{
    "track1": {
        "pseudo_values": [
            98.00000000000001,
            33.699999999999996,
            96.8
        ],
        "pseudo_ed_values": [
            76.70000000000002,
            30.300000000000004,
            73.2
        ],
        "ed_values": [
            100.0,
            49.800000000000004,
            100.0
        ],
        "preprocess_values": [
            17.10826539993286,
            17.10826539993286,
            0,
            0
        ],
        "query_values": [
            47.62836050987244,
            17.539501428604126,
            258.4495892524719,
            4.6499552726745605
        ]
    },
    "track2": {
        "pseudo_values": [
            98.4,
            30.4,
            90.69999999999997
        ],
        "pseudo_ed_values": [
            97.89999999999999,
            28.200000000000003,
            86.7
        ],
        "ed_values": [
            100.0,
            56.400000000000006,
            100.0
        ],
        "preprocess_values": [
            7.81714391708374,
            7.81714391708374,
            0,
            0
        ],
        "query_values": [
            61.117897272109985,
            32.55158591270447,
            318.27469420433044,
            6.185410261154175
        ]
    },
    "track3": {
        "pseudo_values": [
            90.3,
            24.8,
            83.80000000000001
        ],
        "pseudo_ed_values": [
            93.99999999999999,
            23.900000000000002,
            81.00000000000001
        ],
        "ed_values": [
            100.0,
            54.29999999999999,
            100.0
        ],
        "preprocess_values": [
            7.363928556442261,
            7.363928556442261,
            0,
            0
        ],
        "query_values": [
            67.25809240341187,
            49.96934247016907,
            399.60637497901917,
            7.567011833190918
        ]
    },
    "sample4": {
        "pseudo_values": [
            96.8,
            40.800000000000004,
            97.09999999999998
        ],
        "pseudo_ed_values": [
            94.0,
            36.199999999999996,
            96.0
        ],
        "ed_values": [
            100.0,
            62.3,
            100.0
        ],
        "sax_values": [
            0,
            0,
            0
        ],
        "preprocess_values": [
            5.248334646224976,
            5.248334646224976,
            0,
            0,
            0
        ],
        "query_values": [
            85.56249904632568,
            53.51401114463806,
            176.0882649421692,
            8.6080002784729,
            0
        ]
    },
    "sample1": {
        "pseudo_values": [
            94.19999999999999,
            42.8,
            89.19999999999997
        ],
        "pseudo_ed_values": [
            91.1,
            33.900000000000006,
            84.3
        ],
        "ed_values": [
            100.0,
            64.2,
            100.0
        ],
        "sax_values": [
            100.0,
            63.1,
            100.0
        ],
        "preprocess_values": [
            3.1369705200195312,
            3.1369705200195312,
            0,
            0,
            25.807271480560303
        ],
        "query_values": [
            21.193970680236816,
            13.641084909439087,
            44.7186803817749,
            2.132035970687866,
            3.9373433589935303
        ]
    },
    "sample2": {
        "pseudo_values": [
            92.89999999999999,
            41.1,
            93.5
        ],
        "pseudo_ed_values": [
            96.80000000000003,
            39.300000000000004,
            95.3
        ],
        "ed_values": [
            100.0,
            61.5,
            100.0
        ],
        "sax_values": [
            100.0,
            58.599999999999994,
            100.0
        ],
        "preprocess_values": [
            3.7228238582611084,
            3.7228238582611084,
            0,
            0,
            50.88336515426636
        ],
        "query_values": [
            39.78078556060791,
            26.77067232131958,
            88.09306812286377,
            4.347704887390137,
            7.542389392852783
        ]
    },
    "sample3": {
        "pseudo_values": [
            98.2,
            39.5,
            96.6
        ],
        "pseudo_ed_values": [
            98.2,
            38.6,
            97.5
        ],
        "ed_values": [
            100.0,
            65.0,
            100.0
        ],
        "sax_values": [
            100.0,
            62.4,
            100.0
        ],
        "preprocess_values": [
            4.156823635101318,
            4.156823635101318,
            0,
            0,
            80.47980976104736
        ],
        "query_values": [
            66.74693417549133,
            40.175437450408936,
            132.936181306839,
            6.2897210121154785,
            11.265103340148926
        ]
    },
    "query1": {
        "pseudo_values": [
            99.9,
            10.4,
            81.2
        ],
        "pseudo_ed_values": [
            95.8,
            9.8,
            77.8
        ],
        "ed_values": [
            100.0,
            30.200000000000003,
            100.0
        ],
        "sax_values": [
            100.0,
            22.700000000000003,
            99.70000000000002
        ],
        "preprocess_values": [
            9.846714496612549,
            9.846714496612549,
            0,
            0,
            77.46438503265381
        ],
        "query_values": [
            139.5836374759674,
            76.04175281524658,
            84.89858937263489,
            12.810655355453491,
            17.19070339202881
        ]
    },
    "query2": {
        "pseudo_values": [
            96.39999999999999,
            10.4,
            81.1
        ],
        "pseudo_ed_values": [
            97.5,
            6.100000000000001,
            59.400000000000006
        ],
        "ed_values": [
            100.0,
            23.600000000000005,
            100.0
        ],
        "sax_values": [
            100.0,
            17.5,
            97.6
        ],
        "preprocess_values": [
            15.129639863967896,
            15.129639863967896,
            0,
            0,
            149.57929873466492
        ],
        "query_values": [
            153.5681700706482,
            70.02257657051086,
            204.63998818397522,
            13.45538592338562,
            19.47581958770752
        ]
    },
    "query3": {
        "pseudo_values": [
            100.0,
            28.300000000000004,
            99.9
        ],
        "pseudo_ed_values": [
            100.0,
            17.7,
            85.1
        ],
        "ed_values": [
            100.0,
            39.699999999999996,
            100.0
        ],
        "sax_values": [
            100.0,
            31.100000000000005,
            99.4
        ],
        "preprocess_values": [
            26.066667795181274,
            26.066667795181274,
            0,
            0,
            220.6349015235901
        ],
        "query_values": [
            355.6404287815094,
            145.47021389007568,
            384.2245194911957,
            14.868043184280396,
            22.597055673599243
        ]
    },
    "query4": {
        "pseudo_values": [
            99.69999999999999,
            25.0,
            96.8
        ],
        "pseudo_ed_values": [
            92.4,
            18.0,
            79.3
        ],
        "ed_values": [
            100.0,
            44.9,
            99.8
        ],
        "sax_values": [
            0,
            0,
            0
        ],
        "preprocess_values": [
            16.362993001937866,
            16.362993001937866,
            0,
            0,
            0
        ],
        "query_values": [
            310.29526948928833,
            114.89818859100342,
            648.3606123924255,
            15.813884019851685,
            0
        ]
    }
}