^C:\USERS\WVDS9\DOCUMENTS\GITHUB\THESIS-PROJECT2\WRLDTMPL8-MAIN\X64\RELEASE\CAPE.OBJ|C:\USERS\WVDS9\DOCUMENTS\GITHUB\THESIS-PROJECT2\WRLDTMPL8-MAIN\X64\RELEASE\TEMPLATE.OBJ|C:\USERS\WVDS9\DOCUMENTS\GITHUB\THESIS-PROJECT2\WRLDTMPL8-MAIN\X64\RELEASE\WATERWORLD.OBJ|C:\USERS\WVDS9\DOCUMENTS\GITHUB\THESIS-PROJECT2\WRLDTMPL8-MAIN\X64\RELEASE\WORLD.OBJ
C:\USERS\WVDS9\DOCUMENTS\GITHUB\THESIS-PROJECT2\WRLDTMPL8-MAIN\X64\BOUNCEWORLD.EXE
C:\USERS\WVDS9\DOCUMENTS\GITHUB\THESIS-PROJECT2\WRLDTMPL8-MAIN\X64\BOUNCEWORLD.PDB
