^C:\Users\wvds9\Documents\GitHub\infomov-retro-voxel-fluids\WrldTmpl8-main\waterworld.vcxproj
C:\Users\wvds9\Documents\GitHub\infomov-retro-voxel-fluids\WrldTmpl8-main\x64\waterWorld_debug.lib
C:\Users\wvds9\Documents\GitHub\infomov-retro-voxel-fluids\WrldTmpl8-main\x64\waterWorld_debug.exp
^C:\Users\wvds9\Documents\GitHub\infomov-retro-voxel-fluids\WrldTmpl8-main\waterworld.vcxproj
C:\Users\wvds9\Documents\GitHub\infomov-retro-voxel-fluids\WrldTmpl8-main\x64\waterWorld_debug.lib
C:\Users\wvds9\Documents\GitHub\infomov-retro-voxel-fluids\WrldTmpl8-main\x64\waterWorld_debug.exp
^C:\Users\wvds9\Documents\GitHub\infomov-retro-voxel-fluids\WrldTmpl8-main\waterworld.vcxproj
C:\Users\wvds9\Documents\GitHub\infomov-retro-voxel-fluids\WrldTmpl8-main\x64\waterWorld_debug.lib
C:\Users\wvds9\Documents\GitHub\infomov-retro-voxel-fluids\WrldTmpl8-main\x64\waterWorld_debug.exp
