^C:\Users\wvds9\Documents\GitHub\thesis-project2\WrldTmpl8-main\bounce.vcxproj
C:\Users\wvds9\Documents\GitHub\thesis-project2\WrldTmpl8-main\x64\bounceWorld_debug.lib
C:\Users\wvds9\Documents\GitHub\thesis-project2\WrldTmpl8-main\x64\bounceWorld_debug.exp
^C:\Users\wvds9\Documents\GitHub\thesis-project2\WrldTmpl8-main\bounce.vcxproj
C:\Users\wvds9\Documents\GitHub\thesis-project2\WrldTmpl8-main\x64\bounceWorld_debug.lib
C:\Users\wvds9\Documents\GitHub\thesis-project2\WrldTmpl8-main\x64\bounceWorld_debug.exp
^C:\Users\wvds9\Documents\GitHub\thesis-project2\WrldTmpl8-main\bounce.vcxproj
C:\Users\wvds9\Documents\GitHub\thesis-project2\WrldTmpl8-main\x64\bounceWorld_debug.lib
C:\Users\wvds9\Documents\GitHub\thesis-project2\WrldTmpl8-main\x64\bounceWorld_debug.exp
