~q -< p10.; 1
p10 -< TRUE.; 1
q -< s10.; 1
s10 -< TRUE.; 1
~s10 -< s9.; 1
s9 -< TRUE.; 1
~s9 -< s8.; 1
s8 -< TRUE.; 1
~s8 -< s7.; 1
s7 -< TRUE.; 1
~s7 -< s6.; 1
s6 -< TRUE.; 1
~s6 -< s5.; 1
s5 -< TRUE.; 1
~s5 -< s4.; 1
s4 -< TRUE.; 1
~s4 -< s3.; 1
s3 -< TRUE.; 1
~s3 -< s2.; 1
s2 -< TRUE.; 1
~s2 -< s1.; 1
s1 -< TRUE.; 1
~s1 -< s0.; 1
s0 -< TRUE.; 1
~p10 -< p9.; 1
p9 -< TRUE.; 1
~p9 -< p8.; 1
p8 -< TRUE.; 1
~p8 -< p7.; 1
p7 -< TRUE.; 1
~p7 -< p6.; 1
p6 -< TRUE.; 1
~p6 -< p5.; 1
p5 -< TRUE.; 1
~p5 -< p4.; 1
p4 -< TRUE.; 1
~p4 -< p3.; 1
p3 -< TRUE.; 1
~p3 -< p2.; 1
p2 -< TRUE.; 1
~p2 -< p1.; 1
p1 -< TRUE.; 1
~p1 -< p0.; 1
p0 -< TRUE.; 1
~p5 -< r5.; 1
r5 -< TRUE.; 1
~r5 -< r4.; 1
r4 -< TRUE.; 1
~r4 -< r3.; 1
r3 -< TRUE.; 1
~r3 -< r2.; 1
r2 -< TRUE.; 1
~r2 -< r1.; 1
r1 -< TRUE.; 1
~r1 -< r0.; 1
r0 -< TRUE.; 1