q -< s25.
~q -< p25.
~p12 -< r12.
~s25 -< s24.
~p25 -< p24.
~s24 -< s23.
~p24 -< p23.
~s23 -< s22.
~p23 -< p22.
~s22 -< s21.
~p22 -< p21.
~s21 -< s20.
~p21 -< p20.
~s20 -< s19.
~p20 -< p19.
~s19 -< s18.
~p19 -< p18.
~s18 -< s17.
~p18 -< p17.
~s17 -< s16.
~p17 -< p16.
~s16 -< s15.
~p16 -< p15.
~s15 -< s14.
~p15 -< p14.
~s14 -< s13.
~p14 -< p13.
~s13 -< s12.
~p13 -< p12.
~s12 -< s11.
~p12 -< p11.
~s11 -< s10.
~p11 -< p10.
~s10 -< s9.
~p10 -< p9.
~s9 -< s8.
~p9 -< p8.
~s8 -< s7.
~p8 -< p7.
~s7 -< s6.
~p7 -< p6.
~s6 -< s5.
~p6 -< p5.
~s5 -< s4.
~p5 -< p4.
~s4 -< s3.
~p4 -< p3.
~s3 -< s2.
~p3 -< p2.
~s2 -< s1.
~p2 -< p1.
~r12 -< r11.
~r11 -< r10.
~r10 -< r9.
~r9 -< r8.
~r8 -< r7.
~r7 -< r6.
~r6 -< r5.
~r5 -< r4.
~r4 -< r3.
~r3 -< r2.
~r2 -< r1.
TRUE.
