,0,1
0,0.80750155,1.0233983
1,0.8249453,0.9632808
2,0.7819335,0.9943887
3,0.8799904,1.0357826
4,0.8502767,1.0564052
5,0.8500891,0.9744333
6,0.7798828,0.99466646
7,0.7463432,0.96560454
8,0.8079234,0.9839747
9,0.80242914,1.1004994
10,0.22728768,0.20826772
11,0.0,0.039966695
12,0.0,0.0061735064
13,0.0,0.0
14,0.036792472,0.029191613
15,0.0,0.048407376
16,0.021084845,0.06079711
17,0.0,0.0
18,0.0,0.016271353
19,0.0,0.0
20,0.0072245896,0.0
