"","V1","V2"
"1",0.994958104490468,6.22350569604626
"2",0.396516488987528,-0.358781077070548
"3",1.11124629773846,7.1717976837733
"4",0.8991560539143,7.01785097125149
"5",1.25458043651868,6.76351217816022
"6",1.1223932806256,7.05164767349531
"7",0.788634061479649,6.58238052440601
"8",1.38046775074172,6.98436141155203
"9",0.962969662642688,7.28187248420374
"10",-0.0982658257546959,-0.350592202756045
"11",1.23217785628159,7.39139449048026
"12",1.3189720175282,7.1558235832367
"13",0.996497414296497,6.63172023884485
"14",1.52069673534506,7.26374317038424
"15",0.760260149076976,7.41163604798661
"16",-0.59888402931677,0.685460444834182
"17",-0.299175314559179,-1.91934680601098
"18",0.110300316035877,-0.732358516195934
"19",1.8097197253853,-0.576124522100122
"20",0.91675757140401,0.00946628498304447
"21",-0.752785468814,-2.58701978924543
"22",-0.493233164036085,-0.348553887210355
"23",-2.80111044803079,-1.91790076748022
"24",3.48260299189714,-1.73935822477444
"25",-2.85707315446614,-2.33998523888391
"26",-0.150723200381622,-1.58682158458979
"27",-2.77279849981209,-2.23081007036885
"28",3.42463410489503,-1.44900481721335
"29",-3.31912022128832,-1.79119480286712
"30",1.11170574844598,-0.305219741709778
"31",1.83555295625105,-0.370917027205082
"32",-2.00232442860038,-0.641843990647147
"33",-3.4566864917307,-1.85087315462752
"34",-1.34466203673997,0.242152818936823
"35",3.69971583412742,-1.36512751917271
"36",-0.749301207931089,-1.74514113011257
"37",-1.02745124102291,0.409506258955466
"38",-0.794369995836362,-2.33160508478561
"39",3.3785807026616,-1.41743039853718
"40",2.04497735400433,-0.53053018637883
"41",-1.08421343580248,-2.65585528636743
"42",-3.04464424629621,-2.63806520240634
"43",-1.49231982795868,-0.430216936745585
"44",4.13960765235774,-1.49759610410307
"45",3.92647298028431,-1.70165854996033
"46",-0.373911251980032,-1.74193090958472
"47",-2.96022329371989,-2.60877422937783
"48",-1.24432573179534,-2.74942703451281
"49",0.0712107147347236,-1.45694322730023
"50",-3.0792433048465,-2.43600513868345
"51",-1.36469128014644,0.394895877332631
"52",0.772848379435059,-0.179580786882329
"53",3.7823735494096,-1.42869866557591
"54",-2.63286336207673,-2.31746399694709
"55",-2.98616725351322,-1.97424996998675
"56",-0.277955481371971,-2.49542242318495
"57",3.16269289272875,-1.24269501068961
"58",-0.608285924698676,-0.53143865257708
"59",2.42015109718653,-0.583821202610887
"60",-3.32202994045393,-2.43386664866121
"61",3.49869730301405,-1.04612255228807
"62",-0.718000371554649,0.745809055986211
"63",-1.36357949710076,-2.82216183568233
"64",-2.35789770549724,-2.01786193004629
"65",0.850021268980203,-0.152816903919659
"66",-2.19490594624992,-1.97445644436435
"67",0.573294275765406,-0.750270999942609
"68",0.0940555226056701,-0.155658285938024
"69",-3.09588175966399,-2.22950039327073
"70",2.20278404171923,-0.280236123978628
"71",3.06876525820115,-1.11124274320277
"72",2.29985018430617,-0.617323362516317
"73",-1.25846769483112,-0.605402477752938
"74",-1.55820267862374,-1.00369762802348
"75",-1.4962169013053,-2.58801495053553
"76",0.730805789114642,0.237411360489883
"77",3.76237263595134,-1.30547487737655
"78",-0.544588858938059,-1.21779656604169
"79",-3.27018232312657,-2.0273068367625
"80",-0.906242455714052,-2.04467275005487
"81",-0.517704383107249,0.409095739295265
"82",-2.75383723574404,-1.48977235865305
"83",3.68634448622536,-1.43423247510666
"84",0.23641834498474,-0.987518876600217
"85",2.7679994581347,-0.890280315604854
"86",-0.671194874779394,-2.38984086262014
"87",0.0498659035314855,-0.189832364850249
"88",-0.669194981500753,0.233717781233231
"89",-0.54641748945978,-0.691045238628065
"90",0.0305591288363149,0.437475934514746
"91",-0.448478140933429,-0.193116617190181
"92",-0.761775631864449,-0.334324758459302
"93",-0.643499241424194,0.715453408328711
"94",0.0770511268860762,0.535278380187521
"95",-0.868697802023776,-0.803773575033354
"96",-1.55819177835384,-0.0379937819263692
"97",-0.945610883322399,0.608434359967675
"98",-0.156581401280082,0.322965718741971
"99",-0.0581727110296643,-0.578458409017727
"100",-1.40595379875878,0.642088233880234
