"","V1","V2"
"1",8.05758901096778,-7.56304501544596
"2",3.02244987059553,-2.37058422441863
"3",10.0641950129361,-11.0941725519298
"4",9.43104985116731,-11.0233130870772
"5",8.92103861929516,-10.8143197505399
"6",9.51609139757611,-11.7385459204761
"7",8.97888141939507,-8.91506143364349
"8",8.96441995874335,-11.6653974709957
"9",8.46990034716429,-11.7351647663528
"10",2.24587369627929,-6.66114592076633
"11",9.18938073684119,-12.8377131774265
"12",9.6478127866668,-12.3473027440393
"13",8.83549103414635,-9.43304006359903
"14",8.79721753057815,-12.303689916363
"15",10.1171647066975,-11.9788140253654
"16",4.78594664167309,2.56828183809655
"17",-2.8660657515407,-4.8456483420468
"18",2.2254181429286,-6.90592130774501
"19",-1.86293163907724,9.16317469294616
"20",6.96398729721964,-5.79994225816629
"21",-5.52817658903039,-5.49234117589037
"22",-1.41394221924559,-1.00137699725879
"23",-9.06629047908779,1.92365830222419
"24",1.93109368390201,14.5403749603195
"25",-11.5196155608283,2.63079910008064
"26",-2.50508111842929,-4.73924148587559
"27",-9.70660745443187,1.48467983047008
"28",2.49666260550122,13.8532561931209
"29",-7.16220159113179,1.599641496658
"30",4.95760390202756,-3.22614326151437
"31",-3.08135578706312,10.046942167341
"32",-2.40668094658703,3.27868114842082
"33",-6.99897613724407,1.14450794311893
"34",1.78494065084461,5.15596208279244
"35",3.53287708859177,11.7511331018096
"36",-5.73194666198024,-7.91764785591702
"37",2.19488238164907,2.59279187011506
"38",-5.1544985729659,-4.61123631374781
"39",1.97401281062788,12.1706324258749
"40",-1.58614996182654,9.03423449130335
"41",-5.65369619093133,-4.52303309709711
"42",-8.79510384699839,-0.437413909861948
"43",-0.956751559987761,2.48020700613864
"44",3.64157425020844,13.504379235481
"45",4.35771515920529,13.6449651178326
"46",-3.18753776341227,-4.13735919690344
"47",-9.23965206963827,-1.16799017850365
"48",-7.00991657894974,-4.72370604735213
"49",-1.7807019369866,-5.08734517738829
"50",-10.4256953871805,1.14744876249642
"51",1.47581022887519,4.42855098039415
"52",6.42312251186843,-4.79119450259788
"53",2.0212539531153,12.91538224585
"54",-9.7743683284397,0.719191204861137
"55",-9.34120850291225,2.35005956319714
"56",-4.09807294797177,-6.83133334106557
"57",1.64696992770089,11.7152085063433
"58",-0.874815557500963,-0.783960675067508
"59",-0.646828737052467,8.79427280544133
"60",-8.84172679869658,0.797351253868246
"61",3.31777319856552,12.549684612133
"62",3.74504215982803,2.59328483755155
"63",-7.5981531749356,-4.70029614639508
"64",-8.86213957596133,3.79404797077732
"65",3.78653585174707,-2.56120695779779
"66",-8.8782973040343,3.90646144778494
"67",2.20885109937159,-3.42086234797191
"68",1.34963489434654,-3.13105324978594
"69",-11.2865920718662,2.54115756595255
"70",-1.08741155952382,8.52203028414455
"71",1.17861933532348,12.1688630755096
"72",-0.06324092892337,9.09303645760954
"73",-0.742032388193688,1.24230759312031
"74",-3.44935714409964,0.328844374697685
"75",-7.75072993780607,-4.74334620460247
"76",7.00920651651186,-5.87488400914618
"77",3.08416188590591,12.4644357736564
"78",-1.0461898936055,-2.96628892682137
"79",-7.92328336111375,0.894274113285466
"80",-5.76961422936659,-6.70852985695643
"81",1.62087624737109,1.27821307556466
"82",-7.481497858698,-0.156130315780049
"83",2.49511669892178,12.9044442275609
"84",2.20832890293293,-7.25179314949051
"85",-3.07261615339503,10.3585345455544
"86",-5.69830850422443,-6.50275674666986
"87",1.82305456166499,-1.2944395860809
"88",2.77573232566006,1.16752794712508
"89",1.11149496700884,-1.09329023818858
"90",3.71084771671994,0.43802191544417
"91",1.6332350955059,-0.668706885796741
"92",0.893260695977133,-0.395052716449416
"93",2.40726003507149,1.59720299769801
"94",4.1983901720035,0.595858923444872
"95",0.674005456998702,-0.361478826484419
"96",0.390917869978381,2.85135723202594
"97",2.6969219533895,2.22951919408842
"98",3.04146589988176,0.131792066112989
"99",2.87922950806227,-0.863114592878847
"100",1.01367049913853,3.1107073922969
