"","V1","V2"
"1",-3.06441252090729,-4.74038520670406
"2",5.20679931621046,-2.49972813174607
"3",-3.72757572627075,-0.929778383917781
"4",-3.03005582481975,-4.73951978652106
"5",-3.01530656055905,-4.78084129037306
"6",-3.74382724482007,-1.07824110023355
"7",-10.7958552577187,-9.26687428451548
"8",-1.38618495423113,-5.00958297032362
"9",5.20974087418026,-2.49940496175673
"10",-10.8078938673358,-8.70198360883339
"11",-10.1531513073708,-8.76801570482602
"12",-3.05087739538837,-4.77174395457794
"13",2.05185719348988,0.0343086832775892
"14",3.42347178329399,-0.584972461392647
"15",-1.42710246254958,-5.01560163810913
"16",4.22484602551871,10.6658640488868
"17",-10.2900747465359,2.11197438050931
"18",12.9695798494317,1.96293104583474
"19",4.44611158284727,-8.10259131925374
"20",-11.1174593465677,2.25786881385757
"21",-5.78562290975716,8.89436836242937
"22",1.2191779703955,-2.07188921220361
"23",-3.04368367114987,-4.83463232572129
"24",4.24372749559346,-10.3440359438154
"25",4.30749288018447,10.4170784700784
"26",-5.57528565890537,8.76871674103632
"27",13.3087401815135,1.1567655763248
"28",-0.827169441943521,2.26027880736154
"29",13.8629920597231,1.649063584355
"30",-10.5131110750202,-8.36421165437028
"31",4.46079385337121,10.3020428069805
"32",12.9002268135711,1.26155524074256
"33",-3.73139351032008,-0.956736271314561
"34",4.10345786181,-9.96638522478212
"35",2.6995884752716,-2.04204940036911
"36",-11.0521431496157,2.11200497758184
"37",-9.16322723595155,-6.35600616369821
"38",-5.28805079360142,9.37565247919105
"39",1.8419205692573,-1.78097611473272
"40",13.5811303323257,1.17426936576643
"41",13.84088039834,1.93263991242305
"42",-3.97436719097117,7.15820845412363
"43",4.65358475610753,10.9974951416194
"44",10.1777996776787,0.356629710958959
"45",4.44718874272158,-8.09586816043737
"46",2.11609625380851,-0.961097839281067
"47",13.2950380005937,2.15342272222172
"48",-3.98005725926718,7.16611484158368
"49",-5.92913368289046,9.28905554145325
"50",1.20649983024868,-1.91988604034758
"51",-9.16114955794361,-6.35233514986938
"52",-5.71224497788769,9.45240849387416
"53",5.13160190331917,10.6088010841266
"54",-10.2731925578271,-8.63245538132307
"55",1.34462548511133,-0.46435825580096
"56",3.03056546802004,-1.94231955405036
"57",1.32488604714066,0.126809273339664
"58",3.24523995618235,-1.35750834794657
"59",4.28916395244119,10.9133200223436
"60",0.325666702089216,-1.31178797652134
"61",-10.074629001611,-9.06989030182825
"62",-5.31120547021873,8.89102018059136
"63",-10.8218271106831,1.25009303829187
"64",1.27463344574565,-0.5197908135024
"65",2.56178673142511,-0.443191164036412
"66",4.12380255698513,-10.3933669222272
"67",4.80636925715857,10.1674178544396
"68",-0.833451025001982,2.25516838145339
"69",-3.3352252797563,-4.02649803639792
"70",3.94375280836609,-10.3080345712149
"71",3.9881961098584,-10.1132551432437
"72",13.7318224165616,1.37756626760687
"73",-0.843836782146626,2.2454200632346
"74",4.61193976868342,7.66324111550272
"75",-5.53591053002179,9.54866594605709
"76",-10.7780385487613,1.27056345906247
"77",4.92941764355946,10.2719946721401
"78",-10.9267485428374,-9.1213503026274
"79",10.1753106851355,0.355818770986352
"80",4.35772793933466,-10.2204933444156
"81",4.8024362262278,11.0431586295305
"82",13.4180310435669,1.99887864878942
"83",0.523906590871088,-1.10254874803055
"84",-10.7818631794941,1.27149262433172
"85",12.9689359255503,1.34410722159773
"86",4.27646263274654,-10.0476007939765
"87",12.8806844407955,1.77057222387252
"88",-5.93618955049008,9.02342313023244
"89",-10.3386424092254,-9.2839399931602
"90",-10.7859271064301,1.2761374351018
"91",3.55751494041017,-0.838416300494917
"92",0.6174608428693,-2.37048759745243
"93",-10.4351215373448,-9.35048861879093
"94",-10.9194676837308,-8.70393277090137
"95",2.62997622982074,-0.800799106109392
"96",-3.75675749865404,-1.34402686826449
"97",5.02291724636321,10.8486371826606
"98",-5.20218245695736,9.14455227647787
"99",-10.0683688897504,2.0655144081304
"100",4.61142471741536,7.65882310397087
