"","PC1","PC2"
"1",-5.80804040389986,-1.78329573330416e-15
"2",6.81813438718681,1.79717352111197e-15
"3",-5.80804040389986,-1.78329573330416e-15
"4",6.81813438718681,1.79717352111197e-15
"5",-5.80804040389986,-1.78329573330416e-15
"6",6.81813438718681,1.79717352111197e-15
"7",6.81813438718681,1.79717352111197e-15
"8",-5.80804040389986,-1.78329573330416e-15
"9",6.81813438718681,1.79717352111197e-15
"10",6.81813438718681,1.79717352111197e-15
"11",6.81813438718681,1.79717352111197e-15
"12",-5.80804040389986,-1.78329573330416e-15
"13",6.81813438718681,1.79717352111197e-15
"14",6.81813438718681,1.79717352111197e-15
"15",-5.80804040389986,-1.78329573330416e-15
"16",-5.80804040389986,-1.78329573330416e-15
"17",-5.80804040389986,-1.78329573330416e-15
"18",-5.80804040389986,-1.78329573330416e-15
"19",6.81813438718681,1.79717352111197e-15
"20",6.81813438718681,1.79717352111197e-15
"21",6.81813438718681,1.79717352111197e-15
"22",6.81813438718681,1.79717352111197e-15
"23",-5.80804040389986,-1.78329573330416e-15
"24",6.81813438718681,1.79717352111197e-15
"25",-5.80804040389986,-1.78329573330416e-15
"26",6.81813438718681,1.79717352111197e-15
"27",-5.80804040389986,-1.78329573330416e-15
"28",-5.80804040389986,-1.78329573330416e-15
"29",-5.80804040389986,-1.78329573330416e-15
"30",-5.80804040389986,-1.78329573330416e-15
"31",-5.80804040389986,-1.78329573330416e-15
"32",6.81813438718681,1.79717352111197e-15
"33",-5.80804040389986,-1.78329573330416e-15
"34",-5.80804040389986,-1.78329573330416e-15
"35",-5.80804040389986,-1.78329573330416e-15
"36",-5.80804040389986,-1.78329573330416e-15
"37",-5.80804040389986,-1.78329573330416e-15
"38",-5.80804040389986,-1.78329573330416e-15
"39",-5.80804040389986,-1.78329573330416e-15
"40",6.81813438718681,1.79717352111197e-15
"41",6.81813438718681,1.79717352111197e-15
"42",6.81813438718681,1.79717352111197e-15
"43",-5.80804040389986,-1.78329573330416e-15
"44",-5.80804040389986,-1.78329573330416e-15
"45",-5.80804040389986,-1.78329573330416e-15
"46",-5.80804040389986,-1.78329573330416e-15
"47",6.81813438718681,1.79717352111197e-15
"48",6.81813438718681,1.79717352111197e-15
"49",6.81813438718681,1.79717352111197e-15
"50",6.81813438718681,1.79717352111197e-15
"51",-5.80804040389986,-1.78329573330416e-15
"52",6.81813438718681,1.79717352111197e-15
"53",6.81813438718681,1.79717352111197e-15
"54",-5.80804040389986,-1.78329573330416e-15
"55",6.81813438718681,1.79717352111197e-15
"56",-5.80804040389986,-1.78329573330416e-15
"57",-5.80804040389986,-1.78329573330416e-15
"58",6.81813438718681,1.79717352111197e-15
"59",-5.80804040389986,-1.78329573330416e-15
"60",6.81813438718681,1.79717352111197e-15
"61",-5.80804040389986,-1.78329573330416e-15
"62",6.81813438718681,1.79717352111197e-15
"63",6.81813438718681,1.79717352111197e-15
"64",-5.80804040389986,-1.78329573330416e-15
"65",-5.80804040389986,-1.78329573330416e-15
"66",-5.80804040389986,-1.78329573330416e-15
"67",-5.80804040389986,-1.78329573330416e-15
"68",6.81813438718681,1.79717352111197e-15
"69",-5.80804040389986,-1.78329573330416e-15
"70",6.81813438718681,1.79717352111197e-15
"71",6.81813438718681,1.79717352111197e-15
"72",6.81813438718681,1.79717352111197e-15
"73",-5.80804040389986,-1.78329573330416e-15
"74",-5.80804040389986,-1.78329573330416e-15
"75",-5.80804040389986,-1.78329573330416e-15
"76",6.81813438718681,1.79717352111197e-15
"77",-5.80804040389986,-1.78329573330416e-15
"78",6.81813438718681,1.79717352111197e-15
"79",-5.80804040389986,-1.78329573330416e-15
"80",-5.80804040389986,-1.78329573330416e-15
"81",-5.80804040389986,-1.78329573330416e-15
"82",6.81813438718681,1.79717352111197e-15
"83",6.81813438718681,1.79717352111197e-15
"84",6.81813438718681,1.79717352111197e-15
"85",6.81813438718681,1.79717352111197e-15
"86",-5.80804040389986,-1.78329573330416e-15
"87",6.81813438718681,1.79717352111197e-15
"88",-5.80804040389986,-1.78329573330416e-15
"89",-5.80804040389986,-1.78329573330416e-15
"90",-5.80804040389986,-1.78329573330416e-15
"91",-5.80804040389986,-1.78329573330416e-15
"92",6.81813438718681,1.79717352111197e-15
"93",-5.80804040389986,-1.78329573330416e-15
"94",-5.80804040389986,-1.78329573330416e-15
"95",6.81813438718681,1.79717352111197e-15
"96",6.81813438718681,1.79717352111197e-15
"97",-5.80804040389986,-1.78329573330416e-15
"98",6.81813438718681,1.79717352111197e-15
"99",6.81813438718681,1.79717352111197e-15
"100",-5.80804040389986,-1.78329573330416e-15
