"","V1","V2"
"1",3.153835059493,-5.29123206634098
"2",3.35718717891306,-8.86219107423317
"3",4.78841394433557,-5.60795249243245
"4",3.61835539915072,-10.7257972483473
"5",1.83572824036713,-7.79744545342668
"6",3.29655084309292,-7.22796033004949
"7",6.10954225550365,-10.6095390182851
"8",6.33408084900797,-9.22587884512073
"9",1.8939895907881,-11.3483562826295
"10",1.54387101233899,-2.95736472547621
"11",0.194038043687848,-0.146104027227511
"12",-1.35158328334673,5.39117435201556
"13",-3.70070264593567,4.38106048007594
"14",-4.4204060232568,7.9482375513523
"15",-5.46051323319026,5.82819351869096
"16",-6.2331069111472,10.9981018746501
"17",-0.679657257302747,10.0135255675856
"18",-4.17999676162503,5.86720466146224
"19",-0.652071562571372,8.81479161070924
"20",-4.64262918073015,9.54885606647411
"21",-4.804925557573,11.0086758805531
