,0,1,2,3,4,5,6,7,8,9
0,1.341447,-1.3842171,0.1557211,-1.8076907,1.0902358,-1.7245741,0.5527554,-1.8767446,0.9162343,1.5299884
1,1.4859059,-1.5356969,0.07559579,-2.1754148,1.1116914,-1.7812227,0.527086,-1.9525766,0.91562265,1.6533403
2,1.5539533,-1.5643914,0.06339133,-2.1289668,1.11909,-1.752207,0.5135024,-2.087122,0.90019083,1.8010302
3,1.4429804,-1.4829807,0.029675521,-2.0497518,1.120904,-1.8930724,0.51824796,-1.978174,0.9037749,1.8696141
4,1.4891955,-1.5776923,0.09635266,-2.0864382,1.1566768,-1.891795,0.5050128,-2.04805,0.95836127,1.7531903
5,1.4382501,-1.5116813,0.07325408,-2.1369278,1.1167033,-1.7281488,0.5312054,-2.0543077,0.9128564,1.7483615
6,1.491687,-1.5632187,0.029444048,-2.2373352,1.2288204,-1.9060078,0.52398276,-1.9251007,0.9240353,1.8758572
7,1.455089,-1.5979283,0.072179876,-1.9343349,1.1017636,-1.6901042,0.5790436,-1.8190945,0.9233209,1.7202463
8,1.3960031,-1.5033652,0.05437856,-2.0221448,1.1182622,-1.8182371,0.54990655,-1.807118,0.8960866,1.7949451
9,1.172596,-1.0206442,0.14462279,-1.514695,0.9895159,-1.4529129,0.5247265,-1.6175215,0.8278181,1.457018
10,0.56731325,-0.03908026,0.5145734,-0.4168177,0.70541847,-0.175026,0.70449775,-0.28635865,0.7918538,0.23174775
11,1.0899448,1.0624884,1.5785307,0.35893023,1.1000708,1.3099505,1.5110875,0.9667277,1.3663963,-1.2693567
12,1.4104844,1.6403811,2.1245959,0.58435524,1.2312119,1.6957407,1.6971481,1.1874014,1.4397292,-1.4299004
13,1.4045594,1.5720705,2.0962536,0.5908618,1.3090943,1.8272834,1.7981092,1.2786729,1.5383451,-1.5050747
14,1.3830035,1.5908011,2.00582,0.54232264,1.2376835,1.771782,1.7664095,1.2575796,1.4505745,-1.3687115
15,1.3918264,1.597433,1.9540004,0.5241804,1.1751658,1.5769535,1.6958762,1.1254162,1.3773258,-1.2670387
16,1.3221492,1.4964582,2.0449975,0.5846156,1.2338974,1.6787868,1.6071935,1.0905145,1.3914498,-1.2425613
17,1.4069132,1.5807965,2.129933,0.5960816,1.2247808,1.7058765,1.6730056,1.1431887,1.3485821,-1.2285949
18,1.418067,1.5868742,2.0384881,0.6041312,1.2612797,1.6779796,1.6587881,1.1102599,1.4273466,-1.360146
19,1.3940551,1.6064107,1.922901,0.5081151,1.23818,1.7148755,1.7715465,1.2392598,1.4464794,-1.3779284
20,1.3942719,1.5891742,2.040856,0.5401503,1.2743539,1.7300004,1.7143646,1.1744034,1.3632891,-1.2376051
