"","V1","V2"
"1",-0.283145370068364,-1.9740342733005
"2",-0.768733939831014,-1.0101893781129
"3",1.95162648629805,2.16910822396479
"4",-1.3962955443709,-8.11270826709177
"5",-0.153244401539822,-2.59774887952706
"6",-0.881822987748563,-1.91978387667822
"7",-1.20734229586951,-8.16387515062875
"8",1.00364531804649,1.10211044351786
"9",-1.08809774557651,-8.12034880475471
"10",0.633590739788349,3.26008779185978
"11",2.43812760542763,5.57183974117214
"12",2.01477022007351,2.14874915074912
"13",-0.567609890418813,-7.99956822876703
"14",-0.68544586352453,-0.942102898820594
"15",-0.71558957937135,-2.11542846186191
"16",-0.543204740734403,-0.952870111962636
"17",2.10349482390318,2.31010549618864
"18",-0.786479022869754,-1.1465098715377
"19",2.36353841195438,5.49195917328592
"20",-1.54259137342307,-1.19938620865839
"21",-0.468231077501737,2.80627059911267
"22",-0.0813021884338635,2.50763442676976
"23",0.918545993317304,4.26165209985677
"24",2.1186551900563,2.26895596267679
"25",2.22033847267734,2.27674938419328
"26",0.0449994903926397,-1.71092029701092
"27",-1.16554058001525,-0.85691421404228
"28",-1.07189199090763,-8.15840276618994
"29",-2.20390769009629,3.52796149549044
"30",-2.16049088737644,3.46565576163612
"31",-4.4895966707579,0.833371737835199
"32",-0.228757938124899,-2.60319798407395
"33",-1.54899639180758,-7.92248405293885
"34",-0.971019671099321,-1.15608538157852
"35",-0.366970796230749,2.60151580817681
"36",-1.97794137274408,3.4988443372034
"37",4.82985322417776,1.61821062893025
"38",1.8894482195336,2.07724622067624
"39",1.09332705067519,1.1687397497045
"40",-0.798748401897319,-2.18238523322028
"41",-1.66152717184633,-7.93253728047519
"42",-0.384255517093512,-2.50724976837257
"43",-0.277684836195353,2.67367350414655
"44",0.728549862987344,3.33109335142964
"45",-0.395857739797869,-7.84579036398346
"46",-0.571970387946339,-2.54038912031707
"47",4.52080679439709,1.78265847933911
"48",1.69994039045237,1.91713559138688
"49",4.67118634818015,1.6409145249514
"50",0.934477410991049,4.44956139866422
"51",4.6849518800301,1.4013016386593
"52",4.93807383727228,1.56091117429232
"53",-0.250367230042612,-7.74418160052623
"54",0.763042553202266,4.24479739273886
"55",-1.1483913596457,-1.77029281751146
"56",2.33464982349698,5.47050260784109
"57",-0.739676138755006,-8.07531189586793
"58",0.894988714985173,4.15947615207344
"59",-1.25120277524208,-1.63498148929648
"60",-4.73756153725284,1.08530213496749
"61",0.155170540715322,-2.34629413695752
"62",-1.92480500306205,3.5701141057894
"63",-0.346453813793836,-7.802519327069
"64",-4.60482341364993,0.946009387102878
"65",0.280111209201425,-2.0708321003649
"66",-0.0851291081839123,-1.29181975159664
"67",-0.144135907536405,-7.61881665323508
"68",-1.5124242399793,-8.0834625936224
"69",-4.80967730919726,1.16390797055817
"70",-4.69513256851697,1.04756110894191
"71",0.288193931609767,-2.02843416770369
"72",-0.785319654061683,-1.5243364561191
"73",1.10048389531575,1.02574141994677
"74",1.24859356849511,1.26441940151897
"75",0.410632616528836,3.48191900452782
"76",-4.51998553840568,0.875642414397252
"77",-0.212533669294195,2.49313811592143
"78",0.582050700948305,3.96446689448553
"79",-0.790466867267693,-0.485347884766738
"80",2.16978549893737,5.30154815690647
"81",-1.39725173186371,-1.35917463309248
"82",-0.941402177591354,-0.547550214299961
"83",0.715717347009319,4.21313571582442
"84",-1.62836859525529,-1.96245468592172
"85",-2.11466186519469,3.23740055335277
"86",-1.11060264010372,-1.3798965323534
"87",-2.16191780641639,3.88472231379895
"88",0.943069013808662,1.03732422786459
"89",-0.265829557720437,-2.40174036282339
"90",0.177999839688161,-2.66117701786694
"91",-0.337002045265721,2.70099919196347
"92",4.8419659852973,1.3976122181839
"93",-0.250954848313153,-1.80709097725317
"94",4.82384223196392,1.49882411794451
"95",2.46633946021041,5.59349254639193
"96",0.487169217238267,4.47565893756471
"97",-2.37733514012982,3.69335820975859
"98",-2.39214811745918,3.68918453093594
"99",4.48428877838858,1.85552414243099
"100",2.00981202674666,5.1708253025513
