"","PC1","PC2"
"1",-5.20022538291568,-0.281560551760996
"2",0.336862370914728,0.509804710805557
"3",-5.16075739871068,0.567607048592109
"4",-5.20084566512426,-0.0954141701107389
"5",-5.32583748058902,-0.229638419059762
"6",-5.01975158521358,0.860094536948599
"7",4.94952371874425,-0.303208501362815
"8",-5.66266497132666,-0.0928623201888713
"9",0.606143354245901,0.616034695226309
"10",4.89867439800907,-0.274253163535869
"11",5.02465846210836,-0.310177118856761
"12",-5.23478274677513,-0.246110225778033
"13",-0.408925192064575,0.026479217890333
"14",-0.436001670777169,0.0954439621451371
"15",-5.42878986125522,-0.276394399760874
"16",1.12783972331511,5.32494397979984
"17",0.380861246091236,-6.08983855175627
"18",-0.599228938654718,-1.08281071661304
"19",-0.349088307795993,2.42319284459642
"20",0.936990925220709,-5.82997461302498
"21",1.50017916683225,-1.42977709188107
"22",-0.503321364699457,-0.00984150832197048
"23",-5.18661637074373,-0.280254118582477
"24",-1.05526086147738,1.32723389994835
"25",1.24699193570081,5.12853768175087
"26",1.51072496722289,-1.54557763001793
"27",-0.538962014475526,-1.14881900058839
"28",-3.54259261186796,-0.370365144654586
"29",-0.546587543875106,-1.14035845838896
"30",5.00335380900155,-0.151837506031139
"31",1.17260846785669,5.17458561385776
"32",-0.497311819982329,-1.23872154952586
"33",-4.90616889250209,0.635041598812497
"34",-1.00437315301758,1.38408170986971
"35",-0.335898784620221,0.0582211008994685
"36",0.663072647935012,-6.17969278943998
"37",5.3320561413194,0.0475616407535661
"38",1.49250244377439,-1.59860469702304
"39",-0.534161626983266,-0.169609900131266
"40",-0.615216474399984,-1.15868720054459
"41",-0.664556169345644,-1.14969222330367
"42",0.96248572518151,-1.15643565717909
"43",1.21173790566238,5.21162068738717
"44",0.287909863089135,-1.52063827233479
"45",-0.622700766655707,2.44983314901685
"46",-0.508189323675923,-0.0564729176869327
"47",-0.652856351863027,-1.03708672056251
"48",0.936743834886989,-1.0916491621619
"49",1.52435847881189,-1.58002354040856
"50",-0.585398272081762,-0.190059524960674
"51",5.03801427007324,0.114363958327516
"52",1.54081622265557,-1.55375525424282
"53",1.23340831872176,5.07052871543411
"54",4.98662924049668,-0.187777988649136
"55",-0.354135418572456,0.128822108929536
"56",-0.44589173658334,0.127364162505877
"57",-0.585478130126394,0.142804706725408
"58",-0.438023788526845,0.0723264571884996
"59",1.16526969719219,5.1680085775456
"60",-0.514334210200088,-0.124123986379299
"61",5.03546723667082,-0.237308986596978
"62",1.55398329549569,-1.71853676320778
"63",0.763572585046228,-4.93785287805535
"64",-0.49547711604717,0.0441637696959667
"65",-0.362068351847284,0.260276668116015
"66",-1.04256305766812,1.22042443678787
"67",1.12849912618331,5.22243415155633
"68",-3.82978930499231,0.346153667365248
"69",-4.39237623227315,-0.0702457543855354
"70",-1.02278656081238,1.33334936656951
"71",-1.04358359476075,1.36012329634694
"72",-0.588021194094249,-1.10322622204956
"73",-3.47798018354448,0.135451900800905
"74",1.00454737316464,4.48100986194136
"75",1.48453821066411,-1.52703864348281
"76",0.648574967439693,-5.05792007143646
"77",1.15042463695763,5.22804196547869
"78",4.94809874708607,-0.19737835122557
"79",0.332044628095183,-1.65480487533225
"80",-0.991840002781993,1.37143267354896
"81",1.12015046333482,5.28240164954765
"82",-0.674742925198855,-1.10643447325413
"83",-0.492234424197024,-0.143925260299773
"84",0.700848336414042,-4.88247544071465
"85",-0.551372456406104,-1.23258777779936
"86",-1.04513876697798,1.35095782230051
"87",-0.580247946836802,-1.14221796767463
"88",1.47643459138045,-1.53987904621183
"89",4.96313469560348,-0.282752355932262
"90",0.698314606908248,-5.0964249642085
"91",-0.32522184291463,0.186182191574261
"92",-0.604409462002643,-0.0386279580062616
"93",4.95888258424382,-0.238951369056568
"94",4.94813374017065,-0.272631612965244
"95",-0.346308041747725,0.00760683914670891
"96",-5.20336148550066,0.439089610715831
"97",1.21380980410037,5.15647246537139
"98",1.40577884926856,-1.398477876902
"99",0.0414747887256805,-5.47208020269226
"100",1.08732723606562,4.4437743444782
