,,,,,,,,,,,21,12
0,-0.18603615,-0.5123721,0.2867926,-0.44519746,-0.26450372,0.08032018,0.019355549,-0.072341606,0.074169405,0.10721215,0.17378187,0.3332265
1,-0.04488288,-0.6462345,0.40745512,-0.4261364,-0.31560868,0.09098758,0.07697502,-0.023791928,0.0059316945,0.12267947,-0.018982138,0.24019669
2,-0.084492624,-0.57064074,0.24031912,-0.31263268,-0.32583272,0.120931216,0.06589621,0.0960029,0.13778293,0.0139132375,0.11008132,0.34949207
3,-0.17382309,-0.48309115,0.3584304,-0.4603499,-0.20996718,-0.045080546,-0.018498732,0.058581367,0.004972535,0.036562864,0.23763613,0.32919046
4,-0.04358557,-0.42828915,0.23821214,-0.5094347,-0.23619673,-0.012907238,-0.08349774,-0.04742902,-0.04259472,0.087192826,0.29334652,0.48995957
5,-0.16597278,-0.5664256,0.34610143,-0.38039464,-0.26056173,0.057925187,0.14840125,0.0934842,0.13322395,0.06733642,0.12334328,0.23883761
6,-0.066655904,-0.5246869,0.32550833,-0.41114253,-0.30276808,0.10672373,0.11882453,0.032001484,0.032763872,0.10491628,0.17194687,0.35274893
7,-0.12559868,-0.4653855,0.20915182,-0.45969325,-0.26746634,0.021606885,0.008126548,-0.00447181,0.07951946,0.10790216,0.20715073,0.42697158
8,-0.21304888,-0.60550183,0.44522354,-0.34761703,-0.2511771,0.101168975,0.12933989,0.16709667,0.12506641,0.024853785,0.0714084,0.12254849
9,-0.9548948,-0.32470676,-0.34892592,-0.4014481,0.28639728,-0.19810994,-0.3827819,0.9827868,1.3318157,-0.50353324,0.26876557,0.9829426
10,-0.17944363,-0.5058927,0.1742457,-0.37280053,-0.18288141,0.07251255,0.011233384,0.11908582,0.26135972,-0.018454794,0.120793074,0.42043343
11,-0.6769361,-0.6747997,-0.31319252,-0.097629406,0.033637393,-0.06665611,-0.52242285,0.93672633,1.3382555,-0.63781244,0.12723029,0.8523853000000001
12,-0.28161803,-0.5252917,0.26128983,-0.4193009,-0.2006676,0.033124343,0.009642991,-0.18674539,0.12512425,0.15059054,0.033280026000000004,0.3880344
13,0.01815579,-0.56686926,0.25691223,-0.45108515,-0.37028977,0.08497283,0.04618233,-0.09225178,0.05054026,0.18153067,0.07093686,0.36932677
14,-0.17569388,-0.5633241,0.44194096,-0.49991795,-0.21972427,0.027188223,0.07481902,-0.08730925,-0.0027837385,0.15803397,0.08559149,0.26695052
15,-0.12345735,-0.49497208,0.27328926,-0.49412808,-0.24602987,0.017330933,0.007500094,-0.14634539,0.05850515,0.13088192,0.18209979999999998,0.3995566
16,0.019873915,-0.5973335,0.29120517,-0.40266165,-0.3464979,0.12796363,0.1020566,-0.022835134,0.05331018,0.15040787,-0.046220284,0.37200690000000003
17,-0.006752831,-0.53813386,0.26132053,-0.43235493,-0.34222755,0.06148831,0.071877316,-0.09024126,0.05576802,0.22161241,0.08436629,0.40022966
18,-0.071549185,-0.5727779,0.31082562,-0.4892903,-0.30521926,0.028022215,0.025654968,-0.09375261,0.02222494,0.16604246,0.12249635,0.32845598
19,-0.14324316,-0.53101915,0.20342475,-0.37886456,-0.24327579,0.07234988,-0.0036991707,-0.0838259,0.22980617,0.10156046,-0.019791767,0.39786473
20,-0.21885823,-0.5640668,0.4079352,-0.44636032,-0.2523785,-0.029692845,-0.016274834,-0.08542775,-0.025090475,0.09562446,0.21825601,0.21374570000000004
