"","PC1","PC2"
"1",-8.18050437767449,0.473717257620186
"2",0.879834314716916,0.347601563487644
"3",-10.5601011041802,-1.44456834833597
"4",-9.608102788247,-0.778202013901307
"5",-9.90925342795633,-0.377242912242816
"6",-9.40076792485968,-1.18216044455027
"7",-7.58643625392274,1.53113185740772
"8",-8.96215428378838,-1.41037947813308
"9",-8.88176138546812,-0.815764294900063
"10",-2.90671801132802,0.452665326731685
"11",-8.21432295471111,-2.56366358688797
"12",-9.3598895399777,-1.95036361854126
"13",-9.3039307449392,1.48918496025971
"14",-8.9741265183819,-2.03639593680408
"15",-10.0081647922906,-1.4699264675087
"16",-3.35479554360768,-1.69705332607364
"17",2.38670877529957,0.628446543484141
"18",-0.975018590347631,1.19884497264731
"19",1.41708455980399,2.60791051885711
"20",-3.22598395380239,3.26278634243515
"21",2.63042598587629,-1.3479794440735
"22",2.10081439707111,0.926869822070543
"23",2.67260014906672,-3.61158220639027
"24",1.85034769743363,3.76613293550724
"25",2.34606093732095,-4.87170988047363
"26",2.2192279853836,0.793082509766688
"27",2.61368607225506,-3.65265675746285
"28",1.38435012424833,5.47304484266848
"29",1.80437907757096,-3.79674427130577
"30",-0.80476515540787,4.20871367203896
"31",2.85985664657609,1.78038491446697
"32",1.47641369725749,-2.9172907285649
"33",1.85082680009226,-3.46355662990418
"34",1.23982176554867,1.95166118740442
"35",1.43319706945887,3.3146531749275
"36",1.6321968652782,-0.514993594736833
"37",0.689046026313763,-0.72063444172932
"38",2.53580126062564,-0.716010314908636
"39",2.03818336177886,3.8080692437588
"40",1.74462178939705,2.39171573607045
"41",2.21272026679026,-2.41299564567845
"42",3.24230890234182,-4.33843091968398
"43",1.27327658971165,-2.64530203651033
"44",1.66352598940736,6.30656001205435
"45",1.70796314600081,6.10713683467139
"46",2.65191137987421,-0.0716227747612894
"47",3.24688419254879,-4.79340185611908
"48",2.91574059557507,-3.19665409482484
"49",1.65307582884953,0.0183439603974705
"50",3.02592213580056,-4.33185291715405
"51",1.51389997689027,-0.817558771820142
"52",-1.7962200605125,2.31932036123539
"53",1.41546799467942,5.83208120196449
"54",1.98051109158905,-2.73812627203578
"55",3.27799190645313,-2.88432318871223
"56",2.58315934421364,0.445598894061994
"57",1.93961680342284,3.50532119468193
"58",1.63510785078889,-0.627637221660062
"59",2.53228828614364,2.47329439205058
"60",2.51907751245628,-4.28748620085265
"61",1.91046749665255,4.7209560248014
"62",-0.222733919886136,0.290621473059266
"63",2.98168167082894,-3.89213283763369
"64",2.6676790249944,-1.30364871563804
"65",0.951598730133463,1.81541065916799
"66",2.45730044014767,-1.0618464252164
"67",1.64077002385636,1.55189277703903
"68",1.40520807710263,1.30221219171985
"69",2.50546053431965,-3.82949335634718
"70",0.563955287396438,2.09231717809552
"71",1.86505304010046,5.0251996697356
"72",2.14967971973811,3.76800663577653
"73",0.329016805489316,-2.09156606730882
"74",2.36113968411688,-1.92601048441426
"75",3.06779585585917,-3.9570882772599
"76",-4.52563247913575,1.13528826506067
"77",1.98522407109281,4.76290757202019
"78",2.35295900877315,0.0762015255231875
"79",2.55710444762234,-4.27174647391503
"80",2.2270594016334,-1.94176633281829
"81",1.05025870168159,0.21704694895081
"82",2.80695719372497,-4.55910446524442
"83",1.50657916193289,5.56908223719747
"84",-3.17713420015922,3.18630761665885
"85",2.20212164588998,5.71440278588349
"86",2.63064102709019,-2.29039668534129
"87",0.85805423740362,0.823293094450652
"88",0.24207101184565,-0.612459341632269
"89",1.2656563098524,0.188191849396885
"90",0.223499937416251,-0.0291034917539863
"91",0.66790988538742,-0.150694298228155
"92",1.04492236906899,-0.403606630902736
"93",0.396826103064023,-0.520673204904161
"94",0.212983959925216,1.16285062804392
"95",1.37272364385393,-0.284380174095221
"96",1.70714433667105,-1.43515413270009
"97",-0.139340145197126,-0.590325023126975
"98",-0.142322673561108,-0.200859278932746
"99",-0.115426895299719,-0.0557837429832728
"100",1.37216972806543,-0.924353327670724
