"","V1","V2"
"1",-2.41209377899082,1.95977293211895
"2",0.394270820266345,3.26259219766116
"3",-0.699604474012237,2.29695958075737
"4",-2.35263117787965,2.06202758987044
"5",-2.29104932829095,2.08774963824207
"6",-0.915437482613032,2.05738305972329
"7",-10.7912072069426,-0.219235572635546
"8",-1.79512325524174,2.01559967647219
"9",0.411234381378546,3.41793919104237
"10",-11.062363461151,-0.493394669184833
"11",-10.8627228136588,-0.681517173022207
"12",-2.23187831591557,2.03977001242271
"13",0.325905823251169,3.46010366740397
"14",0.332382133599227,3.01354176039139
"15",-1.97852689385843,2.13862841080459
"16",9.06515418646492,5.13698321169869
"17",0.843417032140501,0.281472727462029
"18",1.39166104013408,-11.2405586274578
"19",8.87037441380196,-7.90866596592496
"20",0.549207414659026,0.063344007413221
"21",-4.89056607912042,5.49127375711999
"22",-0.517427566545419,3.07745422167103
"23",-2.37807964039682,2.00451596386384
"24",8.69669776784509,-7.7398264617354
"25",9.24725133823711,5.32023660628422
"26",-5.11810837750117,5.68836029745827
"27",1.3274104279169,-11.5319335277079
"28",-1.20542972277633,3.39551647539026
"29",0.951562422007237,-11.5083973476737
"30",-11.1495883840312,-0.229659829874473
"31",9.22679713997123,5.17918630665702
"32",1.31562479405585,-11.3899342259454
"33",-0.636540446472843,2.26673561828767
"34",8.77503032168666,-7.81756755237112
"35",-0.0223017086897466,3.35630556891697
"36",0.690570188850652,0.408723936864209
"37",-10.4400784285695,-0.67344699077984
"38",-5.41699911649677,5.62682712618009
"39",-0.323249934104422,3.24819051650979
"40",1.08244034332561,-11.6162609357671
"41",0.947390730739046,-11.3697434268338
"42",-4.79118516632912,5.2222769323287
"43",9.16492287571493,5.20201597090901
"44",1.27967516009383,-11.8561363565341
"45",9.069442586619,-8.10544659173232
"46",-0.203000612655067,3.19040407728534
"47",1.19854828501504,-11.4454114261877
"48",-4.70376262939854,5.22800642496269
"49",-4.81061476434418,5.73151339817963
"50",-0.558323780869061,2.91033116983824
"51",-10.5352705130908,-0.845233947263524
"52",-5.00823671549863,5.83921537206978
"53",8.98187912665903,5.0876890797284
"54",-10.6679740439981,-0.598814017511444
"55",-0.119334645385516,3.67563511605474
"56",-0.118867018200215,3.10497282091986
"57",-0.337890534724809,3.89984401273026
"58",0.370254800816529,2.89488358286791
"59",8.81703405001121,5.28098208032414
"60",-0.714040020865824,3.38263346110001
"61",-10.7799215620733,-0.6437360099599
"62",-4.7753505362083,5.78485306621539
"63",0.967061256048658,0.0743265468842669
"64",-0.217254446463467,3.79334987842923
"65",0.20435888453455,3.75107732440661
"66",8.84090517954393,-7.88294766256469
"67",9.13872096523611,4.88628851573501
"68",-1.18638025954765,3.52190832225225
"69",-2.1997243955739,2.44062424482155
"70",8.65306565354861,-7.6969011893129
"71",8.62639761737792,-7.66942588925283
"72",0.808846895968412,-11.6062395384389
"73",-1.08883542033293,3.47176444771162
"74",8.73350872047351,4.46996525500873
"75",-5.1891506580678,5.41833751849205
"76",1.09731420812983,0.15578365436207
"77",9.35828060589425,5.40440772348043
"78",-10.874567097695,-0.30145695952146
"79",1.3964239887945,-11.341245791594
"80",8.95017359659722,-7.9912261816472
"81",8.94347855968817,5.24508191332721
"82",1.35384040331277,-11.2708679472758
"83",-0.0559374358325431,2.71056278632992
"84",0.833097019744392,0.168410264124888
"85",0.946098196025171,-11.2134713327335
"86",8.90374727914316,-7.94547046340343
"87",1.10967610553688,-11.0611723020691
"88",-4.9522330187094,5.62995611300321
"89",-10.765839556714,-0.543535750871325
"90",1.07206546321142,0.117480322298537
"91",0.438034853223665,2.8495083254197
"92",-0.593805096259175,3.35888637612776
"93",-10.8977870986318,-0.740704797874733
"94",-10.647384759835,-0.146598722796021
"95",0.103097985102268,3.24575265776897
"96",-1.037723806316,2.01258596783102
"97",9.05548798835845,5.58345660056615
"98",-5.36501082695797,5.47520135550648
"99",0.886399367409335,0.0138827234073085
"100",8.94019361567371,4.73513572396198
