"","PC1","PC2"
"1",1.98785646787263,1.03652443361828
"2",1.60064314052473,1.16590985978461
"3",1.17316527034665,1.26596647423287
"4",0.716176160530044,1.33417732287722
"5",0.241171476222734,1.36882654140814
"6",-0.239899931546497,1.36904251837255
"7",-0.714936601937211,1.33481982082061
"8",-1.17198887930121,1.26701933097277
"9",-1.59955950949229,1.16734659046934
"10",-1.98345974911565,1.03988274650696
"11",1.20570220474292e-13,1.29014358874954e-11
"12",1.98345974912888,-1.03988274650386
"13",1.59955950950296,-1.16734659046908
"14",1.17198887930903,-1.26701933097475
"15",0.714936601941978,-1.33481982082411
"16",0.239899931548094,-1.36904251837683
"17",-0.241171476224347,-1.36882654141242
"18",-0.716176160534828,-1.33417732288074
"19",-1.17316527035449,-1.26596647423488
"20",-1.60064314053542,-1.16590985978439
"21",-1.98785646788591,-1.03652443361518
