"","PC1","PC2"
"1",2.55691118634189,0.296185134947791
"2",3.82591363017817,0.146885805332733
"3",-3.60390074405367,-0.584124355797881
"4",-1.05141211729462,5.26988358147005
"5",3.87499879366532,0.171314580176186
"6",3.78445276893836,0.180801924368052
"7",-1.07456285710503,5.04310142154621
"8",-1.26171010140189,-2.83559495751585
"9",-1.58869361154749,4.9549825679679
"10",-1.79357855914194,-1.32914361684438
"11",-1.06859300055129,-2.59500484713073
"12",-3.45731538242208,0.101722122063624
"13",-2.28818718794436,4.25415943947584
"14",3.90163295804917,0.161275922546862
"15",3.84438583002632,0.11007083888198
"16",3.93359062307902,0.199290121187872
"17",-2.74168010498663,-0.383787978632675
"18",3.91547622581915,0.14201480134234
"19",-1.57754824767643,-2.52961635478685
"20",3.86559174390019,0.296678322253882
"21",-0.546612032693385,0.6711918057905
"22",-1.05889989281187,0.943360933265121
"23",-0.444044432993195,-4.99030130733738
"24",-3.45838118177911,-0.317882562653918
"25",-3.59176880445809,-0.32501761723831
"26",3.82070411003104,0.149552985589919
"27",3.75104778881602,0.281052178211218
"28",-1.2062411050582,5.88114971328877
"29",-1.20831756839959,-0.864027075376244
"30",-1.25236431299769,-1.09612923065602
"31",-0.0978733473003898,1.65373903537983
"32",3.83229307578381,0.0791121575266836
"33",-0.94520815298699,4.61170414110124
"34",3.90643379696567,0.158794575048104
"35",-0.960936657554863,1.0177316881536
"36",-1.46236205511202,-1.07561319396197
"37",-4.16525808886846,-0.103353875822988
"38",-3.01463491975486,-0.418384239560138
"39",-0.921490177064897,-2.85900587627482
"40",3.81088548384137,0.0751745150976639
"41",-1.14059738189831,4.63971113456509
"42",3.84331116217186,0.225872461937246
"43",-0.559180238030846,0.550262201893452
"44",-1.77559226957168,-1.61922411431265
"45",-2.71478521194144,3.52862238491283
"46",3.85453611277644,0.146692724660955
"47",-2.63540210085074,0.00117210220645578
"48",-2.60621230405792,-0.606960436088726
"49",-4.19604254822888,-0.0888627104076188
"50",-0.826613443282988,-4.80464242833391
"51",-4.08514468497145,-0.0701862766863995
"52",-4.2475818209241,-0.050681350139977
"53",-2.57033550231049,3.41171300084507
"54",-0.8111575216116,-4.96375484860236
"55",3.84385069997885,0.0844341246274753
"56",-1.10382308821258,-2.266975206043
"57",-1.81843612471255,5.52896316832892
"58",-0.822521399835214,-4.50547215760609
"59",3.89327736591434,0.136918661898455
"60",-0.524273109045084,1.47299087610765
"61",3.82617208570362,0.11500886693838
"62",-1.6361886979493,-0.746167037465142
"63",-2.48154570748248,4.59159325873138
"64",-0.152290181678824,1.48493810307733
"65",3.7720194799732,0.148383777659885
"66",3.83436859698099,0.106686823157567
"67",-2.61589168967035,3.66769737064981
"68",-0.83188672480078,4.45647903107547
"69",-0.0534573122567998,1.39661109577261
"70",-0.252941063489043,1.68397006445237
"71",3.81848242612641,0.0613742800369481
"72",3.83712459716111,0.11569958035911
"73",-1.2522013416696,-2.72457733534108
"74",-1.28051523788332,-2.70675863026825
"75",-1.67040884748695,-1.52871566047097
"76",-0.279295257476387,1.6978590372603
"77",-1.13563797580796,1.01029552448895
"78",-0.446704782094967,-5.06399098840995
"79",3.88379476221489,0.245634922343868
"80",-1.89310663472806,-2.24529082859951
"81",3.88280474248129,0.215855780897646
"82",3.86566952798109,0.231890443486337
"83",-0.478858095036266,-5.11516848364661
"84",3.84804912878916,0.187435798295146
"85",-1.1882797633901,-0.999974026895368
"86",3.92536126138868,0.153169067918294
"87",-1.90527669296086,-0.0554064671575537
"88",-1.0424064681077,-3.02157854514764
"89",3.95053558812519,0.139951258313466
"90",3.74613959585905,0.133957041644464
"91",-1.05603659053061,0.977275556047209
"92",-4.13424069576747,-0.0449052977543012
"93",2.48396388923599,0.263428976395946
"94",-4.15351034618376,-0.0566212845273117
"95",-1.43498293275026,-2.67694368424678
"96",-0.403648321682544,-5.12195176394905
"97",-1.54428462998661,-1.10466171926509
"98",-1.28207563848597,-1.20696823629461
"99",-2.64778985337613,0.0181336159536718
"100",-1.20104416211964,-3.97818582170366
