0 12
0 10
0 5
0 2
0 3
0 4
0 14
0 13
0 6
0 7
0 11
0 8
0 9
0 15
1 0
1 16
1 17
1 18
1 19
1 20
1 21
1 22
1 23
1 86
1 24
1 87
1 25
1 26
1 27
1 28
1 29
1 30
1 31
1 32
1 33
1 88
1 89
1 34
1 35
1 36
1 37
1 38
1 39
1 40
1 41
1 90
1 42
1 91
1 43
1 92
1 44
1 45
1 46
1 47
1 48
1 49
1 15
1 50
1 51
1 52
1 53
1 54
1 55
1 56
1 57
1 58
1 59
1 93
1 94
1 60
1 61
1 62
1 95
1 63
1 64
1 96
1 65
1 66
1 67
1 68
1 69
1 70
1 97
1 71
1 72
1 73
1 98
1 74
1 75
1 76
1 77
1 78
1 79
1 80
1 81
1 99
1 82
1 83
1 84
1 85
2 0
3 0
4 0
5 0
6 0
6 19
6 75
6 12
7 0
8 0
9 0
9 29
9 51
9 53
10 0
11 0
12 0
12 6
13 0
14 0
15 1
16 40
16 34
16 76
16 1
16 20
16 37
16 77
16 25
16 48
16 47
16 45
17 48
17 51
17 1
18 71
18 84
19 6
19 34
19 83
19 51
20 16
20 25
20 53
20 41
20 55
20 56
20 79
20 47
20 74
20 62
20 85
21 35
22 41
22 1
22 54
22 78
22 59
22 40
22 26
22 49
22 95
22 65
22 53
22 28
22 63
22 47
22 67
22 73
23 76
23 1
23 50
23 33
23 34
23 44
23 82
23 52
23 43
24 49
25 16
25 34
25 47
25 48
25 76
25 63
26 53
26 41
26 54
26 59
26 49
26 63
27 1
27 29
27 43
27 44
27 76
27 60
27 67
27 70
28 33
28 1
28 32
28 59
28 78
28 81
29 9
29 27
29 67
29 71
29 84
30 26
30 71
30 58
30 1
30 63
30 65
31 53
31 46
31 71
31 81
31 50
32 28
32 1
32 81
33 23
33 28
34 16
34 23
34 25
34 37
34 82
34 76
34 19
34 70
34 1
34 45
35 15
35 1
35 57
35 45
35 21
35 48
35 44
35 85
35 20
36 1
37 16
37 34
37 65
37 1
37 47
37 40
37 81
38 54
38 70
38 82
39 71
39 84
40 16
40 26
40 37
40 53
40 47
40 81
41 26
41 53
41 1
41 20
41 59
41 62
41 79
41 78
41 81
41 22
42 81
42 62
43 27
43 70
43 76
44 23
44 27
45 16
45 25
45 35
45 79
45 48
45 62
46 81
46 73
47 16
47 25
47 37
47 40
47 20
47 1
47 62
47 85
47 81
47 74
48 16
48 17
48 25
48 53
48 1
48 45
48 85
48 65
48 60
48 63
49 24
49 26
49 53
49 54
49 59
49 1
49 68
49 85
49 22
50 23
50 54
50 59
50 31
50 1
51 9
51 17
51 83
52 27
52 56
52 70
52 82
52 1
53 9
53 25
53 26
53 41
53 54
53 22
53 40
53 20
53 1
53 49
53 48
53 31
53 78
53 59
53 65
53 67
53 81
53 47
54 26
54 41
54 53
54 59
54 49
54 63
55 67
55 20
55 1
55 40
56 1
56 20
56 52
56 70
57 35
57 41
57 62
58 30
58 1
59 26
59 28
59 41
59 53
59 54
59 78
59 81
59 49
59 63
60 25
60 27
60 70
60 48
60 82
60 76
61 1
62 41
62 47
62 74
63 25
63 26
63 30
63 53
63 77
63 54
63 70
63 48
63 59
63 73
64 25
64 77
64 71
64 62
64 83
64 1
64 75
64 43
65 26
65 30
65 37
65 53
65 54
65 48
65 59
65 63
66 1
66 55
67 27
67 53
67 55
67 1
67 29
67 65
68 54
68 49
69 84
70 27
70 34
70 56
70 82
70 84
70 76
70 63
70 52
71 30
71 84
72 46
72 1
73 46
73 1
73 63
74 47
74 62
75 6
75 83
75 51
76 16
76 23
76 25
76 27
76 34
76 66
76 70
76 82
76 43
76 1
76 60
77 16
77 1
77 63
78 28
78 32
78 53
78 41
78 59
78 22
78 1
78 81
79 41
79 45
79 1
79 20
79 48
80 1
81 41
81 46
81 47
81 59
82 34
82 56
82 70
82 76
82 1
82 38
82 60
83 51
84 70
84 71
85 47
85 48
85 49
85 1
85 20
