,0,1,2,3,4,5,6,7,8,9,10,11
0,0.009960757,-1.0728865,0.54895276,0.65086657,-0.14926432,0.6114099,0.5302263,-0.25576165,0.2760413,0.5312353,-0.60797006,1.0742666
1,-0.041054703,-1.3430225,0.6069906,0.888438,-0.1906461,0.68367124,0.68074787,-0.18968947,0.32100478,0.7144873,-0.72340304,1.2570564
2,0.059089255,-1.3309059,0.63008577,0.75844544,-0.14030391,0.6077809,0.591961,-0.187349,0.300282,0.7219337,-0.60011244,1.1288382
3,-0.06369975,-1.5410997,0.8334536,0.8418039,-0.14742531,0.72254264,0.68355334,-0.30573714,0.31159598,0.7123268,-0.7908434,1.4713936
4,-0.032108456,-1.3286864,0.50666416,0.7956465,-0.20956084,0.6217182,0.45526212,-0.21521555,0.24344575,0.5471609,-0.7052795,1.1138581
5,0.025982713,-1.2815763,0.72069335,0.86679596,-0.03448998,0.58156943,0.68303317,-0.25345212,0.29025277,0.799038,-0.7970514,1.207294
6,0.048911087,-1.3218069,0.8177572,0.79983944,-0.08881337,0.47849774,0.51252747,-0.26281708,0.25291267,0.78722334,-0.8056148,1.2385572
7,0.029052857,-1.5051769,0.8569396,0.891475,-0.096902244,0.5627597,0.6971512,-0.26642224,0.20555356,0.8232546,-0.9138064,1.4639395
8,-0.09166851,-1.3810172,0.68902034,0.75068146,-0.20577131,0.6132393,0.6615909,-0.23594984,0.2713832,0.65146536,-0.76469773,1.2888945
9,0.018797003,-1.3483711,0.5929943,0.7895041,-0.090328485,0.5748113,0.5293805,-0.24483739,0.26256442,0.72608054,-0.7068649,1.1219519
10,-0.05621389,-0.4493984,-0.25429952,0.11580912,0.062476203,0.43542337,0.10625077,0.10565572,0.5513308,0.26819456,0.1284762,0.06083245
11,-0.38379622,-0.4987791,-1.2085255,-0.124522716,0.3617989,1.5226204,0.03900892,0.43383598,1.6393101,0.37174407,1.0880872,-0.7846244
12,-0.528947,-0.47774765,-1.5117546,-0.011194229,0.33447903,1.8677163,0.17927599,0.54633766,2.0980818,0.3615795,1.3159006,-0.92378724
13,-0.5427027,-0.38700134,-1.594556,-0.11720662,0.42628124,1.7529635,0.11445446,0.51665425,2.1145685,0.4319812,1.3232192,-1.068648
14,-0.49320948,-0.5052848,-1.221408,-0.0072856573,0.3362864,1.5064936,0.039152633,0.50373,1.7247195,0.41250837,1.0713677,-0.6085302
15,-0.49066913,-0.43666914,-1.3981396,-0.15476051,0.42399558,1.6168169,0.0985273,0.47058687,1.8496567,0.37604913,1.25084,-0.8005711
16,-0.2957547,-0.45050338,-1.1129035,-0.081712976,0.2992063,1.2726171,0.029144123,0.2490655,1.4282905,0.24400012,0.834648,-0.60500735
17,-0.3814628,-0.4921912,-1.1601819,-0.01780799,0.19192797,1.4168535,0.03394445,0.32749063,1.5476072,0.20115572,0.9355858,-0.6077026
18,-0.42371127,-0.41125944,-1.2345321,-0.03801695,0.36637798,1.4838688,0.07529916,0.40201598,1.7384797,0.32151383,1.0840881,-0.7247036
19,-0.44881207,-0.47049356,-1.1312771,-0.04553884,0.33220562,1.4503497,0.06059256,0.47576398,1.7024922,0.42854813,0.9196737,-0.60907197
20,-0.5220963,-0.59043044,-1.2836928,-0.090409644,0.29311237,1.6451983,0.16885236,0.43882063,1.7825406,0.4047923,1.1527659,-0.67849994
