"","PC1","PC2"
"1",-1.08254616133263,-0.0760122760652361
"2",-0.965152099928746,-0.151381756613167
"3",-3.45083869193848,-2.43707324853437
"4",0.899002583793753,0.118814303767146
"5",0.0582510223411787,0.622298836919052
"6",0.975750852524181,-0.0453694792240708
"7",1.02184361456376,0.583212486169712
"8",-0.675802891740434,-0.649663679412535
"9",-0.380008586005923,-0.412690776553357
"10",-0.853144366701764,-0.241352389974062
"11",-0.740803324882036,-0.67239914488939
"12",1.87530500297803,2.64091106764973
"13",-0.204454332181538,-4.12221922628677
"14",-2.95861391897578,-2.39522978028544
"15",2.11929037418972,0.274175229235795
"16",-0.868471369702506,-0.12051908816536
"17",-2.96269576863783,-1.09831056970451
"18",-1.10762361871935,-0.278357090276765
"19",-0.521463758128362,-0.759686153412399
"20",1.84576475797063,4.69948943866295
"21",-0.8594586428456,-5.08919379923323
"22",2.20207723358492,-0.498185675389549
"23",1.53077536657013,-3.16387606407112
"24",-3.69712643198004,2.11387187668275
"25",-3.72324232741493,2.20703934323241
"26",1.88318548781698,2.46594239622323
"27",-0.546510019935488,-0.41706940026282
"28",-0.842047354846784,-0.225082575145264
"29",-4.01968248182258,1.60180211108285
"30",4.63573400610183,-1.96557923616095
"31",0.10008180929135,0.526608222958538
"32",1.83901114977861,0.412290037461259
"33",-0.662373123099765,-0.0988275522478884
"34",-3.81920039207611,2.13972455151274
"35",1.12273138292663,-0.014793716123
"36",4.59822116540714,-1.97814498799683
"37",-3.55082210974971,-2.7262198793733
"38",1.9098466512816,0.340587084388402
"39",-0.39390279653339,1.67541505672142
"40",2.8604122121663,0.438120052059964
"41",4.5922267624454,-1.87199595848119
"42",1.80649540339585,2.60705085240932
"43",-0.814971128365952,-0.332204924276028
"44",-0.106489504213528,0.681462487811105
"45",4.58531860066386,-1.91324088219172
"46",1.87740061087547,5.24064595561804
"47",4.84941246055594,-3.03043265858953
"48",0.055829847654219,0.573164382733803
"49",-2.91091498350793,-2.94150803311729
"50",-3.62165529099205,-1.62256220062104
"51",4.64483858843331,-1.90436682267751
"52",-2.96027279306097,-1.10152675318646
"53",-0.389866579683277,-0.323178225962184
"54",-3.79817065763304,1.67486743460277
"55",2.02005783937884,-0.399729177041955
"56",0.178094082218036,0.806051264464668
"57",-0.646905338161642,-0.603163884143088
"58",-0.221362918173172,-3.96594104928714
"59",-3.64526030173682,2.14500748517094
"60",-0.760857584902096,1.59708074242353
"61",0.258198725363781,1.22910313902192
"62",1.956476550447,2.57405653437372
"63",-1.05582677804431,-0.382301535379079
"64",4.88882488966573,-2.95698131713214
"65",-3.77017835206622,2.2096075803766
"66",1.77085301097721,4.64304775976671
"67",0.848745972776393,-3.52645582418978
"68",0.732455205793697,0.615125210270182
"69",1.07427357059068,-0.101776403082873
"70",-1.16110917578106,-4.95525657939167
"71",0.252591736233913,1.04696653780382
"72",-0.56689503215733,-0.622796831121526
"73",-0.925865591354632,-0.0254483835623647
"74",1.19710551112024,2.76247191653896
"75",-0.0794256575506058,0.637131642643424
"76",0.918643387284318,-0.024323540105463
"77",-1.18476698760646,-0.398169411632172
"78",0.932008340504313,-3.36623480367045
"79",0.929088841791127,1.27392272024837
"80",-1.14137124008054,-0.0443687053998845
"81",-1.18594357684331,-0.246918401391695
"82",2.11576001352575,0.58917472622256
"83",-0.799898208666522,-0.514622925726305
"84",1.94173275112443,4.93530928338102
"85",-0.548390594634811,-0.537648336559673
"86",1.76730135937951,5.25598262985509
"87",1.68314344989016,3.20098896440674
"88",1.52831703960555,-3.15248276574922
"89",-0.458492106653589,-0.566365249695294
"90",-0.256665297728108,-4.05359402953205
"91",-3.8828862164947,2.84707869834121
"92",-1.13119432068141,-0.476515034999697
"93",2.68806195987749,0.903425631199637
"94",-0.191614091555802,1.354745076143
"95",-3.97118296380648,2.62259391333315
"96",2.97552086752837,0.320989626816968
"97",-2.85328466446449,-1.80975461482566
"98",-3.3909397159259,-2.46349041336929
"99",-0.603986765784735,-0.369689513364651
"100",1.37656693510393,3.03492844415225
