,0,1,2,3,4,5,6,7,8,9,10,11,12,13,14,15,16,17,18,19,20,21,22,23,24,25,26,27,28,29,30,31,32,33,34,35,36,37,38,39
0,0.21580030024051666,0.743263304233551,0.07949181646108627,0.05984945595264435,-0.10624074190855026,0.1699305772781372,-0.006043312605470419,-0.05549973249435425,0.1517261564731598,0.2547515630722046,-0.09174247831106186,0.0011916799703612924,0.3607783913612366,-0.03876576945185661,0.032526645809412,0.013931686989963055,0.028049852699041367,0.0749816820025444,-0.0923849493265152,0.0697680339217186,0.08290769159793854,-0.09271040558815002,0.1550498604774475,-0.1918102353811264,-0.3480146527290344,-0.22058582305908203,-0.2941855788230896,0.0953354611992836,0.14649982750415802,0.2651742398738861,0.06716182827949524,-0.08190912753343582,0.0842268243432045,0.20023272931575775,-0.3070550560951233,0.0027748127467930317,0.0052071670070290565,0.1962071806192398,0.006527958903461695,-0.2345796376466751
1,0.203328937292099,0.13386453688144684,0.21401460468769073,0.009590618312358856,0.07691628485918045,0.14108066260814667,-0.5000403523445129,-0.04715897887945175,0.7062807679176331,-0.38177961111068726,0.3941667973995209,0.20975685119628906,0.21224592626094818,-0.027896272018551826,-0.02144060842692852,-0.505885899066925,0.15060757100582123,-0.0024566694628447294,-0.47453367710113525,-0.04615161567926407,0.10754584521055222,0.2916378974914551,-0.26208168268203735,-0.1892545074224472,0.15634503960609436,0.27778246998786926,0.0009993859566748142,0.1584794521331787,0.4927971065044403,0.45992743968963623,0.30103012919425964,-0.32726365327835083,-0.1856507658958435,0.28204143047332764,-0.3594820499420166,0.19290073215961456,0.31596800684928894,0.4205646812915802,-0.059970468282699585,-0.07872195541858673
2,0.14875413477420807,0.2915194630622864,0.08010129630565643,0.014229302294552326,-0.08120638877153397,-0.03462153300642967,0.024737831205129623,0.05171724036335945,0.10854561626911163,0.07097447663545609,-0.24255023896694183,-0.04759358614683151,0.11162053048610687,0.01530896034091711,0.0045554302632808685,0.10007593780755997,0.009809860028326511,0.06211000680923462,-0.11092008650302887,0.02242833375930786,-0.2543081045150757,0.06754758208990097,0.07186512649059296,0.13763509690761566,-0.262241929769516,-0.159683957695961,0.013885208405554295,0.04093706235289574,0.20952466130256653,0.18284614384174347,0.050046298652887344,0.08699069917201996,0.03368318825960159,0.08033400774002075,-0.20751714706420898,0.027096590027213097,-0.006457427050918341,0.04834786057472229,-0.09253829717636108,-0.16135193407535553
3,-0.25085005164146423,0.45417195558547974,0.0980796366930008,-0.11174742132425308,-0.10157299786806107,0.005205608904361725,0.18438620865345,0.2609573304653168,-0.32558977603912354,0.22218455374240875,0.5248680710792542,-0.1226762905716896,-0.19136187434196472,0.12252689898014069,0.36315128207206726,0.22748351097106934,-0.011526793241500854,-0.44221216440200806,-0.06559233367443085,0.04720244184136391,-0.2485978901386261,0.24637086689472198,-0.14474163949489594,0.28821510076522827,0.05519241839647293,-0.24803444743156433,0.329836905002594,0.374665766954422,0.26155370473861694,0.3322308361530304,-0.07231442630290985,-0.18871672451496124,0.671262800693512,0.16382525861263275,-0.718292236328125,-0.10799507796764374,-0.31391599774360657,-0.07212994247674942,-0.2771049737930298,0.37965649366378784
4,0.19070319831371307,0.3372350335121155,0.029253767803311348,0.06820925325155258,-0.04053260758519173,-0.001733338925987482,-0.03492752090096474,0.04912997782230377,0.08899877965450287,0.06494641304016113,-0.3168196678161621,-0.03766898438334465,0.2142568975687027,-0.015957489609718323,-0.05999598279595375,0.05672253295779228,-0.03533808887004852,0.03274647518992424,-0.07329342514276505,0.0478181466460228,-0.22583816945552826,0.03134177625179291,0.11748877167701721,0.17533108592033386,-0.31536465883255005,-0.23687145113945007,-0.011854360811412334,0.06796616315841675,0.24387231469154358,0.19701996445655823,0.04048148915171623,0.1259859949350357,0.0882241502404213,0.14431288838386536,-0.2686731815338135,-0.06342305988073349,0.05326121672987938,0.07050567120313644,-0.08413494378328323,-0.2152005434036255
5,0.19416837394237518,0.3289324641227722,0.04650956392288208,0.029835795983672142,-0.05424962937831879,-0.03746531158685684,0.013138150796294212,0.02201744355261326,0.12838239967823029,0.06052074581384659,-0.2838718295097351,-0.03372791036963463,0.1916789710521698,-0.013901900500059128,-0.04018678143620491,0.07601471990346909,-0.0008732946589589119,0.053451959043741226,-0.09641479700803757,0.012987048365175724,-0.25930002331733704,0.042010605335235596,0.08432839810848236,0.16682855784893036,-0.30163103342056274,-0.2002682387828827,0.016025064513087273,0.041107356548309326,0.23591817915439606,0.16808947920799255,0.06726130098104477,0.10579270124435425,0.07205776125192642,0.1230340227484703,-0.23069757223129272,0.00274515594355762,0.006136865820735693,0.04825834557414055,-0.11038126796483994,-0.21924349665641785
6,-0.1388872265815735,0.39851319789886475,0.24319322407245636,0.005045309662818909,-0.3018111288547516,0.008050968870520592,-0.5994287729263306,0.39667853713035583,-0.15233732759952545,0.3563289940357208,0.28262463212013245,0.15364202857017517,-0.09097538888454437,0.23530611395835876,0.8591859340667725,0.3045280873775482,0.17297735810279846,-0.21677233278751373,-0.041419144719839096,0.10738775879144669,-0.5415071845054626,-0.4146578013896942,-0.20419958233833313,0.2505267262458801,0.3014164865016937,-0.3176693618297577,0.2583059072494507,-0.14260849356651306,0.1335911750793457,0.3247923254966736,-0.05713038146495819,-0.4563123881816864,0.0749969482421875,0.24375735223293304,-0.07414902746677399,-0.19156524538993835,0.45053038001060486,-0.21162427961826324,0.34954312443733215,-0.04246492311358452
7,-0.06573130190372467,0.3225519359111786,0.09053241461515427,-0.01748860441148281,-0.3064410388469696,0.08866721391677856,0.13753321766853333,0.5261662602424622,-0.06901530921459198,0.2257440835237503,-0.03761051595211029,-0.19714690744876862,-0.406878262758255,0.3849390745162964,0.15222685039043427,-0.005488880909979343,-0.0615164190530777,0.09582741558551788,-0.15342621505260468,0.06988902390003204,-0.1540907770395279,0.16608229279518127,0.13065870106220245,-0.1546797752380371,0.16814596951007843,0.09868872910737991,-0.16033585369586945,-0.0918097123503685,0.3469577729701996,0.24683985114097595,-0.25475460290908813,0.16662856936454773,-0.12056562304496765,-0.04434060677886009,-0.4000372290611267,-0.12702222168445587,0.13768836855888367,-0.03222741559147835,-0.10884753614664078,0.14561115205287933
8,-0.03231462091207504,0.28715386986732483,0.4059760272502899,-0.2916901707649231,0.0407363623380661,-0.010397665202617645,-0.11902311444282532,-0.04841899126768112,0.22802160680294037,0.40050768852233887,-0.11122244596481323,0.20065027475357056,-0.4398837387561798,0.45979800820350647,0.393169105052948,0.11839938908815384,-0.6196253895759583,-0.11016559600830078,-0.43494081497192383,0.13580405712127686,-0.10273054987192154,0.10551004111766815,0.13700594007968903,-0.25659382343292236,-0.028107445687055588,-0.2553842067718506,0.4357595443725586,-0.0278879813849926,0.17833054065704346,0.10900107026100159,-0.3937106132507324,0.013184620998799801,0.32506468892097473,0.2484065443277359,-0.3325154781341553,-0.15113911032676697,0.18378905951976776,-0.16146627068519592,0.26150327920913696,0.07739389687776566
9,-0.08103562146425247,0.17964580655097961,-0.27002039551734924,-0.0453847199678421,0.03558582812547684,0.3190796375274658,0.06666795909404755,0.3085269331932068,0.005795374512672424,0.13300487399101257,-0.14965452253818512,0.19257771968841553,-0.18696781992912292,-0.04975113645195961,-0.07649083435535431,-0.2079724818468094,0.11196808516979218,-0.16155670583248138,-0.0670669823884964,0.22092127799987793,0.18426182866096497,0.10101361572742462,-0.10124558210372925,0.3416728377342224,-0.17272956669330597,-0.1327812522649765,-0.22478654980659485,0.021547913551330566,0.43224453926086426,0.030654028058052063,-0.08742336928844452,0.045974548906087875,-0.12599343061447144,0.13632357120513916,-0.052850548177957535,-0.06036430224776268,-0.083741694688797,0.13548801839351654,0.07942281663417816,-0.014976806938648224
10,0.17918719351291656,0.32023748755455017,0.04357181116938591,0.040021397173404694,-0.05038516968488693,-0.010747280903160572,-0.006820361595600843,0.02925146371126175,0.09398983418941498,0.05698723718523979,-0.2664230763912201,-0.04699312895536423,0.15968835353851318,-0.008716803975403309,-0.05701683461666107,0.08068767935037613,-0.006960046011954546,0.052875082939863205,-0.08869796246290207,0.014575936831533909,-0.23181159794330597,0.0395396426320076,0.10187558829784393,0.16332939267158508,-0.3004325330257416,-0.1994108408689499,-0.016276441514492035,0.0588323138654232,0.21871714293956757,0.18359072506427765,0.05633158981800079,0.10776262730360031,0.041772451251745224,0.10253991186618805,-0.2399381399154663,-0.005214463919401169,0.020435834303498268,0.056258294731378555,-0.09640039503574371,-0.1802414357662201
11,-0.003529475536197424,0.31616392731666565,0.17340409755706787,-0.11682377010583878,-0.3011090159416199,-0.07988212257623672,0.20482753217220306,0.35067108273506165,0.07355532795190811,0.1211736872792244,0.012165025807917118,-0.10278865694999695,-0.479812353849411,0.38723012804985046,0.13421666622161865,0.1496155709028244,0.102545827627182,0.09088274836540222,-0.2366563081741333,0.027883000671863556,-0.32024019956588745,0.16077914834022522,0.0776243805885315,-0.048700541257858276,0.08472936600446701,0.15346744656562805,-0.14617693424224854,-0.0930156484246254,0.3270263075828552,0.14416128396987915,-0.09041181206703186,0.11766041070222855,-0.2386137694120407,-0.06490684300661087,-0.330788791179657,0.10092339664697647,-0.002977898111566901,-0.1223779171705246,-0.11670056730508804,0.11381486803293228
12,0.05177619308233261,0.04642631858587265,0.25536367297172546,0.01828506588935852,-0.41388800740242004,-0.18587370216846466,0.25077441334724426,0.3623937666416168,-0.1980641633272171,0.25196146965026855,-0.11367886513471603,0.0021178964525461197,-0.3033120930194855,0.10398412495851517,0.5363911390304565,0.6260261535644531,0.08514275401830673,-0.08723238855600357,-0.4298117160797119,0.304110586643219,-0.28557300567626953,0.09490898251533508,0.062351346015930176,-0.011208869516849518,-0.0676480233669281,0.18491555750370026,0.14118856191635132,-0.18653224408626556,0.21532291173934937,0.3948054313659668,-0.03693515062332153,-0.1999836415052414,0.4931808412075043,0.05077875033020973,-0.10872965306043625,0.2698270082473755,0.1926828920841217,0.7126122117042542,0.2022550255060196,0.1580214500427246
13,0.21984855830669403,0.25281938910484314,0.12159442901611328,-0.13456116616725922,-0.20035241544246674,-0.19301429390907288,0.18388080596923828,-0.1525997817516327,0.21679143607616425,0.006948020309209824,-0.19994062185287476,0.08529581874608994,0.06067374348640442,0.015152828767895699,0.06133487448096275,0.1075897067785263,0.17493602633476257,0.04074755311012268,-0.14241763949394226,-0.04191529378294945,-0.4356902837753296,0.10843992978334427,-0.0019064262742176652,0.11726701259613037,-0.2678245007991791,-0.008905700407922268,0.01627352088689804,0.004084499552845955,0.23139263689517975,0.015456976369023323,0.17772328853607178,0.10020996630191803,-0.094905786216259,0.1583855301141739,-0.07148796319961548,0.20414908230304718,-0.15571673214435577,0.0039011407643556595,-0.14108224213123322,-0.1542733758687973
14,0.18262912333011627,0.33227238059043884,0.0212884321808815,0.06246080622076988,-0.07281557470560074,0.009334031492471695,-0.016847360879182816,0.051626794040203094,0.06581324338912964,0.07897114008665085,-0.27966639399528503,-0.05989561602473259,0.2202056646347046,-0.024873161688447,-0.04900610074400902,0.03131847083568573,-0.039975862950086594,0.05207210034132004,-0.05757509544491768,0.014375770464539528,-0.2221069633960724,0.03955959901213646,0.11889037489891052,0.14821946620941162,-0.28282690048217773,-0.21093520522117615,-0.008422113955020905,0.054762933403253555,0.23590028285980225,0.20413433015346527,0.022637655958533287,0.12233281135559082,0.06602996587753296,0.13643960654735565,-0.24564485251903534,-0.05380382761359215,0.040761254727840424,0.09400089085102081,-0.11007478833198547,-0.18744710087776184
15,-0.11013701558113098,0.23179009556770325,0.12171293795108795,-0.1498296558856964,0.05900859832763672,-0.11784332245588303,-0.11006815731525421,0.01663803867995739,-0.004605776164680719,0.01835380122065544,0.020988916978240013,-0.013423625379800797,0.04140540957450867,0.002431148197501898,-0.12429428845643997,0.2158324122428894,-0.0765630230307579,0.04192323982715607,-0.04716813936829567,0.12207471579313278,0.4921398460865021,-0.07831279933452606,-0.06815124303102493,-0.1756148338317871,0.07575110346078873,0.16939011216163635,-0.07067416608333588,0.0672660544514656,0.06414615362882614,0.08790336549282074,0.37620577216148376,-0.253368079662323,-0.2719186842441559,0.2652750611305237,-0.22923782467842102,0.05155616253614426,-0.1477525383234024,0.15769344568252563,-0.01781640015542507,-0.049024105072021484
16,0.3607753813266754,0.38266125321388245,-0.27422788739204407,0.45719045400619507,0.36183521151542664,-0.17791032791137695,0.07437387853860855,0.18689124286174774,-0.040538910776376724,-0.19445186853408813,0.28674745559692383,-0.12790623307228088,-0.17577670514583588,0.0029983886051923037,0.10423815995454788,0.14279788732528687,-0.03075876273214817,-0.6602321267127991,-0.19651088118553162,-0.21545134484767914,-0.0724891796708107,0.06992530822753906,0.013299520127475262,-0.057924315333366394,-0.14219674468040466,0.2618207633495331,-0.06605686247348785,0.1063726618885994,0.02247065305709839,-0.3906087279319763,-0.5659247636795044,-0.152080699801445,-0.4073091149330139,0.3553484082221985,-0.06641274690628052,0.0024113901890814304,0.014487676322460175,0.17306560277938843,0.1693757027387619,-0.13897033035755157
17,0.22561928629875183,-0.11678134649991989,-0.24025693535804749,0.2923859655857086,-0.06155583634972572,0.16872598230838776,-0.06989171355962753,-0.183699831366539,0.5012833476066589,0.2558991014957428,0.31408241391181946,0.32517749071121216,-0.20642860233783722,-0.1175994798541069,0.28229087591171265,-0.28936246037483215,-0.06255647540092468,0.07790465652942657,-0.011750527657568455,-0.13890241086483002,0.023967113345861435,-0.06148175895214081,-0.13525305688381195,0.048691220581531525,-0.15692608058452606,-0.0003056067507714033,-0.10605265200138092,0.1314137876033783,0.19629548490047455,0.1950373500585556,-0.0997491404414177,-0.051279764622449875,-0.05037222057580948,0.17937970161437988,0.14101846516132355,0.0415685661137104,0.14467740058898926,0.19678935408592224,-0.2598695158958435,0.322994589805603
18,-0.05845644325017929,0.005158496554940939,-0.002280112588778138,-0.044942762702703476,-0.05255761742591858,0.07104134559631348,0.05458233878016472,-0.022209355607628822,0.1073942482471466,0.018734214827418327,0.052933257073163986,-0.05266594886779785,0.06776012480258942,-0.06916948407888412,0.06364626437425613,-0.021344564855098724,0.0471344031393528,0.0675901547074318,-0.16631439328193665,0.044779032468795776,-0.023732051253318787,0.0958188846707344,0.0012656960170716047,0.02826700359582901,0.026226790621876717,-0.03950051590800285,-0.17631474137306213,0.06282465159893036,-0.05982373654842377,-0.09864205867052078,-0.04660244658589363,-0.05423297360539436,0.04636985436081886,0.058170467615127563,0.05281265452504158,-0.1073061004281044,-0.014374446123838425,0.001961982110515237,0.11627409607172012,-1.0838260777745745e-06
19,-0.011495394632220268,0.002660863334313035,-0.02886056713759899,-0.01264752633869648,-0.014877261593937874,0.01222019363194704,0.016521397978067398,0.017764896154403687,0.02566094696521759,-0.023761829361319542,-0.006753143388777971,-0.03991777449846268,0.015572816133499146,-0.006457522977143526,-0.0087072579190135,-0.0028151751030236483,-0.0292750783264637,0.004444056656211615,-0.026821965351700783,0.0045261806808412075,-0.010507130064070225,-0.006713632959872484,-0.042827166616916656,-0.006966776214540005,-0.001406096387654543,-0.0019581899978220463,0.01581808365881443,-0.01936136931180954,-0.0010088259587064385,0.03018762357532978,0.006904937326908112,0.006539922207593918,-0.012140623293817043,0.02461412362754345,-0.004227278754115105,0.014127160422503948,-0.025697529315948486,0.004492084961384535,0.013130648992955685,0.018145015463232994
20,0.11824401468038559,0.04135019704699516,0.059272702783346176,-0.30517104268074036,0.1128823310136795,0.3092876970767975,-0.10208316147327423,0.03392307087779045,0.17246083915233612,0.07765040546655655,0.1459757685661316,-0.2296307533979416,0.0984610766172409,0.07253461331129074,0.08094661682844162,0.026273733004927635,0.028500303626060486,-0.07089093327522278,-0.2607291340827942,-0.19441001117229462,0.1272294819355011,0.03920084983110428,0.017022784799337387,-0.06521150469779968,-0.2611214518547058,-0.08862496167421341,-0.07577173411846161,-0.1347222924232483,0.16766305267810822,-0.17097824811935425,0.0440978966653347,-0.3769521713256836,-0.08984936028718948,-0.11577457934617996,0.2506370544433594,-0.3032689392566681,0.0191142987459898,0.1570139080286026,-0.0951467752456665,0.1359921097755432
21,-0.015665579587221146,0.10580611228942871,-0.07324247807264328,-0.14153531193733215,0.014230184257030487,-0.15062032639980316,-0.06173449754714966,-0.2161838859319687,-0.1026809886097908,0.03159821406006813,0.26988527178764343,0.1266144961118698,0.003908354789018631,0.07762409001588821,-0.08344821631908417,0.13263964653015137,0.07621704787015915,0.10853858292102814,0.020462609827518463,0.05121690779924393,0.2026151567697525,-0.09835553914308548,0.20220638811588287,-0.20813629031181335,0.005579357035458088,-0.12439897656440735,-0.21054373681545258,0.14072109758853912,0.12586325407028198,0.02148892544209957,0.11583887040615082,-0.1069040596485138,-0.20542660355567932,0.08871794492006302,-0.19873261451721191,0.19284072518348694,0.018635433167219162,0.04923155531287193,0.10745421797037125,0.10818976163864136
22,0.09951207041740417,0.020495766773819923,-0.07458725571632385,-0.18506082892417908,0.0032460864167660475,0.020234616473317146,-0.20273886620998383,-0.05411402881145477,0.07530113309621811,-0.1527872383594513,-0.14621099829673767,0.05066123232245445,-0.20163004100322723,-0.21714675426483154,0.07157094776630402,0.034507665783166885,0.25948745012283325,-0.18155904114246368,-0.03225138783454895,0.12101598083972931,0.11392011493444443,-0.07760760933160782,-0.04884681850671768,-0.055245015770196915,-0.05547403544187546,0.13629592955112457,0.002671587746590376,-0.09668167680501938,0.05067934840917587,0.06834910064935684,-0.09987514466047287,0.13472820818424225,-0.05916360765695572,0.21655231714248657,-0.03634471073746681,-0.0743861123919487,-0.08150894194841385,-0.01622885651886463,-0.13181255757808685,0.14616359770298004
23,-0.0700216218829155,0.1377844661474228,-0.019774528220295906,0.03306763246655464,0.25274166464805603,-0.12173162400722504,0.09586525708436966,-0.03308567777276039,-0.013488211669027805,0.010597155429422855,0.29450035095214844,-0.006979305762797594,-0.03024953231215477,-0.07560893893241882,-0.0652509331703186,0.16667310893535614,-0.008460338227450848,0.03888557106256485,-0.27368855476379395,-0.30347150564193726,0.08718596398830414,-0.4174019396305084,-0.38969889283180237,0.13190485537052155,0.05652818828821182,0.33458372950553894,-0.4824312627315521,-0.501454770565033,0.32300469279289246,-0.24716602265834808,-0.2711244225502014,-0.05266531556844711,0.38087210059165955,-0.04913919419050217,-0.27361249923706055,0.07909610122442245,0.09163323044776917,0.21483482420444489,0.09227901697158813,-0.3684886693954468
24,-0.00669237831607461,0.12956954538822174,-0.06841272115707397,-0.08651351183652878,-0.03297494351863861,0.004695898853242397,-0.04805346950888634,-0.06618686020374298,0.015707891434431076,-0.03816448897123337,-0.11720273643732071,0.09702559560537338,-0.08957912027835846,-0.09789860248565674,0.01846526749432087,-0.005860494449734688,0.035709451884031296,-0.20032644271850586,-0.06474662572145462,0.10251323133707047,0.007639036048203707,0.03771539404988289,-0.06729795783758163,-0.04700348153710365,-0.01693488284945488,0.043810389935970306,-0.012851795181632042,-0.058483414351940155,0.08301115036010742,-0.0714106559753418,0.021729420870542526,-0.007129236590117216,-0.08024139702320099,0.06758496165275574,0.10870744287967682,-0.04765782505273819,-0.05354864522814751,-0.013452183455228806,-0.002128340769559145,0.07778555899858475
25,-0.057603467255830765,0.11065518856048584,-0.011266655288636684,-0.10616613179445267,-0.11824296414852142,0.27246376872062683,-0.19121335446834564,-0.023975765332579613,0.057622604072093964,0.09309370070695877,-0.07118038088083267,-0.014257654547691345,0.024571837857365608,-0.011840078048408031,0.037924930453300476,-0.17827847599983215,0.17856869101524353,-0.19237370789051056,0.09606746584177017,-0.22037695348262787,0.05382423847913742,0.08360644429922104,-0.04977601394057274,-0.20576289296150208,-0.16492322087287903,0.13266968727111816,-0.05276370793581009,-0.15332789719104767,0.26208895444869995,-0.019192399457097054,-0.18381386995315552,-0.1280873715877533,0.030104318633675575,0.015417159534990788,0.15683802962303162,-0.0031506854575127363,-0.27626726031303406,0.1696140617132187,0.013975778594613075,0.08654642850160599
26,0.031180905178189278,-0.028624942526221275,0.006179241929203272,-0.21677875518798828,0.0008344515226781368,0.010977826081216335,-0.340670645236969,0.004930488299578428,0.033989354968070984,-0.1344267576932907,-0.2093200385570526,-0.08623213320970535,-0.2051963359117508,-0.10255858302116394,-0.14351992309093475,0.11024065315723419,0.13940070569515228,-0.2297874540090561,0.0027618641033768654,-0.08890876919031143,0.17800326645374298,-0.010474174283444881,-0.1217525377869606,0.017061814665794373,-0.022510811686515808,0.15567685663700104,0.11341968178749084,-0.07827965915203094,0.13347287476062775,0.15751393139362335,-0.027036407962441444,0.020940624177455902,-0.056405507028102875,0.07921607792377472,-0.043925121426582336,-0.04459264129400253,-0.08132866770029068,0.0515478253364563,-0.13183486461639404,0.019301125779747963
27,0.001849914202466607,-0.28860315680503845,-0.3725810945034027,-0.019246075302362442,0.42733946442604065,-0.04738146811723709,-0.5296062231063843,0.12596236169338226,-0.43726688623428345,0.18455515801906586,0.8725056648254395,-0.05863930657505989,-0.10872083902359009,0.19728846848011017,-0.13732591271400452,-0.10705287009477615,0.15407025814056396,-0.625323474407196,-0.9490903615951538,-0.17902976274490356,-0.3919253945350647,-0.08686750382184982,-0.07118937373161316,-0.349316269159317,-0.3578040599822998,0.12063063681125641,0.24899554252624512,-0.29682016372680664,0.023525182157754898,0.35517972707748413,0.5046901106834412,0.4370361566543579,-0.32902517914772034,0.3024137020111084,0.027057234197854996,-0.16987495124340057,-0.05794466659426689,0.3726505637168884,0.1120162084698677,-0.42221158742904663
28,0.13017070293426514,0.1440693587064743,-0.09625265002250671,-0.032289013266563416,-0.13583622872829437,0.02243431843817234,-0.08661911636590958,-0.12044431269168854,0.16513343155384064,-0.05844747647643089,0.045592620968818665,0.0034573159646242857,-0.14079546928405762,-0.13070735335350037,0.1547260880470276,-0.12374427169561386,0.2766258120536804,-0.10045246034860611,-0.0725073590874672,0.14983710646629333,0.1250104159116745,-0.03889985382556915,-0.03673109784722328,-0.0931258276104927,-0.018157675862312317,0.04544060304760933,-0.13776932656764984,-0.17070354521274567,-0.08824512362480164,0.011090788058936596,-0.2278580516576767,0.09243429452180862,0.0017749604303389788,0.15551330149173737,0.009062937460839748,-0.1272052526473999,-0.11560649424791336,0.03585325554013252,-0.16658273339271545,0.06520573794841766
29,-0.13425323367118835,0.0030127388890832663,-0.07599380612373352,0.23257069289684296,-0.015025361441075802,-0.04203491657972336,-0.020961754024028778,-0.24265523254871368,0.30077463388442993,0.09134765714406967,0.032867442816495895,0.15420609712600708,0.04760175198316574,0.12806209921836853,0.20861124992370605,-0.0014591587241739035,0.094851553440094,-0.13940875232219696,0.0007838129531592131,0.04197602719068527,-0.06875266134738922,-0.030378010123968124,-0.09836924076080322,-0.019847899675369263,0.03389083221554756,0.16857481002807617,-0.28291386365890503,0.16101184487342834,0.21280145645141602,-0.16836750507354736,0.12566062808036804,0.32721182703971863,0.012338493950664997,0.1297888606786728,-0.012177299708127975,-0.11712729185819626,-0.02843044325709343,0.09809743613004684,0.053825899958610535,0.28965067863464355
30,0.02324981801211834,0.19895035028457642,-0.06477438658475876,-0.06878893077373505,-0.13034549355506897,0.005957412999123335,-0.05002250149846077,0.04537779837846756,-0.014699965715408325,-0.06509731709957123,-0.15499651432037354,-0.04808066785335541,-0.18831385672092438,-0.06629973649978638,-0.09795337170362473,-0.04822053387761116,0.05213441699743271,-0.2178400158882141,-0.04999657720327377,0.11921148002147675,0.07924704253673553,0.011194043792784214,-0.21801535785198212,-0.025994351133704185,0.054690171033144,0.12475605309009552,-0.1310681700706482,-0.08268687129020691,0.13578851521015167,-0.20202496647834778,-0.05268852785229683,0.04801337048411369,-0.16168542206287384,0.18890945613384247,0.08626169711351395,-0.07365431636571884,0.09886391460895538,-0.02123475819826126,-0.07219431549310684,0.06983094662427902
31,-0.06428756564855576,-0.010956515558063984,-0.028909405693411827,-0.14724373817443848,0.004069098271429539,0.11006242781877518,-0.13224920630455017,0.02826511859893799,-0.030304253101348877,-0.034203581511974335,-0.23770296573638916,0.05095476284623146,-0.09652286767959595,-0.08901083469390869,-0.007366575300693512,-0.043326038867235184,0.14354033768177032,-0.19914351403713226,-0.02373827062547207,0.015205713920295238,-0.0038834488950669765,-0.020608292892575264,-0.11548593640327454,-0.019034652039408684,-0.0628567785024643,0.08206665515899658,-0.028059611096978188,-0.02118336781859398,0.21964098513126373,-0.10339553654193878,0.03208906203508377,0.030589455738663673,-0.07739805430173874,0.1433621346950531,0.04061395302414894,0.029585272073745728,-0.10742214322090149,-0.01799185387790203,0.0984424501657486,0.12132048606872559
32,0.046089332550764084,0.11602505296468735,-0.38237881660461426,0.09677231311798096,0.256216824054718,-0.03400988504290581,-0.0611400306224823,-0.6532022356987,-0.31473493576049805,-0.4658389687538147,0.041923269629478455,-0.37002888321876526,-0.41102173924446106,0.3304431438446045,0.7061411738395691,-0.442364901304245,-0.3971652388572693,-0.2502706050872803,-0.4026590883731842,0.12346798181533813,-0.051392801105976105,-0.32777348160743713,0.09624306112527847,0.1692778319120407,0.019324420019984245,0.30704265832901,-0.29632410407066345,0.2336156815290451,0.06584477424621582,0.33862990140914917,-0.04263162612915039,-0.21873216331005096,0.05925630033016205,-0.4553232192993164,-0.011350864544510841,-0.12593084573745728,-0.5274959206581116,0.277773380279541,-0.04548114910721779,-0.8264114856719971
33,-0.045012980699539185,-0.2534151077270508,0.21217182278633118,-0.0376017764210701,0.08861945569515228,-0.14413195848464966,-0.22657033801078796,0.03775228559970856,0.21471050381660461,0.0031837925780564547,0.13464310765266418,-0.006321012042462826,-0.15666133165359497,0.07612383365631104,0.18340039253234863,-0.0720687136054039,0.10502936691045761,0.08455763757228851,0.08365931361913681,-0.21061889827251434,0.16275569796562195,0.049824584275484085,-0.11911752820014954,0.14973343908786774,-0.1786108762025833,-0.2394537627696991,-0.19677777588367462,-0.15996377170085907,-0.11275262385606766,-0.024807516485452652,-0.0653352439403534,0.03588588535785675,-0.04777241125702858,0.1454417109489441,-0.22680164873600006,-0.10016036033630371,-0.07295158505439758,0.26308390498161316,-0.11374814063310623,-0.09082996100187302
34,-0.10463810712099075,-0.00012500891170930117,0.3656647801399231,0.04827161133289337,-0.1423587203025818,-0.0025921203196048737,-0.1487734168767929,0.03444976732134819,0.12335837632417679,0.052468422800302505,0.08370663970708847,-0.07614004611968994,0.05516849085688591,0.14664186537265778,-0.1343403458595276,-0.06324800103902817,-0.01587330549955368,-0.031629711389541626,0.10334491729736328,-0.1657882183790207,0.16237229108810425,0.03856397792696953,-0.1819356083869934,0.12492146342992783,0.05421067401766777,0.1680639684200287,-0.11966113746166229,0.02637501060962677,-0.1415034681558609,-0.03269650787115097,0.0675753802061081,-0.13233226537704468,-0.006904042791575193,0.1425318717956543,-0.23375968635082245,-0.14780819416046143,-0.2887793481349945,0.35098591446876526,0.027426624670624733,-0.1570083051919937
35,-0.2704647481441498,0.16105493903160095,-0.23788470029830933,-0.0516483373939991,0.3384140729904175,-0.1894737184047699,0.03798702731728554,0.12949085235595703,0.08952246606349945,-0.18528254330158234,-0.04586510360240936,-0.0550980344414711,0.2061607986688614,0.2702012062072754,0.21440790593624115,0.16774266958236694,0.10750162601470947,-0.05813246965408325,0.03277328237891197,0.14320549368858337,0.17766843736171722,0.11872781813144684,-0.1835717111825943,-0.42375415563583374,-0.23419779539108276,-0.053457263857126236,-0.04664197564125061,0.09000791609287262,0.11125686019659042,-0.04341360181570053,-0.24894018471240997,-0.4304613769054413,-0.18380628526210785,0.3335137963294983,0.05501214787364006,0.05565473064780235,-0.3055378198623657,0.34592995047569275,-0.0785246267914772,-0.06024812534451485
36,-0.22292450070381165,-0.1526382863521576,0.1821572482585907,-0.10135281831026077,-0.20454077422618866,-0.0033108219504356384,-0.1771349012851715,-0.0162406824529171,0.15854772925376892,0.032281290739774704,0.16009566187858582,-0.23257945477962494,0.11839175969362259,0.016792217269539833,-0.10975849628448486,-0.09166982024908066,0.015375547111034393,0.09894447028636932,-0.014270179904997349,-0.17948731780052185,-0.0015332226175814867,0.25359857082366943,-0.059608981013298035,0.11573966592550278,0.07787247002124786,-0.0024215546436607838,-0.2068401277065277,0.055982936173677444,0.09010142832994461,-0.1476026326417923,-0.12850329279899597,-0.15215949714183807,0.03684038668870926,0.19505052268505096,-0.08382432162761688,-0.20221346616744995,-0.15069302916526794,0.3531550168991089,0.06333261728286743,-0.12775781750679016
37,0.038432564586400986,0.14939260482788086,-0.03855660557746887,-0.09187937527894974,-0.1075233742594719,-0.027196329087018967,-0.14734366536140442,-0.1306295245885849,0.14583720266819,-0.0865907222032547,-0.07047298550605774,0.00014742596249561757,-0.1852983832359314,-0.233980193734169,0.06815986335277557,0.010508629493415356,0.20962610840797424,-0.24195508658885956,-0.1115727350115776,0.18166054785251617,0.154086172580719,0.046860627830028534,-0.20268961787223816,-0.04020662605762482,-0.04870844632387161,0.04253290221095085,-0.050165846943855286,-0.09279963374137878,-0.08420893549919128,0.014389598742127419,-0.14861124753952026,0.07226619124412537,-0.05535774305462837,0.16255798935890198,0.03919830918312073,-0.1204637736082077,-0.07930035889148712,0.03662703558802605,-0.12848639488220215,0.05527974292635918
38,0.30085957050323486,-0.06065653637051582,-0.057795073837041855,0.12919512391090393,0.29983288049697876,-0.14790737628936768,-0.08909729868173599,-0.010728918947279453,-0.0633658766746521,0.29179102182388306,0.17672181129455566,-0.16292735934257507,0.0017604180611670017,-0.41696929931640625,0.423073947429657,-0.06346018612384796,0.06965084373950958,0.15881198644638062,-0.13259276747703552,-0.035654883831739426,0.05194205045700073,0.19968543946743011,-0.2858286499977112,0.006998235825449228,-0.14786455035209656,0.12670749425888062,0.01828697882592678,0.09791148453950882,-0.08852777630090714,-0.07761675119400024,-0.17396646738052368,0.17080487310886383,-0.2104242444038391,-0.039650723338127136,-0.331249475479126,-0.07649163901805878,-0.24834343791007996,-0.015318155288696289,0.3540864884853363,-0.04392421618103981
39,-0.04690806567668915,-0.0786389634013176,0.049080394208431244,-0.04215241223573685,0.08792725205421448,0.03629649430513382,-0.0813869833946228,0.06685272604227066,-0.0195475947111845,-0.00651762168854475,-0.05756239593029022,0.011357096955180168,0.003045665565878153,0.048521850258111954,-0.013748311437666416,0.02012697421014309,0.03387512266635895,0.029975328594446182,0.02741958573460579,-0.09875013679265976,-0.0020809888374060392,-0.029315494000911713,0.0007391017861664295,0.02012600749731064,-0.0487736314535141,0.026109643280506134,-0.009595108218491077,-0.012148289009928703,0.08867498487234116,0.02576398476958275,-0.0028276247903704643,-0.008850648067891598,0.013820634223520756,0.0033070947974920273,-0.013126322068274021,0.022635070607066154,-0.07586168497800827,0.004577649757266045,0.03282174468040466,0.007511774078011513
40,-0.16599375009536743,-0.058819543570280075,0.30906882882118225,-0.14101649820804596,0.9258599877357483,-0.1606978327035904,-0.007181741297245026,-0.708001971244812,-0.14650307595729828,0.47153565287590027,0.166765958070755,-0.2117307037115097,0.2269568294286728,0.14856110513210297,-0.11227911710739136,-0.14579704403877258,-0.410564661026001,-0.5998945236206055,-0.3650539517402649,0.35642367601394653,-0.5182896256446838,-0.07935723662376404,-0.12338966131210327,0.14968237280845642,0.08165360987186432,0.24136805534362793,-0.410370409488678,-0.6302598118782043,0.12419597804546356,0.6495591402053833,-0.4431031346321106,-0.13837501406669617,-0.45673668384552,0.12512493133544922,-0.11208410561084747,-0.3829021453857422,-0.31772980093955994,0.2636614441871643,-0.040869660675525665,-0.007394770160317421
41,0.2875956594944,-0.26021909713745117,0.039654988795518875,-0.04317721724510193,0.05386074632406235,0.22529686987400055,-0.2052704244852066,-0.0265310388058424,0.328315794467926,0.16080865263938904,0.2937924265861511,0.1275608241558075,-0.16872315108776093,0.06154613196849823,-0.284065306186676,-0.0043261609971523285,0.3063082695007324,0.035337116569280624,-0.12508557736873627,0.2827453315258026,0.14454106986522675,-0.23474803566932678,-0.18076921999454498,0.04470056667923927,-0.41954436898231506,0.025390740483999252,0.08809744566679001,0.044701334089040756,0.19974437355995178,0.1481284499168396,-0.3275836706161499,-0.44606852531433105,-0.1505977362394333,-0.14723056554794312,-0.08970180153846741,-0.20569264888763428,-0.1782406121492386,0.16998538374900818,-0.18810616433620453,0.025450879707932472
42,-0.00039411798934452236,0.0061981636099517345,-0.007638367358595133,-0.003949491307139397,-0.0055542574264109135,0.0005465622525662184,0.004506028722971678,-0.009108825586736202,0.018201015889644623,0.00043595279566943645,-0.009035764262080193,-0.026512205600738525,0.013268725946545601,0.0026711986865848303,-0.006444934289902449,0.015715979039669037,-0.0004928088164888322,-0.009605822153389454,-0.010107198730111122,0.00028334063244983554,0.014908351004123688,-0.0036990477237850428,-0.020472729578614235,-0.018111540004611015,-3.931078390451148e-05,0.027928505092859268,0.025117794051766396,-0.013860595412552357,0.0021501595620065928,0.015991946682333946,0.0018550533568486571,-0.016199804842472076,-0.0009051733068190515,-0.0009771576151251793,0.0009657034534029663,-0.026421191170811653,-0.005884301848709583,-0.011061509139835835,-0.012645644135773182,-0.00835599098354578
43,-0.22196859121322632,-0.09269516915082932,0.19738496840000153,0.017069794237613678,-0.04054669290781021,-0.09537763893604279,-0.14288969337940216,-0.030469590798020363,0.13463987410068512,0.04680279642343521,0.09413676708936691,-0.021054118871688843,-0.004789671860635281,0.12045488506555557,-0.04195898771286011,-0.04100072383880615,0.07340800762176514,0.01714904047548771,0.042538296431303024,-0.05249158293008804,0.04364260658621788,0.10130234807729721,-0.23619724810123444,0.11612547934055328,-0.13950581848621368,-0.08455237746238708,-0.2012222856283188,-0.006798660848289728,0.012302088551223278,-0.16207149624824524,-0.10712159425020218,-0.03682926669716835,0.023336991667747498,0.08743743598461151,-0.12377531826496124,-0.04673108085989952,-0.2171669900417328,0.20615099370479584,0.11170066893100739,-0.09035346657037735
44,0.007971941493451595,-0.05607764050364494,0.1493377685546875,-0.20139354467391968,0.23796184360980988,0.17395088076591492,0.1292712539434433,-0.13087870180606842,-0.41064414381980896,-0.1453823745250702,0.29916518926620483,-0.07617847621440887,-0.007319038733839989,-0.351736456155777,0.35778486728668213,0.02129620872437954,-0.21402497589588165,-0.08878163248300552,0.08076995611190796,0.07367867231369019,-0.19452334940433502,-0.1337975412607193,-0.514605700969696,-0.10745933651924133,-0.24954262375831604,0.24498678743839264,-0.2521863877773285,0.3054913878440857,0.30969077348709106,-0.1303013563156128,-0.08086500316858292,0.2350267469882965,-0.026469916105270386,0.10694324970245361,-0.15600551664829254,0.04831342026591301,0.1270936280488968,-0.08660485595464706,-0.09330376982688904,-0.20472297072410583
45,-0.11073420196771622,0.37024515867233276,-0.12623851001262665,-0.20723749697208405,-0.14166222512722015,-0.13836587965488434,-0.19705694913864136,-0.3507264256477356,0.057556066662073135,0.04691319540143013,0.15264460444450378,-0.07308167219161987,-0.1336635798215866,-0.044213470071554184,-0.15863633155822754,0.15218660235404968,0.1251433938741684,-0.1364230066537857,-0.07465117424726486,0.08044132590293884,0.42382365465164185,0.014094880782067776,-0.15571103990077972,-0.25592878460884094,-0.0474877767264843,-0.04884086921811104,-0.19254939258098602,0.042476195842027664,0.10405635088682175,0.003554506693035364,0.06847719103097916,-0.2623174488544464,-0.20885328948497772,0.1144971176981926,-0.09387955814599991,0.12009148299694061,0.009363390505313873,0.10539355874061584,0.049651019275188446,0.02409103885293007
46,0.1190454363822937,-0.04769550636410713,-0.16199666261672974,0.12936002016067505,-0.10089419782161713,-0.1274290680885315,-0.21966268122196198,-0.044623762369155884,0.06151431053876877,-0.03984994813799858,-0.20993779599666595,0.11081654578447342,-0.25395193696022034,-0.30183807015419006,-0.019527306780219078,-0.06514444202184677,0.16063138842582703,-0.07510432600975037,-0.12661083042621613,0.11314712464809418,0.06385121494531631,-0.0582759715616703,-0.05627958104014397,-0.15868808329105377,-0.10604580491781235,0.2214152216911316,-0.03813013434410095,-0.07411006838083267,0.06491931527853012,0.17742136120796204,-0.10654154419898987,-0.20293815433979034,-0.05561387538909912,0.15259172022342682,-0.08595363050699234,-0.22119204699993134,-0.03202052041888237,-0.16308462619781494,-0.2710859477519989,0.15786942839622498
47,-0.10830771178007126,0.30948376655578613,0.06861203908920288,0.06553532183170319,0.133648082613945,-0.016055120155215263,-0.24591626226902008,0.34153300523757935,0.07384680956602097,-0.21423743665218353,-0.025469103828072548,0.19027066230773926,0.028477540239691734,-0.08757394552230835,-0.22682680189609528,-0.15400338172912598,-0.33495599031448364,0.11650668829679489,-0.4970797002315521,0.023184381425380707,-0.09119953960180283,-0.2594551742076874,-0.28287777304649353,-0.11984178423881531,-0.23275427520275116,0.32419681549072266,0.10138146579265594,0.026584291830658913,-0.2782401740550995,0.15664833784103394,0.09767738729715347,-0.2567427158355713,-0.06499668955802917,0.1786605715751648,0.14763952791690826,-0.08447735756635666,-0.2580626904964447,0.017564985901117325,-0.02721440978348255,0.2856832444667816
48,0.07825440913438797,0.06416109949350357,0.32433250546455383,0.17908835411071777,0.23554427921772003,0.19315779209136963,-0.0576678141951561,-0.16231723129749298,0.040838826447725296,-0.46835407614707947,0.32585346698760986,-0.021984294056892395,-0.0009152208222076297,0.04981255158782005,-0.021680735051631927,0.10634956508874893,0.42694756388664246,0.15937083959579468,-0.02431294322013855,0.0316767580807209,0.13396506011486053,0.33799633383750916,0.10394600033760071,0.02176942676305771,-0.06671226769685745,-0.03950398042798042,-0.21442222595214844,-0.1577843576669693,0.3059863746166229,0.15855765342712402,-0.056426092982292175,-0.23591840267181396,0.17940017580986023,0.11477992683649063,0.0783371850848198,-0.3538844883441925,-0.2132260650396347,-0.005950267892330885,0.23619382083415985,0.09490557760000229
49,0.17648878693580627,0.25452685356140137,-0.2701415717601776,-0.06437239795923233,-0.1866842657327652,0.050622377544641495,-0.08068405836820602,-0.018188517540693283,-0.012111587449908257,0.10333617776632309,-0.0902489498257637,-0.08899807184934616,-0.01898641139268875,-0.20032620429992676,-0.01411651261150837,-0.15608477592468262,0.10314809530973434,-0.2364264577627182,0.020137883722782135,-0.08937095105648041,0.041296567767858505,0.058137595653533936,-0.05422088876366615,-0.20266778767108917,0.14350157976150513,0.2973327338695526,0.19130387902259827,-0.16336895525455475,0.2382095456123352,-0.06837780773639679,-0.022077372297644615,-0.03459380194544792,-0.07417977601289749,0.061731576919555664,0.05892018601298332,-0.11271858215332031,-0.08718033879995346,0.006599451415240765,-0.01896965689957142,0.03326001018285751
50,-0.11819729208946228,0.03901980072259903,0.09428887069225311,0.042759720236063004,-0.21353821456432343,-0.1575678437948227,-0.039157651364803314,-0.12154029309749603,0.16868360340595245,0.034551430493593216,0.08412262797355652,-0.14906178414821625,-0.028265085071325302,0.018371185287833214,-0.07095679640769958,-0.03572571650147438,-0.00992131419479847,-0.09107837080955505,-0.020172730088233948,0.07311790436506271,0.09424897283315659,0.13879795372486115,-0.2909085750579834,0.08276072889566422,0.013709441758692265,-0.0768727958202362,-0.09080073237419128,0.010221787728369236,-0.14805364608764648,-0.0844072476029396,-0.06473607569932938,-0.03784869238734245,-0.02168753370642662,0.0598968081176281,-0.09129821509122849,-0.12073487788438797,-0.04792173206806183,0.17558857798576355,0.016844935715198517,-0.14842651784420013
51,-0.05180288106203079,0.05267587676644325,0.08023685216903687,0.049631889909505844,-0.15839573740959167,-0.01693751849234104,-0.06070040911436081,-0.07326022535562515,0.0738743245601654,0.07109885662794113,0.04232317581772804,-0.04422894865274429,-0.03046957217156887,0.0030816616490483284,-0.022263944149017334,-0.040694527328014374,0.01819276064634323,-0.04019753262400627,-0.05260932072997093,0.03153457120060921,0.08783146739006042,0.11225400120019913,-0.21020102500915527,0.060878071933984756,-0.02983662486076355,-0.1318989396095276,-0.16039203107357025,0.021433260291814804,-0.1300753802061081,-0.08314462751150131,-0.0891788899898529,-0.009316716343164444,0.049491167068481445,-0.0015409801853820682,-0.013087269850075245,-0.025132853537797928,-0.014575701206922531,0.136321023106575,0.05204916372895241,-0.08937925845384598
52,-0.3245338499546051,-0.1102081760764122,0.17715546488761902,0.3818050026893616,-0.07605895400047302,-0.08385862410068512,0.21878857910633087,-0.006077218800783157,-0.14195255935192108,0.03439071774482727,0.45115283131599426,0.2488870769739151,-0.0015282038366422057,-0.3844176232814789,0.18212276697158813,0.08174052089452744,0.01164170354604721,-0.419765442609787,-0.3063700199127197,-0.24200962483882904,-0.15626659989356995,-0.10853341221809387,-0.3641413450241089,-0.2901928126811981,-0.4085616171360016,0.22340145707130432,-0.3747086226940155,0.2996690273284912,0.12264657020568848,0.33055296540260315,-0.24937738478183746,0.047917354851961136,-0.01549759041517973,0.07139511406421661,0.10888266563415527,-0.2291053980588913,0.011233159340918064,-0.34251686930656433,-0.042559679597616196,-0.4920147955417633
53,0.1470121294260025,0.08216305822134018,0.13402779400348663,-0.10088460892438889,0.0002557997067924589,0.4304008483886719,0.10016515851020813,0.1848229169845581,0.3000410497188568,0.07849819958209991,0.14705975353717804,0.3153953552246094,-0.11808961629867554,-0.08468472212553024,0.06378917396068573,-0.19878801703453064,0.1713865101337433,-0.13688555359840393,0.06647086143493652,0.19463872909545898,0.26694807410240173,-0.019788047298789024,-0.05706872045993805,0.16276411712169647,-0.027222231030464172,0.35466885566711426,-0.04579628258943558,-0.03529185801744461,0.05834924057126045,0.11664295941591263,-0.04682726785540581,-0.09001680463552475,-0.16378554701805115,0.33862224221229553,-0.03165388107299805,-0.030449779704213142,-0.37918657064437866,0.24361082911491394,-0.07089270651340485,-0.11904259771108627
54,0.03538084775209427,0.05177314579486847,0.030795948579907417,-0.15589796006679535,-0.16999785602092743,0.11672844737768173,-0.3260810673236847,-0.060974281281232834,0.1663885861635208,-0.011483230628073215,-0.0644349604845047,-0.12903618812561035,-0.0907636433839798,-0.19147305190563202,0.038936007767915726,-0.09707169234752655,0.2883680760860443,-0.15055115520954132,0.027215253561735153,-0.08157185465097427,0.21133117377758026,0.030068377032876015,-0.1675252914428711,-0.13851825892925262,-0.0723561942577362,0.10872681438922882,-0.0009288283181376755,-0.19120822846889496,0.05247992277145386,0.12308934330940247,-0.302229106426239,0.04783882945775986,0.006153975613415241,0.14740672707557678,0.014878638088703156,-0.1100352481007576,-0.21226496994495392,0.20236046612262726,-0.1969626247882843,0.0564250610768795
55,-0.0879257321357727,0.37181758880615234,0.20591166615486145,-0.10964130610227585,0.08433892577886581,0.1527353823184967,-0.20962673425674438,0.08342814445495605,0.0007638412062078714,-0.015863994136452675,0.10763358324766159,0.3925323486328125,-0.0043742903508245945,0.05131484568119049,0.06526388972997665,-0.37726351618766785,0.10449131578207016,-0.13800297677516937,0.054939672350883484,0.022573422640562057,-0.04075990244746208,0.11467162519693375,0.04388005658984184,-0.10932973772287369,-0.20096923410892487,0.43410488963127136,-0.23342597484588623,-0.07123656570911407,-0.04942861944437027,-0.1842704862356186,0.0993252620100975,-0.053357191383838654,0.08239153027534485,0.13695940375328064,0.04472096636891365,-0.08996624499559402,-0.23446719348430634,0.25184354186058044,-0.031676456332206726,0.09627647697925568
56,-0.28245487809181213,0.28792789578437805,0.4558359980583191,-0.010224861092865467,0.19277334213256836,-0.22704695165157318,-0.10749802738428116,-0.07300601154565811,-0.4802614748477936,0.0054996684193611145,0.2705765962600708,0.3925056755542755,0.0638113021850586,-0.35634148120880127,0.23896655440330505,0.04084343835711479,-0.2527850270271301,0.09754683822393417,-0.4776113033294678,-0.3324420750141144,0.05244997516274452,-0.3595810830593109,0.07037768512964249,-0.02635626494884491,0.14244522154331207,-0.03285472095012665,0.2119312286376953,0.02765928953886032,0.5685465931892395,0.0682821124792099,-0.44171398878097534,0.2696191966533661,-0.3995664119720459,-0.16859939694404602,0.5033204555511475,-0.35931622982025146,-0.40697160363197327,0.40765589475631714,-0.14796790480613708,-0.306255042552948
57,-0.006064588204026222,0.06017154082655907,0.07024489343166351,-0.1742676943540573,0.06353260576725006,0.1978999227285385,-0.10188893228769302,0.008458184078335762,0.1296234428882599,0.038088299334049225,0.016108470037579536,-0.17882563173770905,0.08928380906581879,0.058523088693618774,-0.06543473899364471,0.1034843847155571,0.16821077466011047,-0.09594869613647461,-0.19038252532482147,0.016312390565872192,0.12365483492612839,-0.004223104100674391,-0.08034317195415497,-0.04168716073036194,-0.19447548687458038,0.05974802374839783,-0.041920799762010574,-0.025766028091311455,0.13532453775405884,-0.09784118086099625,-0.06337878108024597,-0.23575784265995026,0.01734168641269207,-0.1482689082622528,0.14990541338920593,-0.21781498193740845,-0.13151748478412628,0.050983283668756485,-0.006857486441731453,0.057318203151226044
58,-0.10638302564620972,0.1374158412218094,-0.08175992220640182,0.13958458602428436,-0.05119079351425171,0.003725424176082015,-0.25397929549217224,-0.1667006015777588,0.266157329082489,0.025892609730362892,-0.20221871137619019,-0.09902286529541016,-0.06319642066955566,-0.048098091036081314,0.06462842226028442,0.13277935981750488,-0.00852872896939516,-0.28200384974479675,-0.06341742724180222,0.07096359878778458,0.12562841176986694,-0.0005099867121316493,-0.31072351336479187,-0.003646381665021181,0.0750298872590065,0.24789515137672424,-0.0707564502954483,0.13865341246128082,0.26680999994277954,-0.07048904150724411,0.16846831142902374,0.24945412576198578,-0.06437432765960693,0.09219545871019363,0.15070006251335144,-0.10366895794868469,0.08770406246185303,0.09844419360160828,-0.10798094421625137,0.2850034236907959
59,0.2535571753978729,0.13059809803962708,0.2732524573802948,-0.1364085078239441,0.24692541360855103,0.23061969876289368,-0.04765056446194649,0.130785271525383,0.19314564764499664,-0.040584880858659744,-0.08403297513723373,0.14849905669689178,-0.1185220330953598,-0.020238783210515976,0.23787643015384674,-0.025116929784417152,0.1843758225440979,-0.16274423897266388,-0.13204079866409302,-0.013327655382454395,0.2563042938709259,-0.2375556230545044,-0.10256744921207428,-0.0730181336402893,-0.12375228852033615,0.23052239418029785,-0.13088546693325043,-0.164615660905838,-0.24599753320217133,-0.006744121201336384,0.09995633363723755,-0.020106706768274307,-0.12242832034826279,0.2514316439628601,-0.09730520844459534,-0.2668829560279846,-0.2185506522655487,0.07903047651052475,-0.18133696913719177,0.12304903566837311
60,-0.09939750283956528,-0.2539755702018738,0.02651011385023594,-0.23769059777259827,-0.07981899380683899,0.0874444767832756,-0.09009095281362534,-0.061383992433547974,0.15668220818042755,-0.07008188217878342,0.15121375024318695,0.10326210409402847,0.10480146110057831,-0.06000238656997681,0.10369821637868881,-0.1580132246017456,0.2640259861946106,0.05072217434644699,-0.02438175119459629,-0.11045817285776138,-0.16440509259700775,0.14940963685512543,0.2661433517932892,-0.00943367462605238,0.0537213534116745,0.12821832299232483,-0.36752018332481384,0.02443181909620762,0.187897726893425,-0.1309141367673874,-0.17418654263019562,0.03718692064285278,0.060889460146427155,0.40797895193099976,-0.15429092943668365,-0.3044888377189636,-0.21835371851921082,0.20273928344249725,0.09427430480718613,0.08438928425312042
61,0.3249260485172272,-0.10005862265825272,0.022551728412508965,0.029459942132234573,-0.06481542438268661,-0.25970757007598877,0.01198536716401577,0.23030772805213928,0.03789934888482094,-0.13527879118919373,0.08478356152772903,-0.07704293727874756,-0.3617314100265503,0.07353124767541885,-0.4356606602668762,-0.2311069667339325,-0.23398686945438385,0.1882026046514511,0.049820367246866226,-0.04260769858956337,-0.04775313660502434,-0.20018848776817322,-0.4309829771518707,-0.003561401041224599,0.08163397014141083,-0.09938609600067139,-0.15096156299114227,0.10455168038606644,0.2345556616783142,0.35098904371261597,0.03697071596980095,-0.07769494503736496,0.19317536056041718,0.3256373703479767,0.2682514190673828,-0.04108896479010582,-0.07878585904836655,-3.276439383625984e-05,0.138813778758049,0.05929867923259735
62,0.1265362799167633,0.010305128060281277,-0.08696293085813522,0.03470899164676666,0.2217952013015747,0.11878606677055359,-0.2288733571767807,0.028446760028600693,-0.06761591881513596,-0.26437869668006897,-0.01562562957406044,0.4040803015232086,-0.2366395890712738,-0.5370706915855408,-0.11587879806756973,-0.16789470613002777,-0.545000433921814,-0.41097983717918396,-0.36417487263679504,0.030805518850684166,-0.6546574234962463,-0.15331001579761505,-0.2133164405822754,-0.6367326378822327,0.5239754915237427,-0.4831380248069763,-0.16853855550289154,-0.10720637440681458,0.2909284234046936,0.12769536674022675,-0.016970215365290642,-0.16454415023326874,-0.26058074831962585,-0.34497252106666565,-0.039840005338191986,-0.2147589772939682,-0.5727916955947876,0.4475104808807373,-0.20305871963500977,-0.13689956068992615
63,0.42131078243255615,0.19540145993232727,0.17312899231910706,0.008801744319498539,0.2750486731529236,-0.27807918190956116,-0.1704835146665573,0.21104294061660767,0.08292777836322784,0.13073737919330597,0.18738749623298645,-0.3964283764362335,-0.23406030237674713,-0.061583295464515686,0.006003986112773418,-0.04515814408659935,0.004656629171222448,-0.0058052209205925465,0.08981107175350189,-0.17211472988128662,0.20870383083820343,0.3497554063796997,-0.2908393144607544,-0.008589125238358974,-0.013242953456938267,-0.02555023692548275,-0.16208426654338837,-0.08125296980142593,0.24812915921211243,-0.074924536049366,0.09180480241775513,-0.1299619823694229,0.02170073799788952,0.16026341915130615,0.3101753890514374,-0.3224198818206787,-0.20647567510604858,0.06775103509426117,0.22164976596832275,-0.08815965056419373
64,0.016489125788211823,-0.11619904637336731,-0.04983820021152496,0.17119820415973663,-0.056839823722839355,-0.12276890873908997,-0.04294582083821297,0.008630075491964817,-0.006957600824534893,0.07342910766601562,-0.07329684495925903,0.08610932528972626,-0.04496680572628975,-0.0694214254617691,-0.07955276966094971,-0.04330943897366524,-0.0557030588388443,0.08374820649623871,-0.05873860418796539,-0.06116955727338791,-0.03519847244024277,-0.017077112570405006,-0.018602440133690834,-0.09415722638368607,-0.09787972271442413,0.11428478360176086,-0.017615972086787224,0.034849684685468674,0.04945061355829239,0.10254336893558502,-0.0046956175938248634,-0.2577727437019348,0.028219861909747124,-0.03245330601930618,-0.06338315457105637,-0.10435101389884949,-0.005354626569896936,-0.10997958481311798,-0.09611321240663528,0.05284997448325157
65,0.06745177507400513,0.048392292112112045,-0.020060887560248375,-0.01482368353754282,0.021448438987135887,0.01653348095715046,-0.18516044318675995,0.0030986738856881857,0.14508849382400513,-0.0941496193408966,0.01217294204980135,-0.16874611377716064,-0.08351065963506699,-0.18193648755550385,0.04422645643353462,0.08879824727773666,0.11993313580751419,-0.003422139212489128,-0.05540159344673157,0.16625243425369263,0.16524171829223633,-0.04533800110220909,-0.047070834785699844,-0.04201639071106911,-0.046724941581487656,0.030603837221860886,0.12954023480415344,-0.13222165405750275,-0.06383318454027176,0.11324154585599899,-0.11664438992738724,0.003807597793638706,-0.05849814414978027,0.0789894163608551,0.0027942643500864506,-0.06226715072989464,-0.06307469308376312,-0.020520707592368126,-0.23288153111934662,0.0433940514922142
66,0.022751599550247192,0.1643824726343155,-0.3434705436229706,0.0777217298746109,0.4067457318305969,0.20717880129814148,0.10300472378730774,-0.2930468022823334,0.10868159681558609,0.17592301964759827,-0.23088689148426056,0.3898988962173462,-0.2801295518875122,0.3302742540836334,-0.027926994487643242,0.10724682360887527,0.33006131649017334,-0.005845081992447376,-0.09282176941633224,-0.2786553204059601,-0.19141438603401184,0.16852766275405884,-0.41655418276786804,0.10054340213537216,0.4519069492816925,0.0948280394077301,0.020359108224511147,0.5166151523590088,-0.09605010598897934,0.25683292746543884,-0.20416663587093353,0.03185080364346504,-0.11189824342727661,0.04611093923449516,0.13254621624946594,-0.17859719693660736,0.09815318137407303,0.3926857113838196,-0.05589546635746956,-0.0923382043838501
67,-0.24983097612857819,-0.25126054883003235,0.22665363550186157,0.5949362516403198,0.6325744390487671,0.4088381826877594,-0.1665080338716507,-0.5826844573020935,-0.5397612452507019,0.35806798934936523,0.29611244797706604,-0.28080642223358154,-0.41099753975868225,-0.07341073453426361,0.005152808967977762,-0.08780569583177567,0.017788374796509743,-0.07260237634181976,-0.4724729061126709,0.44121381640434265,-0.4896639287471771,0.0982842966914177,-0.04549757391214371,-0.21476013958454132,0.24660943448543549,-0.06437888741493225,-0.09912274032831192,-0.3677777945995331,0.16764423251152039,-0.11056483536958694,0.14126867055892944,-0.14842630922794342,-0.054145947098731995,0.6886178255081177,-0.0014713583514094353,0.24680839478969574,-0.17753517627716064,0.182371586561203,-0.48524123430252075,-0.5762671232223511
68,0.052418164908885956,-0.02843550220131874,0.003167778719216585,0.04432693496346474,-0.02970321848988533,-0.009590680710971355,-0.061786431819200516,0.006221350282430649,-0.004053899087011814,0.0068779876455664635,0.028681257739663124,0.015556935220956802,-0.03138900175690651,-0.0701121911406517,0.001102070207707584,-0.03598305583000183,0.015363097190856934,0.04979909211397171,0.020510965958237648,-0.010215554386377335,0.009092993102967739,-0.0002649205853231251,0.057213496416807175,-0.042070094496011734,-0.005530355963855982,-0.0026038740761578083,0.007506060414016247,-0.015764575451612473,-0.006805936340242624,0.05301501974463463,-0.07145192474126816,-0.023401251062750816,0.004148818552494049,0.016205454245209694,-0.015968700870871544,-0.003066770499572158,0.00022352674568537623,0.027819780632853508,-0.1008811816573143,0.03092825785279274
69,-0.004071821458637714,0.0026106988079845905,0.005011810455471277,-0.0010355667909607291,0.0025100940838456154,0.0010981481755152345,0.0001154659257736057,-0.006798424292355776,-0.005623003002256155,0.0036381001118570566,0.0020821760408580303,3.807952816714533e-05,0.001168271410278976,-0.007494383025914431,0.009572175331413746,-0.0011710756225511432,-0.001912735286168754,0.012761704623699188,-0.005881809163838625,0.00959167629480362,-0.0007272267830558121,-0.005860844161361456,-0.011252935975790024,0.0021679599303752184,-0.007544015068560839,0.0018183052306994796,-0.011623421683907509,0.0032087895087897778,0.003844238817691803,-0.012157008051872253,-0.004280857741832733,0.003869212931022048,-0.003838143777102232,0.007997074164450169,0.00010335830302210525,0.0004727318009827286,-0.0003498408477753401,0.0011304564541205764,0.00709094014018774,0.0050255246460437775
70,0.010550076141953468,-0.3201305568218231,0.1076337918639183,-0.05745125934481621,-0.2023780643939972,-0.08102547377347946,0.012295560911297798,-0.24233779311180115,0.04672270640730858,-0.26107069849967957,0.08689381182193756,0.026224210858345032,-0.018639888614416122,0.14717870950698853,-0.08957953006029129,-0.21466608345508575,-0.011908985674381256,-0.07024174183607101,-0.35269564390182495,-0.29388725757598877,-0.002930837217718363,0.19203589856624603,-0.3864916265010834,0.07735112309455872,-0.20721818506717682,-0.03393245115876198,-0.1753128618001938,-0.09576858580112457,0.2492949664592743,-0.08688011765480042,0.21922676265239716,-0.3845707178115845,-0.23912297189235687,0.23851357400417328,-0.3221278488636017,-0.5425847172737122,0.11357096582651138,0.18588922917842865,0.1703989952802658,0.22121788561344147
71,0.1108708530664444,-0.11695217341184616,-0.05546483397483826,-0.38138189911842346,0.20232249796390533,0.14734020829200745,-0.19892282783985138,0.09100094437599182,0.19467952847480774,-0.15016095340251923,-0.1183566302061081,-0.07229234278202057,-0.11273771524429321,-0.3009217083454132,0.2929374873638153,0.06637389212846756,0.1414676159620285,-0.05995149910449982,-0.24566130340099335,-0.23806177079677582,0.0886807069182396,0.12615902721881866,0.14037655293941498,0.10585593432188034,-0.06391361355781555,0.028735090047121048,-0.06411509960889816,-0.11434274911880493,0.16577786207199097,0.041341688483953476,0.10135606676340103,-0.11912131309509277,-0.07324803620576859,0.35976412892341614,0.08698826283216476,-0.2156113088130951,0.08725258708000183,-0.08695631474256516,-0.1911482810974121,0.07971301674842834
72,-0.1289023905992508,0.4338255226612091,-0.06312494724988937,-0.1528334766626358,0.3072802424430847,-0.2724585235118866,-0.30922815203666687,0.06054128706455231,-0.08058557659387589,-0.11033635586500168,0.19960740208625793,0.29476189613342285,-0.06022169068455696,-0.03228183463215828,0.03145315870642662,-0.26317664980888367,-0.04700585827231407,0.09898996353149414,-0.13719461858272552,0.2797878682613373,-0.07904694974422455,0.36636608839035034,-0.060897309333086014,-0.012869617901742458,-0.28697869181632996,0.09412647038698196,-0.08183509856462479,-0.09251976758241653,-0.14896467328071594,-0.10196373611688614,-0.10787668824195862,0.007553525734692812,0.15209057927131653,-0.29429227113723755,0.2257850468158722,-0.034644193947315216,0.11965837329626083,0.20469607412815094,-0.19913147389888763,0.04253910109400749
73,0.4107702374458313,-0.01094882097095251,-0.17451097071170807,0.17919671535491943,0.2569768726825714,0.08355125039815903,-0.42704707384109497,0.02951996587216854,-0.3049219846725464,0.08918493241071701,0.1702229380607605,0.31657692790031433,0.1897122710943222,0.3170296847820282,0.2428719848394394,0.1813317835330963,-0.19553986191749573,-0.06577471643686295,-0.6124259829521179,0.09294496476650238,0.07520607113838196,0.2769317030906677,-0.24962186813354492,0.1382586658000946,0.2379664182662964,-0.09913201630115509,-0.5482800602912903,-0.3889541029930115,0.021685859188437462,0.08739206939935684,-0.33639732003211975,0.10748574137687683,-0.03472321480512619,0.05808897316455841,0.09216377139091492,0.08934330940246582,-0.3782474994659424,-0.1508738100528717,-0.4425906836986542,-0.2049180567264557
74,-0.027537193149328232,0.11228227615356445,-0.11295762658119202,0.10534396022558212,-0.09945846349000931,-0.020167352631688118,-0.09268425405025482,-0.07346946001052856,0.05217202380299568,0.03341565653681755,-0.14165261387825012,0.1008353903889656,-0.1604761779308319,-0.16164855659008026,-0.03102901577949524,-0.06802383065223694,0.062320809811353683,-0.1658899337053299,-0.10436107963323593,0.028800424188375473,0.029769448563456535,0.05805780366063118,-0.10766635835170746,-0.13788144290447235,-0.19976988434791565,0.15665043890476227,-0.05987023189663887,-0.02618498168885708,0.10506102442741394,0.0017538564279675484,-0.028479846194386482,-0.2724679410457611,-0.015314297750592232,0.03059873729944229,0.10281030088663101,-0.10173788666725159,-0.07140880823135376,-0.11174594610929489,-0.07462141662836075,0.1156570091843605
75,0.013605999760329723,-0.010758857242763042,-0.22612343728542328,-0.07494501024484634,0.00546974828466773,0.06670515984296799,0.3014158010482788,0.18042919039726257,0.23363159596920013,0.12860216200351715,0.14749594032764435,0.17072398960590363,-0.029181618243455887,0.024934152141213417,-0.06495174020528793,-0.07448073476552963,-0.047877661883831024,0.05292660742998123,-0.04198325425386429,0.14508192241191864,0.14302775263786316,0.08061980456113815,-0.12458252161741257,0.2461785227060318,0.05884897708892822,0.028364595025777817,0.0920037180185318,-0.09063893556594849,0.21127374470233917,0.0644095316529274,-0.05000802129507065,-0.04555483162403107,-0.06321825832128525,0.01652127131819725,0.02069704607129097,0.05416335538029671,0.006276714149862528,0.012239782139658928,-0.008154451847076416,-0.278277724981308
76,-0.03254275768995285,-0.014834808185696602,0.22222983837127686,0.04046432301402092,-0.11462266743183136,0.03003564104437828,-0.09952887892723083,-0.24303880333900452,-0.04569709673523903,-0.1399359554052353,0.10610909014940262,0.17898111045360565,-0.167718306183815,0.15430469810962677,0.10315542668104172,-0.2215656340122223,0.11424759775400162,-0.23884259164333344,0.1775454729795456,-0.40556636452674866,0.17184966802597046,0.3486211895942688,-0.2265888899564743,0.06384631991386414,-0.1924971342086792,-0.1307956725358963,-0.12476307153701782,-0.2775988280773163,0.2265661358833313,-0.12797527015209198,0.09789156913757324,-0.1209368035197258,-0.1955680400133133,0.1377263367176056,-0.2007066309452057,-0.13524353504180908,0.0946742370724678,0.31768175959587097,0.04892988130450249,0.015656739473342896
77,-0.03185119107365608,-0.06361602246761322,0.015584618784487247,-0.055423323065042496,0.04430732876062393,0.02978600189089775,-0.04781746864318848,0.030398020520806313,-0.0007516166660934687,0.005018824711441994,-0.05519632250070572,0.05044759064912796,-0.011609693989157677,0.051061999052762985,-0.01813562400639057,-0.01579170674085617,0.06982327997684479,-0.05443680286407471,0.03023558296263218,-0.1123252734541893,-0.014147918671369553,-0.002729401458054781,0.01208680309355259,0.008842232637107372,-0.03535816818475723,0.03412694111466408,-0.038581859320402145,-0.021048495545983315,0.06958489120006561,0.03902275487780571,-0.0035940890666097403,0.00665335264056921,0.02784673124551773,-0.00775239709764719,-0.02167125791311264,0.01622883416712284,-0.07732387632131577,0.007555155549198389,0.053175393491983414,0.01375020481646061
78,0.18804007768630981,-0.16696321964263916,0.03735794499516487,-0.16055402159690857,0.04840415343642235,-0.034830205142498016,-0.058077942579984665,0.0016797544667497277,0.09911647439002991,-0.06237977370619774,-0.0002933799696620554,-0.15240676701068878,0.05191364511847496,0.0077610681764781475,0.007636308204382658,0.05432266741991043,0.20479750633239746,0.013834790326654911,-0.07731373608112335,0.12229140102863312,0.10954646021127701,-0.19789302349090576,-0.07855847477912903,-0.06256115436553955,0.013094402849674225,0.05629686638712883,0.1504593789577484,-0.07440877705812454,-0.07477062195539474,0.1656874269247055,-0.10785648971796036,0.12988576292991638,-0.020790578797459602,0.038624659180641174,-0.14424258470535278,-0.24479961395263672,-0.06389480084180832,0.02494908683001995,-0.23164242506027222,0.04078998044133186
79,0.07124847173690796,0.09235548973083496,-0.011698375456035137,-0.13645951449871063,0.03600656986236572,0.16658057272434235,-0.1777864694595337,-0.04922456294298172,0.15274733304977417,-0.17205937206745148,0.09500819444656372,-0.24337923526763916,-0.0802949070930481,-0.33927884697914124,-0.006356101483106613,0.22592584788799286,0.045224521309137344,0.04123041406273842,-0.2801668643951416,0.14542269706726074,0.10973077267408371,0.08947786688804626,0.11400046944618225,0.022466249763965607,0.033917054533958435,0.07159862667322159,-0.07230783253908157,0.016558073461055756,-0.014928696677088737,0.019168522208929062,-0.10681365430355072,-0.16100631654262543,-0.043589070439338684,0.09087923169136047,0.09452441334724426,-0.13657797873020172,0.05296853929758072,-0.005854383111000061,-0.12136661261320114,0.06152189522981644
80,0.11610826104879379,-0.046290989965200424,-0.013810466974973679,0.13467243313789368,-0.01574716530740261,0.14846649765968323,0.07979921251535416,-0.08451914042234421,0.02933928370475769,-0.4637579321861267,0.0880054160952568,-0.11573075503110886,0.06588628143072128,-0.08068284392356873,0.18763723969459534,-0.15011486411094666,0.04321114346385002,0.17093196511268616,-0.19228717684745789,-0.022245150059461594,0.11754003167152405,-0.0327889621257782,-0.2792157232761383,-0.05183319374918938,0.015241330489516258,-0.19753876328468323,0.27998867630958557,-0.3519361913204193,-0.07184294611215591,0.26146477460861206,-0.058806318789720535,0.16854475438594818,-0.1541174352169037,0.22527815401554108,-0.20105740427970886,-0.013865295797586441,0.026028495281934738,0.0036357601638883352,0.06287666410207748,0.251154363155365
81,0.19914008677005768,0.049542829394340515,0.03379756957292557,0.1127089112997055,-0.08926824480295181,0.014557566493749619,-0.004382612183690071,0.035242415964603424,0.02775755524635315,0.09699719399213791,-0.07479152083396912,-0.10528727620840073,0.06168779730796814,-0.01728975959122181,-0.17493709921836853,-0.009291248396039009,-0.056793082505464554,-0.11284636706113815,-0.1935943365097046,0.17030325531959534,0.08030398190021515,-0.17003865540027618,-0.1781425029039383,-0.1929461508989334,-0.16950595378875732,0.28918662667274475,0.1514558345079422,0.008715490810573101,0.018817678093910217,0.05232663080096245,0.12809112668037415,-0.4429877698421478,-0.07891550660133362,-0.11552541702985764,0.03487744927406311,-0.34680894017219543,-0.028226574882864952,-0.06853494048118591,-0.28380849957466125,0.13579881191253662
82,0.13307134807109833,0.18701934814453125,0.33874037861824036,-0.12678022682666779,-0.0716957151889801,0.26898252964019775,-0.18224240839481354,0.06749284267425537,0.0864788144826889,0.11264458298683167,-0.12528963387012482,0.09275741130113602,-0.1113637313246727,0.04356281831860542,0.18277183175086975,-0.16439585387706757,-0.12775227427482605,-0.3105110824108124,0.028377491980791092,-0.4092006981372833,0.3303447663784027,0.11299610882997513,-0.26946553587913513,0.02606484480202198,-0.1408744901418686,0.19181935489177704,-0.22576117515563965,-0.11141957342624664,-0.15506447851657867,-0.06575123965740204,0.21241775155067444,-0.20775443315505981,-0.11795133352279663,0.21096749603748322,0.01873069256544113,-0.09768330305814743,-0.12536396086215973,0.26527243852615356,-0.056665096431970596,-0.015426640398800373
83,-0.1370624601840973,0.21251653134822845,-0.033166032284498215,0.07774940878152847,-0.09233353286981583,0.1378023326396942,0.14061452448368073,-0.004877603147178888,0.1543310582637787,0.052984461188316345,0.07044009119272232,-0.14591513574123383,-0.030650295317173004,-0.06156960502266884,0.05867786332964897,-0.10131954401731491,0.09195777773857117,0.09125758707523346,-0.17720849812030792,-0.022736504673957825,-0.06101309135556221,0.024715302512049675,-0.16091179847717285,0.06031071022152901,-0.2605917155742645,-0.2259085774421692,-0.2630354166030884,-0.05261766538023949,-0.09426364302635193,-0.012320696376264095,-0.05594787746667862,0.012984703294932842,-0.019485164433717728,0.008218553848564625,0.025886934250593185,0.14204736053943634,-0.22511853277683258,0.11912118643522263,0.08838293701410294,0.17470839619636536
84,0.08347395807504654,-0.3206009566783905,0.38204970955848694,0.05046408995985985,0.2369070202112198,-0.5290647745132446,-0.011836186051368713,0.1426827311515808,0.0714026540517807,0.010112953372299671,-0.03508306294679642,-0.14893770217895508,0.14426349103450775,-0.01810220442712307,0.18784168362617493,-0.49028709530830383,0.30435842275619507,-0.23449276387691498,-0.42870044708251953,-0.14859667420387268,0.3085530996322632,-0.16327951848506927,-0.14123861491680145,-0.058834366500377655,0.039759524166584015,-0.20934146642684937,-0.2785990834236145,0.2773802876472473,0.23768234252929688,-0.019366640597581863,-0.24047985672950745,-0.354976087808609,0.012556334026157856,0.21112923324108124,-0.24389034509658813,0.2548830509185791,0.01796814426779747,0.10740169882774353,-0.12975278496742249,-0.008591399528086185
85,-0.0753374770283699,0.12774048745632172,-0.05879904329776764,0.3019983172416687,0.1628880798816681,0.0677848607301712,-0.24216219782829285,-0.020224759355187416,0.37972062826156616,-0.007869173772633076,0.004261010326445103,-0.17817573249340057,0.052676163613796234,0.0449695847928524,0.0898427963256836,0.239039808511734,-0.0950881838798523,-0.12622380256652832,-0.005100659094750881,0.03222379833459854,0.11097077280282974,-0.04087645187973976,-0.09407253563404083,-0.0562918446958065,0.047888725996017456,0.13475719094276428,0.0687313824892044,0.05454543977975845,0.24643538892269135,0.009128543548285961,0.14551027119159698,0.0597413145005703,0.006881210952997208,-0.1955941617488861,0.1596500426530838,-0.04197387769818306,-0.019216718152165413,0.07850025594234467,-0.22039151191711426,0.20793387293815613
86,0.0,0.0,0.0,0.0,0.0,0.0,0.0,0.0,0.0,0.0,0.0,0.0,0.0,0.0,0.0,0.0,0.0,0.0,0.0,0.0,0.0,0.0,0.0,0.0,0.0,0.0,0.0,0.0,0.0,0.0,0.0,0.0,0.0,0.0,0.0,0.0,0.0,0.0,0.0,0.0
87,0.0,0.0,0.0,0.0,0.0,0.0,0.0,0.0,0.0,0.0,0.0,0.0,0.0,0.0,0.0,0.0,0.0,0.0,0.0,0.0,0.0,0.0,0.0,0.0,0.0,0.0,0.0,0.0,0.0,0.0,0.0,0.0,0.0,0.0,0.0,0.0,0.0,0.0,0.0,0.0
88,0.0,0.0,0.0,0.0,0.0,0.0,0.0,0.0,0.0,0.0,0.0,0.0,0.0,0.0,0.0,0.0,0.0,0.0,0.0,0.0,0.0,0.0,0.0,0.0,0.0,0.0,0.0,0.0,0.0,0.0,0.0,0.0,0.0,0.0,0.0,0.0,0.0,0.0,0.0,0.0
89,0.0,0.0,0.0,0.0,0.0,0.0,0.0,0.0,0.0,0.0,0.0,0.0,0.0,0.0,0.0,0.0,0.0,0.0,0.0,0.0,0.0,0.0,0.0,0.0,0.0,0.0,0.0,0.0,0.0,0.0,0.0,0.0,0.0,0.0,0.0,0.0,0.0,0.0,0.0,0.0
90,0.0,0.0,0.0,0.0,0.0,0.0,0.0,0.0,0.0,0.0,0.0,0.0,0.0,0.0,0.0,0.0,0.0,0.0,0.0,0.0,0.0,0.0,0.0,0.0,0.0,0.0,0.0,0.0,0.0,0.0,0.0,0.0,0.0,0.0,0.0,0.0,0.0,0.0,0.0,0.0
91,0.0,0.0,0.0,0.0,0.0,0.0,0.0,0.0,0.0,0.0,0.0,0.0,0.0,0.0,0.0,0.0,0.0,0.0,0.0,0.0,0.0,0.0,0.0,0.0,0.0,0.0,0.0,0.0,0.0,0.0,0.0,0.0,0.0,0.0,0.0,0.0,0.0,0.0,0.0,0.0
92,0.0,0.0,0.0,0.0,0.0,0.0,0.0,0.0,0.0,0.0,0.0,0.0,0.0,0.0,0.0,0.0,0.0,0.0,0.0,0.0,0.0,0.0,0.0,0.0,0.0,0.0,0.0,0.0,0.0,0.0,0.0,0.0,0.0,0.0,0.0,0.0,0.0,0.0,0.0,0.0
93,0.0,0.0,0.0,0.0,0.0,0.0,0.0,0.0,0.0,0.0,0.0,0.0,0.0,0.0,0.0,0.0,0.0,0.0,0.0,0.0,0.0,0.0,0.0,0.0,0.0,0.0,0.0,0.0,0.0,0.0,0.0,0.0,0.0,0.0,0.0,0.0,0.0,0.0,0.0,0.0
94,0.0,0.0,0.0,0.0,0.0,0.0,0.0,0.0,0.0,0.0,0.0,0.0,0.0,0.0,0.0,0.0,0.0,0.0,0.0,0.0,0.0,0.0,0.0,0.0,0.0,0.0,0.0,0.0,0.0,0.0,0.0,0.0,0.0,0.0,0.0,0.0,0.0,0.0,0.0,0.0
95,0.0,0.0,0.0,0.0,0.0,0.0,0.0,0.0,0.0,0.0,0.0,0.0,0.0,0.0,0.0,0.0,0.0,0.0,0.0,0.0,0.0,0.0,0.0,0.0,0.0,0.0,0.0,0.0,0.0,0.0,0.0,0.0,0.0,0.0,0.0,0.0,0.0,0.0,0.0,0.0
96,0.0,0.0,0.0,0.0,0.0,0.0,0.0,0.0,0.0,0.0,0.0,0.0,0.0,0.0,0.0,0.0,0.0,0.0,0.0,0.0,0.0,0.0,0.0,0.0,0.0,0.0,0.0,0.0,0.0,0.0,0.0,0.0,0.0,0.0,0.0,0.0,0.0,0.0,0.0,0.0
97,0.0,0.0,0.0,0.0,0.0,0.0,0.0,0.0,0.0,0.0,0.0,0.0,0.0,0.0,0.0,0.0,0.0,0.0,0.0,0.0,0.0,0.0,0.0,0.0,0.0,0.0,0.0,0.0,0.0,0.0,0.0,0.0,0.0,0.0,0.0,0.0,0.0,0.0,0.0,0.0
98,0.0,0.0,0.0,0.0,0.0,0.0,0.0,0.0,0.0,0.0,0.0,0.0,0.0,0.0,0.0,0.0,0.0,0.0,0.0,0.0,0.0,0.0,0.0,0.0,0.0,0.0,0.0,0.0,0.0,0.0,0.0,0.0,0.0,0.0,0.0,0.0,0.0,0.0,0.0,0.0
99,0.0,0.0,0.0,0.0,0.0,0.0,0.0,0.0,0.0,0.0,0.0,0.0,0.0,0.0,0.0,0.0,0.0,0.0,0.0,0.0,0.0,0.0,0.0,0.0,0.0,0.0,0.0,0.0,0.0,0.0,0.0,0.0,0.0,0.0,0.0,0.0,0.0,0.0,0.0,0.0
