"","PC1","PC2"
"1",-2.88162637737858,-0.809621636451531
"2",-2.88605001022935,-0.877388597454668
"3",-2.8780852851573,-0.779927325845838
"4",-2.88338311945542,-0.835422525549564
"5",-2.88110288756839,-0.857084501814609
"6",-2.88584578031132,-0.83207861735899
"7",-2.87594892484527,-0.799572145835536
"8",-2.88518826047698,-0.861116131528534
"9",-2.88127275862924,-0.793395794501582
"10",-2.051759921399,4.18990505338405
"11",-0.131031698439744,5.86381195396371
"12",1.84482844630325,4.16789038620283
"13",2.91992304504648,-0.736793442461064
"14",2.92070481532671,-0.7563634776768
"15",2.9202593904396,-0.752097799752332
"16",2.91993196750842,-0.7809249981519
"17",2.9168192857503,-0.743820436330357
"18",2.91904511504718,-0.755771519478044
"19",2.92265858682701,-0.765995186272622
"20",2.92084620174678,-0.7463602811647
"21",2.91627816989486,-0.73787297592193
