"index","embedding","PCA_Khop.Score","PCA_Degree.Score","PCA_rank","TSNE_Khop.Score","TSNE_Degree.Score","TSNE_rank","UMAP_Khop.Score","UMAP_Degree.Score","UMAP_rank"
1,"attentionWalk",0.2233,0.0125,2,0.3446,0.0199,3,0.3608,0.0172,1
2,"attentionWalk",0.2085,0.0157,2,0.3175,-0.0026,4.5,0.2884,0.0209,2
3,"attentionWalk",0.2653,8e-04,2,0.3998,0.0165,2,0.3665,-0.0192,3
4,"attentionWalk",0.3037,-0.0097,4,0.3523,0.0361,1,0.3016,-0.0149,4
5,"attentionWalk",0.2043,-0.0043,5,0.3055,0.01,4.5,0.26,-0.0132,5
6,"deepwalk",0.4996,0.0093,2,0.4316,-0.0102,2,0.315,-0.0114,5
7,"deepwalk",0.4459,0.0358,1,0.3894,-8e-04,4,0.3544,-0.0096,3
8,"deepwalk",0.3615,0.0098,5,0.3855,0.0095,4,0.3521,0.0238,1.5
9,"deepwalk",0.4248,0.0192,3,0.4121,-0.0057,4,0.3047,0.0049,4
10,"deepwalk",0.4666,0.0083,4,0.4306,0.0205,1,0.4031,-2e-04,1.5
11,"HOPE",0.4697,-0.0031,5,0.3805,0.0684,2.5,0.3463,0.0123,3
12,"HOPE",0.4697,-0.0031,4,0.381,5e-04,5,0.2867,-0.0209,5
13,"HOPE",0.4697,-0.0031,3,0.4348,0.0096,2.5,0.3492,0.0407,1
14,"HOPE",0.4697,-0.0031,1,0.4535,-0.0025,4,0.3093,-0.0208,4
15,"HOPE",0.4697,-0.0031,2,0.4554,0.0199,1,0.3149,0.0459,2
16,"Laplacian_Eigenmaps",0.4178,-0.0482,3,0.4029,-0.0066,4.5,0.4117,0.0418,1
17,"Laplacian_Eigenmaps",0.4178,-0.0482,2,0.426,-0.0024,2.5,0.2909,-0.0486,5
18,"Laplacian_Eigenmaps",0.4178,-0.0482,1,0.4035,-0.0105,4.5,0.3272,-0.0208,4
19,"Laplacian_Eigenmaps",0.4178,-0.0492,4.5,0.4233,0.0033,2.5,0.3261,0.0572,2.5
20,"Laplacian_Eigenmaps",0.4178,-0.0492,4.5,0.4485,0.0072,1,0.3329,-0.0031,2.5
21,"Locally_Linear_embedding",0.422,0.022,2,0.4495,-0.0056,3,0.3474,-0.0127,2
22,"Locally_Linear_embedding",0.4548,-0.0081,3,0.4366,0.0269,1.5,0.3739,0.0141,1
23,"Locally_Linear_embedding",0.505,-0.0065,1,0.4054,0.0154,4.5,0.3195,-0.0491,5
24,"Locally_Linear_embedding",0.3727,-0.0088,4.5,0.4145,0.0023,4.5,0.3356,-0.0273,3.5
25,"Locally_Linear_embedding",0.4084,-0.013,4.5,0.4375,0.0226,1.5,0.2947,0.0079,3.5
26,"node2vec",0.4863,-9e-04,3,0.4766,0.0043,1.5,0.4356,-0.0267,3
27,"node2vec",0.4685,0.0027,4.5,0.39,0.0254,3,0.4169,-0.0125,4.5
28,"node2vec",0.5187,0.0507,1,0.4787,6e-04,1.5,0.4348,-8e-04,1
29,"node2vec",0.4646,0.0094,4.5,0.4705,-0.0025,4.5,0.4314,-0.0035,2
30,"node2vec",0.4731,0.0427,2,0.4358,-0.0023,4.5,0.4265,-0.014,4.5
31,"SDNE",0.3923,-0.0202,4,0.4202,0.0156,1,0.3165,0.0151,2.5
32,"SDNE",0.372,0.0104,4,0.3882,0.0059,3.5,0.3147,-0.0096,5
33,"SDNE",0.3903,-0.0171,4,0.4103,0.0139,2,0.3358,0.0315,1
34,"SDNE",0.4534,-0.0114,1,0.38,-0.0195,5,0.3702,-0.0034,2.5
35,"SDNE",0.3885,0.0415,2,0.3565,0.0146,3.5,0.2854,0.0027,4
36,"struc2vec",0.0236,0.6991,5,0.0556,0.3582,1.5,0.0391,0.4478,2
37,"struc2vec",0.0245,0.9331,1,0.0427,0.3683,4.5,0.0349,0.3804,5
38,"struc2vec",0.0331,0.8104,2.5,0.055,0.3191,4.5,0.0379,0.5758,1
39,"struc2vec",0.0195,0.9184,4,0.046,0.3717,1.5,0.0329,0.4949,3.5
40,"struc2vec",0.0333,0.7945,2.5,0.0323,0.3847,3,0.0269,0.4994,3.5
41,"Walklets",0.4783,0.0156,5,0.4516,0.0048,2,0.3922,-0.0119,5
42,"Walklets",0.5248,0.0093,3.5,0.4249,0.0042,4.5,0.4324,-0.024,3
43,"Walklets",0.5138,0.0249,3.5,0.4801,-0.0117,3,0.4282,0.0149,1
44,"Walklets",0.5287,0.0604,1,0.438,4e-04,4.5,0.4153,0.0119,3
45,"Walklets",0.5209,0.0502,2,0.4734,0.0088,1,0.4256,-0.0091,3
