"","V1","V2"
"1",-5.21568754558286,-0.563915556287168
"2",3.73559956648636,0.104685855760033
"3",-5.15078774281621,0.78510159375757
"4",4.83854702179879,0.940541475057828
"5",-4.11794487803033,-1.06341550820458
"6",4.9077321368783,-0.239548499544595
"7",5.76522880608476,-1.01823626817118
"8",-5.1509020583185,0.785062292474814
"9",4.90743484286409,-0.239557285564925
"10",3.68309570840663,-0.31222712747409
"11",4.95814556010427,-1.43228845576132
"12",-5.15091685668771,0.785057205066442
"13",3.85000974005444,-0.840941932143785
"14",4.90773213687885,-0.239548499532271
"15",-3.02888161029561,-0.432200042271854
"16",-4.14735113305831,0.184504807328146
"17",-4.14735156022682,0.184498895459764
"18",-2.87512493537611,0.315558675310213
"19",4.90751029833178,-0.239554912491547
"20",5.66471615421795,0.663767071658578
"21",4.05346182998846,-1.07126492507868
"22",5.97935537823337,0.249669826187099
"23",-3.66811272018437,-0.983076113654777
"24",5.76522880608476,-1.01823626817118
"25",-5.15091155327765,0.785059028275884
"26",4.90733108896918,-0.23956110736688
"27",-5.15091158575326,0.785059017111383
"28",-2.85799349282919,0.147879662468963
"29",-4.74665325087536,-0.918412417545599
"30",-3.04449423765183,-0.4421367871461
"31",-4.14735113305831,0.184504807328146
"32",4.90732311384626,-0.239562030778818
"33",-3.19446949677716,1.03523877368781
"34",-4.14732321892161,0.184507891786436
"35",-5.15091158880295,0.785059016062956
"36",-4.14735113305831,0.184504807328146
"37",-3.40299613836527,-0.837024259719283
"38",-4.14735113305831,0.184504807328146
"39",-5.08505081255757,-0.696675830776302
"40",4.90733893319978,-0.239562270263837
"41",4.90773213687885,-0.239548499532271
"42",6.08691537742947,-0.0953771662959594
"43",-5.15091158585047,0.785059017077969
"44",-4.14735113305831,0.184504807328146
"45",-3.96390216838299,1.46762625873367
"46",-4.1473515608994,0.184498886155236
"47",4.90755072096531,-0.239554815305231
"48",4.90746389956343,-0.23955642805885
"49",4.90773214047933,-0.23954844049984
"50",4.90773213687885,-0.239548499532271
"51",-4.37554638090643,-1.04998969211939
"52",4.90748711828135,-0.23955560686534
"53",4.90773204090517,-0.239550071075859
"54",-4.1473513182874,0.184502253355623
"55",4.90773207385781,-0.239549531816004
"56",-4.1473379956138,0.184501214392991
"57",-4.14735113305831,0.184504807328146
"58",4.9077320409047,-0.239550071083958
"59",-4.14735113305831,0.184504807328146
"60",4.90773208162221,-0.239549404747499
"61",-4.14732480773535,0.184507196258122
"62",4.56615319033365,-1.37907365500093
"63",5.27634626481599,0.886908543067784
"64",-3.92872640803561,1.45641438236419
"65",-4.14735156117874,0.184498882290797
"66",-4.14735156075966,0.184498888088394
"67",-5.15091158585047,0.785059017077969
"68",4.9074869996806,-0.239557550702272
"69",-3.38224411694907,1.19816013869215
"70",4.3223409302264,0.790979506918507
"71",4.90744648399069,-0.23955673535799
"72",5.76522880608476,-1.01823626817118
"73",-4.14731812965736,0.184502119955756
"74",-3.00665445827284,0.763688208185005
"75",-4.14735113305831,0.184504807328146
"76",4.90754499722606,-0.239554089152767
"77",-4.14735131864197,0.184502248450649
"78",4.90773207385557,-0.239549531854596
"79",-4.14731812965736,0.184502119955756
"80",-4.14729197862074,0.184504718349969
"81",-4.14728951245568,0.184505345881057
"82",4.90773207385557,-0.239549531854596
"83",4.90773208162221,-0.239549404747499
"84",4.90746389599526,-0.239556486598523
"85",4.90773208162221,-0.239549404747499
"86",-4.14732028775717,0.184501224470657
"87",4.9077321368783,-0.239548499544595
"88",-4.14735113305831,0.184504807328146
"89",-4.14735156075966,0.184498888088394
"90",-4.14735140051418,0.184501115884273
"91",-4.14735113305831,0.184504807328146
"92",3.98357632662463,0.522591446821719
"93",-4.14735140165549,0.184501100096181
"94",-4.14735113305831,0.184504807328146
"95",4.90773207385557,-0.239549531854596
"96",4.90773213687885,-0.239548499532271
"97",-4.14731792962643,0.184504895850607
"98",4.9074639180651,-0.239556124492654
"99",4.90733104695418,-0.239561796227812
"100",-4.14732550372013,0.184504657522197
