"","V1","V2"
"1",-1.42169473869988,-0.580684982766971
"2",-7.6739251531061,-0.243560273999709
"3",-1.5643166302605,-2.38861417512491
"4",0.0416616093790152,0.391198604726712
"5",-0.492500316601642,-1.8085946073499
"6",-1.30989913255264,0.526944507982793
"7",0.202210638317973,0.370596823360572
"8",0.297088351092802,0.0997321819455186
"9",0.254267727217633,0.091416461201177
"10",-7.31534996451689,-0.319600264245749
"11",-0.669996073944968,1.18567632777187
"12",0.467388546880623,-1.49748923541064
"13",0.842025602940224,2.04484744208904
"14",-1.7263583884624,-2.35790447120417
"15",5.08405747949324,-3.7783644562806
"16",-7.36588565901068,-0.584774196441509
"17",-1.39248696977408,-2.94529306232016
"18",-7.58220267342499,-0.244206902879563
"19",0.0131778880771821,-0.412516853850841
"20",1.67858173488563,-1.16055266534342
"21",0.704103872731995,2.12722054567012
"22",5.11519687935962,-3.64843313380921
"23",0.80914876919796,0.333175889081922
"24",-3.27623054932338,2.78612942021694
"25",-3.14394732662005,2.92918693917201
"26",0.517627017523002,-1.43739004131705
"27",0.244208108649504,-0.612328438092004
"28",-7.52272337825337,-0.498493880454181
"29",-3.19374533990934,2.65756696336372
"30",-1.04178118365287,6.39780796843344
"31",-0.51793255177811,-2.01045620619066
"32",5.25180153705823,-3.46083627015155
"33",-7.50749404803843,-0.5525958672179
"34",-0.58640703936673,0.374297309231213
"35",-1.60504177714251,0.328178527576522
"36",-0.852361137696426,6.14036347410584
"37",-1.81271040165575,-2.30870607095049
"38",5.18541162706456,-3.71615992443632
"39",0.172947930093416,1.15468172948454
"40",4.82615943935862,-3.53594517888493
"41",-0.868790833908398,6.25037438708542
"42",0.389075662605305,-1.5734414461639
"43",-7.40006431575391,-0.318369000169632
"44",-0.692698976355101,-1.78580551114534
"45",-0.947924093979103,6.2681795676936
"46",1.75155892725497,-1.20444649288739
"47",-1.22653445892127,6.31421727790288
"48",-0.371304187581432,-1.61706298659329
"49",-1.79284213277075,-2.8775942901675
"50",-1.50871966238836,-2.87375315069004
"51",-0.908145339036634,6.33624010549492
"52",-1.28662977577446,-2.82866465015885
"53",0.216072296024606,-0.461226179766797
"54",-3.22807734919492,2.59487224816428
"55",5.0113536176047,-3.35831226392221
"56",9.52396213018145,0.48040509717657
"57",0.62211738663139,-0.638029408693529
"58",0.82916309397021,2.32847892925491
"59",-3.26797773784633,2.83968130479913
"60",0.241492848505884,1.27850027256138
"61",9.81329328464435,0.585910535037143
"62",0.376380166509944,-1.65516254086756
"63",-1.5627833558492,-0.104579317458903
"64",-1.19206268074322,6.44450439339184
"65",-3.47975632539266,2.66708809456216
"66",1.73642962818617,-1.03567293807839
"67",0.975131869266521,-0.0137735603780089
"68",9.75404593517997,0.755737865409663
"69",-1.23171978464094,0.579052130879072
"70",0.656724913116654,2.00903533391523
"71",9.65086835306086,0.658768200232938
"72",0.206310007262866,-0.196963685986892
"73",-1.61872058203381,-0.327222026369525
"74",-0.535896190877053,-1.31823504767111
"75",-0.926814668510031,-1.72718151107678
"76",-1.31747530688925,0.50130523789676
"77",-0.387475469512901,1.08608005915074
"78",1.06467710909235,0.149797514547912
"79",9.67800640694984,0.624114319213214
"80",-1.65887619817715,-0.397232959972425
"81",-1.77196930969534,-0.250415597754281
"82",5.21732537643219,-3.87212555089705
"83",-0.593111194014313,1.07057346499579
"84",1.98509839783572,-0.894328712195888
"85",-0.661555966037896,1.04345227819075
"86",1.80661837161257,-1.18223454480598
"87",-0.504556412552378,-1.35219380783584
"88",0.956776841676167,0.0917594118711764
"89",0.624385661343047,-0.151339926665206
"90",0.91555271661264,2.09768985557178
"91",-0.488055638166168,0.344858051831615
"92",-0.691599551739041,1.19573862549156
"93",4.73948315864822,-3.29947796513139
"94",0.181590618918314,1.21535126473304
"95",-0.545448890965055,0.318623913263229
"96",4.96451308091751,-3.1415278458076
"97",-1.61159176471569,-3.13433949125729
"98",-1.54899634770341,-2.68472649999861
"99",0.440588647043601,-0.457894496257876
"100",-0.632496330891359,-1.23257629018511
