,0,1,2,3,4,5,6,7,8,9,10,11,12,13,14,15,16,17,18,19,20,21,22,23,24,25,26,27,28,29,30,31,32,33,34,35,36,37,38,39
0,-1.0668365,-0.58285975,2.0680747,-0.9262599,-1.2836157,0.63800466,-0.5983267,1.2567071,0.34463522,0.8828715,-0.93787044,-0.969745,-1.3229967,-0.42059743,1.3303279,0.6646813,-0.017919421,0.38573065,-0.041763846,0.327483,-0.7242582,0.96641177,0.4732537,-0.18960048,0.23448843,0.36886388,-1.067833,-0.6856674,1.0386192,0.6199951,0.87590253,0.28390267,0.12768723,0.63933766,1.6470323,0.68024224,-1.5021392,-0.2423595,2.0171404,-0.19739008
1,-0.38701108,0.33804157,-1.8690989,0.51956654,-0.47853094,1.084223,-0.45843053,-0.300692,0.8092528,0.38099223,-0.1403376,0.2750158,0.017394839,0.012368832,-0.5964599,0.43319342,-0.41260296,0.2862839,0.20802672,0.24609351,-0.12022529,0.27709982,0.1678351,0.020976935,0.11284511,0.24526624,-0.35158026,-0.7537764,0.1127948,-0.4169012,0.41895562,-0.13094126,0.33221924,-0.71574867,-0.07617312,-0.25625953,-0.30785182,0.35989046,-0.015512,0.06637861
2,-0.65107954,-0.90254843,1.6630299,-0.73983055,-0.14204434,1.1101756,0.119556084,0.8978962,-0.5374573,0.2140278,-0.8548173,-0.15379553,0.57508314,0.24575993,0.6160585,1.2527431,-0.53760475,0.38159385,-0.106703825,0.011062973,0.0400263,-0.5992837,0.28336397,-0.46142352,-0.5240519,-0.60113215,0.27880138,-2.6327825,1.415908,-0.58719224,1.2449946,0.11190757,-0.28478247,0.3866259,1.319572,1.9325156,-1.6030043,-0.27774104,-0.1887099,-0.6587528
3,-0.43533432,-0.6364513,1.3088803,-1.0099789,-0.2585202,0.8421766,-0.33394873,0.59701043,0.47998917,0.35119116,-0.17215778,-0.6523187,0.14323753,0.018489635,0.5575704,0.93835497,-0.43042794,0.9625765,-0.43824145,-0.124175675,0.414679,-0.9073201,0.19380492,-0.24367131,-0.5186383,0.48365632,-0.33139747,-1.9714305,1.3699046,-0.13249944,1.0076103,-0.084596,-0.1075971,0.16961221,1.4808278,1.0891422,-1.3725857,0.6147874,0.2316582,-0.8060236
4,-0.19104198,-0.48507825,2.560701,-0.63710266,-0.7092647,1.1766924,-0.3255035,0.6746138,0.2747023,-0.12487576,-0.7611129,-0.77866906,0.38507828,0.40074337,0.2529819,-0.111616716,-0.12451037,-0.014758143,0.074661486,-1.3554792,0.20570609,-0.08082219,1.3425608,0.1205436,-0.24375321,0.38036066,-0.1145295,-2.799309,1.5674884,0.4168777,0.4184554,0.17562525,-1.1334617,-0.5252932,1.2580193,1.6917741,-1.1632483,0.06040356,0.2802539,-0.96052474
5,-0.4453103,-1.1314073,1.3873299,-1.6293905,-0.056253113,0.6419793,0.290519,0.840168,0.39129654,-0.020395918,-0.24561247,-0.7245233,0.17786868,-0.05474589,0.6274708,0.78414655,-0.42239475,0.756948,-0.29321054,-0.7656931,0.65030515,-0.9787317,0.21438292,0.40179405,0.13570768,0.67239,-0.3373303,-1.6884464,1.2559881,-0.17003748,0.9238235,-0.09896495,-0.22506349,0.2929142,1.5663893,0.91155654,-0.96510094,0.48170736,-0.28707412,-1.7321635
6,-0.13292573,-0.8884984,2.4424956,0.47319496,0.07144579,-0.5570563,-1.9122624,1.904457,-0.56537825,-0.17203808,0.058699816,1.0972177,-0.43042934,1.8331898,0.24633662,0.5703554,-1.3743216,1.1621693,1.2022614,-1.5333104,0.58118653,-0.22322738,0.6411731,0.50051135,-0.7631265,-0.9819294,-1.3063481,-1.023159,1.9714122,0.5065154,-0.03676761,1.4319156,-1.5029455,-1.0953339,2.7145643,-0.89454174,-0.53513384,-0.9515435,1.6807827,-0.011475004
7,-0.05695806,-0.46757996,1.8095267,-0.7710253,-0.5261079,1.1319577,-0.3132537,0.2643995,0.46668178,-0.054523375,-0.066146344,-0.030243969,0.58855265,0.24796554,0.6874909,0.6141361,-0.5198653,0.9627266,-0.53578496,-0.1742538,0.30776808,-0.90403605,0.32102793,-0.43466794,-0.29267898,0.3204732,-0.14839035,-2.503982,1.6697028,0.07633699,0.2410859,0.07176605,-0.5244205,0.005073917,0.993478,1.2546111,-1.4933921,0.8345639,0.11668889,-0.751986
8,-0.71161866,-0.241575,1.0518047,-0.8813562,-0.48712352,1.5353112,0.1540434,0.071630426,0.28501093,0.24162021,-0.21179226,-0.85056865,0.26827085,-0.17240934,0.5346073,0.69481647,-0.09696041,1.3039327,-0.70686084,-0.77140874,0.38154405,-0.45228308,0.6641663,0.16140443,0.01886546,0.50124645,0.4536119,-1.9665271,1.4188372,0.40606418,1.06047,-0.25166148,-0.37596974,0.41576114,1.2467927,1.3085123,-0.9964117,0.5176504,0.09269747,-0.9892247
9,-0.035955194,0.4433342,1.845746,0.202204,0.7539058,0.011791059,-0.6685806,0.462926,-1.8125404,0.9187454,-1.3007395,-0.61112994,1.0824671,0.06559963,-0.08802501,-0.37492427,1.2265981,0.13689695,-0.14001274,-0.15267894,-1.0605463,0.34551206,-0.2038918,0.16528349,-0.054773096,-0.018261215,0.53687453,0.32992086,1.7437524,0.6185558,0.18429464,-0.26200953,-2.7157621,-0.15978992,0.72831094,0.49630776,0.02648592,-1.0816184,1.0064601,-0.067650504
10,0.18948503,-0.55901515,2.0503755,-1.6700382,-0.9829334,0.8895779,0.077302426,0.23050252,0.50882334,0.39780578,-0.007432284,-1.0470119,0.37554106,-0.33286485,0.68037546,0.43551314,0.3505303,0.35284302,-0.07164088,-0.28611812,0.4044608,-0.67675173,0.7493732,-0.039932504,0.11557308,0.22358267,-0.9386381,-1.9040053,1.4241794,-0.42803934,-0.077427015,-0.33329502,-0.91218597,-0.10681602,0.7371579,1.3275291,-0.6776127,0.32614705,-0.4436905,-0.41946027
11,-0.57268417,-0.85557026,1.4246433,-1.5128888,-0.8248978,1.1709365,0.2161609,0.6813835,0.06474234,-0.24797809,-0.5503978,-0.9824853,0.70990473,0.006015869,0.46474627,0.53541243,-0.011062326,0.40894017,-0.45139498,0.16920502,0.7709634,-0.9582826,0.77124566,-0.08431382,-0.13905513,0.18896285,0.11557829,-2.4277031,1.2830992,-0.22620475,0.81258404,-0.027250672,-0.86748844,0.029938553,0.94785184,1.6451019,-1.0998757,0.4049292,0.054820523,-1.4042748
12,-1.0481946,-1.7543368,1.3801155,-1.0788424,1.5500746,0.18123047,0.3598787,2.0122085,0.46998882,0.3320035,0.21835662,-1.0448723,1.4870415,0.7692745,0.20774005,1.2411051,-0.28009865,0.07575442,0.08807263,-1.081887,1.3681169,1.2226017,0.81446415,0.9843386,-0.75904083,-0.32897526,-0.17989449,-1.8826556,0.68416566,1.0718687,0.89718205,0.12605081,0.099977195,-0.2924141,3.1873903,2.2322123,-0.13744526,-0.46658295,-0.9118345,-0.44483918
13,-0.33637145,-0.8414423,1.1851289,-1.3751582,-0.23901086,1.0781031,-0.19917256,0.5110325,0.0123476125,0.011485679,-0.59576887,-0.76864815,0.23600906,-0.052346658,1.060259,0.6389016,-0.7192631,1.1520997,-0.5442739,-0.87695485,-0.07923584,-0.30620295,0.35849068,-0.10258031,-0.28225368,-0.010535806,0.42334628,-2.175327,1.2057375,-0.5578753,0.4205711,-0.37063837,-0.92624164,0.1464926,0.6595678,1.0797559,-1.2527424,0.31718656,-0.26478314,-1.838219
14,-0.669752,-1.0300591,1.7872331,-0.7437971,-0.48855042,1.1668471,0.2755015,-0.04364825,0.13965264,0.117466606,-0.9001771,-0.8748088,0.38465947,-0.0022914093,1.1404881,-0.33198544,-0.6507001,0.944817,-0.8841636,-0.68796515,0.11863275,-0.54939276,0.58018106,-0.4931145,-0.10487564,0.48697814,-0.31691462,-2.6701953,1.3587489,-0.09673357,0.58768576,-0.14701508,-0.35371512,-0.87639034,0.7613473,1.8012205,-1.4024853,-0.400434,-0.7498598,-0.5732158
15,0.053326126,-0.30347478,1.2662724,0.38223386,-0.19267508,-0.16851105,-0.79596597,-0.369091,0.7378909,-0.6569336,0.29755855,-0.13962498,-0.59037966,-0.3494722,1.0150839,0.31456518,-0.9586699,0.7559226,-0.2706366,0.56775665,0.2989268,-1.1015089,-0.569607,-0.4369115,-0.93115526,0.28614852,-0.48552808,-0.64952976,-0.04422637,-0.12156425,0.45841125,-0.26993507,0.44987923,-0.7417106,0.7722748,-0.7101123,-0.69954205,1.0581645,0.026878593,0.6121715
16,0.3888154,0.8762269,0.18183479,-0.6905505,0.19109726,-0.5190314,0.31345195,0.08917313,0.23962475,0.6262111,1.6891562,0.44326717,1.1157634,0.4219918,-0.8645029,0.3570417,0.341362,-1.1726226,0.5623142,-0.17309819,-0.5137377,0.12117896,1.1574554,0.6506057,1.0556237,0.18744847,-0.8778407,0.8531105,0.5666139,-0.21698338,0.40440708,-0.081568204,1.1943293,0.50356376,-0.083558686,-0.13019562,-0.27427298,-0.06049126,-1.0021596,0.888573
17,1.1118586,0.71214086,0.5529634,0.28096387,1.2170906,-0.57344705,-0.84908324,0.77753997,-1.6046735,0.1688203,-0.2548994,0.32662052,0.6235694,-0.16261174,-2.4157977,1.367045,0.7365941,-1.3544487,0.51000625,-0.77028644,0.2907372,-0.6920139,-0.20505708,-0.37826467,0.271748,-0.6895065,0.79036796,-0.7871277,-0.45409438,0.5674747,0.44020218,0.2336517,-1.8037772,-0.30731022,0.91628796,0.624435,0.55818886,1.2616264,1.6823821,0.75248045
18,-0.12062556,-0.5249155,-1.380578,0.012545,-1.1525353,0.22471073,0.3086505,-0.22921444,0.82709795,0.31410956,0.60586685,-0.6109709,0.7870485,0.23151375,0.59144956,-0.13100682,0.6830103,1.2965012,-0.99511284,0.5095131,0.38523304,0.93375075,0.70529366,-0.18655767,-0.5417266,0.75241816,2.284112,0.5495514,-1.25454,0.67548007,0.14262575,0.050200656,0.27846316,-1.0707206,-0.005316928,-0.046871826,1.1023495,0.051659122,1.069502,0.09565152
19,-0.008191666,-0.30232206,1.2177106,-0.49522623,2.458021,-0.8663886,0.22567146,2.493613,-0.32493305,0.17426164,-0.4449939,-0.030456483,2.18121,1.1086102,-1.5473855,0.742852,0.60057294,-0.84008,0.57314795,-1.5010381,-0.02155843,1.2882998,-0.1378101,0.5112137,-0.33698854,-0.026955571,-0.22460224,0.21803132,0.15370359,0.39878437,0.42373186,-0.5987847,0.6601682,-0.19365945,2.1379313,0.99782574,0.4561335,0.64783126,0.27684578,0.36231986
20,1.1628569,-0.07384619,-0.2993386,-0.80817235,0.3645443,0.5116108,-0.74134785,0.06524002,0.5247338,0.21278656,2.1922224,-1.4218234,0.0511533,0.14806688,0.47294286,-0.41494364,1.1529315,-1.5048532,1.3877397,0.76973695,-0.29091674,-0.4143301,0.18692778,-0.75382435,-0.013494625,-0.076782644,0.417244,1.5509363,0.23593779,0.009145796,-0.39703003,0.5808515,0.52994907,0.52847034,-2.0444224,-0.067633726,-0.1681723,-1.7283217,0.5145719,-0.6100764
21,0.31589302,-0.61227363,0.6585059,-1.2613087,-1.0553799,0.32536387,-0.42218623,-0.76884824,0.3818874,0.30739987,0.72336245,-0.74305165,-0.6179221,-0.96024805,0.44626772,1.0704802,0.9688243,1.0777935,1.1483054,2.6642673,0.50740945,-2.536757,-0.48242232,-0.52087414,1.4331923,2.1128027,-3.5377226,1.4820249,0.17282288,-1.0967307,1.0748093,0.100671135,0.10848408,-0.23773186,1.0102116,-0.8815722,-0.3963846,1.4936754,0.9917845,0.6478221
22,0.19680847,-0.14856823,-0.5337366,0.33097965,-0.50733495,0.16085294,0.021105265,-0.6481917,-0.22683394,0.42323866,-0.49843487,0.28937423,-0.8464462,0.44624224,0.7417314,-0.47698903,0.18032876,-0.65813744,0.06989716,0.4002808,-0.7806992,0.04098583,-0.31350225,0.39914167,-0.17559236,-0.61527276,0.062342003,0.07920158,-1.3764173,-1.335529,0.13617525,0.17044123,-0.38138163,0.2574893,-0.6365982,0.2733887,-0.18126817,-0.9882249,-1.0771631,-0.056274965
23,-0.09216524,-0.04275087,-1.183458,-0.92059344,0.26049682,-2.5729756,1.5920107,0.07875638,-0.71217436,0.2338134,0.03243409,0.41390842,-0.8999311,-1.1724001,-1.1105826,-1.0113496,-0.07863419,0.07815287,-1.1493322,-0.64245075,0.4234676,-2.6555872,0.8005751,-0.3499436,0.23578277,2.5570114,-0.20194405,0.23892306,0.6540772,0.6915687,0.3309743,1.666415,2.0323064,-0.33669984,0.38824984,0.6263617,-0.36993977,-1.3404717,-0.33120325,-1.1909795
24,1.4347656,-0.3919138,-1.0503658,1.2368155,-1.054883,-0.01842018,-0.5137574,-0.3481478,-1.917459,1.2323226,-0.93589395,-1.7564023,0.2573862,0.09426717,0.4488558,-0.53375757,-0.045447513,-0.57318455,0.3963283,-0.21427028,0.22406991,-2.1681046,0.28686485,0.010868467,-0.764051,0.739342,0.40232444,-0.67494154,-1.5966177,-3.0591812,0.60136193,0.34976807,-0.59345764,0.80617625,-0.7740844,0.77746785,1.8622367,0.5255988,-1.2460874,0.74497825
25,1.0878022,0.4329454,0.5017274,-1.1160313,-0.96214324,-1.048068,0.6891328,0.5045827,0.04150496,0.90124714,0.74396235,0.6855325,-0.4387969,0.75711864,-0.49729326,0.41548848,0.550463,-0.9356951,-0.058209553,-0.7528665,-1.0513269,0.4194077,0.30085748,0.05790088,0.7177876,0.2081837,-0.58747554,0.87226814,-0.108802475,-0.24380746,-0.52874506,1.2074351,0.8834672,0.41723967,-0.2357442,0.4557904,0.48501846,-0.77213067,0.055092074,0.6430974
26,0.45803684,-1.1800226,0.09927271,0.072818376,-0.7184933,-0.5267189,0.33902732,-0.17016296,-0.4730604,1.2399356,-0.46673173,0.6162703,-0.274563,-0.0916321,1.2469214,-0.28716716,0.8195474,-0.28425616,-0.08034122,0.95168304,-1.0820074,-0.05656229,0.2564182,-0.20980588,0.15563825,-0.38491917,-0.33617064,0.69620204,-0.9904775,-1.1633586,-0.06334183,0.93083924,-0.6628713,-0.10500029,-0.70438147,-0.4637882,1.007684,-1.1637233,-0.88823324,-0.2902586
27,0.13572653,1.4063942,0.8686069,0.031507965,0.22667821,-1.5034316,1.4850099,-0.5871828,-1.1739436,-0.13475949,0.6624339,-1.2224714,-0.54872507,0.40833324,-0.014386406,-1.7799885,0.21125759,-0.07412243,-1.2950015,-0.42540115,-0.043962225,-1.507986,0.22912496,1.5969898,0.16750251,1.7154694,0.20325772,0.8563972,0.88297665,0.6049346,-0.28462085,-0.58239293,0.06955084,-1.7161411,0.74657214,-0.78718394,0.79599166,-2.4647958,0.3593597,1.0469267
28,-0.080829956,-0.21700184,-0.90334696,0.7800971,1.6429683,-1.212551,0.4162025,-0.22536713,-1.553364,-1.507692,-1.0795455,1.2845472,-0.12277607,-0.010723923,-0.46914038,-0.8099517,-1.2914288,-0.16548613,-0.76156723,0.9527673,-1.0892409,-1.6342167,-0.13573666,-0.26004565,0.23200284,0.494569,0.5199267,-0.5715654,-0.755727,-1.6537573,1.0190678,0.8433134,-0.041849766,0.42099807,-0.60048217,-0.4821931,-0.7587899,0.53692085,-1.7656089,-2.5842798
29,-1.0109776,0.56900454,-0.22618884,-1.0071387,0.96289515,-0.26845005,1.0510792,-0.9038682,-0.7175634,0.00048000703,-0.65587014,-0.9084182,-0.8265398,-0.44216746,-0.12996434,-0.9873782,1.7922089,0.38051063,0.18319507,-1.4075025,-0.22210653,0.810153,1.345108,1.479963,-0.4600643,-0.21826856,2.341243,1.1126192,-0.4333656,0.8134285,0.5254736,-0.34863788,-1.4354692,-1.1246179,0.79152,0.66524374,-0.35891196,-1.3355592,1.3900819,-0.5265169
30,0.47328764,-0.12938784,0.0024641873,0.32771832,-1.5343281,1.0432135,0.41656965,-0.70441973,0.8102631,0.35487875,0.12826745,0.60929215,1.8635505,1.6596336,0.50701123,-0.108794205,1.3411316,1.4876198,-1.7724696,0.8254743,-0.60972583,1.4483309,-0.2565162,-0.73404497,-0.72042143,0.6323971,1.8703666,0.6325623,-1.5559477,0.95230085,0.6405811,0.45564163,-0.2132285,-0.036439527,-0.085209966,0.29909122,1.4058996,0.7351195,-0.39616704,-0.5718259
31,-0.2360893,-0.6098512,-0.2714445,0.31220704,0.6521495,1.7626088,0.5520537,-1.9254607,-0.21949126,1.5593557,-0.787332,0.18464097,-1.7613155,-1.4051557,0.16896495,-0.1254233,0.07713989,0.028674355,-0.3250755,-0.96131146,0.32856375,0.20556805,0.3199016,-2.2738533,1.3902681,-0.2717759,0.13386844,-0.29250324,-1.6772925,1.1468263,1.0466756,0.72130764,1.7061738,0.9579251,-0.8914655,2.2468243,0.10494375,-1.0292579,-0.55097216,-0.12900722
32,-0.4616032,-0.11965083,-1.3832138,-0.78082263,1.7765813,0.26306188,-0.53026575,-0.23738852,-0.8884376,0.23713844,0.07504863,0.48064396,-1.1783702,0.04613002,0.53452146,0.5278265,-0.77239615,0.34790847,-0.16493471,0.4715971,-0.46309963,-1.054223,0.47337306,-0.034084443,-0.5305023,-0.8509568,0.22049488,1.0523028,0.20920883,-1.4449637,0.81398207,1.2867217,0.15466578,2.1458032,-0.17470215,-0.7161738,-1.327158,-0.12424351,-0.40265924,-1.9623405
33,-0.36724505,1.8588175,-0.8669564,0.50313014,0.9491744,0.24356475,0.9096183,1.0102096,-1.7209285,0.33048922,-0.10869358,1.1599449,-1.8956671,0.5175984,0.05224966,0.32812405,-1.3994396,1.3169922,-1.0063627,-1.0148163,-1.3810945,-2.1204336,-1.3396225,0.32232895,1.4801856,1.007913,0.36021096,0.42969984,0.47154498,-0.44961226,1.0173116,1.2509854,1.3197504,3.0899723,0.26285136,-1.7803073,-0.23357026,-0.59058756,0.53044724,-2.2437074
34,0.29501304,0.91819715,0.32979023,-0.99548066,-0.28916848,-0.86247176,0.50344193,0.8695788,0.4941086,-0.27201793,1.294846,0.25882712,-0.11966594,0.9347201,-1.3245691,-0.55329424,0.15352428,0.026705338,0.62048745,-1.4501421,-0.33750287,-0.25556937,1.3539759,-0.086269155,0.42262042,0.63105685,-0.1877956,0.115352556,-0.17637062,0.8786814,0.042253915,0.69458497,0.8667393,-0.6509578,0.021755518,-1.4309131,1.2431438,-0.59162116,-0.4510024,-0.11092454
35,-0.71238494,0.95922196,-1.4609977,-0.95505327,0.9664874,-1.3278571,0.7248308,0.9559047,1.0292466,0.29550698,1.4529088,-2.5418124,-0.88779217,-1.8073335,-0.77845156,0.0855685,0.16036384,-1.3276651,-0.39997485,1.8189191,2.601911,0.8755966,-0.058691677,0.9673116,1.4591615,0.33276173,-2.9051912,-0.74158823,-1.2318399,-0.11799111,-0.6947838,-0.6169014,-0.13261938,0.4356233,2.4880455,0.4276221,1.5593804,0.19714834,-0.7394614,-0.6118176
36,-0.1385541,-0.120433904,0.0229589,1.0905452,0.4331225,0.15221296,-0.20361334,-0.76236206,0.26161668,-0.07094903,-0.13298538,-0.11681015,-0.056711305,-0.3657055,0.65787184,-0.32102597,-0.17519778,-0.23796499,-0.38531855,1.0554713,0.30158967,0.026273979,0.043082558,-0.72971416,-0.16243275,-0.26307583,-0.13118654,-0.296495,-1.0076948,-0.50466996,0.15960436,0.20592625,0.49835262,-0.29409844,0.097228564,0.77861124,-0.044764858,0.37979934,0.05155467,0.6972996
37,0.8283894,0.4555763,0.8486588,-0.6781085,0.28920066,-0.17818165,-0.9284381,-0.22983226,1.2151643,0.6366024,0.3173748,0.40112892,1.2568247,1.1004713,-0.4857716,-0.752378,0.83956677,-1.3638762,0.40804124,-0.77243716,-0.17999804,0.52428174,-0.71606916,0.25514948,-0.63992685,-0.18878688,-0.7058019,1.1907517,-0.2394561,-0.033881098,0.2151712,0.52374375,0.91920054,0.47984388,-0.41430813,0.6493638,-0.50091386,0.046809398,-1.3886647,0.02227021
38,-1.0367566,-0.6433131,-2.00795,-0.7427096,-1.5356703,-1.1625161,0.57048047,1.4567598,0.20867057,-0.3282993,0.66638035,-0.98984283,-0.337874,0.8226241,-0.82534117,0.023276396,0.45092633,0.73718554,0.0031541581,-1.1675723,-0.1305715,-0.64990515,-0.44544804,0.62038666,-0.70178795,0.04179909,0.7269344,0.8365675,-0.6220179,0.42172873,1.7781898,0.35759488,0.13397557,-1.09656,-0.117904246,-1.1003296,0.5978857,-2.3803308,-1.6410055,0.5910679
39,0.19966632,-0.0669618,-1.3794955,0.6101821,0.16696213,-0.32946855,0.041874696,-0.19017859,0.6842293,0.13794065,0.8615539,0.27732047,1.1456627,0.52754545,0.31809005,-0.41887608,-0.10112422,0.9189797,-1.1786554,-0.19655465,0.12662905,1.2800118,0.36742464,-0.17228396,0.0038354185,0.3181691,1.8966333,0.942335,-1.1476514,0.6184971,-0.25271147,0.1999869,0.8409463,-1.0996655,0.02108432,-0.5939267,1.15607,0.10655052,0.44685802,-0.19045441
40,0.19689997,0.538225,0.23547606,-0.5208869,0.77999246,0.1954472,-0.72620976,-0.24396522,0.6597647,0.7762037,0.710545,0.6041674,0.39361617,0.17760466,0.02743965,-0.46470648,0.77528584,-2.0252328,0.51376504,-0.7671966,-0.719946,0.1202829,0.5475035,-0.065649815,1.1798881,-1.0960512,-0.52373606,1.0364956,0.62740314,0.00484866,0.5448375,1.4949929,-0.08123693,0.43923566,-1.2401847,0.4268278,0.05278944,0.094171435,-1.4947947,0.26082873
41,0.11419533,-0.06627358,0.5225682,0.40836915,0.22833982,0.115049735,0.61178756,0.35575217,0.06854545,-1.0658756,0.91957194,-0.22595933,0.40818468,0.31790483,1.096996,-0.39701146,0.44543695,-1.2065836,-0.21967931,0.8105276,-0.107136,-0.091041245,-0.016890822,-0.49204773,1.3930675,-1.1003168,0.41815498,0.41688165,-0.92054904,-0.6986959,0.18524258,0.35379848,0.34070936,0.32139704,-1.1608049,0.17905186,0.46620598,-0.42623037,-0.9962399,-1.0101215
42,0.02752163,-0.20497397,-0.590176,-0.008413507,-0.48706296,0.23069257,-0.5604998,-0.12675065,1.0372891,-0.5514372,-0.014385112,-0.7061174,-0.47755682,0.2759393,0.2801938,-0.56941235,-1.0385427,-0.53202236,-0.6966408,-0.24450439,-0.082328446,0.30046144,-0.6025486,-0.38443843,0.25311136,-0.8029347,-0.2679034,0.29483894,-0.39941812,-1.2346617,0.60003024,-0.9491721,0.9731642,-0.3565589,-0.8879332,-0.91614985,-0.52429676,0.4041992,-0.8555291,-0.50270283
43,-0.6460754,1.6488271,-0.21760087,-0.69649583,-0.34390983,-1.7775034,1.2033236,0.12882087,-0.25560564,-0.15209365,0.68915224,-0.53218,-0.85929024,-0.7407297,-0.72508574,-1.4136333,0.26909593,-0.5064516,-0.58163327,-1.4206972,-0.5356266,-0.6435842,-0.107687816,1.0317923,0.2642288,1.6157037,1.2586628,-0.25746486,-0.028178578,0.97691053,0.1591881,0.58975637,1.3902719,-0.04864526,0.068744265,-0.11642892,-0.6109294,-1.2676728,0.59869885,0.45233557
44,-0.37994722,1.9517345,-0.1943144,-0.7629761,-0.6347859,-0.52756035,1.3045087,-0.6137306,-0.254918,0.18337098,-0.21726225,-1.2615526,-1.7674847,-0.8222916,-0.24847355,-1.6972636,0.9037182,0.45143408,-0.16935076,-1.6856006,-1.0727805,-1.2142972,-1.7329023,1.6572981,1.5990179,2.4300292,-0.1425831,0.9954311,-0.18123712,-0.03409055,0.6826004,-0.55209434,-0.27477485,-0.05351068,0.41278085,-1.5215179,-0.11078502,-0.48207146,0.22088204,-1.1927167
45,1.7376812,-0.43280643,1.0606776,-2.1233182,0.1547396,0.1169362,0.5290164,0.113799036,0.8461011,-0.737446,2.041867,0.7323029,0.55163765,0.4772173,-1.02519,1.3689194,1.3393642,-0.047368903,1.2239022,0.35422212,0.4156462,-1.742957,0.012374707,-0.64665955,1.6301088,1.1078684,-0.53388965,0.42217165,-0.66904676,-0.16316633,-0.25963178,0.04165271,0.56971127,-0.9095643,-0.5856628,0.5315163,-0.06864875,0.9465461,0.28023165,-0.9234275
46,1.0648946,0.4999783,-0.0008987087,-1.6588081,0.7119966,1.7453792,0.7345165,-1.9499137,-1.0182126,-0.033575192,0.97908044,-0.12735319,-0.15584534,0.9356367,0.13733986,0.64499456,-1.0879581,-0.0668779,-1.2281106,-1.4505597,-0.9406332,0.3359323,-0.73759216,-1.6173941,0.60535043,-1.7548906,0.25379845,-0.49346694,0.15477292,-1.0949693,-0.45851824,-0.9599114,0.35169458,-0.6678262,-1.2765684,0.2140399,-1.4556257,-0.43617648,-1.9643267,0.479287
47,1.2708346,0.146947,0.29939893,-0.36935294,0.29543522,0.35853416,-0.251756,-0.3466932,0.5944555,-0.13186228,1.0611285,-0.38700926,0.8718611,0.67759496,-0.06707243,-0.62472403,-0.055758093,-1.2733581,0.22505566,-1.0088863,0.3834489,0.074269705,1.0897324,0.15733354,0.88702375,-0.8650242,-0.33120367,0.84090513,0.034553185,-1.511523,-0.24230361,-0.53292006,1.0317742,0.49864766,-0.7572848,-0.0036399476,0.24200517,-0.13674186,-1.1720337,-0.7914887
48,1.4824469,0.6084819,0.1524707,-0.056098413,-0.09265908,0.16460957,0.24944718,-0.023329113,0.16222432,0.62095374,2.0022142,-0.15413901,0.08741859,-0.21572922,-1.208513,1.7975496,1.3822635,-1.6010067,0.7054851,0.35702804,-0.43296638,0.6337571,0.05199439,-0.18525161,0.52739716,0.14609806,0.5458826,-0.046317954,-0.3552584,0.46190256,0.07169636,-0.2565958,-0.4824234,1.2895752,0.3570169,0.32463935,1.2437035,-0.21746485,-0.13537437,-0.0051158783
49,0.17235106,-0.9710429,-1.5709301,0.045420866,-0.7609648,-0.16271369,0.78059655,-0.57285374,-0.47740525,1.1271776,-0.69047886,-0.47590607,1.642629,0.050637815,-0.23440243,-0.35606438,0.3000874,-1.2924235,-0.6543041,1.8951279,0.61096543,-1.3229805,-0.26642302,-0.9696951,-0.51293594,-1.1972796,0.8429998,-1.3483559,0.16599457,-2.2807906,0.16770479,0.84117126,-0.085222825,0.36699194,-0.74140716,1.0991955,1.3277795,-0.6617198,-0.3960241,-0.011984166
50,0.7594534,1.1336831,0.028745938,1.4966486,0.041887786,0.46697137,0.690532,-0.28475225,-0.8360768,1.1468441,-0.44142374,1.2793003,-0.45487845,-0.9601306,0.3500867,-1.285585,0.07650828,1.397628,-0.03472452,-0.75625896,-1.6531633,-1.6947154,-2.1088965,-2.4295616,2.680022,1.5683606,-1.9353553,-1.5283877,-0.31897506,-0.42770672,-1.072995,-0.10099737,-0.09519137,0.4421146,-1.0676926,-0.8875526,0.6269298,-1.4608699,-0.35731578,-0.21883558
51,0.02774052,-0.06075127,1.2473859,-0.7330105,0.4595024,-0.31074783,-0.97706014,0.81978977,-1.2240633,-0.5047274,-1.3519361,-0.17470479,-0.4947575,0.012494803,-2.0607765,0.84140646,1.4668036,-1.9953547,1.3955513,-1.3613148,-0.66967905,0.5368276,0.6723826,0.33676726,-0.47001174,-1.7043643,1.9300456,-0.22652006,-0.090182915,0.04259991,1.4190155,-0.37514418,-2.5082436,-0.657269,1.2539649,-0.4149195,0.4633857,0.08483454,2.0721602,-0.5130034
52,-0.7837643,1.2832584,-1.1333383,-0.8374278,-0.117836475,-0.36452663,-0.20213564,0.90081066,-0.08398415,0.33629552,1.6970899,-1.3327659,-0.42078608,0.4366664,0.17784512,-0.617411,0.21518949,1.2663677,-0.14636964,-0.5652593,0.88137406,-0.96189034,-0.9977192,0.76018244,-0.29720792,-0.101473324,1.5759134,0.640816,-0.1700401,1.0131966,0.30677116,0.06937881,0.5101846,0.0788261,-0.009620838,-0.7683812,0.30372718,-2.2188585,1.2093328,0.27085727
53,0.20573683,-0.38595477,0.59297514,-0.044906165,0.7360681,-0.018739413,0.21659422,-0.45226642,-0.9220945,0.3942726,-0.23102076,0.25028884,0.9783166,0.17449304,0.30650857,-0.37166202,1.273699,-0.35274002,0.59056836,0.7149233,-0.6142372,-0.12816453,0.160653,-0.3663813,0.4207986,-0.862914,-0.41602552,0.22082625,-0.9366967,-0.70763975,0.077022046,0.07962323,-0.61294425,0.69613695,-0.4115188,0.5358515,-0.01728449,-1.1142882,-0.45014998,0.32701012
54,0.63465077,-0.64347124,0.33441484,0.3749606,-0.17166463,-0.88904876,0.62977016,-0.111746825,-0.52872634,0.39707977,0.10425014,-0.035183497,0.27435717,-0.13133797,1.39072,-0.117593296,0.5602736,-0.91311944,0.22107925,1.0949188,-0.6315197,-0.41606382,-1.1239592,0.24595691,-0.1421665,-0.33794764,0.606016,0.22550136,-1.1350578,-1.2006565,0.26681003,0.92511785,0.51695734,0.70613134,-0.6347242,0.63667065,0.6309797,-1.2196769,-0.7640079,-0.21478032
55,-1.5732555,1.0720437,-0.27849588,1.2487465,0.22412634,-0.069008745,-0.14080308,-0.4508007,-0.2417262,-1.3610653,-0.16248848,-0.11683892,-0.5278626,0.4555341,-1.2625061,-1.65155,0.33281457,-0.80592537,0.714625,0.6862083,1.2281482,-0.1286242,2.3366663,0.08183236,-0.013153348,-1.312475,-0.13447696,1.0245675,-0.58756214,-0.18160582,0.6312856,0.3153279,1.3311049,-0.8553397,-0.080936685,1.4254591,-0.8874323,-1.7677205,1.1516517,1.6629981
56,-0.27628458,0.5140462,-0.65316546,-0.21347927,-1.5232416,-0.8098734,-0.5032463,0.85948384,-0.46337608,-0.649453,1.1508797,-1.0595052,0.110741824,0.56055635,-0.118661754,-0.79053426,-0.8359376,0.262424,-0.08394774,-0.44337744,1.2688676,-0.37667045,0.6687715,-0.35175988,-0.30985036,-0.1412007,1.068814,0.10459643,-0.073739976,0.51234263,-0.020817364,0.1958109,0.681326,-1.7643272,-0.8562149,0.0123476535,0.5437936,-2.277836,0.68197286,0.7862351
57,0.14977854,-1.2862091,0.69793695,-1.3200316,-0.37553224,0.19851515,-0.60198605,-0.077863224,0.962931,-0.34444892,0.8495515,-0.89458984,-0.5247558,-0.07268059,1.3788403,0.8159268,0.235804,0.25473648,0.2769438,1.9610938,0.5180186,-1.078794,-0.6521301,0.10557639,0.862496,0.18542466,-2.0126905,1.5436065,-0.2575263,-1.2435863,1.1277819,-0.38736403,0.25836572,-0.012829906,0.50519943,-1.131837,-0.5155299,0.94834095,-0.010581117,-0.55475
58,0.04040353,-1.2597567,-0.74958706,0.6956207,1.616962,-0.68434644,-0.27165937,-0.8342802,1.1160977,0.8308636,-0.006492695,-0.18352914,0.64088166,-0.55101526,0.76848537,-0.35541266,0.121912085,0.3690328,-1.243337,-0.47388387,0.5881095,1.0973325,0.45491374,0.009175183,-0.1476589,0.42145044,1.2920653,0.7481572,-1.6483873,0.6661051,0.16112451,0.17711796,0.41153193,-1.1898144,1.0095735,-0.0897249,1.5442287,1.4041094,0.39672652,-0.1937446
59,0.13707486,-0.6684026,-0.5952935,-0.1792928,0.4022642,-0.12077767,-0.056140408,-0.46948934,-1.1223214,0.4885697,-0.37530223,0.96358335,-0.32076848,0.06225516,1.4252496,0.60593843,0.15203574,-0.6401459,-0.24735253,-0.07081827,-0.7659933,-0.25234374,-0.32003424,0.16969451,0.46819073,-1.1565622,0.18714692,0.7847865,-0.9655674,-1.2011573,0.40097353,1.5933133,0.066459365,1.2794591,-0.34790584,0.40274352,-0.121355884,-0.8290218,-1.1156049,-0.6200558
60,0.09656804,0.5972225,-0.9445232,-1.3872454,-1.4560019,-1.2339051,1.0668218,0.0017475745,0.07469333,-0.3433354,1.2217327,-0.7005675,-0.18101735,-0.39004767,-1.5699629,-0.22852853,1.3064429,-0.35244128,0.38333464,-0.9253543,-0.38461867,-0.852633,-0.01599813,0.9172547,0.04922741,1.1994802,1.371018,-0.09945092,-0.5325074,0.40911198,0.32190543,0.66064095,-0.07660372,-0.4711513,-0.7041676,-0.17267908,-0.15198502,-1.3035574,0.20472446,0.095006794
61,-0.14879262,0.3000102,-0.57673866,0.5600034,0.47244465,-0.22263281,0.0049677975,-0.86550885,0.25484094,0.392068,-0.14530867,0.18738258,-0.7977909,-1.009654,-0.14928767,-0.20218064,-0.2349053,0.60419947,0.0156160975,0.06080651,0.20433316,-0.8567972,-0.12714773,-0.7542521,-0.487138,0.54530966,-0.13523486,-0.5102081,-0.38402912,-0.14938977,0.07740029,0.3235522,0.48522064,-0.48367056,0.35790876,0.1360609,-0.27152565,0.40377557,0.49612182,0.6501417
62,0.9409193,-0.4897576,-0.04826602,-1.5599573,-0.16545114,-0.6046338,-0.52871996,-0.014241214,0.78992134,0.18676451,0.8551539,-0.54795605,0.1900736,-0.29319483,0.5149836,-0.84091896,-0.4487072,-1.1550745,-0.23993176,-0.37877727,-0.10952508,0.14428549,1.8796781,0.07913959,0.98156786,-1.1202993,-0.9568767,1.0595282,0.36421233,-2.214125,-0.48656747,-0.14050281,0.9904829,0.17428301,-1.9369502,-0.9575212,-0.07604611,-0.14822619,-0.3835528,-1.3663021
63,0.098450825,-0.7610398,-0.43478495,-0.0593996,0.15172707,0.17319721,1.5474327,-0.81980383,-0.4443941,1.0952532,1.101908,0.844081,0.5692884,-0.18914735,0.53703594,1.4614558,0.059535902,0.052583106,-0.2670192,-0.11183716,-0.82283163,0.19192167,0.30327156,0.796004,1.2931943,-0.8165463,1.4309195,0.25601968,-0.09112857,-0.7105767,0.5388991,-0.17399393,0.85447836,-0.5223632,-0.19590276,-0.09040415,0.52150065,-0.9339163,-0.36780226,0.69950944
64,0.4651614,0.19651964,-0.12089713,0.20350593,-0.36808017,-0.20777233,-0.12761085,-0.35329664,0.16095233,0.79371357,0.25627792,0.73195654,1.0532588,0.28215933,-0.71684015,0.34612402,0.69192845,0.9068246,-0.3265042,-0.24839066,-0.14277585,-0.1622025,0.35207534,0.11919166,-0.6269523,0.51981884,0.83164275,0.113528624,0.17458089,0.28076312,0.2868445,0.11326829,-0.36938494,-0.6587933,0.616518,-0.37353638,0.72725475,0.560637,0.5527352,0.6496127
65,0.17837988,-0.7340094,-0.65571815,0.20450847,0.5167817,-0.3645472,0.086764105,-0.42012635,0.058899883,1.245404,-0.37093955,0.75817955,0.30126062,-0.017163552,0.24375196,0.047672953,0.7680076,-0.88604975,-0.068166934,-0.6684433,-0.0710594,0.67218184,0.81033325,0.43920058,1.0557903,-0.32243538,0.53761923,1.1556062,-0.7951712,0.12317266,0.47723553,1.0371324,-0.35730016,-0.67864394,0.12162891,0.8226721,1.5321136,-0.014438188,-0.37947538,0.43797508
66,0.37476003,1.6781492,0.6476007,1.0331671,0.54820824,0.8892124,-0.119232826,-0.988874,0.44319603,-0.32395303,1.3766397,0.011610656,0.23429334,0.7213549,0.8992373,-1.3951615,0.56736535,-0.5991004,0.43929654,0.13309282,-1.4538065,-0.248701,1.3666787,0.36534983,-1.1110386,1.6312821,0.60125005,1.048206,1.0792509,0.8241549,-0.4141599,1.2648808,0.5227169,0.10016235,-0.39537528,-0.9049527,-1.5381931,0.52884835,1.0828081,0.65016186
67,-0.6639627,1.1579589,0.6831734,0.8161206,0.7422222,0.83545166,-0.039833177,-1.5189346,-0.54610246,0.84604514,0.19567342,-0.93014383,0.16137806,-0.34660742,0.824439,-1.492442,1.593022,0.03294178,0.20003603,0.43762928,-1.148061,0.14233172,0.19345056,1.2967253,-0.41498712,0.5470771,0.4232705,1.3472039,0.79404014,0.6825117,0.8753243,0.4047803,-1.0362388,0.61998874,-0.23485394,-0.3493815,-0.4798223,-1.118345,0.08902709,0.4080744
68,1.0171053,-0.90053886,-1.0602276,0.5226809,-1.5502476,0.26500404,0.061127502,0.22974423,-1.19025,1.9128593,-0.31560156,-0.8466035,0.23038046,0.5663082,0.8655689,0.19779035,0.8122699,-0.66753507,0.6170706,0.68008393,-0.33369386,-1.595929,0.10275208,0.07899797,-0.72012454,0.29232028,0.39989436,-0.31687412,-1.0656492,-2.202961,0.64075845,1.0172396,-0.54529184,1.1158671,-0.83425003,0.6564492,1.6268923,-0.66998255,-0.78317714,0.9256543
69,0.43321154,0.31878325,-0.5207324,0.36796942,0.19917715,0.65917104,0.040842377,-0.32775974,1.196952,0.5302376,1.5495954,0.28721544,0.73668486,0.6578167,0.82952994,-0.17408761,0.031985383,1.8240689,-0.9687522,-0.32257414,-0.15188244,0.98116076,0.3068176,-0.51783144,-0.4405856,0.7408282,1.7110054,0.6875455,-0.1495351,0.98800117,-1.0911038,-0.03478575,0.7584124,-0.72560585,-0.0076666675,-0.31386343,0.3251524,0.14651763,0.9819166,-0.110708155
70,-0.09479015,0.70587575,-1.6828529,-0.54452074,-0.7345856,-1.0364434,0.46910644,0.76438755,-0.113483906,0.35172236,1.0552975,-0.54342735,0.24291834,0.4986088,0.16166833,-0.6074708,0.4144,1.1331228,0.016733805,-0.44846135,-0.29834855,0.3206082,-0.45372295,0.2969268,0.03995338,0.79068804,0.96296,1.2077359,0.36187065,0.26025343,-1.0700579,0.5757358,0.5271721,-0.8008295,0.33055183,-0.45250317,-0.011246075,-1.870499,1.5525066,-0.0763331
71,0.6953582,-0.6341456,-0.6484028,0.9200376,0.67760867,0.197941,0.04800569,0.008984459,-0.0656353,0.788831,0.8567157,-0.6253603,1.6121311,0.656284,1.5942696,-0.5790901,0.6932257,2.249356,-1.3930173,-0.24615271,-0.70103765,1.6403482,-0.041185655,0.059425432,0.61235136,1.2234901,1.8661964,0.94971687,-1.039782,0.68941915,-1.940312,-0.3487428,-1.1954727,-1.5725856,0.5212123,-0.54301685,1.6467361,-0.25158116,1.2509195,-0.71271366
72,-0.001001585,-0.62218916,-0.21664034,0.2185978,0.7274297,-0.16094682,-0.39448175,-0.6250756,0.37603396,0.34528512,0.03011078,-0.2605758,-0.5167301,-0.3573912,0.5244657,0.04969829,-0.6806881,0.23481528,-0.87163115,-0.21852072,-0.43180874,0.5288605,-0.7455654,-1.0094692,-0.38844037,-0.54355335,0.03212402,0.10330134,-0.33836138,-0.10187832,0.2888371,-0.51269567,0.41331843,-0.5849358,0.31627205,-0.2724715,-0.56201154,0.46012548,-0.50662804,0.8639302
73,0.4782625,-1.0888262,-0.63398963,-0.72359693,1.4414517,-0.6533701,0.424298,-0.6581287,-0.28519717,0.08663442,1.2791576,-1.0087568,-1.1797291,-0.4380972,0.13990968,1.1553766,-0.8563243,-0.6286741,-1.1111071,-1.1339383,-1.3840923,1.4365534,-1.2313893,-1.523956,0.62441254,-0.87864697,0.445419,0.24259165,-1.024282,0.283767,-0.12775807,-0.69585645,0.6929027,-0.107766755,0.15733983,0.38999757,-0.9324599,-0.27572346,-1.445869,1.76677
74,1.2791811,0.40082228,1.0293335,-0.49781305,-1.3292047,-0.06321808,-0.5144467,0.31356135,0.8944075,-0.09201821,0.27685478,-0.81178546,-0.10366813,0.5578807,0.8334523,-1.0238049,-0.26333195,-2.277964,-0.64320517,-0.8479814,-0.49508473,0.3102223,-0.36687285,-0.105349034,1.7477499,-0.5815077,-0.7476853,1.47378,0.13903946,-1.1883918,0.26687384,-0.25432214,1.7323307,0.90100646,-1.9694148,-0.41386783,0.152589,-0.32981053,-0.1946058,-1.1355728
75,-0.29838774,-0.04032962,1.2680455,1.5816436,2.056254,-0.3600117,-0.44799206,1.8509108,-0.62463564,-0.52515256,-1.1667199,-1.1382753,0.9990254,0.1009711,-0.81479716,0.5337274,0.0030637952,-1.6925868,0.70547915,-0.8317116,0.4470421,2.0486228,-0.38136005,0.1509103,-0.76307166,-0.4321572,0.5697748,-1.403964,-1.1578865,0.7730378,0.21131906,-0.52807343,-0.45782438,0.06745697,2.6059275,1.7430272,0.6469903,0.8289463,0.94492155,0.6302589
76,0.26736015,1.7385238,-0.11391494,0.08088229,0.1333755,-0.36436918,0.6684134,0.06720013,0.6577157,0.4283985,1.7082624,-0.42361188,-0.18947229,0.1015662,-1.521611,-0.43843794,1.0891279,0.620175,0.7463459,-1.7832608,0.20065574,-1.096195,0.11409486,1.2689549,-0.027965132,0.7573548,0.5290139,1.0206288,0.19790642,-0.07661616,0.5680586,-0.1616596,1.3553531,0.018516012,-0.13720608,0.06134109,0.5801358,-1.12795,-0.13365799,0.17630759
77,1.0130857,0.94984865,0.7116212,-0.4772443,-0.9081984,-0.9770447,0.65798277,-0.76674235,0.4733464,-0.2597471,0.521919,1.0271833,-0.11913579,-0.340835,-0.45216113,0.21852809,0.57860726,0.21632776,0.1387228,-0.44863644,-1.7488062,0.7193302,-0.27201486,-0.65220064,-0.5546608,0.01882836,0.5660028,-0.3651543,-0.68857896,-0.8412195,-1.2862908,1.448764,-0.07012677,-0.6067789,-0.35691413,0.34326392,0.077789195,-0.031818513,-0.63392365,0.27099386
78,-0.44948792,-0.264757,-0.2778576,0.7199091,0.3740178,-0.2100489,-0.39963266,0.08427619,-1.1648674,-0.39178014,-0.58473027,1.1133841,-0.1631449,0.9067064,0.6805667,-0.33564276,-0.93412507,-0.23028244,-0.70028824,1.050491,-0.82264596,-0.2648146,-0.6515712,0.021678977,0.9066304,-1.2095772,-0.48268986,0.79263574,0.07400734,-1.2947445,0.46869388,1.0318497,-0.13142368,0.53720987,-0.15092903,-0.93624634,-0.48549715,-0.4739941,-0.4003443,-0.6383754
79,0.51744616,-0.20759021,-0.19649825,-0.3783683,-0.6462086,-0.53004515,-0.640524,0.63392276,-0.69718796,-0.12185131,1.6662202,-0.13599314,-0.58079785,0.12299073,0.40227285,0.22796464,0.19728208,-0.59956896,-0.29080012,1.1595068,0.71157783,0.05869244,0.85877347,-0.7700776,1.8643072,-0.79347885,-1.3728601,1.2953293,-1.1089064,0.11088529,-0.69209677,0.862763,-0.17993082,0.22576897,-0.3553521,-0.24449912,0.17668447,-0.7598081,0.80784976,0.6102659
80,0.3392379,0.22191678,0.3314494,0.9066585,-0.00073071825,-0.23581363,-0.5981889,-1.3053645,0.8344633,0.4908067,0.069981396,0.3970789,-0.097641766,-0.6075925,0.18762706,-0.32078484,-0.48068568,0.43458253,-0.61715674,-0.031109128,-0.2059473,0.0677806,-0.08572648,-0.88573146,-0.51707476,-0.017503986,-0.1767224,-0.2063103,-0.042992555,-0.23438096,-0.06870774,0.2056666,0.3961466,-1.0784202,0.30983597,-0.4436805,0.09581748,0.8099344,0.20625584,1.1077071
81,-0.06419319,-1.2119411,-0.99601144,-0.093048,1.5890661,0.10334183,-0.7085963,0.021230103,-0.2273338,0.15362996,-0.19478023,-0.28890672,-0.5350455,0.37662718,0.18077184,-0.396975,-0.9047967,-1.5517988,-0.38885587,-0.48245502,-1.5038261,0.90220076,-0.77675,-1.1725233,1.498307,-1.0228566,-0.49365708,1.4302049,-0.36442173,-0.5510638,0.68442017,-0.042356927,-0.21138084,-0.22615544,-1.0684031,-0.90889555,-0.6467401,-0.3689491,-1.7615737,-0.49656507
82,0.3473105,1.3579205,0.00899147,-0.45424283,-0.0655891,-1.8511761,0.05146234,1.643352,0.22427611,0.51711726,1.2608247,-0.33720526,-0.16840531,0.8299731,0.48037943,-1.0110571,-0.46885687,-0.03225941,-0.46570042,-0.49051628,0.70028573,-0.4156884,-1.3012515,1.3088691,-1.0366467,0.97759205,0.28911117,0.18432215,-0.18758583,0.7368816,-0.41019478,0.39340943,1.695825,0.33985063,0.5740302,-0.3187813,-0.05850996,-1.755275,1.5139521,0.51323026
83,0.7456543,1.4485265,1.5746025,0.31879354,1.5424224,-0.30264983,-1.7326589,1.1222242,-1.6651305,-0.15426457,-1.3002721,0.40758297,0.6515868,0.567512,-2.0853062,0.74218875,0.41480398,-0.79347205,0.74941194,-1.9355466,-1.2715509,1.1850357,-0.1525025,0.20625548,-0.4144785,-1.0023861,0.9297587,-0.34426117,0.40328556,0.5722738,0.7496368,-0.20677745,-2.7739859,-0.31023058,1.2118747,-0.55250263,-0.17996076,1.1811754,1.4957582,-0.9156692
84,-0.27231908,-0.5185325,-0.13816659,-0.18571483,0.18854652,0.10122976,0.5343419,0.07838275,-0.47968808,-0.45250714,0.731567,-1.7637959,1.3643143,0.2344799,0.35793182,-0.81027037,0.37198573,2.1938493,-1.9918287,-0.6541733,0.4646425,1.3740824,0.78517777,0.11041847,0.32738885,1.1801642,2.1608682,0.9356305,-1.4629512,1.6408309,0.3614981,-0.03093787,-0.020231891,-1.4211028,0.2614117,0.2792395,1.1403781,-0.6156356,0.2107735,0.089068286
85,1.1388513,0.107967995,-0.054439034,-0.16906299,-0.73464626,0.12088418,-0.53581154,0.20805684,-0.56891453,0.7142063,0.4067467,-0.59564906,0.5856986,0.6893652,-0.01103416,0.1280054,0.25341687,-1.5391831,0.17062402,-0.24585763,0.2541107,-0.5502317,0.65953296,-0.11582008,0.60099816,-0.114555866,0.21501766,0.38216513,-0.6383957,-0.8120045,0.15247446,0.68200386,0.14865842,0.41191393,-1.3497982,0.9174061,0.82857174,0.1338278,0.4201522,0.58184206
86,0.25447744,0.54209596,-0.40449098,0.82133687,-0.0046751704,-0.20488366,-0.68749505,-0.508273,0.23605525,-0.27699304,-0.00439687,-0.2299387,0.040966325,-0.20105128,-0.022735719,-0.77443814,-0.24223089,0.10165467,-0.30999768,0.28867912,0.11358621,-0.56816024,0.30908218,-0.51950425,-0.44180804,0.33007386,0.22954212,0.12961648,-0.46515104,-0.6747439,0.22948039,0.08099618,0.095794566,-0.5593678,-0.16564383,-0.60155225,0.045135465,0.9127769,0.36422834,0.08594457
87,0.3695411,0.06211987,0.010334432,-0.10419775,-0.04549958,-0.11903716,-0.05155468,-0.5627394,0.25042543,0.18881065,0.48029238,-0.05777356,-0.4612817,-0.40220317,-0.12004817,0.06485861,0.008215506,0.20210518,-0.12974283,0.0868763,-0.09794068,-0.5767132,0.39598975,-0.6457164,-0.17928304,0.380536,0.1120251,-0.16905265,-0.246424,-0.23703143,0.12389786,0.15660977,0.34189048,-0.2611515,-0.1339829,-0.03980643,-0.03520133,0.27011004,0.11575619,0.052808195
88,0.2981656,0.22578283,-0.5714444,-0.11848607,0.6689782,-0.6287826,-0.2027107,-0.23408574,0.25496778,-0.35634902,0.5514173,-0.06449695,-0.037487403,-0.029941471,-0.3113152,-0.13797742,-0.7326761,0.084399074,-0.30728355,-0.17349486,-0.049794335,-0.4614033,-0.26294687,-0.32301608,-0.3199987,-0.11610892,-0.12879868,0.051867865,-0.10604843,-0.87189096,0.026513198,-0.2708951,0.49898818,-0.7212088,-0.0044599352,-0.63326705,-0.3061408,0.34043235,-0.58225435,0.055280272
89,0.5637903,1.027073,-0.24454194,0.4632681,0.1988768,-0.3531487,-0.38005197,-0.2687133,0.181961,-0.24180663,0.94413775,0.32636613,-0.4399427,-0.16925348,-0.6443081,0.10656409,0.23982081,-0.4300628,0.29108667,0.09776925,-0.34407136,-0.42542788,-0.099518396,-0.34002447,0.16117696,0.29158854,0.14968349,0.47951442,-0.5930283,-0.16794834,0.1389532,0.5631079,0.4647114,0.4651203,-0.1264788,-0.59360504,-0.06161545,0.65914917,0.59677017,0.25953695
90,0.39053458,0.12339069,-0.0010919574,0.20551503,-0.15462099,0.14166784,-0.87852716,-0.12135505,0.27080142,0.31140777,0.324198,0.36347115,-0.14377755,0.050520923,-0.052943885,0.42270514,0.23439617,-0.16063939,0.29173717,0.19765224,-0.26930824,0.026608856,-0.2596769,-0.5055976,-0.17323713,-0.2294551,-0.035314776,0.48351106,-0.18640424,-0.1099928,0.29800743,0.49067247,-0.1402432,0.40563297,0.061689552,-0.62570304,0.04134582,0.5490881,0.5378843,0.14986898
91,0.03483078,0.525166,-0.02231266,0.3247527,-0.21723647,-0.1325197,-0.40598544,-0.5060634,0.53354603,0.23714475,-0.24486479,-0.12349197,-0.3373643,-0.3510602,-0.28180844,-0.5187357,0.07387427,-0.4797159,-0.07902175,0.18451646,-0.061980918,-0.4268344,-0.053044096,-0.43187895,-0.20771195,0.06852392,-0.30442387,-0.03111719,-0.22559282,-0.61421084,0.60124665,0.07434895,0.33352405,-0.043296415,0.036282208,-0.37157515,0.06407931,0.73221016,0.086747535,0.15974768
92,0.2470402,0.27224442,-0.46172282,0.19975019,0.39583805,-0.38992327,-0.41631433,-0.3763063,0.6241101,0.028870298,0.5187965,-0.0012678548,-0.51083326,-0.5626805,-0.15351501,-0.037366822,-0.46111813,0.1011818,-0.4791194,0.09408628,0.00471244,-0.35141987,-0.11450915,-0.8647254,0.045041613,0.20029159,-0.30896345,-0.15970455,-0.62413055,-0.28851163,0.13601041,0.23653603,0.6656005,-0.06088324,0.20421404,-0.4417516,-0.051548533,1.0324008,-0.012471511,0.07259618
93,0.19242203,0.39289728,0.0018648005,-0.032293815,-0.15515473,-0.5625161,-0.12176754,0.1349687,0.7844857,0.12607378,1.0023879,-0.084661596,-0.018023225,-0.031568546,-0.15759575,0.17225966,0.086435355,0.41811848,-0.2942288,0.34683865,0.18094252,-0.5580418,0.084901266,-0.39115307,-0.53688794,0.6671773,0.06475513,0.19414179,0.0721479,0.09080993,0.23948917,0.3576387,0.7497865,-0.111426026,0.51730317,-0.3578525,0.19578828,0.7067405,0.39483154,0.37431893
94,0.31719166,0.8756581,0.0211139,0.16616458,-0.012736566,0.05510223,-0.73855066,-0.58203536,-0.37379333,-0.07279472,0.44282553,-0.5898146,-0.7783947,-0.19848908,0.048402645,-0.4396548,-0.10324462,-0.6815298,0.21183223,0.03531835,-0.007452396,-0.54992414,0.23564227,-0.15986876,-0.101747654,-0.49458516,1.0942516e-05,0.29863513,0.077237226,-0.5953074,-0.04712827,0.15257356,-0.27980348,-0.08226152,-0.44034865,-0.2782865,-0.48061445,-0.31865174,0.7439576,0.47252622
95,-0.33716884,0.22023234,-0.5247756,0.6616544,0.4203081,-1.1753614,0.4030179,-0.1943139,-0.4278345,0.32758585,0.32735783,-0.0388995,-0.73500365,-0.4990322,0.15952957,-0.0755943,0.36129913,-0.93904454,-0.57495236,1.4640403,-0.027319042,-0.6489903,-0.35963178,-0.06553691,0.18618259,-0.4553959,0.24805,0.8046952,-1.1049851,-0.29925624,0.9635141,0.77859426,0.4746139,0.5094777,0.18399514,-0.2720346,0.63581836,-0.33464167,0.14595035,0.6866443
96,0.11944579,0.06828211,-0.08389159,0.48490015,-0.09482303,-0.015134816,-0.17710999,-0.6089893,0.3607133,0.110856794,-0.110459186,0.061157055,0.19093068,-0.3626314,-0.0074717677,-0.17259648,0.26124045,0.16305862,-0.16178016,0.5750602,-0.06943528,-0.4807435,0.22597791,-0.38989058,-0.29981825,0.324287,0.018883878,-0.3410106,-0.37740347,-0.62993103,0.34279492,0.12980308,-0.102140106,-0.33170363,0.14820494,0.051358294,0.12063628,0.71263015,0.0120653445,0.104724355
97,0.3758759,0.82498187,0.3785567,0.02783767,0.22745867,0.13868748,-0.69576776,-0.6670407,0.4862682,0.03834656,0.631734,-0.4497731,-0.7996355,-0.8320215,-0.4653205,0.28993756,0.20196739,-0.12690075,0.31845278,0.17985831,-0.05598828,-0.7074205,0.02720037,-0.6045189,0.023450546,0.4166895,-0.5119419,0.07908892,0.0805485,-0.19138828,0.39524242,-0.1320192,-0.04655343,-0.019180546,0.3231923,-0.31682664,-0.4981919,1.164631,0.71550757,0.4369423
98,0.5539858,0.5227718,0.3037934,0.5034501,0.7036642,-0.49617374,-0.4826236,-0.2623041,-0.12690462,0.018559342,0.29555106,0.02219555,-0.27849373,-0.4227061,-0.49367452,0.07816752,0.21134534,-0.74151236,0.3808734,-0.15130967,-0.12387474,-0.5781253,-0.25322095,-0.21886794,-0.24423008,0.16034462,0.08159767,0.11914336,-0.22787535,-0.10220875,0.14104351,0.2938828,-0.08115832,0.093191236,0.47110566,-0.17904423,0.011306915,0.65709823,0.43657854,0.47596738
99,-0.18794215,0.5406858,-0.94196105,0.5550038,0.36614686,-0.54652554,0.36041608,-0.3139144,-0.3544003,-0.31916064,0.39303294,0.27934092,-0.39439818,-0.05467965,0.058600236,-0.23971921,-0.5122311,0.6541718,-0.4895294,0.32215536,-0.28149283,-0.7698581,-0.4641422,-0.023689136,-0.28562605,0.46552497,0.37385738,0.016254783,-0.3323468,-0.34492168,0.148027,0.3899831,0.5541443,-0.03966308,0.29268023,-0.4722309,-0.2963816,-0.27258524,-0.10538225,0.08562752
