,0,1,2,3
0,-0.2255520960926838,-0.08288735949249801,0.06842373494569046,0.3147942547868602
1,-0.22555209609268934,-0.08288735949249795,0.06842373494568978,-0.06662514059238295
2,-0.22555209609267832,-0.08288735949249805,0.06842373494568957,-0.13805458415149618
3,-0.22555209609268106,-0.08288735949249802,0.06842373494569026,-0.052835243704641675
4,-0.22555209609270171,-0.08288735949249797,0.06842373494569123,0.5113557561302213
5,-0.22555209609268934,-0.08288735949249793,0.06842373494569157,0.06256887868594099
6,-0.22555209609269208,-0.08288735949249794,0.06842373494569202,-0.09241890837389573
7,-0.22555209609269483,-0.08288735949249797,0.06842373494569128,-0.33496976393254746
8,-0.2255520960926979,-0.0828873594924979,0.06842373494569085,-0.2038152488480589
9,-0.20527120483739966,0.3476910555694444,-0.6766562882769482,6.245004513516507e-16
10,-3.233140397763476e-14,0.7965903597260746,1.0078972964374793e-16,0.0
11,0.20527120483742373,0.3476910555694437,0.6766562882769482,-6.168893521008024e-16
12,0.22555209609266008,-0.08288735949249776,-0.06842373494568967,-0.2062692758446309
13,0.2255520960927041,-0.08288735949249784,-0.06842373494569111,0.34230085728922266
14,0.2255520960926986,-0.08288735949249786,-0.06842373494569015,0.01249855099172047
15,0.22555209609270963,-0.08288735949249805,-0.06842373494569266,-0.3301966605907317
16,0.22555209609270135,-0.08288735949249798,-0.06842373494569133,0.009483511864325231
17,0.22555209609267385,-0.08288735949249786,-0.06842373494568944,0.3800761404383559
18,0.22555209609269447,-0.08288735949249794,-0.06842373494569091,-0.01564914121616726
19,0.22555209609269036,-0.08288735949249786,-0.06842373494569072,-0.1820123009634519
20,0.22555209609269172,-0.0828873594924979,-0.06842373494569098,-0.010231681968641963
