,0,1,2,3
0,0.08208922121762335,0.0820892788208878,0.0,0.0
1,0.07920335006320585,0.07920341152571901,0.01311035858988546,0.013110349183381461
2,0.074325094919642,0.07432516437274041,0.02589092218340259,0.025890904546791674
3,0.06757716975591485,0.06757725078024793,0.0380201918760774,0.03802016830892089
4,0.05912932065025765,0.05912941605169421,0.049193052256548644,0.0491930260770402
5,0.04919405577672371,0.0491941673939161,0.05912844667611078,0.05912842206904929
6,0.03802129969843019,0.03802142824994178,0.06757644731287756,0.0675764291356938
7,0.025892106440330027,0.025892251417854156,0.07432454218098526,0.07432453573493301
8,0.013111589491049905,0.013111749103637162,0.07920298093323609,0.07920299170818551
9,0.00012590475311969837,0.00014319316774315602,0.08208904498191551,0.08208907838423393
10,-0.0008409985276751323,0.0008437599388271103,0.0008409985277992622,0.0008437599387033957
11,-0.0820890449698378,0.0820890783963117,-0.00012590475309864118,0.00014319316776166132
12,-0.07920298092158297,0.07920299171983862,-0.013111589489120785,0.013111749105566298
13,-0.07432454217004995,0.07432453574586832,-0.025892106436520512,0.025892251421663653
14,-0.06757644730293508,0.0675764291456363,-0.03802129969283611,0.038021428255535825
15,-0.059128446667411225,0.059128422077748856,-0.04919405576948584,0.049194167401153996
16,-0.049193052249310906,0.04919302608427796,-0.05912932064155798,0.05912941606039391
17,-0.03802019187048349,0.03802016831451477,-0.06757716974597225,0.06757725079019056
18,-0.025890922179593257,0.025890904550601005,-0.07432509490870659,0.07432516438367587
19,-0.013110358587956544,0.0131103491853104,-0.0792033500515527,0.07920341153737216
20,-1.389044044066621e-17,-2.77809005946766e-17,-0.0820892212055456,0.08208927883296556
