"","V1","V2"
"1",-0.914151421603846,-1.38796900542744
"2",0.742173696358674,1.55124097956156
"3",-0.15111470152295,0.182601294622568
"4",-0.983308492007757,-1.25683192777519
"5",-0.878666469601605,-1.42076430174994
"6",-0.172164564398466,0.0816623939289312
"7",-12.0071228296934,6.19493674198633
"8",-0.754813427772106,-0.697383771216557
"9",0.882226744334679,1.60594066807527
"10",-11.8998420896273,6.42384167911867
"11",-11.7470707480062,6.32425156545127
"12",-1.09432158947539,-1.20276249277534
"13",0.789188862741639,1.78084571926322
"14",0.741254005885863,1.08868454715647
"15",-0.927407369114281,-0.973231487405868
"16",10.245520633783,-2.22074653004602
"17",-2.49873009149316,4.45370856860756
"18",-5.26395124082613,-11.685243029621
"19",3.16655980726915,10.732710470793
"20",-2.83873443650548,4.60114779375252
"21",7.22578654939765,-5.33749465244339
"22",0.623081948165255,1.96651735578631
"23",-0.761220784572834,-1.44633512888387
"24",3.08557573010687,11.0304697387791
"25",10.1102414416917,-2.36015672896388
"26",7.43002872611178,-5.49891166133822
"27",-4.98209855915628,-11.6690286864168
"28",-0.382264443914993,1.141400015736
"29",-5.3365152419173,-11.7440527646627
"30",-11.8832220681732,6.22414217367516
"31",10.2674778185823,-2.24100900519856
"32",-4.94711562708535,-11.6214801623571
"33",-0.132378088123062,0.152111876032916
"34",2.85539101451432,11.2492188058689
"35",1.05842338956707,1.35532300648456
"36",-2.74015966386269,4.73805805345545
"37",-11.5579963833045,5.86758312346327
"38",7.16030936903901,-5.54092042284584
"39",0.18229063833703,1.538497819099
"40",-5.40333750897451,-11.3462700358894
"41",-5.29862457235638,-11.3326868671311
"42",6.76031457159347,-5.46664702674347
"43",10.3888837578923,-2.02594597578654
"44",-4.99633311417263,-11.1167281959754
"45",3.10561645186372,10.7711605593464
"46",0.315260928919366,1.38261000468422
"47",-5.15960532087674,-11.4950241877099
"48",6.6928320710426,-5.3503027696748
"49",7.02792188273471,-5.70044070612217
"50",0.27435929519985,2.06879938783407
"51",-11.7927920178456,5.83100193462218
"52",7.1698764053763,-5.58106953198559
"53",10.2380877897242,-2.36941883837793
"54",-11.8762521619879,6.57927432244242
"55",0.590097176601537,1.78938048833145
"56",1.07996424412662,1.28137938553836
"57",0.0751495818404457,1.28242266207469
"58",1.21365395693656,1.12091751873852
"59",9.96905623065965,-2.35100875979802
"60",0.186130398646942,2.03176845609731
"61",-11.6133876696686,6.39015057388783
"62",7.49750309993133,-5.6146056145444
"63",-2.86013674734431,4.85639396906972
"64",0.159265028092553,1.77885481644408
"65",0.669162557914769,1.30465800874777
"66",2.80390430570859,11.2982856652501
"67",9.95089620590473,-2.43603036084321
"68",-0.429124296707071,1.11620621802763
"69",-1.16135558038401,-1.29410066467107
"70",2.985745995735,11.1676061118101
"71",2.99668619389411,11.1102089595725
"72",-4.96535616809627,-11.5127870240217
"73",-0.473590521450894,1.22192756611601
"74",10.6000133931837,-2.44579361789408
"75",7.25682841517247,-5.9259067651867
"76",-2.53068256457296,4.61949477000426
"77",10.1587962807031,-1.93133997973849
"78",-11.9733613932454,6.10301344671984
"79",-4.78696883885475,-11.3067889123223
"80",2.75227450381389,11.1189934250572
"81",10.2482813143937,-1.84922519499498
"82",-5.34196549897962,-11.7740324060176
"83",0.529075646559183,2.11434659847995
"84",-2.57201140495075,4.68784488147698
"85",-5.09303712629122,-11.8152086144189
"86",2.51265990376148,11.3782529107975
"87",-5.19263126950934,-11.7262706251622
"88",7.49378200035773,-5.33147070432299
"89",-11.7783926301981,6.66526239363423
"90",-2.70686138075245,4.74019225990625
"91",0.91189827925307,0.795330791942795
"92",0.0275861825527564,1.93128276103662
"93",-11.8565462227723,6.65121839367239
"94",-12.1664583268781,6.37787060532713
"95",0.504247770203456,1.51579036038846
"96",-0.355980359002525,-0.225693472098452
"97",10.0862034660172,-2.07154376615883
"98",7.37733287645867,-5.57604264510427
"99",-2.44778802253878,4.33745746343808
"100",10.5120725115138,-2.42754703939285
