"","V1","V2"
"1",-5.68541365276874,8.89532290529615
"2",-3.74146053114391,1.48990178228194
"3",-6.33752381307105,13.0154068836004
"4",-5.18605034157082,12.6983675282816
"5",-5.79096372569355,12.5339104259662
"6",-5.29908961764515,13.3957518301603
"7",-5.50414785715557,10.6031920116328
"8",-5.7446379743614,13.484511095597
"9",-4.6217085307808,13.280418100834
"10",-0.466197513043013,6.33991830932725
"11",-5.00211935266395,14.5029491746702
"12",-5.61981854083753,14.1809609647782
"13",-5.58530118721941,11.1061302309512
"14",-4.80660621799946,13.8597455631139
"15",-6.1932122739362,13.9415202054881
"16",1.28157509211268,2.86177947587307
"17",6.7802247385516,2.60112326529851
"18",-0.392589743816272,6.58322989318594
"19",-8.10863469495991,-2.72183114293723
"20",-5.29172001158224,6.85271722224881
"21",9.41153148700052,1.37053066759967
"22",-2.45848503097761,-2.73273471565416
"23",6.99400826271587,-5.75289315239044
"24",-5.04499567526861,-10.2686158459657
"25",6.44477568146639,-8.69384150926899
"26",6.39108857863675,2.52220231411549
"27",7.32698398412436,-6.65823740349481
"28",-5.83609094476084,-9.80094965420504
"29",10.0134895329498,-6.36413710728831
"30",-5.61016696486873,2.48586908952749
"31",-7.51236795620055,-4.0654819463762
"32",3.46839636422012,-3.63145191041284
"33",9.95369842811526,-5.8645024052663
"34",0.103103461115416,-3.89643269242247
"35",-5.49480261707588,-8.24318049955333
"36",9.06506448791891,3.93239269639001
"37",1.08874721057424,0.27421370894523
"38",8.20340589242482,1.00314637904292
"39",-7.51089649263896,-8.60015748919024
"40",-8.37058025229538,-2.54978025063525
"41",8.54864238672182,0.631038568924932
"42",8.57008251675064,-4.589815632702
"43",2.59500318306252,-2.14582452348621
"44",-7.13918677654186,-10.1725168834449
"45",-7.33066553814121,-10.8396482018313
"46",6.93738285420618,3.35557511885578
"47",9.31277971229152,-4.07005719059358
"48",9.66980484373454,-0.0187497433520614
"49",5.63757309775375,2.5347891595847
"50",7.91855581007231,-7.38625921544825
"51",0.359634076221789,-3.11665548544343
"52",-5.50563421218005,5.66640394120076
"53",-7.50059943936533,-9.39552089138623
"54",7.63766381210227,-6.60083232970428
"55",6.60691189318113,-6.09017267195254
"56",10.8541686798593,2.29934372339056
"57",-7.70151909802556,-7.95386108760525
"58",-2.14021782826038,-2.20581933705512
"59",-9.34755970684619,-2.15626144130828
"60",8.44852834296063,-6.05523073236344
"61",-6.02061688412388,-8.88513431030992
"62",1.24796351349761,1.84430184326845
"63",10.1322694194775,-0.472229798519819
"64",5.09195419461082,-6.04190834099729
"65",-4.35384676476856,1.89087641095061
"66",5.01802736742615,-6.13395674234836
"67",-4.52032512555135,0.432373138578649
"68",-4.14418902494684,-0.443422854346703
"69",6.4944425076315,-8.49481071053417
"70",-8.8275306206377,-1.95416440720957
"71",-7.19863758314796,-7.86017028574423
"72",-10.0192124915351,-2.33918949357354
"73",2.79645069705085,-1.13574047712574
"74",5.57749901756503,-2.22599988401552
"75",10.2937965739972,-0.511189225938307
"76",-5.30625611188928,6.95342659571204
"77",-6.11979009119673,-8.81683444912307
"78",4.43038572307763,1.05917472521964
"79",9.09535579541131,-5.77417736435036
"80",9.33466410052222,2.69124068305426
"81",-0.00455301405066259,0.00311320670191939
"82",7.27794657069741,-3.99901060162151
"83",-6.74153503216375,-9.05117213921386
"84",-0.302856839073506,6.91781039671024
"85",-7.49986185996124,-4.41442496389262
"86",9.54071952120838,2.47714059649619
"87",-2.49589684692359,0.423471788543237
"88",-0.0956474896168398,1.36949710729787
"89",-1.95532916798854,0.0297160298282114
"90",-1.40703715279461,1.78870126160901
"91",-1.65807589022987,0.399219689991053
"92",-1.57800167202685,-0.609835957888739
"93",0.21479118627102,0.802475312934882
"94",-1.81326525636001,1.97782561763284
"95",-1.29103311906062,-0.353763078384363
"96",1.22934709378642,-1.88450168759872
"97",0.889410623918324,0.872566692224715
"98",-0.712469949807133,2.19895838096079
"99",-1.14688180176924,3.24799442491169
"100",0.805965586325474,-1.63915627331486
