"","PC1","PC2"
"1",-3.1009347411711,-0.0363483015484869
"2",-3.11703404281812,0.0532127133608382
"3",-3.24213543335363,-0.159761722128124
"4",-3.41125280036221,-0.17964315618708
"5",-3.23587808246853,-0.129674525033646
"6",-3.49783208845886,-0.287636337772559
"7",-3.32610729184558,-0.120901132169031
"8",-3.2008890639344,-0.0824055253367164
"9",-3.11161351821445,0.0144656597607115
"10",-2.34214874281195,0.429730984193351
"11",0.734553865635637,1.43048265104014
"12",2.61604716941227,0.435248879507504
"13",3.07987419938457,-0.154594978330811
"14",3.10316130533977,-0.169431521190701
"15",3.08812683029062,-0.0552998902707767
"16",3.19735341619042,-0.156550769391392
"17",3.15430089706035,-0.12548447729301
"18",3.1615361806273,-0.192440507669645
"19",3.18699711795424,-0.207826903436862
"20",3.19443676373295,-0.245818363853115
"21",3.0694380598107,-0.0593227762505884
