"","PC1","PC2"
"1",1.98785646813288,-1.03652443355764
"2",1.60064314073428,-1.16590985978039
"3",1.17316527050024,-1.26596647427223
"4",0.716176160623823,-1.33417732294622
"5",0.241171476254362,-1.36882654149208
"6",-0.239899931577801,-1.36904251845638
"7",-0.714936602030645,-1.33481982088925
"8",-1.17198887945441,-1.26701933101155
"9",-1.59955950970139,-1.16734659046432
"10",-1.98345974937498,-1.03988274644611
"11",-4.6269654774278e-12,4.92759614253817e-10
"12",1.98345974886955,1.03988274656473
"13",1.59955950929385,1.16734659047411
"14",1.17198887915582,1.26701933093598
"15",0.714936601848531,1.33481982075548
"16",0.239899931516778,1.369042518293
"17",-0.241171476192732,1.36882654132847
"18",-0.716176160441061,1.33417732281174
"19",-1.17316527020091,1.2659664741955
"20",-1.60064314032589,1.16590985978859
"21",-1.98785646762567,1.03652443367581
