"","PC1","PC2"
"1",1.98785646778387,1.03652443363896
"2",1.60064314045326,1.16590985978604
"3",1.17316527029427,1.26596647421944
"4",0.71617616049806,1.33417732285369
"5",0.241171476211949,1.3688265413795
"6",-0.239899931535817,1.36904251834396
"7",-0.714936601905341,1.3348198207972
"8",-1.17198887924896,1.26701933095954
"9",-1.59955950942097,1.16734659047105
"10",-1.9834597490272,1.03988274652772
"11",1.7421619702418e-12,1.85365736215387e-10
"12",1.98345974921733,-1.0398827464831
"13",1.59955950957428,-1.16734659046737
"14",1.17198887936128,-1.26701933098797
"15",0.714936601973848,-1.33481982084752
"16",0.239899931558774,-1.36904251840542
"17",-0.241171476235132,-1.36882654144105
"18",-0.716176160566812,-1.33417732290428
"19",-1.17316527040687,-1.2659664742483
"20",-1.60064314060689,-1.16590985978296
"21",-1.98785646797467,-1.0365244335945
