,0,1,2,3,4,5,6,7,8,9,10,11,12,13,14,15,16,17,18,19,20,21,22,23,24,25,26,27,28,29,30,31,32,33,34,35,36,37,38,39
0,3.1667447090148926,1.010947346687317,1.417778491973877,3.5427651405334473,-0.5287680625915527,0.6468983292579651,0.0804971233010292,0.7682769298553467,0.24041715264320374,1.5268269777297974,-0.33922699093818665,2.0746378898620605,0.5030258297920227,-0.254685640335083,-3.4197893142700195,-3.514538049697876,2.582357168197632,0.17885980010032654,3.0861456394195557,1.9720505475997925,1.4186536073684692,1.577030897140503,2.2832138538360596,-0.3969898819923401,2.982429027557373,-0.40058478713035583,0.19723393023014069,2.6549928188323975,2.694838047027588,1.489169955253601,-0.6982597708702087,-1.2576831579208374,2.754875898361206,-1.0037710666656494,-0.3066183626651764,0.7789175510406494,-0.10173504054546356,0.6553239822387695,3.0628037452697754,-3.0174453258514404
1,2.3715102672576904,0.9013590812683105,1.1087812185287476,2.8074514865875244,-0.7460417151451111,0.31748199462890625,-0.23450003564357758,0.7794472575187683,0.4210965633392334,0.9969938397407532,-0.12189079821109772,1.3624225854873657,0.9363119006156921,-0.12671275436878204,-2.377460479736328,-2.603822946548462,1.5146676301956177,-1.0686737298965454,2.9927573204040527,1.1443637609481812,1.5760754346847534,-0.6842691898345947,-0.14955121278762817,-0.13959456980228424,1.6657930612564087,0.5384956002235413,0.7666345834732056,0.27010029554367065,3.106921434402466,0.2353733479976654,-1.0640760660171509,-0.9416908025741577,0.6611536741256714,-1.971035361289978,0.6533355116844177,-0.8771355152130127,0.8309094309806824,0.18361204862594604,0.9552858471870422,-2.9882562160491943
2,2.6516611576080322,1.072452425956726,1.8067431449890137,0.9212872385978699,-1.2694870233535767,-2.2370471954345703,-0.1357611119747162,0.5471723675727844,0.9030318260192871,2.486917018890381,-2.3262510299682617,0.5131035447120667,0.1729637086391449,1.6150827407836914,-1.8912053108215332,-1.188520073890686,1.1908599138259888,-1.729535698890686,1.4592580795288086,0.4976455569267273,0.5293461680412292,-0.0992274209856987,3.0783112049102783,-0.7152171730995178,0.6005373597145081,-1.6455633640289307,0.7009207606315613,2.0291953086853027,2.3761677742004395,1.036700963973999,1.2499887943267822,-1.004029393196106,1.3014323711395264,-1.2091064453125,0.6569571495056152,-0.13508498668670654,-1.0441004037857056,0.47190821170806885,3.2496349811553955,-0.3494235873222351
3,1.7615785598754883,0.9806450009346008,0.6355596780776978,2.7367897033691406,-0.6579333543777466,1.187572717666626,-0.590305745601654,-0.3951806128025055,-0.6319644451141357,0.7761267423629761,-1.3415380716323853,1.4457366466522217,0.405271977186203,1.3027962446212769,-2.638232469558716,-2.189441204071045,1.4948440790176392,0.4814991056919098,1.7385085821151733,1.796178936958313,0.8102304935455322,1.6733728647232056,1.0832535028457642,-1.0282500982284546,1.3992512226104736,0.40816530585289,-0.8698182702064514,1.8863110542297363,1.4052528142929077,1.1630885601043701,-1.4408903121948242,-1.4560637474060059,1.7972408533096313,-0.4153549373149872,-0.8753438591957092,1.0113569498062134,0.08383986353874207,0.5901594758033752,1.3150967359542847,-2.713106393814087
4,1.7944601774215698,1.6855311393737793,0.8869013786315918,2.400399684906006,-1.0445352792739868,1.6007068157196045,0.08674084395170212,0.36870434880256653,0.6584548354148865,1.617814302444458,-0.15684689581394196,1.3634921312332153,0.3725956976413727,0.19304034113883972,-1.8236191272735596,-2.397000312805176,1.0000097751617432,0.49463194608688354,1.8502310514450073,1.6405943632125854,0.49962174892425537,1.5002636909484863,1.820145845413208,-0.7239043712615967,2.157564640045166,0.14835967123508453,-0.0523906834423542,1.587827444076538,1.548124074935913,0.9949578642845154,-0.6708196401596069,-0.6776387691497803,2.210914134979248,-0.1708684265613556,-0.4135601222515106,0.9029839634895325,-0.32124027609825134,0.8375940322875977,2.0156261920928955,-1.698216199874878
5,2.1965367794036865,0.7999393939971924,0.8057336211204529,2.2314727306365967,-0.8716661930084229,0.7607669234275818,-0.13225437700748444,-0.2583301067352295,0.26412948966026306,0.5947994589805603,-0.894934356212616,1.8647797107696533,0.1924365609884262,1.1671316623687744,-2.0639259815216064,-2.475069284439087,2.333787679672241,0.2928807735443115,1.441933274269104,1.044933795928955,0.603304922580719,2.144146680831909,0.9749589562416077,-0.864398181438446,1.4548602104187012,-0.20992611348628998,-0.45429882407188416,3.0044503211975098,0.8145191669464111,1.444911241531372,0.1346345990896225,-1.5951087474822998,2.0022501945495605,-0.32551446557044983,-0.31888827681541443,1.3482602834701538,-0.10883012413978577,-0.20834539830684662,1.9220858812332153,-2.140202522277832
6,1.8706320524215698,1.006009578704834,0.48269110918045044,3.1753218173980713,-0.18177063763141632,1.3816194534301758,-0.9198333621025085,-0.42420631647109985,-0.6276789903640747,0.8877421021461487,-1.3532793521881104,1.5830743312835693,0.39683374762535095,1.3847190141677856,-2.577589511871338,-2.2311737537384033,1.5416020154953003,0.6189634799957275,1.7162082195281982,1.9013433456420898,0.9601679444313049,1.617352843284607,0.9516056776046753,-0.8166720867156982,1.2424317598342896,0.4536009430885315,-0.9213219285011292,1.9899077415466309,1.4543144702911377,1.127157211303711,-1.3980368375778198,-1.4466164112091064,1.6540199518203735,-0.19778825342655182,-0.7620552778244019,1.2393553256988525,0.0055699958465993404,0.530463457107544,1.3292572498321533,-2.5362627506256104
7,1.9611897468566895,0.6235904097557068,0.7411844730377197,2.242969036102295,-0.1889834851026535,0.21031910181045532,-0.22254392504692078,0.3200015425682068,0.09143190830945969,0.7422288060188293,-0.4136474132537842,1.0283846855163574,0.6809531450271606,-0.4505673050880432,-2.3917644023895264,-2.0145347118377686,1.8195915222167969,0.10793931782245636,1.782536268234253,1.0853476524353027,1.0925089120864868,0.8059660196304321,1.1344457864761353,-0.3832032382488251,1.967867374420166,-0.3266989588737488,-0.16926217079162598,1.6361432075500488,1.7884035110473633,0.7667767405509949,-1.121068000793457,-0.8684966564178467,1.7529230117797852,-0.7141819000244141,-0.48184728622436523,0.3862621486186981,0.22037222981452942,0.17369034886360168,1.5757033824920654,-2.0711722373962402
8,1.8995373249053955,0.7517940998077393,0.6798139810562134,2.414783000946045,-0.27300843596458435,0.31766918301582336,-0.17598065733909607,0.2563207149505615,0.06779565662145615,0.9277744293212891,-0.512063205242157,1.250806450843811,0.5923542380332947,-0.35305917263031006,-2.1988723278045654,-2.00319504737854,1.870105504989624,0.19971223175525665,1.7726964950561523,1.2828971147537231,1.0798465013504028,0.7335785031318665,1.2347356081008911,-0.3006659150123596,1.9728974103927612,-0.2072381228208542,-0.21874333918094635,1.640086054801941,1.563387393951416,0.8679783344268799,-1.034305453300476,-0.7649739384651184,1.5200079679489136,-0.599057674407959,-0.3911146819591522,0.5714431405067444,-0.032266054302453995,0.23550306260585785,1.794569730758667,-2.01796817779541
9,2.844295024871826,0.9257965087890625,0.9947828650474548,2.879833459854126,-0.5192551016807556,0.39315691590309143,-0.35097894072532654,0.48371222615242004,0.5573011040687561,1.235685110092163,-0.25637179613113403,1.5735421180725098,1.1067383289337158,-0.3495883643627167,-2.332411289215088,-2.9109818935394287,1.3768891096115112,0.3044460117816925,2.612544536590576,0.7440347671508789,2.3765225410461426,-1.125244379043579,0.08721654862165451,-0.991047203540802,1.5076313018798828,0.6583642959594727,0.7628154158592224,0.37423133850097656,2.981210947036743,-0.33580201864242554,-0.9079314470291138,-1.521323800086975,0.5646595358848572,-2.3072972297668457,0.5714737772941589,-0.6120142936706543,0.5939648747444153,0.35583221912384033,1.0972411632537842,-3.026642084121704
10,1.9808616638183594,1.6640267372131348,-0.6062592267990112,1.4897443056106567,-1.9527474641799927,0.8220996856689453,-2.214940309524536,0.4825819730758667,0.023275960236787796,1.0355889797210693,-0.8440824747085571,1.1262993812561035,0.6320760250091553,0.1090693473815918,-1.6186031103134155,-2.362475872039795,2.260498046875,-0.09602435678243637,-0.9788178205490112,2.268221616744995,1.5396630764007568,1.1059062480926514,1.4835039377212524,0.2811960279941559,2.2413687705993652,-0.6186165809631348,-0.48349708318710327,1.5240367650985718,1.06775963306427,0.8522450923919678,-0.6982709765434265,-1.3016546964645386,1.7051661014556885,-0.06333696842193604,-0.6287018060684204,0.7409015893936157,0.07691123336553574,-0.11390213668346405,1.9268211126327515,-1.906702995300293
11,1.9593157768249512,0.6820594072341919,1.7387408018112183,2.7708323001861572,0.07675796747207642,0.422549843788147,1.3985652923583984,-0.41598543524742126,0.2658696174621582,0.9904744625091553,0.6941428780555725,1.8885588645935059,0.05570175498723984,0.6314155459403992,-1.74239981174469,-2.719190835952759,-0.932980477809906,0.9365622401237488,3.7770750522613525,1.0500507354736328,-0.019301243126392365,0.9134007096290588,1.5254018306732178,-0.8365206718444824,1.9536410570144653,0.1977693736553192,0.5870190262794495,3.1183605194091797,0.8237137198448181,1.6701170206069946,0.09859054535627365,-0.6623390913009644,1.5906733274459839,-0.7320975661277771,-0.12509578466415405,0.7476043105125427,-0.37837788462638855,1.3587565422058105,1.9523619413375854,-2.2409961223602295
12,1.9949073791503906,0.15554559230804443,2.625430107116699,0.9889776706695557,0.1460859328508377,2.246101140975952,1.364752173423767,1.093098521232605,2.043530225753784,-0.35782158374786377,-2.1371281147003174,0.2556159198284149,0.2507683038711548,-1.064680814743042,-2.2127270698547363,-2.5045087337493896,3.734785556793213,-0.10695762187242508,1.3403403759002686,0.07422453165054321,-0.7572745084762573,-0.04132856801152229,0.7039661407470703,-0.893066942691803,0.9910803437232971,-0.04037056118249893,-2.423858642578125,0.6547539234161377,1.653664231300354,0.4169445037841797,-2.552417039871216,-1.4937682151794434,1.1274830102920532,0.1526929885149002,-1.6006642580032349,2.0996198654174805,-1.7852585315704346,-1.5379639863967896,1.7487599849700928,-1.4418948888778687
13,2.592217206954956,2.11621356010437,1.4052196741104126,0.8868198990821838,-0.8130561709403992,-2.0798614025115967,-0.2920072674751282,-1.1090222597122192,0.5289115309715271,2.113895893096924,-1.9751460552215576,0.6768075227737427,0.7195157408714294,0.6305032968521118,-1.7565466165542603,-1.130116581916809,1.1082507371902466,-1.62497878074646,1.195460557937622,1.0189602375030518,0.8150937557220459,-0.3874422609806061,3.334167957305908,-1.4461615085601807,0.40277180075645447,-1.7526570558547974,0.06434263288974762,2.057894706726074,2.771333694458008,0.9038568735122681,1.2651005983352661,-1.0523945093154907,0.8335180878639221,-1.3030608892440796,0.4297492504119873,-0.282937228679657,-1.351108193397522,0.13435383141040802,3.799485683441162,-0.6424072980880737
14,0.9648881554603577,0.5842466950416565,-1.463118553161621,3.1012513637542725,-0.44458308815956116,0.28626057505607605,-0.5237956643104553,-1.5668649673461914,-1.1295145750045776,-0.22069896757602692,-0.03986643999814987,2.332932949066162,2.2992377281188965,-0.1207868754863739,-0.8042253851890564,-1.332412600517273,1.4070509672164917,1.5528521537780762,1.6022557020187378,1.0739402770996094,-0.12650516629219055,1.4257700443267822,-0.3793806731700897,-2.2145462036132812,1.3913782835006714,-0.4495868682861328,-1.2711313962936401,2.2856082916259766,-0.572511613368988,1.6631613969802856,-1.3165146112442017,0.6655786633491516,2.5183300971984863,-1.0207388401031494,-0.41401207447052,0.8004804253578186,0.33893027901649475,1.2229039669036865,-0.7840883135795593,-1.655854344367981
15,2.4519879817962646,1.0150630474090576,0.765130341053009,2.8014261722564697,-0.7598839402198792,0.16255323588848114,-0.34171006083488464,0.5199368596076965,0.14587974548339844,1.2289859056472778,-0.2844005823135376,1.4986075162887573,1.3702975511550903,-0.12450147420167923,-2.2362053394317627,-2.897228240966797,0.9351597428321838,-0.22137761116027832,2.7651114463806152,1.7437574863433838,2.064002275466919,-0.5206959247589111,-0.45122742652893066,0.0682186484336853,1.1208032369613647,1.018422245979309,0.5488114953041077,0.49282851815223694,3.4129772186279297,0.5533281564712524,-0.8656318187713623,-0.5884318947792053,0.5704308748245239,-1.817757487297058,0.23943445086479187,-0.981597900390625,1.027679443359375,-0.18496479094028473,1.1570440530776978,-3.036647081375122
16,1.5450347661972046,-0.5258676409721375,-0.22730931639671326,2.4208199977874756,-1.5010120868682861,-0.5276346802711487,0.0767253190279007,2.8249809741973877,-0.1718035191297531,1.8452131748199463,-1.4059598445892334,1.9016914367675781,-0.099112868309021,2.1234936714172363,-2.411034107208252,0.24703779816627502,1.2467495203018188,-0.1567934900522232,2.4058187007904053,-0.36147570610046387,0.6521099209785461,0.7057488560676575,2.7099215984344482,2.3169054985046387,3.1241703033447266,-1.0188655853271484,1.330291509628296,1.3016773462295532,0.42107558250427246,1.344283103942871,0.4797179102897644,0.2539452910423279,3.0490620136260986,-0.21338945627212524,0.00683937594294548,-1.1266446113586426,0.7904799580574036,1.8032702207565308,1.6862995624542236,-0.32999539375305176
17,2.6898159980773926,0.9808526635169983,1.0691090822219849,3.0480308532714844,-0.4956137239933014,0.11997676640748978,-0.10070043802261353,0.593152642250061,0.415617436170578,1.319158673286438,-0.19020257890224457,1.647193431854248,1.3111071586608887,-0.49728402495384216,-2.3470025062561035,-3.1531870365142822,1.5721040964126587,-0.20243266224861145,2.5670993328094482,0.8905603289604187,2.214038848876953,-1.0053379535675049,0.14531643688678741,-0.7317837476730347,1.549877405166626,0.6203444004058838,0.7925713062286377,0.342317670583725,2.950507164001465,-0.24473173916339874,-0.9442552924156189,-1.4638023376464844,0.5495821237564087,-2.3028147220611572,0.6061751246452332,-0.7125266790390015,0.7422713041305542,0.12544386088848114,1.0966291427612305,-3.025226593017578
18,2.0730342864990234,0.6855531930923462,0.7636384963989258,2.2832770347595215,-0.20483797788619995,-0.021760867908596992,0.07672468572854996,0.4096209406852722,0.4230968654155731,0.9359201788902283,-0.28372034430503845,0.9744836688041687,0.6441147923469543,-0.5783637166023254,-1.9849039316177368,-2.3029940128326416,1.789488434791565,0.004904155153781176,1.6119821071624756,1.1778991222381592,1.0449414253234863,0.7934185266494751,1.2986339330673218,-0.32250097393989563,2.262488603591919,-0.40875330567359924,0.017896883189678192,1.6127430200576782,1.7669535875320435,0.7648868560791016,-0.7728465795516968,-0.942390501499176,1.6010106801986694,-0.7600004076957703,-0.568077802658081,0.40499916672706604,-0.05485748127102852,0.19985739886760712,1.6584993600845337,-2.116612434387207
19,1.2127830982208252,2.4601218700408936,-0.7631533741950989,2.288053035736084,0.9908918142318726,0.12491399049758911,1.5938265323638916,0.4256347119808197,-0.35472244024276733,2.1878719329833984,1.463805079460144,-0.31652480363845825,-0.29837939143180847,1.4243749380111694,-0.6336814761161804,-3.273834705352783,1.4215580224990845,2.1965763568878174,2.471698760986328,1.5311408042907715,-0.09681238979101181,0.6450093388557434,0.05948792025446892,1.8041985034942627,1.0540577173233032,1.8768951892852783,1.4442763328552246,2.317293405532837,0.4870310425758362,1.1414666175842285,0.4738224148750305,-1.6895824670791626,-0.22153714299201965,0.7116943001747131,0.19674544036388397,1.4603700637817383,1.2281129360198975,1.3291552066802979,2.069927215576172,-2.536198854446411
20,2.2116382122039795,-0.7749499678611755,2.935863494873047,1.3303762674331665,-0.25205644965171814,0.6342723965644836,2.1859617233276367,0.11069929599761963,1.869491457939148,-0.13899558782577515,-1.68022882938385,1.858244776725769,-0.48058611154556274,-1.2702229022979736,-2.9663753509521484,-1.036274790763855,3.8852906227111816,-0.40371739864349365,1.3053712844848633,0.374417781829834,-0.6670358180999756,-0.022121895104646683,0.7319443225860596,-0.6912463903427124,1.8648908138275146,-0.6904069185256958,-2.529103994369507,0.6136617064476013,1.660565972328186,0.0724785253405571,-2.232527017593384,-0.9702459573745728,0.896702766418457,-0.24849136173725128,-1.6528716087341309,1.9423885345458984,-1.8728008270263672,-1.7329245805740356,1.6254675388336182,-1.7897248268127441
21,2.0119359493255615,0.8595820665359497,-0.9287102222442627,2.743504762649536,0.4055037796497345,0.9421710968017578,0.2736791968345642,-3.031157970428467,-0.29971522092819214,-1.231081485748291,-0.6840277910232544,1.6821324825286865,3.021681785583496,-0.3128325641155243,-1.912045955657959,-1.319522500038147,1.2577588558197021,1.545572280883789,1.947802186012268,0.9735128879547119,-0.6793042421340942,2.283517360687256,-0.5703662633895874,-1.9245344400405884,1.6052972078323364,-0.8571732640266418,-1.376465082168579,2.143314838409424,-0.6264128684997559,1.5555356740951538,-1.7100342512130737,0.7290138602256775,2.5463857650756836,-1.0864832401275635,-0.32889673113822937,0.7011760473251343,0.2659503221511841,1.1990808248519897,-0.7650755643844604,-1.5890051126480103
22,1.8297053575515747,1.1176677942276,-0.11461275070905685,1.513413667678833,-2.739246368408203,0.5650972127914429,2.3067362308502197,-1.1685523986816406,-2.217433452606201,0.3252549469470978,-1.1556299924850464,-0.5871686935424805,1.4922630786895752,0.6630475521087646,-1.9340589046478271,-2.483431816101074,0.22281281650066376,0.2755327522754669,1.2752071619033813,-0.4392455220222473,1.3244061470031738,2.7335855960845947,2.597686767578125,-2.2165374755859375,1.3259440660476685,-1.1508625745773315,-1.0785858631134033,2.113680839538574,0.22614850103855133,-0.1813281774520874,0.2455594539642334,-3.5378870964050293,1.418229579925537,1.2286415100097656,-1.4234950542449951,-1.1613688468933105,-0.268395334482193,-0.7868561744689941,0.8571491837501526,-3.0926880836486816
23,1.0017443895339966,0.4769851863384247,1.7956626415252686,2.395453929901123,1.5457711219787598,-0.05843120813369751,-0.9018639326095581,1.1567078828811646,1.2476762533187866,0.5880287885665894,1.2637604475021362,1.1414406299591064,-0.050880566239356995,0.651067852973938,-3.4750266075134277,-0.4813616871833801,1.5116405487060547,0.07643216848373413,2.0257742404937744,-0.6473552584648132,1.323398470878601,2.6033308506011963,-0.1018354594707489,0.6020928621292114,2.237771987915039,0.9062519669532776,0.8282078504562378,1.5136278867721558,0.6104797720909119,0.4359135329723358,-2.641526460647583,0.8447116017341614,1.3996130228042603,-0.40482228994369507,-1.7347532510757446,0.7906795740127563,1.9345568418502808,-0.9472612738609314,1.7059866189956665,-1.0278983116149902
24,0.9812807440757751,0.36948060989379883,1.7627739906311035,2.332915782928467,1.492152452468872,-0.07026021927595139,-0.8796029686927795,1.1099753379821777,1.2066266536712646,0.554963231086731,1.330484390258789,1.1171331405639648,-0.11504677683115005,0.5720568895339966,-3.571725845336914,-0.5520481467247009,1.5933809280395508,0.12332700192928314,2.059849262237549,-0.5843842029571533,1.384166955947876,2.6402456760406494,-0.08820181339979172,0.5803955793380737,2.259124994277954,0.9335283637046814,0.8794909715652466,1.45517098903656,0.6378653645515442,0.5673235654830933,-2.7853825092315674,0.8484644293785095,1.4819128513336182,-0.35490182042121887,-1.6135735511779785,0.783717691898346,2.022306442260742,-0.9782796502113342,1.6437042951583862,-0.9927244186401367
25,1.9107892513275146,0.5765981674194336,1.4180015325546265,2.6583213806152344,0.037938155233860016,0.42587724328041077,1.0904895067214966,-0.6981497406959534,0.11261095106601715,1.2239506244659424,0.18906369805335999,2.4782183170318604,-0.5308562517166138,0.06128605827689171,-1.7463257312774658,-2.221076250076294,-1.0524307489395142,0.9281755685806274,3.395731210708618,1.5277235507965088,0.06888335943222046,0.6643829941749573,1.5879154205322266,-1.0135186910629272,2.0043840408325195,0.1704183667898178,0.6753309965133667,3.0478270053863525,0.8959267735481262,1.5028034448623657,0.011870333924889565,-0.5598464608192444,1.5485934019088745,-0.7368002533912659,0.23474539816379547,0.7772424221038818,-0.4396515488624573,1.4165501594543457,2.235210418701172,-2.336775541305542
26,2.0290887355804443,0.7559725642204285,0.6545684933662415,2.4014298915863037,-0.08726419508457184,0.1100345104932785,0.009002498351037502,0.35287293791770935,0.3377658426761627,0.9217768907546997,-0.2574775815010071,1.1182217597961426,0.6898128986358643,-0.6904177665710449,-2.0571255683898926,-2.301924705505371,1.7103697061538696,0.1781923770904541,1.737024188041687,1.1069926023483276,1.0955369472503662,0.7915316820144653,1.292867660522461,-0.39462557435035706,2.1671669483184814,-0.21144381165504456,0.22218556702136993,1.7832262516021729,1.8447169065475464,0.8935726881027222,-0.6864185929298401,-0.7904343605041504,1.7661114931106567,-0.7988921999931335,-0.45207101106643677,0.3932228684425354,0.03754459321498871,0.25603827834129333,1.579778790473938,-1.999531865119934
27,2.2116708755493164,0.794865071773529,0.7399278879165649,2.9548206329345703,-0.575340986251831,0.01824435591697693,-0.2205514758825302,0.5425356030464172,0.1396317034959793,1.1947600841522217,-0.25825798511505127,1.3450024127960205,1.201195478439331,-0.28417402505874634,-2.1235203742980957,-2.6189019680023193,1.3437678813934326,-0.7078552842140198,2.5203332901000977,1.3927370309829712,2.149502992630005,-0.8081274032592773,0.08438455313444138,-0.18700958788394928,1.3277949094772339,0.6272134780883789,0.6634467244148254,0.2093200534582138,3.0818920135498047,0.20221969485282898,-0.8953678011894226,-0.8408635258674622,0.6413395404815674,-1.9249321222305298,0.5320224761962891,-0.8086276650428772,0.8614442944526672,-0.20562507212162018,1.1488473415374756,-2.944679021835327
28,1.6748112440109253,0.35149043798446655,2.7102015018463135,1.8837459087371826,1.2635796070098877,0.08101165294647217,-1.6735409498214722,0.03671915829181671,1.3552452325820923,0.9808383584022522,0.826207160949707,-1.1054773330688477,1.6456836462020874,0.6236113905906677,-2.9643492698669434,-1.724448561668396,2.544142007827759,-0.13103827834129333,1.8597670793533325,-0.5783076286315918,1.6508270502090454,2.2650012969970703,-0.4689672291278839,0.5317299365997314,2.266273021697998,0.8967812657356262,2.058305025100708,2.413740396499634,0.4835638999938965,0.11405708640813828,-1.568147897720337,0.8681896328926086,1.3846112489700317,-0.9366877675056458,-1.5898042917251587,0.946509599685669,1.9723466634750366,-0.9828007221221924,1.9525431394577026,-1.0434798002243042
29,3.5545902252197266,-0.06391923129558563,-0.48299872875213623,0.9592597484588623,0.6223496794700623,0.48131948709487915,0.22947295010089874,0.512052059173584,0.13224251568317413,1.0688645839691162,-1.5361639261245728,1.1991976499557495,-2.281658411026001,0.5686264038085938,-1.064400315284729,-2.460759162902832,1.0792127847671509,0.24378874897956848,1.2855242490768433,1.0886509418487549,-2.0067811012268066,2.152761936187744,1.7153908014297485,0.13015806674957275,2.141587972640991,0.43606051802635193,-1.4060070514678955,0.6736267805099487,0.3274722397327423,2.4217326641082764,0.7404100298881531,-1.7254713773727417,1.138891339302063,0.6867642998695374,0.4958725869655609,0.9362083077430725,-2.36735463142395,1.312050223350525,1.0279793739318848,-1.9259929656982422
30,1.7744219303131104,1.5474200248718262,0.8493256568908691,2.4870965480804443,-1.0113074779510498,1.2971986532211304,0.1518636792898178,0.3097131550312042,0.5314570069313049,1.580133318901062,-0.1642119437456131,1.3597016334533691,0.6084815859794617,0.19288678467273712,-1.9443405866622925,-2.316110372543335,1.0939006805419922,0.5446452498435974,1.8108150959014893,1.4933125972747803,0.5928075909614563,1.519637107849121,1.7700501680374146,-0.7119320631027222,2.3536367416381836,0.11313582211732864,-0.025188568979501724,1.6395050287246704,1.363511323928833,0.9585475921630859,-0.7194833755493164,-0.7304176688194275,2.197420358657837,-0.2856541872024536,-0.5353886485099792,1.0744916200637817,-0.45945292711257935,0.7783918380737305,1.8998745679855347,-1.7283326387405396
31,1.686653733253479,-1.1382431983947754,0.44336268305778503,2.840644598007202,-1.0765938758850098,-0.5252484083175659,-1.5633286237716675,-1.4257738590240479,0.6761796474456787,-0.7562362551689148,1.2526124715805054,1.9621729850769043,1.3561909198760986,0.09018819779157639,-0.7061790823936462,-2.4080703258514404,1.2610996961593628,0.281736820936203,1.0179297924041748,1.6616106033325195,0.2715339958667755,1.6079730987548828,-0.4912101924419403,-1.9555000066757202,0.579356849193573,-0.12483682483434677,-1.2446194887161255,2.915346384048462,-0.45383089780807495,1.3320369720458984,-0.6406335830688477,0.25293365120887756,1.9224804639816284,-1.0405938625335693,-0.9863872528076172,1.2365461587905884,-0.11612464487552643,0.31045636534690857,-0.8313062191009521,-2.0390074253082275
32,2.720419406890869,0.7821152806282043,0.6567047834396362,2.8942089080810547,-0.770529568195343,0.1724333018064499,-0.31671878695487976,0.37218934297561646,0.2207639068365097,1.1951082944869995,-0.32807236909866333,1.4003033638000488,1.0926593542099,-0.18691250681877136,-2.1786575317382812,-2.7398979663848877,0.9558265209197998,-0.04802791774272919,2.6426916122436523,1.5577818155288696,2.1030519008636475,-0.6501399278640747,-0.3825039863586426,-0.019120533019304276,1.2166823148727417,1.05093252658844,0.5849626064300537,0.5466301441192627,3.54079008102417,0.7632508873939514,-0.9090259671211243,-0.41356170177459717,0.7196648716926575,-1.663689136505127,0.5485154390335083,-1.0176494121551514,1.0697294473648071,-0.23066195845603943,1.099332332611084,-3.0771889686584473
33,0.6292107701301575,2.650484800338745,2.874898910522461,1.18939208984375,-2.3801491260528564,1.3995444774627686,-0.3609315752983093,1.6280492544174194,1.815024495124817,1.7335313558578491,-1.0471912622451782,1.7254010438919067,2.334512233734131,1.6085325479507446,0.10870238393545151,-1.9174258708953857,-0.26676979660987854,-1.8913729190826416,1.6613318920135498,2.477389097213745,1.048435926437378,2.5685510635375977,1.0961683988571167,0.7607325911521912,0.9758636355400085,-1.525308609008789,0.23617763817310333,3.3314402103424072,1.2714232206344604,-1.8138506412506104,-1.687181830406189,-0.701660692691803,3.807870626449585,0.5422196388244629,0.038903698325157166,-0.0708579272031784,-0.8625924587249756,-2.307037591934204,2.4312312602996826,-0.9703565239906311
34,2.196087121963501,0.749535858631134,0.7822306752204895,2.332097053527832,-0.9219051599502563,0.5208302140235901,-0.03585828095674515,-0.26077792048454285,0.30322396755218506,0.7239148616790771,-0.8210227489471436,1.8657586574554443,0.060964468866586685,1.0929820537567139,-1.9008450508117676,-2.482532262802124,2.357901096343994,0.2794068157672882,1.5008269548416138,0.9691975712776184,0.6214878559112549,2.0075504779815674,1.0248076915740967,-0.9568185210227966,1.478445291519165,-0.1272907257080078,-0.3936696946620941,3.1576995849609375,0.5534863471984863,1.4612693786621094,0.28770336508750916,-1.8045650720596313,2.144318103790283,-0.3521404266357422,-0.3162516951560974,1.564956784248352,-0.08192378282546997,-0.0963376834988594,1.8316494226455688,-2.187669277191162
35,3.5060014724731445,-0.05838312208652496,-0.49711716175079346,0.8573337197303772,0.5443200469017029,0.6690599322319031,0.17103907465934753,0.5838534832000732,0.09858909994363785,1.0610746145248413,-1.5940064191818237,1.1121318340301514,-2.2116451263427734,0.5214998722076416,-1.040736198425293,-2.379701852798462,1.1003066301345825,0.33769097924232483,1.24040687084198,1.2063250541687012,-1.9788750410079956,2.0661768913269043,1.8280158042907715,0.13973231613636017,2.034619092941284,0.4218060076236725,-1.3838393688201904,0.6234689950942993,0.49132105708122253,2.390993356704712,0.6978375911712646,-1.7013072967529297,1.1435893774032593,0.6551153659820557,0.36980465054512024,0.8522474765777588,-2.367232084274292,1.4262412786483765,1.0267326831817627,-2.021855354309082
36,1.1132726669311523,1.8789494037628174,2.028935432434082,1.9226272106170654,-0.9357928037643433,-2.2571918964385986,0.9812917113304138,-0.4976170063018799,0.09298709034919739,2.195056915283203,-2.254521131515503,1.0349243879318237,1.4721423387527466,-0.2714691460132599,-2.119370222091675,-0.6415624022483826,0.9499180316925049,-0.8845345377922058,1.0808779001235962,0.9868220090866089,1.0698126554489136,-0.8094474077224731,3.5382585525512695,-1.1031986474990845,0.8175851702690125,-1.8754549026489258,-0.8807209134101868,1.9867600202560425,2.8269917964935303,0.6024191975593567,1.2549995183944702,-0.521253228187561,0.5006373524665833,-0.9372193217277527,-0.15015052258968353,-0.5414403676986694,-1.1489757299423218,0.18660803139209747,3.7056632041931152,-0.7693724036216736
37,1.1643999814987183,-1.5824977159500122,0.08860662579536438,3.741495370864868,-0.3783680498600006,-0.8373478055000305,-0.13632644712924957,-0.947142481803894,-0.03038755990564823,0.2461174577474594,0.8296492695808411,3.3285329341888428,1.007253646850586,-0.8396901488304138,-0.5135179162025452,-1.267900824546814,1.138644814491272,0.7402823567390442,0.929824948310852,1.7488335371017456,0.5712933540344238,1.0839958190917969,-0.21911412477493286,-2.299483299255371,0.7003468871116638,0.023503929376602173,-1.1673779487609863,2.628070592880249,-0.45449724793434143,1.4254837036132812,-0.9156440496444702,0.29025137424468994,1.9899612665176392,-1.026599407196045,-0.777986466884613,1.1727869510650635,-0.0012440106365829706,0.49069157242774963,-0.8495683073997498,-1.9170749187469482
38,-0.2945394217967987,2.3766324520111084,2.592041015625,3.0084927082061768,0.197281613945961,2.083054304122925,0.9555981755256653,-1.690010666847229,-2.4903676509857178,2.2200212478637695,1.269953966140747,1.610005497932434,0.9739412069320679,0.06787706911563873,-2.979990005493164,-0.6967179775238037,3.2151827812194824,1.877526044845581,0.07802524417638779,-0.8563843369483948,2.065757989883423,1.241523027420044,2.6658241748809814,-0.4613231420516968,0.9935279488563538,0.43772682547569275,0.8483645915985107,1.7005330324172974,-0.3172999620437622,0.9132126569747925,-3.078857183456421,-2.949986457824707,0.8960450887680054,-2.1538491249084473,0.69089275598526,2.8593783378601074,-0.21225930750370026,0.27351295948028564,2.0138275623321533,-0.9321188926696777
39,1.421549916267395,-1.7848737239837646,-0.48295900225639343,2.9355885982513428,-1.0860931873321533,1.25411057472229,-0.6419100761413574,-0.3748398423194885,-0.1767573058605194,0.28791382908821106,1.180489182472229,2.204176902770996,0.4389996826648712,-1.8553051948547363,-0.48368483781814575,-2.422914743423462,1.1032981872558594,0.22772884368896484,0.7994731068611145,1.9689126014709473,0.8411508202552795,1.2100380659103394,-0.2877810001373291,-2.3299813270568848,0.24708999693393707,0.3074324429035187,-1.2530362606048584,2.9401185512542725,-0.14455950260162354,1.4173295497894287,-0.6671138405799866,0.17900286614894867,1.8375493288040161,-1.0270220041275024,-1.1079175472259521,1.3311723470687866,-0.143173947930336,0.16607403755187988,-0.8411221504211426,-2.145005464553833
40,3.4208436012268066,-0.043829917907714844,-0.5525278449058533,1.0156536102294922,0.8201462626457214,0.627916157245636,0.18294046819210052,0.6456433534622192,0.1800374686717987,1.1311097145080566,-1.52393639087677,1.1564433574676514,-2.322368621826172,0.6102811694145203,-1.0690613985061646,-2.432249069213867,1.0071525573730469,0.46051010489463806,1.14898681640625,1.1131261587142944,-1.9027924537658691,2.0380489826202393,1.9180923700332642,0.03478728607296944,2.1460413932800293,0.3811710476875305,-1.333031177520752,0.6901127696037292,0.3748137652873993,2.4250495433807373,0.6796784996986389,-1.795563817024231,1.0752089023590088,0.6334710121154785,0.33348530530929565,0.9035252928733826,-2.329404592514038,1.5109689235687256,1.0563641786575317,-2.0617339611053467
41,1.750035047531128,0.6697165369987488,1.4004610776901245,2.7679052352905273,0.0883626714348793,0.5021552443504333,0.8389939665794373,-0.6356549859046936,0.2773558497428894,1.160966157913208,0.3127073347568512,2.1243016719818115,-0.35742491483688354,0.3061900734901428,-1.602543830871582,-2.4097492694854736,-1.1135423183441162,1.000842571258545,3.400214910507202,1.5621355772018433,0.07994618266820908,0.7132033705711365,1.5830180644989014,-0.8988072276115417,1.9527069330215454,0.12801054120063782,0.5250968933105469,2.9743459224700928,0.7887901663780212,1.3555216789245605,-0.10680270940065384,-0.5911802053451538,1.3943058252334595,-0.5652734637260437,0.2212531566619873,0.9099156856536865,-0.3007218837738037,1.585004448890686,2.3268394470214844,-2.3364851474761963
42,2.6025662422180176,0.8382918834686279,0.6942511200904846,2.8401870727539062,-0.5959457755088806,0.14473724365234375,-0.2309478521347046,0.4939013719558716,0.2467719167470932,1.0212277173995972,-0.4151366651058197,1.3267155885696411,1.207847237586975,-0.3088582456111908,-2.286324977874756,-2.7388391494750977,0.9756945967674255,-0.09057975560426712,2.7311160564422607,1.632779598236084,2.1334707736968994,-0.5674475431442261,-0.3543437719345093,-0.0853080078959465,1.3122700452804565,0.910843014717102,0.5752931237220764,0.39301934838294983,3.412044048309326,0.5271511673927307,-0.919029176235199,-0.5987257361412048,0.6467682719230652,-1.630786418914795,0.40196195244789124,-0.9939841628074646,1.0486435890197754,-0.23587845265865326,1.1417196989059448,-3.0564374923706055
43,1.9032647609710693,1.6339111328125,0.8672988414764404,2.6081316471099854,-1.199913740158081,1.4479122161865234,0.10305216163396835,0.667218804359436,0.7998157739639282,2.1445305347442627,-0.2648734152317047,1.460336446762085,0.6706210374832153,0.2648119330406189,-1.6630382537841797,-2.4769070148468018,1.2219709157943726,0.5867573022842407,1.8301873207092285,1.7229481935501099,0.5760225057601929,1.7342218160629272,1.805909514427185,-0.6808790564537048,2.569319486618042,0.4002234935760498,-0.1501162201166153,1.7364912033081055,1.6064320802688599,0.934274435043335,-0.8096500635147095,-0.8428913950920105,2.1434261798858643,-0.32542961835861206,-0.43987900018692017,0.8451789021492004,-0.21269604563713074,0.6128659844398499,2.0814759731292725,-1.7663357257843018
44,3.5749545097351074,0.00937485322356224,-0.5275147557258606,0.9412383437156677,0.5722560882568359,0.8152377009391785,0.17219717800617218,0.6265859603881836,-0.07684442400932312,0.7650849223136902,-1.5233495235443115,1.3713905811309814,-2.004324197769165,0.5709649324417114,-0.9057220220565796,-2.3572182655334473,1.0643243789672852,0.4443969130516052,1.0934205055236816,1.268649697303772,-1.870794653892517,2.011512279510498,1.9684741497039795,0.06759408116340637,1.8801096677780151,0.3876174986362457,-1.2092690467834473,0.5192205905914307,0.584621250629425,2.447542905807495,0.4679582417011261,-1.6542327404022217,1.0174733400344849,0.7676348090171814,0.4499252438545227,0.8914764523506165,-2.2950539588928223,1.3378039598464966,1.000713586807251,-1.9518762826919556
45,0.6383212804794312,3.1711068153381348,-0.5455289483070374,2.4102284908294678,0.507567822933197,0.7935633063316345,0.4716905653476715,1.103887677192688,-1.145914912223816,2.039616346359253,0.9691622257232666,1.4933274984359741,-0.0030786849092692137,1.5670686960220337,0.0763317197561264,-2.7408430576324463,1.5389354228973389,2.175203561782837,1.6668444871902466,1.858015775680542,0.21802525222301483,1.011786699295044,0.030332675203680992,2.0467162132263184,0.8661320805549622,2.013841390609741,1.2160470485687256,2.4355859756469727,0.688484251499176,1.1359139680862427,0.6059804558753967,-1.5941716432571411,-0.1020536944270134,0.9054323434829712,0.27941685914993286,1.3165498971939087,1.3609305620193481,1.3180882930755615,2.2422728538513184,-2.6288201808929443
46,4.285843849182129,-0.21877026557922363,0.2641085088253021,0.5300253629684448,-0.30439493060112,-0.12336500734090805,0.0938093289732933,-0.5350151062011719,-1.9342215061187744,-0.03754071518778801,-1.3119444847106934,2.4059388637542725,-0.9569893479347229,-0.0909406915307045,-1.2468273639678955,-1.9580392837524414,1.0421844720840454,1.4494978189468384,0.2698202133178711,1.2878353595733643,-1.391932725906372,1.8052867650985718,2.718578577041626,-0.27271461486816406,1.0837972164154053,0.45428159832954407,-0.637973427772522,0.08985525369644165,1.528658151626587,3.353886127471924,-0.5120976567268372,-1.3363069295883179,0.3599488437175751,-0.005703137256205082,-0.17712709307670593,0.6393610835075378,-2.203578472137451,1.9484580755233765,1.052991509437561,-2.652951240539551
47,1.6926988363265991,1.6833851337432861,0.7655630111694336,2.5546085834503174,-0.9613355398178101,1.5693374872207642,0.10710795223712921,0.21504627168178558,0.7170674204826355,1.5622810125350952,-0.16108453273773193,1.3313469886779785,0.4252183437347412,0.12797103822231293,-2.1025047302246094,-2.2997944355010986,1.0256515741348267,0.6189753413200378,1.709828495979309,1.645264983177185,0.6508824229240417,1.6074787378311157,1.7843806743621826,-0.8081924915313721,2.147693395614624,0.17268869280815125,-0.04794628545641899,1.6102491617202759,1.4712016582489014,0.9716900587081909,-0.6900705099105835,-0.6655422449111938,2.073786497116089,-0.22077302634716034,-0.5001866221427917,0.7979156970977783,-0.36370930075645447,0.665583074092865,1.8364791870117188,-1.7729638814926147
48,2.0886542797088623,1.0290400981903076,-0.20260009169578552,2.6069226264953613,-1.7753647565841675,-3.109666585922241,0.5377966165542603,0.6084985733032227,-0.8193526864051819,1.5344204902648926,-2.3109757900238037,1.9746482372283936,1.5627648830413818,-0.5325393676757812,-2.6763150691986084,0.22096535563468933,0.7251065969467163,0.33162879943847656,1.1722356081008911,0.7733331918716431,1.0469106435775757,-0.7836747765541077,3.2432773113250732,0.5015327334403992,2.311560869216919,-1.6258515119552612,-1.1683655977249146,1.488110065460205,1.6494567394256592,0.3649995028972626,0.7347224950790405,0.557117760181427,1.216198444366455,-0.22401279211044312,-0.8915815353393555,-1.2527068853378296,-0.36420828104019165,0.9412844181060791,2.99126935005188,-0.8438212275505066
49,2.0500264167785645,0.16581277549266815,1.3015382289886475,1.6414525508880615,-1.7166557312011719,-1.8533310890197754,0.23136714100837708,2.3227169513702393,0.46803033351898193,2.512465715408325,-1.5664429664611816,0.9986485838890076,-0.4762322008609772,3.0915467739105225,-2.2187154293060303,-0.4338304102420807,1.3660064935684204,-1.2640752792358398,2.1523776054382324,-0.36332470178604126,0.3482074439525604,0.5741627812385559,2.6177620887756348,0.9112813472747803,2.041581153869629,-1.2136777639389038,1.9940367937088013,1.5985060930252075,1.0929256677627563,1.4522987604141235,0.7577903270721436,-0.4244861304759979,2.453829526901245,-0.7820407748222351,0.520318329334259,-0.5405042767524719,0.12017598748207092,1.3786739110946655,1.929524540901184,-0.07617413252592087
50,3.4983487129211426,-0.04065041244029999,-0.536215603351593,0.9475145936012268,0.6197593212127686,0.6821665167808533,0.2445855438709259,0.5792295932769775,0.046728115528821945,0.9036185145378113,-1.4498186111450195,1.2197235822677612,-2.1013636589050293,0.5231853127479553,-0.9696690440177917,-2.4352760314941406,1.0744236707687378,0.4519714117050171,1.1960793733596802,1.251572847366333,-1.9793462753295898,1.957764983177185,1.9304649829864502,0.05446649715304375,1.931201696395874,0.40832915902137756,-1.3491438627243042,0.5933622717857361,0.47298604249954224,2.36411190032959,0.6856155395507812,-1.7270890474319458,1.1389397382736206,0.7240526080131531,0.4034934639930725,0.9270338416099548,-2.3461191654205322,1.3583396673202515,1.093284249305725,-2.002671718597412
51,1.8982954025268555,0.9312657713890076,-0.22985254228115082,1.9570708274841309,-1.4029585123062134,-0.4422720670700073,1.3797053098678589,3.2010104656219482,-0.5577352046966553,1.3741899728775024,-1.5695056915283203,1.7188026905059814,0.42082127928733826,2.5774173736572266,-2.5001721382141113,0.15504184365272522,1.5001025199890137,-0.18462935090065002,2.471318483352661,-0.2147466540336609,0.603768527507782,0.6723690032958984,2.7493607997894287,2.401125431060791,3.2280633449554443,-1.0110194683074951,1.2884705066680908,1.4308395385742188,0.30420729517936707,1.420997142791748,0.5640896558761597,0.39095941185951233,3.0911152362823486,-0.10206887125968933,0.05396788939833641,-1.107766032218933,0.902053952217102,1.9475501775741577,1.7051492929458618,-0.31099897623062134
52,2.0199148654937744,0.7087553143501282,0.506411612033844,2.4695091247558594,-0.1980283409357071,0.49281251430511475,-0.3361184895038605,-0.1307438164949417,0.2832739055156708,0.9744871854782104,-0.17310573160648346,0.9948359131813049,0.8437696099281311,-0.7990130186080933,-2.1318485736846924,-2.4251198768615723,1.6404814720153809,0.2842233180999756,1.6876927614212036,1.170427918434143,1.0590687990188599,0.8685140609741211,1.1854381561279297,-0.37124547362327576,2.013479709625244,-0.3500077724456787,0.007766579743474722,1.8347011804580688,1.8189772367477417,0.7400814294815063,-0.8048896789550781,-0.8321016430854797,1.7033367156982422,-0.7910224199295044,-0.45701712369918823,0.32864487171173096,0.004693353082984686,0.07929357886314392,1.7787623405456543,-2.047177791595459
53,1.8708564043045044,0.40301257371902466,2.194450855255127,2.096635580062866,1.8410652875900269,-0.10603679716587067,-1.127961277961731,-0.28112611174583435,1.2732270956039429,0.8754088878631592,0.8107762932777405,-0.989484965801239,1.2974401712417603,0.5798095464706421,-2.896700620651245,-1.5473787784576416,2.673970937728882,-0.11384249478578568,1.9037705659866333,-0.543584406375885,1.7209115028381348,2.225493907928467,-0.5042548775672913,0.49941492080688477,2.2964980602264404,0.8827390074729919,2.061596632003784,2.406687021255493,0.5132792592048645,0.15897025167942047,-1.6120609045028687,0.8988867402076721,1.2760064601898193,-0.9737901091575623,-1.6835463047027588,0.8612026572227478,1.9095314741134644,-0.9857214093208313,1.9817689657211304,-1.0432788133621216
54,1.523037314414978,-0.9240421652793884,0.4666197597980499,2.4509990215301514,-0.20341628789901733,0.20712421834468842,0.11312396824359894,-2.2213327884674072,0.491452157497406,-0.9504737257957458,0.40850943326950073,1.943637728691101,1.6164638996124268,-0.3239438533782959,-1.0132607221603394,-1.8858085870742798,1.1025902032852173,0.530168354511261,1.3919134140014648,1.6526674032211304,-0.09398726373910904,2.0130562782287598,-0.6563514471054077,-1.6401515007019043,0.8852732181549072,-0.35579776763916016,-1.3596088886260986,2.6631665229797363,-0.31091246008872986,1.467023253440857,-0.8941944241523743,0.5061935186386108,2.2971720695495605,-1.0602329969406128,-0.716728925704956,0.9280863404273987,0.009216208010911942,0.6160749793052673,-0.7827171087265015,-1.781510829925537
55,-0.5694369673728943,-0.36794885993003845,1.5483237504959106,3.6639821529388428,-1.9514225721359253,0.6635534167289734,1.4913806915283203,0.5563492774963379,2.1906466484069824,2.923185110092163,0.24220067262649536,1.356795072555542,-0.5628651976585388,-0.7887413501739502,-0.6364774703979492,-1.556095838546753,1.4898223876953125,-0.023953992873430252,1.251839518547058,3.6294710636138916,-0.4739625155925751,-0.6858282685279846,1.1365517377853394,-0.25597861409187317,2.2417666912078857,1.3802852630615234,-1.341529130935669,2.1842167377471924,1.0550435781478882,-1.1114898920059204,0.4222325086593628,-0.29349416494369507,2.6668612957000732,1.2338273525238037,0.9428444504737854,2.140828847885132,0.555357038974762,-0.1273181289434433,1.0443059206008911,-1.1700338125228882
56,1.9457080364227295,0.6232772469520569,0.6026234030723572,2.378509759902954,-0.16225160658359528,0.16092625260353088,-0.059236079454422,0.18876905739307404,0.30832380056381226,0.969926655292511,-0.3325502574443817,1.1038342714309692,0.7878689765930176,-0.9087012410163879,-2.3071916103363037,-2.1836063861846924,1.9930530786514282,0.14799879491329193,1.7140032052993774,1.130829930305481,1.1082713603973389,0.6221909523010254,1.301196575164795,-0.37029963731765747,2.0563528537750244,-0.3403043746948242,0.035447314381599426,1.7438809871673584,1.7576221227645874,0.8814926147460938,-0.8529144525527954,-0.8056192994117737,1.5898208618164062,-0.7770429253578186,-0.6069458723068237,0.5335929989814758,0.19833281636238098,0.10979605466127396,1.6427083015441895,-2.0780820846557617
57,1.9722110033035278,0.3137713670730591,2.501275062561035,0.9168952107429504,0.07054610550403595,2.1461031436920166,1.4255672693252563,1.16948664188385,1.9414632320404053,-0.26771262288093567,-1.9807047843933105,0.10131745785474777,0.3054960072040558,-1.088853120803833,-1.9749245643615723,-2.448911190032959,3.6969292163848877,0.04842744395136833,1.3988529443740845,0.11241120845079422,-0.7116432189941406,-0.08122602850198746,0.6758520007133484,-0.8182203769683838,1.0514540672302246,-0.05694771558046341,-2.4375383853912354,0.7516526579856873,1.7149832248687744,0.47383221983909607,-2.59014630317688,-1.592452883720398,0.9706587195396423,0.039258018136024475,-1.5687916278839111,2.0516092777252197,-1.7840592861175537,-1.6681705713272095,1.6569103002548218,-1.5385438203811646
58,0.9825239777565002,0.4177009165287018,1.7556827068328857,2.3728232383728027,1.4868615865707397,-0.0442194789648056,-0.837053120136261,1.1931411027908325,1.2424349784851074,0.5521126985549927,1.2958297729492188,1.118591070175171,-0.076435886323452,0.4981372654438019,-3.5952155590057373,-0.513077974319458,1.3503060340881348,0.1580478399991989,2.1417174339294434,-0.6082178950309753,1.3548222780227661,2.7395663261413574,0.013756022788584232,0.5749167799949646,2.242844820022583,0.9884060621261597,1.0028365850448608,1.5446773767471313,0.6248534917831421,0.6165763139724731,-2.5751872062683105,0.836694598197937,1.4403232336044312,-0.3340500593185425,-1.781630277633667,0.7791200280189514,2.0529444217681885,-0.8989666104316711,1.5932154655456543,-1.0627753734588623
59,-0.08041952550411224,2.3913021087646484,2.868065118789673,3.1853721141815186,0.7017573714256287,0.9098702669143677,0.8199447393417358,-1.6593282222747803,-2.1373579502105713,2.7361061573028564,1.2758134603500366,1.114808201789856,1.7261883020401,-0.31117480993270874,-2.793883800506592,-0.7107968926429749,3.1160852909088135,1.9237433671951294,0.09714328497648239,-0.8205455541610718,2.2677114009857178,1.2467598915100098,2.7052438259124756,-0.41052818298339844,0.9860906600952148,0.4925302267074585,0.7600740790367126,1.7704360485076904,-0.33803361654281616,0.8636618852615356,-3.084057569503784,-2.9811627864837646,0.7095958590507507,-2.250140905380249,0.7207708954811096,2.877078056335449,-0.229108989238739,0.2696407735347748,2.034215211868286,-1.019644856452942
60,-0.5831332206726074,0.21193619072437286,0.9133459329605103,3.4555625915527344,-1.0015007257461548,2.531975030899048,0.4506905972957611,1.039106845855713,1.3889517784118652,3.2758116722106934,0.0767330527305603,0.7727805972099304,-0.06089698150753975,-1.1741406917572021,-1.1640428304672241,-1.229710578918457,1.3767555952072144,-0.038737501949071884,1.3656964302062988,3.6520373821258545,-0.5161029696464539,-0.6599599123001099,1.1052314043045044,-0.17349044978618622,2.277679681777954,1.5360146760940552,-1.3243509531021118,2.0539541244506836,1.0005919933319092,-1.0358927249908447,0.3517554998397827,-0.35909581184387207,2.548220157623291,1.2508388757705688,1.0064442157745361,2.1279187202453613,0.5554343461990356,-0.2920021712779999,0.9436640739440918,-1.3451894521713257
61,1.8281896114349365,0.30500876903533936,1.7095444202423096,2.9531357288360596,0.021977856755256653,0.3284332752227783,1.2270686626434326,-0.6032799482345581,0.22346535325050354,0.9750365018844604,0.8974791765213013,2.1782689094543457,-0.21083368360996246,0.6759800314903259,-1.8276541233062744,-2.83048939704895,-1.0228683948516846,0.9067339301109314,3.733341693878174,1.1797633171081543,-0.016830947250127792,0.8400003910064697,1.545332908630371,-0.956037700176239,1.9075260162353516,0.005612622480839491,0.4912588894367218,2.938631057739258,0.7681782245635986,1.6129776239395142,-0.061118487268686295,-0.7599066495895386,1.5347535610198975,-0.723716139793396,0.2353471964597702,0.8524577617645264,-0.49173077940940857,1.578544020652771,2.280172824859619,-2.4158387184143066
62,3.754349946975708,1.2034584283828735,1.4948704242706299,3.430011510848999,-0.08218883723020554,0.16865882277488708,-0.08781129121780396,0.5697356462478638,0.323883056640625,1.3218994140625,-0.36958301067352295,1.8924483060836792,0.49277570843696594,-0.15237489342689514,-3.52190899848938,-3.5268728733062744,2.587710380554199,0.26264339685440063,2.9808902740478516,1.8485229015350342,1.4706339836120605,1.4026645421981812,2.144711494445801,-0.5125091075897217,2.983105182647705,-0.4319632649421692,0.0776643455028534,2.5215704441070557,2.719188690185547,1.4657819271087646,-0.9198020696640015,-1.415278434753418,2.65912127494812,-0.8407142758369446,-0.40721645951271057,0.6153120398521423,0.0021453178487718105,0.3979695737361908,2.7326602935791016,-2.991325855255127
63,4.183447360992432,-0.09353232383728027,0.07007797807455063,0.2816549837589264,-0.8314728140830994,0.9128148555755615,-0.00883458275347948,-0.21973615884780884,-2.020019769668579,-0.14480237662792206,-1.3409202098846436,2.374633312225342,-1.0329662561416626,-0.0013108517741784453,-1.307776927947998,-1.9729077816009521,1.105753779411316,1.3744940757751465,0.25199005007743835,1.2826753854751587,-1.3303159475326538,1.8867592811584473,2.7077760696411133,-0.25978219509124756,1.144775152206421,0.3738979399204254,-0.5295584201812744,0.0884418860077858,1.322535753250122,3.31014347076416,-0.5632054209709167,-1.292468786239624,0.5797292590141296,0.14029935002326965,-0.025094160810112953,0.701819658279419,-2.232095718383789,1.8541754484176636,1.0172131061553955,-2.4740240573883057
64,0.9519204497337341,0.4541099965572357,1.7904759645462036,2.418261766433716,1.581292986869812,-0.09807468205690384,-0.8987797498703003,1.3024479150772095,1.2773939371109009,0.6053643822669983,1.3368289470672607,1.0775084495544434,-0.12214836478233337,0.5998525619506836,-3.525129556655884,-0.5033676028251648,1.404928207397461,0.1390799582004547,1.989316463470459,-0.5944638848304749,1.4132813215255737,2.719022274017334,-0.10771992057561874,0.6255283951759338,2.2764663696289062,0.8505982160568237,0.8803784251213074,1.4863872528076172,0.663718044757843,0.4961533844470978,-2.791980743408203,0.9180893301963806,1.445694088935852,-0.49237459897994995,-1.7451599836349487,0.9150127172470093,2.071296215057373,-0.8453841805458069,1.6019541025161743,-1.0734448432922363
65,1.8817323446273804,2.9140524864196777,-0.5722460150718689,1.6274693012237549,0.9371132850646973,0.31865715980529785,1.5526925325393677,-0.036636821925640106,-0.5224734544754028,1.792651653289795,1.560631513595581,-0.01557978056371212,-0.06546282768249512,1.6928166151046753,-0.6940725445747375,-3.0229454040527344,1.4770987033843994,2.344120502471924,2.721409559249878,1.4372684955596924,-0.1846833974123001,0.5153390169143677,0.06915344297885895,1.8242628574371338,1.009750485420227,1.8114240169525146,1.5936148166656494,2.3256995677948,0.6450281739234924,1.1273887157440186,0.5847355127334595,-1.7320187091827393,-0.20647986233234406,0.7422816157341003,0.2995271682739258,1.3302395343780518,1.2526205778121948,1.2105008363723755,2.1488289833068848,-2.5437238216400146
66,1.88554847240448,0.2908044159412384,0.7799517512321472,1.054962158203125,-3.7060790061950684,0.9792408347129822,1.2483903169631958,-0.5936992764472961,-0.8541131615638733,1.2351503372192383,-1.7029109001159668,-1.2811185121536255,0.8164841532707214,-0.11963582038879395,-1.5376532077789307,-3.0410399436950684,0.23487769067287445,-0.07182146608829498,1.4330083131790161,-0.46591436862945557,1.3675230741500854,2.8057453632354736,2.5628175735473633,-2.1858112812042236,1.613084316253662,-0.9146238565444946,-0.6040512919425964,1.6939901113510132,0.6213502287864685,-0.5386782288551331,0.28959202766418457,-3.7160027027130127,1.792047142982483,1.2931996583938599,-1.2973017692565918,-1.208411455154419,-0.4159392714500427,-0.6257655620574951,0.7229397296905518,-3.1183114051818848
67,0.2640722393989563,-0.857423722743988,0.6694225668907166,3.5308029651641846,-0.8335962295532227,1.9567134380340576,1.648736596107483,1.556469202041626,1.0380783081054688,3.086277484893799,0.18769435584545135,1.1788461208343506,-0.2522161602973938,-1.6570929288864136,-0.8507609367370605,-1.3877372741699219,1.3528659343719482,-0.017613844946026802,1.4432168006896973,3.749267578125,-0.5523135662078857,-0.7036506533622742,1.1462517976760864,-0.20496325194835663,2.34182071685791,1.572080135345459,-1.39368736743927,2.0296950340270996,1.1015878915786743,-1.0405405759811401,0.4716161787509918,-0.3053063452243805,2.720484733581543,1.2658095359802246,1.0187593698501587,2.1941802501678467,0.6163448095321655,-0.20117522776126862,1.0285977125167847,-1.2613922357559204
68,1.9162741899490356,0.7234315276145935,0.5142301917076111,2.5058467388153076,-1.1094295978546143,0.36102113127708435,-0.16411837935447693,-0.463795930147171,0.3014381229877472,0.7290791273117065,-1.1350514888763428,2.089737892150879,-0.11351965367794037,1.1735928058624268,-2.067220449447632,-2.391298294067383,2.1907429695129395,0.3770627975463867,1.2925785779953003,1.1313846111297607,0.4169003665447235,2.0918667316436768,1.1501569747924805,-0.8304842114448547,1.641103982925415,0.02079068310558796,-0.5842140316963196,2.964107036590576,0.6443793773651123,1.4674527645111084,0.058945655822753906,-1.5189825296401978,2.12337589263916,-0.30068373680114746,-0.32754045724868774,1.4753406047821045,-0.06444329023361206,-0.05521420016884804,1.8593571186065674,-1.9955933094024658
69,2.0605580806732178,0.3863183557987213,2.5511584281921387,1.1969248056411743,-0.2828439474105835,0.4452075660228729,2.547124147415161,1.0706928968429565,1.9506009817123413,-0.16511854529380798,-1.6289451122283936,2.0592801570892334,-0.4924187660217285,-1.147934913635254,-2.838808536529541,-0.9497730135917664,3.8708951473236084,-0.3614594638347626,1.2856369018554688,0.3395284414291382,-0.6539695262908936,-0.07306550443172455,0.7131438851356506,-0.7085882425308228,2.007556676864624,-0.8578890562057495,-2.566042423248291,0.5605791211128235,1.6788277626037598,0.04139633849263191,-2.1126410961151123,-0.8912901282310486,0.8427937626838684,-0.40455162525177,-1.675965428352356,1.8177403211593628,-1.8973312377929688,-1.789903998374939,1.509481430053711,-1.8729609251022339
70,-0.5707471966743469,0.42667677998542786,0.32202550768852234,4.164876937866211,-0.6266156435012817,0.450570285320282,2.144706964492798,0.6611770987510681,0.4385089874267578,3.2537918090820312,-0.18765993416309357,1.1594852209091187,-0.2896621525287628,-1.507386565208435,-0.9440225958824158,-1.1277951002120972,1.393752932548523,0.059710413217544556,1.3247478008270264,3.6663365364074707,-0.5533718466758728,-0.7393973469734192,1.1503103971481323,-0.3716719448566437,2.2738945484161377,1.5449748039245605,-1.3992562294006348,2.075054883956909,1.0982755422592163,-1.045366883277893,0.4281938076019287,-0.27884501218795776,2.546731472015381,1.2367041110992432,1.0008090734481812,2.135165214538574,0.5198236703872681,-0.3291935622692108,0.9514746069908142,-1.2344554662704468
71,1.903341293334961,0.7213794589042664,0.6591086387634277,2.312098503112793,-0.5051267743110657,0.30206558108329773,-0.12162870168685913,0.38311895728111267,0.11715233325958252,0.8035120368003845,-0.3532845973968506,1.0823869705200195,0.5991788506507874,-0.58884197473526,-2.3216898441314697,-2.165844678878784,1.9163761138916016,0.10862399637699127,1.7874444723129272,1.2101750373840332,1.0784438848495483,0.8285118341445923,1.1982109546661377,-0.3503686785697937,2.031827449798584,-0.35430842638015747,-0.028922894969582558,1.758485198020935,1.7650172710418701,0.7542968392372131,-0.7170202136039734,-0.9114606380462646,1.6423325538635254,-0.578691840171814,-0.571719765663147,0.47672346234321594,0.07005339115858078,0.07836814224720001,1.6484183073043823,-1.9834024906158447
72,2.5953891277313232,1.2872674465179443,0.7580379843711853,3.45483136177063,-1.1768784523010254,0.41662493348121643,-0.4164253771305084,0.5928739309310913,0.259538859128952,1.4098436832427979,-0.6581141948699951,1.6950916051864624,1.2515709400177002,-0.15048953890800476,-2.5785343647003174,-3.044158935546875,2.165889024734497,0.28582024574279785,2.840128183364868,1.7245538234710693,1.348313331604004,1.481721043586731,2.0926339626312256,-0.38259387016296387,2.5593910217285156,-0.18935759365558624,-0.08132857829332352,2.442216396331787,2.557486057281494,1.271862268447876,-0.700253963470459,-1.2869333028793335,2.350429058074951,-0.7764216661453247,-0.5177038311958313,0.6174950003623962,-0.041490502655506134,0.5142160058021545,2.6684625148773193,-2.931933641433716
73,2.244807720184326,2.4922914505004883,2.0820999145507812,0.34901320934295654,-1.4199659824371338,2.3081390857696533,-0.7528280019760132,-1.17335844039917,0.9584477543830872,-0.9814595580101013,-0.3388916254043579,1.1670665740966797,-0.1264399290084839,3.0986545085906982,-1.880063772201538,-2.5846962928771973,-0.014537646435201168,2.8068811893463135,1.2449599504470825,1.456230878829956,3.0390536785125732,1.5425994396209717,0.9686028957366943,-0.38956418633461,-0.5773283839225769,-0.9512128233909607,1.5763896703720093,2.3678958415985107,1.6419984102249146,2.7403039932250977,-1.7723637819290161,-0.6914546489715576,1.6730066537857056,-0.24913474917411804,-2.620361804962158,1.9866796731948853,-0.45359134674072266,1.9462776184082031,1.8618539571762085,-0.4209076166152954
74,1.7846332788467407,1.5762680768966675,0.9656522870063782,2.6767916679382324,-1.24264657497406,1.404571533203125,0.29372861981391907,0.5889718532562256,0.6724928617477417,1.9454137086868286,-0.26722252368927,1.3101999759674072,0.6949529647827148,0.16424837708473206,-1.6269758939743042,-2.5675206184387207,1.2130087614059448,0.48607316613197327,1.9163237810134888,1.6598188877105713,0.5652196407318115,1.6309585571289062,1.8804347515106201,-0.5769959688186646,2.450817823410034,0.39157000184059143,-0.19508929550647736,1.7445640563964844,1.5967458486557007,0.9682827591896057,-0.8606931567192078,-0.7691441178321838,2.180234909057617,-0.2535908818244934,-0.47058114409446716,1.0278103351593018,-0.46290910243988037,0.8188386559486389,2.226911783218384,-1.741819977760315
75,1.8877615928649902,0.7460410594940186,0.5584841370582581,2.719989538192749,-0.9467839002609253,0.45901039242744446,-0.3641614317893982,-0.48690861463546753,0.2156199812889099,0.8680527210235596,-0.959669828414917,1.8159544467926025,-0.01683158054947853,0.8886850476264954,-1.9808151721954346,-2.2527272701263428,2.1785898208618164,0.1571318358182907,1.3414595127105713,0.9376551508903503,0.7269647121429443,1.7970415353775024,1.0319156646728516,-0.7726227641105652,1.5189578533172607,0.02179320715367794,-0.4419809579849243,2.867276430130005,0.7048041820526123,1.3353716135025024,0.05988892912864685,-1.5385401248931885,2.176607847213745,-0.1479322910308838,-0.4536620080471039,1.423476219177246,0.07354162633419037,0.0339822955429554,1.7328826189041138,-1.9767870903015137
76,1.9864145517349243,1.2403773069381714,0.2255166620016098,1.6095213890075684,-0.4989362955093384,1.456559658050537,-2.972101926803589,1.3651212453842163,-0.0622178353369236,1.1430518627166748,-0.9091534614562988,1.0367517471313477,0.8269540071487427,0.4997950792312622,-2.1037092208862305,-2.087528944015503,2.8205220699310303,-0.32145339250564575,-0.6787034869194031,2.1080284118652344,1.934486985206604,1.2576849460601807,0.5573426485061646,0.6638938784599304,1.9998193979263306,-0.5107307434082031,-0.7072103023529053,1.7964922189712524,1.3311660289764404,0.8203989863395691,-0.9512292146682739,-1.128492832183838,1.7636494636535645,-0.13444308936595917,-0.6398237347602844,0.5700468420982361,-0.07396948337554932,-0.07221503555774689,2.016713857650757,-1.897647500038147
77,1.859543800354004,0.836763322353363,-0.6958023309707642,1.6874868869781494,-3.901463031768799,0.7413800358772278,0.8101841807365417,-0.5019207000732422,-0.8061386942863464,1.23298978805542,-1.7666395902633667,-1.219545602798462,1.0395071506500244,0.10941212624311447,-1.425618052482605,-3.1218769550323486,0.31703832745552063,-0.039684440940618515,1.3724665641784668,-0.4687490165233612,1.2714227437973022,2.822880268096924,2.653010606765747,-2.231562614440918,1.6671218872070312,-0.883762001991272,-0.5206966400146484,1.6472091674804688,0.69141685962677,-0.47518154978752136,0.24002672731876373,-3.7222900390625,1.9212772846221924,1.2536901235580444,-1.2592800855636597,-1.2516453266143799,-0.5309411883354187,-0.653718888759613,0.6620743274688721,-3.095186710357666
78,-0.3258371949195862,0.8707002997398376,-0.04238642379641533,2.961214542388916,-1.6696357727050781,2.8473403453826904,1.100853681564331,0.9555183053016663,0.9919571876525879,2.978515386581421,0.4979788064956665,1.3302353620529175,-1.0369081497192383,-1.2595410346984863,-1.2550536394119263,-1.1569823026657104,1.4056875705718994,-0.0845939889550209,1.3280361890792847,3.6164677143096924,-0.5615165829658508,-0.6783287525177002,1.0920758247375488,-0.31371960043907166,2.2569580078125,1.5417543649673462,-1.373433232307434,2.0989015102386475,1.0673787593841553,-1.014737844467163,0.4448532462120056,-0.3570367693901062,2.648155927658081,1.2169172763824463,0.9570436477661133,2.1333200931549072,0.5544869303703308,-0.23128902912139893,1.0487512350082397,-1.351900577545166
79,3.0773990154266357,1.5243867635726929,1.0720160007476807,3.7228100299835205,-1.0376102924346924,0.4918012320995331,-0.47161146998405457,0.6463483572006226,0.46192535758018494,1.5286428928375244,-0.5435286164283752,1.7693365812301636,1.4922494888305664,-0.2226538062095642,-2.5795414447784424,-3.1688127517700195,2.438378095626831,0.32762351632118225,2.929492473602295,1.8065513372421265,1.3699740171432495,1.3888523578643799,2.08213472366333,-0.6072311997413635,2.821442127227783,-0.16197437047958374,0.17545734345912933,2.5206825733184814,2.6223762035369873,1.245233416557312,-0.7295928597450256,-1.3589247465133667,2.2830920219421387,-0.8387821912765503,-0.4755837917327881,0.4395338296890259,-0.20679564774036407,0.37691253423690796,2.6431725025177,-2.8099610805511475
80,2.8924527168273926,1.4848252534866333,0.8658462762832642,3.8867809772491455,-1.352823257446289,0.5852718353271484,-0.542236864566803,0.5254937410354614,0.3791538178920746,1.396954894065857,-0.7371609807014465,1.8646520376205444,1.4371397495269775,-0.18762554228305817,-2.9675347805023193,-3.26560378074646,2.480041027069092,0.10557084530591965,2.8377182483673096,1.7964107990264893,1.2637122869491577,1.4739381074905396,2.1690478324890137,-0.5863631963729858,2.902682304382324,-0.39218080043792725,-0.017465071752667427,2.621669292449951,2.715228796005249,1.2705549001693726,-0.859926164150238,-1.1708115339279175,2.4264252185821533,-0.9907418489456177,-0.4597810208797455,0.5852158069610596,-0.23000484704971313,0.540760338306427,2.7056145668029785,-2.8962574005126953
81,0.46122220158576965,0.8789699673652649,-0.6010453701019287,3.442317247390747,0.22769194841384888,0.5015416741371155,-0.8239336013793945,-1.914961814880371,-0.9654149413108826,-0.4604545831680298,0.04922205209732056,2.3988044261932373,2.24196457862854,0.09306981414556503,-0.9534624814987183,-1.3796874284744263,1.3006393909454346,1.6628817319869995,1.6025540828704834,1.1643755435943604,-0.11394644528627396,1.2830544710159302,-0.3877907693386078,-2.26607084274292,1.3299615383148193,-0.4861487150192261,-1.3777027130126953,2.3053781986236572,-0.42947402596473694,1.5898228883743286,-1.395403265953064,0.7153356075286865,2.450162887573242,-1.0406382083892822,-0.3947945237159729,0.8023825287818909,0.2936428487300873,1.1758378744125366,-0.8175715208053589,-1.661102294921875
82,1.8951221704483032,1.5686848163604736,-0.4556659460067749,1.3937373161315918,-1.8853940963745117,0.8648005127906799,-2.209657907485962,0.5134690999984741,0.056024253368377686,1.0074551105499268,-0.5901288390159607,1.1066176891326904,0.6121608018875122,0.0006937072612345219,-1.694359302520752,-2.1267852783203125,2.2622854709625244,-0.09457246959209442,-1.0555448532104492,2.260585069656372,1.379511833190918,1.1238402128219604,1.659082293510437,0.19752629101276398,1.9952552318572998,-0.5776554346084595,-0.4919467568397522,1.7351841926574707,1.0794142484664917,0.9074435830116272,-0.8000869154930115,-1.2385283708572388,1.7841854095458984,-0.11743853241205215,-0.48999834060668945,0.7301368117332458,-0.05247703194618225,-0.16714030504226685,2.0450596809387207,-1.804439902305603
83,1.5699284076690674,3.352360963821411,-0.875244677066803,1.549162745475769,-0.13409791886806488,1.0741407871246338,1.0062696933746338,0.5098403096199036,-0.9950177073478699,1.6406527757644653,1.4419491291046143,1.1211681365966797,-0.012917689047753811,2.1144659519195557,-0.5500057339668274,-2.5672719478607178,1.7228842973709106,2.340601682662964,1.9016823768615723,1.6048942804336548,0.08338896185159683,0.6987764835357666,0.08884743601083755,1.9493894577026367,0.9326884746551514,1.91525137424469,1.539836049079895,2.44520902633667,0.7243640422821045,1.1587049961090088,0.6298636198043823,-1.7400816679000854,-0.15570352971553802,0.8543485999107361,0.2787424623966217,1.2539814710617065,1.3388125896453857,1.269052267074585,2.2511420249938965,-2.6149866580963135
84,1.9541863203048706,1.6324692964553833,-0.6132913827896118,1.4979746341705322,-1.889106273651123,0.7964948415756226,-2.1632561683654785,0.4805672764778137,0.01613732986152172,0.9807078242301941,-0.5631996989250183,1.0529530048370361,0.5939628481864929,-0.14276109635829926,-1.6285799741744995,-2.405862331390381,2.3161535263061523,-0.09537892043590546,-1.0119587182998657,2.3374454975128174,1.428155779838562,1.1144006252288818,1.5209860801696777,0.32666680216789246,2.1825664043426514,-0.5405436754226685,-0.5343332290649414,1.6162924766540527,1.1920993328094482,0.8613058924674988,-0.6503533720970154,-1.3863098621368408,1.8047956228256226,-0.06435386836528778,-0.5430455803871155,0.6802495718002319,-0.009381265379488468,0.08874107152223587,1.9365746974945068,-1.8708086013793945
85,0.9373469352722168,3.517127752304077,0.07228342443704605,2.278721809387207,1.0004503726959229,-0.21720927953720093,0.2829289436340332,0.7640321850776672,-1.0298740863800049,2.469618082046509,0.8282129764556885,1.0973118543624878,-0.09724009037017822,1.0525097846984863,0.4155331254005432,-3.22526478767395,1.4331897497177124,2.163757562637329,2.0395002365112305,1.7473597526550293,0.055420488119125366,0.8646581768989563,0.005531749222427607,1.9898086786270142,0.7793892025947571,2.2224528789520264,1.2005317211151123,2.4198505878448486,0.817663848400116,1.286104440689087,0.5528100728988647,-1.5081523656845093,-0.13106530904769897,0.804457426071167,0.2993221879005432,1.3013428449630737,1.2693692445755005,1.332580804824829,2.1521341800689697,-2.361063003540039
86,2.576772689819336,2.9472274780273438,1.292352557182312,0.3879099190235138,-0.8011910319328308,2.1116080284118652,0.3918530344963074,-1.904629111289978,2.0185534954071045,-0.5891754031181335,-0.22139093279838562,0.9729748964309692,-0.49019086360931396,2.804462194442749,-1.3959282636642456,-3.055527925491333,-0.07719742506742477,2.7234833240509033,0.7865891456604004,1.7129486799240112,2.931648015975952,1.5510478019714355,1.1108742952346802,-0.240318164229393,-0.6775941252708435,-0.8881251811981201,1.5514079332351685,2.370126247406006,1.6955280303955078,2.856919050216675,-1.8093465566635132,-0.6276597380638123,1.6255366802215576,-0.316851407289505,-2.7394564151763916,1.8821383714675903,-0.47244903445243835,2.0557010173797607,1.8891091346740723,-0.5221371650695801
87,1.8856836557388306,1.0333267450332642,-0.06630177050828934,1.3774720430374146,-2.955101251602173,0.6548353433609009,2.2082369327545166,-1.1233205795288086,-2.1137726306915283,0.4639619290828705,-1.2666947841644287,-0.5722810626029968,1.462005615234375,0.6304050087928772,-1.9085029363632202,-2.5697827339172363,0.21815814077854156,0.34984809160232544,1.2844420671463013,-0.4382251799106598,1.307091236114502,2.6717774868011475,2.6298201084136963,-2.2484445571899414,1.1976170539855957,-1.0326874256134033,-0.9533683061599731,2.0940990447998047,0.24615003168582916,-0.17159271240234375,0.25707295536994934,-3.4897513389587402,1.5311020612716675,1.3088644742965698,-1.3795078992843628,-1.146470546722412,-0.2183641940355301,-0.6920769214630127,0.8440808653831482,-3.032649517059326
88,2.024533748626709,0.8124686479568481,0.6629838943481445,2.318988084793091,-0.17944295704364777,0.034407634288072586,-0.12635040283203125,0.27727437019348145,0.27115774154663086,0.8433743119239807,-0.4170880615711212,1.2039622068405151,0.757249116897583,-0.6132441759109497,-2.159379720687866,-2.2492434978485107,1.8049997091293335,0.11549846827983856,1.6257168054580688,1.1307363510131836,0.9176318645477295,0.9074205160140991,1.2120391130447388,-0.5368363857269287,1.91469144821167,-0.1563236117362976,-0.1384405791759491,1.6535218954086304,1.6640276908874512,0.7465999722480774,-0.7785031795501709,-0.8380503058433533,1.5809072256088257,-0.7714928388595581,-0.5213371515274048,0.3513681888580322,0.1901400238275528,0.008281462825834751,1.8291351795196533,-2.13332462310791
89,2.0286548137664795,0.19912445545196533,2.637312173843384,0.9297113418579102,-0.03246377035975456,1.9340251684188843,1.5545302629470825,1.1081799268722534,1.9679924249649048,-0.2561536133289337,-1.9191722869873047,0.21697357296943665,0.2656513750553131,-1.0429179668426514,-1.969103455543518,-2.4568068981170654,3.6613287925720215,-0.08672072738409042,1.3724377155303955,0.01317243929952383,-0.7194494009017944,-0.0513150654733181,0.780836284160614,-0.9566739201545715,1.0689010620117188,-0.06478535383939743,-2.3973402976989746,0.6828054189682007,1.670404076576233,0.44714581966400146,-2.632084846496582,-1.5352314710617065,0.9025989770889282,0.16336879134178162,-1.486830472946167,2.0964441299438477,-1.729361891746521,-1.6095377206802368,1.6611263751983643,-1.450622797012329
90,-0.38898661732673645,2.8091626167297363,2.376340866088867,2.6866018772125244,-1.977726936340332,0.4870167672634125,-1.1065573692321777,1.9590939283370972,1.9630440473556519,1.8405134677886963,-0.8216001391410828,1.3686754703521729,2.543560266494751,1.769533634185791,-0.08412646502256393,-2.0378379821777344,-0.332588791847229,-1.773378610610962,1.5716420412063599,2.5392367839813232,1.1823112964630127,2.3626437187194824,1.1099225282669067,0.6984691619873047,1.0146456956863403,-1.4700417518615723,0.3261411488056183,3.377741813659668,1.2167634963989258,-1.7702442407608032,-1.6455295085906982,-0.7495988011360168,3.7758829593658447,0.31112906336784363,0.04576454684138298,-0.0520809181034565,-0.9108105897903442,-2.222935438156128,2.2545626163482666,-0.999557375907898
91,1.69587242603302,1.6229702234268188,-0.7895812392234802,2.2479164600372314,-0.48802292346954346,0.6790224313735962,-2.6753597259521484,1.1903564929962158,0.09611612558364868,0.9655805826187134,-0.7368474006652832,1.0785934925079346,0.7727749347686768,0.1733996719121933,-2.022700071334839,-2.0355424880981445,2.673731565475464,-0.17440450191497803,-0.6602562069892883,2.25508975982666,1.8447597026824951,1.2850935459136963,0.7114354372024536,0.6353158354759216,2.2406742572784424,-0.7427394390106201,-0.9429470896720886,1.730868935585022,1.2629810571670532,0.809242844581604,-1.0044395923614502,-1.1918151378631592,1.9142036437988281,0.010403512045741081,-0.7724427580833435,0.7903828620910645,-0.01668034866452217,-0.07682537287473679,2.224573850631714,-1.9403362274169922
92,1.9149739742279053,-1.8196278810501099,0.7403940558433533,2.7387583255767822,-0.198917955160141,2.5458884239196777,-1.7652267217636108,-0.4789275527000427,0.5865139961242676,-0.05239995941519737,1.955811619758606,1.0564523935317993,0.7647075057029724,-1.5415431261062622,-1.015309453010559,-3.011261224746704,0.9425171613693237,-0.4101215898990631,0.6103783249855042,2.527920961380005,1.2210742235183716,1.5941203832626343,-0.24548934400081635,-2.220059394836426,-0.15195807814598083,0.37559282779693604,-1.4181548357009888,3.3637821674346924,-0.0033160196617245674,1.262621521949768,-0.36519721150398254,-0.2385535091161728,1.6928014755249023,-1.0805060863494873,-1.1912037134170532,1.566550850868225,-0.2709425687789917,-0.035380177199840546,-0.821013331413269,-2.3618292808532715
93,0.31985077261924744,2.050208330154419,2.371708393096924,3.0212199687957764,0.2750839591026306,1.0938496589660645,2.4213387966156006,-2.0688912868499756,-2.2933578491210938,2.5403780937194824,1.4104607105255127,1.459354043006897,1.0849751234054565,0.1109212338924408,-2.870727062225342,-0.7041698098182678,3.1446733474731445,1.8173878192901611,0.08379295468330383,-0.8810633420944214,2.231558084487915,1.260559320449829,2.6611435413360596,-0.3842063248157501,1.0605124235153198,0.42038074135780334,0.764971911907196,1.754346489906311,-0.42351171374320984,0.905237078666687,-3.0303940773010254,-2.9758238792419434,0.7983384132385254,-2.15995192527771,0.7098795771598816,2.9027774333953857,-0.2062973827123642,0.29301732778549194,1.9825438261032104,-0.9624695181846619
94,0.11559413373470306,1.3622716665267944,3.003505229949951,2.094677686691284,-2.6502838134765625,0.8565970063209534,-1.0895715951919556,1.6847021579742432,2.107921838760376,2.019082546234131,-0.29366788268089294,1.4295654296875,2.3146440982818604,1.8454489707946777,-0.23551003634929657,-1.9576925039291382,-0.3623015880584717,-1.773257851600647,1.6191333532333374,2.680128812789917,1.2256488800048828,2.2906758785247803,1.202262043952942,0.5857419371604919,1.0817152261734009,-1.4834887981414795,0.2603347599506378,3.3451344966888428,1.1742284297943115,-1.8864212036132812,-1.6433449983596802,-0.7240797877311707,3.6889145374298096,0.29234349727630615,0.017680462449789047,-0.033374104648828506,-0.9100000858306885,-2.2390336990356445,2.343935966491699,-1.0001535415649414
95,1.3802695274353027,-1.533812403678894,1.1742775440216064,2.2135510444641113,-1.808709979057312,2.259692668914795,-1.30522620677948,-1.2250081300735474,0.998070240020752,-0.9147034287452698,1.1026941537857056,1.8432989120483398,-0.11294631659984589,-1.0162333250045776,-0.5394983291625977,-3.3630523681640625,1.398434042930603,-0.8800561428070068,0.6856598854064941,2.266430616378784,0.8876798152923584,1.8329484462738037,-0.5463306307792664,-1.9651515483856201,-0.01138288713991642,0.16971831023693085,-1.4689680337905884,3.17411470413208,-0.0851646438241005,1.2110276222229004,-0.6088863611221313,-0.210136279463768,1.6030302047729492,-0.9986283779144287,-1.3468002080917358,1.683210849761963,-0.15251989662647247,-0.014975402504205704,-0.8581991195678711,-2.4008638858795166
96,1.6388351917266846,-0.07107695192098618,-0.5951417088508606,2.764406681060791,-0.6154595017433167,-1.5925418138504028,0.651408314704895,2.0388288497924805,-0.8852167129516602,1.1103368997573853,-1.9650650024414062,2.491307497024536,1.079372525215149,0.94399493932724,-2.6007797718048096,0.5521844029426575,0.8630133271217346,0.23301097750663757,1.986565351486206,0.17082184553146362,1.0561877489089966,0.3805122375488281,3.0151450634002686,2.18654203414917,3.4459567070007324,-1.0675314664840698,0.1617528796195984,1.3360259532928467,0.4540608525276184,0.8286867737770081,0.5471289753913879,0.8577550649642944,2.772324800491333,-0.010343706235289574,-0.6925539970397949,-1.4598084688186646,0.5852421522140503,1.7220139503479004,1.8024866580963135,-0.5603875517845154
97,1.1227792501449585,1.332228183746338,1.5915025472640991,1.8790987730026245,-1.8843350410461426,-2.1852622032165527,-0.6856634020805359,-0.8477015495300293,0.05599752441048622,2.206627130508423,-2.2506818771362305,1.0754331350326538,1.552490234375,-0.14316344261169434,-2.2631874084472656,-0.6948520541191101,0.887357771396637,-0.6662687659263611,1.0182918310165405,1.105182409286499,1.086971640586853,-0.903777003288269,3.614534378051758,-1.1627836227416992,0.831272542476654,-1.852827787399292,-0.7640805244445801,1.858633279800415,2.6782872676849365,0.5803368091583252,1.18594491481781,-0.5942726731300354,0.510931134223938,-1.0327262878417969,-0.25088009238243103,-0.5408404469490051,-1.2156120538711548,0.18516206741333008,3.747093677520752,-0.7432295083999634
98,1.9898415803909302,0.7431800365447998,0.6490973234176636,2.4337592124938965,-0.14157934486865997,0.2573837339878082,-0.3176844120025635,0.08012605458498001,0.3527759313583374,0.9903430938720703,-0.04170195758342743,1.1321848630905151,0.7510383129119873,-0.6699569821357727,-2.240204095840454,-2.2872955799102783,1.9323341846466064,0.020835865288972855,1.7146782875061035,1.0609949827194214,0.9473117589950562,0.799123227596283,1.2749673128128052,-0.1970929205417633,2.119399070739746,-0.35790592432022095,0.15207837522029877,1.7704437971115112,1.6656196117401123,0.9027677178382874,-0.8281521201133728,-0.7794132232666016,1.6740003824234009,-0.7248813509941101,-0.6051167249679565,0.39559516310691833,0.12858648598194122,0.14955492317676544,1.5981916189193726,-2.0639231204986572
99,2.699341297149658,1.878328561782837,1.991767168045044,0.6058769226074219,0.04791933670639992,2.2373452186584473,-1.0530167818069458,-2.0737833976745605,1.6095720529556274,-1.013109803199768,-0.5545262098312378,1.0769199132919312,-0.004870140925049782,2.821650743484497,-1.6952075958251953,-2.854137420654297,-0.04324367642402649,2.9528303146362305,1.152728796005249,1.5086970329284668,3.0989480018615723,1.6471774578094482,1.0454522371292114,-0.36820343136787415,-0.49201375246047974,-0.8846439719200134,1.6586436033248901,2.40533709526062,1.578501582145691,2.795598268508911,-1.714507818222046,-0.6083603501319885,1.7133140563964844,-0.28449612855911255,-2.7487807273864746,1.8890111446380615,-0.5123350024223328,1.965997576713562,1.914872646331787,-0.5434026122093201
