"","PC1","PC2"
"1",-0.466825437925362,-0.262348274042974
"2",-0.459213112552774,0.00563334406578855
"3",-0.448961663399563,0.366521745124615
"4",-0.479292566697873,-0.701236679112073
"5",-0.481488781271944,-0.778551442533575
"6",-0.425527815669959,1.19147865720302
"7",-0.456633198625516,0.0964557242154289
"8",-0.468911704343988,-0.335792461372369
"9",-0.465350593037784,-0.210428354689991
"10",-2.93321495735592,0.307404613531203
"11",-0.425694565338497,0.64627968416696
"12",2.56160565788209,0.25676406573418
"13",0.517996436095437,-1.18940733616441
"14",0.608768999090117,2.00611796269517
"15",0.554874618797167,0.108839203444528
"16",0.465580318302925,-3.03464586362446
"17",0.56082690610105,0.318381426756729
"18",0.531209841665947,-0.724247265856584
"19",0.571434719477961,0.69181514828236
"20",0.569716758853148,0.631336668244448
"21",0.56910013995334,0.609629433932004
