"","PC1","PC2"
"1",-3.12353459456568,1.26650733995667
"2",-3.02187245058665,-0.248603490020504
"3",-3.08364917149128,-0.145304612068825
"4",-3.54229379683043,0.953227354680997
"5",-3.14400300937005,1.11441725988449
"6",-3.16296045535645,0.263648333832284
"7",-3.10259672778122,0.632054716300243
"8",-4.07788318088305,-0.0534400997153763
"9",-2.6107690964261,-0.496615209086479
"10",-2.50495301645864,-1.2075372220166
"11",-1.2888265491611,-2.37519698845433
"12",2.08044415006353,-0.9918398678765
"13",3.43454812895613,-0.0570083433157453
"14",3.43963536427962,-0.413100523605989
"15",4.2301148975156,1.2058499235097
"16",3.53892761169508,0.298210929140423
"17",2.97877401757847,0.16797447993669
"18",2.21326683770532,-0.047464890970149
"19",2.62788187118697,-0.52347326821336
"20",3.58924612534759,-0.378217076945766
"21",4.53050304458235,1.03591125504814
