"","PC1","PC2"
"1",0.13749998051442,-0.635394492875102
"2",-0.871791128094222,-1.3502978400301
"3",3.61684074604133,-2.610139707971
"4",-1.11174387395258,0.854520147038236
"5",0.621492630902011,-0.072596325639997
"6",0.40366060494368,0.591429040013118
"7",-1.20569481922436,1.10337963357459
"8",-0.675400467756277,-0.470516435150639
"9",-0.605018359737051,-0.398490618541451
"10",-0.378345673601031,-1.79819788086065
"11",0.489719522947766,0.120362754781618
"12",-0.250529740935401,2.2697790618652
"13",1.04089200518568,-3.38797489535161
"14",3.67446789496784,-2.99481406905302
"15",-1.77184509071289,4.01946031953213
"16",-0.474406427658452,-0.966113938078883
"17",1.67628251580794,1.06956874275814
"18",-0.536004355385863,-1.75604884857782
"19",-0.45956189534911,-0.634205594009396
"20",-1.90050340050266,3.02457332265399
"21",1.30635504503248,-3.92686896851746
"22",-2.00148625833087,3.84394287686344
"23",2.36092426765479,-2.81037535003207
"24",-5.10756666261446,-2.41242231266564
"25",-5.34430080104847,-2.32350035545305
"26",0.0334025880911085,2.10020140199789
"27",-0.606642761348921,-0.37464530804237
"28",-0.846134068130741,-1.14125321140213
"29",-4.76887260816516,-2.57887299174595
"30",4.57387583531476,2.51456641206046
"31",0.446826400929215,-0.0879757731594807
"32",-1.83013825146646,2.9531060396479
"33",-0.458163078795896,-0.803215706596473
"34",-0.645083665047988,-2.43998229403317
"35",0.662227428080133,0.989818203679977
"36",4.5766976806814,2.44026702069108
"37",3.58593820137735,-3.03239999552957
"38",-2.14472173945738,3.11757992407828
"39",-3.02406183300585,-1.51179950494847
"40",-1.63982707754788,3.45369672380736
"41",4.60377300856675,2.43187857272113
"42",-0.0873810196548322,2.14263733821741
"43",-0.441715038987118,-1.03728907452683
"44",1.07028378529997,-0.502476072192533
"45",4.59245445208567,2.44989044673204
"46",-1.56200376102339,3.45677377083777
"47",4.88204013262038,2.94502367502449
"48",0.503747753484127,-0.171446628378103
"49",3.43725125329415,-1.95739710583757
"50",2.60672216449829,-0.322691012207304
"51",4.6037269460205,2.48035428293245
"52",1.58397932147732,0.777073386204984
"53",-0.596903150204716,-0.553820529761781
"54",-4.66547457786439,-2.62461536824871
"55",-1.70191540867013,3.11741507683956
"56",-0.377208410064262,0.644749141709105
"57",-0.654651902679838,-0.540659356012062
"58",0.936338680571299,-3.27276120155331
"59",-5.23446300811805,-2.28067825242344
"60",-3.09747377044853,-1.49982415871892
"61",-0.92837968796135,0.692773115147401
"62",-0.0175575690220676,2.4839230867073
"63",0.0965480418096562,-1.02772661321133
"64",4.86869304902664,2.79484957662316
"65",-5.3250169014973,-2.43522433084243
"66",-1.69099122427839,3.31289719523729
"67",2.48629927910383,-3.11802902902106
"68",-0.640121721764593,0.68498897218382
"69",0.52514877068047,0.761807013337969
"70",1.28698680238344,-3.87963346669794
"71",-0.190078130640354,0.825693166018264
"72",-0.597063389408149,-0.511027080073468
"73",0.349718197390968,-0.681834091411673
"74",-0.287094674338458,1.16397144765966
"75",0.798323101646546,-0.11861602063974
"76",0.46450582873736,0.710018560330229
"77",-0.214578684037048,-0.247520572575857
"78",2.2383454432534,-3.31083804699358
"79",-0.445757299661589,0.444324885758196
"80",0.292923511577612,-1.03301305427482
"81",0.26993196361937,-0.960986739294508
"82",-2.10487911086088,4.04285108602721
"83",0.571183374312811,-0.0797919305858541
"84",-1.79270059665721,3.31928012869193
"85",0.724148102276503,0.132848834063194
"86",-1.34690345866134,3.66315401849696
"87",-0.166664299778754,1.28504599475275
"88",2.43679729599724,-2.77765585440623
"89",-0.628873546712282,-0.505207567500553
"90",0.975996659573828,-3.3655580734952
"91",-0.490458929665078,-2.01944036872838
"92",-0.0889347356210667,-0.183748704053416
"93",-1.74003048071132,3.34998773631413
"94",-2.68371223194568,-1.75918895498583
"95",-0.988988138271157,-1.88149150605351
"96",-1.40630144308331,2.9797989096992
"97",2.03417422588847,0.248313264273434
"98",3.61547309067394,-3.07777993370968
"99",-0.661048361146789,-0.49970621463357
"100",-0.549448883033048,0.947205023730249
