,0,1,2,3,4,5,6,7,8,9,10,11,12,13,14,15,16,17,18,19,20,21,22,23,24,25,26,27,28,29,30,31,32,33,34,35,36,37,38,39
0,3.153231143951416,1.0191340446472168,1.4518848657608032,3.498361349105835,-0.5574703216552734,0.729591429233551,0.10080572962760925,0.7574150562286377,0.2520291805267334,1.510542631149292,-0.3370555341243744,2.0734992027282715,0.4912251830101013,-0.2392430156469345,-3.4143636226654053,-3.508901357650757,2.5674359798431396,0.1691007763147354,3.071091890335083,1.9920834302902222,1.3686611652374268,1.5495660305023193,2.2799861431121826,-0.4012981653213501,2.9849321842193604,-0.41874387860298157,0.21093708276748657,2.6461734771728516,2.684793472290039,1.4932836294174194,-0.7123637795448303,-1.2911827564239502,2.754875898361206,-1.0037710666656494,-0.3066183626651764,0.7789175510406494,-0.10173504054546356,0.6553239822387695,3.0628037452697754,-3.0174453258514404
1,2.359606981277466,1.0443016290664673,1.2378112077713013,2.866147518157959,-0.8469582200050354,0.5583694577217102,-0.15633276104927063,0.7374876737594604,0.8153275847434998,0.07439962029457092,1.0483847856521606,-0.4083804190158844,1.6317636966705322,-1.2898178100585938,-1.7319668531417847,-2.971547842025757,1.582539439201355,0.043647777289152145,2.121751546859741,1.1907880306243896,0.6631326675415039,0.9978837966918945,0.9643287062644958,-0.18698711693286896,1.7533576488494873,0.7380037307739258,0.5446658730506897,0.21400533616542816,3.0150339603424072,0.4742338955402374,-1.2742115259170532,-0.28830763697624207,1.7637749910354614,-0.5932292938232422,-0.06955040246248245,0.47761091589927673,0.0806538462638855,0.3588224947452545,1.7449307441711426,-2.127915143966675
2,1.2842923402786255,1.2852803468704224,2.4173789024353027,0.9357863664627075,-1.919132947921753,-2.4084389209747314,0.14530876278877258,1.471551537513733,1.0163601636886597,1.8179372549057007,-2.372927188873291,2.0149502754211426,-1.3991740942001343,0.777732789516449,-2.3662807941436768,-0.7945596575737,0.9454165697097778,-1.990027904510498,2.1965413093566895,0.7491093277931213,0.7791494131088257,-0.30471110343933105,1.951020359992981,-0.6616350412368774,0.9597020745277405,-1.482689380645752,1.1833146810531616,1.728861689567566,2.3726601600646973,0.8837234973907471,1.1315412521362305,-1.3797718286514282,1.171807050704956,-0.9404447674751282,0.5655713081359863,-0.5425790548324585,-1.3138892650604248,0.5151281952857971,3.0625085830688477,-0.2791198790073395
3,2.076124906539917,0.8898013830184937,-0.9666189551353455,2.147433042526245,0.9521164894104004,1.7251898050308228,-0.505861222743988,-0.0775953084230423,-0.74033123254776,1.010903239250183,-1.3753029108047485,1.2842743396759033,0.5913512110710144,1.5395424365997314,-2.56184983253479,-1.979764461517334,1.4843136072158813,0.4406260550022125,1.7747379541397095,1.8518152236938477,0.6966376900672913,1.631171464920044,1.0508930683135986,-1.0744763612747192,1.3551676273345947,0.5064972043037415,-0.7916855812072754,1.8044146299362183,1.3904592990875244,1.1850857734680176,-1.5312652587890625,-1.406823754310608,1.8585869073867798,-0.3623468279838562,-0.8162041306495667,1.0074257850646973,0.2601567506790161,0.595996081829071,1.3124580383300781,-2.7275917530059814
4,2.938535213470459,2.330105781555176,1.4402706623077393,-0.3783645033836365,-0.38661989569664,1.31131911277771,0.34548041224479675,0.7085669636726379,0.5894444584846497,1.5191657543182373,-0.16197392344474792,1.4144887924194336,0.30928727984428406,0.37629345059394836,-1.8709267377853394,-2.316713571548462,1.0067124366760254,0.47891291975975037,1.9482110738754272,1.669187307357788,0.4433997869491577,1.4831125736236572,1.7960093021392822,-0.6939448714256287,2.176119565963745,0.20415301620960236,0.0734964907169342,1.611717939376831,1.5693968534469604,0.9772033095359802,-0.7009435296058655,-0.5874804854393005,2.19553804397583,-0.24738319218158722,-0.3429338037967682,1.0130293369293213,-0.5930429100990295,0.8764471411705017,2.02752947807312,-1.6403982639312744
5,1.920638084411621,0.7643158435821533,0.8150103688240051,2.6591882705688477,-1.5922770500183105,-1.158255696296692,0.6096424460411072,0.19871361553668976,0.36280348896980286,0.6816633939743042,-0.7188573479652405,1.6494266986846924,0.23709851503372192,1.1837249994277954,-2.093632459640503,-2.271357297897339,2.128948926925659,0.15428519248962402,1.5935273170471191,1.141375184059143,0.7369661331176758,1.4753073453903198,0.969134509563446,-1.041933536529541,1.4554418325424194,-0.1736544668674469,-0.4284019470214844,3.035421133041382,0.7081503868103027,1.5639965534210205,0.030047107487916946,-1.5981249809265137,1.932385802268982,-0.5515997409820557,-0.050745584070682526,0.8238411545753479,0.23172271251678467,-0.1578298956155777,1.7161697149276733,-2.222557783126831
6,1.5407198667526245,0.6864912509918213,-0.8716814517974854,2.6637444496154785,0.802402675151825,1.906430959701538,-0.8695067167282104,0.7967531681060791,-0.7198619246482849,1.1113828420639038,-1.378797173500061,1.405200481414795,0.5599021315574646,1.6505109071731567,-2.524322271347046,-1.99346923828125,1.5518410205841064,0.5747070908546448,1.7527726888656616,1.9460954666137695,0.8394847512245178,1.5437796115875244,0.9515303373336792,-0.8809612989425659,1.2812198400497437,0.49532902240753174,-0.8494621515274048,1.913248062133789,1.4755290746688843,1.1515629291534424,-1.489189863204956,-1.377295732498169,1.7960044145584106,-0.17953810095787048,-0.7304151654243469,1.2115918397903442,0.20867837965488434,0.5132456421852112,1.3180409669876099,-2.5751402378082275
7,2.323410987854004,0.06883376836776733,0.3257053792476654,1.7487138509750366,0.8308929800987244,0.8453989624977112,-1.4325722455978394,0.1611408144235611,0.04370904341340065,0.7295039892196655,-0.47846290469169617,1.0858354568481445,0.6851403713226318,-0.3403228521347046,-2.4271256923675537,-1.9462697505950928,1.873376488685608,0.16366927325725555,1.8350560665130615,1.211696982383728,1.0643773078918457,0.8063788414001465,1.0459411144256592,-0.48207709193229675,1.9585204124450684,-0.29955559968948364,-0.1362617015838623,1.5658233165740967,1.7223414182662964,0.7950763702392578,-1.1612372398376465,-0.8185502290725708,1.7603384256362915,-0.6395765542984009,-0.4701414108276367,0.3636927306652069,0.38494643568992615,0.19279798865318298,1.5893335342407227,-2.133287191390991
8,2.1721155643463135,-0.09544354677200317,0.49297723174095154,1.9403376579284668,0.7420455813407898,0.9123221039772034,-1.5565394163131714,0.0404006764292717,0.03710106015205383,0.9356889724731445,-0.5772964358329773,1.267520546913147,0.5994675159454346,-0.2475549727678299,-2.237879991531372,-1.956760287284851,1.9136637449264526,0.24927352368831635,1.796411395072937,1.389376163482666,1.049839735031128,0.7520002722740173,1.125374436378479,-0.3746766746044159,2.020812749862671,-0.23052233457565308,-0.20180048048496246,1.5944362878799438,1.5708240270614624,0.8895456790924072,-1.1058127880096436,-0.7209944725036621,1.5468236207962036,-0.5843389630317688,-0.39997807145118713,0.5305639505386353,0.05619087442755699,0.2581581771373749,1.8326045274734497,-2.0793769359588623
9,2.8131563663482666,1.1553586721420288,1.139040470123291,2.857480525970459,-0.758179783821106,0.4827651083469391,-0.20283879339694977,0.507794201374054,1.9853246212005615,1.4493825435638428,0.5419765114784241,0.7414048910140991,2.213515520095825,-1.1512552499771118,-0.727479875087738,-2.1270618438720703,1.7210514545440674,0.07415612787008286,2.2433395385742188,1.22280752658844,0.999829113483429,0.9288421869277954,1.0870004892349243,-0.4149159789085388,1.8515394926071167,1.101113200187683,0.18978767096996307,0.13698725402355194,3.076110601425171,-0.017072364687919617,-0.8613008260726929,-0.7288344502449036,1.7652782201766968,-0.7401354908943176,-0.19112145900726318,0.3069714307785034,0.1882166713476181,0.34362101554870605,1.7797555923461914,-2.3309974670410156
10,2.0928235054016113,1.0158519744873047,0.4065377712249756,2.158883571624756,-0.8559053540229797,-0.22119402885437012,-0.2018701285123825,1.089808464050293,-0.19752617180347443,1.2097853422164917,-1.4800937175750732,1.2180148363113403,-0.05830330401659012,0.49255913496017456,-2.2014992237091064,-1.9977072477340698,1.9282066822052002,0.1766342967748642,1.0184234380722046,1.7602710723876953,0.988394558429718,1.1435396671295166,1.3873590230941772,-0.47908830642700195,2.188417434692383,-0.6239526271820068,-0.39752528071403503,1.5268120765686035,0.9765684008598328,0.848843514919281,-0.7556134462356567,-1.3387117385864258,1.901528000831604,-0.03424422815442085,-0.6793545484542847,0.5437116026878357,0.291429728269577,0.016948167234659195,1.6546082496643066,-1.9401530027389526
11,1.4457709789276123,0.696626603603363,1.7465860843658447,3.0599873065948486,-0.5992339253425598,0.9903088808059692,1.0971078872680664,-0.4056011140346527,0.0912100076675415,1.4253771305084229,0.13383251428604126,1.5425716638565063,-0.0011187400668859482,1.2987741231918335,-1.605718970298767,-2.7743520736694336,0.8423509001731873,0.496391624212265,3.018091917037964,0.8933430910110474,0.17379960417747498,1.3914554119110107,1.3873242139816284,-0.652787446975708,2.0144145488739014,0.27467629313468933,0.734026312828064,3.020993232727051,0.8793187141418457,1.7684983015060425,0.005771019496023655,-0.6514821648597717,1.3852424621582031,-0.7674052715301514,-0.0660102590918541,0.6684554815292358,-0.4792426526546478,1.3676965236663818,1.9965327978134155,-2.371434450149536
12,1.8966537714004517,0.021556256338953972,2.8667590618133545,1.5356309413909912,0.30704763531684875,2.0868048667907715,1.3818278312683105,0.47941502928733826,1.6702461242675781,-1.2550848722457886,-1.9626845121383667,0.7113921642303467,-0.28398188948631287,-0.6138179898262024,-2.7833783626556396,-2.403803586959839,3.9768707752227783,-0.17901133000850677,0.24326685070991516,0.6206160187721252,-0.03837750107049942,-0.015979338437318802,1.0221933126449585,-1.201816201210022,1.1366363763809204,-0.11619292944669724,-2.17350172996521,0.7261909246444702,1.4270089864730835,-0.03232628107070923,-2.4863483905792236,-2.0740466117858887,1.9739538431167603,0.8023516535758972,-2.195387363433838,1.444618821144104,-1.8283486366271973,-0.8891662359237671,1.3214589357376099,-1.3985483646392822
13,1.4593232870101929,1.554895281791687,3.291696071624756,0.7219442129135132,-1.4508103132247925,-2.010326385498047,0.5768916010856628,0.060454465448856354,0.6346263885498047,1.866657018661499,-1.731885313987732,1.6553492546081543,-0.5941265821456909,-0.09713076055049896,-2.253448486328125,-0.7329544425010681,0.8706297874450684,-2.058363676071167,2.0728442668914795,1.1267586946487427,1.3901668787002563,-0.5024255514144897,1.8548798561096191,-1.4459308385849,0.7331417202949524,-1.562523603439331,0.7203465700149536,1.876778483390808,2.8876421451568604,0.6072384119033813,1.1434324979782104,-1.3805980682373047,0.5569370985031128,-1.122212290763855,0.3962901830673218,-0.5195109248161316,-1.7227917909622192,0.30668070912361145,3.457601547241211,-0.5463480353355408
14,0.8765681385993958,1.2488566637039185,-1.3833128213882446,2.9145946502685547,-1.3723562955856323,-0.9059073328971863,0.06801005452871323,-1.4023818969726562,-1.3473683595657349,0.20512233674526215,0.07813858985900879,2.956303596496582,1.359300136566162,0.1957823932170868,-0.5340270400047302,-1.5479991436004639,1.2062379121780396,1.4145067930221558,1.6370476484298706,0.7667280435562134,-0.2655189633369446,1.6800435781478882,-0.3945969343185425,-2.309480905532837,1.7431833744049072,0.3677525222301483,-0.3156836926937103,1.6202545166015625,-0.1030513346195221,1.4362058639526367,-2.132417917251587,1.180458903312683,1.8138048648834229,-1.5211342573165894,0.6601456999778748,0.893848717212677,-0.40768498182296753,0.2949015498161316,-0.27450665831565857,-2.1767477989196777
15,2.6834096908569336,1.1934317350387573,0.7754740118980408,2.8299765586853027,-0.9536666870117188,0.3279096782207489,-0.30610647797584534,0.4393785893917084,-0.21072565019130707,0.610859751701355,-0.4823913276195526,-0.02105993963778019,2.697981357574463,-1.2578743696212769,-1.183976173400879,-2.356083393096924,1.5290591716766357,0.20299947261810303,2.2120611667633057,1.2686210870742798,0.8622627258300781,0.844330906867981,0.9600188136100769,-0.31338614225387573,1.2581125497817993,1.0820285081863403,0.46270424127578735,0.555728554725647,3.1458113193511963,0.6492782831192017,-1.2078993320465088,0.24087795615196228,1.7340831756591797,-0.8150132298469543,-0.4628395736217499,0.2581642270088196,0.12405715137720108,0.28445932269096375,1.880476713180542,-2.2400214672088623
16,0.5927063226699829,1.2750842571258545,-0.22716687619686127,1.9346836805343628,-2.2789242267608643,-0.06518141180276871,1.4032238721847534,2.9853174686431885,-1.009338140487671,1.478932499885559,-2.2664880752563477,2.3577468395233154,-0.6356017589569092,1.5623077154159546,-2.023324966430664,-0.2188846617937088,1.4824284315109253,0.06150108203291893,2.1295201778411865,-0.24404335021972656,0.8159275650978088,0.5029352903366089,2.936694383621216,2.1643147468566895,3.0622122287750244,-0.9210267663002014,1.214607834815979,1.3888863325119019,0.2751014530658722,1.571325659751892,0.44652819633483887,0.5878068804740906,2.7197771072387695,-1.2300870418548584,0.3150172829627991,-1.5101966857910156,1.4915486574172974,0.9818130731582642,1.5820502042770386,-0.7082221508026123
17,3.060560941696167,1.1918716430664062,1.209849238395691,3.222994089126587,-0.6232689023017883,0.3829270303249359,-0.005659515503793955,0.3996436297893524,1.5196356773376465,1.313895583152771,0.9067385792732239,0.578669548034668,1.890610933303833,-1.4804960489273071,-1.0155359506607056,-2.1866631507873535,1.6573809385299683,0.23414820432662964,2.1492202281951904,1.3488961458206177,0.9743840098381042,0.8413094282150269,1.2939555644989014,-0.3629804253578186,1.8441754579544067,1.0411460399627686,0.26793205738067627,0.13435398042201996,3.03713321685791,0.07130599766969681,-0.9561805129051208,-0.694355309009552,1.6929042339324951,-0.6868300437927246,-0.0937330424785614,0.3672572374343872,0.24134904146194458,0.21558208763599396,1.9016685485839844,-2.336904525756836
18,2.2304844856262207,-0.06910117715597153,0.40625229477882385,1.7485270500183105,0.8081362247467041,0.8515751361846924,-1.4686802625656128,-0.01535918191075325,0.4220298230648041,0.873268723487854,-0.35976919531822205,1.1329107284545898,0.48327523469924927,-0.43956366181373596,-2.0409412384033203,-2.239133596420288,1.8523117303848267,0.10448844730854034,1.6384145021438599,1.2920982837677002,0.9869275689125061,0.838097870349884,1.1787426471710205,-0.41069304943084717,2.1972274780273438,-0.3722534477710724,-0.03969777375459671,1.5614423751831055,1.7085509300231934,0.7887463569641113,-0.8479428291320801,-0.9201771020889282,1.6195614337921143,-0.6998181343078613,-0.5619155764579773,0.35405537486076355,0.07784716784954071,0.2181219607591629,1.7529975175857544,-2.1869990825653076
19,2.85617733001709,1.337807059288025,0.9670370221138,1.3605822324752808,1.6411126852035522,-1.7964606285095215,0.8387578129768372,1.557226538658142,0.15650580823421478,2.711620330810547,0.5157797336578369,-1.1891200542449951,0.6924620866775513,1.4735126495361328,-0.6553651690483093,-3.2519941329956055,0.9038841128349304,2.1622395515441895,2.8605377674102783,1.4814527034759521,0.13185732066631317,-0.054265011101961136,-0.045396655797958374,0.9808030724525452,1.2373180389404297,2.245081663131714,1.3740824460983276,1.8193416595458984,0.717089831829071,1.5201973915100098,0.30034270882606506,-1.4748973846435547,0.018948009237647057,0.06914663314819336,0.6517208814620972,0.8238440155982971,1.6296319961547852,1.1246637105941772,1.435158610343933,-2.947300672531128
20,2.1617074012756348,-1.423484206199646,2.790799379348755,2.4403746128082275,-0.3817327618598938,1.3787034749984741,1.4598721265792847,-0.6281395554542542,2.2702536582946777,-0.09946916252374649,-1.3438555002212524,1.3193960189819336,0.5784950256347656,-1.323056697845459,-2.9344584941864014,-1.0280883312225342,3.9483654499053955,-0.2031530886888504,0.4714371860027313,1.4591859579086304,0.17165997624397278,-0.6465237140655518,0.8188776969909668,-0.88152015209198,1.8910505771636963,-0.5909096002578735,-2.5531318187713623,0.7953988909721375,1.5546008348464966,-0.3090237081050873,-2.058537006378174,-1.3411706686019897,1.6593903303146362,0.8240222334861755,-2.2909300327301025,1.476622462272644,-1.8685595989227295,-0.9766738414764404,1.3854870796203613,-1.6810494661331177
21,0.43391746282577515,0.21512708067893982,0.5570875406265259,3.5535616874694824,-1.7065850496292114,-0.9591496586799622,-0.292030394077301,-2.291896104812622,-0.5893616080284119,-0.943839967250824,-0.18430031836032867,3.1867940425872803,2.226019859313965,-0.09430495649576187,-1.6438652276992798,-1.241949200630188,1.092769980430603,1.183845043182373,1.573356032371521,0.5219723582267761,-0.8024709820747375,2.5837295055389404,-0.22758615016937256,-2.2353217601776123,1.9108235836029053,-0.048408143222332,-0.28877463936805725,1.4922562837600708,0.019483020529150963,1.468382477760315,-2.3123321533203125,1.4575293064117432,1.84972083568573,-1.4523289203643799,0.696607232093811,0.8719667792320251,-0.35502639412879944,0.2767660617828369,-0.3194824159145355,-2.1572437286376953
22,3.396242618560791,0.2929741144180298,0.7290866374969482,0.6644930839538574,-2.608314275741577,-0.206429585814476,2.196319818496704,-0.9299032092094421,-2.4549779891967773,0.5255830883979797,-1.3319168090820312,-0.41746431589126587,-0.48993727564811707,0.27230432629585266,-2.21946120262146,-2.3142731189727783,0.2062474489212036,1.3905974626541138,2.0686147212982178,-1.0752280950546265,1.0406513214111328,1.5554583072662354,2.250595808029175,-1.589046597480774,1.078877329826355,-0.5236918330192566,-1.8985670804977417,2.3314576148986816,0.8021216988563538,0.7917436361312866,1.0909284353256226,-3.3271093368530273,1.3919899463653564,0.9439202547073364,-0.03603409230709076,-0.9091569781303406,0.2033093124628067,-1.8308805227279663,1.2129660844802856,-3.318197011947632
23,0.13616974651813507,2.3341751098632812,1.9242006540298462,2.1339919567108154,0.8254644274711609,0.09956522285938263,-0.7545118927955627,1.4966468811035156,-0.10376753658056259,-0.05674055591225624,-0.6801840662956238,0.9698570966720581,1.061889410018921,1.767964482307434,-3.5268516540527344,-0.3034816384315491,2.20452618598938,-0.29236042499542236,1.925120234489441,-0.5245546102523804,1.2085908651351929,1.907818078994751,-0.3847676217556,0.5131758451461792,2.1636810302734375,-0.6702665686607361,1.0070254802703857,1.9003055095672607,0.6302217841148376,-1.2317553758621216,-2.18476939201355,-0.7024495005607605,1.0814136266708374,-0.6142594814300537,-1.6986366510391235,1.7719638347625732,1.7628231048583984,-0.6856628060340881,1.0933003425598145,-1.375038504600525
24,0.05581679940223694,2.1985905170440674,1.9151378870010376,2.154369354248047,0.8209384083747864,0.06958511471748352,-0.6888020038604736,1.3861451148986816,-0.0968533530831337,-0.10626254230737686,-0.6357725858688354,0.9977935552597046,1.0828255414962769,1.7545011043548584,-3.6272919178009033,-0.3348127603530884,2.202603816986084,-0.21951739490032196,2.0423672199249268,-0.4512508511543274,1.3185486793518066,1.9206345081329346,-0.38153889775276184,0.4869233965873718,2.2264366149902344,-0.8209009766578674,1.0088603496551514,1.9697222709655762,0.6175128221511841,-1.2740371227264404,-2.2807579040527344,-0.694453775882721,1.294790267944336,-0.6244612336158752,-1.598863959312439,2.0230448246002197,1.8904088735580444,-0.654527485370636,1.0496195554733276,-1.3145374059677124
25,1.3936735391616821,0.5313907265663147,1.388388752937317,3.0325677394866943,-0.682072103023529,0.8311410546302795,1.0158370733261108,-0.41872045397758484,0.01753535307943821,1.7447563409805298,-0.15028810501098633,2.238950729370117,-0.2972753047943115,0.4124285578727722,-1.4559712409973145,-2.481682777404785,0.6637420058250427,0.48374053835868835,3.0825436115264893,1.0847386121749878,0.11568401008844376,1.1526659727096558,1.2642886638641357,-0.7758215665817261,2.05683970451355,0.20448645949363708,0.7791346907615662,2.934858798980713,0.893554151058197,1.5850355625152588,-0.08178402483463287,-0.5570605993270874,1.3153611421585083,-0.6977367997169495,0.25687265396118164,0.8213636875152588,-0.6570804119110107,1.3976470232009888,2.1990764141082764,-2.3463692665100098
26,2.0859594345092773,-0.14524812996387482,0.5431873798370361,1.9731338024139404,0.7490385174751282,0.9037830829620361,-1.6219109296798706,0.10874386131763458,0.32422247529029846,0.7857351303100586,-0.3139719069004059,1.2975759506225586,0.5591756105422974,-0.5840398073196411,-2.0878331661224365,-2.227668523788452,1.7568359375,0.2493935525417328,1.7830517292022705,1.210439682006836,1.0472174882888794,0.8184221386909485,1.1820368766784668,-0.47990041971206665,2.1419432163238525,-0.19133082032203674,0.2034483253955841,1.7328226566314697,1.780866265296936,0.9252423644065857,-0.7280758023262024,-0.7516345977783203,1.815418004989624,-0.737410306930542,-0.44954580068588257,0.33332547545433044,0.21394743025302887,0.25906187295913696,1.7022039890289307,-2.0998308658599854
27,2.2796947956085205,1.0202393531799316,0.9277380108833313,2.969749927520752,-0.6834356188774109,0.2213699072599411,-0.12721513211727142,0.6023109555244446,-0.261932373046875,1.1504288911819458,0.8586118817329407,0.3307737112045288,1.6160532236099243,-2.208611011505127,-1.5481593608856201,-2.3747222423553467,1.6162625551223755,0.07686594128608704,2.184666395187378,1.4970288276672363,1.0322514772415161,0.759620189666748,1.0739939212799072,-0.3176130950450897,1.371969223022461,0.8483037352561951,0.4618925154209137,0.22417029738426208,3.0027852058410645,0.38677433133125305,-1.1056318283081055,-0.156981959939003,1.6575138568878174,-0.6885643601417542,-0.14630210399627686,0.45909228920936584,0.31364282965660095,0.05278420075774193,1.7379066944122314,-2.1729159355163574
28,0.4750267267227173,2.6867969036102295,2.3622169494628906,2.2122488021850586,0.8539320826530457,-0.392977237701416,-1.424485683441162,-0.09862662106752396,0.9808099269866943,0.08569321036338806,0.4792824387550354,-0.8941002488136292,1.6652905941009521,1.8865392208099365,-3.0377278327941895,-1.919560432434082,2.328599214553833,-0.5826376080513,2.1893250942230225,0.22402215003967285,1.9053915739059448,1.1764590740203857,-0.8079751133918762,0.5308899283409119,2.172574996948242,0.3042016625404358,2.276022434234619,2.2745842933654785,0.5508818626403809,-0.8831901550292969,-1.4164024591445923,-0.6322775483131409,0.9060659408569336,-1.2228469848632812,-1.6404142379760742,1.8409463167190552,1.7457855939865112,-0.7834184765815735,1.6730101108551025,-1.3119195699691772
29,2.275378942489624,-1.3231627941131592,-0.07682431489229202,2.333364963531494,-0.7270484566688538,-1.132491111755371,0.6279915571212769,1.1888866424560547,1.4551177024841309,1.6193267107009888,-0.6606091260910034,0.6120032072067261,-1.6679695844650269,-0.7152460217475891,-0.6507081985473633,-2.9223575592041016,1.6930251121520996,-0.22941063344478607,1.09845769405365,1.632624864578247,-1.7411600351333618,1.8078829050064087,0.6908252239227295,0.8296136856079102,2.092146873474121,0.31270334124565125,-1.3697874546051025,0.5547361373901367,0.2908802926540375,2.995295763015747,0.13741298019886017,-0.8937175273895264,1.2534343004226685,1.0956034660339355,-0.5686386227607727,-0.5276985764503479,-1.4240940809249878,1.8855910301208496,0.9465532302856445,-2.165935516357422
30,2.872525453567505,2.380753993988037,1.3185094594955444,-0.2754535675048828,-0.37796202301979065,1.4170516729354858,0.6191116571426392,0.7864024043083191,0.4565216302871704,1.4704174995422363,-0.1811879426240921,1.4170703887939453,0.5031421184539795,0.4244697391986847,-1.9291776418685913,-2.2128825187683105,1.0559577941894531,0.520952045917511,1.9261146783828735,1.5277767181396484,0.5404726266860962,1.4779250621795654,1.7683066129684448,-0.6980005502700806,2.3625667095184326,0.1413171887397766,0.07410848140716553,1.6379461288452148,1.3966474533081055,0.9456003308296204,-0.7517120242118835,-0.6348247528076172,2.1797585487365723,-0.3405023515224457,-0.45858582854270935,1.279290795326233,-0.7917864918708801,0.8163853287696838,1.945193886756897,-1.704598069190979
31,1.4478871822357178,2.600564479827881,-0.3132340908050537,1.513933539390564,-1.6747372150421143,-0.7633972764015198,-1.872343897819519,-0.6760345101356506,0.6849187612533569,-0.2458992302417755,1.226912260055542,2.7783524990081787,0.01539588812738657,0.6213927865028381,-0.9392505288124084,-1.6984103918075562,1.0007412433624268,-0.025611180812120438,1.3797134160995483,1.4028782844543457,0.23731309175491333,1.2948421239852905,-0.5162444710731506,-2.238553047180176,0.9652566313743591,1.0383859872817993,-0.8357881307601929,2.206892967224121,-0.14417214691638947,1.182791829109192,-1.874441385269165,0.7277524471282959,1.5197548866271973,-1.9417054653167725,-0.34844887256622314,0.8902226686477661,-0.9412673115730286,0.14197245240211487,0.1575005203485489,-1.7227779626846313
32,2.795574903488159,0.9890351295471191,0.8159927129745483,2.9361681938171387,-0.965654730796814,0.32715892791748047,-0.23700322210788727,0.39108648896217346,-0.3666241765022278,0.6975427269935608,-0.6731390357017517,0.03913024812936783,2.882646322250366,-1.2659990787506104,-1.1628423929214478,-2.347106695175171,1.7571805715560913,0.22716373205184937,2.2872116565704346,1.3820056915283203,1.0064866542816162,0.949066162109375,1.253464698791504,-0.25696951150894165,1.304762601852417,1.105788230895996,0.5958256125450134,0.692213773727417,3.187464714050293,0.8001177310943604,-1.3088788986206055,0.4176844358444214,1.711211085319519,-0.574141800403595,-0.16922041773796082,0.36660730838775635,0.17470711469650269,0.23730021715164185,1.8044523000717163,-2.2026283740997314
33,-0.5939566493034363,-0.1927940547466278,3.231387138366699,3.614314079284668,-1.87590754032135,0.04336332529783249,0.968002200126648,1.4232585430145264,1.5086297988891602,2.2076332569122314,-1.179531216621399,2.2690250873565674,2.0620758533477783,1.9928208589553833,-0.16998888552188873,-1.054203748703003,-1.1320408582687378,-0.7850145697593689,2.1827280521392822,2.541624069213867,0.6890043616294861,2.4854164123535156,1.199379324913025,0.3584820032119751,0.14973799884319305,-1.4906468391418457,-1.215896725654602,4.284849166870117,0.6910786032676697,-0.6641966104507446,-0.8415692448616028,-0.833952009677887,2.824371576309204,1.4340506792068481,-1.2888288497924805,-0.08921714127063751,1.018007516860962,-1.3705977201461792,3.431905746459961,-0.3555730879306793
34,1.8633512258529663,0.8179481625556946,0.7641817331314087,2.6260905265808105,-1.4192694425582886,-0.9065209627151489,0.6430433988571167,0.2983696460723877,0.356692373752594,0.7961330413818359,-0.7009238004684448,1.6281883716583252,0.104120172560215,1.104137659072876,-1.9028276205062866,-2.2767515182495117,2.056494951248169,0.1257132738828659,1.6456637382507324,1.0625133514404297,0.7370028495788574,1.3405307531356812,1.1128087043762207,-1.2084133625030518,1.4812555313110352,-0.08913274854421616,-0.39437633752822876,3.1854634284973145,0.4308057725429535,1.6304895877838135,0.1288907676935196,-1.7793567180633545,2.0986568927764893,-0.5353425741195679,-0.09224414825439453,1.0887809991836548,0.18163271248340607,-0.06121265888214111,1.6859034299850464,-2.288496732711792
35,2.228375196456909,-1.352804183959961,-0.05283566936850548,2.243467092514038,-0.7205076813697815,-0.969931423664093,0.6798250079154968,1.3269121646881104,1.388167142868042,1.6201472282409668,-0.6759467124938965,0.5574862957000732,-1.6941301822662354,-0.7190455198287964,-0.6765158772468567,-2.7719597816467285,1.7228574752807617,-0.08381671458482742,1.0362812280654907,1.620481014251709,-1.7330663204193115,1.7705222368240356,0.8382568955421448,0.7989488840103149,2.009434938430786,0.262258917093277,-1.3523874282836914,0.5038226842880249,0.4717252850532532,2.927985906600952,0.1388351172208786,-0.8765895962715149,1.3539047241210938,1.060099720954895,-0.6871070861816406,-0.6550716757774353,-1.3098337650299072,1.9082691669464111,0.9297299981117249,-2.2484073638916016
36,0.2830149531364441,2.399829864501953,2.602658748626709,1.5814749002456665,-2.1623525619506836,-1.7199856042861938,0.8983031511306763,-0.20764771103858948,0.19591863453388214,2.356442928314209,-1.7069523334503174,1.6564637422561646,0.10814261436462402,-1.0616235733032227,-2.4982187747955322,-0.3051247000694275,0.8678804039955139,-1.5934797525405884,1.767853021621704,1.3703787326812744,1.7109752893447876,-0.9282205700874329,2.1898841857910156,-1.0520228147506714,1.1654421091079712,-1.8370858430862427,-0.06533080339431763,2.0010149478912354,3.1252031326293945,0.12880228459835052,1.1379599571228027,-0.8142015933990479,-0.03968944028019905,-1.1485735177993774,0.2913641929626465,-0.6293379068374634,-1.2324683666229248,0.26597437262535095,3.3289835453033447,-0.9159315824508667
37,1.184377670288086,1.653244137763977,-0.518207311630249,2.4158742427825928,-1.2712339162826538,-1.9266365766525269,-2.147282600402832,0.39108511805534363,-1.1459184885025024,0.30075961351394653,0.2716071307659149,3.205893039703369,-0.7255935668945312,0.8175880908966064,-0.6935701966285706,-1.6720774173736572,1.0717216730117798,0.7504103779792786,1.4548580646514893,1.640689730644226,0.3593979477882385,0.8832151889801025,-0.7596091032028198,-2.0490076541900635,1.0705156326293945,0.8652970790863037,-0.6462868452072144,1.9644622802734375,-0.12396682798862457,1.247393250465393,-1.9842877388000488,0.6735638380050659,1.5800007581710815,-1.7814171314239502,-0.0666351243853569,0.9076504707336426,-0.8909868597984314,0.10224184393882751,0.02722257748246193,-1.7837507724761963
38,0.5477986335754395,2.941715717315674,1.5413848161697388,2.778373956680298,0.13215313851833344,1.7919011116027832,1.7567139863967896,-2.067350387573242,-1.7696635723114014,2.53849458694458,1.5038087368011475,1.3233526945114136,0.8904354572296143,-0.32062190771102905,-3.1590216159820557,-0.679742157459259,1.8942933082580566,-0.02434292994439602,-1.0789090394973755,1.3532837629318237,1.8767735958099365,2.2034711837768555,2.470029830932617,-0.18019285798072815,0.44051334261894226,-0.48362186551094055,1.0558115243911743,2.0986578464508057,-0.3955082893371582,1.7501987218856812,-2.104515790939331,-2.9595372676849365,2.160982608795166,-0.1364387422800064,0.8140568137168884,2.5450665950775146,0.01291369553655386,2.519268274307251,1.8887789249420166,-0.7562912106513977
39,1.717139720916748,0.594831109046936,-0.9058672785758972,1.6886707544326782,-2.634864091873169,-0.5828701257705688,-1.5404446125030518,0.44955721497535706,-1.3189518451690674,-0.5054883360862732,0.7307057976722717,1.7589985132217407,-1.070719599723816,0.9134466052055359,-1.0852540731430054,-2.570993661880493,1.119128704071045,0.3530041575431824,1.1504772901535034,2.1714656352996826,0.4640647768974304,0.9007256627082825,-0.8808068037033081,-1.8795419931411743,0.7223832607269287,1.356820821762085,-0.8253991007804871,2.181743860244751,0.07674379646778107,1.1582684516906738,-2.0037460327148438,0.41661784052848816,1.6095842123031616,-1.916262149810791,-0.4056849181652069,0.8272386789321899,-1.0928977727890015,0.003138086525723338,0.2000749260187149,-1.6754565238952637
40,2.2940218448638916,-1.4311989545822144,0.21439552307128906,2.123013973236084,-0.7814266681671143,-1.1635578870773315,0.4722674787044525,1.2742434740066528,1.5063389539718628,1.6406086683273315,-0.714634358882904,0.6217883825302124,-1.736346960067749,-0.5494630336761475,-0.6266251802444458,-2.8922433853149414,1.6274070739746094,-0.07392583787441254,1.0316457748413086,1.5539755821228027,-1.7843079566955566,1.767503261566162,0.9854748845100403,0.7767941951751709,2.117905378341675,0.2438662201166153,-1.3079497814178467,0.5845080614089966,0.3286503553390503,2.9881625175476074,0.1081312745809555,-0.9601027369499207,1.3183507919311523,1.0704389810562134,-0.7115744352340698,-0.6045778393745422,-1.248044490814209,1.9567949771881104,0.933783769607544,-2.305839776992798
41,1.2105830907821655,0.6748534440994263,1.3734551668167114,3.0137290954589844,-0.5398064255714417,0.7067422270774841,0.9811220169067383,-0.24011017382144928,0.1439133882522583,1.6218138933181763,-0.085767462849617,1.8350085020065308,-0.144612655043602,0.7432299256324768,-1.3924909830093384,-2.6060330867767334,0.6029581427574158,0.5672762393951416,2.85675048828125,1.145093321800232,0.22794070839881897,1.3327934741973877,1.3707020282745361,-0.766383171081543,2.0040061473846436,0.16993173956871033,0.658428966999054,2.8858768939971924,0.844036340713501,1.471717357635498,-0.19693772494792938,-0.5702726244926453,1.1719167232513428,-0.5606333017349243,0.24339279532432556,0.8347915410995483,-0.5350322127342224,1.5834816694259644,2.32132625579834,-2.3695132732391357
42,2.713388204574585,1.0596650838851929,0.8041167855262756,2.8485467433929443,-0.8577198386192322,0.2838355302810669,-0.17302268743515015,0.5658266544342041,-0.1319563090801239,0.5073020458221436,-0.47120264172554016,-0.07476534694433212,2.6513547897338867,-1.2077018022537231,-1.2573556900024414,-2.4519975185394287,1.4949524402618408,0.13338835537433624,2.050685167312622,1.375519871711731,0.8767306208610535,0.894667387008667,0.9372880458831787,-0.38716015219688416,1.3809300661087036,1.0032532215118408,0.49817946553230286,0.46735650300979614,3.145951271057129,0.6585618853569031,-1.244896650314331,0.19105283915996552,1.6961791515350342,-0.6712274551391602,-0.17469333112239838,0.2732604444026947,0.1637929230928421,0.20634455978870392,1.8148882389068604,-2.3168413639068604
43,3.4002888202667236,1.5647706985473633,0.39328473806381226,-0.29460930824279785,-1.3145639896392822,1.1525262594223022,-0.2832353413105011,1.8057781457901,0.7348409295082092,2.031221866607666,-0.19475264847278595,1.5000882148742676,0.6731727123260498,0.4828253388404846,-1.63739013671875,-2.3430356979370117,1.164145588874817,0.5630769729614258,1.9357918500900269,1.743121862411499,0.5186154246330261,1.6897995471954346,1.8065305948257446,-0.6673921942710876,2.5855371952056885,0.45907464623451233,-0.006622199900448322,1.7406518459320068,1.6474446058273315,0.9220563173294067,-0.8483173251152039,-0.743979811668396,2.1408936977386475,-0.4692189395427704,-0.3529963195323944,1.0424087047576904,-0.5174886584281921,0.6301870942115784,2.128199338912964,-1.6922909021377563
44,2.290485382080078,-1.3859814405441284,0.09982562810182571,2.296992778778076,-0.753645122051239,-0.9658140540122986,0.6331927180290222,1.4334967136383057,1.2187503576278687,1.558129906654358,-0.8976259827613831,0.8359246850013733,-1.465980052947998,-0.5991376042366028,-0.37935879826545715,-2.707648277282715,1.6852054595947266,-0.007977940142154694,1.0807005167007446,1.6204891204833984,-1.8031758069992065,1.676662802696228,1.0207946300506592,0.740702748298645,1.8594913482666016,0.15527032315731049,-1.1804226636886597,0.4248417317867279,0.5718176960945129,2.909074068069458,-0.06916049867868423,-0.9403949975967407,1.1791199445724487,1.1254163980484009,-0.6125166416168213,-0.5978174209594727,-1.318581223487854,1.843058705329895,0.894601047039032,-2.205528497695923
45,2.483778715133667,2.3479561805725098,-0.37792596220970154,1.83867609500885,1.622453212738037,-1.0624650716781616,0.8394280076026917,1.7693008184432983,-1.1839044094085693,2.653195381164551,0.468974232673645,0.4632790684700012,0.4729381203651428,1.2791593074798584,0.020852722227573395,-2.906022071838379,0.8780971169471741,2.7795886993408203,2.3324437141418457,1.1735851764678955,0.2663750946521759,0.5086398124694824,0.30918577313423157,1.185189127922058,1.138113021850586,2.343618154525757,1.1546484231948853,1.8621826171875,0.8110048770904541,1.565371036529541,0.42508426308631897,-1.5127828121185303,0.20237626135349274,0.28731051087379456,0.7307581901550293,0.6617220044136047,1.9592208862304688,1.112655758857727,1.7065250873565674,-3.0448684692382812
46,1.5482473373413086,-1.0089917182922363,-0.2134663313627243,3.3314366340637207,-0.07608119398355484,-1.0964648723602295,1.7497388124465942,0.2823823094367981,-0.4222249686717987,1.2874655723571777,-1.9573101997375488,1.8330940008163452,-0.1331993043422699,-1.3590824604034424,0.1925472766160965,-2.807097911834717,1.6606395244598389,0.6593787670135498,1.010654091835022,0.8850047588348389,-2.0745136737823486,1.761725664138794,2.2440989017486572,0.6083689332008362,1.0546249151229858,-0.26836928725242615,-0.5342549681663513,-0.06653793156147003,1.7567931413650513,3.3018932342529297,-1.0065127611160278,-1.3002592325210571,1.0343084335327148,0.6192690134048462,-1.4044290781021118,-0.8368374109268188,-0.5485345125198364,1.9340190887451172,0.5526697635650635,-2.9778170585632324
47,2.9953999519348145,2.2777466773986816,1.341878056526184,-0.40954557061195374,-0.4824366271495819,1.2616124153137207,0.1330643892288208,0.6509231328964233,0.5993974804878235,1.456857681274414,-0.17107348144054413,1.4004485607147217,0.37487760186195374,0.3555026352405548,-2.177762985229492,-2.1916654109954834,0.9835252165794373,0.596890389919281,1.7900094985961914,1.6596183776855469,0.6184864044189453,1.5877736806869507,1.7704365253448486,-0.7753762006759644,2.1600067615509033,0.21040251851081848,0.05848298221826553,1.6209653615951538,1.4962154626846313,0.9549059271812439,-0.7170143723487854,-0.5788617134094238,2.079259157180786,-0.31423625349998474,-0.41653794050216675,0.9300469756126404,-0.5863396525382996,0.6860915422439575,1.8771469593048096,-1.7023183107376099
48,1.3304855823516846,2.456355571746826,0.5610224008560181,1.4157898426055908,-2.490236520767212,-2.8724923133850098,1.9200040102005005,1.0125340223312378,-0.909966766834259,2.357207775115967,-2.2181777954101562,1.8284339904785156,1.4268079996109009,-0.9996262788772583,-2.230269432067871,0.16127510368824005,0.9434743523597717,-0.23995330929756165,1.4403454065322876,1.1486656665802002,1.6587060689926147,-1.0612982511520386,2.4575653076171875,0.4130338430404663,2.3004541397094727,-1.7327055931091309,-0.835620641708374,1.5717778205871582,1.7715961933135986,0.07318610697984695,0.679377019405365,0.47257572412490845,0.41909509897232056,-1.4000433683395386,-0.03867653012275696,-1.3261024951934814,0.329804390668869,0.38748064637184143,2.740356922149658,-1.3226271867752075
49,0.9502937197685242,1.5242077112197876,0.8390744924545288,1.3238693475723267,-2.440009355545044,-1.7734639644622803,0.17861367762088776,2.871931552886963,0.12968121469020844,1.1214903593063354,-2.5911824703216553,2.333936929702759,-1.8589961528778076,2.195035219192505,-1.9170867204666138,-0.6641992330551147,1.2835981845855713,-1.19565749168396,2.43998646736145,0.003924031276255846,0.35025039315223694,0.32884445786476135,2.3464243412017822,1.0105966329574585,2.2288601398468018,-1.0665498971939087,1.9520363807678223,1.4548158645629883,0.8995524644851685,1.7647260427474976,0.758596658706665,-0.4282090961933136,2.3766062259674072,-0.9686604738235474,0.6617259979248047,-1.0861369371414185,0.4012572169303894,0.7972234487533569,1.9438397884368896,-0.30668503046035767
50,2.34291672706604,-1.3439384698867798,-0.09431874752044678,2.2189793586730957,-0.7811103463172913,-0.9642344117164612,0.6187605857849121,1.3280988931655884,1.3299148082733154,1.5327715873718262,-0.719767689704895,0.675582766532898,-1.4945564270019531,-0.6146766543388367,-0.5046575665473938,-2.7912545204162598,1.7054039239883423,0.004558525513857603,1.0325723886489868,1.7068723440170288,-1.8212668895721436,1.6436326503753662,0.9612874388694763,0.76564621925354,1.9056694507598877,0.2538795471191406,-1.3313528299331665,0.49750640988349915,0.42404115200042725,2.921891450881958,0.11826595664024353,-0.9203159809112549,1.2400546073913574,1.0792384147644043,-0.6048839092254639,-0.5577774047851562,-1.4139424562454224,1.8834244012832642,1.0630853176116943,-2.1815385818481445
51,0.9144243001937866,2.3601841926574707,-0.6353761553764343,1.8367130756378174,-1.5307046175003052,-0.330814927816391,0.7456663250923157,3.304748058319092,-1.249173879623413,1.6321978569030762,-2.4321441650390625,2.446930170059204,-0.5640882849693298,1.6563857793807983,-1.7903331518173218,-0.27609094977378845,1.6048521995544434,-0.032074812799692154,2.252257823944092,0.02442348189651966,0.8122000694274902,0.5721608996391296,2.955806255340576,2.3165528774261475,3.143620252609253,-0.9447309970855713,1.1898022890090942,1.509043574333191,0.21629385650157928,1.6134206056594849,0.497429221868515,0.7236926555633545,2.80513596534729,-1.2756904363632202,0.2844550907611847,-1.5084843635559082,1.6325998306274414,1.0966297388076782,1.5994420051574707,-0.6506631970405579
52,2.3123791217803955,0.1380174160003662,0.1541796773672104,1.8293379545211792,0.838557779788971,1.0333586931228638,-1.354699969291687,-0.016511620953679085,0.25463125109672546,0.8881307244300842,-0.28854990005493164,1.2302485704421997,0.6992492079734802,-0.6265372037887573,-2.2103817462921143,-2.3801779747009277,1.7011492252349854,0.32459136843681335,1.7618130445480347,1.2699915170669556,1.017255187034607,0.8648408651351929,1.1190743446350098,-0.44246673583984375,1.9638419151306152,-0.31588172912597656,-0.04394401237368584,1.7749170064926147,1.7446892261505127,0.7699512243270874,-0.8869943022727966,-0.8046605587005615,1.7028144598007202,-0.7305707931518555,-0.45344868302345276,0.2814551889896393,0.13119454681873322,0.09342370182275772,1.8227927684783936,-2.0999598503112793
53,0.3392563462257385,2.5100700855255127,2.268301248550415,2.3606109619140625,0.9867290258407593,-0.3634655773639679,-0.9697927236557007,-0.09932374954223633,0.8605874180793762,0.05379006266593933,0.3473336398601532,-0.7271071076393127,1.5723659992218018,1.8379936218261719,-2.868600845336914,-1.6444426774978638,2.3386282920837402,-0.5606871843338013,2.2643115520477295,0.30141252279281616,2.0508012771606445,1.0512151718139648,-0.8404297828674316,0.4351855218410492,2.2116241455078125,0.25699421763420105,2.307803153991699,2.3072879314422607,0.557813286781311,-0.845072329044342,-1.5003300905227661,-0.5668243169784546,0.8067681789398193,-1.183385968208313,-1.74845552444458,1.6133893728256226,1.7406740188598633,-0.8193593621253967,1.6340742111206055,-1.335200548171997
54,1.4223498106002808,0.8082886934280396,0.4867763817310333,1.9384405612945557,-1.506667971611023,-1.4282842874526978,-1.5625717639923096,-1.327384352684021,0.22366051375865936,-0.6696004271507263,0.4884720742702484,2.8560428619384766,0.3379973769187927,0.2708966135978699,-1.226839542388916,-1.3923100233078003,1.0814636945724487,0.12999504804611206,1.214842677116394,1.2080167531967163,-0.22648216784000397,2.007343292236328,-0.3238305151462555,-2.14457368850708,1.2975198030471802,0.7520357966423035,-0.7352537512779236,1.934848666191101,0.06870405375957489,1.218406319618225,-1.9243690967559814,1.0375244617462158,1.881442904472351,-1.5950596332550049,0.06793975085020065,0.7639186978340149,-0.6616681218147278,0.06110578775405884,-0.1283869594335556,-1.8324511051177979
55,0.6269174218177795,1.5790754556655884,-0.6224393248558044,2.35939884185791,-2.0854625701904297,3.013266086578369,0.5582177042961121,0.26969364285469055,2.619929552078247,2.0489895343780518,0.8049042224884033,0.33147311210632324,-0.6252244114875793,1.1538851261138916,-2.1373088359832764,-1.1297677755355835,0.4931846559047699,1.3802303075790405,0.7050933241844177,2.152658462524414,-0.22522613406181335,-0.09633681178092957,2.5131843090057373,-1.67985200881958,2.4129233360290527,1.364561915397644,-1.0715123414993286,2.5488128662109375,0.4400271475315094,-0.8675204515457153,0.6915364861488342,-0.23928962647914886,1.2937976121902466,0.4546564221382141,1.217711091041565,2.104891300201416,-0.34985288977622986,-1.121042251586914,2.359649419784546,-1.279179334640503
56,2.239032745361328,0.0641174241900444,0.4135945737361908,1.8381762504577637,0.7115296125411987,0.8914976119995117,-1.3557558059692383,-0.017605723813176155,0.3010075092315674,0.9518864750862122,-0.4366370141506195,1.2475048303604126,0.6513920426368713,-0.7599405646324158,-2.3807642459869385,-2.15220308303833,2.0249199867248535,0.2253074198961258,1.7625008821487427,1.2454551458358765,1.0766206979751587,0.6779285073280334,1.1790437698364258,-0.45427265763282776,2.021702766418457,-0.31102481484413147,0.030954046174883842,1.7098877429962158,1.6901369094848633,0.9105657935142517,-0.8895600438117981,-0.7776738405227661,1.6043574810028076,-0.7409822940826416,-0.59325110912323,0.47032979130744934,0.3435514569282532,0.10605981945991516,1.7041797637939453,-2.1351888179779053
57,1.9253543615341187,0.05216972902417183,2.7025070190429688,1.4885884523391724,0.13734155893325806,2.2595629692077637,1.3610823154449463,0.42588627338409424,1.3246842622756958,-1.2942215204238892,-1.934462070465088,0.7199792861938477,-0.36406776309013367,-0.5762500762939453,-2.6452574729919434,-2.266047477722168,3.929194450378418,-0.028535574674606323,0.31877702474594116,0.6331418752670288,-0.018126999959349632,-0.06220749020576477,0.9794820547103882,-1.1400666236877441,1.1585758924484253,-0.17025136947631836,-2.2244975566864014,0.8371065855026245,1.5250415802001953,0.08135579526424408,-2.5286004543304443,-2.087494134902954,1.6162208318710327,0.9147785305976868,-2.165778636932373,1.5599157810211182,-1.859376311302185,-0.9201849102973938,1.3307080268859863,-1.5762314796447754
58,0.14698083698749542,2.250617027282715,1.9275225400924683,2.118544578552246,0.7850577235221863,0.1545017957687378,-0.722880482673645,1.5360289812088013,-0.10632331669330597,-0.08755988627672195,-0.6031789779663086,0.9898966550827026,1.0696898698806763,1.7055745124816895,-3.643756151199341,-0.2855716347694397,2.172410249710083,-0.19005148112773895,1.973198413848877,-0.6178117394447327,1.184938669204712,2.072631597518921,-0.27225857973098755,0.4272114038467407,2.2156307697296143,-0.5929847359657288,1.0836102962493896,1.9563610553741455,0.5811617970466614,-1.2207568883895874,-2.1557393074035645,-0.7395726442337036,1.1772127151489258,-0.6237831711769104,-1.8078035116195679,1.786865472793579,1.8725621700286865,-0.777981698513031,1.0493133068084717,-1.4615660905838013
59,-0.11544013768434525,2.045342206954956,1.5745353698730469,3.7313649654388428,-0.035018566995859146,1.2070804834365845,1.781489610671997,-1.9262031316757202,-1.5046827793121338,2.398496389389038,1.5415040254592896,1.1525148153305054,1.3270756006240845,-0.4907490015029907,-3.378129005432129,-0.5045220851898193,1.8273165225982666,0.05435973405838013,-1.0644240379333496,1.2766574621200562,1.9132944345474243,2.2199299335479736,2.580246686935425,-0.256069153547287,0.4831843674182892,-0.4086822271347046,0.9127482771873474,2.1214585304260254,-0.45458662509918213,1.724226474761963,-2.0655405521392822,-3.08962082862854,2.1251296997070312,-0.11435920745134354,0.932397186756134,2.549771785736084,-0.024611758068203926,2.585517406463623,1.85418701171875,-0.765617311000824
60,0.3105514347553253,2.0376405715942383,1.3919990062713623,1.8181837797164917,-1.9380507469177246,2.859144926071167,-1.0381534099578857,0.733863353729248,2.0812385082244873,2.5513432025909424,0.7869920134544373,0.4801068603992462,-0.4823422431945801,0.5342982411384583,-2.4123244285583496,-0.6898230314254761,0.4210468530654907,1.533751130104065,0.6659040451049805,2.300196647644043,-0.10836059600114822,-0.13230715692043304,2.402780771255493,-1.4549872875213623,2.4941353797912598,1.4819203615188599,-1.103759765625,2.4271674156188965,0.4035879969596863,-0.9032527804374695,0.6189149618148804,-0.3977243900299072,1.2042949199676514,0.39033856987953186,1.2843157052993774,2.073969841003418,-0.4088601768016815,-1.1494389772415161,2.2601521015167236,-1.3554879426956177
61,1.1628704071044922,0.6459940075874329,1.7692724466323853,3.1937084197998047,-0.6514765620231628,0.6613791584968567,1.191516399383545,-0.33777815103530884,0.0036564681213349104,1.5428569316864014,0.3198176622390747,1.7514551877975464,-0.06966761499643326,1.3953291177749634,-1.59462308883667,-3.027932643890381,0.665468692779541,0.42775431275367737,3.170659303665161,1.1504608392715454,0.15888825058937073,1.2334376573562622,1.3110780715942383,-0.9197590947151184,1.9292633533477783,0.05707439407706261,0.5937707424163818,2.846367835998535,0.7800459861755371,1.6883808374404907,-0.18534496426582336,-0.7267241477966309,1.2731930017471313,-0.6883889436721802,0.25984060764312744,0.8532584309577942,-0.7227235436439514,1.5703065395355225,2.233485460281372,-2.4593937397003174
62,3.747035026550293,1.1958274841308594,1.5136770009994507,3.4268343448638916,-0.14374102652072906,0.27917489409446716,-0.09927551448345184,0.5939972996711731,0.34176239371299744,1.299871563911438,-0.3662477433681488,1.890676498413086,0.47416573762893677,-0.1302644908428192,-3.5131962299346924,-3.518724203109741,2.570610523223877,0.25127512216567993,2.9636356830596924,1.8714967966079712,1.4130287170410156,1.3710099458694458,2.140967607498169,-0.5175578594207764,2.982243537902832,-0.44494298100471497,0.08881229162216187,2.5157787799835205,2.7105064392089844,1.4702473878860474,-0.9304529428482056,-1.437279462814331,2.65912127494812,-0.8407142758369446,-0.40721645951271057,0.6153120398521423,0.0021453178487718105,0.3979695737361908,2.7326602935791016,-2.991325855255127
63,1.3849692344665527,-1.0830729007720947,-0.3823760449886322,3.2935824394226074,-0.2932448387145996,-0.13623327016830444,1.7281163930892944,1.133824110031128,-0.44249576330184937,1.2951076030731201,-2.05433988571167,1.8434131145477295,-0.15019354224205017,-1.371171236038208,0.27154749631881714,-2.830294609069824,1.6072598695755005,0.5704869031906128,1.021475911140442,0.7560099959373474,-1.9852856397628784,1.8591967821121216,2.2207956314086914,0.5054970383644104,1.0783771276474,-0.3188539743423462,-0.45096153020858765,-0.02651103585958481,1.5783849954605103,3.2744038105010986,-1.0525423288345337,-1.2265223264694214,1.0734695196151733,0.7544451355934143,-1.0922809839248657,-0.6902425289154053,-0.7889644503593445,1.9579005241394043,0.6557793617248535,-2.7298243045806885
64,0.04699832573533058,2.334620475769043,1.9978845119476318,2.166172742843628,0.8568212985992432,0.15753085911273956,-0.7054359316825867,1.6260408163070679,-0.10374268144369125,-0.11608517915010452,-0.6219147443771362,0.9057466983795166,1.0157194137573242,1.7846258878707886,-3.667628288269043,-0.3325480818748474,2.229736566543579,-0.19429293274879456,1.9091131687164307,-0.5635170340538025,1.199646234512329,2.0200703144073486,-0.4058299660682678,0.54512619972229,2.1967756748199463,-0.8089773654937744,1.0315922498703003,1.9638336896896362,0.6599504351615906,-1.3145627975463867,-2.2246570587158203,-0.6942633390426636,1.2485926151275635,-0.6677485108375549,-1.7340779304504395,1.8453350067138672,1.8774421215057373,-0.6836850047111511,1.0771958827972412,-1.3985929489135742
65,3.020589828491211,1.7522985935211182,0.3142516314983368,1.3698527812957764,1.0313535928726196,-2.387674331665039,1.0961532592773438,0.6044323444366455,-0.2555483877658844,2.399634599685669,0.8276494741439819,-0.8970842957496643,0.7293426394462585,1.6705505847930908,-0.7886934876441956,-2.9896790981292725,0.9358683824539185,2.208235502243042,3.0714058876037598,1.5094798803329468,0.10130713135004044,-0.17455817759037018,-0.10151293873786926,0.9943763017654419,1.221267580986023,2.236189126968384,1.5195248126983643,1.8005943298339844,0.8811684250831604,1.5526193380355835,0.37610775232315063,-1.4686163663864136,0.07766835391521454,-0.008016273379325867,0.7987130284309387,0.7479938864707947,1.6626701354980469,1.0288949012756348,1.456863522529602,-3.0007882118225098
66,2.4784722328186035,-0.41849181056022644,1.7384308576583862,1.0085259675979614,-3.5718090534210205,0.06947260349988937,1.5322070121765137,-0.42929062247276306,-0.8094564080238342,1.3914437294006348,-2.0101606845855713,-1.4356509447097778,-0.25296562910079956,-0.13205230236053467,-2.6324002742767334,-2.203977346420288,0.16786105930805206,0.83935546875,2.1850926876068115,-1.0903894901275635,0.9534935355186462,1.8156170845031738,2.2535526752471924,-1.7172433137893677,1.3088444471359253,-0.5058050751686096,-1.6177294254302979,2.176724672317505,0.6678406596183777,0.7185406684875488,1.1977479457855225,-3.4657645225524902,1.8098454475402832,1.1991007328033447,0.21376527845859528,-0.8108692765235901,0.07810589671134949,-1.6711461544036865,1.0905542373657227,-3.2750930786132812
67,-0.20464809238910675,1.9754116535186768,0.6024940013885498,2.3322267532348633,-2.5206501483917236,2.1541290283203125,0.2842152714729309,1.2692574262619019,2.0195608139038086,2.2064595222473145,1.4765883684158325,1.4833468198776245,-0.6885615587234497,0.6904910206794739,-2.110196352005005,-0.7763885855674744,0.4066069722175598,1.6225502490997314,0.6956695914268494,2.44222092628479,-0.15464110672473907,-0.13327643275260925,2.463381767272949,-1.441664457321167,2.5220956802368164,1.521239995956421,-1.189573884010315,2.2709522247314453,0.5468640327453613,-0.8883401155471802,0.7112797498703003,-0.30665937066078186,1.2771717309951782,0.41534435749053955,1.3142495155334473,2.110646963119507,-0.3893137276172638,-1.20913827419281,2.3594260215759277,-1.3562535047531128
68,1.5610212087631226,0.9136098623275757,0.398794949054718,2.9807538986206055,-1.362274408340454,-0.7143792510032654,0.4389013648033142,0.24780428409576416,0.3225555717945099,0.8630366921424866,-0.9943643808364868,1.835416555404663,-0.070770263671875,1.1743872165679932,-1.985253095626831,-2.192888021469116,2.0183632373809814,0.1812775880098343,1.4564822912216187,1.1233845949172974,0.5963636040687561,1.382195234298706,1.116754174232483,-0.968523383140564,1.6264511346817017,0.043879058212041855,-0.6090213656425476,2.950697422027588,0.5207846164703369,1.588928461074829,-0.04214927926659584,-1.4815888404846191,2.0556952953338623,-0.46662232279777527,-0.12123870104551315,1.0080671310424805,0.20790143311023712,-0.019322920590639114,1.6721293926239014,-2.0592939853668213
69,1.8995823860168457,-1.017226219177246,2.0288033485412598,2.359625816345215,-1.0087902545928955,2.456117630004883,1.352378249168396,-0.3231089115142822,2.3980698585510254,-0.06964710354804993,-1.2265193462371826,1.4931796789169312,0.6430899500846863,-1.2731846570968628,-2.7957403659820557,-0.9600697755813599,3.9369864463806152,-0.11093518882989883,0.4316369295120239,1.3120849132537842,0.16167043149471283,-0.6450137495994568,0.8036224842071533,-0.8789499998092651,1.9858704805374146,-0.7288505434989929,-2.665642023086548,0.784218430519104,1.5986332893371582,-0.30231258273124695,-1.9458881616592407,-1.165878176689148,1.3686792850494385,0.7717416882514954,-2.2944912910461426,1.506582498550415,-1.8794441223144531,-1.0284632444381714,1.391864538192749,-1.8555277585983276
70,0.288747638463974,3.5364975929260254,-0.7411383986473083,2.165647506713867,-1.493788480758667,2.2136659622192383,0.1538880467414856,0.5945810079574585,1.3974956274032593,3.185760736465454,0.7368351817131042,0.907243013381958,-0.6152693033218384,0.7763239741325378,-2.078991651535034,-0.5052269101142883,0.5538439154624939,1.6810349225997925,0.5426028370857239,2.3372116088867188,-0.047675613313913345,-0.1683456003665924,2.401963949203491,-1.4662435054779053,2.4404704570770264,1.5083589553833008,-1.1698131561279297,2.3206498622894287,0.5733041763305664,-0.8990938067436218,0.6812966465950012,-0.2762446701526642,1.194238305091858,0.6089794635772705,1.205858588218689,2.0631496906280518,-0.3401716649532318,-1.1219890117645264,2.3803741931915283,-1.2512320280075073
71,2.176771640777588,-0.01288718730211258,0.3909526467323303,1.9172790050506592,0.7147688269615173,0.9487987756729126,-1.4392728805541992,0.09135930240154266,0.08340220898389816,0.7880184650421143,-0.42802152037620544,1.1472362279891968,0.5713434815406799,-0.4716017544269562,-2.3724095821380615,-2.12204909324646,1.972569227218628,0.14442512392997742,1.840765357017517,1.3114948272705078,1.0500097274780273,0.8503662347793579,1.131102442741394,-0.43494972586631775,2.07539963722229,-0.34715262055397034,-0.00504703214392066,1.72119140625,1.735905408859253,0.7618170976638794,-0.7419074177742004,-0.8610776662826538,1.667860507965088,-0.5440917015075684,-0.5628604888916016,0.4300524592399597,0.20206719636917114,0.08559487015008926,1.6936304569244385,-2.0327811241149902
72,2.590595245361328,1.2919518947601318,0.7774415612220764,3.4231925010681152,-1.1862683296203613,0.4548485577106476,-0.4060031771659851,0.5832569599151611,0.2685829699039459,1.4230691194534302,-0.639753520488739,1.7087116241455078,1.2217072248458862,-0.14937183260917664,-2.597499132156372,-3.0281059741973877,2.1496565341949463,0.27494505047798157,2.823809862136841,1.7457836866378784,1.2937577962875366,1.4515795707702637,2.088981866836548,-0.38735249638557434,2.5639548301696777,-0.20428471267223358,-0.07148464024066925,2.4343338012695312,2.550564765930176,1.2736486196517944,-0.7112733125686646,-1.316381573677063,2.350429058074951,-0.7764216661453247,-0.5177038311958313,0.6174950003623962,-0.041490502655506134,0.5142160058021545,2.6684625148773193,-2.931933641433716
73,2.864320993423462,0.9787088632583618,2.353361129760742,1.8302780389785767,0.6081080436706543,-1.1445140838623047,1.6424510478973389,-2.1624033451080322,-0.008461100049316883,-0.49366891384124756,-2.393491744995117,0.4017234444618225,1.242583155632019,1.8560659885406494,-0.550595760345459,-3.342151165008545,0.30100953578948975,2.252323865890503,1.1617649793624878,1.5034829378128052,2.9831082820892334,3.029201030731201,0.26792484521865845,-0.027750806882977486,-0.8254753947257996,-0.21118822693824768,0.6636767983436584,3.3178045749664307,2.070152759552002,2.663243055343628,-0.49722832441329956,0.3470849394798279,1.5883904695510864,-0.5440127849578857,-2.82283353805542,1.0066100358963013,-0.009329436346888542,2.25724196434021,2.1836533546447754,-0.4416641891002655
74,2.913989543914795,1.9478175640106201,0.295507550239563,0.006771992426365614,-0.8669968843460083,1.7169252634048462,1.1783350706100464,1.9259936809539795,0.5972484350204468,1.8071035146713257,-0.253237783908844,1.3940234184265137,0.6451122760772705,0.4613575041294098,-1.6433870792388916,-2.4334073066711426,1.1668933629989624,0.4679626226425171,1.9986649751663208,1.658429741859436,0.5025526285171509,1.5883878469467163,1.8572701215744019,-0.5346476435661316,2.4671406745910645,0.4497901499271393,-0.044177886098623276,1.7448079586029053,1.6346371173858643,0.946894645690918,-0.9130353927612305,-0.6494500041007996,2.1698012351989746,-0.3301433324813843,-0.431877464056015,1.120532751083374,-0.743828296661377,0.8593376278877258,2.2410049438476562,-1.725359320640564
75,1.406566858291626,0.9679467678070068,0.5423338413238525,3.113834857940674,-1.4658836126327515,-0.9630777835845947,0.5070908069610596,0.2436705082654953,0.21677863597869873,0.9719933271408081,-0.8295809626579285,1.5800610780715942,0.038008999079465866,0.836633563041687,-1.8914391994476318,-2.077075719833374,1.9334731101989746,0.03267422690987587,1.4494357109069824,1.1090917587280273,0.8052343726158142,1.2370202541351318,1.123207449913025,-0.9922787547111511,1.5235704183578491,0.06980269402265549,-0.4419046938419342,2.890444278717041,0.6023442149162292,1.4482910633087158,-0.03975176066160202,-1.5340838432312012,2.1479201316833496,-0.33932918310165405,-0.2094394415616989,0.973851203918457,0.33517739176750183,0.06782355904579163,1.5944429636001587,-2.064610004425049
76,2.1693673133850098,1.1975692510604858,0.6534669399261475,2.2242767810821533,-0.6695659160614014,-0.149067223072052,-0.2631588280200958,1.231364369392395,-0.28835707902908325,1.2818554639816284,-1.432404637336731,1.149704098701477,0.3172720968723297,0.6454978585243225,-2.5701510906219482,-1.862821102142334,2.045997381210327,0.2872317135334015,1.0284321308135986,1.7732399702072144,1.152681589126587,1.3244147300720215,1.5127289295196533,-0.7468351125717163,1.9692918062210083,-0.48609572649002075,-0.5897159576416016,1.7992156744003296,1.2255065441131592,0.7922206521034241,-1.0566577911376953,-1.1515820026397705,1.9737197160720825,-0.11872909963130951,-0.7093176245689392,0.3778441250324249,0.12902964651584625,0.07488062977790833,1.7408664226531982,-1.9338178634643555
77,1.9768956899642944,0.2494516223669052,0.5275067687034607,1.5567063093185425,-3.7461462020874023,0.478580504655838,2.336831569671631,-0.5520161390304565,-0.8458719849586487,1.3964594602584839,-2.088587522506714,-1.3785045146942139,-0.3742527961730957,0.15925396978855133,-2.624351739883423,-2.2602550983428955,0.23764991760253906,0.8990016579627991,2.2253334522247314,-1.1354304552078247,1.0082157850265503,1.7711403369903564,2.262993335723877,-1.7514781951904297,1.3128716945648193,-0.4124738276004791,-1.5544822216033936,2.159015417098999,0.774170458316803,0.719455361366272,1.1600258350372314,-3.4606008529663086,1.883389949798584,1.4826070070266724,0.21296730637550354,-0.8230251669883728,-0.04208800196647644,-1.6347181797027588,1.2396413087844849,-3.2754204273223877
78,0.35044848918914795,2.5633938312530518,1.903279185295105,1.2637379169464111,-2.8481431007385254,2.311493396759033,0.07716194540262222,-0.10801742225885391,1.4433103799819946,2.1497392654418945,1.247915267944336,0.8276667594909668,-1.495463252067566,1.1599407196044922,-2.3570637702941895,-0.9849231839179993,0.5075727701187134,1.4869611263275146,0.6300637722015381,2.265730857849121,-0.1585879772901535,-0.18906544148921967,2.4135215282440186,-1.5616947412490845,2.436739444732666,1.4966670274734497,-1.1424890756607056,2.316451072692871,0.504982054233551,-0.8644998669624329,0.6635040640830994,-0.38636136054992676,1.27395498752594,0.4274902939796448,1.1974356174468994,2.0831499099731445,-0.3587980270385742,-1.148209571838379,2.3807032108306885,-1.4111967086791992
79,3.0706028938293457,1.5291143655776978,1.0888495445251465,3.6984736919403076,-1.046852946281433,0.5259822010993958,-0.45879146456718445,0.6375083327293396,0.46655604243278503,1.5411322116851807,-0.5294318795204163,1.7805070877075195,1.4711954593658447,-0.2240559160709381,-2.5958774089813232,-3.157667875289917,2.4223222732543945,0.3166828155517578,2.9130687713623047,1.8281197547912598,1.315157413482666,1.3587243556976318,2.0785088539123535,-0.612172544002533,2.823744297027588,-0.17616084218025208,0.18620362877845764,2.513763427734375,2.6146881580352783,1.2482701539993286,-0.7405663132667542,-1.3853002786636353,2.2830920219421387,-0.8387821912765503,-0.4755837917327881,0.4395338296890259,-0.20679564774036407,0.37691253423690796,2.6431725025177,-2.8099610805511475
80,2.888532876968384,1.4900014400482178,0.8804450631141663,3.863729953765869,-1.3542215824127197,0.6044088006019592,-0.5291275382041931,0.5142920613288879,0.3805646598339081,1.4050201177597046,-0.7267299294471741,1.873839259147644,1.4236178398132324,-0.18864524364471436,-2.9813616275787354,-3.2606582641601562,2.463700771331787,0.09434185922145844,2.821117877960205,1.818325400352478,1.2077176570892334,1.4430534839630127,2.165339231491089,-0.591389536857605,2.906680107116699,-0.40411630272865295,-0.009716656990349293,2.615398406982422,2.7099432945251465,1.2718812227249146,-0.8686923384666443,-1.1945832967758179,2.4264252185821533,-0.9907418489456177,-0.4597810208797455,0.5852158069610596,-0.23000484704971313,0.540760338306427,2.7056145668029785,-2.8962574005126953
81,0.2544935345649719,1.1535977125167847,-0.9167919158935547,3.3191564083099365,-1.6022651195526123,-0.48958298563957214,-0.2654339671134949,-1.2660245895385742,-1.0920360088348389,0.06723104417324066,0.08017735928297043,3.0447278022766113,1.4010177850723267,0.3804815411567688,-0.6401064395904541,-1.5346686840057373,1.102187156677246,1.527814507484436,1.7332818508148193,0.8243603706359863,-0.3142225742340088,1.5425282716751099,-0.49812421202659607,-2.254599094390869,1.7231911420822144,0.315447062253952,-0.4476892650127411,1.6438910961151123,0.022871805354952812,1.3499298095703125,-2.144291400909424,1.2614160776138306,1.6606042385101318,-1.5680186748504639,0.5391044020652771,0.9438644051551819,-0.49427154660224915,0.2820652425289154,-0.2409989982843399,-2.1157805919647217
82,2.2227623462677,1.2471694946289062,0.3261752128601074,2.0663347244262695,-1.0108519792556763,-0.3004257082939148,-0.4450380802154541,1.3005887269973755,-0.12411082535982132,1.1744378805160522,-1.2158927917480469,1.1839549541473389,0.043914761394262314,0.3254542052745819,-2.2056162357330322,-1.8898868560791016,1.8671460151672363,0.2363574504852295,1.0776350498199463,1.5095871686935425,0.8752797842025757,1.1585118770599365,1.5829143524169922,-0.643568754196167,1.964063286781311,-0.5433895587921143,-0.4290800988674164,1.7426140308380127,1.026415467262268,0.9030069708824158,-0.8536778688430786,-1.2339308261871338,1.990396499633789,-0.11200803518295288,-0.5886290073394775,0.504102885723114,0.1174926683306694,0.012068579904735088,1.7760484218597412,-1.8612483739852905
83,3.1088449954986572,2.329200267791748,-0.6590075492858887,1.373508334159851,0.9544988870620728,-1.819289207458496,0.06172949820756912,0.9940891265869141,-1.1094459295272827,2.3466575145721436,1.026865005493164,-0.004152221139520407,0.687484085559845,1.676719307899475,-0.609210193157196,-2.7660553455352783,1.0031598806381226,2.627638101577759,2.5293681621551514,1.2668073177337646,0.27980005741119385,0.10444514453411102,0.17989090085029602,1.100499153137207,1.1889832019805908,2.345130443572998,1.4804497957229614,1.9116815328598022,0.9201148152351379,1.6035658121109009,0.4290551245212555,-1.5128061771392822,0.16036492586135864,0.0962366908788681,0.7846599817276001,0.6055503487586975,1.9009675979614258,1.0555425882339478,1.6458895206451416,-3.0684525966644287
84,2.3796777725219727,1.2541648149490356,0.09575780481100082,2.1193687915802,-0.8544273376464844,-0.1710490733385086,-0.3097190856933594,1.3641456365585327,-0.18230174481868744,1.220291018486023,-1.3690286874771118,1.1432502269744873,-0.05755288898944855,0.27090984582901,-2.2418456077575684,-2.152146339416504,1.9632130861282349,0.22926056385040283,0.9726043939590454,1.7881300449371338,0.9101546406745911,1.2126814126968384,1.5225573778152466,-0.5446747541427612,2.144580841064453,-0.525604248046875,-0.43407905101776123,1.6171258687973022,1.1107474565505981,0.8513224124908447,-0.7194129824638367,-1.405800223350525,2.006014585494995,-0.052293334156274796,-0.5813536643981934,0.4788268208503723,0.1765417456626892,0.21080736815929413,1.6577492952346802,-1.90816330909729
85,2.2187106609344482,2.275367021560669,-0.03799453377723694,1.9201120138168335,1.7460747957229614,-1.0004165172576904,1.983506441116333,1.152543544769287,-0.739491879940033,2.935866594314575,0.11069105565547943,0.21165326237678528,0.5214372277259827,1.1295000314712524,0.36499911546707153,-3.2960586547851562,0.8535774946212769,2.525826930999756,2.551588296890259,1.3190147876739502,0.19015251100063324,0.3075294494628906,0.12918494641780853,1.1730587482452393,1.0371402502059937,2.489837646484375,1.1269115209579468,1.8883661031723022,0.9245869517326355,1.6357141733169556,0.39405176043510437,-1.4315320253372192,0.07530002295970917,0.21135447919368744,0.7325426936149597,0.7412465214729309,1.753369688987732,1.1460626125335693,1.616235613822937,-2.828371047973633
86,3.507110357284546,1.6332429647445679,0.751417338848114,1.3453621864318848,0.2208658903837204,-0.5871697664260864,1.1685607433319092,-2.732837677001953,1.0457019805908203,-0.2661612927913666,-2.14056396484375,0.027007613331079483,1.0915645360946655,1.8491225242614746,-0.31326234340667725,-3.649909257888794,0.3698158264160156,2.3966472148895264,0.8325780034065247,1.7075790166854858,2.9971182346343994,2.6735293865203857,0.27672284841537476,0.0172465480864048,-0.874394953250885,-0.13032865524291992,0.5570011734962463,3.347360372543335,2.1813554763793945,2.700852155685425,-0.40703877806663513,0.5000362396240234,1.5408684015274048,-0.598107635974884,-2.8699440956115723,0.9524732828140259,-0.0014698343584313989,2.3458995819091797,2.30891752243042,-0.486780047416687
87,3.322793960571289,0.17607487738132477,0.8542430400848389,0.6373501420021057,-2.7974374294281006,-0.19425928592681885,2.201871156692505,-0.860884964466095,-2.375706672668457,0.69289630651474,-1.5227357149124146,-0.443780779838562,-0.41072624921798706,0.3072100281715393,-2.248614549636841,-2.390683650970459,0.1969992220401764,1.413586974143982,2.120790719985962,-1.0636885166168213,1.0300915241241455,1.5403555631637573,2.231074333190918,-1.548912763595581,1.0214569568634033,-0.401520699262619,-1.6476805210113525,2.245130777359009,0.7988353967666626,0.7017930746078491,1.0499751567840576,-3.3606653213500977,1.510359287261963,1.029954433441162,-0.02878054603934288,-0.8441827297210693,0.16981388628482819,-1.735098958015442,1.1137627363204956,-3.266857624053955
88,2.176257848739624,0.1411217302083969,0.2629145383834839,1.9862431287765503,0.7273042798042297,0.9791744947433472,-1.366562843322754,0.26914799213409424,0.22948791086673737,0.7694902420043945,-0.46585455536842346,1.31419038772583,0.7322237491607666,-0.4996083974838257,-2.1834893226623535,-2.188420534133911,1.8380554914474487,0.15476588904857635,1.6732878684997559,1.2181382179260254,0.8657081127166748,0.9330766201019287,1.139125108718872,-0.595660388469696,1.9329304695129395,-0.15422216057777405,-0.16185005009174347,1.655598759651184,1.6764750480651855,0.7644219398498535,-0.8361479043960571,-0.8185129165649414,1.547627568244934,-0.7677942514419556,-0.5136095285415649,0.29181838035583496,0.3173801898956299,-0.0036144263576716185,1.8059728145599365,-2.202378273010254
89,1.9677623510360718,-0.12999166548252106,2.678715944290161,1.5760177373886108,0.03381805866956711,2.2850894927978516,1.352276086807251,0.20716647803783417,1.4370614290237427,-1.2303664684295654,-1.820726990699768,0.817407488822937,-0.40610983967781067,-0.4892826974391937,-2.6465706825256348,-2.2372190952301025,3.9228627681732178,-0.1907787322998047,0.3206789493560791,0.5478194355964661,-0.08107961714267731,-0.019258029758930206,1.0579921007156372,-1.1964892148971558,1.1757313013076782,-0.13483108580112457,-2.2012813091278076,0.772590160369873,1.497501015663147,0.005270334426313639,-2.5037779808044434,-2.084697723388672,1.7290005683898926,0.8800450563430786,-2.116422653198242,1.527394413948059,-1.8396738767623901,-0.892292857170105,1.2811235189437866,-1.3636504411697388
90,-0.015072131529450417,-0.8860549330711365,2.458892822265625,3.435878038406372,-1.9788801670074463,0.1914857029914856,-1.186881422996521,1.5724873542785645,1.558263897895813,2.1004598140716553,-0.9904346466064453,2.155273914337158,2.0063364505767822,2.5502610206604004,-0.36706528067588806,-1.177058219909668,-1.1668524742126465,-0.7557925581932068,2.199471950531006,2.6205015182495117,0.728916585445404,2.2439253330230713,1.1426023244857788,0.18230579793453217,0.17296214401721954,-1.4953407049179077,-1.1275453567504883,4.271622657775879,0.6230677962303162,-0.5852775573730469,-0.8800483345985413,-0.9152379035949707,2.9198966026306152,1.3586753606796265,-1.231845498085022,-0.06447670608758926,0.943576991558075,-1.2409387826919556,3.270784854888916,-0.34015870094299316
91,2.070594549179077,1.3798657655715942,0.48841845989227295,2.3295676708221436,-0.6001604199409485,-0.251319020986557,-0.37640896439552307,1.2211079597473145,-0.035641007125377655,1.1298118829727173,-1.3498375415802002,1.1654918193817139,0.26113325357437134,0.3537572920322418,-2.4771554470062256,-1.9153069257736206,2.10038685798645,0.3513537645339966,0.9651338458061218,1.919715166091919,1.1098408699035645,1.404834508895874,1.5438079833984375,-0.7262960076332092,2.2121644020080566,-0.703170895576477,-0.8285117745399475,1.7552080154418945,1.1679855585098267,0.7779972553253174,-1.106757640838623,-1.1999037265777588,2.1966443061828613,0.06972146034240723,-0.8622757196426392,0.5628983974456787,0.22690534591674805,0.08940421789884567,1.8741885423660278,-2.0015220642089844
92,1.8964910507202148,0.6239919066429138,0.36827418208122253,1.58955979347229,-3.450028896331787,0.8686134219169617,-2.4321186542510986,0.003890023333951831,-0.17116066813468933,-0.5262871980667114,2.141921043395996,1.4154943227767944,-0.601643443107605,0.4833809435367584,-1.5486716032028198,-2.7878689765930176,1.1758047342300415,-0.2627978026866913,0.6705613732337952,2.878673791885376,0.7263432741165161,1.074182391166687,-0.8292413949966431,-1.6757566928863525,0.3154919743537903,1.6755374670028687,-1.1395032405853271,2.6197807788848877,0.14163799583911896,1.0333226919174194,-1.9941757917404175,0.08743280172348022,1.6000601053237915,-2.1462600231170654,-0.875951886177063,0.8960756063461304,-1.2792857885360718,0.034242890775203705,0.41174280643463135,-1.5683038234710693
93,0.9998874664306641,2.136277675628662,0.13519512116909027,3.168797492980957,0.03866996988654137,1.9672598838806152,2.605766534805298,-1.8326777219772339,-1.7741098403930664,2.6884443759918213,1.5642451047897339,1.120031476020813,1.148874282836914,-0.08645988255739212,-3.0444204807281494,-0.7275800704956055,1.796933889389038,-0.14272817969322205,-1.0769493579864502,1.3957136869430542,1.8822728395462036,2.2161831855773926,2.450497627258301,-0.2058364301919937,0.5264607071876526,-0.46190810203552246,0.8911638259887695,2.151477575302124,-0.527529776096344,1.7349592447280884,-2.005815029144287,-3.0410361289978027,2.0686113834381104,-0.15149781107902527,0.8518162965774536,2.598602533340454,-0.03519162908196449,2.6089389324188232,1.8670603036880493,-0.804801344871521
94,0.12909407913684845,-0.2900097668170929,3.272312879562378,2.665217399597168,-2.2177188396453857,0.7680977582931519,-0.2343018651008606,2.1345694065093994,1.4188499450683594,2.0486643314361572,-0.7681108117103577,2.062316656112671,1.6417593955993652,3.06657338142395,-0.5175381898880005,-1.3555701971054077,-1.1099282503128052,-0.7530031204223633,2.439424514770508,2.545504093170166,0.74394291639328,2.1992173194885254,1.0223783254623413,0.2440958023071289,0.1628441959619522,-1.4636279344558716,-1.2451210021972656,4.280599594116211,0.6522112488746643,-0.6816053986549377,-0.8236978650093079,-0.852515697479248,2.7469592094421387,1.3078056573867798,-1.4068520069122314,-0.08900107443332672,0.8457926511764526,-1.231364130973816,3.337804079055786,-0.3715755045413971
95,3.085472822189331,0.8735668659210205,-0.41823720932006836,0.8754794597625732,-3.0006556510925293,0.4165630638599396,-1.6959195137023926,-0.7512288093566895,0.6738735437393188,-1.3054885864257812,0.8730707168579102,1.6757376194000244,-0.7992479801177979,1.1508272886276245,-1.025511622428894,-3.110273599624634,1.2387770414352417,-0.8581600189208984,0.8459201455116272,2.590593099594116,0.5655781030654907,1.2599008083343506,-0.7489084005355835,-1.833724856376648,0.5112411975860596,1.509813904762268,-1.1719733476638794,2.402401924133301,0.1868244856595993,1.1369719505310059,-1.9947856664657593,0.27186843752861023,1.6474111080169678,-2.1510398387908936,-0.8388177156448364,0.8636777997016907,-1.3440014123916626,0.03383329510688782,0.38067254424095154,-1.541250228881836
96,-0.05558854714035988,1.9834917783737183,0.283641517162323,2.492626428604126,-1.396647572517395,-1.0998581647872925,2.010751247406006,2.3380584716796875,-1.6362913846969604,2.037055730819702,-2.404090166091919,2.341881275177002,1.0145196914672852,0.30937865376472473,-1.907834768295288,0.12655019760131836,1.2289485931396484,0.295724481344223,1.7630938291549683,0.3668006956577301,1.2559775114059448,0.035585660487413406,3.0015342235565186,1.9775514602661133,3.2608914375305176,-1.2508271932601929,0.07717376947402954,1.451727271080017,0.4018508195877075,0.9664877653121948,0.46319618821144104,1.0776827335357666,2.0995237827301025,-1.492133378982544,-0.11438275128602982,-1.6840547323226929,1.6413518190383911,0.8016018867492676,1.745535135269165,-1.091547966003418
97,1.318665623664856,2.9634180068969727,2.3704206943511963,0.31846150755882263,-2.1850979328155518,-1.4854167699813843,0.30236783623695374,0.30147257447242737,0.1468592882156372,2.566713809967041,-1.8741313219070435,1.5496433973312378,0.1767415553331375,-0.880996584892273,-2.5057435035705566,-0.416155606508255,0.8608997464179993,-1.417532205581665,1.7434251308441162,1.3853737115859985,1.901790738105774,-1.0419989824295044,2.2214009761810303,-1.1661876440048218,1.1088825464248657,-1.7875523567199707,0.0015955830458551645,1.9041060209274292,2.91400408744812,0.17430450022220612,1.08406662940979,-0.8323211073875427,-0.0779196172952652,-1.2226736545562744,0.22551850974559784,-0.5902091264724731,-1.2385934591293335,0.24732844531536102,3.3849761486053467,-0.8654249906539917
98,2.273479461669922,-0.004617063328623772,0.4045788049697876,1.8896383047103882,0.8405491709709167,0.8996716141700745,-1.4999351501464844,0.08833321183919907,0.3486376702785492,0.9037425518035889,-0.11898218840360641,1.3097654581069946,0.6170361638069153,-0.5284914374351501,-2.2817583084106445,-2.256035089492798,1.9981528520584106,0.11298255622386932,1.764288306236267,1.1800317764282227,0.8876009583473206,0.8556450605392456,1.1887154579162598,-0.2930270731449127,2.103442430496216,-0.3251379132270813,0.11535129696130753,1.7368406057357788,1.6409415006637573,0.9587916731834412,-0.9071457982063293,-0.7566417455673218,1.6884201765060425,-0.6646366715431213,-0.5855622291564941,0.3405633866786957,0.2977917492389679,0.14871175587177277,1.650384545326233,-2.1264731884002686
99,3.1801512241363525,1.705224871635437,2.3828847408294678,1.2166534662246704,0.8399640917778015,-0.355959415435791,0.07485086470842361,-2.47178053855896,0.5685431957244873,-0.4604906439781189,-2.360971450805664,0.34777629375457764,1.430638074874878,1.601022720336914,-0.4170815050601959,-3.5183236598968506,0.36342161893844604,2.471365213394165,1.097703456878662,1.474679946899414,3.175420045852661,2.9508919715881348,0.2870253026485443,-0.11845343559980392,-0.7636157870292664,-0.23577457666397095,0.9659746289253235,3.2976372241973877,1.9805636405944824,2.634218692779541,-0.6776652336120605,0.3233680725097656,1.6788806915283203,-0.49192336201667786,-2.865513801574707,0.977964460849762,-0.06475897133350372,2.2127163410186768,2.3193557262420654,-0.4453454613685608
