0,1
0,2
0,3
0,4
0,5
0,6
0,7
0,8
0,9
1,0
1,2
1,3
1,4
1,5
1,6
1,7
1,8
1,9
2,0
2,1
2,3
2,4
2,5
2,6
2,7
2,8
2,9
3,0
3,1
3,2
3,4
3,5
3,6
3,7
3,8
3,9
4,0
4,1
4,2
4,3
4,5
4,6
4,7
4,8
4,9
5,0
5,1
5,2
5,3
5,4
5,6
5,7
5,8
5,9
6,0
6,1
6,2
6,3
6,4
6,5
6,7
6,8
6,9
7,0
7,1
7,2
7,3
7,4
7,5
7,6
7,8
7,9
8,0
8,1
8,2
8,3
8,4
8,5
8,6
8,7
8,9
9,0
9,1
9,2
9,3
9,4
9,5
9,6
9,7
9,8
9,10
10,9
10,11
11,10
11,12
11,13
11,14
11,15
11,16
11,17
11,18
11,19
11,20
12,11
12,13
12,14
12,15
12,16
12,17
12,18
12,19
12,20
13,11
13,12
13,14
13,15
13,16
13,17
13,18
13,19
13,20
14,11
14,12
14,13
14,15
14,16
14,17
14,18
14,19
14,20
15,11
15,12
15,13
15,14
15,16
15,17
15,18
15,19
15,20
16,11
16,12
16,13
16,14
16,15
16,17
16,18
16,19
16,20
17,11
17,12
17,13
17,14
17,15
17,16
17,18
17,19
17,20
18,11
18,12
18,13
18,14
18,15
18,16
18,17
18,19
18,20
19,11
19,12
19,13
19,14
19,15
19,16
19,17
19,18
19,20
20,11
20,12
20,13
20,14
20,15
20,16
20,17
20,18
20,19
