"","PC1","PC2"
"1",-1.35145468735316,-0.0486071345675689
"2",-1.42888768661365,-0.126040133828062
"3",-1.4150294992227,-0.112181946437108
"4",-1.37520130437264,-0.0723537515870535
"5",-1.295795189288,0.00705236349758909
"6",-1.26200361215763,0.0408439406279597
"7",-1.34488785377746,-0.042040300991865
"8",-1.38586648611758,-0.0830189333319872
"9",-1.38282079268074,-0.0799732398951438
"10",-1.48247828288905,-0.179630730103463
"11",-0.163949329197184,1.10037817163375
"12",1.05529206929002,0.293102572575252
"13",1.3453522814667,0.00304236039857864
"14",1.54015262273332,-0.191757980868042
"15",1.48363976540069,-0.135245123535419
"16",1.46834558808444,-0.11995094621917
"17",1.33550263016111,0.01289201170417
"18",1.3941175712016,-0.0457229293363244
"19",1.65812064036342,-0.309725998498142
"20",1.23842967538187,0.109964966483408
"21",1.36942187958664,-0.0210272377213627
