"","PC1","PC2"
"1",1.10084277900068,1.06833594345502
"2",0.439783207793411,0.0132987250711983
"3",-0.0460354272165121,-4.57912303025556
"4",3.19762718028538,3.48042767767146
"5",-3.89276802654101,0.430480326863911
"6",2.37982148904099,-0.402015951932681
"7",3.68048556897766,1.98310983345653
"8",-1.29546257105494,-5.37815470611326
"9",-0.864597719876502,-0.718440706011992
"10",3.67670026550173,1.4100455984922
"11",4.01005693898098,1.4916880322701
"12",-3.38099634437359,0.776414038912241
"13",0.58297452228562,-0.766662619917913
"14",-0.376482235985317,0.0893106193533817
"15",0.0723281253245647,-4.53859795651764
"16",-3.61408182903957,2.26440060138794
"17",-1.86987733337666,3.34136893047192
"18",-4.27969311963911,0.761775473943012
"19",1.83288304559571,-0.14473001465885
"20",0.469496356955475,-1.80645015080773
"21",2.34895463097429,-0.10384859155985
"22",-0.781034173400394,-0.756548702876673
"23",-4.38167821234422,1.10871933896217
"24",2.21558869886398,0.213960121246254
"25",-3.90366782487707,1.64244752680494
"26",2.67509161614526,1.18324003446749
"27",1.99756753256592,2.85555636863495
"28",-3.94227111259689,-0.393666077068872
"29",-4.15951774950263,1.28705413179038
"30",0.406997200110531,-3.35727028923476
"31",-3.9678126732559,0.866470740370716
"32",2.06169782996891,-1.50388550321232
"33",-3.25036082076441,0.20895299935675
"34",0.976698898287016,-2.78142786871184
"35",-0.431441279172075,5.89776325273443
"36",-3.96639756101562,1.33054454112001
"37",-2.28679534923558,3.97945528232652
"38",-2.95982071456887,2.60348238759365
"39",-0.876539819166814,-5.0928831647261
"40",1.41792485366327,-1.21041512045496
"41",0.538171144892463,-0.656732202267621
"42",2.3132488189615,0.58250193423002
"43",0.641694044237491,-3.26306836536968
"44",1.12300239782094,-3.09836100603206
"45",0.553549124267735,-3.29660368053294
"46",0.721233847187089,-2.05392469630684
"47",2.61247253336149,0.0957820731502499
"48",2.62256161876086,0.600082257705254
"49",3.06652495153986,2.81692931975437
"50",0.615023521754443,-0.583562104250019
"51",-3.84477399398372,1.71015883782169
"52",3.447157425758,2.78030965511225
"53",3.26065422275846,3.04118382470873
"54",-3.42457837932641,0.943763126873877
"55",0.365611780963232,-0.0982607929795509
"56",-2.38942249469888,0.504443105634752
"57",-0.565704989621369,2.40209128615967
"58",-0.409707908028742,0.0672606803534091
"59",-3.88526321412801,1.6608179698725
"60",0.583572353810213,-0.496893124567873
"61",0.79541279591125,-3.5870295166491
"62",2.24364925022518,1.11221621168042
"63",3.40107497105189,3.57962674904534
"64",-2.29572607746909,1.09382016006985
"65",-3.45173294149394,0.201988765350773
"66",0.199444136426179,-3.90462029539793
"67",-3.40597788719013,0.784100966638141
"68",1.16001413719658,0.858710235657945
"69",-0.328232668075589,-4.75614035946407
"70",2.55977106544346,-0.599525564005493
"71",3.63482988391465,0.828396518473142
"72",3.86367332826467,2.52590893985371
"73",1.41965096406822,2.58999030098074
"74",1.35155096932046,2.01834210923187
"75",-4.55801987719312,0.421265234659537
"76",1.39875085601052,0.105174163258394
"77",-2.42038482478237,3.93748995645303
"78",2.38692638419519,0.472335478299158
"79",-3.3558751950337,2.45470885857665
"80",1.76379455845713,3.83012007843742
"81",1.12011263639319,1.2380132159202
"82",3.58627075788496,1.3881994186222
"83",0.473262960209805,-0.166914331775779
"84",2.30219275996466,0.41857283779549
"85",3.3079900090284,2.09387908254301
"86",-4.13305444499964,0.353012883862766
"87",1.32267816749783,-0.0915564932736054
"88",-4.24161197747456,1.20131671524599
"89",-0.22276036084112,-4.84749107417258
"90",-0.46828400730602,-5.02472184112938
"91",-2.95350316357961,1.63182686338928
"92",-0.365278682055405,-0.354737529641129
"93",0.134708839479871,-3.99093014595515
"94",-0.778230428453928,-5.31234416106405
"95",0.701534726823457,-0.46301306153933
"96",2.23616043576512,-1.45667756595665
"97",-0.765251640575316,-4.97164665813898
"98",1.13386891775803,-0.895945786931044
"99",2.23647660649201,-0.0809326818842063
"100",0.0489084091364501,-5.04688884883293
