"","V1","V2"
"1",1.71905009837443,-9.94716876047738
"2",1.76452700552629,-8.58303963999561
"3",0.243221858103735,-8.71479513968259
"4",-0.251377190142978,-7.26596904245375
"5",-1.42544685616293,-6.22012102116525
"6",-2.7530857060644,-5.33967916616718
"7",-4.3383144568134,-5.53592040313213
"8",-5.57626638197686,-4.63701923501964
"9",-6.76082033331101,-5.60310052136961
"10",-7.49351656957033,-4.4520440938055
"11",-0.0617355310601176,0.105088924166882
"12",-1.91416300412883,9.67995261238852
"13",-1.88237766935973,8.31611943285021
"14",-0.372435802183138,8.53337336042324
"15",0.227872152717447,7.12542184754799
"16",1.39363808167283,6.06283122694424
"17",2.86620687820419,5.45963046190425
"18",4.44077709093859,5.68813664476909
"19",5.69882932236198,4.81688292818496
"20",6.85258742750937,5.81936117374349
"21",7.62282958536485,4.69205841034578
