"","PC1","PC2"
"1",-2.90333164768163,0.0867473411841348
"2",-3.01329185124479,0.419538316222961
"3",-2.943838474763,-0.137331780292302
"4",-3.04575114152669,0.569744391699673
"5",-3.03822905758745,0.171679470628508
"6",-2.9443051188629,0.345663815981666
"7",-3.11774537552993,0.553562469926042
"8",-3.13661533623469,0.708802090592907
"9",-3.08751580741234,0.337872090745511
"10",-2.52604228554586,-0.970607085285382
"11",-0.0982087049276081,-3.99483529743231
"12",2.40979393793161,-0.990642125320062
"13",3.1451905381069,0.452959008977212
"14",3.12109762056365,0.115055697451699
"15",3.00327176611359,0.460759422455208
"16",2.85153958702372,0.348528949454943
"17",3.06020668268123,0.324921669285438
"18",2.98475055632273,0.149526495966526
"19",3.18274847414995,0.715073934775175
"20",2.9473106529857,0.0229421915098457
"21",3.14896498543781,0.310038931472607
