"","V1","V2"
"1",0.653749726041071,1.55644249976381
"2",-0.903450023859116,2.90330961975745
"3",1.48740094241807,-2.94086722719435
"4",6.14701174745697,-3.31247774312887
"5",-0.0342676236356341,2.00389911275436
"6",-0.547836221709368,2.16116827336636
"7",5.93124538859577,-3.29431464501406
"8",1.91106929281509,2.25284898170143
"9",5.7262271377264,-3.35806437349117
"10",-0.730744130851558,0.486398355732488
"11",-4.71792801923073,-0.0431461684359116
"12",1.13660041792549,-2.55008860186093
"13",5.25370149260281,-3.15352104927836
"14",-0.793030585196705,2.54090423706174
"15",-0.702666693498972,2.11370896642359
"16",-0.705101296902809,3.38375877709371
"17",0.988387529443087,-2.42704690849896
"18",-1.25362177942154,2.94702976958505
"19",-4.87120277579228,0.101493048434757
"20",0.0744934820130996,2.42257674048863
"21",2.193400433006,0.0849189283979799
"22",2.01807002856495,-0.0536197109854508
"23",-2.45404448634825,0.0345885310197018
"24",1.17309609118595,-2.61855190923903
"25",1.29176918784135,-2.72062113644793
"26",-0.597620919262521,2.39067699843305
"27",-0.747570452393446,2.89151210429347
"28",5.83148997853016,-3.45106494404913
"29",-0.775538701023223,-0.866602896232265
"30",-0.866724587653907,-0.839554059243973
"31",1.10512447562348,6.26643869776286
"32",0.00902180031227207,2.95084421553976
"33",6.19861287436798,-3.05813980824992
"34",-0.437200652419747,3.1209974378842
"35",2.08286798744273,-0.135276785671818
"36",-0.453362957698675,-0.93904788662981
"37",-5.77373073047135,-6.8778007442721
"38",1.46663085968081,-2.93874234846773
"39",1.76653640398027,2.13476690199059
"40",-0.454331453872702,1.70038912975779
"41",6.22335905039803,-3.38898535308644
"42",-0.196672337430836,1.6252394596253
"43",2.28123675370846,0.0223866892118796
"44",-0.699926111228449,0.680073636470175
"45",5.05827837885781,-3.00763162226979
"46",-0.311025856179951,2.98817199833089
"47",-5.4302023007848,-6.7255636640757
"48",1.66477109586951,-2.81450726515362
"49",-5.64542955731987,-6.95278605764919
"50",-2.92100159199698,-0.102356747150648
"51",-5.70579433450632,-6.8248800472657
"52",-5.79469317335996,-6.84535116546667
"53",5.12976999498148,-2.96470401613536
"54",-2.72923834307967,0.0809851847559897
"55",-0.403382409085233,1.55044640766738
"56",-4.59757703390949,-0.170979063977285
"57",5.38672273869707,-3.49351430349051
"58",-2.62522320816024,-0.144565254612864
"59",-0.596769519518069,1.353956344771
"60",1.31506950186801,6.0316875530603
"61",0.0952119678492646,3.27622328542344
"62",-0.582287296606567,-1.02409358284542
"63",5.06439147574626,-3.14355171534994
"64",1.35110300857377,6.14224765747091
"65",-0.269344264834237,3.43466700638548
"66",-0.946331419263942,2.69288775563278
"67",5.26111771950413,-2.9442141860285
"68",6.21457583370359,-3.10931195694095
"69",1.19697105290686,6.22795322878642
"70",1.03136782945281,6.06905294211371
"71",-0.389096954269076,2.49924259781356
"72",-0.991430874940977,1.86606385155743
"73",1.77045575102075,2.15159179358228
"74",1.62584862491585,2.03430517882833
"75",-0.857573952561833,0.348600419570892
"76",1.28438302575962,6.01038497151869
"77",1.99866386679255,-0.23793454934779
"78",-2.5899191342875,0.00732734159435644
"79",-0.846210090131013,3.07759857252419
"80",-4.65999404302295,-0.100374277632587
"81",-0.840641755291667,3.07405794791569
"82",-0.556195022768736,3.24522868532263
"83",-2.51670325119749,-0.208573972540516
"84",-0.0641050852047647,2.79400507974115
"85",-0.852392887483927,-1.00698429693783
"86",-0.325566393429285,1.38876405366748
"87",-0.411504727564713,-1.1011391847578
"88",1.68081754479878,2.07645064709417
"89",0.0906443262349869,2.15128308304419
"90",0.0521563726496509,1.75956681068446
"91",1.98235574116897,-0.341932825220617
"92",-5.75481838275388,-7.01867140722784
"93",0.591263592454015,1.63772063096435
"94",-5.33146487953405,-6.98832121028771
"95",-4.88410193310984,0.150205193177256
"96",-2.60271867617863,-0.164213325947898
"97",-0.37512786969283,-1.13274779449689
"98",-0.558560022025311,-0.79624268478495
"99",-5.5788498175048,-6.51848460609093
"100",-4.53519392402564,-0.0458822523858546
