"","V1","V2"
"1",-2.50703809562773,-1.40306356801103
"2",6.13254091944427,0.139231990659531
"3",0.584329949814637,-1.79799939811993
"4",-0.535127986661639,0.998447469157269
"5",-1.63751826392892,0.22021654553943
"6",0.0568577951157803,1.10929448165753
"7",-0.374898553537861,1.11933264179573
"8",-0.052703751303389,-0.201708499348734
"9",-0.00982193537103671,-0.385620913242272
"10",6.32293963972626,0.442370840005278
"11",0.632578674416564,-0.317757498491165
"12",-1.67968160298369,1.00023510848748
"13",0.933482009779353,1.00339228210169
"14",0.412132187783867,-1.7688486708637
"15",1.98192160262755,4.15498261441008
"16",6.34085509931958,0.0677588253015727
"17",0.907993826237104,-1.28410860454599
"18",6.23964057626267,0.259890718015527
"19",0.445893993533093,-0.84024903254005
"20",-1.57490725158583,2.50760422196128
"21",0.885697781754337,0.706284985474939
"22",2.12996543723179,4.05687767806629
"23",1.41092580189378,0.198712586521805
"24",-0.807251839439194,-1.45555607329527
"25",-0.757133129576562,-1.80603451896805
"26",-1.73023093594975,1.11063171264513
"27",-0.0169779321713541,-0.723783974205132
"28",6.00241023758822,0.0758781663464481
"29",-0.741921579382632,-1.4601232709707
"30",-0.267505091947488,-8.31432539526486
"31",-1.95512891203037,0.272422009523867
"32",1.75897876870582,4.41868465290512
"33",6.01210373066308,0.020471186440265
"34",-1.22158219705421,0.609620713457453
"35",-0.0492206442038907,1.07419332910107
"36",-0.246135414036298,-8.3167871157062
"37",0.377031262170893,-1.54151449002609
"38",1.94293017825288,4.31809786135481
"39",-0.836987799890367,-0.0218659733475224
"40",1.90813148291492,4.65406635723228
"41",-0.0180425542852349,-8.25633921785036
"42",-1.79522450794099,1.25094164229307
"43",6.25355359977353,-0.0341962928980344
"44",-2.1497335394005,-0.231063606588759
"45",-0.150862554237865,-8.2040805473002
"46",-1.48291610880196,2.57705787969331
"47",-0.132667107530263,-7.8662643615975
"48",-2.00468545553727,0.116834045074987
"49",0.442951120441396,-1.46384577890606
"50",0.935587940334018,-1.5348147014801
"51",-0.0817892251833086,-8.1659204414806
"52",0.959289479071555,-1.41057364145633
"53",-0.221270982687162,0.2089910130779
"54",-0.692950803525934,-1.30098273879433
"55",1.89594518513997,4.58267547623312
"56",-5.48768304526739,3.18132611839905
"57",-0.170414356813584,-0.517209673863523
"58",0.978056499481207,0.974626743850112
"59",-0.818639638341431,-1.70445556075453
"60",-0.77110294849308,-0.113431112387869
"61",-5.50865453049982,3.00772144844445
"62",-1.86609167225449,1.22416651509249
"63",-2.63301567143507,-1.49909008302086
"64",-0.237795141026212,-7.71694276432228
"65",-1.03057782370637,-1.62716639852775
"66",-1.45457872384619,2.60008487908461
"67",1.1448409620105,-0.0876222484022487
"68",-5.45839975444726,3.20226854659067
"69",0.105052763190931,1.29203380353007
"70",1.0086103353323,0.80040276965469
"71",-5.50588189382014,3.14467709284094
"72",-0.279016704003918,-0.0770835427090265
"73",-2.53160626869556,-1.44331759438899
"74",-0.32026348846516,1.8691146870457
"75",-2.11083030125096,-0.181849709509182
"76",-0.0559913783363699,0.872259760190434
"77",0.384470629017235,-0.229521532995064
"78",1.41490643277144,0.0723047392428633
"79",-5.41156950270999,3.24045415431125
"80",-2.24976424313996,-1.15337810097648
"81",-2.34673852670074,-1.2382803606964
"82",2.16972722503275,3.97947458046718
"83",0.62418568791662,-0.453324163675974
"84",-1.67105546927754,2.47191470738803
"85",0.52532395004628,-0.374690397739656
"86",-1.64136889694422,2.44362614930667
"87",-0.196042845490728,2.00587591185428
"88",1.30396773351618,0.0704511670061216
"89",-0.293991627647337,-0.671970523549351
"90",0.999894295672968,0.984621871841529
"91",-1.32617504301979,0.477448191051235
"92",0.311061122293748,-0.444708681379706
"93",1.58239438175437,4.54785053966582
"94",-1.04367882441829,-0.375413867700075
"95",-1.19512143365858,0.697894211663161
"96",1.50846824678236,4.62320975650744
"97",1.02728524127556,-1.26158520053934
"98",0.411878204240672,-1.73475661699233
"99",0.246896112852288,0.10117702211993
"100",-0.305722593661416,1.8530420577466
