,0,1,2,3,4,5,6,7,8,9,10,11,12,13,14,15,16,17,18,19,20,21,22,23,24,25,26,27,28,29,30,31,32,33,34,35,36,37,38,39
0,-0.07944712,-0.22355668,0.24992983,0.1236653,0.08242093,0.04322029,-0.05078591,-0.24542002,0.22090572,-0.16000828,-0.007848854,0.17537962,0.061529115,0.20816934,0.114363894,-0.1988355,0.33054546,0.20438541,-0.45219958,0.5870063,0.46416086,-0.21470448,0.38850957,-0.10433861,-0.17432202,-0.59252346,-0.17944863,0.18927257,-0.19216773,-0.1851752,0.40115485,-0.041354034,0.09614916,-0.027690683,0.49437994,0.23990473,0.385159,-0.09042993,0.3282865,0.15744515
1,-0.39794677,0.009016409,0.086197175,0.089614816,0.18953483,0.21023789,0.12553734,0.22821628,0.44133568,0.78037804,0.34049115,0.11411258,-0.15404074,0.2457963,0.10753247,0.13473374,0.6790259,0.3079031,0.49761054,0.3153308,0.114511356,0.40751705,0.2288965,0.30927396,-0.051888857,0.59230447,-0.1409285,0.04953214,0.3885247,0.30499467,0.2556457,0.4739439,0.34833673,-0.014430071,-0.199968,0.092589855,0.588819,0.39169762,0.5172229,0.20452955
2,-0.24346563,-0.23020743,0.12481796,-0.28041735,-0.10272734,-0.17926314,-0.07901989,-0.06960827,0.04517406,-0.08190224,0.16617197,0.39944103,0.036901318,-0.13362041,0.0910535,0.1837652,0.06289572,0.31120032,-0.14958328,0.37949485,0.15301874,-0.09895092,0.055995915,0.063911416,0.089823015,-0.28729975,-0.07226821,0.13950385,-0.26561397,0.019797137,0.119493775,0.17191751,-0.19533099,0.15156263,0.21831292,0.046303548,0.29035383,-0.21498433,-0.044673275,0.119085535
3,-0.022805037,0.02375321,-0.033124372,-0.040098075,0.12358686,-0.17413478,0.06868845,-0.013010076,0.023550767,-0.10608497,0.16160786,-0.07778683,-0.2635198,-0.038171694,0.16064185,0.3374541,0.19444014,0.09802503,-0.2519951,-0.1320868,-0.06390527,-0.013558694,0.37602565,0.14151561,0.041262515,-0.34591883,0.077362366,0.38271263,-0.14504439,0.09751324,0.28333488,-0.026107825,-0.08414766,-0.19330193,-0.16311586,0.04748574,0.35201487,-0.37692204,0.17256641,0.07135863
4,-0.34731174,-0.36320493,0.024224829,-0.07822457,-0.18675554,-0.20611143,-0.04958317,-0.05018322,0.22439797,-0.0981458,0.065996446,0.35200542,-0.048143137,-0.04223443,0.25142688,0.13527097,0.15501896,0.19722857,-0.23087032,0.48089936,0.1625189,-0.28972423,-0.06359849,0.009400509,0.19525371,-0.3513394,-0.11608781,0.046555106,-0.34551984,-0.08380739,0.042475283,0.18722464,-0.08475078,0.16540267,0.21726249,0.081292056,0.023411745,0.13606651,0.06544207,0.35031384
5,0.1075812,-0.12992907,0.20990345,-0.14643353,-0.012693095,-0.122427575,-0.18878582,-0.050069667,0.06978311,0.033988066,0.20643708,0.29480234,0.04802511,-0.07150541,-0.2577646,0.065271474,-0.0076306355,0.42906284,0.12091946,0.048304085,0.029930806,-0.05675093,0.08057161,0.035942953,-0.016504968,-0.24366845,-0.22480713,0.26720828,-0.09166719,0.048257735,0.26108664,0.19154237,-0.20961152,-0.16690049,0.149634,0.2943035,0.2970171,-0.74686503,0.08717515,-0.08982233
6,-0.17083557,-0.048552975,-0.116555266,0.04782135,0.016936682,-0.14020209,0.0030507694,-0.13719934,0.10856924,-0.07062526,0.19288905,-0.14929639,-0.3384979,0.124532685,0.5496078,0.2831398,0.19226006,0.092768304,-0.35894564,0.034114003,-0.12614764,-0.0975645,0.319651,0.016974762,0.10012452,-0.47991106,0.0140650645,0.2945875,-0.15807807,0.089514896,0.16970056,-0.15128396,0.038377125,-0.13449271,-0.123776115,0.071424186,0.2624109,-0.07998016,0.13197471,0.3645699
7,-0.021014562,-0.13875298,0.12842312,-0.32589543,0.22594462,-0.14788766,0.12485922,0.15851404,-0.39818692,-0.049050886,0.05429598,0.21161935,-0.02704272,-0.13220276,0.21739148,0.16314372,0.18191697,0.023385476,-0.36914018,0.11330371,0.25930795,0.11965028,0.17078917,0.14145254,0.044727016,-0.08556159,-0.17286082,0.10055325,-0.15953466,-0.12496104,0.17202389,0.032514844,-0.024635253,0.15020645,-0.13599999,-0.3013573,0.5865331,-0.12518528,-0.116204776,-0.016112907
8,0.0012416469,0.13792291,-0.07584606,-0.020628782,0.0063527464,-0.24852636,0.034163296,-0.1776554,-0.0016955689,-0.1549773,0.06004253,-0.036157284,-0.18951595,0.07658472,0.5234794,0.19140095,-0.015584466,0.026726566,-0.36071083,-0.033197783,-0.13608868,0.08794689,0.25095335,0.013545076,0.054420047,-0.088451676,-0.2217066,0.13182926,-0.2505585,0.04818074,0.22581632,0.20322134,0.20011096,-0.021741072,-0.11940359,-0.04670939,0.63252103,-0.36287707,-0.05613687,0.2522179
9,-0.13287164,0.33155608,0.2684844,-0.23987526,0.111771174,-0.12809178,0.6034293,0.14997707,-0.15505584,0.35681605,-0.09000765,-0.12956494,0.1658152,0.045661665,0.2854205,0.1633028,0.23646274,-0.2068388,-0.1658983,-0.06333159,0.30516154,-0.0688209,-0.09447831,-0.40986755,-0.19671609,-0.5894124,-0.030779205,0.42389134,0.27025455,0.1358222,0.39137706,0.2598781,0.1903194,-0.18152049,-0.22894068,-0.37171417,0.33040464,-0.09039944,0.19701943,-0.054409504
10,-0.21628352,-0.043803755,-0.038147904,-0.32196537,0.040593263,0.0025180054,0.011127067,-0.07911426,0.013930322,-0.17439392,0.23718639,-0.0127955945,-0.017144319,-0.19471672,0.07647637,0.173138,-0.14535257,0.4440298,-0.2028133,-0.07010032,-0.068193726,0.037725717,0.3166324,-0.13736328,-0.04797003,-0.20947298,0.34691122,0.2376309,-0.15692182,0.3272286,0.2024116,0.19194314,0.050954707,-0.18299516,0.05855888,0.22696191,0.28292164,-0.4300514,0.24450873,0.13560304
11,-0.33280998,-0.42195007,0.043579724,-0.12701057,-0.11947735,-0.17660065,-0.054702725,0.038766388,0.14409637,-0.10879354,-0.0067010145,0.3251041,-0.02383064,-0.073106825,0.29018703,0.16090563,0.08489832,0.2606947,-0.220827,0.4122189,0.12525763,-0.22515427,-0.015335967,0.013138908,0.20947912,-0.40707147,-0.03916587,0.10993216,-0.35004935,-0.08797227,0.04735048,0.23301512,-0.05699499,0.17299639,0.12425162,0.054377597,0.107187696,0.09888963,0.16409594,0.39261404
12,-0.15500787,0.004334947,-0.052468143,-0.32788268,-0.0021148243,-0.21810894,-0.13639349,-0.022080969,-0.013508091,-0.07467984,0.34767777,0.33834153,-0.32521138,-0.018692924,-0.009829989,0.26327172,0.06558768,0.30494565,-0.18037316,0.13842587,0.09795275,0.010992675,0.40221527,0.15104264,-0.15716793,-0.3337208,0.40291882,0.5431909,-0.07589194,0.040875796,0.08279759,0.36876073,-0.018815171,0.12735605,0.05282246,-0.09853051,0.24358122,-0.24652924,-0.05545964,0.23230599
13,-0.09693602,-0.20517477,0.28839025,-0.40693894,0.1569521,-0.01766562,-0.08406933,0.13179426,-0.3265041,0.02418405,-0.09478978,0.32604188,0.2254981,-0.2861314,-0.13468446,0.036986407,-0.17268284,0.45923498,0.08316932,0.14049119,0.12906203,0.13822286,0.073465556,0.07306445,0.021637585,-0.23896648,0.01613273,0.25689015,-0.15484919,0.008868359,0.082029946,0.29841048,-0.16946809,0.17993863,0.06484396,-0.06897718,0.47820237,-0.377656,0.04751954,-0.04982194
14,-0.08182527,-0.19912185,0.18923528,-0.30103335,0.06025228,-0.10669445,0.026699552,0.18184495,-0.24863465,-0.084912926,0.077432014,0.37656263,0.0643705,-0.049015783,0.12037909,-0.083215736,0.25318944,-0.0009556679,-0.39497483,0.2767642,0.43169528,0.101420216,0.020818695,0.103934236,0.0492975,-0.073727965,-0.25971943,-0.0112450365,-0.13674383,-0.17538737,0.14604786,0.056649793,-0.09386184,0.2652336,0.16576932,-0.17517626,0.39159372,-0.0555944,-0.30140468,-0.058797903
15,0.024414573,0.03811283,0.28100723,0.34260887,0.025087964,-0.036018275,-0.12247418,-0.17893234,-0.0009004977,-0.01047659,0.15493147,0.17166053,-0.11992988,0.4772749,0.1024313,0.11074195,0.058143858,-0.22404008,0.11472207,0.1198899,0.3670609,0.090529226,0.412606,-0.044772472,-0.41359717,-0.026603676,0.16259702,0.18660915,0.35484406,-0.35157105,0.38188985,0.00509712,-0.39676952,0.50038457,-0.062462233,0.48139924,-0.06750869,0.24468596,0.05190048,0.07448859
16,0.15818831,0.14989343,0.16593929,0.074954845,0.059007317,-0.26719972,-0.10452586,0.46945536,-0.026811166,-0.010210822,-0.0115834335,0.09309112,0.3242055,0.041082237,0.045171138,0.29663044,0.052492622,0.0490338,-0.0145150535,0.4819025,0.0071765417,0.078237936,-0.111345805,0.20124069,-0.23320782,0.037086755,-0.03959444,-0.33158967,0.0897345,-0.3706055,0.23839803,-0.2893129,0.29890674,-0.15361613,-0.17160168,0.09357858,-0.12037205,-0.37384772,0.5469103,0.28556547
17,0.32811436,0.18979734,0.20957951,0.27378163,-0.14385317,0.2620185,0.33793628,0.25107932,-0.022567833,-0.09807454,0.087085836,0.29859796,0.26687294,0.15968308,0.08030228,0.13428643,0.21768774,0.4349966,0.31809998,0.23044656,0.1623099,-0.39577264,0.19750778,0.24183106,0.22411771,-0.28770566,-0.16792768,-0.2054197,0.20526902,0.199507,0.12052105,-0.1026797,0.43679067,-0.16841805,0.11714763,0.24235776,-0.15408953,-0.105907336,0.10138301,0.41604006
18,-0.37265125,0.43076313,0.056681942,-0.36021483,-0.11899183,-0.038638152,-0.16709326,0.1768689,-0.09418195,0.24352728,-0.09484829,-0.19510002,0.014220682,-0.21135695,0.2704839,0.0030654394,0.22207676,-0.26410922,0.34141523,0.17568079,0.26295903,0.35143912,0.21823052,-0.031564694,0.15256022,0.09946232,-0.087299615,-0.14059949,-0.23559709,0.055702318,-0.2862602,-0.2539146,-0.12946841,0.014395274,0.22028157,0.1808933,-0.10357829,-0.25597203,0.35629684,0.16096778
19,0.025930557,0.29526025,0.08024097,0.008608732,-0.20674959,-0.17122483,-0.1829806,-0.13825081,0.06585692,-0.007837901,-0.079211585,0.085575745,0.36484775,-0.085154034,-0.031213058,0.7006096,0.24634908,0.43237734,0.06656244,0.49152198,0.06979506,0.038528144,0.30880094,-0.2619784,0.107610054,0.3595048,-0.08281349,-0.12656622,0.038137153,0.17650664,0.18988904,-0.105993606,0.29992726,-0.3309727,-0.025940003,-0.10289025,-0.069761455,-0.004956399,-0.5977544,0.27160603
20,-0.34060693,0.24807358,-0.043212034,-0.32064936,0.014514645,0.15201333,-0.41191274,-0.18236786,0.3203278,0.2536495,0.19431391,-0.17109464,0.5680048,-0.17067865,0.29952726,0.09135376,-0.09053753,0.02699573,-0.26770517,-0.051555954,0.27615026,0.025499128,0.18878295,0.033409163,0.12432943,0.20035772,-0.38333133,0.035002273,0.49981275,-0.1490841,0.055194125,-0.11038513,0.4122561,0.050441645,0.08409776,0.21758506,-0.16223338,-0.23038626,0.021568384,-0.11152888
21,-0.09152667,-0.38662225,-0.19054341,-0.2153774,0.114922196,0.14099532,-0.104610294,0.16629605,0.4025512,-0.018358216,-0.2612428,-0.31742156,0.16395284,0.09650656,0.2545004,0.008488072,0.33213264,-0.322324,0.4585304,0.10332785,0.08981487,0.004756228,-0.07693137,-0.08312017,0.033979952,0.1400211,0.272863,-0.17582853,0.135,-0.24425457,0.44638345,0.488178,0.3543818,-0.0063777505,0.06338866,-0.079842634,0.08427865,-0.5631241,-0.10578283,0.20539035
22,-0.06835397,0.101570085,0.14233235,0.015075795,0.20423894,-0.16085318,0.25307584,-0.06507695,0.054403037,-0.07384084,0.14888747,-0.09796107,0.18448304,0.0928698,0.23428994,0.23301919,0.04256458,0.2782976,0.31916213,0.30062777,0.1238073,-0.12233237,0.07650033,0.4047446,-0.18542634,-0.26544744,-0.21105179,-0.19432716,0.3975402,-0.53571564,-0.19289011,-0.16242288,-0.019875543,0.044802602,-0.2841445,0.1462153,0.023999255,-0.2422114,-0.107282154,0.0631625
23,-0.55637515,0.23959266,-0.05641459,0.1110816,-0.10940834,0.560301,-0.12221392,0.21783806,0.22901459,0.07363296,-0.33049113,-0.047427446,-0.25155622,0.09704595,-0.32661608,0.036761694,0.019876769,0.030541949,-0.22190024,0.025393672,0.24772412,0.446488,-0.07771938,-0.23656501,-0.035647407,-0.028054768,0.0019077194,0.1394601,-0.1100644,-0.052475896,0.6238986,0.0060898415,-0.025363723,-0.08026824,-0.21948218,-0.09178892,-0.13310556,0.12545519,0.023190228,0.12484574
24,-0.17377384,0.06598356,-0.17248152,0.021896629,0.31628755,-0.201781,-0.021420913,-0.040206205,0.0860428,-0.044820473,0.013864448,-0.0039661485,0.5096277,0.14502351,0.131312,-0.10302276,-0.0604266,0.09216298,0.2618923,-0.058444872,0.07731851,-0.14412552,-0.0851319,-0.048555642,-0.055108808,-0.12792532,-0.03304749,0.057962738,0.16041009,-0.54081416,0.21827663,0.14581679,0.24141757,0.0012665761,-0.21998191,0.16197102,0.033613294,-0.047730345,0.09509685,-0.030626154
25,-0.38897616,0.5201825,-0.2364563,-0.25641274,0.27254218,0.0655762,0.11730361,-0.05004741,0.29368186,0.2375583,-0.08484483,0.03456771,0.23395994,0.4176071,-0.14751643,0.015428099,-0.2292519,0.08856329,0.16822968,0.27754477,0.30429202,-0.15512478,-0.19948259,-0.12596229,0.012463631,-0.0209512,-0.2504949,0.28000498,-0.109807976,-0.21894333,0.16156994,-0.09660973,-0.08972106,-0.3457351,-0.22804148,-0.5251209,0.0015128485,-0.062073823,0.23074043,0.12626031
26,-0.08812124,0.18934634,-0.18116352,0.17307478,0.18695508,0.14335193,-0.07510328,-0.2045567,-0.16542414,-0.20011894,0.06166963,-0.07244536,0.22845623,-0.13354817,0.15117039,0.1427346,-0.12098111,0.30479062,0.1323357,0.3246047,-0.044910245,-0.17986667,-0.070236675,-0.1259153,-0.16960539,0.14717647,-0.33621007,-0.1267321,0.28519994,-0.32764044,0.65983975,0.30204356,0.37613386,0.18975155,-0.24147455,0.04415508,-0.07272371,-0.14797616,0.0026989374,0.030287392
27,0.22723393,0.32594225,0.5797481,-0.13736866,-0.34406564,-0.11097467,-0.08013617,0.16124593,-0.05352298,0.105037875,0.14584349,-0.02683465,0.09407464,0.1014909,0.08287647,0.10443386,-0.15625408,0.23305048,-0.064848885,0.2592742,-0.04194909,0.4122414,-0.30754092,0.10990591,0.37563452,0.20683306,0.11534485,0.4004148,0.5273767,-0.6065906,0.3783057,-0.18671995,0.2769781,-0.0032264201,0.13371629,0.12505482,-0.12192151,0.20857504,0.3783323,0.51564026
28,-0.3261806,-0.1033746,0.25953135,0.02511805,-0.008465018,-0.17930599,0.25201878,-0.04393852,-0.07228026,-0.052402984,-0.019369246,-0.22264011,0.32978114,-0.061252493,0.3712817,-0.13558307,-0.09088008,0.17048095,0.19491564,0.2446375,0.19649734,0.0056983205,0.13672148,0.25412548,-0.4804144,0.12205051,-0.17523265,-0.023963055,0.6155802,0.106779106,-0.008139615,0.06096903,-0.17004381,0.00079982716,-0.26399553,0.356849,0.0074477037,-0.086812876,-0.19092688,0.34035048
29,-0.20496142,0.5024196,0.17381033,-0.094075575,-0.4908075,0.24238183,-0.36365932,0.0036103926,-0.32332063,0.093032114,-0.0848999,-0.1504386,0.29255846,0.028549207,-0.1384642,-0.22753538,0.3507449,0.28354704,0.09388373,0.105361804,0.25509015,-0.16567957,0.20577025,0.053906873,-0.008206364,0.08151955,-0.4480987,0.005176469,-0.0021506406,-0.30568933,-0.24471425,0.21082252,0.2686491,-0.14031401,-0.21299984,0.01400789,0.30834448,0.06556069,0.050038364,0.48043212
30,-0.19194758,0.228316,0.010136374,-0.055018265,0.31567836,-0.0305748,-0.026577352,0.08526884,-0.23151171,0.06456267,0.03995182,-0.09239415,0.1773063,0.03460779,-0.07560076,0.049559094,0.12946707,0.13352267,0.03315094,0.25366312,0.13344847,-0.15023246,-0.14989503,-0.1200175,-0.06505347,-0.40689945,0.014219059,-0.09938789,0.28721464,-0.26439822,0.34731603,-0.11941998,0.09850291,-0.023853784,-0.36443534,0.2730824,-0.15341876,0.1468869,0.21211681,0.19562142
31,-0.42338917,0.055928204,0.30272326,0.4928104,0.022153702,0.13540924,-0.4217596,0.10214696,0.015306196,0.37952155,0.13915066,-0.13221587,0.27276406,-0.2568273,0.67413205,0.017178979,0.04964186,0.36174157,0.21393996,-0.07062964,0.20497982,0.026217518,-0.17526689,-0.12642865,-0.2282347,0.22292575,-0.18379489,0.25344795,0.3630973,-0.08399001,0.11282444,-0.06635861,-0.34185424,0.040211342,-0.22157772,0.052877717,0.030385844,-0.141468,-0.2742861,0.2253756
32,-0.23280914,0.2995564,-0.06198942,0.225743,0.13985042,-0.15922901,-0.15084384,0.038936574,-0.06986403,-0.23034252,-0.03899048,0.26869652,0.16952543,0.14983432,0.1184706,-0.24336317,0.0552476,-0.14379205,0.12195163,0.08121901,0.55277896,0.13541988,-0.11428114,0.015592102,-0.40303352,0.16935614,0.0334886,-0.3245181,0.28435126,0.36482444,0.33499128,0.011117669,-0.16599832,0.07188246,-0.01678176,-0.18849927,-0.1785068,-0.30592966,0.573074,0.597827
33,-0.25193417,0.15986852,0.010558179,-0.037490506,0.08195665,0.23966144,0.45895773,-0.17972268,-0.054112677,0.28060913,0.10935621,-0.042973146,-0.13953274,-0.23157662,-0.07508242,-0.105943836,-0.068164594,-0.012790949,0.09556911,0.1368051,0.13146558,-0.15535314,-0.14075448,0.14889209,-0.11507432,0.49085164,-0.37044343,0.13041309,-0.11157586,-0.16363968,0.48204133,-0.012320424,-0.4461139,-0.09889347,-0.16496119,0.06663495,-0.083510816,-0.14188378,0.13838391,0.6819446
34,-0.26107523,0.007878344,0.103290185,0.09553956,0.12931599,0.19761147,-0.14789072,0.2828258,0.646965,0.067818604,-0.026665606,-0.12664035,0.16890551,-0.19996057,-0.08303418,0.48200706,-0.15320992,-0.080186,0.039931532,0.008130939,0.6451561,-0.16367441,0.26189554,-0.10901205,-0.079516694,0.46266592,0.07114817,-0.18556677,-0.07703602,-0.2790048,0.4531103,-0.15349291,-0.022638647,0.09715203,-0.31138092,0.3866293,0.19717471,0.008682157,0.0215208,0.24265005
35,-0.27875447,0.21974471,0.068458706,0.17457615,-0.026181005,0.039868645,-0.26206934,0.009490863,0.22895722,0.07685266,-0.017084943,0.123579144,-0.044449598,0.049759284,0.12261676,-0.2772209,0.18514504,-0.3639871,0.4798018,0.14320487,0.08651351,0.05775954,0.31474233,0.31243947,0.104416505,0.056548715,-0.002557164,0.36048076,0.062484436,-0.53285044,0.7020239,0.047837492,0.3399152,0.045040026,0.09840703,-0.15188089,-0.22578867,-0.32751557,0.029970285,0.06152303
36,-0.30118513,0.13342325,0.16652049,0.19439721,-0.26603583,0.050304595,0.16313918,0.20985255,0.5539456,0.16492318,0.112609744,-0.36210486,-0.01737529,-0.09315401,-0.24226888,0.13369797,-0.3994786,0.003053856,0.043318905,0.100045234,0.47014683,0.111578956,-0.34535423,0.14609696,0.05722237,-0.12486011,0.05247185,-0.13142477,0.0054394547,-0.2232682,0.2396013,0.014848519,0.15260096,0.18967375,-0.34925735,-0.044140026,0.20530932,-0.20910122,-0.124732435,0.17010348
37,-0.24170896,0.0429186,-0.1549367,0.15551499,0.3262223,0.026831567,-0.0021619198,0.23180515,-0.093150504,-0.25518805,-0.18100667,-0.05378152,0.04760303,0.07755701,0.012710964,0.044289112,0.32819584,0.22036678,-0.00468126,0.22344139,0.25374395,-0.19119698,0.15233749,0.15099771,-0.25034767,-0.28992328,0.09867509,0.07759492,0.48136216,-0.38617662,0.37614882,0.124880694,0.11733394,-0.18143483,-0.2798352,0.13098752,-0.2566684,0.109674245,0.0032694356,-0.057172418
38,-0.11904615,0.5427089,-0.14429268,-0.1400775,-0.3229348,0.064550936,0.2720419,0.29460385,0.10406049,0.1666496,-0.043136578,-0.26597324,-0.032454953,-0.012290572,0.098268285,-0.23203045,-0.12563762,0.21949206,-0.16678259,0.19867174,0.45190135,0.100440346,-0.045764387,0.1781763,-0.21769711,0.1273395,-0.020375205,0.29474166,-0.20233068,-0.14719869,0.041732013,-0.016268203,-0.30306816,0.19168897,-0.010460193,0.019955222,-0.30217662,-0.099799514,0.23433563,-0.008719977
39,0.09596305,0.37834993,0.018374275,-0.4175485,0.036182206,0.15992537,-0.31672508,-0.021731695,0.030592494,0.39948544,-0.047886442,-0.13005589,0.032562762,0.12831068,0.24751373,0.03862792,-0.16374145,0.22243556,0.11864077,0.08721651,0.2414127,0.18946636,0.10504779,-0.25829464,-0.005634731,-0.13932954,-0.17502277,-0.23444538,-0.1501749,0.08871818,0.063568,-0.056395173,-0.30520946,-0.043357912,-0.20194691,0.020346578,-0.20995145,0.048991438,-0.09826419,0.34446368
40,-0.13016205,0.34710544,0.030086275,-0.012310611,-0.06680141,0.18355848,0.16737743,-0.36031458,0.26243967,-0.028385999,0.01567528,-0.28750014,0.2513426,-0.33764008,-0.07725626,0.058949605,0.014078098,0.09801052,-0.2689598,0.14629573,0.13011986,0.20219669,-0.11621205,0.4471626,-0.04040301,0.25827205,-0.27273643,-0.07169551,0.11297665,-0.150871,0.33463487,0.4984571,0.047358815,0.25052297,-0.23186612,-0.024626382,-0.17048417,-0.20694725,-0.022268713,0.49422884
41,-0.13686937,0.113783434,0.016625429,-0.25278884,0.11663754,0.57607746,0.2196718,-0.21304199,0.39365876,0.2798901,0.1032767,0.112819396,0.41319877,-0.13820149,0.3950646,0.2704875,0.0034098348,-0.22871701,-0.052553702,-0.003393164,0.1607747,0.35961896,0.0170758,0.3138402,-0.0020532818,-0.06691546,-0.5848669,0.27181193,0.18421626,0.16714525,0.36140585,0.36231485,0.12448199,-0.29679695,-0.03419734,0.07231468,-0.43486038,0.021893682,0.09641167,-0.0855832
42,-0.083942644,0.21583863,-0.114268,0.087463334,0.013702593,-0.34761938,-0.08643849,-0.122419536,0.037274335,0.02096056,0.019257184,-0.12886454,0.43446288,-0.13696751,0.16113472,-0.038412116,0.04791003,0.012935586,0.08801717,-0.20930296,0.26511428,-0.06069289,-0.17836219,-0.03611984,-0.009710658,0.03264754,0.1799852,0.04166117,-0.107084,-0.54479074,0.34467593,0.4905451,0.13625287,0.02111437,-0.23070128,0.37780842,-0.09652616,0.02048246,-0.14625534,0.02166839
43,0.0059431354,0.33362126,0.19711193,0.058205325,-0.33778453,0.24775563,0.022199066,-0.10358174,0.08823148,0.039014935,0.12680532,-0.48424938,-0.13312155,0.09591836,0.111533605,0.16299479,0.00256213,0.10652405,0.20745724,0.32133043,0.5296241,-0.14506005,-0.008420576,-0.007807524,0.024637787,0.02878211,-0.41474468,0.15047596,0.0775474,-0.027631346,0.1689417,0.17373955,-0.14711109,0.052735396,-0.098965734,-0.31953144,-0.16982041,-0.321475,-0.12213984,-0.01096695
44,-0.22593534,0.28768617,0.055102307,0.03511439,-0.29144076,0.61778927,-0.028476361,-0.09911597,-0.11329296,-0.14713348,0.11737424,-0.3294589,-0.028631806,-0.08253588,0.12782952,0.27454904,-0.11381512,0.33415896,0.20710005,0.06704381,0.26412472,0.15760517,0.00046210893,-0.28355068,-0.2765337,0.1003648,-0.2268476,0.053883187,-0.02492304,-0.3041152,0.014965335,-0.06857357,0.15218905,0.31325597,0.24299055,-0.31251594,-0.0053785467,-0.11007182,-0.085323796,0.21842587
45,-0.26741,0.2655175,0.016628167,-0.044203456,0.040938403,-0.109984525,-0.024931554,-0.19704889,-0.013167534,0.06437542,0.005163034,-0.21672603,0.50139683,-0.16221261,0.12804429,-0.12085842,-0.013646999,0.113578066,0.02267575,0.09587367,0.22827712,-0.12341898,-0.23983458,-0.22851425,-0.14511545,0.070286855,-0.04973868,0.020765483,0.13355246,-0.113856986,0.24456975,0.24748911,0.5422653,0.13583119,-0.20096405,0.17634895,-0.079376996,-0.11303379,0.06311047,0.12512352
46,-0.33187562,0.08487973,-0.008054553,-0.020754004,0.3007255,-0.16757804,0.19354658,-0.2525695,-0.23357315,0.5737397,-0.02364024,-0.20126513,0.3022633,0.38395655,0.31082156,0.06346124,-0.12458732,0.5165917,-0.15778983,-0.07673552,0.22063291,0.081728816,-0.011185911,0.23787214,-0.36171857,0.09225911,-0.20372435,-0.21022071,-0.2804569,0.022865793,0.26502806,0.25147393,0.38392493,-0.029787248,0.10413925,0.05162909,-0.20245413,0.30088288,0.03542514,-0.12073256
47,0.39461342,0.2783925,-0.2375871,-0.23057112,0.4941099,0.30499807,-0.2096668,-0.3632681,0.3420986,-0.19624572,0.07380678,-0.08302197,0.26250336,0.3141786,0.15069698,0.28307056,0.2053208,0.28948447,0.048553023,0.1550942,0.5352665,0.55573636,-0.18022677,-0.031598013,0.041945573,0.27017024,-0.3562519,0.32443333,0.19051863,0.04032238,0.13399532,0.07869124,0.15988487,0.03450463,0.22383636,0.13688207,0.05419962,0.37310603,0.13820982,0.115367256
48,0.03830707,0.38217404,0.1367034,0.08826704,0.5364918,0.32111606,-0.22981063,0.08000599,0.42804945,0.5863043,-0.10583991,-0.023863565,-0.2264779,-0.18652137,0.1070249,-0.28311363,0.36518955,0.053187314,-0.29651517,0.5320363,0.18683109,-0.13526402,0.25482902,0.07848662,-0.056273375,0.36298242,0.22181286,0.36016124,0.08022703,0.13245767,0.08203208,0.21196738,0.33625913,0.15165381,-0.3836473,0.029557468,-0.25301346,-0.24359249,-0.045985166,0.027007304
49,0.12310249,-0.26263765,-0.013078695,-0.050955933,0.0030297148,0.0011014964,-0.18533109,0.39299166,0.05697058,0.27302015,-0.03240951,-0.20513974,0.5240168,0.31129304,0.10027864,0.31785628,0.06626461,0.022155855,-0.08869779,0.5083161,-0.030200176,0.14638035,-0.31684178,0.2175791,-0.384595,0.017309232,-0.27322066,0.5453328,0.006293875,0.32844383,0.23925515,0.061417952,0.44074696,-0.21750903,-0.47690144,0.071676075,-0.20764533,0.016884822,0.018906927,-0.07913779
50,-0.08858791,0.39933664,0.042583186,0.09877412,-0.12908487,-0.2874176,0.08217658,0.23369323,0.23032172,-0.1633229,-0.20244576,-0.25476426,-0.026734307,-0.039601564,-0.14142644,-0.23874877,0.089747325,-0.042942718,-0.08174591,0.39817685,0.07081095,0.050904207,-0.17982271,0.16755047,-0.12470436,0.0008477477,-0.09802736,-0.16605692,0.25378814,-0.08765817,0.4537369,0.46464798,0.05797905,-0.005017114,-0.2381032,0.6047224,0.12695882,-0.1837669,-0.3508062,0.19825254
51,-0.23952629,0.5270213,0.035233043,-0.21841912,-7.79719e-05,-0.05742142,-0.11899898,-0.02381716,-0.09301391,0.08434423,-0.10427192,0.03484612,-0.19159451,0.09009437,-0.09120929,0.486743,0.36739632,0.053427625,-0.2228679,0.3466758,0.081032656,0.0029101917,-0.05020659,-0.07268677,0.070428796,0.022720631,-0.100067675,-0.0672668,0.046468962,0.30813223,0.31642285,-0.07864506,-0.26223058,0.0102331145,-0.5764184,0.19918455,-0.19231129,-0.019348491,-0.13541259,0.021785572
52,-0.21817295,0.43164885,0.23018683,0.011810087,0.1719204,0.08514008,-0.072194725,0.48164013,0.04276836,0.29918313,-0.17254576,-0.20235106,0.053850666,0.067069344,-0.05368715,0.028958155,0.15972403,0.00067886733,0.21176377,-0.05549998,0.3516585,-0.22134578,-0.26391533,0.3587601,0.15668032,-0.14165014,-0.19927461,0.36699802,-0.32287553,-0.069109984,0.018190242,-0.10282854,0.038507186,-0.35952562,-0.102436356,0.2083297,-0.08562675,-0.056545574,-0.14473496,0.29997095
53,0.1957694,0.49129498,0.85185665,-0.10752433,0.23527369,-0.0107600745,0.18203051,0.1448914,0.6847027,0.021847818,0.0760595,-0.051203918,0.42825103,0.019205116,0.07264437,-0.0062381057,0.039490886,0.035984054,0.4000219,0.1355745,-0.17496173,-0.03309864,0.48227835,0.09714058,-0.05826059,-0.28417337,-0.20107496,-0.18512483,0.008714482,-0.12644932,0.31033412,0.23477595,0.1510195,0.56021,-0.20090878,0.11989527,-0.073218696,0.09105266,0.1453078,0.29206055
54,-0.5838498,-0.0483852,-0.23946871,-0.0013012022,0.2798012,-0.016613726,0.25884736,-0.23910093,0.30592722,-0.046086915,-0.04302416,-0.022792637,0.3761507,-0.30125564,-0.10659421,-0.101081856,0.15770026,-0.05216863,0.08016394,0.27750796,0.04031344,0.52788013,0.26708743,0.25706828,-0.26687253,0.095021226,-0.43066242,0.36556724,-0.0023896634,-0.11184341,-0.051493067,0.19425409,0.2835323,-0.27444834,-0.38739875,0.07473136,-0.167951,0.14325416,0.055984233,-0.020998375
55,0.063776486,0.39578137,0.51885974,0.0085972585,0.17440122,0.30348548,-0.120743856,-0.06883547,0.18409942,-0.10135868,-0.4038907,-0.27239156,-0.09703855,-0.28162187,0.1866333,-0.08204355,-0.001373606,0.43394178,0.18654549,0.24305841,0.3496305,-0.01987439,-0.3136412,0.1019195,-0.11110227,0.0958205,-0.011898965,0.013317619,0.05699405,-0.13779551,0.47047535,-0.298412,0.22227754,0.15518518,-0.24272226,0.07561798,0.13622665,0.14607462,0.41636437,0.19383033
56,0.046393782,0.09079815,-0.47353503,-0.046038184,0.104887255,0.2979842,-0.2837547,0.20248528,0.18907747,0.11540481,0.08085293,-0.11688809,0.011626022,-0.4829998,0.0117234085,-0.56206924,-0.060383216,0.16786452,0.04045023,0.16196387,0.13512407,0.17478009,0.03927846,0.11323777,-0.39273852,-0.09597638,-0.20881437,0.077901445,0.029663512,-0.05774455,0.59516233,-0.2682998,0.24428344,0.1948787,0.04341671,0.048050772,0.016757712,0.24287675,-0.046636123,0.42267933
57,0.0575125,0.04866155,-0.43017203,-0.047883607,0.25862217,-0.33816803,0.06892543,0.11669072,0.4124752,0.19137937,-0.0008893191,-0.16629218,0.48503473,-0.05820647,0.10913566,-0.15197554,-0.047027554,0.13456076,-0.11641591,-0.05565274,0.3836547,-0.26786435,0.13096736,0.14516091,0.6506932,0.23913087,-0.055454556,0.17035319,0.47830972,-0.15098533,0.27328587,0.279861,0.17890766,0.034878705,0.086538166,0.02390633,-0.1284734,-0.13615872,0.032267567,-0.022819059
58,-0.4713118,0.36495522,0.06191155,-0.20093301,0.13001451,0.08817377,0.023322912,-0.0131691275,-0.22853276,0.12521037,-0.112368405,-0.0075655472,0.24526653,0.40300435,-0.10065147,0.028078163,-0.091676906,0.2584973,-0.11945572,0.3105052,-0.13296953,0.0061329408,-0.12821019,-0.24521641,-0.011814657,-0.2850534,0.0312461,-0.20640756,0.2967474,-0.051769204,0.16689083,-0.31166595,0.023121333,0.09651045,-0.309345,0.34677345,0.042649783,0.10841704,0.16954507,0.05380915
59,-0.30472705,0.17815797,-0.021551918,0.23817539,0.50388724,0.24730155,-0.03455956,-0.25243816,0.26701868,0.0035150058,-0.40469995,-0.07804189,0.32773402,-0.37608418,-0.068787634,0.39549103,0.20813592,0.1071942,-0.32490408,0.06271185,0.19492838,0.26801,0.34407875,0.31122404,-0.26524204,0.17018051,-0.32208812,0.26534808,0.2396077,-0.32600328,-0.22832368,0.22352237,0.3398172,0.07110263,0.019030966,-0.0939536,-0.07554643,0.12042959,0.31179994,0.11126512
60,-0.045022894,-0.14875123,0.30189848,0.103837915,-0.27709395,0.485353,0.15362796,0.10877283,-0.16092698,0.20871966,-0.017141014,-0.33948794,0.078275226,-0.122570105,-0.0012147685,0.41471943,-0.020564822,0.15805578,0.032604333,0.25238612,0.084305085,-0.13457967,-0.034225706,0.10605545,0.06756743,0.20911801,-0.20328884,0.29274473,-0.112888955,-0.5107366,0.2997654,-0.0586228,0.15617509,-0.07904471,-0.30713964,-0.19372022,-0.23408666,-0.22049928,0.29137594,0.12475962
61,-0.09755022,0.5538934,-0.024118125,0.47194582,0.003436558,0.3409591,0.41783002,0.40251628,-0.073050186,0.30409428,0.36108088,0.23171082,-0.009223822,0.068573646,0.19000414,0.18648966,0.19232842,0.17948228,0.013811007,0.18224484,0.0031618844,0.33407125,-0.35321954,-0.31989658,0.2741995,-0.14181049,0.010045561,0.003875033,0.12586385,0.1375694,0.15229742,0.077586696,-0.088067,0.066033244,0.1728031,0.35628924,0.12448388,0.039551295,-0.22913624,-0.13207611
62,-0.044030786,0.023423707,-0.25194335,0.35911044,0.21761759,-0.21206684,0.0138528505,0.0917405,0.005405939,0.17530967,0.10487961,0.09290985,0.40773296,-0.21553096,0.012698759,-0.020588083,0.32949075,0.14299826,0.087664574,-0.09513937,0.23937696,0.27730432,-0.41226673,0.19959098,0.12002142,0.030526523,-0.19732049,0.39996517,-0.12592514,0.34623802,0.32038486,-0.17674163,0.5626446,0.5519979,-0.3111964,0.3652352,-0.18009716,0.010115897,-0.029905327,0.19386321
63,0.04151451,0.31797627,0.263222,0.31098092,0.1810685,0.09617739,-0.22772513,0.57646996,0.54877794,-0.14434326,0.60943,-0.080463275,0.46301714,0.06672046,-0.0066095586,-0.22288701,0.15908918,0.4283309,-0.3780566,0.2662354,-0.08099288,0.16499868,-0.073314086,0.16366634,-0.23459668,0.14948,-0.03554519,-0.22502418,-0.0014921833,-0.31123748,0.33516136,-0.15202327,-0.050898388,-0.07167377,-0.14199127,-0.19969794,-0.11607957,-0.19883186,0.087308764,0.22217654
64,-0.12317932,0.083344825,0.055809505,0.102081984,0.04764939,0.23061973,-0.04579857,0.08447139,-0.17944187,-0.3089177,0.27866748,-0.16326272,0.34267744,-0.30806807,-0.038404815,0.23179469,0.04473389,-0.00648359,0.09842574,0.026127186,0.30956635,-0.12345946,0.03995705,0.39364442,-0.09306853,-0.07444173,0.42482534,-0.047578044,-0.2596246,-0.17704831,0.21668899,0.06628366,0.33149895,-0.28247407,0.09001185,0.28649336,-0.14452983,0.29561102,-0.25513625,0.34654197
65,-0.2193704,0.094733074,0.07173656,0.1350602,0.00814501,-0.17762399,-0.018531961,-0.13512594,0.15875554,0.27638587,0.38188186,-0.07299122,0.26381412,-0.21735992,-0.05634183,0.36511874,0.2528184,0.08953593,-0.04645365,-0.13172753,0.6865423,-0.023061706,-0.18395355,0.012681774,-0.23205723,-0.23258944,0.08488783,0.034389053,0.01879808,-0.3238945,-0.14020012,-0.20036308,0.24224448,0.07373467,-0.3453826,-0.015195002,-0.23314023,-0.0048384913,0.047379002,0.11098172
66,0.030027356,0.24443781,-0.0048072753,0.09595661,-0.37023106,0.17504099,-0.04937917,0.4822214,0.066080794,-0.026930371,-0.10026912,0.24360876,0.121110395,-0.21035348,0.26195952,-0.08805973,-0.3243631,0.11591051,0.02201559,-0.12364323,0.32665068,0.14091711,0.51826537,0.17196774,0.19647901,-0.22697853,-0.1600595,-0.34373987,0.118932344,-0.067141406,0.1425745,0.48356602,0.036262542,0.028116891,-0.47106516,0.21027623,-0.09553638,0.25578624,0.4870067,-0.21416475
67,-0.23936254,0.06927054,0.76303434,-0.088337675,-0.060733307,0.20189855,0.06387832,-0.35058802,0.19157824,0.39665926,0.05512975,0.15458816,-0.037064195,0.098927766,-0.15772972,-0.054577,0.10430514,-0.11063105,-0.13116132,0.15652093,0.1229053,0.5686926,0.044283584,0.111599594,-0.21445933,-0.08749179,0.021225736,-0.040851615,0.08910471,-0.05989127,-0.028157894,-0.037782453,0.54031944,-0.09709116,-0.44204968,0.12988062,-0.35849738,-0.25478,-0.15875277,0.5683148
68,-0.271742,0.1696201,-0.1294101,-0.13277005,0.09210963,0.37531054,0.18215933,-0.21583271,0.041310467,-0.11403518,0.2612792,0.14016095,0.36574206,0.5505681,0.22158358,-0.056946855,0.010055536,0.15284172,0.0016750351,-0.1656484,0.33651727,-0.06194791,-0.1893745,0.48338458,-0.08705739,0.08037675,0.11484645,-0.05601645,-0.14969581,-0.15553197,0.0018129634,-0.28381586,0.28044406,0.32734275,-0.2157325,0.24860877,-0.079126544,-0.37651286,0.017981404,-0.1835028
69,0.032059424,0.4729911,0.075610876,-0.31170103,-0.12609148,0.15072414,-0.29764038,0.14272219,-0.06274502,0.33238095,-0.3743773,-0.08578127,-0.07781613,0.20895493,0.21134424,-0.17401922,0.2183596,0.23464294,-0.11061101,0.12312629,0.22121139,0.20725322,-0.029039094,-0.19135977,-0.22164102,-0.031414393,-0.13214092,-0.01153109,-0.041007917,0.11519126,0.14449981,-0.11171259,-0.170704,-0.06378146,-0.10784444,0.31908602,-0.22039215,-0.10587892,-0.21488364,0.23851934
70,-0.2725134,0.21259604,0.0007328355,0.18943325,0.24088156,0.42056817,0.010061299,0.49906436,0.18625912,0.23557319,-0.29641917,-0.14346598,0.12001093,0.43190414,-0.35907617,0.3188125,-0.1348589,0.225384,-0.21686347,-0.15856878,0.4870912,0.39719865,-0.22284044,0.07021346,0.5322338,-0.12151413,-0.15475097,0.2272297,0.24680275,0.057989594,0.07411175,0.043308396,0.13154499,0.03664736,0.018091941,-0.07701484,-0.052303903,-0.03148146,0.07097182,0.39312932
71,-0.37602305,0.34024003,-0.019084087,-0.03972264,0.16128121,-0.11549662,-0.15862474,0.34529975,0.29775602,0.16371426,-0.49488705,0.033461,0.087048106,-0.05996606,0.074469015,0.08876206,0.21977635,0.54537416,0.02176642,-0.06475441,0.06583275,0.2385205,-0.047306977,0.13764448,-0.57378554,-0.068890855,-0.07770661,0.09563444,0.18114683,-0.0783339,-0.26869023,-0.046121016,0.25206745,0.115932904,-0.1487921,0.122654244,0.028593903,-0.14730802,-0.31424263,0.24139193
72,-0.08026567,0.26691017,0.121614635,-0.08964685,0.054992944,-0.36839664,-0.102687925,-0.04026256,0.21369117,-0.5187315,-0.08393322,0.19309849,-0.07936209,-0.18652394,0.45010298,-0.19049057,-0.032915737,0.30382887,0.05002656,0.095900305,0.3618917,0.17797486,-0.2652843,0.18841444,-0.13833952,0.19337411,0.09026365,-0.0120267905,0.2560968,0.04338448,0.4013264,0.07948769,0.06120384,-0.34626,-0.16703214,0.13732782,-0.2307912,0.2303207,0.15797623,-0.35350564
73,-0.35322064,0.29140162,-0.09401484,0.093746856,-0.18719462,0.21669035,-0.14198112,-0.20597482,0.13975397,-0.039204367,-0.15842856,0.06684925,0.33241218,-0.06122263,-0.01613359,-0.32075644,0.30743366,0.17308545,-0.1524412,-0.021990702,0.42963198,0.044467423,0.18963759,0.35054186,-0.14057204,0.09032854,0.093703434,0.118255675,-0.06718651,-0.11812184,0.35192037,0.05666787,0.21319649,-0.03261776,-0.4107011,0.0030558652,-0.24127367,-0.019150367,0.075825125,0.08936397
74,0.09625148,0.09176615,0.06408585,0.1327404,0.47715792,-0.046512317,-0.13727002,0.35387236,-0.033078764,-0.28136665,-0.0019453688,0.047155015,0.28082323,0.13437256,0.2373316,0.008808361,-0.27631056,0.18409206,0.173569,0.04844078,0.41406703,-0.21144262,0.008250581,0.41489407,-0.048538674,-0.2072994,0.039175082,-0.13429737,0.101775795,0.000115361756,0.106546976,0.15393724,0.36083665,-0.3122881,-0.13601081,0.08021715,-0.19726157,-0.005148282,-0.038641486,0.060095444
75,-0.09079041,0.38438228,-0.13890989,-0.25123444,-0.35575873,0.050277326,0.21203402,0.11224039,0.31535864,0.052570675,-0.07948526,0.48939446,0.24093895,-0.12193066,-0.08240688,0.39776435,0.29720712,0.025062088,0.035618503,0.16731389,-0.11719175,-0.43125585,0.1397549,0.1802757,-0.21263514,-0.10160493,0.24294892,-0.1316067,0.034728553,0.16923717,0.31439874,-0.09175479,-0.051467672,-0.0077814707,-0.00022585958,-0.35210013,0.14801034,0.22103429,-0.07197315,0.07881689
76,-0.109564245,0.2683809,0.3103953,-0.030284071,0.22034802,0.21975917,-0.17956541,0.31090412,0.034699116,0.18250224,0.072497085,0.07208106,-0.26620102,0.13401212,-0.10372418,0.0007991132,-0.5067735,0.096471675,0.11055383,0.40268183,0.013073065,-0.028238045,0.24371988,-0.015222838,0.20731217,-0.11969999,-0.15709813,-0.18381247,0.2843157,-0.31186867,0.5919507,-0.10155013,0.39323276,0.014077018,-0.30828565,0.04106741,-0.15658006,-0.067104965,0.056438092,0.23617299
77,-0.3856008,0.05114871,0.44440845,-0.32143354,0.24926905,0.14721517,-0.11088582,0.25661576,0.152935,-0.34850094,0.1674246,-0.34044075,0.3177669,0.19114462,-0.1649313,0.19326766,0.6076414,0.10601046,-0.06588276,-0.17892136,0.02673461,-0.15038966,0.33296365,-0.3160583,0.31890097,0.12835819,-0.25861284,0.09089991,-0.09745327,0.198437,0.09962841,0.20331156,-0.0024649296,-0.0338394,-0.29421288,-0.03894377,-0.4872856,0.0273817,0.07765228,-0.076334216
78,0.15600893,0.18380724,-0.3346268,-0.30262122,0.23833755,-0.078846544,-0.04941284,0.05857487,0.20471561,0.09403519,0.17923555,-0.06843175,0.10162704,-0.14382356,0.14757366,0.20391563,0.26499856,0.13717277,-0.21029568,-0.05386543,0.15749986,-0.079210706,0.061372116,0.57016015,-0.023798808,-0.04940599,-0.035593815,-0.15582834,0.43216473,-0.56073225,0.016691158,0.062402412,-0.2817907,0.2534141,-0.08516174,0.42570642,-0.10361578,-0.10484248,-0.13851732,0.27714735
79,0.011837798,0.18314141,0.05557354,-0.10484835,0.3303725,-0.06600443,0.07732603,0.10360158,0.18997604,0.111981586,0.29110336,0.09125468,0.0027338357,-0.14512958,-0.16605236,0.04276273,0.19194321,0.09498215,-0.229514,0.1576736,0.5247159,-0.041296966,-0.033843867,-0.122692324,-0.3419389,0.018789126,-0.26024434,-0.29399422,0.22243717,-0.24118303,-0.03769834,-0.11529319,0.53556323,-0.24994278,-0.08895078,0.20131987,-0.23718974,-0.30003738,0.048586104,0.27631932
80,0.03095881,0.03052909,-0.13118462,-0.13977998,0.3139395,0.04130381,0.4625891,-0.00013614594,0.32289436,0.04115959,-0.16881704,0.17317891,0.16872956,0.39802402,-0.12888752,-0.019352643,0.20463987,0.28828275,0.23302458,-0.099527895,0.30468324,0.5878317,0.086143255,-0.2235184,0.10810868,0.08521698,0.056466524,-0.050517846,-0.18718688,-0.5297838,-0.037501276,0.02401075,-0.11450025,-0.25113845,-0.03472595,0.18106766,-0.17022128,-0.14285222,-0.15713659,0.48427084
81,-0.021556506,0.2919383,0.08994738,0.30201006,0.63861144,0.35775945,-0.3752993,-0.5078546,0.20080179,0.3904751,0.08735407,0.02266237,0.710069,0.264158,0.11309329,0.23101404,0.26295316,-0.20779371,-0.3081894,0.17319395,0.004665973,-0.012948947,-0.37376532,0.15251495,0.17774758,0.07160885,0.0466393,0.31498703,0.024797795,-0.072866954,0.027032245,0.30739254,0.10684972,-0.2292402,-0.14992338,0.1651058,0.1441105,-0.0006906223,0.12210807,-0.028796036
82,-0.3365576,0.4854302,0.22331621,0.1431486,0.42548496,0.14722057,0.11519436,0.23270538,-0.045419503,0.026810331,0.2754858,-0.06369165,0.0319961,0.19668822,-0.18803142,0.14232768,-0.49420273,-0.32559904,0.31294045,0.31638855,0.2731959,-0.23860843,0.19937639,-0.054042395,-0.16327266,0.37019202,-0.36120299,0.42605504,0.0005946716,-0.15260129,0.016980419,0.09454117,0.3692118,0.24510673,0.17051353,0.42416042,0.28171223,0.16550286,0.17436859,0.36374342
83,-0.19943863,0.22380358,0.12454407,-0.0030141233,-0.068462536,0.009396645,0.30914977,-0.08773378,-0.15460844,0.018947165,-0.09631838,-0.009078194,0.3618057,-0.079093054,-0.3795522,-0.112078615,0.20821026,0.1882507,0.03853186,0.090364955,0.09105002,0.22203869,0.4847958,0.051156264,0.2763873,0.012862479,0.1590007,0.45389232,-0.08450632,0.27575263,0.5011476,-0.5121197,0.027500492,-0.27759928,0.022301223,-0.13691075,0.36690775,-0.1825175,-0.122071594,0.015798576
84,-0.5733232,0.24965894,0.14695063,0.15075243,0.0877767,0.031970274,-0.16583127,0.082781486,0.1753899,0.51336485,-0.27432826,-0.35297695,-0.024555419,0.22202897,-0.26458597,0.43117008,0.18292795,-0.07917984,-0.033625554,0.09538628,0.037004467,0.55907536,-0.11569523,0.5252158,-0.073829174,-0.004017623,-0.28589988,-0.17899692,0.07491355,0.19591597,0.44264957,0.3259932,0.033194926,-0.336744,0.4586939,0.012203104,-0.048395723,-0.03718759,0.06304488,0.18369557
85,-0.0052721025,-0.013249564,-0.08891799,-0.13683522,0.045461453,-0.1697241,-0.08105561,-0.25706312,0.07583887,-0.106802754,0.375297,-0.3452907,0.55206996,-0.074609816,0.082063794,-0.112407304,0.028253283,-0.07714174,0.3177522,0.4236344,0.3288356,0.09424726,0.05802443,0.16717042,-0.15693061,-0.41309634,0.22299013,-0.26473254,0.22569177,0.01987446,0.20528863,0.08607452,0.03153351,-0.09846349,-0.28994694,0.056711715,-0.07989772,0.14170316,0.0736152,0.271239
86,0.0,0.0,0.0,0.0,0.0,0.0,0.0,0.0,0.0,0.0,0.0,0.0,0.0,0.0,0.0,0.0,0.0,0.0,0.0,0.0,0.0,0.0,0.0,0.0,0.0,0.0,0.0,0.0,0.0,0.0,0.0,0.0,0.0,0.0,0.0,0.0,0.0,0.0,0.0,0.0
87,0.0,0.0,0.0,0.0,0.0,0.0,0.0,0.0,0.0,0.0,0.0,0.0,0.0,0.0,0.0,0.0,0.0,0.0,0.0,0.0,0.0,0.0,0.0,0.0,0.0,0.0,0.0,0.0,0.0,0.0,0.0,0.0,0.0,0.0,0.0,0.0,0.0,0.0,0.0,0.0
88,0.0,0.0,0.0,0.0,0.0,0.0,0.0,0.0,0.0,0.0,0.0,0.0,0.0,0.0,0.0,0.0,0.0,0.0,0.0,0.0,0.0,0.0,0.0,0.0,0.0,0.0,0.0,0.0,0.0,0.0,0.0,0.0,0.0,0.0,0.0,0.0,0.0,0.0,0.0,0.0
89,0.0,0.0,0.0,0.0,0.0,0.0,0.0,0.0,0.0,0.0,0.0,0.0,0.0,0.0,0.0,0.0,0.0,0.0,0.0,0.0,0.0,0.0,0.0,0.0,0.0,0.0,0.0,0.0,0.0,0.0,0.0,0.0,0.0,0.0,0.0,0.0,0.0,0.0,0.0,0.0
90,0.0,0.0,0.0,0.0,0.0,0.0,0.0,0.0,0.0,0.0,0.0,0.0,0.0,0.0,0.0,0.0,0.0,0.0,0.0,0.0,0.0,0.0,0.0,0.0,0.0,0.0,0.0,0.0,0.0,0.0,0.0,0.0,0.0,0.0,0.0,0.0,0.0,0.0,0.0,0.0
91,0.0,0.0,0.0,0.0,0.0,0.0,0.0,0.0,0.0,0.0,0.0,0.0,0.0,0.0,0.0,0.0,0.0,0.0,0.0,0.0,0.0,0.0,0.0,0.0,0.0,0.0,0.0,0.0,0.0,0.0,0.0,0.0,0.0,0.0,0.0,0.0,0.0,0.0,0.0,0.0
92,0.0,0.0,0.0,0.0,0.0,0.0,0.0,0.0,0.0,0.0,0.0,0.0,0.0,0.0,0.0,0.0,0.0,0.0,0.0,0.0,0.0,0.0,0.0,0.0,0.0,0.0,0.0,0.0,0.0,0.0,0.0,0.0,0.0,0.0,0.0,0.0,0.0,0.0,0.0,0.0
93,0.0,0.0,0.0,0.0,0.0,0.0,0.0,0.0,0.0,0.0,0.0,0.0,0.0,0.0,0.0,0.0,0.0,0.0,0.0,0.0,0.0,0.0,0.0,0.0,0.0,0.0,0.0,0.0,0.0,0.0,0.0,0.0,0.0,0.0,0.0,0.0,0.0,0.0,0.0,0.0
94,0.0,0.0,0.0,0.0,0.0,0.0,0.0,0.0,0.0,0.0,0.0,0.0,0.0,0.0,0.0,0.0,0.0,0.0,0.0,0.0,0.0,0.0,0.0,0.0,0.0,0.0,0.0,0.0,0.0,0.0,0.0,0.0,0.0,0.0,0.0,0.0,0.0,0.0,0.0,0.0
95,0.0,0.0,0.0,0.0,0.0,0.0,0.0,0.0,0.0,0.0,0.0,0.0,0.0,0.0,0.0,0.0,0.0,0.0,0.0,0.0,0.0,0.0,0.0,0.0,0.0,0.0,0.0,0.0,0.0,0.0,0.0,0.0,0.0,0.0,0.0,0.0,0.0,0.0,0.0,0.0
96,0.0,0.0,0.0,0.0,0.0,0.0,0.0,0.0,0.0,0.0,0.0,0.0,0.0,0.0,0.0,0.0,0.0,0.0,0.0,0.0,0.0,0.0,0.0,0.0,0.0,0.0,0.0,0.0,0.0,0.0,0.0,0.0,0.0,0.0,0.0,0.0,0.0,0.0,0.0,0.0
97,0.0,0.0,0.0,0.0,0.0,0.0,0.0,0.0,0.0,0.0,0.0,0.0,0.0,0.0,0.0,0.0,0.0,0.0,0.0,0.0,0.0,0.0,0.0,0.0,0.0,0.0,0.0,0.0,0.0,0.0,0.0,0.0,0.0,0.0,0.0,0.0,0.0,0.0,0.0,0.0
98,0.0,0.0,0.0,0.0,0.0,0.0,0.0,0.0,0.0,0.0,0.0,0.0,0.0,0.0,0.0,0.0,0.0,0.0,0.0,0.0,0.0,0.0,0.0,0.0,0.0,0.0,0.0,0.0,0.0,0.0,0.0,0.0,0.0,0.0,0.0,0.0,0.0,0.0,0.0,0.0
99,0.0,0.0,0.0,0.0,0.0,0.0,0.0,0.0,0.0,0.0,0.0,0.0,0.0,0.0,0.0,0.0,0.0,0.0,0.0,0.0,0.0,0.0,0.0,0.0,0.0,0.0,0.0,0.0,0.0,0.0,0.0,0.0,0.0,0.0,0.0,0.0,0.0,0.0,0.0,0.0
