,0,1,2,3,4,5,6,7,8,9,10,11,12,13,14,15,16,17,18,19,20,21,22,23,24,25,26,27,28,29,30,31,32,33,34,35,36,37,38,39
0,0.16665494441986084,-0.024377793073654175,-0.3319110870361328,0.14112451672554016,0.03488142043352127,0.5189359784126282,-0.0867571085691452,-0.023689359426498413,0.14011164009571075,-0.501566469669342,0.43203938007354736,0.3549290895462036,0.3295917809009552,0.11762416362762451,-0.24352076649665833,-0.2092522829771042,0.05457821488380432,-0.2937833368778229,-0.32290711998939514,-0.08011411130428314,0.2527967393398285,0.543740451335907,-0.12418550252914429,0.13928017020225525,-0.0906011164188385,-0.15387319028377533,-0.07403305172920227,-0.04164763540029526,0.38853251934051514,-0.2649837136268616,-0.0792231485247612,-0.16074855625629425,-0.24324071407318115,-0.05928124487400055,-0.06347944587469101,-0.038614366203546524,0.47597742080688477,-0.3274100422859192,-0.013701030984520912,0.37331655621528625
1,0.48358675837516785,-0.3412473797798157,0.32096564769744873,0.7876647710800171,-0.08249073475599289,-0.3751737177371979,-0.5101411938667297,0.40217676758766174,0.15086863934993744,0.3839695155620575,0.6036190986633301,-0.054993148893117905,-0.15488319098949432,-0.31858327984809875,0.2210320085287094,0.6139184832572937,-0.5570901036262512,0.15441784262657166,-0.5306946635246277,0.9855450391769409,-0.42697587609291077,0.5123369097709656,-0.5075228810310364,-0.21279504895210266,0.07710935175418854,0.2996246814727783,0.37962761521339417,0.02543955110013485,0.4213976263999939,-0.21518008410930634,-0.43375346064567566,-0.011634242720901966,0.02375837042927742,0.019991403445601463,0.1744798719882965,-0.217722550034523,0.4234612286090851,-0.5555281639099121,-0.1913488805294037,0.16503562033176422
2,0.11726000905036926,0.07379091531038284,-0.24435172975063324,0.1561669409275055,0.09590838849544525,0.14637023210525513,-0.030078265815973282,0.14286892116069794,0.10582675039768219,0.21247048676013947,0.07979045063257217,0.16098760068416595,0.3213781416416168,-0.32529377937316895,0.028231365606188774,-0.03953944146633148,-0.10683244466781616,-0.3040209114551544,-0.014737535268068314,-0.06435923278331757,0.06816272437572479,0.19310230016708374,0.26059621572494507,-0.16259419918060303,0.028886334970593452,0.055017467588186264,-0.19806350767612457,-0.1098528727889061,0.1371346414089203,-0.2609860599040985,-0.0070481011644005775,0.048842716962099075,-0.31697025895118713,0.022397726774215698,-0.10394394397735596,-0.2543749213218689,0.15741407871246338,-0.0745130106806755,0.12290508300065994,0.21469290554523468
3,0.06716087460517883,-0.042116276919841766,-0.27099835872650146,0.05860490724444389,0.013412093743681908,0.037566863000392914,-0.01668435148894787,0.15309487283229828,0.020148398354649544,0.059057995676994324,0.1411769539117813,0.07542593777179718,0.1901286244392395,-0.05006512254476547,0.12572233378887177,-0.009282572194933891,-0.00925453007221222,-0.29669150710105896,-0.06165618449449539,-0.15287838876247406,0.21145594120025635,-0.0017858371138572693,0.19475650787353516,-0.04034269601106644,0.1601380705833435,0.07065194845199585,-0.1710604578256607,-0.20865663886070251,0.07420144975185394,-0.016962548717856407,0.08620927482843399,0.011686891317367554,-0.11736700683832169,-0.047811441123485565,-0.03377687931060791,-0.26743122935295105,0.24581660330295563,-0.1924695521593094,0.06738200038671494,0.10598393529653549
4,0.12691481411457062,0.044918667525053024,-0.1805918663740158,0.08672035485506058,0.13174474239349365,0.08151113241910934,0.044159479439258575,0.07428576797246933,-0.01622920110821724,0.15239931643009186,0.09151257574558258,0.07720169425010681,0.24585489928722382,-0.24145491421222687,0.01331227645277977,-0.11137596517801285,-0.0434604249894619,-0.22933824360370636,-0.026849722489714622,-0.07894568145275116,0.14300937950611115,0.05957543104887009,0.20708175003528595,-0.066643126308918,0.008892450481653214,0.064350925385952,-0.1558772623538971,-0.0836438313126564,0.1327175796031952,-0.2539638578891754,-0.0011795591562986374,-0.00195319508202374,-0.24462975561618805,0.005046943202614784,-0.06358204782009125,-0.2315196692943573,0.2439507246017456,-0.1277598887681961,0.07261081784963608,0.1614827960729599
5,-0.02420640178024769,0.30709487199783325,-0.7305457592010498,0.33800196647644043,0.1651923805475235,0.371611624956131,-0.457428902387619,0.257948100566864,0.26104074716567993,-0.43720510601997375,-0.20467133820056915,0.08508260548114777,0.22158633172512054,-0.1799478828907013,0.2940143048763275,0.5755141377449036,-0.2401338666677475,-0.05877263471484184,-0.43311312794685364,0.15630485117435455,-0.057351551949977875,0.33543911576271057,0.4532754123210907,-0.11337053030729294,0.5101140141487122,-0.08923617750406265,-0.20627017319202423,0.06173960864543915,-0.26850366592407227,0.11165288835763931,-0.202918142080307,0.14283663034439087,-0.0979749858379364,-0.19159787893295288,0.0003903380420524627,0.10316798090934753,-0.12154331803321838,-0.07661963999271393,-0.0982639342546463,0.1871364563703537
6,0.25358742475509644,0.14046460390090942,-0.03289785236120224,-0.01504368707537651,0.17316295206546783,0.08332940936088562,0.0764819085597992,0.028863990679383278,0.022897426038980484,0.2488214522600174,-0.04733804613351822,0.13877174258232117,0.37833693623542786,-0.3851320445537567,-0.07166915386915207,-0.1509745717048645,-0.17813101410865784,-0.07117714732885361,-0.09044720232486725,-0.08525395393371582,-0.045964136719703674,0.11763758212327957,0.004022238776087761,-0.042989328503608704,-0.20541983842849731,0.04316874220967293,-0.2885229289531708,0.22567960619926453,0.09125709533691406,-0.43293297290802,0.012219781056046486,-0.06890366226434708,-0.27995428442955017,0.1851765215396881,0.058644987642765045,-0.11248553544282913,0.1844412237405777,-0.00025940733030438423,-0.044014327228069305,-0.035088904201984406
7,-0.051646698266267776,0.014844859018921852,-0.1308465600013733,0.0647692009806633,0.05362861976027489,0.07069654017686844,0.040568698197603226,0.1373971849679947,-0.015752052888274193,0.06048966571688652,0.14874860644340515,0.011856130324304104,0.09621600061655045,-0.059021055698394775,0.1616876870393753,-0.05966997519135475,-0.00315896631218493,-0.2692429721355438,-0.011105033569037914,-0.0666048601269722,0.15880674123764038,0.03099486045539379,0.27973344922065735,-0.02850397489964962,0.17859941720962524,0.08895523101091385,-0.07891218364238739,-0.2640107274055481,0.10829348862171173,-0.09960344433784485,0.014800678007304668,0.01384333148598671,-0.09800394624471664,-0.15774516761302948,-0.1515333652496338,-0.2347075343132019,0.2082630842924118,-0.1349046379327774,0.11024440824985504,0.25025826692581177
8,-0.13612399995326996,-0.20478320121765137,-0.22304648160934448,-0.23647652566432953,-0.1975654810667038,0.04487231373786926,0.00997103750705719,0.4940239191055298,0.20073041319847107,-0.12849083542823792,0.4748632609844208,0.5519063472747803,0.26003706455230713,-0.5797088742256165,0.24229219555854797,0.16038833558559418,1.0487449344509514e-06,0.23855914175510406,-0.38049766421318054,0.22817566990852356,-0.5245837569236755,0.2469942271709442,0.34212368726730347,-0.18124158680438995,-0.1135900542140007,0.01733413338661194,0.0701303780078888,-0.30537816882133484,0.19955800473690033,0.355867475271225,-0.19856873154640198,0.3789312541484833,-0.3455240726470947,-0.32321497797966003,-0.05780355632305145,-0.07999679446220398,-0.33063170313835144,0.1449815332889557,0.20461365580558777,-0.1471487283706665
9,-0.02170766331255436,0.1079137772321701,-0.05020439624786377,-0.1645408272743225,-0.19640006124973297,-0.16353952884674072,0.2828131318092346,0.019415006041526794,0.27803340554237366,0.06236903741955757,0.14940856397151947,0.07809876650571823,0.06921444088220596,0.06732887774705887,0.05799916759133339,0.048724547028541565,0.13673193752765656,0.04345428943634033,0.0053479974158108234,-0.1520380824804306,-0.09957116842269897,0.15633432567119598,0.10044980049133301,0.009347214363515377,-0.0236448235809803,-0.05965781211853027,0.05985809490084648,-0.0009844478918239474,0.01781393587589264,-0.2819364070892334,0.01862603984773159,-0.05014391243457794,0.02794305421411991,-0.22519385814666748,0.17713142931461334,-0.12611617147922516,0.19258485734462738,0.00900893285870552,-0.1731327325105667,0.18219970166683197
10,-0.08630330115556717,0.0486239530146122,-0.10248126834630966,0.031602129340171814,0.10371695458889008,-0.015316657721996307,0.07821572571992874,0.1064562126994133,-0.1455109715461731,0.024083055555820465,0.1158352643251419,-0.10392513126134872,0.016691438853740692,0.042209479957818985,0.15340524911880493,-0.09309063851833344,-0.00021453876979649067,-0.21677832305431366,0.01067203190177679,-0.1219404861330986,0.24156151711940765,-0.07772224396467209,0.25048017501831055,0.05574643984436989,0.20063719153404236,0.11244354397058487,-0.04720179736614227,-0.20981943607330322,0.08236442506313324,-0.0778600424528122,0.043024513870477676,-0.02357911504805088,-0.008775269612669945,-0.13026359677314758,-0.0932556539773941,-0.192643940448761,0.30238330364227295,-0.1997557282447815,0.05787563696503639,0.2107708752155304
11,0.033831968903541565,0.04191121831536293,-0.18341104686260223,0.08925233036279678,0.09958750754594803,0.08414111286401749,0.05130282789468765,0.11777849495410919,-0.019776491448283195,0.1096196100115776,0.13201530277729034,0.04885964095592499,0.17726103961467743,-0.1600079983472824,0.10504943132400513,-0.07677754759788513,-0.03919128328561783,-0.2852773368358612,-0.01305925752967596,-0.0830506756901741,0.16141143441200256,0.053409039974212646,0.27006927132606506,-0.04412614181637764,0.08521861582994461,0.08348815888166428,-0.1249702125787735,-0.1835261583328247,0.12709301710128784,-0.19932901859283447,0.009550821967422962,0.0010234301444143057,-0.18407605588436127,-0.06170687824487686,-0.11942310631275177,-0.24533209204673767,0.25767648220062256,-0.14946946501731873,0.09970849752426147,0.23822021484375
12,0.3831130862236023,-0.2457517385482788,-0.2294507771730423,0.2059362530708313,-0.08761978894472122,0.4155149757862091,-0.018382837995886803,-0.14617802202701569,0.4113121032714844,0.09764757752418518,0.03834547847509384,0.5292387008666992,0.28264036774635315,-0.22105082869529724,-0.1596115678548813,0.34710365533828735,-0.05569258704781532,-0.364641010761261,-0.24220514297485352,0.24049456417560577,-0.6055582761764526,0.1911926567554474,-0.14683571457862854,-0.20597366988658905,0.0033552406821399927,-0.2542967200279236,-0.031535737216472626,-0.3690602779388428,0.454717755317688,-0.17823638021945953,-0.4320512115955353,-0.08613792061805725,0.07874561101198196,-0.10586654394865036,-0.42880699038505554,0.05142245069146156,-0.2785045802593231,0.4603143036365509,0.030402205884456635,0.38731229305267334
13,-0.34877368807792664,0.19274207949638367,0.009236740879714489,0.33855119347572327,-0.4336074888706207,0.02104036882519722,-0.40221402049064636,0.23297879099845886,0.4943884313106537,0.1720477193593979,0.13616755604743958,0.32087215781211853,0.1771024912595749,-0.030801977962255478,0.12961995601654053,0.3131992220878601,-0.2680259048938751,-0.26015302538871765,0.08900607377290726,-0.06932981312274933,-0.1988523304462433,0.5007725358009338,-0.012099774554371834,-0.4011516869068146,-0.13354958593845367,0.21827848255634308,-0.13944301009178162,-0.17836804687976837,-0.02624872885644436,0.04598294943571091,0.15115724503993988,0.24557152390480042,-0.022085221484303474,-0.05239832401275635,-0.25488945841789246,-0.09172777831554413,-0.4234907329082489,0.37649431824684143,0.20197270810604095,0.1923651248216629
14,-0.03805571794509888,0.03628638759255409,-0.15720577538013458,0.06809066981077194,0.0834679827094078,0.06725167483091354,0.04235507547855377,0.14728249609470367,-0.018767399713397026,0.07561071962118149,0.1232338547706604,0.018761299550533295,0.11968482285737991,-0.07012130320072174,0.15099136531352997,-0.07452854514122009,-0.035730816423892975,-0.28863731026649475,-0.013748785480856895,-0.0832081213593483,0.16616760194301605,0.04736095666885376,0.28951382637023926,-0.03935374692082405,0.16897782683372498,0.0868796780705452,-0.08340044319629669,-0.22637782990932465,0.09923219680786133,-0.10778926312923431,0.0047461725771427155,0.016461603343486786,-0.12939509749412537,-0.11337798833847046,-0.12364861369132996,-0.212567999958992,0.2194652408361435,-0.15008479356765747,0.1060556024312973,0.2483198195695877
15,-0.2791271507740021,0.12561959028244019,0.039660319685935974,0.14395663142204285,0.1419386863708496,0.054448164999485016,0.3168511688709259,0.011546499095857143,-0.16843929886817932,-0.2730976641178131,0.22199824452400208,0.32792672514915466,0.05252174288034439,-0.3101425766944885,-0.4535242021083832,0.21951963007450104,0.11325810849666595,-0.2253841608762741,-0.03776386380195618,0.12229778617620468,0.28742268681526184,0.3893519341945648,-0.22154761850833893,0.20221354067325592,-0.25511816143989563,-0.09638750553131104,0.32919833064079285,0.26000988483428955,0.13010786473751068,0.11878779530525208,-0.1977585107088089,-0.14929045736789703,-0.0036575666163116693,0.15684114396572113,-0.23574960231781006,-0.06943622976541519,-0.016663648188114166,-0.14836686849594116,-0.27047601342201233,0.12719494104385376
16,-0.15245838463306427,0.06205832213163376,-0.1664675623178482,0.1504686176776886,0.13738250732421875,0.17616483569145203,0.2791491746902466,-0.03453782945871353,0.09598695486783981,-0.13194237649440765,0.33080706000328064,0.07750241458415985,0.17881207168102264,0.08387988805770874,0.31854042410850525,0.07720737159252167,0.28321778774261475,-0.2917262017726898,0.11614780128002167,0.276848167181015,-0.10434512794017792,-0.09092485904693604,-0.44436246156692505,0.2119036316871643,0.0692511722445488,0.033977389335632324,-0.10417231917381287,-0.10876843333244324,-0.2995723783969879,-0.20754939317703247,0.12989166378974915,0.2688397467136383,-0.08842228353023529,-0.051296480000019073,0.5310410857200623,-0.13861636817455292,0.09086417406797409,0.25800570845603943,-0.14860771596431732,-0.15389306843280792
17,0.49432072043418884,0.2596309781074524,0.018730800598859787,-0.03220907971262932,-0.20858292281627655,0.06156997010111809,0.15359686315059662,0.11317770183086395,0.16286492347717285,0.06875617802143097,-0.03366557136178017,0.2850618064403534,-0.02126593515276909,0.2773872911930084,0.1429862678050995,0.10165710747241974,0.07623057067394257,-0.03545344993472099,-0.1665574163198471,-0.09195229411125183,-0.08821487426757812,0.13612814247608185,0.14927859604358673,-0.13940489292144775,-0.028419405221939087,0.04276524484157562,0.05829968675971031,0.14558236300945282,-0.008757336996495724,0.13583600521087646,0.12756219506263733,0.1477297991514206,0.2522318363189697,0.13622532784938812,0.25889647006988525,0.059633221477270126,0.489411860704422,-0.0551939383149147,-0.10779470205307007,-0.09310635924339294
18,0.04697433114051819,0.0326986163854599,-0.03191361576318741,0.219502255320549,0.15532457828521729,-0.05374698340892792,0.12966695427894592,-0.16581179201602936,0.18085578083992004,0.08638659119606018,-0.11649170517921448,-0.04436255991458893,0.27947181463241577,0.14110034704208374,0.21556660532951355,0.06259609013795853,0.09545627981424332,0.027190526947379112,0.13058413565158844,0.05689140781760216,-0.04693656042218208,-0.015398647636175156,-0.1454140543937683,0.2857009470462799,-0.07358697056770325,0.10333773493766785,-0.0343671590089798,-0.14396736025810242,0.034864917397499084,0.18175075948238373,-0.029186125844717026,0.0203865859657526,-0.25143301486968994,-0.09473760426044464,0.12828394770622253,-0.05162622779607773,0.058729976415634155,0.1125466525554657,0.009120224043726921,-0.07904687523841858
19,0.3753373324871063,-0.0696110799908638,0.07218758761882782,-0.008954523131251335,-0.250032514333725,0.17870861291885376,0.08447974175214767,0.004734519869089127,0.11636273562908173,-0.04832000657916069,0.23045724630355835,0.15493068099021912,0.13171903789043427,0.15989448130130768,0.08669136464595795,0.08196613192558289,-0.11928512156009674,0.1500747799873352,0.08207061141729355,0.1089983657002449,0.10286817699670792,-0.12627901136875153,0.03872092813253403,0.12134934961795807,0.0699220523238182,-0.22653010487556458,-0.011132159270346165,0.12033349275588989,-0.2191828340291977,-0.13340292870998383,-0.01031574234366417,0.4348732531070709,0.1579856276512146,-0.02982684038579464,-0.11912401765584946,-0.01981225423514843,0.232500359416008,0.055146269500255585,-0.02767099440097809,0.06134204566478729
20,-0.02106834575533867,0.0839904397726059,-0.26061132550239563,0.020896196365356445,-0.07289580255746841,0.09283415973186493,0.09589888155460358,-0.21604490280151367,0.004859804175794125,0.10651673376560211,0.4143281579017639,-0.06801354140043259,0.07032094895839691,-0.12428829818964005,0.02398211508989334,0.08331231772899628,0.12284903228282928,-0.26086175441741943,-0.17674483358860016,-0.13345617055892944,-0.1272950917482376,0.04118219390511513,-0.30876386165618896,0.1520944982767105,0.12328702211380005,0.0070993429981172085,0.11527513712644577,0.07435885071754456,-0.4545143246650696,0.03746385499835014,0.1773231327533722,-0.07601826637983322,-0.06309789419174194,0.06603213399648666,0.1276780664920807,0.03109067864716053,0.0030360734090209007,-0.008606494404375553,0.0379302017390728,-0.056980639696121216
21,-0.2595260441303253,0.2663327753543854,-0.2796899080276489,0.39308327436447144,-0.08775147050619125,-0.22755223512649536,-0.4168122410774231,-0.23529879748821259,-0.613582193851471,-0.2525879740715027,0.5355184078216553,-0.04706566408276558,0.052590228617191315,-0.2731713056564331,0.08442853391170502,0.23765847086906433,-0.40346652269363403,0.24181604385375977,0.02271067537367344,-0.3173050582408905,-0.39608463644981384,-0.044174399226903915,0.26024147868156433,0.2411564439535141,-0.406223326921463,-0.049395035952329636,0.09432727098464966,-0.3441760838031769,0.4354701638221741,-0.03374645113945007,-0.08129464834928513,0.12550877034664154,0.3357848525047302,-0.10250773280858994,0.18342305719852448,0.2815724015235901,0.38231950998306274,0.1758844554424286,-0.22708456218242645,-0.12523984909057617
22,-0.06194526329636574,0.2646172344684601,-0.10895540565252304,-0.10003150254487991,0.04917943850159645,0.1474769115447998,0.21366256475448608,0.25963929295539856,-0.1948549896478653,-0.39407333731651306,0.32854050397872925,0.1583336740732193,0.16382358968257904,-0.21329370141029358,0.219609797000885,-0.14109410345554352,-0.16792114078998566,0.05276425555348396,-0.07289015501737595,-0.12362929433584213,-0.32961392402648926,-0.1751844733953476,-0.3894345760345459,-0.04283352941274643,0.013407282531261444,-0.1210421770811081,0.10730122029781342,0.08462437987327576,-0.2630331814289093,-0.09568585455417633,-0.4041403532028198,-0.05995738506317139,0.11460554599761963,0.07630255073308945,0.2743026316165924,-0.31029212474823,0.10228846222162247,-0.1263374537229538,0.23787325620651245,-0.1565825492143631
23,-0.049725744873285294,0.10816916078329086,0.13397406041622162,-0.13786408305168152,-0.086697056889534,-0.07944370061159134,0.27341002225875854,-0.22094298899173737,-0.005809440277516842,-0.13938802480697632,0.09330417960882187,-0.012438765726983547,0.22929343581199646,0.1097906157374382,-0.16699330508708954,0.1625870019197464,-0.04514474421739578,-0.05291074886918068,0.08982129395008087,-0.04838705062866211,-0.22133609652519226,0.3479345738887787,0.07521051913499832,0.10601648688316345,0.051276106387376785,0.07198888063430786,0.014830203726887703,-0.11370257288217545,-0.29746323823928833,-0.08647395670413971,-0.061930324882268906,-0.014695472083985806,-0.08434449136257172,-0.0018066744087263942,0.15778790414333344,-0.1584240049123764,0.04577174037694931,-0.07618994265794754,-0.16988223791122437,0.05155973881483078
24,-0.056177929043769836,0.03598815202713013,-0.13327041268348694,0.20971958339214325,-0.09650120884180069,0.021997883915901184,0.20120695233345032,-0.10087943077087402,0.09097138792276382,-0.10118525475263596,0.21034330129623413,0.08903960883617401,-0.16236315667629242,-0.17434664070606232,-0.0608617439866066,0.032823596149683,-0.008162299171090126,-0.15146848559379578,-0.02854691445827484,-0.17608417570590973,0.06655751168727875,-0.10109628736972809,-0.050860658288002014,-0.042207714170217514,-0.06765924394130707,-0.0053758928552269936,0.08703529834747314,0.14641383290290833,-0.24486131966114044,0.10285092145204544,-0.1702074408531189,-0.04742204025387764,-0.06477352976799011,0.021371908485889435,0.171904519200325,-0.12059321999549866,-0.05336051806807518,-0.05248630791902542,-0.07726439833641052,0.02019203081727028
25,0.007154733873903751,0.05906379595398903,-0.04299554228782654,-0.047622986137866974,-0.23540745675563812,-0.057334937155246735,0.23488226532936096,-0.11177842319011688,0.31251004338264465,-0.08915134519338608,0.13939900696277618,0.15240557491779327,-0.048566367477178574,0.05970768630504608,-0.01534029096364975,0.12872225046157837,-0.08563593029975891,-0.1087164431810379,-0.025656063109636307,-0.2046506404876709,-0.09350995719432831,0.016885779798030853,-0.04532023146748543,0.06232665479183197,0.052227020263671875,-0.16410310566425323,-0.1391129195690155,0.09500305354595184,-0.2025294154882431,-0.04075153172016144,0.029584627598524094,0.045008957386016846,-0.03777572885155678,-0.013692144304513931,0.23004662990570068,-0.07308372855186462,0.14960813522338867,-0.16351068019866943,-0.20124998688697815,-0.03512001037597656
26,-0.10193231701850891,0.0046811350621283054,0.015211300924420357,0.11186405271291733,-0.08978930115699768,0.08650427311658859,0.3164159655570984,-0.06153370812535286,0.018183477222919464,-0.1382366269826889,0.13604280352592468,0.059569377452135086,-0.09375720471143723,-0.1249641478061676,-0.16215503215789795,0.10408545285463333,-0.14068660140037537,-0.09843350201845169,-0.010365460999310017,-0.118648000061512,0.003540029749274254,0.04419455677270889,0.006877347361296415,-0.0215131938457489,-0.014434946700930595,-0.0389280840754509,0.06780701130628586,0.05629972368478775,-0.39140409231185913,0.05609031766653061,-0.14865197241306305,0.022691644728183746,0.007081867195665836,0.020657939836382866,0.1264701932668686,-0.2102915346622467,0.08733604103326797,0.04376944527029991,-0.15300311148166656,0.09719660133123398
27,0.09483759105205536,0.3300497531890869,0.31402748823165894,0.12698951363563538,0.17501525580883026,-0.4004122018814087,0.14381639659404755,-0.0026395642198622227,0.015588484704494476,-0.10424789786338806,0.3821907639503479,0.14437386393547058,0.11608263105154037,-0.14848017692565918,-0.25873780250549316,0.28133711218833923,0.14613673090934753,-0.4316233992576599,-0.20083138346672058,0.13249880075454712,-0.3362371623516083,-0.1548934429883957,0.02868962287902832,0.42491793632507324,0.34675973653793335,-0.1899116486310959,0.34487709403038025,-0.11891716718673706,-0.20596860349178314,-0.31517159938812256,0.23049674928188324,0.33845898509025574,-0.0892779603600502,0.30903545022010803,0.1282864511013031,0.3671568036079407,0.10208011418581009,-0.03200780227780342,0.10786449909210205,0.11460120975971222
28,-0.04596387967467308,0.14039920270442963,-0.05329127237200737,0.1090887188911438,-0.09253713488578796,-0.04320269450545311,0.2077895700931549,-0.23476852476596832,0.03331327810883522,-0.14144045114517212,0.15474271774291992,-0.08365187048912048,0.08108344674110413,-0.016900140792131424,0.07026021927595139,0.11100254207849503,0.11301829665899277,-0.17360444366931915,0.12152176350355148,-0.20745687186717987,-0.19606658816337585,0.11590620130300522,-0.15230557322502136,-0.007635743822902441,0.06257958710193634,0.17334748804569244,0.16419348120689392,0.17953121662139893,-0.15786536037921906,-0.0783708468079567,-0.14592504501342773,-0.06911617517471313,-0.20300650596618652,-0.08022578805685043,0.0423954501748085,-0.07187290489673615,-0.0804639607667923,-0.16466400027275085,0.01906801015138626,-0.0676293820142746
29,0.11919627338647842,0.32809826731681824,0.15464916825294495,-0.035966090857982635,-0.04015160724520683,0.010730177164077759,0.10600102692842484,-0.03574188053607941,0.08556754887104034,-0.0034135435707867146,0.1342933028936386,0.27197694778442383,-0.12050715833902359,0.2991878390312195,0.052052199840545654,0.03217523545026779,0.102237768471241,-0.05245881527662277,0.023188304156064987,-0.0686684250831604,-0.3477490544319153,0.2025843858718872,0.09302646666765213,0.05057469755411148,0.09187491983175278,0.07076118886470795,0.0009859228739514947,-0.04550172761082649,-0.19921503961086273,-0.12328853458166122,-0.018710201606154442,6.059551196813118e-06,-0.16623973846435547,0.043725863099098206,-0.05550361052155495,0.11812467128038406,0.290953665971756,-0.1308048814535141,-0.08032993227243423,-0.24395568668842316
30,-0.09746658802032471,0.15278275310993195,0.025968803092837334,0.027419529855251312,-0.08465994149446487,0.20212945342063904,0.27669766545295715,0.0054339258931577206,0.059638213366270065,-0.2158777117729187,0.1665465086698532,0.14323095977306366,-0.024106593802571297,-0.1458127796649933,-0.21402215957641602,-0.024472655728459358,-0.20610441267490387,-0.027512801811099052,0.017182471230626106,-0.0026809247210621834,-0.020913351327180862,-0.02793216146528721,-0.10979139804840088,-0.08809658139944077,0.066545769572258,-0.17043764889240265,-0.03428179398179054,-0.04641227796673775,-0.35052865743637085,-0.047803811728954315,-0.25099483132362366,-0.002578218001872301,0.15740813314914703,0.1325809210538864,0.2977616488933563,-0.36221569776535034,0.11512082815170288,0.04912785068154335,-0.10718563199043274,0.04359927028417587
31,-0.13533876836299896,0.12098931521177292,0.05783872306346893,0.002892406191676855,-0.03161488100886345,-0.032682787626981735,0.31904685497283936,-0.06042664125561714,0.1867474764585495,-0.006781409494578838,0.10214052349328995,0.033760301768779755,-0.18896494805812836,-0.07708223909139633,-0.016452886164188385,0.03596840053796768,-0.07346898317337036,0.0007283169543370605,0.09736094623804092,-0.11398206651210785,-0.09771059453487396,0.12830369174480438,0.04197549819946289,0.020397212356328964,0.0328267440199852,-0.15971864759922028,0.02838815748691559,0.1321682333946228,-0.21069003641605377,-0.20144575834274292,-0.2104852795600891,0.12478256970643997,-0.008852406404912472,-0.12902475893497467,0.08441814035177231,-0.0192360021173954,0.10069289058446884,-0.04280512034893036,-0.08430171012878418,0.12802185118198395
32,0.009371554479002953,0.07731770724058151,-0.36939606070518494,0.22128361463546753,-0.12230221927165985,-0.3864325284957886,0.17847132682800293,0.3534015715122223,-0.02347099967300892,-0.028409363701939583,0.14254030585289001,-0.25411632657051086,-0.13062171638011932,0.502066969871521,-0.1600530445575714,-0.15037229657173157,0.15374962985515594,-0.03969687968492508,-0.11423103511333466,-0.04866870492696762,-0.2550305128097534,0.30799591541290283,-0.12077199667692184,0.45490989089012146,-0.011756492778658867,-0.15143515169620514,-0.07633788138628006,0.18407104909420013,0.15526147186756134,0.0957794114947319,-0.6450304388999939,0.308647096157074,-0.2659566402435303,0.2343253493309021,0.44762903451919556,-0.3031476140022278,0.08097988367080688,0.28137099742889404,0.035321298986673355,0.2029648870229721
33,-0.043982893228530884,0.15227551758289337,0.2067476212978363,-0.04645378515124321,-0.23582902550697327,0.00688533391803503,0.28078171610832214,-0.18050724267959595,0.13544122874736786,-0.16442033648490906,-0.0010227612219750881,-0.05763360857963562,0.030002513900399208,0.08931959420442581,-0.20096568763256073,0.1038423702120781,-0.07330024987459183,-0.03290906175971031,-0.03650082275271416,0.022939767688512802,-0.20741285383701324,0.21770833432674408,0.144706130027771,0.14125767350196838,0.11353489011526108,-0.020291216671466827,-0.028961187228560448,-0.13194580376148224,-0.03867122903466225,-0.07964695245027542,0.07258806377649307,0.12068447470664978,-0.18023112416267395,0.12581110000610352,0.07729999721050262,-0.14055633544921875,0.08216851204633713,-0.17197240889072418,-0.16456735134124756,-0.07593464851379395
34,0.16498616337776184,-0.23397180438041687,-0.08573713898658752,0.20084530115127563,-0.5263079404830933,-0.5212266445159912,-0.4580501914024353,-0.21282871067523956,-0.7321409583091736,-0.11041446775197983,-0.029353421181440353,0.2875516414642334,-0.30429965257644653,-0.3157246708869934,0.40209221839904785,0.27572640776634216,-0.18331898748874664,-0.17873500287532806,0.1793479472398758,0.5070459246635437,-0.11875472217798233,0.3365643620491028,-0.08465109765529633,0.35564929246902466,-0.22776074707508087,-0.6772775053977966,0.10656408965587616,0.1266583651304245,0.05133721977472305,-0.29528263211250305,-0.05419143661856651,-0.17899002134799957,-0.41358932852745056,0.05377233773469925,0.06522591412067413,-0.3292017877101898,0.48142656683921814,0.13138148188591003,0.10683952271938324,-0.10161657631397247
35,-0.1750854104757309,0.7404606938362122,0.07004375755786896,0.002460205927491188,0.0034804062452167273,-0.06872697174549103,-0.13538888096809387,0.15188932418823242,0.16867776215076447,-0.22524866461753845,0.10939765721559525,0.32550719380378723,0.29765012860298157,0.1616179198026657,-0.03981229290366173,0.20370377600193024,-0.007535743061453104,-0.20021237432956696,0.07794355601072311,0.1302039921283722,0.016982348635792732,-0.24908028542995453,-0.5121181607246399,0.30225804448127747,-0.12720650434494019,-0.2832123041152954,0.021236851811408997,-0.19607922434806824,0.1508043259382248,0.14059162139892578,-0.2359420508146286,0.2826363742351532,-0.045087192207574844,-0.056275624781847,0.32650279998779297,-0.15580283105373383,0.24056865274906158,-0.19277748465538025,-0.1810392439365387,-0.06349830329418182
36,-0.1223156526684761,0.10208733379840851,0.10572348535060883,-0.09380992501974106,-0.12020888179540634,-0.07241462916135788,0.32605427503585815,-0.1945619136095047,0.07243537902832031,-0.0751967653632164,0.08014935255050659,-0.005943888798356056,0.08653408288955688,0.018527420237660408,-0.2514320909976959,0.1529114693403244,-0.08266879618167877,-0.013185069896280766,0.03334255516529083,-0.011359822005033493,-0.10351914167404175,0.2513619363307953,0.16697974503040314,0.05918711796402931,0.048125386238098145,0.0013404028723016381,-0.0060851299203932285,-0.08022139966487885,-0.2214212864637375,-0.03821813315153122,-0.08940888196229935,0.029411286115646362,-0.06364726275205612,0.049724504351615906,0.16001923382282257,-0.17547422647476196,0.07262561470270157,-0.02857397310435772,-0.20218245685100555,0.04639282077550888
37,-0.04822566360235214,0.029065368697047234,-0.023394005373120308,-0.0627586618065834,-0.1188993752002716,0.10156091302633286,0.16231445968151093,-0.15823601186275482,-0.10184422135353088,0.0011629420332610607,0.24377435445785522,-0.06838148087263107,0.30162954330444336,0.06454972177743912,-0.10171867161989212,0.16036547720432281,0.053130246698856354,-0.15269142389297485,-0.06151306629180908,-0.16595445573329926,-0.22996988892555237,0.2284296452999115,-0.2132166177034378,0.10052205622196198,0.16287903487682343,0.0705094188451767,0.036744970828294754,-0.010136677883565426,-0.48779478669166565,-0.02015630342066288,0.0647008940577507,0.06377529352903366,-0.012404135428369045,-0.0019700813572853804,0.13834244012832642,-0.10368342697620392,0.11376720666885376,-0.032028086483478546,-0.1108197569847107,-0.037157945334911346
38,-0.11491527408361435,-0.330758273601532,0.18592754006385803,-0.06485800445079803,0.019259847700595856,0.05466778948903084,-0.00600125128403306,-0.013673974201083183,-0.5212642550468445,-0.3002953827381134,0.09650899469852448,0.11004871875047684,-0.18266160786151886,0.24903292953968048,0.21045325696468353,0.24357879161834717,-0.11782206594944,-0.3421986997127533,0.21001186966896057,0.12289146333932877,-0.07320310920476913,-0.11255155503749847,-0.27291110157966614,-0.4984039068222046,0.31846702098846436,0.23150570690631866,-0.04407847672700882,0.2665173411369324,0.5006791949272156,-0.2339783012866974,0.25219982862472534,0.3909277319908142,-0.4856565594673157,0.03079143539071083,0.428462415933609,0.05832654610276222,-0.03259751573204994,0.21387861669063568,-0.510574996471405,0.22448065876960754
39,-0.21538046002388,0.09388960152864456,-0.016570881009101868,-0.152780681848526,0.02048328146338463,-0.016330059617757797,0.1665576994419098,-0.054075729101896286,0.05244353041052818,0.2591363191604614,0.20190566778182983,-0.006802387535572052,-0.05287044122815132,-0.044504065066576004,-0.028369631618261337,0.05957379937171936,0.029848717153072357,0.04499100148677826,-0.03731442987918854,0.0011637092102319002,-0.08797302842140198,0.09906841814517975,-0.006591809447854757,0.04340359941124916,0.10656281560659409,-0.17916059494018555,-0.03874606639146805,0.20759153366088867,-0.22940991818904877,-0.21857360005378723,-0.033285290002822876,0.12919539213180542,0.07777594774961472,-0.1690787672996521,0.057830922305583954,0.021042050793766975,0.14896821975708008,0.14688166975975037,-0.08504147827625275,0.18131202459335327
40,-0.07593706995248795,0.1286536157131195,0.150069922208786,-0.050934065133333206,-0.12114087492227554,0.2854645550251007,0.20148876309394836,-0.03382081165909767,0.08186677098274231,0.0909549742937088,0.20632438361644745,-0.04073207452893257,0.051072701811790466,0.18673337996006012,-0.14326496422290802,0.3533010184764862,-0.13545416295528412,-0.177512988448143,0.22217322885990143,-0.16159874200820923,-0.21830007433891296,0.05131845921278,0.17064829170703888,0.2565484046936035,0.06310869753360748,0.012635844759643078,0.2041918933391571,0.18418827652931213,-0.09638597816228867,-0.2822668254375458,-0.1527959704399109,-0.14413009583950043,-0.25640997290611267,-0.23424099385738373,0.36003589630126953,-0.004705278668552637,-0.0256614089012146,-0.12187690287828445,0.18298161029815674,-0.16618624329566956
41,-0.019674107432365417,0.4896490275859833,-0.075172558426857,-0.12193505465984344,-0.21293756365776062,0.1300392597913742,0.2518855929374695,-0.20798324048519135,0.07095020264387131,0.018746625632047653,0.11404339969158173,-0.2099640965461731,-0.03545038402080536,-0.19961731135845184,0.2651031017303467,0.1623953878879547,0.16256411373615265,-0.2665840983390808,-0.1944393515586853,0.018319807946681976,-0.17409591376781464,0.1074913814663887,-0.40275001525878906,-0.2677305340766907,0.3422541618347168,-0.11456061154603958,0.4242941737174988,0.0429973378777504,0.011082438752055168,0.07807131111621857,0.25924888253211975,-0.21562354266643524,0.0658610463142395,0.10302160680294037,0.5585758090019226,-0.2424089014530182,0.15384039282798767,0.003425066126510501,0.15090791881084442,0.04158386215567589
42,-0.11241369694471359,0.09705545008182526,-0.07714658975601196,0.14588399231433868,-0.046599309891462326,-0.030748413875699043,0.2027963101863861,-0.1450803428888321,0.05862085521221161,-0.045950476080179214,0.16870975494384766,0.03233844041824341,-0.1524735391139984,-0.16515834629535675,-0.0689263790845871,0.02488573081791401,0.03887872397899628,-0.08853573352098465,0.0335022397339344,-0.10469791293144226,0.010436072014272213,-0.01027624774724245,0.04102926701307297,-0.023330407217144966,-0.05977309122681618,0.026180971413850784,0.12115299701690674,0.13456499576568604,-0.1447778046131134,0.007730701006948948,-0.19615882635116577,-0.03361174464225769,-0.09819425642490387,-0.02340046875178814,0.11335234344005585,-0.07413097470998764,-0.08257213234901428,-0.04535479098558426,-0.036942627280950546,0.047267887741327286
43,-0.027020933106541634,0.003132619196549058,0.034067098051309586,-0.21845431625843048,-0.10813499242067337,-0.12115415930747986,0.20707811415195465,-0.09783616662025452,0.10588732361793518,-0.04080768674612045,0.060894936323165894,0.050409503281116486,0.191207617521286,0.1444847285747528,-0.19511960446834564,0.19292983412742615,-0.11682555079460144,0.03068903088569641,-0.006738847587257624,-0.04897770285606384,-0.09309689700603485,0.22256216406822205,0.07811161875724792,0.05289348214864731,0.0824999138712883,-0.07564613968133926,-0.14436930418014526,-0.06399746239185333,-0.19808506965637207,-0.018247777596116066,0.01214002538472414,0.03170305863022804,0.0383773148059845,0.0022297550458461046,0.1960553377866745,-0.17093567550182343,0.17511847615242004,-0.0030114133842289448,-0.23396819829940796,0.012790177948772907
44,0.07800088077783585,0.009847529232501984,0.1386106312274933,0.026083528995513916,-0.1539931744337082,0.18401098251342773,0.07639813423156738,0.09187965095043182,0.09471773356199265,-0.06911712884902954,0.0184053722769022,0.12972113490104675,-0.06289493292570114,0.030454246327280998,0.030070845037698746,0.0053099640645086765,-0.18806736171245575,-0.017755014821887016,-0.08534523099660873,-0.11634760349988937,-0.04635884612798691,-0.07934026420116425,-0.06874782592058182,0.09382664412260056,0.022149009630084038,-0.1423012614250183,-0.11690561473369598,-0.051445454359054565,-0.1992092877626419,-0.0583801344037056,0.10319384187459946,0.131235271692276,0.053858671337366104,-0.031450387090444565,0.06926389038562775,-0.02135748788714409,0.16678638756275177,-0.02135246992111206,-0.11870472133159637,-0.013973462395370007
45,-0.14568239450454712,0.24495302140712738,-0.10272318869829178,0.35058778524398804,-0.44716838002204895,-0.4933049976825714,0.23506440222263336,0.26876240968704224,-0.6555687189102173,-0.032735999673604965,0.35009506344795227,0.07107159495353699,0.14203095436096191,0.3312205374240875,0.27444425225257874,0.3082394301891327,-0.44635799527168274,0.29250356554985046,-0.6314356327056885,0.36567723751068115,0.05637417733669281,-0.11514453589916229,-0.20303355157375336,-0.20829854905605316,-0.34446296095848083,-0.24633286893367767,-0.1840871125459671,-0.3071879744529724,-0.021535029634833336,-0.22110259532928467,-0.28023388981819153,-0.39333009719848633,-0.43543100357055664,0.09588730335235596,0.17725883424282074,0.48187848925590515,0.03187622129917145,-0.15652517974376678,0.204901322722435,0.32119032740592957
46,-0.0443371944129467,0.19130679965019226,0.1372983455657959,0.13168810307979584,-0.053358420729637146,-0.007542898878455162,0.37793901562690735,-0.16726472973823547,0.032208945602178574,-0.13574334979057312,0.056189946830272675,-0.11746597290039062,-0.23474930226802826,-0.17986978590488434,0.021811190992593765,0.10267884284257889,0.023994313552975655,-0.31340962648391724,-0.018006889149546623,-0.08933380246162415,-0.10433797538280487,0.09538812935352325,0.04329221323132515,-0.1700403243303299,-0.0810551717877388,0.11641845107078552,-0.025264985859394073,0.23746880888938904,0.04276386648416519,0.11656331270933151,-0.21044118702411652,-0.027754398062825203,0.03978481888771057,-0.17728513479232788,0.14660978317260742,-0.09239665418863297,0.03718641400337219,-0.06839374452829361,0.15885990858078003,0.05282784625887871
47,0.09847638010978699,0.3379672169685364,0.21426653861999512,0.11600372940301895,-0.05612816661596298,0.1872546672821045,0.4346534013748169,-0.15395930409431458,0.0876128301024437,-0.0678727850317955,0.4851923882961273,0.14077848196029663,0.03588153049349785,-0.19503869116306305,0.23852483928203583,-0.07919754832983017,-0.15708942711353302,-0.0694887563586235,0.05575568228960037,0.2530227601528168,0.2598884105682373,0.2532670795917511,-0.13803958892822266,0.021830225363373756,0.3731744885444641,-0.32029789686203003,-0.08524258434772491,0.30987784266471863,-0.044833116233348846,0.1978040635585785,0.20549996197223663,0.07136287540197372,0.25693342089653015,0.25282683968544006,0.2087588608264923,0.0534641332924366,0.038448791950941086,0.06448132544755936,0.2607167363166809,0.005606372840702534
48,-0.055251192301511765,-0.08518355339765549,0.046442847698926926,-0.0037995807360857725,0.0017129097832366824,-0.19674043357372284,0.2641895115375519,-0.004600454121828079,0.2086990922689438,-0.05253418907523155,0.219055637717247,0.24345853924751282,0.15312623977661133,0.09752482175827026,0.09568194299936295,0.2485331892967224,-0.007674765307456255,0.048950109630823135,-0.004296961240470409,-0.35203060507774353,0.14833591878414154,0.3223840296268463,-0.2531754672527313,0.08945171535015106,0.37769803404808044,-0.269228458404541,-0.22745582461357117,0.22755686938762665,0.130039781332016,0.032750099897384644,-0.029853908345103264,-0.07972948253154755,0.14330317080020905,-0.026086999103426933,0.11806134134531021,-0.025326687842607498,0.13201987743377686,-0.04384027048945427,-0.29532554745674133,-0.12567003071308136
49,0.04952305555343628,-0.04879281669855118,0.3600824177265167,0.6641958355903625,0.25900688767433167,-0.2960280776023865,-0.1588752716779709,0.006985395215451717,-0.1577603965997696,-0.31144845485687256,0.4158054292201996,-0.23603911697864532,0.17984220385551453,0.4279179275035858,0.25952601432800293,0.15024639666080475,0.09655182808637619,-0.358386367559433,-0.6139023303985596,0.6466584205627441,0.16709156334400177,0.08872901648283005,0.3139641582965851,-0.5003466606140137,-0.5809417963027954,-0.6003973484039307,0.03397731855511665,0.14440909028053284,-0.09448884427547455,-0.36104312539100647,-0.02366379275918007,0.01642526499927044,0.08552581071853638,-0.37317541241645813,0.17733371257781982,-0.20386680960655212,-0.09033017605543137,-0.008790838532149792,-0.09128380566835403,-0.47461605072021484
50,-0.0452711395919323,0.012151760049164295,-0.032838232815265656,-0.037054531276226044,-0.19731304049491882,-0.055367276072502136,0.2886071801185608,-0.1579272747039795,0.14094312489032745,-0.12010668218135834,0.1410738229751587,0.06273543834686279,0.07971109449863434,0.027348894625902176,-0.23627695441246033,0.1728978157043457,-0.0801830068230629,-0.08668392896652222,-0.03411075845360756,-0.12827855348587036,-0.06284261494874954,0.14483299851417542,0.06426181644201279,0.05678093805909157,0.030029471963644028,-0.025801261886954308,-0.05959765240550041,-0.05679955333471298,-0.2693626880645752,0.07704136520624161,-0.04189131408929825,0.005331635940819979,-0.025271475315093994,0.09251915663480759,0.24269990622997284,-0.1964009404182434,0.10388550907373428,-0.08547967672348022,-0.22581885755062103,-0.04224100336432457
51,-0.0832422599196434,0.02666594088077545,-0.0005189894000068307,-0.21154211461544037,-0.07708366960287094,-0.14362458884716034,0.2201836258172989,-0.18582050502300262,0.12103750556707382,-0.06021369993686676,0.08663433790206909,-0.00837476085871458,0.162750244140625,0.13353610038757324,-0.21001270413398743,0.20292989909648895,0.006276487838476896,0.04793911054730415,0.01823323778808117,0.025459948927164078,-0.09085569530725479,0.27362266182899475,0.13634106516838074,0.042388249188661575,0.07443384826183319,-0.02798597887158394,-0.06804341822862625,-0.02981310896575451,-0.14601381123065948,-0.0897802859544754,-0.08424265682697296,0.018517740070819855,0.024054184556007385,-0.05149685963988304,0.13312070071697235,-0.1738514006137848,0.1158074140548706,0.013583125546574593,-0.183780238032341,0.03865184262394905
52,-0.0010267613688483834,0.11145670711994171,-0.07738672196865082,-0.16124670207500458,-0.1905587762594223,0.018213579431176186,0.2098725289106369,-0.17306360602378845,0.14855317771434784,0.13091464340686798,0.24871432781219482,-0.008867115713655949,-0.04838884621858597,0.009423923678696156,-0.10915710031986237,0.1686532348394394,0.10996954888105392,-0.24655649065971375,-0.3157983720302582,-0.0937652662396431,-0.18297187983989716,0.12213584780693054,-0.055035416036844254,0.08309945464134216,0.06946250796318054,-0.16049796342849731,-0.27099743485450745,0.13241034746170044,-0.1395130157470703,0.05156948044896126,0.1449025273323059,0.14211897552013397,0.17238599061965942,-0.06091371923685074,0.34874099493026733,0.026068761944770813,0.25850963592529297,-0.07396185398101807,0.01586577296257019,-0.05865515023469925
53,0.03247034549713135,0.06338473409414291,0.18002867698669434,0.17372089624404907,-0.037794340401887894,0.1747726947069168,0.3059474229812622,0.2876282036304474,-0.06799003481864929,0.06379193067550659,0.2162141650915146,0.270664244890213,0.2629775404930115,0.11926250904798508,0.06104966998100281,0.4890744984149933,0.07122445851564407,-0.21006138622760773,-0.04899882897734642,-0.4562112092971802,0.13323530554771423,0.19971022009849548,-0.11465727537870407,0.405396044254303,0.2500281035900116,-0.09471549093723297,0.416043758392334,0.1317705512046814,0.028827250003814697,-0.07370221614837646,-0.1441153883934021,-0.3325017988681793,0.04155191406607628,-0.07477781921625137,0.3095792233943939,-0.012634191662073135,-0.15850460529327393,-0.04145084321498871,0.03172087296843529,-0.3574216365814209
54,-0.13134826719760895,-0.14341744780540466,0.31317150592803955,0.3374989628791809,-0.04257737472653389,-0.18453016877174377,-0.26088282465934753,-0.5162973403930664,-0.42307573556900024,0.1518273651599884,0.29922327399253845,0.06214241683483124,0.2426038384437561,0.4983537495136261,0.14332890510559082,0.05220678821206093,-0.5071080923080444,0.16644825041294098,-0.7289801836013794,-0.00859343446791172,-0.014453369192779064,-0.1278851479291916,-0.13904640078544617,-0.45262497663497925,0.1492605358362198,-0.5441302061080933,0.4594661295413971,0.07546944171190262,0.2585841417312622,-0.024919046089053154,-0.4036833941936493,0.27073830366134644,-0.44926223158836365,-0.1736803501844406,0.0477803498506546,-0.3663640320301056,0.1420913189649582,0.0003740992397069931,0.1336025893688202,-0.18168573081493378
55,-0.26220089197158813,-0.019655385985970497,0.7170869708061218,0.18709677457809448,-0.3922939598560333,-0.5950486660003662,-0.6924184560775757,0.03994900733232498,-0.14348989725112915,-0.3620273172855377,0.012369012460112572,0.33748582005500793,0.13821923732757568,0.02911391668021679,0.1658111810684204,-0.005120653193444014,0.04842796176671982,-0.170800119638443,-0.6280772089958191,0.3212418556213379,0.21344920992851257,-0.1640809327363968,0.0025368828792124987,0.23312339186668396,0.19154343008995056,0.19791360199451447,-0.03577423095703125,0.22155478596687317,-0.14529363811016083,-0.19684790074825287,-0.3830750286579132,-0.26343151926994324,-0.20100213587284088,0.08165235817432404,0.4569597542285919,-0.03840595856308937,0.2881819009780884,0.25776204466819763,0.2518831789493561,0.2797410190105438
56,-0.021130984649062157,-0.1168070137500763,0.4986504912376404,0.10355795919895172,-0.20961040258407593,-0.11591191589832306,-0.6045498251914978,-0.10193470865488052,-0.3336312472820282,0.2715546190738678,0.4007871747016907,0.10824034363031387,0.10858000069856644,0.17640681564807892,0.4289892315864563,-0.31209906935691833,0.018173379823565483,-0.3320882320404053,-0.05726340040564537,0.11702389270067215,-0.19723185896873474,0.029313471168279648,0.1516224443912506,-0.06535650044679642,0.03155393898487091,-0.573996365070343,-0.018471205607056618,0.04839445650577545,0.032239049673080444,0.30186745524406433,-0.3870319128036499,-0.21758082509040833,-0.3607337176799774,0.17327135801315308,0.4892485439777374,-0.022937284782528877,-0.2865826487541199,-0.22792352735996246,-0.5593081116676331,0.472748726606369
57,0.41993868350982666,0.3121699392795563,0.08333764970302582,-0.3513202667236328,0.5107150077819824,-0.2843351662158966,-0.3075285851955414,-0.2511429190635681,-0.12930375337600708,-0.2823902368545532,0.7731750011444092,0.02353510633111,-0.306563138961792,0.15283717215061188,0.4676211476325989,0.35826244950294495,-0.6548320055007935,0.19959454238414764,-0.2632650136947632,-0.08157851547002792,0.08633432537317276,-0.004453652538359165,0.06137837842106819,0.20649218559265137,-0.3328096270561218,-0.13944251835346222,0.24370752274990082,-0.08543995767831802,0.09957031905651093,0.11961375921964645,0.11473781615495682,0.014079750515520573,-0.18279576301574707,0.2626952826976776,0.11191195249557495,-0.30268576741218567,-0.24552683532238007,0.14048922061920166,0.1751737743616104,0.33752235770225525
58,-0.08759155869483948,0.21397823095321655,0.11150725185871124,0.04342734068632126,0.07895266264677048,0.11102069169282913,0.2891281247138977,-0.020975200459361076,-0.023019101470708847,0.05242147669196129,0.2071332037448883,0.28206926584243774,-0.29748639464378357,0.08638377487659454,-0.17031113803386688,0.05110260099172592,0.003082358045503497,-0.004740839824080467,0.010565427131950855,0.0280888844281435,-0.14233055710792542,0.17106907069683075,0.19840507209300995,-0.12390080094337463,0.056370463222265244,0.10449390858411789,0.06299237906932831,0.08484817296266556,-0.38599011301994324,0.017153359949588776,-0.25888878107070923,-0.06621038913726807,-0.03916740417480469,0.08209812641143799,-0.030053142458200455,-0.09654754400253296,0.33004552125930786,0.15971827507019043,-0.23481976985931396,-0.0017488328740000725
59,0.3926408886909485,0.1611335575580597,0.2832304835319519,0.025204451754689217,-0.34987354278564453,-0.4562216103076935,-0.251184344291687,0.24163876473903656,-0.11293814331293106,-0.22687602043151855,0.6851571798324585,-0.45796439051628113,0.1393849402666092,-0.2434627115726471,-0.0654715821146965,-0.12220247089862823,-0.44498705863952637,-0.09679882228374481,-0.24080505967140198,0.1140303686261177,0.11206986755132675,-0.02730332687497139,-0.21497997641563416,-0.25077754259109497,0.2731176018714905,-0.3344757556915283,0.30068162083625793,-0.17544706165790558,0.31983086466789246,0.1529398262500763,-0.24637968838214874,-0.29741016030311584,-0.7426737546920776,-0.3993631601333618,0.02582923322916031,0.05865420773625374,0.4748504161834717,0.7210637927055359,-0.07707405090332031,-0.2033270299434662
60,0.15947803854942322,0.12492627650499344,0.10531872510910034,0.0028434882406145334,-0.23471587896347046,0.06801954656839371,0.12638121843338013,-0.03559339791536331,0.16496117413043976,-0.21691006422042847,0.059331946074962616,0.07964511960744858,0.0984630212187767,0.15176285803318024,0.04327226057648659,0.07111714780330658,-0.0796700045466423,-0.12297432124614716,-0.03196484595537186,-0.26641884446144104,-0.2770628035068512,0.07508315145969391,-0.12353602796792984,0.16317689418792725,0.08798972517251968,-0.09422681480646133,-0.0873851329088211,-0.0759456530213356,-0.21012882888317108,-0.09922732412815094,0.1207287535071373,0.13520421087741852,-0.08541492372751236,-0.007636976893991232,0.12522387504577637,0.02176709845662117,0.16171640157699585,-0.24296049773693085,-0.09764665365219116,-0.15234428644180298
61,0.3037245571613312,0.17188842594623566,0.2023468017578125,-0.07892622798681259,-0.17363573610782623,0.023092960938811302,0.4192565679550171,0.030800847336649895,-0.06668180227279663,0.05008317530155182,-0.10231245309114456,-0.058455049991607666,0.23289944231510162,-0.05882105976343155,0.09306756407022476,0.11526374518871307,-0.0398198738694191,0.08754319697618484,0.06157054752111435,0.09510860592126846,0.06307639926671982,0.32815590500831604,0.27140453457832336,-0.12026412039995193,-0.09250018745660782,0.07789484411478043,0.3706037700176239,0.15017597377300262,-0.15037783980369568,0.055718399584293365,-0.09761282801628113,0.2491723746061325,0.37360918521881104,0.006985308136790991,0.3156792223453522,-0.07354605197906494,0.24835741519927979,0.1393066942691803,-0.11894838511943817,0.37874993681907654
62,0.2608794569969177,0.2013898342847824,0.059679754078388214,0.1650792360305786,-0.14136536419391632,-0.05304601043462753,0.2904963195323944,-0.15033692121505737,-0.0984324961900711,-0.06650746613740921,0.2558698058128357,-0.07411092519760132,0.08180961012840271,-0.09410694986581802,0.1338963359594345,0.024924136698246002,0.0570714995265007,-0.24321162700653076,0.1733473837375641,0.07767283171415329,0.027280542999505997,0.01997150108218193,0.08573858439922333,-0.11361810564994812,-0.10905180126428604,0.18529264628887177,0.044823676347732544,0.43504324555397034,-0.06848277151584625,0.2042609006166458,-0.31454145908355713,0.15585164725780487,0.08609583973884583,0.0035915637854486704,0.15872374176979065,0.06826569139957428,-0.07962438464164734,-0.13146458566188812,0.19982266426086426,0.16338035464286804
63,0.014051343314349651,-0.2844633460044861,0.15768249332904816,-0.14822323620319366,-0.06288859248161316,-0.41791313886642456,-0.4377170503139496,-0.011657312512397766,-0.06591950356960297,-0.10888773947954178,0.2257692962884903,-0.19649672508239746,-0.3301231861114502,0.03001333400607109,0.45130065083503723,0.03516828641295433,-0.4333741366863251,-0.4906519055366516,-0.29112255573272705,0.3872012495994568,0.5603215098381042,0.4452381730079651,-0.3263044059276581,-0.08190079033374786,-0.0195061843842268,-0.01357012428343296,0.2423441857099533,-0.4526320695877075,-0.027926186099648476,-0.46848469972610474,-0.8559175133705139,0.3756870627403259,-0.2823970317840576,0.08395659923553467,0.5121958255767822,0.42219725251197815,0.14835837483406067,0.06309963017702103,-0.18755535781383514,-0.3383518159389496
64,0.6578376293182373,0.29327479004859924,0.36818793416023254,0.2308434098958969,-0.009973335079848766,0.03440307080745697,-0.35244816541671753,-0.27405232191085815,-0.5289139151573181,-0.08150626718997955,0.15158599615097046,-0.019447265192866325,-0.34647390246391296,-0.17191769182682037,-0.12718184292316437,0.431826651096344,0.3680746853351593,0.19184055924415588,-0.056104935705661774,-0.10548969358205795,0.17926134169101715,0.21728914976119995,-0.14316116273403168,-0.27180832624435425,-0.17930661141872406,-0.39196598529815674,-0.4041832387447357,-0.3380568027496338,0.10715924203395844,-0.08056352287530899,-0.20870018005371094,0.049138572067022324,-0.2881602644920349,-0.30816829204559326,0.42183250188827515,-0.14033357799053192,-0.005449058022350073,0.1353483498096466,0.22902527451515198,0.08803266286849976
65,-0.15573137998580933,0.08574089407920837,-0.0840749591588974,0.1632348597049713,-0.07894241809844971,-0.02340066432952881,0.28718245029449463,-0.1903189867734909,0.0959428921341896,-0.07589399069547653,0.1475469172000885,-0.008839031681418419,-0.16812986135482788,-0.2056344747543335,-0.05094989389181137,0.09818871319293976,0.04608339071273804,-0.11286862939596176,0.07320045679807663,-0.09471511840820312,0.012194769456982613,-0.028327977284789085,0.0023052275646477938,-0.08085696399211884,-0.0072245048359036446,0.042688027024269104,0.14220881462097168,0.22812774777412415,-0.1267727166414261,-0.003995976876467466,-0.19983871281147003,-0.03201080113649368,-0.15482768416404724,-0.023372739553451538,0.06991519778966904,-0.11458887159824371,-0.04146689921617508,-0.046583063900470734,-0.047087956219911575,0.03995834290981293
66,-0.02288062311708927,0.25142449140548706,-0.18581770360469818,-0.1676969677209854,0.21831472218036652,-0.07656154781579971,-0.020126767456531525,-0.048349522054195404,-0.20398636162281036,0.009059845469892025,0.22374595701694489,0.2270876169204712,0.25755736231803894,0.30067312717437744,-0.07411638647317886,0.05207861214876175,0.18777918815612793,-0.032831769436597824,0.31836485862731934,0.16446137428283691,-0.22244353592395782,0.28615251183509827,-0.10287808626890182,-0.29691728949546814,0.21208560466766357,0.23458026349544525,0.10580451041460037,-0.11879786103963852,-0.25930255651474,0.08986523747444153,-0.24219906330108643,-0.3267773687839508,0.09881031513214111,0.18087440729141235,0.09836325794458389,-0.20456494390964508,0.17830997705459595,0.01619701087474823,0.04330577328801155,-0.28933852910995483
67,0.042140912264585495,0.35811418294906616,0.16196514666080475,0.11058615148067474,0.07824384421110153,-0.1107943058013916,0.23572827875614166,0.0630248561501503,-0.19302748143672943,-0.026536017656326294,0.10204055905342102,0.049045681953430176,0.07566738873720169,-0.18299895524978638,0.06727759540081024,0.2678711414337158,0.12482563406229019,-0.3326474726200104,-0.02420716919004917,-0.2454613596200943,-0.16214554011821747,-0.09016625583171844,-0.20654098689556122,0.17868176102638245,0.15037398040294647,0.024214457720518112,0.21958784759044647,0.1362556666135788,-0.2136857956647873,-0.18992024660110474,-0.42636775970458984,0.04283453896641731,0.06269560009241104,-0.18092215061187744,-0.17527985572814941,-0.024950385093688965,-0.10642918199300766,-0.026669496670365334,-0.13967344164848328,-0.017834439873695374
68,0.02112220972776413,0.011393222026526928,-0.10663840919733047,0.19667212665081024,-0.1002429947257042,0.0468594916164875,0.23790134489536285,-0.07791135460138321,0.06910824775695801,-0.17387402057647705,0.12911434471607208,0.060369037091732025,-0.20502811670303345,-0.17316384613513947,-0.029005620628595352,0.08703777194023132,-0.02237631008028984,-0.27143028378486633,-0.06904741376638412,-0.2032022625207901,0.030257845297455788,-0.08078354597091675,-0.08049346506595612,-0.11112459748983383,-0.08230281621217728,-0.0017250602832064033,0.004979490768164396,0.19216077029705048,-0.1956189125776291,0.21888157725334167,-0.17237180471420288,-0.033677853643894196,0.04612186923623085,-0.016917603090405464,0.22020357847213745,-0.12678754329681396,0.04399418458342552,-0.05792667344212532,0.025129150599241257,0.010751097463071346
69,-0.055409111082553864,0.06367386877536774,0.05254318565130234,-0.06523551046848297,-0.008081605657935143,-0.0382896363735199,0.11809000372886658,0.0059761605225503445,0.08427968621253967,0.023217197507619858,0.03841934725642204,0.035004157572984695,-0.03059719130396843,0.017388587817549706,0.00589773477986455,0.024342702701687813,-0.04974548891186714,0.04415169358253479,0.04613214358687401,-0.04111079126596451,-0.06690600514411926,0.05531910061836243,0.02349253185093403,0.005597565323114395,0.02946731448173523,-0.10842063277959824,-0.036759473383426666,0.09331740438938141,-0.09448451548814774,-0.12870733439922333,-0.054391611367464066,0.06484038382768631,0.029986023902893066,-0.1110110878944397,0.02537197433412075,-0.0064752548933029175,0.09338581562042236,0.025852397084236145,-0.06749410927295685,0.09022468328475952
70,0.327528178691864,0.07565269619226456,0.14800292253494263,-0.17059773206710815,-0.21161918342113495,-0.08739084750413895,0.29338884353637695,-0.28085416555404663,0.009921761229634285,-0.18341656029224396,0.17609649896621704,0.01527265552431345,0.16959229111671448,0.11577872931957245,-0.07701307535171509,0.35341164469718933,-0.2392677664756775,-0.20030046999454498,0.06945139169692993,0.07332563400268555,0.0260488148778677,0.2590390741825104,0.10462892055511475,-0.009354631416499615,-0.008816628716886044,0.08163346350193024,-0.2141304761171341,0.09421947598457336,-0.17927910387516022,0.2464129775762558,0.003879338037222624,0.10408144444227219,0.1424892693758011,0.0865032970905304,0.3267940580844879,-0.18212231993675232,0.17987631261348724,-0.03086118772625923,-0.0808524563908577,0.13236647844314575
71,-0.07643593102693558,0.0763293132185936,0.012567243538796902,0.07722386717796326,-0.1166682317852974,0.06560215353965759,0.28125226497650146,-0.02838156931102276,0.1703222393989563,-0.09041378647089005,0.12513047456741333,0.08426074683666229,-0.14343054592609406,-0.08131949603557587,-0.02534146048128605,0.05561727285385132,-0.14680249989032745,-0.08431588113307953,0.012889078818261623,-0.19355455040931702,-0.08795696496963501,-0.019627880305051804,-0.04272064194083214,-0.01078949123620987,0.0381152480840683,-0.15256604552268982,0.0051423716358840466,0.20638087391853333,-0.2661120295524597,-0.09244414418935776,-0.12046528607606888,0.10258305817842484,-0.002854890190064907,-0.0943358913064003,0.10578865557909012,-0.07993583381175995,0.1630200892686844,-0.009720707312226295,-0.1523800641298294,0.07064518332481384
72,0.04392874613404274,-0.1908949911594391,-0.0866818055510521,0.0993063673377037,0.27520492672920227,-0.4872581362724304,-0.06636851280927658,-0.0171711016446352,0.16139814257621765,-0.218872532248497,0.13047851622104645,0.10850930213928223,0.270846962928772,0.13361483812332153,-0.21515238285064697,0.09969435632228851,0.20453090965747833,-0.03581763058900833,0.2555617690086365,-0.20917543768882751,-0.276059091091156,0.09717214107513428,-0.05355243757367134,-0.12024789303541183,0.10685975849628448,-0.06622230261564255,0.18603450059890747,0.06546682119369507,-0.20213809609413147,0.007243192754685879,-0.0015847879694774747,-0.03139292076230049,-0.08985009044408798,-0.02181863971054554,0.3146251142024994,0.1350744217634201,0.14677982032299042,-0.1675805151462555,0.325984925031662,0.18482545018196106
73,0.0725310891866684,0.3153946101665497,0.017448458820581436,0.022423438727855682,-0.003163229441270232,-0.021475762128829956,0.14090466499328613,-0.12515586614608765,0.05380968376994133,0.0069987159222364426,0.28710928559303284,0.2224365621805191,-0.14507275819778442,0.23800930380821228,0.0051416694186627865,0.10078535974025726,0.1983594298362732,-0.07929124683141708,0.058146748691797256,-0.1777079552412033,-0.3354751765727997,0.1847478747367859,0.03205040469765663,-0.05195825919508934,0.0973166972398758,0.14665505290031433,0.07019783556461334,0.11485734581947327,-0.21582169830799103,-0.0746706873178482,-0.20011579990386963,-0.07750611752271652,-0.206216499209404,0.017963586375117302,0.008474983274936676,0.025850629433989525,0.2514537274837494,-0.09039701521396637,-0.10384867340326309,-0.20878472924232483
74,0.005160475615411997,-0.022495059296488762,-0.22272315621376038,-0.14231279492378235,0.022911228239536285,-0.03931993991136551,0.038978345692157745,-0.09864415973424911,-0.08186350762844086,0.21213805675506592,0.15659533441066742,-0.09580910950899124,0.01480182260274887,-0.03484661877155304,-0.06560508906841278,0.11749347299337387,0.16597090661525726,-0.2584839463233948,-0.24915048480033875,0.0065023344941437244,-0.037103280425071716,0.12578445672988892,-0.11683814972639084,-0.10332099348306656,0.013792143203318119,-0.016718294471502304,-0.18574512004852295,0.20084065198898315,-0.02909667231142521,0.2186572402715683,0.07650580257177353,0.0036352123133838177,0.26932594180107117,-0.0843060314655304,0.25718677043914795,0.04452056437730789,0.146194189786911,0.06255846470594406,0.19681057333946228,-0.012993904761970043
75,0.09382683783769608,0.05473614111542702,-0.10496777296066284,0.04559703171253204,-0.13267549872398376,0.0036546571645885706,0.010502027347683907,0.0597538948059082,0.08259062469005585,0.07155445963144302,-0.1441090852022171,0.020789429545402527,0.04057293012738228,-0.003952153492718935,0.08993581682443619,0.01918463408946991,0.202367901802063,0.12892204523086548,-0.11896241456270218,-0.1002553403377533,0.08273153752088547,0.10239771753549576,0.025872962549328804,-0.07653970271348953,-0.08163992315530777,0.01167846005409956,0.4272943139076233,-0.09783705323934555,0.04024543613195419,-0.08385076373815536,0.15387842059135437,-0.038376566022634506,0.026729239150881767,0.029110979288816452,0.2129938006401062,-0.07628239691257477,0.022530008107423782,0.020214542746543884,-0.15409402549266815,0.09261726588010788
76,0.10989755392074585,0.09085576236248016,0.08682898432016373,-0.058233752846717834,-0.11004539579153061,-0.2102852761745453,0.2882040739059448,0.040495388209819794,-0.11635354906320572,-0.08538234978914261,0.0753806084394455,0.17020303010940552,0.29194706678390503,0.07031243294477463,-0.21541078388690948,0.46964702010154724,-0.07546942681074142,-0.32631346583366394,-0.11575692147016525,-0.16858728229999542,-0.0950026735663414,0.05116111785173416,-0.1293884664773941,0.2210010588169098,0.11214160919189453,-0.08761485666036606,-0.008340400643646717,-0.21611671149730682,-0.37570324540138245,0.03959887847304344,-0.12281114608049393,0.01362606417387724,0.19418850541114807,0.053356241434812546,0.026443472132086754,-0.20152997970581055,0.12025542557239532,-0.06235548108816147,-0.3142485022544861,-0.08780653774738312
77,0.0011497520608827472,-0.16097398102283478,-0.1205834448337555,0.11390972882509232,-0.2216852903366089,0.3723166584968567,0.010179329663515091,0.08339501917362213,0.06031719595193863,0.09843871742486954,0.22416804730892181,0.10149688273668289,-0.07938385754823685,0.07542428374290466,-0.22201749682426453,0.3552829921245575,-0.24474354088306427,-0.2332579642534256,0.01814671792089939,-0.1197839006781578,0.11908367276191711,-0.24169249832630157,0.10798057913780212,0.2586299180984497,-0.128766730427742,0.009917410090565681,0.09513342380523682,0.0395154245197773,-0.08822255581617355,0.05178069323301315,-0.005842213984578848,-0.2636432647705078,-0.023462221026420593,0.007445213384926319,0.4304347336292267,-0.07400199770927429,0.012064855545759201,-0.02754722349345684,0.16134198009967804,-0.26310989260673523
78,-0.08371485769748688,-0.02564661204814911,-0.15822376310825348,0.21054676175117493,-0.11499045044183731,0.05776601657271385,0.21996697783470154,-0.11677099764347076,0.10420204699039459,-0.13462065160274506,0.14438411593437195,0.02799394354224205,-0.14292582869529724,-0.16385124623775482,-0.04208933189511299,0.09458256512880325,-0.06016644462943077,-0.19825075566768646,0.0023801380302757025,-0.20335449278354645,0.03046940639615059,-0.11958393454551697,-0.11385634541511536,-0.104240283370018,0.022198420017957687,0.007394385524094105,0.10651759803295135,0.23843498528003693,-0.1842486411333084,0.1280611902475357,-0.1481989026069641,-0.01698141172528267,-0.07042992860078812,0.04278818517923355,0.11482889205217361,-0.1238095611333847,0.046421147882938385,-0.03645797073841095,-0.10522956401109695,0.0012245860416442156
79,0.045617736876010895,0.00849237386137247,-0.0313539132475853,0.144303560256958,-0.042836371809244156,0.14762142300605774,0.19271397590637207,-0.001435822807252407,-0.03856911510229111,-0.22154633700847626,0.1409391611814499,0.07524026930332184,-0.022665446624159813,-0.0821285992860794,0.18270666897296906,0.058662932366132736,-0.09695873409509659,-0.21512721478939056,0.038842298090457916,-0.2766393721103668,-0.13649171590805054,-0.023449739441275597,-0.2985233962535858,0.0076955039985477924,-0.024746417999267578,0.052059609442949295,0.11747750639915466,0.15257081389427185,-0.43423447012901306,-0.00951046496629715,-0.09916803240776062,-0.06756462156772614,-0.03369079530239105,-0.08409328013658524,0.03747933730483055,-0.07456064969301224,0.046532079577445984,-0.06904643028974533,0.013605487532913685,0.043858274817466736
80,0.06945473700761795,-0.009774941951036453,-0.007504175882786512,0.25598853826522827,-0.19529373943805695,0.19986897706985474,0.10447696596384048,-0.03663253411650658,0.06924567371606827,-0.19893623888492584,0.01783575490117073,0.059904638677835464,-0.12070950865745544,-0.11912055313587189,-0.024089956656098366,-0.00415044603869319,-0.11086567491292953,-0.17572735249996185,-0.12647710740566254,-0.15788349509239197,0.02073022536933422,-0.15527106821537018,-0.1014886125922203,0.01911708526313305,0.011939043179154396,-0.0023391684517264366,0.039661955088377,-0.05157078802585602,-0.14487838745117188,0.17142082750797272,0.03837292268872261,0.06611818820238113,-0.0783105418086052,0.1787438988685608,0.060992322862148285,-0.03823653608560562,0.04668537527322769,-0.12808680534362793,-0.05617515742778778,-0.12910258769989014
81,-0.14536963403224945,0.0008730284753255546,0.12517498433589935,0.1949184685945511,0.04962436482310295,0.19359982013702393,0.400226891040802,-0.13881659507751465,-0.04887735843658447,0.038939427584409714,0.28143441677093506,0.06955555081367493,-0.1849927008152008,-0.28884169459342957,0.1488679051399231,0.04747772961854935,0.06186184659600258,-0.12013275921344757,-0.21209925413131714,-0.1817232370376587,0.17638279497623444,0.4736582040786743,-0.2251395881175995,0.0518045499920845,0.21121329069137573,-0.16409502923488617,-0.174338236451149,0.1750441938638687,-0.14974983036518097,0.18851909041404724,0.0034221250098198652,-0.01737600937485695,0.2552068829536438,-0.08571560680866241,0.24362117052078247,0.15155942738056183,0.14014187455177307,0.06368021667003632,0.16068542003631592,-0.056117646396160126
82,0.34793606400489807,0.2209469974040985,-0.008103531785309315,0.3723732829093933,-0.17902958393096924,-0.6422010660171509,-0.024026725441217422,-0.04535255208611488,-0.6760401725769043,0.1838727444410324,-0.007669379469007254,0.5614213347434998,-0.2582618296146393,0.16690374910831451,-0.21297931671142578,-0.3719211220741272,-0.6517793536186218,-0.34040382504463196,-0.362237811088562,0.4954872131347656,-0.0037688049487769604,0.1699000746011734,-0.21451565623283386,0.26348111033439636,0.2715330421924591,0.12990304827690125,0.12076069414615631,-0.02869713120162487,0.21750079095363617,0.012192487716674805,0.028009306639432907,0.04200562834739685,0.08222831785678864,-0.8059650659561157,0.48600053787231445,-0.05018342658877373,-0.34849685430526733,-0.15344682335853577,-0.08145415037870407,-0.004742396995425224
83,0.181535542011261,-0.010606076568365097,-0.2772839069366455,0.04234706237912178,-0.3309856355190277,0.02108544483780861,0.07539955526590347,-0.3809284269809723,0.2575053572654724,-0.22611762583255768,0.38157516717910767,0.03512820228934288,0.07631009072065353,0.18677791953086853,-0.004747632425278425,0.2410358339548111,0.2563115656375885,0.040630362927913666,0.09758815914392471,0.21355725824832916,0.17980097234249115,-0.012099414132535458,0.22013653814792633,0.12450248003005981,0.1812235414981842,0.08141917735338211,0.1845502257347107,0.09225671738386154,-0.0047646923922002316,-0.04436749964952469,-0.2188505232334137,0.30077555775642395,0.050230007618665695,-0.09005796164274216,-0.10779117792844772,-0.10207784175872803,-0.010868839919567108,-0.090494304895401,0.07741553336381912,0.07214471697807312
84,-0.12153742462396622,0.2663840353488922,0.21088044345378876,-0.043912019580602646,0.024014536291360855,0.2513224184513092,0.17002590000629425,-0.12166786193847656,0.022344404831528664,-0.05523960664868355,-0.015117522329092026,-0.11576782166957855,0.28545647859573364,0.12345556914806366,-0.0394517257809639,0.2039536088705063,0.029354235157370567,-0.3716835081577301,-0.06978415697813034,0.19621051847934723,-0.2224438488483429,0.27807438373565674,-0.32789742946624756,0.2855299413204193,-0.1977696269750595,-0.037779904901981354,0.0365753211081028,-0.029408171772956848,-0.1965910643339157,0.48382601141929626,0.21461620926856995,0.40035226941108704,-0.2197960764169693,-0.265899658203125,0.24734996259212494,0.07591133564710617,0.5081970691680908,-0.15541939437389374,0.0002632749965414405,0.022112369537353516
85,-0.1127040684223175,0.21003778278827667,-0.034223832190036774,0.3918740451335907,0.23502187430858612,0.05928101763129234,0.35026535391807556,-0.1690310537815094,0.18623563647270203,0.10852883011102676,0.10083471238613129,0.20425593852996826,-0.28199058771133423,0.015454004518687725,0.15036273002624512,0.0854380652308464,0.11212456971406937,0.002326641231775284,0.07920541614294052,0.04595935717225075,-0.0152839170768857,-0.10629736632108688,0.009933718480169773,0.15025211870670319,-0.1267029196023941,0.19385617971420288,0.026109665632247925,0.045113712549209595,-0.13307149708271027,0.2739843726158142,-0.2746936082839966,-0.06806694716215134,-0.30997350811958313,0.011672901920974255,0.13722720742225647,-0.13576076924800873,0.20051054656505585,0.2404315322637558,-0.1327151209115982,0.019938698038458824
86,0.0,0.0,0.0,0.0,0.0,0.0,0.0,0.0,0.0,0.0,0.0,0.0,0.0,0.0,0.0,0.0,0.0,0.0,0.0,0.0,0.0,0.0,0.0,0.0,0.0,0.0,0.0,0.0,0.0,0.0,0.0,0.0,0.0,0.0,0.0,0.0,0.0,0.0,0.0,0.0
87,0.0,0.0,0.0,0.0,0.0,0.0,0.0,0.0,0.0,0.0,0.0,0.0,0.0,0.0,0.0,0.0,0.0,0.0,0.0,0.0,0.0,0.0,0.0,0.0,0.0,0.0,0.0,0.0,0.0,0.0,0.0,0.0,0.0,0.0,0.0,0.0,0.0,0.0,0.0,0.0
88,0.0,0.0,0.0,0.0,0.0,0.0,0.0,0.0,0.0,0.0,0.0,0.0,0.0,0.0,0.0,0.0,0.0,0.0,0.0,0.0,0.0,0.0,0.0,0.0,0.0,0.0,0.0,0.0,0.0,0.0,0.0,0.0,0.0,0.0,0.0,0.0,0.0,0.0,0.0,0.0
89,0.0,0.0,0.0,0.0,0.0,0.0,0.0,0.0,0.0,0.0,0.0,0.0,0.0,0.0,0.0,0.0,0.0,0.0,0.0,0.0,0.0,0.0,0.0,0.0,0.0,0.0,0.0,0.0,0.0,0.0,0.0,0.0,0.0,0.0,0.0,0.0,0.0,0.0,0.0,0.0
90,0.0,0.0,0.0,0.0,0.0,0.0,0.0,0.0,0.0,0.0,0.0,0.0,0.0,0.0,0.0,0.0,0.0,0.0,0.0,0.0,0.0,0.0,0.0,0.0,0.0,0.0,0.0,0.0,0.0,0.0,0.0,0.0,0.0,0.0,0.0,0.0,0.0,0.0,0.0,0.0
91,0.0,0.0,0.0,0.0,0.0,0.0,0.0,0.0,0.0,0.0,0.0,0.0,0.0,0.0,0.0,0.0,0.0,0.0,0.0,0.0,0.0,0.0,0.0,0.0,0.0,0.0,0.0,0.0,0.0,0.0,0.0,0.0,0.0,0.0,0.0,0.0,0.0,0.0,0.0,0.0
92,0.0,0.0,0.0,0.0,0.0,0.0,0.0,0.0,0.0,0.0,0.0,0.0,0.0,0.0,0.0,0.0,0.0,0.0,0.0,0.0,0.0,0.0,0.0,0.0,0.0,0.0,0.0,0.0,0.0,0.0,0.0,0.0,0.0,0.0,0.0,0.0,0.0,0.0,0.0,0.0
93,0.0,0.0,0.0,0.0,0.0,0.0,0.0,0.0,0.0,0.0,0.0,0.0,0.0,0.0,0.0,0.0,0.0,0.0,0.0,0.0,0.0,0.0,0.0,0.0,0.0,0.0,0.0,0.0,0.0,0.0,0.0,0.0,0.0,0.0,0.0,0.0,0.0,0.0,0.0,0.0
94,0.0,0.0,0.0,0.0,0.0,0.0,0.0,0.0,0.0,0.0,0.0,0.0,0.0,0.0,0.0,0.0,0.0,0.0,0.0,0.0,0.0,0.0,0.0,0.0,0.0,0.0,0.0,0.0,0.0,0.0,0.0,0.0,0.0,0.0,0.0,0.0,0.0,0.0,0.0,0.0
95,0.0,0.0,0.0,0.0,0.0,0.0,0.0,0.0,0.0,0.0,0.0,0.0,0.0,0.0,0.0,0.0,0.0,0.0,0.0,0.0,0.0,0.0,0.0,0.0,0.0,0.0,0.0,0.0,0.0,0.0,0.0,0.0,0.0,0.0,0.0,0.0,0.0,0.0,0.0,0.0
96,0.0,0.0,0.0,0.0,0.0,0.0,0.0,0.0,0.0,0.0,0.0,0.0,0.0,0.0,0.0,0.0,0.0,0.0,0.0,0.0,0.0,0.0,0.0,0.0,0.0,0.0,0.0,0.0,0.0,0.0,0.0,0.0,0.0,0.0,0.0,0.0,0.0,0.0,0.0,0.0
97,0.0,0.0,0.0,0.0,0.0,0.0,0.0,0.0,0.0,0.0,0.0,0.0,0.0,0.0,0.0,0.0,0.0,0.0,0.0,0.0,0.0,0.0,0.0,0.0,0.0,0.0,0.0,0.0,0.0,0.0,0.0,0.0,0.0,0.0,0.0,0.0,0.0,0.0,0.0,0.0
98,0.0,0.0,0.0,0.0,0.0,0.0,0.0,0.0,0.0,0.0,0.0,0.0,0.0,0.0,0.0,0.0,0.0,0.0,0.0,0.0,0.0,0.0,0.0,0.0,0.0,0.0,0.0,0.0,0.0,0.0,0.0,0.0,0.0,0.0,0.0,0.0,0.0,0.0,0.0,0.0
99,0.0,0.0,0.0,0.0,0.0,0.0,0.0,0.0,0.0,0.0,0.0,0.0,0.0,0.0,0.0,0.0,0.0,0.0,0.0,0.0,0.0,0.0,0.0,0.0,0.0,0.0,0.0,0.0,0.0,0.0,0.0,0.0,0.0,0.0,0.0,0.0,0.0,0.0,0.0,0.0
