"","PC1","PC2"
"1",-4.99811534283832,-1.39466402473845
"2",0.126320965594909,0.649872723497309
"3",-4.74571841649136,-2.49389592843453
"4",-4.9091631825668,-1.48006299723678
"5",-5.11215501686488,-1.5594097768588
"6",-4.60712443000842,-2.21879135327286
"7",4.64549691282304,1.2835383007285
"8",-5.61580646395827,-2.42836931260608
"9",0.320067944202446,0.768958057663678
"10",4.70812986698701,1.35610157416172
"11",4.85854856344872,1.36551413670942
"12",-5.04587818593202,-1.52147771617715
"13",-0.42386404418486,0.0198640057313043
"14",-0.434353012425492,0.0483227652787785
"15",-5.18724813345967,-2.21309155151325
"16",1.01224603059686,-1.79725797532127
"17",-0.0200944331607933,2.54838827373992
"18",-1.4779700828844,4.84134003934556
"19",0.221141965770654,-2.12874669548839
"20",0.153817964139459,2.79552010373216
"21",2.32813864881796,-3.28847887461124
"22",-0.488302774914496,0.00992142729082845
"23",-4.97413472470311,-1.48082995562363
"24",0.131616124208752,-2.98835425612562
"25",1.12887203329066,-1.7352786582843
"26",2.29658350659197,-3.11161643892039
"27",-1.54961061235103,4.79654517663626
"28",-3.93111539354291,-0.374342637201258
"29",-1.46016282838044,4.80420175118584
"30",4.79254247621712,1.33674383307262
"31",1.06581452235484,-1.74135144061053
"32",-1.51675359888535,5.02976536282191
"33",-4.60713609470172,-2.71629069389976
"34",0.154630588279153,-2.8579625455126
"35",-0.305833296161619,-0.134460724459926
"36",0.133620286848532,2.81546355930291
"37",5.30014791581639,1.54438896782307
"38",2.31302158033077,-3.22713618095859
"39",-0.555620582362164,0.000464799234086209
"40",-1.47783853078127,4.82150884609489
"41",-1.52747066717348,4.88391450531399
"42",1.19413817839414,-2.30406249204707
"43",1.08322665159913,-1.74504682950723
"44",-0.662373050414651,4.04000109488338
"45",0.0701750788290368,-2.14856223169191
"46",-0.48462365221042,-0.014840772655917
"47",-1.55752215248514,4.88487136125642
"48",1.30171557235537,-2.17412899881027
"49",2.29726430259167,-3.15395649705738
"50",-0.601213664041359,0.0960031483016142
"51",5.14389005148074,1.65966981462635
"52",2.40375496995076,-3.32551746783338
"53",1.09686810393048,-1.68018459341269
"54",4.75858112760245,1.30402391280551
"55",-0.343360085796379,-0.0987864853878134
"56",-0.384660267703158,-0.161478516397753
"57",-0.594943435384338,-0.207098407231596
"58",-0.40200006414509,-0.0457957692151908
"59",1.04909636778644,-1.75353136463603
"60",-0.534516018018569,0.0250451534386037
"61",4.78995124934909,1.3598690446088
"62",2.30294447501671,-3.08094508030447
"63",0.449939444220294,2.31659826102298
"64",-0.485291438962394,-0.107222961044701
"65",-0.32821473062655,-0.148046826511928
"66",0.160520933036468,-3.00816795846746
"67",0.958609600162861,-1.6960845803087
"68",-4.0922078445458,0.726817803043858
"69",-4.54603371544633,-0.0227140325750863
"70",0.258409405796855,-3.17792719171988
"71",0.195535358546741,-3.09793456150992
"72",-1.50121460307362,4.87574779683415
"73",-3.79649690126464,0.999104676592502
"74",0.834004472001849,-1.18108256848444
"75",2.32590368742031,-3.27377368022053
"76",0.289158825234639,2.32923162674567
"77",1.05296925597123,-1.77933743268113
"78",4.72431180762981,1.40987049421494
"79",-0.703518584434644,3.96408479248686
"80",0.197274719584917,-3.10113762498785
"81",1.01262021194185,-1.77912246279068
"82",-1.55124739161604,4.82408379719201
"83",-0.466097975283827,-0.110978174317
"84",0.359173777443599,2.26832092068351
"85",-1.50044252000791,4.89696627288981
"86",0.117512723360585,-2.84965306993067
"87",-1.5337574547859,4.92203734585056
"88",2.34296651433159,-3.19366571181345
"89",4.72300615806208,1.30765703736021
"90",0.315718748870939,2.30167649852621
"91",-0.282689531601285,-0.0873564556564026
"92",-0.5724382917473,-0.0259249935968449
"93",4.7671820066752,1.25390692290886
"94",4.72793054898836,1.25553411601557
"95",-0.367915938899955,0.0587159770532662
"96",-4.76392276801458,-1.90512619287348
"97",1.03107121299229,-1.71608552888816
"98",2.29230893290439,-3.33619530610976
"99",-0.233862199269414,2.96915940470985
"100",0.943541758130054,-1.38599292488406
