"","V1","V2"
"1",-0.420663940026341,-3.08221326745148
"2",-3.95655225432707,-3.94818452564997
"3",-2.32871011989746,-3.76124683053474
"4",-0.471269984942987,-3.46183068689142
"5",-0.558669128212791,-3.19003938911123
"6",-2.35952599568789,-3.67256822588517
"7",14.598428460407,5.39282245815361
"8",-1.29685518733415,-3.30808103716318
"9",-4.19927008108358,-3.78272659904702
"10",14.8747718888448,5.52769095610883
"11",14.7764510058325,5.45893949667977
"12",-0.465865218750842,-3.19856204718715
"13",-3.92286022695092,-3.86292041930106
"14",-4.18786151428208,-4.27970249979576
"15",-0.99079473294378,-3.14307965234186
"16",-15.1735008613868,-3.75568684122777
"17",-4.96001319919988,0.477101598178948
"18",12.7257493550076,13.0015971087488
"19",-11.622741894584,6.1287224385445
"20",-4.71302622466939,0.217023496361174
"21",7.37308686367704,-11.1780876066545
"22",-3.65674304717416,-3.55762778889741
"23",-0.633611105224807,-3.25758325767716
"24",-11.8218396435664,6.41818875598893
"25",-15.3645545223675,-3.90524276992175
"26",7.45429497542121,-11.1904912998057
"27",12.943031455465,13.2607910068444
"28",-2.85022916878413,-2.85682638691718
"29",12.4738510905863,12.799120209762
"30",14.7461403920518,5.66409341592814
"31",-15.3406780318593,-3.5255765999859
"32",12.5841916702993,12.8110039076463
"33",-2.15401399095405,-3.60297621411303
"34",-11.908500774185,6.15772995344854
"35",-3.54569039733171,-4.27732948790257
"36",-4.63006886865893,0.143183341464177
"37",14.2745631057952,5.48292112414968
"38",7.50954553033622,-11.0555028938256
"39",-3.30766544655793,-4.11274530386112
"40",12.533844141235,13.1107370886973
"41",12.6317171850112,13.1030438697969
"42",7.29250643627864,-10.6942616867723
"43",-15.5363896384602,-3.7178913425904
"44",12.6824509571313,12.5546767785809
"45",-11.5939489371633,5.95795163644947
"46",-3.41014262163476,-4.13105765461908
"47",12.8403707381866,12.8613323436878
"48",7.27113283408298,-10.6078207340956
"49",7.85786441837397,-10.6732490000023
"50",-3.26710183593226,-3.54051111333375
"51",14.0801377348766,5.7480808012545
"52",7.78784649494161,-11.0615457022122
"53",-15.0127210902095,-3.36863054603576
"54",14.5290638883081,5.39779254211775
"55",-3.71847473596217,-3.92340651656878
"56",-3.61149160952921,-4.63203456476368
"57",-3.91759427558778,-4.48533545405902
"58",-4.09804354693799,-4.26536491829015
"59",-15.306267163822,-3.51569987269099
"60",-3.30185289052524,-3.37176184136237
"61",14.6612020472908,5.74454039503406
"62",7.24858284601703,-10.8987987923702
"63",-4.76132799001101,0.296599834355445
"64",-3.28787199572902,-3.81672269183277
"65",-3.60001316648241,-4.30737597404827
"66",-11.9842650273384,6.69205950281433
"67",-15.1023951692568,-3.74311946483292
"68",-3.02292648717405,-3.00370305513639
"69",-0.648369961789863,-3.16550135843226
"70",-11.7676106748917,6.30988807539171
"71",-11.9035241687347,6.45670838443136
"72",12.3590675797557,12.8777735515324
"73",-2.95938382856186,-2.94107408770915
"74",-14.8576777201799,-3.72864754172354
"75",7.85391781279211,-11.0908785037979
"76",-4.8218780663998,0.277240259992987
"77",-15.0443033611883,-3.52292258476264
"78",14.5865268965813,5.72634266144045
"79",12.5591283630316,12.3630551791352
"80",-11.7159087395579,6.36719288883117
"81",-15.2901028175589,-3.54459234024372
"82",12.7377827166962,13.450257033131
"83",-3.42761625352732,-3.67649532901703
"84",-4.92381497681934,0.418225133682824
"85",12.828367250724,12.7042201155139
"86",-11.7553169196646,6.58236992890469
"87",12.7921363604057,12.9808340585526
"88",7.75709666308251,-11.0040571216658
"89",14.9634938140676,5.71684162025686
"90",-5.18427105036031,0.677554468747187
"91",-4.46175674672055,-4.40506423843396
"92",-3.14038596865425,-3.69513786022497
"93",14.999199592545,5.50238488558383
"94",15.0557036197754,5.39291345961585
"95",-3.84734169145986,-4.35109803654794
"96",-1.76794707464008,-3.60318416876633
"97",-15.6178632299321,-3.89307285223467
"98",7.44527074331943,-11.1657605958387
"99",-4.4676571856288,-0.0372116245686216
"100",-14.7111827492645,-3.66172496480637
