"","V1","V2"
"1",-2.17028283906735,6.87305921129651
"2",-4.84948751412483,10.9679900762911
"3",-3.93740208088266,10.4476551772866
"4",-3.59063753886471,7.63791873975994
"5",-1.40588046665353,4.52614464081855
"6",-1.17256455863524,3.56866884362259
"7",-2.78653669135654,5.99324783182715
"8",-4.16182846510412,8.70430312557025
"9",-2.9846043755414,8.74395156493003
"10",-4.48474287499943,12.4171273483037
"11",0.661033275361996,-0.818326592149263
"12",1.50138256979912,-3.01218016818736
"13",2.1671781873775,-6.61108604961833
"14",3.74011561059742,-11.3432878972593
"15",4.19100242429526,-10.1345465926931
"16",3.16564898022948,-9.94835610713719
"17",3.11714989828054,-5.88475641041828
"18",2.79951910987959,-7.99427684979118
"19",4.57235031046592,-12.412154549656
"20",2.08365391654878,-4.64427017180409
"21",3.54493312239421,-7.07682517099239
