"","PC1","PC2"
"1",-5.08823287484763,-0.859174711358611
"2",0.535746005507862,0.299587923512781
"3",-4.68658461743124,-0.501335055050016
"4",-5.11773964038476,-0.717010192137664
"5",-5.24034880690099,-0.88101724542683
"6",-4.6591562385421,-0.425098592812243
"7",4.82892982210001,0.781195542315181
"8",-6.00050714931714,-0.913232615493421
"9",0.821194506380872,0.444004198485994
"10",4.89062012026925,0.77893441149319
"11",4.91826902493286,0.839579333392513
"12",-5.16616084110083,-0.866763587691247
"13",-0.468193605837943,0.00725344257401383
"14",-0.465672940075288,0.0485719416277091
"15",-5.86794749713561,-0.815455296222399
"16",0.865964347106118,3.86637754077104
"17",0.729300471605657,-4.82994100402221
"18",0.965884853019382,-3.65836312984976
"19",-1.26264878424826,4.26083042391952
"20",1.25859874576448,-5.08807426219317
"21",0.221642535985468,0.729056060665996
"22",-0.502642621912851,0.017603640805458
"23",-5.17174460687197,-0.925613559603135
"24",-1.59238198001604,3.45101312922899
"25",0.932831904385285,3.76499869150372
"26",0.29091537594728,0.501141894237779
"27",0.960234254687044,-3.7542374051553
"28",-3.84543528360668,-0.236543228161283
"29",0.97403549563937,-3.71966602566569
"30",4.95382228857503,0.950251156310497
"31",0.91027398412234,3.74031378792661
"32",0.999300412832084,-3.81527520350694
"33",-4.72609853691836,-0.719669658275252
"34",-1.56628424316587,3.41813203533861
"35",-0.459857585603982,0.137999215153566
"36",1.06388749324764,-5.33931045192544
"37",5.30792256736917,1.308781406116
"38",0.209606466093976,0.523097993320585
"39",-0.539611234050379,-0.143042126329959
"40",0.972043776848635,-3.78328895248559
"41",0.924655033188957,-3.78263020179914
"42",0.274978139914,0.317272145309674
"43",0.99927276643064,3.75275923749732
"44",1.86306760082024,-3.5793518879947
"45",-1.47944338171033,4.29749413227967
"46",-0.547906844452368,0.00214203349183929
"47",0.913644394977243,-3.67571817967488
"48",0.295066598852818,0.654825401886357
"49",0.226468788023637,0.553910987916621
"50",-0.599169943437521,-0.176220199850022
"51",5.04344733985534,1.37402487272608
"52",0.227367904374739,0.60440165067536
"53",0.983923689213867,3.69092898727877
"54",4.99055325776202,0.828262476608431
"55",-0.44878687323921,0.169074375717815
"56",-0.524719411199187,0.173264679085701
"57",-0.71576462816834,0.2380673911762
"58",-0.461545588160847,0.0772374697595383
"59",0.94753740851078,3.7459023751526
"60",-0.547879093779846,-0.032905388925122
"61",5.05455624303966,0.811586745972584
"62",0.329348237237311,0.31329420110708
"63",1.13458142951409,-4.62965351555847
"64",-0.542800407112747,0.143319839188511
"65",-0.472806297744727,0.341105594008345
"66",-1.60353983868071,3.29511439185999
"67",0.879299268591107,3.76822842933675
"68",-3.83436010614196,-0.204417732143053
"69",-4.41287244843301,-0.709228100136938
"70",-1.62787421110227,3.48450532189924
"71",-1.62429294088695,3.46309584659011
"72",0.952942443979821,-3.73881143614516
"73",-3.50904644712146,-0.154611284724637
"74",0.309503887226435,3.51040154624654
"75",0.24017755513853,0.538593649822127
"76",1.06131518995922,-4.72654005721508
"77",0.857192576217694,3.79170781411515
"78",4.82368173735614,0.836969315566959
"79",1.84782040599531,-3.58169403597335
"80",-1.57083130896471,3.43141978609373
"81",0.893338915691955,3.78408672030501
"82",0.881684222311957,-3.72133386880642
"83",-0.579410981654738,-0.0722297912519931
"84",1.07002875086483,-4.60778280153345
"85",0.987199095709962,-3.81040343890384
"86",-1.62276340607846,3.34701281707869
"87",0.941357046779596,-3.6609515125269
"88",0.243422144785243,0.530076000546285
"89",4.88883136602423,0.811334977721976
"90",1.07222229982556,-4.7746285130242
"91",-0.383655951346154,0.147025063990274
"92",-0.637426882960228,0.0351258405666088
"93",4.96498383866894,0.842466992650039
"94",5.02944558730637,0.817294461503675
"95",-0.410356491804158,0.0328750380492617
"96",-4.95551387194673,-0.453339584866834
"97",0.943849741792684,3.73007619774066
"98",0.14946479848378,0.685775300499438
"99",0.448245088542254,-4.47228315729824
"100",0.234517198707842,3.71606311399783
