"","PC1","PC2"
"1",-2.86824464369632,0.105370924155557
"2",-3.95043979040642,-0.0287904127263466
"3",4.0286127492367,-0.0867270692383583
"4",0.990916567553424,-4.88549645795812
"5",-4.03632046188806,-0.00499634399585028
"6",-3.9598429997275,-0.0263951125439036
"7",0.449947142253636,-4.54298982901322
"8",1.57695921083483,3.12133858509513
"9",1.48275508975419,-4.16132402270734
"10",2.26972415257984,1.09718122547448
"11",1.48996476182396,3.93672325293578
"12",3.35795421258094,-0.155995922348222
"13",1.81872750983349,-4.2611273581993
"14",-4.03893195488229,0.00346935751151251
"15",-4.009330777948,0.065421036562203
"16",-4.07275327035078,0.00909699337595404
"17",2.71686282043177,0.509761849706188
"18",-4.05368965223817,0.0107313154703741
"19",1.62768240442578,3.79003507820366
"20",-4.01022831427569,-0.119572123145961
"21",1.02075614312633,-1.88265071825889
"22",1.4994893136847,-1.77257520596106
"23",0.930516309046671,4.78352077057514
"24",3.15208077690678,0.755040517242129
"25",3.46158121490711,0.0686708557054768
"26",-3.99936671560396,0.118584621759485
"27",-3.93860659686627,-0.0899922205696727
"28",1.1100446798651,-5.00423554794968
"29",1.3351599783005,-0.970448252174523
"30",1.36310882363828,-0.854762416352207
"31",0.33566780470217,0.276768653989953
"32",-3.99037810874256,0.0867590348268278
"33",-0.0208994496021751,-4.57776419025659
"34",-4.04067211540253,0.023655733536531
"35",1.33402798327898,-1.68187180007645
"36",1.14751614773355,-0.903492658845963
"37",4.21068794093145,-0.258893199139008
"38",3.48409069320175,-0.164116317439535
"39",1.27037082241331,3.07814767364394
"40",-3.95757669217877,0.0794566277038395
"41",0.668923418226308,-4.88077049086513
"42",-4.00629170374604,-0.0663784015281802
"43",1.04000407302226,-1.78344084885556
"44",2.27583155781139,1.35385488634293
"45",2.02614049026269,-4.00261061573656
"46",-4.01500643281664,0.0571639899365508
"47",2.71884673673929,-0.205308218328602
"48",3.16492585859688,0.342032576714597
"49",4.26416565985845,-0.270823293161366
"50",0.979068430685608,4.73247171347969
"51",4.13018086623408,-0.246208100734597
"52",4.32425945162741,-0.286137747702932
"53",1.77706942845936,-3.91580128169782
"54",0.95224006536669,4.70885311263791
"55",-3.97132525299308,0.0783273998710117
"56",1.30269697686465,3.54298332885723
"57",1.09776881671563,-5.43755329930779
"58",1.35436291341815,4.79447629724641
"59",-4.01967718236569,0.0554633364609241
"60",0.773780005120549,0.443538810407073
"61",-3.97831011492999,0.0702358226207115
"62",1.85341762068018,-0.787828968262993
"63",1.7981130626429,-5.06448661018298
"64",0.431669023224054,0.198944405264425
"65",-3.96270494074783,0.0676010991695024
"66",-3.99768457529304,0.0796883284690459
"67",1.91084640933387,-4.08610622140995
"68",0.243218860342589,-4.55431410206312
"69",0.355137520125088,0.0939337143066978
"70",0.498478970801825,-0.0899326351072711
"71",-3.99238678368709,0.10797424444281
"72",-3.9943721306763,0.0838942101728373
"73",1.54058909768704,3.05244995006357
"74",1.58929177256325,3.09125183356643
"75",2.11380330552429,1.22196907336324
"76",0.585937763830044,0.0732924820133166
"77",1.53590501192681,-1.72404110304038
"78",0.863869512643655,4.76258264678019
"79",-4.01074240800756,-0.0683354510037414
"80",1.80121962280482,3.47642474640584
"81",-4.01277997095659,-0.0898332546465644
"82",-3.99696601828449,-0.014193854853384
"83",0.935183338162115,4.91406391470385
"84",-4.02358600917205,-0.0299081829604831
"85",1.31547070575228,-0.879394475837878
"86",-4.10663313401204,0.0202425076441325
"87",1.86884867436719,-1.57362447183118
"88",1.48504960154656,3.30759236885855
"89",-4.07552688522203,-0.0134623117065026
"90",-3.92944463716256,-0.011335167035867
"91",1.44369760769831,-1.71423509381141
"92",4.15862793060445,-0.270321064392517
"93",-2.78440416387523,0.111508553374219
"94",4.17764286689224,-0.252498012526896
"95",1.34880898897124,3.92111769069093
"96",0.914488259764684,4.93291495986918
"97",1.65626392617675,-0.661482209848528
"98",0.987983649027867,-0.810934827891745
"99",2.80560881376229,-0.0865058628989268
"100",1.29048196884672,4.6954412469231
