"","V1","V2"
"1",-1.41315658334336,-2.70339093816827
"2",-1.15758092667438,-2.39099621910175
"3",-1.98681472417398,-2.63290213004071
"4",-1.93343033756009,-3.28988074158828
"5",-0.922044970422707,-2.91749699493124
"6",-1.34463127114244,-1.90490079371628
"7",-2.30591954665261,-2.34079183356245
"8",-1.78405404229605,-2.07854645303454
"9",-2.39190356347285,-3.44264157020752
"10",0.5592989820979,-0.308941868143089
"11",0.878772818154223,0.225823502864614
"12",1.1401380699836,0.803661417163203
"13",1.28985732184259,2.76241705316217
"14",2.08770259898986,1.94393999751722
"15",1.86077198203113,2.83913420121899
"16",1.97657096104989,2.3563931008223
"17",1.37120824211824,3.18548275744133
"18",1.47896607658498,2.07425676921815
"19",0.842234491956648,3.13746892007442
"20",0.741165880795729,2.55375974244706
"21",1.01284854013368,2.12815208056467
