,0,1,2,3
0,0.08208922121185849,0.08208927882665272,0.0,0.0
1,0.07920335005764362,0.07920341153128128,0.013110358588964761,0.013110349184302162
2,0.0743250949144224,0.07432516437796008,0.025890922181584345,0.02589090454860992
3,0.06757716975116912,0.06757725078499376,0.03802019187340735,0.03802016831159095
4,0.05912932064610518,0.059129416055846776,0.04919305225309398,0.0491930260804949
5,0.04919405577326899,0.0491941673973709,0.05912844667195837,0.05912842207320174
6,0.03802129969576006,0.03802142825261188,0.06757644730813188,0.06757642914043954
7,0.025892106438511715,0.0258922514196725,0.0743245421757657,0.07432453574015264
8,0.013111589490129116,0.01311174910455797,0.07920298092767392,0.07920299171374774
9,0.00012590475310964862,0.00014319316775198774,0.08208904497615065,0.08208907838999888
10,-0.0008409985277343611,0.0008437599387680551,0.0008409985277400087,0.0008437599387624555
11,-0.08208904497560264,0.08208907839054677,-0.00012590475310869306,0.0001431931677528203
12,-0.07920298092714521,0.07920299171427644,-0.013111589490041582,0.013111749104645503
13,-0.07432454217526957,0.07432453574064878,-0.025892106438338853,0.025892251419845323
14,-0.06757644730768077,0.06757642914089061,-0.03802129969550625,0.038021428252865704
15,-0.0591284466715637,0.05912842207359639,-0.04919405577294061,0.04919416739769925
16,-0.0491930522527656,0.04919302608082328,-0.05912932064571049,0.059129416056241425
17,-0.03802019187315357,0.03802016831184472,-0.06757716975071804,0.0675772507854448
18,-0.025890922181411518,0.025890904548782737,-0.07432509491392628,0.07432516437845624
19,-0.013110358588877238,0.013110349184389674,-0.07920335005711494,0.07920341153180993
20,0.0,1.7363062871672876e-17,-0.08208922121131053,0.08208927882720067
