"","PC1","PC2"
"1",1.55911321457224,0.0849693364836517
"2",0.387663412563176,-0.23557379189181
"3",-2.00221219454014,-4.09011013277377
"4",4.57646578201615,2.02158484378166
"5",-3.12031247682724,2.29705417704484
"6",1.70610924427819,-1.10798382515761
"7",4.15974562540596,0.523440692305157
"8",-3.69022287415913,-4.22081306068065
"9",-1.23633778617648,-0.47530124886278
"10",3.98278461458282,-0.120102252739633
"11",4.17989306030387,-0.158039449983451
"12",-2.63004021180669,2.11277754686301
"13",0.245719705116038,-0.988651722756309
"14",-0.486754017494062,-0.114126935756577
"15",-1.87664355456049,-4.15000497193372
"16",-2.25942545796159,3.74967587223361
"17",-0.250507754150378,4.05767495079983
"18",-3.35241253905187,2.61646347846211
"19",1.61389804049313,-0.596589135473334
"20",-0.586216074759547,-1.96088463217386
"21",1.85552771151752,-1.3566143911013
"22",-1.25250330730076,-0.488587723058675
"23",-3.32749324125917,3.0807042409721
"24",1.91893682307478,-0.91621976483852
"25",-2.98422594490118,3.10933967839435
"26",3.11068514875522,-0.0317324477544601
"27",3.0030793708669,1.93469993679011
"28",-3.50032688671529,1.46410375390689
"29",-3.24640452108278,2.96617270221555
"30",-0.983666214113423,-3.08827807062459
"31",-3.10630185877755,2.60468239364548
"32",1.0188685398953,-2.34038308488351
"33",-2.79724096045413,1.6872806680752
"34",-0.027120281148183,-3.13032850773397
"35",1.78247924310672,5.12365529804908
"36",-3.11423078247245,2.78893577592864
"37",-0.61870419203509,4.46375145357253
"38",-1.4979338888054,3.89919601358037
"39",-3.09620401362756,-4.0698013237017
"40",0.577388742942847,-1.66464430414475
"41",0.0724509718718869,-0.832504619422662
"42",2.55073524687858,-0.650158972524385
"43",-0.592931316906538,-3.11670627241678
"44",-0.142302535818273,-3.26851207854755
"45",-0.731037262798815,-3.12877334763676
"46",-0.0497782765737841,-2.23223401949854
"47",2.74674136970121,-1.34266783183703
"48",2.67890988428603,-0.733410476227398
"49",4.07506740878488,1.59022120040384
"50",0.337905581828246,-0.831091464585927
"51",-2.8500090834934,3.2973447648128
"52",4.49888178379449,0.946609090126567
"53",4.35385483406312,1.56986035456905
"54",-2.49963093654546,2.09752787303069
"55",0.3017584764491,-0.293972407644068
"56",-1.55279689682915,1.13767831080082
"57",0.916318512023675,2.77419369525841
"58",-0.555147803030383,-0.132940233360806
"59",-2.87404267892218,3.12874175119357
"60",0.395800314360568,-0.730026835643829
"61",-0.709477197423246,-3.34824373878082
"62",2.62082800281395,-0.162484244013221
"63",4.78559235686797,2.12729531602919
"64",-1.45922818020913,1.73524971324255
"65",-2.60691022173685,2.09664079505382
"66",-1.42090349289187,-3.70749150582755
"67",-2.67825904126571,2.27772247323287
"68",1.38962001562123,0.415212146027623
"69",-2.36123095655867,-4.11426799287237
"70",1.89426790498715,-1.41355835149634
"71",3.69188300338162,-0.856538173966495
"72",4.6049600758815,0.847971392390066
"73",2.21439552697397,1.47385318344406
"74",2.08310715515608,1.02246472764446
"75",-3.49599099141382,2.56828894736317
"76",0.906197823950621,-0.504083765999824
"77",-0.70310976914404,4.43132649176314
"78",2.03002269927845,-0.724427822469468
"79",-2.16604199146037,3.47990174686187
"80",3.07476256398122,2.60358590334748
"81",1.52688075966486,0.0536124556888533
"82",3.8774803769855,-0.0827583235190064
"83",0.345255889914557,-0.407305404295368
"84",1.98298881984811,-0.76878111693587
"85",3.99498478510851,0.610444809292255
"86",-3.48038110713056,2.29787167473182
"87",1.00596461169837,-0.66877986202447
"88",-3.041539962718,2.91157894630006
"89",-2.39526447630275,-4.19115509237743
"90",-2.74306728237331,-4.25742279122853
"91",-1.70563099385876,2.15555857760671
"92",-0.519401371720816,-0.41132763500518
"93",-1.54950074974786,-3.51232433954957
"94",-3.0890044496097,-4.36233383885189
"95",0.342755587383793,-0.765096170197045
"96",1.16889701996186,-2.40364739070589
"97",-2.97678175425584,-4.04553698621534
"98",0.269116614934519,-1.43434301817164
"99",1.70301672138024,-1.09622223793472
"100",-2.12691916438685,-4.40102001351122
