"","V1","V2"
"1",2.93208031169679,2.63878741859518
"2",0.463394246646981,-1.9434825853536
"3",3.83147283881744,7.15731000372348
"4",9.26126158117053,-4.13318903045087
"5",2.90394984431762,-1.06343504835845
"6",-0.702426547671865,1.18422380426001
"7",9.60147618813275,-5.23371977854313
"8",-5.08627892843717,4.41214424639769
"9",9.71979669198193,-5.31869625880711
"10",-3.12679830341545,6.81665652034408
"11",-14.6703217324994,1.39117734685638
"12",1.8610089695393,7.4843803191938
"13",10.1936660857918,-7.71689717809655
"14",1.29314795456838,-2.63282645425874
"15",-0.590304714252138,1.10930399932757
"16",-0.896147589723527,-3.83628368221084
"17",1.86233751797193,7.46615477245432
"18",-2.18613531920894,-3.35194370890821
"19",-14.8323563042231,0.906112385994844
"20",0.693336820374936,-5.20616047920041
"21",1.39660050155221,-11.5841303958941
"22",2.30732350271803,-11.4970766813105
"23",-9.76721290957158,0.64553660551242
"24",1.88877275121496,7.47030089171681
"25",2.91631350143043,7.33636378111649
"26",2.1127141122142,-3.15291846671074
"27",-0.842696112796235,-3.66570785060298
"28",9.54417821938547,-5.28577687430245
"29",10.4561394455862,5.93082996598976
"30",10.4817864591933,6.01742949562333
"31",-6.8100893335776,-9.50025487176217
"32",2.62374719960914,-3.9166393669888
"33",8.83384994587305,-3.05297542497672
"34",-1.57240916110243,-2.83243738155203
"35",2.25179945655539,-11.2923876436871
"36",10.5229397086352,4.96190441649004
"37",-1.78588584024641,13.5180794037804
"38",3.832012346223,7.1438332710467
"39",-5.53940871906531,4.36293670775381
"40",2.41705292126283,-0.371252319860629
"41",8.9538243907159,-3.29910702885941
"42",2.63044460553717,-0.715191513517251
"43",1.36182023449724,-11.5877731996279
"44",-3.1347226280688,6.81658695674747
"45",9.8911114647561,-8.53634582415927
"46",-0.587551795228967,-2.22516397424791
"47",-0.741041362184838,14.9425116277567
"48",3.85253337323665,7.13337575784791
"49",-1.48542740614975,13.2909661845117
"50",-10.4196775502084,-0.371493635811923
"51",-1.51721739043981,13.9738362958449
"52",-1.73769030672307,13.9006764313165
"53",9.89612502327585,-8.5307928533834
"54",-10.2454652089499,-0.286997310233221
"55",-3.15810043148475,-0.792896181897716
"56",-14.3628335990146,0.971593500667784
"57",9.64579120113184,-6.44233347155734
"58",-10.6681047148199,1.27220316931379
"59",-3.39932355199353,-1.58940667630148
"60",-6.79987429282404,-9.48221588555668
"61",-0.771283972964074,-1.70304898587251
"62",11.3738409882475,5.82484371675845
"63",9.73137968663145,-7.81263305879131
"64",-7.29953072416399,-9.54182975677499
"65",0.012446862304074,-1.85240322420473
"66",1.70452457145251,-3.07798835953495
"67",9.92733340396031,-8.26602810858908
"68",8.88148846081146,-3.14168850692156
"69",-7.58854066976227,-9.27190696206253
"70",-7.13598047938848,-8.93707356674066
"71",0.197671116546252,-0.909647547924866
"72",-3.05883853240458,-1.48558819507327
"73",-5.41324050083401,4.63240096575945
"74",-5.06706461016244,4.48563924059435
"75",-3.12935967391241,6.8053156449556
"76",-7.06444188099437,-8.85200478553005
"77",2.42305293055032,-11.4456030564445
"78",-9.93491067678488,0.675481689970454
"79",-0.691451341293224,-5.38000120342142
"80",-14.4736551453715,0.758942634181835
"81",-1.84689799333882,-4.27604047134681
"82",0.0147987380392932,-4.34295810597168
"83",-9.90178537497126,0.775231213877264
"84",-0.387645817776031,-2.96343712684236
"85",10.4745381262353,6.04941222592848
"86",-3.069061491303,-0.63930568477881
"87",12.0292014188963,5.4410104495401
"88",-5.61269214103638,4.42747179104318
"89",2.67528900163538,-1.14787556541135
"90",0.877400393836233,-0.0899786395436461
"91",2.29022736886243,-11.6163131839668
"92",-1.0922046083627,13.6917678834127
"93",2.93220303369618,2.63904040800702
"94",-1.11676442646878,13.4992589194305
"95",-14.7309757859251,0.770706705691963
"96",-9.77064779385221,0.748919478378985
"97",11.8667317672346,5.48465886624418
"98",10.4907511351251,4.97385268841735
"99",-0.740692585073626,14.9392975062692
"100",-13.7735204396535,0.322795824092548
