"","PC1","PC2"
"1",-2.97975221007153,0.127175200950538
"2",-3.759125953076,-0.364488661309425
"3",-3.16706792472943,0.655719413713684
"4",-3.90239707524268,-0.358091692039726
"5",-3.63629010603618,-0.910897127004497
"6",-2.64510336288487,0.31130920255302
"7",-3.56700649400904,-0.221676879840842
"8",-3.10330078021411,-0.0392992745279086
"9",-3.78220816912304,-0.537032133189854
"10",-2.85060324460834,0.193048042483961
"11",0.198778387909191,2.79629897936903
"12",2.95326636849286,-0.346809990517117
"13",3.12310876634545,-0.496784783552469
"14",3.4083916870507,-0.279355295560385
"15",3.40611796072976,0.0275218676646238
"16",2.80086122104934,0.506501542075198
"17",3.51726935119723,0.767847393316469
"18",3.61689510505387,-1.00479200929724
"19",3.01009746203525,-0.381471308291219
"20",3.41556201220634,-0.19062181220887
"21",3.94250699792521,-0.254100674786974
