,wave,stress,spearman,pearson,kendall
0,4.0,0.40940894589131976,0.32394437168948687,0.3404759446222322,0.2279708506417431
1,3.0,0.41125116866755607,0.3202593415843452,0.3542649808087715,0.2249151709424148
2,2.0,0.4306375051260773,0.29424438806815445,0.3070525698970076,0.203881420126171
3,1.0,0.4065887245943076,0.24531527715679213,0.2697806242358855,0.16950730040240808
4,0.0,0.4366478002838513,0.2891423683691366,0.3132957997739082,0.1993905652893638
