waves;cluster;mahalanobis_dist_low;cosine_sim_low;mahalanobis_dist_high;cosine_sim_high
0 -> 1;0;1.2680876843727964;0.9920974075189197;4.149351208010736;0.37192242362393
0 -> 1;1;1.43216568443411;0.9995185701446179;3.955983255496804;0.20792044934897766
0 -> 1;2;1.9121030568169022;0.856271252603897;4.733737917130245;0.32279955452113224
0 -> 1;3;1.6499453792085224;0.7462689276377861;4.995002711658754;0.34705000732787505
0 -> 1;4;1.58009201434715;0.9824309900597341;3.330264665910696;0.34988867514092065
0 -> 1;5;1.673775820299625;0.9961250587671696;3.6610676490471676;0.3123501809568037
1 -> 2;0;1.2602597926252062;0.999667972167824;3.469643612445769;0.6616424562436666
1 -> 2;1;1.3323829400887088;0.9988997514732314;3.658102564934552;0.5566350682277077
1 -> 2;2;1.4084999216035154;0.9691016217771777;4.1456091788590586;0.33893882700957234
1 -> 2;3;1.598823879046196;0.611791945566214;4.3032454053687825;0.19640531884747195
1 -> 2;4;1.5039045177192285;0.9964915014529749;3.8753155715945278;0.4087018622581327
1 -> 2;5;1.3668854085318298;0.9951433256987583;5.285808281445347;0.39749086490295593
2 -> 3;0;1.393868084937189;0.9803572929483026;4.209055929032485;0.4331597544794452
2 -> 3;1;1.3044327283725623;0.9991894655772254;6.476327049014152;0.33400906349132664
2 -> 3;2;1.3071289902786627;0.9992754053602023;2.9324184476916124;0.2427745292575012
2 -> 3;3;1.3252065406351108;0.9677874462459403;3.1494461999910954;0.34018470880053886
2 -> 3;4;1.3258614836449567;0.9998595399105906;4.465973800593206;0.5054721586554566
2 -> 3;5;1.3515680032455961;0.9999327829143232;4.353139119794028;0.5388135679379716
3 -> 4;0;1.4449986972508853;0.9693310473179123;3.8434258540345203;0.4229836440246
3 -> 4;1;1.3225974173931092;0.9917660820085138;8.601012519881085;0.39556373609948253
3 -> 4;2;1.3811621376353902;0.9626962751670696;4.9520494708709055;0.49419836518934385
3 -> 4;3;1.3184285491018364;0.906576769393188;4.418028362313097;0.42350135104043096
3 -> 4;4;1.3358000751255656;0.998574579113173;7.475555464188181;0.4436850256038253
3 -> 4;5;1.4935333794417163;0.9910784379821854;6.93380980254433;0.35315378266181896

