waves;cluster;mahalanobis_dist_low;cosine_sim_low;mahalanobis_dist_high;cosine_sim_high
0 -> 1;0;1.3757117683020388;0.9878922176061119;3.431357417278744;0.593341235348576
0 -> 1;1;2.0697512840736376;0.9927943165884764;3.9568758982828736;0.4589169697688316
0 -> 1;2;1.4177424712105793;0.6167901333223075;3.5149149473973424;0.49891646635312276
0 -> 1;3;1.3129486173439626;0.9935199322064036;3.628307798884443;0.524961559211514
0 -> 1;4;1.7851446976534429;0.9819243931234767;3.8903347354516975;0.5256136923471203
0 -> 1;5;1.5429092415628862;0.9854537749061234;3.520973198591683;0.5688289033390085
1 -> 2;0;1.318569019006735;0.9978691509648754;3.2677615215453493;0.6090806632597784
1 -> 2;1;1.5108193901846505;0.9801853072852976;3.853615372709395;0.47744520041412014
1 -> 2;2;1.321404502770823;0.9469706305279959;3.386527003659482;0.5869937364236205
1 -> 2;3;1.333931288731928;0.9925820186942872;3.563931635176977;0.650215430609313
1 -> 2;4;1.3280945267221667;0.9972417666461716;3.356265434203627;0.7190534130067081
1 -> 2;5;1.3787227210602961;0.06395602980522842;3.3967654298923913;0.48054315036517176
2 -> 3;0;1.3672053002499738;0.994616130255924;3.8620679897359382;0.517297223151496
2 -> 3;1;1.398112219950632;0.9506716899675661;3.8240537629344145;0.3644677601745471
2 -> 3;2;1.3119843852506607;0.9998420620060925;3.745958182787229;0.385172953568239
2 -> 3;3;1.352515440364259;0.9994995775956236;4.841612993153494;0.604461638558068
2 -> 3;4;1.328793808691164;0.9997007629243849;4.033138615036856;0.49291975212875944
2 -> 3;5;1.5497770573796064;0.48538641097352003;3.539823499006546;0.46790235939270397
3 -> 4;0;2.23696918782074;0.8630241561948347;4.160434783230008;0.44382874115655535
3 -> 4;1;1.89924638427966;0.8277984089389516;3.5049041125436116;0.4248754857407437
3 -> 4;2;1.2900399378469292;0.9998758895065758;3.2994017561963296;0.38046817621200046
3 -> 4;3;1.3201146441670562;0.9950011785635164;3.2058502821016686;0.5864396069210763
3 -> 4;4;1.7303317156143987;0.9244260821836964;3.870177619013152;0.47017009144543737
3 -> 4;5;1.6062709738668366;0.8501528951278301;3.5147965494429667;0.4456275969062343

