wave;neighbourhood_preservation;neighbourhood_hit;trustworthiness;continuity;stress;spearman;pearson;kendall;cluster_size;cluster_adjacency
4;"[0.30828978301041066, 0.35300408117739607, 0.37282003696490496, 0.38222382993516896, 0.38705763088257905, 0.389367398132365, 0.3883590992012286, 0.38508204181096994, 0.3807817955901981, 0.375496252614328, 0.37094498226162215, 0.3677237032130565, 0.36574139022022606, 0.3627359905096796, 0.3608025457212847, 0.36009078773451575, 0.3601780462246742, 0.36018618290324367, 0.3595099899445232, 0.3590025550997241]";"[0.8548397151683497, 0.8251200867201284, 0.8000791229653997, 0.7847019147118284, 0.7732940076747927, 0.7624407013415577, 0.7512608849264422, 0.7406300904724417, 0.7300098153617434, 0.7204588880063503, 0.7109801801790536, 0.7036262559485004, 0.6955214227021743, 0.6889041884425826, 0.6827256222472514, 0.676352650335925, 0.6694105303925848, 0.6632001659885598, 0.6575419497039825, 0.652637542710527]";"[0.9051835755897489, 0.8754298897710218, 0.8598702596000691, 0.8500315623912073, 0.8433908077925023, 0.8376215416011938, 0.83300346153135, 0.8296844994329465, 0.8270672221531443, 0.8247102389937279, 0.8229210034714025, 0.8210688440583789, 0.8193179737868229, 0.8181719372686995, 0.8168200042598851, 0.8156146912525992, 0.8143892210963142, 0.8133706891543577, 0.812309920959842, 0.811545742804217]";"[0.8981862315316909, 0.8577205621419945, 0.8329295432612159, 0.8165846034068561, 0.8036877489101506, 0.7926411767276969, 0.7838359258589899, 0.7767342508174654, 0.7705442074026265, 0.7652872390736605, 0.7610957551426674, 0.7571018848501262, 0.7537557363517479, 0.7509496880928264, 0.748461126882213, 0.7462179887524065, 0.7441887028207486, 0.7423087374446887, 0.7404466365296809, 0.7387460310345404]";0.37757674883437053;0.3498487593171826;0.3743558544178734;0.247745911009864;"[(8221, 4.204350006017074), (7916, 2.4095511771155156), (9931, 4.486289281042982), (9354, 3.560328242968798), (8096, 3.06746546971554), (5909, 3.7252103628670734)]";"[(0.7929725352323913, 0.8692381135672732), (9.046085607565375, 0.9028936440870071), (4.258141269882972, 0.8989032304158883), (5.317636049083876, 0.908688042570614), (4.267052185361116, 0.8927169431894677), (6.061947900806615, 0.901898447330548), (12.260163439456266, 0.9064154503396817), (0.015538134855665173, 0.8666051200456999), (0.0, 0.824663745597291), (0.1851958260683609, 0.910948731480305), (3.0004783249215574, 0.8986874721515227), (0.017901957760171158, 0.863734112429046), (2.6829444855102795, 0.8979853704024957), (0.0, 0.8597626166555838), (7.09922437753753, 0.902018553069626)]"
3;"[0.29194141039797616, 0.32701817988403603, 0.3415049714971958, 0.3498974358166744, 0.35482840810816313, 0.3582814098199546, 0.3609929615239293, 0.3611060820186553, 0.3597637190769432, 0.35490717999565946, 0.3500598213298349, 0.345951108709745, 0.34283755979804387, 0.3393906858492108, 0.33683231110510736, 0.3357686620879834, 0.33481715765662495, 0.33344682895920047, 0.3316190524994397, 0.33007187984544023]";"[0.8152906704573999, 0.7734546643727517, 0.7423594044071148, 0.7198095434445692, 0.7010552670433428, 0.6870217704952797, 0.6739365637099498, 0.6617606877247509, 0.6518431140884025, 0.6423821176208694, 0.6336037447581289, 0.6264742964066754, 0.6198087109421928, 0.6103901244968528, 0.6005508420020221, 0.591806943793192, 0.5834275836832493, 0.5755336276963819, 0.5683819368697067, 0.5613028194208851]";"[0.8934370685932557, 0.8631472641777265, 0.8493084773194916, 0.8391069031772297, 0.8322456302663481, 0.8270890495875698, 0.8229395645373845, 0.8195133388849312, 0.8169857450512946, 0.8147372664566331, 0.8129580120067125, 0.811361143598029, 0.810018952450348, 0.8090137462577992, 0.8081951878677207, 0.8070792950177426, 0.8060720539929566, 0.8050521728531231, 0.8041123110547413, 0.8032344348264686]";"[0.890846207688047, 0.8528337609746384, 0.8314599621024057, 0.8152948938261992, 0.8034841904291824, 0.7934848609845322, 0.785157417006795, 0.7780759255422337, 0.7724955644786073, 0.7677437710506947, 0.7634984362667947, 0.7600501521200672, 0.7568323269327895, 0.7539536450332416, 0.7513581263693716, 0.7491969506107832, 0.7471379950659738, 0.7451947180620111, 0.7433996149779636, 0.741826486443584]";0.387397262591608;0.3500132742279769;0.3910456720450795;0.2465352314791577;"[(9139, 0.6817342367284367), (3939, 0.3360917442785907), (8844, 4.147949979754344), (14345, 5.772765714824742), (10418, 5.473000738369818), (6395, 4.380656613068899)]";"[(0.0021143752589347347, 0.8436398657525707), (4.229476646048574, 0.8968391079047424), (2.161391123018764, 0.892531097395936), (10.351767378220769, 0.9076851641113687), (6.657260858052916, 0.8993280510515845), (1.1241991565553124, 0.8751008987172016), (7.847571570310672, 0.8974085577769649), (0.0, 0.8513172941809417), (0.0, 0.8022073721954347), (6.51186928576588, 0.9068832612636806), (7.475982840760497, 0.8976823263820256), (0.03176781434272932, 0.8625518560145411), (7.206232244177077, 0.8969688456739311), (0.0, 0.8505353769397749), (5.869929593717068, 0.8885725229078816)]"
2;"[0.2809557012066925, 0.3228245895952121, 0.34046760740601867, 0.3505850427068514, 0.354357404640718, 0.3594319225305157, 0.36355044573122847, 0.3678549000515062, 0.3689782019749034, 0.36800937654309596, 0.36504730508816746, 0.36170853280696486, 0.3583919423813954, 0.3547385222004417, 0.35114141210169375, 0.3489449930796438, 0.3474650569173824, 0.34710062694292076, 0.3462199862482188, 0.3443945502496947]";"[0.8069142665358017, 0.7673450702835031, 0.7392246606231031, 0.7200437159968139, 0.7051043024552256, 0.690205569180261, 0.6784067455298166, 0.6689466687725395, 0.6615643471581174, 0.6546532388273033, 0.6482153004987379, 0.6425574379781627, 0.6378112908133724, 0.6317343517082544, 0.6268690634318065, 0.6235373836285942, 0.6208529899036425, 0.6184094301681973, 0.6151944212041418, 0.6116080551316987]";"[0.8783595051184261, 0.8457359040836883, 0.8292050874530705, 0.8191393480053346, 0.8124258682654404, 0.8080158855813104, 0.8043227992752756, 0.8016741286497375, 0.7992350886161084, 0.7972752494872919, 0.7961507724796058, 0.7948252530328783, 0.7938085881794781, 0.7934970504197352, 0.7928150921702156, 0.7925861404883434, 0.7926445428940838, 0.7925111180699275, 0.7922053684815196, 0.7919218593138709]";"[0.903541555213615, 0.8673957650057, 0.8434206736937471, 0.8259796943676154, 0.8128277445831292, 0.8025211698163064, 0.7944978283364648, 0.7883994316279559, 0.7828693753395717, 0.7785826243932039, 0.7747663820059527, 0.7717535339746835, 0.7690132798292965, 0.766722608538225, 0.7648188077207017, 0.763181133739049, 0.7616582185393306, 0.7602997233064395, 0.7590830597164305, 0.7579737468967126]";0.373725076225946;0.3613528733912571;0.38885247889058844;0.2530190860372963;"[(6534, 1.9044293118974474), (2615, 3.046403307164433), (5791, 4.549947070009397), (7520, 2.9113648965738843), (6894, 3.717018980828351), (4414, 4.506858895324095)]";"[(0.02631160744272197, 0.8522511809126604), (9.054338193845078, 0.9009415850914523), (1.4533604411232035, 0.8949158943731743), (6.697714818228009, 0.9074906144341041), (6.317641181165585, 0.8993561946203219), (2.3487510489986745, 0.8817518909952708), (13.535869486989322, 0.8975973304709775), (0.0038280017396373125, 0.8600209806105349), (0.0, 0.8155510691938481), (6.455393252989748, 0.9078951606716268), (2.4780211423002716, 0.8991102561050995), (0.20833237236163776, 0.8693500313075659), (6.929834336842119, 0.9011726734958433), (0.0, 0.8579610922022246), (5.660141125490054, 0.8921723033662173)]"
1;"[0.18035210345683084, 0.22349716249474083, 0.24457935295481775, 0.2589313172298284, 0.2643489567591532, 0.26860801121857014, 0.271701378447727, 0.2712012417652281, 0.27187811556624897, 0.27203367619209884, 0.27178105319739093, 0.27179324751487005, 0.27125037391478424, 0.27059881398485336, 0.2687281706539825, 0.2676770775976799, 0.2682857034277154, 0.2687418914969637, 0.26745881775930797, 0.26628723525914966]";"[0.661304728816774, 0.6421971843335397, 0.629969528972755, 0.6231334999951739, 0.6168980783785776, 0.6106208654664741, 0.6055493773397826, 0.6006235209924402, 0.5965368052120199, 0.5923551882047785, 0.5887592761214628, 0.5842871903674136, 0.581337958821317, 0.577996564767008, 0.5747878199225108, 0.5720483375665492, 0.5693868747512344, 0.5663564211906655, 0.5633101682411465, 0.5599687244610548]";"[0.8729861943475774, 0.8410263887871487, 0.8247057045723365, 0.8126984660311134, 0.803827702275497, 0.7964782638077701, 0.7904981253256765, 0.7860002356476259, 0.7826167389007346, 0.7802707231954323, 0.7780135831560371, 0.7761511870689594, 0.7748252805129034, 0.7734618990528926, 0.7724591905375668, 0.7714569333742809, 0.7703316718998059, 0.7694585135445148, 0.7684949484597292, 0.767444913156784]";"[0.8707892361197513, 0.8313913640861161, 0.809936351183649, 0.7936513462642016, 0.7824833793172623, 0.7726079197316265, 0.7644087635598711, 0.7576515871305665, 0.7514275133059398, 0.7467491581672637, 0.7420347975021838, 0.7380499505202788, 0.7349187381259694, 0.7318758639476215, 0.7296478038422358, 0.7274375155784502, 0.7254730118411843, 0.7237503807967884, 0.722081697146663, 0.7205016974803298]";0.3678151387457377;0.269856621129022;0.29852399698473575;0.1876153959936098;"[(5370, 3.010218518040352), (2552, 1.3560216152186255), (6388, 3.652943488018968), (6455, 4.232121850878321), (8627, 5.626309999091461), (3786, 1.939087531179484)]";"[(0.041838183280790586, 0.8588624184662093), (5.772987688157137, 0.8994153330558103), (2.1302075877208124, 0.8964079954663435), (25.356004521976942, 0.9028284077715145), (11.431842898412857, 0.8863344834298285), (5.9623746247237985, 0.8857636682363869), (8.69647326806761, 0.8947920943107914), (0.34095756941301997, 0.8527268362520196), (0.0, 0.8136382485956057), (0.2518910421635392, 0.9075675542704766), (11.399335333533706, 0.8981301021754372), (0.050771104077259134, 0.8646044732341285), (9.038619638956249, 0.8958403804654781), (0.02687804775518774, 0.8572869082824024), (4.6743570323054415, 0.8976652507415316)]"
0;"[0.1924849975814741, 0.22367863570242177, 0.23978164083029854, 0.24923288461040133, 0.25563465864430623, 0.25924407375591363, 0.26184234136713025, 0.2631481904912759, 0.2647649325319288, 0.26611323832551725, 0.267218966052315, 0.26803850156188647, 0.2691201902676451, 0.2701424313792034, 0.2706864285708518, 0.27095622285355486, 0.27113738521845543, 0.2715664882742373, 0.272019866718902, 0.2726497864280265]";"[0.888595166163142, 0.8484805624389453, 0.8210278750590786, 0.8026013555563098, 0.7868582820149617, 0.7730648536438319, 0.761490511931096, 0.7517195532123557, 0.7442570631234562, 0.7359457156748962, 0.728436461886293, 0.7223574975074277, 0.7154943802016415, 0.7091107978068703, 0.7021681622100975, 0.6955664441002988, 0.6880930383272867, 0.6828146667356959, 0.6777158075379904, 0.673888740406436]";"[0.8840819701026368, 0.8525105168096179, 0.833493516632128, 0.8226221088904783, 0.8157659996907999, 0.8115708128143322, 0.8081462438569407, 0.8056956240093536, 0.8036877483397106, 0.8020319670606885, 0.800397171607881, 0.7991465334412308, 0.7978299905321828, 0.7967578906875389, 0.7957245008517819, 0.794539259490917, 0.7935197434715706, 0.7926263899414805, 0.7914433555778699, 0.7905859833280622]";"[0.8885324546131976, 0.8534354670827804, 0.8331512626872083, 0.8189860713123946, 0.8078778191156388, 0.7993426302601482, 0.7923845056629906, 0.78651554347863, 0.7816957466897104, 0.777497265912048, 0.7739053196757786, 0.7706383604568426, 0.7676439181707243, 0.7650674101280551, 0.7627459753116899, 0.7606451818620777, 0.7589713178683348, 0.7571652457283939, 0.7554446895656366, 0.7538533586662023]";0.3787316662358369;0.3376429145883487;0.3683382266370167;0.23554829326792706;"[(3110, 3.1363787747644), (1534, 2.462795575684547), (3823, 2.925716914792569), (4106, 5.007710423690319), (3826, 3.5176939722390315), (1475, 1.9425009141096405)]";"[(0.0, 0.8509455721462811), (1.9718186805035258, 0.8906329298666844), (4.837213119159272, 0.8934333448597414), (10.102866362964392, 0.9005438648062095), (7.40444187051509, 0.8913533257384344), (3.321774857220492, 0.8841558820202545), (5.214095970715271, 0.8910185077894757), (0.0, 0.8557492465026255), (0.0, 0.8109105022096184), (0.21214915357544736, 0.9035215237509672), (6.895804261776195, 0.8989295696431738), (0.0, 0.8600623400936203), (2.2160312428909155, 0.8927894768412413), (0.0, 0.8545648174331336), (2.1712737568858125, 0.8849948818430268)]"
