wave;neighbourhood_preservation;neighbourhood_hit;trustworthiness;continuity;stress;spearman;pearson;kendall;cluster_size;cluster_adjacency
4;"[0.46837873323146856, 0.4803486015848475, 0.48743296980025264, 0.4873750793812395, 0.4855651675656807, 0.48182286641742333, 0.4738229815294609, 0.46468802064350634, 0.45388061405204516, 0.4432619706558034, 0.4331125895239304, 0.42602120079320016, 0.4197674694824987, 0.41327369300384464, 0.40862115591722253, 0.40449215475523514, 0.40151057639544313, 0.39963708354793415, 0.39840787245005393, 0.39789774130253475]";"[0.8959320972820064, 0.8724148785568443, 0.856111305835141, 0.8415496242813084, 0.828928532325671, 0.8175547100404917, 0.8062264148999384, 0.7953298648667576, 0.786278285118683, 0.7778393015537002, 0.7678198929414685, 0.7583620845496679, 0.7495297227018646, 0.7412607007245777, 0.7341161442456511, 0.7276969180618691, 0.7209349815552903, 0.7146785980283692, 0.7097058925020832, 0.705387373456018]";"[0.9173070318172212, 0.8860625925329959, 0.8669515044651911, 0.8551195436769328, 0.8463448343500761, 0.8399392464535174, 0.8348474438537201, 0.8308762562250731, 0.8272538068237774, 0.8242671591175533, 0.821740370670553, 0.8194339856751401, 0.8172415226644189, 0.815239739767712, 0.8136693210059589, 0.8120924753825705, 0.8106748339440312, 0.8095680251837821, 0.8085248311629577, 0.807443666686446]";"[0.9151236632098078, 0.8782246054482886, 0.8547883611356605, 0.8394370117141831, 0.8269121421199473, 0.8163427974128871, 0.8074881875827021, 0.8000902385774019, 0.7935504807023629, 0.7879347487671782, 0.7832760684575082, 0.778855306879026, 0.7752005554992717, 0.7719587490990805, 0.7691071170243508, 0.7664224478504932, 0.7640367108263001, 0.7620641471087178, 0.7600377263980034, 0.758096183045276]";0.37949027519930617;0.37780465708400246;0.4073852595093589;0.26675529238761697;"[(10075, 4.508975670538231), (5876, 2.1921077455752593), (7885, 2.623475190732248), (9127, 4.153889056699154), (8358, 3.327030062447318), (8106, 2.9832527782838407)]";"[(0.011268362775404063, 0.864186157988643), (7.55095076465184, 0.9031653897119376), (3.195840449878616, 0.9108599645342818), (2.7851690429570404, 0.9030529749890951), (2.6726272833632496, 0.8992094668143896), (3.779573808606245, 0.8929525188971478), (0.0, 0.8608881538089413), (0.0, 0.8263328146309586), (5.264660182338491, 0.9018046363122979), (2.1338735063647265, 0.8989622321380358), (0.02323255519961464, 0.8705041851733119), (0.8323505433324146, 0.90844982203917), (8.993107312548052, 0.9068771923474782), (5.3259130351268835, 0.8987581261028715), (0.2323611463456946, 0.8686221383408365)]"
3;"[0.4457974408728598, 0.45722339940554135, 0.4570888342187267, 0.45196897131885416, 0.44828242999943546, 0.4454370123462842, 0.4414788895047838, 0.43721601945364286, 0.43236287553111274, 0.4224042961192717, 0.4109686729432033, 0.40310726253395546, 0.3963501342057013, 0.39097471945496093, 0.38628340621074025, 0.3824046455171768, 0.37924598751319255, 0.37690437670437393, 0.3740864641933561, 0.37154877666957853]";"[0.8339547509762281, 0.7880189390169342, 0.7571088770908045, 0.7319947818174062, 0.7129324699562741, 0.6950086718445279, 0.6808675868240521, 0.6688553617430201, 0.6584468593911532, 0.6497514948075704, 0.6386486212180923, 0.6292186724882892, 0.6214867249871673, 0.6147358576014745, 0.6078039595111957, 0.6021358104316274, 0.5976296666371472, 0.5931173703231052, 0.5881829856036721, 0.5833675009043522]";"[0.9092670408996237, 0.8782152874161048, 0.8619977093948773, 0.8501860698156196, 0.8410751728519518, 0.834244203996724, 0.8293942427051879, 0.8252331175240221, 0.8218791982521264, 0.8190356069835856, 0.8165229691624158, 0.8147056714581449, 0.8131688496600529, 0.8119334320213134, 0.8108281946233991, 0.8098517421982011, 0.8090424467516041, 0.808144303973109, 0.8073913149557871, 0.806706288400185]";"[0.91475201498282, 0.8786616470597263, 0.8569513958182018, 0.8400990543955021, 0.8275465459791042, 0.8172255843793772, 0.8086610787518105, 0.801242464941072, 0.7952555761853833, 0.7900519395274375, 0.7855834996239082, 0.7819304763609801, 0.7787120078707404, 0.7756171858813867, 0.7727453584497729, 0.7702547203825362, 0.7680241282292619, 0.7660271787319748, 0.7641585199191974, 0.7626158234190796]";0.37985733414804307;0.3762336985151068;0.40601748422145817;0.26524850051602245;"[(8971, 4.503322642291218), (6339, 2.878503374070638), (9151, 3.9310064895711045), (14497, 6.459265247698326), (3886, 0.7530019046149986), (10236, 2.265691404777498)]";"[(0.08657391022579124, 0.8637596720733984), (3.7627033897008912, 0.8975826702344475), (6.722266070382471, 0.9075760585788597), (0.763713795937555, 0.8758946372102194), (6.248988798459642, 0.897962828620817), (6.936281038802433, 0.899746378350344), (0.0, 0.8518228127061832), (0.0, 0.8039093390721471), (4.019361043242993, 0.889095991333251), (4.064112473300757, 0.8934901949577121), (0.04589618198400373, 0.845153578752955), (12.375752772553657, 0.907803969781118), (8.556633462980702, 0.8986037186467689), (4.531300989718192, 0.8976936990123551), (0.05008153588329129, 0.8527167252507388)]"
2;"[0.4708639660128518, 0.48320079803618976, 0.48470094720018303, 0.4838303628291687, 0.480735744600479, 0.47644248767222386, 0.47357174882541503, 0.4713760316324307, 0.4685643002354273, 0.46567301240144465, 0.4597144031737684, 0.45328713064810355, 0.4469845609444284, 0.44004819293878084, 0.43387722041134225, 0.42791352244493314, 0.42231047552107936, 0.41739786825326985, 0.41348462686130844, 0.4087705956556126]";"[0.8398504924357801, 0.7938418733994427, 0.762179479976365, 0.7370011079265254, 0.7140949787285643, 0.6935102625401132, 0.6770657407072789, 0.6637845165705863, 0.649815652898067, 0.6395890946980287, 0.6280393751684925, 0.6200656860014317, 0.6133579562792886, 0.6061356607551334, 0.5993263483979336, 0.5932846569621031, 0.5868497647815345, 0.5807026733475792, 0.575450658657519, 0.5702999474529856]";"[0.9066498556160463, 0.8678793252119712, 0.8467080177204742, 0.834010743671587, 0.825356764431868, 0.8188814989580997, 0.814070822745526, 0.8102410907157639, 0.8072578458405649, 0.8048697481402348, 0.8027492607151219, 0.8008624831948638, 0.7993287894938168, 0.7980643713583314, 0.7969003078583418, 0.796074161288398, 0.7952917009432907, 0.79462785007483, 0.7937725392445052, 0.7930772975345693]";"[0.9150451068532195, 0.8811629010675504, 0.8594391661962779, 0.8436155425239061, 0.831432033318723, 0.8219244621867992, 0.8139811145566134, 0.8072172361264439, 0.8013826858291623, 0.7963547060824099, 0.7919366392384581, 0.7881810294087688, 0.7846570951090451, 0.7816781348069234, 0.7790470592118636, 0.7766672463267932, 0.7745446113853172, 0.7725754158553751, 0.7706701032864012, 0.7689140568323847]";0.38290418887794114;0.35580484353181874;0.37320155645438097;0.2461333074488142;"[(5639, 3.8848276933375665), (4264, 1.1992731887951071), (5556, 2.535101107004954), (8187, 6.541519462036595), (2990, 0.1385977922270271), (7132, 6.334202828001597)]";"[(0.2775552858245199, 0.871999162357297), (3.420816302801733, 0.8998205317797904), (5.527984209034465, 0.9079984478096258), (1.7025771823845826, 0.8856701770351416), (6.180851180779911, 0.9012850706232165), (7.859347456973954, 0.8998298149323493), (0.0, 0.8602760213193429), (0.0, 0.8207173189699937), (4.894227545875328, 0.8942827741276663), (2.097819166701029, 0.8976046946810895), (0.03593835035008883, 0.8581554392896834), (8.11300572270688, 0.9088064206646098), (4.509306873371111, 0.9032487630405606), (6.206162275021727, 0.9021763960457718), (0.0, 0.8649842377442152)]"
1;"[0.48336485772089344, 0.49247731367659864, 0.4916556601043182, 0.49643652236067987, 0.4992638876071786, 0.5006337432947212, 0.4977509593080459, 0.48890390612199885, 0.48015746191558994, 0.4714491579243342, 0.4630620984257428, 0.454827409064848, 0.44704274218111284, 0.4384634338778194, 0.43064868314624166, 0.4237680093554867, 0.4180877452145131, 0.41272778556029355, 0.4068645064703942, 0.4024564112670125]";"[0.8729943732917346, 0.8391955604023842, 0.8173033918706333, 0.7969474002628684, 0.7812227443655552, 0.7671887616008911, 0.7557838492894128, 0.7447691309374991, 0.7358401679978834, 0.7276891375328937, 0.7200065793439534, 0.7113064266416174, 0.7024655674664717, 0.6941730635303148, 0.688334907550213, 0.6828319062536016, 0.6777121385657163, 0.6735056562509628, 0.6695021658069462, 0.6660225129198568]";"[0.9030940611101667, 0.8646740010242242, 0.8451123027524762, 0.8311181677144799, 0.8225968339426645, 0.8163017764409755, 0.8111888179696649, 0.8076776368931695, 0.8042051417109988, 0.801283001144714, 0.798507758639437, 0.7965242220648597, 0.7949651340949672, 0.793607306385131, 0.7923732459134862, 0.7913517288534109, 0.7904064055655537, 0.7895667385510695, 0.7887946600241549, 0.7880612941557377]";"[0.9163180423479351, 0.8830484258747079, 0.8631721932337404, 0.8474904805462169, 0.8360174180740039, 0.8260711379358675, 0.8179364500468351, 0.8111430645429714, 0.8049946591152721, 0.799791691567046, 0.7948438830798393, 0.7905574849137448, 0.7868556374568618, 0.7832768334235846, 0.7802692566464735, 0.7773371717069679, 0.7747683897325807, 0.7723478119580147, 0.7700033899917782, 0.7678245241083335]";0.3642511005121645;0.3115160772127864;0.3341341031269276;0.21463665413602487;"[(6182, 3.523748078192149), (3153, 0.10212195479698596), (6647, 4.945480137948618), (6077, 1.618650005971779), (4994, 5.369051733399547), (6125, 3.971931072465353)]";"[(0.010518221764096721, 0.8685437794005664), (2.6784581725508727, 0.9019023325221195), (0.43666593940409404, 0.9073500994030235), (5.865538593723699, 0.900922362913758), (6.575966229248536, 0.9073662472639044), (4.376389262894466, 0.9030824849627096), (0.09529482680636325, 0.8710356654040273), (0.0, 0.8336706332172769), (1.9707320277949398, 0.8924802028936756), (5.358973478387207, 0.9038455861610787), (0.07949625922410636, 0.870596341739351), (5.788458607856746, 0.910393293614744), (5.906363100138007, 0.9019678378776534), (2.322046729516706, 0.905646749901002), (0.6763144502539563, 0.8819555372158017)]"
0;"[0.46219867623495975, 0.4946640160689707, 0.5001228593720205, 0.4971938081417946, 0.4943356079157253, 0.4864363334462739, 0.4778672575476537, 0.4700908554598648, 0.46569310929632374, 0.4624734889420221, 0.45948416977985734, 0.45618089485224056, 0.45345497870509693, 0.45152962811263303, 0.4484187177844685, 0.44581617692261427, 0.44342948343583366, 0.4409171449648649, 0.43889830633506427, 0.43542749878370357]";"[0.9008641297160934, 0.8780803954774559, 0.8611992070530196, 0.8457234348303292, 0.8318385650224215, 0.816298041514482, 0.8047950683272939, 0.7958737931784552, 0.7872654184598993, 0.7807799840537976, 0.7728970409977787, 0.7630019798623532, 0.7553086162524646, 0.7487659841109993, 0.7424439567853915, 0.736596339330182, 0.7305864370753375, 0.724827384839259, 0.7188112890218441, 0.7131149851874655]";"[0.918747704097636, 0.8851170772305228, 0.8643859176908137, 0.8513044436578351, 0.8427224206615891, 0.8358142485241015, 0.8300468733553658, 0.8261204892480087, 0.8230604015308775, 0.819947289290813, 0.8172628033349998, 0.8148690988164624, 0.8129576358475197, 0.8112720238513766, 0.8097966589697199, 0.8082849817330352, 0.8071703142153597, 0.8059841536016815, 0.80501026884456, 0.804097932754156]";"[0.9289104994509021, 0.9006611233398379, 0.8814693202684293, 0.8673044584069242, 0.8565884261996681, 0.8474197980883442, 0.8397826086870893, 0.8330215494875344, 0.8271557081415694, 0.8216374615137287, 0.8162957172097913, 0.8116722424077885, 0.807514432953815, 0.8036982414212567, 0.7999455534749124, 0.7965729462461464, 0.7937826568267242, 0.7909229781323344, 0.7882875004506391, 0.785805278414931]";0.35327875221496124;0.37057388238933386;0.4025796565138019;0.2608598917770961;"[(3527, 3.9095321386057003), (1572, 2.3914473231188182), (4286, 3.5723317905190837), (4140, 5.636412740168193), (1536, 1.5070211220337888), (2813, 2.902251802509629)]";"[(0.014926447647852541, 0.8648288278249656), (6.768845378676112, 0.9071888559676904), (0.16361462294540213, 0.9119259597170187), (3.780701594893306, 0.8916664120088112), (1.9490733432583416, 0.8979128050988907), (3.929007468407737, 0.89179390310149), (0.0, 0.860785498814955), (0.0, 0.8150638010237011), (5.655977303010574, 0.9002860958876245), (2.5770120623174066, 0.903000836728632), (0.0, 0.8629824860221622), (2.461936909910563, 0.9098483553210218), (4.5411386222843, 0.8984664615666553), (4.852511843655046, 0.9003496599863322), (0.0, 0.8556398038229548)]"
