start	end	text
1540	8920	There are three tasks. So you may start with task one, which task one is you have to look
8920	14840	at the model cluster performance metrics and find the best and worst performing models.
16760	27160	Okay. The model cluster thing, if I remember correctly, was this one. And like you said,
27160	33620	it was the best was on this side and the worst was on this side. So the best one is the rich
33620	43760	regression and the worst one is the LSTM. Okay. Yeah, that's perfect. Now, task two would be find
43760	56600	a cluster that is problematic, then locate it and locate it both on the cluster graph and the
56600	62840	cluster that's problematic. Then there are multiple things that I can look at. I should look
62840	71820	for red because red is problematic. There is no red in the total here. So then I'll look for the
71820	81900	highest, which are cluster one and cluster three. And it was the most problematic one or multiple.
83760	91020	One. Okay, then it's probably cluster three. And if I look here and I want to select cluster three,
91200	102600	then I see here that there is a very high variance. And if I compare it, for example,
102740	107260	to cluster one, okay, that's also hard. So maybe that's not the thing to look at. Well,
107260	115260	it's quite higher, a lot higher, actually. Yeah, okay. Yeah, you found it. So now, with the knowledge
115260	121420	that I gave you earlier in the data set, and looking at the cluster plot and stats, which you've
121420	129480	already started to do, try to give a semantic meaning to the cluster. Semantic meaning. Yeah.
132480	143100	So as in Fahrenheit, what? Oh, okay. Well, what I see with the, if I compare these clusters to
143100	148520	the other clusters, is that you see in this cluster that the deviation between the time series is a
148520	154980	lot. So what's probably the thing is that this is a city that has a climate which just varies a lot,
154980	168640	which makes it harder for models to predict the correct Fahrenheit. So what you mean with
168640	179020	semantic? Yeah, that's very valid. Okay. That's task two for you. Now, task three is find the
179020	192220	worst model cluster pair by looking at the matrix. Okay. Okay, cluster one with the LSTM is the worst
192220	209000	cluster model pair. All right. So now, with this information, you have to filter the dimensionality
209340	218300	All right. Have you filtered correctly, according to? Oh, no, I had to filter cluster one. Yes. I felt
218300	227780	like I didn't say nothing changed. Okay. So now, your task is inside this cluster, find any instances
227780	237600	that are performing noticeably worse than the rest. Let's see. Noticeably worse is red. Okay, so
239420	252740	in cluster one, I have to look. Okay. So this one is quite worse. Let's see. This one is 78. 78. Yeah,
252740	261260	there are like a few dots here. Like when you put your mouse on it, you see that they're all like 87,
261520	268940	86. Some about 80. So there's like some points around here that are worse. Okay.
269000	278520	The worst. Now, please select them. And then try to also give them a meaning as before. And compare
278520	285840	them with the total instances of the cluster also. Okay. So I want to select a few bad ones, but
285840	296220	they're like, so here's the red thing. And here are some red ones that are very terrible as well. So I
296220	305700	will select them, which I'm going to do now. I will select some points that are quite all right. But
305700	315200	that happens. Okay. So yeah. Now try to give them a meaning as before and compare them also with
315200	323800	the total instances of the cluster. Okay. What I see here is that that when I look at the selection
323800	336600	graph, I again see like the very high tops, low lows. And when I compare that to the other one, I
336600	346500	think these are like the shape is quite similar. I don't see lines that are extremely deviating. That's
346500	352160	interesting. I thought I would see the lines that are like extremely underneath it. But the pattern
352160	361540	is the same, that they've just very different. So I think these are just time points, time series
361540	370260	where where the weather was just very harsh in the winter, very like soft in the winter in them. Very
370260	375700	hot summers is what you see here. Yeah, they're very hot summers. That's that's what I see, because
375700	381580	the winters are like around 50. I don't know if that's bad. But they're not like around the zero,
381580	388800	which is out. I'm comparing the wrong cluster. Yeah, but they're not extremely there. But you see,
390260	396800	what do I see? I actually see a very similar graph with the other points. So, oh, that's what I see. I
396800	407580	see that these points define the way this cluster is is like averaged, because the lines are very
407580	414860	similar. So these are probably like extreme points with like hot summers or soft winters,
415200	421860	which is what defines the meaning of this cluster. Okay, thank you very much. That was very nice.
422180	425600	Okay, that's it for the task tree and for the think-alert protocol.
