0, Transform(position = float3(1.47285, 1.26993, -0.558769), target = float3(0.648815, 1.17788, -1.11777), up = float3(-0.031992, 0.999478, -0.004434))
15, Transform(position = float3(1.47285, 1.26993, -0.558769), target = float3(0.86182, 1.73725, -1.19772), up = float3(0.000873484, 0.999999, 0.000913397))
30, Transform(position = float3(1.47285, 1.26993, -0.558769), target = float3(0.648815, 1.17788, -1.11777), up = float3(-0.031992, 0.999478, -0.004434))
