,Implemented design strategies (from table 1),Design strategy category (to be added),Product (sold where) (to be added),Future potential design,Ecosystem service 1,Ecosystem service 2,Ecosystem service 3,Ecosystem service 4,Ecosystem service 5,Ecosystem service 6,Ecosystem service 7,Ecosystem service 8,Ecosystem service 9,Ecosystem service 10,Ecosystem service 11,Ecosystem service 12,Ecosystem service 13,Ecosystem service 14,Ecosystem service 15,Ecosystem service 16,Ecosystem service 17,Ecosystem service 18,Ecosystem service 19,Ecosystem service 20
0,Aeroponic systems,,,,Food/nutrition for humans,Habitat,Primary production,,,,,,,,,,,,,,,,,
1,Agroforestry and agrosilvopasture,,,,Food/nutrition for humans,Regulation of temperature,Primary production,Food/nutrition for non-humans,Soil,Regulation of air quality,Regulation of soil quality,Regulation of biogeochemical cycles (nutrient cycling and storage),Pest and disease regulation,Control of invasive species and other natural hazards,"Organisms (plants, animals, fungi, protists, bacteria) and genes to produce genetic library for food, fibers, pharmaceuticals, and materials","Seeds, spores and other organism (plant, animal and fungi, protists and bacteria) material to maintain species and genetic diversity",Regulation of smell,Regulation of light,Spiritual and artistic inspiration,Aesthetic values,,,,
2,Airdrop irrigation systems,,,,"Fresh water (<3,000 Mg/L TDS)","Regulation of humidity, ventilation and transpiration",Regulation of drought,,,,,,,,,,,,,,,,,
3,Aquaponic systems,,,,Food/nutrition for humans,Habitat,Primary production,Food/nutrition for non-humans,,,,,,,,,,,,,,,,
4,Beehives,,,,Pollination and seed dispersal,Habitat,Food/nutrition for non-humans,"Organisms (plants, animals, fungi, protists, bacteria) and genes to produce genetic library for food, fibers, pharmaceuticals, and materials","Seeds, spores and other organism (plant, animal and fungi, protists and bacteria) material to maintain species and genetic diversity",,,,,,,,,,,,,,,
5,Biofilters,,,,Fresh air,"Fresh water (<3,000 Mg/L TDS)",Regulation of air quality,Regulation of water quality,,,,,,,,,,,,,,,,
6,Biomass energy collection,,,,Biomass energy,,,,,,,,,,,,,,,,,,,
7,Biophilic design,,,,Relaxation and psychological wellbeing,Ornamental resources,Aesthetic values,Educational values and knowledge ,Spiritual and artistic inspiration,Sense of place,Cultural heritage and historical values,,,,,,,,,,,,,
8,Bioremediation,,,,Soil,Regulation of soil quality,Regulation of air quality,Regulation of smell,,,,,,,,,,,,,,,,
9,Black/greywater treatment,,,,Regulation of water quality,Reclaimed and recycled water ,Regulation of smell,,,,,,,,,,,,,,,,,
10,Green roofs,,,,Regulation of temperature,Habitat,Primary production,Food/nutrition for non-humans,Soil,Regulation of air quality,"Organisms (plants, animals, fungi, protists, bacteria) and genes to produce genetic library for food, fibers, pharmaceuticals, and materials","Seeds, spores and other organism (plant, animal and fungi, protists and bacteria) material to maintain species and genetic diversity",Regulation of light,Aesthetic values,,,,,,,,,,
11,Blue roofs,,,,Regulation of temperature,Habitat,Food/nutrition for non-humans,Regulation of air quality,Regulation of light,Aesthetic values,,,,,,,,,,,,,,
12,Botanical garden,,,,Regulation of temperature,Habitat,Primary production,Food/nutrition for non-humans,Soil,Regulation of air quality,"Organisms (plants, animals, fungi, protists, bacteria) and genes to produce genetic library for food, fibers, pharmaceuticals, and materials","Seeds, spores and other organism (plant, animal and fungi, protists and bacteria) material to maintain species and genetic diversity",Regulation of light,Aesthetic values,Educational values and knowledge ,Recreation ,Spiritual and artistic inspiration,Aesthetic values,Sense of place,Cultural heritage and historical values,Relaxation and psychological wellbeing,,,
13,Burning hydrogen,,,,Hydrogen energy,,,,,,,,,,,,,,,,,,,
14,Cisterns,,,,"Fresh water (<3,000 Mg/L TDS)",,,,,,,,,,,,,,,,,,,
15,Coated glass,,,,Regulation of temperature,Regulation of light,,,,,,,,,,,,,,,,,,
16,Community gardens,,,,Food/nutrition for humans,Primary production,Food/nutrition for non-humans,Soil,Regulation of air quality,"Organisms (plants, animals, fungi, protists, bacteria) and genes to produce genetic library for food, fibers, pharmaceuticals, and materials","Seeds, spores and other organism (plant, animal and fungi, protists and bacteria) material to maintain species and genetic diversity",Regulation of light,Spiritual and artistic inspiration,Recreation ,Aesthetic values,Social relations,Educational values and knowledge ,Sense of place,Cultural heritage and historical values,Cultural diversity,Relaxation and psychological wellbeing,,,
17,Compact construction,,,,Aesthetic values,Educational values and knowledge ,Recreation ,Social relations,Sense of place,,,,,,,,,,,,,,,
18,Compaction reduction,,,,Regulation of soil quality,,,,,,,,,,,,,,,,,,,
19,Companion planting,,,,Pest and disease regulation,Control of invasive species and other natural hazards,Primary production,Educational values and knowledge ,,,,,,,,,,,,,,,,
20,Composting,,,,Regulation of biogeochemical cycles (nutrient cycling and storage),Food/nutrition for non-humans,Soil,Habitat,,,,,,,,,,,,,,,,
21,Cradle to cradle design,,,,Recycling of materials ,Educational values and knowledge ,,,,,,,,,,,,,,,,,,
22,Cross ventilation,,,,Regulation of temperature,"Regulation of humidity, ventilation and transpiration",,,,,,,,,,,,,,,,,,
23,Delayed drainage systems,,,,Regulation of flood events,,,,,,,,,,,,,,,,,,,
24,Design for deconstruction,,,,Recycling of materials ,,,,,,,,,,,,,,,,,,,
25,Downspout strategies,,,,Regulation of flood events,"Regulation of humidity, ventilation and transpiration",,,,,,,,,,,,,,,,,,
26,Drip irrigation systems,,,,Regulation of drought,,,,,,,,,,,,,,,,,,,
27,Dynamic/aerodynamic architecture,,,,Regulation of wind,Aesthetic values,Spiritual and artistic inspiration,,,,,,,,,,,,,,,,,
28,Ecological analogue design,,,,Educational values and knowledge ,,,,,,,,,,,,,,,,,,,
29,Green facades,,,,Food/nutrition for humans,Primary production,Food/nutrition for non-humans,Soil,Regulation of air quality,"Organisms (plants, animals, fungi, protists, bacteria) and genes to produce genetic library for food, fibers, pharmaceuticals, and materials","Seeds, spores and other organism (plant, animal and fungi, protists and bacteria) material to maintain species and genetic diversity",Regulation of light,Spiritual and artistic inspiration,Recreation ,Aesthetic values,Social relations,Educational values and knowledge ,Sense of place,Relaxation and psychological wellbeing,,,,,
30,Elevated constructions,,,,Regulation of flood events,Regulation of temperature,Aesthetic values,,,,,,,,,,,,,,,,,
31,Extensive green roof,,,,Habitat,Regulation of temperature,"Regulation of humidity, ventilation and transpiration",Primary production,Soil,Regulation of air quality,"Organisms (plants, animals, fungi, protists, bacteria) and genes to produce genetic library for food, fibers, pharmaceuticals, and materials","Seeds, spores and other organism (plant, animal and fungi, protists and bacteria) material to maintain species and genetic diversity",Regulation of light,Aesthetic values,,,,,,,,,,
32,Façade cladding,,,,Regulation of temperature,"Regulation of humidity, ventilation and transpiration",Protection against harmful cosmic radiation,Regulation of wind,Regulation of light,Aesthetic values,,,,,,,,,,,,,,
33,Fit form to function,,,,Aesthetic values,,,,,,,,,,,,,,,,,,,
34,Floating contructions,,,,Regulation of flood events,,,,,,,,,,,,,,,,,,,
35,Fog harvesting,,,,"Fresh water (<3,000 Mg/L TDS)",,,,,,,,,,,,,,,,,,,
36,Food forests,,,,Food/nutrition for humans,Food/nutrition for non-humans,Habitat,Regulation of air quality,"Organisms (plants, animals, fungi, protists, bacteria) and genes to produce genetic library for food, fibers, pharmaceuticals, and materials","Seeds, spores and other organism (plant, animal and fungi, protists and bacteria) material to maintain species and genetic diversity",Regulation of temperature,"Regulation of humidity, ventilation and transpiration",Primary production,Regulation of light,Spiritual and artistic inspiration,Recreation ,Aesthetic values,Social relations,Educational values and knowledge ,Sense of place,Relaxation and psychological wellbeing,,,
37,Green corridors,,,,Habitat,Soil,Regulation of temperature,"Regulation of humidity, ventilation and transpiration",Primary production,Regulation of air quality,"Organisms (plants, animals, fungi, protists, bacteria) and genes to produce genetic library for food, fibers, pharmaceuticals, and materials","Seeds, spores and other organism (plant, animal and fungi, protists and bacteria) material to maintain species and genetic diversity",Regulation of light,Spiritual and artistic inspiration,Recreation ,Aesthetic values,Social relations,Educational values and knowledge ,Sense of place,Relaxation and psychological wellbeing,,,,
38,Green façade,,,,Habitat,Regulation of temperature,"Regulation of humidity, ventilation and transpiration",Primary production,Regulation of air quality,"Organisms (plants, animals, fungi, protists, bacteria) and genes to produce genetic library for food, fibers, pharmaceuticals, and materials","Seeds, spores and other organism (plant, animal and fungi, protists and bacteria) material to maintain species and genetic diversity",Regulation of light,Spiritual and artistic inspiration,Aesthetic values,Educational values and knowledge ,Sense of place,Relaxation and psychological wellbeing,,,,,,,
39,Green wall system,,,,Habitat,Regulation of temperature,"Regulation of humidity, ventilation and transpiration",Primary production,Regulation of air quality,"Organisms (plants, animals, fungi, protists, bacteria) and genes to produce genetic library for food, fibers, pharmaceuticals, and materials","Seeds, spores and other organism (plant, animal and fungi, protists and bacteria) material to maintain species and genetic diversity",Spiritual and artistic inspiration,Aesthetic values,Educational values and knowledge ,Sense of place,Relaxation and psychological wellbeing,,,,,,,,
40,Greenhouse agriculture,,,,Habitat,Soil,Primary production,"Organisms (plants, animals, fungi, protists, bacteria) and genes to produce genetic library for food, fibers, pharmaceuticals, and materials","Seeds, spores and other organism (plant, animal and fungi, protists and bacteria) material to maintain species and genetic diversity",Regulation of light,Educational values and knowledge ,,,,,,,,,,,,,
41,Heat-cold storage installation,,,,Regulation of temperature,,,,,,,,,,,,,,,,,,,
42,Hedgerows consisting of edible plants,,,,Habitat,Soil,Pollination and seed dispersal,Regulation of air quality,Food/nutrition for humans,Food/nutrition for non-humans,"Organisms (plants, animals, fungi, protists, bacteria) and genes to produce genetic library for food, fibers, pharmaceuticals, and materials","Seeds, spores and other organism (plant, animal and fungi, protists and bacteria) material to maintain species and genetic diversity",Regulation of light,Spiritual and artistic inspiration,Recreation ,Aesthetic values,Social relations,Educational values and knowledge ,Sense of place,Relaxation and psychological wellbeing,,,,
43,Herb gardens,,,,Habitat,Soil,Pollination and seed dispersal,Regulation of air quality,Food/nutrition for humans,Food/nutrition for non-humans,"Organisms (plants, animals, fungi, protists, bacteria) and genes to produce genetic library for food, fibers, pharmaceuticals, and materials","Seeds, spores and other organism (plant, animal and fungi, protists and bacteria) material to maintain species and genetic diversity",Regulation of light,Spiritual and artistic inspiration,Recreation ,Aesthetic values,Social relations,Educational values and knowledge ,Sense of place,Relaxation and psychological wellbeing,,,,
44,High albedo materials,,,,Regulation of temperature,Protection against harmful cosmic radiation,Regulation of light,,,,,,,,,,,,,,,,,
45,Hydro turbines,,,,Fresh water as energy source,Marine water as  energy source,,,,,,,,,,,,,,,,,,
46,Hydrogen burning system,,,,Hydrogen energy,,,,,,,,,,,,,,,,,,,
47,Hydronic radiant system,,,,Regulation of temperature,,,,,,,,,,,,,,,,,,,
48,Hydroponics system,,,,Food/nutrition for humans,Food/nutrition for non-humans,,,,,,,,,,,,,,,,,,
49,Increase of native plants,,,,Habitat,Pest and disease regulation,Control of invasive species and other natural hazards,Pollination and seed dispersal,"Organisms (plants, animals, fungi, protists, bacteria) and genes to produce genetic library for food, fibers, pharmaceuticals, and materials","Seeds, spores and other organism (plant, animal and fungi, protists and bacteria) material to maintain species and genetic diversity",Aesthetic values,Educational values and knowledge ,Sense of place,Cultural heritage and historical values,,,,,,,,,,
50,Increase species diversity,,,,Habitat,Pest and disease regulation,Control of invasive species and other natural hazards,Pollination and seed dispersal,"Organisms (plants, animals, fungi, protists, bacteria) and genes to produce genetic library for food, fibers, pharmaceuticals, and materials","Seeds, spores and other organism (plant, animal and fungi, protists and bacteria) material to maintain species and genetic diversity",Aesthetic values,Educational values and knowledge ,Sense of place,Cultural heritage and historical values,,,,,,,,,,
51,Indoor (food) gardens,,,,Habitat,Soil,Food/nutrition for humans,"Organisms (plants, animals, fungi, protists, bacteria) and genes to produce genetic library for food, fibers, pharmaceuticals, and materials","Seeds, spores and other organism (plant, animal and fungi, protists and bacteria) material to maintain species and genetic diversity",Spiritual and artistic inspiration,Recreation ,Aesthetic values,Social relations,Educational values and knowledge ,Sense of place,Relaxation and psychological wellbeing,,,,,,,,
52,Infiltration systems for excess rain water,,,,Regulation of flood events,,,,,,,,,,,,,,,,,,,
53,Insect attracting structures,,,,Habitat,Pollination and seed dispersal,Aesthetic values,,,,,,,,,,,,,,,,,
54,Insulation material,,,,Regulation of temperature,Relaxation and psychological wellbeing,,,,,,,,,,,,,,,,,,
55,Integration of retaining walls,,,,Attenuation of erosion and mass movement,,,,,,,,,,,,,,,,,,,
56,Increased biodiversity,,,,Regulation of temperature,Relaxation and psychological wellbeing,,,,,,,,,,,,,,,,,,
57,Intensive green roof,,,,Habitat,Soil,Regulation of temperature,"Regulation of humidity, ventilation and transpiration",Primary production,Pollination and seed dispersal,Regulation of air quality,"Organisms (plants, animals, fungi, protists, bacteria) and genes to produce genetic library for food, fibers, pharmaceuticals, and materials","Seeds, spores and other organism (plant, animal and fungi, protists and bacteria) material to maintain species and genetic diversity",Regulation of light,Spiritual and artistic inspiration,Recreation ,Aesthetic values,Social relations,Educational values and knowledge ,Sense of place,Relaxation and psychological wellbeing,,,
58,Intercropping,,,,Habitat,Food/nutrition for humans,Food/nutrition for non-humans,Regulation of soil quality,Regulation of biogeochemical cycles (nutrient cycling and storage),Pest and disease regulation,Control of invasive species and other natural hazards,"Organisms (plants, animals, fungi, protists, bacteria) and genes to produce genetic library for food, fibers, pharmaceuticals, and materials","Seeds, spores and other organism (plant, animal and fungi, protists and bacteria) material to maintain species and genetic diversity",,,,,,,,,,,
59,Interlocking panels,,,,Regulation of wind,Regulation of temperature,Regulation of weathering processes ,"Regulation of humidity, ventilation and transpiration",Aesthetic values,,,,,,,,,,,,,,,
60,Introduction of keystone species in property,,,,Habitat,Pest and disease regulation,,,,,,,,,,,,,,,,,,
61,Keep open/pervious surfaces,,,,Habitat,Soil,Regulation of flood events,,Aesthetic values,,,,,,,,,,,,,,,
62,Leakage control,,,,"Regulation of humidity, ventilation and transpiration",,,,,,,,,,,,,,,,,,,
63,Light filtering for temperature keeping,,,,Regulation of temperature,Regulation of light,Aesthetic values,Relaxation and psychological wellbeing,,,,,,,,,,,,,,,,
64,Living Plant Constructions (Baubotanik),,,,Habitat,Regulation of temperature,"Regulation of humidity, ventilation and transpiration",Primary production,Pollination and seed dispersal,Regulation of air quality,"Organisms (plants, animals, fungi, protists, bacteria) and genes to produce genetic library for food, fibers, pharmaceuticals, and materials","Seeds, spores and other organism (plant, animal and fungi, protists and bacteria) material to maintain species and genetic diversity",Regulation of light,Spiritual and artistic inspiration,Recreation ,Aesthetic values,Social relations,Educational values and knowledge ,Sense of place,Relaxation and psychological wellbeing,,,,
65,Location planning with little sun and wind,,,,Regulation of temperature,Regulation of wind,"Regulation of humidity, ventilation and transpiration",Regulation of light,Relaxation and psychological wellbeing,,,,,,,,,,,,,,,
66,Low albedo materials,,,,Regulation of temperature,Regulation of light,,,,,,,,,,,,,,,,,,
67,Medicinal gardens,,,,Habitat,Soil,Regulation of temperature,"Regulation of humidity, ventilation and transpiration",Primary production,Pollination and seed dispersal,Regulation of air quality,Food/nutrition for humans,Food/nutrition for non-humans,"Organisms (plants, animals, fungi, protists, bacteria) and genes to produce genetic library for food, fibers, pharmaceuticals, and materials","Seeds, spores and other organism (plant, animal and fungi, protists and bacteria) material to maintain species and genetic diversity",Regulation of light,Spiritual and artistic inspiration,Recreation ,Aesthetic values,Social relations,Educational values and knowledge ,Sense of place,Relaxation and psychological wellbeing,Cultural heritage and historical values
68,Micro livestock,,,,Habitat,Food/nutrition for humans,Food/nutrition for non-humans,"Organisms (plants, animals, fungi, protists, bacteria) and genes to produce genetic library for food, fibers, pharmaceuticals, and materials","Seeds, spores and other organism (plant, animal and fungi, protists and bacteria) material to maintain species and genetic diversity",,,,,,,,,,,,,,,
69,Microbial fuel cells,,,,,,,,,,,,,,,,,,,,,,,
70,Moss wall,,,,Habitat,Regulation of temperature,"Regulation of humidity, ventilation and transpiration",Primary production,Pollination and seed dispersal,Regulation of air quality,"Organisms (plants, animals, fungi, protists, bacteria) and genes to produce genetic library for food, fibers, pharmaceuticals, and materials","Seeds, spores and other organism (plant, animal and fungi, protists and bacteria) material to maintain species and genetic diversity",Regulation of light,Spiritual and artistic inspiration,Aesthetic values,Educational values and knowledge ,Sense of place,Relaxation and psychological wellbeing,,,,,,
71,Noise reducing technologies,,,,Regulation of noise,Aesthetic values,Relaxation and psychological wellbeing,,,,,,,,,,,,,,,,,
72,Organic farming,,,,Habitat,Soil,Regulation of temperature,"Regulation of humidity, ventilation and transpiration",Primary production,Pollination and seed dispersal,Regulation of air quality,Food/nutrition for non-humans,Food/nutrition for humans,"Organisms (plants, animals, fungi, protists, bacteria) and genes to produce genetic library for food, fibers, pharmaceuticals, and materials","Seeds, spores and other organism (plant, animal and fungi, protists and bacteria) material to maintain species and genetic diversity",Regulation of light,Spiritual and artistic inspiration,Recreation ,Aesthetic values,Social relations,Educational values and knowledge ,Sense of place,Relaxation and psychological wellbeing,
73,Orientation sound barriers,,,,Regulation of noise,Aesthetic values,Relaxation and psychological wellbeing,,,,,,,,,,,,,,,,,
74,Permaculture,,,,Habitat,Soil,Regulation of temperature,"Regulation of humidity, ventilation and transpiration",Primary production,Pollination and seed dispersal,Regulation of air quality,Food/nutrition for non-humans,Food/nutrition for humans,"Organisms (plants, animals, fungi, protists, bacteria) and genes to produce genetic library for food, fibers, pharmaceuticals, and materials","Seeds, spores and other organism (plant, animal and fungi, protists and bacteria) material to maintain species and genetic diversity",Regulation of light,Spiritual and artistic inspiration,Recreation ,Aesthetic values,Social relations,Educational values and knowledge ,Sense of place,Relaxation and psychological wellbeing,
75,Permeable paving system,,,,Habitat,Regulation of flood events,,,,,,,,,,,,,,,,,,
76,Photovoltaic cells integration,,,,Active solar energy,Regulation of light,,,,,,,,,,,,,,,,,,
77,Photovoltaic panels,,,,Active solar energy,Regulation of light,,,,,,,,,,,,,,,,,,
78,Pile foundations,,,,Regulation and attenuation of seismic activity,,,,,,,,,,,,,,,,,,,
79,Placed on columns or stilts,,,,Regulation of temperature,Regulation of flood events,,,,,,,,,,,,,,,,,,
80,Planter green wall,,,,Habitat,Regulation of temperature,"Regulation of humidity, ventilation and transpiration",Primary production,Pollination and seed dispersal,Regulation of air quality,Food/nutrition for non-humans,"Organisms (plants, animals, fungi, protists, bacteria) and genes to produce genetic library for food, fibers, pharmaceuticals, and materials","Seeds, spores and other organism (plant, animal and fungi, protists and bacteria) material to maintain species and genetic diversity",Regulation of light,Spiritual and artistic inspiration,Aesthetic values,Educational values and knowledge ,Sense of place,Relaxation and psychological wellbeing,,,,,
81,Pocket garden/park,,,,Habitat,Soil,Regulation of temperature,"Regulation of humidity, ventilation and transpiration",Primary production,Pollination and seed dispersal,Regulation of air quality,Food/nutrition for non-humans,"Organisms (plants, animals, fungi, protists, bacteria) and genes to produce genetic library for food, fibers, pharmaceuticals, and materials","Seeds, spores and other organism (plant, animal and fungi, protists and bacteria) material to maintain species and genetic diversity",Regulation of light,Spiritual and artistic inspiration,Recreation ,Aesthetic values,Social relations,Educational values and knowledge ,Sense of place,Relaxation and psychological wellbeing,,
82,Private gardens,,,,Habitat,Soil,Regulation of temperature,"Regulation of humidity, ventilation and transpiration",Primary production,Pollination and seed dispersal,Regulation of air quality,Food/nutrition for non-humans,"Organisms (plants, animals, fungi, protists, bacteria) and genes to produce genetic library for food, fibers, pharmaceuticals, and materials","Seeds, spores and other organism (plant, animal and fungi, protists and bacteria) material to maintain species and genetic diversity",Regulation of light,Spiritual and artistic inspiration,Recreation ,Aesthetic values,Social relations,Educational values and knowledge ,Sense of place,Relaxation and psychological wellbeing,,
83,Rainwater Cooling System,,,,Regulation of temperature,"Fresh water (<3,000 Mg/L TDS)",,,,,,,,,,,,,,,,,,
84,Rainwater harvesting systems,,,,"Fresh water (<3,000 Mg/L TDS)","Regulation of humidity, ventilation and transpiration",,,,,,,,,,,,,,,,,,
85,Reduction of light pollution,,,,Regulation of light,Aesthetic values,Sense of place,Relaxation and psychological wellbeing,,,,,,,,,,,,,,,,
86,Replace equipment or install water saving devices,,,,"Regulation of humidity, ventilation and transpiration",,,,,,,,,,,,,,,,,,,
87,Retaining wall system,,,,Attenuation of erosion and mass movement,Aesthetic values,,,,,,,,,,,,,,,,,,
88,Revegetation,,,,Habitat,Soil,Regulation of temperature,"Regulation of humidity, ventilation and transpiration",Primary production,Pollination and seed dispersal,Regulation of air quality,Food/nutrition for non-humans,"Organisms (plants, animals, fungi, protists, bacteria) and genes to produce genetic library for food, fibers, pharmaceuticals, and materials","Seeds, spores and other organism (plant, animal and fungi, protists and bacteria) material to maintain species and genetic diversity",Regulation of light,Spiritual and artistic inspiration,Recreation ,Aesthetic values,Educational values and knowledge ,Sense of place,Relaxation and psychological wellbeing,,,
89,"Rivers or streams, including re-meandering, re-opening Blue corridors",,,,Habitat,Regulation of flood events,Regulation of temperature,Ornamental resources,"Fresh water (<3,000 Mg/L TDS)",,Spiritual and artistic inspiration,Recreation ,Aesthetic values,Social relations,Educational values and knowledge ,Sense of place,Relaxation and psychological wellbeing,Cultural heritage and historical values,,,,,,
90,Roof ponds,,,,Habitat,Regulation of temperature,"Regulation of humidity, ventilation and transpiration",Regulation of air quality,Food/nutrition for non-humans,Regulation of light,Aesthetic values,Educational values and knowledge ,,,,,,,,,,,,
91,Sacrificial ground floors,,,,Regulation of flood events,,,,,,,,,,,,,,,,,,,
92,Seismic architecture,,,,Regulation and attenuation of seismic activity,Educational values and knowledge ,,,,,,,,,,,,,,,,,,
93,Semi-intensive green roof,,,,Habitat,Soil,Regulation of temperature,"Regulation of humidity, ventilation and transpiration",Primary production,Pollination and seed dispersal,Regulation of air quality,Food/nutrition for non-humans,"Organisms (plants, animals, fungi, protists, bacteria) and genes to produce genetic library for food, fibers, pharmaceuticals, and materials","Seeds, spores and other organism (plant, animal and fungi, protists and bacteria) material to maintain species and genetic diversity",Regulation of light,Spiritual and artistic inspiration,Recreation ,Aesthetic values,Social relations,Educational values and knowledge ,Sense of place,Relaxation and psychological wellbeing,,
94,Separation of waste streams,,,,Recycling of materials ,Educational values and knowledge ,,,,,,,,,,,,,,,,,,
95,Smart irrigation,,,,Regulation of drought,"Regulation of humidity, ventilation and transpiration","Fresh water (<3,000 Mg/L TDS)",,,,,,,,,,,,,,,,,
96,Smart roofs,,,,Habitat,Soil,Regulation of temperature,"Regulation of humidity, ventilation and transpiration",Primary production,Pollination and seed dispersal,Regulation of air quality,Food/nutrition for non-humans,"Organisms (plants, animals, fungi, protists, bacteria) and genes to produce genetic library for food, fibers, pharmaceuticals, and materials","Seeds, spores and other organism (plant, animal and fungi, protists and bacteria) material to maintain species and genetic diversity",Regulation of light,Spiritual and artistic inspiration,Recreation ,Aesthetic values,Social relations,Educational values and knowledge ,Sense of place,Relaxation and psychological wellbeing,,
97,Soakwells,,,,Regulation of flood events,,,,,,,,,,,,,,,,,,,
98,Soil amendment,,,,Soil formation,Regulation of soil quality,Regulation of flood events,Regulation of drought,Soil,Habitat,,,,,,,,,,,,,,
99,Soil filtration,,,,Regulation of water quality,Regulation of biogeochemical cycles (nutrient cycling and storage),Habitat,,,,,,,,,,,,,,,,,
100,Soil regeneration,,,,Soil,Regulation of soil quality,,,,,,,,,,,,,,,,,,
101,Soil washing,,,,Regulation of soil quality,Regulation of biogeochemical cycles (nutrient cycling and storage),,,,,,,,,,,,,,,,,,
102,,,,,Active solar energy,Regulation of temperature,,,,,,,,,,,,,,,,,,
103,Solar water heaters,,,,Active solar energy,Regulation of temperature,,,,,,,,,,,,,,,,,,
104,Solid walls,,,,Regulation of temperature,Regulation of wind,,,,,,,,,,,,,,,,,,
105,Source separation of wastewater,,,,Regulation of water quality,Reclaimed and recycled water ,,,,,,,,,,,,,,,,,,
106,Stack ventilation,,,,Regulation of temperature,"Regulation of humidity, ventilation and transpiration",,,,,,,,,,,,,,,,,,
107,Stepping stone habitats,,,,Habitat,Soil,Regulation of temperature,"Regulation of humidity, ventilation and transpiration",Primary production,Pollination and seed dispersal,Regulation of air quality,Food/nutrition for non-humans,"Organisms (plants, animals, fungi, protists, bacteria) and genes to produce genetic library for food, fibers, pharmaceuticals, and materials","Seeds, spores and other organism (plant, animal and fungi, protists and bacteria) material to maintain species and genetic diversity",Regulation of light,Spiritual and artistic inspiration,Recreation ,Aesthetic values,Social relations,Educational values and knowledge ,Sense of place,Relaxation and psychological wellbeing,,
108,Structural bracing strategies,,,,Regulation and attenuation of seismic activity,,,,,,,,,,,,,,,,,,,
109,Subsistence farming,,,,Habitat,Soil,Primary production,Pollination and seed dispersal,Regulation of air quality,Food/nutrition for non-humans,Food/nutrition for humans,"Organisms (plants, animals, fungi, protists, bacteria) and genes to produce genetic library for food, fibers, pharmaceuticals, and materials","Seeds, spores and other organism (plant, animal and fungi, protists and bacteria) material to maintain species and genetic diversity",Regulation of light,Spiritual and artistic inspiration,Recreation ,Aesthetic values,Social relations,Educational values and knowledge ,Sense of place,Relaxation and psychological wellbeing,,,
110,Sunscreens,,,,Regulation of light,Regulation of temperature,Aesthetic values,,,,,,,,,,,,,,,,,
111,Sustainably sourced materials,,,,"Raw materials (timber, fiber, stone, minerals, ores)",Educational values and knowledge ,,,,,,,,,,,,,,,,,,
112,Texture and form based sound barriers,,,,Regulation of noise,Aesthetic values,Relaxation and psychological wellbeing,Cultural heritage and historical values,,,,,,,,,,,,,,,,
113,Thermal desorption,,,,Regulation of temperature,,,,,,,,,,,,,,,,,,,
114,Thermal energy storage system,,,,Regulation of temperature,,,,,,,,,,,,,,,,,,,
115,Topsoil management,,,,Regulation of soil quality,,,,,,,,,,,,,,,,,,,
116,Trellis/fence farms,,,,Habitat,Pollination and seed dispersal,Regulation of temperature,"Regulation of humidity, ventilation and transpiration",Primary production,Regulation of air quality,Food/nutrition for non-humans,"Organisms (plants, animals, fungi, protists, bacteria) and genes to produce genetic library for food, fibers, pharmaceuticals, and materials","Seeds, spores and other organism (plant, animal and fungi, protists and bacteria) material to maintain species and genetic diversity",Regulation of light,Spiritual and artistic inspiration,Aesthetic values,Educational values and knowledge ,Sense of place,Relaxation and psychological wellbeing,,,,,
117,Urban mining,,,,Recycled materials,Reused materials,Educational values and knowledge ,,,,,,,,,,,,,,,,,
118,Urban orchards,,,,Habitat,Soil,Regulation of temperature,"Regulation of humidity, ventilation and transpiration",Primary production,Pollination and seed dispersal,Regulation of air quality,Food/nutrition for non-humans,Food/nutrition for humans,"Organisms (plants, animals, fungi, protists, bacteria) and genes to produce genetic library for food, fibers, pharmaceuticals, and materials","Seeds, spores and other organism (plant, animal and fungi, protists and bacteria) material to maintain species and genetic diversity",Regulation of light,Spiritual and artistic inspiration,Recreation ,Aesthetic values,Social relations,Educational values and knowledge ,Sense of place,Relaxation and psychological wellbeing,
119,Urban (rooftop) farming,,,,Habitat,Soil,Regulation of temperature,"Regulation of humidity, ventilation and transpiration",Primary production,Pollination and seed dispersal,Regulation of air quality,Food/nutrition for non-humans,Food/nutrition for humans,"Organisms (plants, animals, fungi, protists, bacteria) and genes to produce genetic library for food, fibers, pharmaceuticals, and materials","Seeds, spores and other organism (plant, animal and fungi, protists and bacteria) material to maintain species and genetic diversity",Regulation of light,Spiritual and artistic inspiration,Recreation ,Aesthetic values,Social relations,Educational values and knowledge ,Sense of place,Relaxation and psychological wellbeing,
120,Use of biodegradable materials,,,,Soil,Soil formation,Recycling of materials ,Regulation of biogeochemical cycles (nutrient cycling and storage),Aesthetic values,,,,,,,,,,,,,,,
121,Use of carbon/GHG storing building materials,,,,Regulation of air quality,,,,,,,,,,,,,,,,,,,
122,Use of daylight,,,,Regulation of light,Aesthetic values,,,,,,,,,,,,,,,,,,
123,Use of locally sourced materials,,,,"Raw materials (timber, fiber, stone, minerals, ores)",,,,,,,,,,,,,,,,,,,
124,Use of mulch,,,,"Raw materials (timber, fiber, stone, minerals, ores)",Regulation of light,Aesthetic values,Regulation of temperature,"Regulation of humidity, ventilation and transpiration",Regulation of wind,Regulation of drought,,,,,,,,,,,,,
125,Use of pre-existing vegetation,,,,Habitat,Soil,Regulation of temperature,"Regulation of humidity, ventilation and transpiration",Primary production,Pollination and seed dispersal,Regulation of air quality,Food/nutrition for non-humans,"Organisms (plants, animals, fungi, protists, bacteria) and genes to produce genetic library for food, fibers, pharmaceuticals, and materials","Seeds, spores and other organism (plant, animal and fungi, protists and bacteria) material to maintain species and genetic diversity",Regulation of light,Spiritual and artistic inspiration,Recreation ,Aesthetic values,Social relations,Educational values and knowledge ,Sense of place,Relaxation and psychological wellbeing,Cultural heritage and historical values,
126,Use of readily available materials,,,,"Raw materials (timber, fiber, stone, minerals, ores)",,,,,,,,,,,,,,,,,,,
127,Use of recycled materials,,,,Recycled materials,,,,,,,,,,,,,,,,,,,
128,Use of traditional techniques,,,,Spiritual and artistic inspiration,Aesthetic values,Social relations,Educational values and knowledge ,Sense of place,Relaxation and psychological wellbeing,Cultural heritage and historical values,Cultural diversity,,,,,,,,,,,,
129,Vegetable gardens,,,,Habitat,Soil,Regulation of temperature,"Regulation of humidity, ventilation and transpiration",Primary production,Pollination and seed dispersal,Food/nutrition for non-humans,Food/nutrition for humans,"Organisms (plants, animals, fungi, protists, bacteria) and genes to produce genetic library for food, fibers, pharmaceuticals, and materials","Seeds, spores and other organism (plant, animal and fungi, protists and bacteria) material to maintain species and genetic diversity",Spiritual and artistic inspiration,Recreation ,Aesthetic values,Social relations,Educational values and knowledge ,Sense of place,Relaxation and psychological wellbeing,,,
130,Vegetated grid pave,,,,Habitat,Soil,"Organisms (plants, animals, fungi, protists, bacteria) and genes to produce genetic library for food, fibers, pharmaceuticals, and materials","Seeds, spores and other organism (plant, animal and fungi, protists and bacteria) material to maintain species and genetic diversity",Aesthetic values,,,,,,,,,,,,,,,
131,Vegetated pergola,,,,Habitat,Regulation of temperature,"Regulation of humidity, ventilation and transpiration",Primary production,Pollination and seed dispersal,Regulation of air quality,Food/nutrition for non-humans,"Organisms (plants, animals, fungi, protists, bacteria) and genes to produce genetic library for food, fibers, pharmaceuticals, and materials","Seeds, spores and other organism (plant, animal and fungi, protists and bacteria) material to maintain species and genetic diversity",Spiritual and artistic inspiration,Recreation ,Aesthetic values,Educational values and knowledge ,Sense of place,Relaxation and psychological wellbeing,,,,,
132,Vegetation cover increase,,,,Habitat,Soil,Regulation of temperature,"Regulation of humidity, ventilation and transpiration",Primary production,Pollination and seed dispersal,Regulation of air quality,Food/nutrition for non-humans,"Organisms (plants, animals, fungi, protists, bacteria) and genes to produce genetic library for food, fibers, pharmaceuticals, and materials","Seeds, spores and other organism (plant, animal and fungi, protists and bacteria) material to maintain species and genetic diversity",Spiritual and artistic inspiration,Aesthetic values,Sense of place,Relaxation and psychological wellbeing,,,,,,
133,Vegetation for insulation,,,,Habitat,Regulation of temperature,"Regulation of humidity, ventilation and transpiration",Primary production,Pollination and seed dispersal,Regulation of air quality,"Organisms (plants, animals, fungi, protists, bacteria) and genes to produce genetic library for food, fibers, pharmaceuticals, and materials","Seeds, spores and other organism (plant, animal and fungi, protists and bacteria) material to maintain species and genetic diversity",Aesthetic values,Relaxation and psychological wellbeing,,,,,,,,,,
134,Vertical farming,,,,Habitat,Food/nutrition for non-humans,Food/nutrition for humans,"Organisms (plants, animals, fungi, protists, bacteria) and genes to produce genetic library for food, fibers, pharmaceuticals, and materials","Seeds, spores and other organism (plant, animal and fungi, protists and bacteria) material to maintain species and genetic diversity",Educational values and knowledge ,,,,,,,,,,,,,,
135,Vertical mobile garden,,,,Habitat,Soil,Regulation of temperature,"Regulation of humidity, ventilation and transpiration",Primary production,Pollination and seed dispersal,Regulation of air quality,Food/nutrition for non-humans,"Organisms (plants, animals, fungi, protists, bacteria) and genes to produce genetic library for food, fibers, pharmaceuticals, and materials","Seeds, spores and other organism (plant, animal and fungi, protists and bacteria) material to maintain species and genetic diversity",Spiritual and artistic inspiration,Recreation ,Aesthetic values,Educational values and knowledge ,Sense of place,Relaxation and psychological wellbeing,,,,
136,Waste management,,,,Regulation of smell,Regulation of biogeochemical cycles (nutrient cycling and storage),Recycling of materials ,Educational values and knowledge ,,,,,,,,,,,,,,,,
137,Water cooling systems,,,,Regulation of temperature,,,,,,,,,,,,,,,,,,,
138,Water efficient systems,,,,"Fresh water (<3,000 Mg/L TDS)",,,,,,,,,,,,,,,,,,,
139,Water less systems,,,,"Fresh water (<3,000 Mg/L TDS)",,,,,,,,,,,,,,,,,,,
140,Water source heat pump,,,,Fresh water as energy source,,,,,,,,,,,,,,,,,,,
141,Water storage,,,,"Fresh water (<3,000 Mg/L TDS)",,,,,,,,,,,,,,,,,,,
142,Wind barriers,,,,Regulation of wind,Relaxation and psychological wellbeing,,,,,,,,,,,,,,,,,,
143,Wind turbines,,,,Regulation of wind,Wind energy,,,,,,,,,,,,,,,,,,
144,Xeriscaping,,,,Habitat,Soil,Regulation of temperature,"Regulation of humidity, ventilation and transpiration",Primary production,Pollination and seed dispersal,Food/nutrition for non-humans,"Organisms (plants, animals, fungi, protists, bacteria) and genes to produce genetic library for food, fibers, pharmaceuticals, and materials","Seeds, spores and other organism (plant, animal and fungi, protists and bacteria) material to maintain species and genetic diversity",Spiritual and artistic inspiration,Recreation ,Aesthetic values,Educational values and knowledge ,Sense of place,Relaxation and psychological wellbeing,,,,,
145,Reforestation,,,,,,,,,,,,,,,,,,,,,,,
146,Optimising materials,,,,,,,,,,,,,,,,,,,,,,,
147,Metropolitan Food Clusters & Agroparks,,,,,,,,,,,,,,,,,,,,,,,
148,Design adapted to location,,,,,,,,,,,,,,,,,,,,,,,
149,Increased biodiversity,,,,,,,,,,,,,,,,,,,,,,,
150,street greening,,,,,,,,,,,,,,,,,,,,,,,
151,Facade shaped for bird safety,,,,,,,,,,,,,,,,,,,,,,,
152,Water cycling,,,,,,,,,,,,,,,,,,,,,,,
153,Traffic reduction,,,,,,,,,,,,,,,,,,,,,,,
154,Human body heat,,,,,,,,,,,,,,,,,,,,,,,
155,School gardens,,,,,,,,,,,,,,,,,,,,,,,
156,Industrial ecology,,,,,,,,,,,,,,,,,,,,,,,
157,Biogas,,,,,,,,,,,,,,,,,,,,,,,
158,Wetlands incoorporation,,,,,,,,,,,,,,,,,,,,,,,
159,Ending landfill emissions of sewage to the oceans,,,,,,,,,,,,,,,,,,,,,,,
160,Consumption reduction,,,,,,,,,,,,,,,,,,,,,,,
161,Stormwater swales,,,,,,,,,,,,,,,,,,,,,,,
162,UV protection,,,,,,,,,,,,,,,,,,,,,,,
163,Contaminent absorption,,,,,,,,,,,,,,,,,,,,,,,
164,Ocean energy,,,,,,,,,,,,,,,,,,,,,,,
165,Constructed and natural wetlands,,,,,,,,,,,,,,,,,,,,,,,
166,Constructed and natural wetlands,,,,,,,,,,,,,,,,,,,,,,,
167,Drivable grass,,,,,,,,,,,,,,,,,,,,,,,
168,Hylofit water filter,,,,,,,,,,,,,,,,,,,,,,,
169,Designed for destruction,,,,,,,,,,,,,,,,,,,,,,,
170,Heat-cold storage installation,,,,,,,,,,,,,,,,,,,,,,,
171,Green and blue courtyard,,,,,,,,,,,,,,,,,,,,,,,
172,Prison gardens,,,,,,,,,,,,,,,,,,,,,,,
173,Allotment gardens,,,,,,,,,,,,,,,,,,,,,,,
174,Hydrogen production,,,,,,,,,,,,,,,,,,,,,,,
176,Geothermal energy,,,,,,,,,,,,,,,,,,,,,,,
177,Rooftop gardens,,,,,,,,,,,,,,,,,,,,,,,
178,Material reuse,,,,,,,,,,,,,,,,,,,,,,,
179,Container gardens,,,,,,,,,,,,,,,,,,,,,,,
180,Solar panels,,,,,,,,,,,,,,,,,,,,,,,
181,Geothermal energy,,,,,,,,,,,,,,,,,,,,,,,
182,Rooftop gardens,,,,,,,,,,,,,,,,,,,,,,,
183,Material reuse,,,,,,,,,,,,,,,,,,,,,,,
184,Container gardens,,,,,,,,,,,,,,,,,,,,,,,
