PC1,PC2,label
0.6843744,0.47401085,0
0.76294154,0.46439385,0
0.58155346,0.42420286,0
0.6889571,0.4525047,0
0.8892643,0.45453712,0
0.8484619,0.47288686,0
0.50785416,0.4390202,0
0.8869804,0.46822843,0
0.7294721,0.4297094,0
0.87889904,0.456472,0
0.6842698,0.43860024,0
0.78113943,0.45387715,0
0.880913,0.46137512,0
0.8131925,0.45643663,0
0.8157433,0.4657746,0
0.8519024,0.43378463,0
0.8820827,0.47559676,0
0.6344539,0.43890268,0
0.8932268,0.4575539,0
0.85534275,0.45116764,0
0.7804238,0.42658687,0
0.87224627,0.45290518,0
0.82493657,0.4400397,0
0.8731305,0.45949396,0
0.8806786,0.45770296,0
0.77025646,0.4282885,0
0.6312963,0.42746437,0
0.793602,0.4640627,0
0.8975899,0.47350678,0
0.8490404,0.45493823,0
0.5799509,0.41926673,0
0.869839,0.45848998,0
0.89589405,0.46406594,0
0.8837718,0.46758538,0
0.8892771,0.47293863,0
0.7917679,0.45775387,0
0.8770081,0.45775643,0
0.8705159,0.4487215,0
0.7148628,0.45400164,0
0.70274866,0.44792333,0
0.8073846,0.46527517,0
0.7026769,0.44698384,0
0.8798645,0.4535955,0
0.74320906,0.44013986,0
0.85028327,0.44344687,0
0.6835516,0.4206605,0
0.85865027,0.46012586,0
0.7649665,0.45059985,0
0.8710985,0.45674202,0
0.8887371,0.46222425,0
0.8751443,0.46372244,0
0.715193,0.4501181,0
0.88333917,0.4657795,0
0.8944453,0.4665338,0
0.80704266,0.44792202,0
0.54837143,0.40253907,0
0.8618105,0.4445787,0
0.76270396,0.47187528,0
0.855012,0.46166092,0
0.7585072,0.44531476,0
0.6893555,0.4504378,0
0.77905095,0.44387627,0
0.7470783,0.45168018,0
0.85992396,0.45418796,0
0.89469784,0.46747318,0
0.78538424,0.4174156,0
0.78251743,0.45543322,0
0.6463208,0.4292319,0
0.8272605,0.45717296,0
0.84650356,0.46768534,0
0.7610653,0.4490079,0
0.8367292,0.4388908,0
0.6677363,0.43766168,0
0.7483524,0.44794244,0
0.77128947,0.45941168,0
0.7641359,0.45563933,0
0.7611679,0.4354002,0
0.8331542,0.4606388,0
0.82663715,0.45600322,0
0.80693036,0.4271316,0
0.8273995,0.45775962,0
0.7615039,0.4400864,0
0.5979446,0.44694954,0
0.71588004,0.44603515,0
0.77050585,0.426931,0
0.75338656,0.4486427,0
0.42651033,0.4294037,0
0.6494046,0.45189625,0
0.5987497,0.43175486,0
0.87968034,0.46667874,0
0.81050575,0.4548503,0
0.79618156,0.42836446,0
0.74534404,0.42406708,0
0.61358625,0.4050669,0
0.7003953,0.43341368,0
0.83215314,0.42613652,0
0.6908037,0.41928115,0
0.8420048,0.46525246,0
0.7632101,0.45053944,0
0.6821525,0.4167403,0
0.6199294,0.4327256,0
0.6561731,0.45685062,0
0.85047555,0.4639725,0
0.7690015,0.4554224,0
0.75497234,0.4399828,0
0.8457575,0.4303554,0
0.77127224,0.44769835,0
0.7877868,0.44946486,0
0.76414007,0.44813478,0
0.69915307,0.45217335,0
0.7266583,0.45394698,0
0.8652245,0.4435893,0
0.8112323,0.46191356,0
0.79178226,0.4484515,0
0.8980588,0.4687187,0
0.73613113,0.4440229,0
0.7325846,0.45673913,0
0.66339505,0.42843536,0
0.80276746,0.4566006,0
0.8365742,0.43307835,0
0.8865013,0.46469185,0
0.88553506,0.45479548,0
0.7756233,0.46276614,0
0.8472146,0.4387418,0
0.7903149,0.47331506,0
0.8551779,0.45296067,0
0.76653963,0.45384866,0
0.7649956,0.46197456,0
0.7925012,0.45136455,0
0.70455086,0.43739235,0
0.62983745,0.4303487,0
0.7798576,0.45358267,0
0.70429665,0.4498824,0
0.71216154,0.44515052,0
0.7120952,0.4550715,0
0.85396576,0.46786878,0
0.7329518,0.437875,0
0.5720877,0.41730332,0
0.7317443,0.43300274,0
0.60253876,0.43072283,0
0.6351298,0.42845088,0
0.7339052,0.46864265,0
0.7974173,0.4438707,0
0.894478,0.47957286,0
0.84681135,0.46275818,0
0.7772829,0.41369087,0
0.84134406,0.43582696,0
0.57536924,0.41865468,0
0.65349185,0.42680126,0
0.85997033,0.47343755,0
0.7406393,0.47178456,0
0.6590424,0.40998295,0
0.675973,0.44673842,0
0.7655793,0.4056874,0
0.6908817,0.4165945,0
0.7704298,0.41897482,0
0.7174277,0.43190238,0
0.76051027,0.40553123,0
0.7117279,0.4396759,0
0.7325354,0.41631618,0
0.7484678,0.4440142,0
0.82961845,0.44329688,0
0.63495755,0.42435712,0
0.7324048,0.43777007,0
0.76776206,0.4151124,0
0.7150055,0.4080172,0
0.75193316,0.44548506,0
0.7737484,0.41906497,0
0.61764365,0.44662905,0
0.78248036,0.44337636,0
0.7651284,0.44296646,0
0.5692856,0.42380175,0
0.81408006,0.45296523,0
0.79767156,0.44014314,0
0.5966377,0.41495588,0
0.8140772,0.4198396,0
0.7555932,0.46142635,0
0.7930762,0.4441602,0
0.5065811,0.42406604,0
0.66026384,0.4396545,0
0.7766019,0.44376928,0
0.7373089,0.44947684,0
0.66400295,0.42236865,0
0.6824992,0.43994236,0
0.8749863,0.48378995,0
0.8579032,0.44647083,0
0.7111946,0.45366046,0
0.5822396,0.42657304,0
0.7097476,0.46887255,0
0.77806973,0.4473852,0
0.83743525,0.46007162,0
0.84762096,0.48226687,0
0.8191361,0.44688135,0
0.8768802,0.46376842,0
0.66947407,0.4247888,0
0.8725902,0.47556353,0
0.7725938,0.42101392,0
0.82680625,0.46145344,0
0.72246814,0.44333822,0
0.76489836,0.46317813,0
0.66821754,0.45217535,0
0.81289625,0.4239323,0
0.8146709,0.4611464,0
0.6376632,0.4507087,0
0.77996343,0.42168406,0
0.6907994,0.40924844,0
0.84749216,0.48542422,0
0.7010022,0.45287076,0
0.7553951,0.46052578,0
0.69254297,0.43712127,0
0.77703184,0.46453118,0
0.8401881,0.4399735,0
0.8372449,0.47369865,0
0.80808616,0.46363616,0
0.6955794,0.43905705,0
0.7764741,0.45104215,0
0.76955485,0.46550983,0
0.56363475,0.43508258,0
0.9084974,0.47211877,0
0.69324917,0.4215886,0
0.847567,0.45624202,0
0.692538,0.42285544,0
0.84290737,0.46749517,0
0.5717675,0.41903058,0
0.8965468,0.45308042,0
0.8195122,0.453549,0
0.8494056,0.43683368,0
0.83979267,0.45978853,0
0.76975256,0.43677628,0
0.61914456,0.43411586,0
0.8698485,0.4464889,0
0.8527358,0.45903572,0
0.80378413,0.43844286,0
0.8783981,0.45499945,0
0.8370254,0.45724672,0
0.9047605,0.47371817,0
0.9037499,0.47217482,0
0.7407437,0.4693567,0
0.72270334,0.45870697,0
0.7414983,0.4152473,0
0.63506204,0.42859474,0
0.76525253,0.42543483,0
0.82805544,0.44433627,0
0.5594962,0.4176928,0
0.80025345,0.41728032,0
0.79726356,0.4617867,0
0.8630804,0.46006495,0
0.8271514,0.47068995,0
0.8564052,0.45946416,0
0.89774144,0.4756026,0
0.7179098,0.45096174,0
0.7234579,0.45635957,0
0.7339082,0.4276931,0
0.7327347,0.43906367,0
0.73706114,0.42764163,0
0.78028387,0.43961385,0
0.7593346,0.4501752,0
0.7198648,0.45128432,0
0.8117712,0.4700396,0
0.63691217,0.41795477,0
0.6363621,0.40627784,0
0.68303925,0.4378486,0
0.8170841,0.4402158,0
0.8214486,0.45471665,0
0.62913424,0.44898257,0
0.701075,0.425157,0
0.637033,0.440234,0
0.8309818,0.45456827,0
0.77554816,0.42087173,0
0.6838505,0.44306225,0
0.8590822,0.44603884,0
0.5986554,0.43906733,0
0.75052106,0.4389109,0
0.7133005,0.4439849,0
0.84165627,0.43165314,0
0.7851822,0.44393688,0
0.8238823,0.4446353,0
0.7649821,0.41198105,0
0.76732016,0.40493417,0
0.48543647,0.4106947,0
0.6756964,0.44134688,0
0.8238323,0.46743473,0
0.76027244,0.4479396,0
0.79882604,0.41053495,0
0.77474797,0.40948427,0
0.82664806,0.4561528,0
0.70957875,0.43149227,0
0.72176087,0.4151687,0
0.7485223,0.4173558,0
0.7925981,0.45664865,0
0.83097494,0.4870829,0
0.66120446,0.44723073,0
0.86938256,0.47919047,0
0.8435426,0.48580316,0
0.82688534,0.4572878,0
0.8301284,0.48319578,0
0.7237921,0.44851124,0
0.7129764,0.4464651,0
0.6935985,0.4285742,0
0.56086373,0.42510667,0
0.7088499,0.4531943,0
0.6172345,0.44544488,0
0.74408495,0.4348929,0
0.78867817,0.45487794,0
0.84112346,0.45168242,0
0.83750314,0.4738121,0
0.843815,0.4737729,0
0.8332563,0.44577965,0
0.8860205,0.46008378,0
0.8515772,0.43450892,0
0.782949,0.4720086,0
0.65347606,0.45043314,0
0.82813156,0.4889898,0
0.6690472,0.45243958,0
0.772996,0.47291428,0
0.81888646,0.48638776,0
0.71325445,0.45676163,0
0.8474545,0.48131335,0
0.8511837,0.47865954,0
0.73542774,0.47582832,0
0.7591763,0.47459203,0
0.6519029,0.4498058,0
0.8537541,0.45833614,0
0.7828479,0.41273487,0
0.74804646,0.4210506,0
0.8258471,0.4400658,0
0.7300936,0.43220395,0
0.7420046,0.43702912,0
0.796034,0.46870348,0
0.6524722,0.4280449,0
0.8286199,0.47270682,0
0.77942026,0.43066797,0
0.7449076,0.44372877,0
0.77303064,0.46290898,0
0.8109969,0.47161657,0
0.8570709,0.47655398,0
0.8598892,0.4792081,0
0.7585785,0.44049552,0
0.8036274,0.45624748,0
0.810502,0.46713892,0
0.7652288,0.45577657,0
0.7264287,0.44572526,0
0.8192511,0.43822032,0
0.63547087,0.4271332,0
0.8329414,0.4563924,0
0.7451942,0.45524177,0
0.6868458,0.43467328,0
0.7271798,0.4414241,0
0.78054667,0.4351232,0
0.8715526,0.45048282,0
0.63542014,0.43064833,0
0.8626354,0.4519431,0
0.8871466,0.46452326,0
0.83701706,0.4471034,0
0.74841154,0.4197708,0
0.8821918,0.46685404,0
0.76413745,0.45238405,0
0.754777,0.4385108,0
0.82477385,0.45841232,0
0.85498625,0.45612577,0
0.8415521,0.4299217,0
0.73214555,0.4122826,0
0.8254747,0.45528176,0
0.82694834,0.4592406,0
0.68983877,0.42718196,0
0.74041617,0.43682358,0
0.84681094,0.44880706,0
0.76578003,0.42556366,0
0.60360414,0.39316288,0
0.6681612,0.42101586,0
0.7177953,0.4479776,0
0.6586237,0.4420504,0
0.746493,0.40644985,0
0.8061005,0.44226274,0
0.74608934,0.4329101,0
0.40655398,0.39253846,0
0.78971773,0.45642105,0
0.7865136,0.42478654,0
0.72935694,0.41411698,0
0.6726609,0.41301906,0
0.7475286,0.43823782,0
0.8102414,0.46417755,0
0.7398241,0.43275684,0
0.7519252,0.45241508,0
0.7290665,0.4391182,0
0.82455844,0.44164228,0
0.77080035,0.4462657,0
0.84282064,0.43048117,0
0.7730001,0.44675997,0
0.87160933,0.44561672,0
0.8219112,0.43862116,0
0.6979626,0.41088435,0
0.7398462,0.44317,0
0.6036088,0.42356372,0
0.8979184,0.45959276,0
0.78814346,0.44410214,0
0.8065527,0.46634188,0
0.8596541,0.44294667,0
0.86029875,0.4501446,0
0.82479936,0.4352687,0
0.8846826,0.48033765,0
0.89947236,0.4743893,0
0.8845589,0.47613505,0
0.831309,0.42583036,0
0.88398695,0.4811148,0
0.8958363,0.47226095,0
0.86443096,0.44694716,0
0.84624904,0.44057816,0
0.8738215,0.45135483,0
0.8881904,0.46374977,0
0.8757421,0.47133464,0
0.8886544,0.4794197,0
0.84037477,0.46251804,0
0.8750619,0.46175507,0
0.86458355,0.4531736,0
0.84958804,0.45112064,0
0.8413588,0.4546884,0
0.87095624,0.4344171,0
0.86758924,0.4383877,0
0.81590873,0.4440308,0
0.8533885,0.44772828,0
0.83431536,0.43819797,0
0.89092034,0.46242863,0
0.79522276,0.44472957,0
0.7402934,0.4299595,0
0.8922674,0.4592748,0
0.8531118,0.43635705,0
0.823404,0.44904876,0
0.8407478,0.45329446,0
0.79645365,0.47128737,0
0.67414516,0.43221125,0
0.78922725,0.4669935,0
0.6565943,0.4284961,0
0.778725,0.45151216,0
0.8679412,0.4400891,0
0.7942256,0.43164238,0
0.823111,0.44729295,0
0.84472233,0.45118624,0
0.8292057,0.43884006,0
0.8192267,0.43065083,0
0.7745083,0.41712812,0
0.70710194,0.4419633,0
0.75799656,0.422693,0
0.7636683,0.40798298,0
0.77091587,0.42384106,0
0.7305584,0.43722343,0
0.83600086,0.47786856,0
0.82301617,0.42054573,0
0.7919776,0.4715221,0
0.8589186,0.45721552,0
0.8556112,0.46239942,0
0.71100855,0.41787678,0
0.64807844,0.42507222,0
0.78547126,0.44387138,0
0.6002889,0.42224026,0
0.7329564,0.41234833,0
0.8540399,0.45758638,0
0.85971034,0.44605568,0
0.8226838,0.43821207,0
0.8636164,0.43683913,0
0.8600741,0.43819514,0
0.8658181,0.43503442,0
0.84528226,0.4661839,0
0.83894354,0.4347908,0
0.79250747,0.44841802,0
0.83222705,0.43502158,0
0.80384976,0.42344612,0
0.79917157,0.4521406,0
0.6127513,0.4274801,0
0.62439054,0.41118783,0
0.6932774,0.415351,0
0.7237727,0.40934214,0
0.8951882,0.4804001,0
0.610452,0.421439,0
0.6484476,0.423122,0
0.72926426,0.4384589,0
0.68634635,0.3963402,0
0.73492634,0.407974,0
0.7567721,0.43681484,0
0.8402211,0.46353552,0
0.77975976,0.41728166,0
0.7117731,0.4592602,0
0.73272955,0.417855,0
0.86634946,0.4599877,0
0.7202494,0.44775212,0
0.5475166,0.4243236,0
0.8063199,0.45307273,0
0.8453849,0.44507614,0
0.7988178,0.45303863,0
0.8074364,0.4375537,0
0.79639065,0.44031146,0
0.7561248,0.43281406,0
0.6563816,0.41199458,0
0.74815124,0.4077689,0
0.71917653,0.43799055,0
0.73941404,0.4544128,0
0.64176816,0.44373792,0
0.69833916,0.46111614,0
0.72058606,0.39665553,0
0.78943104,0.4158001,0
0.7156928,0.39568797,0
0.6148321,0.3983576,0
0.8014358,0.4649519,0
0.7907873,0.42782623,0
0.7343553,0.4167173,0
0.79148805,0.42843333,0
0.7818279,0.46175992,0
0.67031664,0.44484913,0
0.6982233,0.42054898,0
0.68821543,0.42212936,0
0.7635367,0.4210019,0
0.59170514,0.43723524,0
0.7233362,0.418459,0
0.8283053,0.45622236,0
0.65999025,0.41352403,0
0.84443945,0.4542453,0
0.57584447,0.42175725,0
0.86303556,0.467979,0
0.81785136,0.4549573,0
0.8657755,0.46482018,0
0.8495643,0.45301455,0
0.67850876,0.4228123,0
0.8448502,0.44737908,0
0.7903477,0.45602584,0
0.7088038,0.43098575,0
0.7443351,0.44807953,0
0.8405847,0.46505195,0
0.77029294,0.45416412,0
0.6282207,0.41683114,0
0.6977438,0.43908587,0
0.81622946,0.4290302,0
0.64696395,0.43375203,0
0.7328138,0.45630738,0
0.7224294,0.43553483,0
0.8045938,0.4475261,0
0.589131,0.42057887,0
0.7595791,0.4231446,0
0.8434118,0.4718133,0
0.7921524,0.44684687,0
0.7091878,0.44299453,0
0.8770279,0.45888957,0
0.8559866,0.4479705,0
0.7016281,0.43833435,0
0.7851237,0.4404636,0
0.8666629,0.45136362,0
0.83927155,0.4560056,0
0.7907184,0.4545991,0
0.73398584,0.43561327,0
0.812915,0.42911774,0
0.7578536,0.41183573,0
0.7548184,0.4314303,0
0.7185477,0.40505603,0
0.74475795,0.41901022,0
0.8080089,0.4370925,0
0.71941036,0.4305091,0
0.7506385,0.4173524,0
0.78754497,0.4306942,0
0.8132995,0.43274122,0
0.7905003,0.4483898,0
0.85035396,0.45083067,0
0.78156704,0.45292318,0
0.843404,0.4541314,0
0.719747,0.44141927,0
0.6826472,0.42250675,0
0.85302895,0.47440255,0
0.8173728,0.45280534,0
0.82448995,0.45780554,0
0.8360175,0.44468164,0
0.8253405,0.4534528,0
0.8152536,0.46785557,0
0.7818248,0.43293834,0
0.82242775,0.43799073,0
0.49348214,0.41539368,0
0.6698212,0.411869,0
0.87806803,0.46364543,0
0.7737065,0.42571428,0
0.8694685,0.48625937,0
0.8102585,0.43740338,0
0.86760616,0.47926787,0
0.7369304,0.44397876,0
0.73074394,0.45411912,0
0.68324393,0.44532138,0
0.83819294,0.47590867,0
0.7707239,0.446034,0
0.7802177,0.43447694,0
0.78804463,0.43895906,0
0.6104832,0.4484158,0
0.75561696,0.4198155,0
0.74737626,0.4405662,0
0.72708356,0.4563192,0
0.6851375,0.45086828,0
0.57036966,0.40924495,0
0.735109,0.43808305,0
0.78361875,0.44373238,0
0.7024334,0.4265331,0
0.75802386,0.4393508,0
0.73793805,0.43433532,0
0.81761515,0.4678002,0
0.82281125,0.4178528,0
0.8558021,0.44937095,0
0.86397296,0.45341632,0
0.8444325,0.45494565,0
0.86285067,0.46589452,0
0.85454684,0.46474242,0
0.6593583,0.44972384,0
0.8525107,0.44243607,0
0.5971277,0.43712386,0
0.89135927,0.48550552,0
0.7012444,0.41619444,0
0.70162004,0.428887,0
0.817769,0.4689307,0
0.8198547,0.45805994,0
0.8325432,0.4527232,0
0.84504193,0.47417212,0
0.8016932,0.44899967,0
0.7018132,0.44022888,0
0.6981013,0.42589912,0
0.8773352,0.45881483,0
0.6477763,0.43479383,0
0.77054334,0.4564878,0
0.68998075,0.45401078,0
0.83698916,0.4565304,0
0.8128564,0.4818994,0
0.7835771,0.4299527,0
0.7494325,0.41892618,0
0.81517947,0.4530583,0
0.7782632,0.43428928,0
0.7749526,0.46776733,0
0.80242795,0.43887934,0
0.8229654,0.4566903,0
0.68354553,0.43800175,0
0.85151774,0.46289632,0
0.6751599,0.4451469,0
0.8011812,0.4484021,0
0.78447634,0.4487011,0
0.7904116,0.44750574,0
0.7490742,0.45458546,0
0.67490906,0.40381908,0
0.7518754,0.4380345,0
0.72276753,0.43167531,0
0.80506015,0.4221793,0
0.6773205,0.44181514,0
0.69748056,0.4381913,0
0.7549899,0.4506539,0
0.7055981,0.44892946,0
0.8871406,0.46320832,0
0.79298824,0.4594078,0
0.7580427,0.43044728,0
0.72606593,0.44287503,0
0.85068405,0.46862277,0
0.8252076,0.4635427,0
0.806691,0.4552178,0
0.8718925,0.44795957,0
0.7296319,0.43522146,0
0.8380869,0.44048655,0
0.60511345,0.4247562,0
0.8731889,0.45440367,0
0.65109354,0.44647396,0
0.79855186,0.45661324,0
0.7265851,0.42955652,0
0.8828885,0.47719267,0
0.59130836,0.44084692,0
0.7168092,0.4457226,0
0.9071269,0.47460827,0
0.6888603,0.41340116,0
0.7462771,0.44584408,0
0.8008447,0.45203403,0
0.8163154,0.42949668,0
0.78850424,0.44143775,0
0.7820805,0.42099246,0
0.8048869,0.4261227,0
0.6474348,0.40897417,0
0.8456068,0.46183738,0
0.86826503,0.47226414,0
0.78769565,0.44550756,0
0.68349695,0.4127535,0
0.838218,0.43227342,0
0.84822845,0.44884613,0
0.71550953,0.44431388,0
0.7452465,0.44664568,0
0.6439837,0.4052991,0
0.8491912,0.48256722,0
0.6729317,0.43445706,0
0.8368922,0.4241393,0
0.79788715,0.4635855,0
0.7020324,0.43999067,0
0.8264141,0.44119278,0
0.7922448,0.4454155,0
0.7541806,0.46087375,0
0.8268289,0.42115572,0
0.8123047,0.4511973,0
0.76400113,0.4323742,0
0.70632994,0.44377857,0
0.8286045,0.4522401,0
0.7067166,0.45448786,0
0.74877363,0.4443436,0
0.7301591,0.42154893,0
0.8512487,0.46879667,0
0.7996562,0.46212626,0
0.7328903,0.42863017,0
0.83016497,0.46724176,0
0.8083801,0.47457662,0
0.5915705,0.42318344,0
0.6701813,0.44028232,0
0.754907,0.43619484,0
0.7602918,0.41898477,0
0.64631844,0.4065891,0
0.8499351,0.47635257,0
0.7305593,0.44888857,0
0.776003,0.43782216,0
0.7354378,0.43342575,0
0.76981956,0.4521761,0
0.5875001,0.4168163,0
0.7554799,0.40751255,0
0.7062817,0.444155,0
0.8690902,0.46261862,0
0.73924035,0.4356777,0
0.67986006,0.4128957,0
0.6827219,0.44899935,0
0.86873615,0.48407036,0
0.76383543,0.4403711,0
0.576821,0.43064678,0
0.83262396,0.44064185,0
0.8376509,0.4402209,0
0.71064776,0.40210274,0
0.58762115,0.4237531,0
0.7384894,0.4073286,0
0.66940165,0.3964827,0
0.61975515,0.4198859,0
0.61684406,0.44895983,0
0.7122716,0.40192395,0
0.66927767,0.44516772,0
0.7869718,0.42257503,0
0.7494553,0.40824428,0
0.718333,0.40752164,0
0.771537,0.45953292,0
0.7895602,0.41714972,0
0.7372542,0.45000562,0
0.8069943,0.42173985,0
0.7504336,0.46704307,0
0.66673017,0.42661163,0
0.78937113,0.43264502,0
0.7197234,0.40516686,0
0.7840958,0.45551068,0
0.77787673,0.4516149,0
0.750894,0.44677368,0
0.8620246,0.46661538,0
0.8899349,0.46214703,0
0.7432559,0.45187864,0
0.72744125,0.41111854,0
0.7117417,0.4246276,0
0.6585123,0.43036067,0
0.82777387,0.4323186,0
0.75805223,0.4403917,0
0.86266047,0.46998516,0
0.7066582,0.40599757,0
0.7455769,0.43827912,0
0.88472784,0.48386732,0
0.7514511,0.4513762,0
0.70312726,0.45522255,0
0.6482421,0.43061122,0
0.7157201,0.42914066,0
0.6901761,0.43396595,0
0.7724477,0.40966645,0
0.6471579,0.43500742,0
0.7069936,0.4060341,0
0.77296686,0.43380603,0
0.8240387,0.45412788,0
0.8235665,0.4571896,0
0.68309563,0.41329452,0
0.381636,0.41669548,0
0.74321145,0.40244296,0
0.7477402,0.44551003,0
0.8169219,0.42102525,0
0.7255235,0.46772507,0
0.7140176,0.4345307,0
0.67749536,0.44737142,0
0.6723718,0.44214508,0
0.71567535,0.44709298,0
0.7442978,0.45495567,0
0.62210065,0.43285716,0
0.69390583,0.42510548,0
0.86117667,0.4531562,0
0.793612,0.43532115,0
0.7354121,0.44762152,0
0.80861527,0.43384552,0
0.7678485,0.4442764,0
0.81245977,0.4373516,0
0.78432125,0.42805868,0
0.6497713,0.435046,0
0.72885734,0.45649695,0
0.7727539,0.43615356,0
0.6837807,0.452519,0
0.88513833,0.4572065,0
0.82713866,0.4679444,0
0.8408707,0.44487917,0
0.8088495,0.44394454,0
0.75982934,0.41347018,0
0.7168024,0.4282856,0
0.7522959,0.44494757,0
0.8658507,0.4481389,0
0.62382996,0.43811128,0
0.6355579,0.4429356,0
0.71580875,0.4010143,0
0.87113804,0.46000174,0
0.7359414,0.4584185,0
0.7504896,0.41265583,0
0.88388985,0.46033636,0
0.6775697,0.42239282,0
0.7563091,0.4091909,0
0.80864847,0.4422841,0
0.68427384,0.4346648,0
0.72906977,0.41345504,0
0.73027766,0.4233212,0
0.5916462,0.41407403,0
0.6120679,0.41597843,0
0.61565375,0.39997503,0
0.75607973,0.45054233,0
0.6298333,0.4076806,0
0.7156829,0.42459577,0
0.7489076,0.45828164,0
0.6444431,0.44939527,0
0.70064056,0.42730778,0
0.63455796,0.44021192,0
0.4654661,0.41497564,0
0.6103427,0.43649969,0
0.81981057,0.4289571,0
0.7053146,0.44462177,0
0.82446784,0.4521721,0
0.7342688,0.4309195,0
0.73115635,0.45035946,0
0.78240526,0.46550316,0
0.72629637,0.44604155,0
0.7354008,0.4156396,0
0.6944531,0.4371615,0
0.7848138,0.4279123,0
0.80898345,0.4643014,0
0.5008095,0.42598096,0
0.8006767,0.4219098,0
0.31998593,0.40305462,0
0.73376673,0.45910713,0
0.6312038,0.4258828,0
0.5668804,0.41769564,0
0.40523428,0.4399651,0
0.84891355,0.43810764,0
0.7613759,0.44583556,0
0.7586388,0.4517948,0
0.8218273,0.45983884,0
0.8304742,0.43672878,0
0.829343,0.43817526,0
0.7916431,0.45366952,0
0.8339618,0.45027274,0
0.7798496,0.43556485,0
0.783159,0.42057773,0
0.7827376,0.45101425,0
0.90468496,0.4664245,0
0.82345414,0.45900428,0
0.8722715,0.47350046,0
0.7042117,0.45073494,0
0.7442485,0.43798256,0
0.7744029,0.45621717,0
0.7851617,0.44164208,0
0.6592328,0.41880977,0
0.72866035,0.44672504,0
0.6525317,0.45000678,0
0.65612215,0.42081055,0
0.7386705,0.42233524,0
0.70885473,0.44081995,0
0.7553477,0.41337928,0
0.7856585,0.4143688,0
0.817213,0.41673636,0
0.83475614,0.4547803,0
0.75323635,0.42932287,0
0.6622921,0.43804953,0
0.8023401,0.41797143,0
0.7961501,0.43944666,0
0.8481012,0.4468263,0
0.83782166,0.4849017,0
0.6189197,0.43403283,0
0.6911151,0.44037208,0
0.6141645,0.40641984,0
0.813978,0.4486085,0
0.73214215,0.44878998,0
0.80663735,0.44380197,0
0.7496794,0.44731942,0
0.7179966,0.4406749,0
0.78523684,0.45182863,0
0.88777685,0.4571255,0
0.8026453,0.43117294,0
0.76222694,0.44446313,0
0.79697514,0.46183982,0
0.82714146,0.4521122,0
0.83423674,0.44353154,0
0.7965273,0.4615227,0
0.81940085,0.43078437,0
0.70493805,0.42983755,0
0.7449168,0.443628,0
0.74647576,0.4493266,0
0.83475155,0.4667879,0
0.7953172,0.43658492,0
0.81607753,0.45505178,0
0.5807507,0.4202526,0
0.76602095,0.41553095,0
0.73883635,0.43629494,0
0.75426644,0.44748235,0
0.6686188,0.45759183,0
0.81301177,0.42595312,0
0.83251595,0.43678993,0
0.5466844,0.41999075,0
0.8660788,0.44740862,0
0.6647275,0.44348386,0
0.75675607,0.42499658,0
0.7354592,0.45490727,0
0.84087086,0.44051453,0
0.7185103,0.4439537,0
0.6638518,0.42166978,0
0.61201054,0.43638772,0
0.7599566,0.45757425,0
0.70184374,0.44952127,0
0.7013742,0.45524272,0
0.6545712,0.42396,0
0.6206152,0.42013818,0
0.71673983,0.45427075,0
0.7781066,0.41745144,0
0.76595676,0.42594332,0
0.8718332,0.48591977,0
0.6844318,0.44994417,0
0.77773535,0.456307,0
0.8574222,0.4328925,0
0.82718116,0.43810868,0
0.57729363,0.43378255,0
0.8267024,0.45369685,0
0.842043,0.44420797,0
0.8081703,0.46899912,0
0.82701415,0.44592956,0
0.6306507,0.46501416,0
0.7892762,0.47129092,0
0.82268876,0.4465857,0
0.6521093,0.42742902,0
0.7651577,0.411946,0
0.7958213,0.42236122,0
0.81212926,0.4305822,0
0.6837698,0.44438225,0
0.6409667,0.41851646,0
0.6372924,0.43271023,0
0.6593603,0.44258386,0
0.6860629,0.42411056,0
0.74442464,0.45594206,0
0.795998,0.4386524,0
0.8379806,0.42865545,0
0.7039394,0.4255219,0
0.7434086,0.4215949,0
0.78830695,0.46000707,0
0.6889892,0.43467355,0
0.51559275,0.42382076,0
0.8288951,0.43286097,0
0.77775156,0.43562123,0
0.8625879,0.4531789,0
0.66166466,0.45346862,0
0.8307734,0.44326305,0
0.7919826,0.4336744,0
0.77002025,0.44783473,0
0.77434474,0.43772632,0
0.76792246,0.40786016,0
0.59146166,0.42444068,0
0.8750133,0.46281752,0
0.7995131,0.4528769,0
0.662839,0.4243236,0
0.65463084,0.4483468,0
0.80094075,0.4544611,0
0.8084855,0.43323007,0
0.7788381,0.4384248,0
0.7819599,0.45205054,0
0.86733115,0.4566363,0
0.72518086,0.4504952,0
0.8195973,0.4320722,0
0.843466,0.45956036,0
0.7087951,0.42885605,0
0.594223,0.4179003,0
0.68642575,0.43585762,0
0.09718341,0.4567277,1
0.09618779,0.5004337,1
0.088354915,0.4794943,1
0.12807755,0.44755092,1
0.102880135,0.49775085,1
0.12967426,0.40752783,1
0.09064421,0.4942078,1
0.106065564,0.45362273,1
0.1571152,0.3806127,1
0.08885696,0.45816416,1
0.12829164,0.38600266,1
0.080806434,0.4448086,1
0.1187561,0.41463426,1
0.09663084,0.44547927,1
0.103902005,0.44330907,1
0.11437122,0.40001953,1
0.08408893,0.48680806,1
0.08989431,0.47294968,1
0.10461468,0.4177342,1
0.09553606,0.4704223,1
0.17461444,0.37993804,1
0.0959566,0.48126784,1
0.1442458,0.3891044,1
0.11756645,0.42378393,1
0.18002638,0.36759153,1
0.108142585,0.41344365,1
0.09202275,0.49209964,1
0.095139295,0.47415555,1
0.13872302,0.3898567,1
0.11603153,0.4073693,1
0.17260107,0.3658925,1
0.117221385,0.41238368,1
0.15340026,0.38436183,1
0.1400162,0.38872367,1
0.15662232,0.4041055,1
0.1310381,0.3848584,1
0.11730584,0.41710144,1
0.15984203,0.3823225,1
0.123861544,0.39969802,1
0.087863356,0.46785766,1
0.09779647,0.42686012,1
0.15154594,0.38292414,1
0.09572035,0.45505813,1
0.09060638,0.44624642,1
0.08269771,0.46185705,1
0.09046731,0.48292634,1
0.091964155,0.4482502,1
0.100175716,0.4676752,1
0.101034604,0.4329622,1
0.09823396,0.4562104,1
0.16951565,0.3688463,1
0.08782859,0.4572217,1
0.09888764,0.51284766,1
0.115317754,0.40476692,1
0.17077613,0.37641984,1
0.10611828,0.4180608,1
0.17561477,0.3929418,1
0.10078417,0.5181285,1
0.14332786,0.38751492,1
0.15750465,0.36865187,1
0.17528723,0.36327147,1
0.18826805,0.36515245,1
0.12782034,0.38282323,1
0.12846595,0.5426421,1
0.15114795,0.374077,1
0.14470153,0.36933494,1
0.098055385,0.40929332,1
0.104759246,0.5230533,1
0.107891075,0.39941385,1
0.106917515,0.41839722,1
0.112535626,0.39983788,1
0.10427482,0.52009076,1
0.2054718,0.3682818,1
0.1143056,0.3960916,1
0.08700997,0.47552913,1
0.09646477,0.5219175,1
0.21664843,0.36659768,1
0.09112141,0.4451467,1
0.11761636,0.39513367,1
0.0984935,0.4515207,1
0.12422232,0.3892881,1
0.118297175,0.5365299,1
0.09802721,0.514115,1
0.12896842,0.3872638,1
0.10033866,0.4821294,1
0.14866133,0.453695,1
0.09830298,0.53790736,1
0.0939887,0.48802665,1
0.11015915,0.5340155,1
0.112618916,0.5383582,1
0.12493667,0.5279399,1
0.14772667,0.37251988,1
0.1227086,0.39178234,1
0.088281624,0.44713154,1
0.10924607,0.53625333,1
0.11331287,0.5366667,1
0.08727587,0.45876852,1
0.10984448,0.4404814,1
0.15039207,0.3797853,1
0.19621111,0.36675578,1
0.108766176,0.5245551,1
0.10027993,0.44352835,1
0.12144033,0.53188753,1
0.104382806,0.45078406,1
0.08601389,0.4910305,1
0.12357354,0.38660276,1
0.10195629,0.4327977,1
0.10935179,0.40944496,1
0.09076834,0.43042684,1
0.116168395,0.42763755,1
0.103530064,0.45460707,1
0.12040986,0.42696393,1
0.16120756,0.371908,1
0.1770359,0.36709738,1
0.082955875,0.46223986,1
0.09633515,0.4700599,1
0.13961501,0.3757092,1
0.09671931,0.48581296,1
0.14801846,0.37921304,1
0.09656024,0.48999268,1
0.092124954,0.47987705,1
0.11654331,0.4020087,1
0.08468134,0.4979037,1
0.09595263,0.4820823,1
0.112053245,0.4190582,1
0.13916473,0.40645036,1
0.11105485,0.40331537,1
0.13883485,0.37524575,1
0.09533231,0.43922982,1
0.095243946,0.4916859,1
0.12619586,0.39679027,1
0.10166104,0.4430186,1
0.08544685,0.45619807,1
0.09634209,0.49935806,1
0.107064895,0.41765097,1
0.12609337,0.39475787,1
0.15044639,0.36983013,1
0.11130492,0.40046027,1
0.15996122,0.44202578,1
0.10910295,0.42667904,1
0.12304795,0.40339956,1
0.12375598,0.39103013,1
0.16907917,0.38299692,1
0.10501637,0.40421644,1
0.1841598,0.38177788,1
0.09867111,0.4085008,1
0.1423694,0.38154724,1
0.102282025,0.41661698,1
0.09386387,0.4190507,1
0.14351891,0.39092815,1
0.09160486,0.49310398,1
0.09311215,0.41858336,1
0.107288614,0.42893386,1
0.1401617,0.3877375,1
0.10735062,0.4035009,1
0.12890919,0.39784545,1
0.10073731,0.5059713,1
0.15452835,0.3893827,1
0.09411356,0.4456263,1
0.1070229,0.44439647,1
0.09497915,0.46947998,1
0.102036,0.40819153,1
0.11622627,0.43834856,1
0.11454945,0.4138939,1
0.10919587,0.4198487,1
0.098844185,0.48860937,1
0.13868533,0.41329092,1
0.105194286,0.4308208,1
0.10108182,0.5158562,1
0.159498,0.3796065,1
0.09781025,0.5007096,1
0.097851135,0.5016205,1
0.11055733,0.52793646,1
0.10378148,0.40467522,1
0.13022648,0.43535608,1
0.13458735,0.42988688,1
0.09817807,0.5025123,1
0.09609302,0.50708485,1
0.107977316,0.53271204,1
0.092726655,0.47131217,1
0.119773,0.40809578,1
0.09976953,0.5080687,1
0.15041949,0.37671712,1
0.09551257,0.46126512,1
0.14607057,0.38116252,1
0.10757569,0.42599404,1
0.105193265,0.4309372,1
0.12489548,0.389017,1
0.10739909,0.5036393,1
0.110928036,0.4265269,1
0.087715946,0.48036063,1
0.096382365,0.48231828,1
0.09796811,0.4859066,1
0.112546,0.41576448,1
0.124494225,0.38159347,1
0.14577647,0.37699598,1
0.1101464,0.4991003,1
0.15955706,0.36899668,1
0.10177918,0.42442444,1
0.114652775,0.41754544,1
0.12502407,0.41360322,1
0.16767554,0.37415695,1
0.100526914,0.4501569,1
0.10274944,0.42079616,1
0.10164457,0.48941624,1
0.11878197,0.41263092,1
0.13706067,0.39470804,1
0.12677693,0.41725117,1
0.109820545,0.429243,1
0.15565173,0.37476298,1
0.14901409,0.367148,1
0.12016167,0.39302245,1
0.15084334,0.37815958,1
0.11922595,0.39642927,1
0.09534339,0.4426507,1
0.123276256,0.43535092,1
0.10835073,0.5142572,1
0.17111008,0.37241358,1
0.14870347,0.37278163,1
0.11812058,0.41118878,1
0.16283181,0.37345776,1
0.1509126,0.38262096,1
0.08145719,0.4853368,1
0.13127837,0.43339223,1
0.14078109,0.42504516,1
0.15880567,0.42946398,1
0.14818294,0.3861275,1
0.11382957,0.4282803,1
0.12829039,0.44782957,1
0.12979047,0.41841993,1
0.1421028,0.43531063,1
0.121058285,0.44455308,1
0.1250665,0.41732922,1
0.14841609,0.3718317,1
0.10366867,0.5356153,1
0.12408283,0.39911765,1
0.14314146,0.44398865,1
0.14918378,0.37527555,1
0.18113908,0.41364378,1
0.19318795,0.41070184,1
0.11058369,0.3989208,1
0.1329316,0.38684556,1
0.20526972,0.362946,1
0.1629004,0.3650361,1
0.14256988,0.39647055,1
0.1676116,0.3643717,1
0.17784788,0.37350693,1
0.14605334,0.38502362,1
0.11508204,0.42704538,1
0.14528506,0.3749606,1
0.12047902,0.40953153,1
0.09110947,0.46204743,1
0.08679964,0.47358873,1
0.111812,0.5458349,1
0.13418618,0.38661203,1
0.08113094,0.51356685,1
0.092406705,0.42969015,1
0.09836948,0.49365824,1
0.11002229,0.45630887,1
0.095338486,0.46389517,1
0.15363558,0.36683178,1
0.07961313,0.48359674,1
0.11556763,0.4347366,1
0.1664349,0.36654866,1
0.20263037,0.41198832,1
0.099496216,0.5097068,1
0.10372241,0.5069703,1
0.18699542,0.40055344,1
0.1702031,0.4089604,1
0.11999359,0.42195892,1
0.11775651,0.4120952,1
0.1312047,0.536131,1
0.18639746,0.39297232,1
0.1163417,0.4309327,1
0.173411,0.41454524,1
0.109303296,0.446478,1
0.103953205,0.5062666,1
0.09125586,0.52544636,1
0.12947536,0.39343134,1
0.11678567,0.399421,1
0.090062685,0.47159174,1
0.08603484,0.46198076,1
0.14595263,0.37729734,1
0.10260227,0.4333958,1
0.12122545,0.390675,1
0.0940495,0.50925833,1
0.09329072,0.51930267,1
0.12329079,0.3911555,1
0.13403043,0.38522097,1
0.10606715,0.42919722,1
0.13635913,0.38276294,1
0.1347337,0.39165163,1
0.12968598,0.40958536,1
0.094260424,0.4895595,1
0.09718852,0.4236414,1
0.09167529,0.49687034,1
0.15882662,0.371707,1
0.1771574,0.3745363,1
0.094091676,0.5111457,1
0.14052376,0.38066426,1
0.0851879,0.50233173,1
0.19338116,0.36817744,1
0.10562235,0.51601005,1
0.09554968,0.5083625,1
0.08214879,0.48369163,1
0.12690142,0.40674484,1
0.099342965,0.4556921,1
0.09250685,0.45286253,1
0.08972931,0.44941866,1
0.14027485,0.42183053,1
0.106991686,0.44578218,1
0.14000148,0.39337543,1
0.10043116,0.46947923,1
0.08629145,0.4566462,1
0.10321669,0.43422768,1
0.12566036,0.40630403,1
0.12937649,0.4100497,1
0.10460662,0.41914555,1
0.09355682,0.5025494,1
0.1351372,0.38198474,1
0.09267049,0.4473291,1
0.09183606,0.44449636,1
0.111418664,0.41386327,1
0.10291774,0.4431049,1
0.12699692,0.41753152,1
0.122091755,0.42220676,1
0.16657567,0.36479837,1
0.14515994,0.39230135,1
0.16834316,0.367853,1
0.12114991,0.42290404,1
0.08284928,0.4675442,1
0.11897491,0.40598664,1
0.10789877,0.4007476,1
0.09490529,0.4842143,1
0.094911896,0.50649935,1
0.09662769,0.4686367,1
0.08420604,0.48830214,1
0.10193387,0.48748678,1
0.08732622,0.4568312,1
0.121894136,0.41678986,1
0.11227015,0.42084917,1
0.10187862,0.4867424,1
0.095182896,0.48651725,1
0.13363767,0.389836,1
0.10320947,0.4830735,1
0.115874946,0.3926247,1
0.10460873,0.46438196,1
0.13529073,0.3892664,1
0.13879254,0.3863783,1
0.13096835,0.3972436,1
0.11421928,0.5203173,1
0.093835644,0.45290995,1
0.19828619,0.36448756,1
0.08732254,0.48280114,1
0.13078183,0.39359403,1
0.10477127,0.49368072,1
0.13836987,0.37639675,1
0.093278624,0.4660861,1
0.17401248,0.36338225,1
0.15772189,0.36921346,1
0.08200283,0.45624956,1
0.10298621,0.47674224,1
0.1497515,0.36935523,1
0.086969376,0.5245863,1
0.11519452,0.4143368,1
0.10088687,0.52001375,1
0.09793971,0.47679552,1
0.096054725,0.46795604,1
0.1375593,0.4106346,1
0.09859589,0.5148951,1
0.0981421,0.47766322,1
0.11850236,0.4316451,1
0.10235677,0.47876754,1
0.08933375,0.4934971,1
0.08351241,0.46899328,1
0.10683732,0.437214,1
0.13840207,0.39903417,1
0.07931736,0.47175795,1
0.080957614,0.4691672,1
0.08041819,0.47512493,1
0.10824648,0.43428454,1
0.09214235,0.4645139,1
0.08787429,0.4723496,1
0.12338122,0.38585365,1
0.09288478,0.47243714,1
0.08900903,0.45219007,1
0.0930624,0.50187045,1
0.100691445,0.5067861,1
0.11330227,0.42492846,1
0.10078933,0.44280773,1
0.10177439,0.41144398,1
0.09007694,0.46819752,1
0.14576514,0.39237073,1
0.20453714,0.5335674,1
0.10183633,0.45847768,1
0.09410228,0.51577693,1
0.11981606,0.537564,1
0.09484747,0.48665497,1
0.09494748,0.45725423,1
0.08077227,0.45830503,1
0.11135747,0.53535986,1
0.103859626,0.5118153,1
0.08768741,0.4383594,1
0.0973743,0.50045615,1
0.10071932,0.50118834,1
0.103274465,0.49297753,1
0.08721144,0.5149955,1
0.094110414,0.4975466,1
0.08698649,0.526371,1
0.10352702,0.51603645,1
0.10418429,0.5124345,1
0.10477613,0.43392035,1
0.08716274,0.49535033,1
0.14324665,0.3806758,1
0.10390548,0.46651283,1
0.07974369,0.4732243,1
0.12630175,0.5059377,1
0.08289046,0.45813343,1
0.10061097,0.521456,1
0.10543872,0.4809088,1
0.08324352,0.47453818,1
0.09596764,0.5106678,1
0.097438075,0.509147,1
0.09396037,0.50529855,1
0.09234216,0.48638275,1
0.0900441,0.45260373,1
0.102349766,0.51625496,1
0.08573717,0.4764627,1
0.10652388,0.43198687,1
0.10150849,0.51412493,1
0.112401955,0.4212311,1
0.26668307,0.49741662,1
0.111627474,0.4270383,1
0.114124015,0.4306825,1
0.092761874,0.45960453,1
0.17158481,0.37013564,1
0.08907135,0.49464235,1
0.09776784,0.5098271,1
0.13525227,0.4554537,1
0.1174715,0.40774453,1
0.095589,0.51808625,1
0.09820396,0.508207,1
0.09679126,0.49180675,1
0.09160157,0.44762468,1
0.09318533,0.5009346,1
0.0842783,0.5019846,1
0.10007013,0.5201032,1
0.08973222,0.47195408,1
0.113218,0.53790605,1
0.09432712,0.5114908,1
0.09181606,0.49858704,1
0.095246084,0.51666874,1
0.08921142,0.45826727,1
0.09039736,0.4864685,1
0.11699387,0.40539896,1
0.08024148,0.4753984,1
0.08291257,0.46716157,1
0.08336153,0.46443987,1
0.1186824,0.5373776,1
0.08476833,0.47670183,1
0.12776719,0.3943588,1
0.1089277,0.44205034,1
0.09138544,0.518579,1
0.08740941,0.5223681,1
0.092577524,0.4584471,1
0.091571115,0.48148707,1
0.18585695,0.3927925,1
0.08756321,0.47028685,1
0.1497104,0.3847391,1
0.0932831,0.4867929,1
0.09128962,0.4825313,1
0.09339807,0.47747743,1
0.088347726,0.48827055,1
0.09769212,0.53181905,1
0.09374584,0.48177353,1
0.12663916,0.41393933,1
0.09740872,0.46796194,1
0.079220034,0.5052505,1
0.09918701,0.49159935,1
0.099159576,0.46050262,1
0.10839755,0.48437402,1
0.17957002,0.41850036,1
0.07900146,0.46860397,1
0.091417156,0.49176413,1
0.09392452,0.42203623,1
0.1172758,0.49293232,1
0.07946971,0.46123216,1
0.13527834,0.39040554,1
0.09234861,0.44294092,1
0.09569712,0.48165265,1
0.10900279,0.5175863,1
0.09580077,0.49935126,1
0.10196478,0.4900268,1
0.099135086,0.49827904,1
0.085373096,0.45151454,1
0.102877155,0.47213274,1
0.09929847,0.47950006,1
0.17460762,0.37678254,1
0.09168306,0.49357492,1
0.094183624,0.44401243,1
0.09921112,0.47747862,1
0.11803264,0.53812987,1
0.098339595,0.436356,1
0.08852647,0.46522728,1
0.07917292,0.48630705,1
0.09060685,0.5189638,1
0.09102729,0.4962675,1
0.10064426,0.41766086,1
0.0891948,0.45440012,1
0.09157142,0.44149527,1
0.09868193,0.5013742,1
0.09846167,0.5273494,1
0.10539742,0.5206913,1
0.09655324,0.4751037,1
0.14789997,0.37575442,1
0.11186364,0.41409165,1
0.09515194,0.44870836,1
0.13059478,0.44314405,1
0.11042209,0.5266284,1
0.10053844,0.49596247,1
0.09123374,0.4556305,1
0.107467666,0.51440006,1
0.19425873,0.5085694,1
0.08000261,0.4845078,1
0.119572595,0.53513086,1
0.15478647,0.3738644,1
0.11083545,0.40119943,1
0.4165886,0.49029946,1
0.09602418,0.5125006,1
0.112867296,0.47266188,1
0.09249224,0.48408526,1
0.08824698,0.49874267,1
0.101990096,0.52986515,1
0.08773578,0.508258,1
0.09485606,0.49359643,1
0.098360986,0.47606695,1
0.10338839,0.47001413,1
0.09734651,0.5037523,1
0.09487498,0.46781784,1
0.104778156,0.449123,1
0.09653679,0.46142253,1
0.12734894,0.39997345,1
0.10599288,0.5117581,1
0.10128415,0.52786666,1
0.09820733,0.49414107,1
0.12315523,0.50919545,1
0.10669532,0.5174686,1
0.094432354,0.4264913,1
0.10092769,0.4905684,1
0.07938621,0.49111882,1
0.1003136,0.42839763,1
0.095101856,0.46100625,1
0.09038487,0.5187566,1
0.09855145,0.4484003,1
0.111354575,0.5321593,1
0.09754691,0.52004427,1
0.10643522,0.4222929,1
0.10228843,0.53160965,1
0.10266397,0.5211665,1
0.15207076,0.37579295,1
0.09758164,0.4563392,1
0.08732629,0.48567435,1
0.092705876,0.51374894,1
0.11157547,0.5373314,1
0.15031412,0.3795788,1
0.12217654,0.42339543,1
0.10338242,0.4400536,1
0.10485871,0.51953703,1
0.11073975,0.42327425,1
0.09707639,0.4965308,1
0.14173046,0.544331,1
0.08656969,0.50251746,1
0.10017721,0.4711108,1
0.098197274,0.5162164,1
0.11551395,0.39725658,1
0.097067274,0.4547834,1
0.10356441,0.52978164,1
0.08308704,0.44901243,1
0.09859825,0.45403275,1
0.11218921,0.42965674,1
0.08044336,0.5009815,1
0.09037621,0.5016469,1
0.09745943,0.4586771,1
0.08973631,0.46938783,1
0.098139875,0.50433683,1
0.09812434,0.49219227,1
0.09327471,0.48697907,1
0.09671258,0.5123307,1
0.08382496,0.47863153,1
0.13261794,0.38796276,1
0.09336073,0.47242975,1
0.08233525,0.4881715,1
0.08268971,0.47360173,1
0.11582526,0.47466004,1
0.15678301,0.37049168,1
0.113134205,0.53413814,1
0.091138594,0.46554604,1
0.0929961,0.48186585,1
0.09566343,0.51215756,1
0.1041537,0.41269112,1
0.097039714,0.5081609,1
0.089216046,0.45565102,1
0.09673087,0.42253536,1
0.10136975,0.5150344,1
0.09425923,0.46445575,1
0.095276244,0.4655366,1
0.10292459,0.5256462,1
0.10714148,0.5050862,1
0.09420514,0.4619693,1
0.08954375,0.49959847,1
0.09329887,0.49492893,1
0.09405008,0.4696625,1
0.09621656,0.50234365,1
0.09184246,0.5059543,1
0.103898205,0.51909465,1
0.109960616,0.5316755,1
0.119432956,0.54533297,1
0.16209015,0.38268778,1
0.111505754,0.5246935,1
0.0849953,0.4604531,1
0.18912712,0.3610635,1
0.09140812,0.4997549,1
0.09010757,0.48641405,1
0.09606239,0.4975413,1
0.10019518,0.49592364,1
0.095369294,0.51881486,1
0.08087391,0.46565938,1
0.109390356,0.43578905,1
0.09391271,0.50073534,1
0.14633946,0.41068012,1
0.124816984,0.5208385,1
0.10060934,0.5381312,1
0.10397427,0.43992332,1
0.088347845,0.50992817,1
0.09028061,0.45455343,1
0.113400884,0.5306054,1
0.087133534,0.4821048,1
0.096415535,0.49633604,1
0.08571026,0.5238117,1
0.111687966,0.5106359,1
0.09382782,0.52131546,1
0.09103745,0.51046425,1
0.09303177,0.44296646,1
0.09299271,0.5202442,1
0.08766756,0.479159,1
0.094337925,0.48910132,1
0.09380578,0.49062327,1
0.093285516,0.50288594,1
0.09830048,0.51311404,1
0.09037751,0.5134718,1
0.08977648,0.464174,1
0.090448685,0.49294728,1
0.08133975,0.47807243,1
0.098830305,0.50075126,1
0.09876056,0.5107751,1
0.097661756,0.5178043,1
0.09284762,0.46438387,1
0.1347808,0.503233,1
0.09509841,0.4375453,1
0.13040428,0.41078123,1
0.10264674,0.447845,1
0.101373486,0.48943606,1
0.11372556,0.407087,1
0.08564149,0.51000446,1
0.10980474,0.51998824,1
0.11456409,0.43950993,1
0.10989297,0.51226574,1
0.1003602,0.50311244,1
0.09769327,0.4592623,1
0.091396265,0.51263416,1
0.09209851,0.49343324,1
0.1080974,0.52703345,1
0.09221413,0.4510936,1
0.09792661,0.4667745,1
0.10980994,0.41389412,1
0.10232421,0.49546587,1
0.10335931,0.46208003,1
0.092040084,0.48726422,1
0.11270583,0.5074093,1
0.09570234,0.46965513,1
0.09200052,0.4922869,1
0.11464511,0.40377593,1
0.092298426,0.50689936,1
0.088696145,0.48537612,1
0.088783495,0.48581576,1
0.10424894,0.5229888,1
0.08790083,0.508453,1
0.10155722,0.47918046,1
0.10313312,0.4847487,1
0.09247288,0.47142786,1
0.11051962,0.42078644,1
0.110204615,0.44791192,1
0.07973237,0.46662256,1
0.079153836,0.49533224,1
0.08502538,0.5085031,1
0.08459776,0.49927044,1
0.1658243,0.5117,1
0.1015588,0.49557593,1
0.092231326,0.47045872,1
0.08712523,0.5190363,1
0.09439297,0.46052462,1
0.09258214,0.49985674,1
0.09582824,0.52248067,1
0.08991616,0.49942702,1
0.15376748,0.39515457,1
0.099336095,0.5094406,1
0.10774209,0.4780312,1
0.09589045,0.4871942,1
0.0997795,0.5063285,1
0.09330223,0.4737861,1
0.10112767,0.45377776,1
0.097386755,0.4928643,1
0.094703995,0.5077849,1
0.092444904,0.4285802,1
0.09309419,0.47437993,1
0.10340445,0.50741845,1
0.09500205,0.47586524,1
0.09704665,0.48813933,1
0.102266535,0.42041755,1
0.16040151,0.48904943,1
0.094052516,0.49114177,1
0.08437897,0.488601,1
0.1104716,0.41252917,1
0.10500073,0.4391636,1
0.08992935,0.43694663,1
0.09486425,0.45350957,1
0.091434464,0.48616838,1
0.09206602,0.48719007,1
0.08691176,0.449494,1
0.097800486,0.5232795,1
0.09043911,0.48504826,1
0.093500145,0.5298913,1
0.10112449,0.48872563,1
0.08934128,0.4921046,1
0.09038522,0.53364533,1
0.09814689,0.50564694,1
0.09300325,0.4644065,1
0.09361564,0.4675995,1
0.10018548,0.4970173,1
0.0990711,0.51329714,1
0.08297579,0.48314574,1
0.08283702,0.48743674,1
0.08203021,0.49649474,1
0.077923,0.49965346,1
0.07939716,0.4599515,1
0.07866902,0.46988654,1
0.096451,0.43891957,1
0.11621271,0.39968014,1
0.085613266,0.51477844,1
0.0999051,0.41463497,1
0.09229316,0.5186033,1
0.11547543,0.5372708,1
0.0961195,0.5100768,1
0.08933442,0.4885474,1
0.09063487,0.52710587,1
0.09991429,0.4474452,1
0.0790922,0.47212365,1
0.11201826,0.42628446,1
0.10293188,0.45268774,1
0.13316685,0.5267333,1
0.09920567,0.5214774,1
0.09341382,0.52726185,1
0.105435364,0.4874383,1
0.08399275,0.5056751,1
0.10778805,0.40650225,1
0.098674074,0.41089433,1
0.12740111,0.39672077,1
0.10521825,0.41743806,1
0.11060207,0.4148965,1
0.09195876,0.42752647,1
0.23374525,0.4547098,1
0.10281186,0.45481345,1
0.11409918,0.41053742,1
0.10264412,0.43413687,1
0.09950013,0.45818272,1
0.12287023,0.41268283,1
0.09178728,0.43000466,1
0.07769526,0.47589484,1
0.09634788,0.47624943,1
0.11159972,0.42059857,1
0.09998902,0.42853892,1
0.13267767,0.46716905,1
0.1190709,0.4096325,1
0.10080966,0.517478,1
0.10654136,0.41262463,1
0.10516584,0.51697105,1
0.09910544,0.50849533,1
0.08764555,0.48187903,1
0.09085623,0.47335625,1
0.10217319,0.51032525,1
0.08663609,0.48690417,1
0.16284393,0.45349523,1
0.08547988,0.5214658,1
0.10416191,0.5179804,1
0.097476386,0.53096056,1
0.11051707,0.5159637,1
0.10275819,0.5342901,1
0.102045834,0.5053906,1
0.09312105,0.5045971,1
0.0846061,0.49732322,1
0.09676848,0.5206152,1
0.09948297,0.5090233,1
0.1018991,0.51675695,1
0.10177019,0.50969535,1
0.10265978,0.50517595,1
0.09610754,0.49430785,1
0.109053485,0.5194615,1
0.108106695,0.43042567,1
0.11222608,0.4064861,1
0.11201262,0.41396904,1
0.110463925,0.42163873,1
0.11332017,0.41186875,1
0.102510564,0.44173875,1
0.11178789,0.4284341,1
0.13053657,0.40295008,1
0.090732574,0.44891235,1
0.09504893,0.44514313,1
0.09668205,0.4239044,1
0.09876776,0.51169276,1
0.0862731,0.49284312,1
0.09514138,0.4459291,1
0.09774892,0.50480807,1
0.17461617,0.37328544,1
0.092951335,0.49676594,1
0.10874086,0.41053087,1
0.08798386,0.49711502,1
0.09839624,0.5124091,1
0.090340465,0.48958385,1
0.09504484,0.5098976,1
0.0894699,0.43816712,1
0.13094752,0.4190057,1
0.14719155,0.41298804,1
0.11773464,0.42111665,1
0.108680785,0.42471388,1
0.11904819,0.41855654,1
0.087726966,0.4593927,1
0.14228646,0.3933014,1
0.116467915,0.41943526,1
0.13186033,0.39172715,1
0.095000066,0.43074,1
0.09934992,0.4542291,1
0.094812,0.46168613,1
0.09702289,0.50216156,1
0.09716192,0.44864672,1
0.10322281,0.43607032,1
0.08513684,0.45384943,1
0.1266925,0.38315457,1
0.094808005,0.4575514,1
0.10300457,0.43064904,1
0.14223559,0.3924183,1
0.10130831,0.42566538,1
0.12680377,0.3925146,1
0.112627454,0.40227106,1
0.091456585,0.4981194,1
0.09170472,0.43840024,1
0.08862459,0.5112489,1
0.08309291,0.46823704,1
0.08872562,0.4466395,1
0.09643749,0.47209176,1
0.09200279,0.44384256,1
0.11642255,0.4102954,1
0.11758293,0.40954652,1
0.08856506,0.42937735,1
0.10719551,0.41124216,1
0.089175634,0.4441616,1
0.0843183,0.46214116,1
0.09844475,0.45699602,1
0.08858855,0.4601311,1
0.084356055,0.45926952,1
0.09051371,0.45339558,1
0.09985526,0.45483485,1
0.10004911,0.47300225,1
0.094692916,0.49660394,1
0.101711534,0.4847082,1
0.09641141,0.49198234,1
0.09930057,0.475475,1
0.08746314,0.45180815,1
0.10555685,0.5150488,1
0.0915845,0.47861317,1
0.077720895,0.4807071,1
0.09563873,0.49753144,1
0.08707374,0.45364273,1
0.117224194,0.42412674,1
0.13121696,0.4020612,1
0.13656417,0.38513073,1
0.12519476,0.4050547,1
0.10070308,0.43017143,1
0.10896685,0.4165428,1
0.13282149,0.3933347,1
0.119593695,0.40734047,1
0.10705267,0.41945422,1
0.14763898,0.3936337,1
0.12058852,0.4032513,1
0.10595095,0.43170276,1
0.096098766,0.49306723,1
0.08422803,0.51606804,1
0.0901384,0.4697557,1
0.09157431,0.49269363,1
0.09241352,0.51691043,1
0.082529955,0.47618774,1
0.11360696,0.46966323,1
0.11264991,0.47942662,1
0.11452575,0.43792373,1
0.0999248,0.50683564,1
0.09629839,0.501787,1
0.085125044,0.4807914,1
0.084179685,0.4742454,1
0.09228076,0.5144015,1
0.08881659,0.46571574,1
0.11007857,0.40997267,1
0.10018061,0.5147704,1
0.10357933,0.42893058,1
0.12075586,0.3999804,1
0.10356625,0.44384396,1
0.080243796,0.4583203,1
0.081872776,0.47376338,1
0.10102759,0.46081924,1
0.08403791,0.4576794,1
0.117755346,0.41052368,1
0.1330795,0.41636348,1
0.08840839,0.4547095,1
0.08402527,0.4569595,1
0.08756064,0.5078073,1
0.09686789,0.5088833,1
0.09529251,0.46611634,1
0.09762883,0.48018286,1
0.10539891,0.4959144,1
0.10404454,0.5140889,1
0.10280305,0.5096921,1
0.11485517,0.50067127,1
0.12317227,0.49397078,1
0.10920257,0.5281761,1
0.08812797,0.5268433,1
0.10109041,0.52918994,1
0.10112958,0.52524453,1
0.09373757,0.5212764,1
0.10794711,0.5273749,1
0.119216055,0.5083036,1
0.102134,0.523799,1
0.09751601,0.5232544,1
0.10567985,0.52966815,1
0.09767164,0.51981294,1
0.10342499,0.5200631,1
0.11411515,0.54007566,1
0.0993414,0.52986914,1
0.09636211,0.50180274,1
0.107331574,0.51029986,1
0.110305905,0.51774603,1
0.09212711,0.5309526,1
0.08864382,0.49480027,1
0.10834257,0.53113204,1
0.10248098,0.43493497,1
0.11145699,0.41142255,1
0.1007169,0.47962418,1
0.08341569,0.4666234,1
0.090518855,0.4800937,1
0.10002949,0.4381256,1
0.10793607,0.53269255,1
0.10743843,0.5343567,1
0.08414374,0.5234272,1
0.103616625,0.5135588,1
0.0892025,0.4996806,1
0.09775724,0.51711315,1
0.0935081,0.49629298,1
0.104059726,0.5182353,1
0.09044138,0.5183247,1
0.10153635,0.5215152,1
0.12808035,0.39796838,1
0.09371856,0.48989904,1
0.09530238,0.4709706,1
0.09631541,0.4644568,1
0.09589403,0.49674118,1
0.101081245,0.5078512,1
0.093723975,0.48129743,1
0.08789193,0.4641255,1
0.0952317,0.5076783,1
0.1026928,0.50899833,1
0.10189703,0.4536814,1
0.10089521,0.5213985,1
0.08418983,0.4757668,1
0.09587866,0.5035338,1
0.13198376,0.5201355,1
0.091123655,0.49141878,1
0.09212457,0.47733593,1
0.08409705,0.49934283,1
0.07616297,0.4626269,1
0.12281684,0.391565,1
0.09152762,0.47644258,1
0.08944144,0.50374657,1
0.09250697,0.4909832,1
0.16581331,0.37194893,1
0.09804024,0.4536251,1
0.21693394,0.49714926,1
0.09256781,0.45803696,1
0.08917056,0.48794398,1
0.08362739,0.5076362,1
0.0817735,0.44853243,1
0.08009305,0.46013197,1
0.08719876,0.45697948,1
0.09899783,0.44077373,1
0.11587931,0.49218047,1
0.09996692,0.45247257,1
0.091401376,0.44642967,1
0.084661685,0.50239795,1
0.09482348,0.44787604,1
0.08393111,0.45757115,1
0.09874097,0.51699686,1
0.096805334,0.5033564,1
0.092561774,0.5253978,1
0.17276466,0.37285924,1
0.10224112,0.44657862,1
0.102408335,0.46762776,1
0.08734852,0.47978517,1
0.0831672,0.4793145,1
0.09876087,0.42487532,1
0.098387,0.5112354,1
0.10590714,0.51664704,1
0.10404114,0.48748395,1
0.103144184,0.52755964,1
0.08266548,0.4730473,1
0.101852685,0.5261377,1
0.09866432,0.5203123,1
0.09190993,0.48744917,1
0.10280764,0.50839275,1
0.09318502,0.4967459,1
0.09139157,0.4509695,1
0.09545824,0.47540182,1
0.10225362,0.45581755,1
0.09388531,0.5149517,1
0.10430448,0.43884516,1
0.11104209,0.52485573,1
0.13170762,0.38893712,1
0.10904794,0.5305553,1
0.09963638,0.5155298,1
0.099361144,0.4441776,1
0.08142049,0.50359106,1
0.08547048,0.50720733,1
0.09734372,0.47341442,1
0.09182088,0.42869624,1
0.09990303,0.51755023,1
0.10738833,0.51394665,1
0.09068436,0.51068485,1
0.101827666,0.52165836,1
0.10972164,0.43359044,1
0.08040189,0.45554957,1
0.09332004,0.50242966,1
0.09446073,0.4724981,1
0.09205667,0.49613965,1
0.08616537,0.4742882,1
0.11357545,0.536155,1
0.110811524,0.40532884,1
0.10531406,0.51728004,1
0.094849095,0.4357826,1
0.08595891,0.4465682,1
0.09818441,0.50849324,1
0.12979925,0.4075156,1
0.11012181,0.5260173,1
0.091446824,0.43968686,1
0.09733501,0.5095741,1
0.096746966,0.45902038,1
0.10847103,0.42202222,1
0.105387025,0.5303158,1
0.09645378,0.4787429,1
0.101733744,0.5132784,1
0.08644524,0.46397188,1
0.093475915,0.45145077,1
0.0955933,0.4257207,1
0.10706652,0.47638673,1
0.10292902,0.5196253,1
0.08705727,0.47435018,1
0.0849185,0.47130093,1
0.08986929,0.4684604,1
0.092779905,0.4768588,1
0.097774625,0.51683104,1
0.088497095,0.5153805,1
0.09933151,0.47780994,1
0.09577592,0.52441484,1
0.086738005,0.45939225,1
0.11275762,0.46473756,1
0.093497925,0.4859593,1
0.117347665,0.41389292,1
0.091348425,0.43826914,1
0.10789168,0.5182468,1
0.10041475,0.45293313,1
0.096517354,0.42131478,1
0.09581878,0.48648947,1
0.1026509,0.5019908,1
0.10093314,0.41857633,1
0.08965526,0.5101566,1
0.09753392,0.49317357,1
0.10416349,0.5125129,1
0.09256931,0.47247744,1
0.09966028,0.50694054,1
0.14083673,0.3831736,1
0.09672051,0.51671296,1
0.0924513,0.49812973,1
0.14567134,0.40185967,1
0.10217437,0.5368809,1
0.1058176,0.5165365,1
0.09678444,0.50085825,1
0.083503366,0.49100786,1
0.09316141,0.50770277,1
0.089847445,0.46725363,1
0.10105171,0.5183604,1
0.09397451,0.46739712,1
0.094683446,0.44425797,1
0.09514332,0.46232858,1
0.09381723,0.49173582,1
0.09495474,0.5087998,1
0.17267762,0.50422853,1
0.2319318,0.50922763,1
0.097324654,0.4571311,1
0.10086448,0.49712932,1
0.15922081,0.38254154,1
0.101217434,0.51304984,1
0.08132133,0.5007907,1
0.09580165,0.46273735,1
0.09234574,0.43872875,1
0.08929367,0.49783114,1
0.1077525,0.5163583,1
0.09118165,0.51861995,1
0.103320666,0.49373436,1
0.09393641,0.4811935,1
0.084128104,0.50330764,1
0.11494449,0.42057142,1
0.09592923,0.4863113,1
0.11460714,0.39766604,1
0.08040063,0.48568797,1
0.09535461,0.48153403,1
0.09559348,0.45112917,1
0.09680721,0.50543904,1
0.13144803,0.39666742,1
0.088285916,0.5090894,1
0.11602059,0.41451353,1
0.092341356,0.45635659,1
