PC1,PC2,label
0.5486649,0.23927519,0
0.66099924,0.24396214,0
0.4636353,0.36143368,0
0.57583576,0.2430331,0
0.81789273,0.52602094,0
0.7789043,0.23986872,0
0.38711464,0.2853819,0
0.80968267,0.5024925,0
0.6145689,0.49046126,0
0.7952843,0.49765217,0
0.57189196,0.24206367,0
0.6814199,0.2531414,0
0.80058134,0.43135098,0
0.7288431,0.25518125,0
0.7300814,0.20653616,0
0.7606886,0.6527232,0
0.79896754,0.48443556,0
0.5097162,0.32318756,0
0.8242378,0.51568294,0
0.7775362,0.33803824,0
0.6867034,0.4642784,0
0.78983295,0.42744556,0
0.7154584,0.42067662,0
0.7963408,0.33821067,0
0.8048872,0.42812467,0
0.66216224,0.306396,0
0.49449313,0.4538526,0
0.7029975,0.21797116,0
0.8364096,0.43796742,0
0.7700622,0.3057139,0
0.45195118,0.39717388,0
0.77693677,0.58138084,0
0.8291895,0.47036996,0
0.80226535,0.5586152,0
0.82497895,0.42691204,0
0.696836,0.23774317,0
0.7976642,0.5708721,0
0.79337174,0.38734293,0
0.6044031,0.19466747,0
0.58098286,0.28671673,0
0.7262963,0.2895054,0
0.5616244,0.3064058,0
0.80600065,0.484728,0
0.635546,0.39227644,0
0.7510542,0.47876263,0
0.5620499,0.45960703,0
0.78337,0.39845738,0
0.6532452,0.2502768,0
0.79212207,0.34315655,0
0.8108589,0.5581935,0
0.789178,0.53659374,0
0.608522,0.2949785,0
0.80324465,0.47823772,0
0.83175457,0.46321025,0
0.7168237,0.2547428,0
0.39444062,0.5852398,0
0.78474784,0.41204026,0
0.65942866,0.23090808,0
0.7775666,0.28154534,0
0.6530374,0.4053233,0
0.5804853,0.20798367,0
0.676616,0.21555783,0
0.6213181,0.24101584,0
0.78520834,0.30621725,0
0.83563024,0.4107735,0
0.6786206,0.36875954,0
0.67758214,0.42363977,0
0.5211554,0.40499657,0
0.74294585,0.25343007,0
0.7600097,0.2500722,0
0.66471386,0.2863251,0
0.732698,0.40418905,0
0.55570024,0.32064852,0
0.650609,0.3269656,0
0.6728575,0.21174623,0
0.6678101,0.30809173,0
0.6553959,0.4483649,0
0.74578565,0.30509222,0
0.7480334,0.30062723,0
0.7130657,0.49145177,0
0.7391531,0.42725697,0
0.6654383,0.31000584,0
0.47086084,0.268247,0
0.6045486,0.40452707,0
0.6590567,0.5004178,0
0.6602162,0.30143437,0
0.29996935,0.3966993,0
0.5301564,0.28653598,0
0.47583145,0.35940447,0
0.79957664,0.41750023,0
0.6970557,0.32248133,0
0.6886137,0.5427491,0
0.6205926,0.5535939,0
0.45658967,0.64497036,0
0.585556,0.38103566,0
0.73253334,0.64147276,0
0.5617274,0.48735207,0
0.76362747,0.27145383,0
0.6496515,0.21181788,0
0.54287505,0.59885573,0
0.50327533,0.30599293,0
0.53726333,0.26461303,0
0.78073114,0.33083504,0
0.67440766,0.19520989,0
0.6313168,0.26946315,0
0.76512736,0.4415922,0
0.66368204,0.21370895,0
0.6841613,0.4789849,0
0.66472024,0.40834424,0
0.5860179,0.29995418,0
0.6109805,0.24862944,0
0.7878833,0.43042043,0
0.72519016,0.24092957,0
0.68291366,0.51509196,0
0.8408973,0.40288404,0
0.621221,0.39814094,0
0.61193943,0.2637747,0
0.5263745,0.49541262,0
0.71569765,0.27045873,0
0.7337111,0.43018562,0
0.81757367,0.4065425,0
0.8113166,0.46192175,0
0.6815245,0.30352533,0
0.7578699,0.3995588,0
0.698397,0.21092932,0
0.77281743,0.4115607,0
0.6677812,0.250358,0
0.669839,0.25090876,0
0.6976557,0.3215971,0
0.5838041,0.47841635,0
0.5089873,0.39042342,0
0.6913628,0.25237846,0
0.59550714,0.29688033,0
0.5985403,0.38915783,0
0.60961944,0.2616693,0
0.7810644,0.2042658,0
0.62829673,0.384225,0
0.4440624,0.39905027,0
0.62384295,0.4151488,0
0.4793283,0.35363683,0
0.5144648,0.35622764,0
0.61304843,0.2067883,0
0.710514,0.25628352,0
0.8297193,0.4250001,0
0.74765676,0.5793338,0
0.6579445,0.45437536,0
0.74974144,0.50911206,0
0.44600385,0.42838022,0
0.5322999,0.35615203,0
0.7934348,0.2502522,0
0.63166857,0.24334864,0
0.51380205,0.58543867,0
0.5552282,0.21223675,0
0.64669,0.47703874,0
0.5621552,0.46879488,0
0.64307517,0.47083104,0
0.55924374,0.42720398,0
0.6360454,0.47510877,0
0.6039891,0.30898616,0
0.60094976,0.33296224,0
0.63733506,0.442607,0
0.7404245,0.33570865,0
0.5099022,0.4096825,0
0.62224835,0.2929388,0
0.6406164,0.46972767,0
0.5734875,0.47591347,0
0.6533223,0.29289827,0
0.64732856,0.4782284,0
0.48543185,0.33837456,0
0.6821329,0.43762204,0
0.6677362,0.3367327,0
0.4495747,0.4126428,0
0.7197584,0.28769013,0
0.69963336,0.28802395,0
0.446482,0.55836344,0
0.7166912,0.49840954,0
0.65662944,0.2624563,0
0.67876875,0.29616284,0
0.38998368,0.32529795,0
0.54382974,0.25561345,0
0.6845377,0.3320916,0
0.6375993,0.31161103,0
0.51911247,0.5510789,0
0.55075705,0.23431042,0
0.8071517,0.3048572,0
0.7712268,0.38770103,0
0.6122984,0.26757556,0
0.45932016,0.37617263,0
0.589025,0.22048777,0
0.68757653,0.27788928,0
0.75248885,0.480056,0
0.7670449,0.29781055,0
0.7101937,0.35155582,0
0.809083,0.32049957,0
0.5504374,0.44108346,0
0.8028511,0.3075081,0
0.64276624,0.46176615,0
0.73945355,0.23776527,0
0.60253465,0.43725738,0
0.6638296,0.24408609,0
0.5596736,0.24663173,0
0.70643276,0.44548392,0
0.71158624,0.49491516,0
0.51228666,0.1946855,0
0.6659465,0.4456816,0
0.55317295,0.5174496,0
0.76141655,0.22961378,0
0.5839423,0.29276064,0
0.65329194,0.18245088,0
0.58858407,0.3239706,0
0.67879343,0.266442,0
0.7350174,0.56707704,0
0.7485032,0.2242723,0
0.7184737,0.2797135,0
0.5879236,0.24450262,0
0.67930555,0.38872948,0
0.6718734,0.2565646,0
0.43604365,0.3422194,0
0.8537495,0.4663505,0
0.5748812,0.46534476,0
0.7542218,0.41930243,0
0.5682262,0.44160986,0
0.76699835,0.23803304,0
0.4256298,0.5083717,0
0.83013713,0.47785577,0
0.7326469,0.315988,0
0.7692054,0.46202993,0
0.7595697,0.23989747,0
0.67201364,0.4167041,0
0.49752337,0.35360608,0
0.80197,0.3088963,0
0.7740893,0.26528484,0
0.6860854,0.3852726,0
0.7978823,0.50459766,0
0.76255685,0.23983815,0
0.84942466,0.3786358,0
0.85059786,0.38381407,0
0.63005173,0.19754869,0
0.61008084,0.18571796,0
0.62005407,0.57890743,0
0.50601524,0.3045214,0
0.66396195,0.46687043,0
0.7531185,0.39805442,0
0.42746264,0.405868,0
0.6860712,0.6008562,0
0.6941149,0.30601797,0
0.78844064,0.5245174,0
0.7433972,0.36296946,0
0.7743779,0.48009393,0
0.8410629,0.41473994,0
0.6127531,0.30002707,0
0.6035056,0.34046888,0
0.6270202,0.43146724,0
0.6143318,0.24137424,0
0.61352617,0.30870053,0
0.6447929,0.47630545,0
0.66739476,0.27225912,0
0.6158729,0.3230183,0
0.7289074,0.28964743,0
0.49816287,0.49213406,0
0.48436517,0.5918033,0
0.5572813,0.3743377,0
0.7320021,0.47043654,0
0.74216586,0.34309506,0
0.5097626,0.27087817,0
0.5532801,0.35833696,0
0.5241285,0.28566277,0
0.73416275,0.374984,0
0.6611303,0.33970806,0
0.5778051,0.30643588,0
0.7836241,0.39285797,0
0.4780545,0.34776127,0
0.64626426,0.41388553,0
0.6065714,0.22213556,0
0.753015,0.39691794,0
0.6941659,0.34428304,0
0.72997123,0.33318573,0
0.6359505,0.4565837,0
0.6523861,0.505626,0
0.33399934,0.6098486,0
0.5561178,0.3063474,0
0.745714,0.23888923,0
0.655352,0.3925328,0
0.692484,0.51329535,0
0.664275,0.3912936,0
0.7377494,0.24828032,0
0.59819835,0.3761571,0
0.5919239,0.55730623,0
0.6234538,0.5815424,0
0.7001406,0.36569995,0
0.7443715,0.24227099,0
0.53913194,0.34030175,0
0.7915289,0.2789423,0
0.76956314,0.21567446,0
0.7498524,0.27915514,0
0.7424289,0.22043912,0
0.6184432,0.32458115,0
0.60072696,0.3438553,0
0.57944745,0.39847365,0
0.43623582,0.37041536,0
0.6039828,0.28346843,0
0.48094565,0.39027086,0
0.6233537,0.403663,0
0.69218695,0.39747757,0
0.7618344,0.4622872,0
0.7516995,0.29707617,0
0.7725054,0.28348607,0
0.73657537,0.5215938,0
0.8085597,0.48581025,0
0.76734996,0.5673479,0
0.69166917,0.24041957,0
0.5200171,0.35689628,0
0.74074423,0.21839434,0
0.54235405,0.36794862,0
0.6701682,0.19856623,0
0.72624016,0.28097832,0
0.5900715,0.4161038,0
0.7730731,0.26567385,0
0.7789181,0.334949,0
0.6183534,0.26728904,0
0.644711,0.28343752,0
0.53390086,0.29886383,0
0.74774146,0.5090779,0
0.67390674,0.61026645,0
0.62543005,0.4233341,0
0.72289175,0.5533943,0
0.6225518,0.3798158,0
0.6442967,0.36976072,0
0.7075516,0.29390544,0
0.5010855,0.5457378,0
0.7466804,0.25404385,0
0.6905633,0.28272334,0
0.6375297,0.39770988,0
0.6818695,0.26513535,0
0.7286113,0.20667893,0
0.7834036,0.23408708,0
0.79091036,0.2388726,0
0.6426934,0.54033715,0
0.71395,0.38727945,0
0.72777134,0.22618613,0
0.6621108,0.34056178,0
0.60217136,0.49166042,0
0.71602273,0.37743497,0
0.50244135,0.44147745,0
0.7343629,0.35826665,0
0.6428487,0.24761137,0
0.5672948,0.41506207,0
0.60619485,0.43831265,0
0.66623455,0.5918909,0
0.8074015,0.35851094,0
0.51099163,0.42824137,0
0.79069775,0.38755688,0
0.82729703,0.34752345,0
0.7523544,0.42071652,0
0.6378381,0.49504992,0
0.82154405,0.2945219,0
0.6557428,0.4293887,0
0.6461648,0.4707569,0
0.7445856,0.3193834,0
0.75894684,0.3667834,0
0.7434392,0.65898305,0
0.61137724,0.55152726,0
0.7411837,0.26023936,0
0.7381365,0.27248958,0
0.5783307,0.40812096,0
0.63773644,0.41349533,0
0.77098316,0.4033389,0
0.66012806,0.4719004,0
0.45614496,0.6064043,0
0.53817564,0.461702,0
0.5987893,0.44814909,0
0.53568006,0.38713643,0
0.61315894,0.56425077,0
0.71834046,0.31979334,0
0.6289108,0.46685562,0
0.28348437,0.5896393,0
0.69593304,0.3919067,0
0.680121,0.5334729,0
0.59420615,0.6930884,0
0.5265056,0.34743303,0
0.6368379,0.28073195,0
0.719175,0.28285939,0
0.623441,0.43304858,0
0.65330285,0.2006309,0
0.6188502,0.26972625,0
0.7330563,0.45198673,0
0.6513214,0.2720839,0
0.75678664,0.46046016,0
0.6842734,0.33426392,0
0.7999017,0.45703954,0
0.7283629,0.47664934,0
0.55473757,0.68793726,0
0.6292402,0.36584473,0
0.47211015,0.34658638,0
0.83674955,0.46447778,0
0.68948,0.4304115,0
0.71421427,0.35857782,0
0.777493,0.5216849,0
0.7708894,0.4089769,0
0.7242659,0.4126694,0
0.82447755,0.31373376,0
0.8451103,0.31656346,0
0.82180715,0.2783348,0
0.72358406,0.5575923,0
0.82092285,0.25234696,0
0.8381498,0.38110882,0
0.7803284,0.41398755,0
0.75494355,0.5832782,0
0.80275285,0.41355976,0
0.81750864,0.38032833,0
0.79796827,0.31073785,0
0.81997436,0.35437185,0
0.76695335,0.30851611,0
0.7941825,0.38653952,0
0.78930056,0.40388036,0
0.7715236,0.4396495,0
0.75389534,0.4482731,0
0.7961812,0.5706887,0
0.79119974,0.52257705,0
0.73234403,0.36927786,0
0.78265506,0.39648494,0
0.7342862,0.6033899,0
0.83316064,0.33065635,0
0.69356936,0.50484085,0
0.6171966,0.5856553,0
0.8287501,0.47336686,0
0.7661396,0.47558704,0
0.73326826,0.46631604,0
0.7618991,0.38195747,0
0.7066208,0.21226333,0
0.55285066,0.37524116,0
0.6937006,0.36931828,0
0.52386385,0.45400193,0
0.64151716,0.66840017,0
0.78622836,0.49440715,0
0.66860723,0.50885075,0
0.7355046,0.484336,0
0.75037134,0.38180155,0
0.7149045,0.528256,0
0.7163983,0.48680884,0
0.65253466,0.6378539,0
0.5796762,0.49124238,0
0.63210166,0.5790304,0
0.63573176,0.56854165,0
0.65819097,0.48440132,0
0.59990585,0.56933594,0
0.7522364,0.22421366,0
0.7218759,0.5925077,0
0.6965037,0.19669661,0
0.77106,0.5199258,0
0.7618694,0.5268305,0
0.57199717,0.6101877,0
0.5240491,0.43480945,0
0.6845476,0.4334327,0
0.44346097,0.36274818,0
0.58560914,0.49378598,0
0.777441,0.41792697,0
0.77437806,0.47914335,0
0.7270722,0.4185136,0
0.7906632,0.4447132,0
0.7789696,0.5103173,0
0.7814081,0.51481473,0
0.73247457,0.5850872,0
0.74559426,0.48119617,0
0.6659551,0.5030067,0
0.7363395,0.4632256,0
0.6937411,0.54351026,0
0.6872097,0.5641098,0
0.48818877,0.38552243,0
0.49765104,0.42982358,0
0.566911,0.45708477,0
0.5988916,0.52260643,0
0.8290408,0.41301313,0
0.47901946,0.44373292,0
0.53741604,0.33269182,0
0.5997791,0.26476398,0
0.5341236,0.59363693,0
0.5997257,0.5816803,0
0.63765734,0.544268,0
0.7688168,0.27056065,0
0.6624577,0.6151942,0
0.59568167,0.240872,0
0.5971513,0.41634685,0
0.7768979,0.41890502,0
0.57823616,0.5965055,0
0.4323115,0.3649469,0
0.7199817,0.21587707,0
0.77018124,0.37865725,0
0.7017907,0.22193332,0
0.69856316,0.5780911,0
0.7062432,0.26881635,0
0.6558229,0.3405163,0
0.5143551,0.39374825,0
0.61726046,0.5575073,0
0.5698422,0.3722197,0
0.6283657,0.19715437,0
0.5227095,0.30901974,0
0.5725466,0.30096063,0
0.6057236,0.4427235,0
0.6668087,0.63958436,0
0.5879829,0.4850155,0
0.46984676,0.59861887,0
0.7053697,0.34805632,0
0.6833753,0.5494783,0
0.5988373,0.41366646,0
0.6854582,0.55648935,0
0.6854998,0.2863503,0
0.55565476,0.3169034,0
0.57248414,0.5226944,0
0.54624295,0.6048904,0
0.6508264,0.44086528,0
0.4627623,0.38705662,0
0.58975685,0.5853811,0
0.73780525,0.39795697,0
0.5195557,0.57525307,0
0.7460353,0.35197005,0
0.41657647,0.5513443,0
0.7835294,0.30687603,0
0.7189774,0.31659976,0
0.7831489,0.380412,0
0.7600196,0.3573055,0
0.5471682,0.50993747,0
0.7721642,0.40193725,0
0.67780477,0.33070314,0
0.5918181,0.4348216,0
0.63472986,0.22339642,0
0.7355886,0.4351308,0
0.677911,0.35957018,0
0.46302515,0.6066536,0
0.5789353,0.42371365,0
0.7246347,0.51632094,0
0.5225949,0.39064053,0
0.62186074,0.33445817,0
0.59914553,0.4197064,0
0.7111864,0.35396698,0
0.42371005,0.553486,0
0.6435351,0.5321129,0
0.7675509,0.27121067,0
0.689607,0.23089346,0
0.58914703,0.40683523,0
0.80611956,0.34615347,0
0.7832924,0.40631583,0
0.5804185,0.44700164,0
0.7023468,0.25890112,0
0.79560137,0.40337846,0
0.76004195,0.42461857,0
0.6758719,0.5488832,0
0.6140369,0.49371344,0
0.7144874,0.37116638,0
0.6404419,0.49059734,0
0.6383951,0.40954438,0
0.58739936,0.5462795,0
0.6171694,0.3676282,0
0.7052675,0.3647421,0
0.5831532,0.32268798,0
0.63570076,0.52642184,0
0.66995454,0.6331323,0
0.7217501,0.4245473,0
0.6892836,0.46817678,0
0.76798743,0.36592475,0
0.6845309,0.20540944,0
0.75422364,0.4389028,0
0.6006086,0.21791033,0
0.5557835,0.4143205,0
0.7845855,0.29288685,0
0.71334076,0.5391023,0
0.7413549,0.3858858,0
0.7554944,0.4302144,0
0.7450441,0.38815656,0
0.7334596,0.29958686,0
0.6717009,0.31055072,0
0.72994804,0.46423158,0
0.35132194,0.42871767,0
0.53968185,0.33649608,0
0.8036608,0.51546997,0
0.6575044,0.3690694,0
0.7959563,0.23584467,0
0.7205297,0.2977366,0
0.8005859,0.26809618,0
0.62423027,0.29866806,0
0.6215016,0.22180298,0
0.56556845,0.23548728,0
0.75371647,0.2119942,0
0.6696835,0.40374064,0
0.67544776,0.32089907,0
0.6737641,0.3377411,0
0.48106217,0.3494428,0
0.62702256,0.38676965,0
0.6403109,0.40059546,0
0.61378664,0.21394,0
0.54304653,0.48840514,0
0.42206493,0.5938171,0
0.63138527,0.363857,0
0.6877819,0.3247154,0
0.5759292,0.3115808,0
0.6426685,0.28244576,0
0.6410577,0.28707343,0
0.73719686,0.268663,0
0.71442515,0.60805947,0
0.7719458,0.403854,0
0.77951366,0.5308677,0
0.768002,0.26783755,0
0.79705703,0.28720054,0
0.7799032,0.25026736,0
0.54443675,0.2476728,0
0.7614851,0.55378217,0
0.4499803,0.44199696,0
0.8350198,0.30599877,0
0.57595044,0.55015194,0
0.5762018,0.44101843,0
0.7323439,0.20917739,0
0.7237351,0.22895303,0
0.7488141,0.26124877,0
0.772563,0.24106805,0
0.7162908,0.30521467,0
0.5851805,0.30197445,0
0.56443846,0.50248146,0
0.8074962,0.42167887,0
0.5290847,0.3613845,0
0.6481584,0.27214244,0
0.5711471,0.23277305,0
0.76576203,0.3023174,0
0.7257309,0.21870174,0
0.6758014,0.27292132,0
0.643934,0.42806122,0
0.71638775,0.24633855,0
0.6668359,0.31122592,0
0.67762023,0.228647,0
0.6936416,0.3161669,0
0.7323365,0.2501463,0
0.56037116,0.40687492,0
0.7823118,0.24340893,0
0.5350805,0.4706627,0
0.7015245,0.28913355,0
0.6877952,0.22225228,0
0.7045044,0.36646354,0
0.65463066,0.36549488,0
0.533217,0.5859323,0
0.6414021,0.32886735,0
0.5786692,0.34919274,0
0.68643796,0.48027104,0
0.5484775,0.3959265,0
0.5768347,0.4429292,0
0.6538367,0.2239679,0
0.5910508,0.23814416,0
0.82030946,0.34718126,0
0.6956557,0.20188694,0
0.6580285,0.30932054,0
0.6180215,0.28035557,0
0.77591074,0.208801,0
0.7469106,0.31627122,0
0.7080212,0.23390996,0
0.7966322,0.42351285,0
0.6228958,0.40761977,0
0.7333428,0.5103329,0
0.4778347,0.4472504,0
0.7999095,0.36661106,0
0.5313099,0.2957089,0
0.71135575,0.38907963,0
0.61169887,0.36344308,0
0.8166985,0.3009343,0
0.47236267,0.3328867,0
0.6112346,0.2715764,0
0.8471796,0.417671,0
0.56403667,0.43927914,0
0.64076394,0.26692727,0
0.70208925,0.24992207,0
0.70576596,0.47461954,0
0.6957275,0.30375788,0
0.65781355,0.46361238,0
0.68828243,0.46999037,0
0.47503242,0.50490046,0
0.7478517,0.3634824,0
0.7968624,0.3450343,0
0.6987305,0.3405914,0
0.5400287,0.63899165,0
0.7366109,0.64167047,0
0.76369464,0.36193296,0
0.60669196,0.33853263,0
0.6524974,0.30226815,0
0.5101904,0.5118505,0
0.7727344,0.20602816,0
0.5267389,0.30491635,0
0.7323952,0.59385157,0
0.7046837,0.22372109,0
0.59879804,0.31305513,0
0.72255963,0.5397656,0
0.70404905,0.3094439,0
0.6343311,0.32096562,0
0.73709315,0.5637455,0
0.7273802,0.306331,0
0.6521444,0.4786484,0
0.5934434,0.3848932,0
0.74101156,0.25960588,0
0.58335376,0.38416213,0
0.652718,0.3577316,0
0.6119343,0.38663673,0
0.7755955,0.21708588,0
0.69853103,0.25460288,0
0.61200976,0.47607806,0
0.7456638,0.44525388,0
0.7180688,0.22151719,0
0.47433335,0.33140326,0
0.56375,0.26609856,0
0.6488119,0.28648365,0
0.6341521,0.4179956,0
0.51341534,0.53228945,0
0.7803495,0.21735223,0
0.6221281,0.23628774,0
0.65459824,0.3088248,0
0.61551416,0.25338626,0
0.67768717,0.29616433,0
0.42664215,0.5548001,0
0.6232516,0.6832185,0
0.59873587,0.30226022,0
0.8003619,0.28865328,0
0.6219404,0.2663206,0
0.53783673,0.5881368,0
0.56372434,0.19931753,0
0.802453,0.36794743,0
0.66381055,0.43358102,0
0.45426953,0.3469024,0
0.75560683,0.37873998,0
0.7463649,0.52553,0
0.5700352,0.51469564,0
0.44723025,0.48094374,0
0.6031959,0.6750005,0
0.53744775,0.5116192,0
0.5013424,0.38863784,0
0.49856588,0.22539029,0
0.58574945,0.5362186,0
0.542855,0.1863904,0
0.6749235,0.5552418,0
0.61689514,0.5881811,0
0.5747341,0.63167423,0
0.66997874,0.300734,0
0.67211425,0.536864,0
0.64040464,0.21159439,0
0.716132,0.50952554,0
0.6409295,0.20635004,0
0.54237515,0.4421107,0
0.65970117,0.5606022,0
0.583214,0.60639423,0
0.6795717,0.39090177,0
0.6905436,0.26300317,0
0.6516524,0.33745444,0
0.7875089,0.34373766,0
0.82396066,0.4869203,0
0.6316622,0.40892997,0
0.5906196,0.5090445,0
0.5746069,0.41946882,0
0.53736234,0.40650305,0
0.73188376,0.48754674,0
0.64100325,0.24390891,0
0.7972037,0.26899874,0
0.5717858,0.56380916,0
0.6201594,0.3778747,0
0.8222162,0.30831134,0
0.6538701,0.2688957,0
0.58397377,0.2526248,0
0.5357302,0.35317484,0
0.5935737,0.44209018,0
0.5767685,0.37417725,0
0.66234344,0.49904945,0
0.5302914,0.32829827,0
0.5634139,0.5533269,0
0.6642504,0.31808883,0
0.73881066,0.23177248,0
0.7329421,0.3754479,0
0.5324935,0.64016813,0
0.26795572,0.58578897,0
0.62214905,0.56951916,0
0.6511456,0.3049463,0
0.7062023,0.5275075,0
0.6011594,0.30493477,0
0.6035264,0.41770527,0
0.56484324,0.26766482,0
0.5626613,0.24013563,0
0.57059646,0.2850128,0
0.62940145,0.2341523,0
0.49041256,0.37174422,0
0.56196904,0.4834119,0
0.7880802,0.30827194,0
0.6900487,0.41106257,0
0.6334454,0.26971793,0
0.7064046,0.41717863,0
0.6560889,0.29383615,0
0.71130246,0.52810663,0
0.68502426,0.43530756,0
0.5011849,0.5488679,0
0.60065955,0.25994757,0
0.64482856,0.63731825,0
0.5697226,0.22644912,0
0.81823665,0.35848078,0
0.743653,0.23440418,0
0.76246303,0.4132634,0
0.71359956,0.32516736,0
0.62033814,0.6296249,0
0.59793097,0.45193717,0
0.66180027,0.304597,0
0.79753083,0.38666508,0
0.5046673,0.32278678,0
0.5076459,0.40373456,0
0.6005797,0.37217125,0
0.802606,0.29621056,0
0.63263905,0.2209968,0
0.6349784,0.46679735,0
0.81608087,0.40943176,0
0.5443997,0.4923894,0
0.6322531,0.63214695,0
0.7035012,0.5265301,0
0.5743731,0.32490802,0
0.5913529,0.53451574,0
0.5981805,0.31101605,0
0.47040656,0.42141968,0
0.47374776,0.5153656,0
0.4654514,0.55116934,0
0.6558036,0.27160573,0
0.46910003,0.65244675,0
0.6062524,0.37560052,0
0.6499864,0.24119656,0
0.494259,0.45456097,0
0.5759619,0.27802604,0
0.516522,0.2821513,0
0.33653802,0.3823923,0
0.49725676,0.3096486,0
0.71727604,0.54201114,0
0.6010118,0.29324913,0
0.7454388,0.32152766,0
0.59661597,0.3657142,0
0.6284916,0.21978375,0
0.69507647,0.22867785,0
0.63325924,0.27637663,0
0.59547067,0.42940778,0
0.57872576,0.37706828,0
0.6698528,0.48242265,0
0.7279116,0.18826646,0
0.354845,0.45206425,0
0.69431406,0.51917785,0
0.21267068,0.57901585,0
0.62844634,0.23118462,0
0.49018228,0.45972875,0
0.42112613,0.50469375,0
0.30320513,0.34070894,0
0.7574419,0.5672223,0
0.65257114,0.2441755,0
0.6590802,0.3116773,0
0.7418016,0.32036322,0
0.73209554,0.5445179,0
0.7352652,0.48115736,0
0.7038939,0.25524727,0
0.73590505,0.52085185,0
0.6733878,0.43272546,0
0.68271387,0.54577297,0
0.69043756,0.27814776,0
0.8509273,0.45731094,0
0.74262935,0.27041063,0
0.8054937,0.2999105,0
0.59091777,0.20306337,0
0.63782084,0.33221728,0
0.66702694,0.26267397,0
0.689119,0.347186,0
0.54030555,0.43010527,0
0.62712014,0.2956518,0
0.52949536,0.23605354,0
0.5341494,0.35870212,0
0.6171042,0.56820095,0
0.5948612,0.38373935,0
0.64398295,0.46909016,0
0.68464166,0.5006828,0
0.7250046,0.4945299,0
0.7616097,0.24607216,0
0.6426364,0.3394416,0
0.5260016,0.48078087,0
0.70176715,0.55200714,0
0.7094949,0.399832,0
0.7671474,0.5147195,0
0.742237,0.3876089,0
0.4429541,0.60873467,0
0.5705422,0.4227685,0
0.47470742,0.5302314,0
0.72269535,0.3739959,0
0.62911946,0.35358384,0
0.7151444,0.38967636,0
0.63538915,0.46141958,0
0.60323286,0.40166116,0
0.6832483,0.32620955,0
0.8122763,0.5791731,0
0.70222574,0.53800416,0
0.66254103,0.3240924,0
0.6959543,0.26501653,0
0.74844575,0.30375957,0
0.75195724,0.3738596,0
0.69222957,0.22613014,0
0.7280615,0.40396202,0
0.578468,0.52438563,0
0.6497716,0.2601678,0
0.64259446,0.34736612,0
0.75468045,0.2935007,0
0.69215643,0.5323524,0
0.73033947,0.25743082,0
0.45169178,0.41588065,0
0.6528496,0.60366714,0
0.62929887,0.3708526,0
0.64981145,0.22590238,0
0.5474269,0.22409478,0
0.7115236,0.55054045,0
0.75186235,0.3458841,0
0.4239977,0.38327765,0
0.7942851,0.46540177,0
0.541421,0.2431528,0
0.643613,0.33749607,0
0.6277134,0.39267245,0
0.75442135,0.56840146,0
0.6015395,0.40274423,0
0.5391112,0.40790623,0
0.49605903,0.3109899,0
0.6614159,0.26280096,0
0.59086186,0.32179084,0
0.5971651,0.25200722,0
0.52045125,0.52356786,0
0.4774354,0.5152259,0
0.6051991,0.19573365,0
0.662719,0.5741276,0
0.66713655,0.42030802,0
0.80641884,0.33994344,0
0.56943315,0.2595548,0
0.68745786,0.21383804,0
0.7761538,0.42555144,0
0.72819394,0.346088,0
0.45850888,0.31750026,0
0.7154303,0.5661534,0
0.7529216,0.34898964,0
0.7174953,0.20613314,0
0.74505126,0.3022313,0
0.5002298,0.20342593,0
0.6920188,0.19562456,0
0.7186207,0.50312984,0
0.54239076,0.2730038,0
0.6410449,0.46492487,0
0.68415916,0.48375446,0
0.7055303,0.52752304,0
0.5712695,0.3658575,0
0.5161081,0.46325332,0
0.5172223,0.3928835,0
0.53659487,0.33047363,0
0.5737267,0.4164967,0
0.64414036,0.31965536,0
0.70343614,0.3853463,0
0.73684996,0.569787,0
0.5926892,0.35424837,0
0.6094021,0.4597857,0
0.69201994,0.21760535,0
0.58246964,0.30593434,0
0.38223538,0.38993898,0
0.7283643,0.5563159,0
0.68313587,0.3901309,0
0.78951055,0.435522,0
0.53825235,0.20315081,0
0.7318649,0.35834685,0
0.6781966,0.61686283,0
0.6764397,0.25791407,0
0.65269196,0.3100093,0
0.6378442,0.59701055,0
0.45667037,0.3482433,0
0.8090741,0.36273098,0
0.70749867,0.25786683,0
0.52352154,0.49989024,0
0.5336749,0.29505232,0
0.69815904,0.29744324,0
0.7039598,0.60161287,0
0.66401494,0.55749995,0
0.68780357,0.39760897,0
0.7825664,0.48339364,0
0.61487716,0.23429903,0
0.72988236,0.53815293,0
0.75677466,0.39143914,0
0.5591595,0.6356734,0
0.4610491,0.47230643,0
0.57036024,0.43168277,0
0.06628557,0.36111236,1
0.06287052,0.22183195,1
0.062260054,0.23566222,1
0.07805812,0.56955695,1
0.073835604,0.1802824,1
0.08658486,0.63132524,1
0.06273526,0.21145403,1
0.066936664,0.50447637,1
0.11033574,0.67625767,1
0.05727769,0.45227703,1
0.08971165,0.6575104,1
0.05474232,0.49351707,1
0.07833994,0.6367673,1
0.063411474,0.43074372,1
0.065439984,0.52606106,1
0.07765167,0.6599195,1
0.061051536,0.22191432,1
0.057737045,0.3507088,1
0.069040895,0.5856609,1
0.06129272,0.35095876,1
0.11502604,0.75194514,1
0.065898895,0.24515271,1
0.09725295,0.6994205,1
0.07741494,0.5792455,1
0.12858823,0.6910284,1
0.07467411,0.55991507,1
0.060457274,0.22666846,1
0.061607677,0.34084427,1
0.0962775,0.70018554,1
0.07660288,0.6228205,1
0.12417524,0.67060244,1
0.07659595,0.65979755,1
0.10869571,0.68041843,1
0.09843701,0.62682706,1
0.11280889,0.590508,1
0.091663755,0.67706054,1
0.080018826,0.58374214,1
0.10789535,0.7520226,1
0.08375677,0.63850635,1
0.057132017,0.36390543,1
0.0698983,0.47329742,1
0.103498295,0.7025614,1
0.062224567,0.43232536,1
0.062232755,0.42194352,1
0.05479223,0.39873636,1
0.057859473,0.30144364,1
0.061225496,0.44710228,1
0.06542272,0.35139146,1
0.06607316,0.5544392,1
0.06724091,0.36992532,1
0.11947969,0.7016069,1
0.057583995,0.42772588,1
0.063776635,0.2033977,1
0.078782305,0.6059548,1
0.11701212,0.7513342,1
0.073051706,0.5835275,1
0.114452496,0.7688357,1
0.07371123,0.17987128,1
0.09698163,0.6736685,1
0.11453611,0.6130074,1
0.1294315,0.6331406,1
0.13809364,0.68332726,1
0.09234388,0.6252238,1
0.085459374,0.1686571,1
0.10935017,0.64110094,1
0.10861044,0.62842906,1
0.06831155,0.58372986,1
0.06664413,0.20613621,1
0.076665215,0.59699345,1
0.072512485,0.5496218,1
0.07724303,0.6480514,1
0.06764611,0.18373863,1
0.15144838,0.64808494,1
0.079601355,0.62056166,1
0.058205925,0.3254542,1
0.06655293,0.16105878,1
0.16432454,0.6053892,1
0.06128824,0.4647763,1
0.08300684,0.60893697,1
0.061398506,0.49880975,1
0.08502751,0.69231915,1
0.08427164,0.14270347,1
0.06689776,0.16318199,1
0.09440993,0.5743145,1
0.06330559,0.33151594,1
0.11179123,0.32978407,1
0.066902675,0.15607794,1
0.06122245,0.2750615,1
0.07786493,0.14092255,1
0.07702849,0.1475861,1
0.07830495,0.24887605,1
0.10494355,0.6657148,1
0.08572287,0.6313154,1
0.05840495,0.48389086,1
0.07511217,0.14521506,1
0.07964528,0.14002918,1
0.06161344,0.36035645,1
0.07854291,0.4424843,1
0.10705615,0.6555563,1
0.14430836,0.666943,1
0.06894916,0.23014681,1
0.0695546,0.42653278,1
0.07938134,0.17466673,1
0.07521129,0.38043642,1
0.063358925,0.22217384,1
0.08807397,0.63025594,1
0.069814175,0.4602298,1
0.07575774,0.6092688,1
0.06333593,0.49263173,1
0.07268581,0.6365585,1
0.06878975,0.39189795,1
0.07449021,0.64598316,1
0.11596544,0.6459986,1
0.13030453,0.5993853,1
0.056402043,0.3778771,1
0.0665666,0.29515725,1
0.098932646,0.6388716,1
0.06506157,0.23836316,1
0.10200824,0.67142695,1
0.0689626,0.2063477,1
0.06198324,0.2660107,1
0.08442377,0.5336042,1
0.058991406,0.21068348,1
0.06347784,0.29441118,1
0.07654825,0.561941,1
0.08888703,0.69725305,1
0.077514164,0.59017384,1
0.099382676,0.6104328,1
0.061834246,0.5631125,1
0.066490434,0.20845827,1
0.08925562,0.6008509,1
0.06350173,0.54063755,1
0.058376975,0.38920793,1
0.06700979,0.19121711,1
0.07181305,0.57199234,1
0.08460233,0.6648418,1
0.107545905,0.6707199,1
0.078849,0.579519,1
0.096477315,0.64181346,1
0.068990506,0.6142352,1
0.08219447,0.6340187,1
0.08440525,0.70046115,1
0.113393344,0.74963677,1
0.071423315,0.63278747,1
0.12692773,0.72806877,1
0.06862711,0.58373713,1
0.09736918,0.7211346,1
0.07199619,0.51783377,1
0.06387918,0.5860414,1
0.09712312,0.6756636,1
0.0655079,0.18933892,1
0.06232909,0.6085393,1
0.07089803,0.5377622,1
0.095215164,0.7244628,1
0.07477415,0.6224975,1
0.0831108,0.70194864,1
0.06788228,0.19084172,1
0.10230051,0.75354403,1
0.063346595,0.46740296,1
0.06776482,0.52942616,1
0.061240233,0.33636504,1
0.06867453,0.6265617,1
0.07737405,0.50507295,1
0.07514027,0.6333698,1
0.07061408,0.618181,1
0.06261002,0.2805573,1
0.08703158,0.68187594,1
0.0687497,0.52100617,1
0.07132208,0.15520585,1
0.10894854,0.705183,1
0.06733312,0.19549197,1
0.0712149,0.16640078,1
0.0786569,0.14858311,1
0.07063777,0.6102668,1
0.086920165,0.57121855,1
0.083895326,0.6862923,1
0.06997457,0.17679991,1
0.06174786,0.2248976,1
0.07913727,0.15498191,1
0.065115474,0.29010335,1
0.079463,0.62877,1
0.06877778,0.1731969,1
0.10521471,0.7025878,1
0.060317226,0.45535648,1
0.10082981,0.6773232,1
0.06794596,0.6405038,1
0.06695478,0.57613444,1
0.08819295,0.64673656,1
0.06694934,0.29113314,1
0.07011314,0.66436857,1
0.05728624,0.3101041,1
0.064120054,0.25922948,1
0.06277054,0.2844473,1
0.0746399,0.6030116,1
0.086636916,0.69390726,1
0.10236922,0.72372663,1
0.06843647,0.30304673,1
0.11253327,0.6839518,1
0.06739723,0.5215675,1
0.07481881,0.6119482,1
0.079509385,0.6654078,1
0.115677506,0.7271208,1
0.065000415,0.48466226,1
0.06861872,0.567658,1
0.06432883,0.29371437,1
0.07888168,0.62874216,1
0.09064271,0.6864182,1
0.07843621,0.6963703,1
0.06870495,0.61383367,1
0.10781515,0.70751697,1
0.1074841,0.66401094,1
0.08388507,0.67200863,1
0.10281677,0.70496005,1
0.08272333,0.65472955,1
0.06251625,0.51200044,1
0.07509979,0.6607766,1
0.07721718,0.21977623,1
0.11909138,0.74777865,1
0.10705091,0.6471185,1
0.07599811,0.6499038,1
0.112770915,0.71952176,1
0.10437581,0.68974626,1
0.055416394,0.25976923,1
0.079563335,0.6697307,1
0.08641165,0.7180469,1
0.09627948,0.708119,1
0.10021702,0.68247795,1
0.072554745,0.667089,1
0.07972853,0.589634,1
0.0812189,0.7100997,1
0.08662937,0.6613609,1
0.07302006,0.5940923,1
0.07804242,0.6905698,1
0.10521379,0.66614026,1
0.068496175,0.1755491,1
0.08232116,0.72657704,1
0.086762376,0.6326284,1
0.10667628,0.6373916,1
0.11468602,0.7598478,1
0.12342692,0.7665412,1
0.0767045,0.63274825,1
0.09528652,0.63607854,1
0.15213872,0.68511564,1
0.11830623,0.68027455,1
0.09210438,0.7227574,1
0.122041166,0.67182136,1
0.124540314,0.7353969,1
0.1001655,0.70584124,1
0.07162083,0.6444996,1
0.10663434,0.636036,1
0.07878077,0.6971213,1
0.061041594,0.3783974,1
0.059023477,0.3280657,1
0.07289678,0.17402877,1
0.091864936,0.6652094,1
0.054370012,0.19606432,1
0.06338873,0.51421326,1
0.0685598,0.20420589,1
0.068548985,0.49061224,1
0.064211026,0.3414,1
0.11054912,0.67662746,1
0.057022102,0.24171086,1
0.07291037,0.62119615,1
0.12075953,0.66907525,1
0.12609687,0.75310695,1
0.06557666,0.19847006,1
0.06609396,0.23466223,1
0.12233128,0.7660148,1
0.10872868,0.7601733,1
0.076084524,0.70405006,1
0.07554209,0.71691597,1
0.08567489,0.20302242,1
0.120606884,0.7671794,1
0.073572755,0.6637382,1
0.1077994,0.75861895,1
0.06842537,0.5716137,1
0.0769501,0.1601371,1
0.066242926,0.15520048,1
0.08826534,0.64590883,1
0.079961926,0.66372836,1
0.06113705,0.30972788,1
0.057094265,0.3801205,1
0.10543134,0.63838303,1
0.06657517,0.556103,1
0.08824368,0.5547609,1
0.06848663,0.15934832,1
0.06701838,0.15370123,1
0.08601232,0.685067,1
0.09868539,0.56605345,1
0.067706995,0.5899832,1
0.099525265,0.5961796,1
0.097582094,0.5771225,1
0.0865513,0.642754,1
0.066671535,0.21214159,1
0.07109355,0.43209904,1
0.062465835,0.20364977,1
0.11589449,0.60624176,1
0.12604761,0.701524,1
0.06651285,0.15727174,1
0.09676184,0.6710092,1
0.061082825,0.19462883,1
0.1383788,0.7066166,1
0.07374681,0.1588954,1
0.06589409,0.17600524,1
0.058001053,0.25325468,1
0.08321197,0.67263645,1
0.071701206,0.31345633,1
0.058726516,0.49638924,1
0.06072575,0.41929322,1
0.086785495,0.63764215,1
0.06622087,0.5264256,1
0.09678145,0.6483557,1
0.0626625,0.41216853,1
0.059109844,0.37293512,1
0.06715429,0.5282308,1
0.08086458,0.68565357,1
0.085217245,0.6470397,1
0.071039245,0.59745955,1
0.06194181,0.20529395,1
0.09335244,0.727751,1
0.06246582,0.44185284,1
0.061909877,0.45234033,1
0.076382756,0.5820856,1
0.06737271,0.4855772,1
0.08175621,0.639141,1
0.07648919,0.6513898,1
0.120693244,0.6449487,1
0.09644529,0.7014418,1
0.123502396,0.6661182,1
0.07514994,0.65030223,1
0.059999418,0.2804172,1
0.078936845,0.66172653,1
0.07501105,0.6236696,1
0.06645619,0.22506157,1
0.06848555,0.16605401,1
0.060913898,0.40755236,1
0.060624246,0.23196203,1
0.06400545,0.2981953,1
0.058287796,0.4223267,1
0.07859432,0.6387578,1
0.07175123,0.6367974,1
0.0637936,0.30518633,1
0.06030552,0.30570498,1
0.08944091,0.70363814,1
0.07444867,0.21970409,1
0.08048828,0.64678615,1
0.0731106,0.29024872,1
0.09468073,0.64743,1
0.09850691,0.63786066,1
0.08927677,0.64633864,1
0.07146164,0.22351483,1
0.06462837,0.36111638,1
0.14839788,0.6219811,1
0.06174277,0.2391929,1
0.093380906,0.5944378,1
0.064747214,0.32400003,1
0.09777363,0.65659875,1
0.06738766,0.25069678,1
0.12812166,0.67395675,1
0.11345503,0.66883075,1
0.055846103,0.42051458,1
0.06374842,0.3801482,1
0.10920449,0.6462166,1
0.061383605,0.16846639,1
0.07687257,0.6174246,1
0.06734668,0.1681879,1
0.063517384,0.31047392,1
0.06276271,0.3558661,1
0.08942339,0.66306126,1
0.06821453,0.16157883,1
0.06569855,0.27188027,1
0.075009525,0.58343786,1
0.063851506,0.35662338,1
0.0601744,0.22490801,1
0.055789404,0.3702971,1
0.06681988,0.5567755,1
0.09071993,0.6990902,1
0.058841065,0.25224552,1
0.05694573,0.30920258,1
0.055666007,0.2966449,1
0.069351315,0.556637,1
0.05873221,0.41337666,1
0.06167825,0.27545694,1
0.08876217,0.6462921,1
0.059430107,0.3667788,1
0.058942072,0.4356828,1
0.066489585,0.16970707,1
0.074142836,0.16029646,1
0.071604,0.6279443,1
0.07080444,0.38902813,1
0.0691704,0.6103804,1
0.05766126,0.40151858,1
0.105829746,0.6229034,1
0.13817656,0.20651472,1
0.07487869,0.305034,1
0.07055602,0.15891826,1
0.08482548,0.15259664,1
0.06750453,0.21238196,1
0.061942462,0.40540007,1
0.05807597,0.31501204,1
0.07862679,0.1479757,1
0.07638623,0.16255149,1
0.062375475,0.4477728,1
0.06881475,0.1757022,1
0.07356982,0.16954182,1
0.07635239,0.18875925,1
0.058088083,0.23787485,1
0.06334812,0.2163476,1
0.060989663,0.15989606,1
0.077170715,0.1605121,1
0.07843509,0.17252752,1
0.07654658,0.41298565,1
0.060634952,0.21098822,1
0.10311396,0.6306636,1
0.07850937,0.28214487,1
0.056431357,0.29062253,1
0.082620166,0.38565817,1
0.057997853,0.3515199,1
0.07339357,0.15044016,1
0.0656996,0.37955648,1
0.05889181,0.29679263,1
0.06629061,0.16760637,1
0.063551284,0.20484926,1
0.065723546,0.17305534,1
0.06601761,0.20666088,1
0.0611497,0.41729257,1
0.07309886,0.1514666,1
0.05891602,0.27100858,1
0.07869706,0.42602327,1
0.07538098,0.17281237,1
0.07948688,0.48118705,1
0.18665637,0.24229507,1
0.06994757,0.6158866,1
0.07256754,0.57784873,1
0.067098506,0.30668178,1
0.12570888,0.6822017,1
0.061801266,0.23106848,1
0.06863743,0.16430834,1
0.09599447,0.3710042,1
0.08014762,0.5909715,1
0.0628397,0.19384466,1
0.07210772,0.15990499,1
0.07084263,0.18798298,1
0.058717124,0.5153826,1
0.06758216,0.16542478,1
0.061337586,0.19321491,1
0.074201755,0.16236813,1
0.06502224,0.2413933,1
0.080328986,0.17127481,1
0.06810128,0.16987708,1
0.06412407,0.19976975,1
0.06475015,0.18169537,1
0.06199309,0.3342707,1
0.06591388,0.20066856,1
0.07710815,0.6644794,1
0.054332808,0.3328902,1
0.056806803,0.34289595,1
0.06067683,0.2940306,1
0.08473793,0.15303157,1
0.05902763,0.28362253,1
0.084971085,0.67281646,1
0.06830125,0.5435448,1
0.06697756,0.15777646,1
0.062319838,0.15445317,1
0.06443847,0.34863016,1
0.058925673,0.3454087,1
0.12028251,0.7487823,1
0.06127524,0.2777982,1
0.10738454,0.64980686,1
0.059693445,0.3209278,1
0.061002452,0.26927155,1
0.063622355,0.26628518,1
0.06158244,0.22017755,1
0.07019119,0.14785828,1
0.06480914,0.24877755,1
0.082355395,0.6251615,1
0.06798547,0.29479957,1
0.059110083,0.17503145,1
0.06384042,0.25810027,1
0.0699499,0.30072913,1
0.07790851,0.21505842,1
0.12912297,0.48723048,1
0.056805406,0.28897244,1
0.060116015,0.2475908,1
0.065137334,0.49557805,1
0.08709396,0.1870078,1
0.05693952,0.31866744,1
0.09501243,0.60908186,1
0.066629425,0.37911302,1
0.07007141,0.2018409,1
0.07591237,0.15963559,1
0.06604458,0.19838074,1
0.07198572,0.2105502,1
0.06970108,0.19320641,1
0.05978351,0.3880036,1
0.07097949,0.27669156,1
0.06622063,0.27828524,1
0.12372401,0.73160934,1
0.06645138,0.21180509,1
0.063339755,0.45696375,1
0.0715533,0.23349309,1
0.084097095,0.14673415,1
0.07312054,0.39070362,1
0.05924165,0.34920028,1
0.05426114,0.27206653,1
0.059685614,0.20134665,1
0.0656313,0.17825943,1
0.067692265,0.5829532,1
0.06308848,0.34601283,1
0.06296122,0.44209507,1
0.071706325,0.18051851,1
0.06873308,0.15440175,1
0.072423615,0.16008584,1
0.07057878,0.24829009,1
0.10679412,0.63391644,1
0.07451175,0.5954241,1
0.07031522,0.3347546,1
0.09260953,0.39826468,1
0.07817859,0.15052728,1
0.07337664,0.18141046,1
0.06487301,0.32994282,1
0.077034,0.15366709,1
0.13560055,0.21532229,1
0.05363386,0.29110238,1
0.086453974,0.14602952,1
0.11085297,0.64241695,1
0.07807619,0.61237127,1
0.2917033,0.22248285,1
0.06750847,0.1691148,1
0.08460094,0.23273197,1
0.068846405,0.21001552,1
0.05892711,0.22329444,1
0.07121103,0.14904453,1
0.059809044,0.2025867,1
0.060215514,0.26941407,1
0.07408992,0.21747492,1
0.07053839,0.29388326,1
0.067406304,0.1826066,1
0.059932217,0.38740996,1
0.072854735,0.38515094,1
0.07075673,0.27753332,1
0.092925765,0.5218354,1
0.07974834,0.16632642,1
0.06772915,0.19573863,1
0.07169637,0.19356205,1
0.088991694,0.16018333,1
0.07715539,0.15451235,1
0.06752326,0.4712937,1
0.07177289,0.21098304,1
0.056984812,0.22365232,1
0.0683856,0.50193495,1
0.06526427,0.3471686,1
0.06682226,0.16030784,1
0.07075988,0.36264667,1
0.08259536,0.15861541,1
0.066738665,0.16115795,1
0.07436515,0.5083693,1
0.07352262,0.1507748,1
0.0732434,0.16173278,1
0.10616571,0.671403,1
0.07018159,0.3229984,1
0.066818774,0.20620477,1
0.06577416,0.16756758,1
0.07448379,0.17126417,1
0.107715786,0.64648193,1
0.0761597,0.62700343,1
0.0678143,0.48551363,1
0.07972004,0.15538973,1
0.077632345,0.55892193,1
0.071977235,0.17766741,1
0.09417907,0.18642682,1
0.06437373,0.18013154,1
0.062735006,0.39457428,1
0.070067465,0.15569161,1
0.08145468,0.60152256,1
0.06493617,0.3869579,1
0.07472014,0.14601491,1
0.05865926,0.39085492,1
0.06929162,0.33107793,1
0.078516416,0.44625095,1
0.056158643,0.20845528,1
0.068995595,0.180941,1
0.061424736,0.4163974,1
0.061932005,0.30353683,1
0.0716021,0.16884246,1
0.07220257,0.17951404,1
0.06213404,0.25001928,1
0.06780234,0.17870231,1
0.060081832,0.24334471,1
0.09508139,0.60511214,1
0.066708975,0.25470164,1
0.058057293,0.21322723,1
0.060465697,0.24518918,1
0.08560279,0.22427179,1
0.11532328,0.61406976,1
0.08029946,0.15012953,1
0.061403714,0.34671664,1
0.06774944,0.21808504,1
0.062558725,0.1888834,1
0.07580802,0.5076485,1
0.06651985,0.17422074,1
0.06624954,0.30361196,1
0.064619906,0.5910501,1
0.07338037,0.1583183,1
0.06638766,0.30471057,1
0.06838088,0.28336108,1
0.07500367,0.15117398,1
0.07856749,0.16490556,1
0.06509044,0.33321106,1
0.06358386,0.17995943,1
0.06504551,0.2028747,1
0.06393241,0.31034625,1
0.06550595,0.1918676,1
0.06323989,0.17667124,1
0.07329354,0.15483716,1
0.077214085,0.14847404,1
0.082232475,0.17654084,1
0.111075,0.7166967,1
0.07946616,0.15393475,1
0.057888255,0.37242118,1
0.14307052,0.5856328,1
0.0635798,0.19226874,1
0.060728308,0.23926046,1
0.06689705,0.19423875,1
0.073462,0.1792841,1
0.07178515,0.15462701,1
0.057646107,0.3063552,1
0.0681301,0.5738403,1
0.061226483,0.21989682,1
0.100903146,0.5882955,1
0.09176771,0.1735189,1
0.0675599,0.16265203,1
0.066716515,0.48724383,1
0.06298407,0.18646063,1
0.06404015,0.33851483,1
0.083029866,0.16239655,1
0.0662845,0.22138447,1
0.062430393,0.26053584,1
0.061690122,0.15674177,1
0.0822608,0.16365573,1
0.06958838,0.16116743,1
0.06216169,0.18206896,1
0.06259774,0.4502876,1
0.06650549,0.15795451,1
0.066029236,0.23619868,1
0.06469887,0.21916278,1
0.066719264,0.19890726,1
0.061813213,0.21251741,1
0.06871834,0.16135328,1
0.06419867,0.16394925,1
0.060867,0.37055907,1
0.06671058,0.17814961,1
0.055527955,0.29034555,1
0.07103342,0.17143705,1
0.06479807,0.19379658,1
0.06544189,0.1657003,1
0.064648114,0.30547,1
0.10288063,0.18859667,1
0.065669514,0.4811774,1
0.09659897,0.47638622,1
0.07152833,0.38139698,1
0.07587614,0.18546258,1
0.07893064,0.58136266,1
0.05689403,0.22363885,1
0.08300564,0.1746578,1
0.071675174,0.56691986,1
0.08409252,0.17404902,1
0.071491145,0.1728367,1
0.06755122,0.34573784,1
0.06796776,0.16029724,1
0.061973978,0.2278136,1
0.074954875,0.15538691,1
0.06370276,0.38249704,1
0.06917234,0.28497237,1
0.07788397,0.5231651,1
0.07342775,0.19211793,1
0.064182416,0.47497767,1
0.062419683,0.23715171,1
0.08248928,0.16513987,1
0.060318273,0.41108143,1
0.062143855,0.22147308,1
0.07643486,0.68527913,1
0.06122545,0.2020857,1
0.06056898,0.2365265,1
0.06566311,0.21032244,1
0.071657576,0.15331864,1
0.06500317,0.17573047,1
0.063526906,0.33880958,1
0.07589911,0.19564745,1
0.061560225,0.36781338,1
0.07313757,0.59727085,1
0.06846511,0.5215641,1
0.05564214,0.3233416,1
0.056914907,0.21724203,1
0.062922664,0.17644702,1
0.060615513,0.20952123,1
0.119704716,0.21605101,1
0.064021945,0.26153883,1
0.067326285,0.25215694,1
0.06513433,0.16262957,1
0.064125076,0.34514606,1
0.063301906,0.20994535,1
0.06840785,0.15762977,1
0.061998125,0.21477014,1
0.10866878,0.5565995,1
0.07051346,0.18470047,1
0.07895963,0.22455624,1
0.07236301,0.20778657,1
0.07234778,0.16821788,1
0.065950766,0.2493716,1
0.06302669,0.4843333,1
0.067495,0.21289323,1
0.06658822,0.16570947,1
0.060854185,0.5639913,1
0.067943744,0.2499298,1
0.076827586,0.1604174,1
0.07036289,0.22479686,1
0.071476266,0.20541173,1
0.07237099,0.49343306,1
0.11296795,0.2215534,1
0.06547557,0.20521954,1
0.05735671,0.2556538,1
0.07610945,0.5701934,1
0.06607647,0.570584,1
0.062414497,0.487633,1
0.06642593,0.34408066,1
0.0611505,0.25560614,1
0.0634393,0.22454688,1
0.06279168,0.3675967,1
0.06847134,0.1716413,1
0.06823204,0.21645734,1
0.06733557,0.15250234,1
0.065829806,0.26859653,1
0.06475335,0.19440083,1
0.0619152,0.15899777,1
0.070071004,0.16766575,1
0.06705575,0.2699797,1
0.06762388,0.25104007,1
0.07342385,0.17090108,1
0.07253288,0.16371208,1
0.058311984,0.2596291,1
0.062007215,0.22252798,1
0.061391793,0.18534455,1
0.055069134,0.21140566,1
0.056552332,0.31264314,1
0.054437615,0.31004936,1
0.06567125,0.4746724,1
0.08104537,0.6059841,1
0.058791168,0.18251619,1
0.071559265,0.51111615,1
0.06565238,0.16187818,1
0.085022554,0.14398311,1
0.07380056,0.17059931,1
0.06500651,0.2044567,1
0.063848786,0.1506322,1
0.061933603,0.50482917,1
0.05622901,0.2870023,1
0.08099088,0.44394833,1
0.07545666,0.30836692,1
0.09353649,0.19580354,1
0.07374488,0.15698718,1
0.06779533,0.15694891,1
0.06588594,0.32695132,1
0.062420484,0.17480426,1
0.07459747,0.62546253,1
0.0663712,0.63875604,1
0.08480729,0.6670543,1
0.070503294,0.55157137,1
0.07225324,0.6250408,1
0.0629872,0.5164123,1
0.1642754,0.41681978,1
0.06880301,0.38964608,1
0.07856342,0.59084684,1
0.06682473,0.5099644,1
0.06317522,0.42949063,1
0.083264574,0.5622486,1
0.062164478,0.5103512,1
0.052131318,0.3211804,1
0.06253087,0.3125521,1
0.0710822,0.6240832,1
0.0648109,0.55229074,1
0.09716532,0.3684273,1
0.077809036,0.6598159,1
0.07130603,0.15087527,1
0.07196959,0.646056,1
0.07471194,0.15405725,1
0.068567865,0.1711808,1
0.05709736,0.30315903,1
0.060363665,0.34395954,1
0.06941968,0.17775124,1
0.06058298,0.24344759,1
0.120464884,0.37317425,1
0.06129904,0.15658832,1
0.072244346,0.16289245,1
0.0687841,0.15171345,1
0.07561655,0.16324417,1
0.073453434,0.15381037,1
0.06546324,0.22708128,1
0.064233124,0.23483302,1
0.057459142,0.22987783,1
0.06631277,0.154256,1
0.06415948,0.21676436,1
0.06972973,0.16106868,1
0.06532054,0.20677336,1
0.07110494,0.17699502,1
0.06364317,0.23129156,1
0.07710603,0.15198445,1
0.068077534,0.59114164,1
0.07456704,0.65541905,1
0.07310564,0.62658167,1
0.06974891,0.63037664,1
0.07710666,0.58214676,1
0.065020725,0.5029409,1
0.07031199,0.6111676,1
0.08708608,0.6587678,1
0.05929517,0.47181097,1
0.06400674,0.48982272,1
0.06463686,0.58067834,1
0.07189843,0.17120759,1
0.06257887,0.21354194,1
0.067888476,0.36125717,1
0.06891301,0.1706833,1
0.1322101,0.5698934,1
0.064537376,0.20305024,1
0.076527975,0.52459186,1
0.0605826,0.20899194,1
0.07407875,0.15564151,1
0.06290399,0.21265635,1
0.0658057,0.2041035,1
0.060618598,0.50615895,1
0.08300264,0.66647947,1
0.092406414,0.71981686,1
0.07327316,0.66410697,1
0.06840133,0.62091917,1
0.075342804,0.65728945,1
0.05725269,0.43745124,1
0.094761774,0.7078962,1
0.07889921,0.5980754,1
0.093224265,0.60970336,1
0.066401966,0.5003343,1
0.063216515,0.48122752,1
0.065101035,0.33857092,1
0.06805586,0.18024133,1
0.062300473,0.47558317,1
0.071490355,0.448408,1
0.059112515,0.38259947,1
0.09134565,0.6349282,1
0.06370983,0.37574798,1
0.067533314,0.5611826,1
0.095286615,0.69680196,1
0.068832666,0.5323513,1
0.08380532,0.6889368,1
0.07522363,0.68395656,1
0.06752954,0.18584523,1
0.06621688,0.40073133,1
0.061205097,0.16695312,1
0.057034563,0.34164587,1
0.05750618,0.4686723,1
0.061535776,0.36470523,1
0.061380055,0.4918659,1
0.07800871,0.5935949,1
0.07939497,0.6172114,1
0.060816687,0.49656197,1
0.07337409,0.6242553,1
0.061966848,0.4619013,1
0.056057055,0.39227468,1
0.06584366,0.40299058,1
0.05963539,0.36794972,1
0.05752229,0.36354396,1
0.061113108,0.41995215,1
0.0648049,0.43109506,1
0.06421455,0.34709027,1
0.061412748,0.24081993,1
0.06403286,0.30045125,1
0.06197057,0.2618525,1
0.06277191,0.3921957,1
0.060898717,0.4099054,1
0.07001489,0.17826535,1
0.06598444,0.22580034,1
0.052434605,0.31172943,1
0.06877057,0.18218653,1
0.060532115,0.38664123,1
0.07532525,0.62061864,1
0.08882154,0.66092294,1
0.09394336,0.66504127,1
0.08221024,0.6698217,1
0.06684014,0.5375943,1
0.070463985,0.63224447,1
0.09095163,0.6611429,1
0.07952066,0.6528722,1
0.07294964,0.55417836,1
0.10023213,0.6811594,1
0.0815276,0.63533497,1
0.06829342,0.573086,1
0.06588597,0.2192543,1
0.061600655,0.1690764,1
0.06061956,0.30928993,1
0.06398445,0.2075676,1
0.063647814,0.16193087,1
0.057144858,0.30681637,1
0.06992734,0.44631082,1
0.07000762,0.38431966,1
0.071382105,0.602491,1
0.07098653,0.16156894,1
0.06929364,0.16313334,1
0.06221169,0.24189271,1
0.059501182,0.28653702,1
0.06461875,0.15764904,1
0.057407036,0.40844136,1
0.07435232,0.65966773,1
0.06961606,0.20462295,1
0.06679463,0.5584007,1
0.08342728,0.5980234,1
0.068939544,0.46896428,1
0.055953782,0.3659328,1
0.056022994,0.3288791,1
0.06694578,0.36892495,1
0.05539299,0.43369338,1
0.082798354,0.5562378,1
0.09506184,0.56880933,1
0.058325056,0.47446653,1
0.05838964,0.3730439,1
0.06368784,0.17324306,1
0.06940925,0.15982048,1
0.06626521,0.29886582,1
0.06881335,0.22909789,1
0.06917286,0.32295287,1
0.066801146,0.2118544,1
0.06612962,0.26665294,1
0.071365006,0.28786397,1
0.07527713,0.31932098,1
0.08029772,0.14429645,1
0.06304214,0.15215765,1
0.074192345,0.14862189,1
0.07474465,0.14510593,1
0.065355316,0.15637422,1
0.07867285,0.15356334,1
0.090040766,0.16345061,1
0.07221439,0.15064861,1
0.07187021,0.15849546,1
0.07695918,0.1497667,1
0.07299886,0.16061231,1
0.07750453,0.15078573,1
0.080885805,0.14418939,1
0.07140802,0.142017,1
0.06793119,0.1804933,1
0.08243609,0.18238717,1
0.08365916,0.16142184,1
0.0650126,0.1537561,1
0.0631363,0.20631956,1
0.078255326,0.14194572,1
0.07247664,0.42835155,1
0.08149325,0.49554935,1
0.07674059,0.23653725,1
0.061496537,0.26608053,1
0.060016714,0.2830889,1
0.07019598,0.41536877,1
0.07109457,0.1710514,1
0.07618702,0.14676456,1
0.059317295,0.16153148,1
0.07470026,0.15346336,1
0.067449465,0.18406107,1
0.06979146,0.16147861,1
0.07131727,0.19198163,1
0.07736356,0.15388495,1
0.06719669,0.16383876,1
0.068865635,0.15528211,1
0.08877822,0.6127899,1
0.06741597,0.19855091,1
0.06694652,0.28951576,1
0.0660111,0.31379393,1
0.062425658,0.24016514,1
0.06989981,0.17068507,1
0.07005359,0.20697498,1
0.060914367,0.33563587,1
0.06354878,0.19549353,1
0.06759263,0.19463569,1
0.06399961,0.48814422,1
0.06988339,0.15848301,1
0.05753725,0.2750097,1
0.06663089,0.18604542,1
0.093330614,0.19705708,1
0.06401468,0.20342655,1
0.06402514,0.25757554,1
0.059843753,0.195005,1
0.05351603,0.3327924,1
0.08941569,0.5701255,1
0.06972112,0.23680755,1
0.06641861,0.16803086,1
0.06276922,0.22398354,1
0.117242776,0.6726487,1
0.06522318,0.42236772,1
0.15725225,0.25489068,1
0.06284786,0.36608136,1
0.062177453,0.22079849,1
0.06067014,0.18490677,1
0.055332337,0.460086,1
0.057196826,0.32497847,1
0.061896063,0.34419012,1
0.06511007,0.48456013,1
0.084993,0.18496595,1
0.06964964,0.34829372,1
0.06365206,0.38719678,1
0.06245832,0.18346381,1
0.06585728,0.3755331,1
0.060795616,0.31613678,1
0.069539145,0.153587,1
0.06256108,0.218437,1
0.066654444,0.15065253,1
0.1279351,0.5558463,1
0.069873974,0.3872766,1
0.068742186,0.3159877,1
0.06263668,0.2332529,1
0.06065501,0.244322,1
0.06851667,0.5303853,1
0.06940705,0.16098744,1
0.07348818,0.15738524,1
0.065457016,0.3574349,1
0.07383938,0.15064248,1
0.0599094,0.27314925,1
0.07046352,0.1476288,1
0.06981092,0.15255387,1
0.06262648,0.22805224,1
0.07523274,0.16600357,1
0.06616615,0.185606,1
0.060027335,0.46805266,1
0.06720147,0.27369815,1
0.07521797,0.29361323,1
0.066053726,0.15884112,1
0.06661875,0.53888184,1
0.083176926,0.16588128,1
0.090367064,0.6990412,1
0.07696386,0.14383353,1
0.07520099,0.16445771,1
0.06737919,0.42033365,1
0.05663513,0.20092313,1
0.06351107,0.16961354,1
0.060815148,0.3658673,1
0.05975898,0.57633567,1
0.071858756,0.18116088,1
0.07319324,0.1676201,1
0.06782723,0.15917332,1
0.07499895,0.14976637,1
0.0739052,0.49332622,1
0.056299593,0.3676266,1
0.07004881,0.18549931,1
0.06581458,0.2761986,1
0.06524861,0.19000635,1
0.065101966,0.24294835,1
0.07580699,0.1666768,1
0.078988686,0.54583067,1
0.07209977,0.1693119,1
0.06345837,0.5034689,1
0.061842896,0.3789195,1
0.065342225,0.19254926,1
0.09388957,0.5515222,1
0.07999484,0.14677918,1
0.061414648,0.49900326,1
0.06212036,0.2724326,1
0.061516397,0.4574538,1
0.07553898,0.4894047,1
0.07590953,0.1489378,1
0.07121453,0.21466899,1
0.074343875,0.15061347,1
0.062967926,0.28409666,1
0.06125831,0.46337226,1
0.06843826,0.46634042,1
0.07921412,0.21887916,1
0.06564418,0.19600585,1
0.066425495,0.2412892,1
0.05932837,0.28179798,1
0.06261234,0.30274227,1
0.059383217,0.3509586,1
0.07311276,0.15812156,1
0.06553436,0.16790642,1
0.07233784,0.21335626,1
0.07023895,0.14987655,1
0.06273314,0.32898417,1
0.08070528,0.33164188,1
0.059559405,0.30584675,1
0.08566274,0.5434274,1
0.060777713,0.5111059,1
0.07670819,0.16553825,1
0.07520653,0.32058394,1
0.067712136,0.517972,1
0.063675426,0.24094802,1
0.07261274,0.18429889,1
0.07172009,0.49655834,1
0.06142181,0.17211328,1
0.06918882,0.20755985,1
0.07320383,0.1649281,1
0.06623295,0.24847473,1
0.07246161,0.16187276,1
0.10363303,0.5715554,1
0.06706916,0.16173398,1
0.0655282,0.1783113,1
0.10695696,0.53944904,1
0.071015224,0.15868293,1
0.0799776,0.160753,1
0.062286098,0.22652596,1
0.056191538,0.27488533,1
0.06252696,0.185419,1
0.06583871,0.2890963,1
0.068934016,0.15794963,1
0.061609685,0.3650035,1
0.06782649,0.36205164,1
0.0629958,0.3842324,1
0.060344093,0.2683225,1
0.06663344,0.16664934,1
0.1289396,0.197252,1
0.16290846,0.28449702,1
0.06893131,0.3215461,1
0.07631492,0.1753087,1
0.1135833,0.64085054,1
0.0782472,0.16699089,1
0.059756465,0.18226328,1
0.0693736,0.29870963,1
0.0644676,0.46074048,1
0.060554136,0.24531697,1
0.06772923,0.26328942,1
0.065215796,0.16003102,1
0.076439,0.17517301,1
0.059398595,0.32328543,1
0.059030894,0.20920813,1
0.08242123,0.48298517,1
0.0690384,0.20683257,1
0.08146075,0.5799017,1
0.056644384,0.24690577,1
0.06911741,0.21155612,1
0.061738867,0.44539654,1
0.07015478,0.16447403,1
0.08830874,0.67824596,1
0.06482821,0.16882294,1
0.08405558,0.4678531,1
0.05958727,0.44624862,1
