{
    "dimensionality_reduction_methods": "['PCA', 'TSVD']",
    "proportions": "[1, 0]",
    "dataset": "fmnist",
    "number_of_classes": "10",
    "number_of_points": "10000",
    "number_of_Tsamples": "5000",
    "number_ofVsamples": "1000",
    "loss": "0.0005781665095128119",
    "trustworthiness": "0.912709752155943",
    "continuity": "0.9748284184031005",
    "neighborhood_hit": "0.5259428571428572"
}