PC1,PC2,label
0.5274003,0.18749173,0
0.6165575,0.15847966,0
0.42548254,0.38587028,0
0.4867496,0.1886103,0
0.8497042,0.555398,0
0.79708457,0.18941925,0
0.33136013,0.2952419,0
0.84507984,0.5237187,0
0.59409505,0.5022004,0
0.81316745,0.5305726,0
0.46892482,0.15763627,0
0.63736445,0.18226188,0
0.8059484,0.44606632,0
0.7395483,0.19257216,0
0.6966879,0.1506128,0
0.7867491,0.7184095,0
0.8325943,0.50898653,0
0.4944282,0.31021965,0
0.85135925,0.54088974,0
0.7637709,0.29963544,0
0.6940337,0.45361242,0
0.7857939,0.43558446,0
0.66315657,0.44098398,0
0.77576095,0.29612786,0
0.79320866,0.4137778,0
0.56947917,0.2756879,0
0.48922545,0.5129401,0
0.67798054,0.15982407,0
0.87600076,0.42008457,0
0.77386767,0.2717307,0
0.3693251,0.39504164,0
0.8227301,0.6522276,0
0.85573566,0.44759133,0
0.84773827,0.6364039,0
0.86166745,0.39602906,0
0.67606264,0.17528269,0
0.8435708,0.5953355,0
0.7671966,0.38496643,0
0.54562587,0.12323127,0
0.50522214,0.22369336,0
0.7345666,0.23806557,0
0.4467543,0.2464408,0
0.8291749,0.5098459,0
0.6095707,0.361176,0
0.71228856,0.533665,0
0.504187,0.48711786,0
0.8214433,0.37967432,0
0.5504593,0.17736803,0
0.7791789,0.32886472,0
0.84987986,0.61267096,0
0.82523453,0.5882013,0
0.58807653,0.25045604,0
0.8203049,0.49670616,0
0.86740613,0.46206084,0
0.6749729,0.20543393,0
0.3137919,0.66424704,0
0.7721511,0.42212147,0
0.6440849,0.18397786,0
0.7673031,0.24098629,0
0.68812937,0.3942346,0
0.48891073,0.14077528,0
0.5891881,0.17673896,0
0.524802,0.1890927,0
0.78131026,0.27278328,0
0.8695235,0.39085537,0
0.5588313,0.39437512,0
0.71698403,0.40938812,0
0.48721996,0.37666017,0
0.7248132,0.19154178,0
0.7106073,0.18056256,0
0.59890616,0.22831392,0
0.6872284,0.40800846,0
0.5277724,0.28457332,0
0.6306811,0.288258,0
0.6338894,0.15963295,0
0.65600884,0.27241254,0
0.6790313,0.45106745,0
0.7315005,0.27651268,0
0.73651624,0.24439238,0
0.69969,0.50064135,0
0.7597343,0.40783468,0
0.58514345,0.2571048,0
0.42185363,0.23562507,0
0.6385213,0.38244462,0
0.62230927,0.5113236,0
0.666909,0.2661571,0
0.26318318,0.37035713,0
0.46576384,0.22697188,0
0.43517196,0.36031407,0
0.7935388,0.4198142,0
0.64001566,0.2960496,0
0.6855289,0.5799215,0
0.643536,0.60422325,0
0.40773907,0.7315666,0
0.5616085,0.35934612,0
0.7462434,0.71558136,0
0.55128634,0.516737,0
0.7804296,0.2299481,0
0.55704373,0.15684274,0
0.5253709,0.67463166,0
0.45177642,0.27268985,0
0.48173603,0.19623931,0
0.80977243,0.29487124,0
0.625952,0.14455517,0
0.5134545,0.218108,0
0.7357502,0.40504003,0
0.57147896,0.17231728,0
0.70544213,0.50828105,0
0.6923777,0.38113672,0
0.5242358,0.23940769,0
0.4695424,0.17067645,0
0.77906036,0.4280615,0
0.68735045,0.17224015,0
0.7245346,0.5298359,0
0.87463623,0.3742216,0
0.6145645,0.38190162,0
0.49105573,0.17910077,0
0.50985944,0.54463893,0
0.70321506,0.22647934,0
0.69449794,0.4455869,0
0.8415342,0.38175216,0
0.80281055,0.46949354,0
0.6807588,0.27360374,0
0.74442405,0.39231607,0
0.69042504,0.16813542,0
0.7677891,0.38756308,0
0.63294,0.20423034,0
0.67411447,0.20846233,0
0.6878745,0.2806414,0
0.6022227,0.5033535,0
0.48283148,0.3895156,0
0.6549242,0.19041497,0
0.58692914,0.26507407,0
0.5953142,0.3689992,0
0.5629347,0.2141327,0
0.755568,0.1493538,0
0.63779104,0.3635026,0
0.3843093,0.3782556,0
0.62418956,0.3900393,0
0.45459792,0.3226873,0
0.44530022,0.32909524,0
0.46101537,0.15671109,0
0.670347,0.20338312,0
0.86711854,0.4164866,0
0.7954876,0.62389153,0
0.531219,0.45719677,0
0.72524536,0.52637917,0
0.4033011,0.42795894,0
0.46358338,0.30048916,0
0.80225873,0.21246955,0
0.61600256,0.1895039,0
0.44919804,0.64197594,0
0.47513983,0.16006714,0
0.5467,0.50340074,0
0.5174163,0.5047915,0
0.52442825,0.4783384,0
0.46626532,0.431048,0
0.5239044,0.52206475,0
0.5815348,0.2871879,0
0.5063908,0.38023013,0
0.6435977,0.44455063,0
0.7007461,0.31957307,0
0.47415704,0.40403888,0
0.5776432,0.25693113,0
0.48854917,0.4987253,0
0.38733634,0.5024426,0
0.6330368,0.2457,0
0.5058979,0.48929223,0
0.41124475,0.328635,0
0.7132746,0.44516787,0
0.65943414,0.30634737,0
0.40588692,0.35921606,0
0.62413496,0.23227544,0
0.6737113,0.25846204,0
0.38390052,0.6269375,0
0.66818213,0.49420536,0
0.6331473,0.21307778,0
0.5843834,0.27098528,0
0.32315904,0.33071873,0
0.48302856,0.19917303,0
0.67895865,0.30969608,0
0.65303004,0.28893355,0
0.4885017,0.6498261,0
0.4455654,0.1658856,0
0.8520951,0.24430427,0
0.7331866,0.3752256,0
0.6003109,0.2320919,0
0.42809534,0.3674626,0
0.51298976,0.16325976,0
0.6218174,0.22219852,0
0.79885775,0.4500952,0
0.76932585,0.2514331,0
0.64300853,0.32478154,0
0.8108058,0.26916292,0
0.57469916,0.44907656,0
0.81635547,0.25866863,0
0.5518315,0.50317776,0
0.6923044,0.18934451,0
0.6368617,0.43481985,0
0.6548049,0.20493105,0
0.505338,0.180371,0
0.66527426,0.4540092,0
0.75202924,0.53058594,0
0.44992274,0.13505685,0
0.57280827,0.3991234,0
0.44135627,0.5870656,0
0.74363047,0.17820324,0
0.5884399,0.26741874,0
0.59897286,0.121383265,0
0.5689674,0.28328478,0
0.64325756,0.21087281,0
0.7513391,0.6381508,0
0.74487156,0.18281825,0
0.71219385,0.24236989,0
0.48704395,0.16917628,0
0.70011526,0.3949652,0
0.65195274,0.20544624,0
0.42562863,0.29922685,0
0.88836366,0.47629443,0
0.4999442,0.4059792,0
0.7590708,0.42390266,0
0.5196488,0.4225593,0
0.75083095,0.18273717,0
0.32514304,0.5461807,0
0.8210138,0.49882832,0
0.7365662,0.28610024,0
0.7662531,0.45832065,0
0.74506855,0.20085658,0
0.66810834,0.38233176,0
0.444806,0.34200114,0
0.78402406,0.27248415,0
0.7655282,0.21098088,0
0.6008368,0.4063824,0
0.8082609,0.54385245,0
0.7445516,0.18439153,0
0.87965316,0.33778304,0
0.8737363,0.32314986,0
0.59013164,0.13403687,0
0.5608502,0.1202412,0
0.5956855,0.612798,0
0.43059152,0.2598505,0
0.6422155,0.44356486,0
0.7501378,0.357669,0
0.37175703,0.38106653,0
0.65445065,0.66348976,0
0.66947424,0.26177633,0
0.83872485,0.5487514,0
0.7680134,0.3109387,0
0.8177532,0.4855916,0
0.88380736,0.3673706,0
0.6009175,0.26572776,0
0.6113365,0.3192833,0
0.61968285,0.40742937,0
0.51551014,0.19682209,0
0.5047732,0.27078953,0
0.5697671,0.49837843,0
0.6416765,0.21561013,0
0.64071304,0.2897404,0
0.7401495,0.23584603,0
0.47586876,0.5244676,0
0.444145,0.6859879,0
0.49001834,0.35704002,0
0.7476987,0.47673455,0
0.771878,0.30863285,0
0.49358538,0.22251719,0
0.42855915,0.35323405,0
0.48019516,0.22225793,0
0.70686084,0.37690842,0
0.56867194,0.36693403,0
0.56966406,0.2940526,0
0.7528442,0.3720047,0
0.40800345,0.28041905,0
0.665267,0.39705765,0
0.49878654,0.1634682,0
0.70010674,0.39166212,0
0.68363523,0.31493402,0
0.7092565,0.30955827,0
0.49132478,0.49735522,0
0.55297023,0.5196502,0
0.28815877,0.7019474,0
0.49912047,0.26567233,0
0.75433856,0.19101314,0
0.6783524,0.37520063,0
0.6067832,0.53576803,0
0.52468354,0.398181,0
0.69684243,0.18551314,0
0.5749065,0.37467322,0
0.56942904,0.6428061,0
0.6030152,0.6509647,0
0.72905356,0.34295887,0
0.77127016,0.19445477,0
0.5616206,0.32417336,0
0.7871908,0.22475249,0
0.7837538,0.15501179,0
0.75334674,0.22327513,0
0.75630367,0.1675364,0
0.62097204,0.3281338,0
0.5985231,0.3088868,0
0.581479,0.38088632,0
0.39903766,0.37557167,0
0.58928484,0.26090539,0
0.45263577,0.3949172,0
0.57889897,0.37407935,0
0.6904047,0.38857865,0
0.78612834,0.46089932,0
0.76510096,0.22716227,0
0.792421,0.24129158,0
0.7694871,0.5534762,0
0.8161852,0.5194068,0
0.7845489,0.59580135,0
0.7018742,0.19101839,0
0.5314862,0.34345347,0
0.7604249,0.16676185,0
0.5332452,0.35291764,0
0.6835942,0.15499565,0
0.7769539,0.22990459,0
0.586497,0.392188,0
0.79661536,0.2381572,0
0.8270359,0.30051824,0
0.63714206,0.25685212,0
0.6767725,0.25390354,0
0.53478473,0.25923756,0
0.71698475,0.5440097,0
0.6647408,0.62782574,0
0.56869465,0.44415215,0
0.74685544,0.6076904,0
0.5698213,0.37749174,0
0.6705847,0.37860525,0
0.6889101,0.24661821,0
0.50721556,0.58687,0
0.73546386,0.18787304,0
0.63231045,0.23551868,0
0.64842683,0.38445577,0
0.67161894,0.21778786,0
0.7287796,0.15058182,0
0.7692614,0.1803598,0
0.80005985,0.18053937,0
0.6930678,0.54855347,0
0.748149,0.33941755,0
0.7157596,0.19000308,0
0.67017144,0.2911107,0
0.61952186,0.5243426,0
0.63739026,0.36920267,0
0.5195119,0.45514026,0
0.6655362,0.31201476,0
0.6126716,0.19491999,0
0.573176,0.4008011,0
0.609785,0.44137886,0
0.68850845,0.6233881,0
0.7964065,0.316595,0
0.46057373,0.46469772,0
0.78503066,0.34148124,0
0.8373094,0.29366782,0
0.75783056,0.4335338,0
0.6296352,0.48615453,0
0.8328114,0.23537837,0
0.68805385,0.4155884,0
0.6777089,0.4766675,0
0.75333786,0.2757494,0
0.7418656,0.3548419,0
0.7594758,0.73616725,0
0.5889558,0.592115,0
0.72755146,0.21466951,0
0.73867524,0.23038451,0
0.5676551,0.45169935,0
0.62159204,0.44588846,0
0.75839496,0.4186373,0
0.64699584,0.45148623,0
0.31040132,0.6443022,0
0.48504317,0.50248826,0
0.6237374,0.4468741,0
0.5547118,0.36655653,0
0.49228817,0.61243993,0
0.7096876,0.294904,0
0.6320662,0.51180464,0
0.15959163,0.5370529,0
0.7411445,0.3833194,0
0.6797446,0.5714008,0
0.59269685,0.7800697,0
0.40387252,0.39840126,0
0.5632561,0.24937364,0
0.70543134,0.2227605,0
0.5870667,0.41325366,0
0.5788929,0.1444828,0
0.57173026,0.22006314,0
0.7034642,0.4210611,0
0.56997854,0.24067788,0
0.7289037,0.48302305,0
0.7027821,0.31482258,0
0.8135695,0.4979529,0
0.7422464,0.5122204,0
0.52494454,0.76528,0
0.5783445,0.3473305,0
0.3923591,0.3135862,0
0.85813695,0.47685048,0
0.7136813,0.42352504,0
0.7317752,0.32007068,0
0.80725163,0.5733044,0
0.76654166,0.43736407,0
0.6901328,0.37508252,0
0.8638933,0.27062508,0
0.86542046,0.2771448,0
0.851889,0.23516789,0
0.68086255,0.61745334,0
0.8541043,0.20089105,0
0.87222904,0.32695416,0
0.7755956,0.42048258,0
0.79783434,0.63332254,0
0.82332784,0.4039989,0
0.81723696,0.36354885,0
0.8149595,0.26511955,0
0.83182424,0.31929877,0
0.7569971,0.27540478,0
0.7873563,0.3522821,0
0.8221881,0.39546537,0
0.79627925,0.4097115,0
0.7852532,0.45916694,0
0.80666816,0.5645843,0
0.8062129,0.5649461,0
0.75723755,0.3423267,0
0.7958176,0.36560935,0
0.7568749,0.6242348,0
0.82503295,0.26020774,0
0.7191855,0.5063015,0
0.623649,0.61829954,0
0.85821843,0.5022815,0
0.7530458,0.5013923,0
0.76614493,0.4645632,0
0.78261566,0.34581658,0
0.71092886,0.15503252,0
0.5368377,0.3551121,0
0.70935076,0.36839798,0
0.49612978,0.49275467,0
0.6856971,0.7352615,0
0.7611193,0.5102192,0
0.59385234,0.49396095,0
0.765529,0.4652836,0
0.7204004,0.37199852,0
0.692494,0.55890536,0
0.6776922,0.4865773,0
0.63964194,0.6836908,0
0.5713178,0.49194697,0
0.64067507,0.6297192,0
0.548762,0.6232104,0
0.5926785,0.47387707,0
0.62553525,0.6279647,0
0.7927975,0.17164683,0
0.705987,0.6216389,0
0.665439,0.13147154,0
0.8103736,0.5516195,0
0.7954695,0.5546589,0
0.5352549,0.68112266,0
0.5282195,0.50053227,0
0.7081269,0.4353834,0
0.34243342,0.39782223,0
0.4650069,0.552934,0
0.8074713,0.3926887,0
0.7645652,0.47428498,0
0.67715013,0.4073019,0
0.7857636,0.4405453,0
0.78080374,0.53061414,0
0.772044,0.5350231,0
0.76623964,0.6379713,0
0.7302322,0.47249478,0
0.61644995,0.5324978,0
0.70653087,0.47087088,0
0.6632845,0.56610763,0
0.740675,0.61299,0
0.43587333,0.38175958,0
0.44731918,0.45568585,0
0.5003728,0.43548843,0
0.5514687,0.5670733,0
0.8728786,0.39459276,0
0.42858455,0.4452311,0
0.50067055,0.30428147,0
0.45123246,0.22564638,0
0.40498647,0.6634659,0
0.50893825,0.620434,0
0.66598445,0.57567316,0
0.78378445,0.2070252,0
0.64270425,0.6857301,0
0.5471913,0.19209282,0
0.40597203,0.41454357,0
0.7669857,0.3882424,0
0.5992138,0.6897006,0
0.35947913,0.37043497,0
0.6410862,0.14122975,0
0.76930416,0.33801758,0
0.6176765,0.17226507,0
0.7398728,0.6338373,0
0.62238085,0.19594018,0
0.6543227,0.30650005,0
0.3809541,0.39382786,0
0.5381962,0.55130637,0
0.4897279,0.33308747,0
0.5474521,0.1339478,0
0.49580067,0.29394194,0
0.541794,0.2852354,0
0.5655884,0.5210097,0
0.59769124,0.71939,0
0.481403,0.51823056,0
0.38761052,0.6497641,0
0.72329324,0.33442393,0
0.6793512,0.54877424,0
0.4547446,0.43412483,0
0.6916772,0.5822475,0
0.6786241,0.24439457,0
0.532341,0.2770187,0
0.5697706,0.55889076,0
0.55831,0.6583471,0
0.60803396,0.41621605,0
0.445857,0.40180776,0
0.57885754,0.64122605,0
0.76689464,0.39597762,0
0.5034459,0.64054394,0
0.7366599,0.32702184,0
0.37880963,0.60414964,0
0.77455807,0.2773575,0
0.69986355,0.27269927,0
0.8011762,0.34354255,0
0.7234671,0.34316742,0
0.5277117,0.55606276,0
0.7819923,0.37434876,0
0.57828337,0.25138697,0
0.56514925,0.41941446,0
0.5115102,0.14207816,0
0.72781146,0.4604456,0
0.6945184,0.3349959,0
0.41571712,0.70802474,0
0.59876984,0.4502028,0
0.7289468,0.5389214,0
0.51276433,0.4037697,0
0.64305556,0.30323607,0
0.59118843,0.39508578,0
0.72222376,0.32945946,0
0.3943122,0.62570435,0
0.63949656,0.57991266,0
0.78004795,0.22556593,0
0.6294825,0.18803409,0
0.5933145,0.39551497,0
0.8190046,0.33205655,0
0.7905355,0.38133606,0
0.5910412,0.5379732,0
0.6642902,0.2006222,0
0.8051182,0.37974432,0
0.79750687,0.40249804,0
0.70355815,0.5949204,0
0.65491015,0.53058463,0
0.66524875,0.3509996,0
0.565536,0.45934018,0
0.6118167,0.36061776,0
0.52714694,0.5706364,0
0.4698001,0.37066722,0
0.63213897,0.3435789,0
0.4846736,0.29783106,0
0.581041,0.5521582,0
0.6788615,0.6983976,0
0.7061369,0.39253017,0
0.7387251,0.46932134,0
0.76067334,0.33498573,0
0.64813024,0.15007101,0
0.7790153,0.4293422,0
0.52504665,0.17410481,0
0.521062,0.41219214,0
0.812315,0.26404566,0
0.732343,0.56675845,0
0.77298903,0.36050284,0
0.7721256,0.42072204,0
0.7741428,0.36280453,0
0.75788826,0.26344982,0
0.5802871,0.29193416,0
0.7475312,0.4877319,0
0.24455728,0.40616354,0
0.4270871,0.33698493,0
0.85093313,0.5601154,0
0.56564456,0.40848005,0
0.80352885,0.17230335,0
0.6414531,0.2550716,0
0.83294636,0.22753613,0
0.5616095,0.23705247,0
0.5297731,0.15657005,0
0.4806944,0.18599239,0
0.7121934,0.14056356,0
0.6750544,0.3856531,0
0.6000978,0.28228262,0
0.59977096,0.32272157,0
0.462968,0.2979684,0
0.51939344,0.3875178,0
0.6576173,0.38596287,0
0.53875977,0.14471182,0
0.53474075,0.5140432,0
0.3978287,0.66973156,0
0.6344299,0.32138655,0
0.66515523,0.29670048,0
0.44815198,0.30841112,0
0.56165844,0.22809084,0
0.5634572,0.24441217,0
0.7489077,0.20693041,0
0.6593048,0.6755806,0
0.7767124,0.39000326,0
0.7838155,0.55331504,0
0.74646145,0.23670128,0
0.8188339,0.22122352,0
0.7663087,0.19009262,0
0.50883555,0.18879013,0
0.7644638,0.5927214,0
0.4081515,0.46114123,0
0.8669984,0.23840004,0
0.5560381,0.5815117,0
0.54540026,0.4188197,0
0.7149541,0.15224327,0
0.64933175,0.17583717,0
0.72753674,0.21941663,0
0.7928134,0.19934262,0
0.67566985,0.25143328,0
0.522673,0.267088,0
0.5382706,0.54019606,0
0.82840556,0.40051863,0
0.53512716,0.34397373,0
0.5448417,0.23328559,0
0.48459786,0.17246547,0
0.79764163,0.28665558,0
0.7438291,0.17477955,0
0.5753601,0.25523606,0
0.59141827,0.40968275,0
0.6218946,0.21009943,0
0.5716147,0.2967013,0
0.65069515,0.15929748,0
0.5940647,0.26881364,0
0.6843911,0.20631479,0
0.5609903,0.4299768,0
0.7776344,0.19214211,0
0.52139676,0.50021845,0
0.62351644,0.23567149,0
0.62042296,0.16963167,0
0.6992313,0.3206135,0
0.6645296,0.34150523,0
0.45145714,0.671216,0
0.5408887,0.25745723,0
0.42778704,0.3653221,0
0.6160535,0.5239884,0
0.49715325,0.3929868,0
0.5970489,0.4681901,0
0.55710626,0.17502989,0
0.5227959,0.16865997,0
0.82598925,0.2883043,0
0.64785063,0.14344868,0
0.59341216,0.2219294,0
0.59242654,0.22728407,0
0.78360474,0.16689315,0
0.76150376,0.2759963,0
0.6525759,0.19579636,0
0.8148918,0.39691275,0
0.61786914,0.412015,0
0.6563405,0.53182065,0
0.4762848,0.47907954,0
0.777422,0.31344387,0
0.48274824,0.25101334,0
0.74508214,0.34336913,0
0.5038634,0.3473389,0
0.85330623,0.24757998,0
0.43284327,0.27135944,0
0.5409871,0.20766123,0
0.87545234,0.3832161,0
0.47106597,0.40696198,0
0.5543853,0.21150371,0
0.59137833,0.18070239,0
0.5986604,0.48224372,0
0.69895625,0.27903864,0
0.5688555,0.49588782,0
0.65398985,0.5200778,0
0.32397804,0.60253763,0
0.75491977,0.36210656,0
0.83641046,0.3001326,0
0.68276054,0.28563523,0
0.5227883,0.7265298,0
0.7533944,0.7060679,0
0.7608968,0.36795917,0
0.61934584,0.31268448,0
0.6335251,0.26656848,0
0.4186733,0.5480392,0
0.8024544,0.16093,0
0.4126047,0.26607466,0
0.71417916,0.69568044,0
0.6468597,0.16095142,0
0.5792038,0.27013874,0
0.6995761,0.57355434,0
0.6904227,0.2556702,0
0.58703995,0.29379737,0
0.74413484,0.56467795,0
0.71256465,0.24321286,0
0.6407072,0.48228163,0
0.604851,0.3605257,0
0.6930096,0.23329663,0
0.5657415,0.41612375,0
0.647088,0.32814854,0
0.57941055,0.37995106,0
0.79006934,0.160566,0
0.6155508,0.18960798,0
0.5970126,0.48753104,0
0.78877413,0.43974477,0
0.7169934,0.15062682,0
0.40472472,0.30063766,0
0.5132409,0.2139925,0
0.56990725,0.25801015,0
0.52173305,0.43945017,0
0.4840537,0.56786,0
0.78428495,0.15092458,0
0.55560935,0.18671016,0
0.5309789,0.2782337,0
0.472295,0.21083365,0
0.6765847,0.25984594,0
0.38106743,0.6234894,0
0.56250256,0.75644773,0
0.5606816,0.2667683,0
0.80720246,0.24507806,0
0.54280275,0.20575984,0
0.49409485,0.64336425,0
0.4868398,0.13739538,0
0.8586947,0.33821896,0
0.6794741,0.4554311,0
0.3746705,0.32103696,0
0.7570277,0.32526314,0
0.74067855,0.54083097,0
0.46799687,0.5811246,0
0.42159224,0.5441717,0
0.5438237,0.7477254,0
0.39506227,0.53983456,0
0.4625574,0.40429038,0
0.42676234,0.16137303,0
0.48679844,0.56476325,0
0.44214085,0.123090096,0
0.65318733,0.56995803,0
0.53145486,0.6475856,0
0.47334683,0.6896378,0
0.70498794,0.25322938,0
0.5678952,0.56401074,0
0.6026676,0.15098836,0
0.69134235,0.51711375,0
0.595582,0.13484135,0
0.5759747,0.45061025,0
0.6204701,0.6399701,0
0.5012173,0.6298082,0
0.6971268,0.3725123,0
0.64157164,0.20061061,0
0.65792125,0.32175955,0
0.8158139,0.30947268,0
0.854226,0.5094175,0
0.6606088,0.4211767,0
0.47799304,0.4995354,0
0.5298383,0.4667675,0
0.50578666,0.4221541,0
0.7157408,0.49158195,0
0.5428909,0.19616438,0
0.7982601,0.2015691,0
0.47942704,0.61302686,0
0.5249305,0.3529213,0
0.8681806,0.27817228,0
0.61989266,0.23320931,0
0.4850857,0.1695371,0
0.5238086,0.3518407,0
0.5528532,0.449148,0
0.5393134,0.35012767,0
0.5950033,0.5084817,0
0.48433062,0.3039095,0
0.4720991,0.5868868,0
0.61970025,0.29398605,0
0.701626,0.19339362,0
0.7308823,0.34023482,0
0.48757032,0.732188,0
0.21263272,0.5261614,0
0.53831935,0.5990856,0
0.6471401,0.2803316,0
0.62501377,0.58708435,0
0.6292813,0.2643411,0
0.5834506,0.3928445,0
0.5315289,0.21454987,0
0.4778392,0.16578935,0
0.4407949,0.256237,0
0.48831943,0.1541993,0
0.4764707,0.4270781,0
0.49701586,0.4942018,0
0.7849505,0.24817489,0
0.627452,0.3820412,0
0.57770455,0.20614283,0
0.6669355,0.404539,0
0.5546063,0.19917428,0
0.7260259,0.5634731,0
0.64615524,0.40189016,0
0.5024882,0.6101177,0
0.45914146,0.177915,0
0.68108654,0.70654196,0
0.5087696,0.17198585,0
0.8316796,0.34132034,0
0.7215272,0.17015977,0
0.7870205,0.40156287,0
0.6437854,0.29806048,0
0.59149915,0.71195525,0
0.5793914,0.45698646,0
0.6228259,0.2518486,0
0.8146494,0.35887858,0
0.47190583,0.31196186,0
0.52563524,0.40626922,0
0.5120536,0.36953002,0
0.7899254,0.25921583,0
0.590181,0.16807123,0
0.5625758,0.42548543,0
0.8336067,0.3902943,0
0.5181022,0.5413767,0
0.5664608,0.69447964,0
0.7079574,0.544448,0
0.54847395,0.28392166,0
0.5089388,0.57687354,0
0.41801468,0.273372,0
0.40019205,0.40691298,0
0.40061092,0.53565335,0
0.3416093,0.625323,0
0.620476,0.21716766,0
0.36694548,0.7225067,0
0.54136324,0.3282181,0
0.6106883,0.18465823,0
0.531091,0.5419758,0
0.47862715,0.24612293,0
0.43717343,0.25236627,0
0.2725501,0.38668415,0
0.40195814,0.25418326,0
0.66897374,0.56868213,0
0.5183298,0.23090404,0
0.7622281,0.2767781,0
0.4591671,0.3834142,0
0.5370208,0.15719377,0
0.66850126,0.15903488,0
0.5995213,0.21413767,0
0.44646925,0.463662,0
0.58860546,0.36647335,0
0.6297393,0.48970097,0
0.70844823,0.12360415,0
0.27900615,0.4968067,0
0.6387505,0.5379423,0
0.15050994,0.57621634,0
0.5924088,0.16118771,0
0.49076277,0.50530976,0
0.3359161,0.53896964,0
0.27028304,0.35440534,0
0.7904874,0.6196719,0
0.62225646,0.19219604,0
0.6351296,0.2520697,0
0.76776326,0.28263026,0
0.74563086,0.5872501,0
0.74066865,0.4928162,0
0.6710501,0.22761483,0
0.7774928,0.5572286,0
0.62420636,0.4182724,0
0.70904166,0.58494544,0
0.65667194,0.231404,0
0.8846166,0.41828138,0
0.7255119,0.19835085,0
0.8250404,0.24048056,0
0.51600677,0.15137978,0
0.59479225,0.31652665,0
0.6010686,0.22739814,0
0.67334926,0.33242905,0
0.4896929,0.40592945,0
0.6341563,0.27588522,0
0.48820218,0.1951584,0
0.42568403,0.33185795,0
0.6321912,0.62130105,0
0.6208359,0.39606825,0
0.5785452,0.47673672,0
0.6287522,0.5267629,0
0.69779605,0.51001763,0
0.7295567,0.183768,0
0.5658082,0.32797894,0
0.50969654,0.5381146,0
0.69381493,0.58789575,0
0.69181675,0.3600007,0
0.80349505,0.52374583,0
0.81595635,0.37679905,0
0.42831135,0.72420925,0
0.56780297,0.41307393,0
0.39830852,0.5755757,0
0.7150743,0.3410507,0
0.6433159,0.33156502,0
0.7110123,0.38002783,0
0.6657679,0.46898347,0
0.60778624,0.4032049,0
0.67806107,0.31302562,0
0.8526353,0.6362953,0
0.7225591,0.56534755,0
0.62323576,0.27878183,0
0.6710605,0.21726558,0
0.7640841,0.25189802,0
0.7430224,0.35078618,0
0.633784,0.17111036,0
0.6943204,0.36216164,0
0.6010116,0.5686108,0
0.56913996,0.19451301,0
0.6211358,0.30100107,0
0.75578386,0.25153425,0
0.73812354,0.57912713,0
0.71556485,0.21193317,0
0.37843466,0.4253156,0
0.65831965,0.64847845,0
0.60347986,0.33214945,0
0.5878218,0.1637885,0
0.48209664,0.15349153,0
0.6913823,0.5497434,0
0.73991716,0.29597288,0
0.2941226,0.34180146,0
0.8257192,0.4668304,0
0.41504267,0.16156706,0
0.5584227,0.32429862,0
0.61632913,0.34244412,0
0.7844713,0.5868627,0
0.57801276,0.37081927,0
0.5109534,0.4256752,0
0.47049373,0.2553444,0
0.6273001,0.21699248,0
0.5792411,0.28765288,0
0.55724317,0.21763986,0
0.46052027,0.5885895,0
0.47763672,0.5776374,0
0.5361727,0.14016083,0
0.6607219,0.6050062,0
0.631968,0.40801552,0
0.86773884,0.30367684,0
0.46901333,0.169413,0
0.6177845,0.14674991,0
0.74267524,0.43552288,0
0.6586327,0.33465084,0
0.3824268,0.2813025,0
0.74367785,0.60581654,0
0.72906584,0.3321494,0
0.67631227,0.1419936,0
0.71527356,0.24795994,0
0.44494337,0.15894113,0
0.6666083,0.13591442,0
0.72465163,0.51889926,0
0.47555253,0.2116772,0
0.53094286,0.47727776,0
0.62899274,0.51291573,0
0.68230206,0.5875756,0
0.5612389,0.34572217,0
0.52711844,0.4667909,0
0.49520323,0.39159274,0
0.4940831,0.30510494,0
0.56004083,0.45318487,0
0.65489995,0.301991,0
0.70104176,0.379597,0
0.7318572,0.6466951,0
0.5277613,0.3137657,0
0.5225374,0.48120445,0
0.65692276,0.14240931,0
0.5263785,0.27701077,0
0.3150829,0.39609,0
0.7262005,0.6031809,0
0.6605958,0.35449997,0
0.83080024,0.40152565,0
0.43850565,0.1417901,0
0.6810061,0.324911,0
0.7222376,0.6649357,0
0.6293035,0.20144498,0
0.5387748,0.2946653,0
0.5241412,0.653434,0
0.36716813,0.29754862,0
0.825786,0.32804498,0
0.6143751,0.18373439,0
0.5178315,0.5587794,0
0.48590052,0.2568692,0
0.67513275,0.2673481,0
0.717047,0.64310515,0
0.6743527,0.613586,0
0.71085995,0.38159057,0
0.818616,0.5277795,0
0.5079232,0.18427739,0
0.75929177,0.54975575,0
0.77209747,0.3807895,0
0.5745066,0.7172344,0
0.41547894,0.49824718,0
0.5384606,0.41724056,0
0.067656934,0.3353324,1
0.068530194,0.1765708,1
0.069859065,0.16285518,1
0.076291144,0.64816254,1
0.08583571,0.113852225,1
0.06791953,0.6807956,1
0.06905586,0.14867784,1
0.06221832,0.5604798,1
0.08380786,0.68051445,1
0.061753634,0.47537005,1
0.0714301,0.68648976,1
0.059319448,0.52001476,1
0.06808272,0.70639247,1
0.05829694,0.45244232,1
0.058387373,0.5716864,1
0.0705139,0.6997855,1
0.0713774,0.16855443,1
0.061189417,0.3457917,1
0.061883498,0.6405337,1
0.06341937,0.33324778,1
0.09248989,0.8044682,1
0.07206711,0.18882035,1
0.08016897,0.74962074,1
0.067996904,0.59998864,1
0.10267531,0.72313505,1
0.065584786,0.60070765,1
0.06526086,0.1754321,1
0.06321228,0.32158923,1
0.084925026,0.7531128,1
0.06173931,0.67429894,1
0.09972417,0.7037716,1
0.068892315,0.71532214,1
0.09889119,0.7286969,1
0.07741117,0.63727176,1
0.103514135,0.5906316,1
0.07634502,0.716446,1
0.071015365,0.6175171,1
0.09440052,0.80935776,1
0.068668425,0.69126517,1
0.06067767,0.36696473,1
0.06622439,0.48554948,1
0.08405654,0.7480877,1
0.06021758,0.45246583,1
0.060611665,0.43544474,1
0.05669506,0.4163991,1
0.05959704,0.2689368,1
0.06348868,0.45783758,1
0.0656927,0.32989514,1
0.059878472,0.6154961,1
0.06734123,0.34952733,1
0.100739144,0.7416978,1
0.057537775,0.45864958,1
0.07246958,0.15559356,1
0.06654202,0.64623934,1
0.09760334,0.80089533,1
0.06755129,0.6317689,1
0.09603733,0.8283696,1
0.111582465,0.15332296,1
0.07489137,0.7217526,1
0.08491135,0.6272848,1
0.09891463,0.66515386,1
0.10465463,0.7208841,1
0.07599081,0.6390492,1
0.111607134,0.12518631,1
0.08230734,0.66617835,1
0.08422068,0.62682575,1
0.06479184,0.6074253,1
0.0812347,0.15775369,1
0.07065814,0.6016761,1
0.06161083,0.5805609,1
0.06866508,0.67880714,1
0.07854834,0.13823664,1
0.117780924,0.6898214,1
0.06644939,0.6425393,1
0.06376588,0.29671445,1
0.08079063,0.11333976,1
0.107288666,0.597143,1
0.060139876,0.49286026,1
0.06904838,0.6346094,1
0.05794681,0.54988074,1
0.07325446,0.73766935,1
0.109065205,0.09756191,1
0.07534307,0.109430216,1
0.072299115,0.5628031,1
0.06263873,0.33905897,1
0.11729146,0.24033295,1
0.0894444,0.11618433,1
0.06806075,0.23535523,1
0.10593514,0.1021784,1
0.09927309,0.10474885,1
0.09366566,0.20522636,1
0.0813586,0.6934125,1
0.07044406,0.6566062,1
0.05821958,0.53330296,1
0.096350744,0.10296592,1
0.1015265,0.09846308,1
0.06464485,0.34836817,1
0.076564275,0.41294414,1
0.07892712,0.6918917,1
0.10950745,0.69516635,1
0.09020635,0.20048298,1
0.07191518,0.41757786,1
0.094327584,0.13556239,1
0.07164206,0.3304041,1
0.07272893,0.1868736,1
0.07429355,0.6488918,1
0.061332613,0.4922387,1
0.06702784,0.6418485,1
0.06200025,0.51198447,1
0.06716192,0.71065825,1
0.066950604,0.3936261,1
0.06471139,0.7137789,1
0.08029275,0.6583706,1
0.09700543,0.60051274,1
0.058867708,0.37247106,1
0.06915886,0.23360963,1
0.07349114,0.6586954,1
0.06815068,0.17491713,1
0.0772079,0.7085312,1
0.08064492,0.13114102,1
0.06491113,0.2096898,1
0.06964799,0.53509486,1
0.06809523,0.15193775,1
0.06804447,0.24808365,1
0.06934716,0.60659456,1
0.07624266,0.7686886,1
0.0658123,0.6170438,1
0.072925,0.6192372,1
0.06337837,0.60839266,1
0.07636848,0.13911201,1
0.06865823,0.62902087,1
0.058045838,0.6115095,1
0.057494827,0.40117374,1
0.07666476,0.12698925,1
0.062514715,0.61545444,1
0.06680876,0.7032694,1
0.085877344,0.71049684,1
0.06760519,0.58792996,1
0.0866577,0.72251624,1
0.062884465,0.68106884,1
0.06781484,0.6896221,1
0.07212058,0.75377595,1
0.08844967,0.797717,1
0.06282566,0.66090846,1
0.10225498,0.7865406,1
0.06265499,0.5955623,1
0.08371207,0.75345033,1
0.062266607,0.5465631,1
0.061077666,0.60378975,1
0.07369063,0.7277084,1
0.07861841,0.12221216,1
0.0593926,0.6508895,1
0.061779402,0.5789705,1
0.08171435,0.78188014,1
0.06617149,0.65147126,1
0.067556724,0.76426244,1
0.079945564,0.13776064,1
0.08804679,0.8033564,1
0.060914367,0.49722457,1
0.061782707,0.59409976,1
0.061050087,0.3153995,1
0.06329135,0.6605884,1
0.07135897,0.54086924,1
0.06491434,0.6936505,1
0.062370427,0.69258165,1
0.063152276,0.24803074,1
0.07598408,0.75198746,1
0.060064003,0.57935095,1
0.08300653,0.10220342,1
0.08824089,0.7654108,1
0.07329009,0.13366048,1
0.08355856,0.1048814,1
0.09813561,0.1026857,1
0.062461816,0.64769846,1
0.084921636,0.62104136,1
0.08301771,0.76228327,1
0.07977155,0.11721346,1
0.06967887,0.171823,1
0.11087695,0.112542294,1
0.068538316,0.23186165,1
0.06775244,0.67824507,1
0.074972324,0.11572362,1
0.08863212,0.7427522,1
0.057002343,0.5085288,1
0.08101252,0.71602017,1
0.06348962,0.71799594,1
0.059519365,0.6294854,1
0.071968846,0.66313976,1
0.0728712,0.2601813,1
0.066676624,0.72736615,1
0.060981706,0.28102618,1
0.06677054,0.20547533,1
0.06346896,0.2397537,1
0.06521674,0.6634222,1
0.080516964,0.7456298,1
0.09454243,0.77422845,1
0.069852695,0.2596695,1
0.09138492,0.7301984,1
0.055759706,0.57705224,1
0.063056394,0.67781574,1
0.06932516,0.7289846,1
0.094529286,0.7801778,1
0.062728405,0.5223486,1
0.061649434,0.6193129,1
0.06412445,0.29326183,1
0.067170694,0.6873268,1
0.0712544,0.73626393,1
0.07126153,0.7656817,1
0.061314628,0.68799525,1
0.086624,0.74633265,1
0.08626965,0.71492785,1
0.072368965,0.7017328,1
0.0824351,0.7604637,1
0.07491936,0.68541026,1
0.05984494,0.5608288,1
0.07156238,0.734974,1
0.12524807,0.17048188,1
0.09871763,0.7878403,1
0.08100474,0.66517025,1
0.06657702,0.721398,1
0.09046127,0.7652351,1
0.07951168,0.72131985,1
0.063935444,0.21966875,1
0.07129394,0.7387563,1
0.079243235,0.78532654,1
0.09114634,0.78229886,1
0.07830821,0.72848415,1
0.071765855,0.71976024,1
0.07747972,0.6381702,1
0.0780898,0.7809027,1
0.07797571,0.74559903,1
0.06505825,0.69457674,1
0.06931762,0.7606347,1
0.086396694,0.7019518,1
0.09397725,0.14501862,1
0.07843195,0.7840427,1
0.077211775,0.6968476,1
0.08017769,0.67092925,1
0.11114032,0.8309254,1
0.11737864,0.8329179,1
0.06750443,0.6656296,1
0.08013993,0.6670456,1
0.1078934,0.6825154,1
0.08854638,0.69517195,1
0.074331544,0.7847799,1
0.09594903,0.6915196,1
0.10082202,0.7827751,1
0.08514747,0.75594187,1
0.06443806,0.7207413,1
0.082163535,0.6541391,1
0.07522269,0.75804174,1
0.060183574,0.38450357,1
0.06276446,0.31011754,1
0.103999026,0.13951343,1
0.07392601,0.69285405,1
0.07017593,0.1586775,1
0.06286921,0.53631765,1
0.07655514,0.13499047,1
0.06806132,0.54077166,1
0.06677283,0.31366974,1
0.089441545,0.71120214,1
0.06768352,0.19777831,1
0.068598956,0.6805521,1
0.09383239,0.70591086,1
0.11865745,0.82426614,1
0.0707128,0.14236718,1
0.07273067,0.18743011,1
0.11073179,0.8381201,1
0.101817526,0.8280365,1
0.075379334,0.771513,1
0.07290351,0.78003216,1
0.11242261,0.17939335,1
0.10093825,0.82174766,1
0.07472737,0.71683335,1
0.10554803,0.8276031,1
0.06851687,0.6212148,1
0.096572794,0.10436895,1
0.08823779,0.10871714,1
0.07190547,0.686513,1
0.070649445,0.70423526,1
0.064316764,0.26606825,1
0.057472084,0.3892507,1
0.07802217,0.64060026,1
0.061640035,0.615256,1
0.07074919,0.5459714,1
0.086734675,0.10756979,1
0.08485051,0.101204164,1
0.07618512,0.7182276,1
0.07740356,0.56476367,1
0.061940487,0.6517456,1
0.07638976,0.5941559,1
0.075610906,0.5695299,1
0.07785913,0.70481396,1
0.07384035,0.14760584,1
0.06623186,0.42044494,1
0.067561835,0.14438841,1
0.08337532,0.5898522,1
0.10426475,0.76080734,1
0.08243514,0.10118278,1
0.07583133,0.7093784,1
0.07369256,0.13568643,1
0.12144955,0.7536377,1
0.08434232,0.10543037,1
0.07366009,0.11935002,1
0.06574067,0.20065476,1
0.071576454,0.7342012,1
0.074909,0.25043714,1
0.056861904,0.5728344,1
0.059203096,0.44442514,1
0.07251191,0.69499767,1
0.059714016,0.5874196,1
0.07424065,0.6792282,1
0.061128113,0.4682646,1
0.06304978,0.35764885,1
0.060054537,0.5797562,1
0.06865747,0.74932426,1
0.07410088,0.70107317,1
0.069968924,0.62174547,1
0.06875343,0.14917041,1
0.084786385,0.7705952,1
0.06137203,0.44723228,1
0.06053143,0.4799625,1
0.06657405,0.6224658,1
0.06262123,0.52167386,1
0.070719816,0.70546407,1
0.06632949,0.7198464,1
0.09890519,0.66705227,1
0.07571309,0.7481189,1
0.09940019,0.69536376,1
0.06723068,0.71805227,1
0.06931344,0.23265968,1
0.06683603,0.71237427,1
0.06722518,0.64506817,1
0.074903555,0.15363652,1
0.081713796,0.10806517,1
0.05889829,0.44872755,1
0.0738089,0.18845646,1
0.06413499,0.274272,1
0.05824139,0.4452987,1
0.06828314,0.70003676,1
0.065073155,0.7138219,1
0.06514027,0.28745028,1
0.06523459,0.2904631,1
0.077458955,0.74522346,1
0.08382309,0.14080536,1
0.06820958,0.6789192,1
0.07273832,0.21928883,1
0.073832475,0.6572867,1
0.07851307,0.66246873,1
0.069890484,0.69255227,1
0.08172268,0.17996894,1
0.06634377,0.32181624,1
0.103721455,0.592127,1
0.070614226,0.16858965,1
0.075637594,0.6159762,1
0.07113438,0.2965097,1
0.07602468,0.69185174,1
0.0733254,0.17379403,1
0.09916268,0.7072961,1
0.0915863,0.70292294,1
0.058123972,0.43331325,1
0.061176516,0.39365587,1
0.08164262,0.6622027,1
0.08361665,0.12523666,1
0.06665869,0.6772768,1
0.07741352,0.116814606,1
0.06472472,0.27136618,1
0.064497404,0.34406355,1
0.07261709,0.7144284,1
0.07841454,0.10607644,1
0.06773868,0.21840428,1
0.06509607,0.6605912,1
0.06445451,0.36537647,1
0.06789463,0.16278632,1
0.06094053,0.36743677,1
0.059962835,0.6291891,1
0.07467625,0.7628385,1
0.06993307,0.19418854,1
0.06300471,0.26645195,1
0.06312555,0.25917044,1
0.06373397,0.6114487,1
0.06098319,0.4384039,1
0.067481704,0.20659782,1
0.074598335,0.6719911,1
0.062211614,0.3673569,1
0.05696146,0.46508217,1
0.07902416,0.110742174,1
0.09137013,0.10577899,1
0.062345337,0.70103204,1
0.067471005,0.37184018,1
0.063612305,0.65857106,1
0.057534043,0.43099424,1
0.088415235,0.67106247,1
0.2191774,0.22256032,1
0.0767603,0.24123935,1
0.093874864,0.10858549,1
0.11548643,0.11574498,1
0.07564569,0.144116,1
0.060247704,0.40323442,1
0.06599496,0.2838619,1
0.10527525,0.10960475,1
0.095241785,0.12161972,1
0.061628558,0.46185547,1
0.082460314,0.11740123,1
0.08954301,0.10921513,1
0.093113646,0.12963316,1
0.072884455,0.21343021,1
0.06713921,0.15755433,1
0.07872798,0.11520394,1
0.09813443,0.10993319,1
0.10346156,0.12658629,1
0.072366014,0.3469935,1
0.067935005,0.15341388,1
0.0753436,0.63791233,1
0.08802734,0.20818828,1
0.06447403,0.25231013,1
0.11952706,0.40138102,1
0.05969013,0.3417348,1
0.09243186,0.09790374,1
0.06833398,0.37230843,1
0.069230564,0.25366366,1
0.07428399,0.11257681,1
0.069737405,0.15654002,1
0.07619997,0.11543312,1
0.077102534,0.13540904,1
0.06689975,0.41573775,1
0.08907635,0.09912567,1
0.06402229,0.2103587,1
0.076350704,0.38000083,1
0.099966176,0.12134714,1
0.06738666,0.48265213,1
0.2055993,0.19411853,1
0.062444318,0.69175154,1
0.05949046,0.6391028,1
0.07059242,0.23945536,1
0.09796963,0.71109146,1
0.06968971,0.15041128,1
0.07912033,0.110275626,1
0.09708809,0.31214577,1
0.06424604,0.62031704,1
0.07233535,0.1493033,1
0.08910265,0.10362617,1
0.08151188,0.11922717,1
0.05686563,0.55490065,1
0.08285736,0.10707765,1
0.077008724,0.13489932,1
0.10108802,0.12153246,1
0.0732558,0.17721799,1
0.12207801,0.13281326,1
0.08547432,0.1130171,1
0.07160229,0.14177184,1
0.077305295,0.13741224,1
0.06418837,0.29092136,1
0.076749556,0.13807665,1
0.06611639,0.71172047,1
0.059036143,0.306508,1
0.06161917,0.33929437,1
0.06976963,0.23691426,1
0.12064748,0.11585868,1
0.06621142,0.22902179,1
0.067763984,0.71502227,1
0.061932825,0.61317027,1
0.088567205,0.11114531,1
0.078336574,0.106580585,1
0.06583123,0.31182656,1
0.064614505,0.32700172,1
0.09831804,0.8063449,1
0.06661479,0.22442508,1
0.0884469,0.68756115,1
0.06325708,0.28637704,1
0.066703886,0.2362484,1
0.065608814,0.20677108,1
0.06874263,0.15357727,1
0.09080306,0.100653835,1
0.0709335,0.1860021,1
0.07267223,0.696787,1
0.07265483,0.24949278,1
0.07772639,0.12884037,1
0.06402233,0.2100549,1
0.07101082,0.23467684,1
0.08611683,0.1368383,1
0.10344514,0.46775785,1
0.06786316,0.24560852,1
0.064068556,0.19288367,1
0.06000805,0.5380958,1
0.0984404,0.1243353,1
0.06254965,0.2818645,1
0.073556796,0.60095763,1
0.06777154,0.34829587,1
0.077818014,0.14319237,1
0.08429991,0.10340199,1
0.075113215,0.13326812,1
0.083615534,0.13397,1
0.07891495,0.13251293,1
0.061379373,0.39022768,1
0.07317123,0.20681585,1
0.0674185,0.22081746,1
0.10851376,0.795167,1
0.08100895,0.15925406,1
0.060221456,0.5013903,1
0.08033641,0.14980872,1
0.116830714,0.10978659,1
0.07392077,0.34294176,1
0.061760306,0.3356772,1
0.06414309,0.24086143,1
0.07634911,0.15986013,1
0.079613164,0.11517548,1
0.0641767,0.6290758,1
0.06684148,0.329162,1
0.065645926,0.41879404,1
0.0860133,0.12426431,1
0.08369893,0.10886361,1
0.08273114,0.11186469,1
0.07898872,0.1802048,1
0.08033681,0.63900274,1
0.061444465,0.6222764,1
0.07024946,0.29422688,1
0.09323933,0.34320256,1
0.09394382,0.10503549,1
0.08649148,0.11722658,1
0.06834153,0.28258708,1
0.0927549,0.10209743,1
0.15637675,0.20879105,1
0.060304224,0.25816905,1
0.12397092,0.10289525,1
0.08543586,0.66136384,1
0.07167744,0.6222619,1
0.23911223,0.20780642,1
0.07988497,0.113681726,1
0.09340418,0.1489013,1
0.0834509,0.13401127,1
0.06885453,0.17208233,1
0.08774875,0.104977295,1
0.07516829,0.1567308,1
0.0634005,0.23662959,1
0.08397096,0.13883685,1
0.069067776,0.23726869,1
0.07672643,0.11994423,1
0.058508385,0.40180466,1
0.072297744,0.37719664,1
0.07438852,0.19975872,1
0.07014423,0.50661033,1
0.10615549,0.12538253,1
0.088283844,0.15912187,1
0.084990926,0.12523682,1
0.10543934,0.10288199,1
0.0953967,0.10448837,1
0.064420946,0.46977222,1
0.08570397,0.14685534,1
0.06968341,0.17248178,1
0.06085711,0.52618796,1
0.06808385,0.32496172,1
0.087992474,0.11458347,1
0.074816674,0.3169434,1
0.1186922,0.11110984,1
0.07968597,0.11079984,1
0.06711665,0.5213712,1
0.10528537,0.11311851,1
0.09020392,0.112684675,1
0.080399826,0.70537806,1
0.07443884,0.24845588,1
0.08386489,0.15098438,1
0.07948303,0.11241621,1
0.09862633,0.13986619,1
0.089979246,0.6826125,1
0.064613074,0.6813355,1
0.06285211,0.5231893,1
0.10457368,0.10561099,1
0.07354861,0.5703417,1
0.08544314,0.11954328,1
0.12279989,0.13992965,1
0.08202521,0.12230333,1
0.061367046,0.40451527,1
0.085520275,0.10090976,1
0.06818222,0.63921607,1
0.06451394,0.3771763,1
0.09364061,0.09939267,1
0.063920654,0.38335255,1
0.07007369,0.27894497,1
0.069788896,0.45256758,1
0.068333894,0.16012353,1
0.090816334,0.12959795,1
0.05853158,0.43745914,1
0.06628364,0.2678334,1
0.085194446,0.109368846,1
0.08681772,0.111875474,1
0.065408364,0.20324756,1
0.08022022,0.12534115,1
0.069607206,0.18430549,1
0.074746676,0.6160381,1
0.072616816,0.18170941,1
0.06858637,0.14724422,1
0.06786079,0.18775998,1
0.09619365,0.14322002,1
0.08662566,0.626234,1
0.110640936,0.11250374,1
0.0650688,0.31142053,1
0.07937524,0.14217645,1
0.069211274,0.13942182,1
0.0701208,0.5031736,1
0.07483088,0.11670711,1
0.07258147,0.24640387,1
0.062617734,0.61924386,1
0.09091733,0.10300145,1
0.07065116,0.23933367,1
0.07293552,0.24683356,1
0.10245429,0.11029355,1
0.0996661,0.10481616,1
0.06781764,0.28633142,1
0.077320255,0.12211617,1
0.071677394,0.14464241,1
0.06656512,0.2621464,1
0.07262214,0.13441579,1
0.072044395,0.122982055,1
0.08847456,0.10472365,1
0.09465226,0.10481614,1
0.12737566,0.14123595,1
0.09230241,0.7705663,1
0.092555195,0.105806686,1
0.0581504,0.35967255,1
0.098333046,0.5923761,1
0.071865104,0.1329113,1
0.06636698,0.17800695,1
0.0757942,0.1256503,1
0.086907394,0.11238169,1
0.095588125,0.11081088,1
0.06444728,0.26672417,1
0.05911327,0.6459738,1
0.067784436,0.1700127,1
0.07730515,0.6135829,1
0.12079601,0.13093825,1
0.09274976,0.12242867,1
0.0575581,0.5382471,1
0.0768674,0.13570642,1
0.06888547,0.3050795,1
0.12877697,0.12661268,1
0.08137382,0.15704215,1
0.06872209,0.22643234,1
0.07979408,0.10703676,1
0.09865219,0.1135675,1
0.09244951,0.10983374,1
0.07513504,0.1345156,1
0.060544904,0.4554333,1
0.08640264,0.10938882,1
0.08132016,0.18110271,1
0.071634956,0.15050265,1
0.07535184,0.13244441,1
0.06905294,0.1548113,1
0.077842556,0.1070755,1
0.078238815,0.11158219,1
0.06459758,0.355624,1
0.082096,0.11435869,1
0.061430693,0.25828964,1
0.0819362,0.10845558,1
0.07200243,0.13992998,1
0.076283395,0.11618473,1
0.06889414,0.24739881,1
0.11624365,0.1288948,1
0.06383559,0.51078093,1
0.077092916,0.44887075,1
0.06986476,0.36013398,1
0.088994265,0.118612334,1
0.067448854,0.6100757,1
0.071147524,0.18448201,1
0.11764796,0.13241576,1
0.06169124,0.6005916,1
0.10828229,0.1278061,1
0.080943584,0.114874534,1
0.06943433,0.31105062,1
0.08845844,0.107265554,1
0.068626426,0.165349,1
0.08893117,0.11430044,1
0.06516758,0.36407062,1
0.07419239,0.21276335,1
0.06710598,0.53735036,1
0.08167116,0.1294443,1
0.061739486,0.499298,1
0.067745954,0.17152077,1
0.098740675,0.10423205,1
0.057431065,0.42399555,1
0.06659044,0.1604664,1
0.07000838,0.7224639,1
0.06633858,0.14842503,1
0.06849563,0.17372967,1
0.081052326,0.15591498,1
0.08436479,0.10456859,1
0.08343801,0.12079016,1
0.06183174,0.32949764,1
0.08715492,0.12029258,1
0.06705728,0.33334506,1
0.063935935,0.6499388,1
0.06302305,0.5886544,1
0.06164899,0.30038753,1
0.07119182,0.16590028,1
0.07892494,0.12209301,1
0.07553973,0.1616222,1
0.17067456,0.21543327,1
0.06664971,0.22999774,1
0.07454778,0.17488617,1
0.08501401,0.11566946,1
0.06433751,0.3102821,1
0.07012995,0.15266518,1
0.086693935,0.109753944,1
0.07310019,0.15882958,1
0.08267974,0.54477566,1
0.08122904,0.1205095,1
0.08940065,0.14080733,1
0.0925792,0.14280555,1
0.08690591,0.11158759,1
0.07174858,0.18100016,1
0.058395345,0.54075986,1
0.07425022,0.14315288,1
0.07934368,0.10943439,1
0.063024744,0.5920307,1
0.07737352,0.18343161,1
0.09547062,0.10427865,1
0.08151844,0.1503298,1
0.08353428,0.13424188,1
0.06392,0.50217825,1
0.11118456,0.14900792,1
0.0746213,0.1339436,1
0.066931784,0.21349747,1
0.06506766,0.60291857,1
0.061349697,0.61129725,1
0.06089313,0.5116203,1
0.070221,0.2978293,1
0.067656875,0.20498012,1
0.07034967,0.1539715,1
0.063970976,0.3509463,1
0.08929722,0.12178951,1
0.08346693,0.1639302,1
0.09378049,0.1098714,1
0.07075778,0.23461188,1
0.07811611,0.12900776,1
0.08368598,0.119750924,1
0.083769806,0.10758655,1
0.070781164,0.19787292,1
0.07513985,0.17758135,1
0.088453285,0.10827059,1
0.08973831,0.11067887,1
0.06684638,0.20499615,1
0.07586336,0.1674622,1
0.08246123,0.13246445,1
0.06716039,0.16592456,1
0.062441807,0.2863682,1
0.05772216,0.27957582,1
0.061404504,0.4969428,1
0.070770785,0.60788757,1
0.07372339,0.13651411,1
0.063833624,0.52331764,1
0.082958594,0.11258954,1
0.12426706,0.10097152,1
0.09434289,0.12925692,1
0.07849923,0.13408007,1
0.0834963,0.10858682,1
0.055586398,0.5887668,1
0.064574756,0.24305502,1
0.07106844,0.42514512,1
0.07632456,0.24059322,1
0.14502425,0.17287382,1
0.10118819,0.112520546,1
0.08787248,0.1131294,1
0.067209035,0.29844832,1
0.08146536,0.121260524,1
0.06995129,0.646797,1
0.06268909,0.6753776,1
0.06978457,0.72993857,1
0.061731867,0.59205854,1
0.06216548,0.6869369,1
0.062104728,0.5365292,1
0.120750405,0.3624318,1
0.065351695,0.37995157,1
0.06799599,0.6344022,1
0.05892602,0.5714446,1
0.06025932,0.44564608,1
0.07053057,0.6073144,1
0.059394162,0.5468339,1
0.058525167,0.30043033,1
0.06358563,0.28526303,1
0.06197016,0.6860884,1
0.0575016,0.61657786,1
0.1300333,0.35406044,1
0.06725176,0.72974473,1
0.08513748,0.09809352,1
0.067834035,0.6913125,1
0.0908582,0.101418085,1
0.07746234,0.11551372,1
0.060161404,0.2747995,1
0.06492129,0.3390315,1
0.07317981,0.12059046,1
0.07159677,0.1984552,1
0.13858622,0.3195341,1
0.08259644,0.10662726,1
0.083571844,0.114271715,1
0.0888849,0.106396474,1
0.085101016,0.109312944,1
0.102170445,0.11279901,1
0.06972834,0.18072693,1
0.080561474,0.18724029,1
0.06798916,0.18357322,1
0.07624922,0.10533792,1
0.072407894,0.17079352,1
0.078293346,0.109790474,1
0.072209574,0.15400392,1
0.07995366,0.11718446,1
0.06819318,0.17696513,1
0.089296155,0.09953453,1
0.058322046,0.6567407,1
0.065643,0.7052857,1
0.06088959,0.68395245,1
0.06183283,0.69983846,1
0.066700354,0.6278073,1
0.057806995,0.5510899,1
0.06239465,0.6882595,1
0.07065521,0.7183957,1
0.06127507,0.49083042,1
0.061338414,0.52999073,1
0.06202594,0.6080018,1
0.08931292,0.116448075,1
0.0752647,0.1534634,1
0.068921216,0.32259867,1
0.0806038,0.113044694,1
0.09511279,0.5434837,1
0.073630996,0.13578454,1
0.064461835,0.54129606,1
0.0667332,0.150249,1
0.09522361,0.1123487,1
0.07053013,0.15155458,1
0.08127317,0.16781905,1
0.05846179,0.531802,1
0.0698719,0.7203103,1
0.08100951,0.78726953,1
0.06527649,0.7354819,1
0.059625246,0.6894801,1
0.065557756,0.7268503,1
0.05968839,0.4533662,1
0.078642726,0.76820093,1
0.072633885,0.65183574,1
0.069026984,0.6238331,1
0.064518675,0.5127064,1
0.058507033,0.5385874,1
0.067995004,0.31247953,1
0.07746278,0.1186589,1
0.058008134,0.51918465,1
0.06488806,0.4736536,1
0.06053286,0.3941119,1
0.07436829,0.65201885,1
0.06226268,0.369245,1
0.06397449,0.61285764,1
0.07919902,0.7538018,1
0.06192184,0.57646376,1
0.066974156,0.7416084,1
0.06946782,0.7295134,1
0.08197895,0.123499155,1
0.06527255,0.40068913,1
0.07134772,0.11422855,1
0.060971577,0.33182824,1
0.055635083,0.5209669,1
0.061874304,0.38099775,1
0.0642795,0.51300085,1
0.06369551,0.6412573,1
0.06786514,0.6608571,1
0.05926122,0.51509905,1
0.06954244,0.6789499,1
0.06200003,0.454055,1
0.062260374,0.40177882,1
0.069362976,0.39540645,1
0.06127968,0.3566056,1
0.056665972,0.37433115,1
0.057902716,0.4419944,1
0.062450763,0.43958646,1
0.06491556,0.33270285,1
0.06702567,0.19447824,1
0.0633143,0.2810496,1
0.06479488,0.21857311,1
0.06165989,0.4384062,1
0.06114608,0.42967242,1
0.07785114,0.12416601,1
0.07706418,0.15230013,1
0.059781246,0.2765024,1
0.081665136,0.116659455,1
0.059554495,0.39490014,1
0.06684584,0.7049215,1
0.076431155,0.7152086,1
0.07463715,0.71840197,1
0.07040736,0.7407481,1
0.060258042,0.5822721,1
0.062814385,0.69243103,1
0.07436,0.7052052,1
0.06770403,0.70879316,1
0.06545835,0.60219187,1
0.08553405,0.7402888,1
0.069697134,0.6816013,1
0.06499795,0.64038795,1
0.074895345,0.15302476,1
0.08152393,0.12118195,1
0.059978347,0.27658743,1
0.07254495,0.13980262,1
0.074265786,0.11159239,1
0.062969014,0.2663878,1
0.07209584,0.45615667,1
0.06722206,0.43342716,1
0.07056832,0.68847656,1
0.08536282,0.10321949,1
0.08183728,0.10359133,1
0.0723551,0.18669628,1
0.07005645,0.24033901,1
0.07654111,0.10466569,1
0.06267878,0.41627726,1
0.073857814,0.7186607,1
0.092033036,0.15067343,1
0.0586005,0.62127435,1
0.06812419,0.62742406,1
0.0641399,0.5057089,1
0.059109077,0.36204234,1
0.06244324,0.32081723,1
0.06673231,0.34632444,1
0.056657527,0.47181296,1
0.072527274,0.5978737,1
0.07953185,0.577221,1
0.059346594,0.49291936,1
0.066315584,0.35616502,1
0.0809244,0.11922175,1
0.08186529,0.101595275,1
0.068165705,0.23997174,1
0.07468935,0.15346763,1
0.0795145,0.31631917,1
0.074920006,0.15992938,1
0.07802493,0.23342104,1
0.07510173,0.2637472,1
0.077522196,0.2914398,1
0.10328071,0.09747049,1
0.08461408,0.11093032,1
0.10299097,0.1074952,1
0.10217763,0.10335465,1
0.080451325,0.10462735,1
0.11388814,0.11955674,1
0.11134153,0.10694687,1
0.08882018,0.1025891,1
0.101994805,0.11960453,1
0.11101159,0.111920476,1
0.1013971,0.11932032,1
0.10296328,0.10738072,1
0.11384592,0.10325318,1
0.09872756,0.09976329,1
0.077773385,0.119979136,1
0.11484897,0.13888463,1
0.10979752,0.12260795,1
0.088889256,0.11486244,1
0.07494904,0.14834037,1
0.09966293,0.09494826,1
0.065877914,0.42322573,1
0.07020486,0.48409215,1
0.095561996,0.17686105,1
0.07144498,0.20576654,1
0.063984245,0.23995697,1
0.066494405,0.3954431,1
0.08917952,0.12913856,1
0.09730739,0.1020256,1
0.07496398,0.1118207,1
0.09255174,0.10151231,1
0.088483706,0.12694862,1
0.082307704,0.10795301,1
0.092451334,0.1357618,1
0.09567626,0.106313534,1
0.087496914,0.11788605,1
0.077776626,0.10485894,1
0.06914703,0.64253145,1
0.07909097,0.12871426,1
0.07520725,0.23221649,1
0.068197206,0.2603732,1
0.066569254,0.1902756,1
0.07992978,0.114570014,1
0.08516074,0.13317816,1
0.066016845,0.30579484,1
0.071285024,0.1420026,1
0.07341397,0.13723804,1
0.06095458,0.53942925,1
0.0793684,0.114532605,1
0.06431795,0.22790489,1
0.0766017,0.12533228,1
0.13560946,0.17808373,1
0.073440604,0.13730788,1
0.06864378,0.1901031,1
0.07369189,0.13262236,1
0.060434896,0.29172754,1
0.07010788,0.55956405,1
0.081859335,0.16666317,1
0.087871104,0.11065357,1
0.06654279,0.16417463,1
0.090900965,0.71537846,1
0.06412309,0.42453364,1
0.21272855,0.24071631,1
0.062257756,0.3389879,1
0.07234919,0.16034122,1
0.078864396,0.13384227,1
0.059326965,0.46423534,1
0.06499659,0.3002313,1
0.06948335,0.31226444,1
0.05959435,0.50950956,1
0.09580087,0.11446598,1
0.071049064,0.31731656,1
0.0647314,0.36153537,1
0.07937749,0.13241598,1
0.06712251,0.34870234,1
0.06990274,0.276152,1
0.08314801,0.10263597,1
0.06648347,0.16305701,1
0.08706666,0.10299351,1
0.08847693,0.54406404,1
0.0663434,0.36059204,1
0.06858661,0.26758835,1
0.07266553,0.15574694,1
0.0715528,0.19032964,1
0.069448635,0.5534881,1
0.081177,0.1066481,1
0.08374475,0.10359853,1
0.06596901,0.36374938,1
0.101439595,0.1133679,1
0.069719955,0.21749197,1
0.0860612,0.09786561,1
0.08211728,0.102404095,1
0.06783085,0.1603514,1
0.09134531,0.10994564,1
0.0786057,0.122929804,1
0.05627677,0.5065726,1
0.07562055,0.22024336,1
0.08363286,0.21096763,1
0.07893914,0.10532641,1
0.06375006,0.58469206,1
0.12306349,0.15314393,1
0.07761211,0.74670875,1
0.09781615,0.097022295,1
0.10043553,0.11925488,1
0.06256786,0.42501485,1
0.06779736,0.14742862,1
0.08368576,0.11741342,1
0.060771994,0.3854858,1
0.057555646,0.623049,1
0.0922563,0.13480793,1
0.080541015,0.11357058,1
0.08936754,0.107624665,1
0.09792644,0.110400096,1
0.06665447,0.52169895,1
0.062004607,0.35284948,1
0.0927147,0.12882611,1
0.071963385,0.2007057,1
0.07706323,0.1231469,1
0.077793226,0.1744975,1
0.09619776,0.12506913,1
0.06660484,0.5504386,1
0.08356035,0.1182391,1
0.058683816,0.5380474,1
0.06440514,0.36803934,1
0.072042555,0.1376478,1
0.074556835,0.5456435,1
0.10151144,0.09704024,1
0.06137862,0.52908,1
0.07427645,0.24276167,1
0.059805714,0.4825313,1
0.06295977,0.50223047,1
0.10206472,0.108389124,1
0.08301212,0.13625975,1
0.09228566,0.1001746,1
0.06997908,0.23133059,1
0.05954677,0.51069397,1
0.06358183,0.45854825,1
0.08951708,0.1357458,1
0.07621189,0.14942461,1
0.079799905,0.17126356,1
0.06630687,0.21754973,1
0.06865497,0.2516085,1
0.061542463,0.32697424,1
0.098737076,0.113198206,1
0.08278171,0.11452883,1
0.08142475,0.13963874,1
0.09498797,0.10811584,1
0.07206734,0.28356612,1
0.081159286,0.22820148,1
0.062306054,0.2776443,1
0.07845369,0.5412626,1
0.062745035,0.545429,1
0.09041842,0.10873375,1
0.08136413,0.25767186,1
0.063544616,0.52664095,1
0.067624904,0.18353513,1
0.08294489,0.124220125,1
0.06682452,0.49154335,1
0.0712544,0.12190501,1
0.07986316,0.14430742,1
0.08435666,0.11155482,1
0.07474435,0.16746387,1
0.08852806,0.10188256,1
0.08529221,0.6007196,1
0.07846941,0.1106151,1
0.07750743,0.118418775,1
0.08176517,0.5124287,1
0.095220976,0.11942458,1
0.10228037,0.117170185,1
0.066773206,0.18343829,1
0.06632753,0.2385643,1
0.07020853,0.13330638,1
0.07511019,0.22755635,1
0.07933778,0.10740532,1
0.06356399,0.34654266,1
0.07171808,0.31856567,1
0.06378045,0.37431672,1
0.06412787,0.2392537,1
0.0773596,0.11064701,1
0.14272754,0.13741949,1
0.20116308,0.297863,1
0.07354709,0.27234194,1
0.092280716,0.11446582,1
0.087411515,0.6135217,1
0.1062879,0.12446981,1
0.07641364,0.13127568,1
0.07345518,0.22865571,1
0.064824834,0.47567016,1
0.0734121,0.1887239,1
0.07778582,0.23145677,1
0.08125054,0.109537445,1
0.09179976,0.110842794,1
0.060303345,0.302133,1
0.07359946,0.16800064,1
0.07248037,0.45830902,1
0.07911918,0.13000083,1
0.068624154,0.592942,1
0.069071025,0.2023017,1
0.08151366,0.13823964,1
0.059201792,0.46826208,1
0.08593618,0.104687296,1
0.07287335,0.72784644,1
0.08372415,0.113390915,1
0.07273175,0.45237312,1
0.05552369,0.49849766,1
