{
    "dimensionality_reduction_methods": "['PCA', 'TSVD', 'ISOMAP', 'LLE', 'UMAP']",
    "proportions": "[0.5, 0.5, 0, 0, 0]",
    "dataset": "nmnist",
    "number_of_classes": "2",
    "number_of_points": "10000",
    "number_of_Tsamples": "2000",
    "number_ofVsamples": "1000",
    "loss": "0.0009969945531338453",
    "trustworthiness": "0.8981831618390149",
    "continuity": "0.9602101399306318",
    "neighborhood_hit": "0.9985815602836879"
}