PC1,PC2,label
0.49641997,0.24412648,0
0.5439121,0.19900846,0
0.3673259,0.35505185,0
0.3955944,0.2292001,0
0.82072663,0.3897546,0
0.728701,0.17083699,0
0.30618504,0.3542003,0
0.8342431,0.40159577,0
0.5339419,0.41098192,0
0.79879785,0.40366435,0
0.3992808,0.21263394,0
0.5356446,0.20000798,0
0.7913963,0.3501183,0
0.6627931,0.1819671,0
0.6196797,0.16522963,0
0.76174957,0.54062814,0
0.8318917,0.41090456,0
0.4214164,0.28958982,0
0.8260457,0.38373578,0
0.7131455,0.24732567,0
0.6105143,0.3418407,0
0.75715154,0.3354903,0
0.6274822,0.3626877,0
0.73212886,0.2571317,0
0.76519907,0.33491796,0
0.5106833,0.2847163,0
0.46002746,0.4467627,0
0.5986893,0.18313727,0
0.8589721,0.31162515,0
0.7095548,0.2283259,0
0.30331874,0.37749854,0
0.8143873,0.5014196,0
0.8346221,0.33267343,0
0.8362406,0.48215285,0
0.8305994,0.2973736,0
0.59056574,0.18629697,0
0.82781655,0.4378219,0
0.7079863,0.2883729,0
0.45874295,0.17602469,0
0.43443257,0.25097954,0
0.65406567,0.204203,0
0.3822754,0.28310138,0
0.7993566,0.3676425,0
0.5286746,0.30955517,0
0.6774907,0.41039148,0
0.43145612,0.41085246,0
0.77142733,0.28261426,0
0.4816255,0.21747224,0
0.74441457,0.27286187,0
0.8396439,0.4573435,0
0.81861365,0.44967738,0
0.49935734,0.23067807,0
0.80824494,0.37924638,0
0.8430761,0.3305022,0
0.5914538,0.19494456,0
0.3065399,0.60553503,0
0.7065046,0.30958772,0
0.58747387,0.20648828,0
0.6978808,0.20982583,0
0.6201554,0.32370952,0
0.38388747,0.17560744,0
0.51910377,0.19644374,0
0.47696155,0.2330881,0
0.70887595,0.2212053,0
0.83500427,0.28119126,0
0.49336126,0.3326799,0
0.66879594,0.3341738,0
0.41587254,0.33877993,0
0.6626947,0.18666787,0
0.6644112,0.1952682,0
0.5099814,0.2401254,0
0.648942,0.33721778,0
0.45619825,0.27112946,0
0.5306447,0.2534453,0
0.5532587,0.18214163,0
0.56946534,0.245539,0
0.5939457,0.3496219,0
0.6640232,0.26075608,0
0.6471026,0.21427175,0
0.63009137,0.38141465,0
0.7056957,0.31215066,0
0.4932113,0.25282487,0
0.37204412,0.2656464,0
0.59004027,0.3350235,0
0.576756,0.41365045,0
0.5721101,0.2336593,0
0.27681568,0.4230489,0
0.38874117,0.24726431,0
0.38200265,0.34518027,0
0.77467084,0.3453883,0
0.60906523,0.28950816,0
0.6358109,0.45198178,0
0.6033022,0.48112342,0
0.4128585,0.6423109,0
0.4760651,0.3088751,0
0.7114062,0.5381376,0
0.49633914,0.4161055,0
0.71107435,0.20479079,0
0.47573724,0.1937936,0
0.5046728,0.5598683,0
0.36211118,0.2697911,0
0.39888757,0.22977653,0
0.74547815,0.23377448,0
0.52074456,0.16242099,0
0.45837575,0.24128199,0
0.6682596,0.3057703,0
0.48738652,0.19385886,0
0.65622973,0.39639795,0
0.6297087,0.32077792,0
0.45040837,0.26180804,0
0.40769705,0.24646597,0
0.7279541,0.31712073,0
0.59223175,0.18211167,0
0.6920593,0.4194758,0
0.84644306,0.26902947,0
0.52749,0.32205042,0
0.4243394,0.24797975,0
0.47434396,0.4688759,0
0.6200745,0.20981099,0
0.6548306,0.35060123,0
0.8106831,0.29416397,0
0.77107936,0.3542447,0
0.6027163,0.24543676,0
0.6905133,0.30242795,0
0.6208019,0.17912853,0
0.7249304,0.30433917,0
0.5452225,0.20912965,0
0.5847505,0.20878974,0
0.6167844,0.25336948,0
0.5407556,0.422424,0
0.40420756,0.35865286,0
0.557788,0.191614,0
0.51450384,0.2562992,0
0.51444,0.31534633,0
0.47271878,0.21931973,0
0.6826988,0.15594569,0
0.53851867,0.29351422,0
0.33820888,0.3700166,0
0.53471154,0.3296476,0
0.3917614,0.31093273,0
0.36204404,0.3117743,0
0.41547063,0.22751833,0
0.56497574,0.18697432,0
0.85079914,0.32814342,0
0.7898906,0.49540684,0
0.47627312,0.373202,0
0.672919,0.40612817,0
0.34811684,0.39238763,0
0.37632394,0.29334274,0
0.73110014,0.18356182,0
0.55117464,0.21709068,0
0.43065128,0.54306376,0
0.4012363,0.23731396,0
0.48624656,0.41088668,0
0.46025708,0.4126578,0
0.49116725,0.40789866,0
0.46086654,0.42110902,0
0.4774795,0.42173308,0
0.48021263,0.25782686,0
0.4575585,0.3452541,0
0.58732295,0.3610955,0
0.62855685,0.2699222,0
0.4052335,0.36249658,0
0.4818281,0.25340322,0
0.44964272,0.42248243,0
0.34721726,0.44340804,0
0.5334874,0.2319861,0
0.4795075,0.4248979,0
0.39147648,0.35072014,0
0.6446655,0.3512534,0
0.55755466,0.25829756,0
0.34666196,0.35299248,0
0.5713361,0.24837328,0
0.59892184,0.23736271,0
0.3611329,0.54885733,0
0.6114295,0.4079006,0
0.5469361,0.21329449,0
0.52729994,0.26482087,0
0.2621946,0.33066002,0
0.39140356,0.21933919,0
0.5855232,0.26192328,0
0.5720088,0.25114328,0
0.48148805,0.55321574,0
0.37654796,0.23650353,0
0.8116447,0.20208196,0
0.67725235,0.29712847,0
0.5184712,0.22926815,0
0.36687034,0.3470179,0
0.4735769,0.21745443,0
0.5254546,0.21632774,0
0.75404656,0.34515095,0
0.72811013,0.24301344,0
0.58679676,0.2886244,0
0.74815685,0.21896306,0
0.49344075,0.368198,0
0.74790895,0.2155326,0
0.51085126,0.41635007,0
0.6211081,0.19454724,0
0.59614384,0.3666048,0
0.56456524,0.20135197,0
0.4258566,0.21425822,0
0.61074257,0.3543613,0
0.7332912,0.42230767,0
0.3729225,0.19195384,0
0.5057221,0.3380882,0
0.4059453,0.4988169,0
0.73202705,0.20251879,0
0.5216428,0.26522294,0
0.5200189,0.15923606,0
0.46740535,0.25537935,0
0.5439196,0.21582428,0
0.7409748,0.4937675,0
0.70604485,0.19132859,0
0.6503433,0.23142731,0
0.39346826,0.20445012,0
0.62483484,0.32693684,0
0.56666315,0.20996086,0
0.35606736,0.30886513,0
0.8680865,0.33180663,0
0.42056108,0.35429397,0
0.7197279,0.34475717,0
0.4376019,0.36734635,0
0.6722369,0.179367,0
0.30606517,0.5084577,0
0.7982509,0.36246014,0
0.6573385,0.24249786,0
0.69984484,0.33321303,0
0.6752391,0.18378098,0
0.581928,0.309842,0
0.37956366,0.32359648,0
0.70594203,0.21714868,0
0.7030262,0.18925738,0
0.5681955,0.35617876,0
0.77861536,0.404686,0
0.65261585,0.1704141,0
0.85460687,0.25424653,0
0.83262295,0.23963058,0
0.5294761,0.18701476,0
0.49521422,0.1745301,0
0.5486003,0.48472118,0
0.35449445,0.29007834,0
0.55437756,0.35790065,0
0.6835102,0.2825082,0
0.31944966,0.365615,0
0.6178452,0.52026564,0
0.60999066,0.2497489,0
0.81198186,0.40154034,0
0.72271985,0.25931132,0
0.7907597,0.36147895,0
0.85443103,0.26740608,0
0.5247476,0.2528627,0
0.56704706,0.31002682,0
0.5256749,0.33204818,0
0.4257316,0.21977721,0
0.42349553,0.27923974,0
0.5580176,0.4462224,0
0.5350558,0.20783629,0
0.5666416,0.26345783,0
0.6710559,0.2129622,0
0.45316842,0.46292898,0
0.4256002,0.5831755,0
0.43663,0.34204128,0
0.66653264,0.34647235,0
0.7024978,0.24781772,0
0.41814327,0.24347436,0
0.39120096,0.35409355,0
0.39127985,0.22774564,0
0.67115206,0.33764872,0
0.49681312,0.3104418,0
0.46734655,0.26432642,0
0.6811454,0.28871495,0
0.34173676,0.29717946,0
0.6063605,0.32370827,0
0.41083738,0.20119318,0
0.63095737,0.3061076,0
0.5924016,0.2656641,0
0.641029,0.26958665,0
0.44891757,0.4128912,0
0.49173203,0.4232211,0
0.31381345,0.66241544,0
0.42256007,0.27709857,0
0.68319285,0.17970258,0
0.6216669,0.30627996,0
0.54620063,0.41616046,0
0.43326423,0.3245843,0
0.61650234,0.19356672,0
0.49800208,0.31937408,0
0.5356478,0.51263773,0
0.5571395,0.5153358,0
0.6523283,0.2833655,0
0.7556804,0.20521569,0
0.50846034,0.31649196,0
0.7658427,0.21875462,0
0.7473714,0.16544592,0
0.65931475,0.19195531,0
0.73164326,0.18700503,0
0.530742,0.27931565,0
0.5275468,0.28013787,0
0.49467888,0.31867552,0
0.3713261,0.3691384,0
0.51882714,0.2512187,0
0.453696,0.39410654,0
0.52393395,0.33928642,0
0.6346253,0.32765687,0
0.73528206,0.35023373,0
0.7087062,0.22695068,0
0.72140247,0.20252939,0
0.7375252,0.4193027,0
0.8047786,0.40575343,0
0.7333768,0.4329257,0
0.63774884,0.19729991,0
0.50030524,0.33070707,0
0.7275127,0.18135528,0
0.49097297,0.33108032,0
0.66137135,0.1881181,0
0.7558351,0.21943955,0
0.5646789,0.3714392,0
0.7500543,0.21430185,0
0.78518254,0.24373777,0
0.6172067,0.26666117,0
0.6428393,0.24896404,0
0.47893474,0.26948535,0
0.712223,0.45514312,0
0.60714746,0.4872488,0
0.5063787,0.3799377,0
0.7143362,0.46479854,0
0.4822186,0.3257826,0
0.58338237,0.30310366,0
0.61663806,0.23779997,0
0.51894426,0.51981246,0
0.6640912,0.18602878,0
0.5268261,0.2085114,0
0.58889616,0.3270167,0
0.5827041,0.21141548,0
0.65714043,0.15700136,0
0.7153009,0.18004388,0
0.74394,0.18032351,0
0.6660062,0.42731246,0
0.70131767,0.28120035,0
0.6457732,0.18848132,0
0.5862451,0.26429188,0
0.60027766,0.44886422,0
0.56843716,0.30639338,0
0.46379387,0.4111215,0
0.6030097,0.28296682,0
0.54698765,0.20791022,0
0.50285196,0.35179743,0
0.57015026,0.37923962,0
0.66523266,0.4993724,0
0.7355528,0.23890096,0
0.40808234,0.40540054,0
0.7229564,0.263502,0
0.78948426,0.22594413,0
0.70114666,0.33335984,0
0.5536565,0.37649232,0
0.7756292,0.19072741,0
0.64685714,0.34457946,0
0.62284124,0.37056306,0
0.675337,0.22914921,0
0.72598183,0.3142099,0
0.7299017,0.5622493,0
0.52805823,0.46840486,0
0.6738541,0.20560269,0
0.6823094,0.20607553,0
0.5067754,0.39743343,0
0.5568566,0.38586223,0
0.6914373,0.32998243,0
0.5571843,0.36140868,0
0.3039305,0.5715282,0
0.4202824,0.43721774,0
0.5863317,0.4007214,0
0.5184731,0.34128752,0
0.45223612,0.50166476,0
0.6164398,0.25502175,0
0.5945234,0.4250561,0
0.2224479,0.5557316,0
0.6827891,0.31085476,0
0.62429595,0.43787774,0
0.5746788,0.6394623,0
0.3600038,0.37554312,0
0.49347022,0.25214696,0
0.64497954,0.21797682,0
0.5316331,0.3433874,0
0.50233257,0.17176957,0
0.47385374,0.22593893,0
0.6339796,0.3378548,0
0.5103717,0.2506849,0
0.66195935,0.36334518,0
0.6228504,0.2551603,0
0.7683086,0.35688654,0
0.68133575,0.38317353,0
0.5130156,0.6470389,0
0.5056686,0.30751792,0
0.34628603,0.32585892,0
0.823109,0.33377972,0
0.6417163,0.33302817,0
0.679347,0.27800408,0
0.76765627,0.41450903,0
0.73994184,0.3378345,0
0.628802,0.3006675,0
0.8277152,0.21308334,0
0.82590836,0.2132153,0
0.80559105,0.19312885,0
0.6337567,0.46835443,0
0.8179056,0.17553085,0
0.8416603,0.24574262,0
0.7247059,0.3086948,0
0.7607456,0.4637591,0
0.77287877,0.29640737,0
0.7956343,0.2927792,0
0.7942572,0.23173572,0
0.8180019,0.27406055,0
0.6813624,0.23537934,0
0.76620126,0.29884547,0
0.7813735,0.30198058,0
0.7319108,0.3027437,0
0.7395385,0.3559836,0
0.760658,0.4072785,0
0.7488371,0.3964958,0
0.67136586,0.26662964,0
0.72895193,0.27096882,0
0.71987593,0.48770082,0
0.7653742,0.20665054,0
0.6638114,0.39659643,0
0.5927264,0.50640094,0
0.82269365,0.3495559,0
0.6991607,0.3733391,0
0.72215384,0.35631728,0
0.7242457,0.271641,0
0.6440248,0.1682897,0
0.4511856,0.31734052,0
0.68032044,0.3398291,0
0.47769058,0.43616164,0
0.71647537,0.63726175,0
0.7102107,0.3706838,0
0.5769693,0.43277383,0
0.726593,0.35488993,0
0.6823404,0.3076063,0
0.6786035,0.44954973,0
0.6282847,0.38478503,0
0.6038697,0.5456609,0
0.5533017,0.44040045,0
0.6185954,0.5078502,0
0.50857204,0.50965726,0
0.5332881,0.39511704,0
0.62075245,0.52704597,0
0.7483102,0.17613696,0
0.6583716,0.47395477,0
0.59347695,0.16133842,0
0.7897441,0.41581872,0
0.78375953,0.43185008,0
0.5143403,0.57094765,0
0.48024333,0.41566324,0
0.6582962,0.3444927,0
0.32921177,0.44019553,0
0.43154654,0.4646744,0
0.7651872,0.3057037,0
0.71383137,0.3588168,0
0.6210896,0.33038676,0
0.7202364,0.31565413,0
0.7401729,0.39135522,0
0.7263525,0.38292426,0
0.7669742,0.53595585,0
0.6898561,0.3722988,0
0.6022103,0.47731942,0
0.656235,0.37033698,0
0.61079633,0.45003194,0
0.73937887,0.49891576,0
0.37457666,0.3555114,0
0.38810375,0.39254624,0
0.43325433,0.3769016,0
0.48191237,0.45348513,0
0.8601974,0.307875,0
0.37244993,0.4072509,0
0.3995222,0.28348872,0
0.39296973,0.25953546,0
0.39885512,0.5613309,0
0.4984072,0.52022445,0
0.6319628,0.4635724,0
0.70375407,0.17868793,0
0.59811234,0.53169596,0
0.45415354,0.21338972,0
0.36774835,0.39246824,0
0.74514943,0.32313886,0
0.6171704,0.6029143,0
0.312694,0.36070085,0
0.5180958,0.15115441,0
0.68795604,0.2592295,0
0.5363619,0.19285803,0
0.7056727,0.49302638,0
0.5332576,0.2041857,0
0.55231416,0.26062796,0
0.3396993,0.39495283,0
0.48088193,0.45750746,0
0.45798096,0.3568201,0
0.4617696,0.17343016,0
0.4214769,0.28937837,0
0.5288285,0.32467356,0
0.497306,0.41126958,0
0.5660615,0.5774519,0
0.43193474,0.44556475,0
0.36122417,0.55798,0
0.6855959,0.29237843,0
0.6364151,0.42941236,0
0.42422628,0.3851103,0
0.6368267,0.44974163,0
0.6025699,0.22531144,0
0.46785432,0.27102527,0
0.53250545,0.46041992,0
0.5498332,0.5441033,0
0.5361498,0.35418308,0
0.3994389,0.38133535,0
0.55287033,0.52503186,0
0.72141963,0.3188833,0
0.4910366,0.54391724,0
0.7164954,0.29448768,0
0.39850983,0.5629899,0
0.7384842,0.24775776,0
0.64477503,0.24961632,0
0.77261204,0.28769922,0
0.6717358,0.29333073,0
0.4801039,0.45314336,0
0.6987287,0.28155395,0
0.52407473,0.27320012,0
0.48307613,0.35340765,0
0.43476707,0.2043484,0
0.73110515,0.40449318,0
0.61783856,0.2746125,0
0.43285766,0.636284,0
0.5451468,0.37169647,0
0.6599509,0.39377227,0
0.4680992,0.3604126,0
0.5732569,0.2699213,0
0.5348747,0.346202,0
0.6592132,0.2747526,0
0.40838608,0.57345045,0
0.57985616,0.4564013,0
0.7253817,0.20103998,0
0.55366087,0.19582507,0
0.54345137,0.3301399,0
0.7641899,0.2530257,0
0.7248577,0.28012556,0
0.5518913,0.44789454,0
0.5710877,0.1947363,0
0.74504167,0.28062958,0
0.7524016,0.30701685,0
0.68832505,0.4936186,0
0.6081723,0.41933832,0
0.59556985,0.29696107,0
0.4923123,0.38324133,0
0.5516945,0.31488737,0
0.471241,0.4711236,0
0.4121433,0.33393806,0
0.57629323,0.30830058,0
0.43940625,0.30805525,0
0.52698255,0.44523057,0
0.65727717,0.56029576,0
0.64299256,0.30949253,0
0.6836285,0.35639003,0
0.7012705,0.26785648,0
0.5652318,0.1628014,0
0.7352689,0.32604524,0
0.4452191,0.19334525,0
0.45613486,0.36019537,0
0.74894994,0.21424296,0
0.71274954,0.46007368,0
0.7117958,0.27627447,0
0.7083374,0.31451562,0
0.71052325,0.28439677,0
0.67642874,0.2185674,0
0.5052905,0.26676482,0
0.69129217,0.3660172,0
0.22480983,0.431833,0
0.37195465,0.32247666,0
0.8341015,0.4155652,0
0.50962645,0.35255447,0
0.7726768,0.18339701,0
0.5563451,0.24129009,0
0.79689944,0.19423556,0
0.4784489,0.24775381,0
0.43452817,0.19780144,0
0.38702083,0.2263773,0
0.66850364,0.16249299,0
0.6093507,0.32873994,0
0.5331471,0.26534754,0
0.53579783,0.3052075,0
0.39065003,0.31185883,0
0.45250562,0.32865533,0
0.5814531,0.3220334,0
0.44877437,0.19448118,0
0.5556445,0.4798529,0
0.38725543,0.5936167,0
0.539983,0.27621856,0
0.5736774,0.26163948,0
0.38713926,0.31348032,0
0.47584367,0.2415254,0
0.48376352,0.23587082,0
0.66923654,0.18799812,0
0.61993957,0.51958907,0
0.7221138,0.29398423,0
0.7569958,0.42836016,0
0.6580877,0.1994938,0
0.7428082,0.17969468,0
0.69410485,0.18061918,0
0.43206623,0.22235271,0
0.7269754,0.44459662,0
0.41541594,0.4412063,0
0.82744765,0.19832155,0
0.50854516,0.46693954,0
0.49327043,0.36093387,0
0.64566445,0.16883425,0
0.5833518,0.19304466,0
0.6435769,0.194326,0
0.7359857,0.18433394,0
0.5687709,0.22842589,0
0.45163038,0.26327512,0
0.4873378,0.44906875,0
0.7826947,0.29716837,0
0.4697854,0.31273836,0
0.48151183,0.26727444,0
0.41122365,0.22535047,0
0.73558646,0.23232965,0
0.6964083,0.18196067,0
0.4748671,0.23052365,0
0.49938694,0.3313817,0
0.55922633,0.21665174,0
0.5040474,0.28679356,0
0.58284765,0.19157791,0
0.5212548,0.26316872,0
0.6230956,0.20935175,0
0.52035666,0.37695456,0
0.7143548,0.17363738,0
0.53012705,0.47194165,0
0.53791493,0.23785312,0
0.54566926,0.18610913,0
0.6164738,0.26410356,0
0.5866644,0.2862376,0
0.43015385,0.559405,0
0.46084583,0.26706335,0
0.36610976,0.3488122,0
0.57222784,0.41405603,0
0.46536422,0.3772963,0
0.5510679,0.3923146,0
0.46803725,0.20915367,0
0.43910512,0.2020658,0
0.7875358,0.22891924,0
0.57024765,0.16373147,0
0.49840644,0.23612691,0
0.48461097,0.21805228,0
0.73392624,0.16504358,0
0.69262123,0.23654765,0
0.5721249,0.20007515,0
0.77098507,0.2987645,0
0.5339437,0.34097517,0
0.6209041,0.4308521,0
0.43349928,0.42805976,0
0.7259373,0.257771,0
0.4228258,0.2664121,0
0.6848449,0.28332528,0
0.42818698,0.30772987,0
0.81271434,0.20693454,0
0.34874743,0.2991216,0
0.43416923,0.2197546,0
0.85614765,0.29089284,0
0.40572605,0.38038024,0
0.4615685,0.2367608,0
0.51460314,0.20746216,0
0.54033166,0.38301155,0
0.60329163,0.23576121,0
0.5123,0.40237045,0
0.6102111,0.4031995,0
0.32328668,0.5425984,0
0.7224189,0.302548,0
0.7987442,0.24370481,0
0.57860297,0.24080457,0
0.5154077,0.61159,0
0.7313999,0.54554987,0
0.6969442,0.2894679,0
0.53878665,0.27386668,0
0.5198361,0.23927489,0
0.37018424,0.46938542,0
0.77029014,0.16862392,0
0.36096796,0.2924523,0
0.67069286,0.519872,0
0.5780663,0.1808493,0
0.49138036,0.2501198,0
0.65019757,0.43787938,0
0.5829605,0.22550318,0
0.5104547,0.30483627,0
0.68371636,0.41966945,0
0.62239665,0.21538584,0
0.5680137,0.386509,0
0.5403104,0.3145551,0
0.62622446,0.21357419,0
0.5204599,0.36704087,0
0.5626828,0.27971563,0
0.5102994,0.33822742,0
0.7340668,0.14970241,0
0.54327345,0.21947834,0
0.53588444,0.39744532,0
0.7613408,0.34795827,0
0.65532064,0.16968067,0
0.33107147,0.29534182,0
0.40952265,0.218688,0
0.47825217,0.25238934,0
0.4795122,0.38383442,0
0.44714528,0.47930422,0
0.71501654,0.14902896,0
0.48428124,0.22112328,0
0.46722302,0.2717314,0
0.4098319,0.23444872,0
0.6049036,0.23421538,0
0.36982033,0.5588652,0
0.54964715,0.6384386,0
0.48255163,0.24865073,0
0.74846977,0.20550218,0
0.4718413,0.2374447,0
0.4657949,0.5377276,0
0.41869786,0.20085886,0
0.8274318,0.26214778,0
0.6048683,0.36238143,0
0.31343004,0.3361977,0
0.67305017,0.2542286,0
0.7031502,0.41750106,0
0.43493193,0.49214616,0
0.42061204,0.4945469,0
0.522471,0.6193943,0
0.3486606,0.47952527,0
0.39324737,0.35678908,0
0.36044613,0.22273514,0
0.43127194,0.48394525,0
0.367231,0.18793441,0
0.60910994,0.44706216,0
0.5026908,0.53390485,0
0.44002876,0.57757074,0
0.63259757,0.23315237,0
0.5035175,0.4490587,0
0.4976464,0.16645929,0
0.6185731,0.39538813,0
0.5268719,0.18665753,0
0.51456684,0.38057292,0
0.6126948,0.53730655,0
0.4693251,0.5342728,0
0.6609152,0.3247804,0
0.5483664,0.20121156,0
0.56435746,0.26858547,0
0.76767325,0.24843816,0
0.8282856,0.37212452,0
0.5985098,0.347947,0
0.43175885,0.44338813,0
0.49195915,0.43031824,0
0.43571472,0.36120364,0
0.6570655,0.37990585,0
0.47149104,0.22029716,0
0.72282577,0.17645843,0
0.4260293,0.51471174,0
0.47456658,0.34882557,0
0.8320472,0.22059385,0
0.53161734,0.22761048,0
0.42578015,0.22463174,0
0.43990785,0.31441456,0
0.5006776,0.38560164,0
0.44626376,0.3102864,0
0.5443858,0.42819202,0
0.40404135,0.28294945,0
0.45452943,0.5082177,0
0.5519713,0.2632483,0
0.6085405,0.18854684,0
0.6707921,0.26766017,0
0.47331446,0.62928283,0
0.2383365,0.56188965,0
0.47165444,0.48286313,0
0.55301803,0.23748805,0
0.57194775,0.45691308,0
0.6012561,0.26723364,0
0.49368548,0.3299051,0
0.4502306,0.2271726,0
0.39550272,0.20958072,0
0.3977792,0.29926363,0
0.41938242,0.21529926,0
0.39366922,0.37723544,0
0.44147745,0.43469965,0
0.72016233,0.20664802,0
0.5625433,0.3250039,0
0.46194175,0.2060412,0
0.60982317,0.3332625,0
0.49867114,0.24283543,0
0.6695044,0.4414237,0
0.5515982,0.32571748,0
0.5041919,0.53705233,0
0.40218288,0.24118686,0
0.68558115,0.5773335,0
0.41297713,0.19787467,0
0.7815779,0.2513305,0
0.65120125,0.17259555,0
0.7183052,0.29978552,0
0.58753574,0.2687396,0
0.55854994,0.57159984,0
0.52120984,0.38380674,0
0.50631714,0.22796805,0
0.7535357,0.26468566,0
0.39813206,0.2972126,0
0.48034573,0.37523505,0
0.4502401,0.33287674,0
0.7155122,0.21254689,0
0.520495,0.19454537,0
0.49314874,0.363524,0
0.79354143,0.2913588,0
0.48573261,0.4630593,0
0.5108648,0.5577958,0
0.6751883,0.44019395,0
0.46572205,0.27135766,0
0.46762803,0.4839868,0
0.3429764,0.2681961,0
0.3513211,0.38321614,0
0.3806906,0.48787218,0
0.3216123,0.55739284,0
0.52164376,0.21691142,0
0.37485686,0.64265305,0
0.44680902,0.29145706,0
0.51786214,0.19576794,0
0.5409887,0.48247853,0
0.41695544,0.2708556,0
0.36644056,0.26229954,0
0.2338034,0.38878244,0
0.33450803,0.27301276,0
0.6415354,0.46078998,0
0.4211381,0.24244045,0
0.6835268,0.22737502,0
0.41037205,0.36432874,0
0.44707215,0.1959754,0
0.5724637,0.1597604,0
0.49792707,0.21386184,0
0.39878932,0.3981438,0
0.49864736,0.32381552,0
0.57632756,0.4026374,0
0.62217146,0.13594666,0
0.2853092,0.49469006,0
0.58461565,0.4249431,0
0.21976525,0.6427666,0
0.519659,0.19492927,0
0.4482093,0.45445153,0
0.3620414,0.52441764,0
0.25595802,0.38352138,0
0.7509961,0.45053005,0
0.5545135,0.20176111,0
0.54930556,0.23438482,0
0.6939864,0.23059264,0
0.7000596,0.4482346,0
0.6903786,0.3693286,0
0.5898249,0.2214793,0
0.7478248,0.42910597,0
0.55117214,0.3440408,0
0.64191073,0.42155772,0
0.55562013,0.21838564,0
0.8568943,0.28972688,0
0.6395791,0.18992509,0
0.7799431,0.20436959,0
0.45115402,0.19356254,0
0.5062134,0.29114532,0
0.5462038,0.24932098,0
0.58038455,0.28128833,0
0.42302963,0.36259362,0
0.52874416,0.24357684,0
0.41412398,0.24024148,0
0.3554568,0.3174467,0
0.58480203,0.49497217,0
0.5479843,0.33365345,0
0.5092972,0.389462,0
0.53029203,0.39520383,0
0.6272028,0.38617715,0
0.6467472,0.17117773,0
0.49097365,0.29371956,0
0.47651434,0.46727183,0
0.6404283,0.4377931,0
0.59394217,0.28027618,0
0.7531579,0.3758939,0
0.8026277,0.31290016,0
0.490014,0.67214864,0
0.5231783,0.3633607,0
0.3521938,0.49789894,0
0.6469907,0.29260325,0
0.55631995,0.2860056,0
0.63908553,0.31242386,0
0.62317127,0.38469583,0
0.53543323,0.34425792,0
0.6074099,0.2742712,0
0.8357202,0.4661416,0
0.665456,0.42893776,0
0.52631795,0.26000175,0
0.6217266,0.23053125,0
0.6751073,0.21174273,0
0.67793,0.2796552,0
0.55829924,0.19774733,0
0.61974466,0.27800426,0
0.56024265,0.46474922,0
0.47533622,0.21024948,0
0.5270424,0.26578546,0
0.6921917,0.22250487,0
0.68908983,0.42810377,0
0.63294584,0.19600189,0
0.30008775,0.40155557,0
0.5995701,0.49331102,0
0.52555573,0.29599428,0
0.49672133,0.18874466,0
0.42001843,0.22267689,0
0.6379878,0.42254347,0
0.64710987,0.23416017,0
0.24890907,0.36703005,0
0.7710364,0.32580173,0
0.36493933,0.22706842,0
0.4904327,0.29346353,0
0.58877605,0.32569575,0
0.73334587,0.42725345,0
0.49711648,0.31765163,0
0.44946694,0.3623219,0
0.38666865,0.25942048,0
0.55981123,0.22563708,0
0.5057603,0.26903975,0
0.4618238,0.21826658,0
0.4141801,0.50346595,0
0.44429615,0.49135402,0
0.44205916,0.17990339,0
0.60490876,0.47028717,0
0.5480677,0.32401934,0
0.8405558,0.23983108,0
0.3827609,0.22751157,0
0.5264216,0.16832213,0
0.6823311,0.3221646,0
0.5863675,0.28055304,0
0.31633386,0.29202265,0
0.73700196,0.49722293,0
0.6617564,0.26974446,0
0.6182686,0.17908873,0
0.63703495,0.21752419,0
0.38873625,0.22670683,0
0.60849357,0.16846938,0
0.70161116,0.42948243,0
0.3783071,0.23017442,0
0.48150086,0.3971758,0
0.57747227,0.41079944,0
0.6227065,0.44057444,0
0.48538524,0.3180374,0
0.46331352,0.39468023,0
0.44219705,0.34712946,0
0.40701732,0.28573853,0
0.48357967,0.37519982,0
0.5946316,0.27818677,0
0.6030609,0.30714333,0
0.6846343,0.48085055,0
0.44187677,0.29428658,0
0.4633127,0.41201317,0
0.5441656,0.1618761,0
0.44364688,0.25249997,0
0.27175894,0.39186198,0
0.68865305,0.46147212,0
0.57969666,0.2961112,0
0.7748515,0.28702834,0
0.35930583,0.20477027,0
0.6225841,0.27798468,0
0.6829517,0.5120405,0
0.5386519,0.2057596,0
0.4738175,0.28281742,0
0.49172717,0.52696264,0
0.29124773,0.3053284,0
0.77735376,0.25300956,0
0.51253384,0.19643782,0
0.4930351,0.4700541,0
0.41487232,0.27366892,0
0.6315317,0.26062268,0
0.6774643,0.49587968,0
0.6374646,0.4932008,0
0.64779,0.31272307,0
0.796369,0.39578578,0
0.43551588,0.2255773,0
0.6954751,0.4049517,0
0.7285501,0.30527946,0
0.5742572,0.606052,0
0.36607543,0.44843504,0
0.47800586,0.35354796,0
0.09765488,0.5563796,1
0.11488459,0.46468866,1
0.090776294,0.4143755,1
0.16246222,0.7618383,1
0.10321954,0.33216208,1
0.119450346,0.73764336,1
0.10057186,0.41036683,1
0.1291038,0.7111003,1
0.126914,0.69218904,1
0.11742239,0.6716442,1
0.112423405,0.7261147,1
0.1019565,0.669295,1
0.123817645,0.75930196,1
0.09744839,0.6352173,1
0.11344203,0.71649957,1
0.118485846,0.7513377,1
0.09502333,0.39895272,1
0.10517601,0.6009144,1
0.10777258,0.717225,1
0.105829574,0.5901591,1
0.16331661,0.80549103,1
0.10400195,0.45437375,1
0.13257939,0.7634444,1
0.12522832,0.6999327,1
0.1615013,0.7097641,1
0.10649559,0.679015,1
0.10512622,0.46336192,1
0.1093217,0.57494766,1
0.13475662,0.7630844,1
0.11156612,0.73959416,1
0.14652479,0.68411654,1
0.12788434,0.78124505,1
0.14276001,0.72189474,1
0.1204256,0.67804426,1
0.14265883,0.63335663,1
0.11926823,0.73859024,1
0.11890921,0.699603,1
0.1621772,0.80469054,1
0.115646236,0.73362064,1
0.09999303,0.61152095,1
0.10162413,0.6000023,1
0.1331132,0.7503624,1
0.109213755,0.6444909,1
0.09958843,0.5957081,1
0.1052871,0.6185037,1
0.104035966,0.55308294,1
0.10494324,0.642764,1
0.108283035,0.5737505,1
0.11113924,0.7183106,1
0.0979534,0.5619194,1
0.1528658,0.7223617,1
0.110018976,0.6477798,1
0.12080575,0.4409467,1
0.1110463,0.7077742,1
0.1626176,0.7918155,1
0.11211135,0.7023622,1
0.17746855,0.83371854,1
0.120445155,0.3382988,1
0.122116216,0.7453067,1
0.119024284,0.6377299,1
0.13832416,0.6386116,1
0.15420052,0.69736135,1
0.1117067,0.6819948,1
0.17073654,0.3755169,1
0.12493611,0.68822473,1
0.12156605,0.64943594,1
0.103461266,0.69457257,1
0.14194514,0.45381114,1
0.10854467,0.676822,1
0.10438379,0.6816393,1
0.112225644,0.73287725,1
0.13056475,0.41153535,1
0.16323097,0.655192,1
0.10596927,0.7070135,1
0.110794,0.5372381,1
0.11877137,0.35381132,1
0.13973926,0.5708873,1
0.104861945,0.6420046,1
0.10865869,0.69565415,1
0.117045045,0.71343774,1
0.12279002,0.76716375,1
0.13491236,0.294573,1
0.11180848,0.3545487,1
0.10127566,0.61499953,1
0.1277518,0.58522874,1
0.11905452,0.3806964,1
0.13169417,0.35872036,1
0.10939427,0.5189997,1
0.12760212,0.29772606,1
0.14180698,0.32921386,1
0.16875449,0.50799626,1
0.12660226,0.70754594,1
0.10994936,0.70735574,1
0.10811528,0.67017144,1
0.12993939,0.3188072,1
0.12919937,0.30015424,1
0.10351309,0.5435814,1
0.11378588,0.5481919,1
0.12115169,0.7103329,1
0.15099466,0.6634371,1
0.16300805,0.49553987,1
0.101205245,0.57805634,1
0.15078844,0.394726,1
0.101035275,0.5059702,1
0.096643046,0.40924904,1
0.110996634,0.6908968,1
0.10019736,0.6240247,1
0.11195842,0.7122772,1
0.099022225,0.64532244,1
0.13343522,0.7804881,1
0.10514993,0.59611046,1
0.13206854,0.78850216,1
0.11977626,0.67930496,1
0.13346921,0.5984022,1
0.10436268,0.5891224,1
0.09949434,0.48569965,1
0.11476479,0.688895,1
0.10422729,0.4482551,1
0.12305786,0.7262527,1
0.097989395,0.36185768,1
0.10016373,0.47831893,1
0.102721944,0.61781263,1
0.09908885,0.4112621,1
0.11215216,0.51845765,1
0.11340622,0.6809647,1
0.14407994,0.80135953,1
0.10552724,0.6875366,1
0.10796406,0.6580025,1
0.1247378,0.7412998,1
0.10281945,0.39061257,1
0.10791439,0.68239754,1
0.119038634,0.7361598,1
0.10175547,0.5909215,1
0.10422284,0.37426373,1
0.107886784,0.7062117,1
0.11318359,0.7472257,1
0.13087694,0.71255684,1
0.10642316,0.6737797,1
0.17426984,0.80206436,1
0.12272224,0.76214457,1
0.11787321,0.7394663,1
0.12231487,0.7816338,1
0.15444498,0.8029764,1
0.10620818,0.7290487,1
0.16232708,0.77596545,1
0.10018484,0.6857455,1
0.13860665,0.7634917,1
0.0974121,0.6491586,1
0.10448126,0.7148947,1
0.12016506,0.7508593,1
0.09709555,0.35470018,1
0.1070601,0.7460126,1
0.11002019,0.6957789,1
0.13914932,0.79240173,1
0.10981206,0.72319216,1
0.12583527,0.79790515,1
0.11444148,0.39051524,1
0.15331547,0.80953807,1
0.108628795,0.6453257,1
0.120820895,0.72372705,1
0.100217216,0.5756121,1
0.10825479,0.7393715,1
0.120161474,0.6538816,1
0.11571109,0.75539714,1
0.11554046,0.761042,1
0.11272645,0.539485,1
0.14190394,0.7884965,1
0.10600167,0.6908556,1
0.111059226,0.32305834,1
0.14276747,0.76728714,1
0.1085034,0.39566398,1
0.10259155,0.3198952,1
0.12564859,0.3079173,1
0.1055256,0.7206081,1
0.14183453,0.7020419,1
0.17187847,0.8178193,1
0.105416626,0.3500317,1
0.116972335,0.46547806,1
0.13024914,0.30933446,1
0.10448053,0.47177544,1
0.11789097,0.73718953,1
0.108202554,0.36371914,1
0.137409,0.74129826,1
0.117653795,0.688208,1
0.12830657,0.73229927,1
0.12445517,0.78474134,1
0.11502783,0.7351215,1
0.11003755,0.70836335,1
0.13381505,0.5657462,1
0.13726674,0.80251694,1
0.10284623,0.55439067,1
0.10068727,0.47917202,1
0.10728901,0.5309172,1
0.11231478,0.7270984,1
0.12906788,0.7599277,1
0.14766341,0.7645647,1
0.1329043,0.5668683,1
0.14025854,0.7228338,1
0.09672071,0.69078296,1
0.11641482,0.7483039,1
0.13249075,0.78205395,1
0.15367427,0.77313584,1
0.119583696,0.67051125,1
0.10683377,0.70654196,1
0.12832198,0.56780356,1
0.11724894,0.74360496,1
0.12180935,0.7653926,1
0.14344244,0.8159293,1
0.12563619,0.7760286,1
0.13900557,0.7488795,1
0.13163806,0.7113712,1
0.11606509,0.7403648,1
0.13637005,0.76728755,1
0.121109724,0.73303014,1
0.11129452,0.68996614,1
0.15054879,0.8082583,1
0.14350317,0.37558445,1
0.16436277,0.780229,1
0.11931505,0.6844237,1
0.12034568,0.76981604,1
0.14402667,0.7607314,1
0.12513554,0.73649114,1
0.10584064,0.4794484,1
0.15315782,0.8103304,1
0.16494006,0.83281094,1
0.18436775,0.8286325,1
0.12635332,0.74646705,1
0.14649236,0.79875386,1
0.1688333,0.76208425,1
0.15558434,0.82424927,1
0.1607513,0.81575906,1
0.14007421,0.7891695,1
0.13946427,0.8111971,1
0.13130863,0.70570886,1
0.15366678,0.40988132,1
0.13967271,0.8089082,1
0.1625537,0.7949039,1
0.11945904,0.69075936,1
0.21233155,0.8414744,1
0.22257505,0.83896554,1
0.10876206,0.72412163,1
0.12438587,0.70185614,1
0.15364093,0.6549835,1
0.1316539,0.6947443,1
0.13568588,0.80787957,1
0.13983417,0.67968506,1
0.16080076,0.76874614,1
0.14394496,0.76819724,1
0.1311899,0.79132676,1
0.117018946,0.67502767,1
0.14107533,0.80063415,1
0.10694951,0.58366024,1
0.108942166,0.53707725,1
0.16031021,0.40732706,1
0.11866275,0.7251153,1
0.113945656,0.43552387,1
0.102259666,0.66171306,1
0.10786384,0.3807935,1
0.13933557,0.7133928,1
0.104961716,0.5439051,1
0.134356,0.7009113,1
0.097229294,0.43787354,1
0.14788231,0.77883935,1
0.1353963,0.69548917,1
0.22580098,0.83792984,1
0.11277545,0.42526054,1
0.12907973,0.49261564,1
0.20746237,0.8373061,1
0.19446644,0.8388941,1
0.15169048,0.8222261,1
0.1431666,0.82119083,1
0.17281401,0.46287408,1
0.17586344,0.82597333,1
0.15758102,0.79633963,1
0.20423429,0.84272546,1
0.14431892,0.7562271,1
0.10542969,0.2935259,1
0.11309433,0.3162028,1
0.12000585,0.73183674,1
0.11683574,0.7508909,1
0.09781738,0.5245229,1
0.10176507,0.5973829,1
0.111440815,0.6672583,1
0.1156265,0.7197718,1
0.10068946,0.62020814,1
0.09907421,0.30976817,1
0.1070345,0.31218383,1
0.11983191,0.75048953,1
0.10656231,0.6216709,1
0.12056997,0.74772775,1
0.10832042,0.63556373,1
0.107158504,0.6176334,1
0.13444495,0.7443818,1
0.09987581,0.38901153,1
0.092230015,0.5405555,1
0.10198958,0.41335255,1
0.11736123,0.6140561,1
0.15805386,0.7451423,1
0.110061795,0.32617074,1
0.120611235,0.73264825,1
0.0973574,0.37290174,1
0.17918433,0.7155323,1
0.11490006,0.33069518,1
0.10733126,0.36771742,1
0.09909957,0.44539455,1
0.12941779,0.7746825,1
0.094966784,0.46518636,1
0.11625697,0.71463007,1
0.10305899,0.61497676,1
0.13927998,0.76155394,1
0.11923804,0.7257945,1
0.120507,0.71835756,1
0.12784289,0.66461384,1
0.09444028,0.58426213,1
0.10905709,0.7037256,1
0.12735926,0.78997815,1
0.13034356,0.7489191,1
0.12146914,0.7129936,1
0.109368525,0.42699888,1
0.138262,0.7783232,1
0.09780095,0.6380533,1
0.10190822,0.6357502,1
0.11028206,0.6961698,1
0.10836446,0.66041255,1
0.12752317,0.75731695,1
0.13146631,0.78373516,1
0.13883361,0.656594,1
0.13057166,0.77377605,1
0.14282598,0.6823237,1
0.13577272,0.7869166,1
0.09709335,0.4543389,1
0.11691023,0.76044226,1
0.10556859,0.70609283,1
0.09988877,0.40618917,1
0.10167487,0.3278463,1
0.11974409,0.65862745,1
0.101206616,0.41934016,1
0.12741747,0.5585163,1
0.10887742,0.62727517,1
0.12416019,0.75935847,1
0.12175713,0.77238,1
0.12421314,0.5746673,1
0.116363406,0.5779332,1
0.13586007,0.770415,1
0.10072801,0.36816737,1
0.10947831,0.7315209,1
0.098873265,0.461262,1
0.115813255,0.6998135,1
0.119909324,0.6928513,1
0.11491874,0.73144764,1
0.14658955,0.482031,1
0.09254416,0.53991014,1
0.13852651,0.5822216,1
0.09386404,0.4197832,1
0.11327987,0.6600558,1
0.1315511,0.598008,1
0.11987921,0.7133943,1
0.08781836,0.4096335,1
0.1458804,0.68155515,1
0.1366477,0.69928014,1
0.097560905,0.61902803,1
0.124463975,0.64393,1
0.11683984,0.6748091,1
0.11907412,0.36769816,1
0.11583778,0.73618895,1
0.11743238,0.3731145,1
0.10696839,0.5395639,1
0.10608734,0.5823918,1
0.1346601,0.76563174,1
0.11222235,0.34694132,1
0.1039383,0.4873172,1
0.1271375,0.74679834,1
0.12920061,0.61814123,1
0.10231663,0.43432066,1
0.10822037,0.58008957,1
0.117357895,0.7397491,1
0.13611042,0.7912158,1
0.086297266,0.414162,1
0.09660325,0.49863273,1
0.10106785,0.50485516,1
0.118590444,0.7219227,1
0.113023184,0.6563854,1
0.09435495,0.46210355,1
0.1099747,0.711116,1
0.11166614,0.6146611,1
0.1037745,0.63819695,1
0.099001795,0.33633992,1
0.10206558,0.30185607,1
0.11935156,0.7721834,1
0.09527982,0.5467211,1
0.10828098,0.7293953,1
0.116613336,0.6457807,1
0.13057154,0.70176935,1
0.29687172,0.3992386,1
0.09858877,0.44220316,1
0.10167601,0.29524857,1
0.1409369,0.31553045,1
0.09740392,0.38844076,1
0.098930374,0.61978024,1
0.09367009,0.4903263,1
0.12780328,0.31338504,1
0.1012725,0.3129991,1
0.09623356,0.6099409,1
0.10384822,0.34511912,1
0.104784936,0.31319574,1
0.10631928,0.32439348,1
0.110246606,0.49128857,1
0.10192769,0.43510786,1
0.1108886,0.35034937,1
0.104709625,0.29205182,1
0.101839595,0.29802406,1
0.09345332,0.5223613,1
0.09713627,0.41939542,1
0.11283449,0.6725769,1
0.09817473,0.3835061,1
0.097647004,0.4883253,1
0.18093276,0.5940973,1
0.09552271,0.54814655,1
0.11080978,0.29266572,1
0.1276752,0.6317932,1
0.109060906,0.48660937,1
0.10785686,0.3600269,1
0.11629898,0.4414595,1
0.10218237,0.35556293,1
0.09465146,0.3748888,1
0.10115022,0.6101354,1
0.11492823,0.30872455,1
0.09347221,0.47359842,1
0.09798587,0.5265474,1
0.11599133,0.31436065,1
0.09622623,0.5815591,1
0.23466282,0.3641773,1
0.12450731,0.7714135,1
0.11279668,0.73193437,1
0.09185026,0.4572703,1
0.1426969,0.7019933,1
0.09309478,0.410633,1
0.10269044,0.33946085,1
0.1297005,0.48935515,1
0.11028139,0.69751143,1
0.118397266,0.435578,1
0.10408713,0.30263048,1
0.096159466,0.3387482,1
0.11425943,0.7078549,1
0.09867767,0.32210135,1
0.099235624,0.35890797,1
0.103370994,0.30481333,1
0.09401449,0.416346,1
0.1534746,0.34727868,1
0.1131875,0.32802764,1
0.09604968,0.39874852,1
0.11844363,0.4031697,1
0.089372404,0.5298192,1
0.09476922,0.36301813,1
0.11746561,0.7638659,1
0.10119998,0.54156166,1
0.104418404,0.5549514,1
0.09256469,0.4480286,1
0.14917496,0.3216536,1
0.09602562,0.4819302,1
0.11558008,0.75503784,1
0.12690432,0.7338114,1
0.10947826,0.32030168,1
0.103101,0.32543656,1
0.093663864,0.53370196,1
0.12057985,0.59848136,1
0.1663736,0.81320333,1
0.0928983,0.47550106,1
0.13582209,0.69848156,1
0.11265663,0.5690609,1
0.101716235,0.50863713,1
0.097972915,0.47795177,1
0.09804629,0.41338152,1
0.117641546,0.31174377,1
0.10258493,0.4495085,1
0.12961204,0.7448159,1
0.101802684,0.48943028,1
0.08778699,0.3270048,1
0.106485344,0.5064967,1
0.09343288,0.46822163,1
0.106987365,0.36162615,1
0.13306306,0.5336793,1
0.09508173,0.46807098,1
0.102629125,0.48215866,1
0.09827719,0.64810306,1
0.096672684,0.31284046,1
0.08843963,0.49698284,1
0.11182991,0.6506326,1
0.08953872,0.53381217,1
0.0903602,0.3602615,1
0.11712562,0.33181676,1
0.104125746,0.38529995,1
0.10635223,0.36697045,1
0.107874006,0.3752271,1
0.10053119,0.5647533,1
0.09849518,0.45633504,1
0.104861274,0.49116287,1
0.1747156,0.77302885,1
0.09940484,0.3792059,1
0.1050666,0.64541596,1
0.095714785,0.38460594,1
0.14316198,0.30989182,1
0.09449752,0.4941123,1
0.097575,0.57712114,1
0.106129326,0.4975403,1
0.12979814,0.4382075,1
0.09648832,0.34200972,1
0.11249162,0.7202957,1
0.096687034,0.529051,1
0.10039992,0.6019374,1
0.09949465,0.33967164,1
0.11749871,0.3398568,1
0.118402034,0.350907,1
0.09910293,0.39193448,1
0.11777161,0.6634847,1
0.104564734,0.70521927,1
0.091843285,0.46576187,1
0.112487614,0.5002276,1
0.11756317,0.31228057,1
0.104422785,0.3348149,1
0.09517184,0.50715053,1
0.11172712,0.3028368,1
0.23966163,0.39780304,1
0.10262264,0.51565564,1
0.14007086,0.28254542,1
0.12663923,0.6707752,1
0.11195663,0.6948553,1
0.2684689,0.3423999,1
0.10851802,0.3440062,1
0.09866192,0.35375634,1
0.0908606,0.3501233,1
0.1095311,0.44351834,1
0.11673314,0.32629192,1
0.11793467,0.42230955,1
0.113674045,0.54187095,1
0.09151118,0.35164642,1
0.10412376,0.48740327,1
0.105132595,0.36468259,1
0.10956662,0.6293698,1
0.100537285,0.5493399,1
0.08801386,0.4261718,1
0.09757698,0.5815796,1
0.10564681,0.3027765,1
0.14599411,0.44092673,1
0.09976987,0.34245345,1
0.1396753,0.29957518,1
0.11347049,0.30259,1
0.095922,0.60971755,1
0.11081176,0.37442532,1
0.09484916,0.41102463,1
0.10000487,0.65283996,1
0.09960977,0.5445291,1
0.09984709,0.31130007,1
0.092481874,0.50759524,1
0.13982674,0.29975185,1
0.121607475,0.35734165,1
0.104491465,0.631702,1
0.12363927,0.3139233,1
0.12369127,0.33753753,1
0.12949197,0.72290385,1
0.093419306,0.46776956,1
0.0894743,0.3329836,1
0.10495924,0.33980185,1
0.15141742,0.4023738,1
0.13603564,0.6894058,1
0.13128452,0.7676826,1
0.107595384,0.6636859,1
0.110830106,0.2763637,1
0.117469005,0.6656939,1
0.09912774,0.32374653,1
0.18712838,0.3981553,1
0.099942386,0.3295367,1
0.119558245,0.6366366,1
0.114724316,0.3166395,1
0.10689098,0.70018566,1
0.09848895,0.5868374,1
0.118662044,0.30305916,1
0.0971921,0.5675106,1
0.09361256,0.5009669,1
0.10556222,0.5832947,1
0.10315625,0.41941807,1
0.09481309,0.30771133,1
0.10302337,0.64749646,1
0.09991421,0.5054358,1
0.10326385,0.32064742,1
0.09933716,0.3206636,1
0.1052536,0.47890383,1
0.107542664,0.36115283,1
0.099274516,0.4249977,1
0.11004192,0.66046304,1
0.08992306,0.41560468,1
0.08996579,0.39652246,1
0.09104474,0.41539204,1
0.10377981,0.3471002,1
0.11856664,0.6399055,1
0.13526927,0.31184328,1
0.103460826,0.5465579,1
0.09336416,0.37147698,1
0.110697046,0.42123434,1
0.10106216,0.6105608,1
0.10821371,0.36337218,1
0.09144361,0.43216932,1
0.111702815,0.7249524,1
0.11453411,0.30854544,1
0.096258715,0.4761399,1
0.09874793,0.4821116,1
0.1186696,0.30309194,1
0.112022445,0.28878224,1
0.09553093,0.52503586,1
0.09454639,0.35366088,1
0.09894701,0.3968794,1
0.10099884,0.5125702,1
0.10559253,0.39327425,1
0.102660485,0.37656802,1
0.111941986,0.3180548,1
0.12355369,0.31923229,1
0.17557497,0.37871093,1
0.15190983,0.7674331,1
0.11753964,0.31482825,1
0.097181,0.5678826,1
0.13159814,0.5746191,1
0.10271197,0.38223055,1
0.096167706,0.4570425,1
0.10370966,0.37346202,1
0.09792957,0.32143423,1
0.10113815,0.2908447,1
0.09470961,0.48971954,1
0.12345449,0.7549184,1
0.114226565,0.45842034,1
0.12215061,0.6851433,1
0.121191025,0.30381083,1
0.13567813,0.37443474,1
0.108852915,0.68909913,1
0.10622311,0.37144327,1
0.09055002,0.51958454,1
0.14201707,0.311143,1
0.086824,0.34392503,1
0.12050603,0.5080311,1
0.10398131,0.3300352,1
0.1050195,0.29691368,1
0.10606687,0.3029624,1
0.11415847,0.38974172,1
0.098177955,0.63781166,1
0.11399196,0.32490838,1
0.09215263,0.3715761,1
0.10251984,0.41546693,1
0.100051835,0.37695217,1
0.10759869,0.43948227,1
0.10664531,0.34003428,1
0.102181815,0.34001276,1
0.10616914,0.5847302,1
0.09138213,0.32709023,1
0.10429483,0.50957125,1
0.102926336,0.33119345,1
0.1121594,0.41614783,1
0.11814402,0.37237117,1
0.09538731,0.48975134,1
0.12098416,0.30213058,1
0.104965225,0.6351185,1
0.1010047,0.53553855,1
0.09653497,0.54784036,1
0.0968158,0.31526667,1
0.106748186,0.68323,1
0.116689146,0.46357968,1
0.11706281,0.30500972,1
0.12566876,0.7388526,1
0.10237071,0.2954144,1
0.10264257,0.34155998,1
0.10438783,0.52992326,1
0.10020585,0.3069603,1
0.10720237,0.43472752,1
0.11932705,0.33897913,1
0.09539159,0.5623183,1
0.096189894,0.44829774,1
0.102786615,0.62834257,1
0.10509142,0.3531107,1
0.12694557,0.6970709,1
0.09733388,0.4485262,1
0.11111556,0.29432216,1
0.11107266,0.6466086,1
0.09934702,0.43925476,1
0.12477834,0.7748682,1
0.10337546,0.42722216,1
0.09796935,0.44514307,1
0.09657264,0.36333805,1
0.121007726,0.33699504,1
0.09980287,0.32535338,1
0.11861414,0.60153407,1
0.099561326,0.32974717,1
0.10663199,0.56979406,1
0.11373137,0.73180103,1
0.12911151,0.72850746,1
0.0966922,0.5255806,1
0.09601517,0.40494475,1
0.09613112,0.3363843,1
0.101815365,0.3946622,1
0.18201804,0.3909424,1
0.12230366,0.53377986,1
0.09141802,0.40122968,1
0.100890085,0.3192132,1
0.094506875,0.549922,1
0.10254586,0.41980612,1
0.11158364,0.32352367,1
0.10876575,0.41783643,1
0.12475433,0.6141048,1
0.10269022,0.350477,1
0.099616714,0.35961658,1
0.10127947,0.3236309,1
0.102614075,0.32194617,1
0.093914784,0.4296788,1
0.118197955,0.7093,1
0.104842536,0.399954,1
0.102241136,0.33747855,1
0.11428255,0.7180928,1
0.09645401,0.40177134,1
0.10365166,0.29164508,1
0.09300867,0.3664371,1
0.09346547,0.3454016,1
0.095460705,0.60931146,1
0.13569552,0.35542986,1
0.10087017,0.38550186,1
0.109760016,0.4764424,1
0.10786274,0.69153666,1
0.12632385,0.7475264,1
0.100856096,0.6396097,1
0.094006374,0.5122146,1
0.10126604,0.4858672,1
0.101835944,0.41418156,1
0.09526734,0.52464926,1
0.12249734,0.34908882,1
0.09484572,0.3541027,1
0.117195055,0.32226682,1
0.118381955,0.50797176,1
0.09767134,0.35450727,1
0.12296299,0.36491618,1
0.1078209,0.3285449,1
0.08611841,0.4357722,1
0.09371062,0.40988916,1
0.102326,0.3149233,1
0.10688991,0.3155544,1
0.09581771,0.45565572,1
0.09218666,0.37989914,1
0.090890646,0.32395706,1
0.094813175,0.4131108,1
0.09343311,0.5063825,1
0.09291311,0.5241939,1
0.1030693,0.63669074,1
0.10899322,0.67965096,1
0.11262298,0.3935331,1
0.093064085,0.62475365,1
0.10748233,0.33345872,1
0.13987112,0.27783906,1
0.097422965,0.30963644,1
0.09548447,0.36192307,1
0.11270895,0.33029452,1
0.11657368,0.7287512,1
0.09478649,0.47706923,1
0.095737614,0.5399943,1
0.093522884,0.4513527,1
0.15247278,0.36098474,1
0.113313995,0.30285248,1
0.10796148,0.3260253,1
0.13109681,0.5881231,1
0.09294557,0.32622126,1
0.11530155,0.71770304,1
0.10998307,0.7528673,1
0.12074867,0.76226383,1
0.104683824,0.6846506,1
0.11266346,0.7563754,1
0.101746574,0.6696649,1
0.160232,0.4831401,1
0.104990065,0.5884386,1
0.11248433,0.7004896,1
0.10499814,0.6903148,1
0.10367473,0.6472903,1
0.11161187,0.671121,1
0.1003173,0.66253066,1
0.102694176,0.54703546,1
0.107073225,0.5572597,1
0.11906125,0.76110125,1
0.10450122,0.7160052,1
0.15985319,0.4683462,1
0.12318285,0.7775437,1
0.1138888,0.3130663,1
0.11581172,0.75313634,1
0.11325075,0.30859792,1
0.10742888,0.35823643,1
0.10359076,0.54470205,1
0.11475823,0.56297684,1
0.11009656,0.38082412,1
0.10945511,0.44543844,1
0.16240941,0.44753537,1
0.108015366,0.32409182,1
0.11311789,0.34810156,1
0.122528374,0.3313999,1
0.122873195,0.34152016,1
0.13386677,0.32801166,1
0.1179899,0.47878465,1
0.12208917,0.43847013,1
0.109827586,0.45670414,1
0.1127814,0.34777084,1
0.11785837,0.4607261,1
0.114617065,0.35157514,1
0.11878559,0.4434703,1
0.10991044,0.35532412,1
0.10857427,0.45719692,1
0.12041243,0.31469575,1
0.11641282,0.7552657,1
0.11766288,0.7623439,1
0.111940004,0.7529017,1
0.11938452,0.7713376,1
0.10919794,0.69669735,1
0.110031225,0.7022974,1
0.12251174,0.7699009,1
0.121828765,0.75707847,1
0.1083061,0.67109185,1
0.11090921,0.6652653,1
0.10777361,0.71505755,1
0.10376681,0.32292178,1
0.09857726,0.3820294,1
0.09306602,0.5231654,1
0.1071539,0.34625491,1
0.12199295,0.5728645,1
0.10230901,0.3895205,1
0.10011679,0.63701886,1
0.09776023,0.41848147,1
0.09857659,0.28979182,1
0.09816957,0.40520534,1
0.11435962,0.42412606,1
0.10077827,0.67415047,1
0.13239104,0.77934706,1
0.1534628,0.8190822,1
0.12763776,0.7934383,1
0.11721705,0.7709597,1
0.12729654,0.7849591,1
0.114548646,0.6544929,1
0.13239874,0.78130525,1
0.12271634,0.7140533,1
0.1075061,0.6795247,1
0.103517614,0.6299487,1
0.115593456,0.694189,1
0.098562,0.5434697,1
0.10435327,0.35775128,1
0.109940894,0.67475766,1
0.10007242,0.59485096,1
0.10121448,0.5761004,1
0.10878308,0.6912989,1
0.10190617,0.58290154,1
0.117750056,0.71517503,1
0.1341721,0.7690811,1
0.104008555,0.67565244,1
0.1167916,0.7748725,1
0.12299977,0.7784277,1
0.10451131,0.34272543,1
0.09745972,0.5427513,1
0.102282025,0.35977003,1
0.10495911,0.54874283,1
0.10172022,0.6716525,1
0.11354419,0.6161629,1
0.10836216,0.6707456,1
0.10935772,0.7132623,1
0.11662642,0.7265668,1
0.09881331,0.66189986,1
0.119147696,0.74095935,1
0.10183413,0.61346835,1
0.1049519,0.62269765,1
0.107512176,0.596171,1
0.0959072,0.5899735,1
0.09915035,0.57969475,1
0.10543583,0.618556,1
0.113364,0.63365924,1
0.112629935,0.58599716,1
0.11529115,0.48307005,1
0.124743246,0.55830735,1
0.11234868,0.508975,1
0.12988009,0.6428934,1
0.10394925,0.5939208,1
0.122528516,0.3853978,1
0.092711814,0.38782778,1
0.10277752,0.52747387,1
0.09996091,0.33940104,1
0.1004805,0.57785267,1
0.12201917,0.7609996,1
0.12777044,0.746881,1
0.12036491,0.7379904,1
0.12343931,0.7745272,1
0.10605476,0.689691,1
0.117706515,0.7641959,1
0.12088389,0.7367363,1
0.11543072,0.7538812,1
0.10789297,0.6834613,1
0.13818048,0.7512313,1
0.116822734,0.72880435,1
0.122116864,0.7334578,1
0.105275534,0.41331837,1
0.09943762,0.33519095,1
0.09354581,0.5396587,1
0.09936278,0.3963685,1
0.10842741,0.35597596,1
0.0999352,0.51155305,1
0.14250565,0.68622744,1
0.14665128,0.64856404,1
0.14777935,0.776163,1
0.10970067,0.3214595,1
0.102620296,0.3220756,1
0.09585494,0.40960097,1
0.107338525,0.473296,1
0.10435867,0.33602014,1
0.11261843,0.64208883,1
0.12846555,0.76755965,1
0.138425,0.3934482,1
0.108405426,0.7255523,1
0.10855882,0.6858064,1
0.10765849,0.6491035,1
0.096564844,0.56535023,1
0.11016634,0.545722,1
0.10129334,0.5729198,1
0.10553878,0.6417472,1
0.11253652,0.6657148,1
0.12059803,0.6503938,1
0.11103625,0.6758508,1
0.10634452,0.56127286,1
0.10207593,0.3333637,1
0.10644689,0.32174614,1
0.0964759,0.48285452,1
0.10067378,0.39963382,1
0.15553236,0.5571244,1
0.12769333,0.4511803,1
0.14992732,0.5156733,1
0.14157884,0.5648229,1
0.1509734,0.59090036,1
0.12139281,0.28283945,1
0.10830818,0.32600933,1
0.118889526,0.2985555,1
0.11384829,0.28872952,1
0.11539943,0.34077775,1
0.12556995,0.30906582,1
0.11519727,0.2722298,1
0.111181706,0.31218958,1
0.10937858,0.30765992,1
0.120473854,0.2937454,1
0.105052665,0.29974854,1
0.11159069,0.28945717,1
0.14536081,0.3093848,1
0.11584422,0.2919851,1
0.10689997,0.35862306,1
0.110777766,0.30157405,1
0.10727519,0.29546124,1
0.11521061,0.33621138,1
0.099370256,0.388332,1
0.12173438,0.28739038,1
0.09433299,0.56387085,1
0.10078206,0.59433186,1
0.102307044,0.34575737,1
0.09320615,0.42065042,1
0.102107085,0.50851876,1
0.09632374,0.56874764,1
0.14890763,0.39670897,1
0.12824538,0.31340265,1
0.10319786,0.35041118,1
0.109490894,0.29892346,1
0.097771585,0.31053483,1
0.1059787,0.33130577,1
0.09648304,0.31574586,1
0.10588435,0.29438704,1
0.10186325,0.31832823,1
0.114422746,0.34612033,1
0.10973248,0.6943048,1
0.0977354,0.36090523,1
0.10304907,0.47006622,1
0.0973492,0.5085677,1
0.10710459,0.48342445,1
0.111513935,0.35392433,1
0.09245802,0.34243238,1
0.09383711,0.5384462,1
0.10896115,0.41753712,1
0.11689744,0.41332588,1
0.12574525,0.70377696,1
0.10590051,0.3505426,1
0.095903076,0.49662054,1
0.102638155,0.370932,1
0.17073698,0.38303992,1
0.09557765,0.38751304,1
0.09569564,0.4533096,1
0.09483702,0.3780327,1
0.09101201,0.5143858,1
0.100804225,0.6236577,1
0.09122834,0.35811862,1
0.10383451,0.3047095,1
0.09873368,0.44229138,1
0.14166883,0.7159715,1
0.10972561,0.6175525,1
0.22403285,0.3739036,1
0.0933921,0.57137364,1
0.098344326,0.41459444,1
0.09961785,0.35867387,1
0.100905985,0.6380506,1
0.094731174,0.50703895,1
0.097948596,0.5147718,1
0.101309255,0.6656085,1
0.10523553,0.3137469,1
0.09702062,0.5249925,1
0.08818832,0.56222016,1
0.09523026,0.34748733,1
0.09160383,0.54509956,1
0.096625336,0.47477844,1
0.10730649,0.32176536,1
0.10890636,0.45611748,1
0.11174765,0.31698626,1
0.11693484,0.5612144,1
0.09707648,0.55817795,1
0.10137809,0.5187429,1
0.09120565,0.40319458,1
0.09435421,0.41062987,1
0.113412365,0.67409533,1
0.10807407,0.33246496,1
0.116526,0.3319661,1
0.13245964,0.61165166,1
0.123735055,0.3175183,1
0.09274666,0.4374313,1
0.119372845,0.31866428,1
0.1092247,0.3199762,1
0.09788553,0.43224126,1
0.103978254,0.3129889,1
0.10211681,0.35731918,1
0.10451921,0.66497874,1
0.102912866,0.45017752,1
0.09560278,0.42009476,1
0.10424594,0.33118024,1
0.12529743,0.7198972,1
0.12305657,0.33274627,1
0.1267573,0.76648325,1
0.13310207,0.3047325,1
0.10494466,0.29952922,1
0.09872242,0.602473,1
0.098864935,0.4054728,1
0.097652555,0.31233853,1
0.11689586,0.6360301,1
0.10946791,0.7448356,1
0.1091145,0.350447,1
0.117896296,0.35708666,1
0.10045754,0.3020466,1
0.1090304,0.29977974,1
0.10623872,0.6356056,1
0.09634777,0.55826783,1
0.103305176,0.32249716,1
0.095134065,0.45354322,1
0.09902117,0.3611983,1
0.08735879,0.3675406,1
0.14335927,0.37545747,1
0.10100348,0.6338842,1
0.116647646,0.35700214,1
0.101769365,0.66340506,1
0.08994177,0.5399906,1
0.11461957,0.4162909,1
0.10724942,0.62327695,1
0.12353946,0.28644305,1
0.106066175,0.68152505,1
0.13942021,0.5309943,1
0.1154648,0.67395365,1
0.09186107,0.60326326,1
0.12395937,0.309708,1
0.093288705,0.35915676,1
0.1033305,0.2904244,1
0.097273275,0.4565644,1
0.11293247,0.66793287,1
0.09466579,0.59441984,1
0.095825635,0.3483046,1
0.12959789,0.434627,1
0.08671898,0.358425,1
0.09026343,0.47480828,1
0.09570432,0.50080043,1
0.11093954,0.5850842,1
0.10427903,0.29446432,1
0.099224545,0.3165904,1
0.09421274,0.3648923,1
0.10710284,0.301392,1
0.10027844,0.48410007,1
0.095515504,0.4413378,1
0.110446304,0.56337315,1
0.11647498,0.6321337,1
0.10995603,0.6923444,1
0.11837355,0.32654202,1
0.09537786,0.4257266,1
0.10189389,0.6497183,1
0.10499684,0.45782927,1
0.11149086,0.35369486,1
0.101469845,0.619585,1
0.10294418,0.37691456,1
0.10749045,0.38249403,1
0.10690352,0.33314076,1
0.092635624,0.40927452,1
0.10346744,0.30245864,1
0.11429545,0.62319106,1
0.11130707,0.34775382,1
0.100274496,0.35485977,1
0.11115462,0.5795339,1
0.13684162,0.35536173,1
0.10479878,0.29303658,1
0.11474463,0.4765754,1
0.115298845,0.5036511,1
0.104942806,0.40136135,1
0.09915037,0.43752733,1
0.116859555,0.34909862,1
0.102638744,0.5945025,1
0.093749814,0.51282936,1
0.102351315,0.5936234,1
0.109591156,0.529292,1
0.10359188,0.34583488,1
0.15991136,0.31343386,1
0.23466943,0.4430922,1
0.09587101,0.49874052,1
0.09805333,0.3013821,1
0.13279521,0.6508479,1
0.098792106,0.290995,1
0.095165014,0.3444378,1
0.09374584,0.44640648,1
0.104949325,0.61282206,1
0.11195972,0.46130607,1
0.13381414,0.539,1
0.10602995,0.32927987,1
0.09975139,0.30701336,1
0.1089521,0.57932717,1
0.11203137,0.4148796,1
0.100468986,0.58385724,1
0.09715054,0.36378995,1
0.10400342,0.6622177,1
0.09737885,0.44216555,1
0.09696964,0.3664524,1
0.10421119,0.65253454,1
0.10233563,0.31324244,1
0.121516734,0.7561433,1
0.10117909,0.32030517,1
0.09740476,0.5536017,1
0.109734684,0.66532236,1
