{
    "dimensionality_reduction_methods": "['PCA', 'TSVD', 'ISOMAP', 'LLE']",
    "proportions": "[0.5, 0.5, 0, 0]",
    "dataset": "nmnist",
    "number_of_classes": "2",
    "number_of_points": "10000",
    "number_of_Tsamples": "2000",
    "number_ofVsamples": "1000",
    "loss": "0.0008897786028683186",
    "trustworthiness": "0.8980666278862217",
    "continuity": "0.9582318235926358",
    "neighborhood_hit": "0.9980412022965216"
}