PC1,PC2,label
0.45246583,0.30324867,0
0.44555745,0.20326133,0
0.31332466,0.35512182,0
0.29264015,0.24093011,0
0.77872676,0.20566791,0
0.6317435,0.12780252,0
0.27894783,0.42916605,0
0.8242474,0.25420916,0
0.47666,0.31548393,0
0.77471244,0.25775576,0
0.30279273,0.24358682,0
0.3990457,0.16946346,0
0.7613117,0.23931038,0
0.5529421,0.14531633,0
0.5052085,0.1520003,0
0.73462766,0.31511503,0
0.83039594,0.2830776,0
0.34275168,0.2815869,0
0.7901674,0.2089569,0
0.6375982,0.17691052,0
0.51101696,0.21731508,0
0.70428276,0.22186524,0
0.56590027,0.27928117,0
0.66105497,0.1860481,0
0.7212971,0.22538641,0
0.4111875,0.25637642,0
0.43872076,0.40952817,0
0.48494422,0.16720702,0
0.83991224,0.18701069,0
0.61194795,0.15540205,0
0.24530056,0.36259952,0
0.8098468,0.30998188,0
0.80537325,0.19733338,0
0.8286526,0.2838333,0
0.79330045,0.17402114,0
0.47449917,0.16512637,0
0.81636435,0.26058927,0
0.6192134,0.1800637,0
0.33919317,0.19428498,0
0.34543175,0.2547298,0
0.5522864,0.1581351,0
0.29207206,0.2958659,0
0.7583943,0.21259917,0
0.434523,0.24556653,0
0.62182856,0.27828342,0
0.3535547,0.32123852,0
0.7127903,0.17140943,0
0.37734374,0.22529086,0
0.6881492,0.19735017,0
0.8295919,0.26948506,0
0.8146158,0.29208288,0
0.4041065,0.21203873,0
0.7918151,0.25151852,0
0.8141442,0.18764459,0
0.472045,0.16262473,0
0.30394045,0.56978625,0
0.6136835,0.18070385,0
0.5056188,0.21311702,0
0.59386533,0.14798824,0
0.551173,0.23779649,0
0.2602589,0.19121934,0
0.40866578,0.19794716,0
0.39125094,0.25813648,0
0.59674877,0.14172795,0
0.7882865,0.15609248,0
0.3940544,0.2611929,0
0.6237297,0.2507985,0
0.3414705,0.3023342,0
0.5652201,0.16001888,0
0.5835061,0.18290077,0
0.39134857,0.21080615,0
0.5832352,0.25550106,0
0.38382575,0.2660135,0
0.42083246,0.20013441,0
0.44060415,0.17925991,0
0.47401986,0.20352925,0
0.50245315,0.22913131,0
0.55670685,0.18629268,0
0.5338332,0.15271285,0
0.5445916,0.24006635,0
0.6445078,0.21240987,0
0.38666928,0.21537872,0
0.32125887,0.3219618,0
0.54239464,0.28355342,0
0.5269418,0.3148149,0
0.45800236,0.18356374,0
0.29112387,0.53628296,0
0.30720985,0.26805225,0
0.3382211,0.3525647,0
0.7397826,0.24328582,0
0.5437018,0.2648333,0
0.5845878,0.30364212,0
0.5650171,0.3450079,0
0.42565113,0.5709458,0
0.38814083,0.2580224,0
0.6732955,0.3232837,0
0.43780175,0.32805297,0
0.6089891,0.14455925,0
0.35605803,0.19793256,0
0.49279344,0.45201635,0
0.2704709,0.26343992,0
0.30754483,0.24945839,0
0.66132087,0.14871089,0
0.3800924,0.15267326,0
0.36164603,0.25315812,0
0.57255125,0.19187501,0
0.3579401,0.18704545,0
0.6083728,0.27673835,0
0.5642371,0.24166958,0
0.35543424,0.25773627,0
0.32395822,0.27681577,0
0.6521911,0.19174603,0
0.4622364,0.15243845,0
0.66699564,0.29937926,0
0.8069854,0.15433255,0
0.42826557,0.24330823,0
0.33790404,0.27185684,0
0.4457733,0.40220478,0
0.509475,0.17029619,0
0.58672935,0.25339866,0
0.76633626,0.18048398,0
0.71696573,0.21894003,0
0.51255965,0.20147176,0
0.6033058,0.19836812,0
0.52504677,0.17305054,0
0.66085494,0.20744057,0
0.4249969,0.18438427,0
0.46611053,0.17466383,0
0.5263009,0.19864425,0
0.48378316,0.32211775,0
0.32737234,0.30717975,0
0.43710628,0.16601108,0
0.4405908,0.2442124,0
0.42550576,0.25463903,0
0.36960712,0.21433643,0
0.5653995,0.12898313,0
0.42717674,0.2125729,0
0.2852972,0.37291017,0
0.43781596,0.23899151,0
0.33400124,0.31681296,0
0.28442428,0.2935387,0
0.34598112,0.28931606,0
0.42139852,0.14749372,0
0.8269825,0.20210443,0
0.7974652,0.33866906,0
0.3872953,0.2977922,0
0.60737175,0.2567083,0
0.28785846,0.36207145,0
0.28628236,0.27314347,0
0.629911,0.12846105,0
0.47645998,0.22687307,0
0.41541755,0.4727938,0
0.3099653,0.26533458,0
0.3955304,0.30633044,0
0.40221226,0.33588868,0
0.4256446,0.3458686,0
0.4311759,0.41999808,0
0.40006205,0.33306012,0
0.37126786,0.21278612,0
0.37878677,0.30585292,0
0.53840065,0.28296474,0
0.52072555,0.18908904,0
0.3371717,0.32017037,0
0.3664113,0.21214683,0
0.3774542,0.35750303,0
0.28193834,0.3954607,0
0.41473815,0.18763976,0
0.42191854,0.37089172,0
0.3850928,0.41075587,0
0.5709442,0.23601995,0
0.4320133,0.1872281,0
0.28576505,0.34913322,0
0.47859338,0.23141049,0
0.48725182,0.1866277,0
0.33853382,0.48921734,0
0.5313517,0.27221516,0
0.44380432,0.19563562,0
0.42881376,0.24344036,0
0.20661142,0.35820988,0
0.2879963,0.22713958,0
0.4772065,0.19228071,0
0.47987652,0.20898826,0
0.48119143,0.48309508,0
0.28194836,0.2647932,0
0.75554544,0.1370377,0
0.5826891,0.20204711,0
0.42111316,0.21560913,0
0.298549,0.33299544,0
0.4224544,0.28142786,0
0.41704425,0.18873708,0
0.70911807,0.21767043,0
0.6693786,0.19589122,0
0.4872432,0.23387292,0
0.6478983,0.13713315,0
0.4071996,0.280577,0
0.6454818,0.131747,0
0.443436,0.33315194,0
0.5108779,0.16929242,0
0.56450665,0.30807108,0
0.45004064,0.17694245,0
0.3366105,0.23832364,0
0.52439874,0.2490461,0
0.7230826,0.3083802,0
0.27963838,0.24106473,0
0.40658572,0.26056165,0
0.36030173,0.42341167,0
0.7001854,0.21385603,0
0.44759148,0.25428814,0
0.40387425,0.17596295,0
0.35783005,0.21756178,0
0.41950667,0.1823262,0
0.7292447,0.3391876,0
0.63553435,0.17720763,0
0.56548107,0.19105724,0
0.2767832,0.2153608,0
0.53780305,0.2254009,0
0.46073562,0.1877601,0
0.28367135,0.3131123,0
0.84039456,0.17567697,0
0.33517846,0.28982985,0
0.661573,0.23168069,0
0.34987888,0.29223144,0
0.5500604,0.1372045,0
0.2889906,0.5016779,0
0.7592122,0.22247832,0
0.55303264,0.16856468,0
0.6076028,0.19071314,0
0.57196456,0.14671874,0
0.48236826,0.21549389,0
0.30781686,0.3168071,0
0.5890605,0.13397484,0
0.60333055,0.144922,0
0.50385886,0.30350134,0
0.7354586,0.2377419,0
0.5166026,0.12521154,0
0.8189171,0.15076523,0
0.7708189,0.13096236,0
0.44334215,0.21728048,0
0.40305746,0.21261042,0
0.49887553,0.35445073,0
0.26336047,0.28843245,0
0.45833948,0.24189459,0
0.60300696,0.189618,0
0.26547056,0.36354485,0
0.5710591,0.35182646,0
0.5354145,0.21957524,0
0.7876244,0.23614436,0
0.66850746,0.19987424,0
0.76803505,0.23143832,0
0.81807613,0.1499801,0
0.44336677,0.2322833,0
0.52196586,0.28789577,0
0.41989514,0.23570445,0
0.30495143,0.21455368,0
0.3094463,0.24658391,0
0.5353451,0.3940706,0
0.41258875,0.17188765,0
0.48859835,0.22819792,0
0.59016484,0.17189252,0
0.43003684,0.41553238,0
0.40763876,0.49068964,0
0.380523,0.32415694,0
0.56333077,0.19856097,0
0.6164095,0.16785693,0
0.3457594,0.26267248,0
0.31861827,0.3526941,0
0.3031619,0.24051586,0
0.6155256,0.2568401,0
0.38420448,0.2419695,0
0.35324293,0.22081946,0
0.5750737,0.17641184,0
0.27819204,0.32025105,0
0.5474522,0.25244388,0
0.30362058,0.21780062,0
0.5258582,0.20215344,0
0.4728054,0.18689153,0
0.53996044,0.19281854,0
0.37636858,0.34430224,0
0.4066239,0.3131672,0
0.34514222,0.65141207,0
0.33617935,0.26932225,0
0.5884521,0.1478192,0
0.5689586,0.24528955,0
0.4535803,0.28570443,0
0.30576372,0.24096327,0
0.49843505,0.15927273,0
0.416741,0.26010615,0
0.50300753,0.3926496,0
0.51206595,0.36778384,0
0.5701325,0.19918098,0
0.7317197,0.20604703,0
0.4647968,0.30564782,0
0.72876775,0.19208267,0
0.69118804,0.15800352,0
0.53270596,0.13464156,0
0.6880719,0.19174443,0
0.42900854,0.2236527,0
0.4548895,0.24930225,0
0.4024083,0.24735408,0
0.3510553,0.40456736,0
0.4401473,0.24029583,0
0.46945927,0.4437678,0
0.47496065,0.295117,0
0.576744,0.2533987,0
0.68161875,0.21595363,0
0.61926204,0.17262183,0
0.62132525,0.1399039,0
0.7071353,0.27115813,0
0.78568715,0.26489016,0
0.66777766,0.23598471,0
0.5521911,0.1817196,0
0.48102856,0.34210008,0
0.6781827,0.18015271,0
0.46197802,0.33008093,0
0.6182247,0.22081327,0
0.7357375,0.20669512,0
0.5533342,0.3569375,0
0.68671983,0.16658767,0
0.7352787,0.16850376,0
0.59562963,0.28724033,0
0.60849905,0.24774505,0
0.4208713,0.2839045,0
0.6988116,0.34638855,0
0.5350841,0.3090037,0
0.41494533,0.28985664,0
0.6781539,0.2960464,0
0.38320833,0.2523123,0
0.48573014,0.2154466,0
0.52780783,0.2005988,0
0.54354995,0.4890557,0
0.5608015,0.15628983,0
0.3836697,0.16133186,0
0.5304514,0.2625678,0
0.46930704,0.17789745,0
0.5545805,0.14598504,0
0.63412553,0.15194975,0
0.6580775,0.14064915,0
0.6505248,0.32460406,0
0.6551021,0.2179627,0
0.54099005,0.16498545,0
0.4893749,0.20524298,0
0.59970766,0.3781445,0
0.46555218,0.22427337,0
0.41702744,0.35553005,0
0.5066494,0.22223918,0
0.46329135,0.2094732,0
0.4315396,0.28168514,0
0.53443533,0.3168931,0
0.6550795,0.35990322,0
0.6451542,0.14948656,0
0.3639182,0.37202346,0
0.6358651,0.16466814,0
0.7158401,0.1379963,0
0.6308264,0.21222854,0
0.45997044,0.25754052,0
0.69239855,0.12351808,0
0.61353415,0.2765323,0
0.5711597,0.26993528,0
0.57932895,0.16235398,0
0.68880373,0.2546708,0
0.6988402,0.33545706,0
0.46422172,0.33373955,0
0.6008456,0.17818555,0
0.5949332,0.16855541,0
0.44905385,0.3262554,0
0.48729047,0.2933515,0
0.60570085,0.20190729,0
0.45643803,0.23757145,0
0.28594047,0.5399106,0
0.35878775,0.35248128,0
0.5637588,0.34004536,0
0.4930954,0.33375055,0
0.39080495,0.3922437,0
0.4873629,0.16748755,0
0.56025743,0.33269876,0
0.24007396,0.5908964,0
0.61967874,0.2214851,0
0.56398857,0.29141763,0
0.5608033,0.4692519,0
0.2819903,0.3554257,0
0.38427275,0.23327012,0
0.5665925,0.19024692,0
0.4768077,0.28896162,0
0.3975356,0.19090445,0
0.35678324,0.2027642,0
0.5479454,0.22377957,0
0.4077216,0.23579487,0
0.56914026,0.21764249,0
0.52065516,0.18756528,0
0.7062609,0.19864583,0
0.6067757,0.23258989,0
0.5141318,0.5120191,0
0.42799488,0.25911367,0
0.30060703,0.36005968,0
0.7733098,0.17609388,0
0.5587984,0.22331029,0
0.62483805,0.21903959,0
0.71775866,0.23027432,0
0.68852264,0.2315432,0
0.53215444,0.21150458,0
0.78241897,0.1386951,0
0.7660265,0.12819164,0
0.7339548,0.123608954,0
0.56019735,0.2974679,0
0.76218367,0.1268847,0
0.80005914,0.14754988,0
0.64312786,0.18932171,0
0.7199168,0.26243228,0
0.69805825,0.16742183,0
0.7555165,0.20280756,0
0.755772,0.18240832,0
0.79887795,0.2058828,0
0.58623314,0.16647534,0
0.72734046,0.22143058,0
0.72558945,0.18240032,0
0.6479544,0.17438169,0
0.68613416,0.22192465,0
0.7015922,0.22111702,0
0.6677635,0.19961736,0
0.55895954,0.16455834,0
0.6407608,0.1620728,0
0.68152785,0.30073628,0
0.6728816,0.12750748,0
0.60469365,0.26178938,0
0.57228214,0.3795188,0
0.77395606,0.18121363,0
0.61974823,0.22165309,0
0.67727655,0.23704965,0
0.64804894,0.17761192,0
0.5552625,0.16327327,0
0.36276364,0.26853952,0
0.6602991,0.29136464,0
0.4607812,0.4094318,0
0.7670495,0.52170366,0
0.6340522,0.21782273,0
0.5412828,0.36551204,0
0.6892985,0.24075033,0
0.6122432,0.22875094,0
0.6451658,0.32990494,0
0.55803895,0.27009505,0
0.56587315,0.3775767,0
0.55541134,0.39407212,0
0.6074974,0.3849981,0
0.44692335,0.37795192,0
0.45772186,0.29933757,0
0.63223684,0.4250879,0
0.6763064,0.14879593,0
0.59366965,0.2930843,0
0.48641494,0.16729523,0
0.7763837,0.26641762,0
0.7799312,0.29674855,0
0.49788958,0.45856434,0
0.43509224,0.35268232,0
0.60992986,0.25431478,0
0.2921558,0.46530688,0
0.36982587,0.39029855,0
0.7166546,0.19692206,0
0.6444295,0.22175604,0
0.53455836,0.23840068,0
0.6256441,0.17536159,0
0.6828274,0.23302507,0
0.65501314,0.2220681,0
0.7701703,0.37995663,0
0.63109803,0.24903233,0
0.57316387,0.38468948,0
0.58941853,0.25356737,0
0.54055715,0.29736498,0
0.7539183,0.3735558,0
0.32313055,0.34882352,0
0.32778254,0.34509265,0
0.35851693,0.31459248,0
0.40478387,0.32678103,0
0.84564805,0.19822715,0
0.32179403,0.37267107,0
0.2912151,0.24090454,0
0.29991826,0.27960163,0
0.36405393,0.48638952,0
0.47275755,0.43374342,0
0.6054308,0.33886477,0
0.58928084,0.12513919,0
0.5473042,0.35581443,0
0.3404189,0.21167335,0
0.30296135,0.37478998,0
0.70291257,0.239656,0
0.6608029,0.5180585,0
0.27013016,0.3873027,0
0.3541138,0.12836811,0
0.57585466,0.15731,0
0.41383785,0.18119147,0
0.6795078,0.3192139,0
0.4109701,0.17868802,0
0.4331729,0.18970777,0
0.26962563,0.38286003,0
0.40983203,0.34178853,0
0.39920977,0.3498229,0
0.3432978,0.18995298,0
0.34713745,0.28439713,0
0.5217112,0.36577216,0
0.3963848,0.2902941,0
0.53096586,0.41205508,0
0.3566179,0.35875422,0
0.33102146,0.48221132,0
0.65495884,0.24594109,0
0.5855221,0.2985514,0
0.35644197,0.3539183,0
0.5828408,0.2933675,0
0.5145874,0.19406617,0
0.40591908,0.2764683,0
0.49599636,0.36678895,0
0.5515478,0.4482621,0
0.45194143,0.26368865,0
0.3623915,0.37676764,0
0.5311771,0.40840462,0
0.66550195,0.21876535,0
0.4848903,0.46224475,0
0.6695165,0.24032484,0
0.4331781,0.5654953,0
0.67396474,0.19050822,0
0.56214005,0.20453814,0
0.723305,0.20251428,0
0.5892726,0.21232988,0
0.43508872,0.36812317,0
0.5904068,0.16141354,0
0.4385334,0.25731748,0
0.40063074,0.27634495,0
0.32243943,0.22240615,0
0.7268766,0.33330828,0
0.5323432,0.20711142,0
0.45989874,0.5838573,0
0.492396,0.30735883,0
0.57852334,0.23404749,0
0.4334148,0.3457636,0
0.4934849,0.23300007,0
0.47699556,0.29095572,0
0.57875055,0.2008389,0
0.43951762,0.55938965,0
0.5213719,0.31368712,0
0.65067416,0.16023982,0
0.43768272,0.1800446,0
0.49508503,0.2912058,0
0.67888695,0.15006968,0
0.63802284,0.16921127,0
0.52422875,0.36583954,0
0.45577917,0.16490012,0
0.6644633,0.16669536,0
0.7034392,0.20096537,0
0.6861444,0.37315038,0
0.56380934,0.3109077,0
0.4885941,0.21254532,0
0.407976,0.28714535,0
0.47379592,0.25608498,0
0.40872896,0.3608053,0
0.3185447,0.29826072,0
0.48695713,0.24399874,0
0.36406824,0.3081603,0
0.46359223,0.33267885,0
0.64388347,0.39334753,0
0.555495,0.212383,0
0.62493485,0.24097462,0
0.60812056,0.17817967,0
0.4443353,0.15636666,0
0.6748626,0.21314439,0
0.33674282,0.2049687,0
0.3884518,0.3060667,0
0.66152805,0.14301245,0
0.70250505,0.33428714,0
0.6399289,0.1863495,0
0.6296699,0.19432423,0
0.63534176,0.18674207,0
0.5740232,0.15552749,0
0.39964437,0.22810979,0
0.6276084,0.23068386,0
0.20184386,0.4856991,0
0.27952978,0.30893034,0
0.8222858,0.24880141,0
0.41627914,0.28213295,0
0.7233299,0.16199677,0
0.43759027,0.19158953,0
0.7491237,0.14651173,0
0.3718471,0.22359742,0
0.31882304,0.20628422,0
0.27664024,0.23468462,0
0.5970609,0.17191294,0
0.52976716,0.2436881,0
0.430978,0.22835118,0
0.44212216,0.25016516,0
0.31998613,0.31134063,0
0.34810314,0.27123016,0
0.49995393,0.23984663,0
0.33497664,0.20744498,0
0.60086703,0.48825303,0
0.38997787,0.5344954,0
0.43615916,0.21205394,0
0.46129233,0.19671094,0
0.2974302,0.3001864,0
0.36042047,0.21506806,0
0.37745214,0.21831843,0
0.56813943,0.1477078,0
0.5624192,0.33790267,0
0.6315787,0.18224089,0
0.72243106,0.2697201,0
0.5345534,0.13870078,0
0.6325817,0.11225166,0
0.58210725,0.13559394,0
0.3412717,0.24418476,0
0.67490315,0.26550576,0
0.4350389,0.482495,0
0.76871973,0.12758818,0
0.4538458,0.3617106,0
0.43659803,0.31208652,0
0.541093,0.15582147,0
0.47357932,0.18288873,0
0.5191057,0.14470161,0
0.6534575,0.1428338,0
0.43730506,0.16609803,0
0.37319046,0.25796756,0
0.43911752,0.36022085,0
0.7181472,0.1715626,0
0.40797886,0.2896002,0
0.3823155,0.25703302,0
0.31726995,0.2528087,0
0.6546645,0.15595655,0
0.6276206,0.17254485,0
0.3309267,0.18494883,0
0.3908303,0.23952144,0
0.4572992,0.20461056,0
0.3986734,0.2456365,0
0.49723536,0.19345395,0
0.4078867,0.22577749,0
0.5197646,0.1841142,0
0.4899498,0.34167156,0
0.6195598,0.13641271,0
0.5612695,0.46873316,0
0.42029834,0.19703825,0
0.43254566,0.18184374,0
0.5186167,0.19190781,0
0.49785453,0.22168209,0
0.40662158,0.46983665,0
0.35199848,0.23697554,0
0.27976254,0.32214877,0
0.49762195,0.30372658,0
0.44474787,0.3769661,0
0.5113386,0.32382178,0
0.34858507,0.20383705,0
0.33591783,0.21735735,0
0.7218273,0.15267152,0
0.4530549,0.1632093,0
0.37304118,0.19964816,0
0.3572884,0.18577123,0
0.64596677,0.13948889,0
0.6105294,0.17125094,0
0.45186773,0.1737815,0
0.7037933,0.17690513,0
0.4480979,0.25374958,0
0.562996,0.31585607,0
0.4012213,0.3902923,0
0.6367695,0.17432423,0
0.36582834,0.29372817,0
0.6173673,0.20626152,0
0.33656138,0.27347365,0
0.7490354,0.13378647,0
0.2641342,0.29920042,0
0.31694123,0.20306502,0
0.8283628,0.17491886,0
0.32794344,0.3253952,0
0.3419911,0.21526746,0
0.398608,0.19842741,0
0.44860348,0.2814709,0
0.47620887,0.16542508,0
0.42332983,0.30399176,0
0.53895164,0.28537643,0
0.3018261,0.5276418,0
0.67094773,0.22394115,0
0.744589,0.15960024,0
0.4466815,0.16935214,0
0.51879054,0.49870637,0
0.70982796,0.3421631,0
0.60170877,0.18335803,0
0.45208466,0.22478607,0
0.3941939,0.18324025,0
0.31580806,0.40210477,0
0.7182014,0.15329534,0
0.27389196,0.310833,0
0.6059208,0.3085184,0
0.4814665,0.18372495,0
0.39296004,0.22429071,0
0.58088195,0.28321666,0
0.45251334,0.16079815,0
0.4153911,0.25840455,0
0.6051343,0.24242447,0
0.49681607,0.15660264,0
0.49425706,0.26920328,0
0.47921562,0.27239025,0
0.5144531,0.17337635,0
0.48531345,0.33609667,0
0.47188833,0.22008844,0
0.42244148,0.2656778,0
0.6396822,0.12367277,0
0.43386796,0.20597215,0
0.46349475,0.29862523,0
0.74234486,0.24983251,0
0.5568488,0.16446178,0
0.25726292,0.3040323,0
0.29391217,0.21130131,0
0.36009753,0.21522474,0
0.4031511,0.3271142,0
0.41380343,0.4034042,0
0.6149062,0.122948326,0
0.37858814,0.22602642,0
0.36318493,0.25273767,0
0.30799747,0.25072452,0
0.52453953,0.19866525,0
0.35939306,0.5132612,0
0.5378767,0.4883806,0
0.39100063,0.23508336,0
0.6576599,0.1372793,0
0.36154577,0.23003614,0
0.43622634,0.43976182,0
0.32433516,0.24274975,0
0.7917001,0.16821983,0
0.52318007,0.24511832,0
0.25721502,0.35353297,0
0.5657051,0.16031209,0
0.65422565,0.2750552,0
0.377478,0.4053813,0
0.4304887,0.49038097,0
0.5035821,0.47110328,0
0.29645553,0.4210588,0
0.32175115,0.31659704,0
0.2798299,0.27614158,0
0.3653617,0.37677982,0
0.2577543,0.23186375,0
0.5621411,0.31672713,0
0.45608306,0.41278124,0
0.40346062,0.45909652,0
0.5442904,0.18940382,0
0.4148029,0.31394482,0
0.36824235,0.16293912,0
0.5317056,0.24846813,0
0.42640415,0.20596269,0
0.45608312,0.30886313,0
0.60139775,0.42291054,0
0.43603188,0.42869848,0
0.6330101,0.26809236,0
0.4251691,0.17399305,0
0.45275298,0.20275325,0
0.7069153,0.16720445,0
0.79121375,0.20671186,0
0.5368956,0.26851103,0
0.37643087,0.37339413,0
0.44186747,0.36603957,0
0.36759928,0.31372342,0
0.57963234,0.2449116,0
0.36282286,0.22018488,0
0.6117889,0.12282911,0
0.3661215,0.3984363,0
0.40610236,0.31829238,0
0.78294843,0.13815902,0
0.4238428,0.20141138,0
0.3429331,0.265719,0
0.3578839,0.27501377,0
0.44509408,0.3245878,0
0.3548788,0.25726888,0
0.4737956,0.31607866,0
0.3240818,0.27165157,0
0.41555443,0.43261495,0
0.45890254,0.22069202,0
0.46954963,0.14447129,0
0.58582896,0.19434059,0
0.46249226,0.50756264,0
0.25081834,0.59080625,0
0.39509317,0.34561813,0
0.44110534,0.1886748,0
0.4955627,0.3110238,0
0.5687778,0.28078002,0
0.4033098,0.2540705,0
0.35251147,0.23439322,0
0.29599375,0.2327722,0
0.32762006,0.32489148,0
0.32237908,0.24422562,0
0.31050384,0.31270242,0
0.37763518,0.36021137,0
0.6208581,0.14130235,0
0.47085375,0.24646732,0
0.33143097,0.18003194,0
0.5303084,0.24487121,0
0.40737575,0.24889295,0
0.6095137,0.2744326,0
0.44106188,0.2191554,0
0.526704,0.49504915,0
0.31606388,0.27643085,0
0.70497054,0.44166663,0
0.29699016,0.20763807,0
0.7030461,0.14677194,0
0.5440186,0.15167798,0
0.62887853,0.1752728,0
0.50399464,0.22531423,0
0.51133573,0.40564364,0
0.46362346,0.30862677,0
0.36718044,0.17659514,0
0.66678274,0.15267561,0
0.3226648,0.29467013,0
0.44602826,0.351408,0
0.35901797,0.28529665,0
0.6012153,0.13463877,0
0.41940844,0.2080026,0
0.39890575,0.27791545,0
0.7375873,0.17118013,0
0.4580634,0.39569074,0
0.4498172,0.38460094,0
0.6438752,0.3103184,0
0.37542382,0.2443274,0
0.41799167,0.38739458,0
0.24111465,0.25893548,0
0.30939814,0.38192138,0
0.35989827,0.46466008,0
0.2878943,0.5019675,0
0.3964348,0.18389896,0
0.38515818,0.5869107,0
0.33768988,0.23731858,0
0.40173227,0.18589896,0
0.572367,0.47555012,0
0.3143059,0.268989,0
0.29140416,0.28715795,0
0.20164718,0.43737713,0
0.26492456,0.3041166,0
0.5975872,0.3296717,0
0.31473508,0.22860217,0
0.584078,0.15593225,0
0.33376744,0.33664727,0
0.33159068,0.2041759,0
0.44388,0.14648472,0
0.38642597,0.18980452,0
0.31804526,0.34270912,0
0.40265307,0.25261098,0
0.5138583,0.2962833,0
0.49702883,0.12978117,0
0.30353144,0.5669658,0
0.51388705,0.29752716,0
0.2419321,0.65234596,0
0.41660556,0.20562519,0
0.41162136,0.3983345,0
0.39614105,0.5661631,0
0.23861752,0.4746929,0
0.70237815,0.25234124,0
0.45198178,0.1956119,0
0.45201802,0.20313343,0
0.6015517,0.15900765,0
0.6424076,0.26986575,0
0.62446195,0.23790348,0
0.48797828,0.1863021,0
0.7222563,0.2770655,0
0.45794806,0.2544753,0
0.56533164,0.25560385,0
0.43512374,0.17570446,0
0.82011867,0.15547568,0
0.51978946,0.14792691,0
0.7038407,0.142914,0
0.3621957,0.22972894,0
0.3934885,0.22682247,0
0.4596612,0.24102148,0
0.47304338,0.20086706,0
0.35377336,0.3140305,0
0.40783682,0.18937244,0
0.3302838,0.26237217,0
0.26724264,0.3015183,0
0.5395626,0.34755757,0
0.46761307,0.25990066,0
0.41785276,0.28215545,0
0.40780693,0.23823333,0
0.5280185,0.23339696,0
0.5276124,0.13738208,0
0.38500148,0.24484365,0
0.43850437,0.41102484,0
0.5759129,0.28154245,0
0.4717747,0.18431039,0
0.6965298,0.21202745,0
0.7930849,0.24198292,0
0.57924706,0.66949296,0
0.4886187,0.32496303,0
0.30503976,0.42633432,0
0.5539087,0.20643674,0
0.45533276,0.22024111,0
0.54589975,0.2102103,0
0.5875229,0.29713798,0
0.46233338,0.27130744,0
0.5215944,0.2142947,0
0.81531614,0.25610766,0
0.60485333,0.2657185,0
0.41238543,0.20384884,0
0.5286664,0.21057993,0
0.5487616,0.13729802,0
0.5928741,0.1889661,0
0.44961157,0.18949816,0
0.512653,0.19167246,0
0.52894,0.3599274,0
0.36690977,0.20336404,0
0.42005247,0.21106976,0
0.6031357,0.16932422,0
0.6412917,0.268998,0
0.51421756,0.15280436,0
0.23888499,0.36367452,0
0.53330654,0.31371468,0
0.44202462,0.24322297,0
0.37458897,0.1834973,0
0.33723855,0.26607898,0
0.5794444,0.28071043,0
0.5174735,0.14772545,0
0.21123092,0.4115906,0
0.7016386,0.17390186,0
0.29009643,0.2900608,0
0.39558464,0.2496738,0
0.5649012,0.31427056,0
0.67383945,0.23827255,0
0.40853125,0.26013246,0
0.38442025,0.3108646,0
0.2977751,0.26419133,0
0.4817379,0.21883985,0
0.4262459,0.24745072,0
0.352542,0.21067668,0
0.3753025,0.42372024,0
0.41798526,0.423817,0
0.32635587,0.19492996,0
0.538558,0.30709398,0
0.4532794,0.23124598,0
0.8105093,0.1593545,0
0.28152093,0.24670623,0
0.40867275,0.16921313,0
0.58889353,0.19874907,0
0.47075093,0.20740308,0
0.24675465,0.32273224,0
0.73683584,0.35954717,0
0.56068885,0.18289448,0
0.5308631,0.18245578,0
0.5211287,0.1618393,0
0.31562072,0.28741518,0
0.5196831,0.18191627,0
0.66950005,0.30524287,0
0.26890546,0.22628072,0
0.39773688,0.31627247,0
0.49528545,0.29136705,0
0.5415392,0.27526897,0
0.41035458,0.27709714,0
0.40333417,0.32545093,0
0.3953346,0.32848763,0
0.32168728,0.26764148,0
0.4012619,0.2880198,0
0.5329043,0.24379006,0
0.48298484,0.19321269,0
0.61901826,0.28158745,0
0.35027945,0.25371906,0
0.38497174,0.32503438,0
0.39820182,0.14208972,0
0.34660655,0.23442666,0
0.23925571,0.42631868,0
0.6389254,0.29175654,0
0.48707223,0.22068678,0
0.70073974,0.15833798,0
0.2592313,0.24308059,0
0.5266693,0.21227323,0
0.6513448,0.32690614,0
0.42359638,0.1831553,0
0.36917618,0.25376216,0
0.43968242,0.40512997,0
0.21624511,0.31657103,0
0.71035546,0.1568236,0
0.3768207,0.17229697,0
0.47646642,0.40810764,0
0.33924672,0.2840461,0
0.56504184,0.23341879,0
0.63975745,0.32092485,0
0.6076076,0.34487998,0
0.58168006,0.2295643,0
0.77236176,0.24374427,0
0.33128226,0.24328825,0
0.6192297,0.23048083,0
0.67512494,0.21235241,0
0.59257984,0.4896161,0
0.3187907,0.39699104,0
0.41185245,0.30566424,0
0.1350672,0.76370794,1
0.19401832,0.80103064,1
0.12036944,0.71319664,1
0.3004456,0.8797379,1
0.12515879,0.6460287,1
0.18165706,0.81732494,1
0.1490295,0.7464694,1
0.23157257,0.86405975,1
0.16312072,0.72657347,1
0.20848638,0.85120314,1
0.15253602,0.7725818,1
0.16102476,0.8159902,1
0.18962805,0.83288956,1
0.14811234,0.81152725,1
0.19479254,0.8587246,1
0.17558108,0.8070272,1
0.12702687,0.70340586,1
0.17570615,0.82899016,1
0.15948038,0.8151128,1
0.17302287,0.823704,1
0.24909024,0.82145,1
0.15239257,0.7524595,1
0.18445317,0.7932484,1
0.20002866,0.822025,1
0.21686958,0.72925615,1
0.14610009,0.7780434,1
0.17395368,0.7958867,1
0.18255416,0.8213564,1
0.1865783,0.7832679,1
0.1702958,0.8263563,1
0.18177974,0.69422543,1
0.2149576,0.85045207,1
0.17609872,0.7179557,1
0.15942165,0.7456712,1
0.16490476,0.6744187,1
0.16099614,0.77070314,1
0.17191581,0.7951221,1
0.23888198,0.8112382,1
0.1629756,0.8004056,1
0.16099261,0.82583636,1
0.13300276,0.74086696,1
0.17567179,0.769393,1
0.18072666,0.8323496,1
0.14375857,0.77820957,1
0.17871995,0.8313863,1
0.17948216,0.83044475,1
0.16312326,0.8144958,1
0.17176852,0.8065236,1
0.17787339,0.8352592,1
0.13454087,0.7625731,1
0.19836135,0.72561646,1
0.19102725,0.8423623,1
0.20324269,0.79689276,1
0.15513715,0.79055816,1
0.23219697,0.7940169,1
0.1576682,0.79113454,1
0.28128627,0.8459768,1
0.13108633,0.58760214,1
0.167829,0.78378135,1
0.13694197,0.6659431,1
0.15761663,0.64860296,1
0.19564264,0.7015437,1
0.1406535,0.7273972,1
0.26630253,0.73735785,1
0.1623801,0.7267107,1
0.1481235,0.68946886,1
0.14759214,0.7886079,1
0.2506286,0.80981386,1
0.14672889,0.75608355,1
0.15139963,0.7957155,1
0.1616012,0.7950567,1
0.21776493,0.78415555,1
0.19227678,0.64628637,1
0.14653765,0.77861667,1
0.18238448,0.80305326,1
0.17818218,0.7303642,1
0.15009196,0.5829126,1
0.16176422,0.8074723,1
0.14662865,0.7664984,1
0.21097828,0.8695667,1
0.1807682,0.80750936,1
0.16652378,0.62738925,1
0.16945414,0.7362274,1
0.116055906,0.6826567,1
0.23458846,0.8444339,1
0.11417412,0.52315474,1
0.19777603,0.7321745,1
0.17786962,0.8026281,1
0.15108567,0.61911243,1
0.20304933,0.7001724,1
0.30379564,0.8266533,1
0.16609135,0.74220943,1
0.1476348,0.76411754,1
0.17564191,0.8271336,1
0.17413625,0.6773497,1
0.1624175,0.6438893,1
0.15181863,0.7662073,1
0.14385535,0.7075842,1
0.15455322,0.7463783,1
0.17003675,0.64951557,1
0.29232237,0.8216091,1
0.1304171,0.7352246,1
0.24166103,0.7598941,1
0.12662816,0.7078556,1
0.123956054,0.69592184,1
0.14220354,0.7420065,1
0.13841231,0.7767801,1
0.16474572,0.798298,1
0.14247885,0.7835661,1
0.22474878,0.86355656,1
0.15483862,0.7904436,1
0.22738561,0.87240416,1
0.14775953,0.71815217,1
0.14619218,0.6249639,1
0.17328234,0.816552,1
0.14145058,0.7535562,1
0.1487318,0.7415736,1
0.16234916,0.7720809,1
0.16312206,0.76456094,1
0.1204129,0.66647005,1
0.15432478,0.778386,1
0.12758034,0.7173983,1
0.14729774,0.74756896,1
0.18018587,0.7987384,1
0.15481937,0.7791337,1
0.23082735,0.84850705,1
0.1464321,0.77542746,1
0.13231163,0.7120012,1
0.22688228,0.8658165,1
0.14260615,0.71648645,1
0.14168449,0.7580432,1
0.20973009,0.86919814,1
0.16191308,0.80471367,1
0.14468972,0.7133044,1
0.15914588,0.8097521,1
0.16163225,0.80441487,1
0.17057277,0.7347111,1
0.14707479,0.7658855,1
0.30122578,0.87584984,1
0.20486906,0.85845435,1
0.17139597,0.81028455,1
0.18215877,0.81853694,1
0.22821772,0.81682354,1
0.15726191,0.8086174,1
0.22323698,0.7721847,1
0.1420017,0.78525263,1
0.19499744,0.7884579,1
0.13204283,0.76501024,1
0.16719815,0.82548976,1
0.1660406,0.7904297,1
0.12266348,0.67323,1
0.17823882,0.8449418,1
0.16938202,0.82141477,1
0.20564398,0.81508243,1
0.16242748,0.80229056,1
0.20092447,0.8475365,1
0.16830564,0.7335666,1
0.23008479,0.8237505,1
0.16928232,0.80971074,1
0.20705222,0.8582266,1
0.16175689,0.8175122,1
0.16764258,0.8222913,1
0.17256363,0.7896442,1
0.17499973,0.830389,1
0.18237393,0.84449077,1
0.19888556,0.83123803,1
0.2250863,0.8421183,1
0.15991907,0.81963366,1
0.15037057,0.685846,1
0.19583952,0.7800863,1
0.16297363,0.74857616,1
0.12726174,0.64969003,1
0.16034514,0.65074784,1
0.1563827,0.8070234,1
0.20419931,0.78656626,1
0.31438443,0.88279104,1
0.14172283,0.691978,1
0.20105863,0.80679655,1
0.1520938,0.6163437,1
0.15336074,0.7526323,1
0.17356567,0.8117921,1
0.15898111,0.7283025,1
0.17868225,0.7529775,1
0.2155832,0.86653507,1
0.17217192,0.7621913,1
0.20915863,0.865273,1
0.19201012,0.8514608,1
0.14499818,0.75710374,1
0.24959475,0.84870785,1
0.25324854,0.88273966,1
0.17151022,0.8179088,1
0.15307733,0.7732239,1
0.18217362,0.82042927,1
0.16294566,0.811973,1
0.18359712,0.7850737,1
0.19993033,0.7659354,1
0.25188902,0.85194105,1
0.18320815,0.73635876,1
0.14484276,0.8191079,1
0.18179424,0.8371715,1
0.21758546,0.8498681,1
0.21704854,0.78079337,1
0.20058005,0.8336672,1
0.15673707,0.81029224,1
0.23987755,0.8478308,1
0.17261532,0.81727517,1
0.17523256,0.8101495,1
0.24420506,0.8750116,1
0.2203218,0.87354153,1
0.185548,0.7675733,1
0.16960737,0.73201585,1
0.16133289,0.7856458,1
0.19004221,0.7901162,1
0.17338538,0.7861077,1
0.18060616,0.83329004,1
0.27351415,0.887039,1
0.16986004,0.6197514,1
0.23423152,0.7858681,1
0.14855756,0.7170625,1
0.18189481,0.8340684,1
0.19698483,0.7695082,1
0.1659968,0.7645567,1
0.17336397,0.7888849,1
0.28038275,0.88859266,1
0.29190677,0.88576305,1
0.32786235,0.8778192,1
0.17138648,0.7781411,1
0.27126846,0.87909955,1
0.32016957,0.88242453,1
0.2770139,0.8747904,1
0.28454468,0.88503295,1
0.26022092,0.8906371,1
0.23914173,0.87337744,1
0.16830124,0.729019,1
0.2520142,0.7737102,1
0.22395861,0.8413691,1
0.29999867,0.88541955,1
0.14969958,0.7227682,1
0.34530503,0.8580562,1
0.35826746,0.85056466,1
0.15303133,0.7889471,1
0.16356017,0.7492397,1
0.18645576,0.663944,1
0.16301915,0.71250784,1
0.21271883,0.8435558,1
0.16884214,0.6899091,1
0.22216116,0.7669432,1
0.20741025,0.79526216,1
0.22800712,0.8732489,1
0.14133069,0.7011967,1
0.23721746,0.853515,1
0.17123486,0.8062303,1
0.1760488,0.79679596,1
0.2523896,0.75635374,1
0.16077003,0.77099717,1
0.19095579,0.79103726,1
0.15251966,0.79385585,1
0.15511543,0.7195147,1
0.25887126,0.87314755,1
0.15752506,0.78047794,1
0.16989224,0.7178714,1
0.14071532,0.7402475,1
0.27978867,0.8835601,1
0.16652171,0.7011562,1
0.36310062,0.8505782,1
0.1839208,0.7835976,1
0.23212881,0.8244575,1
0.33023128,0.8462,1
0.31529856,0.8575112,1
0.27574486,0.8790435,1
0.25159895,0.8719894,1
0.2734443,0.7728134,1
0.26973927,0.82760024,1
0.29471412,0.881523,1
0.33422083,0.8611871,1
0.27103275,0.8827313,1
0.113005504,0.5838682,1
0.14797,0.66134655,1
0.16672221,0.7906948,1
0.16969626,0.8045953,1
0.14646679,0.7811256,1
0.16496547,0.81545424,1
0.1329486,0.7039837,1
0.18739562,0.8384582,1
0.12105769,0.70035154,1
0.11152566,0.62005615,1
0.1364567,0.6593514,1
0.16691189,0.7834624,1
0.123336196,0.67794293,1
0.2005018,0.8546193,1
0.12840556,0.69229335,1
0.12343339,0.6872514,1
0.1933401,0.8057932,1
0.13788922,0.70856255,1
0.10883863,0.6849013,1
0.1568103,0.76006687,1
0.13408929,0.65976197,1
0.20366202,0.73725617,1
0.14924954,0.6846706,1
0.1636866,0.77064466,1
0.12999278,0.7016559,1
0.22164908,0.69596905,1
0.1570963,0.6918576,1
0.15944193,0.73501194,1
0.14888453,0.7535609,1
0.19742367,0.83254355,1
0.11532675,0.6885165,1
0.20638156,0.8634706,1
0.15982562,0.80306685,1
0.2254784,0.8452695,1
0.20845565,0.86485,1
0.16493984,0.7738378,1
0.2357594,0.8617503,1
0.13713016,0.7869888,1
0.17210828,0.83315444,1
0.19992039,0.84566927,1
0.19714732,0.8131596,1
0.18691197,0.8112186,1
0.17686714,0.77861995,1
0.19937626,0.7949075,1
0.14877945,0.8074164,1
0.15325636,0.8009883,1
0.15478939,0.78786165,1
0.16518345,0.8108994,1
0.19328825,0.8278722,1
0.21922088,0.8625169,1
0.16036639,0.6630158,1
0.19353889,0.8130495,1
0.17103003,0.68510735,1
0.23423363,0.86829436,1
0.1333058,0.71912795,1
0.1739279,0.8235764,1
0.14397292,0.7759368,1
0.13636447,0.7158182,1
0.12775202,0.66068006,1
0.22116284,0.8622908,1
0.13900426,0.7161128,1
0.23743895,0.8463398,1
0.18237846,0.8266096,1
0.1916564,0.83444625,1
0.19255514,0.847367,1
0.22862326,0.84790653,1
0.2047255,0.83880025,1
0.20089762,0.81186837,1
0.12206495,0.6541666,1
0.15511964,0.788589,1
0.13262847,0.72580034,1
0.15138519,0.7557031,1
0.15156132,0.73972625,1
0.15793635,0.78796613,1
0.2642164,0.8225474,1
0.12361411,0.74831915,1
0.15338121,0.6025955,1
0.12645446,0.7191067,1
0.1395706,0.72464997,1
0.24351527,0.856513,1
0.16115023,0.75475144,1
0.10621492,0.67825705,1
0.17881165,0.69098544,1
0.17165284,0.7141642,1
0.15277009,0.80537724,1
0.23396808,0.86778504,1
0.14155655,0.6996417,1
0.1764109,0.72602445,1
0.16891234,0.81465626,1
0.1814701,0.7527488,1
0.17367621,0.8071906,1
0.16677307,0.8085015,1
0.2108481,0.833788,1
0.1634157,0.7199212,1
0.15998569,0.77823746,1
0.21122512,0.85035115,1
0.23964132,0.8566547,1
0.15740135,0.7658602,1
0.17947692,0.8117743,1
0.19952348,0.8600218,1
0.20708264,0.8364108,1
0.10627582,0.68292755,1
0.14352253,0.7622266,1
0.15813074,0.7808904,1
0.19244038,0.8407006,1
0.19735527,0.85019916,1
0.13278204,0.74450326,1
0.14184245,0.7459023,1
0.19134475,0.8384171,1
0.1684329,0.8226623,1
0.12528265,0.6708356,1
0.11212785,0.6025912,1
0.195358,0.85614675,1
0.12063673,0.728637,1
0.16286662,0.81441593,1
0.21408485,0.85853946,1
0.16753687,0.7331716,1
0.38911608,0.6384867,1
0.118664876,0.670836,1
0.10772115,0.5840445,1
0.16915028,0.6262082,1
0.1270316,0.69911957,1
0.15413767,0.81604725,1
0.12642927,0.7265404,1
0.15329102,0.63217795,1
0.10397658,0.5882863,1
0.13341007,0.7642599,1
0.13121691,0.67135304,1
0.12177557,0.62243384,1
0.120705456,0.60984284,1
0.16910337,0.78490746,1
0.15640871,0.7701904,1
0.16015668,0.7176229,1
0.10819734,0.5714689,1
0.09563413,0.54273885,1
0.111267425,0.6921637,1
0.14106262,0.7466802,1
0.13987659,0.7236823,1
0.10563394,0.6018682,1
0.14453848,0.76137894,1
0.2694872,0.78317314,1
0.14160746,0.7751365,1
0.13262416,0.62476414,1
0.23090814,0.85767627,1
0.1663805,0.7595066,1
0.15926772,0.72924703,1
0.19464414,0.79310757,1
0.13937011,0.7040108,1
0.11859183,0.679574,1
0.14588481,0.78656626,1
0.14811389,0.659132,1
0.13769214,0.7642235,1
0.11294241,0.67860585,1
0.13267781,0.6079878,1
0.11403846,0.7054029,1
0.26838636,0.54951185,1
0.21156387,0.86442345,1
0.18215965,0.84383863,1
0.11574052,0.6985756,1
0.17813574,0.706733,1
0.1270397,0.73172027,1
0.13297744,0.68488175,1
0.16228789,0.68083596,1
0.15941827,0.79463154,1
0.19714536,0.7921854,1
0.12058508,0.6205852,1
0.11463568,0.6472854,1
0.20760646,0.8622911,1
0.118371844,0.64368075,1
0.13007833,0.68138206,1
0.10203607,0.5648338,1
0.121404245,0.696643,1
0.19320495,0.65319973,1
0.15244666,0.67247015,1
0.1296949,0.72206694,1
0.18396446,0.7626358,1
0.12111893,0.75410074,1
0.12000374,0.668852,1
0.17905071,0.8293393,1
0.16488755,0.803208,1
0.16500719,0.7946988,1
0.12016051,0.7009755,1
0.18455581,0.6355209,1
0.1386435,0.75612754,1
0.16778989,0.8083527,1
0.22410421,0.8637204,1
0.13743936,0.65359926,1
0.13661037,0.6811007,1
0.12725517,0.75304544,1
0.2201654,0.84839344,1
0.24546017,0.8144364,1
0.12941845,0.746212,1
0.17405076,0.7340638,1
0.19717975,0.8352308,1
0.15542686,0.78560674,1
0.14712422,0.77117103,1
0.14242914,0.7396152,1
0.1526675,0.6656907,1
0.14958303,0.74865484,1
0.19286087,0.8207858,1
0.1403029,0.73915917,1
0.09915103,0.6270302,1
0.17865747,0.8117392,1
0.12031596,0.7137715,1
0.13267204,0.6602858,1
0.14321762,0.62126195,1
0.13046297,0.72917026,1
0.16744283,0.8001225,1
0.14055358,0.7814554,1
0.09206291,0.55230325,1
0.12016511,0.7382795,1
0.14088869,0.7260383,1
0.11024224,0.7113848,1
0.10647478,0.65016377,1
0.16351405,0.69722766,1
0.14690717,0.7230058,1
0.13765204,0.6780375,1
0.15034471,0.7092703,1
0.14688122,0.77130497,1
0.13268809,0.72697407,1
0.16314471,0.78376263,1
0.2399852,0.765906,1
0.12149326,0.6691097,1
0.16097185,0.80714166,1
0.11587442,0.66505253,1
0.17545699,0.628318,1
0.109923765,0.66055316,1
0.14934298,0.8002013,1
0.17527893,0.7947202,1
0.22167249,0.7972534,1
0.11987967,0.6621309,1
0.17927547,0.8222261,1
0.13080175,0.7425793,1
0.144419,0.77411264,1
0.11311012,0.6369804,1
0.16643478,0.7097371,1
0.17104284,0.7199978,1
0.12239892,0.6642943,1
0.14209367,0.70625687,1
0.15095177,0.80324364,1
0.10716982,0.6686307,1
0.122812085,0.64564985,1
0.14547302,0.64878213,1
0.12731317,0.6453213,1
0.12631485,0.73507947,1
0.1322651,0.62889963,1
0.3423788,0.67827415,1
0.17057762,0.8044455,1
0.15561402,0.57290024,1
0.15338396,0.7027662,1
0.15472935,0.77049774,1
0.28117687,0.4926329,1
0.15051574,0.70010877,1
0.10266927,0.58807606,1
0.09851853,0.61617655,1
0.17644042,0.7784569,1
0.15499742,0.6845039,1
0.19037196,0.7695694,1
0.20487039,0.8380697,1
0.09856338,0.6112798,1
0.15336804,0.76100093,1
0.14651921,0.7126273,1
0.19004564,0.84463364,1
0.12747733,0.7264594,1
0.10225754,0.6658616,1
0.11345297,0.68158966,1
0.099590264,0.5430615,1
0.24645314,0.78876984,1
0.11693575,0.63857955,1
0.18122727,0.63855565,1
0.13238437,0.6209163,1
0.12792416,0.7509065,1
0.14505145,0.6805197,1
0.13114864,0.7218117,1
0.14284757,0.7889219,1
0.13863239,0.7600076,1
0.11191881,0.6118261,1
0.107518,0.68534166,1
0.16409397,0.6030547,1
0.18705086,0.73752207,1
0.13850537,0.7532492,1
0.1439409,0.6227994,1
0.17100659,0.69037056,1
0.1733125,0.76289403,1
0.11373545,0.6918912,1
0.09379078,0.5905193,1
0.14195135,0.69101816,1
0.23434922,0.7543752,1
0.17144516,0.7198401,1
0.22789289,0.86588395,1
0.16071431,0.8095797,1
0.11396562,0.5559739,1
0.16186556,0.76857775,1
0.114341624,0.62885517,1
0.2913885,0.742549,1
0.123405404,0.64677876,1
0.21450883,0.853461,1
0.15531756,0.67762494,1
0.14552303,0.77160525,1
0.14250264,0.7840117,1
0.15090218,0.65129256,1
0.13653086,0.7609198,1
0.11943878,0.72136754,1
0.13561498,0.73620945,1
0.15940794,0.7614952,1
0.096513756,0.5704953,1
0.1676723,0.8375079,1
0.14513586,0.7620838,1
0.12460921,0.6422097,1
0.11432746,0.62185985,1
0.16948187,0.7914101,1
0.14522013,0.700085,1
0.1409781,0.7282384,1
0.13635437,0.72057337,1
0.11125901,0.68691826,1
0.12103482,0.7143436,1
0.11996026,0.7043709,1
0.110408,0.5889944,1
0.13321617,0.6613144,1
0.16222304,0.6266346,1
0.15788768,0.78613466,1
0.109992936,0.65452945,1
0.18096946,0.78383726,1
0.12695464,0.7195276,1
0.16003214,0.7288317,1
0.10847803,0.66128546,1
0.18229388,0.8355452,1
0.14433381,0.6483401,1
0.12844314,0.7278379,1
0.1325656,0.7270997,1
0.13545449,0.6127325,1
0.12168895,0.5809407,1
0.13168879,0.75453836,1
0.116133295,0.67195153,1
0.13867119,0.7250341,1
0.14986515,0.773097,1
0.15701784,0.74239296,1
0.15055108,0.7340933,1
0.14114477,0.66007054,1
0.16089308,0.6682817,1
0.24866216,0.69936055,1
0.20752473,0.7818491,1
0.14804766,0.6540344,1
0.14885862,0.7929934,1
0.14156292,0.59795284,1
0.14963523,0.72825354,1
0.14384568,0.7671699,1
0.14500804,0.7151705,1
0.11032615,0.6184911,1
0.10465037,0.5727795,1
0.13366283,0.74436396,1
0.22207738,0.8732852,1
0.19538397,0.8026595,1
0.16244967,0.76283556,1
0.115146875,0.5359371,1
0.20303527,0.7376057,1
0.18023159,0.8452332,1
0.15163806,0.7153463,1
0.11436138,0.72254294,1
0.15449873,0.57931876,1
0.09043428,0.59481466,1
0.20720507,0.8139911,1
0.13814948,0.68096143,1
0.10685979,0.5734294,1
0.12113452,0.61309433,1
0.17516325,0.7501812,1
0.1490879,0.80619794,1
0.1521242,0.6770988,1
0.10241372,0.62089366,1
0.15127565,0.7458318,1
0.13532665,0.7039101,1
0.17198189,0.7822117,1
0.14939381,0.70519966,1
0.1348381,0.6892221,1
0.1677125,0.8040829,1
0.10258729,0.62408406,1
0.17154138,0.7971178,1
0.13131367,0.6652503,1
0.17711551,0.7743434,1
0.1858066,0.75498515,1
0.12979276,0.7403405,1
0.12159746,0.54279983,1
0.14944048,0.7782051,1
0.10809188,0.6376479,1
0.122630484,0.7315447,1
0.1039136,0.5948157,1
0.1434984,0.7699614,1
0.19691236,0.799975,1
0.111394994,0.54168534,1
0.22778015,0.8711539,1
0.09110491,0.5194977,1
0.1309527,0.67390364,1
0.14949703,0.75967145,1
0.112704396,0.61249644,1
0.16863723,0.77065593,1
0.1575999,0.6886696,1
0.12908071,0.7561041,1
0.12332979,0.7056956,1
0.13182944,0.7389066,1
0.136079,0.6705883,1
0.23725569,0.8738855,1
0.14372937,0.76200324,1
0.122639865,0.5899115,1
0.19713625,0.85467374,1
0.15225002,0.7690339,1
0.19867028,0.83410025,1
0.1635961,0.7775272,1
0.14291382,0.7555766,1
0.11496117,0.64570755,1
0.17531906,0.71367526,1
0.11990956,0.6414265,1
0.2162775,0.85242283,1
0.11356937,0.6189527,1
0.16412508,0.79790175,1
0.17204195,0.8248533,1
0.23222496,0.86935645,1
0.14504215,0.7742154,1
0.13188615,0.71844697,1
0.11804367,0.65633446,1
0.13961984,0.70995647,1
0.19099371,0.5608588,1
0.22310126,0.8381799,1
0.111491434,0.67232573,1
0.120265484,0.6369827,1
0.13513625,0.77393746,1
0.15378435,0.7552022,1
0.14402339,0.66836745,1
0.16519289,0.7501555,1
0.15409726,0.705209,1
0.13075551,0.6809497,1
0.111410975,0.62175643,1
0.109065525,0.5826995,1
0.12025803,0.6353735,1
0.124237366,0.7146032,1
0.21265061,0.8690814,1
0.15137653,0.7325846,1
0.1327926,0.6807024,1
0.19259119,0.8424302,1
0.11938236,0.67260736,1
0.10990575,0.58134174,1
0.10584553,0.6336428,1
0.10331917,0.62341195,1
0.121419236,0.7379784,1
0.16455144,0.62954307,1
0.13993335,0.716612,1
0.1775632,0.78632385,1
0.15410475,0.7910345,1
0.23321569,0.8776216,1
0.14467192,0.78521687,1
0.12003359,0.72342,1
0.15445209,0.7788246,1
0.1504034,0.7429866,1
0.12760776,0.7317912,1
0.1729107,0.69846684,1
0.10632707,0.61603004,1
0.14650896,0.65890086,1
0.19664517,0.8003703,1
0.12280754,0.6698831,1
0.1830802,0.7351937,1
0.13941522,0.6660748,1
0.10416022,0.68811053,1
0.11642573,0.68015796,1
0.11835438,0.62129104,1
0.12698446,0.6369239,1
0.13735215,0.74832976,1
0.11243683,0.664716,1
0.099493,0.60879254,1
0.13644987,0.73866993,1
0.13283375,0.75224346,1
0.14378133,0.78822064,1
0.15068193,0.79081285,1
0.14784758,0.757594,1
0.17719674,0.75977445,1
0.11756662,0.73757833,1
0.14234535,0.68136346,1
0.15618843,0.5723064,1
0.09779383,0.5697381,1
0.11629697,0.6645313,1
0.15209498,0.692625,1
0.21202715,0.8741253,1
0.13702793,0.74907696,1
0.10941192,0.67482305,1
0.109525934,0.6700893,1
0.16197877,0.5666394,1
0.12535784,0.6003126,1
0.13214546,0.65599614,1
0.24772258,0.8554017,1
0.10804387,0.6345947,1
0.1703636,0.79647386,1
0.1754185,0.8349523,1
0.17496523,0.8148677,1
0.14946032,0.79867655,1
0.17555496,0.8384219,1
0.15471467,0.8026889,1
0.1756862,0.6108873,1
0.15625076,0.7926691,1
0.15582916,0.7859851,1
0.16051234,0.8241418,1
0.16379167,0.82947785,1
0.14715648,0.76130825,1
0.14686479,0.79769003,1
0.17348897,0.8136622,1
0.17653997,0.817628,1
0.19304208,0.8518285,1
0.162891,0.83254427,1
0.18088746,0.59815186,1
0.1911822,0.8405574,1
0.15328749,0.6786406,1
0.17658149,0.82263887,1
0.14085396,0.647243,1
0.15128297,0.7140589,1
0.17334163,0.8167164,1
0.18806067,0.80811244,1
0.1691599,0.74954706,1
0.16415271,0.7526256,1
0.1700396,0.57005465,1
0.14522758,0.6761417,1
0.15354684,0.69701993,1
0.17052251,0.69827133,1
0.17796911,0.71212023,1
0.17811446,0.6712803,1
0.20258744,0.8122517,1
0.18866004,0.7538727,1
0.18249562,0.79027724,1
0.17012787,0.7354878,1
0.19658299,0.79780346,1
0.17005885,0.72910213,1
0.19906285,0.79602754,1
0.152829,0.70467496,1
0.17501767,0.785715,1
0.16301051,0.6781785,1
0.19819784,0.86410385,1
0.18582425,0.8332073,1
0.17523903,0.8369419,1
0.19637531,0.8572836,1
0.14983259,0.7857081,1
0.18400554,0.85155356,1
0.2065108,0.863615,1
0.17727809,0.8126562,1
0.17794394,0.83616334,1
0.17469682,0.8166543,1
0.17152417,0.8250636,1
0.11865078,0.6321138,1
0.1307745,0.6945874,1
0.1182367,0.7228293,1
0.1442675,0.6937054,1
0.12853996,0.59990925,1
0.14552014,0.72717696,1
0.1309638,0.75027126,1
0.14505462,0.7543288,1
0.09924844,0.56645715,1
0.13866393,0.7275708,1
0.15795347,0.7388278,1
0.15732874,0.8164633,1
0.21127121,0.84902596,1
0.24455185,0.8559719,1
0.21053793,0.86417127,1
0.19738187,0.86398023,1
0.20812207,0.8582537,1
0.20449781,0.8484572,1
0.1868123,0.808149,1
0.17425707,0.7967323,1
0.14036171,0.75003326,1
0.14238007,0.7657277,1
0.20096308,0.85309666,1
0.13868141,0.7626711,1
0.14243276,0.699447,1
0.18403211,0.83952683,1
0.12905332,0.74504554,1
0.15288077,0.78420395,1
0.13650878,0.73199105,1
0.1558151,0.7968894,1
0.18570167,0.83058214,1
0.1892341,0.80269116,1
0.14956018,0.79406494,1
0.17283566,0.82256734,1
0.19582285,0.8353694,1
0.13318112,0.6632351,1
0.12642837,0.72050154,1
0.15028287,0.72873974,1
0.16780743,0.79522353,1
0.16423441,0.83162564,1
0.19611779,0.83904773,1
0.17399503,0.81932795,1
0.15854181,0.8064928,1
0.16989529,0.8062703,1
0.15035486,0.80580497,1
0.181793,0.8152506,1
0.1510205,0.7841603,1
0.17000428,0.82295597,1
0.15684341,0.7868457,1
0.14533317,0.8001225,1
0.15778615,0.8050404,1
0.17001973,0.8152061,1
0.18607758,0.8273239,1
0.18745612,0.8245113,1
0.19866632,0.80957854,1
0.23035845,0.84407383,1
0.19281097,0.8159989,1
0.23994061,0.85686666,1
0.1562413,0.7855954,1
0.19573523,0.76117194,1
0.11272305,0.6696373,1
0.17250113,0.80775094,1
0.12308663,0.656201,1
0.15059507,0.78563553,1
0.18805313,0.8383256,1
0.17823488,0.79741794,1
0.16300479,0.7774747,1
0.18149996,0.8247132,1
0.16059144,0.8144014,1
0.18976615,0.8478147,1
0.16422209,0.78300697,1
0.1658753,0.81314874,1
0.15039162,0.7860728,1
0.18396553,0.77900004,1
0.16400892,0.7950301,1
0.19687375,0.84131527,1
0.15144168,0.7382273,1
0.12308926,0.6570841,1
0.14317946,0.7946041,1
0.13953444,0.7250121,1
0.16045332,0.7324478,1
0.15449227,0.78151083,1
0.2668603,0.87316376,1
0.27475888,0.86404985,1
0.26513332,0.8745897,1
0.14253084,0.666132,1
0.13004433,0.66156447,1
0.1264633,0.6971186,1
0.16160715,0.7523047,1
0.14523591,0.7041837,1
0.19331197,0.8425065,1
0.20043544,0.8266702,1
0.21240428,0.73354095,1
0.17209919,0.8410563,1
0.14353934,0.7653345,1
0.15779884,0.80143166,1
0.14582856,0.7854798,1
0.18167332,0.80195385,1
0.14747648,0.7848436,1
0.17368202,0.8268407,1
0.14417896,0.7520504,1
0.15638672,0.7418681,1
0.19533902,0.84684503,1
0.16113313,0.7784267,1
0.1311124,0.66585094,1
0.14031649,0.6729817,1
0.13393307,0.7431695,1
0.13841243,0.71178275,1
0.27650577,0.8215571,1
0.21981058,0.80536866,1
0.27414516,0.82767546,1
0.2640074,0.846343,1
0.28662157,0.8575792,1
0.14142323,0.6039444,1
0.13952403,0.67204714,1
0.13545819,0.6078226,1
0.124847986,0.5889947,1
0.16727428,0.7150703,1
0.13567676,0.58716357,1
0.11228752,0.5310812,1
0.13843453,0.6539136,1
0.11368176,0.5859868,1
0.12725982,0.5734234,1
0.10537403,0.5684979,1
0.11721366,0.5767414,1
0.18673477,0.64558387,1
0.1337904,0.612589,1
0.14959985,0.7052575,1
0.10014159,0.5268607,1
0.10008656,0.5341138,1
0.15104625,0.6825036,1
0.13454983,0.709319,1
0.14754346,0.62308604,1
0.11612341,0.7209863,1
0.12522158,0.7109573,1
0.10655436,0.5701773,1
0.11959195,0.68939036,1
0.1619185,0.79364026,1
0.12570468,0.7422335,1
0.24936002,0.77756155,1
0.16897364,0.6667572,1
0.14684406,0.7147964,1
0.12792441,0.6206644,1
0.10747294,0.59223217,1
0.1373504,0.67795444,1
0.09854993,0.5703416,1
0.11522299,0.59417135,1
0.11883028,0.6294037,1
0.17123559,0.73192424,1
0.14580424,0.7640842,1
0.12295523,0.67355967,1
0.13876112,0.72385055,1
0.13655865,0.75646895,1
0.17642315,0.8002995,1
0.15708402,0.71032023,1
0.09993959,0.6065045,1
0.12935369,0.7589311,1
0.17011666,0.7714352,1
0.18977797,0.7772758,1
0.22680005,0.86560106,1
0.14229764,0.7033354,1
0.1438455,0.77519804,1
0.14009587,0.7090923,1
0.21657878,0.6467305,1
0.1276671,0.7078218,1
0.13462044,0.7434727,1
0.123809755,0.6989706,1
0.13155703,0.76132256,1
0.120341174,0.70319515,1
0.09988266,0.61154604,1
0.12239171,0.617878,1
0.15069032,0.7673428,1
0.18715096,0.73782545,1
0.17089413,0.80896735,1
0.2213743,0.5067614,1
0.13556372,0.78440404,1
0.13601826,0.72404784,1
0.1284805,0.6799338,1
0.1593536,0.81099516,1
0.13067886,0.7406669,1
0.13081339,0.7300729,1
0.15411332,0.8167976,1
0.114788055,0.58788455,1
0.124862425,0.7290622,1
0.11441912,0.74507946,1
0.11589449,0.6577038,1
0.115984045,0.73216707,1
0.12697238,0.70887095,1
0.13919814,0.6736053,1
0.18274887,0.8004511,1
0.14375357,0.6687826,1
0.12160187,0.60131514,1
0.13150235,0.75464886,1
0.14828049,0.7704691,1
0.11602675,0.6971929,1
0.12304539,0.6948493,1
0.16816753,0.79044837,1
0.14535218,0.6874831,1
0.16355792,0.7008532,1
0.24022748,0.84971076,1
0.14973259,0.64014095,1
0.12155901,0.70555556,1
0.16619824,0.6931361,1
0.14472044,0.6820285,1
0.14523433,0.7568633,1
0.11720844,0.6152239,1
0.13520235,0.68616,1
0.17151754,0.8321025,1
0.13878432,0.7150175,1
0.10650086,0.63713765,1
0.13917747,0.6893021,1
0.21764144,0.8547615,1
0.12118548,0.5631745,1
0.18076023,0.7973343,1
0.181102,0.67057896,1
0.10695984,0.56876403,1
0.1397447,0.7797264,1
0.14781676,0.7506488,1
0.11428223,0.62150913,1
0.212804,0.8584078,1
0.19035676,0.8610398,1
0.12949616,0.6506823,1
0.17398617,0.7280212,1
0.113055505,0.60304403,1
0.11825753,0.59756136,1
0.1442073,0.7701628,1
0.14129521,0.773159,1
0.114314,0.6031787,1
0.12680537,0.72534424,1
0.13064337,0.69078195,1
0.09609195,0.61927223,1
0.21593581,0.735943,1
0.12967117,0.7393419,1
0.16305938,0.7101254,1
0.15284297,0.8056465,1
0.11513969,0.72306806,1
0.18537897,0.78178775,1
0.13010474,0.71008927,1
0.14782551,0.61574113,1
0.17323571,0.8277214,1
0.25322703,0.83325285,1
0.20171449,0.8549766,1
0.113025695,0.7260434,1
0.14766677,0.63152003,1
0.10546406,0.6311466,1
0.113519296,0.5973889,1
0.13057724,0.71672,1
0.18830666,0.835283,1
0.12391648,0.737112,1
0.102126494,0.6015531,1
0.22118431,0.7982506,1
0.09179833,0.60355294,1
0.12302725,0.7409186,1
0.13173732,0.74812365,1
0.19187084,0.83184916,1
0.107073225,0.57230186,1
0.11945353,0.63828945,1
0.11007558,0.6464774,1
0.11830078,0.6053462,1
0.13229881,0.71410125,1
0.10802425,0.65402585,1
0.19320641,0.83578277,1
0.14976737,0.7278006,1
0.17840634,0.8294232,1
0.15559176,0.6719597,1
0.10381109,0.62283146,1
0.1453031,0.77799356,1
0.16480595,0.7771985,1
0.15065631,0.68618774,1
0.13939483,0.7513976,1
0.15203443,0.7379898,1
0.14752816,0.702339,1
0.13526541,0.6692123,1
0.11649496,0.6906512,1
0.1202942,0.6194264,1
0.12691842,0.6560704,1
0.16051161,0.7167292,1
0.13238263,0.69033515,1
0.12268966,0.6544144,1
0.1989538,0.7153868,1
0.103306666,0.5550166,1
0.19944225,0.8121466,1
0.19874436,0.8067873,1
0.16108468,0.7588982,1
0.12736507,0.6893451,1
0.17447022,0.7300391,1
0.16222863,0.8150564,1
0.11455496,0.7057394,1
0.15589473,0.80087703,1
0.18806297,0.82220566,1
0.14037932,0.7001089,1
0.17254587,0.54485494,1
0.27013743,0.59715194,1
0.12112577,0.7181819,1
0.10222611,0.57903767,1
0.16768336,0.71013135,1
0.0871552,0.51972955,1
0.11992508,0.665041,1
0.11633451,0.6902228,1
0.14834832,0.76958424,1
0.1758435,0.7728107,1
0.23383164,0.8323618,1
0.140759,0.68482625,1
0.10699543,0.59023046,1
0.19082299,0.8374391,1
0.1741667,0.751105,1
0.12429743,0.7103192,1
0.12190058,0.6696722,1
0.13449758,0.7433263,1
0.13758564,0.7367586,1
0.1160267,0.6547503,1
0.16705255,0.82834184,1
0.12170827,0.6348025,1
0.1693048,0.7995887,1
0.123537175,0.6468162,1
0.10950084,0.6672242,1
0.19095254,0.8457577,1
