PC1,PC2,label
0.42019895,0.26396787,0
0.5346777,0.22782692,0
0.38738182,0.36462742,0
0.45184484,0.25319374,0
0.7607112,0.3504993,0
0.69315183,0.15666023,0
0.31149566,0.34094697,0
0.74527645,0.34618467,0
0.5599501,0.3933831,0
0.7110267,0.35958073,0
0.44145855,0.23300615,0
0.5632349,0.20753981,0
0.7034839,0.31100556,0
0.6212234,0.1843997,0
0.5985809,0.1625736,0
0.7144259,0.49262542,0
0.7244415,0.36060393,0
0.4301717,0.2985748,0
0.7666964,0.3410035,0
0.6776803,0.2261048,0
0.63174134,0.33050212,0
0.6961847,0.29544294,0
0.58750796,0.33124518,0
0.68980694,0.23125805,0
0.719276,0.29302165,0
0.5050003,0.27048013,0
0.42175055,0.42334542,0
0.5794893,0.17922103,0
0.78005284,0.280637,0
0.661777,0.21406382,0
0.37767336,0.38654003,0
0.7117753,0.4333178,0
0.76455104,0.30809382,0
0.7465874,0.40211302,0
0.77089447,0.2738213,0
0.583782,0.18032996,0
0.7489686,0.40120056,0
0.69466746,0.25971198,0
0.45920265,0.19292922,0
0.48016822,0.24657054,0
0.6535445,0.20827784,0
0.43383944,0.291857,0
0.73802805,0.32762054,0
0.5655686,0.3106081,0
0.6365616,0.37459427,0
0.48051864,0.4089024,0
0.71862555,0.2609523,0
0.5039416,0.22873142,0
0.6722353,0.24722879,0
0.75444424,0.39070207,0
0.72386485,0.39180857,0
0.52112335,0.24854909,0
0.7213343,0.34775704,0
0.77693874,0.29741538,0
0.5878782,0.18935199,0
0.3315035,0.58168584,0
0.6909712,0.2877409,0
0.5487952,0.20659183,0
0.66838515,0.19309779,0
0.58633715,0.31469685,0
0.4569825,0.19864833,0
0.5117192,0.1817859,0
0.45279986,0.23698212,0
0.6816542,0.20319594,0
0.7818167,0.24817592,0
0.5137704,0.32108787,0
0.6147057,0.32603738,0
0.45608377,0.35525388,0
0.6191008,0.18714768,0
0.62815154,0.1902541,0
0.5688011,0.23677616,0
0.6051729,0.29905772,0
0.4718292,0.28760424,0
0.5721244,0.26117057,0
0.5432657,0.17942066,0
0.5846196,0.24652712,0
0.59670115,0.33483475,0
0.6482211,0.2214781,0
0.6605252,0.2087704,0
0.6459515,0.35116488,0
0.6816216,0.3009601,0
0.5610505,0.2486144,0
0.36390188,0.29530796,0
0.54295856,0.3419509,0
0.5838568,0.38727832,0
0.57913125,0.23874153,0
0.2613045,0.4519815,0
0.44449273,0.27954498,0
0.39518866,0.35739452,0
0.7079335,0.30257186,0
0.5555313,0.26975197,0
0.6163802,0.41985863,0
0.5569856,0.44791463,0
0.38824385,0.6301177,0
0.51100576,0.31420332,0
0.6808408,0.4888897,0
0.49777314,0.3952145,0
0.6676027,0.1901667,0
0.490806,0.1884922,0
0.49271438,0.51988393,0
0.40796378,0.30609134,0
0.4431177,0.2710834,0
0.71482664,0.21601242,0
0.5362166,0.16681972,0
0.46864617,0.2450546,0
0.67823726,0.29529178,0
0.504805,0.18495801,0
0.6351106,0.3607736,0
0.6080509,0.31418252,0
0.4960941,0.2808122,0
0.4684697,0.24978942,0
0.7051151,0.28212535,0
0.6107123,0.18790689,0
0.63262933,0.39286497,0
0.7830728,0.24545915,0
0.55151147,0.3247155,0
0.4707824,0.26694247,0
0.46010295,0.44341728,0
0.6181583,0.20163812,0
0.61224264,0.3134265,0
0.74538136,0.26200372,0
0.728615,0.3202024,0
0.6008514,0.24381661,0
0.6503901,0.27685118,0
0.58472824,0.17460002,0
0.6899902,0.28662685,0
0.556519,0.20228979,0
0.568032,0.21579936,0
0.606898,0.23771283,0
0.5358093,0.4019014,0
0.44356298,0.3578951,0
0.58317184,0.20087305,0
0.50441587,0.262064,0
0.5405083,0.32255673,0
0.5170553,0.23360293,0
0.6532968,0.14584568,0
0.5722037,0.28764766,0
0.37262917,0.38475236,0
0.563633,0.3201311,0
0.40311056,0.34594324,0
0.4318651,0.3264364,0
0.4434656,0.23347679,0
0.591229,0.19163533,0
0.7759157,0.281601,0
0.6992409,0.44033274,0
0.5209215,0.37897444,0
0.6656026,0.3745852,0
0.38716772,0.40721595,0
0.45460373,0.30499277,0
0.7027687,0.16921279,0
0.51873463,0.23309049,0
0.4384454,0.5396216,0
0.4081843,0.23043884,0
0.5191615,0.38811383,0
0.4749849,0.392569,0
0.50385314,0.41356963,0
0.40211278,0.4276472,0
0.5054823,0.38640553,0
0.5127928,0.25484022,0
0.42953038,0.3004185,0
0.57883304,0.34869847,0
0.61839545,0.25378966,0
0.44224694,0.36366755,0
0.50087094,0.25157207,0
0.4924692,0.41950622,0
0.42832306,0.4532937,0
0.5650762,0.22434428,0
0.5075194,0.42424232,0
0.39515933,0.34784272,0
0.626397,0.31759483,0
0.59208894,0.25105795,0
0.4088619,0.38423404,0
0.58666986,0.24031252,0
0.5613275,0.22626343,0
0.38820875,0.53152424,0
0.6231878,0.37754384,0
0.5601845,0.22301768,0
0.53420407,0.23787458,0
0.32311985,0.34623912,0
0.44561198,0.22707622,0
0.59544134,0.25524345,0
0.55432284,0.25617665,0
0.43875107,0.5201176,0
0.39273614,0.24379359,0
0.73814714,0.19875886,0
0.6659736,0.27051783,0
0.52084285,0.24316475,0
0.4025607,0.35413477,0
0.4445052,0.23795217,0
0.579729,0.2161864,0
0.71187973,0.3381282,0
0.677725,0.23335592,0
0.5814795,0.27439758,0
0.71792287,0.21229228,0
0.5065639,0.35873565,0
0.7192532,0.21098402,0
0.51610714,0.3751117,0
0.612419,0.18061918,0
0.540319,0.35887635,0
0.5659487,0.19082634,0
0.45817092,0.24493185,0
0.5921094,0.32868278,0
0.66269195,0.36891606,0
0.37727752,0.20958601,0
0.56379336,0.3369421,0
0.448342,0.46696565,0
0.6193245,0.2019543,0
0.4965798,0.2533154,0
0.50730085,0.16396779,0
0.51070595,0.27785873,0
0.5831316,0.22014399,0
0.6525841,0.4379311,0
0.60715014,0.18398133,0
0.6145965,0.21830502,0
0.4655682,0.22878583,0
0.62660676,0.2857711,0
0.57416916,0.21348496,0
0.38398132,0.32844254,0
0.8092794,0.2873289,0
0.516548,0.3822101,0
0.65689147,0.31573963,0
0.4954035,0.3665466,0
0.6568812,0.17370549,0
0.36718938,0.49538875,0
0.754481,0.3174654,0
0.6426521,0.21984401,0
0.6990708,0.30591035,0
0.6354925,0.17049083,0
0.6144234,0.30079663,0
0.42332578,0.34035963,0
0.6991594,0.19111559,0
0.6606756,0.17778301,0
0.5407422,0.32454914,0
0.72212845,0.36068112,0
0.64825124,0.16851276,0
0.78633296,0.22993182,0
0.7932072,0.23380274,0
0.48374254,0.20156151,0
0.45643267,0.18582058,0
0.57848114,0.4438017,0
0.3935133,0.29781294,0
0.6061486,0.3404544,0
0.6912417,0.26636392,0
0.35873368,0.38972792,0
0.60665154,0.4779623,0
0.58968145,0.23964222,0
0.75502646,0.35526627,0
0.6861771,0.25663835,0
0.719834,0.32578257,0
0.7948578,0.25216457,0
0.52274275,0.25912774,0
0.51523906,0.29760668,0
0.5617965,0.33658725,0
0.46274468,0.21110013,0
0.46827358,0.26695636,0
0.5150194,0.42539608,0
0.5724625,0.21651526,0
0.54593354,0.27110073,0
0.6498097,0.2155116,0
0.42006472,0.4534164,0
0.39562464,0.5735544,0
0.45826316,0.35148466,0
0.6848615,0.32581523,0
0.6735598,0.2330417,0
0.4204376,0.2651811,0
0.3868351,0.36804092,0
0.43275806,0.27517673,0
0.6153016,0.30325365,0
0.506876,0.27953652,0
0.5026443,0.2678837,0
0.70169204,0.2584009,0
0.41553715,0.34075847,0
0.5757517,0.32533726,0
0.4533474,0.22134511,0
0.6388411,0.2789015,0
0.6136258,0.25596958,0
0.6068078,0.25206324,0
0.48688456,0.3901686,0
0.5389979,0.40953115,0
0.29038545,0.6472325,0
0.45859316,0.279447,0
0.6416235,0.17710388,0
0.587464,0.29917943,0
0.59189904,0.39126042,0
0.52457577,0.31258312,0
0.6047351,0.18513718,0
0.5186097,0.30664882,0
0.5203085,0.46024683,0
0.55394185,0.47907922,0
0.6421604,0.26088244,0
0.6323133,0.1979176,0
0.4537699,0.3311456,0
0.67700183,0.20720293,0
0.65648925,0.17294988,0
0.66543776,0.18700004,0
0.62014216,0.1797657,0
0.54542613,0.2650335,0
0.5230468,0.2865957,0
0.51211977,0.32294264,0
0.34610233,0.40111992,0
0.51006585,0.2558927,0
0.40202597,0.39460185,0
0.5263947,0.31849718,0
0.6356159,0.293007,0
0.7129424,0.31322372,0
0.66786194,0.21399532,0
0.7014524,0.19387369,0
0.6725204,0.3802701,0
0.728591,0.34300348,0
0.7139117,0.397881,0
0.5978812,0.19667387,0
0.43141446,0.3512838,0
0.61523694,0.18877216,0
0.4659727,0.34978488,0
0.52724034,0.18201955,0
0.63608396,0.22175954,0
0.5218437,0.37814304,0
0.6911177,0.19004041,0
0.7235538,0.22833999,0
0.52192646,0.24146561,0
0.5464327,0.24626866,0
0.44065785,0.29815486,0
0.6514611,0.40237933,0
0.60364145,0.50182843,0
0.4923752,0.3810291,0
0.65718865,0.41650182,0
0.54041183,0.29778764,0
0.5679786,0.2941165,0
0.6236478,0.2372721,0
0.4316587,0.50884086,0
0.6453829,0.19213627,0
0.5690595,0.21723437,0
0.57119334,0.30794024,0
0.5976754,0.21244064,0
0.6123308,0.16426282,0
0.6715083,0.16937262,0
0.69008464,0.17342953,0
0.60361874,0.42248407,0
0.6512828,0.2819451,0
0.6202316,0.17450702,0
0.6011934,0.25148675,0
0.5474322,0.41517857,0
0.5824468,0.297701,0
0.44499633,0.3884056,0
0.6164915,0.2825142,0
0.5268038,0.21168801,0
0.4998229,0.35562477,0
0.5424402,0.3503906,0
0.621177,0.46782827,0
0.7195765,0.23570456,0
0.46035895,0.37757957,0
0.7118045,0.25528166,0
0.7514012,0.22075233,0
0.6735974,0.29657096,0
0.5752414,0.37750143,0
0.73792046,0.18108349,0
0.60279846,0.32593977,0
0.6038997,0.3449687,0
0.66673225,0.220286,0
0.63077575,0.2746472,0
0.69308275,0.5070033,0
0.5421646,0.44835436,0
0.6146581,0.19247484,0
0.6230668,0.19622979,0
0.49000242,0.3699978,0
0.5534016,0.35663456,0
0.69198835,0.28266406,0
0.58995247,0.3576053,0
0.37355512,0.58887684,0
0.46510714,0.40174857,0
0.5527581,0.36831725,0
0.4651631,0.3561157,0
0.48230398,0.5208927,0
0.607798,0.24479799,0
0.54524523,0.38836342,0
0.2613306,0.6017002,0
0.6492907,0.27582172,0
0.61843926,0.3969707,0
0.5480426,0.616371,0
0.36627725,0.3434475,0
0.5036477,0.23896983,0
0.6135006,0.21819787,0
0.54616904,0.33735955,0
0.5017189,0.18863261,0
0.49531844,0.23308936,0
0.6597909,0.32567748,0
0.49076954,0.24853462,0
0.6668154,0.32215267,0
0.6245577,0.23547864,0
0.72634256,0.30307004,0
0.659325,0.33896285,0
0.50898635,0.6200658,0
0.53938526,0.30078292,0
0.37487528,0.33391508,0
0.7793741,0.29139408,0
0.6306899,0.3151538,0
0.64679056,0.2675136,0
0.71783644,0.35273966,0
0.66258395,0.29522616,0
0.6090205,0.30951297,0
0.7567433,0.19808376,0
0.76769894,0.19756638,0
0.7416641,0.17105395,0
0.62561977,0.432259,0
0.7341056,0.15738726,0
0.7781368,0.2353538,0
0.68900025,0.27338547,0
0.70482093,0.42229125,0
0.72710586,0.26741737,0
0.72147584,0.2607811,0
0.68597114,0.21719226,0
0.73167855,0.24705933,0
0.6848518,0.21566477,0
0.687443,0.2799978,0
0.7111992,0.26675078,0
0.7130607,0.29099026,0
0.68855286,0.3167693,0
0.748383,0.37589836,0
0.7343269,0.3428143,0
0.66747576,0.24271977,0
0.71927696,0.25125614,0
0.68051624,0.45839468,0
0.7536474,0.2045035,0
0.64555377,0.38171467,0
0.5767164,0.47964722,0
0.7792586,0.2907331,0
0.6814696,0.3272147,0
0.6760607,0.33288312,0
0.69197214,0.25723448,0
0.5866257,0.175856,0
0.48589894,0.3080449,0
0.61939085,0.30684608,0
0.45383653,0.40757337,0
0.5932355,0.5984292,0
0.7035773,0.34312245,0
0.55056703,0.42977306,0
0.69282126,0.33053195,0
0.6346999,0.289286,0
0.6139103,0.4173564,0
0.6196321,0.36991864,0
0.59350806,0.524536,0
0.5233395,0.42659047,0
0.56052434,0.47297665,0
0.53027195,0.47998783,0
0.56914145,0.38836813,0
0.54624665,0.4886873,0
0.6460697,0.1618201,0
0.6498499,0.44983107,0
0.5609822,0.17253318,0
0.7102694,0.36748233,0
0.7019968,0.3855331,0
0.5097341,0.53779703,0
0.45874685,0.38092238,0
0.6272111,0.3103063,0
0.29421315,0.43363002,0
0.43222746,0.46377304,0
0.7162731,0.27598456,0
0.6986554,0.32983676,0
0.6240536,0.31837487,0
0.71709514,0.28105167,0
0.70776,0.35212436,0
0.70496273,0.34210503,0
0.6640704,0.48144606,0
0.65574783,0.34519088,0
0.5558076,0.45619926,0
0.63798124,0.34225202,0
0.60562336,0.42428833,0
0.6390699,0.44924605,0
0.41893527,0.36303297,0
0.41001323,0.39663473,0
0.48475546,0.3738572,0
0.51379484,0.42927822,0
0.7608135,0.28110147,0
0.41037217,0.4163556,0
0.44863817,0.2995215,0
0.42672136,0.26435572,0
0.41571885,0.55736417,0
0.50442266,0.5005711,0
0.5865137,0.43661794,0
0.6892365,0.17556964,0
0.595865,0.5019187,0
0.48815122,0.2167174,0
0.4367648,0.40289876,0
0.6763871,0.30748624,0
0.52789444,0.54806614,0
0.35673118,0.39500475,0
0.58989733,0.16481265,0
0.6933928,0.25043756,0
0.5504378,0.18395917,0
0.6426838,0.44413045,0
0.5745989,0.20568505,0
0.5688402,0.24907681,0
0.3784238,0.4003282,0
0.5219628,0.45724422,0
0.42446494,0.35987282,0
0.47188982,0.18668774,0
0.43721607,0.29709396,0
0.4617313,0.29813176,0
0.477051,0.38087595,0
0.594143,0.52132195,0
0.45565572,0.4309,0
0.39949086,0.5651402,0
0.6220228,0.27047232,0
0.622811,0.41907528,0
0.43285444,0.3969144,0
0.63762486,0.40817872,0
0.5930763,0.22445004,0
0.4647758,0.29797378,0
0.5107246,0.439906,0
0.49981856,0.5260504,0
0.54854846,0.34279537,0
0.3904661,0.39755803,0
0.52728665,0.48887938,0
0.65950155,0.28682944,0
0.45056257,0.5263495,0
0.61678904,0.26732257,0
0.3423734,0.565008,0
0.67467856,0.2228082,0
0.59856457,0.2470989,0
0.69110894,0.2716143,0
0.6487698,0.258133,0
0.49017936,0.43394223,0
0.7157465,0.25623947,0
0.5562979,0.2813701,0
0.5302138,0.35233435,0
0.4644809,0.231087,0
0.6285316,0.35715616,0
0.62006056,0.27199227,0
0.37238055,0.6065807,0
0.5125461,0.3671379,0
0.6672554,0.36112848,0
0.44657934,0.36095002,0
0.55614996,0.26753625,0
0.5078202,0.35751274,0
0.6283504,0.24839944,0
0.34738117,0.5487118,0
0.5832385,0.40821773,0
0.6838999,0.18351492,0
0.5298108,0.19083874,0
0.5240065,0.33344704,0
0.7166752,0.22193691,0
0.71692723,0.25999823,0
0.5198272,0.37719262,0
0.5808409,0.19989103,0
0.72135115,0.25997186,0
0.7082882,0.28218868,0
0.62296396,0.45683795,0
0.56143105,0.39190853,0
0.59003085,0.27703828,0
0.5523313,0.3682106,0
0.54308635,0.32288384,0
0.49877515,0.45438033,0
0.45813522,0.33241197,0
0.5759592,0.292558,0
0.41611546,0.32154164,0
0.5637888,0.42203242,0
0.61739624,0.52100897,0
0.63273066,0.30721217,0
0.6425046,0.34516788,0
0.6746006,0.25247157,0
0.53117704,0.17245874,0
0.6822017,0.30875298,0
0.4421896,0.19857746,0
0.47060993,0.34501526,0
0.7166499,0.19519976,0
0.6609778,0.41548175,0
0.68230456,0.26432854,0
0.6928189,0.28626257,0
0.6809329,0.27097848,0
0.6621725,0.21452324,0
0.5152222,0.262532,0
0.6565354,0.32727924,0
0.2846881,0.45558676,0
0.38851586,0.3395375,0
0.7552293,0.3507498,0
0.5132033,0.3142359,0
0.67822254,0.17874707,0
0.5872803,0.22844766,0
0.71251917,0.17961441,0
0.5090181,0.25549507,0
0.48139736,0.211898,0
0.439191,0.23035036,0
0.62162817,0.1619417,0
0.6070002,0.30861488,0
0.53817356,0.26677796,0
0.52686054,0.28753522,0
0.41648495,0.3501785,0
0.47656706,0.33589253,0
0.57316965,0.3091952,0
0.4735904,0.20624517,0
0.47788838,0.45691532,0
0.38386422,0.56016856,0
0.55450475,0.28856567,0
0.59510046,0.24059574,0
0.4293723,0.29642943,0
0.5054211,0.23134337,0
0.5082782,0.26188344,0
0.65134376,0.19574852,0
0.631736,0.47151288,0
0.6913209,0.268576,0
0.72253215,0.3753259,0
0.6652371,0.173259,0
0.71928155,0.18052337,0
0.66891867,0.17547518,0
0.44516987,0.23603165,0
0.70187145,0.394197,0
0.36877164,0.4505418,0
0.77079445,0.1967584,0
0.5209314,0.4639916,0
0.49332216,0.376936,0
0.6064425,0.16475646,0
0.56722033,0.1895949,0
0.6258982,0.18538919,0
0.67758954,0.16989201,0
0.6250893,0.22252055,0
0.46849987,0.27139232,0
0.50104326,0.41682202,0
0.7415336,0.27297768,0
0.44939736,0.33392408,0
0.49599355,0.25200516,0
0.43267432,0.24837066,0
0.6839083,0.20409639,0
0.61482257,0.17878118,0
0.51422364,0.22426282,0
0.5524739,0.33608317,0
0.5597137,0.20407571,0
0.5162522,0.26811552,0
0.5531799,0.20103687,0
0.55525786,0.24555081,0
0.59287757,0.19987331,0
0.49071568,0.3488657,0
0.6733627,0.16762364,0
0.46119806,0.44335636,0
0.5741683,0.2251483,0
0.5263841,0.19573857,0
0.6357618,0.2694778,0
0.603518,0.2930944,0
0.45458037,0.51793903,0
0.52369773,0.28054282,0
0.4203702,0.340464,0
0.5536734,0.38818347,0
0.46521166,0.36487326,0
0.5157626,0.37847775,0
0.50254434,0.21549097,0
0.47406185,0.21382064,0
0.72833246,0.22892237,0
0.5496512,0.16640483,0
0.54376197,0.24570964,0
0.5187517,0.22941783,0
0.648773,0.15248106,0
0.668294,0.2280849,0
0.5626105,0.18550408,0
0.71299344,0.27637282,0
0.5573406,0.32401395,0
0.6329592,0.40299797,0
0.41929364,0.4211434,0
0.7033776,0.25251853,0
0.44503015,0.27702138,0
0.66064936,0.2816846,0
0.50926155,0.29716942,0
0.73713726,0.19210285,0
0.42163256,0.32711703,0
0.51010877,0.2325486,0
0.7817748,0.263829,0
0.46384367,0.38389322,0
0.519098,0.2340093,0
0.55377954,0.21279228,0
0.58523726,0.38298506,0
0.5932959,0.223148,0
0.52974784,0.38643995,0
0.5669469,0.3721304,0
0.31442934,0.5470679,0
0.6279559,0.283005,0
0.7264503,0.22731382,0
0.6321821,0.2372595,0
0.4769847,0.58445394,0
0.6796633,0.49514815,0
0.66422784,0.24990173,0
0.53504115,0.26684293,0
0.5708872,0.24306403,0
0.42909473,0.46424767,0
0.65362567,0.15487307,0
0.39062956,0.29982707,0
0.6574242,0.43869865,0
0.56583285,0.19075216,0
0.51056176,0.2712635,0
0.6562109,0.4076862,0
0.6196735,0.21634792,0
0.5352934,0.28252757,0
0.6805233,0.40162623,0
0.635844,0.22109778,0
0.5800602,0.37041837,0
0.5346383,0.31505919,0
0.59502536,0.21141814,0
0.5135914,0.33899224,0
0.5765215,0.28963527,0
0.48610783,0.33620834,0
0.66348046,0.14251088,0
0.57202643,0.21095766,0
0.5412212,0.38571846,0
0.7039889,0.31793603,0
0.6042688,0.17927156,0
0.3864674,0.32586467,0
0.4634753,0.24988598,0
0.5213858,0.23696397,0
0.4908031,0.36403558,0
0.4477256,0.46394172,0
0.6771426,0.15436505,0
0.4857757,0.2247988,0
0.50002396,0.26514784,0
0.44954318,0.23542485,0
0.5857386,0.22876859,0
0.34542218,0.56355536,0
0.55330634,0.5988553,0
0.51023924,0.2580669,0
0.7036247,0.18684597,0
0.46362817,0.2494286,0
0.46759358,0.5313066,0
0.40494886,0.21993735,0
0.75801224,0.24478096,0
0.6034979,0.3349389,0
0.37066463,0.3687408,0
0.6820602,0.24724105,0
0.67886966,0.393222,0
0.42542076,0.49337497,0
0.3809434,0.47271425,0
0.53541684,0.5965066,0
0.42533326,0.47169814,0
0.41892287,0.36762145,0
0.37444028,0.26469788,0
0.49119243,0.46300906,0
0.38342512,0.20291315,0
0.59862024,0.43596545,0
0.5163206,0.51202226,0
0.49684456,0.554085,0
0.5889292,0.2290285,0
0.5603126,0.45003715,0
0.51324886,0.18427679,0
0.64406335,0.37923822,0
0.49890533,0.20166668,0
0.48806322,0.36525202,0
0.55765766,0.4828893,0
0.5036798,0.5170678,0
0.59984475,0.30683482,0
0.5846333,0.2123706,0
0.5757149,0.2707437,0
0.71134645,0.22477315,0
0.7744114,0.31624034,0
0.57425827,0.3262,0
0.48212692,0.42575997,0
0.44596937,0.38868243,0
0.45469388,0.37713748,0
0.64919853,0.35260463,0
0.47546262,0.21876234,0
0.712864,0.1778544,0
0.48562723,0.48951527,0
0.47876817,0.3556264,0
0.75576484,0.19482592,0
0.55707365,0.21587996,0
0.45836082,0.25352135,0
0.46167302,0.31442443,0
0.50680244,0.37523514,0
0.4923719,0.32928333,0
0.5419498,0.42364392,0
0.44250613,0.30375537,0
0.43919018,0.52282226,0
0.5292336,0.25062832,0
0.6089809,0.17066386,0
0.6627651,0.261904,0
0.45752504,0.6002545,0
0.29704946,0.6035765,0
0.5399026,0.46311593,0
0.57124364,0.23121305,0
0.59874374,0.40809846,0
0.5087064,0.27648947,0
0.5454373,0.33411127,0
0.46485665,0.2534826,0
0.44264117,0.23624484,0
0.38449034,0.31573024,0
0.4794435,0.22840339,0
0.41466603,0.34689593,0
0.48506236,0.42958894,0
0.684579,0.20187795,0
0.59039533,0.3194902,0
0.53246105,0.2238474,0
0.5981761,0.31400517,0
0.5090123,0.26881227,0
0.65150666,0.3927155,0
0.609832,0.3122123,0
0.45005378,0.5092792,0
0.43203577,0.2885645,0
0.5973972,0.53269756,0
0.4580137,0.2122079,0
0.7331533,0.22086574,0
0.6346457,0.17185655,0
0.69983095,0.2653966,0
0.5805873,0.2615729,0
0.51869893,0.5576046,0
0.5287463,0.36431152,0
0.5802353,0.24602892,0
0.72671896,0.23967068,0
0.41838053,0.3201877,0
0.44751102,0.38625816,0
0.4379747,0.34332463,0
0.7006328,0.1984384,0
0.51240486,0.20064037,0
0.52148795,0.39115214,0
0.74079996,0.2659126,0
0.47234362,0.42715347,0
0.567476,0.5255351,0
0.636057,0.40818125,0
0.49197784,0.27157065,0
0.4971898,0.44224805,0
0.4154262,0.30430552,0
0.4049567,0.3903456,0
0.40878806,0.49000698,0
0.36304122,0.55066663,0
0.5651535,0.20841876,0
0.39790246,0.6371187,0
0.5087118,0.31688482,0
0.55122805,0.19928205,0
0.41297847,0.45591807,0
0.4258402,0.26786748,0
0.4134276,0.2822492,0
0.27177456,0.41729727,0
0.41737068,0.30352408,0
0.6131503,0.45026395,0
0.5002116,0.2709237,0
0.66139746,0.22322172,0
0.428773,0.3695112,0
0.48456675,0.2150828,0
0.59078264,0.18554325,0
0.53228337,0.24294801,0
0.4379071,0.40066746,0
0.5135626,0.31090352,0
0.5750615,0.37361112,0
0.5946315,0.15037192,0
0.28442657,0.50153905,0
0.6056611,0.3967047,0
0.219947,0.6266742,0
0.51366824,0.20791124,0
0.4087058,0.44614303,0
0.33663297,0.53266203,0
0.29356915,0.39930928,0
0.7004309,0.39968196,0
0.51536554,0.2010683,0
0.57010424,0.25032744,0
0.669539,0.21995367,0
0.6654408,0.4006393,0
0.65358067,0.35088256,0
0.5842552,0.20730728,0
0.6731505,0.38207647,0
0.58881295,0.3400451,0
0.63868624,0.39197254,0
0.589446,0.21205437,0
0.80757487,0.27364784,0
0.6462562,0.1919552,0
0.72553945,0.20163895,0
0.44140124,0.20085882,0
0.54183745,0.26935282,0
0.5288728,0.23476027,0
0.6036677,0.2521413,0
0.46727487,0.3743366,0
0.54552954,0.23629089,0
0.40425423,0.25016895,0
0.42811784,0.3322296,0
0.56822485,0.4586097,0
0.5240233,0.32292095,0
0.53298426,0.39878437,0
0.6034458,0.3794011,0
0.63082194,0.3661517,0
0.644073,0.17774919,0
0.5174382,0.28180182,0
0.46956053,0.45067018,0
0.6350038,0.40567464,0
0.65260106,0.27258068,0
0.7239787,0.34332737,0
0.67291415,0.29675558,0
0.3628665,0.62564605,0
0.50525755,0.36834165,0
0.40449053,0.49109432,0
0.63874555,0.27414766,0
0.57187057,0.28044268,0
0.6366478,0.28530163,0
0.5868135,0.36041358,0
0.5314397,0.33590785,0
0.58565944,0.25110638,0
0.7651067,0.4021195,0
0.646264,0.39629906,0
0.5633792,0.26353675,0
0.5705247,0.22491604,0
0.6675942,0.19822802,0
0.66243225,0.2572662,0
0.5443482,0.19133824,0
0.63382983,0.27981624,0
0.53387004,0.43088117,0
0.5208391,0.23587082,0
0.5777217,0.26713952,0
0.67000157,0.20655972,0
0.6475708,0.38639596,0
0.61643773,0.18994306,0
0.37948018,0.408291,0
0.60443425,0.47668275,0
0.53398824,0.3043449,0
0.5004879,0.20197822,0
0.41258317,0.25156605,0
0.6489753,0.4009712,0
0.6530104,0.23177013,0
0.35287765,0.39498198,0
0.73862135,0.2951233,0
0.40398547,0.25404882,0
0.4887278,0.29766148,0
0.5641179,0.33863863,0
0.714809,0.39993298,0
0.533901,0.34030676,0
0.45707402,0.3495201,0
0.4256182,0.2916266,0
0.5437122,0.23085374,0
0.50877255,0.2818105,0
0.495446,0.23956724,0
0.46160373,0.48154703,0
0.41212338,0.47966033,0
0.4619299,0.18600589,0
0.5979494,0.44315,0
0.5846957,0.3146574,0
0.7513948,0.22781715,0
0.44145894,0.2747981,0
0.54304934,0.1932118,0
0.67949986,0.28266618,0
0.59876305,0.2551057,0
0.37505987,0.33691916,0
0.6494837,0.45159003,0
0.6430152,0.23946606,0
0.580629,0.1738186,0
0.6380021,0.21185891,0
0.36469495,0.24788627,0
0.54954493,0.17453584,0
0.6373217,0.39582223,0
0.43111962,0.2578364,0
0.50525373,0.39379188,0
0.5821506,0.37735623,0
0.6283982,0.39727837,0
0.50733244,0.32180277,0
0.4585518,0.40371895,0
0.4547878,0.35121402,0
0.44481823,0.31210935,0
0.50123143,0.351653,0
0.568229,0.26219186,0
0.6283792,0.2748084,0
0.65755,0.42947832,0
0.49870744,0.29218268,0
0.47631693,0.4075405,0
0.568327,0.17418197,0
0.492068,0.25763842,0
0.31884933,0.40207094,0
0.6561112,0.4154117,0
0.5991808,0.2980371,0
0.73610884,0.27279556,0
0.388238,0.23133785,0
0.6074847,0.26757348,0
0.64182407,0.4796627,0
0.55765915,0.2135412,0
0.50087965,0.26414913,0
0.53404623,0.5044408,0
0.3693652,0.3390983,0
0.7375446,0.23183058,0
0.5945142,0.19670673,0
0.45417202,0.43910807,0
0.4326111,0.2988951,0
0.5703927,0.2420044,0
0.6598729,0.4617179,0
0.61406994,0.4389101,0
0.6333032,0.29549703,0
0.70663846,0.3384521,0
0.48538917,0.21799591,0
0.6873046,0.37481728,0
0.67562157,0.2784749,0
0.5064149,0.5644114,0
0.40548363,0.43854967,0
0.5101862,0.37531027,0
0.09968301,0.5948451,1
0.07928978,0.5199279,1
0.09168241,0.4814116,1
0.109099284,0.7648074,1
0.10519776,0.40264615,1
0.13110995,0.7506611,1
0.08776599,0.47684503,1
0.09828245,0.7327709,1
0.1651409,0.72808313,1
0.08959653,0.69660056,1
0.14198777,0.73351705,1
0.10123214,0.69296885,1
0.12487844,0.7681991,1
0.0929917,0.6598706,1
0.0971724,0.73789626,1
0.12946397,0.75882655,1
0.096164346,0.46158826,1
0.08138569,0.6358477,1
0.11191544,0.73433656,1
0.08400315,0.6304509,1
0.16671152,0.7935376,1
0.08944748,0.506692,1
0.1525551,0.76735663,1
0.11934686,0.7292742,1
0.18099448,0.71138215,1
0.12182167,0.6989994,1
0.07686204,0.51839453,1
0.08559944,0.6229025,1
0.15992203,0.76193285,1
0.11871394,0.7504904,1
0.17705211,0.6850132,1
0.123294346,0.78187877,1
0.17269711,0.7246222,1
0.15173075,0.6993762,1
0.17822078,0.6617871,1
0.14790922,0.74421376,1
0.13002919,0.7154238,1
0.16920312,0.79510725,1
0.13079004,0.74641114,1
0.08441677,0.6346533,1
0.11923053,0.635193,1
0.15846382,0.7607318,1
0.092147484,0.67627746,1
0.10030546,0.6373064,1
0.08655475,0.65365195,1
0.07774862,0.60209507,1
0.09632783,0.6715851,1
0.090037405,0.61865455,1
0.10614945,0.73634136,1
0.10250564,0.60176027,1
0.17577471,0.7205397,1
0.088657744,0.675264,1
0.0799839,0.5095187,1
0.12638237,0.7255561,1
0.17836632,0.78508985,1
0.12626065,0.72105926,1
0.17470187,0.8213526,1
0.13226864,0.3728071,1
0.14445785,0.75085384,1
0.15998878,0.64739513,1
0.17914109,0.6442425,1
0.1958954,0.69077075,1
0.14761135,0.6901255,1
0.1128703,0.44206288,1
0.15666899,0.69175225,1
0.16538668,0.661224,1
0.11730308,0.7135047,1
0.08355101,0.5222975,1
0.13034382,0.69773626,1
0.11408803,0.70606357,1
0.13079001,0.7480394,1
0.08358794,0.4801526,1
0.19833052,0.66087335,1
0.12879728,0.7232615,1
0.08596846,0.60040134,1
0.092169344,0.42121637,1
0.2090884,0.604246,1
0.10030292,0.6760391,1
0.13276246,0.7103218,1
0.09107884,0.7314889,1
0.13858944,0.7713235,1
0.12490268,0.3631058,1
0.08688262,0.42583445,1
0.14870124,0.6458453,1
0.08189498,0.6306023,1
0.17436051,0.4548704,1
0.09632732,0.42994735,1
0.082573734,0.5670982,1
0.11876265,0.3545993,1
0.105612434,0.40311676,1
0.10135935,0.56602854,1
0.15353514,0.7179214,1
0.13615274,0.72028536,1
0.09794095,0.6961167,1
0.10563808,0.39137134,1
0.11651603,0.3642512,1
0.10134755,0.5873114,1
0.1309888,0.61331266,1
0.16133495,0.71299577,1
0.20644462,0.66059846,1
0.09166157,0.54253507,1
0.1146506,0.61845595,1
0.09740586,0.46310318,1
0.12136096,0.57752985,1
0.103712276,0.46081662,1
0.14231963,0.7055446,1
0.10825919,0.6498153,1
0.1288624,0.72841996,1
0.10879396,0.6702941,1
0.11511598,0.78433615,1
0.09880031,0.62957036,1
0.113996014,0.79495806,1
0.16618219,0.6878797,1
0.17149876,0.63175434,1
0.08993032,0.6286572,1
0.09572915,0.5445196,1
0.14488313,0.7019275,1
0.084783934,0.51423484,1
0.14731337,0.7400296,1
0.10148869,0.43997088,1
0.08465229,0.5396715,1
0.13496664,0.64420784,1
0.08640351,0.47971192,1
0.08734469,0.57697946,1
0.12510136,0.70463514,1
0.13427897,0.8010066,1
0.1260844,0.70758736,1
0.14323269,0.6730836,1
0.10103112,0.7530762,1
0.09295805,0.46020272,1
0.14001536,0.70146537,1
0.09536867,0.7502372,1
0.0922291,0.6301302,1
0.09242814,0.44471103,1
0.114065334,0.72469866,1
0.13282643,0.759389,1
0.15686637,0.71533215,1
0.12594002,0.6956254,1
0.13856503,0.7838782,1
0.1073911,0.77630436,1
0.12698933,0.7483509,1
0.14121476,0.77549267,1
0.17141867,0.79670274,1
0.12066608,0.74863166,1
0.18612021,0.7671965,1
0.11746616,0.71298194,1
0.1552354,0.7756268,1
0.11762206,0.66910243,1
0.1103958,0.7346987,1
0.1456492,0.75910044,1
0.09623382,0.42009223,1
0.10832618,0.75589246,1
0.10872586,0.7168425,1
0.15413219,0.78739494,1
0.12645842,0.7356044,1
0.12740077,0.7996159,1
0.08765456,0.46400684,1
0.16399254,0.8074026,1
0.10255284,0.6784695,1
0.10088558,0.7391626,1
0.08224828,0.6156857,1
0.1161161,0.7515613,1
0.11822592,0.6900078,1
0.12107014,0.7661486,1
0.11271473,0.7678428,1
0.077534616,0.5907635,1
0.13169545,0.7916945,1
0.10395925,0.7085464,1
0.09870254,0.39559713,1
0.1622847,0.7537665,1
0.0902292,0.46065295,1
0.10378893,0.38556677,1
0.11478421,0.3748092,1
0.115978345,0.7340975,1
0.14560905,0.7052789,1
0.13168798,0.8128151,1
0.09834087,0.4163538,1
0.07833706,0.5376436,1
0.13232553,0.3690995,1
0.095871255,0.53953433,1
0.12557809,0.7489666,1
0.09025224,0.43178704,1
0.16406743,0.7461764,1
0.089202374,0.70959455,1
0.15036134,0.7410079,1
0.11164535,0.7910062,1
0.103534654,0.7557309,1
0.14364222,0.72486144,1
0.086206056,0.6088316,1
0.11487707,0.8057368,1
0.0808978,0.60138524,1
0.08324168,0.54073304,1
0.0804925,0.586252,1
0.118924625,0.7434772,1
0.14390847,0.751788,1
0.16680889,0.7628958,1
0.085266806,0.6239355,1
0.1642584,0.7136657,1
0.101984605,0.7026347,1
0.116497494,0.75794154,1
0.1222832,0.7889294,1
0.17097071,0.76334417,1
0.09835281,0.7088923,1
0.112413704,0.7233893,1
0.0804299,0.59918165,1
0.12628342,0.75663507,1
0.13764675,0.7770319,1
0.12271786,0.8160936,1
0.106207326,0.780137,1
0.16399956,0.74859625,1
0.1550056,0.70696574,1
0.14351243,0.7512954,1
0.15314172,0.7608123,1
0.13789277,0.7446537,1
0.10138466,0.7158488,1
0.116496,0.81352717,1
0.13204741,0.44324392,1
0.18338847,0.77325886,1
0.15740418,0.6956263,1
0.119899936,0.7744208,1
0.16865611,0.7549878,1
0.15797757,0.7496,1
0.08095278,0.5368441,1
0.119849585,0.8155965,1
0.13772488,0.8251933,1
0.14605294,0.81398517,1
0.147715,0.7568861,1
0.11993408,0.80512756,1
0.11689779,0.7684566,1
0.13146755,0.81675327,1
0.12677082,0.8051893,1
0.10369445,0.7875505,1
0.122040205,0.81399494,1
0.15270884,0.7171012,1
0.093561314,0.46841547,1
0.14254655,0.8034467,1
0.123489484,0.79741514,1
0.15380432,0.69365865,1
0.17835009,0.82591355,1
0.18826438,0.823963,1
0.12930934,0.7358273,1
0.15027955,0.7081536,1
0.2094318,0.6843711,1
0.17303483,0.7069631,1
0.14020696,0.8090482,1
0.17983465,0.68340194,1
0.18433799,0.7637287,1
0.15551339,0.7683845,1
0.11230703,0.79569876,1
0.1620477,0.68283784,1
0.13160454,0.8013109,1
0.09245579,0.62879103,1
0.09058142,0.5913433,1
0.10200749,0.46072322,1
0.14015758,0.7427707,1
0.07838236,0.48934212,1
0.10707545,0.6912079,1
0.09218201,0.46217015,1
0.096206166,0.7262811,1
0.0939693,0.5924592,1
0.16465917,0.70433897,1
0.09026704,0.49302956,1
0.1122508,0.7841329,1
0.1755957,0.6896941,1
0.17931661,0.81937283,1
0.082949676,0.4940965,1
0.08182449,0.54781747,1
0.18613681,0.8200646,1
0.17250252,0.8260488,1
0.12839663,0.81740993,1
0.13029607,0.8161184,1
0.11445297,0.4855231,1
0.17673902,0.81759006,1
0.121382125,0.8009427,1
0.16929051,0.82779866,1
0.10379525,0.7699691,1
0.118430614,0.3599524,1
0.10557813,0.39094815,1
0.13627687,0.7395696,1
0.1359977,0.7565745,1
0.08876713,0.5763405,1
0.08739674,0.6360905,1
0.15976985,0.69064766,1
0.10577472,0.73854816,1
0.13596773,0.6473808,1
0.10683897,0.3766242,1
0.10086734,0.38990885,1
0.1490162,0.7537613,1
0.15062426,0.6332213,1
0.10675913,0.75948495,1
0.15304779,0.6598145,1
0.15186025,0.65289015,1
0.13831824,0.75093925,1
0.09471683,0.45980084,1
0.12049274,0.5842385,1
0.083324045,0.4781618,1
0.16431883,0.6442017,1
0.18735251,0.7272397,1
0.09381403,0.39386874,1
0.14297125,0.741265,1
0.09582409,0.44328827,1
0.19884704,0.7141536,1
0.099354535,0.4033759,1
0.08800609,0.44071874,1
0.089442566,0.5126042,1
0.13283354,0.7801576,1
0.11235941,0.51473266,1
0.09218345,0.72665614,1
0.095199436,0.6465207,1
0.121132605,0.78141594,1
0.09609444,0.74182713,1
0.14612688,0.7387454,1
0.08665506,0.6854436,1
0.093747795,0.6120131,1
0.10336577,0.7200329,1
0.126923,0.79535514,1
0.13365732,0.75811154,1
0.12348397,0.72776306,1
0.07972298,0.49567854,1
0.15765284,0.77436894,1
0.0988918,0.6646086,1
0.09987925,0.66499853,1
0.12542391,0.7154445,1
0.10310395,0.69453907,1
0.1253005,0.7715418,1
0.11867259,0.78932655,1
0.17193402,0.6615134,1
0.14630021,0.78169674,1
0.18433292,0.6798732,1
0.11363347,0.7946916,1
0.09676275,0.50934327,1
0.12932739,0.77303636,1
0.12893733,0.7277115,1
0.09331834,0.47449008,1
0.10062225,0.39666408,1
0.08526634,0.68219924,1
0.09744137,0.474043,1
0.07914639,0.6055207,1
0.09230182,0.6637722,1
0.123752296,0.7689482,1
0.11616344,0.7772187,1
0.07996825,0.61188984,1
0.080361925,0.60818344,1
0.14106907,0.77694577,1
0.10890151,0.43779936,1
0.13268836,0.7368361,1
0.10243353,0.52377933,1
0.14818168,0.72615266,1
0.1533994,0.7079247,1
0.13952349,0.7419577,1
0.08609191,0.54560477,1
0.09970288,0.5855304,1
0.20127639,0.61335266,1
0.09348316,0.48738843,1
0.1469144,0.67850167,1
0.08427408,0.6361541,1
0.14549786,0.7178282,1
0.10108563,0.4665802,1
0.18711148,0.6797902,1
0.1690762,0.69444895,1
0.095758274,0.6523265,1
0.083267786,0.6745881,1
0.16118461,0.6842213,1
0.09521555,0.43060017,1
0.124798805,0.7495526,1
0.08572527,0.4510981,1
0.08406446,0.5955393,1
0.088559076,0.62488633,1
0.13515759,0.77807844,1
0.09093061,0.41901925,1
0.08693732,0.5430991,1
0.113224186,0.75166875,1
0.083013095,0.65236807,1
0.08239377,0.5050319,1
0.088286094,0.63077927,1
0.09959677,0.75137264,1
0.1427629,0.7860928,1
0.100019224,0.47276992,1
0.09233961,0.5556762,1
0.086384565,0.5615448,1
0.10590464,0.74196166,1
0.08642517,0.6772602,1
0.09258876,0.52510476,1
0.14785886,0.71299326,1
0.084391326,0.64760876,1
0.09231212,0.67061496,1
0.09641605,0.40109414,1
0.1139777,0.3672338,1
0.1123183,0.7816062,1
0.11055813,0.58725625,1
0.117681704,0.7422914,1
0.0849298,0.6710833,1
0.16654348,0.69039565,1
0.18691117,0.39005232,1
0.11976907,0.49853647,1
0.12104567,0.364088,1
0.13344032,0.3638898,1
0.09725878,0.45221996,1
0.09127676,0.6550628,1
0.09637228,0.53526175,1
0.120303415,0.37382847,1
0.121992126,0.368895,1
0.11094482,0.63379735,1
0.0964617,0.41213194,1
0.11031668,0.3777485,1
0.11844973,0.38754126,1
0.089889124,0.5441221,1
0.08505936,0.49842077,1
0.09209309,0.4242098,1
0.1278732,0.36052442,1
0.14150621,0.353156,1
0.12628582,0.5791393,1
0.08881143,0.4723267,1
0.155232,0.6942427,1
0.13314462,0.46277583,1
0.0918309,0.5384104,1
0.1481939,0.61678195,1
0.09365433,0.5865144,1
0.11313566,0.37009346,1
0.09101615,0.6640009,1
0.09476521,0.54597104,1
0.08820675,0.42804384,1
0.08046523,0.5050345,1
0.09062237,0.426316,1
0.09796122,0.43575484,1
0.098834954,0.64431304,1
0.10326365,0.38321462,1
0.08680745,0.5330888,1
0.13560416,0.57407284,1
0.12622486,0.3804621,1
0.12702653,0.62809134,1
0.21377277,0.3864725,1
0.107285954,0.7792553,1
0.10803567,0.75308436,1
0.10721461,0.5186274,1
0.19018942,0.6965015,1
0.09421716,0.4962197,1
0.09559553,0.40994915,1
0.14266092,0.5489593,1
0.12518083,0.7205689,1
0.08188843,0.5005684,1
0.109797284,0.37532935,1
0.10554957,0.40632442,1
0.09386911,0.732446,1
0.1004046,0.38587144,1
0.09868794,0.4335701,1
0.12785599,0.37027696,1
0.0974836,0.46684265,1
0.1299955,0.4162767,1
0.102112584,0.40173748,1
0.09253997,0.45694968,1
0.08865226,0.46363094,1
0.095808886,0.57100254,1
0.099240474,0.42506197,1
0.12612866,0.7761462,1
0.086442254,0.6033936,1
0.08963501,0.5982653,1
0.102000475,0.5111942,1
0.13213031,0.37551674,1
0.09113412,0.54161704,1
0.13190973,0.7665077,1
0.099687606,0.7481159,1
0.10681953,0.38881525,1
0.09577243,0.3996031,1
0.101431146,0.5784532,1
0.08372182,0.6381827,1
0.171929,0.8035093,1
0.09128717,0.5258659,1
0.16250932,0.7094867,1
0.08294568,0.6237482,1
0.084635034,0.54759675,1
0.087352104,0.5348604,1
0.0871832,0.48032966,1
0.108500615,0.38902643,1
0.09070876,0.50885653,1
0.12533864,0.7535395,1
0.098796755,0.53705144,1
0.10309187,0.39808974,1
0.07981749,0.56252545,1
0.10307307,0.5252,1
0.11020568,0.43473315,1
0.17770243,0.58872885,1
0.09510825,0.521885,1
0.08009427,0.542975,1
0.10635941,0.66307366,1
0.13515669,0.36777714,1
0.09731033,0.54379684,1
0.14404592,0.6924345,1
0.11147417,0.5720207,1
0.10280919,0.42000768,1
0.10044225,0.40599182,1
0.091130815,0.45849746,1
0.102365255,0.44390625,1
0.09686303,0.4398421,1
0.09837793,0.6094961,1
0.099050716,0.5217393,1
0.08752486,0.55706656,1
0.1902844,0.757491,1
0.10662391,0.44093928,1
0.10067065,0.6681272,1
0.106815465,0.45296738,1
0.13031778,0.3612324,1
0.1286537,0.54207206,1
0.08861437,0.6101273,1
0.08348254,0.55001754,1
0.082980365,0.49985284,1
0.09696745,0.4045294,1
0.11074488,0.7328271,1
0.10054306,0.5666816,1
0.10361627,0.64349926,1
0.110942826,0.40068272,1
0.0984091,0.41051066,1
0.09620591,0.4188923,1
0.11036427,0.4612883,1
0.15939167,0.68508875,1
0.118844084,0.73618364,1
0.11697593,0.5204834,1
0.14138518,0.565026,1
0.11290946,0.38243258,1
0.10728804,0.3987118,1
0.10202985,0.55151576,1
0.11082564,0.37156603,1
0.15832402,0.42739996,1
0.08084928,0.5765631,1
0.14116222,0.3348278,1
0.15804464,0.6950546,1
0.13231252,0.7158969,1
0.2505207,0.33557737,1
0.095527515,0.41869384,1
0.13069932,0.41117814,1
0.11172562,0.4169101,1
0.08028911,0.51085126,1
0.10259092,0.397443,1
0.08556749,0.48002815,1
0.07715191,0.58084786,1
0.11728718,0.41277587,1
0.095170215,0.5499026,1
0.091798626,0.43784478,1
0.083178505,0.6656307,1
0.11260955,0.5910951,1
0.11131506,0.4834993,1
0.14155607,0.62504745,1
0.13756426,0.35317272,1
0.095638685,0.4869672,1
0.109377265,0.41133446,1
0.117292754,0.37417772,1
0.115129195,0.37121242,1
0.11539926,0.6366764,1
0.10323715,0.44603327,1
0.092579775,0.47248125,1
0.110193744,0.679291,1
0.099506155,0.58547074,1
0.11410889,0.37679586,1
0.11745558,0.55483156,1
0.13946956,0.36864635,1
0.08802816,0.43057552,1
0.121101305,0.6629757,1
0.1182154,0.37826255,1
0.10684437,0.40157416,1
0.15395635,0.72710943,1
0.11330994,0.5241064,1
0.11824499,0.39840952,1
0.09713438,0.41409355,1
0.10369083,0.4464558,1
0.16179135,0.69425154,1
0.112481244,0.7775414,1
0.103456885,0.68964225,1
0.13427448,0.3547102,1
0.1356163,0.69340235,1
0.11144409,0.38638178,1
0.12988235,0.44720343,1
0.10563262,0.40146333,1
0.086295806,0.674171,1
0.10004252,0.3926781,1
0.13003112,0.70941406,1
0.0964889,0.6266661,1
0.11314805,0.3765216,1
0.099995844,0.6045911,1
0.1042582,0.5490397,1
0.11961866,0.6208323,1
0.08420301,0.48173016,1
0.12347619,0.37579638,1
0.08626192,0.67466563,1
0.09316635,0.55373734,1
0.10653244,0.39038888,1
0.10758614,0.3877001,1
0.08241584,0.53359175,1
0.09755252,0.43512145,1
0.09252821,0.484698,1
0.14706184,0.6836673,1
0.101111226,0.48090738,1
0.08744818,0.4641701,1
0.09600979,0.47411224,1
0.12597446,0.40763238,1
0.1651482,0.65081525,1
0.12284648,0.3742998,1
0.09100293,0.60462666,1
0.10496977,0.43631965,1
0.07873443,0.4866726,1
0.12918285,0.6349558,1
0.08731801,0.43805107,1
0.11240561,0.49341026,1
0.10835822,0.7475682,1
0.108000234,0.3867391,1
0.100411125,0.5395363,1
0.10467134,0.5065169,1
0.12158125,0.36516455,1
0.118834846,0.3625052,1
0.0974647,0.5766313,1
0.09508767,0.41578162,1
0.09071453,0.4618478,1
0.09226396,0.5680034,1
0.086820155,0.46006095,1
0.085308,0.44187045,1
0.10347532,0.39247447,1
0.110105805,0.39087522,1
0.13029893,0.42938298,1
0.17108746,0.75927275,1
0.11477733,0.38395643,1
0.092022546,0.6178897,1
0.18602405,0.5875526,1
0.08786272,0.45236453,1
0.08296145,0.51683265,1
0.092057884,0.44887385,1
0.111407585,0.38873294,1
0.124982566,0.35282958,1
0.09485331,0.5408957,1
0.10019056,0.7649652,1
0.07741293,0.52009356,1
0.1507605,0.69947106,1
0.1561882,0.3537173,1
0.09784796,0.438466,1
0.09484018,0.70476073,1
0.09563211,0.44151828,1
0.10308687,0.556949,1
0.146164,0.35516995,1
0.11922549,0.41142666,1
0.08238959,0.5613914,1
0.098399095,0.40227413,1
0.12790208,0.3657707,1
0.11879706,0.38044244,1
0.08517937,0.45163593,1
0.09860298,0.6657509,1
0.10055458,0.39861143,1
0.11522791,0.43705127,1
0.08713853,0.48477888,1
0.09455584,0.4389709,1
0.08179907,0.5046963,1
0.093713365,0.4109419,1
0.09485934,0.4123977,1
0.09472613,0.621974,1
0.10345707,0.39037815,1
0.08320405,0.5628806,1
0.10139019,0.39510426,1
0.082274616,0.48708913,1
0.0832315,0.4431133,1
0.09602399,0.5463121,1
0.16278341,0.3639414,1
0.11103662,0.6698416,1
0.15239781,0.5806113,1
0.10990613,0.5893073,1
0.118386276,0.37765375,1
0.12827533,0.70196915,1
0.082387105,0.5219066,1
0.15408291,0.36072743,1
0.10192021,0.7665328,1
0.15031354,0.3577169,1
0.100895785,0.40499744,1
0.10069785,0.5802214,1
0.11221758,0.3749504,1
0.08345895,0.508016,1
0.10450158,0.40681222,1
0.10126802,0.60440934,1
0.10148639,0.517849,1
0.12731783,0.65775216,1
0.10416789,0.42106992,1
0.09233189,0.72492933,1
0.08581574,0.5109141,1
0.123290956,0.36387804,1
0.086690724,0.6852613,1
0.0829052,0.5017653,1
0.13005823,0.7837276,1
0.081027605,0.49572197,1
0.08527335,0.50510305,1
0.10660972,0.42115524,1
0.09459924,0.40946296,1
0.10684599,0.4034784,1
0.08103401,0.6373601,1
0.11148292,0.39981788,1
0.09534169,0.62855047,1
0.11887327,0.7444879,1
0.09733738,0.7417173,1
0.09037619,0.5705622,1
0.093476385,0.4682166,1
0.104451194,0.4079479,1
0.096239254,0.46052045,1
0.18474951,0.38143042,1
0.07817153,0.57388645,1
0.103797734,0.4719792,1
0.11204147,0.38983494,1
0.09366143,0.594291,1
0.087751,0.4864678,1
0.1042754,0.39555913,1
0.08851421,0.48472297,1
0.14513035,0.66013515,1
0.10514916,0.43215623,1
0.11793801,0.42669272,1
0.1234627,0.3924928,1
0.10897299,0.38774136,1
0.09571256,0.48831302,1
0.09079057,0.72405314,1
0.09223172,0.47292945,1
0.094054446,0.40694213,1
0.100513905,0.7385057,1
0.107093684,0.46787408,1
0.120292194,0.359999,1
0.110725544,0.4264469,1
0.11200673,0.42017004,1
0.118936494,0.64730847,1
0.13757691,0.42403594,1
0.08977855,0.46110234,1
0.08289009,0.535661,1
0.121862136,0.7083876,1
0.09999337,0.7651201,1
0.11042933,0.6713238,1
0.10276456,0.56353617,1
0.08581214,0.5313568,1
0.087377384,0.4860982,1
0.10688716,0.5708771,1
0.101312324,0.42473355,1
0.1156368,0.41853914,1
0.10788853,0.39721274,1
0.084813945,0.5577939,1
0.09841973,0.42529228,1
0.09115139,0.4381449,1
0.10013416,0.39571998,1
0.102595024,0.48933288,1
0.10087816,0.46729934,1
0.10870089,0.37794355,1
0.11213671,0.38901353,1
0.091117635,0.5192258,1
0.107566886,0.44511724,1
0.10649593,0.3946429,1
0.08759302,0.47454587,1
0.09151035,0.54656076,1
0.08541242,0.5707957,1
0.106971115,0.67171466,1
0.13161927,0.7089756,1
0.08505336,0.4589862,1
0.121225305,0.65130955,1
0.099002466,0.40578905,1
0.13931644,0.34705657,1
0.13256064,0.3641622,1
0.10037067,0.43383852,1
0.096773446,0.40006974,1
0.08898874,0.73458964,1
0.09183786,0.5318412,1
0.13242857,0.58996266,1
0.11651468,0.5020117,1
0.15188248,0.3929603,1
0.12395234,0.36758208,1
0.11105847,0.39388785,1
0.083762184,0.63306564,1
0.105511226,0.3970029,1
0.12883583,0.73576665,1
0.11573237,0.765426,1
0.13150737,0.76551163,1
0.110414535,0.70807135,1
0.1161268,0.7637361,1
0.10513358,0.69220036,1
0.21549003,0.5270072,1
0.099194124,0.6279665,1
0.12811898,0.71922034,1
0.10047758,0.7073444,1
0.090763256,0.6797692,1
0.12698796,0.6972568,1
0.104531184,0.69053435,1
0.080572546,0.59909815,1
0.08337581,0.59814006,1
0.11150988,0.7729217,1
0.10178806,0.7335098,1
0.1701302,0.5215609,1
0.12419615,0.78088653,1
0.0992935,0.38767624,1
0.12552156,0.7654612,1
0.1051258,0.38606063,1
0.09152461,0.42651686,1
0.07953704,0.59792787,1
0.09091719,0.6079385,1
0.08854546,0.45082673,1
0.09113515,0.50010675,1
0.18501163,0.5178656,1
0.096577,0.39702925,1
0.0990802,0.41318837,1
0.10215781,0.40449587,1
0.09530108,0.42120722,1
0.11413415,0.3939276,1
0.08154631,0.53463656,1
0.09735413,0.5054035,1
0.08176427,0.51489025,1
0.08793144,0.4191464,1
0.081412576,0.52384526,1
0.09121798,0.42142817,1
0.080033295,0.5102777,1
0.093967006,0.42718676,1
0.08307985,0.5172243,1
0.10519139,0.38756633,1
0.10364766,0.767918,1
0.12267622,0.7706011,1
0.11617317,0.7648204,1
0.10942535,0.78055406,1
0.12339038,0.7156183,1
0.09437985,0.71986187,1
0.10829646,0.77651596,1
0.13522346,0.7654812,1
0.09386209,0.69805205,1
0.1058481,0.69524586,1
0.109038085,0.73988897,1
0.11485406,0.39605713,1
0.09976347,0.44976828,1
0.107204646,0.56466895,1
0.09473456,0.4150707,1
0.18159208,0.60108954,1
0.08986262,0.46646795,1
0.120738365,0.6629417,1
0.085694455,0.48114175,1
0.12459321,0.35038167,1
0.08874668,0.4674537,1
0.09947441,0.4700558,1
0.10429825,0.69884735,1
0.1269071,0.7943383,1
0.14482152,0.8152332,1
0.11642474,0.7993848,1
0.10711782,0.77991563,1
0.1192579,0.790354,1
0.08948929,0.6844166,1
0.1495576,0.7837014,1
0.1303314,0.73273987,1
0.14149007,0.70153147,1
0.11584112,0.6694234,1
0.09468049,0.7161353,1
0.09660788,0.5835667,1
0.094101034,0.4247086,1
0.09306003,0.7049459,1
0.115176775,0.6304739,1
0.095499955,0.612082,1
0.14756134,0.69989324,1
0.09322681,0.6237532,1
0.10936426,0.7337708,1
0.15018854,0.7696144,1
0.11326451,0.69894385,1
0.13109626,0.77914315,1
0.12646821,0.78718656,1
0.1046591,0.4111343,1
0.11171022,0.5839518,1
0.08425566,0.4296497,1
0.0897001,0.59868234,1
0.09033276,0.69393796,1
0.08500756,0.644899,1
0.10024501,0.6994501,1
0.12003903,0.7292509,1
0.1275623,0.7419023,1
0.101913564,0.67969644,1
0.12529036,0.7486817,1
0.10776418,0.66100967,1
0.08826145,0.64741683,1
0.09956972,0.64214367,1
0.09075454,0.6192493,1
0.088270746,0.6135629,1
0.09563737,0.65483254,1
0.09391902,0.6736877,1
0.0864376,0.6276914,1
0.07845107,0.54191965,1
0.07868586,0.60578585,1
0.0787859,0.56759745,1
0.08824459,0.67130506,1
0.10139056,0.63077396,1
0.08593165,0.46175557,1
0.09966307,0.4503123,1
0.082651444,0.59196436,1
0.10131892,0.40793508,1
0.09727896,0.6170432,1
0.118551485,0.77049935,1
0.14335388,0.7574255,1
0.14310797,0.7395355,1
0.13191147,0.776459,1
0.1079373,0.71541804,1
0.11395549,0.7716049,1
0.14384,0.74558973,1
0.12966613,0.7673286,1
0.11889427,0.705088,1
0.15636447,0.75287676,1
0.13161638,0.74361503,1
0.1078554,0.7475821,1
0.090568,0.48534507,1
0.10330562,0.4050126,1
0.08596342,0.57769376,1
0.09107938,0.46294364,1
0.08648925,0.42887267,1
0.09032979,0.5706084,1
0.09500057,0.7084675,1
0.091224335,0.66927814,1
0.109670155,0.7759024,1
0.09807183,0.39367616,1
0.09845305,0.38811016,1
0.09986768,0.4756647,1
0.09300422,0.5338271,1
0.090563454,0.40836716,1
0.08733328,0.6725062,1
0.13005014,0.76811934,1
0.100987144,0.47335458,1
0.103125304,0.739348,1
0.13101186,0.70550585,1
0.10581395,0.6798664,1
0.09300683,0.6032359,1
0.08877419,0.5919469,1
0.09550914,0.6192659,1
0.09033847,0.6765169,1
0.13263436,0.68169993,1
0.15674613,0.67703694,1
0.096185915,0.7025477,1
0.09684571,0.5999768,1
0.09964047,0.40765747,1
0.09904025,0.38990647,1
0.09589577,0.543159,1
0.09583129,0.4692241,1
0.10294874,0.5985324,1
0.08289083,0.5231632,1
0.09050392,0.57391983,1
0.08740219,0.599413,1
0.08799126,0.6319508,1
0.12556715,0.35420042,1
0.100816056,0.39313033,1
0.12338425,0.3615875,1
0.1219688,0.353627,1
0.09136579,0.41600505,1
0.13132313,0.3560895,1
0.14601289,0.33957157,1
0.10532148,0.3872863,1
0.12618233,0.36499155,1
0.12764925,0.35726276,1
0.13072221,0.3571536,1
0.1300694,0.34953442,1
0.12279679,0.371289,1
0.112861924,0.3608775,1
0.09362556,0.42732558,1
0.15398182,0.36456048,1
0.14811443,0.33927166,1
0.10157242,0.405957,1
0.095485285,0.4540318,1
0.117690794,0.363615,1
0.11673003,0.6094295,1
0.13229403,0.6242794,1
0.13390379,0.4121105,1
0.10076221,0.48174077,1
0.08280178,0.56456906,1
0.11151302,0.6063932,1
0.0909827,0.4672935,1
0.11203166,0.38831404,1
0.09149262,0.42069796,1
0.1098732,0.3697039,1
0.11599632,0.38736862,1
0.1019729,0.40636316,1
0.12663051,0.38048849,1
0.12350977,0.3630482,1
0.114611864,0.38471,1
0.088756144,0.4225542,1
0.13754624,0.71355706,1
0.099912405,0.42549804,1
0.10134342,0.5248662,1
0.09480531,0.56168836,1
0.08083912,0.54050815,1
0.09248336,0.42256117,1
0.11251991,0.40478003,1
0.0962365,0.5798803,1
0.08322899,0.4837675,1
0.08344309,0.48705605,1
0.09312915,0.72353935,1
0.09700555,0.4154848,1
0.08504284,0.53900576,1
0.09294091,0.439967,1
0.14035736,0.4081645,1
0.09154131,0.4527777,1
0.09143505,0.51404,1
0.09237766,0.44531152,1
0.09061004,0.57168466,1
0.1432623,0.6534315,1
0.121808186,0.4261729,1
0.107967496,0.37515715,1
0.084496185,0.49972352,1
0.16588902,0.7092276,1
0.099009685,0.6560297,1
0.21963,0.39515305,1
0.09481112,0.6104103,1
0.08988862,0.47363868,1
0.09952985,0.42472297,1
0.096853994,0.6747726,1
0.09600993,0.55139625,1
0.1025859,0.56141406,1
0.1006577,0.6918708,1
0.123082876,0.37749735,1
0.10463763,0.56632644,1
0.102047324,0.6002456,1
0.102772936,0.41350487,1
0.10420069,0.58631355,1
0.10213486,0.52485067,1
0.09788178,0.39459038,1
0.07847529,0.52388364,1
0.103295304,0.39223695,1
0.17074288,0.5892428,1
0.103341736,0.60435015,1
0.09387388,0.5731174,1
0.09615824,0.4705842,1
0.099002466,0.47473976,1
0.115842454,0.6889029,1
0.09607153,0.40356195,1
0.09645331,0.4086416,1
0.09184668,0.64532006,1
0.11493751,0.37644094,1
0.09993958,0.5026425,1
0.096201845,0.3989988,1
0.10075832,0.39146596,1
0.08516674,0.49837333,1
0.114532255,0.38116062,1
0.09449084,0.42386308,1
0.09611746,0.69469213,1
0.10160091,0.5099325,1
0.1200614,0.475838,1
0.09413487,0.4074233,1
0.10118295,0.7347309,1
0.14933418,0.35813203,1
0.1473981,0.7687931,1
0.10982338,0.37534675,1
0.13243271,0.3576541,1
0.1026034,0.6357748,1
0.084858894,0.47459313,1
0.10536543,0.38813776,1
0.08115157,0.6553967,1
0.09929264,0.7507494,1
0.11682707,0.41241878,1
0.09238078,0.4317792,1
0.11391412,0.36173517,1
0.12253636,0.3558685,1
0.11651528,0.6712617,1
0.09422271,0.597079,1
0.11975667,0.39125788,1
0.09676722,0.5209445,1
0.093746446,0.43298787,1
0.11429641,0.44071165,1
0.10223668,0.4428149,1
0.12810253,0.6658339,1
0.096661635,0.4276257,1
0.10409753,0.69519025,1
0.1072197,0.5776978,1
0.084244184,0.478964,1
0.1488723,0.6607833,1
0.11863605,0.3681588,1
0.100267164,0.70164347,1
0.08740298,0.5830415,1
0.09178207,0.7058448,1
0.12030021,0.64431065,1
0.11841953,0.37731183,1
0.10981891,0.4189544,1
0.1129977,0.36016405,1
0.10014691,0.5063548,1
0.096106306,0.6902052,1
0.11692594,0.6286262,1
0.118999526,0.41383347,1
0.080038585,0.509299,1
0.119588375,0.43010396,1
0.09101384,0.5316686,1
0.0951001,0.55112493,1
0.08360386,0.63972104,1
0.12701829,0.35213134,1
0.10946862,0.3960339,1
0.10508041,0.42744857,1
0.11587076,0.36897957,1
0.10759249,0.5375778,1
0.13056394,0.5341384,1
0.07989042,0.6098748,1
0.14676812,0.6576474,1
0.099721305,0.7112336,1
0.10856086,0.40645,1
0.12890212,0.48996487,1
0.11487953,0.67451847,1
0.0819858,0.52144736,1
0.101173356,0.42111334,1
0.117535956,0.6478062,1
0.08377203,0.43979916,1
0.09929952,0.45021957,1
0.10157365,0.40609163,1
0.0989997,0.47719005,1
0.108387545,0.3764779,1
0.15754105,0.6248171,1
0.09260363,0.4154597,1
0.09310968,0.41556177,1
0.16815287,0.61512196,1
0.106032535,0.41612214,1
0.13824034,0.35027128,1
0.0771764,0.5339326,1
0.084463716,0.5574293,1
0.08206844,0.46580273,1
0.109261565,0.5016003,1
0.089334734,0.42097083,1
0.088988945,0.6330536,1
0.110322095,0.5539872,1
0.094304495,0.6376124,1
0.0789644,0.5737811,1
0.092716984,0.41636693,1
0.18457757,0.35623777,1
0.22450647,0.44060722,1
0.10565495,0.54156715,1
0.12482306,0.36258203,1
0.16994019,0.69614047,1
0.14522035,0.3498856,1
0.09741344,0.4133766,1
0.11199835,0.5052648,1
0.11022039,0.64995134,1
0.089582816,0.5248175,1
0.091534555,0.5838828,1
0.09816799,0.40858597,1
0.11494121,0.3718135,1
0.07928213,0.62293917,1
0.089324,0.47582498,1
0.13094231,0.628617,1
0.10151671,0.43236688,1
0.13214245,0.6831589,1
0.09056199,0.50023454,1
0.10291478,0.4290594,1
0.09228378,0.6817576,1
0.104252934,0.3857981,1
0.1397097,0.7697967,1
0.10384354,0.39769268,1
0.13187692,0.5990217,1
0.09014973,0.6916278,1
