{
    "dimensionality_reduction_methods": "['PCA', 'UMAP', 'TSVD']",
    "proportions": "[0.6, 0.4, 0]",
    "dataset": "nmnist",
    "number_of_classes": "2",
    "number_of_points": "10000",
    "number_of_Tsamples": "5000",
    "number_ofVsamples": "1000",
    "loss": "0.00021489964274223894",
    "trustworthiness": "0.880283193556796",
    "continuity": "0.9451776452565224",
    "neighborhood_hit": "0.9991219182708543"
}