{
    "dimensionality_reduction_methods": "['PCA', 'UMAP', 'TSVD']",
    "proportions": "[0, 0.1, 0.9]",
    "dataset": "nmnist",
    "number_of_classes": "2",
    "number_of_points": "10000",
    "number_of_Tsamples": "2000",
    "number_ofVsamples": "1000",
    "loss": "0.003131014062091708",
    "trustworthiness": "0.8940538149299576",
    "continuity": "0.9448523453822377",
    "neighborhood_hit": "0.9986491050320838"
}