PC1,PC2,label
0.48598576,0.24350679,0
0.51339453,0.18683363,0
0.38271865,0.36239657,0
0.37725797,0.22106567,0
0.81670386,0.35465327,0
0.70515114,0.15520151,0
0.3045559,0.36303353,0
0.82937014,0.36790264,0
0.5416871,0.39771196,0
0.79231733,0.37642038,0
0.36736545,0.20568891,0
0.5008511,0.18228061,0
0.780763,0.32659432,0
0.62981087,0.16614188,0
0.5848176,0.15415546,0
0.7623127,0.5035322,0
0.8240959,0.3799551,0
0.4194701,0.28975588,0
0.8206085,0.34919927,0
0.6910549,0.2294034,0
0.602083,0.31764215,0
0.7440938,0.31248537,0
0.6143288,0.3504823,0
0.7086118,0.23579943,0
0.7527549,0.30875793,0
0.4870612,0.27281436,0
0.47418353,0.44842786,0
0.56758136,0.16922772,0
0.85060656,0.28038487,0
0.6886416,0.20910753,0
0.30766946,0.37836304,0
0.8122278,0.46438214,0
0.82573134,0.3015911,0
0.83494765,0.44135684,0
0.82085174,0.2646942,0
0.5582991,0.17240371,0
0.8238664,0.40146878,0
0.69146574,0.2676262,0
0.42458975,0.16638127,0
0.41128063,0.24453036,0
0.6398569,0.1911031,0
0.36674193,0.27728447,0
0.7917954,0.33669412,0
0.52290213,0.29633278,0
0.6715757,0.39274967,0
0.4285378,0.3982694,0
0.7606874,0.2556572,0
0.448909,0.20858477,0
0.72580403,0.2549168,0
0.83755666,0.4204627,0
0.8143034,0.4183426,0
0.49210274,0.22648574,0
0.80149746,0.35399768,0
0.836054,0.29786336,0
0.5623833,0.18386346,0
0.31666464,0.6087871,0
0.694675,0.28486258,0
0.5712486,0.19940098,0
0.6721316,0.19164452,0
0.61691827,0.304713,0
0.35668993,0.16997446,0
0.4857134,0.19075136,0
0.44888574,0.2293205,0
0.6820916,0.19923557,0
0.8233094,0.24873483,0
0.47643456,0.32527506,0
0.66797227,0.3164956,0
0.41171956,0.33393097,0
0.6346901,0.17576678,0
0.63525015,0.18502262,0
0.48965055,0.22465041,0
0.6341957,0.32396877,0
0.4564714,0.27093682,0
0.5219907,0.23987217,0
0.52267784,0.17219089,0
0.5610732,0.23340783,0
0.58841187,0.32577413,0
0.639914,0.23501904,0
0.61976975,0.19382079,0
0.6167191,0.3526676,0
0.69982046,0.29087052,0
0.46704322,0.23804936,0
0.37808657,0.27649802,0
0.59049666,0.3238482,0
0.5662943,0.3958029,0
0.5600314,0.21985035,0
0.28577256,0.44950134,0
0.38168472,0.24662441,0
0.39242902,0.3508193,0
0.76293975,0.3206386,0
0.5876731,0.28073663,0
0.6276162,0.42350656,0
0.6052618,0.46004876,0
0.42759493,0.6394888,0
0.4777111,0.3014882,0
0.71178025,0.50510025,0
0.49929658,0.4078977,0
0.68358654,0.18433635,0
0.4421198,0.18574446,0
0.5148865,0.5503939,0
0.3558551,0.267312,0
0.3842833,0.22547325,0
0.7295283,0.20935388,0
0.48216,0.15126677,0
0.43211475,0.24000111,0
0.6480195,0.28254062,0
0.45256537,0.18626505,0
0.6634524,0.37660715,0
0.62810344,0.30209753,0
0.434516,0.2521051,0
0.37906536,0.23467453,0
0.71307725,0.29209504,0
0.5603808,0.16653506,0
0.69315964,0.39654005,0
0.83639127,0.24079193,0
0.5152106,0.30400407,0
0.39801294,0.23484477,0
0.48187262,0.46202245,0
0.59982204,0.19520247,0
0.6413299,0.33695588,0
0.7979596,0.26521257,0
0.7604983,0.32672727,0
0.59449816,0.23235247,0
0.6730815,0.28235048,0
0.599338,0.17049639,0
0.7087347,0.28241155,0
0.5159183,0.19642214,0
0.5636592,0.19328143,0
0.59666944,0.23713449,0
0.5513397,0.40500072,0
0.39962202,0.3481548,0
0.5310734,0.17883424,0
0.5082901,0.2503654,0
0.5159209,0.3046665,0
0.4585412,0.2136894,0
0.64854544,0.14251265,0
0.53738534,0.2784666,0
0.33399987,0.37336642,0
0.5283115,0.30955353,0
0.40048572,0.3163703,0
0.364988,0.31053224,0
0.38971588,0.22550172,0
0.5256925,0.17216237,0
0.8436759,0.29435965,0
0.78917754,0.46265015,0
0.46585086,0.37019753,0
0.6620612,0.3761799,0
0.346021,0.39101592,0
0.37055114,0.2873514,0
0.7085534,0.16501592,0
0.53943884,0.2098732,0
0.43956327,0.5416537,0
0.37443358,0.22393805,0
0.4802534,0.40044993,0
0.463159,0.407643,0
0.4806829,0.40480334,0
0.4474733,0.4218183,0
0.4746273,0.41840184,0
0.47346604,0.24796575,0
0.4422064,0.34243008,0
0.59756774,0.3510623,0
0.60450846,0.25073582,0
0.40600157,0.35744575,0
0.45065755,0.2366202,0
0.444541,0.4229466,0
0.33910993,0.44707856,0
0.51185614,0.21639907,0
0.47100595,0.42360175,0
0.39785853,0.3620257,0
0.63986,0.3255196,0
0.54455477,0.24053006,0
0.34543142,0.3543645,0
0.5468464,0.23758797,0
0.5735186,0.22288059,0
0.37176552,0.5494714,0
0.59807557,0.37983036,0
0.53262264,0.2039525,0
0.5045797,0.258075,0
0.26982144,0.34070182,0
0.37187463,0.2149816,0
0.5745407,0.24394904,0
0.56720054,0.24161172,0
0.49486294,0.5504434,0
0.349328,0.226751,0
0.7975222,0.181709,0
0.65866536,0.2781331,0
0.5051311,0.22154593,0
0.36806205,0.34736738,0
0.4557174,0.21776943,0
0.5014625,0.20433941,0
0.7503608,0.31522086,0
0.7132417,0.22325887,0
0.5665951,0.27687377,0
0.7247271,0.19544396,0
0.49933124,0.35499918,0
0.7246014,0.18990172,0
0.5025662,0.40985513,0
0.5899197,0.18202722,0
0.60474336,0.35858902,0
0.54160357,0.1897715,0
0.4066952,0.20984884,0
0.5984455,0.33956507,0
0.73416096,0.3990581,0
0.3455787,0.1889373,0
0.4849956,0.32539114,0
0.40060523,0.4938715,0
0.7064598,0.19415785,0
0.51809967,0.25868562,0
0.48168787,0.15144771,0
0.46327043,0.24730968,0
0.5234005,0.20058551,0
0.7393824,0.46964362,0
0.6768099,0.18021946,0
0.6257611,0.21516968,0
0.3649088,0.19605626,0
0.6182711,0.30240804,0
0.5479736,0.19783182,0
0.35183585,0.30650175,0
0.8613322,0.29554543,0
0.41476554,0.34414577,0
0.70630175,0.3188414,0
0.43550515,0.35417938,0
0.6420582,0.16271666,0
0.3168013,0.5169795,0
0.7921024,0.33755952,0
0.6321227,0.22015107,0
0.6857789,0.304195,0
0.6474719,0.17135142,0
0.57264656,0.2896181,0
0.38247815,0.32506743,0
0.679007,0.1953846,0
0.6706585,0.1738122,0
0.5558298,0.3502425,0
0.77258164,0.3724324,0
0.6168213,0.15430334,0
0.8423181,0.22575082,0
0.8183021,0.20965205,0
0.501137,0.17899433,0
0.4627433,0.16795115,0
0.5535839,0.46897474,0
0.3384622,0.2816791,0
0.5449083,0.33330578,0
0.6686304,0.2599244,0
0.32144782,0.37106332,0
0.61623657,0.49680763,0
0.58619756,0.2358328,0
0.8135917,0.36679968,0
0.71597743,0.24371874,0
0.7844458,0.33252627,0
0.84494364,0.2353061,0
0.51600426,0.24530137,0
0.5590346,0.30008042,0
0.5216121,0.3131873,0
0.3980906,0.21089584,0
0.39784595,0.26757494,0
0.552943,0.43766728,0
0.51250494,0.19378798,0
0.56610364,0.254344,0
0.65762603,0.19916257,0
0.45407653,0.45925704,0
0.431346,0.57611406,0
0.42188418,0.3356009,0
0.6618014,0.31636187,0
0.69038105,0.22674184,0
0.40802535,0.24192587,0
0.3794294,0.35730153,0
0.38809502,0.2298987,0
0.6571358,0.3163825,0
0.47867182,0.3024851,0
0.46200266,0.25481004,0
0.6616198,0.26314127,0
0.34147897,0.30004057,0
0.6089536,0.31244034,0
0.37411037,0.19236977,0
0.61320233,0.2875579,0
0.57184553,0.24519226,0
0.6163402,0.24873224,0
0.44326305,0.41347367,0
0.4816478,0.40870556,0
0.32138175,0.6667855,0
0.40954977,0.2693144,0
0.66037714,0.16637081,0
0.62711006,0.29760596,0
0.53828174,0.40107965,0
0.41820428,0.3165145,0
0.5797868,0.177637,0
0.49113548,0.30921254,0
0.5418295,0.500911,0
0.5554183,0.494186,0
0.6488753,0.263009,0
0.73688066,0.19572511,0
0.51560146,0.31274018,0
0.7450404,0.20578124,0
0.7243287,0.155187,0
0.6354814,0.17380807,0
0.71153927,0.17848086,0
0.53126943,0.26877975,0
0.52830285,0.2747845,0
0.49139932,0.306732,0
0.38275582,0.38197994,0
0.51082504,0.24618517,0
0.469097,0.408166,0
0.51554507,0.32885695,0
0.631187,0.31061608,0
0.72911626,0.31971076,0
0.6837925,0.20353751,0
0.70288163,0.18341945,0
0.7298647,0.38923755,0
0.79823244,0.3764037,0
0.72884494,0.3957196,0
0.61999905,0.18698177,0
0.514758,0.3370707,0
0.70605034,0.17185745,0
0.5059552,0.33570617,0
0.64065754,0.18481961,0
0.7480741,0.2117418,0
0.575359,0.36821675,0
0.736473,0.19762973,0
0.7776403,0.2226528,0
0.6169621,0.26656765,0
0.6426279,0.2461281,0
0.47330275,0.26825193,0
0.7042092,0.43423095,0
0.6055729,0.45854002,0
0.49548662,0.36568412,0
0.70647335,0.43273753,0
0.47239038,0.31063697,0
0.5794053,0.28551072,0
0.59932494,0.22244297,0
0.5282989,0.5198815,0
0.6314938,0.17069854,0
0.49896237,0.19786818,0
0.58802176,0.31371316,0
0.5606237,0.19711712,0
0.63163054,0.14772956,0
0.68389523,0.16533726,0
0.7194474,0.16167723,0
0.6759548,0.41519997,0
0.70024025,0.26655,0
0.62424475,0.17667037,0
0.57086015,0.24555619,0
0.61176014,0.43937063,0
0.54564595,0.2923765,0
0.47330138,0.40134984,0
0.5867922,0.2683935,0
0.5244074,0.20169316,0
0.49630266,0.33763012,0
0.56846666,0.36804807,0
0.66633976,0.4755271,0
0.71604645,0.21862504,0
0.42372495,0.4086879,0
0.7041947,0.2393563,0
0.7706246,0.20273307,0
0.68926424,0.30683377,0
0.5445216,0.35629833,0
0.7529896,0.17036812,0
0.6504411,0.3322114,0
0.62331915,0.35483462,0
0.65868324,0.2100573,0
0.70868087,0.2981901,0
0.7293493,0.52549046,0
0.5235514,0.44813314,0
0.6424118,0.19218192,0
0.65045244,0.19267346,0
0.50842744,0.3818565,0
0.5528088,0.36344653,0
0.67008907,0.29616025,0
0.54491365,0.33525482,0
0.3006801,0.57522184,0
0.41292322,0.42269757,0
0.5973609,0.38766038,0
0.5278596,0.34200877,0
0.45257482,0.49563134,0
0.58446515,0.22922488,0
0.59073824,0.4078024,0
0.20154265,0.5503042,0
0.6814529,0.28955877,0
0.618815,0.41209915,0
0.58344,0.61885005,0
0.350242,0.38013002,0
0.4740974,0.24379484,0
0.61981624,0.20430046,0
0.5301436,0.33786646,0
0.47560906,0.16738394,0
0.44338283,0.21288604,0
0.61884713,0.31182086,0
0.4780577,0.24224855,0
0.6520171,0.3367683,0
0.60985875,0.23926969,0
0.7579116,0.32304704,0
0.6700052,0.3516265,0
0.5249951,0.6326527,0
0.49782375,0.29819757,0
0.34851158,0.3325116,0
0.8148374,0.29873863,0
0.6328128,0.30859104,0
0.6726835,0.26117125,0
0.76111454,0.3780892,0
0.72817594,0.3194554,0
0.6109563,0.28535894,0
0.81392026,0.19066569,0
0.80688226,0.18846472,0
0.7807791,0.17004128,0
0.63231283,0.44688734,0
0.7958513,0.1574668,0
0.82840705,0.21839,0
0.71239525,0.28763878,0
0.7567994,0.4255593,0
0.75796694,0.265738,0
0.78245705,0.27096045,0
0.7743743,0.21519965,0
0.8045349,0.25276738,0
0.66378665,0.21375434,0
0.74755925,0.27766657,0
0.77060735,0.273902,0
0.718445,0.27165326,0
0.7293219,0.32420504,0
0.7546547,0.36938763,0
0.74153656,0.35786825,0
0.65267384,0.23945433,0
0.71137774,0.24361625,0
0.7131688,0.44842282,0
0.74112487,0.18396965,0
0.6622021,0.36919087,0
0.59623873,0.48617348,0
0.81767726,0.3136694,0
0.68841285,0.3451734,0
0.7166504,0.33074853,0
0.70699996,0.24706401,0
0.6193473,0.15906884,0
0.45177972,0.3080768,0
0.6779631,0.32157993,0
0.47850817,0.43493396,0
0.72374314,0.61553425,0
0.7011579,0.34545317,0
0.5671944,0.42223898,0
0.7247062,0.33258414,0
0.66635716,0.2923635,0
0.67227817,0.4322465,0
0.6182197,0.36559597,0
0.59903467,0.518792,0
0.5631163,0.43337342,0
0.6203771,0.4896179,0
0.50723904,0.49629423,0
0.52402055,0.37976784,0
0.62573135,0.51162815,0
0.7228366,0.16145971,0
0.6514883,0.4435324,0
0.56178075,0.15254591,0
0.7836611,0.38359478,0
0.7794257,0.40342104,0
0.5205439,0.55722725,0
0.49022073,0.4124162,0
0.657997,0.32799655,0
0.32220045,0.4415255,0
0.42741987,0.46536708,0
0.75341696,0.2774239,0
0.70247114,0.33062682,0
0.605036,0.31358644,0
0.70506597,0.28624907,0
0.7303446,0.3605339,0
0.72027075,0.35747907,0
0.76620215,0.5026379,0
0.6780482,0.34871656,0
0.5955267,0.45735964,0
0.6456293,0.34853113,0
0.6028314,0.42283142,0
0.742356,0.47460943,0
0.38679793,0.36011103,0
0.39001602,0.3925602,0
0.41813353,0.365395,0
0.46858624,0.4324222,0
0.8500302,0.27721816,0
0.37697965,0.4050787,0
0.38677788,0.2730994,0
0.3703135,0.2590772,0
0.39303762,0.5618931,0
0.48685104,0.5110461,0
0.6335068,0.44221583,0
0.6761554,0.16111828,0
0.59373176,0.5060538,0
0.43403956,0.20514563,0
0.35681477,0.39668846,0
0.7278145,0.30293673,0
0.63566124,0.5916331,0
0.32283136,0.37206683,0
0.47269714,0.13873851,0
0.66160816,0.23152505,0
0.50176114,0.18291052,0
0.70504695,0.46008176,0
0.5005429,0.19235493,0
0.5334422,0.2418263,0
0.32559058,0.3937382,0
0.47113147,0.4405823,0
0.44059315,0.34917855,0
0.42056695,0.16484076,0
0.42472467,0.2886067,0
0.5233352,0.3229784,0
0.48883712,0.3965498,0
0.56441194,0.5555009,0
0.42576045,0.4374029,0
0.36670375,0.55595815,0
0.6806473,0.27920786,0
0.62877446,0.40616587,0
0.4141886,0.3902489,0
0.63197637,0.42054543,0
0.5895447,0.21473977,0
0.46858665,0.27163997,0
0.53498995,0.4485764,0
0.5621647,0.53696656,0
0.51445764,0.33308032,0
0.41350326,0.3852162,0
0.55337715,0.50943154,0
0.7067881,0.29303867,0
0.4959263,0.5365861,0
0.69561654,0.2785768,0
0.41009086,0.5711663,0
0.7177888,0.22991581,0
0.6270048,0.2368974,0
0.7554048,0.2639332,0
0.6483824,0.2724012,0
0.49057892,0.4474729,0
0.68011767,0.24963199,0
0.49761078,0.26046658,0
0.47788417,0.3391567,0
0.4013708,0.19348872,0
0.7245012,0.38826436,0
0.6167711,0.26067126,0
0.43898967,0.6329349,0
0.557311,0.36596873,0
0.65029967,0.3631032,0
0.4820689,0.36467955,0
0.5707465,0.2609968,0
0.52560973,0.33424336,0
0.64212406,0.2556786,0
0.42486936,0.57933384,0
0.5753827,0.4313933,0
0.70503736,0.18560804,0
0.520053,0.18736026,0
0.5523994,0.32952505,0
0.7447404,0.22727825,0
0.70843375,0.25351104,0
0.56988376,0.43959284,0
0.5371485,0.18134165,0
0.7272999,0.2523492,0
0.7458277,0.2819826,0
0.6921501,0.46919623,0
0.6148703,0.4041506,0
0.57348627,0.27918375,0
0.47273266,0.36353627,0
0.52874875,0.3002736,0
0.45993242,0.45258668,0
0.39789125,0.33444124,0
0.5548399,0.293578,0
0.41981646,0.30705538,0
0.5169551,0.42672083,0
0.65717524,0.5325754,0
0.6249852,0.289328,0
0.68884575,0.3358418,0
0.68169814,0.24697995,0
0.52735996,0.15555595,0
0.7260368,0.3014167,0
0.41371864,0.19089352,0
0.44925264,0.3516184,0
0.7345781,0.19328986,0
0.71249306,0.43344513,0
0.70831996,0.25686103,0
0.6950779,0.2858507,0
0.69917697,0.25882322,0
0.66331065,0.201206,0
0.48744124,0.25964117,0
0.67928684,0.337673,0
0.22675528,0.4466941,0
0.3581125,0.3257345,0
0.8308022,0.37890083,0
0.49259657,0.3422973,0
0.74823624,0.16837856,0
0.5291381,0.2264121,0
0.7777193,0.17781784,0
0.4515767,0.23613986,0
0.40288875,0.18692982,0
0.36316177,0.21649975,0
0.6353722,0.15554295,0
0.6016184,0.30803868,0
0.5108375,0.2562815,0
0.51050663,0.28970045,0
0.38733655,0.30655283,0
0.44012305,0.32665884,0
0.5749834,0.3033969,0
0.41948557,0.18381666,0
0.5806274,0.48777285,0
0.39904955,0.59195256,0
0.53278136,0.26129505,0
0.55479735,0.24214414,0
0.37166896,0.31034097,0
0.44546896,0.22838122,0
0.45466912,0.22796816,0
0.6487891,0.17356826,0
0.6221846,0.49844956,0
0.7082634,0.27137357,0
0.7525283,0.39701125,0
0.62800086,0.18183985,0
0.71384096,0.15865155,0
0.6642594,0.16407166,0
0.4129939,0.21721712,0
0.72452265,0.41504973,0
0.4292647,0.4571861,0
0.8113287,0.17451167,0
0.5104866,0.4547027,0
0.48879108,0.35496563,0
0.6144045,0.15673983,0
0.5502149,0.1844601,0
0.6103131,0.17871638,0
0.7132789,0.16825111,0
0.5368081,0.20700286,0
0.43973583,0.26054633,0
0.49194294,0.4381381,0
0.7684573,0.2661574,0
0.4716699,0.31042755,0
0.45498216,0.25539723,0
0.38889873,0.21840875,0
0.71924543,0.20993795,0
0.67932504,0.17305245,0
0.44841075,0.22241345,0
0.4852496,0.31338015,0
0.5298326,0.21004295,0
0.48265314,0.27618834,0
0.5544457,0.18017164,0
0.4978776,0.25180724,0
0.5968454,0.19861406,0
0.53118896,0.37473568,0
0.6862258,0.15990363,0
0.54447776,0.4729005,0
0.5098747,0.22242591,0
0.51000816,0.1779218,0
0.60315406,0.24620858,0
0.5876472,0.27407882,0
0.4381026,0.55606246,0
0.43722847,0.25449947,0
0.35163945,0.3481524,0
0.5655186,0.4036777,0
0.47026965,0.3773454,0
0.5595747,0.38371947,0
0.4369034,0.19724454,0
0.4069973,0.19464345,0
0.76602995,0.20884646,0
0.5363377,0.15636916,0
0.4679936,0.21839364,0
0.46547872,0.20693429,0
0.7059017,0.15324795,0
0.67753536,0.21636197,0
0.5413039,0.18883343,0
0.7554711,0.2705907,0
0.53507215,0.32455486,0
0.61249286,0.41320542,0
0.4462621,0.42658952,0
0.7047091,0.2363132,0
0.4219143,0.27007276,0
0.68019605,0.26372123,0
0.40708384,0.3010046,0
0.79410416,0.18375601,0
0.34455988,0.2910725,0
0.41340327,0.20902029,0
0.8437804,0.25919107,0
0.39199242,0.367835,0
0.43168744,0.220886,0
0.48189786,0.19699189,0
0.52614045,0.37120637,0
0.5799041,0.21660967,0
0.50089556,0.3919745,0
0.60336584,0.38984406,0
0.3230095,0.5562535,0
0.7082391,0.28492397,0
0.7836469,0.2199832,0
0.55055106,0.21993878,0
0.52633417,0.60063845,0
0.7301959,0.5116827,0
0.68323016,0.26591834,0
0.53010976,0.2633426,0
0.5051727,0.22266765,0
0.36910325,0.46533778,0
0.7438059,0.15614878,0
0.34566855,0.2948536,0
0.6736737,0.4927315,0
0.5393635,0.17146516,0
0.48325095,0.24324942,0
0.6468888,0.41300878,0
0.55850464,0.20488195,0
0.48833513,0.28254578,0
0.66841763,0.3822889,0
0.5912275,0.19669612,0
0.5625064,0.36487603,0
0.54822624,0.3086368,0
0.5973913,0.2027922,0
0.5356053,0.36644804,0
0.55842716,0.2662406,0
0.48847213,0.3211038,0
0.70070946,0.1389567,0
0.5139332,0.2063488,0
0.5275923,0.38042933,0
0.7651428,0.327379,0
0.62964875,0.15939036,0
0.33075804,0.29918995,0
0.39906394,0.21365935,0
0.45533502,0.24012895,0
0.46718827,0.37966108,0
0.45046473,0.47301102,0
0.68614596,0.13642465,0
0.45697948,0.21193919,0
0.44896686,0.26895055,0
0.3851798,0.23550881,0
0.5949142,0.22451317,0
0.37238955,0.55656075,0
0.5531672,0.61827224,0
0.47254515,0.2450103,0
0.7249512,0.18536797,0
0.44125408,0.22743681,0
0.4665882,0.52745634,0
0.38488555,0.19335279,0
0.8205244,0.23637532,0
0.60387677,0.33895794,0
0.31935585,0.33917168,0
0.6510455,0.22932673,0
0.696688,0.38940516,0
0.43446273,0.48914182,0
0.43522254,0.50343126,0
0.52477777,0.6016939,0
0.34650153,0.47555384,0
0.39354676,0.3543224,0
0.34174076,0.22022037,0
0.42410943,0.468274,0
0.3302981,0.18136461,0
0.5990516,0.42497823,0
0.50397813,0.52359617,0
0.4371492,0.5637078,0
0.614605,0.21752478,0
0.4979166,0.4325714,0
0.46683207,0.15827838,0
0.6072069,0.3660429,0
0.49665245,0.17646654,0
0.51997393,0.37029845,0
0.6143511,0.5217681,0
0.45926815,0.51823944,0
0.65585226,0.31072673,0
0.51870877,0.18796635,0
0.5594181,0.25453487,0
0.75000113,0.22375426,0
0.82136196,0.3344482,0
0.6037282,0.33311686,0
0.41680098,0.43009576,0
0.48386714,0.4177415,0
0.44392654,0.35854962,0
0.64452475,0.3520132,0
0.4415153,0.21471497,0
0.69636005,0.15800181,0
0.42215526,0.49849573,0
0.45951393,0.3383608,0
0.8188564,0.19581352,0
0.51201016,0.21593682,0
0.40422103,0.2204042,0
0.4435029,0.30892387,0
0.495175,0.37595376,0
0.44474325,0.29991305,0
0.53432816,0.4090092,0
0.40435773,0.28357694,0
0.45409167,0.50463146,0
0.5222393,0.25145948,0
0.5728257,0.1721851,0
0.6511218,0.25149006,0
0.47807422,0.6139568,0
0.23694812,0.5623943,0
0.4618449,0.46254456,0
0.5410365,0.22716387,0
0.5716211,0.44056103,0
0.5989673,0.26556018,0
0.49389926,0.31603846,0
0.43804356,0.22348712,0
0.3669981,0.20274267,0
0.37321472,0.2966923,0
0.38808694,0.20605509,0
0.39927363,0.36735192,0
0.43609878,0.42137522,0
0.6941871,0.18869197,0
0.54682165,0.31038707,0
0.43889853,0.1943704,0
0.59469396,0.3159422,0
0.4667668,0.23258108,0
0.6672045,0.40761092,0
0.5307997,0.30038175,0
0.5290266,0.539353,0
0.37487936,0.23614162,0
0.691629,0.55693054,0
0.3865916,0.19154215,0
0.7666946,0.2269961,0
0.621714,0.16176556,0
0.70342785,0.26914787,0
0.56594634,0.2580012,0
0.563876,0.554192,0
0.51859725,0.37135586,0
0.4906778,0.21325445,0
0.7327217,0.2360324,0
0.4033263,0.29894018,0
0.48920184,0.3717648,0
0.43587732,0.3277841,0
0.69275206,0.19163673,0
0.50003874,0.18913408,0
0.4755603,0.34730676,0
0.7789678,0.26190054,0
0.48745495,0.45546666,0
0.50855064,0.5330123,0
0.6662838,0.4124023,0
0.4549954,0.26318043,0
0.45955527,0.47106126,0
0.3213659,0.27119273,0
0.35721412,0.38802347,0
0.38202992,0.4881349,0
0.31730574,0.5570805,0
0.49374482,0.20221399,0
0.38040498,0.64115024,0
0.42742234,0.27835876,0
0.49386418,0.18645619,0
0.5674376,0.491262,0
0.39398956,0.26550314,0
0.36349714,0.26660407,0
0.24420461,0.4063366,0
0.3323907,0.27779102,0
0.63720465,0.4393999,0
0.40206212,0.23281631,0
0.66556054,0.2072096,0
0.39534143,0.36227944,0
0.41639334,0.18645027,0
0.54872835,0.15267503,0
0.47716254,0.20272802,0
0.3889983,0.40014806,0
0.49361327,0.30638924,0
0.55854875,0.37976158,0
0.5811968,0.12702629,0
0.30671135,0.52092844,0
0.57621735,0.40464553,0
0.19693957,0.62490267,0
0.49368727,0.18757156,0
0.45515254,0.44553444,0
0.36785218,0.53880924,0
0.26723903,0.40799108,0
0.7448201,0.41388968,0
0.52625895,0.19487381,0
0.5373043,0.22406542,0
0.6781081,0.21124828,0
0.6930294,0.4143651,0
0.68034804,0.344471,0
0.56174874,0.2058036,0
0.74375904,0.39763147,0
0.5344072,0.325162,0
0.637964,0.39537442,0
0.53334785,0.20237972,0
0.84879065,0.2579777,0
0.6092429,0.17337471,0
0.76341146,0.18578917,0
0.41435754,0.18950114,0
0.4778177,0.2707362,0
0.5220036,0.23884314,0
0.5623247,0.25917372,0
0.4149237,0.35443187,0
0.5161691,0.2285135,0
0.3895273,0.23218633,0
0.34732884,0.31565607,0
0.58458626,0.4709615,0
0.5485894,0.3196793,0
0.49750105,0.37278175,0
0.5170768,0.36837336,0
0.6160429,0.35951784,0
0.6100624,0.15808736,0
0.46623412,0.28220287,0
0.48528033,0.46106285,0
0.6304879,0.41138673,0
0.5816211,0.25909677,0
0.74530226,0.34088883,0
0.8018906,0.2942194,0
0.5179305,0.67884517,0
0.5317497,0.35974097,0
0.35050264,0.4920975,0
0.62851053,0.2688525,0
0.54802173,0.26964068,0
0.62369365,0.28742963,0
0.6283319,0.3709948,0
0.5338803,0.32978094,0
0.5844396,0.25562826,0
0.83396393,0.42527142,0
0.6612669,0.39830592,0
0.50861907,0.24229446,0
0.5922967,0.21707428,0
0.6482826,0.18955758,0
0.65603566,0.2568263,0
0.5222327,0.18537927,0
0.60091305,0.26267928,0
0.56934106,0.45129624,0
0.45114663,0.20075075,0
0.51520747,0.2517111,0
0.6681185,0.2041041,0
0.6884942,0.4008489,0
0.6000028,0.18034184,0
0.31238657,0.3989254,0
0.59500885,0.4655685,0
0.5138453,0.28258896,0
0.45919073,0.17804067,0
0.39440334,0.21442144,0
0.6322446,0.39765686,0
0.62014616,0.21217756,0
0.25247177,0.37706193,0
0.75866985,0.29107553,0
0.34095204,0.22696814,0
0.46785524,0.28575626,0
0.59421426,0.32164302,0
0.72710747,0.38884172,0
0.49295226,0.30755305,0
0.44750795,0.35846648,0
0.3821829,0.25818706,0
0.539181,0.21601565,0
0.49969268,0.26321766,0
0.45690194,0.21437636,0
0.42958072,0.49669698,0
0.45232463,0.48677042,0
0.40279174,0.17036512,0
0.59798974,0.44262254,0
0.53794014,0.3078942,0
0.83263975,0.21644719,0
0.36189815,0.21738754,0
0.48813206,0.15898688,0
0.6695301,0.3015705,0
0.56692743,0.26725152,0
0.319082,0.29926944,0
0.7314647,0.4666887,0
0.64085025,0.25059342,0
0.5877015,0.16755274,0
0.6097098,0.20137127,0
0.36786333,0.22420451,0
0.5780973,0.1605544,0
0.6948963,0.40340102,0
0.35692596,0.22279967,0
0.47300994,0.39145535,0
0.56660676,0.39276147,0
0.62068915,0.41750106,0
0.48544613,0.30803847,0
0.46841365,0.38737604,0
0.44825462,0.3502548,0
0.40734854,0.28314158,0
0.4848198,0.36218548,0
0.58712244,0.26692656,0
0.5881694,0.2777154,0
0.68309474,0.45212862,0
0.422606,0.28209624,0
0.45745832,0.40167573,0
0.5045956,0.14745122,0
0.4303311,0.25029334,0
0.28345978,0.4052068,0
0.68619496,0.43417957,0
0.56954217,0.278249,0
0.7612295,0.25534883,0
0.32750157,0.19705309,0
0.60042095,0.2641731,0
0.6854727,0.48078358,0
0.509299,0.19342236,0
0.4534469,0.27789596,0
0.49358818,0.5188417,0
0.28929824,0.3071428,0
0.7603681,0.22746532,0
0.47940722,0.1819496,0
0.502226,0.46822277,0
0.40859875,0.27022395,0
0.6072636,0.24743366,0
0.67414,0.46435025,0
0.6393124,0.4669267,0
0.6458856,0.29439068,0
0.78882813,0.36405832,0
0.41154495,0.21792278,0
0.6875521,0.36875978,0
0.71065104,0.28014037,0
0.5845698,0.59245014,0
0.36765462,0.44346413,0
0.4826105,0.3502381,0
0.10423875,0.60135376,1
0.12225292,0.536072,1
0.09694402,0.47438195,1
0.17819455,0.7827242,1
0.10871326,0.392338,1
0.12690888,0.74746823,1
0.10731724,0.47787955,1
0.13952564,0.7374465,1
0.12651832,0.6915737,1
0.1297152,0.7062443,1
0.11613668,0.72667575,1
0.1112953,0.6921441,1
0.13174748,0.7679057,1
0.10524036,0.6692697,1
0.122960076,0.7426693,1
0.12527035,0.75453585,1
0.10449212,0.45961884,1
0.11443134,0.64948946,1
0.115805455,0.73003805,1
0.11474037,0.6427399,1
0.16515183,0.8009855,1
0.11076481,0.51520807,1
0.13697638,0.7625361,1
0.13354556,0.71825933,1
0.16033253,0.70755225,1
0.11304567,0.6907268,1
0.11253615,0.5355899,1
0.118206255,0.6282928,1
0.1429231,0.7612953,1
0.11755497,0.75044006,1
0.14441764,0.68102545,1
0.13804464,0.78871846,1
0.14802049,0.71595144,1
0.1244934,0.68363696,1
0.14619218,0.6364931,1
0.12458996,0.73794454,1
0.12647025,0.71313614,1
0.1655826,0.7993662,1
0.12226854,0.7404946,1
0.109765895,0.65865535,1
0.10903971,0.6188565,1
0.13707708,0.74842113,1
0.11871823,0.68033904,1
0.1078894,0.62639165,1
0.117561154,0.6582297,1
0.11247178,0.61467975,1
0.11512113,0.67794794,1
0.11595711,0.6241299,1
0.12096231,0.73426664,1
0.10479926,0.6033995,1
0.1516002,0.7174931,1
0.12190865,0.68374574,1
0.12875082,0.51725626,1
0.11632282,0.7164957,1
0.16518563,0.7856163,1
0.11920209,0.7118954,1
0.18308073,0.82828116,1
0.13530844,0.39369532,1
0.12535448,0.7452342,1
0.115664124,0.6359936,1
0.1330786,0.63720137,1
0.15405619,0.69330436,1
0.114319056,0.6820967,1
0.182928,0.44562253,1
0.12559961,0.6879495,1
0.12129237,0.64950824,1
0.11166311,0.7075665,1
0.15093853,0.52729654,1
0.114043735,0.6842919,1
0.10920803,0.6955486,1
0.11878726,0.7388728,1
0.13830242,0.48951438,1
0.15808032,0.6483189,1
0.11120029,0.71289265,1
0.12131169,0.59033144,1
0.12849142,0.42889172,1
0.13154738,0.5685416,1
0.114753984,0.6687671,1
0.11321018,0.70110935,1
0.12765759,0.7440116,1
0.12987691,0.7682434,1
0.14718172,0.3582531,1
0.11912559,0.4307294,1
0.10146325,0.6183158,1
0.1373167,0.63626134,1
0.12555565,0.4071486,1
0.1449891,0.43344766,1
0.117557265,0.58017683,1
0.13893987,0.36060986,1
0.15328535,0.4012786,1
0.17998263,0.5748754,1
0.1275103,0.7071715,1
0.11375517,0.7094399,1
0.11947848,0.6947701,1
0.14068657,0.38881132,1
0.1402984,0.36643144,1
0.114671715,0.58291054,1
0.120190054,0.570633,1
0.12382569,0.71059144,1
0.1476178,0.6568516,1
0.17506771,0.5667826,1
0.109130576,0.60759085,1
0.16173318,0.46910885,1
0.10889775,0.5418265,1
0.105523296,0.46740702,1
0.11452702,0.6927812,1
0.106140316,0.6486618,1
0.11968043,0.72283554,1
0.10732583,0.66660374,1
0.14326523,0.7910308,1
0.113512084,0.6376621,1
0.1413025,0.7981271,1
0.12004071,0.67930925,1
0.12739252,0.59848946,1
0.1161604,0.6322264,1
0.10657033,0.54252845,1
0.114800595,0.6912457,1
0.11147685,0.51697606,1
0.12550102,0.72700065,1
0.104109265,0.42232344,1
0.10755153,0.5419282,1
0.10567214,0.62871695,1
0.1074841,0.47873253,1
0.119844,0.5783174,1
0.12065507,0.6932269,1
0.15152617,0.80409026,1
0.1111439,0.69733363,1
0.107258596,0.6592655,1
0.13752265,0.76364535,1
0.10911597,0.45698264,1
0.11212903,0.6895122,1
0.1300826,0.75985086,1
0.11220928,0.62821674,1
0.11048691,0.44221732,1
0.11392683,0.7185405,1
0.11715798,0.75003237,1
0.13078642,0.7101499,1
0.11205272,0.68376476,1
0.18726341,0.8103013,1
0.13216579,0.77714765,1
0.12376631,0.74638677,1
0.130032,0.78256875,1
0.15764634,0.79835635,1
0.11318521,0.7384525,1
0.16541022,0.7681812,1
0.10755299,0.6997427,1
0.14068681,0.7608355,1
0.10319129,0.66416186,1
0.115352444,0.73267776,1
0.12489966,0.7515543,1
0.10298049,0.41698352,1
0.11819165,0.7618111,1
0.11667598,0.7140026,1
0.14585845,0.79061174,1
0.11755394,0.7323661,1
0.13257319,0.8011292,1
0.1224626,0.46212268,1
0.15832402,0.80466706,1
0.11874275,0.6699341,1
0.13185818,0.74846256,1
0.108536206,0.62930316,1
0.11691276,0.7499967,1
0.12901743,0.67730916,1
0.122558564,0.7632052,1
0.12365878,0.7718688,1
0.120402835,0.6045652,1
0.14937338,0.79279274,1
0.11402018,0.7124191,1
0.119576864,0.39428562,1
0.14570552,0.7629003,1
0.11454242,0.46820605,1
0.10924652,0.38193342,1
0.13601923,0.37519386,1
0.11308184,0.73088276,1
0.15043497,0.7074655,1
0.18705235,0.82605875,1
0.11255832,0.41856965,1
0.12526104,0.539686,1
0.14432113,0.3707794,1
0.11235767,0.5278841,1
0.12354423,0.743679,1
0.11485457,0.4349096,1
0.13882996,0.73693997,1
0.12971637,0.72155935,1
0.13025506,0.7303951,1
0.13456537,0.7951833,1
0.12324707,0.75320375,1
0.1139548,0.7090131,1
0.14411716,0.63010526,1
0.1512949,0.8144191,1
0.1115768,0.61020243,1
0.107456565,0.5396862,1
0.114886366,0.5958969,1
0.11947649,0.7381605,1
0.13451129,0.7582644,1
0.1528916,0.75962496,1
0.14088425,0.6296633,1
0.14004163,0.71919614,1
0.103831165,0.7104454,1
0.12426058,0.7593208,1
0.1402205,0.78875136,1
0.15571332,0.7678109,1
0.13136145,0.6978139,1
0.11368632,0.71920216,1
0.13696124,0.62757623,1
0.12417657,0.75093323,1
0.1266702,0.7671839,1
0.15308534,0.820458,1
0.13612258,0.7904861,1
0.14114258,0.7463236,1
0.13206175,0.71016794,1
0.12198699,0.7421171,1
0.13992648,0.76534134,1
0.12804675,0.735687,1
0.122105345,0.7120622,1
0.16417167,0.8184346,1
0.15896279,0.4253287,1
0.16578794,0.7745834,1
0.120062836,0.6826592,1
0.12727883,0.77531856,1
0.14528672,0.75549835,1
0.1278165,0.7344247,1
0.116428405,0.5429623,1
0.16503021,0.81984663,1
0.17610462,0.8353826,1
0.19606748,0.8312405,1
0.1290418,0.7450081,1
0.15969448,0.8105217,1
0.1824971,0.7821034,1
0.16771133,0.8282405,1
0.17586592,0.82178926,1
0.15457703,0.80658174,1
0.14912698,0.81773096,1
0.13117394,0.7036155,1
0.1649286,0.48563194,1
0.15042917,0.8091152,1
0.17676474,0.8052898,1
0.11970483,0.68856883,1
0.22067976,0.8363615,1
0.22941492,0.8325883,1
0.11498684,0.73010546,1
0.12718974,0.70469487,1
0.14980845,0.65158457,1
0.12981398,0.69130814,1
0.1424194,0.8080126,1
0.13662143,0.67565256,1
0.1626094,0.7623367,1
0.14776266,0.7665741,1
0.14185183,0.80139154,1
0.117986664,0.67180634,1
0.15322138,0.8053154,1
0.11832882,0.62364626,1
0.12067623,0.5868714,1
0.17228042,0.47444314,1
0.12068137,0.725369,1
0.12609927,0.5105523,1
0.111754924,0.68399227,1
0.114929065,0.44885096,1
0.15428008,0.74622303,1
0.113580815,0.5913815,1
0.1329183,0.6988147,1
0.10835597,0.50027305,1
0.16142434,0.79573464,1
0.13419017,0.6903627,1
0.2303865,0.8302136,1
0.119431704,0.498427,1
0.13768151,0.5640979,1
0.21472631,0.8321088,1
0.20236616,0.83477384,1
0.16560493,0.82845175,1
0.15588799,0.8255414,1
0.1875132,0.5227847,1
0.17998399,0.81697625,1
0.17129093,0.8077864,1
0.21083632,0.83726525,1
0.15755278,0.7803271,1
0.11206488,0.34969312,1
0.12448481,0.38204095,1
0.123803996,0.7346646,1
0.12406816,0.7546805,1
0.105531655,0.5770424,1
0.11201787,0.63767695,1
0.11266192,0.6667222,1
0.12576039,0.73658013,1
0.10255565,0.62639534,1
0.1062255,0.37096706,1
0.115072265,0.37882683,1
0.12570558,0.7490086,1
0.10667192,0.6220231,1
0.12993658,0.7632298,1
0.10966331,0.6389617,1
0.10857644,0.6231318,1
0.14173552,0.74980605,1
0.10720819,0.4515212,1
0.09761769,0.559145,1
0.108482376,0.48278296,1
0.114073545,0.61512524,1
0.1598048,0.73728424,1
0.11742859,0.39395466,1
0.12264577,0.7316867,1
0.1059296,0.4380476,1
0.17831983,0.70809495,1
0.12224065,0.4019842,1
0.11489721,0.44145477,1
0.10983224,0.5071896,1
0.13659982,0.77957064,1
0.10101027,0.50920576,1
0.12837134,0.7391962,1
0.11249454,0.64761114,1
0.14693417,0.77164155,1
0.12973428,0.7517187,1
0.12381633,0.72076535,1
0.13971631,0.70213103,1
0.10279136,0.62628925,1
0.116835244,0.72410905,1
0.13500234,0.794916,1
0.13623033,0.754275,1
0.12898704,0.7265456,1
0.1162085,0.4988636,1
0.1436036,0.7746645,1
0.10686351,0.67287314,1
0.11106516,0.6639694,1
0.11671527,0.7060836,1
0.117920555,0.68727756,1
0.13431153,0.765322,1
0.1407914,0.7928097,1
0.13516414,0.6514419,1
0.1356664,0.7736808,1
0.14146127,0.67752886,1
0.1445284,0.79780495,1
0.10679854,0.5060578,1
0.1238347,0.7663379,1
0.111413814,0.71310335,1
0.10584874,0.4686832,1
0.10869952,0.3911325,1
0.13230734,0.6990732,1
0.112530984,0.47972843,1
0.13515331,0.61834186,1
0.12081243,0.6625388,1
0.13231973,0.7674128,1
0.13015191,0.7812819,1
0.13370067,0.6346231,1
0.12548621,0.6356733,1
0.13813208,0.77021664,1
0.10568273,0.42391422,1
0.11493836,0.7347388,1
0.1053483,0.5163666,1
0.118348874,0.70144296,1
0.12269148,0.69391614,1
0.119291775,0.7351388,1
0.15591606,0.5543655,1
0.098612934,0.5844469,1
0.13251005,0.5802158,1
0.100370094,0.48044312,1
0.11589743,0.664938,1
0.14327909,0.6570963,1
0.12040054,0.71343064,1
0.093801275,0.46286833,1
0.14300463,0.6796525,1
0.13535985,0.6953309,1
0.10688066,0.651383,1
0.13388978,0.69192076,1
0.11683489,0.67232937,1
0.13159649,0.43903884,1
0.122857876,0.7449954,1
0.12564677,0.44989645,1
0.11450817,0.5980131,1
0.11438365,0.6313561,1
0.14047647,0.7720131,1
0.11979725,0.41856474,1
0.11111196,0.5502173,1
0.13608262,0.7615993,1
0.13869356,0.66951185,1
0.10907306,0.5042898,1
0.12127326,0.62443024,1
0.12764981,0.76050705,1
0.14278425,0.7935172,1
0.09598002,0.46916246,1
0.107026055,0.54946953,1
0.111624226,0.560255,1
0.12756379,0.7408826,1
0.12370558,0.69707733,1
0.10166794,0.5202893,1
0.11383173,0.709039,1
0.121310435,0.6625957,1
0.11387356,0.6697946,1
0.10474254,0.4011386,1
0.10884478,0.36070588,1
0.12760587,0.7832956,1
0.10119603,0.5810269,1
0.117020175,0.74053407,1
0.1288658,0.6866384,1
0.1345192,0.6994636,1
0.32487416,0.4557692,1
0.10517851,0.48493284,1
0.11107235,0.3524615,1
0.15577576,0.3788425,1
0.104304574,0.4506192,1
0.10719912,0.66075104,1
0.102990195,0.534771,1
0.14009976,0.37675774,1
0.11087021,0.37106663,1
0.102942035,0.6317114,1
0.10976643,0.4091106,1
0.11100567,0.37309688,1
0.115407944,0.3826378,1
0.12237089,0.55569154,1
0.10861429,0.50466436,1
0.12163023,0.42216954,1
0.11314331,0.3473377,1
0.11354918,0.35238016,1
0.09915169,0.5528938,1
0.10441406,0.48525527,1
0.113771655,0.6740692,1
0.1087677,0.43145862,1
0.108819894,0.5430166,1
0.2054859,0.6396639,1
0.105727024,0.5889328,1
0.11967966,0.3563129,1
0.14098075,0.6834097,1
0.118701465,0.5409089,1
0.11482165,0.43154415,1
0.122591086,0.51496524,1
0.108463526,0.42439497,1
0.10014242,0.43504843,1
0.110820636,0.646917,1
0.1224964,0.3765002,1
0.101790085,0.53411514,1
0.10438458,0.55412513,1
0.12633005,0.37250265,1
0.10053551,0.600069,1
0.25233608,0.41095746,1
0.13340011,0.7846033,1
0.12116506,0.7470211,1
0.098954834,0.5037451,1
0.1428958,0.6961981,1
0.102388434,0.4786224,1
0.109922394,0.40701944,1
0.13948996,0.52695805,1
0.11440744,0.70793027,1
0.12618081,0.50965434,1
0.1113412,0.3645561,1
0.10312814,0.3992205,1
0.12645516,0.7349913,1
0.10447265,0.38345954,1
0.10905615,0.422561,1
0.11366705,0.36096826,1
0.10015271,0.47100836,1
0.17181359,0.41073877,1
0.12331758,0.39334452,1
0.10241421,0.46391088,1
0.12880935,0.47795537,1
0.0955359,0.5750805,1
0.102149524,0.42464066,1
0.12410069,0.7700404,1
0.113474175,0.5931437,1
0.11608728,0.60052085,1
0.10257544,0.49936026,1
0.16501722,0.38423043,1
0.10466513,0.5374564,1
0.11992072,0.7576316,1
0.13781042,0.7553771,1
0.12027677,0.38518435,1
0.11220135,0.39333183,1
0.10093339,0.57841754,1
0.13212867,0.65419024,1
0.16836953,0.80362344,1
0.10018911,0.5324153,1
0.1386275,0.6992914,1
0.12185637,0.627132,1
0.10987672,0.56859964,1
0.10474473,0.53872454,1
0.104429536,0.4777289,1
0.12887944,0.37997624,1
0.1087806,0.5093707,1
0.13911316,0.75474167,1
0.10930591,0.54055715,1
0.098564334,0.38853827,1
0.113245785,0.5716733,1
0.09961015,0.517758,1
0.11327169,0.41966072,1
0.13274105,0.545975,1
0.10602142,0.5208397,1
0.110313416,0.5520197,1
0.105061114,0.6684101,1
0.10300029,0.36177275,1
0.098528914,0.54470426,1
0.11379893,0.6582403,1
0.095115736,0.5666483,1
0.09827933,0.42183256,1
0.12503478,0.4010235,1
0.11021632,0.45337427,1
0.11204591,0.42892605,1
0.115022115,0.4426847,1
0.11173974,0.5992155,1
0.10503415,0.51290196,1
0.1128808,0.55463547,1
0.17891853,0.76780015,1
0.10929745,0.4403283,1
0.11501458,0.6713397,1
0.10076359,0.43929976,1
0.15833928,0.37291023,1
0.10047544,0.521851,1
0.10586823,0.6231801,1
0.11888261,0.5591804,1
0.1398883,0.5151927,1
0.10284583,0.40297222,1
0.12291273,0.73557204,1
0.105568826,0.5696224,1
0.10874826,0.6325096,1
0.10719118,0.3995258,1
0.12763347,0.41241902,1
0.12701896,0.42545095,1
0.10763706,0.44719052,1
0.11798096,0.6641469,1
0.10960257,0.7182077,1
0.09934393,0.5002582,1
0.11755037,0.53051794,1
0.12743357,0.37880105,1
0.111225694,0.39415348,1
0.10189715,0.5519015,1
0.11991559,0.3660884,1
0.24885532,0.4587899,1
0.114259884,0.57489634,1
0.1534799,0.33993036,1
0.12487142,0.6703029,1
0.118849866,0.7029707,1
0.27435523,0.3750987,1
0.11708421,0.41459483,1
0.10299402,0.39969993,1
0.09602198,0.40137896,1
0.11806869,0.5134232,1
0.12701894,0.39633188,1
0.12843178,0.49425638,1
0.12225916,0.6071161,1
0.09696372,0.40162104,1
0.110536255,0.5445936,1
0.111441806,0.43392026,1
0.118789926,0.67353904,1
0.10666014,0.586872,1
0.09303641,0.47287065,1
0.101306394,0.59295064,1
0.11454172,0.35511085,1
0.15779832,0.5120203,1
0.10553961,0.4008089,1
0.14667745,0.3655975,1
0.12225799,0.36502796,1
0.102497615,0.6314628,1
0.11937509,0.43750083,1
0.10570315,0.47461894,1
0.106721014,0.6727175,1
0.10687519,0.58845156,1
0.11017446,0.36953232,1
0.09831222,0.5435709,1
0.1542189,0.36062464,1
0.12881424,0.4305939,1
0.10969289,0.6460359,1
0.13688177,0.37643093,1
0.13388419,0.40589687,1
0.13087034,0.72381216,1
0.10025536,0.5117992,1
0.10016062,0.38961247,1
0.113688335,0.40898684,1
0.164959,0.47398943,1
0.13698271,0.68918717,1
0.139599,0.78153676,1
0.11543583,0.6889729,1
0.121263556,0.3332151,1
0.12380047,0.6766995,1
0.10720587,0.3856355,1
0.20380645,0.464848,1
0.110136256,0.39085335,1
0.12925953,0.68212074,1
0.12268551,0.386165,1
0.11244211,0.7065946,1
0.1061149,0.628434,1
0.12905678,0.37013122,1
0.10695291,0.60108674,1
0.09929383,0.5457317,1
0.11131746,0.60823023,1
0.11404279,0.49005073,1
0.10542719,0.3621117,1
0.11166337,0.68759084,1
0.10819512,0.5571787,1
0.11020758,0.3822408,1
0.10510848,0.37837973,1
0.113503955,0.54608196,1
0.115616806,0.42867118,1
0.107292555,0.48558787,1
0.11262422,0.6644791,1
0.09636524,0.4699197,1
0.09682357,0.46147725,1
0.09933498,0.4706511,1
0.10835728,0.39261666,1
0.116488665,0.63577384,1
0.14831975,0.37573868,1
0.11242288,0.5946213,1
0.098476686,0.4253854,1
0.117505915,0.49600452,1
0.10544237,0.62302136,1
0.11505492,0.4361221,1
0.10025665,0.4770002,1
0.122643694,0.7436667,1
0.12272872,0.37487656,1
0.103150815,0.52795565,1
0.1072624,0.53194076,1
0.13233124,0.3665439,1
0.11979057,0.34447527,1
0.102387644,0.5729862,1
0.10039466,0.4168135,1
0.106079,0.46291834,1
0.108898744,0.56751156,1
0.112273805,0.46467414,1
0.11059436,0.44823822,1
0.12034589,0.3853042,1
0.13403,0.38744524,1
0.19439085,0.4432314,1
0.15596743,0.7647994,1
0.1273124,0.3812981,1
0.10744603,0.60861766,1
0.1240457,0.5754261,1
0.10957785,0.4503672,1
0.10297861,0.5228024,1
0.109892935,0.44148886,1
0.10377683,0.37846708,1
0.1117969,0.3479929,1
0.104546,0.53791964,1
0.1348089,0.77363867,1
0.12188683,0.5326228,1
0.12546791,0.6908918,1
0.13382192,0.35536468,1
0.14876471,0.446846,1
0.117288284,0.71766126,1
0.11705924,0.43938234,1
0.09695868,0.5601712,1
0.16070057,0.3697699,1
0.09645941,0.39792752,1
0.1287856,0.5739997,1
0.11344063,0.3958188,1
0.11400125,0.3543932,1
0.11732084,0.36427945,1
0.12161069,0.4651965,1
0.10689644,0.67014533,1
0.12384421,0.39443707,1
0.102525175,0.42559984,1
0.10940052,0.48342896,1
0.106052764,0.44047275,1
0.114435226,0.5122864,1
0.113977365,0.41218305,1
0.109964296,0.40920502,1
0.1159707,0.62890315,1
0.09734678,0.3843458,1
0.11511336,0.5679822,1
0.109718926,0.39468974,1
0.119275995,0.4913623,1
0.12585135,0.45003146,1
0.10227248,0.5420912,1
0.13039471,0.35025662,1
0.11295429,0.65479255,1
0.10244669,0.5471696,1
0.10249603,0.58489144,1
0.103777945,0.37070498,1
0.11173755,0.6926115,1
0.12980194,0.5361133,1
0.13218229,0.3596071,1
0.13512185,0.7635298,1
0.112626605,0.3466731,1
0.10875799,0.4069177,1
0.112719685,0.5755041,1
0.108825915,0.36536482,1
0.11445987,0.50469166,1
0.12967804,0.40964308,1
0.102060534,0.5994786,1
0.10253647,0.5014951,1
0.106874384,0.64112604,1
0.11184486,0.415323,1
0.1388357,0.733564,1
0.10401964,0.51467025,1
0.11727323,0.35182643,1
0.12207735,0.6882597,1
0.105877176,0.5069278,1
0.1339099,0.7800396,1
0.11023437,0.4995731,1
0.10449563,0.51046795,1
0.10656051,0.4205785,1
0.1296332,0.41104984,1
0.1104442,0.38754478,1
0.12695146,0.6567794,1
0.10450187,0.38577884,1
0.11701733,0.61821604,1
0.12040355,0.7430269,1
0.14064705,0.7550675,1
0.10765296,0.57371944,1
0.107093245,0.46844724,1
0.10628075,0.3973131,1
0.11329125,0.4595564,1
0.20112492,0.4364517,1
0.13109015,0.6011924,1
0.09778959,0.45477122,1
0.11191439,0.38077775,1
0.10154854,0.5966718,1
0.1109147,0.4894335,1
0.12116461,0.39145082,1
0.11757174,0.48547545,1
0.12542409,0.623461,1
0.111531846,0.4172749,1
0.10460191,0.41020048,1
0.111729786,0.3763303,1
0.109168455,0.38340497,1
0.100286074,0.4877532,1
0.12864465,0.74069065,1
0.11129176,0.46750596,1
0.10933127,0.4043089,1
0.12647624,0.7405303,1
0.104842536,0.45721492,1
0.110514976,0.34757158,1
0.09910243,0.41919315,1
0.10003758,0.40158054,1
0.10124659,0.6290099,1
0.14337613,0.4109196,1
0.10685669,0.45165324,1
0.118974335,0.54101914,1
0.11328473,0.70175564,1
0.13842505,0.77160877,1
0.10959777,0.6595836,1
0.10027927,0.55562955,1
0.1086654,0.54802877,1
0.10826682,0.4807351,1
0.10502923,0.5593289,1
0.13374217,0.41957372,1
0.10538424,0.409013,1
0.13011654,0.38894686,1
0.12737341,0.5694604,1
0.10482872,0.41733804,1
0.13462888,0.4393974,1
0.11369049,0.39159492,1
0.091346405,0.48565456,1
0.09946014,0.46235055,1
0.107769035,0.3733231,1
0.11621393,0.38003275,1
0.10598394,0.514807,1
0.10320349,0.44000563,1
0.101849474,0.3830858,1
0.105905645,0.47982633,1
0.103005804,0.55238485,1
0.102612674,0.575921,1
0.11100168,0.65912265,1
0.1139731,0.6878259,1
0.12378643,0.4691674,1
0.09862829,0.6410579,1
0.11744314,0.40236035,1
0.15467353,0.3358925,1
0.10942525,0.36498642,1
0.101878375,0.42201185,1
0.12365178,0.40242398,1
0.12783036,0.75464404,1
0.105244935,0.5311686,1
0.10009156,0.5614501,1
0.09871217,0.49428093,1
0.16909228,0.40918905,1
0.12582351,0.36305127,1
0.119678676,0.39181718,1
0.13966799,0.64726096,1
0.10312515,0.3882353,1
0.12366698,0.727171,1
0.12032451,0.76410973,1
0.12681435,0.76638913,1
0.110712655,0.7011042,1
0.1201616,0.7662839,1
0.11119997,0.69285715,1
0.16172852,0.50011045,1
0.11275132,0.6299743,1
0.1181998,0.70955956,1
0.113047116,0.7139728,1
0.11223722,0.6857559,1
0.11755901,0.6831162,1
0.10892565,0.68154186,1
0.11451946,0.60047406,1
0.11464137,0.61453766,1
0.1277368,0.77295876,1
0.113536194,0.7331866,1
0.17332146,0.49462694,1
0.13102223,0.7833006,1
0.12240073,0.3841062,1
0.12583402,0.76186424,1
0.12118184,0.3745712,1
0.11378605,0.4288708,1
0.11206248,0.6017415,1
0.12647286,0.6117935,1
0.11677039,0.45348594,1
0.119183205,0.5078943,1
0.1680238,0.47300717,1
0.1178203,0.38994074,1
0.1208666,0.4162476,1
0.13445567,0.4034758,1
0.13059771,0.41595757,1
0.14799848,0.3957559,1
0.12583159,0.55160224,1
0.13416752,0.50319993,1
0.121378966,0.5271686,1
0.120911,0.42565846,1
0.12633516,0.53437704,1
0.12236143,0.42730424,1
0.12573631,0.5188012,1
0.11671992,0.42350546,1
0.11592334,0.52775353,1
0.12872502,0.38558388,1
0.12522638,0.77186835,1
0.1263429,0.77008,1
0.11834267,0.7618574,1
0.12774332,0.7833713,1
0.1150146,0.7080815,1
0.118859455,0.73010504,1
0.13200924,0.78394395,1
0.12779075,0.7612785,1
0.11871332,0.7038691,1
0.12143973,0.68674356,1
0.118041545,0.7323253,1
0.11376895,0.38535804,1
0.108761,0.44462785,1
0.099313386,0.5633672,1
0.11353386,0.41473272,1
0.11827907,0.5678022,1
0.10896306,0.45833072,1
0.10406282,0.65081584,1
0.104468845,0.48689678,1
0.108328626,0.34813678,1
0.10481965,0.46949333,1
0.12493859,0.49358103,1
0.109916784,0.69579226,1
0.13926941,0.78531754,1
0.16060422,0.8184072,1
0.13636382,0.8014094,1
0.12580796,0.78472227,1
0.13560995,0.7933909,1
0.12720144,0.6917965,1
0.13837774,0.7804546,1
0.13046758,0.72349715,1
0.10933286,0.6833449,1
0.111232586,0.6464561,1
0.12637632,0.72099435,1
0.10622366,0.58844244,1
0.10985807,0.42348254,1
0.11993589,0.70376515,1
0.10580422,0.6200084,1
0.111827806,0.61223716,1
0.11152098,0.69055855,1
0.11033239,0.6252367,1
0.12613878,0.73148626,1
0.13929096,0.76965415,1
0.11184262,0.6903572,1
0.12194324,0.77714014,1
0.1325979,0.7839349,1
0.111983635,0.40329668,1
0.10578841,0.56940424,1
0.109910674,0.43193567,1
0.11640782,0.5947905,1
0.11176061,0.69874203,1
0.12362219,0.6638314,1
0.11907688,0.6993619,1
0.11555682,0.7248746,1
0.12231587,0.73383623,1
0.10717238,0.6850647,1
0.1294276,0.7500624,1
0.1106854,0.6403913,1
0.11592709,0.6635544,1
0.11680232,0.6361634,1
0.10406755,0.6335724,1
0.10945528,0.6205772,1
0.11682405,0.6514845,1
0.12231224,0.67119616,1
0.12111023,0.63794124,1
0.1226662,0.5533812,1
0.1328701,0.6197165,1
0.11958097,0.5747666,1
0.14160025,0.6835029,1
0.11464199,0.6243394,1
0.12905161,0.46226203,1
0.09840528,0.44179434,1
0.11530629,0.5845788,1
0.10539249,0.39975077,1
0.11099551,0.61273384,1
0.13096182,0.7714427,1
0.13431408,0.75022626,1
0.124756455,0.739745,1
0.13043544,0.7781214,1
0.115164705,0.7063086,1
0.12550211,0.77439326,1
0.12502396,0.7381065,1
0.12157634,0.75834084,1
0.11515322,0.6960845,1
0.14336526,0.7506998,1
0.1219226,0.73457366,1
0.13184105,0.7494837,1
0.11229691,0.48204008,1
0.10991735,0.3973309,1
0.10133949,0.591972,1
0.104875326,0.46289465,1
0.11660984,0.43046176,1
0.10991898,0.5656342,1
0.15507595,0.728251,1
0.15663724,0.69015163,1
0.16045679,0.7907134,1
0.115639456,0.38731658,1
0.10859564,0.3867049,1
0.10577762,0.46698856,1
0.11823258,0.52839416,1
0.11245576,0.40832162,1
0.12415031,0.6841988,1
0.13943097,0.77387226,1
0.1497503,0.46294674,1
0.116771154,0.7435308,1
0.11269708,0.6932421,1
0.11594703,0.67685,1
0.10745848,0.6048447,1
0.12300215,0.59511733,1
0.10887723,0.619164,1
0.11606744,0.6727624,1
0.117891416,0.6745624,1
0.1278976,0.6612901,1
0.12335364,0.70702636,1
0.116889544,0.6022432,1
0.111865684,0.39858338,1
0.113839515,0.38795373,1
0.103359796,0.5367018,1
0.10717161,0.46192887,1
0.16603291,0.60780835,1
0.13566372,0.5270337,1
0.1594744,0.5809596,1
0.15042087,0.626033,1
0.16110253,0.64767736,1
0.13213518,0.34535053,1
0.11874676,0.394433,1
0.13117611,0.36055773,1
0.12446999,0.34853485,1
0.12368818,0.4124156,1
0.13936993,0.3675172,1
0.12365079,0.32559967,1
0.11989821,0.3788523,1
0.12204071,0.36693788,1
0.13311452,0.3518301,1
0.11714656,0.35743192,1
0.12262202,0.3486061,1
0.15842803,0.37327537,1
0.12627387,0.35432416,1
0.11386723,0.42537993,1
0.12615937,0.35753497,1
0.118049175,0.34805325,1
0.12819757,0.40602383,1
0.10913039,0.45470408,1
0.13169105,0.3513467,1
0.09960852,0.59105825,1
0.10476477,0.60896283,1
0.1134065,0.39537832,1
0.102786936,0.47377184,1
0.11059253,0.5700115,1
0.10262388,0.5984583,1
0.15769121,0.47340447,1
0.13923632,0.3815114,1
0.112578556,0.41979033,1
0.11738368,0.36189684,1
0.108435385,0.3678148,1
0.114660524,0.39913547,1
0.10681996,0.3681489,1
0.11554333,0.35424316,1
0.11237232,0.38005868,1
0.12291479,0.42308706,1
0.11324674,0.6997781,1
0.104554854,0.42238238,1
0.110215984,0.5211779,1
0.10379127,0.56141967,1
0.11467057,0.5510507,1
0.11777795,0.42455977,1
0.097836755,0.39380172,1
0.10118976,0.583523,1
0.116551,0.49273244,1
0.12350145,0.48982832,1
0.13595414,0.7341425,1
0.1145501,0.4214323,1
0.10389172,0.5542931,1
0.10918351,0.43860227,1
0.18614744,0.44062528,1
0.10153015,0.4519762,1
0.101903945,0.51149017,1
0.10088274,0.44174767,1
0.10135172,0.56259286,1
0.10196871,0.6297549,1
0.10081611,0.41102818,1
0.113252595,0.36495534,1
0.10528348,0.5086642,1
0.14072235,0.71311986,1
0.118322164,0.6540033,1
0.23836869,0.40828365,1
0.1004346,0.6158507,1
0.105057165,0.47656426,1
0.110117786,0.42183203,1
0.110984035,0.6673758,1
0.10539569,0.5510535,1
0.10669305,0.55575264,1
0.10908976,0.6922282,1
0.110553,0.36518353,1
0.1030555,0.5674223,1
0.09491893,0.59982544,1
0.10505674,0.41073707,1
0.09722741,0.58258945,1
0.10618362,0.52005625,1
0.114915736,0.3902132,1
0.11599228,0.53077537,1
0.12279351,0.38512465,1
0.11145363,0.56220096,1
0.10328969,0.59806675,1
0.10879487,0.5736297,1
0.09703988,0.46138158,1
0.10446673,0.4672387,1
0.12130265,0.69012547,1
0.11522552,0.40189648,1
0.12409401,0.40423042,1
0.14201905,0.65827423,1
0.13756034,0.38299754,1
0.10308236,0.4924115,1
0.12793793,0.39079794,1
0.117506675,0.3904214,1
0.10465908,0.49994624,1
0.11072224,0.37218672,1
0.108356036,0.42035615,1
0.114818595,0.6919055,1
0.111788824,0.50349385,1
0.101112455,0.4617363,1
0.112088844,0.40175697,1
0.13486569,0.74287105,1
0.14380641,0.390059,1
0.13321325,0.7663787,1
0.14360549,0.3747606,1
0.11656839,0.35515863,1
0.10509496,0.6339757,1
0.10890915,0.47624305,1
0.107407555,0.37278375,1
0.12684399,0.68436146,1
0.12073342,0.7644705,1
0.12052045,0.41378278,1
0.12480136,0.43178952,1
0.10931333,0.35927796,1
0.120057136,0.36141342,1
0.11357577,0.65750927,1
0.10656033,0.5975168,1
0.112946294,0.37840977,1
0.10109203,0.5100796,1
0.10551678,0.42629343,1
0.09656207,0.42023018,1
0.15540917,0.4473795,1
0.10549445,0.6477731,1
0.12449501,0.42796907,1
0.110223435,0.6831823,1
0.096977845,0.5730987,1
0.12305884,0.49431676,1
0.110075414,0.6304766,1
0.13284297,0.34988803,1
0.11700742,0.7090895,1
0.1493863,0.5958073,1
0.1257862,0.71057487,1
0.09670613,0.62160695,1
0.13635737,0.37427723,1
0.097670056,0.41103277,1
0.110406525,0.35024995,1
0.10526801,0.5058046,1
0.12392948,0.69487923,1
0.099939525,0.6135019,1
0.100295216,0.39655384,1
0.13730982,0.5111652,1
0.09602336,0.41038495,1
0.09681538,0.5283138,1
0.102246135,0.55155194,1
0.120373756,0.6367436,1
0.114473715,0.3515611,1
0.10958503,0.37811035,1
0.099758014,0.42043132,1
0.11762217,0.3623105,1
0.10968643,0.5289367,1
0.10008544,0.4818508,1
0.1189223,0.6246207,1
0.12179381,0.641543,1
0.12029946,0.7172536,1
0.12844245,0.39427155,1
0.103819,0.4657383,1
0.10885119,0.66733736,1
0.112108044,0.52563345,1
0.11778415,0.41775167,1
0.10803782,0.64065266,1
0.11020319,0.44898602,1
0.1156349,0.44730067,1
0.11427318,0.40001145,1
0.09850326,0.4654657,1
0.10954025,0.3632709,1
0.11410305,0.623299,1
0.11915257,0.42111182,1
0.10618099,0.42102188,1
0.110651106,0.5828696,1
0.14928897,0.42629328,1
0.11485079,0.3484059,1
0.12213166,0.5507059,1
0.12776929,0.5663644,1
0.11172946,0.47556397,1
0.108131245,0.48683697,1
0.12503652,0.4248052,1
0.11196271,0.6422409,1
0.100064985,0.55194753,1
0.110696204,0.63724446,1
0.118204735,0.5947819,1
0.110335656,0.4155407,1
0.16504106,0.35615638,1
0.25689986,0.48535484,1
0.10351591,0.54348546,1
0.105200246,0.35697797,1
0.13268395,0.65358716,1
0.111024536,0.34367812,1
0.105645016,0.40839127,1
0.10117368,0.4944363,1
0.11381148,0.6352145,1
0.121396504,0.52674633,1
0.14538988,0.6023697,1
0.115857035,0.40025866,1
0.10641345,0.36196798,1
0.11723803,0.6347832,1
0.12405684,0.48280838,1
0.10606158,0.6041371,1
0.10178069,0.42287844,1
0.10776534,0.6693727,1
0.10852802,0.5029946,1
0.10243011,0.42144442,1
0.112968855,0.68626624,1
0.108228534,0.37456468,1
0.12652051,0.757944,1
0.11068808,0.3845248,1
0.10076308,0.5676207,1
0.12086917,0.69625074,1
