{
    "dimensionality_reduction_methods": "['PCA', 'TSVD', 'ISOMAP', 'LLE']",
    "proportions": "[0.5, 0.5, 0, 0]",
    "dataset": "fmnist",
    "number_of_classes": "2",
    "number_of_points": "10000",
    "number_of_Tsamples": "5000",
    "number_ofVsamples": "1000",
    "loss": "0.00026239664293825626",
    "trustworthiness": "0.8889258062199239",
    "continuity": "0.9581635423400129",
    "neighborhood_hit": "0.9297142857142858"
}