PC1,PC2,label
0.7928846,0.6388044,0
0.84539306,0.65757495,0
0.7100137,0.49128565,0
0.79762137,0.6618038,0
0.92944413,0.4010617,0
0.89995843,0.63771737,0
0.64448035,0.58399314,0
0.9255445,0.40675628,0
0.82172036,0.37863386,0
0.9270552,0.41069987,0
0.80769086,0.61370814,0
0.8718755,0.6343299,0
0.92885846,0.4666586,0
0.885317,0.6021189,0
0.8887309,0.6686025,0
0.90402675,0.29036707,0
0.92183983,0.44910496,0
0.76014197,0.5082902,0
0.93124455,0.41264525,0
0.9145234,0.5148169,0
0.8596969,0.40654922,0
0.9265818,0.45248833,0
0.9066702,0.42609513,0
0.92682153,0.53213465,0
0.9281342,0.46995524,0
0.8770373,0.54813737,0
0.7563179,0.37603512,0
0.87151355,0.66759086,0
0.9275785,0.48580614,0
0.91014147,0.5590604,0
0.72190255,0.42723617,0
0.9163868,0.332856,0
0.932034,0.44479972,0
0.921374,0.37582952,0
0.922118,0.496621,0
0.8768102,0.6222395,0
0.9161439,0.35728458,0
0.92598057,0.47888863,0
0.82924235,0.6891202,0
0.8180083,0.5413657,0
0.8659795,0.5997355,0
0.83357865,0.53324085,0
0.92396665,0.4256259,0
0.8333222,0.47499672,0
0.915997,0.40300745,0
0.7957449,0.40052158,0
0.906342,0.486296,0
0.86750793,0.62108,0
0.92627096,0.5264249,0
0.9273857,0.37439388,0
0.9184046,0.38625348,0
0.8088136,0.5536337,0
0.92594105,0.4385993,0
0.9267723,0.45985395,0
0.88924205,0.57869524,0
0.71145934,0.2581088,0
0.9172645,0.47472677,0
0.8448688,0.67297703,0
0.9135121,0.57684517,0
0.83842283,0.45543104,0
0.8053023,0.6614778,0
0.8818501,0.6162431,0
0.8627854,0.6113823,0
0.9183163,0.5549213,0
0.9282887,0.5043169,0
0.8871776,0.47161987,0
0.85084325,0.44689605,0
0.7670999,0.42597595,0
0.8973207,0.5993601,0
0.9118423,0.6216336,0
0.84885323,0.6186931,0
0.9160801,0.42406347,0
0.7775433,0.5299757,0
0.8300457,0.5452498,0
0.8625018,0.6640155,0
0.84043056,0.57245034,0
0.84562266,0.40787235,0
0.8997663,0.58440566,0
0.88847506,0.5726984,0
0.8811967,0.38035563,0
0.88255876,0.46231288,0
0.8500184,0.54899913,0
0.72530556,0.57143116,0
0.79903513,0.46800116,0
0.8585848,0.3532233,0
0.8348856,0.58065885,0
0.5689827,0.40976536,0
0.7584723,0.5811548,0
0.7204246,0.47172892,0
0.926545,0.49674222,0
0.89736736,0.53058356,0
0.8741871,0.33705255,0
0.84250945,0.31340438,0
0.7543368,0.24361168,0
0.80667657,0.45818058,0
0.8961979,0.2873451,0
0.8107323,0.337282,0
0.901916,0.6172682,0
0.8750825,0.6444276,0
0.7960096,0.2726966,0
0.74545544,0.5481051,0
0.7643495,0.63164514,0
0.8974467,0.5637009,0
0.8629929,0.682121,0
0.8737795,0.5670079,0
0.90996164,0.41209835,0
0.8784266,0.63778377,0
0.8540221,0.40476328,0
0.8355246,0.47154012,0
0.7985008,0.6007907,0
0.83174413,0.63602054,0
0.92061615,0.436817,0
0.8832801,0.6492389,0
0.85897535,0.3667479,0
0.92998,0.5120132,0
0.82916605,0.4732029,0
0.83722013,0.6290053,0
0.7785059,0.34545907,0
0.8764272,0.6107198,0
0.91637146,0.40028346,0
0.9279865,0.4913136,0
0.93098474,0.45261917,0
0.84435546,0.5910772,0
0.9166308,0.44362804,0
0.8638978,0.6817123,0
0.91094935,0.47623846,0
0.8566675,0.61528987,0
0.8447825,0.6594624,0
0.86918736,0.52987885,0
0.7964214,0.39691684,0
0.7464868,0.4546439,0
0.8587626,0.62410426,0
0.7993965,0.56039023,0
0.8044793,0.48607627,0
0.80319303,0.62239,0
0.9143038,0.6727813,0
0.8249519,0.46409592,0
0.7175406,0.41598353,0
0.8264242,0.44055456,0
0.73088676,0.49235508,0
0.7598115,0.4693284,0
0.83583915,0.69217485,0
0.88145214,0.6002983,0
0.9263158,0.53333485,0
0.8930637,0.34029788,0
0.8853919,0.3865262,0
0.90428257,0.37539107,0
0.7157104,0.40288556,0
0.782705,0.46316546,0
0.90720916,0.6473633,0
0.82369137,0.6580476,0
0.78847164,0.27990407,0
0.80793536,0.6789301,0
0.87876755,0.35341322,0
0.8126518,0.3373225,0
0.87932193,0.38351184,0
0.8519981,0.39964673,0
0.87933964,0.34290487,0
0.81553227,0.5274946,0
0.86943144,0.45720583,0
0.8293681,0.4182272,0
0.9027581,0.5287969,0
0.7609794,0.4174378,0
0.84071857,0.54858243,0
0.8790372,0.38231623,0
0.85183805,0.37911403,0
0.8437404,0.55876064,0
0.8805313,0.38742936,0
0.7340208,0.4954681,0
0.85667413,0.42589784,0
0.85188425,0.53093946,0
0.69403124,0.42834127,0
0.89152974,0.6063412,0
0.8874042,0.54528636,0
0.7378888,0.2883007,0
0.8944472,0.3867602,0
0.8372324,0.63128215,0
0.8933389,0.52867943,0
0.64788544,0.48711702,0
0.7898531,0.5763226,0
0.85518134,0.5362592,0
0.8213128,0.5561475,0
0.7824123,0.31139037,0
0.82572466,0.612473,0
0.9140645,0.6068893,0
0.92230934,0.48139036,0
0.7980037,0.62952054,0
0.7149815,0.45964745,0
0.8090875,0.657596,0
0.8590721,0.5753893,0
0.88414776,0.44319093,0
0.89517397,0.6433866,0
0.9051301,0.50114655,0
0.92398137,0.5748026,0
0.7849422,0.41383228,0
0.91666454,0.6103224,0
0.884053,0.35571775,0
0.89975506,0.6349099,0
0.8128321,0.41130644,0
0.8510166,0.6110174,0
0.7725315,0.64212906,0
0.9021899,0.3835206,0
0.8711094,0.39457142,0
0.778507,0.6569598,0
0.8813349,0.3852711,0
0.820419,0.3223536,0
0.9027842,0.68264204,0
0.8050352,0.5537128,0
0.8549783,0.68818736,0
0.7939645,0.5471592,0
0.85603493,0.63929355,0
0.9058246,0.32993332,0
0.9036225,0.6615482,0
0.8754443,0.59988946,0
0.81374013,0.62865996,0
0.8486981,0.49612233,0
0.84747696,0.63556147,0
0.7024486,0.48825002,0
0.93502474,0.48780394,0
0.8037835,0.39325586,0
0.90821904,0.46923712,0
0.81132275,0.3975909,0
0.9026443,0.657247,0
0.71509284,0.3239127,0
0.9364447,0.43551195,0
0.8885778,0.53908986,0
0.90879345,0.41364974,0
0.90637577,0.61116594,0
0.85033715,0.44358814,0
0.7403508,0.5018233,0
0.92609894,0.5333738,0
0.9158266,0.5825346,0
0.89759904,0.46108228,0
0.92495525,0.41647387,0
0.90100867,0.6262403,0
0.93548477,0.537733,0
0.9333046,0.5533794,0
0.8367972,0.7017456,0
0.8350021,0.69049364,0
0.8439117,0.29531512,0
0.78107476,0.52538574,0
0.8524381,0.3931763,0
0.88348746,0.48182893,0
0.7089817,0.38730407,0
0.8855721,0.29514176,0
0.8748511,0.55124146,0
0.8998411,0.4126085,0
0.8762969,0.5367612,0
0.90175575,0.40670374,0
0.92563754,0.51645476,0
0.8069078,0.55875087,0
0.81547385,0.51162964,0
0.8295671,0.42868012,0
0.8557083,0.5700624,0
0.86351246,0.5098045,0
0.87833154,0.3835333,0
0.84219015,0.5997505,0
0.8061442,0.56051487,0
0.86746943,0.60161006,0
0.7676474,0.33363438,0
0.77653724,0.27365306,0
0.7944751,0.47763494,0
0.8778837,0.43093312,0
0.8798781,0.53021556,0
0.745123,0.5687958,0
0.8461276,0.47435004,0
0.7521663,0.5632249,0
0.8979489,0.50710434,0
0.8884739,0.47961524,0
0.7850904,0.5684771,0
0.91542375,0.48606327,0
0.7141584,0.5102858,0
0.83278966,0.44202313,0
0.8237495,0.6405,0
0.91483754,0.44605687,0
0.8622906,0.5316797,0
0.900521,0.51885515,0
0.8821501,0.35899514,0
0.874952,0.3461896,0
0.63529855,0.26000577,0
0.7921109,0.5354656,0
0.88448906,0.64443,0
0.83835125,0.44966397,0
0.8923865,0.3511029,0
0.8879264,0.44197056,0
0.9018742,0.5981771,0
0.81424695,0.46157065,0
0.8316991,0.29242423,0
0.847548,0.29692423,0
0.8583668,0.5062873,0
0.88361967,0.6521981,0
0.7657895,0.53293896,0
0.9184628,0.6102711,0
0.8908031,0.6980042,0
0.8901893,0.59174085,0
0.89056885,0.6746223,0
0.81427455,0.5416527,0
0.80769545,0.50028485,0
0.80228156,0.43693897,0
0.69082206,0.46422383,0
0.79808867,0.58922434,0
0.7286346,0.44571766,0
0.84640396,0.39469266,0
0.8549341,0.4833347,0
0.8901045,0.43806416,0
0.8959266,0.6055656,0
0.8910518,0.6266901,0
0.89342046,0.3642163,0
0.92933375,0.42571533,0
0.90632844,0.3466775,0
0.85241205,0.66423553,0
0.7626149,0.4881271,0
0.88305646,0.6868476,0
0.76641536,0.49469572,0
0.8563417,0.67273164,0
0.8719162,0.60559034,0
0.7940838,0.4707178,0
0.8944658,0.6474027,0
0.8911237,0.5908536,0
0.8183168,0.6003309,0
0.8387432,0.5846241,0
0.75614506,0.5664422,0
0.91478354,0.39497665,0
0.8664156,0.31283838,0
0.8605086,0.44262758,0
0.89147705,0.34010968,0
0.8276658,0.4448421,0
0.82642144,0.4946599,0
0.8566399,0.62174666,0
0.77468586,0.30198368,0
0.8873888,0.64008236,0
0.8725923,0.5719404,0
0.8285973,0.44371587,0
0.8467539,0.6406591,0
0.8774512,0.68776095,0
0.90924966,0.6533862,0
0.9066268,0.67341155,0
0.834482,0.33970603,0
0.86329395,0.49223784,0
0.8782762,0.66824836,0
0.84649664,0.52643186,0
0.80926096,0.37774074,0
0.90185004,0.46682748,0
0.7628731,0.38818282,0
0.9030267,0.5200282,0
0.83626086,0.603904,0
0.7901979,0.43300024,0
0.8207593,0.3954301,0
0.8530022,0.3052553,0
0.9180037,0.5248668,0
0.749712,0.4138094,0
0.9126103,0.49066097,0
0.92579216,0.55870724,0
0.89628965,0.45528305,0
0.8458175,0.36374983,0
0.9244333,0.58313656,0
0.8373687,0.42673343,0
0.8365512,0.37976345,0
0.8841873,0.5537274,0
0.9209409,0.47821987,0
0.90007675,0.27794588,0
0.8372688,0.3135763,0
0.89488786,0.57823247,0
0.8975619,0.56990105,0
0.7907658,0.4609648,0
0.8206281,0.4747697,0
0.8991882,0.48775718,0
0.85486144,0.3869498,0
0.7566776,0.25825775,0
0.791835,0.3759115,0
0.8016084,0.42000103,0
0.7607488,0.46174505,0
0.86044985,0.32021204,0
0.8821515,0.55169946,0
0.83782214,0.39095807,0
0.55486006,0.2155234,0
0.85363716,0.47914752,0
0.8689076,0.33527374,0
0.8238143,0.24583597,0
0.8357785,0.4494703,0
0.85653657,0.55718106,0
0.87764335,0.58287007,0
0.83735514,0.38832006,0
0.85023713,0.682099,0
0.8417289,0.5799601,0
0.89078087,0.4344224,0
0.87865406,0.58229303,0
0.9097673,0.41014016,0
0.8485693,0.5331217,0
0.91925055,0.43253812,0
0.88901955,0.39545575,0
0.8054029,0.23581232,0
0.830796,0.47525457,0
0.7512576,0.44727236,0
0.93308586,0.45925155,0
0.8616664,0.4478408,0
0.864747,0.52796096,0
0.9119861,0.37027133,0
0.922081,0.46059904,0
0.90455353,0.43773526,0
0.9185713,0.5933485,0
0.93226624,0.5923484,0
0.9266214,0.61389476,0
0.90839344,0.32836363,0
0.92583084,0.63409764,0
0.9278706,0.53787816,0
0.9247271,0.44426453,0
0.90112746,0.334881,0
0.9222114,0.4732312,0
0.93215185,0.51323175,0
0.92602485,0.55246454,0
0.9255513,0.54988146,0
0.89239913,0.5865271,0
0.9261008,0.49816185,0
0.91549575,0.47364655,0
0.9008604,0.44865546,0
0.8966151,0.44695598,0
0.91955185,0.34458026,0
0.918999,0.38177633,0
0.88434666,0.49482173,0
0.9049246,0.48492327,0
0.89470774,0.32051793,0
0.9305691,0.56933624,0
0.8614628,0.3984768,0
0.8260144,0.3089937,0
0.92872065,0.4420011,0
0.9161376,0.39565185,0
0.8815771,0.42394456,0
0.89637226,0.5003374,0
0.8685763,0.67645025,0
0.79277164,0.44582787,0
0.844395,0.54330903,0
0.7754834,0.38452604,0
0.8450339,0.28044367,0
0.9232128,0.39827538,0
0.8864677,0.35457927,0
0.8791137,0.40017956,0
0.9121211,0.49059585,0
0.90597403,0.35259426,0
0.8970639,0.38337532,0
0.86367214,0.278017,0
0.7968593,0.3803878,0
0.85213035,0.2884298,0
0.8728595,0.3073742,0
0.86532855,0.38876185,0
0.8160897,0.31444946,0
0.8981969,0.6540119,0
0.89625,0.3096922,0
0.87225616,0.70155704,0
0.90663886,0.3716559,0
0.9044511,0.38017443,0
0.82035756,0.2878794,0
0.7647222,0.39160126,0
0.8604307,0.4212665,0
0.7724344,0.47911605,0
0.86406434,0.33905745,0
0.90200156,0.46629497,0
0.9161355,0.40611523,0
0.8966035,0.45877036,0
0.9183532,0.41996914,0
0.91470766,0.38454947,0
0.92450064,0.3551911,0
0.8996904,0.35689935,0
0.9067268,0.3822514,0
0.87371296,0.4112774,0
0.9032799,0.40031475,0
0.887203,0.3338217,0
0.85947526,0.34074873,0
0.74054635,0.45887613,0
0.76296896,0.38865745,0
0.8179425,0.3558457,0
0.83996165,0.3232049,0
0.9269912,0.516513,0
0.7411752,0.38922778,0
0.7736361,0.51044774,0
0.85720944,0.57720864,0
0.8314459,0.2668848,0
0.8512198,0.2855163,0
0.83771265,0.33413276,0
0.89555836,0.6044866,0
0.86691785,0.29359296,0
0.81834453,0.6200472,0
0.8597371,0.43305513,0
0.92261577,0.47187603,0
0.80084634,0.32111293,0
0.66972697,0.4955968,0
0.88894606,0.6539738,0
0.9035031,0.5005048,0
0.8882974,0.6370577,0
0.87629735,0.31601983,0
0.88218844,0.566527,0
0.85300386,0.48615396,0
0.814133,0.46271038,0
0.86389947,0.29454833,0
0.8507403,0.45781764,0
0.84975886,0.66268927,0
0.75493765,0.5428301,0
0.79580504,0.5591322,0
0.8488698,0.39671686,0
0.87856656,0.262385,0
0.85114044,0.35876957,0
0.76063627,0.2677479,0
0.86351806,0.5249008,0
0.86953884,0.33635062,0
0.8612104,0.41563064,0
0.86866665,0.32154104,0
0.8563312,0.58354497,0
0.772793,0.53887486,0
0.805135,0.33167186,0
0.7978223,0.27158958,0
0.86487764,0.38262376,0
0.7081999,0.466075,0
0.82992125,0.28074083,0
0.8885741,0.47404087,0
0.7814026,0.2902493,0
0.91526115,0.49625447,0
0.7186991,0.2902434,0
0.9171868,0.582098,0
0.8942432,0.5440873,0
0.9180915,0.5165048,0
0.9149402,0.5062744,0
0.79320997,0.33894622,0
0.89813423,0.48700136,0
0.87651694,0.5418364,0
0.81173366,0.41796952,0
0.8514002,0.6690105,0
0.9019988,0.4620082,0
0.8369387,0.5261904,0
0.7662229,0.25321156,0
0.79313314,0.43973777,0
0.8846559,0.35945997,0
0.7612414,0.45100984,0
0.8203547,0.5264252,0
0.8251898,0.41591525,0
0.8792459,0.49017042,0
0.7411839,0.2691092,0
0.8531993,0.3292803,0
0.89701843,0.6100368,0
0.8891281,0.60353184,0
0.80502546,0.4256499,0
0.9268763,0.5277859,0
0.90801704,0.4730338,0
0.79652154,0.4040072,0
0.8661143,0.5897554,0
0.9151673,0.47103977,0
0.8890426,0.4610082,0
0.8529487,0.37802714,0
0.8247676,0.3621502,0
0.90015894,0.46626878,0
0.8670354,0.33098847,0
0.8567469,0.4226252,0
0.8416451,0.29758212,0
0.86995095,0.4574603,0
0.89403063,0.49580207,0
0.85167664,0.50943816,0
0.84874237,0.34933743,0
0.8610329,0.28704014,0
0.88754255,0.43495923,0
0.85814977,0.41970485,0
0.9116138,0.5093449,0
0.8743219,0.6368372,0
0.90143365,0.4465961,0
0.84678435,0.5939505,0
0.8077249,0.3892672,0
0.8969518,0.6176057,0
0.8761241,0.3734449,0
0.87938505,0.49330255,0
0.8934044,0.4415053,0
0.8800481,0.5007122,0
0.8717918,0.5934413,0
0.884072,0.51411796,0
0.8898958,0.39639705,0
0.66580147,0.3659446,0
0.82181466,0.5079285,0
0.9151637,0.412523,0
0.8811253,0.47354248,0
0.9157994,0.6656546,0
0.8928242,0.5492166,0
0.90944356,0.6151771,0
0.84089375,0.54494256,0
0.8353718,0.6522413,0
0.8083518,0.63273525,0
0.90125585,0.6486288,0
0.8476909,0.47931418,0
0.877069,0.5272296,0
0.8858156,0.50285846,0
0.7245808,0.5203843,0
0.87786347,0.43700737,0
0.8344981,0.4504243,0
0.8367449,0.6645004,0
0.7789356,0.3800165,0
0.7147309,0.26356754,0
0.82657385,0.48900437,0
0.8677221,0.5277193,0
0.83542603,0.51956695,0
0.8688602,0.53141123,0
0.8340307,0.58409894,0
0.8767331,0.6211071,0
0.9013686,0.28849635,0
0.91676855,0.47613114,0
0.9119897,0.3909221,0
0.9086392,0.5735975,0
0.910623,0.5960671,0
0.9133432,0.6356895,0
0.7751878,0.6090395,0
0.90930176,0.35425517,0
0.7224139,0.37264952,0
0.92156875,0.6357633,0
0.80976677,0.33024287,0
0.81154436,0.39347285,0
0.88837785,0.67510736,0
0.9019532,0.6357375,0
0.9041664,0.5822169,0
0.8973189,0.6523339,0
0.8741545,0.56572765,0
0.8124193,0.5195142,0
0.8122073,0.33337805,0
0.92090094,0.4818921,0
0.7593227,0.47900742,0
0.87303215,0.58793724,0
0.80389863,0.6557283,0
0.8916686,0.57783556,0
0.8734413,0.67873585,0
0.89249027,0.55736005,0
0.8497408,0.41820166,0
0.90046173,0.61103815,0
0.88239175,0.5402229,0
0.8524341,0.6511745,0
0.8989033,0.51550436,0
0.899043,0.62177724,0
0.7878447,0.4241761,0
0.90653247,0.6274928,0
0.7756766,0.38444048,0
0.8869353,0.5540428,0
0.8760499,0.63399523,0
0.8553725,0.51184005,0
0.8154694,0.5461385,0
0.80654585,0.26449594,0
0.8535195,0.53209925,0
0.85816085,0.4865881,0
0.900278,0.35883147,0
0.78452224,0.45178226,0
0.79262376,0.41425052,0
0.8523352,0.6710133,0
0.82205254,0.61565864,0
0.93162286,0.5483688,0
0.8825248,0.6578132,0
0.86019766,0.5427516,0
0.83328485,0.5693131,0
0.9117314,0.67495924,0
0.8786458,0.5747113,0
0.8936778,0.60908854,0
0.92380005,0.4441725,0
0.8204892,0.4518191,0
0.90832263,0.39050037,0
0.7252521,0.3959868,0
0.9250327,0.532569,0
0.76520485,0.54801476,0
0.85625494,0.51041806,0
0.8366288,0.4585352,0
0.92497253,0.60004944,0
0.7114298,0.5581997,0
0.81921905,0.58636564,0
0.9387713,0.5048177,0
0.81569374,0.3935807,0
0.8475694,0.6115354,0
0.8880336,0.6232427,0
0.90127313,0.39799398,0
0.8739977,0.5433321,0
0.88839805,0.39183423,0
0.89818436,0.37503085,0
0.814406,0.31918707,0
0.9105889,0.50567204,0
0.91173613,0.5554404,0
0.8638113,0.5275101,0
0.7963971,0.25735435,0
0.8992775,0.2833117,0
0.9123675,0.50001657,0
0.81041855,0.48682126,0
0.82751817,0.5793028,0
0.7819742,0.33106264,0
0.90326047,0.68156683,0
0.825914,0.52193886,0
0.91059494,0.29897076,0
0.8752671,0.64970154,0
0.79917645,0.5491996,0
0.8946318,0.3679404,0
0.87042934,0.5390194,0
0.84791434,0.5731237,0
0.894845,0.3420527,0
0.8829662,0.57206535,0
0.85057986,0.36821914,0
0.7988014,0.46899486,0
0.90285546,0.6206548,0
0.79736125,0.48189804,0
0.8258403,0.52034193,0
0.844612,0.4422551,0
0.9125357,0.63177353,0
0.8828361,0.6286181,0
0.83407754,0.38008597,0
0.87292284,0.47038338,0
0.8781708,0.67659897,0
0.7259767,0.49301925,0
0.78232574,0.606619,0
0.8605839,0.5583502,0
0.87656426,0.42220768,0
0.77830493,0.30060872,0
0.90127915,0.6779107,0
0.8375835,0.65056723,0
0.88635284,0.52353823,0
0.86145985,0.58002657,0
0.8451554,0.55238014,0
0.7382862,0.29015443,0
0.85427284,0.2467138,0
0.8067634,0.55306554,0
0.91991657,0.57924575,0
0.85857743,0.585809,0
0.8019892,0.2912049,0
0.81050617,0.6822306,0
0.8993261,0.5790918,0
0.8390199,0.44477654,0
0.7048817,0.51316094,0
0.8950831,0.48320618,0
0.897379,0.39664066,0
0.8458064,0.34317607,0
0.71837044,0.35289612,0
0.8421753,0.24895978,0
0.80987436,0.33108598,0
0.74551994,0.44963375,0
0.742139,0.668479,0
0.8361024,0.33228108,0
0.8168631,0.68722206,0
0.87188566,0.32117563,0
0.86104494,0.29952788,0
0.8378827,0.25424647,0
0.85234475,0.5606447,0
0.8836894,0.34724954,0
0.8362056,0.65267843,0
0.8798888,0.38563484,0
0.846211,0.6910486,0
0.78290033,0.38562688,0
0.8792155,0.33139884,0
0.8382799,0.26044467,0
0.855341,0.47046298,0
0.8554892,0.6234413,0
0.83503187,0.55167806,0
0.9105753,0.53410137,0
0.9257589,0.45446917,0
0.82222086,0.45530462,0
0.8527327,0.3072355,0
0.8381073,0.41451508,0
0.7676552,0.44006616,0
0.89965576,0.38615376,0
0.87449837,0.5921325,0
0.9094975,0.6328265,0
0.8309547,0.3021782,0
0.8490328,0.46756247,0
0.920052,0.60549587,0
0.8398447,0.594194,0
0.81258166,0.6325748,0
0.76078385,0.48559046,0
0.8207327,0.39706117,0
0.7931867,0.4770549,0
0.8708055,0.37459272,0
0.76337975,0.50509363,0
0.83695275,0.3151632,0
0.8740607,0.47958997,0
0.90097356,0.62844074,0
0.88761616,0.5018829,0
0.8023877,0.2599305,0
0.48745912,0.28878662,0
0.8544903,0.30035675,0
0.83498013,0.5414902,0
0.9025466,0.3332542,0
0.8181565,0.56458515,0
0.80854803,0.43771398,0
0.7882262,0.6073459,0
0.79068667,0.6309848,0
0.8442251,0.5453235,0
0.8501601,0.647237,0
0.7538915,0.45311165,0
0.81053525,0.39245123,0
0.9181668,0.54239124,0
0.87841743,0.45312682,0
0.8321162,0.5917363,0
0.8907717,0.4210224,0
0.86751086,0.578074,0
0.8817438,0.36650544,0
0.86996585,0.41004637,0
0.76121926,0.31645107,0
0.8385906,0.62977743,0
0.8496049,0.27408418,0
0.7996323,0.6335334,0
0.93185616,0.50920904,0
0.89401394,0.6458883,0
0.89880353,0.4527108,0
0.8867002,0.52083075,0
0.86495805,0.26173759,0
0.81988484,0.3857188,0
0.8346783,0.5987839,0
0.91615236,0.48737904,0
0.7411912,0.53283936,0
0.7415925,0.46920204,0
0.8475764,0.4453296,0
0.92233527,0.5873821,0
0.83244616,0.66445327,0
0.8582209,0.3837503,0
0.9254999,0.48126268,0
0.79585695,0.342457,0
0.85511106,0.27417624,0
0.87606454,0.36511374,0
0.7940256,0.50254613,0
0.8504367,0.29390803,0
0.86415094,0.5043524,0
0.72567797,0.4026452,0
0.7438854,0.34042507,0
0.77204424,0.30634937,0
0.8495357,0.5887425,0
0.7692225,0.2461939,0
0.8240344,0.4734281,0
0.83856934,0.6391802,0
0.753376,0.38895696,0
0.8392122,0.571299,0
0.7558312,0.5641765,0
0.6313015,0.39939547,0
0.72568077,0.5385858,0
0.8903548,0.363037,0
0.8019117,0.59413874,0
0.88672686,0.5520383,0
0.858303,0.48910052,0
0.83250207,0.66966236,0
0.854457,0.6621905,0
0.81095207,0.60369116,0
0.86647844,0.400596,0
0.8000006,0.4717679,0
0.87627345,0.35739434,0
0.8821486,0.6950505,0
0.64932203,0.3548155,0
0.88482666,0.34539327,0
0.44933957,0.24946745,0
0.8296915,0.6494858,0
0.7629155,0.3943354,0
0.7057381,0.33726645,0
0.5072234,0.5355605,0
0.90703297,0.33028206,0
0.8675934,0.58924496,0
0.8405692,0.5547,0
0.88011366,0.5552556,0
0.8959435,0.34727105,0
0.89562595,0.38959774,0
0.86774296,0.6216594,0
0.8922402,0.36511967,0
0.86593837,0.44625363,0
0.86385614,0.33309087,0
0.8638368,0.582086,0
0.9328815,0.48467615,0
0.88933814,0.60618794,0
0.9161324,0.62236696,0
0.8210637,0.64893144,0
0.84405345,0.52939355,0
0.8652916,0.6092688,0
0.8683475,0.5026108,0
0.77846646,0.4078206,0
0.82218677,0.5609373,0
0.7781501,0.6287904,0
0.78839844,0.46893567,0
0.8339767,0.31887475,0
0.8052556,0.47612834,0
0.85847795,0.4075553,0
0.87557924,0.37916368,0
0.89501256,0.37780777,0
0.897567,0.62322986,0
0.8600882,0.49664176,0
0.7712216,0.4195764,0
0.8823013,0.32518324,0
0.8665153,0.46557152,0
0.89752716,0.38254625,0
0.88485074,0.5186932,0
0.7485153,0.25890464,0
0.78666615,0.43360096,0
0.75695336,0.30848193,0
0.88351715,0.50611734,0
0.8164447,0.52957475,0
0.87839425,0.49348864,0
0.8287399,0.40361646,0
0.81158036,0.45591187,0
0.86721504,0.5250551,0
0.9261657,0.37084094,0
0.8741652,0.3450439,0
0.84842837,0.54356676,0
0.8784193,0.62634003,0
0.89252084,0.5542843,0
0.8985575,0.4839649,0
0.8857097,0.6325196,0
0.897321,0.43744195,0
0.8040308,0.33760586,0
0.8359234,0.6197191,0
0.8319535,0.5170177,0
0.8922132,0.59540516,0
0.8663475,0.34542456,0
0.89002657,0.60784024,0
0.71752197,0.41484413,0
0.8546059,0.3035271,0
0.8345367,0.46815866,0
0.85715383,0.6275661,0
0.78426844,0.6720301,0
0.88862675,0.33394155,0
0.9029852,0.49819633,0
0.68478006,0.45049945,0
0.9130995,0.4229613,0
0.7945133,0.6111712,0
0.865911,0.484726,0
0.8081185,0.51000035,0
0.8933004,0.35016906,0
0.8121726,0.47105417,0
0.7898809,0.4023461,0
0.7344836,0.53272665,0
0.84094703,0.61050826,0
0.7952206,0.53635794,0
0.79552823,0.6442658,0
0.76797855,0.35490718,0
0.75172246,0.31860867,0
0.8309944,0.6643517,0
0.8699327,0.3058979,0
0.85357714,0.41743636,0
0.90310603,0.5954354,0
0.7923076,0.63618845,0
0.8599585,0.6742545,0
0.9217319,0.42853785,0
0.91061795,0.49162787,0
0.70354784,0.5427731,0
0.88807875,0.34790987,0
0.91361904,0.48968142,0
0.88338816,0.6847121,0
0.89743495,0.5502539,0
0.7544937,0.6791349,0
0.87045276,0.69259876,0
0.8892307,0.39837214,0
0.7823398,0.57621485,0
0.8787697,0.37334448,0
0.8888469,0.38249248,0
0.8903172,0.35261956,0
0.77758944,0.5076196,0
0.7638631,0.37671098,0
0.74818873,0.43854463,0
0.7719066,0.51031494,0
0.79274523,0.4286322,0
0.82148695,0.5567747,0
0.87391454,0.48223633,0
0.9083656,0.33525264,0
0.8184528,0.47448578,0
0.859348,0.36583155,0
0.8763185,0.6590561,0
0.7978398,0.52419573,0
0.6657359,0.40132204,0
0.89693886,0.33319044,0
0.85723364,0.47525424,0
0.91045487,0.45231673,0
0.7896238,0.6740085,0
0.90938234,0.48817945,0
0.86468,0.29906496,0
0.8576766,0.6174188,0
0.8852502,0.5201552,0
0.87424797,0.2772116,0
0.7471348,0.46714258,0
0.91762596,0.532007,0
0.88221496,0.61669785,0
0.7846029,0.3230031,0
0.76566285,0.5752733,0
0.8832929,0.5574767,0
0.8755852,0.32087135,0
0.8539883,0.33436623,0
0.84774554,0.48842004,0
0.9165033,0.39908248,0
0.8340404,0.6431422,0
0.8831875,0.36195907,0
0.8999994,0.4895778,0
0.81190807,0.25287554,0
0.72899723,0.3619693,0
0.7809334,0.4361026,0
0.10584569,0.5205823,1
0.09735294,0.6940978,1
0.09097767,0.67106277,1
0.14516537,0.32322854,1
0.10227919,0.76112443,1
0.15534987,0.2366784,1
0.08975508,0.71214294,1
0.11422886,0.38824078,1
0.20068978,0.1744604,1
0.09344178,0.4278235,1
0.15974715,0.189044,1
0.08380656,0.3914697,1
0.13757761,0.25012127,1
0.11066329,0.4307316,1
0.1177823,0.3570236,1
0.1348511,0.2007248,1
0.08022158,0.6972951,1
0.09546382,0.5386476,1
0.12411525,0.2770983,1
0.10395446,0.5367382,1
0.2276654,0.12646243,1
0.09945112,0.65333,1
0.18177868,0.17643161,1
0.13555372,0.2789091,1
0.23856813,0.14121102,1
0.12657228,0.29450634,1
0.09656227,0.67793053,1
0.10079266,0.55581445,1
0.16595963,0.17693797,1
0.14169346,0.23735596,1
0.23327237,0.14357947,1
0.13560323,0.22143337,1
0.18912037,0.17336927,1
0.17821681,0.21302761,1
0.1851123,0.26287857,1
0.1616492,0.17813465,1
0.13447808,0.28020296,1
0.19776715,0.13498533,1
0.15199567,0.22523904,1
0.09387402,0.5233055,1
0.10811919,0.37997577,1
0.1940469,0.16791296,1
0.10393378,0.44496876,1
0.09708012,0.44181237,1
0.085152075,0.47360915,1
0.09567125,0.597156,1
0.09934279,0.4237449,1
0.108472615,0.5347174,1
0.11276709,0.3254372,1
0.10622893,0.52069145,1
0.22541378,0.13424507,1
0.09212297,0.4421449,1
0.09813224,0.73790026,1
0.13903286,0.25123155,1
0.2154681,0.13221204,1
0.11927311,0.2962799,1
0.21348903,0.14314958,1
0.08996061,0.7958721,1
0.18441868,0.18390588,1
0.21572961,0.17412518,1
0.2394731,0.15919042,1
0.24694991,0.14620543,1
0.15988086,0.19798267,1
0.113197714,0.822944,1
0.19452614,0.1701759,1
0.18505186,0.17515565,1
0.111776784,0.25831378,1
0.099754624,0.74744225,1
0.12674934,0.23386763,1
0.12472768,0.30316976,1
0.13290635,0.21389405,1
0.10177981,0.76515037,1
0.2703446,0.16086085,1
0.13825533,0.22191568,1
0.08728382,0.56014836,1
0.08856531,0.7977303,1
0.28704736,0.17538601,1
0.09743684,0.4052918,1
0.14217417,0.23118457,1
0.109988414,0.38883147,1
0.15025645,0.1746933,1
0.103947684,0.85308915,1
0.095084935,0.7817763,1
0.16253728,0.23571791,1
0.105233505,0.5589533,1
0.15753375,0.5416851,1
0.08537872,0.83105284,1
0.09720696,0.63071066,1
0.099865064,0.8478514,1
0.100219004,0.84002584,1
0.11546513,0.7286353,1
0.19396664,0.16554528,1
0.15097047,0.20791005,1
0.093866475,0.39220855,1
0.0985433,0.840555,1
0.10119873,0.84918106,1
0.0878274,0.514239,1
0.116408296,0.43516243,1
0.19301389,0.19101124,1
0.26122954,0.15234542,1
0.1013169,0.73081166,1
0.11046511,0.45185527,1
0.113298036,0.79651666,1
0.1074641,0.5003828,1
0.078906246,0.7192902,1
0.15315078,0.20282303,1
0.11671276,0.395786,1
0.1242539,0.25237584,1
0.09848812,0.36401156,1
0.13462834,0.2564929,1
0.11513104,0.48762482,1
0.14106987,0.25123745,1
0.21543622,0.17885806,1
0.24453492,0.18947114,1
0.08358055,0.49372825,1
0.100410625,0.59213233,1
0.18484126,0.18093672,1
0.10114783,0.6656981,1
0.19479676,0.17649055,1
0.09693948,0.7286539,1
0.09621557,0.6262606,1
0.1404471,0.29035842,1
0.08069111,0.71630305,1
0.09844501,0.6079244,1
0.12937714,0.30510518,1
0.16934071,0.19714426,1
0.13174903,0.25173414,1
0.18620354,0.18986243,1
0.10080081,0.3128176,1
0.09611618,0.7168588,1
0.15324257,0.24612843,1
0.11498013,0.34351423,1
0.08805579,0.4762119,1
0.09583517,0.74508315,1
0.12513736,0.2891364,1
0.15755042,0.20009989,1
0.1976915,0.15693045,1
0.13179904,0.24972925,1
0.18631484,0.26881623,1
0.12617461,0.27010813,1
0.15041448,0.22612393,1
0.14814511,0.17111821,1
0.21232067,0.14276159,1
0.122981034,0.22463343,1
0.23080978,0.15196395,1
0.11367135,0.2599877,1
0.17823961,0.15229297,1
0.117664225,0.32577506,1
0.10314214,0.26843935,1
0.18065457,0.19356647,1
0.09164059,0.740236,1
0.1030641,0.2572464,1
0.123025686,0.3287128,1
0.16970442,0.15939084,1
0.12285927,0.23165873,1
0.16044961,0.17989321,1
0.10025568,0.7450577,1
0.18900241,0.14645645,1
0.100114495,0.4068376,1
0.11950221,0.36021,1
0.10426766,0.5413084,1
0.118807435,0.23213452,1
0.13036996,0.37668246,1
0.13510881,0.25168347,1
0.12775157,0.2664893,1
0.10464303,0.6204789,1
0.16963667,0.205455,1
0.12325681,0.34125468,1
0.09547996,0.8072144,1
0.20755717,0.154732,1
0.0967032,0.74003834,1
0.094779804,0.7821886,1
0.099668756,0.83438766,1
0.12306406,0.23289678,1
0.14388138,0.31890416,1
0.14803079,0.22364493,1
0.09485811,0.7681314,1
0.09567937,0.70705664,1
0.09136892,0.8492649,1
0.09334578,0.5970802,1
0.14494932,0.23801126,1
0.09756669,0.7682389,1
0.19258499,0.15639406,1
0.1016526,0.43627393,1
0.18864942,0.17158894,1
0.123072736,0.2620281,1
0.12160795,0.3056895,1
0.15236662,0.20104401,1
0.10692728,0.64438987,1
0.12194502,0.23467818,1
0.09030193,0.5872776,1
0.101497576,0.6348689,1
0.10403837,0.62297004,1
0.13230948,0.26691198,1
0.15411435,0.15482673,1
0.18043089,0.14496711,1
0.11145414,0.62984973,1
0.21409641,0.14292854,1
0.12067655,0.32500103,1
0.13528867,0.2660272,1
0.14979905,0.21861969,1
0.21657862,0.1367887,1
0.108417146,0.39631757,1
0.11941371,0.29792377,1
0.10541755,0.59801096,1
0.1395759,0.25228995,1
0.1718814,0.1895902,1
0.1508244,0.20916735,1
0.12737317,0.2756234,1
0.20393689,0.15064923,1
0.19656801,0.15418196,1
0.14186469,0.1946922,1
0.19711919,0.15494137,1
0.14070962,0.20378695,1
0.10334461,0.3694286,1
0.13888834,0.25968787,1
0.09652881,0.7626436,1
0.21754058,0.1308262,1
0.19542655,0.1754062,1
0.14364593,0.22809114,1
0.21171805,0.13897868,1
0.19134404,0.17121741,1
0.0802387,0.62772423,1
0.15005267,0.24644443,1
0.1600018,0.19801529,1
0.18406728,0.20220175,1
0.1911741,0.18075182,1
0.12193771,0.23372164,1
0.13745442,0.2957205,1
0.14837033,0.19169594,1
0.1613713,0.2468548,1
0.13771279,0.30825368,1
0.14714281,0.21494389,1
0.19587256,0.16161929,1
0.0918365,0.8025858,1
0.14373225,0.16677569,1
0.15998922,0.2812373,1
0.19644472,0.18223114,1
0.20781593,0.16330853,1
0.2218978,0.15366925,1
0.13099782,0.2227389,1
0.16231337,0.20144702,1
0.26940307,0.14651734,1
0.21582507,0.1530908,1
0.17679662,0.17478187,1
0.22544514,0.14830922,1
0.22453097,0.13422821,1
0.18104917,0.16524805,1
0.13340689,0.25643998,1
0.18514723,0.18508025,1
0.13699962,0.1977391,1
0.09492592,0.4970399,1
0.086292945,0.56013036,1
0.09721252,0.81388557,1
0.17065504,0.18199249,1
0.07554895,0.74418545,1
0.10096896,0.3416587,1
0.09824025,0.7212541,1
0.120243974,0.39295262,1
0.102520674,0.5444187,1
0.20367223,0.14613569,1
0.076059364,0.66317785,1
0.12574032,0.26249728,1
0.22154942,0.15186383,1
0.24516085,0.1611386,1
0.09823661,0.7434879,1
0.10407308,0.6983596,1
0.21853021,0.15144758,1
0.19637565,0.16142134,1
0.13093165,0.19996722,1
0.13283437,0.18424284,1
0.11749867,0.7801335,1
0.2297301,0.1374466,1
0.12508656,0.23327962,1
0.20334521,0.16291484,1
0.11705018,0.323289,1
0.09907456,0.8067668,1
0.07784359,0.8222732,1
0.16258754,0.21015973,1
0.13717148,0.20478301,1
0.09305499,0.5812774,1
0.09048709,0.49349496,1
0.18841764,0.19056486,1
0.11562722,0.32428548,1
0.15152664,0.24927638,1
0.0894676,0.81136936,1
0.084254675,0.8172351,1
0.1462121,0.18313944,1
0.1702865,0.23176767,1
0.12208981,0.29164046,1
0.17392287,0.21769445,1
0.16815947,0.24138412,1
0.15367724,0.23308957,1
0.093579195,0.70847255,1
0.11061569,0.4033416,1
0.09197933,0.71896094,1
0.21566324,0.19104883,1
0.22679083,0.1529697,1
0.09011469,0.79147357,1
0.18256353,0.17251812,1
0.07897044,0.75442654,1
0.25478056,0.13948123,1
0.100851044,0.8026163,1
0.092279404,0.766432,1
0.07872482,0.64800245,1
0.1517504,0.21524663,1
0.10639272,0.56243336,1
0.09947037,0.39256302,1
0.09575995,0.44038683,1
0.17296416,0.24991554,1
0.1230338,0.35822073,1
0.17224833,0.21404237,1
0.10788164,0.47713175,1
0.09092214,0.50297314,1
0.11821644,0.34424558,1
0.15210429,0.20425577,1
0.15442078,0.22445244,1
0.11638911,0.26199192,1
0.09420764,0.71944207,1
0.16464454,0.1438603,1
0.099593535,0.43506697,1
0.0996472,0.41572917,1
0.12905142,0.28026012,1
0.115257934,0.39310926,1
0.15062365,0.24705362,1
0.1444248,0.2422048,1
0.23035283,0.15726438,1
0.1817419,0.18066472,1
0.22093461,0.15682803,1
0.14395817,0.24041797,1
0.0825654,0.597588,1
0.14150134,0.22396252,1
0.1273627,0.22983693,1
0.097321056,0.68847436,1
0.090036295,0.78909093,1
0.10247078,0.47840977,1
0.07982414,0.6893702,1
0.1079838,0.5944747,1
0.09009468,0.45036,1
0.14498031,0.24514359,1
0.1312548,0.25183484,1
0.1086521,0.5944342,1
0.10003932,0.60093427,1
0.16550973,0.16212411,1
0.10488196,0.69824445,1
0.14047755,0.20114648,1
0.11318382,0.59731394,1
0.16831979,0.2069858,1
0.17421915,0.2068624,1
0.1611104,0.21728374,1
0.11177352,0.73123044,1
0.10320647,0.5116878,1
0.26899138,0.16246139,1
0.08715661,0.6736592,1
0.16168322,0.23687913,1
0.10830198,0.6016773,1
0.17927322,0.16936487,1
0.09981308,0.63807213,1
0.2307454,0.1449555,1
0.20900987,0.15210505,1
0.08328862,0.46341026,1
0.110022776,0.5179885,1
0.19699426,0.16728628,1
0.07478812,0.80282223,1
0.13430054,0.26240143,1
0.09702953,0.79040545,1
0.10500827,0.5804658,1
0.10303259,0.53276885,1
0.16483112,0.22642584,1
0.09402462,0.79170996,1
0.10444315,0.6177334,1
0.13875659,0.30078614,1
0.10932878,0.5383572,1
0.09044886,0.69235164,1
0.083702035,0.50931543,1
0.12405472,0.32301456,1
0.17064199,0.19006696,1
0.077855736,0.65164286,1
0.08051799,0.5750147,1
0.07919004,0.58973926,1
0.12394606,0.32489857,1
0.09859344,0.4726655,1
0.089933366,0.6189437,1
0.14896125,0.19151732,1
0.09843443,0.52747613,1
0.0949455,0.43369365,1
0.09156745,0.77683157,1
0.09594405,0.8076033,1
0.13211942,0.26662526,1
0.11236862,0.47489768,1
0.11649456,0.25310802,1
0.09381712,0.4784467,1
0.17320323,0.2209724,1
0.19774564,0.7706453,1
0.10554009,0.5775373,1
0.083426155,0.8281607,1
0.1055526,0.84450585,1
0.09580194,0.71170884,1
0.10444083,0.47775388,1
0.08310407,0.5463554,1
0.098875046,0.84881926,1
0.09748949,0.8220768,1
0.092376634,0.4206697,1
0.0973096,0.76758236,1
0.09803259,0.7803807,1
0.10152573,0.7559624,1
0.07859251,0.7395923,1
0.0948532,0.7159579,1
0.07581654,0.8135776,1
0.09306549,0.8256805,1
0.09480326,0.8180203,1
0.1145978,0.4468448,1
0.0855849,0.7188119,1
0.18274575,0.20087744,1
0.10249721,0.625762,1
0.07817107,0.5981073,1
0.11517805,0.6181858,1
0.084890254,0.511785,1
0.08985581,0.8294342,1
0.11105978,0.53894955,1
0.08035397,0.59486073,1
0.09264388,0.77791303,1
0.09677178,0.73032683,1
0.09181563,0.7742309,1
0.094132714,0.715202,1
0.09485992,0.46098173,1
0.09614025,0.8173831,1
0.08842496,0.62343675,1
0.11563736,0.43363723,1
0.09025872,0.8094499,1
0.1316354,0.36411825,1
0.29264015,0.6874204,1
0.13098207,0.2731828,1
0.13243333,0.298604,1
0.09635548,0.5727044,1
0.21943124,0.15363744,1
0.08701083,0.7162492,1
0.09509852,0.7960875,1
0.14451045,0.5129165,1
0.14115292,0.2676941,1
0.090291694,0.76234424,1
0.09230788,0.8071879,1
0.09528632,0.7497377,1
0.098077975,0.3638303,1
0.09145451,0.78527623,1
0.07660198,0.7531223,1
0.08883222,0.8375216,1
0.09187006,0.6463439,1
0.09483689,0.8458151,1
0.08522308,0.7768558,1
0.09014601,0.7426671,1
0.088854015,0.77901995,1
0.0955703,0.5476759,1
0.08953699,0.72011507,1
0.14030132,0.21833138,1
0.078529514,0.5590161,1
0.08325247,0.53467596,1
0.08375241,0.58693033,1
0.102637514,0.85278827,1
0.08430211,0.6154636,1
0.16072698,0.19321921,1
0.123099364,0.33660504,1
0.08033161,0.8216205,1
0.077556685,0.81571347,1
0.09795644,0.5377532,1
0.09207427,0.55426866,1
0.23378652,0.14473574,1
0.09078456,0.608511,1
0.18330316,0.18728527,1
0.09474737,0.5975039,1
0.094757214,0.63252467,1
0.09740403,0.6294997,1
0.08827965,0.68981564,1
0.08357181,0.84505135,1
0.09543905,0.65221715,1
0.15326099,0.24502559,1
0.10184095,0.5946185,1
0.07123302,0.7913315,1
0.10398713,0.6538211,1
0.107210904,0.5809132,1
0.110853985,0.7068487,1
0.21546015,0.354575,1
0.07857825,0.59680086,1
0.09390606,0.6675601,1
0.107868135,0.33462676,1
0.118677124,0.77414733,1
0.08100435,0.56214714,1
0.172181,0.22187713,1
0.09960553,0.48867816,1
0.09768587,0.7209313,1
0.10309955,0.79977,1
0.09543979,0.7373925,1
0.10345883,0.7145462,1
0.09760999,0.74228185,1
0.088059135,0.4713185,1
0.109892905,0.6220926,1
0.104345255,0.6220139,1
0.21385042,0.13894095,1
0.087811425,0.73393846,1
0.10228435,0.40747964,1
0.102376066,0.6804167,1
0.10292986,0.85151887,1
0.10579059,0.45487282,1
0.0936171,0.53712714,1
0.07571343,0.6270159,1
0.08382438,0.7450616,1
0.08978643,0.7566094,1
0.114401735,0.26839408,1
0.09382365,0.51946086,1
0.09959999,0.41788456,1
0.09572628,0.78548956,1
0.088142246,0.8238483,1
0.09965544,0.80691946,1
0.09676891,0.65683293,1
0.19383714,0.19119784,1
0.1335278,0.27527755,1
0.10016517,0.5316978,1
0.14818153,0.49150026,1
0.100837104,0.8354968,1
0.09796521,0.75803393,1
0.096687265,0.5465091,1
0.10287924,0.81623083,1
0.19138056,0.73387325,1
0.078091346,0.60205406,1
0.10586434,0.84796596,1
0.20470768,0.18067718,1
0.12886056,0.23398231,1
0.5088243,0.67595017,1
0.089944646,0.78471804,1
0.11621754,0.6804813,1
0.09093127,0.7250132,1
0.08701032,0.6895558,1
0.092037566,0.83632857,1
0.081921406,0.72851384,1
0.09856794,0.6410375,1
0.09899625,0.70706314,1
0.110051215,0.59351224,1
0.09622399,0.758866,1
0.10326061,0.5002989,1
0.11508874,0.49302885,1
0.10179575,0.61973476,1
0.15570359,0.29106948,1
0.097485304,0.82634854,1
0.08897805,0.7729412,1
0.09547021,0.7488783,1
0.11767861,0.7916136,1
0.0990886,0.8223135,1
0.10410105,0.3767852,1
0.100687265,0.7186371,1
0.074779145,0.7019784,1
0.11439768,0.35964978,1
0.10124969,0.541968,1
0.07930745,0.82335514,1
0.10701725,0.52365404,1
0.09245602,0.8473813,1
0.09100307,0.79404247,1
0.121580645,0.3434099,1
0.089444116,0.8498521,1
0.09156238,0.808349,1
0.20081931,0.16777411,1
0.104089625,0.5600425,1
0.08243213,0.734873,1
0.08561061,0.79421175,1
0.099163786,0.81460315,1
0.19118118,0.17540322,1
0.14690119,0.25109082,1
0.1179476,0.38836706,1
0.090438835,0.8419712,1
0.120675825,0.3165759,1
0.09359728,0.7741677,1
0.123721026,0.80946714,1
0.07836206,0.77197945,1
0.10826849,0.50552374,1
0.0906111,0.805881,1
0.13848098,0.23791768,1
0.10706812,0.49684632,1
0.09011554,0.8435551,1
0.08632893,0.47178897,1
0.10812038,0.54215133,1
0.13013637,0.41062972,1
0.07461818,0.7186239,1
0.081673555,0.78985065,1
0.11056781,0.4619711,1
0.09312651,0.5843628,1
0.09297438,0.7865753,1
0.09736858,0.7574722,1
0.09624991,0.6501387,1
0.09009941,0.78306544,1
0.082754515,0.65127987,1
0.16651326,0.22387928,1
0.09712455,0.64409643,1
0.08244123,0.7053595,1
0.08188065,0.64807266,1
0.12116845,0.6823399,1
0.2095332,0.18537277,1
0.100080244,0.84649134,1
0.09530403,0.5361045,1
0.09386556,0.70493907,1
0.09519883,0.75241196,1
0.118912876,0.32383496,1
0.09512689,0.7660684,1
0.09198841,0.56408834,1
0.10632085,0.27057937,1
0.09296875,0.8118323,1
0.09853841,0.58413607,1
0.09915727,0.608857,1
0.09174621,0.84393215,1
0.10340248,0.79153454,1
0.099428944,0.5545181,1
0.088972,0.7673476,1
0.09285987,0.72945166,1
0.09891101,0.5788114,1
0.09605706,0.740258,1
0.09009995,0.76415753,1
0.097474225,0.8170649,1
0.09832116,0.84084123,1
0.09956872,0.8382797,1
0.20459908,0.15111089,1
0.101075284,0.8284575,1
0.08775296,0.5033019,1
0.2628057,0.17489134,1
0.089175895,0.7345421,1
0.09368536,0.6721954,1
0.09585766,0.7404622,1
0.09891092,0.77225167,1
0.083534844,0.83372355,1
0.08113165,0.5713576,1
0.1265356,0.3094882,1
0.095298894,0.6956808,1
0.17450063,0.27496305,1
0.114316255,0.8261166,1
0.088947065,0.82706314,1
0.12051595,0.37214625,1
0.07908278,0.76254183,1
0.09642472,0.5428574,1
0.09895641,0.84296453,1
0.08324119,0.71200454,1
0.09700584,0.65363806,1
0.07411418,0.8199438,1
0.10594799,0.82227194,1
0.08091892,0.8314715,1
0.08662004,0.7518556,1
0.102282904,0.41716874,1
0.083210945,0.8118784,1
0.08389756,0.6873218,1
0.096823655,0.69565094,1
0.09373405,0.72235924,1
0.09325234,0.7214256,1
0.09386587,0.7937979,1
0.08391275,0.80125105,1
0.09177292,0.51982194,1
0.08907357,0.764431,1
0.08042803,0.5902555,1
0.09688994,0.76901567,1
0.09867246,0.75021666,1
0.09424401,0.78061455,1
0.098223,0.57689834,1
0.12440785,0.7964479,1
0.10220173,0.39487812,1
0.15480468,0.34989354,1
0.113145605,0.49191242,1
0.10032178,0.75579834,1
0.13509625,0.26637313,1
0.079757065,0.71441483,1
0.096060805,0.83979064,1
0.12881145,0.32093477,1
0.09790742,0.83076054,1
0.09828397,0.77546215,1
0.10341001,0.53069055,1
0.08216174,0.81714654,1
0.092836834,0.6847157,1
0.09961124,0.82923937,1
0.0998456,0.49508002,1
0.10297241,0.60493577,1
0.12786034,0.31813598,1
0.100199945,0.7395461,1
0.11101666,0.42266482,1
0.09496871,0.67945635,1
0.10823091,0.79841113,1
0.10133405,0.48949283,1
0.09393212,0.6979723,1
0.1323693,0.19273433,1
0.0911632,0.73831666,1
0.0916553,0.6759957,1
0.086056545,0.7109043,1
0.09787693,0.8108223,1
0.07830188,0.7903279,1
0.10945674,0.55137146,1
0.10473298,0.7301447,1
0.0939228,0.5401382,1
0.12735239,0.28257605,1
0.12452944,0.36507282,1
0.08003454,0.55315125,1
0.07325162,0.7186972,1
0.07520219,0.7896216,1
0.07789011,0.7313411,1
0.15882559,0.76343143,1
0.106635146,0.6478141,1
0.0939484,0.6454471,1
0.07378554,0.8254946,1
0.10139513,0.5355822,1
0.09075861,0.7289829,1
0.085655905,0.81789225,1
0.08593963,0.7095774,1
0.19639237,0.25978255,1
0.09308144,0.7874439,1
0.111111745,0.6969868,1
0.09194918,0.7230095,1
0.09548052,0.7947458,1
0.09764652,0.64941585,1
0.11270711,0.4009547,1
0.09758675,0.71232355,1
0.09248436,0.7855857,1
0.10220058,0.29080904,1
0.0934992,0.65718675,1
0.097522505,0.8110461,1
0.09637713,0.68449444,1
0.09543975,0.73937494,1
0.11712703,0.34884712,1
0.16871831,0.6959438,1
0.09555711,0.7176029,1
0.0822402,0.64224523,1
0.12845382,0.28157187,1
0.11648612,0.31297103,1
0.09563506,0.38722128,1
0.103391714,0.5304703,1
0.09508735,0.6575944,1
0.09401794,0.68274635,1
0.08956865,0.49530077,1
0.086255096,0.7920521,1
0.08541962,0.7145034,1
0.08034278,0.8470622,1
0.10508366,0.63119394,1
0.08738073,0.7405321,1
0.07857416,0.82608,1
0.09476381,0.77646977,1
0.09851334,0.6211165,1
0.098534025,0.6291009,1
0.098974735,0.7734309,1
0.09017773,0.8144793,1
0.08052984,0.6522905,1
0.076621436,0.71935755,1
0.07664421,0.7648667,1
0.071947254,0.7210813,1
0.08160542,0.55238926,1
0.07886414,0.56822354,1
0.105326705,0.39754373,1
0.13975395,0.23226307,1
0.07859127,0.76613134,1
0.11447309,0.32542816,1
0.08348559,0.8061846,1
0.09719292,0.86139536,1
0.08419193,0.8190803,1
0.087657794,0.7290577,1
0.080858424,0.8297699,1
0.11418905,0.36945474,1
0.077917345,0.6006133,1
0.12812562,0.40548214,1
0.11032923,0.56492406,1
0.12057778,0.7860503,1
0.086636566,0.8367169,1
0.08010904,0.8382205,1
0.110006936,0.5802182,1
0.0759507,0.7905363,1
0.12259937,0.23167467,1
0.111279495,0.2308989,1
0.158494,0.20044881,1
0.12558776,0.29609415,1
0.13084263,0.25406384,1
0.1014348,0.3310456,1
0.26466528,0.4629076,1
0.11284133,0.49010387,1
0.13322687,0.27506664,1
0.119128175,0.3521154,1
0.11102301,0.45423576,1
0.15008865,0.29212475,1
0.10312191,0.34914657,1
0.07710608,0.5586005,1
0.10314965,0.5781003,1
0.13231108,0.258027,1
0.11654113,0.31732458,1
0.13023502,0.55424017,1
0.14110449,0.22684488,1
0.09484641,0.8134096,1
0.11837208,0.2324804,1
0.09910762,0.8153265,1
0.09698983,0.77568007,1
0.0901668,0.59311366,1
0.09293221,0.54598796,1
0.09979878,0.7690947,1
0.08438073,0.66202366,1
0.17347549,0.56193614,1
0.07518681,0.8090685,1
0.09879374,0.80325764,1
0.084698126,0.8343206,1
0.10712005,0.79101294,1
0.08682927,0.8393871,1
0.10365762,0.70675826,1
0.084665164,0.70272696,1
0.08087279,0.6822696,1
0.09150587,0.80762464,1
0.09950457,0.72492677,1
0.09831017,0.7958112,1
0.103384316,0.7271589,1
0.10155221,0.76157814,1
0.09867383,0.6834596,1
0.10200369,0.8167993,1
0.12557383,0.29374322,1
0.13170905,0.21561523,1
0.13320994,0.25180978,1
0.1307295,0.25379604,1
0.1343916,0.27530906,1
0.11810273,0.36581355,1
0.13001256,0.28012648,1
0.15772355,0.22027917,1
0.09783357,0.4048191,1
0.09938751,0.3942798,1
0.10698224,0.28477788,1
0.09183916,0.81581885,1
0.08094331,0.7152327,1
0.10358255,0.49967417,1
0.09555469,0.7766216,1
0.23025855,0.21734866,1
0.09186064,0.7312927,1
0.1294403,0.30438766,1
0.08654247,0.7227774,1
0.089775555,0.8291874,1
0.09138821,0.7025317,1
0.088970214,0.7657392,1
0.095337704,0.36925837,1
0.15329503,0.23151627,1
0.17558567,0.19536772,1
0.1398611,0.23630777,1
0.12793048,0.2680505,1
0.14091562,0.23785011,1
0.09053837,0.43603495,1
0.17614919,0.18034764,1
0.13141796,0.2823454,1
0.16337565,0.22646663,1
0.10317172,0.3673926,1
0.10734172,0.40740567,1
0.100478746,0.54624414,1
0.09527151,0.7550736,1
0.10784939,0.39869264,1
0.11653633,0.416266,1
0.087813705,0.47688589,1
0.15691328,0.19330521,1
0.10175,0.4989151,1
0.116020106,0.31544018,1
0.17763329,0.1803651,1
0.115030095,0.33431065,1
0.16005898,0.1831777,1
0.13045998,0.19545268,1
0.08479708,0.7572648,1
0.098762244,0.44746232,1
0.084873825,0.77648157,1
0.08246942,0.53508025,1
0.09852033,0.39627188,1
0.10304693,0.52420413,1
0.0972762,0.37730587,1
0.14051947,0.2622213,1
0.13876414,0.2548316,1
0.09791003,0.3485946,1
0.12033933,0.24800499,1
0.09191068,0.413488,1
0.087312154,0.48872927,1
0.105390735,0.48817298,1
0.09406385,0.51231384,1
0.08729322,0.49701652,1
0.09432763,0.4512449,1
0.10929163,0.44529212,1
0.1076638,0.54378885,1
0.09661611,0.6668023,1
0.10867696,0.58684707,1
0.10027891,0.6478324,1
0.10247861,0.5034273,1
0.08925014,0.46219316,1
0.103534766,0.76585686,1
0.09399418,0.6827111,1
0.075340815,0.5832517,1
0.09407561,0.7575919,1
0.08962392,0.48105812,1
0.13570796,0.27478606,1
0.15701383,0.22120667,1
0.17469774,0.18366067,1
0.15171956,0.21687898,1
0.11409984,0.3337172,1
0.12835039,0.24771053,1
0.16420777,0.2030514,1
0.14201409,0.23220482,1
0.12384115,0.30976242,1
0.18305841,0.19078505,1
0.14572887,0.23103543,1
0.12016686,0.3066119,1
0.09709544,0.7087267,1
0.073594645,0.8059619,1
0.09547308,0.57472485,1
0.09165288,0.7216703,1
0.08694617,0.79376465,1
0.080367826,0.59163326,1
0.122347735,0.45771497,1
0.11850226,0.5167168,1
0.12822562,0.29005393,1
0.09743624,0.7866886,1
0.09492944,0.78330874,1
0.08132177,0.66810346,1
0.082072,0.5924779,1
0.087525986,0.7999138,1
0.0926336,0.4834059,1
0.123107515,0.2174003,1
0.088401824,0.74595255,1
0.120818205,0.31489083,1
0.1489104,0.24183628,1
0.11453914,0.41498145,1
0.08128853,0.50448626,1
0.07997179,0.5553033,1
0.11071414,0.5177262,1
0.08741203,0.44924226,1
0.13786453,0.2917114,1
0.14764403,0.29620862,1
0.089830786,0.4088681,1
0.08630528,0.4909828,1
0.07979309,0.78109115,1
0.09224547,0.79158497,1
0.10038256,0.5834697,1
0.101039335,0.67219955,1
0.09931281,0.6032415,1
0.10234886,0.7353674,1
0.09656182,0.67311347,1
0.11781443,0.63460284,1
0.1306563,0.5976181,1
0.09539125,0.8491479,1
0.07705227,0.8305342,1
0.08749385,0.8494493,1
0.089154206,0.8497069,1
0.085633874,0.80801886,1
0.09652576,0.8452771,1
0.112819545,0.82493657,1
0.094061285,0.8306319,1
0.08651156,0.8419379,1
0.09325352,0.84933126,1
0.08651126,0.8365972,1
0.09246213,0.84832585,1
0.09823978,0.8545763,1
0.088642664,0.8475318,1
0.093579344,0.75426394,1
0.09584344,0.83011955,1
0.09849195,0.83763254,1
0.08029732,0.83797467,1
0.08550535,0.7306669,1
0.09493558,0.848344,1
0.11489305,0.43528572,1
0.12905791,0.33570892,1
0.0964002,0.6870161,1
0.083420396,0.6148215,1
0.094436914,0.60974884,1
0.11201555,0.44521758,1
0.09812806,0.80332893,1
0.09328302,0.8470026,1
0.07382243,0.8072464,1
0.098694056,0.8160154,1
0.08102345,0.7722549,1
0.08925265,0.8125269,1
0.08612872,0.7678609,1
0.09310851,0.83630246,1
0.078061566,0.8206553,1
0.097205535,0.80693996,1
0.15738022,0.2340631,1
0.09369465,0.7279489,1
0.09787279,0.6019458,1
0.10338516,0.57004416,1
0.09831857,0.68306285,1
0.099659294,0.7735364,1
0.09357271,0.71785116,1
0.09085491,0.55784744,1
0.09404834,0.74796665,1
0.102882765,0.7455169,1
0.111754365,0.39521474,1
0.094653636,0.81778073,1
0.08740271,0.6164688,1
0.09399959,0.7563541,1
0.11921351,0.76879174,1
0.091934614,0.7246384,1
0.094924204,0.64401823,1
0.08030213,0.75007015,1
0.077054486,0.54027116,1
0.15210687,0.24631864,1
0.08810234,0.68582034,1
0.083090305,0.7832849,1
0.094385654,0.6929496,1
0.21973075,0.15213834,1
0.10578488,0.46138284,1
0.22159353,0.71064526,1
0.0990991,0.51595455,1
0.09011677,0.69306684,1
0.07525511,0.7723733,1
0.08484683,0.41309583,1
0.081409,0.5444278,1
0.09046814,0.52827084,1
0.11123857,0.38539642,1
0.1172813,0.75398076,1
0.110200666,0.5236928,1
0.1001944,0.48121333,1
0.07732145,0.77508634,1
0.10551778,0.495841,1
0.08639533,0.5452199,1
0.0935027,0.81367946,1
0.099176906,0.7131416,1
0.081191696,0.8360651,1
0.23884317,0.21492562,1
0.11557761,0.47927168,1
0.110984586,0.56909126,1
0.08826037,0.682247,1
0.080406286,0.6620483,1
0.108377375,0.32140648,1
0.094188586,0.7946557,1
0.10145944,0.80427897,1
0.105563186,0.5591946,1
0.09266922,0.84174865,1
0.08116968,0.6267917,1
0.09445528,0.82489693,1
0.09133362,0.81930417,1
0.09493183,0.68459535,1
0.096731335,0.8039939,1
0.09211078,0.7451018,1
0.09717468,0.4153375,1
0.096990466,0.62431437,1
0.11001358,0.58231914,1
0.08864679,0.8062765,1
0.11737903,0.33097845,1
0.096401095,0.84694344,1
0.15927455,0.17028327,1
0.09800126,0.8366693,1
0.088058785,0.82521516,1
0.11147018,0.45065436,1
0.076293156,0.73949164,1
0.076867744,0.78896874,1
0.10627998,0.52356875,1
0.10229304,0.28756434,1
0.08931585,0.80218714,1
0.10477768,0.78521246,1
0.08210092,0.8095422,1
0.09193203,0.8430103,1
0.1263909,0.38060224,1
0.082440205,0.49601513,1
0.08487481,0.78054225,1
0.09878525,0.62317276,1
0.09092198,0.7432949,1
0.08383108,0.67461866,1
0.10241196,0.81936276,1
0.1316027,0.28266367,1
0.10075816,0.7915035,1
0.10547183,0.36660415,1
0.09045268,0.48787493,1
0.09765892,0.75195414,1
0.15036573,0.2964524,1
0.09766665,0.8407028,1
0.09733668,0.3658777,1
0.09185781,0.6685295,1
0.103733644,0.4371091,1
0.12766927,0.35572317,1
0.092806704,0.85172904,1
0.09805343,0.7012446,1
0.096156046,0.82489735,1
0.08728143,0.59177756,1
0.099647954,0.41159177,1
0.106814906,0.38275966,1
0.11091302,0.7006088,1
0.10087167,0.75305283,1
0.084275946,0.6813595,1
0.08759677,0.6121435,1
0.092785634,0.5922607,1
0.097081915,0.5507263,1
0.08775131,0.8284856,1
0.07672402,0.80935013,1
0.10323588,0.69872844,1
0.08456855,0.84546584,1
0.088099286,0.55018026,1
0.117253564,0.5984498,1
0.09748928,0.60271484,1
0.12953761,0.31152615,1
0.09884716,0.3594723,1
0.098298766,0.8047507,1
0.104150005,0.55514985,1
0.10795526,0.3291265,1
0.10087924,0.6558993,1
0.099745885,0.7527537,1
0.11498621,0.33438748,1
0.08691749,0.7719057,1
0.09570304,0.72161585,1
0.100152634,0.79859716,1
0.09644104,0.649684,1
0.09549155,0.79797685,1
0.18157999,0.22083648,1
0.09132151,0.79481196,1
0.09209851,0.7560315,1
0.17662285,0.29047707,1
0.08684435,0.82782376,1
0.09435274,0.8354455,1
0.0995706,0.693931,1
0.07970587,0.625212,1
0.09248147,0.7539196,1
0.08887678,0.6007613,1
0.097169906,0.7987797,1
0.099610195,0.52717584,1
0.10447929,0.49774736,1
0.10156622,0.51191485,1
0.097016655,0.64441544,1
0.09182639,0.7880071,1
0.16594884,0.7719107,1
0.22523361,0.678069,1
0.104816556,0.5643937,1
0.09624779,0.7844762,1
0.20589879,0.20902109,1
0.088934794,0.8388299,1
0.074842654,0.7638274,1
0.099418804,0.5907241,1
0.09856086,0.407041,1
0.08531544,0.68377393,1
0.103145726,0.70884013,1
0.08189902,0.81437355,1
0.10284585,0.76811,1
0.099998504,0.57396287,1
0.076605044,0.7191136,1
0.13157745,0.36406782,1
0.0968725,0.71471536,1
0.13934532,0.250105,1
0.07801047,0.66431963,1
0.09765589,0.7028406,1
0.10682301,0.4315527,1
0.09299514,0.79254806,1
0.16056699,0.20013516,1
0.08015147,0.7976904,1
0.13802591,0.35584092,1
0.09877444,0.43264073,1
