{
    "dimensionality_reduction_methods": "['PCA', 'TSVD']",
    "proportions": "[0.5, 0.5]",
    "dataset": "fmnist",
    "number_of_classes": "2",
    "number_of_points": "10000",
    "number_of_Tsamples": "2000",
    "number_ofVsamples": "1000",
    "loss": "0.000541049987077713",
    "trustworthiness": "0.8908364217481864",
    "continuity": "0.9590808015513897",
    "neighborhood_hit": "0.9315714285714287"
}