{
    "dimensionality_reduction_methods": "['PCA', 'TSVD', 'ISOMAP', 'LLE', 'UMAP']",
    "proportions": "[0.5, 0.5, 0, 0, 0]",
    "dataset": "nmnist",
    "number_of_classes": "2",
    "number_of_points": "10000",
    "number_of_Tsamples": "5000",
    "number_ofVsamples": "1000",
    "loss": "0.00023492876789532602",
    "trustworthiness": "0.8862547400105041",
    "continuity": "0.9533105594528618",
    "neighborhood_hit": "0.9956095913542721"
}