{
    "dimensionality_reduction_methods": "['PCA', 'UMAP', 'TSVD']",
    "proportions": "[0, 1, 0]",
    "dataset": "nmnist",
    "number_of_classes": "2",
    "number_of_points": "10000",
    "number_of_Tsamples": "2000",
    "number_ofVsamples": "1000",
    "loss": "0.002178989117965102",
    "trustworthiness": "0.9184893154737828",
    "continuity": "0.9670123198539184",
    "neighborhood_hit": "0.9994596420128337"
}