PC1,PC2,label
0.58102405,0.4834633,0
0.60665834,0.384495,0
0.44825038,0.41821244,0
0.47639722,0.40778917,0
0.8243477,0.2674072,0
0.7031102,0.29127973,0
0.4495231,0.48316577,0
0.83980626,0.32167915,0
0.58566856,0.34242007,0
0.8313239,0.31581932,0
0.51330763,0.40801194,0
0.5796969,0.3372741,0
0.82364255,0.3337846,0
0.6649444,0.30410084,0
0.65096295,0.33148065,0
0.7928833,0.29889083,0
0.8569328,0.3471945,0
0.49625775,0.38614154,0
0.8308688,0.27286315,0
0.7357741,0.28761002,0
0.6277417,0.28275922,0
0.7931933,0.3173981,0
0.7243931,0.3426438,0
0.76499194,0.3161104,0
0.7946501,0.3199145,0
0.6320997,0.3872786,0
0.5552925,0.40821669,0
0.63242084,0.34901008,0
0.8472059,0.28424183,0
0.725722,0.28076202,0
0.40489554,0.37642008,0
0.8365191,0.31460845,0
0.835214,0.28555804,0
0.8434712,0.31073382,0
0.81111234,0.27884483,0
0.61463505,0.33636764,0
0.8311826,0.29735637,0
0.7401455,0.26441178,0
0.5452863,0.39507,0
0.53892344,0.3752285,0
0.6357722,0.30847454,0
0.51464623,0.43719968,0
0.80931413,0.27911422,0
0.5734069,0.34742263,0
0.75618917,0.31341988,0
0.5233775,0.33402526,0
0.7495878,0.26601142,0
0.594983,0.38918877,0
0.7813905,0.30688348,0
0.850087,0.30629405,0
0.8407127,0.32565826,0
0.5276444,0.33963037,0
0.8306913,0.31761593,0
0.8302062,0.275472,0
0.62829494,0.30739444,0
0.48296204,0.43645394,0
0.7287398,0.25347283,0
0.62582564,0.41216233,0
0.7139865,0.27987838,0
0.6288732,0.31877568,0
0.45618564,0.38105652,0
0.6162586,0.36171937,0
0.6113653,0.4179645,0
0.71693504,0.26597533,0
0.8126433,0.26598224,0
0.6248571,0.3133138,0
0.6763277,0.33008146,0
0.5003423,0.3585189,0
0.6942923,0.3197682,0
0.7190523,0.35443997,0
0.55817646,0.38001883,0
0.7358669,0.3310275,0
0.5114734,0.37171277,0
0.54271793,0.31878987,0
0.59557986,0.36703372,0
0.5776307,0.33728313,0
0.61189866,0.28357887,0
0.70278645,0.33299026,0
0.6413208,0.27941862,0
0.66891295,0.28268424,0
0.70103276,0.30722028,0
0.55247813,0.32583502,0
0.45905644,0.44414786,0
0.6250911,0.36797455,0
0.64988935,0.3339475,0
0.57639813,0.3242821,0
0.42832842,0.5185684,0
0.458952,0.4068161,0
0.46520138,0.39914277,0
0.8125965,0.34787837,0
0.71530426,0.39275506,0
0.68892336,0.3113435,0
0.6642592,0.3363165,0
0.5759915,0.43723387,0
0.5194963,0.3453086,0
0.75593275,0.2999815,0
0.5739448,0.33840016,0
0.7153473,0.2894403,0
0.5839072,0.36699948,0
0.61984706,0.3720635,0
0.43530446,0.37216687,0
0.47521946,0.40376738,0
0.71279573,0.27804628,0
0.5593186,0.3392455,0
0.60503525,0.39889035,0
0.70435345,0.2625531,0
0.59019023,0.35361877,0
0.6701161,0.3272537,0
0.63384247,0.3387073,0
0.52609676,0.41193855,0
0.5374554,0.4240977,0
0.7522806,0.26445252,0
0.61041987,0.32308793,0
0.7131015,0.33446634,0
0.82680726,0.2684322,0
0.57883155,0.3304104,0
0.5339955,0.43235096,0
0.57227844,0.38523757,0
0.6221727,0.337068,0
0.73851293,0.31783298,0
0.8101008,0.28648725,0
0.8018958,0.30784404,0
0.60540277,0.34374598,0
0.73411477,0.288051,0
0.63382953,0.36893922,0
0.75367135,0.30625266,0
0.5961924,0.34581903,0
0.59702814,0.34691367,0
0.6499993,0.31257117,0
0.5824933,0.35892782,0
0.48743334,0.3495255,0
0.5741889,0.3224457,0
0.54656386,0.36998716,0
0.5544924,0.3513217,0
0.5201491,0.36901212,0
0.6967181,0.30496576,0
0.5527625,0.3140622,0
0.45516673,0.40937692,0
0.5679505,0.31104866,0
0.46590975,0.39087343,0
0.43784064,0.36067852,0
0.5519495,0.46067652,0
0.5939895,0.2966103,0
0.8474507,0.32283583,0
0.80937135,0.33864558,0
0.622545,0.3339212,0
0.7171589,0.29160488,0
0.45257863,0.3821628,0
0.4430589,0.37026912,0
0.70178527,0.2858962,0
0.5854163,0.40360793,0
0.56908154,0.39872003,0
0.5118121,0.4331042,0
0.6184593,0.32921115,0
0.55287474,0.33560374,0
0.6507304,0.37488326,0
0.6537966,0.4443288,0
0.62019986,0.3506729,0
0.5119152,0.3219345,0
0.60922396,0.35800034,0
0.6084301,0.33738986,0
0.68437004,0.28721803,0
0.486117,0.3593789,0
0.555727,0.32350725,0
0.62332743,0.3789865,0
0.5535687,0.37257266,0
0.5592748,0.3198713,0
0.6518692,0.39249212,0
0.4999826,0.44862667,0
0.6492648,0.31014225,0
0.57098454,0.31386653,0
0.44700623,0.4024422,0
0.6662073,0.39066228,0
0.6579287,0.31415722,0
0.50721914,0.4059323,0
0.6919228,0.30571514,0
0.56842846,0.35970283,0
0.64349794,0.38163,0
0.3553433,0.4092535,0
0.4655623,0.37219667,0
0.5876077,0.3109753,0
0.58104175,0.34203014,0
0.6033764,0.41911837,0
0.5023281,0.42352164,0
0.78170687,0.2922651,0
0.7353429,0.30901703,0
0.55232733,0.37230533,0
0.46002918,0.39848948,0
0.5621217,0.45952588,0
0.5543194,0.31894433,0
0.73846895,0.2987525,0
0.73312175,0.36237767,0
0.6839685,0.35996157,0
0.7481759,0.27120233,0
0.53728014,0.343026,0
0.7390864,0.26087266,0
0.6518892,0.35159534,0
0.66916645,0.33563486,0
0.62852997,0.36672968,0
0.5849867,0.34132007,0
0.49432895,0.3996333,0
0.6961029,0.3084291,0
0.7501935,0.35384557,0
0.47432953,0.4316293,0
0.62113905,0.3183121,0
0.5724852,0.3721331,0
0.7771749,0.40622255,0
0.5600896,0.3956501,0
0.5826794,0.38127756,0
0.49560195,0.3428484,0
0.5697822,0.3496546,0
0.79235834,0.34304786,0
0.7445873,0.36066312,0
0.67942834,0.3355904,0
0.47234797,0.39727423,0
0.6358793,0.31847572,0
0.5879774,0.35275552,0
0.44197366,0.40536982,0
0.85352546,0.27022928,0
0.5035401,0.33070764,0
0.7614541,0.31142104,0
0.5093485,0.34209937,0
0.6836979,0.30320218,0
0.44882426,0.43790922,0
0.8188163,0.30553883,0
0.6646614,0.28583294,0
0.71828157,0.25544262,0
0.6894171,0.29680187,0
0.6026412,0.2965208,0
0.46292457,0.4040556,0
0.7121009,0.2435125,0
0.7200444,0.29521668,0
0.6980799,0.3769175,0
0.8035922,0.29115942,0
0.6573933,0.272847,0
0.83671063,0.274134,0
0.8079925,0.25300804,0
0.59802765,0.42369464,0
0.5727136,0.42193612,0
0.628261,0.3399001,0
0.4645319,0.40317112,0
0.59240156,0.29092965,0
0.68274003,0.28436863,0
0.42512754,0.38596338,0
0.7090185,0.3218536,0
0.6510205,0.35225284,0
0.7923949,0.3057085,0
0.7121015,0.34085634,0
0.78235763,0.29553902,0
0.8207878,0.2666275,0
0.55743617,0.35698733,0
0.61605823,0.3892265,0
0.5589277,0.31314877,0
0.521029,0.3762023,0
0.55525243,0.35550854,0
0.68659776,0.4156018,0
0.5473423,0.3114386,0
0.57712966,0.35639966,0
0.65488535,0.31925058,0
0.56657,0.39300883,0
0.5761027,0.3937765,0
0.5438162,0.36969674,0
0.6611365,0.27634057,0
0.6767675,0.29289538,0
0.4858443,0.38047847,0
0.5816848,0.42428714,0
0.44529945,0.3700666,0
0.7332162,0.34404564,0
0.6199373,0.31975064,0
0.5084046,0.34853446,0
0.7090255,0.26647684,0
0.4296005,0.41006228,0
0.6226102,0.3285083,0
0.50091773,0.38085625,0
0.6927402,0.27871755,0
0.62258315,0.30099463,0
0.69088566,0.300627,0
0.6112384,0.35677418,0
0.61816037,0.3253776,0
0.512121,0.4913913,0
0.49683118,0.3871945,0
0.6686431,0.31464732,0
0.62614495,0.33117965,0
0.65988785,0.3059775,0
0.5670183,0.3090261,0
0.6642774,0.30579993,0
0.55183816,0.3244718,0
0.6271823,0.3543544,0
0.64663047,0.32850924,0
0.63969463,0.3051378,0
0.77002865,0.39038664,0
0.55754465,0.39424977,0
0.7917814,0.35058257,0
0.74560946,0.35867965,0
0.6373175,0.28115124,0
0.75213027,0.39947852,0
0.5504238,0.346735,0
0.56184757,0.3530405,0
0.53648823,0.31460053,0
0.48207888,0.4270656,0
0.5607336,0.37454587,0
0.5672722,0.4643174,0
0.5875471,0.33953393,0
0.6569657,0.34596986,0
0.7253912,0.28436038,0
0.7271595,0.34232423,0
0.6951535,0.29450065,0
0.75859797,0.3021105,0
0.8326127,0.33069697,0
0.7509659,0.2676441,0
0.64866143,0.3599966,0
0.5606924,0.40931472,0
0.73714626,0.37841073,0
0.5481926,0.39297545,0
0.7029433,0.43528244,0
0.7478645,0.36753508,0
0.62185395,0.4230476,0
0.7356024,0.3352461,0
0.7537569,0.31250995,0
0.65945476,0.43539032,0
0.6615997,0.39396206,0
0.5444471,0.40675527,0
0.7938061,0.37434283,0
0.6786976,0.3052713,0
0.6278267,0.3370981,0
0.75538784,0.30575353,0
0.54429233,0.32406345,0
0.59365624,0.30832243,0
0.6334669,0.35419774,0
0.6375734,0.4392584,0
0.6779897,0.33132994,0
0.59003234,0.28405973,0
0.6123666,0.3409441,0
0.5999432,0.33876088,0
0.6534275,0.3429051,0
0.72837114,0.31816065,0
0.7307463,0.326314,0
0.69333816,0.34915856,0
0.6852294,0.33486152,0
0.6520535,0.35991934,0
0.602553,0.32446957,0
0.6560964,0.37480044,0
0.6657829,0.29154828,0
0.532071,0.38425806,0
0.67984045,0.34072948,0
0.5913547,0.36144766,0
0.5637062,0.32505506,0
0.6276369,0.35358855,0
0.71557957,0.3326464,0
0.7383972,0.25510576,0
0.4964757,0.3873912,0
0.7255509,0.26395565,0
0.7798609,0.25769082,0
0.7167119,0.28513134,0
0.6087617,0.30346054,0
0.7517173,0.2565252,0
0.66133875,0.34827712,0
0.6464545,0.3141305,0
0.65624285,0.2912007,0
0.78852814,0.36784378,0
0.7745304,0.30297825,0
0.61456454,0.31901276,0
0.69871944,0.3173071,0
0.7125102,0.31577235,0
0.56641316,0.37492824,0
0.60579497,0.3563856,0
0.7123949,0.2779249,0
0.6001004,0.28265274,0
0.50590885,0.43036732,0
0.5306063,0.33220774,0
0.6242607,0.3876163,0
0.57467055,0.3990618,0
0.6141346,0.3544125,0
0.65194637,0.2716164,0
0.6584941,0.35239086,0
0.2893803,0.46564206,0
0.66757166,0.33222857,0
0.6716597,0.30826816,0
0.68149537,0.36870825,0
0.55233455,0.40321863,0
0.5838635,0.38887632,0
0.66723543,0.3376509,0
0.5902486,0.33600226,0
0.55227804,0.3850789,0
0.5421418,0.33744535,0
0.6705245,0.2874927,0
0.63506985,0.3721269,0
0.7070552,0.26856238,0
0.6274572,0.31359184,0
0.7712506,0.26662403,0
0.7020024,0.28259975,0
0.64328945,0.38262054,0
0.560483,0.33317363,0
0.44742918,0.4254826,0
0.8138058,0.26157847,0
0.6555839,0.30434293,0
0.6757479,0.33848453,0
0.7782202,0.27029803,0
0.78729606,0.31666687,0
0.69746065,0.2955176,0
0.7931737,0.27682313,0
0.8058189,0.25657383,0
0.7884079,0.26421842,0
0.72532296,0.30504927,0
0.7972428,0.28982455,0
0.8188085,0.2723385,0
0.75505835,0.27402744,0
0.7745855,0.28222272,0
0.770886,0.26454523,0
0.81507134,0.32718498,0
0.80823815,0.3351101,0
0.82598203,0.33248726,0
0.6640159,0.30341044,0
0.80435157,0.33412635,0
0.7825142,0.27526137,0
0.71811146,0.26347286,0
0.74662894,0.29248244,0
0.7645902,0.26932785,0
0.75804406,0.24659473,0
0.6585155,0.27547917,0
0.71202964,0.26322263,0
0.75636834,0.30856198,0
0.75326097,0.2521197,0
0.68185145,0.31178114,0
0.6625947,0.34465486,0
0.8090227,0.26174384,0
0.73957366,0.2739266,0
0.72425234,0.30564585,0
0.7205027,0.28526878,0
0.6473829,0.35271326,0
0.5042218,0.35290527,0
0.69555247,0.3991177,0
0.587033,0.41296804,0
0.78849345,0.42319524,0
0.7524596,0.2654045,0
0.70939136,0.39324412,0
0.72397846,0.30537918,0
0.7457634,0.3327107,0
0.7691438,0.35637474,0
0.70321286,0.31947294,0
0.6981822,0.32898906,0
0.62122595,0.38594356,0
0.6917417,0.34905732,0
0.65966266,0.34230804,0
0.63534486,0.33264852,0
0.69843477,0.37352836,0
0.7513038,0.332688,0
0.72485614,0.29664496,0
0.6313289,0.37493664,0
0.7949635,0.30227196,0
0.80116403,0.3295112,0
0.6294908,0.39569047,0
0.5568569,0.36940894,0
0.6676242,0.32561338,0
0.52403456,0.48926336,0
0.6186446,0.3718766,0
0.7538258,0.29334298,0
0.74419475,0.28896493,0
0.69558483,0.31901407,0
0.73036575,0.24937183,0
0.7688697,0.28406236,0
0.76243734,0.27339256,0
0.8194047,0.3812628,0
0.742062,0.29991615,0
0.72402894,0.398195,0
0.71183103,0.3085674,0
0.6897558,0.3085354,0
0.7708282,0.36231583,0
0.459049,0.39151242,0
0.4917854,0.3501594,0
0.54071486,0.3413773,0
0.58829343,0.3130498,0
0.8555136,0.31054145,0
0.47352913,0.37858495,0
0.4724571,0.33320254,0
0.56068814,0.4127347,0
0.6133898,0.40503615,0
0.6607728,0.37734395,0
0.68089384,0.33702686,0
0.68321013,0.27092844,0
0.68573695,0.31768155,0
0.5128447,0.3867222,0
0.56830645,0.39315698,0
0.79570276,0.34445247,0
0.70760185,0.4321204,0
0.41252336,0.42703873,0
0.5592254,0.29432237,0
0.6887173,0.26257262,0
0.61990166,0.34663698,0
0.734454,0.31430689,0
0.60414255,0.31618375,0
0.57245415,0.29707378,0
0.5386089,0.42097124,0
0.61254996,0.3227222,0
0.61683,0.4243469,0
0.54545313,0.37826592,0
0.4878184,0.38855708,0
0.6116975,0.47140387,0
0.6171153,0.31729332,0
0.67990667,0.34033084,0
0.59390074,0.35708755,0
0.51878357,0.3904027,0
0.69114196,0.35006425,0
0.6933424,0.3197829,0
0.60154694,0.38943955,0
0.6755658,0.29852876,0
0.60948646,0.3388012,0
0.5216156,0.38775846,0
0.61726886,0.35876942,0
0.648535,0.38458875,0
0.61807895,0.30451027,0
0.48643914,0.41113654,0
0.65206677,0.3618998,0
0.7361706,0.31260175,0
0.6187573,0.39019743,0
0.7783653,0.3652817,0
0.5611217,0.46041948,0
0.7696842,0.34081835,0
0.69138545,0.33914223,0
0.7964278,0.32952228,0
0.7311818,0.3176014,0
0.5666204,0.35986224,0
0.6797591,0.2627492,0
0.6318695,0.3862948,0
0.54022914,0.32578406,0
0.55211556,0.40569362,0
0.80132145,0.3958129,0
0.61205626,0.32332918,0
0.6148065,0.4488088,0
0.5918183,0.36921465,0
0.6815275,0.2718873,0
0.5387349,0.3919089,0
0.5943076,0.36866316,0
0.60302955,0.34475648,0
0.6746829,0.30852947,0
0.55907863,0.4531323,0
0.6395347,0.3097977,0
0.7105316,0.3294518,0
0.6304258,0.33058083,0
0.58332676,0.36401135,0
0.7681795,0.26090732,0
0.7141662,0.26969856,0
0.6073612,0.38099745,0
0.5964987,0.30051854,0
0.7360718,0.26578704,0
0.73245454,0.2978973,0
0.73276216,0.37879342,0
0.64883995,0.34329808,0
0.67379487,0.30020818,0
0.5858547,0.31076148,0
0.62859136,0.32871208,0
0.59066975,0.33890215,0
0.5775403,0.36523247,0
0.67061865,0.3330618,0
0.6019149,0.3984773,0
0.62502956,0.33631003,0
0.7254265,0.3432992,0
0.684786,0.29026502,0
0.678263,0.32394913,0
0.73174834,0.2912553,0
0.6230935,0.31875902,0
0.74380904,0.3132331,0
0.54909223,0.35152635,0
0.5382211,0.3432534,0
0.71586,0.29748717,0
0.7453784,0.3574268,0
0.6873074,0.30213672,0
0.70153177,0.28375912,0
0.6911729,0.29635102,0
0.6502401,0.29897937,0
0.6009414,0.33681816,0
0.7090771,0.28067473,0
0.36728388,0.44756114,0
0.5465185,0.39581236,0
0.82940984,0.3029015,0
0.6410336,0.35004202,0
0.7801012,0.34529844,0
0.62891835,0.31036425,0
0.77607465,0.295287,0
0.56988794,0.3425635,0
0.5072615,0.38596195,0
0.4767638,0.40622273,0
0.707182,0.36248434,0
0.6367413,0.34166646,0
0.63361317,0.34439427,0
0.6456988,0.33701423,0
0.47246736,0.41022506,0
0.596774,0.3421484,0
0.6040552,0.3230064,0
0.52526474,0.3965055,0
0.64805055,0.474771,0
0.5432907,0.41421404,0
0.5564102,0.3180777,0
0.5953615,0.32123893,0
0.54185927,0.38750908,0
0.5710436,0.3411114,0
0.5676299,0.3471379,0
0.6488945,0.3024546,0
0.71369416,0.31009135,0
0.74738467,0.28962794,0
0.7880899,0.31290784,0
0.66652644,0.26342297,0
0.71537983,0.2383876,0
0.7044091,0.29006156,0
0.5046083,0.41258755,0
0.77140534,0.28960833,0
0.55011624,0.4575979,0
0.79624355,0.2882342,0
0.60185844,0.36376017,0
0.5751725,0.35365355,0
0.6644397,0.34814999,0
0.66528016,0.3512039,0
0.66742206,0.2832488,0
0.72208756,0.30859292,0
0.5899107,0.28780434,0
0.5222739,0.36122298,0
0.569471,0.3581757,0
0.77620107,0.26913148,0
0.5269628,0.36421978,0
0.61047417,0.39908755,0
0.50705576,0.42859006,0
0.7086714,0.28980058,0
0.70001155,0.3668681,0
0.58442384,0.30851215,0
0.55620146,0.30701813,0
0.65614545,0.3530979,0
0.6227303,0.3581813,0
0.61759543,0.36450657,0
0.6295798,0.3588525,0
0.68462086,0.3508373,0
0.57909507,0.38619316,0
0.7089544,0.2959713,0
0.626255,0.44977596,0
0.60813147,0.32586557,0
0.61979866,0.3476567,0
0.6213193,0.30172613,0
0.6003203,0.33641458,0
0.5735093,0.38769716,0
0.5628518,0.35360703,0
0.5500275,0.37311405,0
0.69301164,0.3331562,0
0.5547062,0.4127404,0
0.5994063,0.3605617,0
0.5538011,0.36956552,0
0.52082485,0.38062984,0
0.7957171,0.28511062,0
0.6255076,0.34713072,0
0.56832373,0.33989918,0
0.5194001,0.3301562,0
0.7472659,0.32632723,0
0.6731939,0.3024775,0
0.63704884,0.3243212,0
0.78145576,0.26836428,0
0.5613983,0.32130387,0
0.72349477,0.35328445,0
0.52115166,0.39396897,0
0.7563447,0.30780128,0
0.50043005,0.40112358,0
0.67087907,0.32698023,0
0.53670424,0.35164404,0
0.79797196,0.2816196,0
0.42848647,0.42097953,0
0.48293045,0.34494776,0
0.84928524,0.2907167,0
0.5213945,0.3628663,0
0.54088175,0.36619568,0
0.6088503,0.35731828,0
0.66535574,0.32388014,0
0.61809486,0.2886382,0
0.6542444,0.33856556,0
0.7092657,0.3192056,0
0.57234865,0.4356739,0
0.76537085,0.32464498,0
0.79001415,0.28916335,0
0.5993468,0.28990355,0
0.6412592,0.39345992,0
0.7785949,0.3131588,0
0.7210604,0.28675294,0
0.56800276,0.31764656,0
0.5282819,0.3088876,0
0.5075201,0.37084278,0
0.772894,0.34138384,0
0.5329683,0.429993,0
0.74429137,0.29502052,0
0.6298709,0.35896116,0
0.5283344,0.35443544,0
0.7126438,0.31835362,0
0.5827819,0.28614292,0
0.58705264,0.37713748,0
0.7198569,0.27549344,0
0.64523554,0.28927258,0
0.6154811,0.2945852,0
0.56713927,0.3642518,0
0.68948716,0.3159496,0
0.57885015,0.39828283,0
0.5716862,0.3293432,0
0.6074091,0.31972083,0
0.73779297,0.2942188,0
0.6269883,0.37286833,0
0.6137322,0.33300045,0
0.74741876,0.33698043,0
0.67701226,0.3843329,0
0.4201623,0.38868207,0
0.45569062,0.37050617,0
0.5614889,0.33924517,0
0.63857186,0.3739364,0
0.5591351,0.3605699,0
0.6957509,0.2984549,0
0.5772066,0.40241107,0
0.607419,0.3742077,0
0.5631817,0.39330083,0
0.6091029,0.32440025,0
0.53505975,0.42078102,0
0.6900823,0.38159916,0
0.5350054,0.3659296,0
0.74634093,0.27130133,0
0.5961058,0.37659654,0
0.60016835,0.3779099,0
0.5295338,0.43503666,0
0.7959578,0.3029919,0
0.62235314,0.3073051,0
0.39380783,0.42102313,0
0.66391873,0.26197112,0
0.74279577,0.3252735,0
0.61179364,0.37573576,0
0.5491975,0.44300193,0
0.65852153,0.36331514,0
0.5119388,0.38003898,0
0.4853824,0.35401794,0
0.46113083,0.45287567,0
0.58012176,0.3408554,0
0.5035567,0.44094583,0
0.6832805,0.312976,0
0.6589622,0.363692,0
0.597813,0.3695749,0
0.63756496,0.3319435,0
0.6317716,0.31107086,0
0.53217703,0.3411983,0
0.6582561,0.28799206,0
0.59663093,0.41390812,0
0.56869805,0.3514881,0
0.72843045,0.39057046,0
0.61668205,0.35615537,0
0.6819337,0.34001932,0
0.58343494,0.3312818,0
0.57736856,0.33225667,0
0.7492437,0.29748586,0
0.82774764,0.2921071,0
0.6179799,0.35183412,0
0.5772997,0.35411572,0
0.6341876,0.37614155,0
0.5058459,0.36428726,0
0.7025699,0.30071524,0
0.59632325,0.36350852,0
0.6990777,0.27929443,0
0.56370324,0.34971368,0
0.6009978,0.3907,0
0.80215424,0.28026244,0
0.56431335,0.35332376,0
0.53006166,0.4452103,0
0.49233902,0.3556544,0
0.5886628,0.35863835,0
0.4946368,0.33234516,0
0.65809023,0.32878795,0
0.46792784,0.36220518,0
0.6297343,0.39216724,0
0.6302323,0.31627864,0
0.64466214,0.29366815,0
0.69818914,0.30847847,0
0.62045926,0.3923316,0
0.31611174,0.4951882,0
0.5975838,0.3151083,0
0.56971246,0.3134166,0
0.67871565,0.31448874,0
0.6415293,0.43103543,0
0.52764916,0.32191184,0
0.5082795,0.4024568,0
0.48239613,0.39584816,0
0.5718672,0.42415988,0
0.53195643,0.41772225,0
0.46506923,0.36248076,0
0.5561857,0.3753794,0
0.7289056,0.26904076,0
0.6528058,0.3176254,0
0.4951083,0.328297,0
0.6779777,0.31481114,0
0.6232749,0.39973116,0
0.69891995,0.29921094,0
0.59649855,0.28293887,0
0.60997856,0.4380363,0
0.55635667,0.42408726,0
0.75039905,0.3792646,0
0.48857483,0.3833903,0
0.77581453,0.26068956,0
0.67497855,0.32723248,0
0.70547056,0.26858696,0
0.6588248,0.32944486,0
0.6852537,0.35003138,0
0.58660156,0.341615,0
0.52441174,0.32363144,0
0.7449955,0.25275877,0
0.4662915,0.40194014,0
0.54780245,0.39874598,0
0.5826283,0.35053545,0
0.71969724,0.26092282,0
0.5723796,0.4114411,0
0.6043729,0.3247373,0
0.78963083,0.2638011,0
0.58846134,0.37538928,0
0.62702465,0.32007992,0
0.72322816,0.32773623,0
0.5221208,0.34743837,0
0.6044782,0.3530097,0
0.5109182,0.33774728,0
0.45921245,0.3943525,0
0.52354145,0.42920852,0
0.52623874,0.4059447,0
0.56338304,0.33297148,0
0.5672805,0.44437236,0
0.517076,0.32734376,0
0.5554563,0.35943094,0
0.6274022,0.46894127,0
0.56657577,0.40390524,0
0.44952786,0.4092875,0
0.3464695,0.43425977,0
0.42201737,0.4136192,0
0.72641265,0.34458643,0
0.48630762,0.3614968,0
0.6627243,0.28189552,0
0.5921097,0.3851096,0
0.5232567,0.38190496,0
0.5821089,0.32690296,0
0.5250827,0.32154977,0
0.5846526,0.35921887,0
0.5360202,0.34264457,0
0.65832794,0.31771064,0
0.635905,0.32011798,0
0.44447252,0.5014041,0
0.6697735,0.3188029,0
0.31800696,0.4935258,0
0.5885134,0.39692703,0
0.5469909,0.39871743,0
0.5331721,0.4793771,0
0.39455575,0.49444923,0
0.77271116,0.27089152,0
0.6217765,0.35789922,0
0.56561404,0.34011227,0
0.67389894,0.28417352,0
0.74181515,0.2894509,0
0.72106624,0.29876992,0
0.61788774,0.32606724,0
0.7622519,0.30963042,0
0.6235124,0.32592723,0
0.67410517,0.27745187,0
0.56579006,0.31823015,0
0.8337762,0.25920236,0
0.6481915,0.30209568,0
0.7696924,0.31375524,0
0.552607,0.40051505,0
0.5789014,0.32561794,0
0.63453144,0.3954099,0
0.5975009,0.30201262,0
0.5137866,0.34720117,0
0.5376995,0.31948802,0
0.506219,0.40692076,0
0.4614339,0.39507306,0
0.65363395,0.3270701,0
0.5801263,0.34582436,0
0.61730057,0.30767328,0
0.60207444,0.2662128,0
0.6895786,0.27200904,0
0.66079366,0.285721,0
0.59828043,0.3441262,0
0.5831802,0.4400317,0
0.6937237,0.29647183,0
0.6003008,0.2874006,0
0.746207,0.2656059,0
0.79316187,0.37123773,0
0.6473832,0.5438819,0
0.5754936,0.36845055,0
0.49704802,0.3663136,0
0.68004906,0.3169669,0
0.5773214,0.3364797,0
0.6671941,0.29835808,0
0.6548094,0.33813787,0
0.5785163,0.3368962,0
0.6411789,0.32237887,0
0.8437899,0.29244092,0
0.69195646,0.28464714,0
0.55954605,0.32006338,0
0.691356,0.39286724,0
0.6703384,0.2653755,0
0.6941362,0.28163758,0
0.6297583,0.35815406,0
0.6635931,0.28239802,0
0.6249764,0.35003555,0
0.5184374,0.358396,0
0.55243784,0.32620656,0
0.69819254,0.32093686,0
0.70508784,0.28977722,0
0.65491056,0.2980876,0
0.38900277,0.36595923,0
0.6675692,0.2938435,0
0.5718,0.32688975,0
0.57113254,0.3475507,0
0.5230868,0.44894207,0
0.68382376,0.30072382,0
0.65765,0.25285012,0
0.36636245,0.42049038,0
0.7535514,0.24596608,0
0.49503252,0.45758983,0
0.6047388,0.32615632,0
0.6292884,0.41613683,0
0.7392734,0.2726071,0
0.5538203,0.34697753,0
0.5349405,0.3416873,0
0.45081943,0.3974869,0
0.595187,0.36657453,0
0.5516506,0.36269575,0
0.49482885,0.37651643,0
0.5188229,0.3881531,0
0.5550448,0.38393325,0
0.5209095,0.37370786,0
0.6771752,0.30327454,0
0.5903656,0.2879623,0
0.8065558,0.30110803,0
0.47362193,0.4181402,0
0.5699922,0.34543628,0
0.7270834,0.27040583,0
0.67027926,0.31779256,0
0.411607,0.4339467,0
0.7862416,0.36029053,0
0.7046541,0.2813135,0
0.6586511,0.3719554,0
0.6656612,0.29478455,0
0.50533926,0.46517986,0
0.6484271,0.39007017,0
0.7606556,0.34398594,0
0.4551305,0.3638912,0
0.62756056,0.34924164,0
0.68227524,0.33043545,0
0.6933085,0.29227272,0
0.5302309,0.36827794,0
0.5363113,0.34612134,0
0.5200872,0.36881354,0
0.46450648,0.36616716,0
0.5446121,0.3316597,0
0.6198068,0.36171496,0
0.60985893,0.28795722,0
0.7496242,0.28000298,0
0.5165827,0.32689947,0
0.5880956,0.3452351,0
0.5695782,0.3194416,0
0.5157582,0.3404013,0
0.38807747,0.42477557,0
0.7423551,0.30253768,0
0.5973581,0.31852657,0
0.7501274,0.25308383,0
0.47071102,0.4261411,0
0.7009431,0.32057187,0
0.7165877,0.30618775,0
0.57790506,0.33413374,0
0.61315554,0.3645959,0
0.6460642,0.3594604,0
0.3901689,0.40294838,0
0.76577276,0.27002716,0
0.5576967,0.34128687,0
0.59352255,0.37821713,0
0.48952088,0.41005474,0
0.692539,0.37242362,0
0.7205193,0.31458196,0
0.68809336,0.330847,0
0.6495344,0.3248227,0
0.80915385,0.2905563,0
0.52981615,0.43482292,0
0.70535475,0.2738746,0
0.74059486,0.30909136,0
0.6807862,0.38337183,0
0.4853311,0.36952817,0
0.5449943,0.3692579,0
0.13548501,0.6885423,1
0.1701525,0.7928026,1
0.112647995,0.7291102,1
0.2481415,0.7352662,1
0.11863479,0.73252857,1
0.17002925,0.5952146,1
0.13295034,0.76399857,1
0.20548147,0.7308683,1
0.16220896,0.4549103,1
0.17268056,0.73173034,1
0.1503445,0.5085819,1
0.13771208,0.65602076,1
0.18561815,0.62511563,1
0.14539574,0.69382775,1
0.18408027,0.7154381,1
0.16082248,0.54800695,1
0.10879184,0.73072404,1
0.1590715,0.7489326,1
0.15484,0.6281282,1
0.1608788,0.7546075,1
0.23007058,0.5164914,1
0.13730966,0.7457222,1
0.1840901,0.5293987,1
0.17732616,0.6460182,1
0.19498494,0.4440585,1
0.1431805,0.59533215,1
0.1540229,0.783459,1
0.16329163,0.7528855,1
0.16885373,0.5096959,1
0.16993576,0.6125062,1
0.17407063,0.4175741,1
0.18335876,0.6065148,1
0.16431786,0.44820082,1
0.15335824,0.5215876,1
0.16425961,0.49656302,1
0.15369023,0.49833593,1
0.16283414,0.6058363,1
0.22172053,0.50489205,1
0.1634654,0.58443445,1
0.15001306,0.7454994,1
0.124645025,0.61194026,1
0.1774493,0.50329703,1
0.16278304,0.72308433,1
0.13352363,0.6676013,1
0.14678659,0.73801214,1
0.16316076,0.7792519,1
0.14845848,0.697101,1
0.16062164,0.73223245,1
0.16182798,0.6624517,1
0.1344349,0.6849023,1
0.18822367,0.42866978,1
0.15904613,0.7336996,1
0.17699037,0.8100233,1
0.15666217,0.5854895,1
0.21474214,0.48715436,1
0.15246452,0.60004926,1
0.25061595,0.55269945,1
0.11136424,0.70351034,1
0.16926242,0.5186334,1
0.14880623,0.4116709,1
0.16764247,0.39450935,1
0.1763007,0.4176454,1
0.1387692,0.47595826,1
0.20471999,0.8067375,1
0.15523246,0.45335868,1
0.14487618,0.43758008,1
0.13529414,0.58250034,1
0.20148587,0.8223473,1
0.13629213,0.53170013,1
0.14964981,0.6075082,1
0.15043263,0.54428357,1
0.18704611,0.8137905,1
0.18190496,0.37979066,1
0.14196528,0.5425162,1
0.15180573,0.74786514,1
0.14846024,0.79762435,1
0.154995,0.3558008,1
0.14251561,0.6792013,1
0.14310335,0.53756696,1
0.19221403,0.7409071,1
0.16415413,0.5328425,1
0.14334904,0.7725087,1
0.14801246,0.7927358,1
0.12663803,0.478697,1
0.19839029,0.77628946,1
0.11180224,0.54585767,1
0.15775068,0.81207234,1
0.15825759,0.7665937,1
0.13719393,0.76655847,1
0.16861433,0.80169624,1
0.23652071,0.8244398,1
0.16347215,0.4687251,1
0.14455912,0.5135903,1
0.1498263,0.6881349,1
0.15256302,0.79179597,1
0.14392391,0.7805706,1
0.12613215,0.6970373,1
0.1344834,0.6168394,1
0.16039617,0.49578092,1
0.1756597,0.39448938,1
0.22981788,0.81931925,1
0.12520409,0.6331211,1
0.19589837,0.8099825,1
0.12041503,0.6611394,1
0.11346929,0.72363997,1
0.13982832,0.5007242,1
0.1433028,0.6482905,1
0.14995429,0.57800376,1
0.12853445,0.6256512,1
0.21251169,0.6703994,1
0.14930429,0.69967407,1
0.21508744,0.68414193,1
0.15526077,0.46810332,1
0.16589363,0.40131313,1
0.1409586,0.7303376,1
0.13365653,0.726039,1
0.15497003,0.48409867,1
0.14457673,0.7670671,1
0.16777231,0.5057461,1
0.11442588,0.73073685,1
0.14063802,0.75672513,1
0.13110103,0.5333725,1
0.12647189,0.7672205,1
0.16414174,0.76179695,1
0.1530283,0.6112645,1
0.217692,0.60095674,1
0.14040288,0.5594621,1
0.14063717,0.4643255,1
0.18535443,0.69072795,1
0.12998645,0.75086856,1
0.14515677,0.54396236,1
0.19465916,0.72547007,1
0.13683373,0.70848584,1
0.13277054,0.7608015,1
0.15604062,0.62232023,1
0.16506545,0.55689263,1
0.16663349,0.44474494,1
0.13678728,0.55123186,1
0.2648722,0.7059817,1
0.1957303,0.67312247,1
0.1715732,0.5909156,1
0.16843714,0.5428493,1
0.2191422,0.5206922,1
0.14947477,0.5754057,1
0.20280789,0.46937945,1
0.13320279,0.57928,1
0.19107127,0.5039311,1
0.12814502,0.5856421,1
0.14053054,0.6229916,1
0.16693988,0.531752,1
0.11478518,0.7364621,1
0.1516595,0.6320792,1
0.16381422,0.6570088,1
0.18907373,0.5298262,1
0.14721611,0.5696627,1
0.19194938,0.58817554,1
0.14841908,0.7712162,1
0.2128111,0.5308427,1
0.14669114,0.68185264,1
0.19118819,0.7135641,1
0.15170017,0.75013125,1
0.14940935,0.5921428,1
0.16795778,0.65849966,1
0.17433117,0.6204313,1
0.17919317,0.64304423,1
0.17861585,0.78653795,1
0.21335647,0.60122395,1
0.1605095,0.665623,1
0.13353796,0.7788812,1
0.19080797,0.4920275,1
0.1489942,0.78092784,1
0.11627578,0.7435442,1
0.14155312,0.7725148,1
0.14590837,0.5844176,1
0.1806116,0.607847,1
0.254744,0.66700095,1
0.1292966,0.75818324,1
0.17200644,0.8019587,1
0.13111906,0.76617384,1
0.13635539,0.72661495,1
0.17020284,0.593035,1
0.14087775,0.7792589,1
0.17975737,0.47272277,1
0.18408258,0.75391996,1
0.17017356,0.48512664,1
0.1964479,0.6687246,1
0.1817925,0.67510474,1
0.14190677,0.5022682,1
0.20459767,0.80735445,1
0.20957707,0.6744432,1
0.15214092,0.7586189,1
0.13999607,0.7497102,1
0.16605961,0.7787642,1
0.16507493,0.6153897,1
0.16422841,0.48816046,1
0.1811021,0.4681564,1
0.21049987,0.80338424,1
0.17637816,0.4447359,1
0.14531882,0.6577299,1
0.17674881,0.64062417,1
0.20151755,0.61619073,1
0.19883275,0.4723676,1
0.16866016,0.7013956,1
0.15433455,0.6278676,1
0.20537928,0.7918733,1
0.1710314,0.60651773,1
0.1780948,0.55425084,1
0.22827645,0.6653614,1
0.20496225,0.6936501,1
0.1880176,0.4917379,1
0.1682063,0.446622,1
0.15449268,0.5253795,1
0.18755977,0.51055044,1
0.1542321,0.52899384,1
0.1586533,0.68890846,1
0.2378438,0.70573467,1
0.13069609,0.7103075,1
0.21648155,0.4775777,1
0.1480594,0.4537705,1
0.18328762,0.61636883,1
0.18748745,0.46667188,1
0.16582248,0.49406797,1
0.13997237,0.7635734,1
0.24734157,0.70167565,1
0.25610504,0.67576605,1
0.27186427,0.6405526,1
0.1736962,0.510065,1
0.22019249,0.6611124,1
0.26006538,0.7275716,1
0.22895883,0.6218085,1
0.244534,0.7113295,1
0.22934696,0.7356095,1
0.22286353,0.6549691,1
0.16751282,0.44955316,1
0.20288305,0.81783855,1
0.18850508,0.5590052,1
0.24594943,0.7176898,1
0.15108871,0.45576486,1
0.29357275,0.59380174,1
0.30113435,0.57160777,1
0.14660868,0.5468353,1
0.16374357,0.50010186,1
0.1726191,0.39792413,1
0.16787085,0.43689182,1
0.2014809,0.57447755,1
0.17256649,0.4186742,1
0.20241275,0.4530371,1
0.19445515,0.5121948,1
0.20996042,0.6781466,1
0.14067294,0.4389351,1
0.19661203,0.598533,1
0.14375126,0.7253382,1
0.14306313,0.7418499,1
0.19566001,0.8125551,1
0.16265218,0.5090226,1
0.14975914,0.80812114,1
0.13315883,0.6199908,1
0.1352068,0.7533421,1
0.2157741,0.75731915,1
0.1414546,0.7192796,1
0.16915597,0.4331864,1
0.11480257,0.7407404,1
0.22975227,0.7033231,1
0.16394311,0.414815,1
0.30839,0.57367516,1
0.1621308,0.80086327,1
0.1928668,0.81159705,1
0.2833681,0.5574716,1
0.2752358,0.5913393,1
0.22287023,0.63351136,1
0.20794882,0.6192481,1
0.20736356,0.8101997,1
0.23573984,0.51286185,1
0.23498929,0.67735875,1
0.29168642,0.59485054,1
0.23083113,0.7368462,1
0.11027889,0.72440857,1
0.11908529,0.76664907,1
0.17066005,0.5591673,1
0.15800469,0.5540052,1
0.13502878,0.7339616,1
0.14251322,0.72537464,1
0.13892657,0.45765045,1
0.1684604,0.6705784,1
0.12488162,0.49392322,1
0.11055909,0.7426555,1
0.122628264,0.7651929,1
0.15388699,0.506041,1
0.12793651,0.45978066,1
0.18939635,0.6810009,1
0.13242856,0.46870676,1
0.13381755,0.49859467,1
0.18949696,0.59607947,1
0.12017366,0.73564255,1
0.10583074,0.5708944,1
0.13941965,0.7750593,1
0.14809465,0.4287348,1
0.19137473,0.44816944,1
0.13136503,0.7708405,1
0.16230395,0.4981606,1
0.115645,0.75603133,1
0.20581704,0.41572455,1
0.14386469,0.7782433,1
0.14018081,0.7850574,1
0.12054931,0.746953,1
0.19240166,0.60393,1
0.11430644,0.6638111,1
0.17954874,0.7272548,1
0.14182058,0.6883577,1
0.21371175,0.64745855,1
0.1946369,0.72395736,1
0.1643357,0.52862334,1
0.19935977,0.7610204,1
0.13051741,0.70132434,1
0.16685922,0.6763004,1
0.19573143,0.6108009,1
0.18545407,0.57014835,1
0.16939056,0.6035348,1
0.15459001,0.7880928,1
0.1773882,0.49287358,1
0.13825828,0.67992,1
0.13985737,0.6746104,1
0.15067498,0.59367776,1
0.15416698,0.67501086,1
0.19331238,0.61394554,1
0.20943071,0.6652309,1
0.16658711,0.40595278,1
0.18314755,0.541571,1
0.17028359,0.41505063,1
0.2189545,0.6635667,1
0.11140549,0.6943681,1
0.17194113,0.5952365,1
0.14075893,0.54495144,1
0.12542441,0.7384568,1
0.11720674,0.7503058,1
0.18410197,0.7673342,1
0.1141723,0.736357,1
0.20526583,0.7962072,1
0.15039173,0.7208299,1
0.18552579,0.62773085,1
0.18901533,0.64235634,1
0.19721855,0.79520816,1
0.18179534,0.78323865,1
0.19909099,0.5420957,1
0.11579195,0.7039468,1
0.14593983,0.52840656,1
0.12621331,0.7121682,1
0.15517989,0.5209311,1
0.15606844,0.5088247,1
0.16299345,0.550558,1
0.21309872,0.82329404,1
0.1258045,0.67466533,1
0.15417376,0.3713019,1
0.11791327,0.73277944,1
0.1464233,0.51726484,1
0.2035221,0.80988574,1
0.15852252,0.47426936,1
0.10234309,0.6988809,1
0.17730057,0.4160357,1
0.16944031,0.4339559,1
0.13017927,0.6826444,1
0.2078987,0.78854936,1
0.14225242,0.4278292,1
0.13722678,0.78985846,1
0.16939881,0.61322635,1
0.15820815,0.80901664,1
0.159664,0.755012,1
0.1576629,0.73406285,1
0.20431499,0.6057324,1
0.14240873,0.78833514,1
0.14682741,0.7505095,1
0.19638449,0.6679251,1
0.20882992,0.7816583,1
0.14248405,0.76804894,1
0.14220761,0.73033047,1
0.18733446,0.70039076,1
0.20652156,0.5962895,1
0.09434211,0.70047474,1
0.11881491,0.7172157,1
0.13008985,0.73787713,1
0.1807277,0.6734526,1
0.17540939,0.7478551,1
0.12199877,0.7292585,1
0.13672015,0.4761719,1
0.17250782,0.7578089,1
0.14703506,0.70396805,1
0.11965675,0.7517118,1
0.111123644,0.7331829,1
0.19005601,0.6556467,1
0.124735914,0.64689887,1
0.14878118,0.5971176,1
0.17690852,0.76898074,1
0.15670127,0.48384276,1
0.27367792,0.7469208,1
0.11387809,0.65659416,1
0.102641985,0.72966486,1
0.14679886,0.7708997,1
0.11807703,0.7434475,1
0.14763513,0.71691537,1
0.10904874,0.67895573,1
0.1380217,0.7698468,1
0.10562305,0.7328276,1
0.12256237,0.6261599,1
0.12504613,0.7503381,1
0.116431266,0.731368,1
0.10903276,0.71287215,1
0.14736702,0.7854605,1
0.14464556,0.77956635,1
0.13101268,0.791323,1
0.105870515,0.7242363,1
0.095806964,0.71414316,1
0.110217616,0.6139402,1
0.12836888,0.7640783,1
0.14634311,0.48500335,1
0.094984986,0.6408058,1
0.119215995,0.7317226,1
0.20596172,0.76393336,1
0.12074507,0.6998964,1
0.11968359,0.7578023,1
0.19730866,0.7949654,1
0.13710645,0.71455586,1
0.14043097,0.7824669,1
0.1731246,0.7960182,1
0.12963897,0.7664964,1
0.11329294,0.7292332,1
0.13585691,0.685238,1
0.13533948,0.7677193,1
0.12363525,0.74501747,1
0.113502875,0.6004452,1
0.11810778,0.7323814,1
0.12287826,0.57183766,1
0.21380185,0.64848876,1
0.20108877,0.67498314,1
0.1718691,0.6714046,1
0.10766759,0.676666,1
0.16731177,0.42587534,1
0.118342035,0.7698931,1
0.12645993,0.7725752,1
0.14292039,0.6505347,1
0.158606,0.58661187,1
0.17053363,0.8078883,1
0.11472373,0.74324036,1
0.10785439,0.73145866,1
0.17047647,0.71555656,1
0.11317457,0.74024564,1
0.109617375,0.7410108,1
0.10444833,0.71974504,1
0.112501614,0.70554674,1
0.15660398,0.7812452,1
0.12326817,0.75662124,1
0.1266481,0.7615687,1
0.15742166,0.80563897,1
0.12021895,0.693992,1
0.107743785,0.7133872,1
0.1745011,0.5957482,1
0.13319182,0.7467566,1
0.13550392,0.7262554,1
0.10316417,0.6825397,1
0.15322499,0.775756,1
0.12290777,0.7302982,1
0.16773841,0.55032694,1
0.1999942,0.7079393,1
0.11681544,0.76318675,1
0.119486555,0.773054,1
0.12391422,0.69310814,1
0.1837055,0.7817856,1
0.22828913,0.50400895,1
0.121532574,0.72253865,1
0.1700484,0.49258557,1
0.1741308,0.7806196,1
0.14312938,0.75568056,1
0.13569586,0.74968624,1
0.12736411,0.7523779,1
0.13244994,0.7851343,1
0.13583702,0.74012685,1
0.18488692,0.630213,1
0.12944293,0.70708054,1
0.08919813,0.72909635,1
0.16206288,0.7816242,1
0.11670474,0.6892386,1
0.12177842,0.72406155,1
0.14700651,0.52341175,1
0.10933616,0.70773333,1
0.15189211,0.78409505,1
0.13256516,0.60928625,1
0.09702128,0.6881082,1
0.10489582,0.6944273,1
0.14724621,0.51208776,1
0.11037795,0.62352985,1
0.1002359,0.7107782,1
0.14314118,0.78264976,1
0.135524,0.7620582,1
0.1275052,0.7291627,1
0.13323112,0.7538679,1
0.12330087,0.68713593,1
0.12575096,0.71839654,1
0.14766972,0.7592339,1
0.21688142,0.4601709,1
0.11090326,0.72929454,1
0.14352015,0.678066,1
0.1110311,0.7056661,1
0.14605771,0.7740392,1
0.10228401,0.5804485,1
0.13920398,0.7228055,1
0.13522659,0.7641979,1
0.18377009,0.814042,1
0.11025601,0.7373649,1
0.15294491,0.60881543,1
0.11894623,0.68056464,1
0.12855476,0.65369564,1
0.11215319,0.74024487,1
0.1428208,0.79761606,1
0.15306334,0.79311234,1
0.109774604,0.6910321,1
0.15070882,0.4682351,1
0.1546916,0.60215986,1
0.102561176,0.6351932,1
0.13004877,0.59947044,1
0.13448623,0.7716612,1
0.11596659,0.72974384,1
0.12216402,0.6875907,1
0.12482177,0.7585649,1
0.2741077,0.7198,1
0.13814658,0.76449245,1
0.13634281,0.7461988,1
0.16412628,0.45040494,1
0.14233944,0.54668415,1
0.2569379,0.6208873,1
0.13048245,0.7730217,1
0.10362683,0.6576893,1
0.09818194,0.69304544,1
0.14976496,0.7774854,1
0.13813528,0.79258853,1
0.15190285,0.7855688,1
0.17830965,0.7984747,1
0.09790316,0.6846027,1
0.14333053,0.7261146,1
0.13456286,0.7677805,1
0.1725178,0.7548187,1
0.13223669,0.6425748,1
0.1029192,0.6685501,1
0.11418411,0.5179054,1
0.10507636,0.70394653,1
0.1911729,0.81115216,1
0.11276502,0.7190506,1
0.16065113,0.7514095,1
0.12460934,0.7534006,1
0.12128015,0.60586214,1
0.12686175,0.7310345,1
0.109105766,0.7470618,1
0.13832311,0.63478065,1
0.13328767,0.69376004,1
0.10082292,0.7370811,1
0.11112689,0.626009,1
0.13797238,0.7561817,1
0.15975171,0.79340893,1
0.13585234,0.5975049,1
0.12977417,0.7653141,1
0.14329161,0.7781463,1
0.17754164,0.50336325,1
0.10969045,0.6703678,1
0.08641786,0.68359286,1
0.12385939,0.7687085,1
0.18879564,0.8156758,1
0.17050424,0.46752718,1
0.21228212,0.67652017,1
0.15857618,0.674372,1
0.10709223,0.7270192,1
0.15236524,0.59511715,1
0.107350364,0.733809,1
0.2121353,0.8122168,1
0.10430483,0.7339517,1
0.19208844,0.7663834,1
0.13535054,0.7718161,1
0.13994025,0.5428868,1
0.13870396,0.69172746,1
0.1314481,0.77669305,1
0.1184873,0.6705974,1
0.12071288,0.6751822,1
0.13902795,0.6285623,1
0.1295161,0.7818793,1
0.08965452,0.7010822,1
0.16454284,0.7386781,1
0.13107647,0.72027314,1
0.11662071,0.74307215,1
0.10850599,0.7201133,1
0.15023488,0.7737018,1
0.13282458,0.7666843,1
0.122370325,0.7278378,1
0.13817425,0.49482617,1
0.106045105,0.7027191,1
0.11266373,0.74155194,1
0.105843745,0.7150994,1
0.10724305,0.6653415,1
0.14338456,0.4187027,1
0.14461496,0.7674957,1
0.14003119,0.72252256,1
0.10639805,0.7101386,1
0.16042608,0.8013028,1
0.122993104,0.5481064,1
0.14096464,0.776746,1
0.09780021,0.6499792,1
0.15737794,0.6419016,1
0.12987997,0.7598697,1
0.12246541,0.7010585,1
0.121168144,0.6964801,1
0.12140207,0.76407284,1
0.11490452,0.72690344,1
0.1270889,0.70031357,1
0.115087084,0.74570376,1
0.1254811,0.7560178,1
0.13798952,0.73081255,1
0.14114861,0.77270967,1
0.13250911,0.77774864,1
0.13126706,0.77019995,1
0.14321157,0.7832977,1
0.18889923,0.79005814,1
0.20408697,0.512313,1
0.13404931,0.7701072,1
0.1289665,0.7149638,1
0.15530668,0.37139407,1
0.13091551,0.7602594,1
0.13275518,0.7604195,1
0.13238622,0.76131356,1
0.10747349,0.7224255,1
0.098627,0.7275706,1
0.113396935,0.70495325,1
0.19785438,0.7086354,1
0.16847864,0.79581845,1
0.16395026,0.5704572,1
0.114435226,0.71270525,1
0.16460803,0.81414783,1
0.1738617,0.7125683,1
0.12154029,0.7683482,1
0.113644086,0.6618438,1
0.13264956,0.74657583,1
0.08515442,0.6767213,1
0.18060063,0.78445965,1
0.1173344,0.7701526,1
0.109221354,0.7295655,1
0.107076384,0.74862856,1
0.1566925,0.78403026,1
0.13808244,0.67760533,1
0.13056023,0.77328545,1
0.09233291,0.67217416,1
0.1346827,0.7623427,1
0.123359084,0.7474615,1
0.15531056,0.78988546,1
0.13430068,0.7769861,1
0.12424596,0.7721359,1
0.14633945,0.72099924,1
0.09995265,0.72127926,1
0.13978575,0.75365984,1
0.11897552,0.74912816,1
0.16088599,0.8016551,1
0.16129887,0.80379635,1
0.12426746,0.7069256,1
0.111498944,0.6935986,1
0.1359506,0.63637817,1
0.119154885,0.5114928,1
0.12737508,0.65437275,1
0.10069328,0.7069941,1
0.14425345,0.57016903,1
0.15407117,0.8066213,1
0.10760577,0.7220761,1
0.20720254,0.7123111,1
0.09711124,0.69509166,1
0.12474363,0.75241756,1
0.13498214,0.7009876,1
0.10487451,0.7381304,1
0.14897645,0.7732116,1
0.14485489,0.7913563,1
0.12767553,0.6712507,1
0.118493564,0.6980835,1
0.13468383,0.56906796,1
0.122174494,0.7274371,1
0.20640889,0.7653644,1
0.13379158,0.7636698,1
0.11929659,0.7233102,1
0.17450318,0.76562077,1
0.1380765,0.77249676,1
0.17375056,0.5789145,1
0.14788194,0.7912255,1
0.13354008,0.7569667,1
0.10035004,0.7072728,1
0.15256129,0.7953231,1
0.103906855,0.7441615,1
0.19568746,0.7849457,1
0.10984245,0.70456034,1
0.1476869,0.73415107,1
0.17102098,0.6324401,1
0.20742203,0.73060846,1
0.12093962,0.718601,1
0.10931733,0.751823,1
0.101693235,0.7470269,1
0.11477301,0.74935746,1
0.1647541,0.66977847,1
0.19128206,0.8038829,1
0.10517951,0.6935002,1
0.10345004,0.7495818,1
0.13101228,0.7052988,1
0.13557978,0.77476746,1
0.1277,0.77191865,1
0.13835415,0.76471394,1
0.16237356,0.53041416,1
0.12247313,0.7648607,1
0.10761336,0.68929315,1
0.09578076,0.6813315,1
0.117083825,0.7413133,1
0.116799615,0.7213681,1
0.19595774,0.74498564,1
0.13609204,0.75890064,1
0.12368038,0.7636727,1
0.16070874,0.66511565,1
0.108071186,0.6954255,1
0.10801045,0.72584057,1
0.10174504,0.68724024,1
0.102331765,0.708806,1
0.1238802,0.59011304,1
0.14693443,0.7091443,1
0.12809804,0.7538204,1
0.1504358,0.76567656,1
0.1473401,0.59648395,1
0.20170753,0.7268937,1
0.13096964,0.6467723,1
0.120046675,0.6693318,1
0.14128777,0.75921714,1
0.1341309,0.7532599,1
0.11053763,0.66183275,1
0.14003007,0.77291983,1
0.094306186,0.682437,1
0.12672584,0.78442883,1
0.16651957,0.76656276,1
0.11348402,0.7335329,1
0.15240529,0.80812395,1
0.12730926,0.7492957,1
0.103971414,0.6869148,1
0.10988316,0.6937561,1
0.11380518,0.72544515,1
0.117615655,0.75576466,1
0.1173368,0.74595225,1
0.09744627,0.7126064,1
0.08983966,0.7155072,1
0.11284134,0.7637116,1
0.11407535,0.7013918,1
0.12431591,0.7346015,1
0.13956131,0.65619844,1
0.13867204,0.5282626,1
0.1430644,0.7999292,1
0.11808406,0.569699,1
0.12242264,0.7723726,1
0.13155656,0.7520858,1
0.09200571,0.71183777,1
0.11101977,0.72782075,1
0.13292415,0.79389614,1
0.19089662,0.73736674,1
0.1135653,0.7187443,1
0.114831306,0.5633937,1
0.11059282,0.65087813,1
0.14056735,0.6799117,1
0.11289155,0.75110584,1
0.11891519,0.77296907,1
0.21098423,0.79591227,1
0.095835075,0.7380022,1
0.15097885,0.56454504,1
0.15331088,0.60856616,1
0.17694484,0.57598406,1
0.15320632,0.627121,1
0.1714301,0.62979704,1
0.13582008,0.6268184,1
0.18288457,0.58287996,1
0.15006278,0.7087899,1
0.15620168,0.58965737,1
0.16218194,0.6724164,1
0.16344678,0.7273443,1
0.1502593,0.5789753,1
0.13517806,0.64349914,1
0.13900985,0.7528669,1
0.16476986,0.76077145,1
0.18785879,0.6612983,1
0.15563796,0.66267455,1
0.14359082,0.57637686,1
0.18589836,0.6171855,1
0.13579705,0.78038985,1
0.15932062,0.5930057,1
0.13094477,0.76218027,1
0.13893947,0.7737913,1
0.15479888,0.7614561,1
0.1558269,0.7458946,1
0.14902931,0.78890306,1
0.13894643,0.7513726,1
0.16603184,0.5687129,1
0.1183039,0.76574236,1
0.14002533,0.7759551,1
0.14312199,0.79877675,1
0.15778002,0.7854933,1
0.1443318,0.78587115,1
0.17779718,0.80559415,1
0.14699219,0.76265067,1
0.14316802,0.7880988,1
0.14923985,0.8019394,1
0.17100927,0.79891884,1
0.15014866,0.7939881,1
0.17673604,0.80452436,1
0.13741995,0.76704264,1
0.15652008,0.77852005,1
0.14494896,0.7794755,1
0.19137955,0.6906291,1
0.16754355,0.59498686,1
0.17168546,0.6216971,1
0.19234395,0.65752757,1
0.15392762,0.5957875,1
0.17908393,0.71602,1
0.19694299,0.67932785,1
0.177212,0.57405984,1
0.1604561,0.71070766,1
0.15042545,0.6783054,1
0.1481068,0.6257803,1
0.112786576,0.7568134,1
0.11001751,0.73952186,1
0.11894421,0.6550507,1
0.13380066,0.76635844,1
0.13503118,0.39462838,1
0.13281421,0.76210517,1
0.13425826,0.57524914,1
0.13386846,0.7702337,1
0.09853616,0.7239179,1
0.12532108,0.74673,1
0.15006734,0.7889818,1
0.13808393,0.65671164,1
0.20743783,0.6387196,1
0.23436742,0.6152373,1
0.20665874,0.6595251,1
0.19221196,0.67227924,1
0.20358877,0.6507011,1
0.16563211,0.7366338,1
0.18776575,0.5478136,1
0.16958438,0.6089458,1
0.14488451,0.5185154,1
0.1305996,0.6235248,1
0.17574117,0.7203747,1
0.1306542,0.6965097,1
0.13105181,0.7548469,1
0.16455911,0.70705247,1
0.13685597,0.6272327,1
0.12928842,0.6915679,1
0.13640557,0.4750689,1
0.14345697,0.71057594,1
0.17436756,0.66053826,1
0.1918497,0.5471016,1
0.14038926,0.6273089,1
0.17416759,0.5626858,1
0.17132133,0.5769535,1
0.11800047,0.73512673,1
0.112653084,0.62620574,1
0.13077581,0.7807788,1
0.13598816,0.72775483,1
0.14888217,0.6964438,1
0.17452759,0.75523716,1
0.1479465,0.6626107,1
0.15973228,0.6104315,1
0.16595775,0.59563273,1
0.13503975,0.644207,1
0.15827143,0.5872742,1
0.13057366,0.6556906,1
0.14855067,0.7288316,1
0.14718205,0.7012612,1
0.13688377,0.7116291,1
0.13525344,0.71848416,1
0.14311635,0.71045274,1
0.17008854,0.7235201,1
0.17262706,0.7550596,1
0.17279024,0.7888351,1
0.20072344,0.7920713,1
0.17194605,0.78331244,1
0.20018426,0.76490974,1
0.13154376,0.68284136,1
0.17121968,0.79866016,1
0.106727235,0.70776933,1
0.13524443,0.7603598,1
0.1165595,0.7329191,1
0.12930198,0.69869375,1
0.18545684,0.64136195,1
0.17814898,0.57322735,1
0.16499783,0.517023,1
0.18322492,0.5902701,1
0.14717938,0.6537147,1
0.18240215,0.63957024,1
0.1672804,0.54104507,1
0.1691891,0.5850396,1
0.14629404,0.6107326,1
0.18872556,0.53921103,1
0.1668239,0.57088625,1
0.18397409,0.6684871,1
0.13912272,0.7615307,1
0.10529661,0.75020975,1
0.1336628,0.740007,1
0.13014172,0.75144815,1
0.14089188,0.7949782,1
0.13039407,0.7379562,1
0.22792594,0.78179014,1
0.2391462,0.7794024,1
0.23109928,0.6992775,1
0.13118048,0.75603735,1
0.12083398,0.75244087,1
0.10685717,0.71290594,1
0.12858874,0.7209098,1
0.12902528,0.7825518,1
0.16801792,0.7480104,1
0.17180447,0.58402526,1
0.1655648,0.77009267,1
0.16892263,0.67292947,1
0.14805755,0.5615128,1
0.15649138,0.6771841,1
0.123004936,0.7045297,1
0.14273643,0.73971844,1
0.14417845,0.71028227,1
0.14929509,0.709627,1
0.14791185,0.5801924,1
0.14479306,0.5806115,1
0.15680274,0.7122997,1
0.13370618,0.6944698,1
0.11133423,0.75023335,1
0.12445947,0.76269835,1
0.12643579,0.71087706,1
0.12389712,0.7329919,1
0.2226564,0.7610674,1
0.18821208,0.815895,1
0.22133085,0.79910576,1
0.2174403,0.80097204,1
0.23020037,0.8114375,1
0.12573466,0.75720614,1
0.1224899,0.7771404,1
0.12191247,0.75920874,1
0.11656346,0.74519444,1
0.14456621,0.79000247,1
0.1252172,0.74371904,1
0.113471285,0.71117437,1
0.12865376,0.77107966,1
0.10999165,0.7444492,1
0.11948496,0.73929703,1
0.10195335,0.73306435,1
0.113541774,0.74044895,1
0.15424378,0.78139293,1
0.1229595,0.7616872,1
0.13068832,0.7597732,1
0.10052139,0.71571106,1
0.103124194,0.70735216,1
0.1287751,0.79002106,1
0.11741188,0.75397754,1
0.1315327,0.7662414,1
0.12318824,0.616202,1
0.12433478,0.5470483,1
0.094408385,0.64346665,1
0.10223439,0.6933293,1
0.144939,0.7576923,1
0.123797856,0.64729834,1
0.20245324,0.8217292,1
0.1455681,0.78602123,1
0.122441895,0.78449523,1
0.121405385,0.7498687,1
0.09446861,0.702392,1
0.12581989,0.77305,1
0.09075468,0.6903106,1
0.109495424,0.742074,1
0.10490253,0.74664146,1
0.14959465,0.8021637,1
0.15062155,0.53824127,1
0.11333411,0.73608696,1
0.1278844,0.7026782,1
0.13289294,0.7132013,1
0.15645541,0.7833161,1
0.14378206,0.7731156,1
0.09831179,0.6840923,1
0.12491842,0.6968197,1
0.15438762,0.7975614,1
0.16906224,0.7987238,1
0.20475513,0.7393451,1
0.13294025,0.7864819,1
0.12981938,0.7438279,1
0.129759,0.763219,1
0.1742216,0.7320346,1
0.12035861,0.74568623,1
0.12538594,0.73648554,1
0.11841615,0.74710035,1
0.111961514,0.7066983,1
0.12914944,0.5004411,1
0.09123615,0.6735196,1
0.106576696,0.73053277,1
0.13607773,0.7670298,1
0.18070437,0.4513011,1
0.1574433,0.70823,1
0.18981586,0.65041757,1
0.13232116,0.70229137,1
0.123502195,0.74222666,1
0.10845913,0.7514182,1
0.13433567,0.6795253,1
0.11093993,0.691147,1
0.11679589,0.6713148,1
0.1502803,0.6804436,1
0.10936779,0.6933415,1
0.12683617,0.6677162,1
0.11536249,0.6541009,1
0.10313776,0.73807734,1
0.12156696,0.65311366,1
0.109616384,0.6686469,1
0.12917534,0.7724766,1
0.16333546,0.797037,1
0.12567575,0.7853301,1
0.14224854,0.40110812,1
0.13302597,0.66940457,1
0.14004609,0.72386575,1
0.11062121,0.72731835,1
0.10461953,0.71150887,1
0.14735599,0.6060573,1
0.13224898,0.7705084,1
0.14626876,0.784378,1
0.20811483,0.7799812,1
0.13155727,0.7755446,1
0.10451869,0.7023951,1
0.14577194,0.7913564,1
0.13209496,0.78377295,1
0.13256152,0.764591,1
0.11508616,0.7339578,1
0.12165129,0.7431493,1
0.14971368,0.7017785,1
0.12144404,0.70475996,1
0.10479885,0.6455268,1
0.12776324,0.77688247,1
0.1945152,0.69572186,1
0.10874357,0.73077476,1
0.16783375,0.520815,1
0.15271558,0.7875709,1
0.09976498,0.7255589,1
0.13851516,0.67173445,1
0.12426375,0.7805349,1
0.09958712,0.7260897,1
0.1894807,0.7766254,1
0.16554482,0.68012685,1
0.12006336,0.75258994,1
0.15701084,0.7896225,1
0.10162958,0.72486883,1
0.11409471,0.7487219,1
0.14504819,0.63601714,1
0.11997223,0.69143087,1
0.10230307,0.71632296,1
0.12218366,0.71845484,1
0.11949976,0.7477103,1
0.088759236,0.6689713,1
0.17745379,0.8074476,1
0.13158934,0.5588259,1
0.14884925,0.7810866,1
0.13994025,0.6557219,1
0.109296285,0.62840354,1
0.16443944,0.81048375,1
0.13256581,0.5319118,1
0.13361058,0.7596946,1
0.14667407,0.66773754,1
0.20985377,0.8038242,1
0.18365099,0.74624926,1
0.11936759,0.57351196,1
0.1341413,0.77221036,1
0.10407075,0.6925727,1
0.11229175,0.7381326,1
0.115651034,0.69574344,1
0.16172668,0.7092463,1
0.118506625,0.5887724,1
0.10154866,0.67935413,1
0.1902026,0.8162744,1
0.08621121,0.666869,1
0.11684844,0.71866995,1
0.12630577,0.7102403,1
0.1671857,0.7596841,1
0.103333056,0.72958505,1
0.10255764,0.7461097,1
0.10581277,0.70522684,1
0.11266001,0.7502917,1
0.115274474,0.67491907,1
0.111046605,0.6480144,1
0.1746741,0.7842904,1
0.13968803,0.5553112,1
0.15588956,0.6652352,1
0.13603069,0.7728568,1
0.09872524,0.6193663,1
0.1329315,0.6057665,1
0.14777237,0.7672385,1
0.13365729,0.744552,1
0.1273478,0.5775761,1
0.13597906,0.7811728,1
0.12786601,0.7407646,1
0.12908065,0.76269984,1
0.110669546,0.71332246,1
0.115930416,0.73490447,1
0.13535905,0.43358645,1
0.14148037,0.7839203,1
0.12417585,0.7521702,1
0.13236144,0.49349004,1
0.16094874,0.79955757,1
0.10311862,0.7178535,1
0.17524822,0.79564315,1
0.1526993,0.7740933,1
0.14613126,0.78626,1
0.10973088,0.679007,1
0.15214029,0.7980847,1
0.15019338,0.74086773,1
0.11611402,0.64627564,1
0.14759928,0.71312034,1
0.16677544,0.7842394,1
0.13021553,0.77438664,1
0.15439281,0.6741498,1
0.21187146,0.6736217,1
0.11791679,0.6864653,1
0.09960664,0.71112716,1
0.16670552,0.48790368,1
0.09075465,0.7069693,1
0.1020119,0.7390162,1
0.108402975,0.680918,1
0.13191745,0.64430374,1
0.14694628,0.7655288,1
0.19395728,0.8208467,1
0.12334183,0.7801317,1
0.104103886,0.71186674,1
0.17234534,0.77222115,1
0.13307276,0.76776695,1
0.12156845,0.5674176,1
0.115478836,0.71881294,1
0.13362399,0.5305846,1
0.115121424,0.7418856,1
0.10999034,0.7131537,1
0.15707794,0.7114498,1
0.11651479,0.7409345,1
0.17504346,0.55261916,1
0.10910956,0.75118,1
0.114647284,0.5374408,1
0.16156904,0.72208273,1
