PC1,PC2,label
0.5533247,0.44532755,0
0.56392354,0.34345356,0
0.41251394,0.40165746,0
0.42315212,0.36884755,0
0.81142193,0.24454054,0
0.68023837,0.24441567,0
0.40564913,0.4841442,0
0.8364552,0.301282,0
0.55656797,0.3303485,0
0.8185416,0.29892564,0
0.45772606,0.36898565,0
0.52811503,0.2903926,0
0.81038797,0.3066328,0
0.63345486,0.25834933,0
0.6117755,0.28469297,0
0.7784499,0.2912603,0
0.85207504,0.33242363,0
0.45405433,0.3614333,0
0.8195523,0.2507671,0
0.7103665,0.25748563,0
0.5932584,0.25851727,0
0.7728938,0.2875756,0
0.68770087,0.32836092,0
0.73897547,0.28267103,0
0.7769071,0.29434282,0
0.5773929,0.35496867,0
0.5283784,0.40731165,0
0.59242356,0.3012574,0
0.84458184,0.25725546,0
0.6936709,0.24735688,0
0.3580851,0.37586266,0
0.830638,0.30833122,0
0.8272397,0.25913095,0
0.83965135,0.29844904,0
0.8040767,0.24829298,0
0.57578844,0.28958708,0
0.82700676,0.2842471,0
0.7070783,0.242235,0
0.48856708,0.34721118,0
0.48716024,0.34994298,0
0.609521,0.26543018,0
0.4545464,0.40492886,0
0.795468,0.25772005,0
0.5345936,0.3176509,0
0.7241013,0.30470762,0
0.47563025,0.32740906,0
0.7358921,0.23888475,0
0.53853995,0.35357672,0
0.75851923,0.2814257,0
0.84524786,0.2918104,0
0.8351582,0.31609058,0
0.49147952,0.30815557,0
0.8220291,0.3003506,0
0.82450795,0.24886216,0
0.58580256,0.26761624,0
0.43826658,0.47132275,0
0.69544536,0.23291643,0
0.596681,0.36024323,0
0.6798683,0.24539207,0
0.6056928,0.2952271,0
0.3979026,0.33178166,0
0.56334955,0.32323757,0
0.5579545,0.3852692,0
0.6826349,0.22928835,0
0.80355626,0.23188165,0
0.5649604,0.30202293,0
0.6614221,0.30829626,0
0.45652226,0.34421334,0
0.6608492,0.27858645,0
0.6866805,0.31431547,0
0.51285285,0.32916367,0
0.70007914,0.31447214,0
0.4763179,0.34842572,0
0.5049752,0.2856582,0
0.5544287,0.31685963,0
0.54614955,0.30220532,0
0.57816404,0.26537842,0
0.66433686,0.29085338,0
0.60759044,0.24419077,0
0.634439,0.26556772,0
0.6841415,0.27824682,0
0.5050809,0.29864028,0
0.4235786,0.42226633,0
0.6045372,0.3448562,0
0.6197648,0.32551125,0
0.54062265,0.28326145,0
0.39920646,0.5349358,0
0.41666028,0.37480065,0
0.43151668,0.39242548,0
0.7963058,0.3207884,0
0.67706823,0.3655107,0
0.6616698,0.30409774,0
0.6395879,0.33159983,0
0.5437795,0.46477956,0
0.4814079,0.3212015,0
0.73497826,0.29495677,0
0.5385638,0.33128405,0
0.68423647,0.25026125,0
0.5221366,0.330122,0
0.5903051,0.38743007,0
0.38646245,0.34562725,0
0.4275591,0.36970937,0
0.69465065,0.23808219,0
0.5079076,0.28748608,0
0.54410964,0.36869183,0
0.6687488,0.24055679,0
0.52800584,0.31207556,0
0.6530753,0.30788094,0
0.6140579,0.30859914,0
0.48066032,0.3708453,0
0.48087683,0.3967482,0
0.7256176,0.24166685,0
0.5676357,0.2754011,0
0.7013863,0.32170996,0
0.8197794,0.23384246,0
0.53558004,0.30602533,0
0.48181754,0.3990146,0
0.541606,0.38745227,0
0.58994246,0.2879185,0
0.7028455,0.3018896,0
0.7978397,0.25596696,0
0.7811543,0.28070587,0
0.5779174,0.30473506,0
0.70135075,0.26032084,0
0.6047792,0.31666154,0
0.7303346,0.27793828,0
0.54920477,0.3026511,0
0.5595832,0.2968137,0
0.61578345,0.28397042,0
0.55574894,0.34280798,0
0.44078743,0.34056205,0
0.53372115,0.2802647,0
0.5174597,0.33949715,0
0.51788163,0.323286,0
0.47706088,0.33107686,0
0.660729,0.2565928,0
0.5141039,0.28235924,0
0.41042438,0.400631,0
0.529206,0.2889705,0
0.43008304,0.37620768,0
0.39228654,0.34669754,0
0.5006894,0.43054453,0
0.54424965,0.25283304,0
0.8421172,0.28749457,0
0.80762035,0.3360714,0
0.56295294,0.3250628,0
0.6882294,0.27773038,0
0.40648887,0.37734595,0
0.39774412,0.3425644,0
0.6781659,0.23906071,0
0.5564027,0.3634193,0
0.5337225,0.41263023,0
0.4563,0.3988098,0
0.5612669,0.3195364,0
0.5127035,0.33458686,0
0.5979127,0.36835548,0
0.6045513,0.44855148,0
0.56603,0.3419585,0
0.4692809,0.29230943,0
0.5514836,0.3488443,0
0.58910567,0.32070327,0
0.6409085,0.2609914,0
0.44500503,0.34798527,0
0.5015865,0.296175,0
0.5628938,0.37482202,0
0.48085698,0.38364986,0
0.51667666,0.28260395,0
0.5985357,0.38939124,0
0.47456983,0.45038375,0
0.62569785,0.28492242,0
0.5291916,0.27409887,0
0.40287188,0.3899375,0
0.6210396,0.3524684,0
0.61251825,0.28151605,0
0.46554786,0.42228097,0
0.6510046,0.29356351,0
0.5326963,0.3168387,0
0.5907462,0.3489906,0
0.31186756,0.39926618,0
0.41445503,0.33623663,0
0.55343115,0.27593496,0
0.5516345,0.30477777,0
0.5774651,0.43027127,0
0.44217846,0.38829765,0
0.7719762,0.247834,0
0.6971186,0.27951846,0
0.51628536,0.3302667,0
0.41636464,0.37966338,0
0.5299275,0.42547667,0
0.5133641,0.28729528,0
0.727827,0.27391422,0
0.71708214,0.31629193,0
0.63633674,0.32691047,0
0.7190215,0.2320895,0
0.5005244,0.31948793,0
0.709375,0.22526202,0
0.601961,0.3463509,0
0.6277544,0.29323837,0
0.6129606,0.35073155,0
0.5463837,0.296448,0
0.4506743,0.36382025,0
0.65379417,0.29058808,0
0.7449057,0.3377843,0
0.42024913,0.3911241,0
0.5656763,0.3024067,0
0.51945084,0.38368613,0
0.7626871,0.36336625,0
0.5304066,0.35966367,0
0.5362271,0.3282605,0
0.45431155,0.30676168,0
0.5255842,0.3035799,0
0.77927524,0.33636424,0
0.71950847,0.3146701,0
0.6492173,0.2988093,0
0.41708016,0.34666836,0
0.6068372,0.28898016,0
0.55157894,0.3094716,0
0.39809173,0.38225538,0
0.84889054,0.23926385,0
0.45558837,0.31824782,0
0.7365637,0.28975952,0
0.46409756,0.32443407,0
0.64620876,0.2557729,0
0.4096481,0.45177355,0
0.8046605,0.2787743,0
0.6317568,0.2523259,0
0.6867165,0.23307666,0
0.6569267,0.25690338,0
0.5669913,0.27104372,0
0.4214717,0.37897745,0
0.6755242,0.21272388,0
0.6891432,0.25347874,0
0.65366006,0.36271486,0
0.78628206,0.27230242,0
0.6162696,0.22965254,0
0.83064055,0.23789942,0
0.79453075,0.21594794,0
0.55941796,0.37707114,0
0.5295442,0.37533695,0
0.5960339,0.33514863,0
0.40798,0.37318674,0
0.55259836,0.27430227,0
0.6588786,0.25600347,0
0.38109782,0.3816414,0
0.6760639,0.32155168,0
0.6213009,0.3199797,0
0.7898735,0.27925488,0
0.699971,0.30077466,0
0.77781737,0.27573115,0
0.81751686,0.23004594,0
0.5255855,0.3264343,0
0.5930366,0.36652064,0
0.51790494,0.28666696,0
0.46085626,0.33300918,0
0.48738483,0.32928512,0
0.6541091,0.4133339,0
0.5055676,0.27420595,0
0.551606,0.3223765,0
0.6343726,0.2802334,0
0.5348059,0.39733818,0
0.5356625,0.41374922,0
0.5017568,0.3630016,0
0.6307304,0.24582042,0
0.6570141,0.2539585,0
0.44627956,0.35968432,0
0.5151105,0.413751,0
0.4033761,0.3416746,0
0.7053329,0.32259658,0
0.5586321,0.2986363,0
0.46178117,0.3132229,0
0.67175627,0.23918696,0
0.38717675,0.3927735,0
0.6019222,0.3061301,0
0.44575253,0.34235242,0
0.6489921,0.2565677,0
0.5792309,0.26760682,0
0.65095854,0.2719736,0
0.5530988,0.35329553,0
0.5639582,0.3180086,0
0.4751471,0.53653556,0
0.45307484,0.35654628,0
0.64447254,0.26864523,0
0.6098294,0.30775055,0
0.60800606,0.29534462,0
0.49316218,0.28942886,0
0.6188512,0.2705702,0
0.51407903,0.3069295,0
0.59783363,0.35575846,0
0.61264455,0.33169907,0
0.61584836,0.27659348,0
0.76347595,0.3473712,0
0.5331491,0.37743545,0
0.7778139,0.3149099,0
0.7326862,0.30604744,0
0.60350144,0.23719312,0
0.73889387,0.3487183,0
0.51455075,0.31063104,0
0.53206915,0.32785532,0
0.49762997,0.29378805,0
0.45087972,0.4287677,0
0.52851003,0.34140563,0
0.5493594,0.46851683,0
0.55764985,0.3329393,0
0.63464224,0.32198605,0
0.71090007,0.26186457,0
0.6986924,0.29524502,0
0.67157644,0.24728571,0
0.74496335,0.29060876,0
0.8225411,0.31058908,0
0.7272806,0.25079533,0
0.6228938,0.3129065,0
0.5432735,0.39739218,0
0.7238411,0.32935548,0
0.5270015,0.3830284,0
0.68706226,0.38363516,0
0.74664694,0.32892147,0
0.60829526,0.4082945,0
0.72135615,0.28852117,0
0.7463942,0.2707685,0
0.6478868,0.40250003,0
0.6499105,0.36066926,0
0.51306385,0.3813369,0
0.77429485,0.36943763,0
0.64135367,0.2968667,0
0.57320076,0.32358184,0
0.7363732,0.29651302,0
0.49795383,0.3033066,0
0.56085193,0.27962366,0
0.6039063,0.31370756,0
0.62148666,0.45116538,0
0.6458993,0.2838855,0
0.53025645,0.25223944,0
0.59025705,0.31846818,0
0.5621702,0.2947619,0
0.6260677,0.28798437,0
0.70328605,0.2761814,0
0.709915,0.2727578,0
0.68365383,0.33917633,0
0.6762954,0.3016236,0
0.6229173,0.30174267,0
0.56917655,0.29181278,0
0.64397043,0.37664893,0
0.61353165,0.2769718,0
0.5018713,0.37491456,0
0.63526636,0.31285292,0
0.558531,0.32429695,0
0.52680403,0.3141844,0
0.6052572,0.34362558,0
0.7010266,0.33650413,0
0.7114043,0.22464834,0
0.46178555,0.38351223,0
0.6993212,0.23453942,0
0.76053524,0.22313328,0
0.6920291,0.26340422,0
0.56846184,0.2833154,0
0.73198766,0.21859027,0
0.64920634,0.32863516,0
0.6256886,0.29942766,0
0.63124585,0.2540041,0
0.76769537,0.34162617,0
0.7556406,0.29976472,0
0.57461536,0.31748363,0
0.6736403,0.28363797,0
0.68292063,0.27661344,0
0.53558195,0.35859376,0
0.57417953,0.33479342,0
0.6812827,0.25592995,0
0.5573643,0.26747733,0
0.450992,0.45778877,0
0.48221505,0.33933493,0
0.6095091,0.37553522,0
0.55600196,0.38601252,0
0.55824256,0.36100543,0
0.6048716,0.24126907,0
0.63488793,0.34509188,0
0.279402,0.49383587,0
0.6530519,0.296468,0
0.6430247,0.2972556,0
0.65486467,0.37930188,0
0.48074114,0.39560202,0
0.53329766,0.3438244,0
0.64061743,0.3007808,0
0.56080323,0.32453743,0
0.51221484,0.33391154,0
0.48860937,0.30522296,0
0.6360292,0.2687403,0
0.5788797,0.34052506,0
0.66913295,0.25192615,0
0.59677786,0.27444485,0
0.7526455,0.24160787,0
0.6753903,0.2621249,0
0.61409754,0.40700093,0
0.52398294,0.31460688,0
0.40978414,0.41325822,0
0.8009774,0.2332223,0
0.62697434,0.27904955,0
0.6610253,0.30656293,0
0.7612515,0.2521952,0
0.7652861,0.291035,0
0.6555563,0.27240393,0
0.7874202,0.23763584,0
0.792693,0.21913995,0
0.7712367,0.22426118,0
0.6848309,0.29736805,0
0.7866966,0.24333805,0
0.8117932,0.23575908,0
0.7259826,0.24791035,0
0.75915754,0.26850227,0
0.7495985,0.23319148,0
0.80171365,0.2915918,0
0.797051,0.29407367,0
0.8202682,0.30194584,0
0.63932943,0.26299918,0
0.7872535,0.3063713,0
0.76570994,0.24894223,0
0.6955891,0.2335986,0
0.7291138,0.27023345,0
0.74621004,0.24764468,0
0.7314252,0.22595626,0
0.6271157,0.2390973,0
0.6892155,0.23062034,0
0.7367313,0.2997855,0
0.7288571,0.2152011,0
0.66003627,0.2925998,0
0.6407463,0.3488582,0
0.7973752,0.23324811,0
0.7082883,0.25472394,0
0.710708,0.2836145,0
0.6990028,0.25328955,0
0.6221819,0.30367434,0
0.46344462,0.32913345,0
0.6880197,0.37220305,0
0.5602684,0.41020483,0
0.78853923,0.44502816,0
0.7214253,0.24941827,0
0.67260593,0.38982734,0
0.7142667,0.28367445,0
0.7150051,0.30401668,0
0.7430066,0.34675568,0
0.66720855,0.3046606,0
0.66657907,0.3331043,0
0.6073432,0.39051554,0
0.67247665,0.35485485,0
0.6080555,0.34749663,0
0.58949965,0.32400522,0
0.68527913,0.38480255,0
0.73205763,0.2828391,0
0.69218445,0.2870971,0
0.59362864,0.32173422,0
0.7899641,0.29031104,0
0.7968532,0.31958243,0
0.60011053,0.40258875,0
0.5260103,0.36238286,0
0.6519148,0.30327973,0
0.46516424,0.4927664,0
0.55770254,0.3772629,0
0.74219054,0.2644685,0
0.7173466,0.26819378,0
0.65564847,0.2961438,0
0.70015633,0.22390506,0
0.74669933,0.2648043,0
0.73500824,0.25334525,0
0.80986553,0.37781122,0
0.7150463,0.283596,0
0.69129366,0.395595,0
0.6804347,0.29290468,0
0.652042,0.2995681,0
0.7692551,0.36202648,0
0.42150068,0.38515702,0
0.44667146,0.34952658,0
0.49160084,0.33399874,0
0.5387735,0.3119207,0
0.8529013,0.28188822,0
0.43129805,0.38019356,0
0.4179906,0.3084399,0
0.4912411,0.38966942,0
0.5550758,0.42273995,0
0.61905307,0.38994455,0
0.6625159,0.33250332,0
0.65367925,0.22778764,0
0.65152687,0.31794217,0
0.4641363,0.34064764,0
0.49912596,0.3977317,0
0.775397,0.31801778,0
0.70088565,0.45394218,0
0.3743857,0.42078534,0
0.49770153,0.24775076,0
0.65451556,0.23014484,0
0.5648961,0.3076293,0
0.7196375,0.30926314,0
0.5506968,0.28379792,0
0.53002864,0.26603526,0
0.46722162,0.41602787,0
0.5594846,0.32665917,0
0.5649946,0.41256937,0
0.49106544,0.3308929,0
0.44840524,0.36562786,0
0.59396595,0.4550551,0
0.56013453,0.30265865,0
0.64440906,0.34992722,0
0.5336231,0.35450482,0
0.47139454,0.408312,0
0.6817556,0.32600817,0
0.667106,0.3075772,0
0.5419894,0.38245267,0
0.6499397,0.29103762,0
0.5819692,0.30109808,0
0.49063703,0.36466667,0
0.5882932,0.35576123,0
0.62853634,0.39487442,0
0.5734349,0.2939838,0
0.45415097,0.40679622,0
0.6243208,0.3677639,0
0.71705484,0.2860825,0
0.5890424,0.40541747,0
0.75569695,0.33335942,0
0.536073,0.49204838,0
0.7470926,0.300423,0
0.65882313,0.3049255,0
0.77930737,0.29407147,0
0.6958661,0.29113764,0
0.5332584,0.35736504,0
0.65008634,0.22932489,0
0.5845681,0.356833,0
0.49990317,0.31174225,0
0.49006847,0.36417767,0
0.78723544,0.3851293,0
0.5875797,0.2891499,0
0.58327067,0.48242885,0
0.5662346,0.35037607,0
0.6516334,0.25478753,0
0.5126639,0.38337696,0
0.56664634,0.33167112,0
0.5702808,0.33290413,0
0.6483511,0.27735665,0
0.5353336,0.4827888,0
0.60725003,0.30598423,0
0.69366074,0.28069124,0
0.57991624,0.29449618,0
0.56188154,0.34281936,0
0.74233675,0.22907892,0
0.6904344,0.23773684,0
0.5870656,0.37347823,0
0.5555024,0.2662699,0
0.71378356,0.23514284,0
0.7227352,0.26746154,0
0.7230443,0.37392658,0
0.62700814,0.32980055,0
0.62603676,0.2761654,0
0.5380237,0.3018895,0
0.58969945,0.30903783,0
0.5438845,0.33958936,0
0.50939566,0.3514593,0
0.6254562,0.3103448,0
0.54211414,0.3859996,0
0.58452505,0.32992452,0
0.7067429,0.34785283,0
0.6510368,0.265927,0
0.66230875,0.29517877,0
0.6989257,0.25943175,0
0.57504696,0.27955398,0
0.72573036,0.28024435,0
0.49122822,0.3204476,0
0.49799132,0.3332617,0
0.69712716,0.25044313,0
0.73594385,0.3478815,0
0.67146397,0.26606503,0
0.67952025,0.2539028,0
0.67286694,0.26223803,0
0.62473816,0.25693622,0
0.54743284,0.31084773,0
0.68586534,0.26349485,0
0.32286024,0.4619552,0
0.47449872,0.37794048,0
0.826853,0.28586438,0
0.58543617,0.33144078,0
0.76634526,0.29996422,0
0.57636034,0.28211072,0
0.76791644,0.2547189,0
0.5154653,0.31583512,0
0.45362964,0.341426,0
0.41858396,0.36429894,0
0.6813103,0.31818777,0
0.6080389,0.31015387,0
0.581654,0.31734902,0
0.5935769,0.31886438,0
0.4295193,0.38990825,0
0.5313898,0.3247823,0
0.5738047,0.29858845,0
0.47187838,0.35131046,0
0.6438175,0.48371682,0
0.5066673,0.4455094,0
0.5199621,0.28738156,0
0.55638784,0.28434265,0
0.4758883,0.3701478,0
0.5132452,0.31068826,0
0.51678514,0.31472874,0
0.6229372,0.25982568,0
0.6770541,0.3086756,0
0.71732074,0.2551667,0
0.77205634,0.2967151,0
0.6269318,0.22962311,0
0.6873208,0.20191316,0
0.6699296,0.24774131,0
0.46042824,0.37277117,0
0.74679863,0.27835223,0
0.52809817,0.47174132,0
0.7858989,0.2406237,0
0.56559604,0.3546698,0
0.54019386,0.34267288,0
0.63204575,0.29553333,0
0.6170996,0.3117961,0
0.6259051,0.24470067,0
0.7021248,0.26162094,0
0.54351604,0.2538222,0
0.48201847,0.33823845,0
0.5355789,0.35502648,0
0.75884485,0.23812175,0
0.49477544,0.34755978,0
0.5518654,0.36906648,0
0.4557537,0.38814473,0
0.6909233,0.24887912,0
0.68179566,0.31592798,0
0.5126688,0.2773797,0
0.50920683,0.2831303,0
0.6061425,0.3212631,0
0.5645659,0.33258575,0
0.58581173,0.32438418,0
0.57178015,0.32734978,0
0.6435356,0.30836815,0
0.55765414,0.37587014,0
0.6838169,0.25077176,0
0.61620784,0.45984054,0
0.5568182,0.29316688,0
0.57127213,0.30708793,0
0.5903005,0.27008665,0
0.57029295,0.30370474,0
0.53497535,0.39952645,0
0.50595963,0.3236119,0
0.47442177,0.37130708,0
0.6462187,0.32446036,0
0.5292354,0.4090864,0
0.5775196,0.34820518,0
0.4969398,0.3289987,0
0.4697474,0.34340364,0
0.77673966,0.24719681,0
0.5799819,0.30135816,0
0.51382977,0.30145174,0
0.470933,0.2896749,0
0.7217573,0.27467328,0
0.6526711,0.26563847,0
0.5874452,0.28722113,0
0.76037824,0.24025954,0
0.5278205,0.2998237,0
0.6860156,0.3430052,0
0.49089488,0.39332598,0
0.7260986,0.26906252,0
0.4645207,0.38367444,0
0.6542194,0.2913438,0
0.4823808,0.33245227,0
0.78289306,0.2395442,0
0.3800773,0.3915262,0
0.43300253,0.30818385,0
0.8434046,0.25744534,0
0.46848977,0.35269472,0
0.48530504,0.32588604,0
0.5533834,0.3202371,0
0.6110974,0.312657,0
0.57617414,0.25154164,0
0.59616697,0.33048895,0
0.6684388,0.3086671,0
0.5068886,0.46513915,0
0.74272543,0.3006165,0
0.7765887,0.25293314,0
0.55346304,0.25450873,0
0.6144368,0.4138231,0
0.76242024,0.31077144,0
0.6879063,0.25679082,0
0.5346194,0.29343125,0
0.48532957,0.27340984,0
0.45675108,0.3750677,0
0.7600664,0.29254255,0
0.46422166,0.40487057,0
0.71019673,0.28813967,0
0.59177846,0.3170666,0
0.4898745,0.31923348,0
0.6796917,0.30177003,0
0.5416348,0.24930899,0
0.54080385,0.34664857,0
0.688908,0.25842986,0
0.6026479,0.2517468,0
0.5801942,0.28698742,0
0.5430849,0.33974764,0
0.64519525,0.2790539,0
0.55504876,0.38631848,0
0.54189473,0.2976273,0
0.5574444,0.30890206,0
0.71215075,0.2459818,0
0.5766573,0.33346272,0
0.5749536,0.3193493,0
0.7456599,0.31218693,0
0.6463168,0.32513416,0
0.37344733,0.36949363,0
0.4075645,0.32617724,0
0.5047665,0.3082143,0
0.5814625,0.36419004,0
0.523065,0.3686816,0
0.67118317,0.24948527,0
0.5258635,0.35831642,0
0.54414296,0.34873644,0
0.49568623,0.36440954,0
0.58480936,0.29112715,0
0.49311608,0.44372568,0
0.6564461,0.39964685,0
0.49597842,0.33164853,0
0.7205129,0.23380888,0
0.53470266,0.34376654,0
0.56155187,0.38731343,0
0.47573227,0.39270854,0
0.7926275,0.26382005,0
0.59321195,0.28481236,0
0.35524002,0.40613973,0
0.632852,0.23088276,0
0.7208684,0.3063748,0
0.55405414,0.38215604,0
0.5247789,0.45690364,0
0.6229107,0.3811668,0
0.45422116,0.3904353,0
0.44000956,0.34391633,0
0.41188127,0.41495138,0
0.5235061,0.3481423,0
0.43544015,0.39311564,0
0.65284747,0.31124943,0
0.61163926,0.37087482,0
0.5502315,0.38556957,0
0.6109733,0.29266816,0
0.5750267,0.30831173,0
0.48407298,0.29452854,0
0.622835,0.27092624,0
0.5531363,0.36399361,0
0.5384347,0.33820114,0
0.7016548,0.3964555,0
0.57288265,0.37206933,0
0.6697748,0.32407656,0
0.53896284,0.28752452,0
0.5399678,0.2936734,0
0.7356347,0.26001927,0
0.8175534,0.26278776,0
0.5951311,0.32725593,0
0.5265663,0.35879475,0
0.5870571,0.37873372,0
0.46742734,0.35070798,0
0.6700283,0.28145376,0
0.5344423,0.3351576,0
0.6713971,0.23259187,0
0.511635,0.35663587,0
0.5520973,0.37708762,0
0.79414165,0.239171,0
0.5247697,0.31185898,0
0.48243502,0.40501997,0
0.4534921,0.3343455,0
0.5522836,0.34967005,0
0.4524877,0.31319967,0
0.61239505,0.32327616,0
0.42682946,0.34107724,0
0.5806911,0.39936516,0
0.5863887,0.29273456,0
0.59572494,0.2517355,0
0.66877544,0.2755944,0
0.5837914,0.41415113,0
0.30086204,0.5189104,0
0.5432632,0.31868434,0
0.5317639,0.27766693,0
0.6326856,0.30941182,0
0.62740576,0.39447802,0
0.49037787,0.30136803,0
0.46591642,0.35855532,0
0.4307592,0.35657316,0
0.51007414,0.4105763,0
0.47659913,0.37846628,0
0.42016268,0.34470502,0
0.50988877,0.36804867,0
0.6983954,0.23393147,0
0.6054848,0.30097345,0
0.44473436,0.28789958,0
0.64061034,0.29547763,0
0.5695993,0.3691475,0
0.6730703,0.28754428,0
0.5509732,0.26283303,0
0.5946544,0.45164362,0
0.4927932,0.40018222,0
0.7430526,0.38829935,0
0.433381,0.33942106,0
0.7542486,0.22630183,0
0.6399465,0.28077272,0
0.6811334,0.2372607,0
0.62071955,0.30293396,0
0.6440112,0.355355,0
0.5541234,0.33184823,0
0.47592118,0.2789663,0
0.7208759,0.22184537,0
0.42651486,0.3751213,0
0.5221019,0.38999107,0
0.5245803,0.33429173,0
0.684397,0.22574037,0
0.5341964,0.35546404,0
0.5505643,0.3103168,0
0.7742128,0.23609507,0
0.5574207,0.37886584,0
0.5808661,0.32746968,0
0.7042289,0.3191721,0
0.48092604,0.3213952,0
0.5582198,0.3591977,0
0.43221623,0.32662642,0
0.41940215,0.3953501,0
0.48506907,0.43697685,0
0.46494725,0.42950282,0
0.51555675,0.2916232,0
0.52673984,0.4779848,0
0.46543044,0.3012102,0
0.51177305,0.31419435,0
0.62032247,0.47274086,0
0.5009754,0.37121284,0
0.40582213,0.3822432,0
0.30562666,0.44158044,0
0.37844047,0.38922283,0
0.6978383,0.33359978,0
0.43545276,0.32978693,0
0.6371063,0.24465267,0
0.5247835,0.38259193,0
0.47009477,0.33696947,0
0.54190975,0.27658078,0
0.4832632,0.2883846,0
0.51518464,0.35811892,0
0.4971152,0.31476462,0
0.6219142,0.31022125,0
0.59722304,0.2684442,0
0.41408837,0.52640635,0
0.6306291,0.30860314,0
0.3004076,0.5325269,0
0.543583,0.35094416,0
0.51329744,0.3966225,0
0.5071561,0.50775063,0
0.35681695,0.49540913,0
0.7535261,0.25809798,0
0.57889324,0.31665212,0
0.532644,0.30336788,0
0.65030414,0.24779102,0
0.71582085,0.27754465,0
0.69596815,0.27685842,0
0.58130383,0.29025096,0
0.7516127,0.29654798,0
0.57929355,0.30480945,0
0.64296305,0.26473528,0
0.52617806,0.27806753,0
0.82787466,0.22672512,0
0.6109836,0.25888515,0
0.75163424,0.26172048,0
0.5034425,0.36545938,0
0.5279132,0.29663235,0
0.59193534,0.35831964,0
0.5599268,0.27252197,0
0.46986347,0.33919525,0
0.497851,0.28034094,0
0.45765734,0.37857312,0
0.4080026,0.365781,0
0.62416,0.32574266,0
0.5490931,0.31822616,0
0.56449765,0.29900172,0
0.5456734,0.25235277,0
0.6463775,0.25661206,0
0.6232402,0.24519862,0
0.541917,0.31895062,0
0.54970115,0.4269621,0
0.6636015,0.28444383,0
0.56123817,0.25296715,0
0.7298522,0.24575776,0
0.79455304,0.33667985,0
0.64306265,0.5749538,0
0.5541221,0.3580834,0
0.44490522,0.38026297,0
0.6456073,0.28560796,0
0.5420565,0.3011757,0
0.63320524,0.27149788,0
0.6374668,0.32593495,0
0.5457179,0.31889892,0
0.6083619,0.29407555,0
0.8362143,0.2754527,0
0.6669348,0.2736751,0
0.51648045,0.2867552,0
0.654273,0.34177074,0
0.632997,0.2272233,0
0.66602474,0.2540856,0
0.5822248,0.31941253,0
0.62320393,0.2546555,0
0.6010536,0.34845883,0
0.47525316,0.3181753,0
0.5132718,0.293338,0
0.67186874,0.27830973,0
0.6866109,0.27804106,0
0.61572635,0.25757116,0
0.34199777,0.36957908,0
0.6315539,0.29099086,0
0.53512496,0.3062336,0
0.5167265,0.30797508,0
0.4748806,0.4096681,0
0.6557637,0.29115131,0
0.6158466,0.2210771,0
0.32205823,0.4271001,0
0.73577976,0.22083114,0
0.44271553,0.421915,0
0.54979503,0.31066868,0
0.61672217,0.389972,0
0.71977067,0.2544917,0
0.5128057,0.32388762,0
0.49530065,0.3323038,0
0.40739843,0.36310485,0
0.5650418,0.33163616,0
0.5172528,0.33472973,0
0.45356175,0.33133423,0
0.48169795,0.39185086,0
0.52171,0.39124992,0
0.4656726,0.3326807,0
0.64120567,0.29720742,0
0.55083877,0.27060097,0
0.80580074,0.2609816,0
0.41851535,0.37836343,0
0.52506584,0.30122998,0
0.6908339,0.24830638,0
0.6187119,0.28832227,0
0.3655547,0.4076686,0
0.7762578,0.35786346,0
0.66607106,0.25491297,0
0.62688476,0.3253323,0
0.6261547,0.2569397,0
0.45589668,0.4313864,0
0.61701787,0.33773378,0
0.7401449,0.33119577,0
0.4001544,0.32826927,0
0.57069105,0.3386717,0
0.63691264,0.31532,0
0.6537337,0.281467,0
0.4963994,0.34464732,0
0.49977005,0.34003383,0
0.48773286,0.36177486,0
0.42267495,0.3423726,0
0.504958,0.31453118,0
0.59617597,0.33368534,0
0.5707568,0.2555545,0
0.7160872,0.27463752,0
0.46918693,0.30946857,0
0.5344367,0.33958942,0
0.5181277,0.27148366,0
0.4689477,0.31338283,0
0.34670174,0.433528,0
0.7167232,0.2930256,0
0.5655833,0.28831849,0
0.7328495,0.22171916,0
0.41141862,0.38366064,0
0.6576576,0.2937347,0
0.69875455,0.30357915,0
0.534695,0.29404157,0
0.55024564,0.34047633,0
0.5974672,0.3641129,0
0.33812678,0.38385835,0
0.74849874,0.23730649,0
0.5065661,0.2922708,0
0.5662478,0.38559365,0
0.44844544,0.38196257,0
0.66270584,0.338709,0
0.69952005,0.30873385,0
0.6673233,0.3292724,0
0.6292431,0.29723957,0
0.7996442,0.27557182,0
0.47822207,0.3835798,0
0.6797093,0.25389102,0
0.7232481,0.28157353,0
0.66249615,0.40648526,0
0.44011095,0.37677386,0
0.5102858,0.35000122,0
0.1390574,0.7183346,1
0.18506713,0.813081,1
0.117584154,0.7397236,1
0.27365124,0.78692067,1
0.12272468,0.72875315,1
0.17746922,0.66142696,1
0.14231138,0.7767737,1
0.2221818,0.7800837,1
0.16378035,0.52313393,1
0.18954587,0.7770598,1
0.15274961,0.5790344,1
0.14774156,0.7084225,1
0.19227973,0.6868484,1
0.15088072,0.73615444,1
0.19484429,0.76691216,1
0.16792595,0.62067705,1
0.11594444,0.7388408,1
0.17036903,0.78407234,1
0.16016,0.68385375,1
0.17115165,0.78602934,1
0.2399114,0.6026903,1
0.14602944,0.7629562,1
0.18739754,0.59916806,1
0.18944885,0.70139045,1
0.20342958,0.51142156,1
0.1467336,0.64670014,1
0.16675578,0.80437505,1
0.17584425,0.78491163,1
0.17549962,0.5787466,1
0.17517209,0.6770883,1
0.17724647,0.4797839,1
0.19709732,0.68316966,1
0.16785082,0.50734276,1
0.15664151,0.5820128,1
0.16535479,0.534469,1
0.15729807,0.5679597,1
0.16941497,0.65952283,1
0.23062399,0.58611363,1
0.1668775,0.64412063,1
0.15879181,0.7794851,1
0.12864034,0.6498533,1
0.17944832,0.5685628,1
0.17413065,0.7643832,1
0.13967668,0.70630586,1
0.1610689,0.77495456,1
0.17558567,0.8087691,1
0.15726852,0.73817384,1
0.17017248,0.7651131,1
0.17131297,0.7180948,1
0.13786042,0.7151262,1
0.19233938,0.49923193,1
0.17412713,0.7754977,1
0.19335952,0.824507,1
0.1596798,0.64304155,1
0.22303365,0.5650783,1
0.157053,0.6538804,1
0.26521853,0.63621247,1
0.11595187,0.6897417,1
0.17169459,0.5886657,1
0.14578861,0.4709852,1
0.16536908,0.44985625,1
0.1822632,0.48148784,1
0.14017342,0.5380056,1
0.22836751,0.8111008,1
0.1586965,0.52011967,1
0.14658974,0.49591145,1
0.14098278,0.6412801,1
0.22539051,0.8370001,1
0.14076467,0.59206027,1
0.15381785,0.6648969,1
0.1563005,0.6127608,1
0.20500988,0.82556355,1
0.18423139,0.43820113,1
0.14538598,0.607639,1
0.16605294,0.77680296,1
0.16227263,0.80074006,1
0.15263532,0.4051486,1
0.1518431,0.7227306,1
0.14621586,0.59864813,1
0.20655851,0.7890307,1
0.17164336,0.6072641,1
0.15201592,0.75934184,1
0.16010337,0.7992692,1
0.124008685,0.5292479,1
0.21859628,0.8107082,1
0.11067091,0.54596287,1
0.17425852,0.8116798,1
0.17029874,0.7916571,1
0.14315788,0.7513758,1
0.18364477,0.79828835,1
0.26630443,0.842243,1
0.16630705,0.5358103,1
0.14717215,0.57996076,1
0.16164517,0.7353726,1
0.1629759,0.78477204,1
0.15221986,0.7686626,1
0.13611734,0.7248954,1
0.1391454,0.64358974,1
0.16046254,0.5586901,1
0.17419711,0.44660184,1
0.25862315,0.83675146,1
0.12845023,0.66498303,1
0.21674077,0.817184,1
0.12413232,0.6794883,1
0.11885194,0.7291605,1
0.14166863,0.56138813,1
0.14550814,0.69000095,1
0.15697005,0.64177966,1
0.13490367,0.67412966,1
0.22368583,0.73419094,1
0.15555376,0.7337572,1
0.22703114,0.7469816,1
0.15446083,0.5294847,1
0.16059844,0.45242992,1
0.15462938,0.76607466,1
0.14003208,0.74633527,1
0.15553254,0.549297,1
0.1555174,0.78491247,1
0.16906244,0.5717479,1
0.118467875,0.72983956,1
0.14997283,0.77784985,1
0.13132365,0.58382475,1
0.13652104,0.7791815,1
0.17590955,0.78592914,1
0.15672472,0.6577709,1
0.22809005,0.67481697,1
0.14432935,0.62045217,1
0.13958003,0.5254737,1
0.20404984,0.7514632,1
0.13754345,0.75908196,1
0.1462352,0.60193837,1
0.20768598,0.77640367,1
0.14803752,0.74584824,1
0.14047371,0.7666663,1
0.16099948,0.6788705,1
0.1676113,0.6265643,1
0.16906452,0.5164872,1
0.14173405,0.6105997,1
0.28518075,0.76162946,1
0.20581,0.733661,1
0.1758861,0.65323555,1
0.17536382,0.6192209,1
0.2264966,0.6001685,1
0.15484317,0.6436107,1
0.21032025,0.54409057,1
0.13796143,0.6387464,1
0.1953514,0.57943934,1
0.13131239,0.637479,1
0.15094563,0.68703675,1
0.16921891,0.6018255,1
0.119519755,0.7376388,1
0.16317068,0.6999873,1
0.17057867,0.70977646,1
0.19722013,0.6062832,1
0.15424211,0.636367,1
0.20010798,0.66583645,1
0.15915646,0.7807224,1
0.22176032,0.61107236,1
0.1571933,0.724906,1
0.20350856,0.76445746,1
0.16071114,0.78190315,1
0.15781923,0.6607915,1
0.17375487,0.7000474,1
0.17943862,0.68296456,1
0.18589199,0.7055504,1
0.19362928,0.8147713,1
0.22288342,0.6739735,1
0.16529045,0.71571434,1
0.14228679,0.7762557,1
0.19493756,0.56498355,1
0.1593036,0.7905957,1
0.121695146,0.7390001,1
0.1500215,0.76355314,1
0.15180048,0.65010875,1
0.19026451,0.6593215,1
0.28014985,0.7402791,1
0.13658392,0.76022506,1
0.1886766,0.82093394,1
0.13824451,0.7480441,1
0.14546968,0.74748415,1
0.17539997,0.6562545,1
0.15124688,0.7861523,1
0.18142828,0.5407891,1
0.2014839,0.7974899,1
0.17295276,0.55566293,1
0.20713449,0.7322631,1
0.1916444,0.7340192,1
0.14411704,0.56820023,1
0.22777176,0.8342474,1
0.2297414,0.7447525,1
0.16391835,0.78951204,1
0.14873339,0.77171236,1
0.1786985,0.8055859,1
0.168594,0.67338246,1
0.1714137,0.5652203,1
0.18798487,0.5389896,1
0.23374309,0.8328428,1
0.17997593,0.51447576,1
0.14921671,0.7103694,1
0.18377845,0.7010032,1
0.21248768,0.6890203,1
0.20628688,0.55151564,1
0.18352881,0.7476125,1
0.15905312,0.6825694,1
0.22646159,0.82334006,1
0.17576523,0.6678809,1
0.18108517,0.6258037,1
0.24118383,0.73243964,1
0.21776477,0.7548615,1
0.19021788,0.5603888,1
0.1702168,0.5154849,1
0.15865923,0.5943689,1
0.19160812,0.58269125,1
0.16172461,0.5976381,1
0.16994473,0.7372077,1
0.25734815,0.7679671,1
0.14094685,0.69975686,1
0.22491932,0.5559354,1
0.14910452,0.516931,1
0.18813531,0.6804285,1
0.1923573,0.54236615,1
0.16805895,0.5616632,1
0.15451093,0.7859531,1
0.26702887,0.76620555,1
0.27564484,0.74447614,1
0.2957492,0.7202186,1
0.1757281,0.57979023,1
0.24243584,0.73536277,1
0.28849253,0.784419,1
0.24929895,0.7041867,1
0.26449698,0.7695957,1
0.24843904,0.7907287,1
0.23586486,0.72500265,1
0.16930789,0.5171543,1
0.2253304,0.825972,1
0.20205678,0.6402871,1
0.2702452,0.77729136,1
0.15192951,0.5197912,1
0.31547752,0.67192465,1
0.324423,0.6522326,1
0.1508746,0.61310124,1
0.16592297,0.5637514,1
0.17666046,0.456745,1
0.1678443,0.50179255,1
0.2098784,0.6530389,1
0.17264378,0.47973743,1
0.209984,0.5302974,1
0.20199087,0.58569276,1
0.22299436,0.7434222,1
0.14116356,0.49994838,1
0.21297573,0.6761639,1
0.15609138,0.7585089,1
0.15714598,0.769258,1
0.21799536,0.81762546,1
0.16461267,0.5783666,1
0.16739069,0.82093245,1
0.14117432,0.6739345,1
0.1453072,0.7624233,1
0.2377664,0.80174977,1
0.15045184,0.7471487,1
0.17083462,0.5000993,1
0.12473436,0.7549611,1
0.25356933,0.7672797,1
0.16492637,0.4817192,1
0.33158627,0.6537694,1
0.1757097,0.8154952,1
0.2139628,0.83219516,1
0.30344906,0.6387918,1
0.29401916,0.6688496,1
0.24462831,0.71449524,1
0.22635843,0.6991058,1
0.23150958,0.81824476,1
0.24873008,0.6006817,1
0.2604541,0.74782896,1
0.31152663,0.6746646,1
0.25298956,0.7899783,1
0.11195331,0.70702726,1
0.12914227,0.7598713,1
0.17310984,0.6223676,1
0.16411765,0.62302476,1
0.14268832,0.759599,1
0.15374841,0.7616701,1
0.13770477,0.5167114,1
0.17927282,0.724749,1
0.12445124,0.54698485,1
0.112391375,0.7304186,1
0.12927254,0.7594618,1
0.15902229,0.5790336,1
0.1267504,0.5124616,1
0.19962406,0.73842764,1
0.13183852,0.5227797,1
0.13155547,0.54482776,1
0.19506331,0.65438765,1
0.12807126,0.74612164,1
0.10714024,0.6030798,1
0.14992784,0.78934073,1
0.14461921,0.48442924,1
0.19612995,0.5141213,1
0.14023769,0.7695023,1
0.16483894,0.56965894,1
0.12256429,0.7588657,1
0.21147625,0.4740783,1
0.15230267,0.77763647,1
0.15100743,0.79177284,1
0.13173966,0.76373655,1
0.1992659,0.67029387,1
0.116098255,0.6803452,1
0.19448677,0.77670336,1
0.15113169,0.7296014,1
0.22447987,0.7097176,1
0.20712997,0.77461815,1
0.16719875,0.59471995,1
0.21919926,0.80208516,1
0.13595627,0.7344236,1
0.17401524,0.7283232,1
0.20293003,0.68072206,1
0.19308725,0.6414015,1
0.178672,0.6665375,1
0.16785131,0.80397284,1
0.18574557,0.5709695,1
0.14519185,0.72404265,1
0.14739902,0.71732074,1
0.15490931,0.6487975,1
0.16196963,0.7198132,1
0.19883853,0.6780642,1
0.21975069,0.7292964,1
0.16521205,0.46239382,1
0.18980892,0.6171265,1
0.17124867,0.47395054,1
0.23192991,0.7310121,1
0.119417615,0.71312946,1
0.17685819,0.6611248,1
0.1436383,0.60810935,1
0.13207273,0.7483483,1
0.12269173,0.7467228,1
0.2032121,0.80640763,1
0.123340115,0.7446113,1
0.22563766,0.82664484,1
0.1645709,0.7606572,1
0.19250232,0.6906245,1
0.19616312,0.7054107,1
0.21662407,0.82496,1
0.19726059,0.81285787,1
0.20425294,0.61838907,1
0.11956315,0.7060093,1
0.15053426,0.60010916,1
0.13129784,0.72802585,1
0.1562742,0.5819623,1
0.15651959,0.56644964,1
0.16457047,0.6155044,1
0.2383669,0.8405692,1
0.1280761,0.70427454,1
0.15332878,0.42228642,1
0.12341669,0.7440985,1
0.14603916,0.5693481,1
0.22543976,0.8361571,1
0.1614332,0.5458441,1
0.10474229,0.70704967,1
0.17903814,0.4774333,1
0.17136972,0.4991091,1
0.13993342,0.72623366,1
0.22673164,0.8244744,1
0.14249465,0.4910785,1
0.15186802,0.7925394,1
0.17360507,0.6716427,1
0.17148888,0.81487626,1
0.17053334,0.7835092,1
0.16634808,0.7665064,1
0.2123629,0.6749872,1
0.15344779,0.79169184,1
0.15621172,0.77321047,1
0.20788498,0.7273043,1
0.2287831,0.81672525,1
0.1524728,0.784854,1
0.15708448,0.76450086,1
0.1982318,0.7551628,1
0.21239589,0.6661587,1
0.09852064,0.70828056,1
0.12857127,0.74186903,1
0.14198934,0.76286566,1
0.19026034,0.7290177,1
0.1892668,0.78864056,1
0.12843978,0.74724054,1
0.13871464,0.5439964,1
0.1855819,0.79295343,1
0.15799727,0.7469874,1
0.12419584,0.750317,1
0.11264857,0.7189991,1
0.19831249,0.71973485,1
0.12570283,0.6761426,1
0.15599051,0.6607119,1
0.195483,0.8066958,1
0.16043505,0.5450468,1
0.30910736,0.7313439,1
0.11669291,0.66973233,1
0.10451438,0.71070224,1
0.15517062,0.7542973,1
0.12360071,0.7471929,1
0.1546744,0.7550881,1
0.11555935,0.7017575,1
0.14438775,0.75615907,1
0.10561233,0.7126915,1
0.12786585,0.66863346,1
0.13003111,0.7478802,1
0.11984139,0.721926,1
0.11318122,0.70239395,1
0.15865049,0.7994803,1
0.15412156,0.79415387,1
0.14303097,0.79229033,1
0.10684631,0.7035519,1
0.095047854,0.6854192,1
0.11139914,0.63935846,1
0.13635159,0.77623606,1
0.14599231,0.5438704,1
0.097675994,0.6381809,1
0.12926795,0.7520729,1
0.22770944,0.7765288,1
0.12945414,0.7306992,1
0.12525168,0.74553686,1
0.21630168,0.8248887,1
0.14935884,0.7401376,1
0.15098567,0.789258,1
0.18789053,0.8138825,1
0.13651721,0.7697458,1
0.1172205,0.7322204,1
0.14203899,0.72052336,1
0.14255017,0.7617084,1
0.13143001,0.76466715,1
0.113778494,0.624974,1
0.12321885,0.71832794,1
0.121515125,0.6093673,1
0.22753857,0.6383975,1
0.21199796,0.7374611,1
0.18064204,0.7273804,1
0.11144389,0.6931476,1
0.17076232,0.48988187,1
0.12423144,0.77568746,1
0.13193184,0.76945764,1
0.1499614,0.6649191,1
0.16278951,0.64771855,1
0.18613203,0.8223407,1
0.118228674,0.7314656,1
0.111507416,0.72677326,1
0.18766111,0.76860046,1
0.116752535,0.7345639,1
0.11734238,0.7423862,1
0.103491195,0.6980568,1
0.11708419,0.7178546,1
0.16895613,0.7669649,1
0.13402568,0.75426924,1
0.13135323,0.76864666,1
0.17138426,0.8126943,1
0.12332058,0.7206925,1
0.11295957,0.71889216,1
0.18043828,0.6646497,1
0.14635025,0.7751301,1
0.14785333,0.75621074,1
0.10914444,0.698424,1
0.1638633,0.76129705,1
0.13074608,0.75027674,1
0.17133181,0.6232382,1
0.21530981,0.7625815,1
0.12444777,0.7547903,1
0.12725794,0.77002436,1
0.12775351,0.7191296,1
0.20289226,0.81430733,1
0.23611382,0.5902158,1
0.12702414,0.7422819,1
0.17317292,0.55031914,1
0.18898909,0.81039375,1
0.15197054,0.7774045,1
0.14380473,0.7704314,1
0.13578099,0.7661654,1
0.14115691,0.77658004,1
0.14413361,0.75807476,1
0.19249131,0.6837549,1
0.13574359,0.7272539,1
0.0923669,0.71953744,1
0.17444836,0.80609745,1
0.12000212,0.7072489,1
0.12739916,0.72236824,1
0.14644569,0.54389256,1
0.11711973,0.7245925,1
0.16324687,0.80465895,1
0.13756007,0.66222554,1
0.09512517,0.66771173,1
0.110893205,0.7164059,1
0.14720212,0.56847894,1
0.11153437,0.65351844,1
0.103283174,0.7097807,1
0.15352711,0.78194475,1
0.14339954,0.7699005,1
0.13335791,0.733473,1
0.1422768,0.7595759,1
0.13247795,0.7182373,1
0.13098383,0.73353773,1
0.15791215,0.7805345,1
0.2260648,0.53245354,1
0.11558593,0.7280143,1
0.15233451,0.7216582,1
0.114129856,0.7097247,1
0.15603632,0.7585918,1
0.10443307,0.60619766,1
0.14672762,0.75545025,1
0.15082766,0.78692746,1
0.20324995,0.8281804,1
0.11497775,0.73623866,1
0.1636724,0.6756713,1
0.124497965,0.7058647,1
0.1356673,0.6937049,1
0.11416196,0.72978103,1
0.15409723,0.7959331,1
0.16372864,0.7956104,1
0.114799865,0.6972453,1
0.14932472,0.5262302,1
0.1577397,0.6614115,1
0.104341134,0.6517704,1
0.12871513,0.6137226,1
0.14044929,0.76196843,1
0.12115577,0.7255281,1
0.12608144,0.70996857,1
0.12935725,0.74567145,1
0.30116048,0.7271361,1
0.15225394,0.7899998,1
0.1422836,0.72425044,1
0.16259114,0.5103475,1
0.14775272,0.60710466,1
0.26372644,0.5997402,1
0.14002219,0.77398926,1
0.10356141,0.6512482,1
0.09900328,0.68633395,1
0.16347629,0.79506785,1
0.14677851,0.7860436,1
0.16838773,0.7993964,1
0.19504635,0.8253608,1
0.09868581,0.6782878,1
0.15112035,0.74958897,1
0.14255013,0.77222204,1
0.18536142,0.79274106,1
0.13327952,0.67203856,1
0.10373949,0.67914623,1
0.1142976,0.559411,1
0.10314762,0.6777143,1
0.21440288,0.8236731,1
0.11586916,0.71390784,1
0.17100535,0.74406374,1
0.12894706,0.73954964,1
0.12493045,0.649203,1
0.13485919,0.73332006,1
0.117541745,0.7552613,1
0.14288966,0.68246883,1
0.13827315,0.721324,1
0.10463799,0.7222695,1
0.110956,0.6478048,1
0.14633635,0.73817027,1
0.17400084,0.80028087,1
0.1389105,0.6420012,1
0.13505547,0.7501605,1
0.15508221,0.7757217,1
0.17930703,0.57034934,1
0.1122241,0.684912,1
0.088295594,0.67174447,1
0.13216512,0.76882565,1
0.20841636,0.8187127,1
0.17241222,0.5278957,1
0.22532274,0.7404981,1
0.16409427,0.7190281,1
0.10916435,0.70231616,1
0.1576235,0.6448089,1
0.11096224,0.7229516,1
0.23992,0.8144062,1
0.11077655,0.72968245,1
0.20794031,0.80403644,1
0.14498901,0.7687775,1
0.14338185,0.6049608,1
0.1438015,0.72644377,1
0.13962996,0.76705796,1
0.12564906,0.702304,1
0.12274696,0.6970166,1
0.14062327,0.662347,1
0.14226297,0.7932725,1
0.09118481,0.6823615,1
0.17225495,0.777376,1
0.13894215,0.7434379,1
0.12114097,0.7357998,1
0.11161851,0.7121391,1
0.1621429,0.7943284,1
0.139969,0.7692341,1
0.1309297,0.74322367,1
0.13875772,0.55113125,1
0.10927614,0.71131796,1
0.117955804,0.7511157,1
0.1116844,0.72656137,1
0.108374864,0.6584248,1
0.14041004,0.47350484,1
0.15191905,0.7522076,1
0.14948787,0.75180525,1
0.10903578,0.70958096,1
0.17372543,0.8160767,1
0.12512453,0.59471065,1
0.15167558,0.7844401,1
0.10126432,0.6621042,1
0.16877633,0.703647,1
0.13698383,0.7519535,1
0.12701507,0.7199191,1
0.12666489,0.7167511,1
0.12657109,0.74555004,1
0.117962345,0.70759916,1
0.13168268,0.7252482,1
0.11796577,0.7443494,1
0.13317776,0.76449835,1
0.14601724,0.75463253,1
0.15107095,0.7833503,1
0.14221303,0.785846,1
0.1372462,0.7630295,1
0.15166345,0.7761966,1
0.20849666,0.7882214,1
0.20879135,0.57862973,1
0.14099537,0.7616409,1
0.13825609,0.7470224,1
0.15136267,0.4205602,1
0.1406126,0.77050245,1
0.14075737,0.77800316,1
0.14033113,0.76771706,1
0.1095573,0.7132389,1
0.10029616,0.7064288,1
0.12134184,0.72695017,1
0.21311797,0.7665064,1
0.18450001,0.8154475,1
0.16651477,0.6218784,1
0.113868184,0.6830679,1
0.18068273,0.8146206,1
0.18270247,0.7602909,1
0.13271178,0.7732863,1
0.1155283,0.68665063,1
0.1385746,0.7227212,1
0.08649519,0.666501,1
0.19689095,0.8089593,1
0.12571345,0.7675335,1
0.10911816,0.7073097,1
0.11193851,0.7327144,1
0.1684618,0.79513425,1
0.14509289,0.721878,1
0.13995098,0.76903194,1
0.09525892,0.6695793,1
0.14419547,0.7748168,1
0.13019422,0.7535018,1
0.16712603,0.80547935,1
0.14288773,0.7799982,1
0.13075145,0.7703915,1
0.15717843,0.75507873,1
0.10174573,0.71325314,1
0.1538167,0.7799366,1
0.12516604,0.74665403,1
0.17297328,0.81284964,1
0.17547289,0.81159705,1
0.12900715,0.72748893,1
0.113919266,0.6686232,1
0.14262357,0.67954093,1
0.11584957,0.5446098,1
0.1283372,0.6824709,1
0.10230006,0.6935773,1
0.1465249,0.625135,1
0.17208153,0.82148147,1
0.10779783,0.69118136,1
0.22256711,0.769607,1
0.09433673,0.66454506,1
0.12970795,0.7513325,1
0.14256614,0.7275712,1
0.10806092,0.7245788,1
0.1608344,0.7899428,1
0.15287243,0.7849356,1
0.13096508,0.70243615,1
0.12229591,0.712015,1
0.13574469,0.6169432,1
0.12888938,0.73012376,1
0.22552742,0.8082885,1
0.14154157,0.7788879,1
0.12166677,0.70833695,1
0.18887943,0.803174,1
0.14748569,0.78885424,1
0.18481411,0.6541608,1
0.15893973,0.80564696,1
0.14102435,0.77201754,1
0.10524579,0.70523196,1
0.16451737,0.796102,1
0.10953544,0.7356252,1
0.21197662,0.8185852,1
0.112395786,0.6984075,1
0.15718675,0.76295716,1
0.17626482,0.6913097,1
0.2239106,0.7809038,1
0.13073039,0.7449391,1
0.11780754,0.75819254,1
0.107480444,0.7414328,1
0.12405742,0.7544709,1
0.17065963,0.6504564,1
0.21064928,0.8292279,1
0.108514056,0.70087856,1
0.10920386,0.7388067,1
0.1359396,0.7348066,1
0.14563642,0.78678477,1
0.13532153,0.76569974,1
0.1506904,0.7777531,1
0.16218252,0.57748985,1
0.12765256,0.76216763,1
0.109660156,0.6847981,1
0.0992296,0.66962683,1
0.12006317,0.7328147,1
0.12168467,0.7334852,1
0.20997868,0.79210657,1
0.14517407,0.76921296,1
0.12961964,0.76174164,1
0.17451972,0.72349715,1
0.11281329,0.7019335,1
0.109325774,0.70756745,1
0.10382889,0.68673235,1
0.10372537,0.7006719,1
0.12483889,0.6330619,1
0.15380292,0.70563847,1
0.13547847,0.7615036,1
0.16407487,0.7872451,1
0.15239006,0.65274304,1
0.21976058,0.7809246,1
0.13761087,0.68924963,1
0.12226016,0.6926331,1
0.15031208,0.779235,1
0.143444,0.7679019,1
0.11677323,0.6881978,1
0.15284127,0.7735217,1
0.09780099,0.67790204,1
0.13468045,0.77209723,1
0.18204653,0.79106086,1
0.11861486,0.7334004,1
0.16640937,0.809193,1
0.13392273,0.74787974,1
0.10548912,0.69923186,1
0.113508664,0.70355994,1
0.11678784,0.71733826,1
0.122219175,0.74470055,1
0.12597299,0.760126,1
0.10258378,0.7134278,1
0.09267008,0.7035908,1
0.12228714,0.77298987,1
0.12178003,0.72582406,1
0.13361052,0.7626255,1
0.14602154,0.7002943,1
0.14303829,0.589723,1
0.15790752,0.8083089,1
0.11920573,0.6159894,1
0.13082261,0.7689988,1
0.13872086,0.7283962,1
0.09320422,0.6901894,1
0.11475617,0.7265338,1
0.14227591,0.7880172,1
0.20567152,0.78785414,1
0.12258991,0.7395169,1
0.113861226,0.59512097,1
0.11141803,0.6656207,1
0.14453496,0.66759497,1
0.117019445,0.7317693,1
0.124678195,0.7627366,1
0.23304911,0.8278071,1
0.09989836,0.72930616,1
0.15894516,0.63103217,1
0.16316435,0.6773139,1
0.18060605,0.6427929,1
0.1561212,0.67913777,1
0.17771477,0.6938439,1
0.14398296,0.68274766,1
0.18162137,0.5958237,1
0.15686847,0.7412095,1
0.15941417,0.6444382,1
0.16708207,0.72250015,1
0.16999817,0.76583034,1
0.15196052,0.62892264,1
0.14151685,0.69142777,1
0.15362133,0.78337723,1
0.17550662,0.7906045,1
0.19594918,0.7222348,1
0.16248426,0.71682,1
0.15242064,0.5825841,1
0.19288029,0.6834563,1
0.1448304,0.7760517,1
0.16752884,0.66004413,1
0.13662778,0.75464916,1
0.1473138,0.77820367,1
0.16674183,0.79159087,1
0.17080267,0.7742253,1
0.16076657,0.79905605,1
0.15063389,0.76663166,1
0.16722004,0.5700569,1
0.12819384,0.76319045,1
0.14811687,0.7757538,1
0.15499607,0.79412585,1
0.16956039,0.7877265,1
0.15653086,0.77782273,1
0.19384511,0.8244559,1
0.16268344,0.7771065,1
0.1595819,0.8051507,1
0.16123572,0.8064028,1
0.18625414,0.81619906,1
0.16179939,0.79801005,1
0.19177157,0.8210831,1
0.14621134,0.77046686,1
0.16875818,0.79763293,1
0.15444198,0.775957,1
0.20107631,0.74961376,1
0.17692484,0.666227,1
0.17786114,0.688391,1
0.20049597,0.72195333,1
0.15612504,0.6489054,1
0.18792544,0.7646903,1
0.20724355,0.74003416,1
0.18128356,0.64176524,1
0.1712817,0.7552009,1
0.16140057,0.72426283,1
0.158228,0.6884725,1
0.11603831,0.74275327,1
0.11788357,0.7432181,1
0.120657705,0.68202204,1
0.14085762,0.76754105,1
0.13219164,0.43939427,1
0.14089888,0.77099746,1
0.13556388,0.6248849,1
0.14213973,0.78344154,1
0.09871568,0.7021517,1
0.13296996,0.75843143,1
0.15779045,0.7901106,1
0.14706856,0.7086022,1
0.21518838,0.70468473,1
0.2445004,0.6865813,1
0.21519035,0.72496784,1
0.20114718,0.73566294,1
0.21209241,0.7164202,1
0.18300684,0.78006804,1
0.19122727,0.61675984,1
0.17472644,0.6619542,1
0.14548814,0.5809013,1
0.13613988,0.6655503,1
0.1899127,0.76852846,1
0.13625436,0.7245043,1
0.13827881,0.75983,1
0.17629446,0.75437117,1
0.13725717,0.6644453,1
0.13908719,0.72635126,1
0.13712378,0.5388629,1
0.15163188,0.74515873,1
0.18329223,0.7145781,1
0.19508551,0.6157109,1
0.14598522,0.67722946,1
0.17786802,0.63700396,1
0.18201694,0.6534549,1
0.12465366,0.734359,1
0.11779335,0.65623,1
0.14087003,0.78760636,1
0.149068,0.7579937,1
0.15816833,0.7435855,1
0.18848753,0.79139596,1
0.15916581,0.71537095,1
0.16328728,0.66908014,1
0.17112777,0.65600497,1
0.1426796,0.6962363,1
0.16809706,0.65271425,1
0.13920341,0.69806045,1
0.15968755,0.7653997,1
0.15423703,0.7326738,1
0.14365141,0.7466744,1
0.14590047,0.75386196,1
0.15512459,0.749352,1
0.18144488,0.76318884,1
0.18447326,0.7874435,1
0.18870139,0.8117982,1
0.2203188,0.8222657,1
0.18640341,0.8086117,1
0.22104217,0.80409473,1
0.14153865,0.7190518,1
0.18599676,0.8096093,1
0.11002019,0.71215934,1
0.15027517,0.7872523,1
0.12081591,0.7311336,1
0.13872832,0.73078895,1
0.19186753,0.70088184,1
0.1818013,0.63342196,1
0.16701086,0.5850685,1
0.18728621,0.65678674,1
0.15483308,0.70361525,1
0.19041246,0.70536536,1
0.16938078,0.6046168,1
0.17193337,0.65031224,1
0.15045056,0.66092634,1
0.1904853,0.59982073,1
0.16951708,0.63369906,1
0.19380786,0.724342,1
0.14749774,0.7722235,1
0.11154525,0.7446214,1
0.14102872,0.768009,1
0.13710621,0.76205236,1
0.15183385,0.79924756,1
0.14119075,0.762951,1
0.2505493,0.81960475,1
0.26190746,0.8174705,1
0.2499549,0.76003754,1
0.1378038,0.75421035,1
0.12640002,0.7489818,1
0.113978475,0.7225906,1
0.14097586,0.74283683,1
0.13773698,0.7832131,1
0.18199646,0.7860058,1
0.18337539,0.6538435,1
0.18372701,0.7796702,1
0.17569198,0.72759426,1
0.14936547,0.6162259,1
0.16149627,0.71866596,1
0.13242565,0.7365689,1
0.15831438,0.7690504,1
0.14972863,0.74056804,1
0.16130316,0.75222725,1
0.14920591,0.6250041,1
0.1500271,0.62062234,1
0.1729877,0.7612811,1
0.14475809,0.72700065,1
0.1188314,0.74712837,1
0.13214189,0.7603035,1
0.13198617,0.7322021,1
0.13133702,0.74372315,1
0.24714714,0.795226,1
0.20682429,0.831076,1
0.24756081,0.82401234,1
0.2419236,0.8293218,1
0.25816333,0.8388676,1
0.13169125,0.7404071,1
0.13001806,0.770266,1
0.12689218,0.7412572,1
0.11963403,0.7266716,1
0.15607299,0.79197747,1
0.12847553,0.7234323,1
0.11329338,0.6826728,1
0.13429844,0.762653,1
0.11130177,0.7221599,1
0.121909566,0.71712834,1
0.10281398,0.70791465,1
0.11509811,0.71864635,1
0.16592139,0.76984197,1
0.12765467,0.7452964,1
0.14000759,0.76462764,1
0.099546716,0.6796649,1
0.10135535,0.6800925,1
0.13786831,0.7822753,1
0.12504002,0.7586887,1
0.13824953,0.7529664,1
0.12292744,0.6493729,1
0.12557061,0.593317,1
0.09718151,0.6336484,1
0.108295135,0.7044949,1
0.1555102,0.781873,1
0.12650305,0.6790241,1
0.22509538,0.83063716,1
0.15569638,0.7779503,1
0.13260809,0.7868731,1
0.12533832,0.73742735,1
0.09805364,0.69075847,1
0.13220933,0.7692503,1
0.092465155,0.6732563,1
0.11188157,0.7242611,1
0.10985299,0.73441976,1
0.16166583,0.80560106,1
0.15147929,0.6001356,1
0.11840436,0.73627824,1
0.13388368,0.72021097,1
0.13788208,0.7367321,1
0.16902944,0.8047082,1
0.15270115,0.77684385,1
0.09934221,0.6776824,1
0.12922843,0.72360396,1
0.16573235,0.80883867,1
0.18298005,0.8126077,1
0.22076698,0.7869548,1
0.13953625,0.78549534,1
0.13808864,0.76597714,1
0.13675521,0.7672794,1
0.1875243,0.72696036,1
0.12574255,0.752807,1
0.1317424,0.75268555,1
0.12309172,0.7515753,1
0.11990516,0.7323888,1
0.12735747,0.5538239,1
0.09371771,0.66906744,1
0.11219318,0.7199237,1
0.14532249,0.78434527,1
0.18464985,0.5210845,1
0.16684437,0.7452187,1
0.19631916,0.618271,1
0.13712247,0.7354449,1
0.13054937,0.7530129,1
0.11574789,0.75008696,1
0.14481533,0.72494304,1
0.118257806,0.7140803,1
0.12267875,0.69535357,1
0.1560426,0.72653836,1
0.11163171,0.68247324,1
0.12883928,0.69270617,1
0.11702512,0.6861144,1
0.10804823,0.73422027,1
0.12208709,0.6822674,1
0.11587132,0.6891903,1
0.13544628,0.76857024,1
0.1769257,0.8158974,1
0.1336433,0.77631843,1
0.13618314,0.44588277,1
0.13579226,0.70154,1
0.1468822,0.749156,1
0.114657596,0.73321277,1
0.11127749,0.72053087,1
0.15616345,0.6612232,1
0.1399681,0.7696154,1
0.15619333,0.7845786,1
0.22768882,0.81338346,1
0.13863261,0.76144606,1
0.110808164,0.7151465,1
0.156411,0.78835016,1
0.13963053,0.7788717,1
0.14107586,0.77883327,1
0.11712246,0.7228383,1
0.12852064,0.74654377,1
0.16089101,0.7475755,1
0.1287235,0.719915,1
0.105578035,0.6533696,1
0.13475367,0.7751682,1
0.20894375,0.7513581,1
0.11078488,0.70271283,1
0.17401749,0.59347934,1
0.16495457,0.78085744,1
0.101548195,0.70216763,1
0.14254563,0.7093462,1
0.13503206,0.7895948,1
0.10445091,0.71753967,1
0.20562413,0.81313145,1
0.17842072,0.7412474,1
0.12411052,0.7449192,1
0.16813944,0.7946236,1
0.10542021,0.7123826,1
0.11622743,0.7297314,1
0.147894,0.6770873,1
0.12847978,0.72320706,1
0.10608943,0.70260906,1
0.1265315,0.7336376,1
0.1257263,0.7508433,1
0.09087145,0.66757536,1
0.19432534,0.80962294,1
0.13278814,0.60888565,1
0.15805672,0.7825609,1
0.14713417,0.7037645,1
0.11226995,0.66048765,1
0.17833017,0.8212597,1
0.1327741,0.5784145,1
0.14003351,0.74511915,1
0.15823977,0.7215341,1
0.23269352,0.82846,1
0.19719085,0.78805345,1
0.11884822,0.61700845,1
0.14020182,0.7570297,1
0.1055581,0.6909082,1
0.113874316,0.7229831,1
0.12210523,0.71320593,1
0.17482941,0.7542391,1
0.1215081,0.6332959,1
0.102220416,0.67188424,1
0.20863646,0.8304706,1
0.08760563,0.66130686,1
0.12155609,0.73717666,1
0.13117458,0.73198855,1
0.18165721,0.79344875,1
0.10454146,0.70726806,1
0.10834755,0.73723596,1
0.10850761,0.7039079,1
0.115238875,0.73338234,1
0.12185209,0.6940557,1
0.11085256,0.6599671,1
0.1886586,0.8133748,1
0.14389187,0.6007969,1
0.16709785,0.7190328,1
0.14491542,0.76754063,1
0.10005247,0.62661344,1
0.13890451,0.65752274,1
0.15876308,0.78629833,1
0.14224468,0.74775213,1
0.13267154,0.6285266,1
0.1455906,0.78950685,1
0.13677056,0.74738,1
0.13409056,0.7587429,1
0.11437235,0.72136694,1
0.119013764,0.7256984,1
0.13268028,0.48431298,1
0.15191591,0.7872883,1
0.12989394,0.75527436,1
0.129991,0.53126943,1
0.17646873,0.7983468,1
0.102925636,0.69386405,1
0.1911642,0.8179258,1
0.171339,0.79852843,1
0.15647933,0.798293,1
0.11603212,0.69271487,1
0.16452387,0.8016199,1
0.15909527,0.772879,1
0.117207915,0.66943294,1
0.1549694,0.7476973,1
0.18079987,0.81012565,1
0.13727649,0.77491075,1
0.15955792,0.6573966,1
0.22631493,0.6628601,1
0.12081421,0.7036375,1
0.10083828,0.6930666,1
0.16888751,0.5436137,1
0.08839308,0.67479825,1
0.10846157,0.7370026,1
0.112157926,0.6936133,1
0.13901156,0.6837934,1
0.16022399,0.78373384,1
0.21407488,0.83868384,1
0.13136807,0.77614677,1
0.105657384,0.6974156,1
0.18594903,0.80510324,1
0.14822248,0.78074795,1
0.123231314,0.6084292,1
0.11963807,0.72323096,1
0.1353939,0.5870021,1
0.1239773,0.7544129,1
0.11342171,0.71281385,1
0.16572443,0.75383335,1
0.12015295,0.7332927,1
0.17680892,0.6200053,1
0.11481543,0.74340165,1
0.11333672,0.57225436,1
0.17619707,0.76781684,1
