{
    "dimensionality_reduction_methods": "['PCA', 'UMAP', 'TSVD']",
    "proportions": "[0.2, 0.8, 0]",
    "dataset": "nmnist",
    "number_of_classes": "2",
    "number_of_points": "10000",
    "number_of_Tsamples": "2000",
    "number_ofVsamples": "1000",
    "loss": "0.0015336399665102363",
    "trustworthiness": "0.9102301080073913",
    "continuity": "0.9658769645441436",
    "neighborhood_hit": "0.9994596420128337"
}