{
    "dimensionality_reduction_methods": "['PCA', 'UMAP', 'TSVD']",
    "proportions": "[1, 0, 0]",
    "dataset": "nmnist",
    "number_of_classes": "2",
    "number_of_points": "10000",
    "number_of_Tsamples": "5000",
    "number_ofVsamples": "1000",
    "loss": "0.0005861298413947225",
    "trustworthiness": "0.9010199128595698",
    "continuity": "0.9617336849255788",
    "neighborhood_hit": "0.9993245525160418"
}