PC1,PC2,label
0.48021045,0.24805123,0
0.5713858,0.4944252,0
0.69089866,0.3186277,0
0.7153821,0.29080522,0
0.5083834,0.3556311,0
0.28484365,0.5687935,0
0.6210583,0.34077862,0
0.198391,0.6481766,0
0.7580103,0.3606967,0
0.6477103,0.3263824,0
0.21523781,0.547081,0
0.55769503,0.39231694,0
0.46224123,0.31837982,0
0.27197307,0.6037342,0
0.50919867,0.3924484,0
0.45173293,0.58403575,0
0.5829117,0.34191382,0
0.3746967,0.46196377,0
0.516208,0.29094094,0
0.42539194,0.25166035,0
0.5614826,0.4021619,0
0.6906315,0.34568277,0
0.66500753,0.29251966,0
0.46439478,0.5067018,0
0.77943426,0.3502811,0
0.63901484,0.41890234,0
0.7182308,0.3261927,0
0.70543474,0.2746854,0
0.77598894,0.34379858,0
0.59653735,0.3040203,0
0.43705034,0.5120568,0
0.54211617,0.40171185,0
0.7063653,0.3012621,0
0.30836532,0.4858214,0
0.48314878,0.4537984,0
0.7709415,0.31461585,0
0.4397227,0.44232646,0
0.33271146,0.53190917,0
0.5320144,0.49031982,0
0.530455,0.5174501,0
0.6052201,0.310545,0
0.39378396,0.38097903,0
0.8090373,0.3179313,0
0.48693335,0.3800759,0
0.3568126,0.5626386,0
0.28110546,0.59518945,0
0.4261548,0.3712396,0
0.3665404,0.52624226,0
0.4373184,0.31395411,0
0.27356657,0.5543854,0
0.414634,0.38293073,0
0.5952278,0.4088662,0
0.55722046,0.3375818,0
0.31771588,0.5970656,0
0.7198212,0.32171312,0
0.13612431,0.6957196,0
0.14668198,0.6822957,0
0.7715465,0.3410522,0
0.6165258,0.27862278,0
0.29255873,0.57109094,0
0.31671864,0.579072,0
0.69376284,0.29516816,0
0.73070693,0.33450624,0
0.5786734,0.43628407,0
0.6204594,0.42533904,0
0.2816134,0.6027895,0
0.6084185,0.39801392,0
0.7204963,0.43368575,0
0.26699024,0.6353849,0
0.4683198,0.44694468,0
0.7204265,0.35229513,0
0.5183782,0.29635787,0
0.32517284,0.4729951,0
0.7978123,0.31633636,0
0.734377,0.33987802,0
0.55544883,0.40927547,0
0.19636087,0.6005124,0
0.7345241,0.3455789,0
0.251368,0.6129647,0
0.65413034,0.30372965,0
0.74921566,0.32532227,0
0.3688487,0.54577124,0
0.5832922,0.35154954,0
0.29054803,0.5945164,0
0.20737502,0.5479432,0
0.28138432,0.50221854,0
0.5495244,0.41020846,0
0.279885,0.5985595,0
0.62338847,0.42867985,0
0.69757366,0.34891862,0
0.562683,0.38542995,0
0.7601286,0.36901107,0
0.6278121,0.40778556,0
0.74674654,0.32884154,0
0.19663955,0.67534727,0
0.48201916,0.5452418,0
0.17795281,0.65656006,0
0.7019521,0.3104037,0
0.6661281,0.38192606,0
0.33924815,0.4588285,0
0.3746338,0.32863933,0
0.1727958,0.6781777,0
0.3015538,0.3371502,0
0.30730692,0.6014079,0
0.63981485,0.27266005,0
0.24143593,0.55146646,0
0.35222656,0.5887069,0
0.69598055,0.26418394,0
0.69968206,0.314481,0
0.5389618,0.28864077,0
0.27777454,0.615434,0
0.3003824,0.60901034,0
0.53967005,0.38436642,0
0.5440602,0.4603131,0
0.7834675,0.34037694,0
0.5557671,0.47801396,0
0.5967485,0.31291038,0
0.45462462,0.33251157,0
0.73031676,0.35594535,0
0.5686187,0.29737675,0
0.19219401,0.6473293,0
0.734171,0.3508251,0
0.6847688,0.31458488,0
0.44988385,0.39944908,0
0.6872265,0.28049257,0
0.6166036,0.3917858,0
0.60766864,0.5346255,0
0.4413838,0.50619435,0
0.5496019,0.3939075,0
0.6697011,0.33682707,0
0.16199677,0.6515153,0
0.6040531,0.3462876,0
0.6386019,0.29639128,0
0.7101413,0.29197153,0
0.57239735,0.37293002,0
0.7048298,0.36531547,0
0.15331459,0.68078536,0
0.596232,0.47710076,0
0.71716815,0.30042702,0
0.45201066,0.4351482,0
0.74396205,0.34891164,0
0.47963724,0.40303424,0
0.5379042,0.30780777,0
0.46550992,0.42726,0
0.702362,0.32014662,0
0.57226187,0.35989186,0
0.40338355,0.28026304,0
0.22974572,0.47453147,0
0.38509014,0.5317203,0
0.7571112,0.36465645,0
0.76932466,0.47470582,0
0.73467076,0.35734242,0
0.67036957,0.31965208,0
0.5275396,0.49546075,0
0.51021075,0.4549189,0
0.5882322,0.39898643,0
0.34755498,0.62420994,0
0.5029018,0.30606398,0
0.5719876,0.37017962,0
0.15923037,0.63826805,0
0.6860729,0.39908642,0
0.73776305,0.33775654,0
0.5454427,0.3973046,0
0.6342662,0.37459743,0
0.3705361,0.53237045,0
0.5257214,0.486045,0
0.52486366,0.37413633,0
0.33224076,0.5614311,0
0.6978338,0.4385333,0
0.6212938,0.48254558,0
0.63519984,0.34406582,0
0.6343798,0.4238718,0
0.67084134,0.3590207,0
0.40221196,0.5294541,0
0.41430175,0.5247737,0
0.5308454,0.45701644,0
0.34212154,0.4434644,0
0.1981318,0.60445267,0
0.43905944,0.42303458,0
0.12026634,0.7117129,0
0.30866823,0.40692362,0
0.44801646,0.5527906,0
0.63548416,0.3163424,0
0.33462036,0.48083973,0
0.75083965,0.30062902,0
0.7294937,0.31344882,0
0.1998239,0.6268691,0
0.63798,0.31860965,0
0.18886822,0.6910942,0
0.6539284,0.42494246,0
0.64373267,0.27217016,0
0.6900961,0.35515106,0
0.1716117,0.6220687,0
0.485358,0.45790046,0
0.4646156,0.49696383,0
0.7968502,0.31993327,0
0.6450659,0.49888533,0
0.4349163,0.5011876,0
0.5674657,0.48772627,0
0.7197759,0.457905,0
0.67043823,0.29553682,0
0.6383545,0.29141968,0
0.76544935,0.37753913,0
0.651948,0.3760066,0
0.6115156,0.32052213,0
0.5188701,0.5389368,0
0.7913743,0.3122485,0
0.2931873,0.40361267,0
0.72368747,0.38122156,0
0.48008782,0.4599928,0
0.7622601,0.29449838,0
0.74633145,0.33650973,0
0.52367467,0.46157628,0
0.6088231,0.33419934,0
0.23600365,0.5233967,0
0.7769973,0.37291986,0
0.76015073,0.33486375,0
0.4271516,0.53031516,0
0.6014937,0.27270693,0
0.7786955,0.30516237,0
0.23865522,0.5908817,0
0.36011946,0.5641856,0
0.24064104,0.6395974,0
0.71588355,0.34639117,0
0.624232,0.40777552,0
0.75449777,0.36033377,0
0.3478135,0.56191045,0
0.72247434,0.32111645,0
0.24604757,0.54275745,0
0.5468746,0.3512892,0
0.46327606,0.45348346,0
0.7497988,0.315642,0
0.47806492,0.4748492,0
0.570657,0.46058768,0
0.3901805,0.40563673,0
0.2334554,0.64105695,0
0.45581046,0.39162394,0
0.7103934,0.28423023,0
0.6318322,0.34181887,0
0.50274193,0.50732964,0
0.5728393,0.3996831,0
0.2791676,0.61191607,0
0.64344454,0.36550152,0
0.75070494,0.28056192,0
0.61928225,0.4237843,0
0.66036993,0.38715416,0
0.18127814,0.6542783,0
0.7694084,0.30016065,0
0.72234356,0.3607551,0
0.62441236,0.51168066,0
0.61422265,0.47375077,0
0.78362286,0.31752837,0
0.31443265,0.5887544,0
0.25544035,0.6101118,0
0.44675624,0.43612137,0
0.14517666,0.7130627,0
0.7467864,0.31365955,0
0.5451106,0.3385784,0
0.4734694,0.46551302,0
0.55639523,0.35122904,0
0.5590725,0.4454245,0
0.470608,0.41025215,0
0.2876507,0.60945165,0
0.3129983,0.565027,0
0.75326467,0.34950867,0
0.26534265,0.602195,0
0.46414235,0.4518921,0
0.64703834,0.38494086,0
0.5690333,0.4022968,0
0.13137631,0.69054365,0
0.5909841,0.40323654,0
0.61580205,0.29208887,0
0.38533667,0.28398135,0
0.38298944,0.5281712,0
0.66501266,0.2668097,0
0.29948744,0.30510643,0
0.13029942,0.70717615,0
0.19508652,0.6367203,0
0.45002514,0.5362641,0
0.26280078,0.5957171,0
0.4166943,0.42968264,0
0.40018705,0.5620172,0
0.4650289,0.5189175,0
0.3566219,0.5126923,0
0.5694052,0.2594994,0
0.5163663,0.43160698,0
0.57297105,0.35436124,0
0.31978327,0.5645572,0
0.5354405,0.4172152,0
0.31620127,0.53311485,0
0.5643962,0.4091037,0
0.72029394,0.31998917,0
0.6658953,0.3315884,0
0.4807081,0.32309678,0
0.7418715,0.38782787,0
0.6680882,0.42749083,0
0.57623076,0.4334773,0
0.6655507,0.3203948,0
0.7377013,0.308957,0
0.20428315,0.6348324,0
0.510136,0.43545994,0
0.4913173,0.45969284,0
0.33873427,0.5508874,0
0.72438616,0.30130124,0
0.19702452,0.632133,0
0.65691435,0.38177922,0
0.5152711,0.4853109,0
0.21708669,0.5945046,0
0.48279354,0.5089395,0
0.58402336,0.43141943,0
0.663823,0.37596327,0
0.46304345,0.49654317,0
0.7929933,0.35863778,0
0.73784393,0.34176016,0
0.5982136,0.39877626,0
0.60427684,0.34678194,0
0.35506338,0.5553711,0
0.606315,0.30997318,0
0.51751935,0.42079413,0
0.46584827,0.4074983,0
0.77554154,0.30500197,0
0.39059564,0.46994656,0
0.5519003,0.4521761,0
0.32977974,0.5340385,0
0.61249214,0.46780375,0
0.75930274,0.4037146,0
0.71423715,0.28625232,0
0.7525411,0.33401585,0
0.1335916,0.64191175,0
0.6408897,0.35237768,0
0.7451161,0.30128452,0
0.4359814,0.486342,0
0.6272266,0.3223798,0
0.46699744,0.28959858,0
0.6047507,0.34118047,0
0.3002534,0.51551527,0
0.47711277,0.47517174,0
0.7629287,0.31806996,0
0.70042443,0.33214614,0
0.7309061,0.2997452,0
0.6501264,0.3774878,0
0.7596316,0.2842087,0
0.7130005,0.41503075,0
0.6712257,0.3009511,0
0.6450203,0.285693,0
0.2906893,0.50205004,0
0.30724558,0.5423351,0
0.7370489,0.3911878,0
0.6479347,0.4143929,0
0.2380153,0.5390731,0
0.50535214,0.36211768,0
0.7104596,0.2827867,0
0.76299804,0.32907897,0
0.6248158,0.3436654,0
0.30011314,0.5482136,0
0.40754896,0.5349713,0
0.3928758,0.5595336,0
0.6856395,0.38339397,0
0.23765787,0.6309925,0
0.15455265,0.63269407,0
0.23852563,0.57999676,0
0.6179718,0.46142882,0
0.55388343,0.2688843,0
0.2872495,0.5382537,0
0.5599208,0.45954078,0
0.2776923,0.5928335,0
0.25917876,0.5985751,0
0.4413521,0.509275,0
0.7849335,0.31650645,0
0.22887751,0.5209881,0
0.677612,0.39320973,0
0.3353939,0.5510715,0
0.6366483,0.36069995,0
0.65010047,0.41141966,0
0.72760075,0.30577496,0
0.70971054,0.47258902,0
0.45052442,0.32747978,0
0.48352844,0.479998,0
0.79167074,0.31440523,0
0.5983562,0.423432,0
0.3233121,0.54904693,0
0.23213519,0.6224049,0
0.5221378,0.41568005,0
0.32383636,0.48761782,0
0.768106,0.339147,0
0.7774052,0.34077466,0
0.745626,0.40175226,0
0.6508315,0.34399226,0
0.65845907,0.42454016,0
0.7070358,0.36119002,0
0.7909639,0.3492208,0
0.66468984,0.3195394,0
0.26470363,0.6202669,0
0.6951245,0.270841,0
0.26391816,0.5084237,0
0.57191336,0.29369244,0
0.7162453,0.33383876,0
0.79529166,0.32244557,0
0.5568584,0.25786963,0
0.62906265,0.4397054,0
0.5233205,0.42297038,0
0.55928427,0.4479894,0
0.16923812,0.67057395,0
0.45210406,0.52845645,0
0.25945333,0.5860772,0
0.34417775,0.5126952,0
0.746108,0.31176585,0
0.34251076,0.52049285,0
0.32041502,0.5017251,0
0.7604172,0.33009875,0
0.7016182,0.34518406,0
0.69743335,0.3208446,0
0.3130198,0.4530472,0
0.55635095,0.5486047,0
0.76143825,0.35089928,0
0.5594935,0.47753102,0
0.32467693,0.58878607,0
0.3538698,0.54209083,0
0.6780792,0.33388004,0
0.32612076,0.5540053,0
0.74682385,0.28753892,0
0.67719173,0.41195726,0
0.50232565,0.48074743,0
0.37589976,0.5478945,0
0.4303208,0.48027226,0
0.70602703,0.3608656,0
0.74199796,0.2955442,0
0.64381456,0.37142217,0
0.39767873,0.42422953,0
0.21294983,0.6225574,0
0.6594199,0.28712034,0
0.5866818,0.24559201,0
0.55622375,0.306335,0
0.6245254,0.31195003,0
0.7644368,0.28813544,0
0.6004411,0.3983643,0
0.22890195,0.6256472,0
0.7063992,0.31297854,0
0.5449723,0.44651574,0
0.7194915,0.31710392,0
0.5822603,0.37737355,0
0.5407848,0.35137472,0
0.7477853,0.2979218,0
0.779138,0.3177275,0
0.5067503,0.5093821,0
0.33751872,0.57324815,0
0.70777804,0.3445017,0
0.50795454,0.26965687,0
0.6145347,0.3779234,0
0.5238889,0.42247924,0
0.44588095,0.5264017,0
0.28228167,0.5838102,0
0.7108791,0.42427838,0
0.55795074,0.44844714,0
0.6771508,0.27650768,0
0.60437226,0.28446975,0
0.43612954,0.39357704,0
0.20414366,0.60863966,0
0.57564044,0.43934506,0
0.37207454,0.5418279,0
0.2686849,0.6211259,0
0.25491214,0.6093777,0
0.42232025,0.3390585,0
0.22534074,0.6188733,0
0.7497016,0.4058201,0
0.53917974,0.41384608,0
0.41568616,0.525054,0
0.40326443,0.39495504,0
0.71566594,0.33878753,0
0.5869485,0.36525545,0
0.74178976,0.38809535,0
0.33182567,0.49404237,0
0.40700123,0.4424535,0
0.35232633,0.5363092,0
0.4480648,0.41109312,0
0.7399218,0.34625188,0
0.5135474,0.28157213,0
0.46468475,0.31841063,0
0.6925899,0.40014333,0
0.24237004,0.616689,0
0.736266,0.34832868,0
0.5389138,0.4689493,0
0.14830455,0.66810805,0
0.6574067,0.3186539,0
0.41082358,0.49103454,0
0.72754604,0.35687625,0
0.7643425,0.34107053,0
0.3539444,0.3985662,0
0.14650428,0.679747,0
0.72473717,0.335154,0
0.20587097,0.6262404,0
0.5475905,0.29225963,0
0.51114064,0.38306,0
0.28730738,0.5130764,0
0.51327235,0.46080053,0
0.40542084,0.5776895,0
0.8188306,0.31158414,0
0.32255712,0.55080426,0
0.58555305,0.39984214,0
0.7278078,0.31570783,0
0.72539383,0.3128596,0
0.7434728,0.29348248,0
0.6471387,0.31027034,0
0.57358056,0.4495473,0
0.6180464,0.31024665,0
0.6943695,0.39159292,0
0.18319564,0.6446665,0
0.23693174,0.62319607,0
0.21354161,0.5637705,0
0.37482154,0.57551724,0
0.7365336,0.35203654,0
0.72529924,0.28758004,0
0.5171837,0.4451416,0
0.24393867,0.5973441,0
0.17532142,0.67600584,0
0.6419525,0.37490436,0
0.28994077,0.59682953,0
0.54572964,0.3601301,0
0.5600405,0.31181145,0
0.64701176,0.2813958,0
0.34247258,0.5484661,0
0.2864933,0.5555944,0
0.29341626,0.6213216,0
0.53730035,0.48129687,0
0.6895863,0.45848998,0
0.3730863,0.41053826,0
0.4499552,0.25977948,0
0.43792638,0.4978071,0
0.36294204,0.3183152,0
0.337986,0.5826489,0
0.5416794,0.39670965,0
0.6863919,0.35246596,0
0.66950816,0.42580274,0
0.35210118,0.5654653,0
0.7307777,0.29791555,0
0.62586534,0.38992774,0
0.6809515,0.37506968,0
0.663159,0.4560566,0
0.62715566,0.42914093,0
0.46417624,0.50557125,0
0.41263846,0.44451997,0
0.13291952,0.69051933,0
0.27430958,0.6346605,0
0.46390724,0.25847632,0
0.3707186,0.47020397,0
0.31342536,0.5762525,0
0.5783155,0.25579,0
0.40556943,0.4737573,0
0.5330072,0.44811735,0
0.19340014,0.64355433,0
0.65993273,0.34632477,0
0.14466365,0.6058141,0
0.16555631,0.6741259,0
0.4375798,0.45458353,0
0.64063764,0.42916322,0
0.7062944,0.40469974,0
0.7579788,0.36969203,0
0.6449819,0.38987377,0
0.710963,0.34740025,0
0.62360054,0.3513168,0
0.27857998,0.5928674,0
0.26219794,0.57782054,0
0.8081038,0.32962048,0
0.5149377,0.52679986,0
0.5082998,0.2537615,0
0.7227047,0.40070778,0
0.7370799,0.35393977,0
0.44017798,0.5093239,0
0.31624833,0.48050532,0
0.31289867,0.59512544,0
0.7779289,0.32467467,0
0.14332955,0.69127834,0
0.5749598,0.37512657,0
0.33057442,0.5650232,0
0.6311792,0.34805447,0
0.1539708,0.6614392,0
0.27091086,0.6208237,0
0.6818388,0.32601517,0
0.16685796,0.66046864,0
0.646303,0.32730958,0
0.50568205,0.45376283,0
0.46479154,0.5651086,0
0.6976641,0.3580001,0
0.41157845,0.39003256,0
0.6083932,0.48235312,0
0.71714956,0.4266054,0
0.62030685,0.34823895,0
0.44382522,0.47386482,0
0.41449657,0.4188016,0
0.7357034,0.34886944,0
0.614179,0.29342848,0
0.61360306,0.38229817,0
0.29593477,0.56711894,0
0.5544554,0.5249187,0
0.6160342,0.47908664,0
0.26047626,0.6015474,0
0.7345799,0.31942508,0
0.63498586,0.38921207,0
0.47548342,0.46478423,0
0.4205489,0.44973922,0
0.73161614,0.32658657,0
0.18571165,0.6716052,0
0.5368695,0.45993567,0
0.2610348,0.5910324,0
0.5407835,0.33542246,0
0.56446606,0.47654736,0
0.75475925,0.32754678,0
0.1816915,0.673607,0
0.25030845,0.6315729,0
0.27550206,0.6063945,0
0.5003812,0.28067416,0
0.6572409,0.38113198,0
0.54334855,0.40187544,0
0.7163095,0.30657527,0
0.65140045,0.3833739,0
0.20851547,0.56809455,0
0.5408018,0.3559207,0
0.24705155,0.6328949,0
0.81800896,0.31758305,0
0.46847898,0.49064732,0
0.736782,0.36742377,0
0.4743387,0.41602993,0
0.6522095,0.37658316,0
0.47781444,0.4998679,0
0.36915243,0.5424212,0
0.44460624,0.31516847,0
0.3926302,0.4697515,0
0.2698581,0.57257724,0
0.6772315,0.3649278,0
0.3617186,0.53234357,0
0.71504915,0.33361414,0
0.38214177,0.28635386,0
0.7657842,0.32246113,0
0.48256567,0.4327434,0
0.5516521,0.29577452,0
0.69820493,0.39356706,0
0.7039276,0.4516564,0
0.68093634,0.34466293,0
0.49308485,0.457795,0
0.20290767,0.64624393,0
0.4235084,0.51422966,0
0.2849313,0.46102357,0
0.21609515,0.63324857,0
0.693211,0.33631328,0
0.43113658,0.52442986,0
0.60730714,0.47802514,0
0.73535955,0.4118144,0
0.5567207,0.3933449,0
0.49567655,0.44181895,0
0.27711442,0.58172023,0
0.7501955,0.2896377,0
0.6105731,0.3023294,0
0.69011974,0.3604683,0
0.2591205,0.46023816,0
0.26707557,0.5114924,0
0.3322403,0.4323728,0
0.4955681,0.36945093,0
0.33301058,0.45368233,0
0.38010484,0.4983487,0
0.58107704,0.45867863,0
0.6226859,0.39499462,0
0.63944775,0.28567073,0
0.6436657,0.30663028,0
0.45092982,0.4530512,0
0.76590353,0.3520585,0
0.4810891,0.4511171,0
0.5837403,0.36667874,0
0.5779062,0.38971582,0
0.3188938,0.575952,0
0.6021821,0.3030586,0
0.5509002,0.4509358,0
0.78841645,0.353623,0
0.40892816,0.49219272,0
0.50856894,0.45645463,0
0.63494235,0.38346148,0
0.78886247,0.3928838,0
0.3967493,0.3669354,0
0.39520591,0.5738904,0
0.43931943,0.55893016,0
0.16356029,0.6502235,0
0.6607413,0.38477468,0
0.3542345,0.529609,0
0.5142346,0.40559146,0
0.5195035,0.5044853,0
0.6272745,0.4016052,0
0.668808,0.36083695,0
0.6376145,0.3497186,0
0.64535993,0.419934,0
0.40511775,0.36057884,0
0.6848653,0.32016748,0
0.64891505,0.35278502,0
0.3130753,0.5080317,0
0.6849816,0.3298161,0
0.39660713,0.33141178,0
0.52160585,0.4622552,0
0.7192523,0.388319,0
0.5637454,0.29910266,0
0.70394063,0.33357844,0
0.5038764,0.5290928,0
0.7061541,0.31608388,0
0.45805648,0.32800487,0
0.44304404,0.31780228,0
0.6769285,0.3866364,0
0.59668726,0.41758236,0
0.45787045,0.2682834,0
0.6775567,0.2714921,0
0.3123322,0.52137536,0
0.5655289,0.4214378,0
0.21286812,0.6062717,0
0.7579521,0.32344148,0
0.46026585,0.53078604,0
0.77073014,0.34670335,0
0.39775607,0.26935267,0
0.3060954,0.5918531,0
0.25634682,0.37040317,0
0.26377723,0.626439,0
0.3181614,0.5733852,0
0.6782284,0.29719865,0
0.40738297,0.41986376,0
0.2044667,0.66282827,0
0.7675102,0.30887356,0
0.1615242,0.6614207,0
0.68495893,0.29278272,0
0.71988684,0.32988328,0
0.19710635,0.561209,0
0.37242925,0.5488353,0
0.58273745,0.5141716,0
0.25583464,0.4721162,0
0.6254084,0.39348802,0
0.21210332,0.54676926,0
0.31372806,0.53427297,0
0.6620594,0.4671901,0
0.18000981,0.63751584,0
0.3684906,0.31971392,0
0.44351703,0.41951254,0
0.59571964,0.38465217,0
0.7665507,0.32589576,0
0.36897883,0.52564555,0
0.6989518,0.35251448,0
0.20995283,0.53532195,0
0.64786077,0.34978434,0
0.45670006,0.49179047,0
0.355186,0.55423516,0
0.66116446,0.3862081,0
0.6840683,0.3469246,0
0.2425342,0.6274018,0
0.5131038,0.25373635,0
0.711274,0.3059977,0
0.73906344,0.3919665,0
0.2241698,0.6048046,0
0.2246834,0.6091389,0
0.70994467,0.45029938,0
0.66464555,0.4600738,0
0.5197325,0.4578035,0
0.72752947,0.3861401,0
0.48398668,0.5436296,0
0.38218272,0.5209952,0
0.7198053,0.33228076,0
0.22466004,0.62001854,0
0.6591748,0.26790795,0
0.6114052,0.41226086,0
0.7463779,0.35225952,0
0.49803385,0.6132664,0
0.2784684,0.5180798,0
0.22733134,0.60513484,0
0.6219217,0.36607873,0
0.17600314,0.56953305,0
0.632927,0.3912187,0
0.28880095,0.5976333,0
0.24112348,0.6233076,0
0.2062546,0.61410886,0
0.5528327,0.44611803,0
0.65526026,0.38257098,0
0.46079567,0.6069519,0
0.65812373,0.29941368,0
0.15538453,0.6447673,0
0.7806468,0.31532797,0
0.6725899,0.29084393,0
0.41646838,0.53917336,0
0.6940953,0.36005497,0
0.7639572,0.3548998,0
0.749281,0.3810362,0
0.25475684,0.5930377,0
0.6628781,0.26805803,0
0.7717541,0.30555838,0
0.6879602,0.34009257,0
0.59243506,0.47838914,0
0.76227206,0.34417954,0
0.44393706,0.44178006,0
0.21372215,0.61240596,0
0.21252297,0.597565,0
0.1565553,0.6208986,0
0.3107027,0.5780935,0
0.7360652,0.30716956,0
0.76325876,0.30869517,0
0.71245664,0.32247543,0
0.72091264,0.30499658,0
0.2797018,0.5626158,0
0.46983358,0.27989396,0
0.22219713,0.65471745,0
0.24376027,0.6089091,0
0.8144158,0.29434714,0
0.49868444,0.54721254,0
0.76126796,0.31628332,0
0.5346433,0.38545,0
0.7298925,0.4068038,0
0.33188552,0.5942334,0
0.44756573,0.531894,0
0.7522299,0.30569696,0
0.6826055,0.35796577,0
0.77849287,0.31233126,0
0.694886,0.3842574,0
0.15062842,0.6314155,0
0.5499458,0.26536813,0
0.7731921,0.35108897,0
0.63098276,0.45593998,0
0.59267795,0.33128753,0
0.19390377,0.6595077,0
0.4605722,0.52015346,0
0.47590235,0.5108036,0
0.7707086,0.3182968,0
0.6471644,0.4154207,0
0.42053297,0.36296955,0
0.41075203,0.5221233,0
0.73712695,0.4008263,0
0.4619535,0.48729524,0
0.45924926,0.3814074,0
0.34010988,0.56967604,0
0.23206414,0.6300113,0
0.8039335,0.3397467,0
0.42462716,0.5283881,0
0.4345867,0.5566132,0
0.20695399,0.6321194,0
0.18555428,0.6572761,0
0.24762051,0.51003206,0
0.46415746,0.43851605,0
0.7574344,0.37978786,0
0.5756302,0.39398444,0
0.5725907,0.46264914,0
0.49443617,0.50059766,0
0.63001436,0.31877708,0
0.28237745,0.5991025,0
0.7579268,0.32330808,0
0.55263996,0.37102997,0
0.7235477,0.30833012,0
0.41925508,0.50979686,0
0.4813146,0.51622236,0
0.50618714,0.42037353,0
0.58190745,0.4694163,0
0.6138285,0.36819595,0
0.33617118,0.58031327,0
0.82785964,0.31598046,0
0.25734162,0.6110788,0
0.41058558,0.26564988,0
0.57876813,0.24543914,0
0.68553704,0.28519621,0
0.7485394,0.38306135,0
0.694601,0.3355334,0
0.7169013,0.3590018,0
0.29514173,0.5499155,0
0.6821454,0.36850998,0
0.6462531,0.34536025,0
0.6893487,0.34695786,0
0.43710208,0.46733183,0
0.7424556,0.27818185,0
0.46295604,0.43165505,0
0.61710984,0.40310925,0
0.28126118,0.5834992,0
0.74476683,0.31016415,0
0.48307624,0.3811517,0
0.6681237,0.3093418,0
0.5662273,0.3982101,0
0.6373531,0.48649138,0
0.233708,0.6089394,0
0.6378711,0.3853521,0
0.4888734,0.45241517,0
0.65857965,0.3660985,0
0.75775063,0.2771279,0
0.5658194,0.36725122,0
0.67333674,0.42045876,0
0.2907452,0.61320776,0
0.77657926,0.36625335,0
0.63664806,0.4092325,0
0.7061539,0.3388109,0
0.54595387,0.46110275,0
0.27042472,0.60870457,0
0.5093719,0.53051955,0
0.36849317,0.5800061,0
0.23657028,0.6053818,0
0.26436862,0.6383599,0
0.6273651,0.33924183,0
0.6775019,0.3089751,0
0.5612106,0.41712028,0
0.7582369,0.31493276,0
0.7116867,0.39078173,0
0.19257382,0.635208,0
0.6456372,0.3561155,0
0.61649036,0.3127416,0
0.7054363,0.3397659,0
0.69416213,0.307398,0
0.42261055,0.4747253,0
0.55871564,0.43019557,0
0.68871003,0.31489846,0
0.2660959,0.5880407,0
0.7121226,0.37997118,0
0.35365906,0.35433635,0
0.1946151,0.6060642,0
0.13842918,0.65890926,0
0.7925848,0.3390978,0
0.58104193,0.33578828,0
0.36068895,0.5158406,0
0.684713,0.33492708,0
0.77878475,0.40311214,0
0.6530473,0.2868257,0
0.18388008,0.63636726,0
0.5779294,0.3941429,0
0.61048305,0.40805805,0
0.38374075,0.26867813,0
0.52331895,0.5019988,0
0.36968657,0.43646485,0
0.6157501,0.41191158,0
0.47522813,0.3296873,0
0.5841861,0.28146368,0
0.30156225,0.5744056,0
0.6624287,0.31707487,0
0.24493372,0.6339417,0
0.74475956,0.40349746,0
0.74916804,0.38427657,0
0.5616679,0.3876077,0
0.67427254,0.34129658,0
0.30320272,0.5325068,0
0.5321862,0.41926286,0
0.6345626,0.2618722,0
0.56717324,0.41408044,0
0.33726943,0.5645117,0
0.21613792,0.41755432,0
0.1440202,0.6850159,0
0.6733869,0.3709187,0
0.32946804,0.5708881,0
0.6733532,0.41035956,0
0.7539925,0.3096534,0
0.4946474,0.47059152,0
0.26949283,0.56673986,0
0.39144513,0.41216832,0
0.58908904,0.45295334,0
0.5564253,0.4135903,0
0.55813795,0.39719075,0
0.6788953,0.4039517,0
0.7435712,0.3531148,0
0.69493383,0.29967052,0
0.43030918,0.4574044,0
0.75748634,0.4075006,0
0.320897,0.5502245,0
0.65321094,0.3917211,0
0.6452263,0.3373078,0
0.63505524,0.31548172,0
0.37140435,0.5285555,0
0.5017296,0.45727423,0
0.26409742,0.62251586,0
0.62176335,0.4166891,0
0.26571548,0.6223053,0
0.69320875,0.29259953,0
0.65278333,0.2923505,0
0.51277304,0.37609458,0
0.21899919,0.6263056,0
0.6145317,0.44147363,0
0.7794522,0.33562332,0
0.13650493,0.64590335,0
0.6923161,0.3904014,0
0.55747604,0.43971977,0
0.25158697,0.4957174,0
0.68420035,0.2926704,0
0.7621878,0.29632998,0
0.73367506,0.3372408,0
0.33158717,0.591665,0
0.7832498,0.29715416,0
0.5716229,0.4594093,0
0.33648026,0.5686099,0
0.7882093,0.34231392,0
0.72961724,0.29410064,0
0.1575843,0.57791626,0
0.73655546,0.29780748,0
0.41022447,0.5000582,0
0.18999271,0.6448304,0
0.7964594,0.29487258,0
0.2483487,0.6104244,0
0.48568627,0.43667433,0
0.4976419,0.50204575,0
0.44317132,0.5391254,0
0.1642836,0.6438217,0
0.7178707,0.35122514,0
0.62073547,0.33842766,0
0.39901605,0.4521165,0
0.70905614,0.35952282,0
0.29800117,0.5147094,0
0.6063376,0.3555358,0
0.32017764,0.5246735,0
0.20971961,0.6129748,0
0.7108354,0.3713406,0
0.4098791,0.26881334,0
0.22123004,0.23617686,1
0.24017952,0.26326907,1
0.17904799,0.4632707,1
0.23552623,0.24344547,1
0.1732537,0.284257,1
0.33826262,0.2804703,1
0.21071441,0.2610861,1
0.2139037,0.2762502,1
0.14600916,0.34809715,1
0.19551484,0.2916847,1
0.18145004,0.36948654,1
0.20836955,0.28443202,1
0.18716314,0.31228042,1
0.29900187,0.29339063,1
0.17484783,0.36988464,1
0.1862329,0.33886963,1
0.21689948,0.2533685,1
0.13456134,0.52415854,1
0.17823914,0.31475547,1
0.21689147,0.23389159,1
0.2098863,0.33575362,1
0.14717919,0.61205,1
0.21549731,0.25362667,1
0.13439177,0.5727597,1
0.54249054,0.24407336,1
0.5032161,0.38112387,1
0.18938436,0.41434512,1
0.23832183,0.24671924,1
0.18817106,0.2977509,1
0.17003551,0.2892019,1
0.24935402,0.30451766,1
0.16737647,0.4149411,1
0.21450001,0.35197505,1
0.16003306,0.384585,1
0.17981896,0.42237937,1
0.18339507,0.3213837,1
0.17627048,0.35388616,1
0.22609302,0.26495725,1
0.19898073,0.26648217,1
0.19458626,0.264415,1
0.39679244,0.52969956,1
0.17595242,0.31162757,1
0.36136577,0.24110112,1
0.1516501,0.42159194,1
0.14868616,0.39639124,1
0.26505584,0.24132657,1
0.15461197,0.39007166,1
0.17443377,0.31187087,1
0.17319028,0.36438558,1
0.2233309,0.24213208,1
0.1398549,0.52453214,1
0.17116429,0.33495054,1
0.19652747,0.2516797,1
0.27156729,0.2755811,1
0.39482775,0.23263052,1
0.16347729,0.39050907,1
0.19179185,0.27676624,1
0.281359,0.28134373,1
0.34755155,0.3669877,1
0.22802244,0.3574847,1
0.2215892,0.41399798,1
0.2969249,0.24688555,1
0.16256498,0.4022725,1
0.2581849,0.2564476,1
0.212313,0.2903982,1
0.1929652,0.3829369,1
0.2781558,0.4289664,1
0.21991388,0.24631904,1
0.39054328,0.5372018,1
0.297018,0.23568766,1
0.15036768,0.5287742,1
0.17378628,0.38262925,1
0.22597544,0.2674778,1
0.15020335,0.41432112,1
0.325805,0.31979054,1
0.16453539,0.43348253,1
0.36487642,0.44441432,1
0.4382303,0.2913889,1
0.20046598,0.26133123,1
0.1641391,0.50822985,1
0.23910947,0.41698578,1
0.21208449,0.2407747,1
0.17758077,0.33779845,1
0.5442143,0.3430346,1
0.31073916,0.25968853,1
0.14173603,0.46285784,1
0.44282869,0.24000558,1
0.17391175,0.44757622,1
0.40776274,0.3451646,1
0.22241959,0.23357883,1
0.16004825,0.33995,1
0.22854353,0.25988686,1
0.19930033,0.25306782,1
0.26211727,0.3062923,1
0.20845906,0.30068138,1
0.17677413,0.302478,1
0.15422058,0.39465374,1
0.20140356,0.48730713,1
0.23903799,0.4360578,1
0.3571024,0.31060514,1
0.22099021,0.25829548,1
0.12716702,0.5155242,1
0.18009537,0.31060287,1
0.2515192,0.2697448,1
0.21455675,0.42417544,1
0.28793702,0.53323406,1
0.29124504,0.30819842,1
0.17191546,0.2936433,1
0.209895,0.30228665,1
0.39088383,0.32468113,1
0.1598264,0.39292112,1
0.28787845,0.2446101,1
0.34536982,0.2924698,1
0.34832934,0.39078036,1
0.358198,0.42421162,1
0.13714515,0.5412307,1
0.2938666,0.4192693,1
0.1728285,0.40068424,1
0.2004057,0.46268865,1
0.15780729,0.44736952,1
0.17573136,0.28092983,1
0.1922473,0.3493921,1
0.3475097,0.4852355,1
0.284097,0.23183791,1
0.22616002,0.33250436,1
0.1998875,0.32690388,1
0.18118538,0.3104796,1
0.23396905,0.35687268,1
0.26050583,0.43973255,1
0.15684539,0.35677338,1
0.2576751,0.2380393,1
0.16334338,0.41181585,1
0.16640715,0.46128774,1
0.15312426,0.4149129,1
0.27520353,0.3014419,1
0.1786648,0.31021243,1
0.5027722,0.27558514,1
0.21389937,0.39556774,1
0.25081056,0.26392674,1
0.2304388,0.23699798,1
0.13472006,0.6060208,1
0.18188295,0.28858367,1
0.14710024,0.5004372,1
0.20086052,0.3018715,1
0.23536798,0.23240371,1
0.60858595,0.29406908,1
0.14754899,0.51673335,1
0.35699525,0.23572585,1
0.21753593,0.2564993,1
0.19300632,0.27561072,1
0.1556594,0.44839492,1
0.21544461,0.42912582,1
0.14562587,0.49231175,1
0.13442475,0.5843674,1
0.21968415,0.26519603,1
0.39605328,0.3662101,1
0.21793517,0.28457943,1
0.2235536,0.23519047,1
0.18027769,0.34680468,1
0.32843828,0.23678942,1
0.30777937,0.28540733,1
0.1590227,0.35347983,1
0.15290926,0.47867697,1
0.24456446,0.24741612,1
0.21366072,0.25733325,1
0.17931631,0.4070387,1
0.28296423,0.50608563,1
0.18174133,0.2625656,1
0.18699397,0.38161263,1
0.19941463,0.25930706,1
0.1899144,0.27885175,1
0.21687669,0.2599975,1
0.18909863,0.57796127,1
0.27322516,0.5200912,1
0.17443576,0.3907145,1
0.1593104,0.42610013,1
0.20577335,0.34192327,1
0.19552375,0.25971597,1
0.17743942,0.3575586,1
0.1878631,0.45565766,1
0.18467383,0.2842612,1
0.18828891,0.2978256,1
0.20940228,0.24527037,1
0.19493273,0.45135182,1
0.21427165,0.29570428,1
0.4275954,0.25114745,1
0.19674718,0.28821123,1
0.20034797,0.25442225,1
0.1299062,0.5365276,1
0.1451392,0.4750135,1
0.20295124,0.39756188,1
0.54079115,0.29723606,1
0.16908973,0.281036,1
0.21269475,0.2537878,1
0.16633043,0.3949232,1
0.22990707,0.26927286,1
0.2707037,0.24137563,1
0.18027084,0.30735207,1
0.17939094,0.34651658,1
0.19219491,0.328311,1
0.23195907,0.40885967,1
0.20239395,0.3195587,1
0.21610852,0.27453816,1
0.18431294,0.2849864,1
0.18308982,0.45537022,1
0.1643326,0.4963139,1
0.18358392,0.39369962,1
0.18825282,0.29949507,1
0.13893656,0.49423587,1
0.40890455,0.4001938,1
0.15547578,0.42491382,1
0.1686635,0.3470472,1
0.18499811,0.26419032,1
0.18581875,0.33293682,1
0.24253358,0.42225027,1
0.32768744,0.2751567,1
0.20164047,0.25289828,1
0.17931718,0.27620924,1
0.1831163,0.3129062,1
0.5887126,0.40897322,1
0.22515647,0.31111386,1
0.34633508,0.5923973,1
0.17390792,0.30400082,1
0.20481813,0.26045552,1
0.19996564,0.2797081,1
0.25653124,0.2326875,1
0.1749259,0.35784957,1
0.20875955,0.28210548,1
0.24355423,0.36557513,1
0.17588979,0.31669846,1
0.29768562,0.23985302,1
0.17003274,0.31236008,1
0.20631517,0.26933897,1
0.25184974,0.3500261,1
0.2085238,0.24423738,1
0.15822798,0.3546692,1
0.3222863,0.24676928,1
0.21478912,0.259396,1
0.17120221,0.47035536,1
0.25727904,0.2480875,1
0.38589647,0.51535046,1
0.17426582,0.4076541,1
0.27418947,0.23897822,1
0.22380435,0.27415165,1
0.42866418,0.3492029,1
0.20791651,0.3254484,1
0.19927917,0.3447722,1
0.21401556,0.33412576,1
0.18908119,0.29940942,1
0.3685546,0.5390766,1
0.2584,0.27324688,1
0.49437043,0.2654466,1
0.14656758,0.47886294,1
0.2690792,0.25804353,1
0.585166,0.2847338,1
0.17521891,0.3941226,1
0.19956358,0.31910908,1
0.18738969,0.2826023,1
0.18023205,0.36772904,1
0.16321766,0.53364384,1
0.20822813,0.33156142,1
0.2006614,0.29437748,1
0.2043263,0.28737438,1
0.54163957,0.41401893,1
0.2726478,0.27138412,1
0.27903047,0.26066732,1
0.4170323,0.23402296,1
0.1875028,0.35066524,1
0.33461988,0.4117292,1
0.1516857,0.44615927,1
0.17329186,0.31788248,1
0.18435271,0.31962433,1
0.19113675,0.31401983,1
0.21167369,0.25732207,1
0.1585588,0.41326687,1
0.19274329,0.31111547,1
0.4624025,0.3838182,1
0.26738977,0.56183106,1
0.21287832,0.26555142,1
0.22806668,0.24907,1
0.17372485,0.46097934,1
0.3107497,0.29321072,1
0.25545245,0.2711181,1
0.22291076,0.27421138,1
0.18445285,0.34793332,1
0.16743869,0.36967966,1
0.18912312,0.3444269,1
0.16015404,0.40687585,1
0.1701642,0.41560763,1
0.1807212,0.25820175,1
0.2177464,0.3462194,1
0.3244702,0.40448135,1
0.1717451,0.3954819,1
0.17005056,0.31101537,1
0.18131699,0.39864832,1
0.16080773,0.39577428,1
0.17534353,0.39576903,1
0.3988901,0.25420684,1
0.18806778,0.35232735,1
0.16277245,0.35194921,1
0.14958476,0.36542454,1
0.17024691,0.35079804,1
0.20608121,0.2747518,1
0.2788764,0.47006813,1
0.15709567,0.4460114,1
0.39290854,0.2545476,1
0.26302898,0.2709138,1
0.18030861,0.40362298,1
0.30419588,0.26745316,1
0.26310483,0.5196648,1
0.19095811,0.34044424,1
0.16045673,0.34524196,1
0.24326277,0.28521115,1
0.2910876,0.2848646,1
0.1918325,0.33050588,1
0.24604826,0.24324256,1
0.15690029,0.46773505,1
0.25671515,0.23690529,1
0.18633069,0.35175687,1
0.62097394,0.28922364,1
0.16093172,0.44764656,1
0.51041645,0.34888393,1
0.17374134,0.30337685,1
0.32979164,0.26075244,1
0.48427507,0.39397654,1
0.21671233,0.31660992,1
0.15934989,0.49678934,1
0.2266225,0.26334468,1
0.39855093,0.5585793,1
0.26772562,0.26010835,1
0.18761815,0.30491018,1
0.2251758,0.28803885,1
0.19928339,0.29371956,1
0.19379468,0.26601672,1
0.16679718,0.36984435,1
0.19961818,0.25274372,1
0.21930449,0.2503537,1
0.2164169,0.3139884,1
0.134335,0.50331664,1
0.17858152,0.39904106,1
0.20252685,0.41914707,1
0.4281175,0.23133376,1
0.16571935,0.40649736,1
0.18146852,0.33821914,1
0.30370396,0.28376326,1
0.21642284,0.27326262,1
0.2289168,0.29131696,1
0.3804494,0.23268312,1
0.19774567,0.31073982,1
0.18991816,0.41529283,1
0.20336314,0.53151274,1
0.20237947,0.30769598,1
0.16848783,0.36234343,1
0.18502663,0.31467888,1
0.19827497,0.44901425,1
0.18705826,0.41675797,1
0.17629269,0.3177681,1
0.30375367,0.35237637,1
0.32308862,0.40064645,1
0.14587499,0.44136107,1
0.43208718,0.30943635,1
0.16510393,0.3230455,1
0.20286459,0.2549145,1
0.15691532,0.66598666,1
0.18409608,0.29850143,1
0.13480264,0.4800109,1
0.38177133,0.24707112,1
0.39714277,0.24169058,1
0.16661097,0.31079477,1
0.14842968,0.46643397,1
0.17269395,0.31991318,1
0.18832383,0.332975,1
0.18492118,0.27961752,1
0.1259982,0.5197847,1
0.19285539,0.29574767,1
0.2198129,0.24680056,1
0.17826143,0.28684288,1
0.16112082,0.32175195,1
0.18653427,0.27030894,1
0.21549362,0.24711168,1
0.22440176,0.33942404,1
0.19748446,0.26531845,1
0.2016836,0.3852126,1
0.52448773,0.24768972,1
0.21494935,0.32316312,1
0.2306577,0.29280174,1
0.20922826,0.3122724,1
0.16381139,0.34185565,1
0.20142105,0.27264693,1
0.31165805,0.39827666,1
0.22569728,0.26833326,1
0.16778864,0.40621746,1
0.24460857,0.24951333,1
0.16543229,0.33908364,1
0.16510801,0.39047083,1
0.4882307,0.2849602,1
0.2100148,0.36282316,1
0.22638702,0.23652573,1
0.20469701,0.39525047,1
0.23282202,0.27526516,1
0.17255622,0.29709905,1
0.17845367,0.31871587,1
0.19686727,0.3331267,1
0.20256656,0.24842522,1
0.128206,0.5915449,1
0.17457968,0.3072053,1
0.1643513,0.4851217,1
0.275514,0.26033536,1
0.13848025,0.5020887,1
0.2026124,0.4371867,1
0.19425915,0.27866474,1
0.19169757,0.3311646,1
0.16415808,0.40582982,1
0.24845444,0.4257889,1
0.17924476,0.32347018,1
0.46602094,0.2677463,1
0.26788038,0.23021518,1
0.17069753,0.31614643,1
0.14190911,0.4505317,1
0.16079587,0.3800571,1
0.23487791,0.27092394,1
0.18205242,0.41592112,1
0.23920614,0.40356746,1
0.15246814,0.5104242,1
0.30167484,0.39275968,1
0.16397662,0.3913268,1
0.18887562,0.26933956,1
0.16696298,0.378654,1
0.20367055,0.28935757,1
0.21987534,0.24814954,1
0.21963249,0.26621705,1
0.13437743,0.4898589,1
0.28641978,0.3034932,1
0.20499784,0.3994488,1
0.1347166,0.49616107,1
0.20777892,0.29721466,1
0.17356426,0.45786253,1
0.25925434,0.26761714,1
0.32119372,0.25415307,1
0.20476133,0.2657799,1
0.16945803,0.43178502,1
0.18338335,0.30708447,1
0.16994722,0.34885913,1
0.20265594,0.26678792,1
0.17743401,0.31588012,1
0.23354928,0.2340682,1
0.2000802,0.26598242,1
0.17738609,0.38636875,1
0.15730278,0.32646328,1
0.18713987,0.30654743,1
0.14767525,0.4144517,1
0.27482134,0.30663657,1
0.22220805,0.24133174,1
0.51263463,0.2883819,1
0.26051116,0.25750035,1
0.5565295,0.42371082,1
0.43982628,0.54342,1
0.17682835,0.41963637,1
0.15669163,0.41591978,1
0.1603193,0.33699206,1
0.2332579,0.23810369,1
0.14092319,0.47438946,1
0.20957984,0.38207033,1
0.20294723,0.3970335,1
0.21473299,0.25619033,1
0.13158205,0.51368845,1
0.2659556,0.25211322,1
0.19497944,0.28509578,1
0.18825836,0.3139217,1
0.20993727,0.25237447,1
0.24033424,0.24827822,1
0.35472393,0.3012173,1
0.1681074,0.32406628,1
0.16378409,0.35580802,1
0.17320412,0.39768964,1
0.184307,0.3122118,1
0.14182131,0.4987247,1
0.22237577,0.4877412,1
0.16592504,0.30828732,1
0.616521,0.31333894,1
0.16060404,0.4123381,1
0.15953548,0.34110737,1
0.14260548,0.52186656,1
0.20022315,0.2536543,1
0.15966992,0.3976111,1
0.26212746,0.22959338,1
0.15143117,0.45905042,1
0.15138467,0.4103385,1
0.18559106,0.40980828,1
0.14720243,0.3803095,1
0.1444894,0.45219764,1
0.262606,0.254799,1
0.37351868,0.46352232,1
0.5742734,0.37609386,1
0.22672649,0.43016994,1
0.1794648,0.3042822,1
0.15846258,0.36088237,1
0.1867965,0.3567986,1
0.193399,0.34679708,1
0.17485869,0.29361182,1
0.18451673,0.33033884,1
0.2818135,0.52086115,1
0.23049213,0.27476165,1
0.2694889,0.4439158,1
0.1676135,0.38730815,1
0.19735414,0.26210684,1
0.22695021,0.2624588,1
0.2586045,0.3672053,1
0.1893365,0.38168237,1
0.24314903,0.29954305,1
0.20823862,0.2479952,1
0.24567217,0.2613402,1
0.17783731,0.32879668,1
0.16058016,0.42401332,1
0.24964981,0.27882737,1
0.21363054,0.26552463,1
0.14436725,0.4617651,1
0.23638938,0.27544317,1
0.26220334,0.39805138,1
0.20428777,0.26521295,1
0.14243028,0.4541301,1
0.14020212,0.5193477,1
0.21054082,0.2553064,1
0.45365986,0.3486585,1
0.24541797,0.40101644,1
0.16576861,0.3429082,1
0.20662895,0.27189717,1
0.21290624,0.5830982,1
0.19760841,0.31869152,1
0.25978866,0.5219181,1
0.17840114,0.30722815,1
0.18554148,0.34491366,1
0.20652457,0.25376165,1
0.16818835,0.47179523,1
0.24795654,0.56235605,1
0.2512283,0.26288468,1
0.19324772,0.32428828,1
0.18156686,0.2720085,1
0.28808933,0.28262594,1
0.13511254,0.48838755,1
0.1334924,0.5031849,1
0.2258301,0.23346037,1
0.19734485,0.28232306,1
0.14335158,0.46237224,1
0.16911331,0.34209007,1
0.21538058,0.2532326,1
0.17255239,0.27048194,1
0.22855514,0.33605146,1
0.15598044,0.37040275,1
0.18476154,0.4321746,1
0.21180598,0.34005812,1
0.19661309,0.27349404,1
0.14356928,0.5555033,1
0.23837963,0.25223422,1
0.12913655,0.4999591,1
0.2340466,0.23598118,1
0.23233393,0.27097756,1
0.20735568,0.2519672,1
0.17034478,0.35763142,1
0.19048567,0.37100196,1
0.2893439,0.3275252,1
0.15263708,0.38478056,1
0.17659514,0.38261348,1
0.19640109,0.36497277,1
0.15311207,0.44699582,1
0.15154591,0.3758711,1
0.19837552,0.29919246,1
0.14766945,0.4811851,1
0.20510171,0.3728039,1
0.18933415,0.31016773,1
0.18651132,0.41899863,1
0.19313577,0.35106638,1
0.22689724,0.28194797,1
0.15104625,0.5009359,1
0.40487307,0.3349025,1
0.24133079,0.2611894,1
0.15324269,0.41329935,1
0.22449155,0.29820493,1
0.21963893,0.24008773,1
0.31377324,0.31478846,1
0.38424015,0.3884676,1
0.1749921,0.32463008,1
0.34686598,0.46872362,1
0.2528867,0.25383458,1
0.194262,0.3677523,1
0.20247497,0.33702734,1
0.1933424,0.24864712,1
0.16819236,0.3098763,1
0.18376394,0.28411552,1
0.18572092,0.32028553,1
0.15960082,0.37172824,1
0.20077652,0.31861323,1
0.14561163,0.47496086,1
0.18295021,0.31903827,1
0.26958385,0.27652562,1
0.27548623,0.4230257,1
0.622398,0.30682585,1
0.191908,0.2870748,1
0.12854709,0.5018675,1
0.19763075,0.32280308,1
0.25349897,0.23613362,1
0.23084837,0.30440173,1
0.22030704,0.2610334,1
0.19623938,0.37403628,1
0.21021463,0.24579549,1
0.2223157,0.23467894,1
0.19478129,0.3008002,1
0.24384266,0.24117401,1
0.14741677,0.52250385,1
0.18890992,0.40028352,1
0.17737354,0.29404142,1
0.26904973,0.24275853,1
0.21839404,0.38100547,1
0.27066538,0.28392604,1
0.23329467,0.36875397,1
0.3252547,0.2673825,1
0.4403513,0.35330337,1
0.20371403,0.26760378,1
0.13899265,0.4599236,1
0.15355937,0.45401496,1
0.23784213,0.24665801,1
0.22019397,0.34546155,1
0.16296804,0.607037,1
0.22137043,0.27337378,1
0.32360914,0.37987158,1
0.18137567,0.29748172,1
0.17584983,0.40427393,1
0.18467093,0.2944345,1
0.15807442,0.3617379,1
0.1679089,0.3404905,1
0.18184696,0.2828975,1
0.17457204,0.34654376,1
0.18526703,0.3017408,1
0.18067193,0.29470435,1
0.48799372,0.31509626,1
0.16765404,0.38185835,1
0.14181262,0.44488814,1
0.20414004,0.29924205,1
0.18046382,0.34175622,1
0.390216,0.4334018,1
0.24218684,0.23861031,1
0.16151486,0.34920081,1
0.20570974,0.24392928,1
0.24266069,0.27295673,1
0.15657504,0.49554703,1
0.1802297,0.29352254,1
0.36010003,0.2690759,1
0.14320567,0.47968915,1
0.17470977,0.41385782,1
0.18999515,0.29727015,1
0.51361,0.24003805,1
0.19248599,0.42781514,1
0.16561005,0.3404434,1
0.17076565,0.44109082,1
0.20641679,0.2858498,1
0.5622057,0.31608385,1
0.20888509,0.29169247,1
0.45726317,0.24922031,1
0.27229962,0.43819076,1
0.22864883,0.25463507,1
0.4449,0.43687472,1
0.19805837,0.3470873,1
0.16512725,0.3520525,1
0.1659456,0.29324618,1
0.14024289,0.5118332,1
0.21951878,0.23941827,1
0.2277165,0.35752624,1
0.194778,0.31159547,1
0.14443092,0.416981,1
0.1846167,0.30962688,1
0.18096654,0.335183,1
0.26198712,0.24292578,1
0.21452196,0.24438736,1
0.499163,0.2754916,1
0.15935531,0.4693832,1
0.16026385,0.5820745,1
0.16139562,0.40878865,1
0.22863697,0.258839,1
0.17198075,0.5354094,1
0.16957533,0.3681973,1
0.14295484,0.44617924,1
0.2804152,0.2411381,1
0.19426298,0.31904584,1
0.20594649,0.2613322,1
0.47756094,0.4353014,1
0.24382246,0.5202052,1
0.48164845,0.2972464,1
0.38132572,0.26605853,1
0.37427074,0.28941473,1
0.22369117,0.30070055,1
0.28994796,0.33614072,1
0.2190929,0.279876,1
0.18065,0.2910681,1
0.47964075,0.43062088,1
0.21047096,0.25253925,1
0.12144646,0.6153626,1
0.2084399,0.49982452,1
0.19409034,0.25094986,1
0.23565152,0.24506694,1
0.16077036,0.31236753,1
0.15991277,0.3629886,1
0.2983669,0.2818477,1
0.14923517,0.3913817,1
0.21251479,0.3339628,1
0.16589202,0.31113258,1
0.17647219,0.5018331,1
0.17816404,0.29490724,1
0.2240154,0.31485116,1
0.22114056,0.24039978,1
0.22596107,0.25256017,1
0.2521619,0.24088724,1
0.23387814,0.35442588,1
0.14682019,0.4353124,1
0.25465375,0.23517594,1
0.17034863,0.47467616,1
0.1511995,0.38036346,1
0.18929125,0.2940862,1
0.18851127,0.4015369,1
0.18166989,0.33575577,1
0.23125787,0.24540304,1
0.26575994,0.2696508,1
0.23472281,0.35815006,1
0.2831838,0.28787732,1
0.17761925,0.41576394,1
0.4358693,0.39711046,1
0.19307542,0.25615376,1
0.20045485,0.28767103,1
0.18483388,0.33233294,1
0.22157317,0.26385626,1
0.16628793,0.41644692,1
0.17371027,0.3290143,1
0.16690782,0.40071198,1
0.23243828,0.3842739,1
0.2098226,0.2589312,1
0.20049684,0.46450278,1
0.22964011,0.23992442,1
0.14902945,0.41380015,1
0.1465371,0.4707934,1
0.2000969,0.28098923,1
0.22195716,0.25262377,1
0.1505665,0.40746704,1
0.41539896,0.30698124,1
0.19792011,0.28144795,1
0.1572797,0.46686018,1
0.17508908,0.50629383,1
0.21671394,0.24840297,1
0.16023403,0.3863037,1
0.3154603,0.42898694,1
0.21256714,0.23998818,1
0.43138698,0.26107812,1
0.23642687,0.24874835,1
0.3501188,0.24566245,1
0.14367285,0.43907496,1
0.28226224,0.33968687,1
0.34468046,0.26717928,1
0.15258354,0.4022074,1
0.23423868,0.2989687,1
0.21709652,0.23493397,1
0.19058222,0.32091224,1
0.23073614,0.25941494,1
0.1879978,0.35069454,1
0.20676972,0.24984959,1
0.22206575,0.33798394,1
0.1827483,0.28098568,1
0.1970436,0.31115335,1
0.21303639,0.2835782,1
0.17188512,0.30661416,1
0.24407023,0.36696917,1
0.1580417,0.3961617,1
0.17085429,0.2828089,1
0.16743666,0.36161742,1
0.15559247,0.38831046,1
0.30046377,0.28827646,1
0.16202459,0.3631099,1
0.15032648,0.40941042,1
0.19267026,0.37653044,1
0.1904308,0.32177237,1
0.14015947,0.4608228,1
0.17830308,0.3109754,1
0.22319408,0.23890968,1
0.1821541,0.42352206,1
0.1798894,0.28955618,1
0.16828012,0.4048839,1
0.20983118,0.39795583,1
0.14950128,0.49038252,1
0.16051035,0.32361084,1
0.24188304,0.24700317,1
0.15574694,0.32089552,1
0.22000399,0.25108525,1
0.20997024,0.2612308,1
0.28628942,0.31255117,1
0.42589623,0.2479633,1
0.18370235,0.2954604,1
0.20334013,0.36634848,1
0.16401877,0.39026737,1
0.17974375,0.32943785,1
0.14628099,0.3996089,1
0.16264592,0.38009018,1
0.16992073,0.43432164,1
0.18209831,0.2800515,1
0.25105026,0.49313483,1
0.18293805,0.25687328,1
0.2520644,0.29481295,1
0.23499444,0.26288682,1
0.22768019,0.5598358,1
0.27771926,0.23974761,1
0.17781898,0.28851667,1
0.20201288,0.2785655,1
0.24221762,0.38958532,1
0.44993085,0.3215025,1
0.23052455,0.26132056,1
0.25845197,0.23550707,1
0.15495469,0.5139796,1
0.19170046,0.3133036,1
0.18004796,0.27036136,1
0.17762244,0.4515801,1
0.18611428,0.32259184,1
0.16674697,0.3884484,1
0.1670379,0.38081977,1
0.19648632,0.6552984,1
0.12692246,0.5345702,1
0.34361845,0.24066089,1
0.3820207,0.24134085,1
0.22737718,0.30086735,1
0.20294231,0.27288476,1
0.1762117,0.3049824,1
0.36801147,0.26642337,1
0.17231917,0.32387444,1
0.17257346,0.38855657,1
0.20908323,0.2685228,1
0.1669327,0.32437855,1
0.19228257,0.28615463,1
0.17418234,0.31340393,1
0.20464288,0.28205934,1
0.24360992,0.45025083,1
0.19350366,0.26156223,1
0.13276468,0.46680152,1
0.21389666,0.43561015,1
0.27890727,0.35275385,1
0.16755132,0.43831205,1
0.6130555,0.45539445,1
0.176446,0.30682656,1
0.17963001,0.40429863,1
0.185917,0.27885106,1
0.18848948,0.34807146,1
0.21056378,0.2828238,1
0.16616556,0.33821353,1
0.24979076,0.26277938,1
0.1924839,0.35773426,1
0.14478332,0.50261927,1
0.15483263,0.37987912,1
0.22167169,0.2367936,1
0.16717649,0.36591202,1
0.15566108,0.4796264,1
0.19772744,0.2691609,1
0.41192722,0.35141435,1
0.17865272,0.30236578,1
0.16463064,0.4841117,1
0.15346304,0.43267253,1
0.18413958,0.27855814,1
0.14084391,0.49300244,1
0.16338271,0.34532952,1
0.1312567,0.40166125,1
0.36214718,0.23866817,1
0.24877279,0.26391968,1
0.21189542,0.24223904,1
0.38362977,0.27568147,1
0.1627229,0.43700218,1
0.17298886,0.3152617,1
0.18599187,0.27756628,1
0.29020244,0.2739996,1
0.16721919,0.40890017,1
0.14429985,0.4641391,1
0.15990742,0.37907556,1
0.1608109,0.31804052,1
0.3990685,0.5413497,1
0.5893016,0.3023409,1
0.24328332,0.2818454,1
0.17767203,0.3969876,1
0.16059364,0.3999213,1
0.15155867,0.3955392,1
0.20015183,0.2690333,1
0.23548715,0.2775135,1
0.1835341,0.33619407,1
0.13781002,0.38787055,1
0.2168058,0.42813525,1
0.15277687,0.4705402,1
0.15375802,0.4059938,1
0.15977652,0.5322735,1
0.31709802,0.35474402,1
0.22570537,0.24594277,1
0.1712384,0.31399447,1
0.27079558,0.33808553,1
0.2666293,0.29950738,1
0.3238208,0.38316873,1
0.19246356,0.28126243,1
0.33723158,0.24029858,1
0.23659684,0.28491554,1
0.24465348,0.3349091,1
0.16064602,0.3657463,1
0.15875547,0.39501545,1
0.24927287,0.23480782,1
0.19488594,0.28188902,1
0.36070186,0.31473672,1
0.16725959,0.34678036,1
0.22414671,0.3305151,1
0.14659947,0.5302821,1
0.1604352,0.39519536,1
0.18669255,0.32486337,1
0.626448,0.42283645,1
0.15790296,0.35998908,1
0.18347116,0.36212793,1
0.3127521,0.32619527,1
0.14478824,0.43785006,1
0.21935268,0.29293844,1
0.22575828,0.45053062,1
0.142804,0.42613795,1
0.15239546,0.48174652,1
0.35619757,0.26973018,1
0.14280656,0.43678156,1
0.17985103,0.3963293,1
0.1552576,0.40105557,1
0.2387195,0.23862907,1
0.18700637,0.25775695,1
0.2062083,0.23604205,1
0.15634078,0.45811746,1
0.1977987,0.31112823,1
0.2546499,0.24900311,1
0.19275829,0.3099173,1
0.1692205,0.3052828,1
0.21780095,0.3064681,1
0.13111708,0.54332656,1
0.16696572,0.42593005,1
0.24960786,0.43031937,1
0.2839799,0.23298459,1
0.16579804,0.43277672,1
0.18231118,0.27102846,1
0.2254151,0.2377609,1
0.13471864,0.5324788,1
0.14977522,0.4308606,1
0.23121104,0.24292876,1
0.20327044,0.26727074,1
0.23315614,0.31942368,1
0.18021707,0.31545156,1
0.3386241,0.24150048,1
0.23022175,0.25440586,1
0.1620516,0.5131698,1
0.130387,0.6039873,1
0.13988504,0.5210167,1
0.1755976,0.3413767,1
0.35217726,0.29104668,1
0.17052425,0.31456473,1
0.42376134,0.48870093,1
0.20928758,0.3730557,1
0.17974147,0.2628935,1
0.1424396,0.45424473,1
0.21935979,0.3162406,1
0.2168148,0.2832387,1
0.25230673,0.26602805,1
0.26908162,0.290934,1
0.17945528,0.3566539,1
0.16151184,0.33952603,1
0.17928503,0.42579,1
0.17368464,0.2810161,1
0.18784611,0.36112267,1
0.17950733,0.33001477,1
0.25000355,0.30398467,1
0.21118592,0.2459524,1
0.49690625,0.50202507,1
0.14545058,0.40987995,1
0.16786288,0.51836234,1
0.18000194,0.3634752,1
0.21489781,0.24224184,1
0.24903865,0.36290553,1
0.25120944,0.28103897,1
0.1808018,0.32176626,1
0.17409562,0.35872227,1
0.20466398,0.24292482,1
0.15890983,0.3394605,1
0.14869878,0.51290166,1
0.17091578,0.28282088,1
0.15061508,0.4235039,1
0.23119178,0.26432016,1
0.17864662,0.31090277,1
0.17348611,0.3220428,1
0.18062845,0.30552724,1
0.24273334,0.30851808,1
0.15856224,0.31516635,1
0.18024327,0.28005368,1
0.18631145,0.42818248,1
0.16795865,0.29684713,1
0.14975728,0.38539428,1
0.29444337,0.36256295,1
0.19019589,0.31827277,1
0.18101123,0.4607069,1
0.19694147,0.2728878,1
0.2726658,0.26119775,1
0.20661877,0.28871244,1
0.17947721,0.3252502,1
0.1735484,0.356575,1
