^C:\USERS\WVDS9\DOCUMENTS\GITHUB\INFOMOV-RETRO-VOXEL-FLUIDS\WRLDTMPL8-MAIN\TEMPLATE\TEMPLATE.CPP
/c /ITEMPLATE /I. /ILIB\GLAD\INCLUDE /ILIB\GLFW\INCLUDE /ILIB\OPENCL\INC /ILIB\ZLIB /Zi /nologo /W3 /WX- /diagnostics:column /Od /D WIN32 /D _DEBUG /D _WINDOWS /D _CRT_SECURE_NO_DEPRECATE /Gm- /EHsc /RTC1 /MDd /GS /fp:fast /Zc:wchar_t /Zc:forScope /Zc:inline /openmp /std:c++17 /Yc"precomp.h" /Fp"C:\USERS\WVDS9\DOCUMENTS\GITHUB\INFOMOV-RETRO-VOXEL-FLUIDS\WRLDTMPL8-MAIN\X64\DEBUG\WATERWORLD_DEBUG.PCH" /Fo"C:\USERS\WVDS9\DOCUMENTS\GITHUB\INFOMOV-RETRO-VOXEL-FLUIDS\WRLDTMPL8-MAIN\X64\DEBUG\\" /Fd"C:\USERS\WVDS9\DOCUMENTS\GITHUB\INFOMOV-RETRO-VOXEL-FLUIDS\WRLDTMPL8-MAIN\X64\DEBUG\VC143.PDB" /external:W3 /Gd /TP /FC C:\USERS\WVDS9\DOCUMENTS\GITHUB\INFOMOV-RETRO-VOXEL-FLUIDS\WRLDTMPL8-MAIN\TEMPLATE\TEMPLATE.CPP
^C:\USERS\WVDS9\DOCUMENTS\GITHUB\INFOMOV-RETRO-VOXEL-FLUIDS\WRLDTMPL8-MAIN\CAPE.CPP
/c /ITEMPLATE /I. /ILIB\GLAD\INCLUDE /ILIB\GLFW\INCLUDE /ILIB\OPENCL\INC /ILIB\ZLIB /Zi /nologo /W3 /WX- /diagnostics:column /Od /D WIN32 /D _DEBUG /D _WINDOWS /D _CRT_SECURE_NO_DEPRECATE /Gm- /EHsc /RTC1 /MDd /GS /fp:fast /Zc:wchar_t /Zc:forScope /Zc:inline /openmp /std:c++17 /Yu"precomp.h" /Fp"C:\USERS\WVDS9\DOCUMENTS\GITHUB\INFOMOV-RETRO-VOXEL-FLUIDS\WRLDTMPL8-MAIN\X64\DEBUG\WATERWORLD_DEBUG.PCH" /Fo"C:\USERS\WVDS9\DOCUMENTS\GITHUB\INFOMOV-RETRO-VOXEL-FLUIDS\WRLDTMPL8-MAIN\X64\DEBUG\\" /Fd"C:\USERS\WVDS9\DOCUMENTS\GITHUB\INFOMOV-RETRO-VOXEL-FLUIDS\WRLDTMPL8-MAIN\X64\DEBUG\VC143.PDB" /external:W3 /Gd /TP /FC C:\USERS\WVDS9\DOCUMENTS\GITHUB\INFOMOV-RETRO-VOXEL-FLUIDS\WRLDTMPL8-MAIN\CAPE.CPP
^C:\USERS\WVDS9\DOCUMENTS\GITHUB\INFOMOV-RETRO-VOXEL-FLUIDS\WRLDTMPL8-MAIN\TEMPLATE\WORLD.CPP
/c /ITEMPLATE /I. /ILIB\GLAD\INCLUDE /ILIB\GLFW\INCLUDE /ILIB\OPENCL\INC /ILIB\ZLIB /Zi /nologo /W3 /WX- /diagnostics:column /Od /D WIN32 /D _DEBUG /D _WINDOWS /D _CRT_SECURE_NO_DEPRECATE /Gm- /EHsc /RTC1 /MDd /GS /fp:fast /Zc:wchar_t /Zc:forScope /Zc:inline /openmp /std:c++17 /Yu"precomp.h" /Fp"C:\USERS\WVDS9\DOCUMENTS\GITHUB\INFOMOV-RETRO-VOXEL-FLUIDS\WRLDTMPL8-MAIN\X64\DEBUG\WATERWORLD_DEBUG.PCH" /Fo"C:\USERS\WVDS9\DOCUMENTS\GITHUB\INFOMOV-RETRO-VOXEL-FLUIDS\WRLDTMPL8-MAIN\X64\DEBUG\\" /Fd"C:\USERS\WVDS9\DOCUMENTS\GITHUB\INFOMOV-RETRO-VOXEL-FLUIDS\WRLDTMPL8-MAIN\X64\DEBUG\VC143.PDB" /external:W3 /Gd /TP /FC C:\USERS\WVDS9\DOCUMENTS\GITHUB\INFOMOV-RETRO-VOXEL-FLUIDS\WRLDTMPL8-MAIN\TEMPLATE\WORLD.CPP
^C:\USERS\WVDS9\DOCUMENTS\GITHUB\INFOMOV-RETRO-VOXEL-FLUIDS\WRLDTMPL8-MAIN\WATERWORLD.CPP
/c /ITEMPLATE /I. /ILIB\GLAD\INCLUDE /ILIB\GLFW\INCLUDE /ILIB\OPENCL\INC /ILIB\ZLIB /Zi /nologo /W3 /WX- /diagnostics:column /Od /D WIN32 /D _DEBUG /D _WINDOWS /D _CRT_SECURE_NO_DEPRECATE /Gm- /EHsc /RTC1 /MDd /GS /fp:fast /Zc:wchar_t /Zc:forScope /Zc:inline /openmp /std:c++17 /Yu"precomp.h" /Fp"C:\USERS\WVDS9\DOCUMENTS\GITHUB\INFOMOV-RETRO-VOXEL-FLUIDS\WRLDTMPL8-MAIN\X64\DEBUG\WATERWORLD_DEBUG.PCH" /Fo"C:\USERS\WVDS9\DOCUMENTS\GITHUB\INFOMOV-RETRO-VOXEL-FLUIDS\WRLDTMPL8-MAIN\X64\DEBUG\\" /Fd"C:\USERS\WVDS9\DOCUMENTS\GITHUB\INFOMOV-RETRO-VOXEL-FLUIDS\WRLDTMPL8-MAIN\X64\DEBUG\VC143.PDB" /external:W3 /Gd /TP /FC C:\USERS\WVDS9\DOCUMENTS\GITHUB\INFOMOV-RETRO-VOXEL-FLUIDS\WRLDTMPL8-MAIN\WATERWORLD.CPP
