^C:\USERS\WVDS9\DOCUMENTS\GITHUB\INFOMOV-RETRO-VOXEL-FLUIDS\WRLDTMPL8-MAIN\X64\RELEASE\CAPE.OBJ|C:\USERS\WVDS9\DOCUMENTS\GITHUB\INFOMOV-RETRO-VOXEL-FLUIDS\WRLDTMPL8-MAIN\X64\RELEASE\TEMPLATE.OBJ|C:\USERS\WVDS9\DOCUMENTS\GITHUB\INFOMOV-RETRO-VOXEL-FLUIDS\WRLDTMPL8-MAIN\X64\RELEASE\WATERWORLD.OBJ|C:\USERS\WVDS9\DOCUMENTS\GITHUB\INFOMOV-RETRO-VOXEL-FLUIDS\WRLDTMPL8-MAIN\X64\RELEASE\WORLD.OBJ
C:\PROGRAM FILES (X86)\WINDOWS KITS\10\LIB\10.0.19041.0\UM\X64\WINMM.LIB
C:\PROGRAM FILES (X86)\WINDOWS KITS\10\LIB\10.0.19041.0\UM\X64\ADVAPI32.LIB
C:\PROGRAM FILES (X86)\WINDOWS KITS\10\LIB\10.0.19041.0\UM\X64\USER32.LIB
C:\USERS\WVDS9\DOCUMENTS\GITHUB\INFOMOV-RETRO-VOXEL-FLUIDS\WRLDTMPL8-MAIN\LIB\GLFW\LIB-VC2017\GLFW3.LIB
C:\PROGRAM FILES (X86)\WINDOWS KITS\10\LIB\10.0.19041.0\UM\X64\GDI32.LIB
C:\PROGRAM FILES (X86)\WINDOWS KITS\10\LIB\10.0.19041.0\UM\X64\SHELL32.LIB
C:\USERS\WVDS9\DOCUMENTS\GITHUB\INFOMOV-RETRO-VOXEL-FLUIDS\WRLDTMPL8-MAIN\LIB\OPENCL\LIB\X64\OPENCL.LIB
C:\PROGRAM FILES (X86)\WINDOWS KITS\10\LIB\10.0.19041.0\UM\X64\OPENGL32.LIB
C:\USERS\WVDS9\DOCUMENTS\GITHUB\INFOMOV-RETRO-VOXEL-FLUIDS\WRLDTMPL8-MAIN\LIB\ZLIB\LIBZ-STATIC.LIB
C:\USERS\WVDS9\DOCUMENTS\GITHUB\INFOMOV-RETRO-VOXEL-FLUIDS\WRLDTMPL8-MAIN\X64\RELEASE\WATERWORLD.OBJ
C:\USERS\WVDS9\DOCUMENTS\GITHUB\INFOMOV-RETRO-VOXEL-FLUIDS\WRLDTMPL8-MAIN\X64\RELEASE\CAPE.OBJ
C:\USERS\WVDS9\DOCUMENTS\GITHUB\INFOMOV-RETRO-VOXEL-FLUIDS\WRLDTMPL8-MAIN\X64\RELEASE\TEMPLATE.OBJ
C:\USERS\WVDS9\DOCUMENTS\GITHUB\INFOMOV-RETRO-VOXEL-FLUIDS\WRLDTMPL8-MAIN\X64\RELEASE\WORLD.OBJ
C:\WINDOWS\GLOBALIZATION\SORTING\SORTDEFAULT.NLS
C:\PROGRAM FILES\MICROSOFT VISUAL STUDIO\2022\COMMUNITY\VC\TOOLS\MSVC\14.30.30705\LIB\X64\MSVCPRT.LIB
C:\PROGRAM FILES\MICROSOFT VISUAL STUDIO\2022\COMMUNITY\VC\TOOLS\MSVC\14.30.30705\LIB\X64\MSVCRT.LIB
C:\PROGRAM FILES\MICROSOFT VISUAL STUDIO\2022\COMMUNITY\VC\TOOLS\MSVC\14.30.30705\LIB\X64\OLDNAMES.LIB
C:\PROGRAM FILES\MICROSOFT VISUAL STUDIO\2022\COMMUNITY\VC\TOOLS\MSVC\14.30.30705\LIB\X64\VCOMP.LIB
C:\PROGRAM FILES\MICROSOFT VISUAL STUDIO\2022\COMMUNITY\VC\TOOLS\MSVC\14.30.30705\LIB\X64\CONCRT.LIB
C:\PROGRAM FILES (X86)\WINDOWS KITS\10\LIB\10.0.19041.0\UM\X64\UUID.LIB
C:\PROGRAM FILES (X86)\WINDOWS KITS\10\LIB\10.0.19041.0\UM\X64\KERNEL32.LIB
C:\PROGRAM FILES\MICROSOFT VISUAL STUDIO\2022\COMMUNITY\VC\TOOLS\MSVC\14.30.30705\LIB\X64\VCRUNTIME.LIB
C:\PROGRAM FILES (X86)\WINDOWS KITS\10\LIB\10.0.19041.0\UCRT\X64\UCRT.LIB
C:\WINDOWS\SYSTEM32\TZRES.DLL
C:\PROGRAM FILES\MICROSOFT VISUAL STUDIO\2022\COMMUNITY\VC\TOOLS\MSVC\14.30.30705\BIN\HOSTX64\X64\1033\LINKUI.DLL
C:\PROGRAM FILES\MICROSOFT VISUAL STUDIO\2022\COMMUNITY\VC\TOOLS\MSVC\14.30.30705\BIN\HOSTX64\X64\CVTRES.EXE
C:\USERS\WVDS9\DOCUMENTS\GITHUB\INFOMOV-RETRO-VOXEL-FLUIDS\WRLDTMPL8-MAIN\X64\RELEASE\VC143.PDB
