^C:\USERS\WVDS9\DOCUMENTS\GITHUB\THESIS-PROJECT2\WRLDTMPL8-MAIN\X64\DEBUG\BOUNCE.OBJ|C:\USERS\WVDS9\DOCUMENTS\GITHUB\THESIS-PROJECT2\WRLDTMPL8-MAIN\X64\DEBUG\CAPE.OBJ|C:\USERS\WVDS9\DOCUMENTS\GITHUB\THESIS-PROJECT2\WRLDTMPL8-MAIN\X64\DEBUG\TEMPLATE.OBJ|C:\USERS\WVDS9\DOCUMENTS\GITHUB\THESIS-PROJECT2\WRLDTMPL8-MAIN\X64\DEBUG\WORLD.OBJ
C:\PROGRAM FILES (X86)\WINDOWS KITS\10\LIB\10.0.19041.0\UM\X64\WINMM.LIB
C:\PROGRAM FILES (X86)\WINDOWS KITS\10\LIB\10.0.19041.0\UM\X64\ADVAPI32.LIB
C:\PROGRAM FILES (X86)\WINDOWS KITS\10\LIB\10.0.19041.0\UM\X64\USER32.LIB
C:\USERS\WVDS9\DOCUMENTS\GITHUB\THESIS-PROJECT2\WRLDTMPL8-MAIN\LIB\GLFW\LIB-VC2017\GLFW3.LIB
C:\PROGRAM FILES (X86)\WINDOWS KITS\10\LIB\10.0.19041.0\UM\X64\GDI32.LIB
C:\PROGRAM FILES (X86)\WINDOWS KITS\10\LIB\10.0.19041.0\UM\X64\SHELL32.LIB
C:\USERS\WVDS9\DOCUMENTS\GITHUB\THESIS-PROJECT2\WRLDTMPL8-MAIN\LIB\OPENCL\LIB\X64\OPENCL.LIB
C:\PROGRAM FILES (X86)\WINDOWS KITS\10\LIB\10.0.19041.0\UM\X64\OPENGL32.LIB
C:\USERS\WVDS9\DOCUMENTS\GITHUB\THESIS-PROJECT2\WRLDTMPL8-MAIN\LIB\ZLIB\LIBZ-STATIC.LIB
C:\USERS\WVDS9\DOCUMENTS\GITHUB\THESIS-PROJECT2\WRLDTMPL8-MAIN\X64\DEBUG\BOUNCE.OBJ
C:\USERS\WVDS9\DOCUMENTS\GITHUB\THESIS-PROJECT2\WRLDTMPL8-MAIN\X64\DEBUG\CAPE.OBJ
C:\USERS\WVDS9\DOCUMENTS\GITHUB\THESIS-PROJECT2\WRLDTMPL8-MAIN\X64\DEBUG\TEMPLATE.OBJ
C:\USERS\WVDS9\DOCUMENTS\GITHUB\THESIS-PROJECT2\WRLDTMPL8-MAIN\X64\DEBUG\WORLD.OBJ
C:\WINDOWS\SYSTEM32\TZRES.DLL
C:\WINDOWS\GLOBALIZATION\SORTING\SORTDEFAULT.NLS
C:\PROGRAM FILES (X86)\MICROSOFT VISUAL STUDIO\2019\COMMUNITY\VC\TOOLS\MSVC\14.29.30133\LIB\X64\MSVCPRTD.LIB
C:\PROGRAM FILES (X86)\MICROSOFT VISUAL STUDIO\2019\COMMUNITY\VC\TOOLS\MSVC\14.29.30133\LIB\X64\MSVCRTD.LIB
C:\PROGRAM FILES (X86)\MICROSOFT VISUAL STUDIO\2019\COMMUNITY\VC\TOOLS\MSVC\14.29.30133\LIB\X64\OLDNAMES.LIB
C:\PROGRAM FILES (X86)\MICROSOFT VISUAL STUDIO\2019\COMMUNITY\VC\TOOLS\MSVC\14.29.30133\LIB\X64\VCOMPD.LIB
C:\PROGRAM FILES (X86)\MICROSOFT VISUAL STUDIO\2019\COMMUNITY\VC\TOOLS\MSVC\14.29.30133\LIB\X64\CONCRTD.LIB
C:\PROGRAM FILES (X86)\WINDOWS KITS\10\LIB\10.0.19041.0\UM\X64\UUID.LIB
C:\PROGRAM FILES (X86)\WINDOWS KITS\10\LIB\10.0.19041.0\UM\X64\KERNEL32.LIB
C:\PROGRAM FILES (X86)\MICROSOFT VISUAL STUDIO\2019\COMMUNITY\VC\TOOLS\MSVC\14.29.30133\LIB\X64\VCRUNTIMED.LIB
C:\PROGRAM FILES (X86)\WINDOWS KITS\10\LIB\10.0.19041.0\UCRT\X64\UCRTD.LIB
C:\USERS\WVDS9\DOCUMENTS\GITHUB\THESIS-PROJECT2\WRLDTMPL8-MAIN\X64\DEBUG\VC142.PDB
