^C:\USERS\WVDS9\DOCUMENTS\GITHUB\THESIS-PROJECT2\WRLDTMPL8-MAIN\X64\RELEASE\CAPE.OBJ|C:\USERS\WVDS9\DOCUMENTS\GITHUB\THESIS-PROJECT2\WRLDTMPL8-MAIN\X64\RELEASE\TEMPLATE.OBJ|C:\USERS\WVDS9\DOCUMENTS\GITHUB\THESIS-PROJECT2\WRLDTMPL8-MAIN\X64\RELEASE\WATERWORLD.OBJ|C:\USERS\WVDS9\DOCUMENTS\GITHUB\THESIS-PROJECT2\WRLDTMPL8-MAIN\X64\RELEASE\WORLD.OBJ
/OUT:"C:\USERS\WVDS9\DOCUMENTS\GITHUB\THESIS-PROJECT2\WRLDTMPL8-MAIN\X64\BOUNCEWORLD.EXE" /NOLOGO /LIBPATH:"LIB/GLFW/LIB-VC2017" /LIBPATH:LIB/ZLIB /LIBPATH:/LIB/X64 /LIBPATH:LIB/OPENCL/LIB/X64 WINMM.LIB ADVAPI32.LIB USER32.LIB GLFW3.LIB GDI32.LIB SHELL32.LIB OPENCL.LIB OPENGL32.LIB "LIBZ-STATIC.LIB" /NODEFAULTLIB:LIBCMT /MANIFEST /MANIFESTUAC:"level='asInvoker' uiAccess='false'" /manifest:embed /DEBUG /PDB:"C:\USERS\WVDS9\DOCUMENTS\GITHUB\THESIS-PROJECT2\WRLDTMPL8-MAIN\X64\BOUNCEWORLD.PDB" /SUBSYSTEM:WINDOWS /OPT:REF /OPT:ICF /TLBID:1 /DYNAMICBASE:NO /IMPLIB:"C:\USERS\WVDS9\DOCUMENTS\GITHUB\THESIS-PROJECT2\WRLDTMPL8-MAIN\X64\BOUNCEWORLD.LIB" /MACHINE:X64 "C:\USERS\WVDS9\DOCUMENTS\GITHUB\THESIS-PROJECT2\WRLDTMPL8-MAIN\X64\RELEASE\WATERWORLD.OBJ"
"C:\USERS\WVDS9\DOCUMENTS\GITHUB\THESIS-PROJECT2\WRLDTMPL8-MAIN\X64\RELEASE\CAPE.OBJ"
"C:\USERS\WVDS9\DOCUMENTS\GITHUB\THESIS-PROJECT2\WRLDTMPL8-MAIN\X64\RELEASE\TEMPLATE.OBJ"
"C:\USERS\WVDS9\DOCUMENTS\GITHUB\THESIS-PROJECT2\WRLDTMPL8-MAIN\X64\RELEASE\WORLD.OBJ"
