^C:\USERS\WVDS9\DOCUMENTS\GITHUB\INFOMOV-RETRO-VOXEL-FLUIDS\WRLDTMPL8-MAIN\TEMPLATE\TEMPLATE.CPP
C:\USERS\WVDS9\DOCUMENTS\GITHUB\INFOMOV-RETRO-VOXEL-FLUIDS\WRLDTMPL8-MAIN\X64\DEBUG\WATERWORLD_DEBUG.PCH
C:\USERS\WVDS9\DOCUMENTS\GITHUB\INFOMOV-RETRO-VOXEL-FLUIDS\WRLDTMPL8-MAIN\X64\DEBUG\VC143.PDB
C:\USERS\WVDS9\DOCUMENTS\GITHUB\INFOMOV-RETRO-VOXEL-FLUIDS\WRLDTMPL8-MAIN\X64\DEBUG\TEMPLATE.OBJ
^C:\USERS\WVDS9\DOCUMENTS\GITHUB\INFOMOV-RETRO-VOXEL-FLUIDS\WRLDTMPL8-MAIN\CAPE.CPP|C:\USERS\WVDS9\DOCUMENTS\GITHUB\INFOMOV-RETRO-VOXEL-FLUIDS\WRLDTMPL8-MAIN\TEMPLATE\WORLD.CPP|C:\USERS\WVDS9\DOCUMENTS\GITHUB\INFOMOV-RETRO-VOXEL-FLUIDS\WRLDTMPL8-MAIN\WATERWORLD.CPP
C:\USERS\WVDS9\DOCUMENTS\GITHUB\INFOMOV-RETRO-VOXEL-FLUIDS\WRLDTMPL8-MAIN\X64\DEBUG\VC143.PDB
C:\USERS\WVDS9\DOCUMENTS\GITHUB\INFOMOV-RETRO-VOXEL-FLUIDS\WRLDTMPL8-MAIN\X64\DEBUG\WATERWORLD.OBJ
C:\USERS\WVDS9\DOCUMENTS\GITHUB\INFOMOV-RETRO-VOXEL-FLUIDS\WRLDTMPL8-MAIN\X64\DEBUG\WORLD.OBJ
C:\USERS\WVDS9\DOCUMENTS\GITHUB\INFOMOV-RETRO-VOXEL-FLUIDS\WRLDTMPL8-MAIN\X64\DEBUG\CAPE.OBJ
^C:\USERS\WVDS9\DOCUMENTS\GITHUB\INFOMOV-RETRO-VOXEL-FLUIDS\WRLDTMPL8-MAIN\CAPE.CPP
C:\USERS\WVDS9\DOCUMENTS\GITHUB\INFOMOV-RETRO-VOXEL-FLUIDS\WRLDTMPL8-MAIN\X64\DEBUG\VC143.PDB
^C:\USERS\WVDS9\DOCUMENTS\GITHUB\INFOMOV-RETRO-VOXEL-FLUIDS\WRLDTMPL8-MAIN\TEMPLATE\WORLD.CPP
C:\USERS\WVDS9\DOCUMENTS\GITHUB\INFOMOV-RETRO-VOXEL-FLUIDS\WRLDTMPL8-MAIN\X64\DEBUG\VC143.PDB
^C:\USERS\WVDS9\DOCUMENTS\GITHUB\INFOMOV-RETRO-VOXEL-FLUIDS\WRLDTMPL8-MAIN\WATERWORLD.CPP
C:\USERS\WVDS9\DOCUMENTS\GITHUB\INFOMOV-RETRO-VOXEL-FLUIDS\WRLDTMPL8-MAIN\X64\DEBUG\VC143.PDB
