^C:\USERS\WVDS9\DOCUMENTS\GITHUB\THESIS-PROJECT2\WRLDTMPL8-MAIN\CAPE.CPP|C:\USERS\WVDS9\DOCUMENTS\GITHUB\THESIS-PROJECT2\WRLDTMPL8-MAIN\TEMPLATE\WORLD.CPP
C:\USERS\WVDS9\DOCUMENTS\GITHUB\THESIS-PROJECT2\WRLDTMPL8-MAIN\X64\RELEASE\VC142.PDB
C:\USERS\WVDS9\DOCUMENTS\GITHUB\THESIS-PROJECT2\WRLDTMPL8-MAIN\X64\RELEASE\WORLD.OBJ
C:\USERS\WVDS9\DOCUMENTS\GITHUB\THESIS-PROJECT2\WRLDTMPL8-MAIN\X64\RELEASE\CAPE.OBJ
^C:\USERS\WVDS9\DOCUMENTS\GITHUB\THESIS-PROJECT2\WRLDTMPL8-MAIN\TEMPLATE\TEMPLATE.CPP
C:\USERS\WVDS9\DOCUMENTS\GITHUB\THESIS-PROJECT2\WRLDTMPL8-MAIN\X64\RELEASE\BOUNCEWORLD.PCH
C:\USERS\WVDS9\DOCUMENTS\GITHUB\THESIS-PROJECT2\WRLDTMPL8-MAIN\X64\RELEASE\VC142.PDB
C:\USERS\WVDS9\DOCUMENTS\GITHUB\THESIS-PROJECT2\WRLDTMPL8-MAIN\X64\RELEASE\TEMPLATE.OBJ
^C:\USERS\WVDS9\DOCUMENTS\GITHUB\THESIS-PROJECT2\WRLDTMPL8-MAIN\CAPE.CPP|C:\USERS\WVDS9\DOCUMENTS\GITHUB\THESIS-PROJECT2\WRLDTMPL8-MAIN\TEMPLATE\WORLD.CPP|C:\USERS\WVDS9\DOCUMENTS\GITHUB\THESIS-PROJECT2\WRLDTMPL8-MAIN\WATERWORLD.CPP
C:\USERS\WVDS9\DOCUMENTS\GITHUB\THESIS-PROJECT2\WRLDTMPL8-MAIN\X64\RELEASE\VC142.PDB
C:\USERS\WVDS9\DOCUMENTS\GITHUB\THESIS-PROJECT2\WRLDTMPL8-MAIN\X64\RELEASE\WATERWORLD.OBJ
C:\USERS\WVDS9\DOCUMENTS\GITHUB\THESIS-PROJECT2\WRLDTMPL8-MAIN\X64\RELEASE\WORLD.OBJ
C:\USERS\WVDS9\DOCUMENTS\GITHUB\THESIS-PROJECT2\WRLDTMPL8-MAIN\X64\RELEASE\CAPE.OBJ
^C:\USERS\WVDS9\DOCUMENTS\GITHUB\THESIS-PROJECT2\WRLDTMPL8-MAIN\TEMPLATE\WORLD.CPP
C:\USERS\WVDS9\DOCUMENTS\GITHUB\THESIS-PROJECT2\WRLDTMPL8-MAIN\X64\RELEASE\VC142.PDB
^C:\USERS\WVDS9\DOCUMENTS\GITHUB\THESIS-PROJECT2\WRLDTMPL8-MAIN\CAPE.CPP|C:\USERS\WVDS9\DOCUMENTS\GITHUB\THESIS-PROJECT2\WRLDTMPL8-MAIN\WATERWORLD.CPP
C:\USERS\WVDS9\DOCUMENTS\GITHUB\THESIS-PROJECT2\WRLDTMPL8-MAIN\X64\RELEASE\VC142.PDB
C:\USERS\WVDS9\DOCUMENTS\GITHUB\THESIS-PROJECT2\WRLDTMPL8-MAIN\X64\RELEASE\WATERWORLD.OBJ
C:\USERS\WVDS9\DOCUMENTS\GITHUB\THESIS-PROJECT2\WRLDTMPL8-MAIN\X64\RELEASE\CAPE.OBJ
^C:\USERS\WVDS9\DOCUMENTS\GITHUB\THESIS-PROJECT2\WRLDTMPL8-MAIN\CAPE.CPP
C:\USERS\WVDS9\DOCUMENTS\GITHUB\THESIS-PROJECT2\WRLDTMPL8-MAIN\X64\RELEASE\VC142.PDB
^C:\USERS\WVDS9\DOCUMENTS\GITHUB\THESIS-PROJECT2\WRLDTMPL8-MAIN\WATERWORLD.CPP
C:\USERS\WVDS9\DOCUMENTS\GITHUB\THESIS-PROJECT2\WRLDTMPL8-MAIN\X64\RELEASE\VC142.PDB
C:\USERS\WVDS9\DOCUMENTS\GITHUB\THESIS-PROJECT2\WRLDTMPL8-MAIN\X64\RELEASE\WATERWORLD.OBJ
