1;1;1;844
1;1;2;30382
1;1;3;1223
1;1;4;31156
1;1;5;30825
1;1;6;28007
1;1;7;26190
1;1;8;23852
1;1;9;1924
1;1;10;28517
1;1;11;1041
1;1;12;8983
1;1;13;6428
1;1;14;34611
1;1;15;2346
1;1;16;4576
1;1;17;33071
1;1;18;2511
1;1;19;24042
1;1;20;5296
1;1;21;26558
1;1;22;6378
1;1;23;28985
1;1;24;8942
1;1;25;6759
1;1;26;8492
1;1;27;932
1;1;28;7867
1;1;29;6255
1;1;30;21147
1;1;31;33991
1;1;32;2840
1;1;33;5927
1;1;34;651
1;1;35;21589
1;1;36;28367
1;1;37;33306
1;1;38;33226
1;1;39;1008
1;1;40;24590
1;1;41;26763
1;1;42;5185
1;1;43;1526
1;1;44;28546
1;1;45;1139
1;1;46;15674
1;1;47;572
1;1;48;6478
1;1;49;584
1;1;50;768
1;1;51;32735
1;1;52;1067
1;1;53;1017
1;1;54;7477
1;1;55;34646
1;1;56;34650
1;1;57;23726
1;1;58;571
1;1;59;574
1;1;60;1000
1;1;61;526
1;1;62;2862
1;1;63;7618
1;1;64;1324
1;1;65;30411
1;1;66;33976
1;1;67;7437
1;1;68;32127
1;1;69;2212
1;1;70;1720
1;1;71;5303
1;1;72;23795
1;1;73;15631
1;1;74;34593
1;1;75;7040
1;1;76;2259
1;1;77;28061
1;1;78;620
1;1;79;25248
1;1;80;552
1;1;81;32562
1;1;82;767
1;1;83;19473
1;1;84;33203
1;1;85;317
1;1;86;1774
1;1;87;8365
1;1;88;0
1;1;89;21335
1;1;90;361
1;1;91;28899
1;1;92;33236
1;1;93;33666
1;1;94;2188
1;1;95;24528
1;1;96;4852
1;1;97;31661
1;1;98;31658
1;1;99;5542
1;1;100;31663
1;1;101;32823
1;1;102;5131
1;1;103;0
1;2;1;8607
1;2;2;2191
1;2;3;5682
1;2;4;26046
1;2;5;7314
1;2;6;24180
1;2;7;31469
1;2;8;5080
1;2;9;20231
1;2;10;8211
1;2;11;4801
1;2;12;8030
1;2;13;33024
1;2;14;5189
1;2;15;1728
1;2;16;4748
1;2;17;7308
1;2;18;25678
1;2;19;4970
1;2;20;6136
1;2;21;16697
1;2;22;34219
1;2;23;4752
1;2;24;4838
1;2;25;20010
1;2;26;1755
1;2;27;1805
1;2;28;2707
1;2;29;2757
1;2;30;7740
1;2;31;2306
1;2;32;26054
1;2;33;4797
1;2;34;32601
1;2;35;4896
1;2;36;2698
1;2;37;576
1;2;38;30710
1;2;39;2314
1;2;40;21701
1;2;41;3046
1;2;42;1995
1;2;43;25860
1;2;44;30875
1;2;45;1888
1;2;46;17262
1;2;47;1875
1;2;48;1876
1;2;49;30238
1;2;50;5861
1;2;51;5052
1;2;52;7541
1;2;53;6603
1;2;54;122
1;2;55;25969
1;2;56;30152
1;2;57;28819
1;2;58;4798
1;2;59;1732
1;2;60;5017
1;2;61;6224
1;2;62;4763
1;2;63;5116
1;2;64;19377
1;2;65;6359
1;2;66;5039
1;2;67;5012
1;2;68;3003
1;2;69;24120
1;2;70;31279
1;2;71;4879
1;2;72;895
1;2;73;2316
1;2;74;5010
1;2;75;18
1;2;76;1758
1;2;77;5055
1;2;78;2353
1;2;79;8410
1;2;80;29921
1;2;81;5202
1;2;82;17201
1;2;83;31461
1;2;84;0
1;2;85;5226
1;2;86;19000
1;2;87;16132
1;2;88;1040
1;2;89;16759
1;2;90;30824
1;2;91;15180
1;2;92;8584
1;2;93;8272
1;2;94;32694
1;2;95;7694
1;2;96;2741
1;2;97;21094
1;2;98;868
1;2;99;22253
1;2;100;1336
1;2;101;2483
1;2;102;2241
1;2;103;32079
1;2;104;1638
1;2;105;1084
1;2;106;24705
1;2;107;1247
1;2;108;1246
1;2;109;6260
1;2;110;32096
1;2;111;6863
1;2;112;2593
1;2;113;6169
1;2;114;1241
1;2;115;883
1;2;116;4319
1;2;117;1518
1;2;118;34544
1;2;119;30157
1;2;120;25908
1;2;121;24047
1;2;122;34306
1;2;123;1013
1;2;124;16093
1;2;125;1731
1;2;126;7070
1;2;127;8188
1;2;128;24389
1;2;129;972
1;2;130;23728
1;2;131;0
1;3;1;7774
1;3;2;1854
1;3;3;358
1;3;4;33666
1;3;5;24021
1;3;6;4823
1;3;7;5205
1;3;8;4829
1;3;9;31661
1;3;10;31658
1;3;11;31663
1;3;12;4907
1;3;13;32809
1;3;14;28082
1;3;15;603
1;3;16;4950
1;3;17;4746
1;3;18;31267
1;3;19;27327
1;3;20;907
1;3;21;908
1;3;22;27189
1;3;23;32538
1;3;24;32560
1;3;25;7814
1;3;26;6129
1;3;27;909
1;3;28;969
1;3;29;21179
1;3;30;783
1;3;31;23702
1;3;32;853
1;3;33;6139
1;3;34;4358
1;3;35;6527
1;3;36;4333
1;3;37;26373
1;3;38;4328
1;3;39;4357
1;3;40;1337
1;3;41;1068
1;3;42;256
1;3;43;31136
1;3;44;16326
1;3;45;22147
1;3;46;1269
1;3;47;20255
1;3;48;1312
1;3;49;26706
1;3;50;1272
1;3;51;733
1;3;52;5882
1;3;53;0
1;3;54;2699
1;3;55;4579
1;3;56;1726
1;3;57;1212
1;3;58;32774
1;3;59;28516
1;3;60;2500
1;3;61;29032
1;3;62;16575
1;3;63;16919
1;3;64;26515
1;3;65;25213
1;3;66;4782
1;3;67;27965
1;3;68;26836
1;3;69;4878
1;3;70;27700
1;3;71;24882
1;3;72;27365
1;3;73;32895
1;3;74;8131
1;3;75;1012
1;3;76;1221
1;3;77;30165
1;3;78;5970
1;3;79;7979
1;3;80;23037
1;3;81;7137
1;3;82;32168
1;3;83;8033
1;3;84;23890
1;3;85;7009
1;3;86;20328
1;3;87;7133
1;3;88;33904
1;3;89;789
1;3;90;31801
1;3;91;859
1;3;92;4736
1;3;93;1599
1;3;94;1230
1;3;95;885
1;3;96;5344
1;3;97;28702
1;3;98;3322
1;3;99;1603
1;3;100;1590
1;3;101;3045
1;3;102;20453
1;3;103;20457
1;3;104;751
1;3;105;1083
1;3;106;1066
1;3;107;7791
1;3;108;33840
1;3;109;25584
1;3;110;33781
1;3;111;1063
1;3;112;2652
1;3;113;30199
1;3;114;944
1;3;115;952
1;3;116;31189
1;3;117;32949
1;3;118;34825
1;3;119;34197
1;3;120;29943
1;3;121;30186
1;3;122;30160
1;3;123;30351
1;3;124;30243
1;3;125;30218
1;3;126;33003
1;3;127;34389
1;3;128;23862
1;3;129;5762
1;3;130;6813
1;3;131;950
1;3;132;19770
1;3;133;7706
1;3;134;25586
1;3;135;7772
1;3;136;0
1;4;1;2832
1;4;2;15487
1;4;3;8319
1;4;4;1601
1;4;5;4857
1;4;6;5105
1;4;7;4824
1;4;8;30528
1;4;9;5140
1;4;10;5152
1;4;11;5058
1;4;12;29250
1;4;13;4957
1;4;14;5175
1;4;15;5239
1;4;16;4945
1;4;17;19087
1;4;18;5097
1;4;19;5128
1;4;20;5407
1;4;21;4958
1;4;22;34910
1;4;23;26079
1;4;24;7953
1;4;25;31898
1;4;26;32702
1;4;27;2539
1;4;28;7211
1;4;29;6217
1;4;30;15940
1;4;31;15426
1;4;32;1824
1;4;33;6865
1;4;34;5221
1;4;35;31023
1;4;36;33425
1;4;37;20621
1;4;38;21807
1;4;39;29895
1;4;40;32778
1;4;41;20793
1;4;42;4904
1;4;43;32102
1;4;44;23070
1;4;45;29266
1;4;46;4956
1;4;47;325
1;4;48;3349
1;4;49;820
1;4;50;5111
1;4;51;28315
1;4;52;4773
1;4;53;5204
1;4;54;16580
1;4;55;20690
1;4;56;5053
1;4;57;795
1;4;58;0
1;4;59;33346
1;4;60;33104
1;4;61;6828
1;4;62;3348
1;4;63;1332
1;4;64;31156
1;4;65;1211
1;4;66;4618
1;4;67;933
1;4;68;29204
1;4;69;6912
1;4;70;5553
1;4;71;23456
1;4;72;4153
1;4;73;1179
1;4;74;23621
1;4;75;1331
1;4;76;753
1;4;77;18283
1;4;78;1178
1;4;79;28022
1;4;80;34684
1;4;81;8316
1;4;82;32681
1;4;83;6895
1;4;84;1228
1;4;85;1605
1;4;86;17733
1;4;87;6181
1;4;88;6270
1;4;89;20844
1;4;90;25543
1;4;91;31750
1;4;92;33
1;4;93;32245
1;4;94;18996
1;4;95;7226
1;4;96;19186
1;4;97;32776
1;4;98;8444
1;4;99;9490
1;4;100;33226
1;4;101;33306
1;4;102;658
1;4;103;32985
1;4;104;927
1;4;105;19375
1;4;106;15674
1;4;107;33206
1;4;108;32876
1;4;109;27124
1;4;110;8290
1;4;111;30815
1;4;112;538
1;4;113;30814
1;4;114;7072
1;4;115;34199
1;4;116;25776
1;4;117;5229
1;4;118;8234
1;4;119;23726
1;4;120;34650
1;4;121;34646
1;4;122;8201
1;4;123;7316
1;4;124;8202
1;4;125;4235
1;4;126;1585
1;4;127;2100
1;4;128;18872
1;4;129;7309
1;4;130;4631
1;4;131;33236
1;4;132;0
1;5;1;28495
1;5;2;2839
1;5;3;34672
1;5;4;1594
1;5;5;4842
1;5;6;31020
1;5;7;2688
1;5;8;32813
1;5;9;4926
1;5;10;34582
1;5;11;4814
1;5;12;4858
1;5;13;18967
1;5;14;30164
1;5;15;880
1;5;16;642
1;5;17;17665
1;5;18;21094
1;5;19;3333
1;5;20;1584
1;5;21;23990
1;5;22;34424
1;5;23;817
1;5;24;22483
1;5;25;7720
1;5;26;956
1;5;27;812
1;5;28;2741
1;5;29;5793
1;5;30;31961
1;5;31;26862
1;5;32;2516
1;5;33;1268
1;5;34;5036
1;5;35;29893
1;5;36;25465
1;5;37;15168
1;5;38;17957
1;5;39;32245
1;5;40;29398
1;5;41;29399
1;5;42;7184
1;5;43;16062
1;5;44;30440
1;5;45;15958
1;5;46;14927
1;5;47;19441
1;5;48;24822
1;5;49;2094
1;5;50;29839
1;5;51;22771
1;5;52;24461
1;5;53;20963
1;5;54;24294
1;5;55;31904
1;5;56;1256
1;5;57;34050
1;5;58;1254
1;5;59;1255
1;5;60;32864
1;5;61;2728
1;5;62;5791
1;5;63;3357
1;5;64;15265
1;5;65;804
1;5;66;26070
1;5;67;0
1;5;68;2191
1;5;69;449
1;5;70;537
1;5;71;33947
1;5;72;573
1;5;73;26046
1;5;74;2740
1;5;75;622
1;5;76;25262
1;5;77;7237
1;5;78;4354
1;5;79;6248
1;5;80;6955
1;5;81;23110
1;5;82;7714
1;5;83;23155
1;5;84;550
1;5;85;1583
1;5;86;32300
1;5;87;29973
1;5;88;30758
1;5;89;33740
1;5;90;17439
1;5;91;31047
1;5;92;958
1;5;93;23876
1;5;94;890
1;5;95;959
1;5;96;2524
1;5;97;943
1;5;98;5908
1;5;99;32952
1;5;100;8669
1;5;101;24119
1;5;102;7205
1;5;103;964
1;5;104;951
1;5;105;4721
1;5;106;25649
1;5;107;33318
1;5;108;27932
1;5;109;31027
1;5;110;865
1;5;111;22341
1;5;112;16472
1;5;113;18716
1;5;114;945
1;5;115;1640
1;5;116;1566
1;5;117;21064
1;5;118;27934
1;5;119;24163
1;5;120;809
1;5;121;730
1;5;122;16960
1;5;123;24306
1;5;124;7357
1;5;125;7371
1;5;126;7355
1;5;127;7359
1;5;128;26248
1;5;129;875
1;5;130;4986
1;5;131;25188
1;5;132;0
2;1;1;363
2;1;2;4734
2;1;3;7617
2;1;4;4774
2;1;5;4949
2;1;6;6340
2;1;7;6168
2;1;8;2091
2;1;9;4800
2;1;10;34458
2;1;11;26241
2;1;12;2627
2;1;13;6315
2;1;14;7941
2;1;15;6316
2;1;16;4985
2;1;17;5141
2;1;18;5856
2;1;19;4750
2;1;20;6286
2;1;21;3205
2;1;22;5224
2;1;23;26079
2;1;24;34679
2;1;25;4780
2;1;26;7953
2;1;27;15825
2;1;28;32285
2;1;29;31548
2;1;30;4903
2;1;31;1826
2;1;32;338
2;1;33;4816
2;1;34;4895
2;1;35;16607
2;1;36;6272
2;1;37;5142
2;1;38;31913
2;1;39;5082
2;1;40;6144
2;1;41;5564
2;1;42;4755
2;1;43;34841
2;1;44;8327
2;1;45;5050
2;1;46;5127
2;1;47;4766
2;1;48;15760
2;1;49;8141
2;1;50;5159
2;1;51;1771
2;1;52;5787
2;1;53;5126
2;1;54;8413
2;1;55;6289
2;1;56;23810
2;1;57;34762
2;1;58;1669
2;1;59;32109
2;1;60;7709
2;1;61;1043
2;1;62;1522
2;1;63;33996
2;1;64;7646
2;1;65;29087
2;1;66;17379
2;1;67;31441
2;1;68;697
2;1;69;8497
2;1;70;1278
2;1;71;24295
2;1;72;30365
2;1;73;33926
2;1;74;2939
2;1;75;1273
2;1;76;29246
2;1;77;205
2;1;78;3141
2;1;79;26265
2;1;80;30863
2;1;81;27158
2;1;82;17714
2;1;83;8435
2;1;84;15031
2;1;85;33513
2;1;86;8699
2;1;87;577
2;1;88;32386
2;1;89;6064
2;1;90;34111
2;1;91;5532
2;1;92;5773
2;1;93;32261
2;1;94;32370
2;1;95;31750
2;1;96;32245
2;1;97;33
2;1;98;31833
2;1;99;31025
2;1;100;0
2;2;1;4815
2;2;2;30872
2;2;3;7373
2;2;4;7357
2;2;5;7370
2;2;6;7372
2;2;7;7359
2;2;8;887
2;2;9;7355
2;2;10;7365
2;2;11;24306
2;2;12;31483
2;2;13;1213
2;2;14;23391
2;2;15;1174
2;2;16;1007
2;2;17;141
2;2;18;31507
2;2;19;7472
2;2;20;5298
2;2;21;31905
2;2;22;696
2;2;23;30934
2;2;24;23982
2;2;25;4340
2;2;26;2340
2;2;27;15093
2;2;28;24257
2;2;29;1200
2;2;30;993
2;2;31;5576
2;2;32;33953
2;2;33;981
2;2;34;19950
2;2;35;4953
2;2;36;32746
2;2;37;28043
2;2;38;28987
2;2;39;30190
2;2;40;30352
2;2;41;23988
2;2;42;8369
2;2;43;31051
2;2;44;29931
2;2;45;9016
2;2;46;4881
2;2;47;32950
2;2;48;21839
2;2;49;949
2;2;50;984
2;2;51;25505
2;2;52;8409
2;2;53;31485
2;2;54;1903
2;2;55;4749
2;2;56;4974
2;2;57;20512
2;2;58;2680
2;2;59;8361
2;2;60;8418
2;2;61;6587
2;2;62;4845
2;2;63;2836
2;2;64;0
2;2;65;810
2;2;66;3329
2;2;67;27934
2;2;68;3238
2;2;69;4334
2;2;70;843
2;2;71;27932
2;2;72;33839
2;2;73;946
2;2;74;940
2;2;75;1005
2;2;76;25743
2;2;77;644
2;2;78;597
2;2;79;942
2;2;80;962
2;2;81;941
2;2;82;18715
2;2;83;29911
2;2;84;947
2;2;85;29598
2;2;86;121
2;2;87;29892
2;2;88;6322
2;2;89;32245
2;2;90;5794
2;2;91;23590
2;2;92;27561
2;2;93;34343
2;2;94;4318
2;2;95;6321
2;2;96;18963
2;2;97;24330
2;2;98;33951
2;2;99;3209
2;2;100;16067
2;2;101;14927
2;2;102;5297
2;2;103;27958
2;2;104;143
2;2;105;23160
2;2;106;16661
2;2;107;18720
2;2;108;33070
2;2;109;32711
2;2;110;8333
2;2;111;34504
2;2;112;1267
2;2;113;24358
2;2;114;1255
2;2;115;891
2;2;116;5679
2;2;117;31900
2;2;118;18006
2;2;119;18009
2;2;120;30383
2;2;121;29839
2;2;122;21297
2;2;123;1280
2;2;124;1268
2;2;125;5036
2;2;126;6360
2;2;127;33162
2;2;128;0
2;3;1;32568
2;3;2;22296
2;3;3;4775
2;3;4;4831
2;3;5;24078
2;3;6;34878
2;3;7;4977
2;3;8;5219
2;3;9;17095
2;3;10;1772
2;3;11;22342
2;3;12;6249
2;3;13;2621
2;3;14;32606
2;3;15;5093
2;3;16;21276
2;3;17;25195
2;3;18;30968
2;3;19;5788
2;3;20;30229
2;3;21;4911
2;3;22;5166
2;3;23;5092
2;3;24;5362
2;3;25;17969
2;3;26;5004
2;3;27;5056
2;3;28;6809
2;3;29;4978
2;3;30;5006
2;3;31;27613
2;3;32;24162
2;3;33;1407
2;3;34;22171
2;3;35;29509
2;3;36;15458
2;3;37;5015
2;3;38;5005
2;3;39;4350
2;3;40;4753
2;3;41;5339
2;3;42;5888
2;3;43;4884
2;3;44;4969
2;3;45;34739
2;3;46;32559
2;3;47;4783
2;3;48;1739
2;3;49;8414
2;3;50;5550
2;3;51;1751
2;3;52;5011
2;3;53;24125
2;3;54;2697
2;3;55;898
2;3;56;25100
2;3;57;5146
2;3;58;5178
2;3;59;26064
2;3;60;5351
2;3;61;19697
2;3;62;33211
2;3;63;4934
2;3;64;17907
2;3;65;6147
2;3;66;1959
2;3;67;7480
2;3;68;34121
2;3;69;4991
2;3;70;19155
2;3;71;5061
2;3;72;5109
2;3;73;5144
2;3;74;28125
2;3;75;8412
2;3;76;5832
2;3;77;4772
2;3;78;5176
2;3;79;2334
2;3;80;5983
2;3;81;5107
2;3;82;4608
2;3;83;5571
2;3;84;4955
2;3;85;5170
2;3;86;29035
2;3;87;5190
2;3;88;6395
2;3;89;6010
2;3;90;7161
2;3;91;27465
2;3;92;26414
2;3;93;14930
2;3;94;18835
2;3;95;26243
2;3;96;7610
2;3;97;29647
2;3;98;996
2;3;99;5878
2;3;100;29175
2;3;101;3223
2;3;102;0
2;3;103;34288
2;3;104;919
2;3;105;34909
2;3;106;15911
2;3;107;29342
2;3;108;936
2;3;109;34814
2;3;110;4201
2;3;111;22751
2;3;112;31183
2;3;113;18837
2;3;114;33827
2;3;115;836
2;3;116;1018
2;3;117;29744
2;3;118;28198
2;3;119;4454
2;3;120;766
2;3;121;23880
2;3;122;960
2;3;123;7424
2;3;124;31152
2;3;125;34612
2;3;126;7980
2;3;127;34669
2;3;128;25745
2;3;129;5037
2;3;130;0
2;4;1;4524
2;4;2;1010
2;4;3;1184
2;4;4;6094
2;4;5;3115
2;4;6;28546
2;4;7;24164
2;4;8;34331
2;4;9;846
2;4;10;948
2;4;11;1517
2;4;12;5264
2;4;13;7011
2;4;14;624
2;4;15;22825
2;4;16;557
2;4;17;31188
2;4;18;7315
2;4;19;1155
2;4;20;7730
2;4;21;25920
2;4;22;1934
2;4;23;30375
2;4;24;562
2;4;25;2188
2;4;26;32946
2;4;27;2184
2;4;28;3292
2;4;29;4935
2;4;30;2682
2;4;31;4987
2;4;32;2949
2;4;33;4910
2;4;34;32889
2;4;35;28825
2;4;36;0
2;4;37;1188
2;4;38;27100
2;4;39;32109
2;4;40;31323
2;4;41;5473
2;4;42;20412
2;4;43;701
2;4;44;508
2;4;45;27692
2;4;46;7505
2;4;47;4487
2;4;48;7374
2;4;49;7646
2;4;50;34486
2;4;51;835
2;4;52;8233
2;4;53;8269
2;4;54;25341
2;4;55;1335
2;4;56;28007
2;4;57;30149
2;4;58;29885
2;4;59;26401
2;4;60;851
2;4;61;34366
2;4;62;1506
2;4;63;6654
2;4;64;20419
2;4;65;2714
2;4;66;21300
2;4;67;8331
2;4;68;24449
2;4;69;778
2;4;70;688
2;4;71;31517
2;4;72;26317
2;4;73;30075
2;4;74;3197
2;4;75;6274
2;4;76;4359
2;4;77;23086
2;4;78;19168
2;4;79;395
2;4;80;25704
2;4;81;24229
2;4;82;1189
2;4;83;882
2;4;84;204
2;4;85;205
2;4;86;203
2;4;87;24322
2;4;88;30242
2;4;89;33954
2;4;90;4367
2;4;91;25082
2;4;92;1957
2;4;93;1334
2;4;94;32973
2;4;95;3134
2;4;96;785
2;4;97;1264
2;4;98;24044
2;4;99;24046
2;4;100;17541
2;4;101;30089
2;4;102;33985
2;4;103;2456
2;4;104;839
2;4;105;7747
2;4;106;881
2;4;107;1065
2;4;108;8363
2;4;109;1064
2;4;110;1015
2;4;111;1602
2;4;112;7753
2;4;113;24118
2;4;114;34762
2;4;115;0
2;5;1;6498
2;5;2;22184
2;5;3;28784
2;5;4;406
2;5;5;30026
2;5;6;6771
2;5;7;114
2;5;8;30730
2;5;9;20215
2;5;10;3219
2;5;11;15074
2;5;12;21343
2;5;13;23596
2;5;14;22704
2;5;15;33686
2;5;16;16908
2;5;17;24043
2;5;18;4825
2;5;19;5139
2;5;20;30812
2;5;21;3308
2;5;22;27137
2;5;23;29626
2;5;24;934
2;5;25;850
2;5;26;808
2;5;27;1085
2;5;28;1069
2;5;29;3295
2;5;30;997
2;5;31;34374
2;5;32;31608
2;5;33;4337
2;5;34;7430
2;5;35;30657
2;5;36;162
2;5;37;930
2;5;38;7097
2;5;39;23922
2;5;40;31151
2;5;41;4234
2;5;42;661
2;5;43;33666
2;5;44;0
2;5;45;23728
2;5;46;33849
2;5;47;4981
2;5;48;5038
2;5;49;5114
2;5;50;5048
2;5;51;1181
2;5;52;6887
2;5;53;4992
2;5;54;4988
2;5;55;5929
2;5;56;8244
2;5;57;4740
2;5;58;28289
2;5;59;5018
2;5;60;4875
2;5;61;4763
2;5;62;24120
2;5;63;2300
2;5;64;4804
2;5;65;5201
2;5;66;30370
2;5;67;31679
2;5;68;6888
2;5;69;15142
2;5;70;1745
2;5;71;1727
2;5;72;7740
2;5;73;2306
2;5;74;5555
2;5;75;1764
2;5;76;1734
2;5;77;30969
2;5;78;4796
2;5;79;7300
2;5;80;1895
2;5;81;5049
2;5;82;1760
2;5;83;7308
2;5;84;5009
2;5;85;6925
2;5;86;18
2;5;87;29730
2;5;88;4844
2;5;89;4994
2;5;90;5729
2;5;91;19987
2;5;92;1663
2;5;93;4751
2;5;94;5636
2;5;95;7104
2;5;96;8368
2;5;97;1625
2;5;98;15272
2;5;99;30809
2;5;100;19546
2;5;101;3018
2;5;102;5804
2;5;103;4851
2;5;104;31658
2;5;105;31663
2;5;106;31661
2;5;107;6503
2;5;108;4767
2;5;109;19836
2;5;110;21967
2;5;111;3140
2;5;112;5063
2;5;113;892
2;5;114;5232
2;5;115;33532
2;5;116;6587
2;5;117;1374
2;5;118;5215
2;5;119;1378
2;5;120;747
2;5;121;811
2;5;122;23955
2;5;123;8971
2;5;124;29975
2;5;125;32079
2;5;126;3330
2;5;127;33002
2;5;128;5792
2;5;129;16673
2;5;130;23106
2;5;131;4779
2;5;132;18887
2;5;133;1246
2;5;134;1247
2;5;135;15945
2;5;136;31588
2;5;137;20533
2;5;138;4088
2;5;139;7083
2;5;140;935
2;5;141;1303
2;5;142;7492
2;5;143;5209
2;5;144;15767
2;5;145;0
