^C:\USERS\BENVA\DOCUMENTS\GAME AND MEDIA TECHNOLOGIES\MULTIMEDIA RETRIEVAL\MULTIMEDIARETRIEVAL\MRPROJECT\MRPROJECT\MAIN.CPP|C:\USERS\BENVA\DOCUMENTS\GAME AND MEDIA TECHNOLOGIES\MULTIMEDIA RETRIEVAL\MULTIMEDIARETRIEVAL\MRPROJECT\MRPROJECT\MESHDECIMATOR\MDMESHDECIMATOR.CPP
C:\USERS\BENVA\DOCUMENTS\GAME AND MEDIA TECHNOLOGIES\MULTIMEDIA RETRIEVAL\MULTIMEDIARETRIEVAL\MRPROJECT\MRPROJECT\X64\RELEASE\VC142.PDB
C:\USERS\BENVA\DOCUMENTS\GAME AND MEDIA TECHNOLOGIES\MULTIMEDIA RETRIEVAL\MULTIMEDIARETRIEVAL\MRPROJECT\MRPROJECT\X64\RELEASE\MDMESHDECIMATOR.OBJ
^C:\USERS\BENVA\DOCUMENTS\GAME AND MEDIA TECHNOLOGIES\MULTIMEDIA RETRIEVAL\MULTIMEDIARETRIEVAL\MRPROJECT\MRPROJECT\MESHDECIMATOR\MDMESHDECIMATOR.CPP
C:\USERS\BENVA\DOCUMENTS\GAME AND MEDIA TECHNOLOGIES\MULTIMEDIA RETRIEVAL\MULTIMEDIARETRIEVAL\MRPROJECT\MRPROJECT\X64\RELEASE\MDMESHDECIMATOR.OBJ
