^C:\USERS\BENVA\DOCUMENTS\GAME AND MEDIA TECHNOLOGIES\MULTIMEDIA RETRIEVAL\MULTIMEDIARETRIEVAL\MRPROJECT\MRPROJECT\MAIN.CPP|C:\USERS\BENVA\DOCUMENTS\GAME AND MEDIA TECHNOLOGIES\MULTIMEDIA RETRIEVAL\MULTIMEDIARETRIEVAL\MRPROJECT\MRPROJECT\MESHDECIMATOR\MDMESHDECIMATOR.CPP
C:\USERS\BENVA\DOCUMENTS\GAME AND MEDIA TECHNOLOGIES\MULTIMEDIA RETRIEVAL\MULTIMEDIARETRIEVAL\MRPROJECT\MRPROJECT\X64\DEBUG\VC142.PDB
C:\USERS\BENVA\DOCUMENTS\GAME AND MEDIA TECHNOLOGIES\MULTIMEDIA RETRIEVAL\MULTIMEDIARETRIEVAL\MRPROJECT\MRPROJECT\X64\DEBUG\VC142.IDB
C:\USERS\BENVA\DOCUMENTS\GAME AND MEDIA TECHNOLOGIES\MULTIMEDIA RETRIEVAL\MULTIMEDIARETRIEVAL\MRPROJECT\MRPROJECT\X64\DEBUG\MDMESHDECIMATOR.OBJ
C:\USERS\BENVA\DOCUMENTS\GAME AND MEDIA TECHNOLOGIES\MULTIMEDIA RETRIEVAL\MULTIMEDIARETRIEVAL\MRPROJECT\MRPROJECT\X64\DEBUG\MAIN.OBJ
^C:\USERS\BENVA\DOCUMENTS\GAME AND MEDIA TECHNOLOGIES\MULTIMEDIA RETRIEVAL\MULTIMEDIARETRIEVAL\MRPROJECT\MRPROJECT\MESHDECIMATOR\MDMESHDECIMATOR.CPP
C:\USERS\BENVA\DOCUMENTS\GAME AND MEDIA TECHNOLOGIES\MULTIMEDIA RETRIEVAL\MULTIMEDIARETRIEVAL\MRPROJECT\MRPROJECT\X64\DEBUG\VC142.PDB
^C:\USERS\BENVA\DOCUMENTS\GAME AND MEDIA TECHNOLOGIES\MULTIMEDIA RETRIEVAL\MULTIMEDIARETRIEVAL\MRPROJECT\MRPROJECT\MAIN.CPP
C:\USERS\BENVA\DOCUMENTS\GAME AND MEDIA TECHNOLOGIES\MULTIMEDIA RETRIEVAL\MULTIMEDIARETRIEVAL\MRPROJECT\MRPROJECT\X64\DEBUG\VC142.PDB
C:\USERS\BENVA\DOCUMENTS\GAME AND MEDIA TECHNOLOGIES\MULTIMEDIA RETRIEVAL\MULTIMEDIARETRIEVAL\MRPROJECT\MRPROJECT\X64\DEBUG\VC142.IDB
C:\USERS\BENVA\DOCUMENTS\GAME AND MEDIA TECHNOLOGIES\MULTIMEDIA RETRIEVAL\MULTIMEDIARETRIEVAL\MRPROJECT\MRPROJECT\X64\DEBUG\MAIN.OBJ
