file_name,score,iterations,avg_time
"TestCases/Exact1.txt",4,3,0.016966978708902996
"TestCases/Exact2.txt",7,3,0.006853183110555013
"TestCases/Exact3.txt",8,3,0.0016690889994303386
"TestCases/Exact4.txt",28,3,0.009660641352335611
"TestCases/Exact5.txt",19,3,0.020476261774698894
"TestCases/Exact6.txt",38,3,0.046192566553751625
"TestCases/Exact7.txt",40,3,0.03675071398417155
"TestCases/Exact8.txt",33,3,0.06337300936381023
"TestCases/Exact9.txt",43,3,0.01606901486714681
"TestCases/Exact10.txt",68,3,0.10736513137817383
"TestCases/Exact11.txt",64,3,0.24138673146565756
"TestCases/Exact12.txt",76,3,0.23934070269266763
"TestCases/Exact13.txt",94,3,2.064103364944458
"TestCases/Exact14.txt",121,3,1.4204022884368896
"TestCases/Exact15.txt",86,3,0.0702215035756429
"TestCases/Exact16.txt",191,3,1.4026429653167725
"TestCases/Exact17.txt",481,3,118.01273775100708
