{
    "thesaurus_name": "EPOS WP16 Rock Physics Measured Property",
    "uri": "http://epos-ip.org/WP16/Rockphysics/MeasuredProperty",
    "definitions": {
        "http://epos/WP16Vocabulary/example1": {
            "keyword": "Hardness",
            "label": "Hardness"
        },
        "http://epos/WP16Vocabulary/example2": {
            "keyword": "Strength",
            "label": "Strength",
            "http://epos/WP16Vocabulary/example3": {
                "keyword": "Yield Strength",
                "label": "Yield Strength"
            },
            "http://epos/WP16Vocabulary/example4": {
                "keyword": "Uniaxial Compressive Strength",
                "label": "Uniaxial Compressive Strength"
            },
            "http://epos/WP16Vocabulary/example5": {
                "keyword": "Triaxial Compressive Strength",
                "label": "Triaxial Compressive Strength"
            },
            "http://epos/WP16Vocabulary/example6": {
                "keyword": "True Triaxial/Polyaxial Strength",
                "label": "True Triaxial/Polyaxial Strength"
            },
            "http://epos/WP16Vocabulary/example7": {
                "keyword": "Torsion",
                "label": "Torsion"
            },
            "http://epos/WP16Vocabulary/example8": {
                "keyword": "Tensile Strength",
                "label": "Tensile Strength"
            },
            "http://epos/WP16Vocabulary/example9": {
                "keyword": "Flexural Strength",
                "label": "Flexural Strength"
            },
            "http://epos/WP16Vocabulary/example10": {
                "keyword": "Strength Recovery/Healing",
                "label": "Strength Recovery/Healing"
            }
        },
        "http://epos/WP16Vocabulary/example3": {
            "keyword": "Yield Strength",
            "label": "Yield Strength"
        },
        "http://epos/WP16Vocabulary/example4": {
            "keyword": "Uniaxial Compressive Strength",
            "label": "Uniaxial Compressive Strength"
        },
        "http://epos/WP16Vocabulary/example5": {
            "keyword": "Triaxial Compressive Strength",
            "label": "Triaxial Compressive Strength"
        },
        "http://epos/WP16Vocabulary/example6": {
            "keyword": "True Triaxial/Polyaxial Strength",
            "label": "True Triaxial/Polyaxial Strength"
        },
        "http://epos/WP16Vocabulary/example7": {
            "keyword": "Torsion",
            "label": "Torsion"
        },
        "http://epos/WP16Vocabulary/example8": {
            "keyword": "Tensile Strength",
            "label": "Tensile Strength"
        },
        "http://epos/WP16Vocabulary/example9": {
            "keyword": "Flexural Strength",
            "label": "Flexural Strength"
        },
        "http://epos/WP16Vocabulary/example10": {
            "keyword": "Strength Recovery/Healing",
            "label": "Strength Recovery/Healing"
        },
        "http://epos/WP16Vocabulary/example11": {
            "keyword": "Fracture Toughness",
            "label": "Fracture Toughness",
            "http://epos/WP16Vocabulary/example12": {
                "keyword": "Mode I",
                "label": "Mode I"
            },
            "http://epos/WP16Vocabulary/example13": {
                "keyword": "Mode II",
                "label": "Mode II"
            }
        },
        "http://epos/WP16Vocabulary/example12": {
            "keyword": "Mode I",
            "label": "Mode I"
        },
        "http://epos/WP16Vocabulary/example13": {
            "keyword": "Mode II",
            "label": "Mode II"
        },
        "http://epos/WP16Vocabulary/example14": {
            "keyword": "Friction",
            "label": "Friction",
            "http://epos/WP16Vocabulary/example15": {
                "keyword": "Imposed Slip",
                "label": "Imposed Slip",
                "http://epos/WP16Vocabulary/example16": {
                    "keyword": "Rate-State",
                    "label": "Rate-State"
                },
                "http://epos/WP16Vocabulary/example17": {
                    "keyword": "Slide-Hold-Slide",
                    "label": "Slide-Hold-Slide"
                }
            },
            "http://epos/WP16Vocabulary/example18": {
                "keyword": "Imposed Stress",
                "label": "Imposed Stress"
            }
        },
        "http://epos/WP16Vocabulary/example15": {
            "keyword": "Imposed Slip",
            "label": "Imposed Slip",
            "http://epos/WP16Vocabulary/example16": {
                "keyword": "Rate-State",
                "label": "Rate-State"
            },
            "http://epos/WP16Vocabulary/example17": {
                "keyword": "Slide-Hold-Slide",
                "label": "Slide-Hold-Slide"
            }
        },
        "http://epos/WP16Vocabulary/example16": {
            "keyword": "Rate-State",
            "label": "Rate-State"
        },
        "http://epos/WP16Vocabulary/example17": {
            "keyword": "Slide-Hold-Slide",
            "label": "Slide-Hold-Slide"
        },
        "http://epos/WP16Vocabulary/example18": {
            "keyword": "Imposed Stress",
            "label": "Imposed Stress"
        },
        "http://epos/WP16Vocabulary/example19": {
            "keyword": "Permeability",
            "label": "Permeability"
        },
        "http://epos/WP16Vocabulary/example20": {
            "keyword": "Density",
            "label": "Density"
        },
        "http://epos/WP16Vocabulary/example21": {
            "keyword": "Viscosity",
            "label": "Viscosity"
        },
        "http://epos/WP16Vocabulary/example22": {
            "keyword": "Roughness",
            "label": "Roughness",
            "http://epos/WP16Vocabulary/example23": {
                "keyword": "Root Mean Square",
                "label": "Root Mean Square"
            },
            "http://epos/WP16Vocabulary/example24": {
                "keyword": "Mean Height Difference",
                "label": "Mean Height Difference"
            },
            "http://epos/WP16Vocabulary/example25": {
                "keyword": "Power Spectral Density",
                "label": "Power Spectral Density"
            }
        },
        "http://epos/WP16Vocabulary/example23": {
            "keyword": "Root Mean Square",
            "label": "Root Mean Square"
        },
        "http://epos/WP16Vocabulary/example24": {
            "keyword": "Mean Height Difference",
            "label": "Mean Height Difference"
        },
        "http://epos/WP16Vocabulary/example25": {
            "keyword": "Power Spectral Density",
            "label": "Power Spectral Density"
        },
        "http://epos/WP16Vocabulary/example26": {
            "keyword": "Elasticity",
            "label": "Elasticity",
            "http://epos/WP16Vocabulary/example27": {
                "keyword": "Vp",
                "label": "Vp"
            },
            "http://epos/WP16Vocabulary/example28": {
                "keyword": "Vs",
                "label": "Vs"
            },
            "http://epos/WP16Vocabulary/example29": {
                "keyword": "Vp/Vs",
                "label": "Vp/Vs"
            },
            "http://epos/WP16Vocabulary/example30": {
                "keyword": "Bulk Modulus",
                "label": "Bulk Modulus"
            },
            "http://epos/WP16Vocabulary/example31": {
                "keyword": "Shear Modulus",
                "label": "Shear Modulus"
            },
            "http://epos/WP16Vocabulary/example32": {
                "keyword": "Young\u2019s Modulus",
                "label": "Young\u2019s Modulus"
            },
            "http://epos/WP16Vocabulary/example33": {
                "keyword": "Acoustic Emissions",
                "label": "Acoustic Emissions"
            }
        },
        "http://epos/WP16Vocabulary/example27": {
            "keyword": "Vp",
            "label": "Vp"
        },
        "http://epos/WP16Vocabulary/example28": {
            "keyword": "Vs",
            "label": "Vs"
        },
        "http://epos/WP16Vocabulary/example29": {
            "keyword": "Vp/Vs",
            "label": "Vp/Vs"
        },
        "http://epos/WP16Vocabulary/example30": {
            "keyword": "Bulk Modulus",
            "label": "Bulk Modulus"
        },
        "http://epos/WP16Vocabulary/example31": {
            "keyword": "Shear Modulus",
            "label": "Shear Modulus"
        },
        "http://epos/WP16Vocabulary/example32": {
            "keyword": "Young\u2019s Modulus",
            "label": "Young\u2019s Modulus"
        },
        "http://epos/WP16Vocabulary/example33": {
            "keyword": "Acoustic Emissions",
            "label": "Acoustic Emissions"
        },
        "http://epos/WP16Vocabulary/example34": {
            "keyword": "Thermal Conductivity",
            "label": "Thermal Conductivity"
        },
        "http://epos/WP16Vocabulary/example35": {
            "keyword": "Thermal Diffusivity",
            "label": "Thermal Diffusivity"
        },
        "http://epos/WP16Vocabulary/example36": {
            "keyword": "Heat Capacity",
            "label": "Heat Capacity"
        },
        "http://epos/WP16Vocabulary/example37": {
            "keyword": "Phase Transition",
            "label": "Phase Transition",
            "http://epos/WP16Vocabulary/example38": {
                "keyword": "Melting",
                "label": "Melting"
            },
            "http://epos/WP16Vocabulary/example39": {
                "keyword": "Freezing",
                "label": "Freezing"
            },
            "http://epos/WP16Vocabulary/example40": {
                "keyword": "Vaporization",
                "label": "Vaporization"
            },
            "http://epos/WP16Vocabulary/example41": {
                "keyword": "Condensation",
                "label": "Condensation"
            },
            "http://epos/WP16Vocabulary/example42": {
                "keyword": "Deposition",
                "label": "Deposition"
            },
            "http://epos/WP16Vocabulary/example43": {
                "keyword": "Sublimation",
                "label": "Sublimation"
            },
            "http://epos/WP16Vocabulary/example44": {
                "keyword": "Recombination",
                "label": "Recombination"
            },
            "http://epos/WP16Vocabulary/example45": {
                "keyword": "Sublimation",
                "label": "Sublimation"
            },
            "http://epos/WP16Vocabulary/example46": {
                "keyword": "Ionization",
                "label": "Ionization"
            },
            "http://epos/WP16Vocabulary/example47": {
                "keyword": "Deionization",
                "label": "Deionization"
            }
        },
        "http://epos/WP16Vocabulary/example38": {
            "keyword": "Melting",
            "label": "Melting"
        },
        "http://epos/WP16Vocabulary/example39": {
            "keyword": "Freezing",
            "label": "Freezing"
        },
        "http://epos/WP16Vocabulary/example40": {
            "keyword": "Vaporization",
            "label": "Vaporization"
        },
        "http://epos/WP16Vocabulary/example41": {
            "keyword": "Condensation",
            "label": "Condensation"
        },
        "http://epos/WP16Vocabulary/example42": {
            "keyword": "Deposition",
            "label": "Deposition"
        },
        "http://epos/WP16Vocabulary/example43": {
            "keyword": "Sublimation",
            "label": "Sublimation"
        },
        "http://epos/WP16Vocabulary/example44": {
            "keyword": "Recombination",
            "label": "Recombination"
        },
        "http://epos/WP16Vocabulary/example45": {
            "keyword": "Sublimation",
            "label": "Sublimation"
        },
        "http://epos/WP16Vocabulary/example46": {
            "keyword": "Ionization",
            "label": "Ionization"
        },
        "http://epos/WP16Vocabulary/example47": {
            "keyword": "Deionization",
            "label": "Deionization"
        },
        "http://epos/WP16Vocabulary/example48": {
            "keyword": "Electrical Conductivity",
            "label": "Electrical Conductivity"
        },
        "http://epos/WP16Vocabulary/example49": {
            "keyword": "Resistivity",
            "label": "Resistivity"
        },
        "http://epos/WP16Vocabulary/example50": {
            "keyword": "Electrical Capacity",
            "label": "Electrical Capacity",
            "http://epos/WP16Vocabulary/example51": {
                "keyword": "Spontaneous Potential",
                "label": "Spontaneous Potential"
            }
        },
        "http://epos/WP16Vocabulary/example51": {
            "keyword": "Spontaneous Potential",
            "label": "Spontaneous Potential"
        },
        "http://epos/WP16Vocabulary/example52": {
            "keyword": "Grain size distribution",
            "label": "Grain size distribution"
        },
        "http://epos/WP16Vocabulary/example53": {
            "keyword": "Abrasivity",
            "label": "Abrasivity"
        },
        "http://epos/WP16Vocabulary/example54": {
            "keyword": "Composition",
            "label": "Composition"
        }
    }
}