{
    "thesaurus_name": "EPOS WP16 Paleomagnetic Data Location Type",
    "uri": "http://epos-ip.org/WP16/Paleomagnetic/LocationType",
    "definitions": {
        "http://epos/WP16Vocabulary/Palmag/ArcheologicalAshes": {
            "keyword": "Archeological Ashes",
            "label": "Archeological Ashes"
        },
        "http://epos/WP16Vocabulary/Palmag/LandSection": {
            "keyword": "Land Section",
            "label": "Land Section"
        },
        "http://epos/WP16Vocabulary/Palmag/StrategraphicSection": {
            "keyword": "Stratigraphic Section",
            "label": "Stratigraphic Section"
        },
        "http://epos/WP16Vocabulary/Palmag/ArcheologicalSite": {
            "keyword": "Archeological Site",
            "label": "Archeological Site"
        },
        "http://epos/WP16Vocabulary/Palmag/Lunar": {
            "keyword": "Lunar",
            "label": "Lunar"
        },
        "http://epos/WP16Vocabulary/Palmag/Submarine": {
            "keyword": "Submarine Site",
            "label": "Submarine Site"
        },
        "http://epos/WP16Vocabulary/Palmag/Core": {
            "keyword": "Core",
            "label": "Core"
        },
        "http://epos/WP16Vocabulary/Palmag/Martian": {
            "keyword": "Martian",
            "label": "Martian"
        },
        "http://epos/WP16Vocabulary/Palmag/DrillSite": {
            "keyword": "Drill Site",
            "label": "Drill Site"
        },
        "http://epos/WP16Vocabulary/Palmag/Meteorite": {
            "keyword": "Meteorite",
            "label": "Meteorite"
        },
        "http://epos/WP16Vocabulary/Palmag/Laboratory": {
            "keyword": "Laboratory",
            "label": "Laboratory"
        },
        "http://epos/WP16Vocabulary/Palmag/Outcrop": {
            "keyword": "Outcrop",
            "label": "Outcrop"
        },
        "http://epos/WP16Vocabulary/Palmag/LakeCore": {
            "keyword": "Lake core",
            "label": "Lake core"
        },
        "http://epos/WP16Vocabulary/Palmag/Region": {
            "keyword": "Region",
            "label": "Region"
        }
    }
}