\relax 
\providecommand\hyper@newdestlabel[2]{}
\providecommand\HyperFirstAtBeginDocument{\AtBeginDocument}
\HyperFirstAtBeginDocument{\ifx\hyper@anchor\@undefined
\global\let\oldcontentsline\contentsline
\gdef\contentsline#1#2#3#4{\oldcontentsline{#1}{#2}{#3}}
\global\let\oldnewlabel\newlabel
\gdef\newlabel#1#2{\newlabelxx{#1}#2}
\gdef\newlabelxx#1#2#3#4#5#6{\oldnewlabel{#1}{{#2}{#3}}}
\AtEndDocument{\ifx\hyper@anchor\@undefined
\let\contentsline\oldcontentsline
\let\newlabel\oldnewlabel
\fi}
\fi}
\global\let\hyper@last\relax 
\gdef\HyperFirstAtBeginDocument#1{#1}
\providecommand\HyField@AuxAddToFields[1]{}
\providecommand\HyField@AuxAddToCoFields[2]{}
\select@language{english}
\@writefile{toc}{\select@language{english}}
\@writefile{lof}{\select@language{english}}
\@writefile{lot}{\select@language{english}}
\@writefile{toc}{\contentsline {section}{\numberline {1}Introduction}{1}{section.1}}
\@writefile{toc}{\contentsline {section}{\numberline {2}Data}{2}{section.2}}
\@writefile{toc}{\contentsline {subsection}{\numberline {2.1}Train and test data}{2}{subsection.2.1}}
\@writefile{toc}{\contentsline {subsection}{\numberline {2.2}Context}{2}{subsection.2.2}}
\@writefile{lof}{\contentsline {figure}{\numberline {1}{\ignorespaces \textit  {example image for the right facing pose}\relax }}{2}{figure.caption.2}}
\providecommand*\caption@xref[2]{\@setref\relax\@undefined{#1}}
\newlabel{fig:pose}{{1}{2}{\textit {example image for the right facing pose}\relax }{figure.caption.2}{}}
\@writefile{toc}{\contentsline {subsection}{\numberline {2.3}Cutouts}{3}{subsection.2.3}}
\@writefile{toc}{\contentsline {subsubsection}{\numberline {2.3.1}Add Height}{3}{subsubsection.2.3.1}}
\@writefile{toc}{\contentsline {subsubsection}{\numberline {2.3.2}Average Ratio}{3}{subsubsection.2.3.2}}
\@writefile{toc}{\contentsline {subsection}{\numberline {2.4}Negative Class Images}{3}{subsection.2.4}}
\@writefile{lof}{\contentsline {figure}{\numberline {2}{\ignorespaces \textit  {Different methods for gathering positive class cutouts. The first image is the original, the second is the cutout using the bounding box. For the third and fourth column, the top images are the adapted and resized cutout for the method where we only add height and the bottom images are for the average ratio method.}\relax }}{4}{figure.caption.3}}
\newlabel{fig:resize}{{2}{4}{\textit {Different methods for gathering positive class cutouts. The first image is the original, the second is the cutout using the bounding box. For the third and fourth column, the top images are the adapted and resized cutout for the method where we only add height and the bottom images are for the average ratio method.}\relax }{figure.caption.3}{}}
\@writefile{lof}{\contentsline {figure}{\numberline {3}{\ignorespaces \textit  {Negative cutout (blue rectangle) from a positive class image}\relax }}{4}{figure.caption.4}}
\newlabel{fig:negcut}{{3}{4}{\textit {Negative cutout (blue rectangle) from a positive class image}\relax }{figure.caption.4}{}}
\@writefile{toc}{\contentsline {section}{\numberline {3}Processing}{5}{section.3}}
\@writefile{toc}{\contentsline {subsection}{\numberline {3.1}Image Descriptor}{5}{subsection.3.1}}
\@writefile{toc}{\contentsline {subsection}{\numberline {3.2}Image Classifier}{5}{subsection.3.2}}
\@writefile{lot}{\contentsline {table}{\numberline {1}{\ignorespaces \textit  {Cross Validation data for parameter C of the SVM}\relax }}{5}{table.caption.5}}
\newlabel{fig:CCross}{{1}{5}{\textit {Cross Validation data for parameter C of the SVM}\relax }{table.caption.5}{}}
\@writefile{toc}{\contentsline {subsection}{\numberline {3.3}Ratio of positive/negative class images}{6}{subsection.3.3}}
\@writefile{lot}{\contentsline {table}{\numberline {2}{\ignorespaces \textit  {p,r and f-scores for different pos/neg ratios}\relax }}{6}{table.caption.6}}
\newlabel{fig:posneg}{{2}{6}{\textit {p,r and f-scores for different pos/neg ratios}\relax }{table.caption.6}{}}
\@writefile{toc}{\contentsline {subsection}{\numberline {3.4}Amount of Data}{6}{subsection.3.4}}
\@writefile{lot}{\contentsline {table}{\numberline {3}{\ignorespaces \textit  {f-scores for cross validation with different sizes of training data}\relax }}{6}{table.caption.7}}
\newlabel{fig:dataSize}{{3}{6}{\textit {f-scores for cross validation with different sizes of training data}\relax }{table.caption.7}{}}
\@writefile{toc}{\contentsline {subsection}{\numberline {3.5}Detection Threshold}{6}{subsection.3.5}}
\@writefile{toc}{\contentsline {subsection}{\numberline {3.6}PR-Curve}{7}{subsection.3.6}}
\@writefile{lof}{\contentsline {figure}{\numberline {4}{\ignorespaces \textit  { Precision Recall Graph}\relax }}{7}{figure.caption.8}}
\newlabel{fig:prCurve}{{4}{7}{\textit { Precision Recall Graph}\relax }{figure.caption.8}{}}
\@writefile{toc}{\contentsline {subsection}{\numberline {3.7}Cell Size}{7}{subsection.3.7}}
\@writefile{lof}{\contentsline {figure}{\numberline {5}{\ignorespaces \textit  { Different cell sizes drawn onto an image. From top left to bottom right: 64x64, 32x32, 16x16, 8x8 and 4x4}\relax }}{8}{figure.caption.9}}
\newlabel{fig:cellSize}{{5}{8}{\textit { Different cell sizes drawn onto an image. From top left to bottom right: 64x64, 32x32, 16x16, 8x8 and 4x4}\relax }{figure.caption.9}{}}
\@writefile{toc}{\contentsline {subsection}{\numberline {3.8}Optimal Values \& Code}{8}{subsection.3.8}}
\citation{*}
\bibstyle{acm}
\@writefile{toc}{\contentsline {section}{\numberline {4}Reflection}{9}{section.4}}
\newlabel{LastPage}{{}{9}{}{page.9}{}}
\xdef\lastpage@lastpage{9}
\xdef\lastpage@lastpageHy{9}
