\relax 
\providecommand\hyper@newdestlabel[2]{}
\providecommand\HyperFirstAtBeginDocument{\AtBeginDocument}
\HyperFirstAtBeginDocument{\ifx\hyper@anchor\@undefined
\global\let\oldcontentsline\contentsline
\gdef\contentsline#1#2#3#4{\oldcontentsline{#1}{#2}{#3}}
\global\let\oldnewlabel\newlabel
\gdef\newlabel#1#2{\newlabelxx{#1}#2}
\gdef\newlabelxx#1#2#3#4#5#6{\oldnewlabel{#1}{{#2}{#3}}}
\AtEndDocument{\ifx\hyper@anchor\@undefined
\let\contentsline\oldcontentsline
\let\newlabel\oldnewlabel
\fi}
\fi}
\global\let\hyper@last\relax 
\gdef\HyperFirstAtBeginDocument#1{#1}
\providecommand\HyField@AuxAddToFields[1]{}
\providecommand\HyField@AuxAddToCoFields[2]{}
\select@language{english}
\@writefile{toc}{\select@language{english}}
\@writefile{lof}{\select@language{english}}
\@writefile{lot}{\select@language{english}}
\@writefile{toc}{\contentsline {section}{\numberline {1}Video}{1}{section.1}}
\@writefile{toc}{\contentsline {section}{\numberline {2}ChessBoards}{1}{section.2}}
\@writefile{toc}{\contentsline {subsection}{\numberline {2.1}Optimization Of Camera Points}{2}{subsection.2.1}}
\@writefile{toc}{\contentsline {section}{\numberline {3}Background}{2}{section.3}}
\@writefile{toc}{\contentsline {section}{\numberline {4}Thresholds}{2}{section.4}}
\@writefile{toc}{\contentsline {subsection}{\numberline {4.1}Finding optimal HSV thresholds}{2}{subsection.4.1}}
\@writefile{toc}{\contentsline {subsection}{\numberline {4.2}Optimizing HSV thresholds}{3}{subsection.4.2}}
\citation{*}
\bibstyle{acm}
\@writefile{toc}{\contentsline {subsection}{\numberline {4.3}Finding Optimal Erode \& Dilate Variables}{4}{subsection.4.3}}
\newlabel{LastPage}{{}{4}{}{page.4}{}}
\xdef\lastpage@lastpage{4}
\xdef\lastpage@lastpageHy{4}
