\BOOKMARK [1][-]{section.1}{Video}{}% 1
\BOOKMARK [1][-]{section.2}{Readme}{}% 2
\BOOKMARK [1][-]{section.3}{Description}{}% 3
\BOOKMARK [1][-]{section.4}{Color models}{}% 4
\BOOKMARK [2][-]{subsection.4.1}{Mean}{section.4}% 5
\BOOKMARK [2][-]{subsection.4.2}{Histogram}{section.4}% 6
\BOOKMARK [2][-]{subsection.4.3}{Comparing color models}{section.4}% 7
\BOOKMARK [1][-]{section.5}{Cluster improvements}{}% 8
\BOOKMARK [2][-]{subsection.5.1}{Ghost voxels}{section.5}% 9
\BOOKMARK [2][-]{subsection.5.2}{Removing ghost voxels}{section.5}% 10
\BOOKMARK [2][-]{subsection.5.3}{Part of pixels used for color models}{section.5}% 11
\BOOKMARK [1][-]{section.6}{Possible further improvements}{}% 12
