\relax 
\providecommand\hyper@newdestlabel[2]{}
\providecommand\HyperFirstAtBeginDocument{\AtBeginDocument}
\HyperFirstAtBeginDocument{\ifx\hyper@anchor\@undefined
\global\let\oldcontentsline\contentsline
\gdef\contentsline#1#2#3#4{\oldcontentsline{#1}{#2}{#3}}
\global\let\oldnewlabel\newlabel
\gdef\newlabel#1#2{\newlabelxx{#1}#2}
\gdef\newlabelxx#1#2#3#4#5#6{\oldnewlabel{#1}{{#2}{#3}}}
\AtEndDocument{\ifx\hyper@anchor\@undefined
\let\contentsline\oldcontentsline
\let\newlabel\oldnewlabel
\fi}
\fi}
\global\let\hyper@last\relax 
\gdef\HyperFirstAtBeginDocument#1{#1}
\providecommand\HyField@AuxAddToFields[1]{}
\providecommand\HyField@AuxAddToCoFields[2]{}
\select@language{english}
\@writefile{toc}{\select@language{english}}
\@writefile{lof}{\select@language{english}}
\@writefile{lot}{\select@language{english}}
\@writefile{toc}{\contentsline {section}{\numberline {1}Video}{1}{section.1}}
\@writefile{toc}{\contentsline {section}{\numberline {2}Readme}{1}{section.2}}
\@writefile{toc}{\contentsline {section}{\numberline {3}Description}{1}{section.3}}
\@writefile{toc}{\contentsline {section}{\numberline {4}Color models}{2}{section.4}}
\@writefile{toc}{\contentsline {subsection}{\numberline {4.1}Mean}{2}{subsection.4.1}}
\@writefile{toc}{\contentsline {subsection}{\numberline {4.2}Histogram}{2}{subsection.4.2}}
\@writefile{toc}{\contentsline {subsection}{\numberline {4.3}Comparing color models}{2}{subsection.4.3}}
\@writefile{lof}{\contentsline {figure}{\numberline {1}{\ignorespaces Path of mean model\relax }}{3}{figure.caption.1}}
\providecommand*\caption@xref[2]{\@setref\relax\@undefined{#1}}
\newlabel{fig:PathsM}{{1}{3}{Path of mean model\relax }{figure.caption.1}{}}
\@writefile{lof}{\contentsline {figure}{\numberline {2}{\ignorespaces Path of histogram model\relax }}{3}{figure.caption.1}}
\newlabel{fig:PathsH}{{2}{3}{Path of histogram model\relax }{figure.caption.1}{}}
\@writefile{toc}{\contentsline {section}{\numberline {5}Cluster improvements}{3}{section.5}}
\@writefile{toc}{\contentsline {subsection}{\numberline {5.1}Ghost voxels}{3}{subsection.5.1}}
\@writefile{toc}{\contentsline {subsection}{\numberline {5.2}Removing ghost voxels}{3}{subsection.5.2}}
\@writefile{lof}{\contentsline {figure}{\numberline {3}{\ignorespaces Clusters for initial k-means algorithm\relax }}{4}{figure.caption.2}}
\newlabel{fig:InitK}{{3}{4}{Clusters for initial k-means algorithm\relax }{figure.caption.2}{}}
\@writefile{toc}{\contentsline {subsection}{\numberline {5.3}Part of pixels used for color models}{4}{subsection.5.3}}
\citation{*}
\bibstyle{acm}
\@writefile{toc}{\contentsline {section}{\numberline {6}Possible further improvements}{5}{section.6}}
\newlabel{fig:original}{{\caption@xref {fig:original}{ on input line 186}}{6}{Removing ghost voxels}{figure.caption.3}{}}
\newlabel{fig:1}{{\caption@xref {fig:1}{ on input line 192}}{6}{Removing ghost voxels}{figure.caption.3}{}}
\newlabel{fig:2}{{\caption@xref {fig:2}{ on input line 201}}{6}{Removing ghost voxels}{figure.caption.3}{}}
\newlabel{fig:3}{{\caption@xref {fig:3}{ on input line 207}}{6}{Removing ghost voxels}{figure.caption.3}{}}
\newlabel{fig:4}{{\caption@xref {fig:4}{ on input line 216}}{6}{Removing ghost voxels}{figure.caption.3}{}}
\newlabel{fig:5}{{\caption@xref {fig:5}{ on input line 222}}{6}{Removing ghost voxels}{figure.caption.3}{}}
\@writefile{lof}{\contentsline {figure}{\numberline {4}{\ignorespaces Frame 1051 with different number of clusters removed\relax }}{6}{figure.caption.3}}
\newlabel{fig:clusters}{{4}{6}{Frame 1051 with different number of clusters removed\relax }{figure.caption.3}{}}
\newlabel{LastPage}{{}{6}{}{page.6}{}}
\xdef\lastpage@lastpage{6}
\xdef\lastpage@lastpageHy{6}
