\relax 
\citation{maart2020RIVM}
\citation{graves2016a}
\citation{2011.13253}
\newlabel{FirstPage}{{}{1}{}{}{}}
\@writefile{toc}{\contentsline {title}{A Quantitative approach to the amount of trustworthy sources in news coverage of COVID-19}{1}{}}
\citation{ombudsman}
\@writefile{toc}{\contentsline {abstract}{Abstract}{2}{}}
\newlabel{intro}{{1}{2}{}{}{}}
\@writefile{toc}{\contentsline {section}{\numberline {1}Introduction }{2}{}}
\newlabel{cont}{{1\,1.1}{2}{}{}{}}
\@writefile{toc}{\contentsline {subsection}{\numberline {1.1}Context }{2}{}}
\newlabel{institutions}{{1\,1.2}{2}{}{}{}}
\@writefile{toc}{\contentsline {subsection}{\numberline {1.2}News Institutions }{2}{}}
\newlabel{researchIntro}{{1\,1.3}{3}{}{}{}}
\@writefile{toc}{\contentsline {subsection}{\numberline {1.3}Research }{3}{}}
\newlabel{method}{{2}{3}{}{}{}}
\@writefile{toc}{\contentsline {section}{\numberline {2}Methodology}{3}{}}
\@writefile{toc}{\contentsline {subsection}{\numberline {2.1}Web crawler}{3}{}}
\@writefile{toc}{\contentsline {subsection}{\numberline {2.2}Simple quantitative analysation}{3}{}}
\newlabel{results}{{3}{4}{}{}{}}
\@writefile{toc}{\contentsline {section}{\numberline {3}Results}{4}{}}
\@writefile{lof}{\contentsline {figure}{\numberline {1}{\ignorespaces  Nu.nl \& Nos.nl Primary Sources in Primary Articles Percentage}}{4}{}}
\newlabel{fig:1_1}{{1}{4}{}{}{}}
\@writefile{lof}{\contentsline {figure}{\numberline {2}{\ignorespaces  Nu.nl \& Nos.nl Primary Sources in Secondary Articles Percentage }}{5}{}}
\newlabel{fig:1_2}{{2}{5}{}{}{}}
\@writefile{lof}{\contentsline {figure}{\numberline {3}{\ignorespaces  Nu.nl \& Nos.nl Secondary Sources in Primary Articles Percentage }}{5}{}}
\newlabel{fig:2_1}{{3}{5}{}{}{}}
\@writefile{lof}{\contentsline {figure}{\numberline {4}{\ignorespaces  Nu.nl \& Nos.nl Secondary Sources in Secondary Articles Percentage }}{6}{}}
\newlabel{fig:2_2}{{4}{6}{}{}{}}
\@writefile{lof}{\contentsline {figure}{\numberline {5}{\ignorespaces  Nu.nl \& Nos.nl Tertiary Sources in Primary Articles Percentage }}{6}{}}
\newlabel{fig:3_1}{{5}{6}{}{}{}}
\citation{maart2020RIVM}
\@writefile{lof}{\contentsline {figure}{\numberline {6}{\ignorespaces  Nu.nl \& Nos.nl Tertiary Sources in Secondary Articles Percentage }}{7}{}}
\newlabel{fig:3_2}{{6}{7}{}{}{}}
\newlabel{discussion}{{4}{7}{}{}{}}
\@writefile{toc}{\contentsline {section}{\numberline {4}Discussion}{7}{}}
\citation{2011.13253}
\bibdata{bond-dilutedNotes,bibliography}
\bibcite{graves2016a}{{1}{2016}{{Graves\ and\ Cherubini}}{{}}}
\newlabel{conclusion}{{5}{8}{}{}{}}
\@writefile{toc}{\contentsline {section}{\numberline {5}Conclusion}{8}{}}
\newlabel{future}{{6}{8}{}{}{}}
\@writefile{toc}{\contentsline {section}{\numberline {6}Future research}{8}{}}
\@writefile{toc}{\contentsline {subsection}{\numberline {6.1}Own future research}{8}{}}
\@writefile{toc}{\contentsline {subsection}{\numberline {6.2}Future research for others}{8}{}}
\newlabel{ackn}{{6\,6.2}{8}{}{}{}}
\@writefile{toc}{\contentsline {section}{\numberline {}Acknowledgement }{8}{}}
\bibcite{2011.13253}{{2}{2020}{{Vijjali\ \emph  {et~al.}}}{{Vijjali, Potluri, Kumar,\ and\ Teki}}}
\bibcite{ombudsman}{{3}{2020}{{Smit}}{{}}}
\bibcite{maart2020RIVM}{{4}{2020}{{RIVM}}{{}}}
\bibstyle{apsrev4-2}
\citation{REVTEX42Control}
\citation{apsrev42Control}
\@writefile{toc}{\contentsline {section}{\numberline {}References}{9}{}}
\newlabel{LastBibItem}{{4}{9}{}{}{}}
\newlabel{LastPage}{{}{9}{}{}{}}
\gdef \@abspage@last{9}
