﻿12
21
111111111000001111111
111100111111111111111
111100111111111111111
111100011011001100110
111100011001100110110
000000111111111111111
000000111111111111111
000000111111111111111
000000111111111111111
000000111111111111111
000000111111111111111
000000111001111100111
3
4
7
8
7
1
7
6
4
1
4
5
7
2
6
4
3
1
3
6
8
4
7
3
6
5
7
6
1
4
7
2
3
4
4
4
2
2
7
8
5
8
3
4
1
1
8
4
7
1
8
5
4
7
1
6
5
7
6
7
4
8
3
6
2
8
8
5
5
8
7
2
2
6
2
6
3
1
2
1
1
8
4
2
8
6
2
3
7
5
5
5
3
5
7
4
5
4
8
2
0