﻿13
22
1111111000000001111111
0111111100000111001111
0111111110001111001111
0111111111111111001111
0011011001100110001111
0011001100110110000000
0111111111111111001111
0111111111111111001111
0111111111111111001111
0111111111111111001111
0111111111111111001111
0111111111111111001111
0111111111111000001111
6
3
8
3
6
5
1
3
8
7
6
5
2
1
2
8
6
4
4
3
4
1
8
5
2
1
4
6
3
6
2
5
1
5
1
5
6
8
5
3
7
6
6
2
7
6
4
4
4
8
5
6
7
2
1
4
5
3
2
3
3
1
7
4
3
6
6
5
2
2
3
1
8
1
4
6
4
4
8
8
2
2
3
3
1
8
5
6
7
7
1
7
2
3
6
8
1
1
7
6
0