﻿....................
S.S.S.S.S.S.S....X..
...................R
...................R
WWW....WWWW.....T...
---....****.....#...
...................R
WWW.................
***..........WWWW...
r...........*****...
....WWW.............
...................R
r......C............
.....****...........
r..............C....
.............*****..
.1.................R
**..**..***.........
300
Time is no issue. Killing balloons is key to making it beatable!
