........W...W.......
.X....W...W...W....R
####^^^^^^^^^^^^^^..
.......W...W...W....
r....W...W...W...W..
..^^^^^^^^^^^^^^^^##
....W...W...W.......
..W...W...W...W....R
##^^^^^^^^^^^^^^^^..
.......W...W...W....
r....W...W...W...W..
..^^^^^^^^^^^^^^^^##
...W...W...W...W....
.W...W...W...W....1.
####################
30
Rockets > Your bombs, can't use your weapon here!
