....................
.................X..
..........##########
....................
WWW....WWWW.........
---....####.........
....................
WWW.................
###.........WWWWW...
............#####...
....WWW.............
....###.............
....................
.1........W.W.W.W.W.
####################
30
You can press the S key to throw bombs at enemies!
