graph ; GPU ; MIS ; width ; # runs ; # nodes ; # edges ; # bags ; results ; time in (s);;graph ;avg time in (s)
1; GPU ; DS ;5;5;74;146;73;15;1,474;;1;0,3512
1; GPU ; DS ;5;5;74;146;73;15;0,063;;3;0,097
1; GPU ; DS ;5;5;74;146;73;15;0,078;;5;0,1128
1; GPU ; DS ;5;5;74;146;73;15;0,078;;7;0,1406
1; GPU ; DS ;5;5;74;146;73;15;0,063;;9;0,1438
3; GPU ; DS ;5;5;87;176;95;15;0,094;;11;0,1656
3; GPU ; DS ;5;5;87;176;95;15;0,094;;13;0,8094
3; GPU ; DS ;5;5;87;176;95;15;0,109;;15;0,1688
3; GPU ; DS ;5;5;87;176;95;15;0,094;;17;0,2406
3; GPU ; DS ;5;5;87;176;95;15;0,094;;19;0,25
5; GPU ; DS ;5;5;201;253;194;63;0,11;;21;0,4968
5; GPU ; DS ;5;5;201;253;194;63;0,125;;23;0,7342
5; GPU ; DS ;5;5;201;253;194;63;0,11;;25;5,013
5; GPU ; DS ;5;5;201;253;194;63;0,11;;27;0,1374
5; GPU ; DS ;5;5;201;253;194;63;0,109;;29;0,4218
7; GPU ; DS ;5;5;216;288;225;62;0,157;;31;0,7092
7; GPU ; DS ;5;5;216;288;225;62;0,125;;33;1,1968
7; GPU ; DS ;5;5;216;288;225;62;0,14;;35;0,8534
7; GPU ; DS ;5;5;216;288;225;62;0,141;;37;4,4684
7; GPU ; DS ;5;5;216;288;225;62;0,14;;39;1,8124
9; GPU ; DS ;5;5;229;312;224;67;0,141;;41;1,6934
9; GPU ; DS ;5;5;229;312;224;67;0,14;;43;1,9154
9; GPU ; DS ;5;5;229;312;224;67;0,156;;45;1,5312
9; GPU ; DS ;5;5;229;312;224;67;0,141;;47;2,8998
9; GPU ; DS ;5;5;229;312;224;67;0,141;;49;3,734
11; GPU ; DS ;5;5;244;337;231;71;0,172;;51;9,393
11; GPU ; DS ;5;5;244;337;231;71;0,156;;53;4,7152
11; GPU ; DS ;5;5;244;337;231;71;0,172;;55;4,2492
11; GPU ; DS ;5;5;244;337;231;71;0,172;;57;5,2402
11; GPU ; DS ;5;5;244;337;231;71;0,156;;59;-1
13; GPU ; DS ;5;5;1906;2083;1896;635;0,828;;61;-1
13; GPU ; DS ;5;5;1906;2083;1896;635;0,797;;63;-1
13; GPU ; DS ;5;5;1906;2083;1896;635;0,797;;65;-1
13; GPU ; DS ;5;5;1906;2083;1896;635;0,797;;67;-1
13; GPU ; DS ;5;5;1906;2083;1896;635;0,828;;69;-1
15; GPU ; DS ;6;5;114;228;117;23;0,172;;71;-1
15; GPU ; DS ;6;5;114;228;117;23;0,172;;73;-1
15; GPU ; DS ;6;5;114;228;117;23;0,156;;75;-1
15; GPU ; DS ;6;5;114;228;117;23;0,172;;77;-1
15; GPU ; DS ;6;5;114;228;117;23;0,172;;79;-1
17; GPU ; DS ;6;5;210;276;203;63;0,235;;81;-1
17; GPU ; DS ;6;5;210;276;203;63;0,25;;83;-1
17; GPU ; DS ;6;5;210;276;203;63;0,234;;85;-1
17; GPU ; DS ;6;5;210;276;203;63;0,234;;87;-1
17; GPU ; DS ;6;5;210;276;203;63;0,25;;89;-1
19; GPU ; DS ;6;5;231;319;224;67;0,25;;91;-1
19; GPU ; DS ;6;5;231;319;224;67;0,25;;93;-1
19; GPU ; DS ;6;5;231;319;224;67;0,234;;95;-1
19; GPU ; DS ;6;5;231;319;224;67;0,266;;97;-1
19; GPU ; DS ;6;5;231;319;224;67;0,25;;99;-1
21; GPU ; DS ;6;5;247;486;249;49;0,5;;101;-1
21; GPU ; DS ;6;5;247;486;249;49;0,5;;103;-1
21; GPU ; DS ;6;5;247;486;249;49;0,5;;105;-1
21; GPU ; DS ;6;5;247;486;249;49;0,5;;107;-1
21; GPU ; DS ;6;5;247;486;249;49;0,484;;109;-1
23; GPU ; DS ;6;5;990;1258;964;298;0,749;;111;-1
23; GPU ; DS ;6;5;990;1258;964;298;0,719;;113;-1
23; GPU ; DS ;6;5;990;1258;964;298;0,734;;115;-1
23; GPU ; DS ;6;5;990;1258;964;298;0,719;;117;-1
23; GPU ; DS ;6;5;990;1258;964;298;0,75;;119;-1
25; GPU ; DS ;6;5;8790;9815;8761;2949;5,031;;121;-1
25; GPU ; DS ;6;5;8790;9815;8761;2949;4,968;;123;-1
25; GPU ; DS ;6;5;8790;9815;8761;2949;5,036;;125;-1
25; GPU ; DS ;6;5;8790;9815;8761;2949;5,015;;127;-1
25; GPU ; DS ;6;5;8790;9815;8761;2949;5,015;;129;-1
27; GPU ; DS ;7;5;15;35;11;4;0,141;;131;-1
27; GPU ; DS ;7;5;15;35;11;4;0,14;;133;-1
27; GPU ; DS ;7;5;15;35;11;4;0,141;;135;-1
27; GPU ; DS ;7;5;15;35;11;4;0,125;;137;-1
27; GPU ; DS ;7;5;15;35;11;4;0,14;;139;-1
29; GPU ; DS ;7;5;197;250;183;59;0,422;;141;-1
29; GPU ; DS ;7;5;197;250;183;59;0,422;;143;-1
29; GPU ; DS ;7;5;197;250;183;59;0,421;;145;-1
29; GPU ; DS ;7;5;197;250;183;59;0,407;;147;-1
29; GPU ; DS ;7;5;197;250;183;59;0,437;;149;-1
31; GPU ; DS ;7;5;269;399;243;72;0,703;;151;-1
31; GPU ; DS ;7;5;269;399;243;72;0,703;;153;-1
31; GPU ; DS ;7;5;269;399;243;72;0,703;;155;-1
31; GPU ; DS ;7;5;269;399;243;72;0,734;;157;-1
31; GPU ; DS ;7;5;269;399;243;72;0,703;;159;-1
33; GPU ; DS ;7;5;480;670;436;136;1,203;;161;-1
33; GPU ; DS ;7;5;480;670;436;136;1,203;;163;-1
33; GPU ; DS ;7;5;480;670;436;136;1,188;;165;-1
33; GPU ; DS ;7;5;480;670;436;136;1,187;;167;-1
33; GPU ; DS ;7;5;480;670;436;136;1,203;;169;-1
35; GPU ; DS ;7;5;543;727;528;157;0,844;;171;-1
35; GPU ; DS ;7;5;543;727;528;157;0,875;;173;-1
35; GPU ; DS ;7;5;543;727;528;157;0,844;;175;-1
35; GPU ; DS ;7;5;543;727;528;157;0,86;;177;-1
35; GPU ; DS ;7;5;543;727;528;157;0,844;;179;-1
37; GPU ; DS ;7;5;1172;1627;1053;334;4,452;;181;-1
37; GPU ; DS ;7;5;1172;1627;1053;334;4,5;;183;-1
37; GPU ; DS ;7;5;1172;1627;1053;334;4,453;;185;-1
37; GPU ; DS ;7;5;1172;1627;1053;334;4,437;;187;-1
37; GPU ; DS ;7;5;1172;1627;1053;334;4,5;;189;-1
39; GPU ; DS ;7;5;1912;2223;1891;600;1,813;;191;-1
39; GPU ; DS ;7;5;1912;2223;1891;600;1,812;;193;-1
39; GPU ; DS ;7;5;1912;2223;1891;600;1,828;;195;-1
39; GPU ; DS ;7;5;1912;2223;1891;600;1,797;;197;-1
39; GPU ; DS ;7;5;1912;2223;1891;600;1,812;;199;-1
41; GPU ; DS ;7;5;2382;2674;2378;766;1,687;;;
41; GPU ; DS ;7;5;2382;2674;2378;766;1,687;;;
41; GPU ; DS ;7;5;2382;2674;2378;766;1,719;;;
41; GPU ; DS ;7;5;2382;2674;2378;766;1,734;;;
41; GPU ; DS ;7;5;2382;2674;2378;766;1,64;;;
43; GPU ; DS ;8;5;246;468;164;58;1,89;;;
43; GPU ; DS ;8;5;246;468;164;58;1,89;;;
43; GPU ; DS ;8;5;246;468;164;58;1,922;;;
43; GPU ; DS ;8;5;246;468;164;58;1,922;;;
43; GPU ; DS ;8;5;246;468;164;58;1,953;;;
45; GPU ; DS ;8;5;389;562;342;110;1,562;;;
45; GPU ; DS ;8;5;389;562;342;110;1,578;;;
45; GPU ; DS ;8;5;389;562;342;110;1,547;;;
45; GPU ; DS ;8;5;389;562;342;110;1,484;;;
45; GPU ; DS ;8;5;389;562;342;110;1,485;;;
47; GPU ; DS ;8;5;585;799;548;167;2,907;;;
47; GPU ; DS ;8;5;585;799;548;167;2,89;;;
47; GPU ; DS ;8;5;585;799;548;167;2,89;;;
47; GPU ; DS ;8;5;585;799;548;167;2,906;;;
47; GPU ; DS ;8;5;585;799;548;167;2,906;;;
49; GPU ; DS ;8;5;623;876;534;176;3,734;;;
49; GPU ; DS ;8;5;623;876;534;176;3,718;;;
49; GPU ; DS ;8;5;623;876;534;176;3,75;;;
49; GPU ; DS ;8;5;623;876;534;176;3,734;;;
49; GPU ; DS ;8;5;623;876;534;176;3,734;;;
51; GPU ; DS ;8;5;1416;1978;1283;402;9,312;;;
51; GPU ; DS ;8;5;1416;1978;1283;402;9,405;;;
51; GPU ; DS ;8;5;1416;1978;1283;402;9,406;;;
51; GPU ; DS ;8;5;1416;1978;1283;402;9,405;;;
51; GPU ; DS ;8;5;1416;1978;1283;402;9,437;;;
53; GPU ; DS ;9;5;181;289;138;48;4,702;;;
53; GPU ; DS ;9;5;181;289;138;48;4,734;;;
53; GPU ; DS ;9;5;181;289;138;48;4,75;;;
53; GPU ; DS ;9;5;181;289;138;48;4,718;;;
53; GPU ; DS ;9;5;181;289;138;48;4,672;;;
55; GPU ; DS ;9;5;233;431;155;57;4,265;;;
55; GPU ; DS ;9;5;233;431;155;57;4,188;;;
55; GPU ; DS ;9;5;233;431;155;57;4,265;;;
55; GPU ; DS ;9;5;233;431;155;57;4,263;;;
55; GPU ; DS ;9;5;233;431;155;57;4,265;;;
57; GPU ; DS ;9;5;245;454;149;58;5,281;;;
57; GPU ; DS ;9;5;245;454;149;58;5,234;;;
57; GPU ; DS ;9;5;245;454;149;58;5,203;;;
57; GPU ; DS ;9;5;245;454;149;58;5,218;;;
57; GPU ; DS ;9;5;245;454;149;58;5,265;;;
59; GPU ; DS ;9;5;560;870;427;-1;0;;;
59; GPU ; DS ;9;5;560;870;427;-1;0;;;
59; GPU ; DS ;9;5;560;870;427;-1;0;;;
59; GPU ; DS ;9;5;560;870;427;-1;0;;;
59; GPU ; DS ;9;5;560;870;427;-1;0;;;
61; GPU ; DS ;9;5;528;1017;446;-1;0;;;
61; GPU ; DS ;9;5;528;1017;446;-1;0;;;
61; GPU ; DS ;9;5;528;1017;446;-1;0;;;
61; GPU ; DS ;9;5;528;1017;446;-1;0;;;
61; GPU ; DS ;9;5;528;1017;446;-1;0;;;
63; GPU ; DS ;9;5;1214;1700;1071;-1;0;;;
63; GPU ; DS ;9;5;1214;1700;1071;-1;0;;;
63; GPU ; DS ;9;5;1214;1700;1071;-1;0;;;
63; GPU ; DS ;9;5;1214;1700;1071;-1;0;;;
63; GPU ; DS ;9;5;1214;1700;1071;-1;0;;;
65; GPU ; DS ;9;5;2856;3641;2653;-1;0;;;
65; GPU ; DS ;9;5;2856;3641;2653;-1;0;;;
65; GPU ; DS ;9;5;2856;3641;2653;-1;0;;;
65; GPU ; DS ;9;5;2856;3641;2653;-1;0;;;
65; GPU ; DS ;9;5;2856;3641;2653;-1;0;;;
67; GPU ; DS ;10;5;200;370;190;-1;0;;;
67; GPU ; DS ;10;5;200;370;190;-1;0;;;
67; GPU ; DS ;10;5;200;370;190;-1;0;;;
67; GPU ; DS ;10;5;200;370;190;-1;0;;;
67; GPU ; DS ;10;5;200;370;190;-1;0;;;
69; GPU ; DS ;10;5;200;370;190;-1;0;;;
69; GPU ; DS ;10;5;200;370;190;-1;0;;;
69; GPU ; DS ;10;5;200;370;190;-1;0;;;
69; GPU ; DS ;10;5;200;370;190;-1;0;;;
69; GPU ; DS ;10;5;200;370;190;-1;0;;;
71; GPU ; DS ;10;5;339;522;269;-1;0;;;
71; GPU ; DS ;10;5;339;522;269;-1;0;;;
71; GPU ; DS ;10;5;339;522;269;-1;0;;;
71; GPU ; DS ;10;5;339;522;269;-1;0;;;
71; GPU ; DS ;10;5;339;522;269;-1;0;;;
73; GPU ; DS ;10;5;262;740;235;-1;0;;;
73; GPU ; DS ;10;5;262;740;235;-1;0;;;
73; GPU ; DS ;10;5;262;740;235;-1;0;;;
73; GPU ; DS ;10;5;262;740;235;-1;0;;;
73; GPU ; DS ;10;5;262;740;235;-1;0;;;
75; GPU ; DS ;10;5;557;1080;351;-1;0;;;
75; GPU ; DS ;10;5;557;1080;351;-1;0;;;
75; GPU ; DS ;10;5;557;1080;351;-1;0;;;
75; GPU ; DS ;10;5;557;1080;351;-1;0;;;
75; GPU ; DS ;10;5;557;1080;351;-1;0;;;
77; GPU ; DS ;10;5;2413;3412;2214;-1;0;;;
77; GPU ; DS ;10;5;2413;3412;2214;-1;0;;;
77; GPU ; DS ;10;5;2413;3412;2214;-1;0;;;
77; GPU ; DS ;10;5;2413;3412;2214;-1;0;;;
77; GPU ; DS ;10;5;2413;3412;2214;-1;0;;;
79; GPU ; DS ;10;5;36415;145635;25210;-1;0;;;
79; GPU ; DS ;10;5;36415;145635;25210;-1;0;;;
79; GPU ; DS ;10;5;36415;145635;25210;-1;0;;;
79; GPU ; DS ;10;5;36415;145635;25210;-1;0;;;
79; GPU ; DS ;10;5;36415;145635;25210;-1;0;;;
81; GPU ; DS ;11;5;237;378;185;-1;0;;;
81; GPU ; DS ;11;5;237;378;185;-1;0;;;
81; GPU ; DS ;11;5;237;378;185;-1;0;;;
81; GPU ; DS ;11;5;237;378;185;-1;0;;;
81; GPU ; DS ;11;5;237;378;185;-1;0;;;
83; GPU ; DS ;11;5;311;632;206;-1;0;;;
83; GPU ; DS ;11;5;311;632;206;-1;0;;;
83; GPU ; DS ;11;5;311;632;206;-1;0;;;
83; GPU ; DS ;11;5;311;632;206;-1;0;;;
83; GPU ; DS ;11;5;311;632;206;-1;0;;;
85; GPU ; DS ;11;5;1274;1808;1177;-1;0;;;
85; GPU ; DS ;11;5;1274;1808;1177;-1;0;;;
85; GPU ; DS ;11;5;1274;1808;1177;-1;0;;;
85; GPU ; DS ;11;5;1274;1808;1177;-1;0;;;
85; GPU ; DS ;11;5;1274;1808;1177;-1;0;;;
87; GPU ; DS ;11;5;1337;1933;1228;-1;0;;;
87; GPU ; DS ;11;5;1337;1933;1228;-1;0;;;
87; GPU ; DS ;11;5;1337;1933;1228;-1;0;;;
87; GPU ; DS ;11;5;1337;1933;1228;-1;0;;;
87; GPU ; DS ;11;5;1337;1933;1228;-1;0;;;
89; GPU ; DS ;11;5;5829;7552;5533;-1;0;;;
89; GPU ; DS ;11;5;5829;7552;5533;-1;0;;;
89; GPU ; DS ;11;5;5829;7552;5533;-1;0;;;
89; GPU ; DS ;11;5;5829;7552;5533;-1;0;;;
89; GPU ; DS ;11;5;5829;7552;5533;-1;0;;;
91; GPU ; DS ;12;5;304;571;284;-1;0;;;
91; GPU ; DS ;12;5;304;571;284;-1;0;;;
91; GPU ; DS ;12;5;304;571;284;-1;0;;;
91; GPU ; DS ;12;5;304;571;284;-1;0;;;
91; GPU ; DS ;12;5;304;571;284;-1;0;;;
93; GPU ; DS ;12;5;1001;1419;927;-1;0;;;
93; GPU ; DS ;12;5;1001;1419;927;-1;0;;;
93; GPU ; DS ;12;5;1001;1419;927;-1;0;;;
93; GPU ; DS ;12;5;1001;1419;927;-1;0;;;
93; GPU ; DS ;12;5;1001;1419;927;-1;0;;;
95; GPU ; DS ;12;5;1335;1932;1217;-1;0;;;
95; GPU ; DS ;12;5;1335;1932;1217;-1;0;;;
95; GPU ; DS ;12;5;1335;1932;1217;-1;0;;;
95; GPU ; DS ;12;5;1335;1932;1217;-1;0;;;
95; GPU ; DS ;12;5;1335;1932;1217;-1;0;;;
97; GPU ; DS ;12;5;2629;3793;2413;-1;0;;;
97; GPU ; DS ;12;5;2629;3793;2413;-1;0;;;
97; GPU ; DS ;12;5;2629;3793;2413;-1;0;;;
97; GPU ; DS ;12;5;2629;3793;2413;-1;0;;;
97; GPU ; DS ;12;5;2629;3793;2413;-1;0;;;
99; GPU ; DS ;13;5;1294;1853;1186;-1;0;;;
99; GPU ; DS ;13;5;1294;1853;1186;-1;0;;;
99; GPU ; DS ;13;5;1294;1853;1186;-1;0;;;
99; GPU ; DS ;13;5;1294;1853;1186;-1;0;;;
99; GPU ; DS ;13;5;1294;1853;1186;-1;0;;;
101; GPU ; DS ;13;5;2778;4083;2528;-1;0;;;
101; GPU ; DS ;13;5;2778;4083;2528;-1;0;;;
101; GPU ; DS ;13;5;2778;4083;2528;-1;0;;;
101; GPU ; DS ;13;5;2778;4083;2528;-1;0;;;
101; GPU ; DS ;13;5;2778;4083;2528;-1;0;;;
103; GPU ; DS ;14;5;1055;1473;952;-1;0;;;
103; GPU ; DS ;14;5;1055;1473;952;-1;0;;;
103; GPU ; DS ;14;5;1055;1473;952;-1;0;;;
103; GPU ; DS ;14;5;1055;1473;952;-1;0;;;
103; GPU ; DS ;14;5;1055;1473;952;-1;0;;;
105; GPU ; DS ;14;5;1408;2056;1286;-1;0;;;
105; GPU ; DS ;14;5;1408;2056;1286;-1;0;;;
105; GPU ; DS ;14;5;1408;2056;1286;-1;0;;;
105; GPU ; DS ;14;5;1408;2056;1286;-1;0;;;
105; GPU ; DS ;14;5;1408;2056;1286;-1;0;;;
107; GPU ; DS ;15;5;160;240;145;-1;0;;;
107; GPU ; DS ;15;5;160;240;145;-1;0;;;
107; GPU ; DS ;15;5;160;240;145;-1;0;;;
107; GPU ; DS ;15;5;160;240;145;-1;0;;;
107; GPU ; DS ;15;5;160;240;145;-1;0;;;
109; GPU ; DS ;15;5;257;515;220;-1;0;;;
109; GPU ; DS ;15;5;257;515;220;-1;0;;;
109; GPU ; DS ;15;5;257;515;220;-1;0;;;
109; GPU ; DS ;15;5;257;515;220;-1;0;;;
109; GPU ; DS ;15;5;257;515;220;-1;0;;;
111; GPU ; DS ;15;5;2763;4038;2511;-1;0;;;
111; GPU ; DS ;15;5;2763;4038;2511;-1;0;;;
111; GPU ; DS ;15;5;2763;4038;2511;-1;0;;;
111; GPU ; DS ;15;5;2763;4038;2511;-1;0;;;
111; GPU ; DS ;15;5;2763;4038;2511;-1;0;;;
113; GPU ; DS ;16;5;80;160;64;-1;0;;;
113; GPU ; DS ;16;5;80;160;64;-1;0;;;
113; GPU ; DS ;16;5;80;160;64;-1;0;;;
113; GPU ; DS ;16;5;80;160;64;-1;0;;;
113; GPU ; DS ;16;5;80;160;64;-1;0;;;
115; GPU ; DS ;16;5;243;497;200;-1;0;;;
115; GPU ; DS ;16;5;243;497;200;-1;0;;;
115; GPU ; DS ;16;5;243;497;200;-1;0;;;
115; GPU ; DS ;16;5;243;497;200;-1;0;;;
115; GPU ; DS ;16;5;243;497;200;-1;0;;;
117; GPU ; DS ;16;5;398;788;337;-1;0;;;
117; GPU ; DS ;16;5;398;788;337;-1;0;;;
117; GPU ; DS ;16;5;398;788;337;-1;0;;;
117; GPU ; DS ;16;5;398;788;337;-1;0;;;
117; GPU ; DS ;16;5;398;788;337;-1;0;;;
119; GPU ; DS ;16;5;678;1030;152;-1;0;;;
119; GPU ; DS ;16;5;678;1030;152;-1;0;;;
119; GPU ; DS ;16;5;678;1030;152;-1;0;;;
119; GPU ; DS ;16;5;678;1030;152;-1;0;;;
119; GPU ; DS ;16;5;678;1030;152;-1;0;;;
121; GPU ; DS ;16;5;1005;1731;846;-1;0;;;
121; GPU ; DS ;16;5;1005;1731;846;-1;0;;;
121; GPU ; DS ;16;5;1005;1731;846;-1;0;;;
121; GPU ; DS ;16;5;1005;1731;846;-1;0;;;
121; GPU ; DS ;16;5;1005;1731;846;-1;0;;;
123; GPU ; DS ;16;5;2762;4047;2516;-1;0;;;
123; GPU ; DS ;16;5;2762;4047;2516;-1;0;;;
123; GPU ; DS ;16;5;2762;4047;2516;-1;0;;;
123; GPU ; DS ;16;5;2762;4047;2516;-1;0;;;
123; GPU ; DS ;16;5;2762;4047;2516;-1;0;;;
125; GPU ; DS ;17;5;160;240;50;-1;0;;;
125; GPU ; DS ;17;5;160;240;50;-1;0;;;
125; GPU ; DS ;17;5;160;240;50;-1;0;;;
125; GPU ; DS ;17;5;160;240;50;-1;0;;;
125; GPU ; DS ;17;5;160;240;50;-1;0;;;
127; GPU ; DS ;17;5;294;568;65;-1;0;;;
127; GPU ; DS ;17;5;294;568;65;-1;0;;;
127; GPU ; DS ;17;5;294;568;65;-1;0;;;
127; GPU ; DS ;17;5;294;568;65;-1;0;;;
127; GPU ; DS ;17;5;294;568;65;-1;0;;;
129; GPU ; DS ;17;5;323;592;266;-1;0;;;
129; GPU ; DS ;17;5;323;592;266;-1;0;;;
129; GPU ; DS ;17;5;323;592;266;-1;0;;;
129; GPU ; DS ;17;5;323;592;266;-1;0;;;
129; GPU ; DS ;17;5;323;592;266;-1;0;;;
131; GPU ; DS ;17;5;499;861;418;-1;0;;;
131; GPU ; DS ;17;5;499;861;418;-1;0;;;
131; GPU ; DS ;17;5;499;861;418;-1;0;;;
131; GPU ; DS ;17;5;499;861;418;-1;0;;;
131; GPU ; DS ;17;5;499;861;418;-1;0;;;
133; GPU ; DS ;17;5;766;1535;649;-1;0;;;
133; GPU ; DS ;17;5;766;1535;649;-1;0;;;
133; GPU ; DS ;17;5;766;1535;649;-1;0;;;
133; GPU ; DS ;17;5;766;1535;649;-1;0;;;
133; GPU ; DS ;17;5;766;1535;649;-1;0;;;
135; GPU ; DS ;17;5;2532;3615;516;-1;0;;;
135; GPU ; DS ;17;5;2532;3615;516;-1;0;;;
135; GPU ; DS ;17;5;2532;3615;516;-1;0;;;
135; GPU ; DS ;17;5;2532;3615;516;-1;0;;;
135; GPU ; DS ;17;5;2532;3615;516;-1;0;;;
137; GPU ; DS ;17;5;2676;3894;2444;-1;0;;;
137; GPU ; DS ;17;5;2676;3894;2444;-1;0;;;
137; GPU ; DS ;17;5;2676;3894;2444;-1;0;;;
137; GPU ; DS ;17;5;2676;3894;2444;-1;0;;;
137; GPU ; DS ;17;5;2676;3894;2444;-1;0;;;
139; GPU ; DS ;17;5;2984;4484;617;-1;0;;;
139; GPU ; DS ;17;5;2984;4484;617;-1;0;;;
139; GPU ; DS ;17;5;2984;4484;617;-1;0;;;
139; GPU ; DS ;17;5;2984;4484;617;-1;0;;;
139; GPU ; DS ;17;5;2984;4484;617;-1;0;;;
141; GPU ; DS ;18;5;294;618;246;-1;0;;;
141; GPU ; DS ;18;5;294;618;246;-1;0;;;
141; GPU ; DS ;18;5;294;618;246;-1;0;;;
141; GPU ; DS ;18;5;294;618;246;-1;0;;;
141; GPU ; DS ;18;5;294;618;246;-1;0;;;
143; GPU ; DS ;18;5;388;815;313;-1;0;;;
143; GPU ; DS ;18;5;388;815;313;-1;0;;;
143; GPU ; DS ;18;5;388;815;313;-1;0;;;
143; GPU ; DS ;18;5;388;815;313;-1;0;;;
143; GPU ; DS ;18;5;388;815;313;-1;0;;;
145; GPU ; DS ;18;5;437;838;368;-1;0;;;
145; GPU ; DS ;18;5;437;838;368;-1;0;;;
145; GPU ; DS ;18;5;437;838;368;-1;0;;;
145; GPU ; DS ;18;5;437;838;368;-1;0;;;
145; GPU ; DS ;18;5;437;838;368;-1;0;;;
147; GPU ; DS ;18;5;564;1112;469;-1;0;;;
147; GPU ; DS ;18;5;564;1112;469;-1;0;;;
147; GPU ; DS ;18;5;564;1112;469;-1;0;;;
147; GPU ; DS ;18;5;564;1112;469;-1;0;;;
147; GPU ; DS ;18;5;564;1112;469;-1;0;;;
149; GPU ; DS ;18;5;615;1232;519;-1;0;;;
149; GPU ; DS ;18;5;615;1232;519;-1;0;;;
149; GPU ; DS ;18;5;615;1232;519;-1;0;;;
149; GPU ; DS ;18;5;615;1232;519;-1;0;;;
149; GPU ; DS ;18;5;615;1232;519;-1;0;;;
151; GPU ; DS ;19;5;314;650;63;-1;0;;;
151; GPU ; DS ;19;5;314;650;63;-1;0;;;
151; GPU ; DS ;19;5;314;650;63;-1;0;;;
151; GPU ; DS ;19;5;314;650;63;-1;0;;;
151; GPU ; DS ;19;5;314;650;63;-1;0;;;
153; GPU ; DS ;19;5;670;1316;538;-1;0;;;
153; GPU ; DS ;19;5;670;1316;538;-1;0;;;
153; GPU ; DS ;19;5;670;1316;538;-1;0;;;
153; GPU ; DS ;19;5;670;1316;538;-1;0;;;
153; GPU ; DS ;19;5;670;1316;538;-1;0;;;
155; GPU ; DS ;19;5;770;1383;634;-1;0;;;
155; GPU ; DS ;19;5;770;1383;634;-1;0;;;
155; GPU ; DS ;19;5;770;1383;634;-1;0;;;
155; GPU ; DS ;19;5;770;1383;634;-1;0;;;
155; GPU ; DS ;19;5;770;1383;634;-1;0;;;
157; GPU ; DS ;19;5;938;1869;765;-1;0;;;
157; GPU ; DS ;19;5;938;1869;765;-1;0;;;
157; GPU ; DS ;19;5;938;1869;765;-1;0;;;
157; GPU ; DS ;19;5;938;1869;765;-1;0;;;
157; GPU ; DS ;19;5;938;1869;765;-1;0;;;
159; GPU ; DS ;19;5;2865;4267;2605;-1;0;;;
159; GPU ; DS ;19;5;2865;4267;2605;-1;0;;;
159; GPU ; DS ;19;5;2865;4267;2605;-1;0;;;
159; GPU ; DS ;19;5;2865;4267;2605;-1;0;;;
159; GPU ; DS ;19;5;2865;4267;2605;-1;0;;;
161; GPU ; DS ;23;5;2502;6244;2383;-1;0;;;
161; GPU ; DS ;23;5;2502;6244;2383;-1;0;;;
161; GPU ; DS ;23;5;2502;6244;2383;-1;0;;;
161; GPU ; DS ;23;5;2502;6244;2383;-1;0;;;
161; GPU ; DS ;23;5;2502;6244;2383;-1;0;;;
163; GPU ; DS ;20;5;402;780;326;-1;0;;;
163; GPU ; DS ;20;5;402;780;326;-1;0;;;
163; GPU ; DS ;20;5;402;780;326;-1;0;;;
163; GPU ; DS ;20;5;402;780;326;-1;0;;;
163; GPU ; DS ;20;5;402;780;326;-1;0;;;
165; GPU ; DS ;20;5;422;808;351;-1;0;;;
165; GPU ; DS ;20;5;422;808;351;-1;0;;;
165; GPU ; DS ;20;5;422;808;351;-1;0;;;
165; GPU ; DS ;20;5;422;808;351;-1;0,016;;;
165; GPU ; DS ;20;5;422;808;351;-1;0;;;
167; GPU ; DS ;20;5;632;1087;539;-1;0;;;
167; GPU ; DS ;20;5;632;1087;539;-1;0;;;
167; GPU ; DS ;20;5;632;1087;539;-1;0;;;
167; GPU ; DS ;20;5;632;1087;539;-1;0;;;
167; GPU ; DS ;20;5;632;1087;539;-1;0;;;
169; GPU ; DS ;20;5;720;1269;610;-1;0;;;
169; GPU ; DS ;20;5;720;1269;610;-1;0;;;
169; GPU ; DS ;20;5;720;1269;610;-1;0;;;
169; GPU ; DS ;20;5;720;1269;610;-1;0;;;
169; GPU ; DS ;20;5;720;1269;610;-1;0;;;
171; GPU ; DS ;20;5;802;1553;671;-1;0;;;
171; GPU ; DS ;20;5;802;1553;671;-1;0;;;
171; GPU ; DS ;20;5;802;1553;671;-1;0;;;
171; GPU ; DS ;20;5;802;1553;671;-1;0;;;
171; GPU ; DS ;20;5;802;1553;671;-1;0;;;
173; GPU ; DS ;20;5;788;1938;745;-1;0;;;
173; GPU ; DS ;20;5;788;1938;745;-1;0;;;
173; GPU ; DS ;20;5;788;1938;745;-1;0;;;
173; GPU ; DS ;20;5;788;1938;745;-1;0;;;
173; GPU ; DS ;20;5;788;1938;745;-1;0;;;
175; GPU ; DS ;20;5;2397;3715;2122;-1;0;;;
175; GPU ; DS ;20;5;2397;3715;2122;-1;0;;;
175; GPU ; DS ;20;5;2397;3715;2122;-1;0;;;
175; GPU ; DS ;20;5;2397;3715;2122;-1;0;;;
175; GPU ; DS ;20;5;2397;3715;2122;-1;0;;;
177; GPU ; DS ;21;5;904;1806;745;-1;0;;;
177; GPU ; DS ;21;5;904;1806;745;-1;0;;;
177; GPU ; DS ;21;5;904;1806;745;-1;0;;;
177; GPU ; DS ;21;5;904;1806;745;-1;0;;;
177; GPU ; DS ;21;5;904;1806;745;-1;0;;;
179; GPU ; DS ;22;5;752;1264;643;-1;0;;;
179; GPU ; DS ;22;5;752;1264;643;-1;0;;;
179; GPU ; DS ;22;5;752;1264;643;-1;0;;;
179; GPU ; DS ;22;5;752;1264;643;-1;0;;;
179; GPU ; DS ;22;5;752;1264;643;-1;0;;;
181; GPU ; DS ;22;5;757;1493;140;-1;0;;;
181; GPU ; DS ;22;5;757;1493;140;-1;0;;;
181; GPU ; DS ;22;5;757;1493;140;-1;0;;;
181; GPU ; DS ;22;5;757;1493;140;-1;0;;;
181; GPU ; DS ;22;5;757;1493;140;-1;0;;;
183; GPU ; DS ;22;5;838;1763;628;-1;0;;;
183; GPU ; DS ;22;5;838;1763;628;-1;0;;;
183; GPU ; DS ;22;5;838;1763;628;-1;0;;;
183; GPU ; DS ;22;5;838;1763;628;-1;0;;;
183; GPU ; DS ;22;5;838;1763;628;-1;0;;;
185; GPU ; DS ;22;5;2834;4207;447;-1;0;;;
185; GPU ; DS ;22;5;2834;4207;447;-1;0;;;
185; GPU ; DS ;22;5;2834;4207;447;-1;0;;;
185; GPU ; DS ;22;5;2834;4207;447;-1;0;;;
185; GPU ; DS ;22;5;2834;4207;447;-1;0;;;
187; GPU ; DS ;23;5;529;1032;437;-1;0;;;
187; GPU ; DS ;23;5;529;1032;437;-1;0;;;
187; GPU ; DS ;23;5;529;1032;437;-1;0;;;
187; GPU ; DS ;23;5;529;1032;437;-1;0;;;
187; GPU ; DS ;23;5;529;1032;437;-1;0;;;
189; GPU ; DS ;24;5;467;896;393;-1;0;;;
189; GPU ; DS ;24;5;467;896;393;-1;0;;;
189; GPU ; DS ;24;5;467;896;393;-1;0;;;
189; GPU ; DS ;24;5;467;896;393;-1;0;;;
189; GPU ; DS ;24;5;467;896;393;-1;0;;;
191; GPU ; DS ;25;5;5096;8105;711;-1;0;;;
191; GPU ; DS ;25;5;5096;8105;711;-1;0;;;
191; GPU ; DS ;25;5;5096;8105;711;-1;0;;;
191; GPU ; DS ;25;5;5096;8105;711;-1;0;;;
191; GPU ; DS ;25;5;5096;8105;711;-1;0;;;
193; GPU ; DS ;26;5;1848;3286;1528;-1;0;;;
193; GPU ; DS ;26;5;1848;3286;1528;-1;0;;;
193; GPU ; DS ;26;5;1848;3286;1528;-1;0;;;
193; GPU ; DS ;26;5;1848;3286;1528;-1;0;;;
193; GPU ; DS ;26;5;1848;3286;1528;-1;0;;;
195; GPU ; DS ;27;5;1724;2975;1455;-1;0;;;
195; GPU ; DS ;27;5;1724;2975;1455;-1;0;;;
195; GPU ; DS ;27;5;1724;2975;1455;-1;0;;;
195; GPU ; DS ;27;5;1724;2975;1455;-1;0;;;
195; GPU ; DS ;27;5;1724;2975;1455;-1;0;;;
197; GPU ; DS ;28;5;6128;15264;5894;-1;0;;;
197; GPU ; DS ;28;5;6128;15264;5894;-1;0;;;
197; GPU ; DS ;28;5;6128;15264;5894;-1;0;;;
197; GPU ; DS ;28;5;6128;15264;5894;-1;0;;;
197; GPU ; DS ;28;5;6128;15264;5894;-1;0;;;
199; GPU ; DS ;36;5;1011;2010;796;-1;0;;;
199; GPU ; DS ;36;5;1011;2010;796;-1;0;;;
199; GPU ; DS ;36;5;1011;2010;796;-1;0;;;
199; GPU ; DS ;36;5;1011;2010;796;-1;0;;;
199; GPU ; DS ;36;5;1011;2010;796;-1;0;;;
