graph ; GPU ; MIS ; width ; # runs ; # nodes ; # edges ; # bags ; results ;time;
1; GPU ; MIS ;5;5;74;146;73;35;2,79; 
1; GPU ; MIS ;5;5;74;146;73;35;0,047; 
1; GPU ; MIS ;5;5;74;146;73;35;0,047; 
1; GPU ; MIS ;5;5;74;146;73;35;0,047; 
1; GPU ; MIS ;5;5;74;146;73;35;0,047; 
3; GPU ; MIS ;5;5;87;176;95;43;0,062; 
3; GPU ; MIS ;5;5;87;176;95;43;0,063; 
3; GPU ; MIS ;5;5;87;176;95;43;0,062; 
3; GPU ; MIS ;5;5;87;176;95;43;0,063; 
3; GPU ; MIS ;5;5;87;176;95;43;0,062; 
5; GPU ; MIS ;5;5;201;253;194;107;0,094; 
5; GPU ; MIS ;5;5;201;253;194;107;0,094; 
5; GPU ; MIS ;5;5;201;253;194;107;0,093; 
5; GPU ; MIS ;5;5;201;253;194;107;0,094; 
5; GPU ; MIS ;5;5;201;253;194;107;0,094; 
7; GPU ; MIS ;5;5;216;288;225;109;0,11; 
7; GPU ; MIS ;5;5;216;288;225;109;0,125; 
7; GPU ; MIS ;5;5;216;288;225;109;0,109; 
7; GPU ; MIS ;5;5;216;288;225;109;0,125; 
7; GPU ; MIS ;5;5;216;288;225;109;0,109; 
9; GPU ; MIS ;5;5;229;312;224;113;0,109; 
9; GPU ; MIS ;5;5;229;312;224;113;0,125; 
9; GPU ; MIS ;5;5;229;312;224;113;0,125; 
9; GPU ; MIS ;5;5;229;312;224;113;0,11; 
9; GPU ; MIS ;5;5;229;312;224;113;0,109; 
11; GPU ; MIS ;5;5;244;337;231;121;0,125; 
11; GPU ; MIS ;5;5;244;337;231;121;0,109; 
11; GPU ; MIS ;5;5;244;337;231;121;0,109; 
11; GPU ; MIS ;5;5;244;337;231;121;0,125; 
11; GPU ; MIS ;5;5;244;337;231;121;0,125; 
13; GPU ; MIS ;5;5;1906;2083;1896;976;0,766; 
13; GPU ; MIS ;5;5;1906;2083;1896;976;0,796; 
13; GPU ; MIS ;5;5;1906;2083;1896;976;0,797; 
13; GPU ; MIS ;5;5;1906;2083;1896;976;0,766; 
13; GPU ; MIS ;5;5;1906;2083;1896;976;0,765; 
15; GPU ; MIS ;6;5;114;228;117;52;0,094; 
15; GPU ; MIS ;6;5;114;228;117;52;0,078; 
15; GPU ; MIS ;6;5;114;228;117;52;0,078; 
15; GPU ; MIS ;6;5;114;228;117;52;0,078; 
15; GPU ; MIS ;6;5;114;228;117;52;0,094; 
17; GPU ; MIS ;6;5;210;276;203;105;0,109; 
17; GPU ; MIS ;6;5;210;276;203;105;0,094; 
17; GPU ; MIS ;6;5;210;276;203;105;0,109; 
17; GPU ; MIS ;6;5;210;276;203;105;0,109; 
17; GPU ; MIS ;6;5;210;276;203;105;0,094; 
19; GPU ; MIS ;6;5;231;319;224;115;0,124; 
19; GPU ; MIS ;6;5;231;319;224;115;0,11; 
19; GPU ; MIS ;6;5;231;319;224;115;0,125; 
19; GPU ; MIS ;6;5;231;319;224;115;0,109; 
19; GPU ; MIS ;6;5;231;319;224;115;0,125; 
21; GPU ; MIS ;6;5;247;486;249;112;0,171; 
21; GPU ; MIS ;6;5;247;486;249;112;0,172; 
21; GPU ; MIS ;6;5;247;486;249;112;0,156; 
21; GPU ; MIS ;6;5;247;486;249;112;0,203; 
21; GPU ; MIS ;6;5;247;486;249;112;0,156; 
23; GPU ; MIS ;6;5;990;1258;964;496;0,469; 
23; GPU ; MIS ;6;5;990;1258;964;496;0,484; 
23; GPU ; MIS ;6;5;990;1258;964;496;0,5; 
23; GPU ; MIS ;6;5;990;1258;964;496;0,469; 
23; GPU ; MIS ;6;5;990;1258;964;496;0,484; 
25; GPU ; MIS ;6;5;8790;9815;8761;4543;4,208; 
25; GPU ; MIS ;6;5;8790;9815;8761;4543;4,093; 
25; GPU ; MIS ;6;5;8790;9815;8761;4543;4,078; 
25; GPU ; MIS ;6;5;8790;9815;8761;4543;3,968; 
25; GPU ; MIS ;6;5;8790;9815;8761;4543;4,125; 
27; GPU ; MIS ;7;5;15;35;11;8;0,016; 
27; GPU ; MIS ;7;5;15;35;11;8;0,016; 
27; GPU ; MIS ;7;5;15;35;11;8;0,015; 
27; GPU ; MIS ;7;5;15;35;11;8;0,016; 
27; GPU ; MIS ;7;5;15;35;11;8;0,016; 
29; GPU ; MIS ;7;5;197;250;183;100;0,094; 
29; GPU ; MIS ;7;5;197;250;183;100;0,125; 
29; GPU ; MIS ;7;5;197;250;183;100;0,094; 
29; GPU ; MIS ;7;5;197;250;183;100;0,109; 
29; GPU ; MIS ;7;5;197;250;183;100;0,094; 
31; GPU ; MIS ;7;5;269;399;243;130;0,14; 
31; GPU ; MIS ;7;5;269;399;243;130;0,125; 
31; GPU ; MIS ;7;5;269;399;243;130;0,125; 
31; GPU ; MIS ;7;5;269;399;243;130;0,14; 
31; GPU ; MIS ;7;5;269;399;243;130;0,141; 
33; GPU ; MIS ;7;5;480;670;436;232;0,25; 
33; GPU ; MIS ;7;5;480;670;436;232;0,235; 
33; GPU ; MIS ;7;5;480;670;436;232;0,25; 
33; GPU ; MIS ;7;5;480;670;436;232;0,265; 
33; GPU ; MIS ;7;5;480;670;436;232;0,234; 
35; GPU ; MIS ;7;5;543;727;528;264;0,266; 
35; GPU ; MIS ;7;5;543;727;528;264;0,281; 
35; GPU ; MIS ;7;5;543;727;528;264;0,282; 
35; GPU ; MIS ;7;5;543;727;528;264;0,281; 
35; GPU ; MIS ;7;5;543;727;528;264;0,265; 
37; GPU ; MIS ;7;5;1172;1627;1053;564;0,609; 
37; GPU ; MIS ;7;5;1172;1627;1053;564;0,609; 
37; GPU ; MIS ;7;5;1172;1627;1053;564;0,61; 
37; GPU ; MIS ;7;5;1172;1627;1053;564;0,609; 
37; GPU ; MIS ;7;5;1172;1627;1053;564;0,625; 
39; GPU ; MIS ;7;5;1912;2223;1891;1016;0,906; 
39; GPU ; MIS ;7;5;1912;2223;1891;1016;0,953; 
39; GPU ; MIS ;7;5;1912;2223;1891;1016;0,937; 
39; GPU ; MIS ;7;5;1912;2223;1891;1016;0,907; 
39; GPU ; MIS ;7;5;1912;2223;1891;1016;0,922; 
41; GPU ; MIS ;7;5;2382;2674;2378;1212;1,031; 
41; GPU ; MIS ;7;5;2382;2674;2378;1212;1; 
41; GPU ; MIS ;7;5;2382;2674;2378;1212;1,016; 
41; GPU ; MIS ;7;5;2382;2674;2378;1212;1,031; 
41; GPU ; MIS ;7;5;2382;2674;2378;1212;1,016; 
43; GPU ; MIS ;8;5;246;468;164;113;0,109; 
43; GPU ; MIS ;8;5;246;468;164;113;0,125; 
43; GPU ; MIS ;8;5;246;468;164;113;0,109; 
43; GPU ; MIS ;8;5;246;468;164;113;0,141; 
43; GPU ; MIS ;8;5;246;468;164;113;0,156; 
45; GPU ; MIS ;8;5;389;562;342;186;0,172; 
45; GPU ; MIS ;8;5;389;562;342;186;0,171; 
45; GPU ; MIS ;8;5;389;562;342;186;0,188; 
45; GPU ; MIS ;8;5;389;562;342;186;0,172; 
45; GPU ; MIS ;8;5;389;562;342;186;0,187; 
47; GPU ; MIS ;8;5;585;799;548;284;0,312; 
47; GPU ; MIS ;8;5;585;799;548;284;0,328; 
47; GPU ; MIS ;8;5;585;799;548;284;0,328; 
47; GPU ; MIS ;8;5;585;799;548;284;0,313; 
47; GPU ; MIS ;8;5;585;799;548;284;0,359; 
49; GPU ; MIS ;8;5;623;876;534;306;0,329; 
49; GPU ; MIS ;8;5;623;876;534;306;0,312; 
49; GPU ; MIS ;8;5;623;876;534;306;0,297; 
49; GPU ; MIS ;8;5;623;876;534;306;0,312; 
49; GPU ; MIS ;8;5;623;876;534;306;0,328; 
51; GPU ; MIS ;8;5;1416;1978;1283;682;0,703; 
51; GPU ; MIS ;8;5;1416;1978;1283;682;0,719; 
51; GPU ; MIS ;8;5;1416;1978;1283;682;0,781; 
51; GPU ; MIS ;8;5;1416;1978;1283;682;0,688; 
51; GPU ; MIS ;8;5;1416;1978;1283;682;0,687; 
53; GPU ; MIS ;9;5;181;289;138;83;0,078; 
53; GPU ; MIS ;9;5;181;289;138;83;0,078; 
53; GPU ; MIS ;9;5;181;289;138;83;0,078; 
53; GPU ; MIS ;9;5;181;289;138;83;0,109; 
53; GPU ; MIS ;9;5;181;289;138;83;0,094; 
55; GPU ; MIS ;9;5;233;431;155;107;0,141; 
55; GPU ; MIS ;9;5;233;431;155;107;0,109; 
55; GPU ; MIS ;9;5;233;431;155;107;0,11; 
55; GPU ; MIS ;9;5;233;431;155;107;0,11; 
55; GPU ; MIS ;9;5;233;431;155;107;0,125; 
57; GPU ; MIS ;9;5;245;454;149;112;0,109; 
57; GPU ; MIS ;9;5;245;454;149;112;0,11; 
57; GPU ; MIS ;9;5;245;454;149;112;0,125; 
57; GPU ; MIS ;9;5;245;454;149;112;0,109; 
57; GPU ; MIS ;9;5;245;454;149;112;0,109; 
59; GPU ; MIS ;9;5;560;870;427;258;0,266; 
59; GPU ; MIS ;9;5;560;870;427;258;0,265; 
59; GPU ; MIS ;9;5;560;870;427;258;0,266; 
59; GPU ; MIS ;9;5;560;870;427;258;0,25; 
59; GPU ; MIS ;9;5;560;870;427;258;0,25; 
61; GPU ; MIS ;9;5;528;1017;446;235;0,391; 
61; GPU ; MIS ;9;5;528;1017;446;235;0,406; 
61; GPU ; MIS ;9;5;528;1017;446;235;0,39; 
61; GPU ; MIS ;9;5;528;1017;446;235;0,407; 
61; GPU ; MIS ;9;5;528;1017;446;235;0,39; 
63; GPU ; MIS ;9;5;1214;1700;1071;593;0,625; 
63; GPU ; MIS ;9;5;1214;1700;1071;593;0,671; 
63; GPU ; MIS ;9;5;1214;1700;1071;593;0,641; 
63; GPU ; MIS ;9;5;1214;1700;1071;593;0,594; 
63; GPU ; MIS ;9;5;1214;1700;1071;593;0,672; 
65; GPU ; MIS ;9;5;2856;3641;2653;1419;1,406; 
65; GPU ; MIS ;9;5;2856;3641;2653;1419;1,407; 
65; GPU ; MIS ;9;5;2856;3641;2653;1419;1,422; 
65; GPU ; MIS ;9;5;2856;3641;2653;1419;1,406; 
65; GPU ; MIS ;9;5;2856;3641;2653;1419;1,422; 
67; GPU ; MIS ;10;5;200;370;190;100;0,171; 
67; GPU ; MIS ;10;5;200;370;190;100;0,172; 
67; GPU ; MIS ;10;5;200;370;190;100;0,172; 
67; GPU ; MIS ;10;5;200;370;190;100;0,17; 
67; GPU ; MIS ;10;5;200;370;190;100;0,188; 
69; GPU ; MIS ;10;5;200;370;190;100;0,203; 
69; GPU ; MIS ;10;5;200;370;190;100;0,172; 
69; GPU ; MIS ;10;5;200;370;190;100;0,172; 
69; GPU ; MIS ;10;5;200;370;190;100;0,172; 
69; GPU ; MIS ;10;5;200;370;190;100;0,156; 
71; GPU ; MIS ;10;5;339;522;269;159;0,156; 
71; GPU ; MIS ;10;5;339;522;269;159;0,156; 
71; GPU ; MIS ;10;5;339;522;269;159;0,156; 
71; GPU ; MIS ;10;5;339;522;269;159;0,156; 
71; GPU ; MIS ;10;5;339;522;269;159;0,157; 
73; GPU ; MIS ;10;5;262;740;235;169;0,328; 
73; GPU ; MIS ;10;5;262;740;235;169;0,391; 
73; GPU ; MIS ;10;5;262;740;235;169;0,375; 
73; GPU ; MIS ;10;5;262;740;235;169;0,343; 
73; GPU ; MIS ;10;5;262;740;235;169;0,344; 
75; GPU ; MIS ;10;5;557;1080;351;246;0,25; 
75; GPU ; MIS ;10;5;557;1080;351;246;0,234; 
75; GPU ; MIS ;10;5;557;1080;351;246;0,235; 
75; GPU ; MIS ;10;5;557;1080;351;246;0,265; 
75; GPU ; MIS ;10;5;557;1080;351;246;0,219; 
77; GPU ; MIS ;10;5;2413;3412;2214;1243;1,187; 
77; GPU ; MIS ;10;5;2413;3412;2214;1243;1,11; 
77; GPU ; MIS ;10;5;2413;3412;2214;1243;1,187; 
77; GPU ; MIS ;10;5;2413;3412;2214;1243;1,203; 
77; GPU ; MIS ;10;5;2413;3412;2214;1243;1,125; 
79; GPU ; MIS ;10;5;36415;145635;25210;19258;50,762; 
79; GPU ; MIS ;10;5;36415;145635;25210;19258;56,591; 
79; GPU ; MIS ;10;5;36415;145635;25210;19258;51,496; 
79; GPU ; MIS ;10;5;36415;145635;25210;19258;49,2; 
79; GPU ; MIS ;10;5;36415;145635;25210;19258;48,027; 
81; GPU ; MIS ;11;5;237;378;185;108;0,204; 
81; GPU ; MIS ;11;5;237;378;185;108;0,188; 
81; GPU ; MIS ;11;5;237;378;185;108;0,172; 
81; GPU ; MIS ;11;5;237;378;185;108;0,171; 
81; GPU ; MIS ;11;5;237;378;185;108;0,172; 
83; GPU ; MIS ;11;5;311;632;206;136;0,203; 
83; GPU ; MIS ;11;5;311;632;206;136;0,203; 
83; GPU ; MIS ;11;5;311;632;206;136;0,203; 
83; GPU ; MIS ;11;5;311;632;206;136;0,219; 
83; GPU ; MIS ;11;5;311;632;206;136;0,203; 
85; GPU ; MIS ;11;5;1274;1808;1177;603;0,688; 
85; GPU ; MIS ;11;5;1274;1808;1177;603;0,734; 
85; GPU ; MIS ;11;5;1274;1808;1177;603;0,797; 
85; GPU ; MIS ;11;5;1274;1808;1177;603;0,719; 
85; GPU ; MIS ;11;5;1274;1808;1177;603;0,687; 
87; GPU ; MIS ;11;5;1337;1933;1228;639;0,735; 
87; GPU ; MIS ;11;5;1337;1933;1228;639;0,734; 
87; GPU ; MIS ;11;5;1337;1933;1228;639;0,734; 
87; GPU ; MIS ;11;5;1337;1933;1228;639;0,703; 
87; GPU ; MIS ;11;5;1337;1933;1228;639;0,766; 
89; GPU ; MIS ;11;5;5829;7552;5533;2945;3,031; 
89; GPU ; MIS ;11;5;5829;7552;5533;2945;2,938; 
89; GPU ; MIS ;11;5;5829;7552;5533;2945;3,004; 
89; GPU ; MIS ;11;5;5829;7552;5533;2945;2,875; 
89; GPU ; MIS ;11;5;5829;7552;5533;2945;3,078; 
91; GPU ; MIS ;12;5;304;571;284;135;0,25; 
91; GPU ; MIS ;12;5;304;571;284;135;0,235; 
91; GPU ; MIS ;12;5;304;571;284;135;0,234; 
91; GPU ; MIS ;12;5;304;571;284;135;0,234; 
91; GPU ; MIS ;12;5;304;571;284;135;0,219; 
93; GPU ; MIS ;12;5;1001;1419;927;483;0,562; 
93; GPU ; MIS ;12;5;1001;1419;927;483;0,578; 
93; GPU ; MIS ;12;5;1001;1419;927;483;0,531; 
93; GPU ; MIS ;12;5;1001;1419;927;483;0,5; 
93; GPU ; MIS ;12;5;1001;1419;927;483;0,563; 
95; GPU ; MIS ;12;5;1335;1932;1217;636;0,812; 
95; GPU ; MIS ;12;5;1335;1932;1217;636;0,734; 
95; GPU ; MIS ;12;5;1335;1932;1217;636;0,735; 
95; GPU ; MIS ;12;5;1335;1932;1217;636;0,75; 
95; GPU ; MIS ;12;5;1335;1932;1217;636;0,765; 
97; GPU ; MIS ;12;5;2629;3793;2413;1254;1,499; 
97; GPU ; MIS ;12;5;2629;3793;2413;1254;1,453; 
97; GPU ; MIS ;12;5;2629;3793;2413;1254;1,454; 
97; GPU ; MIS ;12;5;2629;3793;2413;1254;1,468; 
97; GPU ; MIS ;12;5;2629;3793;2413;1254;1,469; 
99; GPU ; MIS ;13;5;1294;1853;1186;622;0,719; 
99; GPU ; MIS ;13;5;1294;1853;1186;622;0,719; 
99; GPU ; MIS ;13;5;1294;1853;1186;622;0,703; 
99; GPU ; MIS ;13;5;1294;1853;1186;622;0,718; 
99; GPU ; MIS ;13;5;1294;1853;1186;622;0,719; 
101; GPU ; MIS ;13;5;2778;4083;2528;1312;1,594; 
101; GPU ; MIS ;13;5;2778;4083;2528;1312;1,64; 
101; GPU ; MIS ;13;5;2778;4083;2528;1312;1,562; 
101; GPU ; MIS ;13;5;2778;4083;2528;1312;1,594; 
101; GPU ; MIS ;13;5;2778;4083;2528;1312;1,578; 
103; GPU ; MIS ;14;5;1055;1473;952;508;0,609; 
103; GPU ; MIS ;14;5;1055;1473;952;508;0,609; 
103; GPU ; MIS ;14;5;1055;1473;952;508;0,641; 
103; GPU ; MIS ;14;5;1055;1473;952;508;0,625; 
103; GPU ; MIS ;14;5;1055;1473;952;508;0,594; 
105; GPU ; MIS ;14;5;1408;2056;1286;680;0,89; 
105; GPU ; MIS ;14;5;1408;2056;1286;680;0,828; 
105; GPU ; MIS ;14;5;1408;2056;1286;680;0,797; 
105; GPU ; MIS ;14;5;1408;2056;1286;680;0,828; 
105; GPU ; MIS ;14;5;1408;2056;1286;680;0,812; 
107; GPU ; MIS ;15;5;160;240;145;85;0,125; 
107; GPU ; MIS ;15;5;160;240;145;85;0,125; 
107; GPU ; MIS ;15;5;160;240;145;85;0,125; 
107; GPU ; MIS ;15;5;160;240;145;85;0,125; 
107; GPU ; MIS ;15;5;160;240;145;85;0,125; 
109; GPU ; MIS ;15;5;257;515;220;113;0,187; 
109; GPU ; MIS ;15;5;257;515;220;113;0,188; 
109; GPU ; MIS ;15;5;257;515;220;113;0,203; 
109; GPU ; MIS ;15;5;257;515;220;113;0,187; 
109; GPU ; MIS ;15;5;257;515;220;113;0,203; 
111; GPU ; MIS ;15;5;2763;4038;2511;1312;1,672; 
111; GPU ; MIS ;15;5;2763;4038;2511;1312;1,609; 
111; GPU ; MIS ;15;5;2763;4038;2511;1312;1,64; 
111; GPU ; MIS ;15;5;2763;4038;2511;1312;1,625; 
111; GPU ; MIS ;15;5;2763;4038;2511;1312;1,609; 
113; GPU ; MIS ;16;5;80;160;64;36;0,093; 
113; GPU ; MIS ;16;5;80;160;64;36;0,094; 
113; GPU ; MIS ;16;5;80;160;64;36;0,094; 
113; GPU ; MIS ;16;5;80;160;64;36;0,109; 
113; GPU ; MIS ;16;5;80;160;64;36;0,094; 
115; GPU ; MIS ;16;5;243;497;200;105;0,219; 
115; GPU ; MIS ;16;5;243;497;200;105;0,203; 
115; GPU ; MIS ;16;5;243;497;200;105;0,203; 
115; GPU ; MIS ;16;5;243;497;200;105;0,203; 
115; GPU ; MIS ;16;5;243;497;200;105;0,219; 
117; GPU ; MIS ;16;5;398;788;337;173;0,312; 
117; GPU ; MIS ;16;5;398;788;337;173;0,282; 
117; GPU ; MIS ;16;5;398;788;337;173;0,297; 
117; GPU ; MIS ;16;5;398;788;337;173;0,281; 
117; GPU ; MIS ;16;5;398;788;337;173;0,297; 
119; GPU ; MIS ;16;5;678;1030;152;314;0,375; 
119; GPU ; MIS ;16;5;678;1030;152;314;0,406; 
119; GPU ; MIS ;16;5;678;1030;152;314;0,39; 
119; GPU ; MIS ;16;5;678;1030;152;314;0,375; 
119; GPU ; MIS ;16;5;678;1030;152;314;0,375; 
121; GPU ; MIS ;16;5;1005;1731;846;503;0,781; 
121; GPU ; MIS ;16;5;1005;1731;846;503;0,797; 
121; GPU ; MIS ;16;5;1005;1731;846;503;0,797; 
121; GPU ; MIS ;16;5;1005;1731;846;503;0,797; 
121; GPU ; MIS ;16;5;1005;1731;846;503;0,781; 
123; GPU ; MIS ;16;5;2762;4047;2516;1291;1,64; 
123; GPU ; MIS ;16;5;2762;4047;2516;1291;1,688; 
123; GPU ; MIS ;16;5;2762;4047;2516;1291;1,656; 
123; GPU ; MIS ;16;5;2762;4047;2516;1291;1,593; 
123; GPU ; MIS ;16;5;2762;4047;2516;1291;1,609; 
125; GPU ; MIS ;17;5;160;240;50;84;0,125; 
125; GPU ; MIS ;17;5;160;240;50;84;0,125; 
125; GPU ; MIS ;17;5;160;240;50;84;0,125; 
125; GPU ; MIS ;17;5;160;240;50;84;0,125; 
125; GPU ; MIS ;17;5;160;240;50;84;0,14; 
127; GPU ; MIS ;17;5;294;568;65;131;0,235; 
127; GPU ; MIS ;17;5;294;568;65;131;0,235; 
127; GPU ; MIS ;17;5;294;568;65;131;0,234; 
127; GPU ; MIS ;17;5;294;568;65;131;0,234; 
127; GPU ; MIS ;17;5;294;568;65;131;0,25; 
129; GPU ; MIS ;17;5;323;592;266;153;0,25; 
129; GPU ; MIS ;17;5;323;592;266;153;0,25; 
129; GPU ; MIS ;17;5;323;592;266;153;0,25; 
129; GPU ; MIS ;17;5;323;592;266;153;0,266; 
129; GPU ; MIS ;17;5;323;592;266;153;0,25; 
131; GPU ; MIS ;17;5;499;861;418;250;0,407; 
131; GPU ; MIS ;17;5;499;861;418;250;0,374; 
131; GPU ; MIS ;17;5;499;861;418;250;0,391; 
131; GPU ; MIS ;17;5;499;861;418;250;0,391; 
131; GPU ; MIS ;17;5;499;861;418;250;0,453; 
133; GPU ; MIS ;17;5;766;1535;649;329;0,593; 
133; GPU ; MIS ;17;5;766;1535;649;329;0,594; 
133; GPU ; MIS ;17;5;766;1535;649;329;0,594; 
133; GPU ; MIS ;17;5;766;1535;649;329;0,593; 
133; GPU ; MIS ;17;5;766;1535;649;329;0,594; 
135; GPU ; MIS ;17;5;2532;3615;516;1204;1,297; 
135; GPU ; MIS ;17;5;2532;3615;516;1204;1,296; 
135; GPU ; MIS ;17;5;2532;3615;516;1204;1,313; 
135; GPU ; MIS ;17;5;2532;3615;516;1204;1,297; 
135; GPU ; MIS ;17;5;2532;3615;516;1204;1,296; 
137; GPU ; MIS ;17;5;2676;3894;2444;1268;1,609; 
137; GPU ; MIS ;17;5;2676;3894;2444;1268;1,594; 
137; GPU ; MIS ;17;5;2676;3894;2444;1268;1,578; 
137; GPU ; MIS ;17;5;2676;3894;2444;1268;1,593; 
137; GPU ; MIS ;17;5;2676;3894;2444;1268;1,625; 
139; GPU ; MIS ;17;5;2984;4484;617;1393;1,672; 
139; GPU ; MIS ;17;5;2984;4484;617;1393;1,64; 
139; GPU ; MIS ;17;5;2984;4484;617;1393;1,641; 
139; GPU ; MIS ;17;5;2984;4484;617;1393;1,656; 
139; GPU ; MIS ;17;5;2984;4484;617;1393;1,656; 
141; GPU ; MIS ;18;5;294;618;246;126;0,25; 
141; GPU ; MIS ;18;5;294;618;246;126;0,281; 
141; GPU ; MIS ;18;5;294;618;246;126;0,266; 
141; GPU ; MIS ;18;5;294;618;246;126;0,25; 
141; GPU ; MIS ;18;5;294;618;246;126;0,266; 
143; GPU ; MIS ;18;5;388;815;313;167;0,375; 
143; GPU ; MIS ;18;5;388;815;313;167;0,359; 
143; GPU ; MIS ;18;5;388;815;313;167;0,36; 
143; GPU ; MIS ;18;5;388;815;313;167;0,359; 
143; GPU ; MIS ;18;5;388;815;313;167;0,359; 
145; GPU ; MIS ;18;5;437;838;368;200;0,422; 
145; GPU ; MIS ;18;5;437;838;368;200;0,422; 
145; GPU ; MIS ;18;5;437;838;368;200;0,421; 
145; GPU ; MIS ;18;5;437;838;368;200;0,422; 
145; GPU ; MIS ;18;5;437;838;368;200;0,438; 
147; GPU ; MIS ;18;5;564;1112;469;246;0,469; 
147; GPU ; MIS ;18;5;564;1112;469;246;0,453; 
147; GPU ; MIS ;18;5;564;1112;469;246;0,499; 
147; GPU ; MIS ;18;5;564;1112;469;246;0,469; 
147; GPU ; MIS ;18;5;564;1112;469;246;0,469; 
149; GPU ; MIS ;18;5;615;1232;519;270;0,484; 
149; GPU ; MIS ;18;5;615;1232;519;270;0,485; 
149; GPU ; MIS ;18;5;615;1232;519;270;0,484; 
149; GPU ; MIS ;18;5;615;1232;519;270;0,5; 
149; GPU ; MIS ;18;5;615;1232;519;270;0,5; 
151; GPU ; MIS ;19;5;314;650;63;136;0,328; 
151; GPU ; MIS ;19;5;314;650;63;136;0,313; 
151; GPU ; MIS ;19;5;314;650;63;136;0,344; 
151; GPU ; MIS ;19;5;314;650;63;136;0,312; 
151; GPU ; MIS ;19;5;314;650;63;136;0,328; 
153; GPU ; MIS ;19;5;670;1316;538;309;0,766; 
153; GPU ; MIS ;19;5;670;1316;538;309;0,734; 
153; GPU ; MIS ;19;5;670;1316;538;309;0,734; 
153; GPU ; MIS ;19;5;670;1316;538;309;0,735; 
153; GPU ; MIS ;19;5;670;1316;538;309;0,703; 
155; GPU ; MIS ;19;5;770;1383;634;386;0,703; 
155; GPU ; MIS ;19;5;770;1383;634;386;0,703; 
155; GPU ; MIS ;19;5;770;1383;634;386;0,703; 
155; GPU ; MIS ;19;5;770;1383;634;386;0,703; 
155; GPU ; MIS ;19;5;770;1383;634;386;0,703; 
157; GPU ; MIS ;19;5;938;1869;765;411;0,844; 
157; GPU ; MIS ;19;5;938;1869;765;411;0,828; 
157; GPU ; MIS ;19;5;938;1869;765;411;0,828; 
157; GPU ; MIS ;19;5;938;1869;765;411;0,844; 
157; GPU ; MIS ;19;5;938;1869;765;411;0,843; 
159; GPU ; MIS ;19;5;2865;4267;2605;1348;1,766; 
159; GPU ; MIS ;19;5;2865;4267;2605;1348;1,75; 
159; GPU ; MIS ;19;5;2865;4267;2605;1348;1,781; 
159; GPU ; MIS ;19;5;2865;4267;2605;1348;1,75; 
159; GPU ; MIS ;19;5;2865;4267;2605;1348;1,75; 
161; GPU ; MIS ;23;5;2502;6244;2383;1510;3,578; 
161; GPU ; MIS ;23;5;2502;6244;2383;1510;3,593; 
161; GPU ; MIS ;23;5;2502;6244;2383;1510;3,613; 
161; GPU ; MIS ;23;5;2502;6244;2383;1510;3,625; 
161; GPU ; MIS ;23;5;2502;6244;2383;1510;3,64; 
163; GPU ; MIS ;20;5;402;780;326;187;0,484; 
163; GPU ; MIS ;20;5;402;780;326;187;0,422; 
163; GPU ; MIS ;20;5;402;780;326;187;0,422; 
163; GPU ; MIS ;20;5;402;780;326;187;0,422; 
163; GPU ; MIS ;20;5;402;780;326;187;0,406; 
165; GPU ; MIS ;20;5;422;808;351;192;0,375; 
165; GPU ; MIS ;20;5;422;808;351;192;0,375; 
165; GPU ; MIS ;20;5;422;808;351;192;0,375; 
165; GPU ; MIS ;20;5;422;808;351;192;0,375; 
165; GPU ; MIS ;20;5;422;808;351;192;0,375; 
167; GPU ; MIS ;20;5;632;1087;539;319;0,531; 
167; GPU ; MIS ;20;5;632;1087;539;319;0,485; 
167; GPU ; MIS ;20;5;632;1087;539;319;0,5; 
167; GPU ; MIS ;20;5;632;1087;539;319;0,484; 
167; GPU ; MIS ;20;5;632;1087;539;319;0,5; 
169; GPU ; MIS ;20;5;720;1269;610;360;0,625; 
169; GPU ; MIS ;20;5;720;1269;610;360;0,625; 
169; GPU ; MIS ;20;5;720;1269;610;360;0,61; 
169; GPU ; MIS ;20;5;720;1269;610;360;0,625; 
169; GPU ; MIS ;20;5;720;1269;610;360;0,609; 
171; GPU ; MIS ;20;5;802;1553;671;373;0,625; 
171; GPU ; MIS ;20;5;802;1553;671;373;0,61; 
171; GPU ; MIS ;20;5;802;1553;671;373;0,609; 
171; GPU ; MIS ;20;5;802;1553;671;373;0,672; 
171; GPU ; MIS ;20;5;802;1553;671;373;0,609; 
173; GPU ; MIS ;20;5;788;1938;745;461;1,047; 
173; GPU ; MIS ;20;5;788;1938;745;461;1,047; 
173; GPU ; MIS ;20;5;788;1938;745;461;1,046; 
173; GPU ; MIS ;20;5;788;1938;745;461;1,047; 
173; GPU ; MIS ;20;5;788;1938;745;461;1,047; 
175; GPU ; MIS ;20;5;2397;3715;2122;1107;1,671; 
175; GPU ; MIS ;20;5;2397;3715;2122;1107;1,672; 
175; GPU ; MIS ;20;5;2397;3715;2122;1107;1,656; 
175; GPU ; MIS ;20;5;2397;3715;2122;1107;1,688; 
175; GPU ; MIS ;20;5;2397;3715;2122;1107;1,671; 
177; GPU ; MIS ;21;5;904;1806;745;405;0,984; 
177; GPU ; MIS ;21;5;904;1806;745;405;0,984; 
177; GPU ; MIS ;21;5;904;1806;745;405;0,985; 
177; GPU ; MIS ;21;5;904;1806;745;405;0,984; 
177; GPU ; MIS ;21;5;904;1806;745;405;0,984; 
179; GPU ; MIS ;22;5;752;1264;643;376;0,718; 
179; GPU ; MIS ;22;5;752;1264;643;376;0,703; 
179; GPU ; MIS ;22;5;752;1264;643;376;0,719; 
179; GPU ; MIS ;22;5;752;1264;643;376;0,703; 
179; GPU ; MIS ;22;5;752;1264;643;376;0,688; 
181; GPU ; MIS ;22;5;757;1493;140;337;1,094; 
181; GPU ; MIS ;22;5;757;1493;140;337;1,094; 
181; GPU ; MIS ;22;5;757;1493;140;337;1,093; 
181; GPU ; MIS ;22;5;757;1493;140;337;1,094; 
181; GPU ; MIS ;22;5;757;1493;140;337;1,094; 
183; GPU ; MIS ;22;5;838;1763;628;383;1,171; 
183; GPU ; MIS ;22;5;838;1763;628;383;1,156; 
183; GPU ; MIS ;22;5;838;1763;628;383;1,157; 
183; GPU ; MIS ;22;5;838;1763;628;383;1,156; 
183; GPU ; MIS ;22;5;838;1763;628;383;1,172; 
185; GPU ; MIS ;22;5;2834;4207;447;1336;2,531; 
185; GPU ; MIS ;22;5;2834;4207;447;1336;2,532; 
185; GPU ; MIS ;22;5;2834;4207;447;1336;2,531; 
185; GPU ; MIS ;22;5;2834;4207;447;1336;2,531; 
185; GPU ; MIS ;22;5;2834;4207;447;1336;2,515; 
187; GPU ; MIS ;23;5;529;1032;437;251;0,531; 
187; GPU ; MIS ;23;5;529;1032;437;251;0,547; 
187; GPU ; MIS ;23;5;529;1032;437;251;0,5; 
187; GPU ; MIS ;23;5;529;1032;437;251;0,5; 
187; GPU ; MIS ;23;5;529;1032;437;251;0,515; 
189; GPU ; MIS ;24;5;467;896;393;213;0,625; 
189; GPU ; MIS ;24;5;467;896;393;213;0,562; 
189; GPU ; MIS ;24;5;467;896;393;213;0,579; 
189; GPU ; MIS ;24;5;467;896;393;213;0,578; 
189; GPU ; MIS ;24;5;467;896;393;213;0,562; 
191; GPU ; MIS ;25;5;5096;8105;711;2337;12,296; 
191; GPU ; MIS ;25;5;5096;8105;711;2337;12,28; 
191; GPU ; MIS ;25;5;5096;8105;711;2337;12,28; 
191; GPU ; MIS ;25;5;5096;8105;711;2337;12,281; 
191; GPU ; MIS ;25;5;5096;8105;711;2337;12,337; 
193; GPU ; MIS ;26;5;1848;3286;1528;924;2,828; 
193; GPU ; MIS ;26;5;1848;3286;1528;924;2,844; 
193; GPU ; MIS ;26;5;1848;3286;1528;924;2,812; 
193; GPU ; MIS ;26;5;1848;3286;1528;924;2,875; 
193; GPU ; MIS ;26;5;1848;3286;1528;924;2,843; 
195; GPU ; MIS ;27;5;1724;2975;1455;865;3,172; 
195; GPU ; MIS ;27;5;1724;2975;1455;865;3,093; 
195; GPU ; MIS ;27;5;1724;2975;1455;865;3,141; 
195; GPU ; MIS ;27;5;1724;2975;1455;865;3,093; 
195; GPU ; MIS ;27;5;1724;2975;1455;865;3,109; 
197; GPU ; MIS ;28;5;6128;15264;5894;-1;5,89; 
197; GPU ; MIS ;28;5;6128;15264;5894;-1;0,094; 
197; GPU ; MIS ;28;5;6128;15264;5894;-1;5,921; 
197; GPU ; MIS ;28;5;6128;15264;5894;-1;0; 
197; GPU ; MIS ;28;5;6128;15264;5894;-1;5,921; 
199; GPU ; MIS ;36;5;1011;2010;796;-1;0; 
199; GPU ; MIS ;36;5;1011;2010;796;-1;1,765; 
199; GPU ; MIS ;36;5;1011;2010;796;-1;0; 
199; GPU ; MIS ;36;5;1011;2010;796;-1;1,828; 
199; GPU ; MIS ;36;5;1011;2010;796;-1;0; 
8 tasks per thread;;;;;;;;;;
1; GPU ; MIS ;5;5;74;146;73;35;0,922; 
1; GPU ; MIS ;5;5;74;146;73;35;0,047; 
1; GPU ; MIS ;5;5;74;146;73;35;0,047; 
1; GPU ; MIS ;5;5;74;146;73;35;0,047; 
1; GPU ; MIS ;5;5;74;146;73;35;0,047; 
3; GPU ; MIS ;5;5;87;176;95;43;0,063; 
3; GPU ; MIS ;5;5;87;176;95;43;0,047; 
3; GPU ; MIS ;5;5;87;176;95;43;0,062; 
3; GPU ; MIS ;5;5;87;176;95;43;0,047; 
3; GPU ; MIS ;5;5;87;176;95;43;0,047; 
5; GPU ; MIS ;5;5;201;253;194;107;0,078; 
5; GPU ; MIS ;5;5;201;253;194;107;0,079; 
5; GPU ; MIS ;5;5;201;253;194;107;0,078; 
5; GPU ; MIS ;5;5;201;253;194;107;0,078; 
5; GPU ; MIS ;5;5;201;253;194;107;0,094; 
7; GPU ; MIS ;5;5;216;288;225;109;0,094; 
7; GPU ; MIS ;5;5;216;288;225;109;0,078; 
7; GPU ; MIS ;5;5;216;288;225;109;0,094; 
7; GPU ; MIS ;5;5;216;288;225;109;0,078; 
7; GPU ; MIS ;5;5;216;288;225;109;0,094; 
9; GPU ; MIS ;5;5;229;312;224;113;0,11; 
9; GPU ; MIS ;5;5;229;312;224;113;0,109; 
9; GPU ; MIS ;5;5;229;312;224;113;0,094; 
9; GPU ; MIS ;5;5;229;312;224;113;0,093; 
9; GPU ; MIS ;5;5;229;312;224;113;0,094; 
11; GPU ; MIS ;5;5;244;337;231;121;0,094; 
11; GPU ; MIS ;5;5;244;337;231;121;0,109; 
11; GPU ; MIS ;5;5;244;337;231;121;0,094; 
11; GPU ; MIS ;5;5;244;337;231;121;0,11; 
11; GPU ; MIS ;5;5;244;337;231;121;0,109; 
13; GPU ; MIS ;5;5;1906;2083;1896;976;0,625; 
13; GPU ; MIS ;5;5;1906;2083;1896;976;0,656; 
13; GPU ; MIS ;5;5;1906;2083;1896;976;0,672; 
13; GPU ; MIS ;5;5;1906;2083;1896;976;0,609; 
13; GPU ; MIS ;5;5;1906;2083;1896;976;0,625; 
15; GPU ; MIS ;6;5;114;228;117;52;0,062; 
15; GPU ; MIS ;6;5;114;228;117;52;0,079; 
15; GPU ; MIS ;6;5;114;228;117;52;0,078; 
15; GPU ; MIS ;6;5;114;228;117;52;0,062; 
15; GPU ; MIS ;6;5;114;228;117;52;0,078; 
17; GPU ; MIS ;6;5;210;276;203;105;0,078; 
17; GPU ; MIS ;6;5;210;276;203;105;0,094; 
17; GPU ; MIS ;6;5;210;276;203;105;0,078; 
17; GPU ; MIS ;6;5;210;276;203;105;0,094; 
17; GPU ; MIS ;6;5;210;276;203;105;0,078; 
19; GPU ; MIS ;6;5;231;319;224;115;0,094; 
19; GPU ; MIS ;6;5;231;319;224;115;0,109; 
19; GPU ; MIS ;6;5;231;319;224;115;0,093; 
19; GPU ; MIS ;6;5;231;319;224;115;0,094; 
19; GPU ; MIS ;6;5;231;319;224;115;0,11; 
21; GPU ; MIS ;6;5;247;486;249;112;0,172; 
21; GPU ; MIS ;6;5;247;486;249;112;0,141; 
21; GPU ; MIS ;6;5;247;486;249;112;0,156; 
21; GPU ; MIS ;6;5;247;486;249;112;0,14; 
21; GPU ; MIS ;6;5;247;486;249;112;0,141; 
23; GPU ; MIS ;6;5;990;1258;964;496;0,5; 
23; GPU ; MIS ;6;5;990;1258;964;496;0,5; 
23; GPU ; MIS ;6;5;990;1258;964;496;0,5; 
23; GPU ; MIS ;6;5;990;1258;964;496;0,5; 
23; GPU ; MIS ;6;5;990;1258;964;496;0,516; 
25; GPU ; MIS ;6;5;8790;9815;8761;4543;4,203; 
25; GPU ; MIS ;6;5;8790;9815;8761;4543;4,202; 
25; GPU ; MIS ;6;5;8790;9815;8761;4543;4,094; 
25; GPU ; MIS ;6;5;8790;9815;8761;4543;4,172; 
25; GPU ; MIS ;6;5;8790;9815;8761;4543;4,187; 
27; GPU ; MIS ;7;5;15;35;11;8;0,016; 
27; GPU ; MIS ;7;5;15;35;11;8;0,015; 
27; GPU ; MIS ;7;5;15;35;11;8;0; 
27; GPU ; MIS ;7;5;15;35;11;8;0; 
27; GPU ; MIS ;7;5;15;35;11;8;0,016; 
29; GPU ; MIS ;7;5;197;250;183;100;0,094; 
29; GPU ; MIS ;7;5;197;250;183;100;0,14; 
29; GPU ; MIS ;7;5;197;250;183;100;0,094; 
29; GPU ; MIS ;7;5;197;250;183;100;0,125; 
29; GPU ; MIS ;7;5;197;250;183;100;0,11; 
31; GPU ; MIS ;7;5;269;399;243;130;0,156; 
31; GPU ; MIS ;7;5;269;399;243;130;0,141; 
31; GPU ; MIS ;7;5;269;399;243;130;0,141; 
31; GPU ; MIS ;7;5;269;399;243;130;0,14; 
31; GPU ; MIS ;7;5;269;399;243;130;0,141; 
33; GPU ; MIS ;7;5;480;670;436;232;0,25; 
33; GPU ; MIS ;7;5;480;670;436;232;0,25; 
33; GPU ; MIS ;7;5;480;670;436;232;0,281; 
33; GPU ; MIS ;7;5;480;670;436;232;0,25; 
33; GPU ; MIS ;7;5;480;670;436;232;0,234; 
35; GPU ; MIS ;7;5;543;727;528;264;0,281; 
35; GPU ; MIS ;7;5;543;727;528;264;0,313; 
35; GPU ; MIS ;7;5;543;727;528;264;0,266; 
35; GPU ; MIS ;7;5;543;727;528;264;0,265; 
35; GPU ; MIS ;7;5;543;727;528;264;0,297; 
37; GPU ; MIS ;7;5;1172;1627;1053;564;0,61; 
37; GPU ; MIS ;7;5;1172;1627;1053;564;0,609; 
37; GPU ; MIS ;7;5;1172;1627;1053;564;0,625; 
37; GPU ; MIS ;7;5;1172;1627;1053;564;0,578; 
37; GPU ; MIS ;7;5;1172;1627;1053;564;0,64; 
39; GPU ; MIS ;7;5;1912;2223;1891;1016;1; 
39; GPU ; MIS ;7;5;1912;2223;1891;1016;0,953; 
39; GPU ; MIS ;7;5;1912;2223;1891;1016;0,938; 
39; GPU ; MIS ;7;5;1912;2223;1891;1016;0,906; 
39; GPU ; MIS ;7;5;1912;2223;1891;1016;0,953; 
41; GPU ; MIS ;7;5;2382;2674;2378;1212;1,015; 
41; GPU ; MIS ;7;5;2382;2674;2378;1212;1,047; 
41; GPU ; MIS ;7;5;2382;2674;2378;1212;1,015; 
41; GPU ; MIS ;7;5;2382;2674;2378;1212;1,094; 
41; GPU ; MIS ;7;5;2382;2674;2378;1212;1,047; 
43; GPU ; MIS ;8;5;246;468;164;113;0,156; 
43; GPU ; MIS ;8;5;246;468;164;113;0,109; 
43; GPU ; MIS ;8;5;246;468;164;113;0,141; 
43; GPU ; MIS ;8;5;246;468;164;113;0,125; 
43; GPU ; MIS ;8;5;246;468;164;113;0,109; 
45; GPU ; MIS ;8;5;389;562;342;186;0,234; 
45; GPU ; MIS ;8;5;389;562;342;186;0,204; 
45; GPU ; MIS ;8;5;389;562;342;186;0,203; 
45; GPU ; MIS ;8;5;389;562;342;186;0,187; 
45; GPU ; MIS ;8;5;389;562;342;186;0,188; 
47; GPU ; MIS ;8;5;585;799;548;284;0,312; 
47; GPU ; MIS ;8;5;585;799;548;284;0,313; 
47; GPU ; MIS ;8;5;585;799;548;284;0,359; 
47; GPU ; MIS ;8;5;585;799;548;284;0,312; 
47; GPU ; MIS ;8;5;585;799;548;284;0,313; 
49; GPU ; MIS ;8;5;623;876;534;306;0,297; 
49; GPU ; MIS ;8;5;623;876;534;306;0,344; 
49; GPU ; MIS ;8;5;623;876;534;306;0,359; 
49; GPU ; MIS ;8;5;623;876;534;306;0,313; 
49; GPU ; MIS ;8;5;623;876;534;306;0,375; 
51; GPU ; MIS ;8;5;1416;1978;1283;682;0,75; 
51; GPU ; MIS ;8;5;1416;1978;1283;682;0,75; 
51; GPU ; MIS ;8;5;1416;1978;1283;682;0,781; 
51; GPU ; MIS ;8;5;1416;1978;1283;682;0,797; 
51; GPU ; MIS ;8;5;1416;1978;1283;682;0,718; 
53; GPU ; MIS ;9;5;181;289;138;83;0,094; 
53; GPU ; MIS ;9;5;181;289;138;83;0,093; 
53; GPU ; MIS ;9;5;181;289;138;83;0,078; 
53; GPU ; MIS ;9;5;181;289;138;83;0,078; 
53; GPU ; MIS ;9;5;181;289;138;83;0,094; 
55; GPU ; MIS ;9;5;233;431;155;107;0,125; 
55; GPU ; MIS ;9;5;233;431;155;107;0,125; 
55; GPU ; MIS ;9;5;233;431;155;107;0,109; 
55; GPU ; MIS ;9;5;233;431;155;107;0,125; 
55; GPU ; MIS ;9;5;233;431;155;107;0,125; 
57; GPU ; MIS ;9;5;245;454;149;112;0,14; 
57; GPU ; MIS ;9;5;245;454;149;112;0,141; 
57; GPU ; MIS ;9;5;245;454;149;112;0,125; 
57; GPU ; MIS ;9;5;245;454;149;112;0,14; 
57; GPU ; MIS ;9;5;245;454;149;112;0,125; 
59; GPU ; MIS ;9;5;560;870;427;258;0,297; 
59; GPU ; MIS ;9;5;560;870;427;258;0,266; 
59; GPU ; MIS ;9;5;560;870;427;258;0,296; 
59; GPU ; MIS ;9;5;560;870;427;258;0,297; 
59; GPU ; MIS ;9;5;560;870;427;258;0,328; 
61; GPU ; MIS ;9;5;528;1017;446;235;0,469; 
61; GPU ; MIS ;9;5;528;1017;446;235;0,453; 
61; GPU ; MIS ;9;5;528;1017;446;235;0,422; 
61; GPU ; MIS ;9;5;528;1017;446;235;0,438; 
61; GPU ; MIS ;9;5;528;1017;446;235;0,453; 
63; GPU ; MIS ;9;5;1214;1700;1071;593;0,625; 
63; GPU ; MIS ;9;5;1214;1700;1071;593;0,672; 
63; GPU ; MIS ;9;5;1214;1700;1071;593;0,656; 
63; GPU ; MIS ;9;5;1214;1700;1071;593;0,688; 
63; GPU ; MIS ;9;5;1214;1700;1071;593;0,624; 
65; GPU ; MIS ;9;5;2856;3641;2653;1419;1,547; 
65; GPU ; MIS ;9;5;2856;3641;2653;1419;1,5; 
65; GPU ; MIS ;9;5;2856;3641;2653;1419;1,515; 
65; GPU ; MIS ;9;5;2856;3641;2653;1419;1,516; 
65; GPU ; MIS ;9;5;2856;3641;2653;1419;1,515; 
67; GPU ; MIS ;10;5;200;370;190;100;0,171; 
67; GPU ; MIS ;10;5;200;370;190;100;0,188; 
67; GPU ; MIS ;10;5;200;370;190;100;0,219; 
67; GPU ; MIS ;10;5;200;370;190;100;0,218; 
67; GPU ; MIS ;10;5;200;370;190;100;0,204; 
69; GPU ; MIS ;10;5;200;370;190;100;0,171; 
69; GPU ; MIS ;10;5;200;370;190;100;0,188; 
69; GPU ; MIS ;10;5;200;370;190;100;0,172; 
69; GPU ; MIS ;10;5;200;370;190;100;0,172; 
69; GPU ; MIS ;10;5;200;370;190;100;0,172; 
71; GPU ; MIS ;10;5;339;522;269;159;0,188; 
71; GPU ; MIS ;10;5;339;522;269;159;0,172; 
71; GPU ; MIS ;10;5;339;522;269;159;0,187; 
71; GPU ; MIS ;10;5;339;522;269;159;0,188; 
71; GPU ; MIS ;10;5;339;522;269;159;0,187; 
73; GPU ; MIS ;10;5;262;740;235;169;0,344; 
73; GPU ; MIS ;10;5;262;740;235;169;0,359; 
73; GPU ; MIS ;10;5;262;740;235;169;0,375; 
73; GPU ; MIS ;10;5;262;740;235;169;0,36; 
73; GPU ; MIS ;10;5;262;740;235;169;0,375; 
75; GPU ; MIS ;10;5;557;1080;351;246;0,234; 
75; GPU ; MIS ;10;5;557;1080;351;246;0,25; 
75; GPU ; MIS ;10;5;557;1080;351;246;0,266; 
75; GPU ; MIS ;10;5;557;1080;351;246;0,297; 
75; GPU ; MIS ;10;5;557;1080;351;246;0,281; 
77; GPU ; MIS ;10;5;2413;3412;2214;1243;1,172; 
77; GPU ; MIS ;10;5;2413;3412;2214;1243;1,187; 
77; GPU ; MIS ;10;5;2413;3412;2214;1243;1,188; 
77; GPU ; MIS ;10;5;2413;3412;2214;1243;1,171; 
77; GPU ; MIS ;10;5;2413;3412;2214;1243;1,203; 
79; GPU ; MIS ;10;5;36415;145635;25210;19258;53,356; 
79; GPU ; MIS ;10;5;36415;145635;25210;19258;54,859; 
79; GPU ; MIS ;10;5;36415;145635;25210;19258;54,086; 
79; GPU ; MIS ;10;5;36415;145635;25210;19258;51,715; 
79; GPU ; MIS ;10;5;36415;145635;25210;19258;50,071; 
81; GPU ; MIS ;11;5;237;378;185;108;0,203; 
81; GPU ; MIS ;11;5;237;378;185;108;0,203; 
81; GPU ; MIS ;11;5;237;378;185;108;0,203; 
81; GPU ; MIS ;11;5;237;378;185;108;0,203; 
81; GPU ; MIS ;11;5;237;378;185;108;0,219; 
83; GPU ; MIS ;11;5;311;632;206;136;0,25; 
83; GPU ; MIS ;11;5;311;632;206;136;0,25; 
83; GPU ; MIS ;11;5;311;632;206;136;0,234; 
83; GPU ; MIS ;11;5;311;632;206;136;0,25; 
83; GPU ; MIS ;11;5;311;632;206;136;0,234; 
85; GPU ; MIS ;11;5;1274;1808;1177;603;0,828; 
85; GPU ; MIS ;11;5;1274;1808;1177;603;0,844; 
85; GPU ; MIS ;11;5;1274;1808;1177;603;0,859; 
85; GPU ; MIS ;11;5;1274;1808;1177;603;0,829; 
85; GPU ; MIS ;11;5;1274;1808;1177;603;0,828; 
87; GPU ; MIS ;11;5;1337;1933;1228;639;0,843; 
87; GPU ; MIS ;11;5;1337;1933;1228;639;0,844; 
87; GPU ; MIS ;11;5;1337;1933;1228;639;0,812; 
87; GPU ; MIS ;11;5;1337;1933;1228;639;0,813; 
87; GPU ; MIS ;11;5;1337;1933;1228;639;0,797; 
89; GPU ; MIS ;11;5;5829;7552;5533;2945;3,234; 
89; GPU ; MIS ;11;5;5829;7552;5533;2945;3,234; 
89; GPU ; MIS ;11;5;5829;7552;5533;2945;3,301; 
89; GPU ; MIS ;11;5;5829;7552;5533;2945;3,265; 
89; GPU ; MIS ;11;5;5829;7552;5533;2945;3,235; 
91; GPU ; MIS ;12;5;304;571;284;135;0,25; 
91; GPU ; MIS ;12;5;304;571;284;135;0,265; 
91; GPU ; MIS ;12;5;304;571;284;135;0,266; 
91; GPU ; MIS ;12;5;304;571;284;135;0,266; 
91; GPU ; MIS ;12;5;304;571;284;135;0,265; 
93; GPU ; MIS ;12;5;1001;1419;927;483;0,609; 
93; GPU ; MIS ;12;5;1001;1419;927;483;0,578; 
93; GPU ; MIS ;12;5;1001;1419;927;483;0,578; 
93; GPU ; MIS ;12;5;1001;1419;927;483;0,578; 
93; GPU ; MIS ;12;5;1001;1419;927;483;0,563; 
95; GPU ; MIS ;12;5;1335;1932;1217;636;0,906; 
95; GPU ; MIS ;12;5;1335;1932;1217;636;0,86; 
95; GPU ; MIS ;12;5;1335;1932;1217;636;0,843; 
95; GPU ; MIS ;12;5;1335;1932;1217;636;0,86; 
95; GPU ; MIS ;12;5;1335;1932;1217;636;0,875; 
97; GPU ; MIS ;12;5;2629;3793;2413;1254;1,797; 
97; GPU ; MIS ;12;5;2629;3793;2413;1254;1,797; 
97; GPU ; MIS ;12;5;2629;3793;2413;1254;1,828; 
97; GPU ; MIS ;12;5;2629;3793;2413;1254;1,844; 
97; GPU ; MIS ;12;5;2629;3793;2413;1254;1,859; 
99; GPU ; MIS ;13;5;1294;1853;1186;622;0,828; 
99; GPU ; MIS ;13;5;1294;1853;1186;622;0,844; 
99; GPU ; MIS ;13;5;1294;1853;1186;622;0,828; 
99; GPU ; MIS ;13;5;1294;1853;1186;622;0,828; 
99; GPU ; MIS ;13;5;1294;1853;1186;622;0,859; 
101; GPU ; MIS ;13;5;2778;4083;2528;1312;1,859; 
101; GPU ; MIS ;13;5;2778;4083;2528;1312;1,844; 
101; GPU ; MIS ;13;5;2778;4083;2528;1312;1,828; 
101; GPU ; MIS ;13;5;2778;4083;2528;1312;1,891; 
101; GPU ; MIS ;13;5;2778;4083;2528;1312;1,891; 
103; GPU ; MIS ;14;5;1055;1473;952;508;0,718; 
103; GPU ; MIS ;14;5;1055;1473;952;508;0,703; 
103; GPU ; MIS ;14;5;1055;1473;952;508;0,75; 
103; GPU ; MIS ;14;5;1055;1473;952;508;0,719; 
103; GPU ; MIS ;14;5;1055;1473;952;508;0,75; 
105; GPU ; MIS ;14;5;1408;2056;1286;679;0,953; 
105; GPU ; MIS ;14;5;1408;2056;1286;679;0,985; 
105; GPU ; MIS ;14;5;1408;2056;1286;679;0,999; 
105; GPU ; MIS ;14;5;1408;2056;1286;679;1; 
105; GPU ; MIS ;14;5;1408;2056;1286;679;1; 
107; GPU ; MIS ;15;5;160;240;145;85;0,156; 
107; GPU ; MIS ;15;5;160;240;145;85;0,172; 
107; GPU ; MIS ;15;5;160;240;145;85;0,172; 
107; GPU ; MIS ;15;5;160;240;145;85;0,14; 
107; GPU ; MIS ;15;5;160;240;145;85;0,141; 
109; GPU ; MIS ;15;5;257;515;220;112;0,25; 
109; GPU ; MIS ;15;5;257;515;220;112;0,25; 
109; GPU ; MIS ;15;5;257;515;220;112;0,234; 
109; GPU ; MIS ;15;5;257;515;220;112;0,234; 
109; GPU ; MIS ;15;5;257;515;220;112;0,25; 
111; GPU ; MIS ;15;5;2763;4038;2511;1311;1,922; 
111; GPU ; MIS ;15;5;2763;4038;2511;1311;1,922; 
111; GPU ; MIS ;15;5;2763;4038;2511;1311;1,937; 
111; GPU ; MIS ;15;5;2763;4038;2511;1311;1,953; 
111; GPU ; MIS ;15;5;2763;4038;2511;1311;1,828; 
113; GPU ; MIS ;16;5;80;160;64;35;0,125; 
113; GPU ; MIS ;16;5;80;160;64;35;0,109; 
113; GPU ; MIS ;16;5;80;160;64;35;0,11; 
113; GPU ; MIS ;16;5;80;160;64;35;0,125; 
113; GPU ; MIS ;16;5;80;160;64;35;0,109; 
115; GPU ; MIS ;16;5;243;497;200;105;0,266; 
115; GPU ; MIS ;16;5;243;497;200;105;0,265; 
115; GPU ; MIS ;16;5;243;497;200;105;0,25; 
115; GPU ; MIS ;16;5;243;497;200;105;0,266; 
115; GPU ; MIS ;16;5;243;497;200;105;0,265; 
117; GPU ; MIS ;16;5;398;788;337;172;0,375; 
117; GPU ; MIS ;16;5;398;788;337;172;0,343; 
117; GPU ; MIS ;16;5;398;788;337;172;0,36; 
117; GPU ; MIS ;16;5;398;788;337;172;0,36; 
117; GPU ; MIS ;16;5;398;788;337;172;0,375; 
119; GPU ; MIS ;16;5;678;1030;152;422;0,453; 
119; GPU ; MIS ;16;5;678;1030;152;422;0,469; 
119; GPU ; MIS ;16;5;678;1030;152;422;0,468; 
119; GPU ; MIS ;16;5;678;1030;152;422;0,469; 
119; GPU ; MIS ;16;5;678;1030;152;422;0,469; 
121; GPU ; MIS ;16;5;1005;1731;846;495;1,016; 
121; GPU ; MIS ;16;5;1005;1731;846;495;1; 
121; GPU ; MIS ;16;5;1005;1731;846;495;1; 
121; GPU ; MIS ;16;5;1005;1731;846;495;1,015; 
121; GPU ; MIS ;16;5;1005;1731;846;495;1; 
123; GPU ; MIS ;16;5;2762;4047;2516;1290;1,984; 
123; GPU ; MIS ;16;5;2762;4047;2516;1290;1,969; 
123; GPU ; MIS ;16;5;2762;4047;2516;1290;1,968; 
123; GPU ; MIS ;16;5;2762;4047;2516;1290;1,953; 
123; GPU ; MIS ;16;5;2762;4047;2516;1290;1,953; 
125; GPU ; MIS ;17;5;160;240;50;111;0,156; 
125; GPU ; MIS ;17;5;160;240;50;111;0,14; 
125; GPU ; MIS ;17;5;160;240;50;111;0,157; 
125; GPU ; MIS ;17;5;160;240;50;111;0,156; 
125; GPU ; MIS ;17;5;160;240;50;111;0,14; 
127; GPU ; MIS ;17;5;294;568;65;189;0,281; 
127; GPU ; MIS ;17;5;294;568;65;189;0,297; 
127; GPU ; MIS ;17;5;294;568;65;189;0,297; 
127; GPU ; MIS ;17;5;294;568;65;189;0,281; 
127; GPU ; MIS ;17;5;294;568;65;189;0,281; 
129; GPU ; MIS ;17;5;323;592;266;149;0,312; 
129; GPU ; MIS ;17;5;323;592;266;149;0,313; 
129; GPU ; MIS ;17;5;323;592;266;149;0,312; 
129; GPU ; MIS ;17;5;323;592;266;149;0,297; 
129; GPU ; MIS ;17;5;323;592;266;149;0,312; 
131; GPU ; MIS ;17;5;499;861;418;248;0,485; 
131; GPU ; MIS ;17;5;499;861;418;248;0,484; 
131; GPU ; MIS ;17;5;499;861;418;248;0,469; 
131; GPU ; MIS ;17;5;499;861;418;248;0,468; 
131; GPU ; MIS ;17;5;499;861;418;248;0,516; 
133; GPU ; MIS ;17;5;766;1535;649;328;0,75; 
133; GPU ; MIS ;17;5;766;1535;649;328;0,75; 
133; GPU ; MIS ;17;5;766;1535;649;328;0,75; 
133; GPU ; MIS ;17;5;766;1535;649;328;0,75; 
133; GPU ; MIS ;17;5;766;1535;649;328;0,765; 
135; GPU ; MIS ;17;5;2532;3615;516;1686;1,656; 
135; GPU ; MIS ;17;5;2532;3615;516;1686;1,656; 
135; GPU ; MIS ;17;5;2532;3615;516;1686;1,657; 
135; GPU ; MIS ;17;5;2532;3615;516;1686;1,64; 
135; GPU ; MIS ;17;5;2532;3615;516;1686;1,656; 
137; GPU ; MIS ;17;5;2676;3894;2444;1267;1,906; 
137; GPU ; MIS ;17;5;2676;3894;2444;1267;1,906; 
137; GPU ; MIS ;17;5;2676;3894;2444;1267;1,922; 
137; GPU ; MIS ;17;5;2676;3894;2444;1267;1,922; 
137; GPU ; MIS ;17;5;2676;3894;2444;1267;1,859; 
139; GPU ; MIS ;17;5;2984;4484;617;2048;2,094; 
139; GPU ; MIS ;17;5;2984;4484;617;2048;2,078; 
139; GPU ; MIS ;17;5;2984;4484;617;2048;2,078; 
139; GPU ; MIS ;17;5;2984;4484;617;2048;2,093; 
139; GPU ; MIS ;17;5;2984;4484;617;2048;2,078; 
141; GPU ; MIS ;18;5;294;618;246;121;0,328; 
141; GPU ; MIS ;18;5;294;618;246;121;0,313; 
141; GPU ; MIS ;18;5;294;618;246;121;0,312; 
141; GPU ; MIS ;18;5;294;618;246;121;0,328; 
141; GPU ; MIS ;18;5;294;618;246;121;0,344; 
143; GPU ; MIS ;18;5;388;815;313;162;0,438; 
143; GPU ; MIS ;18;5;388;815;313;162;0,453; 
143; GPU ; MIS ;18;5;388;815;313;162;0,453; 
143; GPU ; MIS ;18;5;388;815;313;162;0,453; 
143; GPU ; MIS ;18;5;388;815;313;162;0,453; 
145; GPU ; MIS ;18;5;437;838;368;197;0,516; 
145; GPU ; MIS ;18;5;437;838;368;197;0,515; 
145; GPU ; MIS ;18;5;437;838;368;197;0,516; 
145; GPU ; MIS ;18;5;437;838;368;197;0,515; 
145; GPU ; MIS ;18;5;437;838;368;197;0,532; 
147; GPU ; MIS ;18;5;564;1112;469;362;0,594; 
147; GPU ; MIS ;18;5;564;1112;469;362;0,594; 
147; GPU ; MIS ;18;5;564;1112;469;362;0,578; 
147; GPU ; MIS ;18;5;564;1112;469;362;0,609; 
147; GPU ; MIS ;18;5;564;1112;469;362;0,594; 
149; GPU ; MIS ;18;5;615;1232;519;270;0,594; 
149; GPU ; MIS ;18;5;615;1232;519;270;0,625; 
149; GPU ; MIS ;18;5;615;1232;519;270;0,609; 
149; GPU ; MIS ;18;5;615;1232;519;270;0,61; 
149; GPU ; MIS ;18;5;615;1232;519;270;0,625; 
151; GPU ; MIS ;19;5;314;650;63;191;0,375; 
151; GPU ; MIS ;19;5;314;650;63;191;0,375; 
151; GPU ; MIS ;19;5;314;650;63;191;0,39; 
151; GPU ; MIS ;19;5;314;650;63;191;0,391; 
151; GPU ; MIS ;19;5;314;650;63;191;0,391; 
153; GPU ; MIS ;19;5;670;1316;538;297;0,906; 
153; GPU ; MIS ;19;5;670;1316;538;297;0,922; 
153; GPU ; MIS ;19;5;670;1316;538;297;0,906; 
153; GPU ; MIS ;19;5;670;1316;538;297;0,906; 
153; GPU ; MIS ;19;5;670;1316;538;297;0,891; 
155; GPU ; MIS ;19;5;770;1383;634;438;0,86; 
155; GPU ; MIS ;19;5;770;1383;634;438;0,89; 
155; GPU ; MIS ;19;5;770;1383;634;438;0,875; 
155; GPU ; MIS ;19;5;770;1383;634;438;0,891; 
155; GPU ; MIS ;19;5;770;1383;634;438;0,89; 
157; GPU ; MIS ;19;5;938;1869;765;641;1,062; 
157; GPU ; MIS ;19;5;938;1869;765;641;1,047; 
157; GPU ; MIS ;19;5;938;1869;765;641;1,051; 
157; GPU ; MIS ;19;5;938;1869;765;641;1,047; 
157; GPU ; MIS ;19;5;938;1869;765;641;1,062; 
159; GPU ; MIS ;19;5;2865;4267;2605;1345;2,141; 
159; GPU ; MIS ;19;5;2865;4267;2605;1345;2,14; 
159; GPU ; MIS ;19;5;2865;4267;2605;1345;2,187; 
159; GPU ; MIS ;19;5;2865;4267;2605;1345;2,172; 
159; GPU ; MIS ;19;5;2865;4267;2605;1345;2,171; 
161; GPU ; MIS ;23;5;2502;6244;2383;2150;4,453; 
161; GPU ; MIS ;23;5;2502;6244;2383;2150;4,484; 
161; GPU ; MIS ;23;5;2502;6244;2383;2150;4,5; 
161; GPU ; MIS ;23;5;2502;6244;2383;2150;4,468; 
161; GPU ; MIS ;23;5;2502;6244;2383;2150;4,563; 
163; GPU ; MIS ;20;5;402;780;326;181;0,531; 
163; GPU ; MIS ;20;5;402;780;326;181;0,531; 
163; GPU ; MIS ;20;5;402;780;326;181;0,532; 
163; GPU ; MIS ;20;5;402;780;326;181;0,531; 
163; GPU ; MIS ;20;5;402;780;326;181;0,515; 
165; GPU ; MIS ;20;5;422;808;351;188;0,438; 
165; GPU ; MIS ;20;5;422;808;351;188;0,484; 
165; GPU ; MIS ;20;5;422;808;351;188;0,469; 
165; GPU ; MIS ;20;5;422;808;351;188;0,484; 
165; GPU ; MIS ;20;5;422;808;351;188;0,469; 
167; GPU ; MIS ;20;5;632;1087;539;449;0,546; 
167; GPU ; MIS ;20;5;632;1087;539;449;0,625; 
167; GPU ; MIS ;20;5;632;1087;539;449;0,61; 
167; GPU ; MIS ;20;5;632;1087;539;449;0,625; 
167; GPU ; MIS ;20;5;632;1087;539;449;0,625; 
169; GPU ; MIS ;20;5;720;1269;610;444;0,797; 
169; GPU ; MIS ;20;5;720;1269;610;444;0,765; 
169; GPU ; MIS ;20;5;720;1269;610;444;0,781; 
169; GPU ; MIS ;20;5;720;1269;610;444;0,782; 
169; GPU ; MIS ;20;5;720;1269;610;444;0,781; 
171; GPU ; MIS ;20;5;802;1553;671;369;0,719; 
171; GPU ; MIS ;20;5;802;1553;671;369;0,734; 
171; GPU ; MIS ;20;5;802;1553;671;369;0,735; 
171; GPU ; MIS ;20;5;802;1553;671;369;0,765; 
171; GPU ; MIS ;20;5;802;1553;671;369;0,75; 
173; GPU ; MIS ;20;5;788;1938;745;460;1,297; 
173; GPU ; MIS ;20;5;788;1938;745;460;1,312; 
173; GPU ; MIS ;20;5;788;1938;745;460;1,313; 
173; GPU ; MIS ;20;5;788;1938;745;460;1,328; 
173; GPU ; MIS ;20;5;788;1938;745;460;1,313; 
175; GPU ; MIS ;20;5;2397;3715;2122;1101;2,093; 
175; GPU ; MIS ;20;5;2397;3715;2122;1101;2,109; 
175; GPU ; MIS ;20;5;2397;3715;2122;1101;2,094; 
175; GPU ; MIS ;20;5;2397;3715;2122;1101;2,14; 
175; GPU ; MIS ;20;5;2397;3715;2122;1101;2,094; 
177; GPU ; MIS ;21;5;904;1806;745;393;1,219; 
177; GPU ; MIS ;21;5;904;1806;745;393;1,218; 
177; GPU ; MIS ;21;5;904;1806;745;393;1,235; 
177; GPU ; MIS ;21;5;904;1806;745;393;1,234; 
177; GPU ; MIS ;21;5;904;1806;745;393;1,234; 
179; GPU ; MIS ;22;5;752;1264;643;365;0,859; 
179; GPU ; MIS ;22;5;752;1264;643;365;0,875; 
179; GPU ; MIS ;22;5;752;1264;643;365;0,859; 
179; GPU ; MIS ;22;5;752;1264;643;365;0,875; 
179; GPU ; MIS ;22;5;752;1264;643;365;0,874; 
181; GPU ; MIS ;22;5;757;1493;140;467;1,313; 
181; GPU ; MIS ;22;5;757;1493;140;467;1,312; 
181; GPU ; MIS ;22;5;757;1493;140;467;1,312; 
181; GPU ; MIS ;22;5;757;1493;140;467;1,313; 
181; GPU ; MIS ;22;5;757;1493;140;467;1,328; 
183; GPU ; MIS ;22;5;838;1763;628;362;1,453; 
183; GPU ; MIS ;22;5;838;1763;628;362;1,453; 
183; GPU ; MIS ;22;5;838;1763;628;362;1,437; 
183; GPU ; MIS ;22;5;838;1763;628;362;1,438; 
183; GPU ; MIS ;22;5;838;1763;628;362;1,453; 
185; GPU ; MIS ;22;5;2834;4207;447;2062;3,093; 
185; GPU ; MIS ;22;5;2834;4207;447;2062;3,078; 
185; GPU ; MIS ;22;5;2834;4207;447;2062;3,078; 
185; GPU ; MIS ;22;5;2834;4207;447;2062;3,078; 
185; GPU ; MIS ;22;5;2834;4207;447;2062;3,078; 
187; GPU ; MIS ;23;5;529;1032;437;250;0,625; 
187; GPU ; MIS ;23;5;529;1032;437;250;0,641; 
187; GPU ; MIS ;23;5;529;1032;437;250;0,641; 
187; GPU ; MIS ;23;5;529;1032;437;250;0,624; 
187; GPU ; MIS ;23;5;529;1032;437;250;0,625; 
189; GPU ; MIS ;24;5;467;896;393;207;0,703; 
189; GPU ; MIS ;24;5;467;896;393;207;0,704; 
189; GPU ; MIS ;24;5;467;896;393;207;0,703; 
189; GPU ; MIS ;24;5;467;896;393;207;0,703; 
189; GPU ; MIS ;24;5;467;896;393;207;0,672; 
191; GPU ; MIS ;25;5;5096;8105;711;3634;14,405; 
191; GPU ; MIS ;25;5;5096;8105;711;3634;14,406; 
191; GPU ; MIS ;25;5;5096;8105;711;3634;14,456; 
191; GPU ; MIS ;25;5;5096;8105;711;3634;14,405; 
191; GPU ; MIS ;25;5;5096;8105;711;3634;14,421; 
193; GPU ; MIS ;26;5;1848;3286;1528;882;3,5; 
193; GPU ; MIS ;26;5;1848;3286;1528;882;3,437; 
193; GPU ; MIS ;26;5;1848;3286;1528;882;3,437; 
193; GPU ; MIS ;26;5;1848;3286;1528;882;3,453; 
193; GPU ; MIS ;26;5;1848;3286;1528;882;3,437; 
195; GPU ; MIS ;27;5;1724;2975;1455;817;3,781; 
195; GPU ; MIS ;27;5;1724;2975;1455;817;3,796; 
195; GPU ; MIS ;27;5;1724;2975;1455;817;3,797; 
195; GPU ; MIS ;27;5;1724;2975;1455;817;3,796; 
195; GPU ; MIS ;27;5;1724;2975;1455;817;3,781; 
197; GPU ; MIS ;28;5;6128;15264;5894;-1;7,187; 
197; GPU ; MIS ;28;5;6128;15264;5894;-1;0; 
197; GPU ; MIS ;28;5;6128;15264;5894;-1;7,296; 
197; GPU ; MIS ;28;5;6128;15264;5894;-1;0; 
197; GPU ; MIS ;28;5;6128;15264;5894;-1;7,187; 
199; GPU ; MIS ;36;5;1011;2010;796;-1;0; 
199; GPU ; MIS ;36;5;1011;2010;796;-1;2,094; 
199; GPU ; MIS ;36;5;1011;2010;796;-1;0; 
199; GPU ; MIS ;36;5;1011;2010;796;-1;2,078; 
199; GPU ; MIS ;36;5;1011;2010;796;-1;0; 
128 tasks per thread;;;;;;;;;;
1; GPU ; MIS ;5;5;74;146;73;35;1,009; 
1; GPU ; MIS ;5;5;74;146;73;35;0,094; 
1; GPU ; MIS ;5;5;74;146;73;35;0,094; 
1; GPU ; MIS ;5;5;74;146;73;35;0,078; 
1; GPU ; MIS ;5;5;74;146;73;35;0,079; 
3; GPU ; MIS ;5;5;87;176;95;43;0,094; 
3; GPU ; MIS ;5;5;87;176;95;43;0,109; 
3; GPU ; MIS ;5;5;87;176;95;43;0,125; 
3; GPU ; MIS ;5;5;87;176;95;43;0,109; 
3; GPU ; MIS ;5;5;87;176;95;43;0,11; 
5; GPU ; MIS ;5;5;201;253;194;107;0,156; 
5; GPU ; MIS ;5;5;201;253;194;107;0,141; 
5; GPU ; MIS ;5;5;201;253;194;107;0,172; 
5; GPU ; MIS ;5;5;201;253;194;107;0,171; 
5; GPU ; MIS ;5;5;201;253;194;107;0,141; 
7; GPU ; MIS ;5;5;216;288;225;109;0,156; 
7; GPU ; MIS ;5;5;216;288;225;109;0,187; 
7; GPU ; MIS ;5;5;216;288;225;109;0,172; 
7; GPU ; MIS ;5;5;216;288;225;109;0,156; 
7; GPU ; MIS ;5;5;216;288;225;109;0,188; 
9; GPU ; MIS ;5;5;229;312;224;113;0,172; 
9; GPU ; MIS ;5;5;229;312;224;113;0,171; 
9; GPU ; MIS ;5;5;229;312;224;113;0,188; 
9; GPU ; MIS ;5;5;229;312;224;113;0,172; 
9; GPU ; MIS ;5;5;229;312;224;113;0,187; 
11; GPU ; MIS ;5;5;244;337;231;121;0,188; 
11; GPU ; MIS ;5;5;244;337;231;121;0,172; 
11; GPU ; MIS ;5;5;244;337;231;121;0,187; 
11; GPU ; MIS ;5;5;244;337;231;121;0,188; 
11; GPU ; MIS ;5;5;244;337;231;121;0,218; 
13; GPU ; MIS ;5;5;1906;2083;1896;976;1,219; 
13; GPU ; MIS ;5;5;1906;2083;1896;976;1,266; 
13; GPU ; MIS ;5;5;1906;2083;1896;976;1,265; 
13; GPU ; MIS ;5;5;1906;2083;1896;976;1,266; 
13; GPU ; MIS ;5;5;1906;2083;1896;976;1,203; 
15; GPU ; MIS ;6;5;114;228;117;52;0,125; 
15; GPU ; MIS ;6;5;114;228;117;52;0,125; 
15; GPU ; MIS ;6;5;114;228;117;52;0,14; 
15; GPU ; MIS ;6;5;114;228;117;52;0,156; 
15; GPU ; MIS ;6;5;114;228;117;52;0,141; 
17; GPU ; MIS ;6;5;210;276;203;105;0,172; 
17; GPU ; MIS ;6;5;210;276;203;105;0,156; 
17; GPU ; MIS ;6;5;210;276;203;105;0,156; 
17; GPU ; MIS ;6;5;210;276;203;105;0,156; 
17; GPU ; MIS ;6;5;210;276;203;105;0,156; 
19; GPU ; MIS ;6;5;231;319;224;115;0,203; 
19; GPU ; MIS ;6;5;231;319;224;115;0,188; 
19; GPU ; MIS ;6;5;231;319;224;115;0,172; 
19; GPU ; MIS ;6;5;231;319;224;115;0,188; 
19; GPU ; MIS ;6;5;231;319;224;115;0,203; 
21; GPU ; MIS ;6;5;247;486;249;112;0,281; 
21; GPU ; MIS ;6;5;247;486;249;112;0,282; 
21; GPU ; MIS ;6;5;247;486;249;112;0,265; 
21; GPU ; MIS ;6;5;247;486;249;112;0,297; 
21; GPU ; MIS ;6;5;247;486;249;112;0,266; 
23; GPU ; MIS ;6;5;990;1258;964;496;0,734; 
23; GPU ; MIS ;6;5;990;1258;964;496;0,75; 
23; GPU ; MIS ;6;5;990;1258;964;496;0,765; 
23; GPU ; MIS ;6;5;990;1258;964;496;0,766; 
23; GPU ; MIS ;6;5;990;1258;964;496;0,781; 
25; GPU ; MIS ;6;5;8790;9815;8761;4543;6,203; 
25; GPU ; MIS ;6;5;8790;9815;8761;4543;6,156; 
25; GPU ; MIS ;6;5;8790;9815;8761;4543;6,172; 
25; GPU ; MIS ;6;5;8790;9815;8761;4543;6,203; 
25; GPU ; MIS ;6;5;8790;9815;8761;4543;6,218; 
27; GPU ; MIS ;7;5;15;35;11;8;0,016; 
27; GPU ; MIS ;7;5;15;35;11;8;0,015; 
27; GPU ; MIS ;7;5;15;35;11;8;0,016; 
27; GPU ; MIS ;7;5;15;35;11;8;0,031; 
27; GPU ; MIS ;7;5;15;35;11;8;0,016; 
29; GPU ; MIS ;7;5;197;250;183;100;0,156; 
29; GPU ; MIS ;7;5;197;250;183;100;0,172; 
29; GPU ; MIS ;7;5;197;250;183;100;0,172; 
29; GPU ; MIS ;7;5;197;250;183;100;0,156; 
29; GPU ; MIS ;7;5;197;250;183;100;0,188; 
31; GPU ; MIS ;7;5;269;399;243;130;0,219; 
31; GPU ; MIS ;7;5;269;399;243;130;0,234; 
31; GPU ; MIS ;7;5;269;399;243;130;0,219; 
31; GPU ; MIS ;7;5;269;399;243;130;0,219; 
31; GPU ; MIS ;7;5;269;399;243;130;0,234; 
33; GPU ; MIS ;7;5;480;670;436;232;0,375; 
33; GPU ; MIS ;7;5;480;670;436;232;0,375; 
33; GPU ; MIS ;7;5;480;670;436;232;0,359; 
33; GPU ; MIS ;7;5;480;670;436;232;0,375; 
33; GPU ; MIS ;7;5;480;670;436;232;0,375; 
35; GPU ; MIS ;7;5;543;727;528;264;0,406; 
35; GPU ; MIS ;7;5;543;727;528;264;0,422; 
35; GPU ; MIS ;7;5;543;727;528;264;0,422; 
35; GPU ; MIS ;7;5;543;727;528;264;0,421; 
35; GPU ; MIS ;7;5;543;727;528;264;0,454; 
37; GPU ; MIS ;7;5;1172;1627;1053;564;0,969; 
37; GPU ; MIS ;7;5;1172;1627;1053;564;0,953; 
37; GPU ; MIS ;7;5;1172;1627;1053;564;0,999; 
37; GPU ; MIS ;7;5;1172;1627;1053;564;0,985; 
37; GPU ; MIS ;7;5;1172;1627;1053;564;0,937; 
39; GPU ; MIS ;7;5;1912;2223;1891;1016;1,453; 
39; GPU ; MIS ;7;5;1912;2223;1891;1016;1,391; 
39; GPU ; MIS ;7;5;1912;2223;1891;1016;1,453; 
39; GPU ; MIS ;7;5;1912;2223;1891;1016;1,406; 
39; GPU ; MIS ;7;5;1912;2223;1891;1016;1,406; 
41; GPU ; MIS ;7;5;2382;2674;2378;1212;1,578; 
41; GPU ; MIS ;7;5;2382;2674;2378;1212;1,546; 
41; GPU ; MIS ;7;5;2382;2674;2378;1212;1,578; 
41; GPU ; MIS ;7;5;2382;2674;2378;1212;1,594; 
41; GPU ; MIS ;7;5;2382;2674;2378;1212;1,593; 
43; GPU ; MIS ;8;5;246;468;164;113;0,188; 
43; GPU ; MIS ;8;5;246;468;164;113;0,187; 
43; GPU ; MIS ;8;5;246;468;164;113;0,203; 
43; GPU ; MIS ;8;5;246;468;164;113;0,172; 
43; GPU ; MIS ;8;5;246;468;164;113;0,188; 
45; GPU ; MIS ;8;5;389;562;342;186;0,312; 
45; GPU ; MIS ;8;5;389;562;342;186;0,313; 
45; GPU ; MIS ;8;5;389;562;342;186;0,312; 
45; GPU ; MIS ;8;5;389;562;342;186;0,297; 
45; GPU ; MIS ;8;5;389;562;342;186;0,297; 
47; GPU ; MIS ;8;5;585;799;548;284;0,469; 
47; GPU ; MIS ;8;5;585;799;548;284;0,469; 
47; GPU ; MIS ;8;5;585;799;548;284;0,484; 
47; GPU ; MIS ;8;5;585;799;548;284;0,469; 
47; GPU ; MIS ;8;5;585;799;548;284;0,469; 
49; GPU ; MIS ;8;5;623;876;534;306;0,485; 
49; GPU ; MIS ;8;5;623;876;534;306;0,485; 
49; GPU ; MIS ;8;5;623;876;534;306;0,484; 
49; GPU ; MIS ;8;5;623;876;534;306;0,5; 
49; GPU ; MIS ;8;5;623;876;534;306;0,5; 
51; GPU ; MIS ;8;5;1416;1978;1283;682;1,11; 
51; GPU ; MIS ;8;5;1416;1978;1283;682;1,156; 
51; GPU ; MIS ;8;5;1416;1978;1283;682;1,172; 
51; GPU ; MIS ;8;5;1416;1978;1283;682;1,125; 
51; GPU ; MIS ;8;5;1416;1978;1283;682;1,156; 
53; GPU ; MIS ;9;5;181;289;138;83;0,157; 
53; GPU ; MIS ;9;5;181;289;138;83;0,156; 
53; GPU ; MIS ;9;5;181;289;138;83;0,14; 
53; GPU ; MIS ;9;5;181;289;138;83;0,157; 
53; GPU ; MIS ;9;5;181;289;138;83;0,156; 
55; GPU ; MIS ;9;5;233;431;155;107;0,203; 
55; GPU ; MIS ;9;5;233;431;155;107;0,203; 
55; GPU ; MIS ;9;5;233;431;155;107;0,204; 
55; GPU ; MIS ;9;5;233;431;155;107;0,187; 
55; GPU ; MIS ;9;5;233;431;155;107;0,188; 
57; GPU ; MIS ;9;5;245;454;149;112;0,223; 
57; GPU ; MIS ;9;5;245;454;149;112;0,203; 
57; GPU ; MIS ;9;5;245;454;149;112;0,203; 
57; GPU ; MIS ;9;5;245;454;149;112;0,204; 
57; GPU ; MIS ;9;5;245;454;149;112;0,218; 
59; GPU ; MIS ;9;5;560;870;427;258;0,468; 
59; GPU ; MIS ;9;5;560;870;427;258;0,453; 
59; GPU ; MIS ;9;5;560;870;427;258;0,453; 
59; GPU ; MIS ;9;5;560;870;427;258;0,469; 
59; GPU ; MIS ;9;5;560;870;427;258;0,469; 
61; GPU ; MIS ;9;5;528;1017;446;235;0,656; 
61; GPU ; MIS ;9;5;528;1017;446;235;0,672; 
61; GPU ; MIS ;9;5;528;1017;446;235;0,688; 
61; GPU ; MIS ;9;5;528;1017;446;235;0,672; 
61; GPU ; MIS ;9;5;528;1017;446;235;0,656; 
63; GPU ; MIS ;9;5;1214;1700;1071;593;0,999; 
63; GPU ; MIS ;9;5;1214;1700;1071;593;1; 
63; GPU ; MIS ;9;5;1214;1700;1071;593;1; 
63; GPU ; MIS ;9;5;1214;1700;1071;593;1,032; 
63; GPU ; MIS ;9;5;1214;1700;1071;593;0,999; 
65; GPU ; MIS ;9;5;2856;3641;2653;1419;2,218; 
65; GPU ; MIS ;9;5;2856;3641;2653;1419;2,156; 
65; GPU ; MIS ;9;5;2856;3641;2653;1419;2,203; 
65; GPU ; MIS ;9;5;2856;3641;2653;1419;2,203; 
65; GPU ; MIS ;9;5;2856;3641;2653;1419;2,203; 
67; GPU ; MIS ;10;5;200;370;190;100;0,297; 
67; GPU ; MIS ;10;5;200;370;190;100;0,281; 
67; GPU ; MIS ;10;5;200;370;190;100;0,297; 
67; GPU ; MIS ;10;5;200;370;190;100;0,297; 
67; GPU ; MIS ;10;5;200;370;190;100;0,313; 
69; GPU ; MIS ;10;5;200;370;190;100;0,281; 
69; GPU ; MIS ;10;5;200;370;190;100;0,297; 
69; GPU ; MIS ;10;5;200;370;190;100;0,265; 
69; GPU ; MIS ;10;5;200;370;190;100;0,25; 
69; GPU ; MIS ;10;5;200;370;190;100;0,282; 
71; GPU ; MIS ;10;5;339;522;269;159;0,281; 
71; GPU ; MIS ;10;5;339;522;269;159;0,281; 
71; GPU ; MIS ;10;5;339;522;269;159;0,297; 
71; GPU ; MIS ;10;5;339;522;269;159;0,265; 
71; GPU ; MIS ;10;5;339;522;269;159;0,282; 
73; GPU ; MIS ;10;5;262;740;235;169;0,593; 
73; GPU ; MIS ;10;5;262;740;235;169;0,594; 
73; GPU ; MIS ;10;5;262;740;235;169;0,594; 
73; GPU ; MIS ;10;5;262;740;235;169;0,594; 
73; GPU ; MIS ;10;5;262;740;235;169;0,593; 
75; GPU ; MIS ;10;5;557;1080;351;246;0,422; 
75; GPU ; MIS ;10;5;557;1080;351;246;0,422; 
75; GPU ; MIS ;10;5;557;1080;351;246;0,422; 
75; GPU ; MIS ;10;5;557;1080;351;246;0,422; 
75; GPU ; MIS ;10;5;557;1080;351;246;0,422; 
77; GPU ; MIS ;10;5;2413;3412;2214;1243;1,766; 
77; GPU ; MIS ;10;5;2413;3412;2214;1243;1,875; 
77; GPU ; MIS ;10;5;2413;3412;2214;1243;1,828; 
77; GPU ; MIS ;10;5;2413;3412;2214;1243;1,797; 
77; GPU ; MIS ;10;5;2413;3412;2214;1243;1,844; 
79; GPU ; MIS ;10;5;36415;145635;25210;19258;86,188; 
79; GPU ; MIS ;10;5;36415;145635;25210;19258;78,979; 
79; GPU ; MIS ;10;5;36415;145635;25210;19258;77,253; 
79; GPU ; MIS ;10;5;36415;145635;25210;19258;78,102; 
79; GPU ; MIS ;10;5;36415;145635;25210;19258;77,28; 
81; GPU ; MIS ;11;5;237;378;185;108;0,281; 
81; GPU ; MIS ;11;5;237;378;185;108;0,297; 
81; GPU ; MIS ;11;5;237;378;185;108;0,276; 
81; GPU ; MIS ;11;5;237;378;185;108;0,297; 
81; GPU ; MIS ;11;5;237;378;185;108;0,281; 
83; GPU ; MIS ;11;5;311;632;206;136;0,343; 
83; GPU ; MIS ;11;5;311;632;206;136;0,344; 
83; GPU ; MIS ;11;5;311;632;206;136;0,313; 
83; GPU ; MIS ;11;5;311;632;206;136;0,328; 
83; GPU ; MIS ;11;5;311;632;206;136;0,343; 
85; GPU ; MIS ;11;5;1274;1808;1177;603;1,219; 
85; GPU ; MIS ;11;5;1274;1808;1177;603;1,203; 
85; GPU ; MIS ;11;5;1274;1808;1177;603;1,219; 
85; GPU ; MIS ;11;5;1274;1808;1177;603;1,156; 
85; GPU ; MIS ;11;5;1274;1808;1177;603;1,195; 
87; GPU ; MIS ;11;5;1337;1933;1228;639;1,234; 
87; GPU ; MIS ;11;5;1337;1933;1228;639;1,235; 
87; GPU ; MIS ;11;5;1337;1933;1228;639;1,187; 
87; GPU ; MIS ;11;5;1337;1933;1228;639;1,172; 
87; GPU ; MIS ;11;5;1337;1933;1228;639;1,218; 
89; GPU ; MIS ;11;5;5829;7552;5533;2945;4,782; 
89; GPU ; MIS ;11;5;5829;7552;5533;2945;4,846; 
89; GPU ; MIS ;11;5;5829;7552;5533;2945;4,776; 
89; GPU ; MIS ;11;5;5829;7552;5533;2945;4,656; 
89; GPU ; MIS ;11;5;5829;7552;5533;2945;4,727; 
91; GPU ; MIS ;12;5;304;571;284;135;0,406; 
91; GPU ; MIS ;12;5;304;571;284;135;0,406; 
91; GPU ; MIS ;12;5;304;571;284;135;0,406; 
91; GPU ; MIS ;12;5;304;571;284;135;0,391; 
91; GPU ; MIS ;12;5;304;571;284;135;0,39; 
93; GPU ; MIS ;12;5;1001;1419;927;483;0,859; 
93; GPU ; MIS ;12;5;1001;1419;927;483;0,859; 
93; GPU ; MIS ;12;5;1001;1419;927;483;0,844; 
93; GPU ; MIS ;12;5;1001;1419;927;483;0,852; 
93; GPU ; MIS ;12;5;1001;1419;927;483;0,876; 
95; GPU ; MIS ;12;5;1335;1932;1217;636;1,25; 
95; GPU ; MIS ;12;5;1335;1932;1217;636;1,281; 
95; GPU ; MIS ;12;5;1335;1932;1217;636;1,297; 
95; GPU ; MIS ;12;5;1335;1932;1217;636;1,281; 
95; GPU ; MIS ;12;5;1335;1932;1217;636;1,297; 
97; GPU ; MIS ;12;5;2629;3793;2413;1254;2,516; 
97; GPU ; MIS ;12;5;2629;3793;2413;1254;2,576; 
97; GPU ; MIS ;12;5;2629;3793;2413;1254;2,516; 
97; GPU ; MIS ;12;5;2629;3793;2413;1254;2,547; 
97; GPU ; MIS ;12;5;2629;3793;2413;1254;2,589; 
99; GPU ; MIS ;13;5;1294;1853;1186;622;1,223; 
99; GPU ; MIS ;13;5;1294;1853;1186;622;1,203; 
99; GPU ; MIS ;13;5;1294;1853;1186;622;1,234; 
99; GPU ; MIS ;13;5;1294;1853;1186;622;1,234; 
99; GPU ; MIS ;13;5;1294;1853;1186;622;1,25; 
101; GPU ; MIS ;13;5;2778;4083;2528;1312;2,741; 
101; GPU ; MIS ;13;5;2778;4083;2528;1312;2,761; 
101; GPU ; MIS ;13;5;2778;4083;2528;1312;2,796; 
101; GPU ; MIS ;13;5;2778;4083;2528;1312;2,725; 
101; GPU ; MIS ;13;5;2778;4083;2528;1312;2,734; 
103; GPU ; MIS ;14;5;1055;1473;952;508;1,047; 
103; GPU ; MIS ;14;5;1055;1473;952;508;1,016; 
103; GPU ; MIS ;14;5;1055;1473;952;508;1,031; 
103; GPU ; MIS ;14;5;1055;1473;952;508;1,047; 
103; GPU ; MIS ;14;5;1055;1473;952;508;1,078; 
105; GPU ; MIS ;14;5;1408;2056;1286;680;1,453; 
105; GPU ; MIS ;14;5;1408;2056;1286;680;1,462; 
105; GPU ; MIS ;14;5;1408;2056;1286;680;1,427; 
105; GPU ; MIS ;14;5;1408;2056;1286;680;1,453; 
105; GPU ; MIS ;14;5;1408;2056;1286;680;1,406; 
107; GPU ; MIS ;15;5;160;240;145;85;0,234; 
107; GPU ; MIS ;15;5;160;240;145;85;0,234; 
107; GPU ; MIS ;15;5;160;240;145;85;0,219; 
107; GPU ; MIS ;15;5;160;240;145;85;0,219; 
107; GPU ; MIS ;15;5;160;240;145;85;0,234; 
109; GPU ; MIS ;15;5;257;515;220;113;0,344; 
109; GPU ; MIS ;15;5;257;515;220;113;0,328; 
109; GPU ; MIS ;15;5;257;515;220;113;0,329; 
109; GPU ; MIS ;15;5;257;515;220;113;0,312; 
109; GPU ; MIS ;15;5;257;515;220;113;0,343; 
111; GPU ; MIS ;15;5;2763;4038;2511;1312;2,734; 
111; GPU ; MIS ;15;5;2763;4038;2511;1312;2,734; 
111; GPU ; MIS ;15;5;2763;4038;2511;1312;2,834; 
111; GPU ; MIS ;15;5;2763;4038;2511;1312;2,749; 
111; GPU ; MIS ;15;5;2763;4038;2511;1312;2,703; 
113; GPU ; MIS ;16;5;80;160;64;36;0,172; 
113; GPU ; MIS ;16;5;80;160;64;36;0,156; 
113; GPU ; MIS ;16;5;80;160;64;36;0,157; 
113; GPU ; MIS ;16;5;80;160;64;36;0,172; 
113; GPU ; MIS ;16;5;80;160;64;36;0,156; 
115; GPU ; MIS ;16;5;243;497;200;105;0,36; 
115; GPU ; MIS ;16;5;243;497;200;105;0,36; 
115; GPU ; MIS ;16;5;243;497;200;105;0,359; 
115; GPU ; MIS ;16;5;243;497;200;105;0,328; 
115; GPU ; MIS ;16;5;243;497;200;105;0,344; 
117; GPU ; MIS ;16;5;398;788;337;173;0,531; 
117; GPU ; MIS ;16;5;398;788;337;173;0,516; 
117; GPU ; MIS ;16;5;398;788;337;173;0,471; 
117; GPU ; MIS ;16;5;398;788;337;173;0,484; 
117; GPU ; MIS ;16;5;398;788;337;173;0,542; 
119; GPU ; MIS ;16;5;678;1030;152;314;0,672; 
119; GPU ; MIS ;16;5;678;1030;152;314;0,687; 
119; GPU ; MIS ;16;5;678;1030;152;314;0,688; 
119; GPU ; MIS ;16;5;678;1030;152;314;0,703; 
119; GPU ; MIS ;16;5;678;1030;152;314;0,703; 
121; GPU ; MIS ;16;5;1005;1731;846;503;1,422; 
121; GPU ; MIS ;16;5;1005;1731;846;503;1,401; 
121; GPU ; MIS ;16;5;1005;1731;846;503;1,417; 
121; GPU ; MIS ;16;5;1005;1731;846;503;1,391; 
121; GPU ; MIS ;16;5;1005;1731;846;503;1,391; 
123; GPU ; MIS ;16;5;2762;4047;2516;1291;2,869; 
123; GPU ; MIS ;16;5;2762;4047;2516;1291;2,842; 
123; GPU ; MIS ;16;5;2762;4047;2516;1291;2,818; 
123; GPU ; MIS ;16;5;2762;4047;2516;1291;2,823; 
123; GPU ; MIS ;16;5;2762;4047;2516;1291;2,906; 
125; GPU ; MIS ;17;5;160;240;50;84;0,234; 
125; GPU ; MIS ;17;5;160;240;50;84;0,235; 
125; GPU ; MIS ;17;5;160;240;50;84;0,234; 
125; GPU ; MIS ;17;5;160;240;50;84;0,234; 
125; GPU ; MIS ;17;5;160;240;50;84;0,219; 
127; GPU ; MIS ;17;5;294;568;65;155;0,422; 
127; GPU ; MIS ;17;5;294;568;65;155;0,437; 
127; GPU ; MIS ;17;5;294;568;65;155;0,438; 
127; GPU ; MIS ;17;5;294;568;65;155;0,422; 
127; GPU ; MIS ;17;5;294;568;65;155;0,422; 
129; GPU ; MIS ;17;5;323;592;266;153;0,453; 
129; GPU ; MIS ;17;5;323;592;266;153;0,453; 
129; GPU ; MIS ;17;5;323;592;266;153;0,437; 
129; GPU ; MIS ;17;5;323;592;266;153;0,452; 
129; GPU ; MIS ;17;5;323;592;266;153;0,438; 
131; GPU ; MIS ;17;5;499;861;418;249;0,672; 
131; GPU ; MIS ;17;5;499;861;418;249;0,703; 
131; GPU ; MIS ;17;5;499;861;418;249;0,672; 
131; GPU ; MIS ;17;5;499;861;418;249;0,688; 
131; GPU ; MIS ;17;5;499;861;418;249;0,703; 
133; GPU ; MIS ;17;5;766;1535;649;329;1,078; 
133; GPU ; MIS ;17;5;766;1535;649;329;1,047; 
133; GPU ; MIS ;17;5;766;1535;649;329;1,052; 
133; GPU ; MIS ;17;5;766;1535;649;329;1,057; 
133; GPU ; MIS ;17;5;766;1535;649;329;1,047; 
135; GPU ; MIS ;17;5;2532;3615;516;1277;2,437; 
135; GPU ; MIS ;17;5;2532;3615;516;1277;2,453; 
135; GPU ; MIS ;17;5;2532;3615;516;1277;2,438; 
135; GPU ; MIS ;17;5;2532;3615;516;1277;2,453; 
135; GPU ; MIS ;17;5;2532;3615;516;1277;2,437; 
137; GPU ; MIS ;17;5;2676;3894;2444;1268;2,752; 
137; GPU ; MIS ;17;5;2676;3894;2444;1268;2,781; 
137; GPU ; MIS ;17;5;2676;3894;2444;1268;2,719; 
137; GPU ; MIS ;17;5;2676;3894;2444;1268;2,803; 
137; GPU ; MIS ;17;5;2676;3894;2444;1268;2,698; 
139; GPU ; MIS ;17;5;2984;4484;617;1491;3,109; 
139; GPU ; MIS ;17;5;2984;4484;617;1491;3,067; 
139; GPU ; MIS ;17;5;2984;4484;617;1491;3,089; 
139; GPU ; MIS ;17;5;2984;4484;617;1491;3,078; 
139; GPU ; MIS ;17;5;2984;4484;617;1491;3,069; 
141; GPU ; MIS ;18;5;294;618;246;126;0,484; 
141; GPU ; MIS ;18;5;294;618;246;126;0,516; 
141; GPU ; MIS ;18;5;294;618;246;126;0,469; 
141; GPU ; MIS ;18;5;294;618;246;126;0,468; 
141; GPU ; MIS ;18;5;294;618;246;126;0,469; 
143; GPU ; MIS ;18;5;388;815;313;167;0,656; 
143; GPU ; MIS ;18;5;388;815;313;167;0,656; 
143; GPU ; MIS ;18;5;388;815;313;167;0,656; 
143; GPU ; MIS ;18;5;388;815;313;167;0,641; 
143; GPU ; MIS ;18;5;388;815;313;167;0,656; 
145; GPU ; MIS ;18;5;437;838;368;200;0,781; 
145; GPU ; MIS ;18;5;437;838;368;200;0,734; 
145; GPU ; MIS ;18;5;437;838;368;200;0,734; 
145; GPU ; MIS ;18;5;437;838;368;200;0,813; 
145; GPU ; MIS ;18;5;437;838;368;200;0,741; 
147; GPU ; MIS ;18;5;564;1112;469;246;0,844; 
147; GPU ; MIS ;18;5;564;1112;469;246;0,843; 
147; GPU ; MIS ;18;5;564;1112;469;246;0,828; 
147; GPU ; MIS ;18;5;564;1112;469;246;0,844; 
147; GPU ; MIS ;18;5;564;1112;469;246;0,843; 
149; GPU ; MIS ;18;5;615;1232;519;270;0,875; 
149; GPU ; MIS ;18;5;615;1232;519;270;0,875; 
149; GPU ; MIS ;18;5;615;1232;519;270;0,875; 
149; GPU ; MIS ;18;5;615;1232;519;270;0,882; 
149; GPU ; MIS ;18;5;615;1232;519;270;0,917; 
151; GPU ; MIS ;19;5;314;650;63;154;0,578; 
151; GPU ; MIS ;19;5;314;650;63;154;0,578; 
151; GPU ; MIS ;19;5;314;650;63;154;0,594; 
151; GPU ; MIS ;19;5;314;650;63;154;0,594; 
151; GPU ; MIS ;19;5;314;650;63;154;0,593; 
153; GPU ; MIS ;19;5;670;1316;538;304;1,297; 
153; GPU ; MIS ;19;5;670;1316;538;304;1,297; 
153; GPU ; MIS ;19;5;670;1316;538;304;1,297; 
153; GPU ; MIS ;19;5;670;1316;538;304;1,282; 
153; GPU ; MIS ;19;5;670;1316;538;304;1,267; 
155; GPU ; MIS ;19;5;770;1383;634;384;1,26; 
155; GPU ; MIS ;19;5;770;1383;634;384;1,25; 
155; GPU ; MIS ;19;5;770;1383;634;384;1,25; 
155; GPU ; MIS ;19;5;770;1383;634;384;1,25; 
155; GPU ; MIS ;19;5;770;1383;634;384;1,25; 
157; GPU ; MIS ;19;5;938;1869;765;409;1,505; 
157; GPU ; MIS ;19;5;938;1869;765;409;1,526; 
157; GPU ; MIS ;19;5;938;1869;765;409;1,516; 
157; GPU ; MIS ;19;5;938;1869;765;409;1,531; 
157; GPU ; MIS ;19;5;938;1869;765;409;1,531; 
159; GPU ; MIS ;19;5;2865;4267;2605;1347;3,093; 
159; GPU ; MIS ;19;5;2865;4267;2605;1347;3,132; 
159; GPU ; MIS ;19;5;2865;4267;2605;1347;3,078; 
159; GPU ; MIS ;19;5;2865;4267;2605;1347;3,062; 
159; GPU ; MIS ;19;5;2865;4267;2605;1347;3,071; 
161; GPU ; MIS ;23;5;2502;6244;2383;1510;6,562; 
161; GPU ; MIS ;23;5;2502;6244;2383;1510;6,555; 
161; GPU ; MIS ;23;5;2502;6244;2383;1510;6,406; 
161; GPU ; MIS ;23;5;2502;6244;2383;1510;6,457; 
161; GPU ; MIS ;23;5;2502;6244;2383;1510;6,464; 
163; GPU ; MIS ;20;5;402;780;326;183;0,719; 
163; GPU ; MIS ;20;5;402;780;326;183;0,735; 
163; GPU ; MIS ;20;5;402;780;326;183;0,718; 
163; GPU ; MIS ;20;5;402;780;326;183;0,735; 
163; GPU ; MIS ;20;5;402;780;326;183;0,718; 
165; GPU ; MIS ;20;5;422;808;351;191;0,657; 
165; GPU ; MIS ;20;5;422;808;351;191;0,656; 
165; GPU ; MIS ;20;5;422;808;351;191;0,656; 
165; GPU ; MIS ;20;5;422;808;351;191;0,656; 
165; GPU ; MIS ;20;5;422;808;351;191;0,672; 
167; GPU ; MIS ;20;5;632;1087;539;316;0,869; 
167; GPU ; MIS ;20;5;632;1087;539;316;0,891; 
167; GPU ; MIS ;20;5;632;1087;539;316;0,859; 
167; GPU ; MIS ;20;5;632;1087;539;316;0,875; 
167; GPU ; MIS ;20;5;632;1087;539;316;0,875; 
169; GPU ; MIS ;20;5;720;1269;610;355;1,063; 
169; GPU ; MIS ;20;5;720;1269;610;355;1,093; 
169; GPU ; MIS ;20;5;720;1269;610;355;1,094; 
169; GPU ; MIS ;20;5;720;1269;610;355;1,093; 
169; GPU ; MIS ;20;5;720;1269;610;355;1,094; 
171; GPU ; MIS ;20;5;802;1553;671;370;1,041; 
171; GPU ; MIS ;20;5;802;1553;671;370;1,047; 
171; GPU ; MIS ;20;5;802;1553;671;370;1,047; 
171; GPU ; MIS ;20;5;802;1553;671;370;1,093; 
171; GPU ; MIS ;20;5;802;1553;671;370;1,11; 
173; GPU ; MIS ;20;5;788;1938;745;460;1,941; 
173; GPU ; MIS ;20;5;788;1938;745;460;1,922; 
173; GPU ; MIS ;20;5;788;1938;745;460;1,937; 
173; GPU ; MIS ;20;5;788;1938;745;460;1,937; 
173; GPU ; MIS ;20;5;788;1938;745;460;1,907; 
175; GPU ; MIS ;20;5;2397;3715;2122;1106;3,015; 
175; GPU ; MIS ;20;5;2397;3715;2122;1106;2,988; 
175; GPU ; MIS ;20;5;2397;3715;2122;1106;2,984; 
175; GPU ; MIS ;20;5;2397;3715;2122;1106;3,015; 
175; GPU ; MIS ;20;5;2397;3715;2122;1106;2,969; 
177; GPU ; MIS ;21;5;904;1806;745;401;1,803; 
177; GPU ; MIS ;21;5;904;1806;745;401;1,813; 
177; GPU ; MIS ;21;5;904;1806;745;401;1,812; 
177; GPU ; MIS ;21;5;904;1806;745;401;1,812; 
177; GPU ; MIS ;21;5;904;1806;745;401;1,809; 
179; GPU ; MIS ;22;5;752;1264;643;373;1,276; 
179; GPU ; MIS ;22;5;752;1264;643;373;1,249; 
179; GPU ; MIS ;22;5;752;1264;643;373;1,266; 
179; GPU ; MIS ;22;5;752;1264;643;373;1,25; 
179; GPU ; MIS ;22;5;752;1264;643;373;1,25; 
181; GPU ; MIS ;22;5;757;1493;140;433;2,092; 
181; GPU ; MIS ;22;5;757;1493;140;433;2,104; 
181; GPU ; MIS ;22;5;757;1493;140;433;2,093; 
181; GPU ; MIS ;22;5;757;1493;140;433;2,11; 
181; GPU ; MIS ;22;5;757;1493;140;433;2,093; 
183; GPU ; MIS ;22;5;838;1763;628;366;2,203; 
183; GPU ; MIS ;22;5;838;1763;628;366;2,187; 
183; GPU ; MIS ;22;5;838;1763;628;366;2,203; 
183; GPU ; MIS ;22;5;838;1763;628;366;2,172; 
183; GPU ; MIS ;22;5;838;1763;628;366;2,166; 
185; GPU ; MIS ;22;5;2834;4207;447;1876;4,812; 
185; GPU ; MIS ;22;5;2834;4207;447;1876;4,781; 
185; GPU ; MIS ;22;5;2834;4207;447;1876;4,766; 
185; GPU ; MIS ;22;5;2834;4207;447;1876;4,78; 
185; GPU ; MIS ;22;5;2834;4207;447;1876;4,765; 
187; GPU ; MIS ;23;5;529;1032;437;251;0,937; 
187; GPU ; MIS ;23;5;529;1032;437;251;0,922; 
187; GPU ; MIS ;23;5;529;1032;437;251;0,937; 
187; GPU ; MIS ;23;5;529;1032;437;251;0,953; 
187; GPU ; MIS ;23;5;529;1032;437;251;0,92; 
189; GPU ; MIS ;24;5;467;896;393;209;1,063; 
189; GPU ; MIS ;24;5;467;896;393;209;1,078; 
189; GPU ; MIS ;24;5;467;896;393;209;1,094; 
189; GPU ; MIS ;24;5;467;896;393;209;1,093; 
189; GPU ; MIS ;24;5;467;896;393;209;1,094; 
191; GPU ; MIS ;25;5;5096;8105;711;3488;26,092; 
191; GPU ; MIS ;25;5;5096;8105;711;3488;26,111; 
191; GPU ; MIS ;25;5;5096;8105;711;3488;26,109; 
191; GPU ; MIS ;25;5;5096;8105;711;3488;26,097; 
191; GPU ; MIS ;25;5;5096;8105;711;3488;26,079; 
193; GPU ; MIS ;26;5;1848;3286;1528;895;5,594; 
193; GPU ; MIS ;26;5;1848;3286;1528;895;5,599; 
193; GPU ; MIS ;26;5;1848;3286;1528;895;5,594; 
193; GPU ; MIS ;26;5;1848;3286;1528;895;5,587; 
193; GPU ; MIS ;26;5;1848;3286;1528;895;5,606; 
195; GPU ; MIS ;27;5;1724;2975;1455;837;6,468; 
195; GPU ; MIS ;27;5;1724;2975;1455;837;6,513; 
195; GPU ; MIS ;27;5;1724;2975;1455;837;6,518; 
195; GPU ; MIS ;27;5;1724;2975;1455;837;6,499; 
195; GPU ; MIS ;27;5;1724;2975;1455;837;6,49; 
197; GPU ; MIS ;28;5;6128;15264;5894;-1;11,768; 
197; GPU ; MIS ;28;5;6128;15264;5894;-1;0; 
197; GPU ; MIS ;28;5;6128;15264;5894;-1;11,868; 
197; GPU ; MIS ;28;5;6128;15264;5894;-1;0; 
197; GPU ; MIS ;28;5;6128;15264;5894;-1;12,005; 
199; GPU ; MIS ;36;5;1011;2010;796;-1;0; 
199; GPU ; MIS ;36;5;1011;2010;796;-1;4,099; 
199; GPU ; MIS ;36;5;1011;2010;796;-1;0; 
199; GPU ; MIS ;36;5;1011;2010;796;-1;4,104; 
199; GPU ; MIS ;36;5;1011;2010;796;-1;0; 
32 tasks per thread;;;;;;;;;;
1; GPU ; MIS ;5;5;74;146;73;35;0,928; 
1; GPU ; MIS ;5;5;74;146;73;35;0,047; 
1; GPU ; MIS ;5;5;74;146;73;35;0,047; 
1; GPU ; MIS ;5;5;74;146;73;35;0,046; 
1; GPU ; MIS ;5;5;74;146;73;35;0,047; 
3; GPU ; MIS ;5;5;87;176;95;43;0,047; 
3; GPU ; MIS ;5;5;87;176;95;43;0,063; 
3; GPU ; MIS ;5;5;87;176;95;43;0,062; 
3; GPU ; MIS ;5;5;87;176;95;43;0,063; 
3; GPU ; MIS ;5;5;87;176;95;43;0,062; 
5; GPU ; MIS ;5;5;201;253;194;107;0,078; 
5; GPU ; MIS ;5;5;201;253;194;107;0,094; 
5; GPU ; MIS ;5;5;201;253;194;107;0,094; 
5; GPU ; MIS ;5;5;201;253;194;107;0,093; 
5; GPU ; MIS ;5;5;201;253;194;107;0,094; 
7; GPU ; MIS ;5;5;216;288;225;109;0,094; 
7; GPU ; MIS ;5;5;216;288;225;109;0,109; 
7; GPU ; MIS ;5;5;216;288;225;109;0,125; 
7; GPU ; MIS ;5;5;216;288;225;109;0,094; 
7; GPU ; MIS ;5;5;216;288;225;109;0,093; 
9; GPU ; MIS ;5;5;229;312;224;113;0,093; 
9; GPU ; MIS ;5;5;229;312;224;113;0,11; 
9; GPU ; MIS ;5;5;229;312;224;113;0,109; 
9; GPU ; MIS ;5;5;229;312;224;113;0,125; 
9; GPU ; MIS ;5;5;229;312;224;113;0,109; 
11; GPU ; MIS ;5;5;244;337;231;121;0,109; 
11; GPU ; MIS ;5;5;244;337;231;121;0,109; 
11; GPU ; MIS ;5;5;244;337;231;121;0,11; 
11; GPU ; MIS ;5;5;244;337;231;121;0,109; 
11; GPU ; MIS ;5;5;244;337;231;121;0,109; 
13; GPU ; MIS ;5;5;1906;2083;1896;976;0,703; 
13; GPU ; MIS ;5;5;1906;2083;1896;976;0,781; 
13; GPU ; MIS ;5;5;1906;2083;1896;976;0,906; 
13; GPU ; MIS ;5;5;1906;2083;1896;976;0,844; 
13; GPU ; MIS ;5;5;1906;2083;1896;976;0,859; 
15; GPU ; MIS ;6;5;114;228;117;52;0,078; 
15; GPU ; MIS ;6;5;114;228;117;52;0,078; 
15; GPU ; MIS ;6;5;114;228;117;52;0,094; 
15; GPU ; MIS ;6;5;114;228;117;52;0,094; 
15; GPU ; MIS ;6;5;114;228;117;52;0,124; 
17; GPU ; MIS ;6;5;210;276;203;105;0,125; 
17; GPU ; MIS ;6;5;210;276;203;105;0,11; 
17; GPU ; MIS ;6;5;210;276;203;105;0,125; 
17; GPU ; MIS ;6;5;210;276;203;105;0,109; 
17; GPU ; MIS ;6;5;210;276;203;105;0,125; 
19; GPU ; MIS ;6;5;231;319;224;115;0,125; 
19; GPU ; MIS ;6;5;231;319;224;115;0,151; 
19; GPU ; MIS ;6;5;231;319;224;115;0,125; 
19; GPU ; MIS ;6;5;231;319;224;115;0,125; 
19; GPU ; MIS ;6;5;231;319;224;115;0,125; 
21; GPU ; MIS ;6;5;247;486;249;112;0,203; 
21; GPU ; MIS ;6;5;247;486;249;112;0,188; 
21; GPU ; MIS ;6;5;247;486;249;112;0,234; 
21; GPU ; MIS ;6;5;247;486;249;112;0,188; 
21; GPU ; MIS ;6;5;247;486;249;112;0,188; 
23; GPU ; MIS ;6;5;990;1258;964;496;0,531; 
23; GPU ; MIS ;6;5;990;1258;964;496;0,547; 
23; GPU ; MIS ;6;5;990;1258;964;496;0,562; 
23; GPU ; MIS ;6;5;990;1258;964;496;0,578; 
23; GPU ; MIS ;6;5;990;1258;964;496;0,547; 
25; GPU ; MIS ;6;5;8790;9815;8761;4543;4,531; 
25; GPU ; MIS ;6;5;8790;9815;8761;4543;4,547; 
25; GPU ; MIS ;6;5;8790;9815;8761;4543;4,573; 
25; GPU ; MIS ;6;5;8790;9815;8761;4543;4,701; 
25; GPU ; MIS ;6;5;8790;9815;8761;4543;4,547; 
27; GPU ; MIS ;7;5;15;35;11;8;0,015; 
27; GPU ; MIS ;7;5;15;35;11;8;0,016; 
27; GPU ; MIS ;7;5;15;35;11;8;0; 
27; GPU ; MIS ;7;5;15;35;11;8;0; 
27; GPU ; MIS ;7;5;15;35;11;8;0,015; 
29; GPU ; MIS ;7;5;197;250;183;100;0,109; 
29; GPU ; MIS ;7;5;197;250;183;100;0,11; 
29; GPU ; MIS ;7;5;197;250;183;100;0,109; 
29; GPU ; MIS ;7;5;197;250;183;100;0,109; 
29; GPU ; MIS ;7;5;197;250;183;100;0,141; 
31; GPU ; MIS ;7;5;269;399;243;130;0,172; 
31; GPU ; MIS ;7;5;269;399;243;130;0,156; 
31; GPU ; MIS ;7;5;269;399;243;130;0,172; 
31; GPU ; MIS ;7;5;269;399;243;130;0,156; 
31; GPU ; MIS ;7;5;269;399;243;130;0,141; 
33; GPU ; MIS ;7;5;480;670;436;232;0,281; 
33; GPU ; MIS ;7;5;480;670;436;232;0,266; 
33; GPU ; MIS ;7;5;480;670;436;232;0,281; 
33; GPU ; MIS ;7;5;480;670;436;232;0,281; 
33; GPU ; MIS ;7;5;480;670;436;232;0,266; 
35; GPU ; MIS ;7;5;543;727;528;264;0,297; 
35; GPU ; MIS ;7;5;543;727;528;264;0,312; 
35; GPU ; MIS ;7;5;543;727;528;264;0,328; 
35; GPU ; MIS ;7;5;543;727;528;264;0,297; 
35; GPU ; MIS ;7;5;543;727;528;264;0,313; 
37; GPU ; MIS ;7;5;1172;1627;1053;564;0,797; 
37; GPU ; MIS ;7;5;1172;1627;1053;564;0,656; 
37; GPU ; MIS ;7;5;1172;1627;1053;564;0,672; 
37; GPU ; MIS ;7;5;1172;1627;1053;564;0,676; 
37; GPU ; MIS ;7;5;1172;1627;1053;564;0,76; 
39; GPU ; MIS ;7;5;1912;2223;1891;1016;1,041; 
39; GPU ; MIS ;7;5;1912;2223;1891;1016;1,063; 
39; GPU ; MIS ;7;5;1912;2223;1891;1016;1,054; 
39; GPU ; MIS ;7;5;1912;2223;1891;1016;1,026; 
39; GPU ; MIS ;7;5;1912;2223;1891;1016;1,031; 
41; GPU ; MIS ;7;5;2382;2674;2378;1212;1,187; 
41; GPU ; MIS ;7;5;2382;2674;2378;1212;1,141; 
41; GPU ; MIS ;7;5;2382;2674;2378;1212;1,156; 
41; GPU ; MIS ;7;5;2382;2674;2378;1212;1,172; 
41; GPU ; MIS ;7;5;2382;2674;2378;1212;1,203; 
43; GPU ; MIS ;8;5;246;468;164;113;0,125; 
43; GPU ; MIS ;8;5;246;468;164;113;0,14; 
43; GPU ; MIS ;8;5;246;468;164;113;0,125; 
43; GPU ; MIS ;8;5;246;468;164;113;0,141; 
43; GPU ; MIS ;8;5;246;468;164;113;0,125; 
45; GPU ; MIS ;8;5;389;562;342;186;0,203; 
45; GPU ; MIS ;8;5;389;562;342;186;0,219; 
45; GPU ; MIS ;8;5;389;562;342;186;0,219; 
45; GPU ; MIS ;8;5;389;562;342;186;0,219; 
45; GPU ; MIS ;8;5;389;562;342;186;0,218; 
47; GPU ; MIS ;8;5;585;799;548;284;0,344; 
47; GPU ; MIS ;8;5;585;799;548;284;0,359; 
47; GPU ; MIS ;8;5;585;799;548;284;0,359; 
47; GPU ; MIS ;8;5;585;799;548;284;0,334; 
47; GPU ; MIS ;8;5;585;799;548;284;0,328; 
49; GPU ; MIS ;8;5;623;876;534;306;0,37; 
49; GPU ; MIS ;8;5;623;876;534;306;0,359; 
49; GPU ; MIS ;8;5;623;876;534;306;0,344; 
49; GPU ; MIS ;8;5;623;876;534;306;0,375; 
49; GPU ; MIS ;8;5;623;876;534;306;0,359; 
51; GPU ; MIS ;8;5;1416;1978;1283;682;0,813; 
51; GPU ; MIS ;8;5;1416;1978;1283;682;0,813; 
51; GPU ; MIS ;8;5;1416;1978;1283;682;0,859; 
51; GPU ; MIS ;8;5;1416;1978;1283;682;0,844; 
51; GPU ; MIS ;8;5;1416;1978;1283;682;0,801; 
53; GPU ; MIS ;9;5;181;289;138;83;0,094; 
53; GPU ; MIS ;9;5;181;289;138;83;0,109; 
53; GPU ; MIS ;9;5;181;289;138;83;0,115; 
53; GPU ; MIS ;9;5;181;289;138;83;0,099; 
53; GPU ; MIS ;9;5;181;289;138;83;0,109; 
55; GPU ; MIS ;9;5;233;431;155;107;0,14; 
55; GPU ; MIS ;9;5;233;431;155;107;0,125; 
55; GPU ; MIS ;9;5;233;431;155;107;0,141; 
55; GPU ; MIS ;9;5;233;431;155;107;0,125; 
55; GPU ; MIS ;9;5;233;431;155;107;0,125; 
57; GPU ; MIS ;9;5;245;454;149;112;0,141; 
57; GPU ; MIS ;9;5;245;454;149;112;0,14; 
57; GPU ; MIS ;9;5;245;454;149;112;0,141; 
57; GPU ; MIS ;9;5;245;454;149;112;0,172; 
57; GPU ; MIS ;9;5;245;454;149;112;0,125; 
59; GPU ; MIS ;9;5;560;870;427;258;0,297; 
59; GPU ; MIS ;9;5;560;870;427;258;0,318; 
59; GPU ; MIS ;9;5;560;870;427;258;0,333; 
59; GPU ; MIS ;9;5;560;870;427;258;0,344; 
59; GPU ; MIS ;9;5;560;870;427;258;0,328; 
61; GPU ; MIS ;9;5;528;1017;446;235;0,46; 
61; GPU ; MIS ;9;5;528;1017;446;235;0,515; 
61; GPU ; MIS ;9;5;528;1017;446;235;0,479; 
61; GPU ; MIS ;9;5;528;1017;446;235;0,453; 
61; GPU ; MIS ;9;5;528;1017;446;235;0,453; 
63; GPU ; MIS ;9;5;1214;1700;1071;593;0,75; 
63; GPU ; MIS ;9;5;1214;1700;1071;593;0,744; 
63; GPU ; MIS ;9;5;1214;1700;1071;593;0,724; 
63; GPU ; MIS ;9;5;1214;1700;1071;593;0,703; 
63; GPU ; MIS ;9;5;1214;1700;1071;593;0,688; 
65; GPU ; MIS ;9;5;2856;3641;2653;1419;1,593; 
65; GPU ; MIS ;9;5;2856;3641;2653;1419;1,675; 
65; GPU ; MIS ;9;5;2856;3641;2653;1419;1,62; 
65; GPU ; MIS ;9;5;2856;3641;2653;1419;1,552; 
65; GPU ; MIS ;9;5;2856;3641;2653;1419;1,556; 
67; GPU ; MIS ;10;5;200;370;190;100;0,228; 
67; GPU ; MIS ;10;5;200;370;190;100;0,204; 
67; GPU ; MIS ;10;5;200;370;190;100;0,218; 
67; GPU ; MIS ;10;5;200;370;190;100;0,188; 
67; GPU ; MIS ;10;5;200;370;190;100;0,216; 
69; GPU ; MIS ;10;5;200;370;190;100;0,187; 
69; GPU ; MIS ;10;5;200;370;190;100;0,188; 
69; GPU ; MIS ;10;5;200;370;190;100;0,187; 
69; GPU ; MIS ;10;5;200;370;190;100;0,188; 
69; GPU ; MIS ;10;5;200;370;190;100;0,188; 
71; GPU ; MIS ;10;5;339;522;269;159;0,187; 
71; GPU ; MIS ;10;5;339;522;269;159;0,188; 
71; GPU ; MIS ;10;5;339;522;269;159;0,187; 
71; GPU ; MIS ;10;5;339;522;269;159;0,178; 
71; GPU ; MIS ;10;5;339;522;269;159;0,188; 
73; GPU ; MIS ;10;5;262;740;235;169;0,396; 
73; GPU ; MIS ;10;5;262;740;235;169;0,443; 
73; GPU ; MIS ;10;5;262;740;235;169;0,39; 
73; GPU ; MIS ;10;5;262;740;235;169;0,407; 
73; GPU ; MIS ;10;5;262;740;235;169;0,406; 
75; GPU ; MIS ;10;5;557;1080;351;246;0,297; 
75; GPU ; MIS ;10;5;557;1080;351;246;0,291; 
75; GPU ; MIS ;10;5;557;1080;351;246;0,281; 
75; GPU ; MIS ;10;5;557;1080;351;246;0,282; 
75; GPU ; MIS ;10;5;557;1080;351;246;0,265; 
77; GPU ; MIS ;10;5;2413;3412;2214;1243;1,268; 
77; GPU ; MIS ;10;5;2413;3412;2214;1243;1,26; 
77; GPU ; MIS ;10;5;2413;3412;2214;1243;1,322; 
77; GPU ; MIS ;10;5;2413;3412;2214;1243;1,355; 
77; GPU ; MIS ;10;5;2413;3412;2214;1243;1,281; 
79; GPU ; MIS ;10;5;36415;145635;25210;19258;59,128; 
79; GPU ; MIS ;10;5;36415;145635;25210;19258;59,096; 
79; GPU ; MIS ;10;5;36415;145635;25210;19258;55,114; 
79; GPU ; MIS ;10;5;36415;145635;25210;19258;55,725; 
79; GPU ; MIS ;10;5;36415;145635;25210;19258;56,271; 
81; GPU ; MIS ;11;5;237;378;185;108;0,208; 
81; GPU ; MIS ;11;5;237;378;185;108;0,203; 
81; GPU ; MIS ;11;5;237;378;185;108;0,187; 
81; GPU ; MIS ;11;5;237;378;185;108;0,188; 
81; GPU ; MIS ;11;5;237;378;185;108;0,187; 
83; GPU ; MIS ;11;5;311;632;206;136;0,238; 
83; GPU ; MIS ;11;5;311;632;206;136;0,219; 
83; GPU ; MIS ;11;5;311;632;206;136;0,218; 
83; GPU ; MIS ;11;5;311;632;206;136;0,25; 
83; GPU ; MIS ;11;5;311;632;206;136;0,219; 
85; GPU ; MIS ;11;5;1274;1808;1177;603;0,781; 
85; GPU ; MIS ;11;5;1274;1808;1177;603;0,781; 
85; GPU ; MIS ;11;5;1274;1808;1177;603;0,812; 
85; GPU ; MIS ;11;5;1274;1808;1177;603;0,781; 
85; GPU ; MIS ;11;5;1274;1808;1177;603;0,781; 
87; GPU ; MIS ;11;5;1337;1933;1228;639;0,812; 
87; GPU ; MIS ;11;5;1337;1933;1228;639;0,859; 
87; GPU ; MIS ;11;5;1337;1933;1228;639;0,844; 
87; GPU ; MIS ;11;5;1337;1933;1228;639;0,859; 
87; GPU ; MIS ;11;5;1337;1933;1228;639;0,797; 
89; GPU ; MIS ;11;5;5829;7552;5533;2945;3,423; 
89; GPU ; MIS ;11;5;5829;7552;5533;2945;3,47; 
89; GPU ; MIS ;11;5;5829;7552;5533;2945;3,385; 
89; GPU ; MIS ;11;5;5829;7552;5533;2945;3,363; 
89; GPU ; MIS ;11;5;5829;7552;5533;2945;3,361; 
91; GPU ; MIS ;12;5;304;571;284;135;0,281; 
91; GPU ; MIS ;12;5;304;571;284;135;0,27; 
91; GPU ; MIS ;12;5;304;571;284;135;0,265; 
91; GPU ; MIS ;12;5;304;571;284;135;0,25; 
91; GPU ; MIS ;12;5;304;571;284;135;0,25; 
93; GPU ; MIS ;12;5;1001;1419;927;483;0,594; 
93; GPU ; MIS ;12;5;1001;1419;927;483;0,656; 
93; GPU ; MIS ;12;5;1001;1419;927;483;0,625; 
93; GPU ; MIS ;12;5;1001;1419;927;483;0,578; 
93; GPU ; MIS ;12;5;1001;1419;927;483;0,578; 
95; GPU ; MIS ;12;5;1335;1932;1217;636;0,859; 
95; GPU ; MIS ;12;5;1335;1932;1217;636;0,875; 
95; GPU ; MIS ;12;5;1335;1932;1217;636;0,859; 
95; GPU ; MIS ;12;5;1335;1932;1217;636;0,844; 
95; GPU ; MIS ;12;5;1335;1932;1217;636;0,859; 
97; GPU ; MIS ;12;5;2629;3793;2413;1254;1,765; 
97; GPU ; MIS ;12;5;2629;3793;2413;1254;1,735; 
97; GPU ; MIS ;12;5;2629;3793;2413;1254;1,75; 
97; GPU ; MIS ;12;5;2629;3793;2413;1254;1,735; 
97; GPU ; MIS ;12;5;2629;3793;2413;1254;1,812; 
99; GPU ; MIS ;13;5;1294;1853;1186;622;0,812; 
99; GPU ; MIS ;13;5;1294;1853;1186;622;0,828; 
99; GPU ; MIS ;13;5;1294;1853;1186;622;0,812; 
99; GPU ; MIS ;13;5;1294;1853;1186;622;0,797; 
99; GPU ; MIS ;13;5;1294;1853;1186;622;0,813; 
101; GPU ; MIS ;13;5;2778;4083;2528;1312;1,796; 
101; GPU ; MIS ;13;5;2778;4083;2528;1312;1,824; 
101; GPU ; MIS ;13;5;2778;4083;2528;1312;1,79; 
101; GPU ; MIS ;13;5;2778;4083;2528;1312;1,776; 
101; GPU ; MIS ;13;5;2778;4083;2528;1312;1,78; 
103; GPU ; MIS ;14;5;1055;1473;952;508;0,75; 
103; GPU ; MIS ;14;5;1055;1473;952;508;0,687; 
103; GPU ; MIS ;14;5;1055;1473;952;508;0,688; 
103; GPU ; MIS ;14;5;1055;1473;952;508;0,687; 
103; GPU ; MIS ;14;5;1055;1473;952;508;0,75; 
105; GPU ; MIS ;14;5;1408;2056;1286;680;0,96; 
105; GPU ; MIS ;14;5;1408;2056;1286;680;0,979; 
105; GPU ; MIS ;14;5;1408;2056;1286;680;0,937; 
105; GPU ; MIS ;14;5;1408;2056;1286;680;0,993; 
105; GPU ; MIS ;14;5;1408;2056;1286;680;0,933; 
107; GPU ; MIS ;15;5;160;240;145;85;0,14; 
107; GPU ; MIS ;15;5;160;240;145;85;0,156; 
107; GPU ; MIS ;15;5;160;240;145;85;0,157; 
107; GPU ; MIS ;15;5;160;240;145;85;0,156; 
107; GPU ; MIS ;15;5;160;240;145;85;0,14; 
109; GPU ; MIS ;15;5;257;515;220;113;0,219; 
109; GPU ; MIS ;15;5;257;515;220;113;0,219; 
109; GPU ; MIS ;15;5;257;515;220;113;0,218; 
109; GPU ; MIS ;15;5;257;515;220;113;0,219; 
109; GPU ; MIS ;15;5;257;515;220;113;0,219; 
111; GPU ; MIS ;15;5;2763;4038;2511;1312;1,884; 
111; GPU ; MIS ;15;5;2763;4038;2511;1312;1,948; 
111; GPU ; MIS ;15;5;2763;4038;2511;1312;1,844; 
111; GPU ; MIS ;15;5;2763;4038;2511;1312;1,89; 
111; GPU ; MIS ;15;5;2763;4038;2511;1312;1,813; 
113; GPU ; MIS ;16;5;80;160;64;36;0,125; 
113; GPU ; MIS ;16;5;80;160;64;36;0,109; 
113; GPU ; MIS ;16;5;80;160;64;36;0,109; 
113; GPU ; MIS ;16;5;80;160;64;36;0,125; 
113; GPU ; MIS ;16;5;80;160;64;36;0,11; 
115; GPU ; MIS ;16;5;243;497;200;105;0,234; 
115; GPU ; MIS ;16;5;243;497;200;105;0,234; 
115; GPU ; MIS ;16;5;243;497;200;105;0,235; 
115; GPU ; MIS ;16;5;243;497;200;105;0,25; 
115; GPU ; MIS ;16;5;243;497;200;105;0,218; 
117; GPU ; MIS ;16;5;398;788;337;173;0,36; 
117; GPU ; MIS ;16;5;398;788;337;173;0,359; 
117; GPU ; MIS ;16;5;398;788;337;173;0,328; 
117; GPU ; MIS ;16;5;398;788;337;173;0,368; 
117; GPU ; MIS ;16;5;398;788;337;173;0,328; 
119; GPU ; MIS ;16;5;678;1030;152;373;0,449; 
119; GPU ; MIS ;16;5;678;1030;152;373;0,468; 
119; GPU ; MIS ;16;5;678;1030;152;373;0,438; 
119; GPU ; MIS ;16;5;678;1030;152;373;0,422; 
119; GPU ; MIS ;16;5;678;1030;152;373;0,443; 
121; GPU ; MIS ;16;5;1005;1731;846;501;0,891; 
121; GPU ; MIS ;16;5;1005;1731;846;501;0,89; 
121; GPU ; MIS ;16;5;1005;1731;846;501;0,891; 
121; GPU ; MIS ;16;5;1005;1731;846;501;0,874; 
121; GPU ; MIS ;16;5;1005;1731;846;501;0,883; 
123; GPU ; MIS ;16;5;2762;4047;2516;1291;1,891; 
123; GPU ; MIS ;16;5;2762;4047;2516;1291;1,88; 
123; GPU ; MIS ;16;5;2762;4047;2516;1291;1,807; 
123; GPU ; MIS ;16;5;2762;4047;2516;1291;1,813; 
123; GPU ; MIS ;16;5;2762;4047;2516;1291;1,828; 
125; GPU ; MIS ;17;5;160;240;50;85;0,172; 
125; GPU ; MIS ;17;5;160;240;50;85;0,172; 
125; GPU ; MIS ;17;5;160;240;50;85;0,141; 
125; GPU ; MIS ;17;5;160;240;50;85;0,141; 
125; GPU ; MIS ;17;5;160;240;50;85;0,156; 
127; GPU ; MIS ;17;5;294;568;65;172;0,282; 
127; GPU ; MIS ;17;5;294;568;65;172;0,265; 
127; GPU ; MIS ;17;5;294;568;65;172;0,266; 
127; GPU ; MIS ;17;5;294;568;65;172;0,266; 
127; GPU ; MIS ;17;5;294;568;65;172;0,281; 
129; GPU ; MIS ;17;5;323;592;266;151;0,297; 
129; GPU ; MIS ;17;5;323;592;266;151;0,272; 
129; GPU ; MIS ;17;5;323;592;266;151;0,286; 
129; GPU ; MIS ;17;5;323;592;266;151;0,297; 
129; GPU ; MIS ;17;5;323;592;266;151;0,297; 
131; GPU ; MIS ;17;5;499;861;418;248;0,437; 
131; GPU ; MIS ;17;5;499;861;418;248;0,438; 
131; GPU ; MIS ;17;5;499;861;418;248;0,422; 
131; GPU ; MIS ;17;5;499;861;418;248;0,453; 
131; GPU ; MIS ;17;5;499;861;418;248;0,453; 
133; GPU ; MIS ;17;5;766;1535;649;329;0,672; 
133; GPU ; MIS ;17;5;766;1535;649;329;0,671; 
133; GPU ; MIS ;17;5;766;1535;649;329;0,657; 
133; GPU ; MIS ;17;5;766;1535;649;329;0,671; 
133; GPU ; MIS ;17;5;766;1535;649;329;0,657; 
135; GPU ; MIS ;17;5;2532;3615;516;1534;1,516; 
135; GPU ; MIS ;17;5;2532;3615;516;1534;1,525; 
135; GPU ; MIS ;17;5;2532;3615;516;1534;1,507; 
135; GPU ; MIS ;17;5;2532;3615;516;1534;1,518; 
135; GPU ; MIS ;17;5;2532;3615;516;1534;1,51; 
137; GPU ; MIS ;17;5;2676;3894;2444;1267;1,854; 
137; GPU ; MIS ;17;5;2676;3894;2444;1267;1,795; 
137; GPU ; MIS ;17;5;2676;3894;2444;1267;1,776; 
137; GPU ; MIS ;17;5;2676;3894;2444;1267;1,781; 
137; GPU ; MIS ;17;5;2676;3894;2444;1267;1,797; 
139; GPU ; MIS ;17;5;2984;4484;617;1792;1,921; 
139; GPU ; MIS ;17;5;2984;4484;617;1792;1,926; 
139; GPU ; MIS ;17;5;2984;4484;617;1792;1,904; 
139; GPU ; MIS ;17;5;2984;4484;617;1792;1,906; 
139; GPU ; MIS ;17;5;2984;4484;617;1792;1,922; 
141; GPU ; MIS ;18;5;294;618;246;122;0,313; 
141; GPU ; MIS ;18;5;294;618;246;122;0,296; 
141; GPU ; MIS ;18;5;294;618;246;122;0,297; 
141; GPU ; MIS ;18;5;294;618;246;122;0,312; 
141; GPU ; MIS ;18;5;294;618;246;122;0,297; 
143; GPU ; MIS ;18;5;388;815;313;165;0,422; 
143; GPU ; MIS ;18;5;388;815;313;165;0,421; 
143; GPU ; MIS ;18;5;388;815;313;165;0,407; 
143; GPU ; MIS ;18;5;388;815;313;165;0,422; 
143; GPU ; MIS ;18;5;388;815;313;165;0,406; 
145; GPU ; MIS ;18;5;437;838;368;199;0,484; 
145; GPU ; MIS ;18;5;437;838;368;199;0,485; 
145; GPU ; MIS ;18;5;437;838;368;199;0,484; 
145; GPU ; MIS ;18;5;437;838;368;199;0,484; 
145; GPU ; MIS ;18;5;437;838;368;199;0,469; 
147; GPU ; MIS ;18;5;564;1112;469;245;0,531; 
147; GPU ; MIS ;18;5;564;1112;469;245;0,547; 
147; GPU ; MIS ;18;5;564;1112;469;245;0,531; 
147; GPU ; MIS ;18;5;564;1112;469;245;0,531; 
147; GPU ; MIS ;18;5;564;1112;469;245;0,531; 
149; GPU ; MIS ;18;5;615;1232;519;270;0,578; 
149; GPU ; MIS ;18;5;615;1232;519;270;0,547; 
149; GPU ; MIS ;18;5;615;1232;519;270;0,547; 
149; GPU ; MIS ;18;5;615;1232;519;270;0,562; 
149; GPU ; MIS ;18;5;615;1232;519;270;0,573; 
151; GPU ; MIS ;19;5;314;650;63;170;0,39; 
151; GPU ; MIS ;19;5;314;650;63;170;0,401; 
151; GPU ; MIS ;19;5;314;650;63;170;0,375; 
151; GPU ; MIS ;19;5;314;650;63;170;0,391; 
151; GPU ; MIS ;19;5;314;650;63;170;0,375; 
153; GPU ; MIS ;19;5;670;1316;538;300;0,854; 
153; GPU ; MIS ;19;5;670;1316;538;300;0,828; 
153; GPU ; MIS ;19;5;670;1316;538;300;0,828; 
153; GPU ; MIS ;19;5;670;1316;538;300;0,828; 
153; GPU ; MIS ;19;5;670;1316;538;300;0,812; 
155; GPU ; MIS ;19;5;770;1383;634;379;0,797; 
155; GPU ; MIS ;19;5;770;1383;634;379;0,796; 
155; GPU ; MIS ;19;5;770;1383;634;379;0,781; 
155; GPU ; MIS ;19;5;770;1383;634;379;0,797; 
155; GPU ; MIS ;19;5;770;1383;634;379;0,793; 
157; GPU ; MIS ;19;5;938;1869;765;406;0,972; 
157; GPU ; MIS ;19;5;938;1869;765;406;0,966; 
157; GPU ; MIS ;19;5;938;1869;765;406;0,98; 
157; GPU ; MIS ;19;5;938;1869;765;406;0,994; 
157; GPU ; MIS ;19;5;938;1869;765;406;0,968; 
159; GPU ; MIS ;19;5;2865;4267;2605;1345;1,985; 
159; GPU ; MIS ;19;5;2865;4267;2605;1345;2,015; 
159; GPU ; MIS ;19;5;2865;4267;2605;1345;1,984; 
159; GPU ; MIS ;19;5;2865;4267;2605;1345;1,969; 
159; GPU ; MIS ;19;5;2865;4267;2605;1345;1,984; 
161; GPU ; MIS ;23;5;2502;6244;2383;1510;4,313; 
161; GPU ; MIS ;23;5;2502;6244;2383;1510;4,248; 
161; GPU ; MIS ;23;5;2502;6244;2383;1510;4,172; 
161; GPU ; MIS ;23;5;2502;6244;2383;1510;4,234; 
161; GPU ; MIS ;23;5;2502;6244;2383;1510;4,194; 
163; GPU ; MIS ;20;5;402;780;326;182;0,5; 
163; GPU ; MIS ;20;5;402;780;326;182;0,48; 
163; GPU ; MIS ;20;5;402;780;326;182;0,469; 
163; GPU ; MIS ;20;5;402;780;326;182;0,469; 
163; GPU ; MIS ;20;5;402;780;326;182;0,468; 
165; GPU ; MIS ;20;5;422;808;351;191;0,443; 
165; GPU ; MIS ;20;5;422;808;351;191;0,437; 
165; GPU ; MIS ;20;5;422;808;351;191;0,432; 
165; GPU ; MIS ;20;5;422;808;351;191;0,422; 
165; GPU ; MIS ;20;5;422;808;351;191;0,422; 
167; GPU ; MIS ;20;5;632;1087;539;314;0,61; 
167; GPU ; MIS ;20;5;632;1087;539;314;0,562; 
167; GPU ; MIS ;20;5;632;1087;539;314;0,563; 
167; GPU ; MIS ;20;5;632;1087;539;314;0,562; 
167; GPU ; MIS ;20;5;632;1087;539;314;0,578; 
169; GPU ; MIS ;20;5;720;1269;610;347;0,718; 
169; GPU ; MIS ;20;5;720;1269;610;347;0,704; 
169; GPU ; MIS ;20;5;720;1269;610;347;0,703; 
169; GPU ; MIS ;20;5;720;1269;610;347;0,703; 
169; GPU ; MIS ;20;5;720;1269;610;347;0,703; 
171; GPU ; MIS ;20;5;802;1553;671;370;0,734; 
171; GPU ; MIS ;20;5;802;1553;671;370;0,687; 
171; GPU ; MIS ;20;5;802;1553;671;370;0,703; 
171; GPU ; MIS ;20;5;802;1553;671;370;0,688; 
171; GPU ; MIS ;20;5;802;1553;671;370;0,746; 
173; GPU ; MIS ;20;5;788;1938;745;460;1,213; 
173; GPU ; MIS ;20;5;788;1938;745;460;1,203; 
173; GPU ; MIS ;20;5;788;1938;745;460;1,203; 
173; GPU ; MIS ;20;5;788;1938;745;460;1,25; 
173; GPU ; MIS ;20;5;788;1938;745;460;1,203; 
175; GPU ; MIS ;20;5;2397;3715;2122;1104;1,89; 
175; GPU ; MIS ;20;5;2397;3715;2122;1104;1,906; 
175; GPU ; MIS ;20;5;2397;3715;2122;1104;1,907; 
175; GPU ; MIS ;20;5;2397;3715;2122;1104;1,874; 
175; GPU ; MIS ;20;5;2397;3715;2122;1104;1,891; 
177; GPU ; MIS ;21;5;904;1806;745;396;1,203; 
177; GPU ; MIS ;21;5;904;1806;745;396;1,188; 
177; GPU ; MIS ;21;5;904;1806;745;396;1,171; 
177; GPU ; MIS ;21;5;904;1806;745;396;1,172; 
177; GPU ; MIS ;21;5;904;1806;745;396;1,188; 
179; GPU ; MIS ;22;5;752;1264;643;371;0,875; 
179; GPU ; MIS ;22;5;752;1264;643;371;0,859; 
179; GPU ; MIS ;22;5;752;1264;643;371;0,871; 
179; GPU ; MIS ;22;5;752;1264;643;371;0,839; 
179; GPU ; MIS ;22;5;752;1264;643;371;0,844; 
181; GPU ; MIS ;22;5;757;1493;140;454;1,521; 
181; GPU ; MIS ;22;5;757;1493;140;454;1,463; 
181; GPU ; MIS ;22;5;757;1493;140;454;1,469; 
181; GPU ; MIS ;22;5;757;1493;140;454;1,437; 
181; GPU ; MIS ;22;5;757;1493;140;454;1,453; 
183; GPU ; MIS ;22;5;838;1763;628;362;1,422; 
183; GPU ; MIS ;22;5;838;1763;628;362;1,416; 
183; GPU ; MIS ;22;5;838;1763;628;362;1,384; 
183; GPU ; MIS ;22;5;838;1763;628;362;1,422; 
183; GPU ; MIS ;22;5;838;1763;628;362;1,406; 
185; GPU ; MIS ;22;5;2834;4207;447;2001;3,203; 
185; GPU ; MIS ;22;5;2834;4207;447;2001;3,25; 
185; GPU ; MIS ;22;5;2834;4207;447;2001;3,234; 
185; GPU ; MIS ;22;5;2834;4207;447;2001;3,25; 
185; GPU ; MIS ;22;5;2834;4207;447;2001;3,249; 
187; GPU ; MIS ;23;5;529;1032;437;251;0,64; 
187; GPU ; MIS ;23;5;529;1032;437;251;0,635; 
187; GPU ; MIS ;23;5;529;1032;437;251;0,625; 
187; GPU ; MIS ;23;5;529;1032;437;251;0,625; 
187; GPU ; MIS ;23;5;529;1032;437;251;0,614; 
189; GPU ; MIS ;24;5;467;896;393;209;0,807; 
189; GPU ; MIS ;24;5;467;896;393;209;0,75; 
189; GPU ; MIS ;24;5;467;896;393;209;0,75; 
189; GPU ; MIS ;24;5;467;896;393;209;0,75; 
189; GPU ; MIS ;24;5;467;896;393;209;0,765; 
191; GPU ; MIS ;25;5;5096;8105;711;3548;19,006; 
191; GPU ; MIS ;25;5;5096;8105;711;3548;18,992; 
191; GPU ; MIS ;25;5;5096;8105;711;3548;18,986; 
191; GPU ; MIS ;25;5;5096;8105;711;3548;18,994; 
191; GPU ; MIS ;25;5;5096;8105;711;3548;18,984; 
193; GPU ; MIS ;26;5;1848;3286;1528;888;3,916; 
193; GPU ; MIS ;26;5;1848;3286;1528;888;3,901; 
193; GPU ; MIS ;26;5;1848;3286;1528;888;3,909; 
193; GPU ; MIS ;26;5;1848;3286;1528;888;3,877; 
193; GPU ; MIS ;26;5;1848;3286;1528;888;3,89; 
195; GPU ; MIS ;27;5;1724;2975;1455;829;4,63; 
195; GPU ; MIS ;27;5;1724;2975;1455;829;4,596; 
195; GPU ; MIS ;27;5;1724;2975;1455;829;4,608; 
195; GPU ; MIS ;27;5;1724;2975;1455;829;4,588; 
195; GPU ; MIS ;27;5;1724;2975;1455;829;4,594; 
197; GPU ; MIS ;28;5;6128;15264;5894;-1;8,163; 
197; GPU ; MIS ;28;5;6128;15264;5894;-1;0; 
197; GPU ; MIS ;28;5;6128;15264;5894;-1;8,194; 
197; GPU ; MIS ;28;5;6128;15264;5894;-1;0; 
197; GPU ; MIS ;28;5;6128;15264;5894;-1;8,183; 
199; GPU ; MIS ;36;5;1011;2010;796;-1;0; 
199; GPU ; MIS ;36;5;1011;2010;796;-1;3,084; 
199; GPU ; MIS ;36;5;1011;2010;796;-1;0; 
199; GPU ; MIS ;36;5;1011;2010;796;-1;3,174; 
199; GPU ; MIS ;36;5;1011;2010;796;-1;0; 
