%YAML 1.1
%TAG !u! tag:unity3d.com,2011:
--- !u!114 &11400000
MonoBehaviour:
  m_ObjectHideFlags: 0
  m_CorrespondingSourceObject: {fileID: 0}
  m_PrefabInstance: {fileID: 0}
  m_PrefabAsset: {fileID: 0}
  m_GameObject: {fileID: 0}
  m_Enabled: 1
  m_EditorHideFlags: 0
  m_Script: {fileID: 11500000, guid: 6d659ed10f080ea468cdd2ad2b1dfb41, type: 3}
  m_Name: TerrainSettings
  m_EditorClassIdentifier: 
  initLandSize: 0
  numSubdivisions: 0
  agentOverlapRatio: 0
  numInitAgents: 0
  numTokensStart: 0
  numPeninsulas: 0
  numPeninPathPoints: 0
  pointDistance: 0
  numAgentTokens: 0
  pathAngleVariation: 0
  agentAngleVariation: 0
