2
3
6
45, 50, 1, 5
21, 25, 2, 5
35, 41, 2, 5
29, 35, 2, 4
19, 24, 1, 5
53, 58, 0, 4
57, 62, 2, 5
17, 23, 2, 4
55, 60, 0, 5
51, 54, 2, 4
5, 11, 0, 5
46, 52, 2, 4
56, 60, 1, 4
56, 62, 1, 5
28, 33, 0, 4
18, 24, 0, 4
37, 41, 0, 5
10, 16, 2, 5
55, 59, 1, 5
11, 16, 1, 4
x