1
3
4
12, 22, 14, 8
10, 19, 0, 5
12, 18, 5, 5
5, 12, 1, 8
14, 26, 8, 8
13, 24, 3, 8
7, 13, 4, 6
7, 17, 13, 7
21, 29, 8, 7
13, 18, 8, 7
19, 29, 1, 6
22, 30, 7, 6
17, 30, 1, 6
14, 21, 0, 5
24, 31, 11, 6
17, 23, 11, 6
23, 37, 6, 7
22, 36, 2, 6
32, 39, 9, 7
22, 32, 13, 6
33, 40, 11, 5
28, 35, 14, 7
33, 39, 0, 8
36, 47, 7, 6
25, 32, 0, 6
10, 15, 3, 8
4, 20, 4, 9
15, 20, 3, 5
0, 10, 0, 10
10, 15, 11, 9
2, 5, 3, 9
1, 2, 10, 15
20, 22, 0, 6
4, 8, 4, 8
0, 100, 0, 100
x