1;1;1;4734
1;1;2;25188
1;1;3;28899
1;1;4;1854
1;1;5;3223
1;1;6;33236
1;1;7;358
1;1;8;2836
1;1;9;7772
1;1;10;21335
1;1;11;31020
1;1;12;2688
1;1;13;361
1;1;14;33346
1;1;15;7774
1;1;16;363
1;1;17;23728
1;1;18;33666
1;1;19;34672
1;1;20;2839
1;1;21;1594
1;1;22;4842
1;1;23;28495
1;1;24;2699
1;1;25;6498
1;1;26;4579
1;1;27;1726
1;1;28;15767
1;1;29;22184
1;1;30;24043
1;1;31;1212
1;1;32;30026
1;1;33;114
1;1;34;28516
1;1;35;27965
1;1;36;23596
1;1;37;22704
1;1;38;5209
1;1;39;26515
1;1;40;16575
1;1;41;29032
1;1;42;16908
1;1;43;4782
1;1;44;15074
1;1;45;21343
1;1;46;33686
1;1;47;7492
1;1;48;2500
1;1;49;26836
1;1;50;4825
1;1;51;30730
1;1;52;3219
1;1;53;406
1;1;54;6771
1;1;55;20215
1;1;56;25213
1;1;57;16919
1;1;58;28784
1;1;59;32774
1;1;60;5226
1;1;61;5215
1;1;62;8365
1;1;63;23810
1;1;64;6168
1;1;65;5053
1;1;66;795
1;1;67;4631
1;1;68;27327
1;1;69;33532
1;1;70;2091
1;1;71;4845
1;1;72;6587
1;1;73;8418
1;1;74;5232
1;1;75;4800
1;1;76;892
1;1;77;4907
1;1;78;4851
1;1;79;4852
1;1;80;5131
1;1;81;32823
1;1;82;31661
1;1;83;31663
1;1;84;0
1;1;85;4926
1;1;86;32813
1;1;87;34582
1;1;88;4814
1;1;89;4858
1;1;90;5037
1;1;91;4878
1;1;92;34288
1;1;93;5139
1;1;94;19000
1;1;95;661
1;1;96;972
1;1;97;29175
1;1;98;1188
1;1;99;24118
1;1;100;33104
1;1;101;7753
1;1;102;4234
1;1;103;15911
1;1;104;27700
1;1;105;839
1;1;106;7747
1;1;107;1602
1;1;108;31151
1;1;109;1040
1;1;110;25745
1;1;111;16132
1;1;112;31183
1;1;113;34814
1;1;114;29342
1;1;115;936
1;1;116;4201
1;1;117;22751
1;1;118;30812
1;1;119;6828
1;1;120;24882
1;1;121;2456
1;1;122;5882
1;1;123;3348
1;1;124;27365
1;1;125;30165
1;1;126;1012
1;1;127;1221
1;1;128;32895
1;1;129;8131
1;1;130;7979
1;1;131;23037
1;1;132;5970
1;1;133;31441
1;1;134;7137
1;1;135;8269
1;1;136;25341
1;1;137;8233
1;1;138;8033
1;1;139;32168
1;1;140;835
1;1;141;17379
1;1;142;29087
1;1;143;23890
1;1;144;7646
1;1;145;7374
1;1;146;22483
1;1;147;4487
1;1;148;7720
1;1;149;7505
1;1;150;27692
1;1;151;508
1;1;152;20412
1;1;153;817
1;1;154;34424
1;1;155;701
1;1;156;642
1;1;157;8188
1;1;158;31323
1;1;159;5473
1;1;160;960
1;1;161;7424
1;1;162;27100
1;1;163;24389
1;1;164;880
1;1;165;32109
1;1;166;1669
1;1;167;1378
1;1;168;747
1;1;169;811
1;1;170;23955
1;1;171;23880
1;1;172;16093
1;1;173;17665
1;1;174;7070
1;1;175;1731
1;1;176;23990
1;1;177;34306
1;1;178;1013
1;1;179;935
1;1;180;7083
1;1;181;21094
1;1;182;3333
1;1;183;33904
1;1;184;7133
1;1;185;2741
1;1;186;20328
1;1;187;7694
1;1;188;32694
1;1;189;0
1;2;1;34762
1;2;2;20690
1;2;3;7941
1;2;4;16580
1;2;5;5204
1;2;6;4985
1;2;7;28315
1;2;8;4773
1;2;9;5141
1;2;10;6316
1;2;11;5111
1;2;12;4831
1;2;13;22296
1;2;14;32568
1;2;15;4775
1;2;16;19546
1;2;17;8368
1;2;18;20231
1;2;19;30809
1;2;20;1625
1;2;21;15272
1;2;22;4981
1;2;23;4801
1;2;24;5190
1;2;25;4857
1;2;26;5105
1;2;27;4824
1;2;28;29035
1;2;29;5140
1;2;30;30528
1;2;31;5170
1;2;32;4955
1;2;33;5175
1;2;34;4945
1;2;35;5239
1;2;36;5176
1;2;37;5983
1;2;38;4957
1;2;39;4772
1;2;40;29250
1;2;41;5832
1;2;42;8412
1;2;43;5058
1;2;44;5144
1;2;45;4608
1;2;46;5152
1;2;47;5571
1;2;48;5107
1;2;49;2334
1;2;50;19087
1;2;51;28125
1;2;52;5109
1;2;53;19155
1;2;54;5061
1;2;55;6359
1;2;56;4991
1;2;57;19377
1;2;58;5116
1;2;59;1959
1;2;60;7480
1;2;61;5039
1;2;62;34121
1;2;63;17907
1;2;64;6147
1;2;65;5012
1;2;66;5159
1;2;67;8141
1;2;68;30152
1;2;69;15760
1;2;70;4934
1;2;71;122
1;2;72;25969
1;2;73;33211
1;2;74;4838
1;2;75;19697
1;2;76;25678
1;2;77;4752
1;2;78;34219
1;2;79;5351
1;2;80;4970
1;2;81;5201
1;2;82;4804
1;2;83;30370
1;2;84;31679
1;2;85;30969
1;2;86;6888
1;2;87;1805
1;2;88;2757
1;2;89;15142
1;2;90;1745
1;2;91;2306
1;2;92;1764
1;2;93;2707
1;2;94;5555
1;2;95;1734
1;2;96;1727
1;2;97;7740
1;2;98;1755
1;2;99;4796
1;2;100;20010
1;2;101;1760
1;2;102;2698
1;2;103;4896
1;2;104;4797
1;2;105;26054
1;2;106;1895
1;2;107;32601
1;2;108;5049
1;2;109;22342
1;2;110;0
1;2;111;4524
1;2;112;5080
1;2;113;5856
1;2;114;5219
1;2;115;23070
1;2;116;4748
1;2;117;5166
1;2;118;1771
1;2;119;15426
1;2;120;1824
1;2;121;17095
1;2;122;1772
1;2;123;6865
1;2;124;2621
1;2;125;6249
1;2;126;32606
1;2;127;30229
1;2;128;4911
1;2;129;32102
1;2;130;5092
1;2;131;5362
1;2;132;5189
1;2;133;1728
1;2;134;4958
1;2;135;29509
1;2;136;2316
1;2;137;4753
1;2;138;15458
1;2;139;4350
1;2;140;5015
1;2;141;4879
1;2;142;5005
1;2;143;895
1;2;144;5224
1;2;145;34910
1;2;146;26079
1;2;147;18
1;2;148;4763
1;2;149;7953
1;2;150;28819
1;2;151;3003
1;2;152;24120
1;2;153;4798
1;2;154;34679
1;2;155;5339
1;2;156;15940
1;2;157;2300
1;2;158;7308
1;2;159;15825
1;2;160;32285
1;2;161;31548
1;2;162;4903
1;2;163;5052
1;2;164;5050
1;2;165;5127
1;2;166;7541
1;2;167;6603
1;2;168;4766
1;2;169;2697
1;2;170;898
1;2;171;5861
1;2;172;5146
1;2;173;25100
1;2;174;24125
1;2;175;5011
1;2;176;1826
1;2;177;8327
1;2;178;4755
1;2;179;338
1;2;180;4895
1;2;181;4816
1;2;182;30238
1;2;183;6272
1;2;184;1876
1;2;185;1875
1;2;186;5564
1;2;187;5142
1;2;188;31913
1;2;189;5082
1;2;190;6144
1;2;191;16697
1;2;192;6136
1;2;193;26064
1;2;194;5178
1;2;195;4783
1;2;196;1739
1;2;197;5550
1;2;198;1751
1;2;199;8414
1;2;200;32559
1;2;201;7300
1;2;202;17262
1;2;203;25860
1;2;204;1995
1;2;205;30875
1;2;206;1888
1;2;207;5093
1;2;208;576
1;2;209;30968
1;2;210;30710
1;2;211;2314
1;2;212;29895
1;2;213;0
1;3;1;33666
1;3;2;1374
1;3;3;24021
1;3;4;7617
1;3;5;6340
1;3;6;4774
1;3;7;19836
1;3;8;5063
1;3;9;3140
1;3;10;4746
1;3;11;4950
1;3;12;4767
1;3;13;603
1;3;14;21967
1;3;15;31267
1;3;16;32809
1;3;17;28082
1;3;18;31658
1;3;19;5542
1;3;20;31661
1;3;21;6503
1;3;22;31663
1;3;23;34458
1;3;24;2627
1;3;25;26241
1;3;26;2184
1;3;27;2682
1;3;28;4935
1;3;29;3292
1;3;30;6315
1;3;31;4749
1;3;32;1903
1;3;33;4974
1;3;34;8361
1;3;35;2680
1;3;36;20512
1;3;37;18872
1;3;38;4235
1;3;39;2100
1;3;40;1585
1;3;41;7309
1;3;42;4829
1;3;43;5205
1;3;44;4823
1;3;45;4949
1;3;46;4815
1;3;47;32538
1;3;48;30872
1;3;49;1774
1;3;50;32560
1;3;51;730
1;3;52;19473
1;3;53;7370
1;3;54;7365
1;3;55;16960
1;3;56;7371
1;3;57;26248
1;3;58;7372
1;3;59;7373
1;3;60;887
1;3;61;21179
1;3;62;969
1;3;63;909
1;3;64;6129
1;3;65;317
1;3;66;33203
1;3;67;27189
1;3;68;907
1;3;69;908
1;3;70;875
1;3;71;4986
1;3;72;4910
1;3;73;2949
1;3;74;4987
1;3;75;31461
1;3;76;5202
1;3;77;3205
1;3;78;17201
1;3;79;29921
1;3;80;4992
1;3;81;5929
1;3;82;5128
1;3;83;4988
1;3;84;5407
1;3;85;1758
1;3;86;5055
1;3;87;4740
1;3;88;1407
1;3;89;22171
1;3;90;28289
1;3;91;4875
1;3;92;1732
1;3;93;4978
1;3;94;5006
1;3;95;5056
1;3;96;5004
1;3;97;6809
1;3;98;5018
1;3;99;5017
1;3;100;6224
1;3;101;27613
1;3;102;24162
1;3;103;31898
1;3;104;4780
1;3;105;5888
1;3;106;5010
1;3;107;0
1;3;108;32889
1;3;109;28825
1;3;110;7161
1;3;111;33849
1;3;112;5038
1;3;113;5804
1;3;114;3018
1;3;115;8211
1;3;116;6010
1;3;117;3349
1;3;118;7104
1;3;119;820
1;3;120;8413
1;3;121;6289
1;3;122;325
1;3;123;5126
1;3;124;5114
1;3;125;2832
1;3;126;5048
1;3;127;8319
1;3;128;1601
1;3;129;6395
1;3;130;15487
1;3;131;24078
1;3;132;8030
1;3;133;5636
1;3;134;33024
1;3;135;34878
1;3;136;4977
1;3;137;1181
1;3;138;6887
1;3;139;4956
1;3;140;4751
1;3;141;5787
1;3;142;1663
1;3;143;29266
1;3;144;4750
1;3;145;6286
1;3;146;2353
1;3;147;8410
1;3;148;5729
1;3;149;4994
1;3;150;19987
1;3;151;29730
1;3;152;4844
1;3;153;17969
1;3;154;8244
1;3;155;5097
1;3;156;4969
1;3;157;2539
1;3;158;6925
1;3;159;7211
1;3;160;31279
1;3;161;4884
1;3;162;6217
1;3;163;5009
1;3;164;34739
1;3;165;32702
1;3;166;0
1;4;1;33236
1;4;2;23728
1;4;3;6587
1;4;4;919
1;4;5;34909
1;4;6;32109
1;4;7;21094
1;4;8;2741
1;4;9;7646
1;4;10;1335
1;4;11;5793
1;4;12;697
1;4;13;8497
1;4;14;1272
1;4;15;1278
1;4;16;31961
1;4;17;26862
1;4;18;24295
1;4;19;33926
1;4;20;26706
1;4;21;30365
1;4;22;1211
1;4;23;933
1;4;24;4618
1;4;25;851
1;4;26;1506
1;4;27;34366
1;4;28;1273
1;4;29;2939
1;4;30;29885
1;4;31;26190
1;4;32;26401
1;4;33;31156
1;4;34;30825
1;4;35;1332
1;4;36;1312
1;4;37;33162
1;4;38;6360
1;4;39;20255
1;4;40;2516
1;4;41;1268
1;4;42;5036
1;4;43;29893
1;4;44;1267
1;4;45;24358
1;4;46;32864
1;4;47;1255
1;4;48;1066
1;4;49;30089
1;4;50;32973
1;4;51;891
1;4;52;34050
1;4;53;1254
1;4;54;1334
1;4;55;17541
1;4;56;3134
1;4;57;785
1;4;58;1264
1;4;59;24044
1;4;60;24046
1;4;61;31900
1;4;62;24461
1;4;63;1256
1;4;64;24294
1;4;65;5679
1;4;66;31904
1;4;67;20963
1;4;68;18006
1;4;69;18009
1;4;70;25465
1;4;71;21300
1;4;72;8331
1;4;73;22147
1;4;74;1269
1;4;75;1280
1;4;76;31136
1;4;77;16326
1;4;78;1957
1;4;79;25082
1;4;80;203
1;4;81;204
1;4;82;205
1;4;83;24322
1;4;84;6912
1;4;85;30242
1;4;86;4367
1;4;87;33954
1;4;88;29204
1;4;89;256
1;4;90;29246
1;4;91;15168
1;4;92;0
1;4;93;4088
1;4;94;6169
1;4;95;6863
1;4;96;2593
1;4;97;29744
1;4;98;4454
1;4;99;28198
1;4;100;1018
1;4;101;8333
1;4;102;34504
1;4;103;1590
1;4;104;3045
1;4;105;28007
1;4;106;30149
1;4;107;6654
1;4;108;20419
1;4;109;2714
1;4;110;751
1;4;111;1083
1;4;112;23852
1;4;113;1924
1;4;114;24449
1;4;115;28517
1;4;116;21297
1;4;117;2094
1;4;118;22771
1;4;119;30383
1;4;120;3141
1;4;121;26265
1;4;122;778
1;4;123;688
1;4;124;1041
1;4;125;882
1;4;126;1068
1;4;127;1337
1;4;128;31025
1;4;129;1189
1;4;130;31833
1;4;131;17957
1;4;132;31517
1;4;133;30863
1;4;134;27158
1;4;135;17714
1;4;136;24229
1;4;137;7184
1;4;138;16062
1;4;139;8435
1;4;140;30075
1;4;141;3197
1;4;142;23086
1;4;143;19168
1;4;144;6274
1;4;145;4359
1;4;146;0
1;5;1;33666
1;5;2;31661
1;5;3;31663
1;5;4;31658
1;5;5;34762
1;5;6;5878
1;5;7;996
1;5;8;18967
1;5;9;30164
1;5;10;1303
1;5;11;31152
1;5;12;15180
1;5;13;34612
1;5;14;7980
1;5;15;16759
1;5;16;30824
1;5;17;34669
1;5;18;8363
1;5;19;1015
1;5;20;1064
1;5;21;1065
1;5;22;881
1;5;23;3308
1;5;24;27137
1;5;25;29626
1;5;26;850
1;5;27;808
1;5;28;934
1;5;29;1085
1;5;30;1069
1;5;31;844
1;5;32;30382
1;5;33;1223
1;5;34;930
1;5;35;162
1;5;36;7097
1;5;37;23922
1;5;38;733
1;5;39;18837
1;5;40;34486
1;5;41;812
1;5;42;7009
1;5;43;33996
1;5;44;956
1;5;45;1522
1;5;46;8272
1;5;47;8584
1;5;48;1043
1;5;49;7709
1;5;50;24047
1;5;51;25908
1;5;52;27465
1;5;53;26414
1;5;54;14930
1;5;55;18835
1;5;56;29647
1;5;57;7610
1;5;58;26243
1;5;59;30157
1;5;60;34544
1;5;61;1518
1;5;62;4319
1;5;63;883
1;5;64;789
1;5;65;20533
1;5;66;859
1;5;67;1241
1;5;68;766
1;5;69;32096
1;5;70;6260
1;5;71;31588
1;5;72;23106
1;5;73;24705
1;5;74;1246
1;5;75;1247
1;5;76;18887
1;5;77;4779
1;5;78;15945
1;5;79;16673
1;5;80;1084
1;5;81;1336
1;5;82;22253
1;5;83;5792
1;5;84;29975
1;5;85;2483
1;5;86;8971
1;5;87;0
1;5;88;5788
1;5;89;32778
1;5;90;20793
1;5;91;4904
1;5;92;25195
1;5;93;21701
1;5;94;3046
1;5;95;21276
1;5;96;21807
1;5;97;20621
1;5;98;33425
1;5;99;31023
1;5;100;5221
1;5;101;7740
1;5;102;2306
1;5;103;7308
1;5;104;24120
1;5;105;7953
1;5;106;4763
1;5;107;26079
1;5;108;18
1;5;109;34841
1;5;110;16607
1;5;111;24306
1;5;112;7355
1;5;113;7357
1;5;114;7359
1;5;115;32946
1;5;116;8607
1;5;117;24528
1;5;118;2191
1;5;119;31469
1;5;120;0
2;1;1;31658
2;1;2;2188
2;1;3;8202
2;1;4;24180
2;1;5;25920
2;1;6;562
2;1;7;30375
2;1;8;5682
2;1;9;1934
2;1;10;449
2;1;11;33947
2;1;12;7314
2;1;13;26046
2;1;14;537
2;1;15;573
2;1;16;1517
2;1;17;2740
2;1;18;6248
2;1;19;4354
2;1;20;25262
2;1;21;622
2;1;22;7237
2;1;23;768
2;1;24;23110
2;1;25;584
2;1;26;7714
2;1;27;6478
2;1;28;23155
2;1;29;550
2;1;30;572
2;1;31;27124
2;1;32;2862
2;1;33;7618
2;1;34;8290
2;1;35;30814
2;1;36;526
2;1;37;25776
2;1;38;30815
2;1;39;538
2;1;40;1324
2;1;41;7072
2;1;42;34199
2;1;43;30411
2;1;44;33976
2;1;45;7437
2;1;46;32127
2;1;47;15631
2;1;48;1720
2;1;49;23795
2;1;50;5303
2;1;51;34593
2;1;52;2212
2;1;53;0
2;1;54;767
2;1;55;32562
2;1;56;25248
2;1;57;552
2;1;58;2259
2;1;59;7040
2;1;60;28061
2;1;61;620
2;1;62;6955
2;1;63;7316
2;1;64;8201
2;1;65;7477
2;1;66;34646
2;1;67;34650
2;1;68;23726
2;1;69;1067
2;1;70;31188
2;1;71;7011
2;1;72;32735
2;1;73;7730
2;1;74;5264
2;1;75;1155
2;1;76;7315
2;1;77;22825
2;1;78;624
2;1;79;1017
2;1;80;574
2;1;81;571
2;1;82;1000
2;1;83;32876
2;1;84;33206
2;1;85;32300
2;1;86;1583
2;1;87;15674
2;1;88;19375
2;1;89;5229
2;1;90;8234
2;1;91;141
2;1;92;1007
2;1;93;1174
2;1;94;23391
2;1;95;1213
2;1;96;7791
2;1;97;783
2;1;98;30657
2;1;99;7430
2;1;100;3295
2;1;101;997
2;1;102;4337
2;1;103;33840
2;1;104;25584
2;1;105;33781
2;1;106;2652
2;1;107;1063
2;1;108;7472
2;1;109;23702
2;1;110;4358
2;1;111;6139
2;1;112;853
2;1;113;3357
2;1;114;5791
2;1;115;2728
2;1;116;1255
2;1;117;1268
2;1;118;5036
2;1;119;33985
2;1;120;31156
2;1;121;28007
2;1;122;836
2;1;123;205
2;1;124;1603
2;1;125;32711
2;1;126;33070
2;1;127;18720
2;1;128;5297
2;1;129;27958
2;1;130;143
2;1;131;1228
2;1;132;16661
2;1;133;0
2;2;1;7357
2;2;2;7355
2;2;3;7359
2;2;4;24306
2;2;5;33827
2;2;6;26070
2;2;7;804
2;2;8;15265
2;2;9;20453
2;2;10;20457
2;2;11;1246
2;2;12;1247
2;2;13;33002
2;2;14;2241
2;2;15;3330
2;2;16;32079
2;2;17;1638
2;2;18;31801
2;2;19;4736
2;2;20;1230
2;2;21;1599
2;2;22;23621
2;2;23;1179
2;2;24;885
2;2;25;5344
2;2;26;28702
2;2;27;3322
2;2;28;23160
2;2;29;6895
2;2;30;5553
2;2;31;23456
2;2;32;4153
2;2;33;28022
2;2;34;753
2;2;35;18283
2;2;36;1178
2;2;37;34684
2;2;38;8316
2;2;39;32681
2;2;40;34111
2;2;41;5532
2;2;42;32386
2;2;43;6064
2;2;44;577
2;2;45;32261
2;2;46;32370
2;2;47;5773
2;2;48;31750
2;2;49;5794
2;2;50;34343
2;2;51;30440
2;2;52;27561
2;2;53;33951
2;2;54;25543
2;2;55;1605
2;2;56;17733
2;2;57;6181
2;2;58;6270
2;2;59;20844
2;2;60;3209
2;2;61;19441
2;2;62;26317
2;2;63;24822
2;2;64;26558
2;2;65;24042
2;2;66;5296
2;2;67;2511
2;2;68;29892
2;2;69;121
2;2;70;4576
2;2;71;33071
2;2;72;8983
2;2;73;6322
2;2;74;34611
2;2;75;6428
2;2;76;2346
2;2;77;33
2;2;78;32245
2;2;79;395
2;2;80;25704
2;2;81;24330
2;2;82;18963
2;2;83;4318
2;2;84;6321
2;2;85;0
2;2;86;2191
2;2;87;7706
2;2;88;25586
2;2;89;19770
2;2;90;948
2;2;91;950
2;2;92;26763
2;2;93;24590
2;2;94;984
2;2;95;5185
2;2;96;34331
2;2;97;1526
2;2;98;24164
2;2;99;25505
2;2;100;8409
2;2;101;3115
2;2;102;28546
2;2;103;6094
2;2;104;1139
2;2;105;846
2;2;106;949
2;2;107;23862
2;2;108;5762
2;2;109;21839
2;2;110;6813
2;2;111;4881
2;2;112;32950
2;2;113;927
2;2;114;1008
2;2;115;32985
2;2;116;658
2;2;117;33226
2;2;118;33306
2;2;119;29598
2;2;120;9490
2;2;121;32776
2;2;122;19186
2;2;123;7226
2;2;124;28367
2;2;125;21589
2;2;126;18996
2;2;127;651
2;2;128;5927
2;2;129;2840
2;2;130;6378
2;2;131;28985
2;2;132;15031
2;2;133;33513
2;2;134;29399
2;2;135;29398
2;2;136;23590
2;2;137;14927
2;2;138;15958
2;2;139;0
2;3;1;4357
2;3;2;4328
2;3;3;26373
2;3;4;4333
2;3;5;32245
2;3;6;8492
2;3;7;7867
2;3;8;932
2;3;9;6255
2;3;10;21147
2;3;11;33991
2;3;12;30199
2;3;13;29911
2;3;14;5298
2;3;15;31905
2;3;16;941
2;3;17;18715
2;3;18;696
2;3;19;962
2;3;20;942
2;3;21;597
2;3;22;644
2;3;23;964
2;3;24;24119
2;3;25;25743
2;3;26;951
2;3;27;1005
2;3;28;7205
2;3;29;23982
2;3;30;4721
2;3;31;940
2;3;32;23988
2;3;33;8369
2;3;34;34389
2;3;35;28987
2;3;36;28043
2;3;37;32952
2;3;38;8669
2;3;39;4953
2;3;40;32746
2;3;41;5908
2;3;42;943
2;3;43;4340
2;3;44;15093
2;3;45;2340
2;3;46;19950
2;3;47;981
2;3;48;33953
2;3;49;993
2;3;50;5576
2;3;51;24257
2;3;52;1200
2;3;53;2524
2;3;54;31051
2;3;55;952
2;3;56;944
2;3;57;30934
2;3;58;31189
2;3;59;32949
2;3;60;33003
2;3;61;30190
2;3;62;34825
2;3;63;30218
2;3;64;30243
2;3;65;30352
2;3;66;34197
2;3;67;30186
2;3;68;30160
2;3;69;30351
2;3;70;29943
2;3;71;25649
2;3;72;946
2;3;73;33839
2;3;74;945
2;3;75;1640
2;3;76;843
2;3;77;1566
2;3;78;4334
2;3;79;3238
2;3;80;21064
2;3;81;809
2;3;82;24163
2;3;83;810
2;3;84;3329
2;3;85;18716
2;3;86;16472
2;3;87;22341
2;3;88;865
2;3;89;33318
2;3;90;31027
2;3;91;1184
2;3;92;1010
2;3;93;30758
2;3;94;17439
2;3;95;33740
2;3;96;29973
2;3;97;9016
2;3;98;31047
2;3;99;890
2;3;100;23876
2;3;101;959
2;3;102;958
2;3;103;0
2;4;1;2188
2;4;2;26046
2;4;3;34646
2;4;4;34650
2;4;5;23726
2;4;6;15674
2;4;7;32245
2;4;8;0
2;5;1;868
2;5;2;32079
2;5;3;14927
2;5;4;31750
2;5;5;32245
2;5;6;33
2;5;7;8444
2;5;8;33226
2;5;9;33306
2;5;10;28546
2;5;11;31485
2;5;12;0