OFF
1440 1596 0
-0.0915289259 0.2624633779 -0.0555697534
-0.2804299579 0.2144178903 0.0519460234
-0.2804434496 0.2138324005 -0.0259559942
0.3760699277 0.0438433962 -0.0540076494
0.3307214557 0.0741307184 -0.0542274266
0.2347420243 0.2742130927 0.0514073974
0.2347285326 0.2736276029 -0.0264946202
-0.4516623785 -0.1855564222 -0.0521401904
-0.1171953635 -0.2259983029 0.0552277983
-0.1172088553 -0.2265837927 -0.0226742193
-0.4818432709 -0.1045070526 -0.0527441079
-0.4897504553 -0.1042898146 0.0543775936
-0.4897639471 -0.1048753045 -0.0235244240
0.1126935215 0.3087439770 -0.0559529545
-0.4686135186 -0.0208061264 0.0537464928
-0.4686270104 -0.0213916162 -0.0241555248
0.3848170911 -0.0390551288 0.0537358427
0.3848035994 -0.0396406186 -0.0241661749
-0.1963305870 0.2528310118 -0.0554792087
0.2380406838 0.2285891845 0.0517497227
0.2380271920 0.2280036947 -0.0261522949
-0.4055489498 0.1180600888 0.0526918910
-0.4055624415 0.1174745990 -0.0252101266
-0.4612488476 -0.0245818661 -0.0533483700
-0.2465432937 -0.3553387827 -0.0508996779
-0.2547185414 0.1934644083 -0.0550229138
-0.3700423529 0.0893775214 0.0529013118
-0.3700558447 0.0887920315 -0.0250007058
0.1478067261 -0.2168829104 0.0551133942
0.1477932344 -0.2174684002 -0.0227886234
0.4751929242 -0.2706102012 -0.0516614708
-0.2471405342 0.2118216257 -0.0551621939
-0.0905071873 0.2711838269 0.0514864940
-0.0905206790 0.2705983370 -0.0264155236
0.1407828127 0.3087191772 -0.0559576328
0.2518224213 0.1604312076 0.0522595922
0.2518089295 0.1598457177 -0.0256424254
0.2428366114 0.1664326473 0.0522160433
0.2428231196 0.1658471574 -0.0256859743
0.1165778333 -0.2044055224 -0.0520969386
0.2561354881 0.1103437407 0.0526352886
0.2561219964 0.1097582509 -0.0252667290
0.2271760717 0.2697543429 -0.0556797463
0.1357715032 0.3173190171 0.0511005658
0.1357580115 0.3167335273 -0.0268014518
0.2115895733 -0.2725448790 -0.0516012772
0.5000000000 -0.2101521134 0.0550018115
0.4999865082 -0.2107376032 -0.0229002061
0.1543841700 -0.2109201393 -0.0520545242
-0.2655480890 0.1632238594 -0.0547937587
-0.4559658937 -0.1639463579 -0.0523018603
-0.0465887806 -0.1850611857 0.0549078981
-0.0466022724 -0.1856466755 -0.0229941195
0.2513776976 -0.2795656482 0.0555665629
0.2513642059 -0.2801511381 -0.0223354547
0.2932436917 -0.3075270943 0.0557694626
0.2932302000 -0.3081125841 -0.0221325550
0.2098349593 -0.2795293765 0.0555734850
0.2098214676 -0.2801148663 -0.0223285326
0.4305439480 -0.1135048463 0.0542874666
0.4305304562 -0.1140903361 -0.0236145510
0.4641282536 -0.1359351210 0.0544502299
0.4641147618 -0.1365206108 -0.0234517877
0.4824196187 -0.2733830318 0.0554800822
0.4824061269 -0.2739685216 -0.0224219354
-0.0455172804 -0.1629636836 0.0547416339
-0.0455307722 -0.1635491734 -0.0231603837
0.2853496329 0.0763298237 -0.0542360966
0.0139527771 -0.1967561322 -0.0521366558
0.0400236726 0.2949461807 0.0512852963
0.0400101809 0.2943606909 -0.0266167213
0.3245714332 -0.3097147892 0.0557804791
0.3245579415 -0.3103002790 -0.0221215385
0.3449714671 -0.3233395569 0.0558793460
0.3449579753 -0.3239250468 -0.0220226716
-0.0529935853 -0.1567269659 -0.0524259095
-0.1069788257 -0.2167266917 0.0551563461
-0.1069923175 -0.2173121816 -0.0227456715
-0.4575814912 -0.2505475538 0.0554712547
-0.4575949830 -0.2511330437 -0.0224307629
0.4616319030 -0.2974089157 0.0556642542
0.4616184113 -0.2979944055 -0.0222377634
0.4838709394 -0.2295655669 -0.0519714538
-0.4506347685 -0.2471340497 -0.0516775681
-0.1660424688 0.2981781643 -0.0558252708
-0.1135222727 -0.1912454031 -0.0521559957
-0.2763175635 0.2032045578 -0.0550923773
-0.1662581024 0.3080509484 0.0512225302
-0.1662715942 0.3074654586 -0.0266794874
0.3177528728 0.0687408776 -0.0541846721
0.2983179344 0.0817210777 -0.0542788617
0.0132716065 0.2720977231 -0.0556603127
0.1569638398 0.3643056123 0.0507437574
0.1569503480 0.3637201224 -0.0271582602
0.1795287717 0.3492349531 0.0508531163
0.1795152800 0.3486494633 -0.0270489013
0.3770739606 -0.0458227871 -0.0533339173
0.4256617303 -0.0782735703 -0.0530984411
-0.3113626341 -0.3542031046 -0.0508969873
-0.2573361756 -0.3434463860 -0.0509871886
0.2443637871 0.1552268884 -0.0548219666
0.2346458943 0.1617172714 -0.0548690635
-0.1157333394 -0.2506604744 -0.0517090656
-0.1060172057 -0.1968923757 0.0550071104
-0.1060306975 -0.1974778655 -0.0228949072
0.4127173454 -0.0555757601 -0.0532667897
0.0413728561 0.2861174554 -0.0557705479
0.1619149129 -0.2487365294 -0.0517716110
0.1014693647 -0.1849477629 -0.0522405611
-0.1984699068 0.2776794594 -0.0556655922
0.0845805950 0.2806782994 -0.0557371518
-0.1450217629 -0.2736806345 0.0555909847
-0.1450352546 -0.2742661244 -0.0223110329
0.1550535397 -0.2532733815 0.0553856398
0.1550400479 -0.2538588713 -0.0225163778
-0.0540941290 -0.1794127999 -0.0522552185
0.3997521528 -0.3313068155 0.0559297383
0.3997386610 -0.3318923054 -0.0219722793
-0.1646765612 -0.3313920612 0.0560281316
-0.1646900530 -0.3319775511 -0.0218738860
0.0980851101 -0.1924624264 0.0549384679
0.0980716184 -0.1930479162 -0.0229635497
-0.2914730150 0.1664872967 -0.0548137958
-0.3002107437 0.1322069706 0.0525673236
-0.3002242355 0.1316214808 -0.0253346940
0.3624170642 -0.3198652689 0.0558502128
0.3624035724 -0.3204507588 -0.0220518048
0.1122947650 -0.2107636180 0.0550735536
0.1122812733 -0.2113491079 -0.0228284640
-0.4147053002 0.0801675342 -0.0541436981
0.2537223798 -0.2725819365 -0.0516082956
0.2958315542 -0.3007057977 -0.0514042173
0.0107898227 -0.2042421600 0.0550421196
0.0107763310 -0.2048276499 -0.0228598980
-0.2487076801 -0.3637201224 0.0562856536
-0.2487211719 -0.3643056123 -0.0216163640
0.4336417801 -0.0757026059 0.0540028190
0.4336282883 -0.0762880958 -0.0238991986
-0.4861945047 -0.1390731104 -0.0524835655
-0.1514000749 -0.2689957183 -0.0515650860
-0.4630450680 -0.1673893930 0.0548472074
-0.4630585597 -0.1679748828 -0.0230548102
-0.2066187190 0.2825376301 0.0514212712
-0.2066322108 0.2819521403 -0.0264807464
0.4481078151 -0.3415295014 0.0559981945
0.4480943233 -0.3421149913 -0.0219038231
-0.3025469245 0.1608369504 0.0523525532
-0.3025604163 0.1602514605 -0.0255494644
-0.2535642747 0.2174390632 0.0519186643
-0.2535777664 0.2168535733 -0.0259833533
0.2486432740 0.1055294272 -0.0544491955
0.4546462191 -0.2943596330 -0.0514794183
-0.3131329424 -0.3616972435 0.0562816079
-0.3131464342 -0.3622827333 -0.0216204097
-0.4493084957 0.0423865070 -0.0538537536
-0.2988620964 0.1429217112 0.0524865610
-0.2988755882 0.1423362213 -0.0254154566
0.1732224903 0.3432610010 -0.0562228577
0.1602652999 0.3519148450 -0.0562856536
0.3186289730 0.0783403120 0.0528649943
0.3186154813 0.0777548222 -0.0250370233
0.2991974239 0.0913182485 0.0527708211
0.2991839321 0.0907327587 -0.0251311965
0.4179052358 -0.0481098987 0.0537981653
0.4178917440 -0.0486953885 -0.0241038523
0.1959438792 0.3097414334 0.0511470957
0.1959303875 0.3091559436 -0.0267549219
-0.4028005387 0.1050045714 -0.0543324281
-0.1217697766 0.2732935065 -0.0556459122
-0.2044287542 0.2570954134 0.0516121085
-0.2044422459 0.2565099235 -0.0262899091
0.3628026805 -0.3126464656 -0.0513260733
0.0111206283 0.2805258514 0.0513986811
0.0111071366 0.2799403616 -0.0265033365
-0.0227416235 -0.1535119965 -0.0524553116
-0.3693320642 0.0779687103 -0.0541350305
0.2303797789 0.2254595461 -0.0553473938
-0.2936721233 0.1211167575 -0.0544724227
0.4914487499 -0.2112069930 -0.0521107441
-0.4096131624 -0.2838995244 -0.0514083535
-0.4722420410 -0.1929237178 0.0550407091
-0.4722555327 -0.1935092077 -0.0228613085
-0.3229631548 0.1395084864 0.0525163879
-0.3229766465 0.1389229966 -0.0253856297
0.1094902833 0.3173394493 0.0511049639
0.1094767915 0.3167539595 -0.0267970537
0.3315981218 0.0837310001 0.0528222333
0.3315846301 0.0831455103 -0.0250797843
0.3838327491 0.0488445548 0.0530753836
0.3838192574 0.0482590650 -0.0248266340
-0.4944414116 -0.1415549020 0.0546584800
-0.4944549034 -0.1421403918 -0.0232435376
-0.2588309357 0.2046777409 0.0520154870
-0.2588444275 0.2040922510 -0.0258865306
0.4016845156 -0.3245623337 -0.0512432508
-0.2914972131 0.1383996457 -0.0546026927
0.4427296416 -0.3332400721 -0.0511851399
-0.4915369657 -0.0699290186 -0.0530023079
-0.0259974608 -0.1608894298 0.0547226637
-0.0260109526 -0.1614749196 -0.0231793538
0.0817920021 0.2896891111 0.0513175731
0.0817785103 0.2891036212 -0.0265844444
-0.1057630218 -0.2534988886 0.0554325051
-0.1057765135 -0.2540843784 -0.0224695125
-0.2827413289 0.1583437078 0.0523678616
-0.2827548206 0.1577582179 -0.0255341559
-0.1265142063 -0.2247234608 -0.0519021339
0.1893939331 0.3043566109 -0.0559332639
-0.1185068560 0.2812106133 0.0514159847
-0.1185203477 0.2806251235 -0.0264860329
-0.2601224335 -0.3511425879 0.0561931012
-0.2601359252 -0.3517280778 -0.0217089164
0.4580174213 -0.1420383844 -0.0526248061
0.4223868422 -0.1182414452 -0.0527974865
-0.1146214032 -0.2139309556 -0.0519853070
-0.4565621396 0.0467852675 0.0532364076
-0.4565756314 0.0461997776 -0.0246656100
0.2866206649 0.0860931073 0.0528122699
0.2866071731 0.0855076175 -0.0250897477
-0.4601461737 -0.1819464293 0.0549561119
-0.4601596655 -0.1825319191 -0.0229459056
-0.4212127502 0.0853826320 0.0529401984
-0.4212262419 0.0847971421 -0.0249618192
0.2470046537 0.2128688577 0.0518663198
0.2469911619 0.2122833678 -0.0260356978
-0.1708953677 -0.3262353523 -0.0511315125
-0.4144758308 -0.2891808175 0.0557541461
-0.4144893225 -0.2897663073 -0.0221478715
-0.4999865082 -0.0677775408 0.0541049503
-0.5000000000 -0.0683630306 -0.0237970673
0.2390099337 0.2103272954 -0.0552351587
0.4913630571 -0.2310710855 0.0551605285
0.4913495653 -0.2316565753 -0.0227414891
-0.3206733950 0.1297820119 -0.0545328720
0.3271598616 -0.3028926453 -0.0513932073
0.3465948000 -0.3158728454 -0.0512990177
-0.4635551816 -0.1963489274 -0.0520570173
-0.3592925116 -0.1840141260 -0.0521677793
-0.4102706796 -0.1042979961 -0.0527580747
-0.4564556130 -0.1050691442 -0.0527442802
-0.3847815956 -0.1441560611 -0.0524629270
-0.3544992770 -0.2645014041 -0.0515636895
-0.3083143436 -0.2637302560 -0.0515774839
-0.4030808278 -0.2250289132 -0.0518519400
-0.2884910935 -0.1376211702 -0.0525287178
-0.3063244612 -0.1467887922 -0.0524567280
-0.2021122164 -0.1941408223 -0.0521188917
-0.2879351254 -0.1192564109 -0.0526668385
-0.2576714883 -0.1019973330 -0.0528017943
-0.2873855602 -0.1079136346 -0.0527521829
-0.1558828086 -0.1407050664 -0.0525285064
-0.2419952356 -0.0890469313 -0.0529018408
0.0393638706 -0.1692298797 -0.0523479364
0.2883311444 -0.2277789820 -0.0519510160
0.2780577919 -0.2396536979 -0.0518599897
0.3817620343 -0.2491945916 -0.0518062434
0.0113110459 -0.1270737165 -0.0526599119
-0.1798897415 -0.1047648145 -0.0527944656
-0.0392101884 -0.1448562887 -0.0525175133
0.0311295881 -0.1649020258 -0.0523790372
-0.0842893478 -0.1159192655 -0.0527271887
-0.2249689008 -0.0758277913 -0.0530041410
-0.3205692945 -0.0646733403 -0.0530714178
-0.1068289275 -0.1014507539 -0.0528320264
0.2475909927 -0.1783196417 -0.0523156828
0.1294510193 -0.1526966791 -0.0524877974
0.0703810326 -0.1398851978 -0.0525738546
0.1745301787 -0.1816337023 -0.0522781220
0.2926701521 -0.2072566649 -0.0521060075
0.3657309661 -0.2039426043 -0.0521435683
0.1970697584 -0.1961022139 -0.0521732843
-0.0194310027 -0.0714116556 -0.0530729283
0.2031153638 -0.0748426130 -0.0530856847
0.2014779197 -0.0948265504 -0.0529352074
0.3127511030 -0.0965420291 -0.0529415856
0.0918421805 -0.0731271343 -0.0530793065
0.3127511030 -0.0965420291 -0.0529415856
0.3692064166 -0.0874077997 -0.0530200133
0.3143885470 -0.0765580917 -0.0530920629
-0.0177935587 -0.0514277182 -0.0532234055
-0.2403399252 -0.0479967609 -0.0532106491
-0.1290667419 -0.0497122395 -0.0532170273
-0.2395212031 -0.0380047922 -0.0532858878
0.2031153638 -0.0748426130 -0.0530856847
0.2039340858 -0.0648506443 -0.0531609233
0.0918421805 -0.0731271343 -0.0530793065
-0.0425894599 0.0096307650 -0.0536780097
-0.0420874435 -0.0352023266 -0.0533411436
0.1672422503 -0.0180960110 -0.0535059635
0.0623263952 -0.0042326230 -0.0535919866
0.0101194759 -0.0197174748 -0.0534665651
0.0625774034 -0.0266491688 -0.0534235536
0.1674932586 -0.0405125569 -0.0533375304
0.2721581055 -0.0319593991 -0.0534199404
0.0625774034 -0.0266491688 -0.0534235536
-0.2519191538 -0.0074755505 -0.0535131899
-0.2516681455 -0.0298920963 -0.0533447568
-0.1470032986 -0.0213389386 -0.0534271668
-0.3565840007 -0.0160287083 -0.0534307800
-0.1470032986 -0.0213389386 -0.0534271668
-0.0947963793 -0.0058540868 -0.0535525882
-0.1472543069 0.0010776073 -0.0535955998
0.1672422503 -0.0180960110 -0.0535059635
0.2716560890 0.0128736926 -0.0537568064
0.2721581055 -0.0319593991 -0.0534199404
0.3243650248 -0.0164745473 -0.0535453618
0.2194491697 -0.0026111592 -0.0536313850
0.3243650248 -0.0164745473 -0.0535453618
0.3765719442 -0.0009896955 -0.0536707833
0.3238630084 0.0283585444 -0.0538822279
0.1667402339 0.0267370806 -0.0538428296
0.0623263952 -0.0042326230 -0.0535919866
0.1145333145 0.0112522288 -0.0537174081
0.0620753870 0.0181839228 -0.0537604196
0.2716560890 0.0128736926 -0.0537568064
0.2714050808 0.0352902384 -0.0539252395
0.2194491697 -0.0026111592 -0.0536313850
0.1806683978 0.2071367021 -0.0552010750
0.1450080650 0.1958234413 -0.0551098717
0.0445095230 0.1645804177 -0.0548576527
0.0817899282 0.1748116651 -0.0549410044
-0.0199899242 0.2240525858 -0.0552934583
0.1649295780 0.1204551207 -0.0545468746
-0.0759105320 0.2087057147 -0.0551684307
-0.0386301268 0.2189369621 -0.0552517824
-0.1361205595 0.2307683632 -0.0553238197
0.0261023919 0.1159823685 -0.0544892154
0.0315171657 0.1311026430 -0.0546037929
-0.1116006878 0.1622835256 -0.0548133533
0.1719276324 0.0923616230 -0.0543369437
-0.1197228485 0.1396031139 -0.0546414870
-0.1143080747 0.1547233884 -0.0547560646
-0.1926354688 0.1514134867 -0.0547176228
0.0131278299 0.1035702616 -0.0543936824
0.0261023919 0.1159823685 -0.0544892154
-0.1197228485 0.1396031139 -0.0546414870
0.1654403513 0.0861555696 -0.0542891772
-0.1391846916 0.1209849537 -0.0544981875
-0.1262101296 0.1333970605 -0.0545937205
-0.2153409523 0.1296922997 -0.0545504401
-0.0257895957 0.0733547939 -0.0541598513
0.0120403747 0.0949288175 -0.0543285474
-0.1408158743 0.1080227875 -0.0544004850
0.1459816386 0.0710478357 -0.0541722617
-0.1975608299 0.0756617521 -0.0541474409
-0.1597308595 0.0972357757 -0.0543161370
-0.2834464471 0.0768152312 -0.0541412357
-0.0717479874 0.0220795057 -0.0537665210
-0.0257895957 0.0733547939 -0.0541598513
-0.1975608299 0.0756617521 -0.0541474409
-0.2205400258 0.0500241080 -0.0539507758
-0.1461440066 0.0360518069 -0.0538586484
-0.2834464471 0.0768152312 -0.0541412357
-0.1116752128 0.0745082730 -0.0541536461
-0.1346544087 0.0488706289 -0.0539569810
-0.0687324043 0.0739315335 -0.0541567487
0.1230024427 0.0454101917 -0.0539755966
0.1459816386 0.0710478357 -0.0541722617
0.0600960214 0.0722013148 -0.0541660565
0.2203776578 0.0570755346 -0.0540801343
0.0256272277 0.0337448487 -0.0538710588
0.0486064235 0.0593824928 -0.0540677239
-0.0230603799 0.0279121772 -0.0538187899
-0.2664984175 -0.0012511802 -0.0535574455
-0.2205400258 0.0500241080 -0.0539507758
-0.2949360450 0.0639964091 -0.0540429032
-0.3179152408 0.0383587650 -0.0538462380
-0.2577380354 0.0570102586 -0.0539968395
-0.1691232024 0.0104141628 -0.0536619833
-0.1461440066 0.0360518069 -0.0538586484
-0.2178108100 0.0045814913 -0.0536097144
-0.3638736325 -0.0129165231 -0.0534529078
-0.3179152408 0.0383587650 -0.0538462380
-0.3666028484 0.0325260936 -0.0537939692
-0.3151860250 -0.0070838517 -0.0535051767
-0.4152904559 0.0266934221 -0.0537417003
-0.4125612401 -0.0187491946 -0.0534006389
-0.3666028484 0.0325260936 -0.0537939692
-0.4649185120 -0.2220283807 0.0163049731
-0.4360354069 -0.2701569306 0.0166616916
-0.3638111325 -0.3257317754 0.0170668682
-0.4144825767 -0.2894735624 0.0168031373
-0.3638043866 -0.3254390305 0.0560178770
-0.2866344338 -0.3567126606 0.0172863458
-0.2066988666 -0.3478488368 0.0172058838
-0.1548559079 -0.3028290928 0.0168585494
-0.0763097391 -0.1912695256 0.0160064954
-0.0076105649 -0.1828585398 0.0159313829
0.0544307206 -0.1986450381 0.0160392850
0.1824375036 -0.2666941239 0.0165285536
0.4820573809 -0.1733363621 0.0157750119
0.3843181743 0.0046019681 0.0144546043
0.3577086896 0.0659950326 0.0139977997
0.2153362059 0.2916845181 0.0123262377
0.1463609256 0.3405195698 0.0119711528
-0.0397000254 0.2755620942 0.0124915788
0.0111138824 0.2802331065 0.0124476723
-0.0396932795 0.2758548392 0.0514425876
-0.1423892251 0.2943380360 0.0123682486
-0.2290032603 0.2369744934 0.0128143776
-0.2914951871 0.1873346754 0.0131982795
-0.3465094997 0.1141502590 0.0137578411
-0.4388941908 0.0657912048 0.0141372942
-0.4625945750 0.0126968256 0.0145404414
-0.4843067593 -0.0445845785 0.0149747128
-0.4586073706 -0.0942641120 -0.0528251152
-0.3815125063 -0.2698797634 -0.0515185889
-0.3544992770 -0.2645014041 -0.0515636895
-0.3815125063 -0.2698797634 -0.0515185889
-0.3059177263 -0.3039738950 -0.0512754390
-0.3160721077 -0.1754086092 -0.0522399413
-0.3538960706 -0.1899603244 -0.0521240239
-0.3002196822 -0.2726495536 -0.0515118509
-0.3886604776 -0.0999952376 -0.0527941556
-0.2434837377 -0.2508219808 -0.0516857269
-0.2813077007 -0.2653736960 -0.0515698096
-0.2071895527 -0.2885286665 -0.0514086197
-0.3160721077 -0.1754086092 -0.0522399413
-0.2434837377 -0.2508219808 -0.0516857269
-0.2071895527 -0.2885286665 -0.0514086197
-0.2337360913 -0.2222021637 -0.0519025136
-0.3063244612 -0.1467887922 -0.0524567280
-0.3886604776 -0.0999952376 -0.0527941556
-0.2288622681 -0.2078922552 -0.0520109070
-0.2884910935 -0.1376211702 -0.0525287178
-0.2879351254 -0.1192564109 -0.0526668385
-0.2012782643 -0.1665936833 -0.0523260728
-0.2873855602 -0.1079136346 -0.0527521829
-0.2576714883 -0.1019973330 -0.0528017943
-0.1558828086 -0.1407050664 -0.0525285064
-0.2571212164 -0.0906544160 -0.0528871398
0.2720995031 -0.2590939175 -0.0517128505
0.3574145724 -0.2961669948 -0.0514489952
0.2780577919 -0.2396536979 -0.0518599897
0.2926701521 -0.2072566649 -0.0521060075
0.2883311444 -0.2277789820 -0.0519510160
0.3839315381 -0.2389334330 -0.0518837391
0.1970697584 -0.1961022139 -0.0521732843
0.3839315381 -0.2389334330 -0.0518837391
0.4339012388 -0.2342495000 -0.0519275965
0.3882705458 -0.2184111159 -0.0520387306
0.0150999512 -0.1178944295 -0.0527295571
0.0113110459 -0.1270737165 -0.0526599119
0.2475909927 -0.1783196417 -0.0523156828
-0.2230744482 -0.0712381478 -0.0530389635
0.2532743505 -0.1645507113 -0.0524201506
0.2494854453 -0.1737299982 -0.0523505054
0.3723615502 -0.1878788521 -0.0522654473
0.0150999512 -0.1178944295 -0.0527295571
0.2532743505 -0.1645507113 -0.0524201506
0.3723615502 -0.1878788521 -0.0522654473
0.4319051501 -0.1995429226 -0.0521880957
0.3556458859 -0.1532945478 -0.0525224784
0.2365586862 -0.1299664069 -0.0526771816
0.1341871508 -0.1412225704 -0.0525748538
0.3472880538 -0.1360023957 -0.0526509939
-0.0016157131 -0.0833101252 -0.0529865881
-0.2230744482 -0.0712381478 -0.0530389635
-0.1039872485 -0.0945662887 -0.0528842603
-0.2314322804 -0.0539459957 -0.0531674791
0.2282008541 -0.1126742548 -0.0528056971
0.1132925705 -0.0979921900 -0.0528961426
0.2365586862 -0.1299664069 -0.0526771816
-0.0016157131 -0.0833101252 -0.0529865881
0.2282008541 -0.1126742548 -0.0528056971
0.3431091377 -0.1273563196 -0.0527152516
0.2103855645 -0.1007757852 -0.0528920373
-0.0194310027 -0.0714116556 -0.0530729283
-0.2314322804 -0.0539459957 -0.0531674791
0.2014779197 -0.0948265504 -0.0529352074
-0.0177935587 -0.0514277182 -0.0532234055
0.2039340858 -0.0648506443 -0.0531609233
0.3147979080 -0.0715621073 -0.0531296822
0.1974618934 -0.0535017392 -0.0532450976
-0.0242657511 -0.0400788131 -0.0533075798
-0.2395212031 -0.0380047922 -0.0532858878
0.1942257972 -0.0478272866 -0.0532871848
-0.0242657511 -0.0400788131 -0.0533075798
-0.0425894599 0.0096307650 -0.0536780097
0.1667402339 0.0267370806 -0.0538428296
0.2714050808 0.0352902384 -0.0539252395
0.1375817064 0.0391858213 -0.0539313409
-0.0717479874 0.0220795057 -0.0537665210
-0.2519191538 -0.0074755505 -0.0535131899
0.1230024427 0.0454101917 -0.0539755966
0.2044542869 0.2287221361 -0.0553674246
0.1823597934 0.2903184905 -0.0558265391
0.1947130434 0.2071243022 -0.0552034142
0.1806683978 0.2071367021 -0.0552010750
0.1466809596 0.2579403396 -0.0555770147
0.1666119345 0.1931038633 -0.0550931737
0.1309574403 0.1888135752 -0.0550547541
0.1450080650 0.1958234413 -0.0551098717
0.0721145234 0.2304556492 -0.0553575334
0.0969103535 0.1693966008 -0.0549029250
0.1493106197 0.1742137734 -0.0549482046
0.0812911131 0.2231557483 -0.0553042587
0.1911299932 0.1228632122 -0.0545695108
0.0026907138 0.2159299893 -0.0552363392
0.0550909800 0.2207471620 -0.0552816188
-0.0391286597 0.2672805505 -0.0556150330
0.0191045493 0.1440757247 -0.0546991452
0.0445095230 0.1645804177 -0.0548576527
-0.0759105320 0.2087057147 -0.0551684307
0.1522270911 0.1102027742 -0.0544676209
-0.1140179925 0.1779486752 -0.0549306696
-0.0886130188 0.1984533682 -0.0550891770
-0.1805792633 0.1948851504 -0.0550464317
0.0153155458 0.1348971160 -0.0546295052
0.0191045493 0.1440757247 -0.0546991452
-0.1197014978 0.1641807622 -0.0548262095
0.0120403747 0.0949288175 -0.0543285474
0.0131278299 0.1035702616 -0.0543936824
-0.1408158743 0.1080227875 -0.0544004850
-0.4152904559 0.0266934221 -0.0537417003
-0.4649185120 -0.2220283807 0.0163049731
-0.4360354069 -0.2701569306 0.0166616916
-0.3638111325 -0.3257317754 0.0170668682
-0.3131396883 -0.3619899884 0.0173305991
-0.3638178783 -0.3260245203 -0.0218841406
-0.2866344338 -0.3567126606 0.0172863458
-0.2066988666 -0.3478488368 0.0172058838
-0.1548559079 -0.3028290928 0.0168585494
-0.0763097391 -0.1912695256 0.0160064954
-0.0076105649 -0.1828585398 0.0159313829
0.0544307206 -0.1986450381 0.0160392850
0.1824375036 -0.2666941239 0.0165285536
0.4820573809 -0.1733363621 0.0157750119
0.3843181743 0.0046019681 0.0144546043
0.3577086896 0.0659950326 0.0139977997
0.2153362059 0.2916845181 0.0123262377
0.1463609256 0.3405195698 0.0119711528
-0.0397000254 0.2755620942 0.0124915788
-0.0905139331 0.2708910820 0.0125354852
-0.0397067712 0.2752693493 -0.0264594300
-0.1423892251 0.2943380360 0.0123682486
-0.2290032603 0.2369744934 0.0128143776
-0.2914951871 0.1873346754 0.0131982795
-0.3465094997 0.1141502590 0.0137578411
-0.4388941908 0.0657912048 0.0141372942
-0.4625945750 0.0126968256 0.0145404414
-0.4843067593 -0.0445845785 0.0149747128
-0.3629259783 -0.3219847060 -0.0365224294
-0.3629259783 -0.3219847060 -0.0365224294
-0.2098082698 -0.3452704823 -0.0363739383
-0.2098082698 -0.3452704823 -0.0363739383
0.0561228478 -0.1948877064 -0.0375502295
0.0561228478 -0.1948877064 -0.0375502295
0.4790019648 -0.1763879938 -0.0377625061
0.4790019648 -0.1763879938 -0.0377625061
0.3765719442 -0.0009896955 -0.0536707833
0.3804367635 0.0021013888 -0.0390869122
-0.0402108947 0.2712018697 -0.0410365449
-0.0402108947 0.2712018697 -0.0410365449
-0.4309665290 -0.1449272091 -0.0524491325
-0.4357597636 -0.0644399311 -0.0530532223
-0.4309665290 -0.1449272091 -0.0524491325
-0.4054774450 -0.1847852741 -0.0521539849
-0.3338034276 -0.2238721910 -0.0518726316
-0.3059177263 -0.3039738950 -0.0512754390
-0.3568958943 -0.2242577651 -0.0518657344
-0.4054774450 -0.1847852741 -0.0521539849
-0.2288622681 -0.2078922552 -0.0520109070
-0.3748699705 -0.0811015182 -0.0529385439
-0.2199455842 -0.2033084443 -0.0520469019
-0.1589227779 -0.2224006484 -0.0519139787
-0.2938815270 -0.1246526635 -0.0526252520
-0.2012782643 -0.1665936833 -0.0523260728
-0.2004539164 -0.1495795189 -0.0524540893
-0.3594601679 -0.0632895995 -0.0530750822
-0.1855968805 -0.1466213680 -0.0524788950
-0.1049884688 -0.1600589331 -0.0523918625
-0.2571212164 -0.0906544160 -0.0528871398
-0.1323684295 -0.1212794639 -0.0526785762
-0.1798897415 -0.1047648145 -0.0527944656
0.3663520055 -0.2670066655 -0.0516697040
0.1949002545 -0.2063633724 -0.0520957885
0.3714886818 -0.2610693075 -0.0517152171
0.4284774792 -0.2599023964 -0.0517338571
0.0563902053 -0.1560107397 -0.0524502365
-0.0040403001 -0.1548791572 -0.0524482753
-0.1095499649 -0.1248105516 -0.0526559895
-0.0364891509 -0.1214964910 -0.0526935503
-0.2502295180 -0.0847190774 -0.0529329417
-0.3431088742 -0.0502048287 -0.0531762555
-0.1658989141 -0.0886392726 -0.0529180837
-0.0842893478 -0.1159192655 -0.0527271887
0.0563902053 -0.1560107397 -0.0524502365
0.0999160260 -0.1462909385 -0.0525308260
0.1885210060 -0.1655081604 -0.0524017401
0.1379997717 -0.1832907326 -0.0522593416
0.3066609794 -0.1911311230 -0.0522296256
0.3882705458 -0.2184111159 -0.0520387306
0.2448699552 -0.2016794394 -0.0521396459
0.1745301787 -0.1816337023 -0.0522781220
0.2579332334 -0.0856923210 -0.0530136351
0.3119323809 -0.1065339978 -0.0528663469
0.0910234585 -0.0831191030 -0.0530040678
0.1466600501 -0.0839768423 -0.0530072569
0.3675689726 -0.1073917371 -0.0528695360
0.3957966294 -0.1028246224 -0.0529087499
0.2579332334 -0.0856923210 -0.0530136351
0.3692064166 -0.0874077997 -0.0530200133
-0.1298854639 -0.0597042082 -0.0531417887
-0.0742488723 -0.0605619476 -0.0531449778
-0.3507943864 -0.0362893135 -0.0532795096
-0.1290667419 -0.0497122395 -0.0532170273
0.0926609025 -0.0631351656 -0.0531545451
0.3143885470 -0.0765580917 -0.0530920629
0.0926609025 -0.0631351656 -0.0531545451
0.0370243109 -0.0622774263 -0.0531513560
0.0098684676 0.0026990710 -0.0536349982
-0.0162349920 -0.0050433549 -0.0535722874
0.1147843228 -0.0111643170 -0.0535489750
0.0101194759 -0.0197174748 -0.0534665651
0.2197001779 -0.0250277051 -0.0534629519
0.2722836096 -0.0431676720 -0.0533357239
0.0627029075 -0.0378574417 -0.0533393370
0.1150353310 -0.0335808628 -0.0533805420
-0.1994612262 -0.0144072445 -0.0534701783
-0.1468777945 -0.0325472115 -0.0533429502
-0.3564584966 -0.0272369812 -0.0533465634
-0.3041260731 -0.0229604023 -0.0533877684
-0.0945453711 -0.0282706326 -0.0533841552
-0.0684419114 -0.0205282067 -0.0534468659
-0.1994612262 -0.0144072445 -0.0534701783
-0.0947963793 -0.0058540868 -0.0535525882
0.2980105569 -0.0018004274 -0.0536510841
0.3246160331 -0.0388910931 -0.0533769288
0.2197001779 -0.0250277051 -0.0534629519
0.2458036376 -0.0172852792 -0.0535256627
0.3502174763 0.0136844244 -0.0537765056
0.3507194927 -0.0311486672 -0.0534396395
0.2980105569 -0.0018004274 -0.0536510841
0.3502174763 0.0136844244 -0.0537765056
0.1147843228 -0.0111643170 -0.0535489750
0.1408877824 -0.0034218911 -0.0536116858
0.0098684676 0.0026990710 -0.0536349982
0.1145333145 0.0112522288 -0.0537174081
0.2191981614 0.0198053866 -0.0537998180
0.3238630084 0.0283585444 -0.0538822279
0.2191981614 0.0198053866 -0.0537998180
0.1930947018 0.0120629607 -0.0537371073
0.1947130434 0.2071243022 -0.0552034142
0.1466809596 0.2579403396 -0.0555770147
0.1666119345 0.1931038633 -0.0550931737
0.0931904605 0.2409704484 -0.0554402098
-0.0386301268 0.2189369621 -0.0552517824
0.0309000020 0.1994321254 -0.0551172314
0.1835697806 0.1255707444 -0.0545885505
0.1047195505 0.1425177692 -0.0547022636
-0.0801999517 0.2461152343 -0.0554488473
-0.0157005045 0.1866430662 -0.0550130417
-0.0988401543 0.2409996106 -0.0554071715
-0.1590501818 0.2630622591 -0.0555625605
-0.1143080747 0.1547233884 -0.0547560646
-0.0400417611 0.1466930843 -0.0547085731
0.1746350193 0.0999217603 -0.0543942325
0.0990150121 0.1041719958 -0.0544130795
-0.1845133081 0.1740938984 -0.0548894892
-0.0468102283 0.1277927412 -0.0545653512
-0.1872206950 0.1665337611 -0.0548322004
-0.2236770051 0.1724389475 -0.0548702683
-0.1597308595 0.0972357757 -0.0543161370
-0.0643877498 0.1014758025 -0.0543645162
0.1648966238 0.0818348476 -0.0542566097
0.0600960214 0.0722013148 -0.0541660565
-0.2267014914 0.1091762666 -0.0543942798
-0.1116752128 0.0745082730 -0.0541536461
-0.2456164766 0.0983892548 -0.0543099318
-0.3315020938 0.0995427339 -0.0543037266
-0.1346544087 0.0488706289 -0.0539569810
-0.1833420162 0.0430379574 -0.0539047121
-0.2949360450 0.0639964091 -0.0540429032
-0.2405036385 0.0762384916 -0.0541443383
-0.1032011980 0.0354750673 -0.0538617510
-0.1546180214 0.0750850125 -0.0541505435
-0.0917116001 0.0482938894 -0.0539600836
-0.0487687915 0.0477171498 -0.0539631862
0.0486064235 0.0593824928 -0.0540677239
0.1030388300 0.0716245753 -0.0541691591
0.2318672557 0.0698943567 -0.0541784669
0.1716900502 0.0512428631 -0.0540278654
0.0114084139 0.0663686434 -0.0541137876
0.0743148352 0.0395775202 -0.0539233277
-0.0000811840 0.0535498213 -0.0540154550
-0.0487687915 0.0477171498 -0.0539631862
-0.2807172312 0.0313726145 -0.0538001743
-0.3321340546 0.0709825597 -0.0540889668
-0.2807172312 0.0313726145 -0.0538001743
-0.2435192216 0.0243864639 -0.0537541107
-0.1833420162 0.0430379574 -0.0539047121
-0.1204355949 0.0162468343 -0.0537142522
-0.1948316141 0.0302191354 -0.0538063795
-0.2435192216 0.0243864639 -0.0537541107
-0.3408944367 0.0127211210 -0.0536495729
-0.3436236525 0.0581637377 -0.0539906343
-0.2922068292 0.0185537924 -0.0537018418
-0.3408944367 0.0127211210 -0.0536495729
-0.3895820442 0.0068884495 -0.0535973040
-0.4382696517 0.0010557780 -0.0535450352
-0.3923112600 0.0523310662 -0.0539383654
-0.3895820442 0.0068884495 -0.0535973040
-0.4948752277 -0.0863264226 0.0152902632
-0.4921026794 -0.1232151032 0.0155670280
-0.4787499857 -0.1547648924 0.0158018349
-0.4722487869 -0.1932164627 0.0160897003
-0.4649117661 -0.2217356358 0.0552559819
-0.4575882371 -0.2508402987 0.0165202459
-0.4360286610 -0.2698641857 0.0556127004
-0.3891434816 -0.3074562965 0.0364105072
-0.3891502275 -0.3077490414 -0.0025405016
-0.3384720374 -0.3437145094 0.0366742381
-0.3891434816 -0.3074562965 0.0364105072
-0.2487144260 -0.3640128673 0.0173346448
-0.2066921207 -0.3475560918 0.0561568926
-0.1646833071 -0.3316848062 0.0170771228
-0.1548491621 -0.3025363479 0.0558095581
-0.1253991382 -0.2638825065 0.0165607361
-0.1114859385 -0.2400413407 0.0163791429
-0.1060239516 -0.1971851206 0.0160561016
-0.0763029932 -0.1909767807 0.0549575042
-0.0260042067 -0.1611821747 0.0157716550
-0.0076038190 -0.1825657949 0.0548823917
0.0107830769 -0.2045349049 0.0160911108
0.0544374664 -0.1983522932 0.0549902938
0.1300439997 -0.2141160091 0.0161424651
0.1514233870 -0.2353708909 0.0162985082
0.1550467938 -0.2535661264 0.0164346310
0.1824442495 -0.2664013790 0.0554795624
0.2305995826 -0.2798402573 0.0166190151
0.2723039488 -0.2938391162 0.0167170039
0.3089008166 -0.3089136866 0.0168239620
0.3810778626 -0.3258787872 0.0169389667
0.4239232380 -0.3367109034 0.0170129576
0.4548631132 -0.3197619535 0.0168802156
0.4720190150 -0.2856887187 0.0166211594
0.4868845920 -0.2525198035 0.0163692965
0.4999932541 -0.2104448583 0.0160508027
0.4820641268 -0.1730436172 0.0547260207
0.4473293549 -0.1250127285 0.0154178394
0.4320861182 -0.0948964710 0.0151941340
0.4257667621 -0.0621989972 0.0149494833
0.4013544176 -0.0438752586 0.0148159952
0.3848103453 -0.0393478737 0.0147848339
0.3843249201 0.0048947130 0.0534056131
0.3838260033 0.0485518099 0.0141243748
0.3577154355 0.0662877775 0.0529488085
0.2713713306 0.0979256791 0.0137727705
0.2539722088 0.1350947292 0.0134964316
0.2449138867 0.1893580075 0.0130901727
0.2363846082 0.2511083937 0.0126275512
0.1877295796 0.3291954483 0.0120490972
0.0956343968 0.3032215353 0.0122602597
0.0609010915 0.2920249010 0.0123504259
0.0255654046 0.2874432711 0.0123909799
-0.1045137675 0.2759044752 0.0125002305
-0.1864451566 0.2950015443 0.0123708919
-0.2044355001 0.2568026685 0.0126610997
-0.2289965144 0.2372672383 0.0517653864
-0.2804367037 0.2141251454 0.0129950146
-0.2914884412 0.1876274203 0.0521492883
-0.3229699007 0.1392157415 0.0135653791
-0.3465027539 0.1144430039 0.0527088499
-0.3878023972 0.1034260602 0.0138455926
-0.4133875959 0.1014286155 0.0138650359
-0.4565688855 0.0464925226 0.0142853988
-0.4625878291 0.0129895705 0.0534914502
-0.4306377704 -0.2347279733 -0.0517742720
-0.4165874424 -0.2277180928 -0.0518293896
-0.3604878982 -0.3190513145 -0.0511526704
-0.3464375702 -0.3120414340 -0.0512077881
-0.4030808278 -0.2250289132 -0.0518519400
-0.3329309556 -0.3093522544 -0.0512303384
-0.2816269509 -0.3237101405 -0.0511313138
-0.2813077007 -0.2653736960 -0.0515698096
-0.3270578764 -0.2313049390 -0.0518179374
-0.4075724591 -0.1072710952 -0.0527361970
-0.3523662926 -0.1377019234 -0.0525170485
-0.2450135157 -0.3030803817 -0.0512927024
-0.2797779227 -0.2131152950 -0.0519628341
-0.2450135157 -0.3030803817 -0.0512927024
-0.2087193307 -0.3407870675 -0.0510155952
-0.1611477213 -0.2976155353 -0.0513482992
-0.1974419063 -0.2599088495 -0.0516254064
-0.2797779227 -0.2131152950 -0.0519628341
-0.1925680831 -0.2455989410 -0.0517337998
-0.3523662926 -0.1377019234 -0.0525170485
-0.3837866544 -0.0856853291 -0.0529025490
-0.2675933647 -0.1773405237 -0.0522338175
-0.2337360913 -0.2222021637 -0.0519025136
-0.2021122164 -0.1941408223 -0.0521188917
-0.2938815270 -0.1246526635 -0.0526252520
-0.1049884688 -0.1600589331 -0.0523918625
-0.1553325368 -0.1293621495 -0.0526138519
-0.3594601679 -0.0632895995 -0.0530750822
-0.1550574008 -0.1236906910 -0.0526565246
0.2040532749 -0.2417510379 -0.0518314099
0.2720995031 -0.2590939175 -0.0517128505
0.4060303957 -0.2952633139 -0.0514642067
0.3633728611 -0.2767267753 -0.0515961344
0.1867844339 -0.2220208402 -0.0519767058
0.3633728611 -0.2767267753 -0.0515961344
0.2494854453 -0.1737299982 -0.0523505054
0.1294510193 -0.1526966791 -0.0524877974
-0.2249689008 -0.0758277913 -0.0530041410
-0.1039872485 -0.0945662887 -0.0528842603
0.3666781924 -0.2016477826 -0.0521609796
0.1341871508 -0.1412225704 -0.0525748538
0.3685726450 -0.1970581391 -0.0521958022
0.4319051501 -0.1995429226 -0.0521880957
0.4747330856 -0.1766226887 -0.0523677751
0.4151894858 -0.1649586182 -0.0524451267
0.3128179504 -0.1762147817 -0.0523427990
0.4068316536 -0.1476664661 -0.0525736423
0.1937307507 -0.1528866408 -0.0524975022
0.1258293187 -0.1239304182 -0.0527033693
0.2919233700 -0.1329844013 -0.0526640877
0.3556458859 -0.1532945478 -0.0525224784
-0.0444436487 -0.1062303591 -0.0528069087
-0.1123450807 -0.0772741365 -0.0530127758
-0.3421616479 -0.0479100070 -0.0531936668
-0.1165239968 -0.0686280604 -0.0530770336
0.0558384287 -0.0906511576 -0.0529413653
0.1216504026 -0.1152843422 -0.0527676271
0.3431091377 -0.1273563196 -0.0527152516
0.1258293187 -0.1239304182 -0.0527033693
0.3702298191 -0.0749178388 -0.0531140616
0.3083257156 -0.0602132022 -0.0532138565
0.0930702636 -0.0581391812 -0.0531921644
0.3050896194 -0.0545387497 -0.0532559436
-0.1286573809 -0.0447162552 -0.0532546467
-0.2427572993 -0.0323303396 -0.0533279749
0.0849800230 -0.0439530499 -0.0532973823
0.1974618934 -0.0535017392 -0.0532450976
0.1942257972 -0.0478272866 -0.0532871848
-0.0420874435 -0.0352023266 -0.0533411436
0.3237375042 0.0395668173 -0.0539664444
0.2422465533 0.0477389791 -0.0540137508
0.0620753870 0.0181839228 -0.0537604196
0.2276672896 0.0539633494 -0.0540580065
-0.1472543069 0.0010776073 -0.0535955998
-0.2664984175 -0.0012511802 -0.0535574455
0.0256272277 0.0337448487 -0.0538710588
0.1375817064 0.0391858213 -0.0539313409
0.2120199137 0.2330369412 -0.0554011637
0.2044542869 0.2287221361 -0.0553674246
0.1156307773 0.2693093195 -0.0556570833
0.1326244964 0.2439075008 -0.0554691134
0.2146558359 0.1563330647 -0.0548251353
0.1326244964 0.2439075008 -0.0554691134
0.0550909800 0.2207471620 -0.0552816188
0.1153008664 0.1986847608 -0.0551262317
0.2173301263 0.1252717985 -0.0545921506
0.1440201734 0.1461299065 -0.0547362179
0.0341812933 0.2464224425 -0.0554709658
0.0498005337 0.1926632951 -0.0550696321
-0.0444191060 0.2391966836 -0.0554030463
-0.0182189729 0.2416052699 -0.0554256861
-0.0886130188 0.1984533682 -0.0550891770
-0.0157005045 0.1866430662 -0.0550130417
0.1649295780 0.1204551207 -0.0545468746
0.0856658202 0.1271392494 -0.0545833831
-0.1424718029 0.2256421900 -0.0552841929
-0.0474567216 0.1610121999 -0.0548149074
-0.1551742897 0.2153898435 -0.0552049392
-0.2138598988 0.2033533880 -0.0551043128
-0.1140179925 0.1779486752 -0.0549306696
0.1503325894 0.1056134698 -0.0544328009
-0.1159124942 0.1733593708 -0.0548958495
-0.1872100196 0.1788225853 -0.0549245616
-0.1397284192 0.1166642316 -0.0544656200
0.1648966238 0.0818348476 -0.0542566097
-0.1397284192 0.1166642316 -0.0544656200
-0.2161565437 0.1232112166 -0.0545015889
-0.4093202799 0.0601776086 -0.0539943921
-0.4382696517 0.0010557780 -0.0535450352
-0.4948752277 -0.0863264226 0.0152902632
-0.4921026794 -0.1232151032 0.0155670280
-0.4787499857 -0.1547648924 0.0158018349
-0.4575882371 -0.2508402987 0.0165202459
-0.4649252579 -0.2223211257 -0.0226460357
-0.4144825767 -0.2894735624 0.0168031373
-0.4360421528 -0.2704496755 -0.0222893172
-0.3384787833 -0.3440072544 -0.0022767707
-0.3384720374 -0.3437145094 0.0366742381
-0.3891502275 -0.3077490414 -0.0025405016
-0.3384787833 -0.3440072544 -0.0022767707
-0.1646833071 -0.3316848062 0.0170771228
-0.2067056124 -0.3481415817 -0.0217451250
-0.1450285088 -0.2739733794 0.0166399759
-0.1548626538 -0.3031218377 -0.0220924594
-0.1253991382 -0.2638825065 0.0165607361
-0.1114859385 -0.2400413407 0.0163791429
-0.0465955265 -0.1853539306 0.0159568893
-0.0763164849 -0.1915622705 -0.0229445134
0.0107830769 -0.2045349049 0.0160911108
-0.0076173108 -0.1831512848 -0.0230196259
0.0980783643 -0.1927551713 0.0159874591
0.0544239747 -0.1989377831 -0.0229117238
0.1300439997 -0.2141160091 0.0161424651
0.1514233870 -0.2353708909 0.0162985082
0.2098282134 -0.2798221214 0.0166224762
0.1824307577 -0.2669868688 -0.0224224552
0.2305995826 -0.2798402573 0.0166190151
0.2723039488 -0.2938391162 0.0167170039
0.3089008166 -0.3089136866 0.0168239620
0.3810778626 -0.3258787872 0.0169389667
0.4239232380 -0.3367109034 0.0170129576
0.4548631132 -0.3197619535 0.0168802156
0.4720190150 -0.2856887187 0.0166211594
0.4868845920 -0.2525198035 0.0163692965
0.4641215077 -0.1362278659 0.0154992211
0.4820506350 -0.1736291070 -0.0231759969
0.4473293549 -0.1250127285 0.0154178394
0.4320861182 -0.0948964710 0.0151941340
0.4257667621 -0.0621989972 0.0149494833
0.4013544176 -0.0438752586 0.0148159952
0.3838260033 0.0485518099 0.0141243748
0.3843114284 0.0043092232 -0.0244964044
0.3315913759 0.0834382552 0.0138712245
0.3577019437 0.0657022876 -0.0249532091
0.2713713306 0.0979256791 0.0137727705
0.2539722088 0.1350947292 0.0134964316
0.2449138867 0.1893580075 0.0130901727
0.2363846082 0.2511083937 0.0126275512
0.1877295796 0.3291954483 0.0120490972
0.0956343968 0.3032215353 0.0122602597
0.0609010915 0.2920249010 0.0123504259
0.0255654046 0.2874432711 0.0123909799
-0.1045137675 0.2759044752 0.0125002305
-0.1864451566 0.2950015443 0.0123708919
-0.2535710205 0.2171463183 0.0129676555
-0.2290100062 0.2366817484 -0.0261366312
-0.3025536704 0.1605442054 0.0134015444
-0.2915019329 0.1870419305 -0.0257527293
-0.3700490988 0.0890847765 0.0139503030
-0.3465162456 0.1138575141 -0.0251931677
-0.3878023972 0.1034260602 0.0138455926
-0.4133875959 0.1014286155 0.0138650359
-0.4686202645 -0.0210988713 0.0147954840
-0.4626013209 0.0124040807 -0.0244105674
-0.4614451506 -0.2203216287 -0.0372694383
-0.4614451506 -0.2203216287 -0.0372694383
-0.4336040727 -0.2675162841 -0.0369195582
-0.4336040727 -0.2675162841 -0.0369195582
-0.3604878982 -0.3190513145 -0.0511526704
-0.3887076504 -0.3058755067 -0.0293351504
-0.3638178783 -0.3260245203 -0.0218841406
-0.3380362062 -0.3421337196 -0.0290714195
-0.2852413049 -0.3528645597 -0.0363037991
-0.2852413049 -0.3528645597 -0.0363037991
-0.1580450639 -0.3004866347 -0.0367194860
-0.1580450639 -0.3004866347 -0.0367194860
-0.0800624132 -0.1884453327 -0.0375750629
-0.0800624132 -0.1884453327 -0.0375750629
-0.0060290877 -0.1791155259 -0.0376580048
-0.0060290877 -0.1791155259 -0.0376580048
0.1833148106 -0.2632018752 -0.0370588275
0.1833148106 -0.2632018752 -0.0370588275
0.2735978800 -0.2904284679 -0.0368698360
0.2735978800 -0.2904284679 -0.0368698360
0.4212341513 -0.3325661888 -0.0365787096
0.3572703565 0.0611948917 -0.0395270303
0.3572703565 0.0611948917 -0.0395270303
0.2676252236 0.0955185224 -0.0397694716
0.2502428917 0.1324925697 -0.0400443478
0.2502428917 0.1324925697 -0.0400443478
0.2409165266 0.1880872264 -0.0404605665
0.2409165266 0.1880872264 -0.0404605665
0.2120612328 0.2889921069 -0.0412139421
0.2120612328 0.2889921069 -0.0412139421
0.1488665804 0.3362196498 -0.0415579465
0.1488665804 0.3362196498 -0.0415579465
-0.0391286597 0.2672805505 -0.0556150330
-0.0134696441 0.2716497964 -0.0483484288
-0.0397067712 0.2752693493 -0.0264594300
-0.0658699103 0.2668326238 -0.0483031491
-0.1422814083 0.2894016439 -0.0411556519
-0.1422814083 0.2894016439 -0.0411556519
-0.1823707505 0.2925724590 -0.0411725398
-0.2257913901 0.2341657746 -0.0407260515
-0.2257913901 0.2341657746 -0.0407260515
-0.2915019329 0.1870419305 -0.0257527293
-0.3461543554 0.1084458534 -0.0397603301
-0.3461543554 0.1084458534 -0.0397603301
-0.4352673688 0.0635918246 -0.0394077864
-0.4352673688 0.0635918246 -0.0394077864
-0.4589122395 0.0108089558 -0.0390069900
-0.4589122395 0.0108089558 -0.0390069900
-0.4800819881 -0.0456603174 -0.0385789163
-0.4800819881 -0.0456603174 -0.0385789163
-0.4715460593 -0.0645444594 -0.0530462390
-0.4437110710 -0.1249981767 -0.0525967064
-0.4540589958 -0.1453127832 -0.0524422353
-0.4588522303 -0.0648255051 -0.0530463251
-0.4230152216 -0.0843689636 -0.0529056485
-0.4182219870 -0.1648562416 -0.0523015587
-0.3975261376 -0.1242270286 -0.0526105008
-0.3720370536 -0.1640850935 -0.0523153531
-0.4182219870 -0.1648562416 -0.0523015587
-0.3568958943 -0.2242577651 -0.0518657344
-0.3210588856 -0.2438012235 -0.0517250578
-0.2828252596 -0.3035883210 -0.0512823363
-0.3302085017 -0.2842376496 -0.0514195643
-0.3811866697 -0.2045215196 -0.0520098596
-0.3787900524 -0.2447651586 -0.0517078147
-0.4273716031 -0.2052926677 -0.0519960652
-0.3811866697 -0.2045215196 -0.0520098596
-0.2199455842 -0.2033084443 -0.0520469019
-0.2675933647 -0.1773405237 -0.0522338175
-0.3837866544 -0.0856853291 -0.0529025490
-0.3316805320 -0.1093613442 -0.0527336309
-0.1856728295 -0.2361520813 -0.0518059939
-0.2453016549 -0.1658809963 -0.0523238048
-0.1767561457 -0.2315682703 -0.0518419889
-0.1373280586 -0.2365305614 -0.0518115222
-0.2101978666 -0.1746880621 -0.0522636929
-0.3745919865 -0.0719191385 -0.0530076043
-0.2072246659 -0.1719899358 -0.0522844862
-0.1579498338 -0.1902623195 -0.0521556899
-0.1855968805 -0.1466213680 -0.0524788950
-0.2439197383 -0.1287465767 -0.0526031361
-0.3743172039 -0.0662477503 -0.0530502764
-0.3085658281 -0.0826434663 -0.0529384382
-0.1495595766 -0.1689333856 -0.0523174453
-0.2067771485 -0.1213511997 -0.0526651503
-0.1347025407 -0.1659752348 -0.0523422510
-0.0838082009 -0.1853291015 -0.0522056071
0.0083111235 -0.1613709381 -0.0524016240
0.0577110709 -0.1908519475 -0.0521886085
0.1829868717 -0.2417325092 -0.0518279007
0.2407720158 -0.2569063923 -0.0517238658
0.2585934253 -0.2617833025 -0.0516902987
0.1677479280 0.2579217397 -0.0555805235
0.2146558359 0.1563330647 -0.0548251353
0.1607256052 0.2579279396 -0.0555793539
0.1296872406 0.2833421583 -0.0557649846
0.1255962648 0.2368910814 -0.0554151628
0.1968256695 0.1506764343 -0.0547795336
0.1147943300 0.2382508704 -0.0554235118
0.0672816583 0.2635439519 -0.0556053789
0.0817899282 0.1748116651 -0.0549410044
-0.1601198417 0.2754864829 -0.0556557522
0.0029396981 0.1917586899 -0.0550547176
-0.0708798504 0.2486730461 -0.0554696853
0.0122597994 0.1943165017 -0.0550755555
0.0563449651 0.1871218952 -0.0550291179
0.1326798544 0.1501912047 -0.0547647775
0.2251396055 0.0983924722 -0.0543914856
0.1233597531 0.1476333929 -0.0547439395
0.0746145367 0.1535490935 -0.0547799582
-0.0988401543 0.2409996106 -0.0554071715
-0.0594150392 0.2325260982 -0.0553503149
0.0029396981 0.1917586899 -0.0550547176
-0.0458055182 0.1976743905 -0.0550907362
-0.1289451680 0.2520309349 -0.0554848660
-0.1060155457 0.2197370390 -0.0552461252
-0.1662255732 0.2417996875 -0.0554015142
-0.1289451680 0.2520309349 -0.0554848660
-0.1262101296 0.1333970605 -0.0545937205
-0.0468102283 0.1277927412 -0.0545653512
0.1719276324 0.0923616230 -0.0543369437
0.0892840906 0.0948629156 -0.0543414298
-0.1958791093 0.1483104600 -0.0546937396
-0.0630284309 0.1122776076 -0.0544459350
-0.2023663903 0.1421044065 -0.0546459731
-0.2534190827 0.1340459727 -0.0545765664
-0.3315020938 0.0995427339 -0.0543037266
-0.0927602276 0.0852952848 -0.0542379941
-0.2172439988 0.1145697725 -0.0544364538
-0.0833027350 0.0906887907 -0.0542801682
-0.0261736875 0.0982023100 -0.0543465318
0.0884684993 0.0883818326 -0.0542925785
0.2318672557 0.0698943567 -0.0541784669
0.0790110067 0.0829883266 -0.0542504045
0.0171532129 0.0727780544 -0.0541629539
-0.2456164766 0.0983892548 -0.0543099318
-0.1932161755 0.1032060212 -0.0543552084
-0.0927602276 0.0852952848 -0.0542379941
-0.1546180214 0.0750850125 -0.0541505435
-0.2696443000 0.1097530062 -0.0543911772
-0.2405036385 0.0762384916 -0.0541443383
-0.3263892556 0.0773919707 -0.0541381331
-0.3074742704 0.0881789825 -0.0542224812
-0.4093202799 0.0601776086 -0.0539943921
-0.4999932541 -0.0680702857 0.0151539415
-0.4923128415 -0.0953081186 0.0348339284
-0.4897572012 -0.1045825596 0.0154265848
-0.4932720455 -0.1323850026 0.0351127540
-0.4944481575 -0.1418476469 0.0157074712
-0.4708975268 -0.1610771427 0.0353245211
-0.3131396883 -0.3619899884 0.0173305991
-0.2866276879 -0.3564199157 0.0562373546
-0.2277032733 -0.3557844796 0.0367457687
-0.2277100192 -0.3560772245 -0.0022052401
-0.1856877139 -0.3396204490 0.0366170077
-0.2277032733 -0.3557844796 0.0367457687
-0.1450285088 -0.2739733794 0.0166399759
-0.1352104506 -0.2687815705 0.0360758604
-0.1065047616 -0.2071022786 0.0161307194
-0.0460597764 -0.1743051796 0.0158737572
-0.0357641165 -0.1622193016 0.0157811400
0.0326102716 -0.2014435991 0.0355407023
0.0326035258 -0.2017363440 -0.0034103065
0.0762579153 -0.1955537323 0.0354888764
0.0326102716 -0.2014435991 0.0355407023
0.1051831917 -0.2019057671 0.0160550019
0.1477999803 -0.2171756553 0.0161623854
0.1532384634 -0.2443221362 0.0358420740
0.2098282134 -0.2798221214 0.0166224762
0.2202172710 -0.2796848169 0.0360962501
0.2513709518 -0.2798583932 0.0166155541
0.2723106947 -0.2935463712 0.0556680127
0.3347647043 -0.3168199180 0.0168789037
0.3624103183 -0.3201580139 0.0168992040
0.3717474634 -0.3228720281 0.0363945898
0.3997454069 -0.3315995605 0.0169787295
0.4239299839 -0.3364181585 0.0559639664
0.4481010692 -0.3418222463 0.0170471857
0.4548698590 -0.3194692086 0.0558312243
0.4824128728 -0.2736757767 0.0165290734
0.4891238246 -0.2417954445 0.0357649125
0.4956747827 -0.2209043443 0.0161301612
0.4910286905 -0.1917442377 0.0353884117
0.4910219446 -0.1920369826 -0.0035625971
0.4730928173 -0.1546357415 0.0351126209
0.4910286905 -0.1917442377 0.0353884117
0.4641215077 -0.1362278659 0.0154992211
0.4389366514 -0.1192587874 0.0348526530
0.4305372021 -0.1137975912 0.0153364578
0.4313150331 -0.1042006586 0.0347408003
0.3845676327 -0.0172265803 0.0340952235
0.3845608868 -0.0175193253 -0.0048557853
0.3840754617 0.0267232615 0.0337649940
0.3845676327 -0.0172265803 0.0340952235
0.3089064526 0.0845365353 0.0138668989
0.2866139190 0.0858003624 0.0138612611
0.2637534094 0.1041347099 0.0332040295
0.2561287423 0.1100509958 0.0136842798
0.2539789547 0.1353874741 0.0524474404
0.2428298655 0.1661399023 0.0132650345
0.2449206325 0.1896507525 0.0520411815
0.2425159229 0.2204362762 0.0128570124
0.2380339379 0.2282964396 0.0127987139
0.2363913541 0.2514011386 0.0515785600
0.2347352784 0.2739203478 0.0124563886
0.2153429518 0.2919772631 0.0512772465
0.1959371334 0.3094486885 0.0121960869
0.1918367294 0.3194684409 0.0315980964
0.1682395599 0.3564775378 0.0118474281
0.1569570939 0.3640128673 0.0117927486
0.1463676715 0.3408123147 0.0509221616
0.1226241474 0.3170364883 0.0121517561
0.1094835374 0.3170467044 0.0121539551
0.0887131994 0.2964553232 0.0317889164
0.0817852562 0.2893963661 0.0123665644
0.0504623820 0.2934855408 0.0318178611
-0.0142896985 0.2780439728 0.0319451300
-0.0142964444 0.2777512279 -0.0070058788
-0.0651036063 0.2733729606 0.0319890364
-0.0142896985 0.2780439728 0.0319451300
-0.1185136019 0.2809178684 0.0124649759
-0.1423824792 0.2946307809 0.0513192574
-0.1662648483 0.3077582035 0.0122715214
-0.1864384107 0.2952942893 0.0513219007
-0.2055304825 0.2695237768 0.0125656810
-0.2696371927 0.2092550707 0.0130297464
-0.2926508726 0.1592975841 0.0134091986
-0.2908084585 0.1503399645 0.0134762025
-0.3115936951 0.1355649836 0.0135908469
-0.3700490988 0.0890847765 0.0139503030
-0.3877956514 0.1037188051 0.0527966014
-0.4055556957 0.1177673439 0.0137408822
-0.4094682728 0.1097443522 0.0332784634
-0.4212194961 0.0850898871 0.0139891896
-0.4388874449 0.0660839497 0.0530883030
-0.4686202645 -0.0210988713 0.0147954840
-0.4843000134 -0.0442918336 0.0539257216
-0.4737216761 -0.0818274882 -0.0529159677
-0.4572866322 -0.1291052349 -0.0525634877
-0.4306377704 -0.2347279733 -0.0517742720
-0.4131003024 -0.2558088086 -0.0516188716
-0.3464375702 -0.3120414340 -0.0512077881
-0.3850505303 -0.3014754195 -0.0512805120
-0.3081458949 -0.2240290814 -0.0518758961
-0.2733814879 -0.3139941681 -0.0512057644
-0.3081458949 -0.2240290814 -0.0518758961
-0.3215649920 -0.2033567741 -0.0520289393
-0.3807342649 -0.1486157098 -0.0524301105
-0.4249546626 -0.0622885519 -0.0530712628
-0.3712782741 -0.1449777810 -0.0524590898
-0.3342192002 -0.1565552663 -0.0523784949
-0.2631606082 -0.2842270388 -0.0514312560
-0.2639254972 -0.3103562393 -0.0512347437
-0.2986899042 -0.2203911526 -0.0519048754
-0.2616308302 -0.2319686379 -0.0518242805
-0.2268664232 -0.3219337246 -0.0511541488
-0.2253366452 -0.2696753236 -0.0515471733
-0.1890424602 -0.3073820094 -0.0512700661
-0.2268664232 -0.3219337246 -0.0511541488
-0.1792948138 -0.2787621924 -0.0514868528
-0.1890424602 -0.3073820094 -0.0512700661
-0.2253366452 -0.2696753236 -0.0515471733
-0.1792948138 -0.2787621924 -0.0514868528
-0.2616308302 -0.2319686379 -0.0518242805
-0.2749040995 -0.1988053865 -0.0520712274
-0.2180259104 -0.2482104609 -0.0517097633
-0.1974419063 -0.2599088495 -0.0516254064
-0.3342192002 -0.1565552663 -0.0523784949
-0.3474924694 -0.1233920149 -0.0526254418
-0.4249546626 -0.0622885519 -0.0530712628
-0.3450555578 -0.1162370607 -0.0526796385
-0.2869589130 -0.1620646580 -0.0523452728
-0.2724671879 -0.1916504322 -0.0521254241
-0.1901311715 -0.2384439868 -0.0517879965
-0.2749040995 -0.1988053865 -0.0520712274
-0.1589227779 -0.2224006484 -0.0519139787
-0.2075026499 -0.1811723155 -0.0522154259
-0.3748699705 -0.0811015182 -0.0529385439
-0.2101978666 -0.1746880621 -0.0522636929
-0.1579498338 -0.1902623195 -0.0521556899
-0.2007286991 -0.1552509070 -0.0524114171
-0.3745919865 -0.0719191385 -0.0530076043
-0.2004539164 -0.1495795189 -0.0524540893
0.2515769401 -0.2547550483 -0.0517419060
0.2515769401 -0.2547550483 -0.0517419060
0.3574145724 -0.2961669948 -0.0514489952
0.4000721070 -0.3147035335 -0.0513170676
0.4243800187 -0.3142516930 -0.0513246733
0.3147570377 -0.2776304562 -0.0515809229
0.4060303957 -0.2952633139 -0.0514642067
0.2294419685 -0.2405573788 -0.0518447782
0.1897635783 -0.2123007304 -0.0520502754
0.3663520055 -0.2670066655 -0.0516697040
0.3207153265 -0.2581902366 -0.0517280620
0.3383008451 -0.2230950490 -0.0519948733
0.3817620343 -0.2491945916 -0.0518062434
0.1949002545 -0.2063633724 -0.0520957885
0.2427004514 -0.2119405980 -0.0520621501
0.4295622311 -0.2547718171 -0.0517726050
0.4545470815 -0.2524298506 -0.0517945336
0.3383008451 -0.2230950490 -0.0519948733
0.4339012388 -0.2342495000 -0.0519275965
0.4449612857 -0.1707906535 -0.0524064509
0.4616769500 -0.2053749578 -0.0521494199
0.4021333501 -0.1937108873 -0.0522267715
0.4449612857 -0.1707906535 -0.0524064509
0.3425897503 -0.1820468169 -0.0523041232
0.3044601182 -0.1589226295 -0.0524713145
0.3895966019 -0.1677726591 -0.0524195448
0.4151894858 -0.1649586182 -0.0524451267
0.2235025506 -0.1587186760 -0.0524588264
0.1853729185 -0.1355944887 -0.0526260177
0.0746435510 -0.1295585000 -0.0526522054
0.1811940025 -0.1269484126 -0.0526902755
0.2642410281 -0.1314754041 -0.0526706347
0.3002812022 -0.1502765535 -0.0525355722
0.4026527376 -0.1390203900 -0.0526379000
0.3044601182 -0.1589226295 -0.0524713145
-0.0146718488 -0.1120623943 -0.0527682329
-0.0528014808 -0.0889382070 -0.0529354242
-0.1635308484 -0.0829022182 -0.0529616119
-0.0569803969 -0.0802921309 -0.0529996820
-0.2826180481 -0.0595740774 -0.0531163152
-0.3463405640 -0.0392639309 -0.0532579245
-0.1739781386 -0.0612870280 -0.0531222563
-0.1123450807 -0.0772741365 -0.0530127758
0.0271113578 -0.0869806414 -0.0529639767
0.0641962608 -0.1079433098 -0.0528128498
0.1707467123 -0.1053332224 -0.0528509199
0.0683751769 -0.1165893859 -0.0527485921
0.2856549959 -0.1200152872 -0.0527604744
0.3472880538 -0.1360023957 -0.0526509939
0.1811940025 -0.1269484126 -0.0526902755
0.1216504026 -0.1152843422 -0.0527676271
0.4005632795 -0.1346973520 -0.0526700289
0.3252938481 -0.1154578500 -0.0528015918
0.1132925705 -0.0979921900 -0.0528961426
0.3163862033 -0.1095086152 -0.0528447619
-0.1165239968 -0.0686280604 -0.0530770336
-0.2403399252 -0.0479967609 -0.0532106491
0.0910234585 -0.0831191030 -0.0530040678
0.2103855645 -0.1007757852 -0.0528920373
0.3034715713 -0.0517015234 -0.0532769872
0.1764041048 -0.0429508001 -0.0533207485
-0.2427572993 -0.0323303396 -0.0533279749
0.1674932586 -0.0405125569 -0.0533375304
0.3469114003 0.0562921369 -0.0540961607
0.2945789768 0.0520155580 -0.0540549558
0.2190726573 0.0310136595 -0.0538840345
0.2799997131 0.0582399283 -0.0540992114
0.1144078104 0.0224605017 -0.0538016246
0.0474961232 0.0244082932 -0.0538046753
0.1826244980 0.0465745854 -0.0539946737
0.2422465533 0.0477389791 -0.0540137508
-0.0949218834 0.0053541861 -0.0536368048
-0.1618335706 0.0073019776 -0.0536398555
-0.3565840007 -0.0160287083 -0.0534307800
-0.1691232024 0.0104141628 -0.0536619833
-0.0230603799 0.0279121772 -0.0538187899
0.0402064914 0.0275204783 -0.0538268031
0.2203776578 0.0570755346 -0.0540801343
0.0474961232 0.0244082932 -0.0538046753
0.2309109830 0.2157358072 -0.0552744049
0.2007069234 0.2686967760 -0.0556672138
0.1713125466 0.3211166678 -0.0560560963
0.1726185498 0.2687206566 -0.0556625287
0.2265487805 0.1671257817 -0.0549083101
0.1677479280 0.2579217397 -0.0555805235
0.0931904605 0.2409704484 -0.0554402098
0.1898003571 0.1471715012 -0.0547519748
0.0861651482 0.2374655153 -0.0554126510
0.0426930650 0.2512766861 -0.0555089230
0.0760006668 0.1950718814 -0.0550922719
0.0472813598 0.2476267357 -0.0554822857
0.0891007333 0.1962761745 -0.0551035918
0.1231104866 0.1718051871 -0.0549255648
0.1833203730 0.1497427860 -0.0547701776
0.2382398131 0.0995965180 -0.0544028037
0.1702203065 0.1485384928 -0.0547588577
0.1231104866 0.1718051871 -0.0549255648
0.0079811602 0.2440138562 -0.0554483259
0.0288908469 0.2183385756 -0.0552589790
0.0760006668 0.1950718814 -0.0550922719
0.0288908469 0.2183385756 -0.0552589790
-0.0182189729 0.2416052699 -0.0554256861
-0.0653287928 0.2648719642 -0.0555923932
0.0079811602 0.2440138562 -0.0554483259
-0.0129285266 0.2696891368 -0.0556376729
-0.1590501818 0.2630622591 -0.0555625605
-0.0347542347 0.1712645464 -0.0548941611
-0.1361205595 0.2307683632 -0.0553238197
-0.0284029913 0.1763907197 -0.0549337880
0.0144045092 0.1756117420 -0.0549353472
0.1047195505 0.1425177692 -0.0547022636
0.2187883620 0.0932662989 -0.0543518588
0.0983683071 0.1373915959 -0.0546626368
0.0523851848 0.1356074870 -0.0546412642
-0.1551742897 0.2153898435 -0.0552049392
-0.1155424108 0.2120477791 -0.0551866849
-0.0347542347 0.1712645464 -0.0548941611
-0.0807373570 0.1694804375 -0.0548727885
-0.1884549252 0.2238580811 -0.0552628202
-0.1472986279 0.1864169128 -0.0549885507
-0.1884549252 0.2238580811 -0.0552628202
-0.2217355606 0.2323263187 -0.0553207013
-0.4897572012 -0.1045825596 0.0154265848
-0.4974376138 -0.0773447266 -0.0042534021
-0.4944481575 -0.1418476469 0.0157074712
-0.4909333132 -0.1140452038 -0.0039786980
-0.4630518138 -0.1676821379 0.0158961986
-0.4866024445 -0.1484526421 -0.0037208513
-0.2601291793 -0.3514353328 0.0172420924
-0.2866411797 -0.3570054055 -0.0216646630
-0.1856944598 -0.3399131939 -0.0023340011
-0.1856877139 -0.3396204490 0.0366170077
-0.2277100192 -0.3560772245 -0.0022052401
-0.1856944598 -0.3399131939 -0.0023340011
-0.1057697677 -0.2537916335 0.0164814963
-0.1352171964 -0.2690743154 -0.0028751484
-0.1065047616 -0.2071022786 0.0161307194
-0.0460597764 -0.1743051796 0.0158737572
-0.0357641165 -0.1622193016 0.0157811400
0.0762511695 -0.1958464772 -0.0034621324
0.0762579153 -0.1955537323 0.0354888764
0.0326035258 -0.2017363440 -0.0034103065
0.0762511695 -0.1958464772 -0.0034621324
0.1051831917 -0.2019057671 0.0160550019
0.1550467938 -0.2535661264 0.0164346310
0.1496083107 -0.2264196455 -0.0032450576
0.2513709518 -0.2798583932 0.0166155541
0.2202105251 -0.2799775618 -0.0028547587
0.2932369458 -0.3078198392 0.0168184538
0.2722972029 -0.2941318611 -0.0222340049
0.3347647043 -0.3168199180 0.0168789037
0.3997454069 -0.3315995605 0.0169787295
0.3717407175 -0.3231647730 -0.0025564190
0.4481010692 -0.3418222463 0.0170471857
0.4239164922 -0.3370036483 -0.0219380512
0.4616251571 -0.2977016606 0.0167132454
0.4548563673 -0.3200546984 -0.0220707932
0.4913563112 -0.2313638304 0.0162095197
0.4891170787 -0.2420881894 -0.0031860963
0.4956747827 -0.2209043443 0.0161301612
0.4730860714 -0.1549284865 -0.0038383879
0.4730928173 -0.1546357415 0.0351126209
0.4910219446 -0.1920369826 -0.0035625971
0.4730860714 -0.1549284865 -0.0038383879
0.4305372021 -0.1137975912 0.0153364578
0.4557220584 -0.1307666697 -0.0040169741
0.4336350342 -0.0759953509 0.0150518102
0.4313082872 -0.1044934036 -0.0042102085
0.3840687158 0.0264305165 -0.0051860148
0.3840754617 0.0267232615 0.0337649940
0.3845608868 -0.0175193253 -0.0048557853
0.3840687158 0.0264305165 -0.0051860148
0.3089064526 0.0845365353 0.0138668989
0.2561287423 0.1100509958 0.0136842798
0.2789892519 0.0917166483 -0.0056584886
0.2518156754 0.1601384626 0.0133085834
0.2539654630 0.1348019843 -0.0254545772
0.2469979078 0.2125761128 0.0129153110
0.2449071408 0.1890652626 -0.0258608361
0.2425159229 0.2204362762 0.0128570124
0.2347352784 0.2739203478 0.0124563886
0.2363778623 0.2508156488 -0.0263234576
0.1959371334 0.3094486885 0.0121960869
0.2153294600 0.2913917732 -0.0266247711
0.1795220258 0.3489422082 0.0119021075
0.1918299835 0.3191756959 -0.0073529124
0.1682395599 0.3564775378 0.0118474281
0.1357647573 0.3170262722 0.0121495570
0.1463541797 0.3402268249 -0.0269798560
0.1226241474 0.3170364883 0.0121517561
0.0817852562 0.2893963661 0.0123665644
0.1025555942 0.3099877474 -0.0072683970
0.0400169267 0.2946534358 0.0123342875
0.0504556362 0.2931927959 -0.0071331477
-0.0651103522 0.2730802156 -0.0069619724
-0.0651036063 0.2733729606 0.0319890364
-0.0142964444 0.2777512279 -0.0070058788
-0.0651103522 0.2730802156 -0.0069619724
-0.1662648483 0.3077582035 0.0122715214
-0.1423959710 0.2940452910 -0.0265827602
-0.2066254649 0.2822448852 0.0124702624
-0.1864519025 0.2947087994 -0.0265801169
-0.2055304825 0.2695237768 0.0125656810
-0.2696371927 0.2092550707 0.0130297464
-0.2926508726 0.1592975841 0.0134091986
-0.2908084585 0.1503399645 0.0134762025
-0.3115936951 0.1355649836 0.0135908469
-0.4055556957 0.1177673439 0.0137408822
-0.3878091431 0.1031333153 -0.0251054162
-0.4212194961 0.0850898871 0.0139891896
-0.4094750187 0.1094516072 -0.0056725453
-0.4565688855 0.0464925226 0.0142853988
-0.4389009367 0.0654984599 -0.0248137146
-0.4999932541 -0.0680702857 0.0151539415
-0.4843135052 -0.0448773234 -0.0239762960
3 197 229 10
3 229 12 10
3 10 12 138
3 12 191 138
3 138 191 50
3 191 141 50
3 50 141 7
3 141 220 7
3 7 220 236
3 220 181 236
3 236 942 83
3 181 942 236
3 79 943 181
3 83 943 79
3 83 944 179
3 79 944 83
3 227 945 79
3 179 945 227
3 542 946 179
3 98 946 542
3 179 947 542
3 227 947 179
3 543 948 153
3 227 948 543
3 98 949 153
3 543 949 98
3 98 950 99
3 153 950 98
3 211 951 153
3 99 951 211
3 99 211 24
3 211 135 24
3 24 544 225
3 135 544 24
3 119 545 135
3 225 545 119
3 225 952 139
3 119 952 225
3 112 953 119
3 139 953 112
3 139 112 102
3 112 203 102
3 102 203 206
3 203 9 206
3 206 9 214
3 9 77 214
3 214 77 85
3 77 104 85
3 85 954 115
3 104 954 85
3 52 955 104
3 115 955 52
3 115 52 75
3 52 66 75
3 75 66 174
3 66 199 174
3 174 956 68
3 199 956 174
3 133 957 199
3 68 957 133
3 68 546 108
3 133 546 68
3 121 547 133
3 108 547 121
3 108 121 39
3 121 128 39
3 39 128 48
3 128 29 48
3 48 29 107
3 29 114 107
3 107 958 45
3 114 958 107
3 58 959 114
3 45 959 58
3 45 58 130
3 58 54 130
3 130 960 131
3 54 960 130
3 56 961 54
3 131 961 56
3 131 56 234
3 56 72 234
3 234 72 235
3 72 74 235
3 235 74 171
3 74 126 171
3 171 126 194
3 126 117 194
3 194 117 196
3 145 962 117
3 196 962 145
3 196 145 151
3 145 81 151
3 151 81 30
3 81 64 30
3 30 64 82
3 64 232 82
3 82 232 178
3 232 47 178
3 178 548 212
3 47 548 178
3 62 549 47
3 212 549 62
3 212 62 213
3 62 60 213
3 213 60 97
3 60 137 97
3 97 137 105
3 137 164 105
3 105 164 96
3 164 17 96
3 17 550 96
3 3 550 17
3 189 551 17
3 3 551 189
3 3 963 4
3 189 963 3
3 187 964 189
3 4 964 187
3 4 187 89
3 187 160 89
3 89 160 90
3 160 162 90
3 90 162 67
3 162 218 67
3 67 965 150
3 218 965 67
3 218 41 150
3 150 966 100
3 41 966 150
3 36 967 41
3 100 967 36
3 100 36 101
3 36 38 101
3 101 968 230
3 38 968 101
3 224 969 38
3 230 969 224
3 230 224 176
3 224 20 176
3 176 20 42
3 20 6 42
3 42 970 207
3 6 970 42
3 166 971 6
3 207 971 166
3 207 166 157
3 166 95 157
3 157 95 158
3 95 93 158
3 158 972 34
3 93 972 158
3 44 973 93
3 34 973 44
3 34 44 13
3 44 185 13
3 13 185 110
3 185 201 110
3 110 201 106
3 201 70 106
3 106 70 91
3 70 173 91
3 552 974 91
3 0 974 552
3 173 975 91
3 552 975 173
3 553 976 33
3 173 976 553
3 33 977 553
3 0 977 33
3 0 33 168
3 33 209 168
3 168 978 84
3 209 978 168
3 88 979 209
3 84 979 88
3 84 88 109
3 143 980 88
3 109 980 143
3 109 143 18
3 143 170 18
3 18 981 31
3 170 981 18
3 149 982 170
3 31 982 149
3 31 149 25
3 149 193 25
3 25 193 86
3 193 2 86
3 86 2 122
3 122 983 147
3 2 983 122
3 122 147 49
3 147 205 49
3 49 205 195
3 205 156 195
3 195 156 177
3 156 124 177
3 177 124 233
3 124 183 233
3 233 984 175
3 183 984 233
3 27 985 183
3 175 985 27
3 175 27 167
3 27 22 167
3 167 22 129
3 22 222 129
3 129 986 154
3 222 986 129
3 216 987 222
3 154 987 216
3 154 988 23
3 216 988 154
3 15 989 216
3 23 989 15
3 23 990 197
3 15 990 23
3 229 991 15
3 197 991 229
3 197 992 23
3 10 992 197
3 23 10 138
3 23 50 7
3 7 236 83
3 238 993 554
3 239 993 238
3 554 994 7
3 239 994 554
3 555 995 239
3 23 995 555
3 239 996 555
3 238 996 239
3 556 997 240
3 7 997 556
3 556 998 238
3 240 998 556
3 557 999 240
3 237 999 557
3 557 1000 7
3 240 1000 557
3 558 1001 241
3 237 1001 558
3 241 1002 558
3 242 1002 241
3 559 1003 242
3 99 1003 559
3 242 1004 559
3 241 1004 242
3 560 1005 243
3 237 1005 560
3 560 1006 241
3 243 1006 560
3 561 1007 243
3 7 1007 561
3 561 1008 237
3 243 1008 561
3 23 99 24
3 562 1009 244
3 139 1009 562
3 244 1010 562
3 245 1010 244
3 563 1011 245
3 23 1011 563
3 245 1012 563
3 244 1012 245
3 246 1013 139
3 564 1013 246
3 564 1014 244
3 246 1014 564
3 565 1015 139
3 246 1015 565
3 139 1016 565
3 102 1016 139
3 247 1017 206
3 566 1017 247
3 566 1018 23
3 247 1018 566
3 567 1019 206
3 247 1019 567
3 206 1020 567
3 214 1020 206
3 568 1021 248
3 85 1021 568
3 248 1022 568
3 249 1022 248
3 569 1023 249
3 23 1023 569
3 249 1024 569
3 248 1024 249
3 250 1025 85
3 570 1025 250
3 570 1026 248
3 250 1026 570
3 571 1027 85
3 250 1027 571
3 571 1028 115
3 85 1028 571
3 251 572 75
3 23 572 251
3 75 573 251
3 174 573 75
3 68 1029 174
3 252 1029 68
3 252 1030 108
3 68 1030 252
3 174 574 23
3 108 574 174
3 108 39 48
3 107 1031 48
3 45 1031 107
3 130 131 234
3 130 1032 48
3 234 1032 130
3 234 235 171
3 234 1033 48
3 171 1033 234
3 108 48 171
3 253 575 151
3 254 575 253
3 254 576 108
3 253 576 254
3 255 577 151
3 253 577 255
3 151 578 255
3 30 578 151
3 259 579 256
3 108 579 259
3 256 580 259
3 258 580 256
3 260 581 258
3 257 581 260
3 258 582 260
3 256 582 258
3 261 583 257
3 262 583 261
3 262 584 23
3 261 584 262
3 257 585 261
3 263 585 257
3 263 586 256
3 257 586 263
3 266 587 108
3 256 587 266
3 108 588 266
3 265 588 108
3 267 589 265
3 264 589 267
3 265 590 267
3 108 590 265
3 268 591 264
3 269 591 268
3 269 592 82
3 268 592 269
3 264 593 268
3 270 593 264
3 270 594 108
3 264 594 270
3 273 595 272
3 274 595 273
3 274 596 213
3 273 596 274
3 275 597 273
3 271 597 275
3 272 598 273
3 275 598 272
3 277 599 213
3 276 599 277
3 97 600 213
3 277 600 97
3 278 601 276
3 272 601 278
3 278 602 97
3 276 602 278
3 281 603 271
3 280 603 281
3 279 604 271
3 281 604 279
3 282 605 280
3 23 605 282
3 282 606 279
3 280 606 282
3 284 607 283
3 279 607 284
3 284 608 97
3 283 608 284
3 285 609 279
3 283 609 285
3 271 610 279
3 285 610 271
3 290 611 286
3 289 611 290
3 287 612 286
3 290 612 287
3 291 613 289
3 288 613 291
3 291 614 287
3 289 614 291
3 292 615 288
3 293 615 292
3 293 616 96
3 292 616 293
3 294 617 292
3 287 617 294
3 288 618 292
3 294 618 288
3 296 619 295
3 297 619 296
3 297 620 287
3 296 620 297
3 298 621 296
3 23 621 298
3 295 622 296
3 298 622 295
3 300 623 287
3 299 623 300
3 286 624 287
3 300 624 286
3 301 625 299
3 295 625 301
3 301 626 286
3 299 626 301
3 304 627 303
3 305 627 304
3 305 628 96
3 304 628 305
3 306 629 304
3 302 629 306
3 303 630 304
3 306 630 303
3 308 631 307
3 3 631 308
3 308 632 96
3 307 632 308
3 309 633 307
3 303 633 309
3 309 634 3
3 307 634 309
3 312 635 302
3 311 635 312
3 310 636 302
3 312 636 310
3 313 637 311
3 286 637 313
3 313 638 310
3 311 638 313
3 315 639 314
3 310 639 315
3 315 640 3
3 314 640 315
3 316 641 310
3 314 641 316
3 302 642 310
3 316 642 302
3 89 90 67
3 150 100 101
3 101 230 176
3 101 176 42
3 150 101 207
3 317 1034 34
3 643 1034 317
3 643 1035 150
3 317 1035 643
3 644 1036 34
3 317 1036 644
3 34 1037 644
3 13 1037 34
3 318 1038 110
3 645 1038 318
3 645 1039 150
3 318 1039 645
3 646 1040 110
3 318 1040 646
3 110 1041 646
3 106 1041 110
3 67 150 91
3 0 1042 67
3 168 1042 0
3 84 1043 168
3 109 1043 84
3 321 1044 319
3 647 1044 321
3 647 1045 168
3 321 1045 647
3 648 1046 319
3 321 1046 648
3 319 1047 648
3 320 1047 319
3 322 1048 320
3 649 1048 322
3 649 1049 67
3 322 1049 649
3 650 1050 320
3 322 1050 650
3 320 1051 650
3 319 1051 320
3 651 1052 323
3 168 1052 651
3 323 1053 651
3 324 1053 323
3 652 1054 324
3 319 1054 652
3 324 1055 652
3 323 1055 324
3 653 1056 325
3 168 1056 653
3 653 1057 323
3 325 1057 653
3 654 1058 325
3 18 1058 654
3 654 1059 168
3 325 1059 654
3 89 67 25
3 25 86 122
3 328 655 326
3 25 655 328
3 326 656 328
3 327 656 326
3 329 657 327
3 89 657 329
3 327 658 329
3 326 658 327
3 330 659 25
3 331 659 330
3 331 660 326
3 330 660 331
3 332 661 25
3 330 661 332
3 49 662 25
3 332 662 49
3 335 1060 333
3 49 1060 335
3 333 1061 335
3 334 1061 333
3 336 1062 334
3 89 1062 336
3 334 1063 336
3 333 1063 334
3 337 1064 49
3 338 1064 337
3 338 1065 333
3 337 1065 338
3 339 1066 49
3 337 1066 339
3 49 1067 339
3 195 1067 49
3 233 1068 177
3 175 1068 233
3 342 1069 340
3 663 1069 342
3 663 1070 177
3 342 1070 663
3 664 1071 340
3 342 1071 664
3 340 1072 664
3 341 1072 340
3 343 1073 341
3 665 1073 343
3 665 1074 89
3 343 1074 665
3 666 1075 341
3 343 1075 666
3 341 1076 666
3 340 1076 341
3 667 1077 344
3 177 1077 667
3 344 1078 667
3 345 1078 344
3 668 1079 345
3 340 1079 668
3 345 1080 668
3 344 1080 345
3 346 1081 177
3 669 1081 346
3 669 1082 344
3 346 1082 669
3 670 1083 346
3 175 1083 670
3 177 1084 346
3 670 1084 177
3 175 167 129
3 129 1085 175
3 154 1085 129
3 351 671 349
3 347 671 351
3 349 672 351
3 350 672 349
3 352 673 350
3 175 673 352
3 350 674 352
3 349 674 350
3 353 675 347
3 354 675 353
3 354 676 349
3 353 676 354
3 355 677 347
3 353 677 355
3 355 678 348
3 347 678 355
3 358 679 356
3 348 679 358
3 356 680 358
3 357 680 356
3 359 681 357
3 89 681 359
3 357 682 359
3 356 682 357
3 360 683 348
3 361 683 360
3 361 684 356
3 360 684 361
3 362 685 348
3 360 685 362
3 362 686 347
3 348 686 362
3 366 687 365
3 363 687 366
3 366 688 175
3 365 688 366
3 367 689 363
3 365 689 367
3 367 690 364
3 363 690 367
3 368 691 364
3 369 691 368
3 369 692 347
3 368 692 369
3 370 693 364
3 368 693 370
3 370 694 363
3 364 694 370
3 373 695 372
3 371 695 373
3 373 696 175
3 372 696 373
3 374 697 372
3 363 697 374
3 374 698 371
3 372 698 374
3 376 699 375
3 371 699 376
3 376 700 23
3 375 700 376
3 377 701 375
3 175 701 377
3 377 702 371
3 375 702 377
3 89 3 4
3 703 1086 228
3 229 1086 703
3 228 1087 703
3 11 1087 228
3 704 1088 11
3 12 1088 704
3 11 1089 704
3 190 1089 11
3 705 1090 190
3 191 1090 705
3 190 1091 705
3 140 1091 190
3 141 140 219
3 220 219 180
3 378 706 180
3 181 706 378
3 378 707 78
3 180 707 378
3 379 708 78
3 79 708 379
3 379 709 226
3 78 709 379
3 381 710 380
3 226 710 381
3 381 711 227
3 380 711 381
3 382 712 380
3 152 712 382
3 382 713 226
3 380 713 382
3 383 1092 152
3 153 1092 383
3 383 1093 210
3 152 1093 383
3 211 210 134
3 714 1094 384
3 134 1094 714
3 714 1095 135
3 384 1095 714
3 715 1096 384
3 118 1096 715
3 715 1097 134
3 384 1097 715
3 385 716 118
3 119 716 385
3 385 717 111
3 118 717 385
3 718 1098 111
3 112 1098 718
3 202 1099 111
3 718 1099 202
3 202 719 203
3 8 719 202
3 9 8 76
3 76 1100 77
3 103 1100 76
3 386 720 103
3 104 720 386
3 386 721 51
3 103 721 386
3 51 1101 52
3 65 1101 51
3 65 1102 66
3 198 1102 65
3 387 722 198
3 199 722 387
3 387 723 132
3 198 723 387
3 724 1103 388
3 132 1103 724
3 724 1104 133
3 388 1104 724
3 725 1105 388
3 120 1105 725
3 725 1106 132
3 388 1106 725
3 120 1107 121
3 127 1107 120
3 127 726 128
3 28 726 127
3 727 1108 28
3 29 1108 727
3 28 1109 727
3 113 1109 28
3 389 728 113
3 114 728 389
3 389 729 57
3 113 729 389
3 730 1110 57
3 58 1110 730
3 53 1111 57
3 730 1111 53
3 731 1112 53
3 54 1112 731
3 731 1113 55
3 53 1113 731
3 55 732 56
3 71 732 55
3 71 1114 72
3 73 1114 71
3 74 73 125
3 733 1115 125
3 126 1115 733
3 116 1116 125
3 733 1116 116
3 734 1117 116
3 117 1117 734
3 734 1118 144
3 116 1118 734
3 735 1119 144
3 145 1119 735
3 735 1120 80
3 144 1120 735
3 80 736 81
3 63 736 80
3 737 1121 63
3 64 1121 737
3 63 1122 737
3 231 1122 63
3 231 1123 232
3 46 1123 231
3 738 1124 390
3 46 1124 738
3 738 1125 47
3 390 1125 738
3 739 1126 390
3 61 1126 739
3 739 1127 46
3 390 1127 739
3 740 1128 61
3 62 1128 740
3 61 1129 740
3 59 1129 61
3 741 1130 59
3 60 1130 741
3 136 1131 59
3 741 1131 136
3 136 742 137
3 163 742 136
3 163 743 164
3 16 743 163
3 744 1132 391
3 16 1132 744
3 744 1133 17
3 391 1133 744
3 745 1134 391
3 188 1134 745
3 745 1135 16
3 391 1135 745
3 392 746 188
3 189 746 392
3 392 747 186
3 188 747 392
3 187 186 159
3 159 1136 160
3 161 1136 159
3 162 161 217
3 748 1137 217
3 218 1137 748
3 217 1138 748
3 40 1138 217
3 749 1139 40
3 41 1139 749
3 749 1140 35
3 40 1140 749
3 36 35 37
3 750 1141 37
3 38 1141 750
3 750 1142 223
3 37 1142 750
3 223 1143 224
3 19 1143 223
3 751 1144 19
3 20 1144 751
3 751 1145 5
3 19 1145 751
3 393 1146 5
3 6 1146 393
3 393 1147 165
3 5 1147 393
3 752 1148 165
3 166 1148 752
3 94 1149 165
3 752 1149 94
3 94 1150 95
3 92 1150 94
3 394 1151 92
3 93 1151 394
3 394 1152 43
3 92 1152 394
3 43 1153 44
3 184 1153 43
3 753 1154 184
3 185 1154 753
3 184 1155 753
3 200 1155 184
3 754 1156 200
3 201 1156 754
3 200 1157 754
3 69 1157 200
3 69 755 70
3 172 755 69
3 396 1158 395
3 172 1158 396
3 396 1159 173
3 395 1159 396
3 397 1160 395
3 32 1160 397
3 397 1161 172
3 395 1161 397
3 32 756 33
3 208 756 32
3 398 1162 208
3 209 1162 398
3 398 1163 87
3 208 1163 398
3 757 1164 87
3 88 1164 757
3 757 1165 142
3 87 1165 757
3 142 1166 143
3 169 1166 142
3 399 758 169
3 170 758 399
3 399 759 148
3 169 759 399
3 149 148 192
3 192 1167 193
3 1 1167 192
3 400 760 1
3 2 760 400
3 400 761 146
3 1 761 400
3 146 1168 147
3 204 1168 146
3 204 1169 205
3 155 1169 204
3 156 155 123
3 123 1170 124
3 182 1170 123
3 401 762 182
3 183 762 401
3 401 763 26
3 182 763 401
3 764 1171 26
3 27 1171 764
3 764 1172 21
3 26 1172 764
3 765 1173 21
3 22 1173 765
3 221 1174 21
3 765 1174 221
3 402 1175 221
3 222 1175 402
3 402 1176 215
3 221 1176 402
3 403 766 215
3 216 766 403
3 403 767 14
3 215 767 403
3 404 1177 14
3 15 1177 404
3 404 1178 228
3 14 1178 404
3 405 1179 138
3 23 1179 405
3 138 1180 405
3 50 1180 138
3 83 768 7
3 179 768 83
3 769 1181 179
3 7 1181 769
3 406 1182 179
3 769 1182 406
3 770 1183 406
3 98 1183 770
3 406 1184 770
3 179 1184 406
3 407 771 98
3 408 771 407
3 408 772 7
3 407 772 408
3 409 773 98
3 407 773 409
3 98 774 409
3 99 774 98
3 775 1185 412
3 410 1185 775
3 775 1186 24
3 412 1186 775
3 776 1187 410
3 412 1187 776
3 411 1188 410
3 776 1188 411
3 413 1189 411
3 777 1189 413
3 777 1190 23
3 413 1190 777
3 778 1191 411
3 413 1191 778
3 411 1192 778
3 410 1192 411
3 414 1193 779
3 415 1193 414
3 779 1194 24
3 415 1194 779
3 780 1195 415
3 410 1195 780
3 415 1196 780
3 414 1196 415
3 781 1197 416
3 24 1197 781
3 781 1198 414
3 416 1198 781
3 782 1199 416
3 225 1199 782
3 782 1200 24
3 416 1200 782
3 783 1201 419
3 139 1201 783
3 783 1202 225
3 419 1202 783
3 784 1203 419
3 418 1203 784
3 784 1204 139
3 419 1204 784
3 420 1205 418
3 785 1205 420
3 785 1206 417
3 420 1206 785
3 420 1207 786
3 418 1207 420
3 786 1208 139
3 418 1208 786
3 421 1209 417
3 787 1209 421
3 787 1210 422
3 421 1210 787
3 788 1211 422
3 23 1211 788
3 422 1212 788
3 421 1212 422
3 417 1213 421
3 789 1213 417
3 789 1214 423
3 417 1214 789
3 790 1215 423
3 139 1215 790
3 423 1216 790
3 417 1216 423
3 206 1217 102
3 791 1217 206
3 791 1218 424
3 206 1218 791
3 792 1219 424
3 23 1219 792
3 424 1220 792
3 206 1220 424
3 85 1221 214
3 426 1221 85
3 426 1222 425
3 85 1222 426
3 427 1223 425
3 23 1223 427
3 425 1224 427
3 85 1224 425
3 75 793 115
3 429 793 75
3 429 794 428
3 75 794 429
3 430 795 428
3 23 795 430
3 428 796 430
3 75 796 428
3 45 797 48
3 130 797 45
3 171 1225 108
3 194 1225 171
3 798 1226 194
3 108 1226 798
3 194 1227 798
3 196 1227 194
3 799 1228 196
3 432 1228 799
3 151 1229 196
3 799 1229 151
3 800 1230 432
3 431 1230 800
3 800 1231 151
3 432 1231 800
3 433 1232 431
3 801 1232 433
3 801 1233 108
3 433 1233 801
3 802 1234 433
3 151 1234 802
3 431 1235 433
3 802 1235 431
3 435 1236 434
3 436 1236 435
3 436 1237 30
3 435 1237 436
3 437 1238 435
3 108 1238 437
3 434 1239 435
3 437 1239 434
3 439 1240 30
3 438 1240 439
3 82 1241 30
3 439 1241 82
3 440 1242 438
3 434 1242 440
3 440 1243 82
3 438 1243 440
3 443 803 441
3 82 803 443
3 441 804 443
3 442 804 441
3 444 805 442
3 23 805 444
3 442 806 444
3 441 806 442
3 445 807 82
3 446 807 445
3 446 808 441
3 445 808 446
3 447 809 82
3 445 809 447
3 82 810 447
3 178 810 82
3 811 1244 451
3 212 1244 811
3 811 1245 178
3 451 1245 811
3 812 1246 451
3 450 1246 812
3 812 1247 212
3 451 1247 812
3 452 1248 450
3 813 1248 452
3 813 1249 449
3 452 1249 813
3 452 1250 814
3 450 1250 452
3 814 1251 212
3 450 1251 814
3 453 1252 449
3 815 1252 453
3 815 1253 454
3 453 1253 815
3 816 1254 454
3 448 1254 816
3 454 1255 816
3 453 1255 454
3 449 1256 453
3 817 1256 449
3 817 1257 455
3 449 1257 817
3 818 1258 455
3 212 1258 818
3 455 1259 818
3 449 1259 455
3 456 1260 448
3 819 1260 456
3 819 1261 458
3 456 1261 819
3 820 1262 458
3 457 1262 820
3 458 1263 820
3 456 1263 458
3 459 1264 457
3 821 1264 459
3 821 1265 23
3 459 1265 821
3 457 1266 459
3 822 1266 457
3 822 1267 456
3 457 1267 822
3 448 1268 456
3 823 1268 448
3 823 1269 461
3 448 1269 823
3 824 1270 461
3 460 1270 824
3 461 1271 824
3 448 1271 461
3 462 1272 460
3 825 1272 462
3 825 1273 212
3 462 1273 825
3 460 1274 462
3 826 1274 460
3 826 1275 448
3 460 1275 826
3 213 1276 212
3 465 1276 213
3 465 1277 464
3 213 1277 465
3 466 1278 464
3 463 1278 466
3 464 1279 466
3 213 1279 464
3 467 1280 463
3 468 1280 467
3 468 1281 23
3 467 1281 468
3 463 1282 467
3 469 1282 463
3 469 1283 213
3 463 1283 469
3 105 827 97
3 472 827 105
3 472 828 471
3 105 828 472
3 473 829 471
3 470 829 473
3 471 830 473
3 105 830 471
3 474 831 470
3 475 831 474
3 475 832 23
3 474 832 475
3 470 833 474
3 476 833 470
3 476 834 105
3 470 834 476
3 96 1284 105
3 835 1284 96
3 835 1285 477
3 96 1285 835
3 836 1286 477
3 23 1286 836
3 477 1287 836
3 96 1287 477
3 837 1288 89
3 3 1288 837
3 837 1289 480
3 89 1289 837
3 838 1290 480
3 479 1290 838
3 480 1291 838
3 89 1291 480
3 481 1292 479
3 839 1292 481
3 839 1293 478
3 481 1293 839
3 479 1294 481
3 840 1294 479
3 840 1295 89
3 479 1295 840
3 482 1296 478
3 841 1296 482
3 841 1297 483
3 482 1297 841
3 842 1298 483
3 23 1298 842
3 483 1299 842
3 482 1299 483
3 478 1300 482
3 843 1300 478
3 843 1301 484
3 478 1301 843
3 844 1302 484
3 89 1302 844
3 484 1303 844
3 478 1303 484
3 845 1304 42
3 101 1304 845
3 42 1305 845
3 207 1305 42
3 150 207 157
3 157 846 150
3 158 846 157
3 34 1306 158
3 486 1306 34
3 486 1307 485
3 34 1307 486
3 487 1308 485
3 150 1308 487
3 485 1309 487
3 34 1309 485
3 13 847 489
3 110 847 13
3 489 848 488
3 110 848 489
3 490 849 488
3 150 849 490
3 490 850 110
3 488 850 490
3 491 1310 106
3 492 1310 491
3 492 1311 150
3 491 1311 492
3 493 1312 106
3 491 1312 493
3 106 1313 493
3 91 1313 106
3 496 1314 494
3 851 1314 496
3 851 1315 91
3 496 1315 851
3 852 1316 494
3 496 1316 852
3 852 1317 495
3 494 1317 852
3 497 1318 495
3 853 1318 497
3 853 1319 67
3 497 1319 853
3 854 1320 495
3 497 1320 854
3 854 1321 494
3 495 1321 854
3 855 1322 498
3 91 1322 855
3 855 1323 499
3 498 1323 855
3 856 1324 499
3 494 1324 856
3 856 1325 498
3 499 1325 856
3 857 1326 500
3 498 1326 857
3 857 1327 0
3 500 1327 857
3 858 1328 91
3 498 1328 858
3 858 1329 500
3 91 1329 858
3 109 1330 168
3 18 1330 109
3 503 1331 501
3 859 1331 503
3 859 1332 18
3 503 1332 859
3 860 1333 501
3 503 1333 860
3 501 1334 860
3 502 1334 501
3 504 1335 502
3 861 1335 504
3 861 1336 67
3 504 1336 861
3 862 1337 502
3 504 1337 862
3 502 1338 862
3 501 1338 502
3 863 1339 505
3 18 1339 863
3 505 1340 863
3 506 1340 505
3 864 1341 506
3 501 1341 864
3 506 1342 864
3 505 1342 506
3 865 1343 507
3 18 1343 865
3 865 1344 505
3 507 1344 865
3 866 1345 18
3 507 1345 866
3 866 1346 31
3 18 1346 866
3 508 867 31
3 509 867 508
3 509 868 67
3 508 868 509
3 510 869 31
3 508 869 510
3 31 870 510
3 25 870 31
3 25 122 49
3 512 871 511
3 195 871 512
3 512 872 89
3 511 872 512
3 513 873 195
3 511 873 513
3 177 874 195
3 513 874 177
3 514 875 154
3 175 875 514
3 154 876 514
3 23 876 154
3 877 1347 12
3 11 1347 877
3 12 1348 877
3 229 1348 12
3 878 1349 191
3 190 1349 878
3 191 1350 878
3 12 1350 191
3 879 1351 141
3 140 1351 879
3 141 1352 879
3 191 1352 141
3 141 219 220
3 220 180 181
3 515 880 79
3 78 880 515
3 515 881 181
3 79 881 515
3 516 882 227
3 226 882 516
3 516 883 79
3 227 883 516
3 518 884 517
3 153 884 518
3 518 885 152
3 517 885 518
3 519 886 517
3 227 886 519
3 519 887 153
3 517 887 519
3 520 1353 211
3 210 1353 520
3 520 1354 153
3 211 1354 520
3 211 134 135
3 888 1355 521
3 119 1355 888
3 888 1356 118
3 521 1356 888
3 889 1357 521
3 135 1357 889
3 889 1358 119
3 521 1358 889
3 522 890 112
3 111 890 522
3 522 891 119
3 112 891 522
3 892 1359 203
3 202 1359 892
3 203 1360 892
3 112 1360 203
3 9 893 8
3 203 893 9
3 9 76 77
3 104 1361 103
3 77 1361 104
3 523 894 52
3 51 894 523
3 523 895 104
3 52 895 523
3 66 1362 65
3 52 1362 66
3 199 1363 198
3 66 1363 199
3 524 896 133
3 132 896 524
3 524 897 199
3 133 897 524
3 898 1364 525
3 121 1364 898
3 898 1365 120
3 525 1365 898
3 899 1366 525
3 133 1366 899
3 899 1367 121
3 525 1367 899
3 128 1368 127
3 121 1368 128
3 29 900 28
3 128 900 29
3 901 1369 114
3 113 1369 901
3 114 1370 901
3 29 1370 114
3 526 902 58
3 57 902 526
3 526 903 114
3 58 903 526
3 904 1371 54
3 53 1371 904
3 54 1372 904
3 58 1372 54
3 905 1373 56
3 55 1373 905
3 905 1374 54
3 56 1374 905
3 72 906 71
3 56 906 72
3 74 1375 73
3 72 1375 74
3 74 125 126
3 907 1376 117
3 116 1376 907
3 117 1377 907
3 126 1377 117
3 908 1378 145
3 144 1378 908
3 908 1379 117
3 145 1379 908
3 909 1380 81
3 80 1380 909
3 909 1381 145
3 81 1381 909
3 64 910 63
3 81 910 64
3 911 1382 232
3 231 1382 911
3 64 1383 232
3 911 1383 64
3 47 1384 46
3 232 1384 47
3 912 1385 527
3 62 1385 912
3 912 1386 61
3 527 1386 912
3 913 1387 527
3 47 1387 913
3 913 1388 62
3 527 1388 913
3 914 1389 60
3 59 1389 914
3 60 1390 914
3 62 1390 60
3 915 1391 137
3 136 1391 915
3 137 1392 915
3 60 1392 137
3 164 916 163
3 137 916 164
3 17 917 16
3 164 917 17
3 918 1393 528
3 189 1393 918
3 918 1394 188
3 528 1394 918
3 919 1395 528
3 17 1395 919
3 919 1396 189
3 528 1396 919
3 529 920 187
3 186 920 529
3 529 921 189
3 187 921 529
3 187 159 160
3 162 1397 161
3 160 1397 162
3 162 217 218
3 922 1398 41
3 40 1398 922
3 41 1399 922
3 218 1399 41
3 923 1400 36
3 35 1400 923
3 923 1401 41
3 36 1401 923
3 36 37 38
3 924 1402 224
3 223 1402 924
3 924 1403 38
3 224 1403 924
3 20 1404 19
3 224 1404 20
3 925 1405 6
3 5 1405 925
3 925 1406 20
3 6 1406 925
3 530 1407 166
3 165 1407 530
3 530 1408 6
3 166 1408 530
3 926 1409 95
3 94 1409 926
3 95 1410 926
3 166 1410 95
3 93 1411 92
3 95 1411 93
3 531 1412 44
3 43 1412 531
3 531 1413 93
3 44 1413 531
3 185 1414 184
3 44 1414 185
3 927 1415 201
3 200 1415 927
3 201 1416 927
3 185 1416 201
3 928 1417 70
3 69 1417 928
3 201 1418 70
3 928 1418 201
3 173 929 172
3 70 929 173
3 533 1419 532
3 33 1419 533
3 533 1420 32
3 532 1420 533
3 534 1421 532
3 173 1421 534
3 534 1422 33
3 532 1422 534
3 209 930 208
3 33 930 209
3 535 1423 88
3 87 1423 535
3 535 1424 209
3 88 1424 535
3 931 1425 143
3 142 1425 931
3 931 1426 88
3 143 1426 931
3 170 1427 169
3 143 1427 170
3 536 932 149
3 148 932 536
3 536 933 170
3 149 933 536
3 149 192 193
3 2 1428 1
3 193 1428 2
3 537 934 147
3 146 934 537
3 537 935 2
3 147 935 537
3 205 1429 204
3 147 1429 205
3 156 1430 155
3 205 1430 156
3 156 123 124
3 183 1431 182
3 124 1431 183
3 538 936 27
3 26 936 538
3 538 937 183
3 27 937 538
3 938 1432 22
3 21 1432 938
3 938 1433 27
3 22 1433 938
3 939 1434 222
3 221 1434 939
3 222 1435 939
3 22 1435 222
3 539 1436 216
3 215 1436 539
3 539 1437 222
3 216 1437 539
3 540 940 15
3 14 940 540
3 540 941 216
3 15 941 540
3 541 1438 229
3 228 1438 541
3 541 1439 15
3 229 1439 541