OFF
1369 1501 0
0.2883213294 0.2185935084 -0.1529936287
0.2883336900 0.2310905036 -0.1533652648
0.2880458730 0.2184081398 -0.1592361737
0.2880582336 0.2309051350 -0.1596078098
0.3182923981 0.2272114350 -0.0324996290
0.3182947485 0.2295877058 -0.0325702947
0.3127833405 0.2235041103 -0.1573489503
0.3127856909 0.2258803810 -0.1574196159
0.2562277090 0.2285422764 -0.0298005027
0.2558816115 -0.1213735873 -0.0193946919
0.2561288240 0.1285663154 -0.0268274139
0.2503725539 -0.1250809120 -0.1442440132
0.2506197664 0.1248589906 -0.1516767352
0.2548504272 0.2276154335 -0.0610132273
0.2586361287 -0.1195199327 0.0430297058
0.2588833412 0.1304199699 0.0355969838
0.3176680650 0.2276664467 -0.0324855912
0.3176695181 0.2291355672 -0.0325292800
0.3121590074 0.2239591220 -0.1573349125
0.3121604605 0.2254282424 -0.1573786012
0.0704233676 0.1276098586 0.0189548988
0.0704283119 0.1326086567 0.0188062443
0.0649143564 0.1239025651 -0.1058933711
0.0649193007 0.1289013632 -0.1060420255
0.1874376436 0.1311934649 -0.1090122503
0.1874326994 0.1261946669 -0.1088635959
0.1926712263 0.1347154086 0.0095941055
0.1926662820 0.1297166106 0.0097427599
-0.0811063984 0.1343405188 -0.0121181516
-0.0813585551 -0.1205981819 -0.0045367752
-0.0811113426 0.1293417208 -0.0119694972
-0.0866154560 0.1306331941 -0.1369674729
-0.0868676127 -0.1243055067 -0.1293860964
-0.0866204002 0.1256343960 -0.1368188184
-0.0809411506 0.1344517225 -0.0083732134
-0.0809460948 0.1294529244 -0.0082245590
0.0025785985 0.1341481046 -0.0158050930
0.0025736543 0.1291493066 -0.0156564385
-0.0029304591 0.1304407798 -0.1406544142
-0.0029354033 0.1254419818 -0.1405057598
-0.3045326690 -0.1189690834 0.0428220900
-0.3042854565 0.1309708192 0.0353893680
-0.3047530303 -0.1191173758 0.0378281381
-0.3045058178 0.1308225268 0.0303954161
0.3196896653 0.2276617985 -0.0325746576
0.3196911184 0.2291309190 -0.0326183464
0.3141806077 0.2239544738 -0.1574239789
0.3141820608 0.2254235942 -0.1574676676
0.3190644349 0.2272096599 -0.0325336429
0.3190667852 0.2295859306 -0.0326043086
0.3135553773 0.2235023352 -0.1573829642
0.3135577276 0.2258786059 -0.1574536298
0.3382828355 0.2184786336 -0.1551948016
0.3382951962 0.2309756287 -0.1555664377
0.3380073792 0.2182932650 -0.1614373465
0.3380197398 0.2307902601 -0.1618089826
0.1312304233 0.1313227004 -0.1065359077
0.1312254790 0.1263239023 -0.1063872533
0.1364640059 0.1348446441 0.0120704481
0.1364590617 0.1298458460 0.0122191025
-0.4995055750 0.2509959687 -0.1411028227
-0.5000000000 -0.2488838367 -0.1262373787
-0.4992301233 0.2511813341 -0.1348603829
-0.4997245483 -0.2486984712 -0.1199949389
-0.0773587595 0.1343319020 -0.0122832628
-0.0773637038 0.1293331039 -0.0121346083
-0.0828678171 0.1306245772 -0.1371325840
-0.0828727614 0.1256257792 -0.1369839295
0.1953271331 0.1273226715 0.0134519667
0.1953320773 0.1323214695 0.0133033122
0.1898181219 0.1236153779 -0.1113963032
0.1898230661 0.1286141760 -0.1115449577
0.0143375859 -0.1152382804 0.1788833143
0.0145847983 0.1347016222 0.1714505923
0.0143926994 -0.1152011917 0.1801323279
0.0146399119 0.1347387109 0.1726996059
0.0063262374 0.1341394878 -0.0159702041
0.0060740806 -0.1207992129 -0.0083888277
0.0063212931 0.1291406897 -0.0158215497
0.0008171798 0.1304321630 -0.1408195253
0.0005650231 -0.1245065377 -0.1332381489
0.0008122355 0.1254333650 -0.1406708709
0.0146130608 -0.1150528994 0.1851262798
0.0148602733 0.1348870033 0.1776935578
0.0064914852 0.1342506914 -0.0122252659
0.0064865410 0.1292518934 -0.0120766115
0.1249857609 0.1313370585 -0.1062607843
0.1249808167 0.1263382605 -0.1061121298
0.1302193436 0.1348590022 0.0123455715
0.1302143993 0.1298602042 0.0124942260
0.4997245483 0.2486984712 -0.1851262798
0.4992301233 -0.2511813341 -0.1702608358
0.5000000000 0.2488838367 -0.1788838400
0.4995055750 -0.2509959687 -0.1640183960
0.3199291552 0.2283958098 -0.0326070213
0.3144200976 0.2246884850 -0.1574563425
0.3199861581 -0.1204050194 0.0153074293
0.3202333706 0.1295348833 0.0078747073
0.3186795917 0.2283986828 -0.0325519688
0.3131705341 0.2246913581 -0.1574012900
0.3173023099 0.2274718399 -0.0637646934
0.3197657967 -0.1205533117 0.0103134775
0.3200130092 0.1293865909 0.0028807555
-0.0761653613 0.1342919426 -0.0135872825
-0.0816193054 0.1306217066 -0.1371875901
0.0687785406 0.1314662940 -0.1037844416
0.0687735963 0.1264674959 -0.1036357872
0.0740121232 0.1349882376 0.0148219141
0.0740071790 0.1299894396 0.0149705686
0.3174300281 0.2284015559 -0.0324969163
0.3119209705 0.2246942312 -0.1573462375
-0.2437334502 -0.1202248386 0.0026170366
-0.2434862377 0.1297150641 -0.0048156854
-0.2492425078 -0.1239321633 -0.1222322846
-0.2489952953 0.1260077393 -0.1296650066
-0.2409789330 -0.1183711840 0.0650414344
-0.2407317205 0.1315687187 0.0576087124
0.0012749732 0.1341138866 -0.0169991005
-0.0041789708 0.1304436505 -0.1405994081
0.0001377259 0.0000926827 -0.1494393895
-0.0001094866 -0.2498472199 -0.1420066675
-0.2497934112 -0.1243028942 -0.1347171642
-0.1249514489 -0.1870750571 -0.1383619158
-0.1248278427 -0.0621051058 -0.1420782768
0.0000141196 -0.1248772686 -0.1457230285
-0.2499170175 -0.2492728456 -0.1310008032
-0.3747589797 -0.1865006827 -0.1273560516
-0.1249514489 -0.1870750571 -0.1383619158
0.2498216504 -0.1254516430 -0.1567288927
0.2496980442 -0.2504215943 -0.1530125317
0.1248560819 -0.1876494314 -0.1493677801
0.3746636127 -0.1882238058 -0.1603736443
0.1249796881 -0.0626794801 -0.1530841411
0.1248560819 -0.1876494314 -0.1493677801
0.0000141196 -0.1248772686 -0.1457230285
-0.2495461987 0.1256370084 -0.1421498862
-0.2497934112 -0.1243028942 -0.1347171642
-0.3746353735 -0.0615307314 -0.1310724126
-0.2496698050 0.0006670571 -0.1384335252
-0.3747589797 -0.1865006827 -0.1273560516
-0.1248278427 -0.0621051058 -0.1420782768
-0.2496698050 0.0006670571 -0.1384335252
-0.1247042364 0.0628648456 -0.1457946378
-0.4994773358 0.0012414315 -0.1274276609
-0.3745117672 0.0634392199 -0.1347887736
-0.4993537295 0.1262113828 -0.1311440219
-0.3743881610 0.1884091713 -0.1385051346
-0.3746353735 -0.0615307314 -0.1310724126
-0.4996009420 -0.1237285199 -0.1237112999
-0.3745117672 0.0634392199 -0.1347887736
0.0001377259 0.0000926827 -0.1494393895
-0.0001094866 -0.2498472199 -0.1420066675
-0.2497934112 -0.1243028942 -0.1347171642
-0.1249514489 -0.1870750571 -0.1383619158
-0.1248278427 -0.0621051058 -0.1420782768
0.0000141196 -0.1248772686 -0.1457230285
-0.2499170175 -0.2492728456 -0.1310008032
-0.3747589797 -0.1865006827 -0.1273560516
-0.1249514489 -0.1870750571 -0.1383619158
0.2498216504 -0.1254516430 -0.1567288927
0.2496980442 -0.2504215943 -0.1530125317
0.1248560819 -0.1876494314 -0.1493677801
0.3746636127 -0.1882238058 -0.1603736443
0.1249796881 -0.0626794801 -0.1530841411
0.1248560819 -0.1876494314 -0.1493677801
0.0000141196 -0.1248772686 -0.1457230285
-0.2495461987 0.1256370084 -0.1421498862
-0.2497934112 -0.1243028942 -0.1347171642
-0.3746353735 -0.0615307314 -0.1310724126
-0.2496698050 0.0006670571 -0.1384335252
-0.3747589797 -0.1865006827 -0.1273560516
-0.1248278427 -0.0621051058 -0.1420782768
-0.2496698050 0.0006670571 -0.1384335252
-0.1247042364 0.0628648456 -0.1457946378
-0.4994773358 0.0012414315 -0.1274276609
-0.3745117672 0.0634392199 -0.1347887736
-0.4993537295 0.1262113828 -0.1311440219
-0.3743881610 0.1884091713 -0.1385051346
-0.3746353735 -0.0615307314 -0.1310724126
-0.4996009420 -0.1237285199 -0.1237112999
-0.3745117672 0.0634392199 -0.1347887736
-0.0001377259 -0.0000926827 -0.1556818292
-0.0003849384 -0.2500325854 -0.1482491072
-0.2500688629 -0.1244882597 -0.1409596040
-0.1252269006 -0.1872604225 -0.1446043556
-0.1251032944 -0.0622904712 -0.1483207166
-0.0002613321 -0.1250626341 -0.1519654682
-0.2501924692 -0.2494582110 -0.1372432430
-0.3750344315 -0.1866860482 -0.1335984913
-0.1252269006 -0.1872604225 -0.1446043556
0.2495461987 -0.1256370084 -0.1629713325
0.2494225925 -0.2506069597 -0.1592549715
0.1245806302 -0.1878347969 -0.1556102199
0.3743881610 -0.1884091713 -0.1666160841
0.1247042364 -0.0628648456 -0.1593265809
0.1245806302 -0.1878347969 -0.1556102199
-0.0002613321 -0.1250626341 -0.1519654682
-0.2498216504 0.1254516430 -0.1483923260
-0.2500688629 -0.1244882597 -0.1409596040
-0.3749108252 -0.0617160968 -0.1373148523
-0.2499452567 0.0004816916 -0.1446759650
-0.3750344315 -0.1866860482 -0.1335984913
-0.1251032944 -0.0622904712 -0.1483207166
-0.2499452567 0.0004816916 -0.1446759650
-0.1249796881 0.0626794801 -0.1520370776
-0.4997527875 0.0010560660 -0.1336701007
-0.3747872190 0.0632538545 -0.1410312133
-0.4996291813 0.1260260173 -0.1373864617
-0.3746636127 0.1882238058 -0.1447475744
-0.3749108252 -0.0617160968 -0.1373148523
-0.4998763938 -0.1239138853 -0.1299537397
-0.3747872190 0.0632538545 -0.1410312133
0.1282233173 -0.1229400625 -0.0763164204
0.0074513392 -0.1198723856 0.0228233712
0.0088285978 -0.1189455584 0.0540355701
-0.1133206736 -0.1168047322 0.1219623743
0.1364868573 -0.1173791066 0.1109565101
0.1284705298 0.1269998402 -0.0837491424
0.0076985517 0.1300675170 0.0153906492
0.0090758103 0.1309943443 0.0466028481
-0.1130734611 0.1331351705 0.1145296523
0.1367340698 0.1325607961 0.1035237881
0.2546279475 0.0026695289 -0.0543235147
0.2545043413 -0.1223004224 -0.0506071537
0.2587597349 0.0054500186 0.0393133448
0.0006886293 0.0004634136 -0.1369545099
0.0005650231 -0.1245065377 -0.1332381489
-0.1242769392 -0.0617343748 -0.1295933973
0.1255305916 -0.0623087492 -0.1405992615
-0.1241533330 0.0632355765 -0.1333097583
-0.1242769392 -0.0617343748 -0.1295933973
-0.2491189015 0.0010377880 -0.1259486456
-0.2449871141 0.0038182777 -0.0323117861
-0.2451107204 -0.1211516737 -0.0285954251
-0.2408553267 0.0065987673 0.0613250734
-0.1131970673 0.0081652191 0.1182460133
-0.2408553267 0.0065987673 0.0613250734
-0.1130734611 0.1331351705 0.1145296523
0.1366104635 0.0075908448 0.1072401491
0.1364868573 -0.1173791066 0.1109565101
0.0144611921 0.0097316709 0.1751669533
0.1674232157 0.0072409920 0.0965004935
0.1672996094 -0.1177289594 0.1002168545
0.0910181382 -0.0539059537 0.1408133866
0.2437046869 -0.0565820137 0.0559039614
0.0147366670 0.0099170520 0.1814099188
0.0911417445 0.0710639976 0.1370970256
0.0910181382 -0.0539059537 0.1408133866
0.1674232157 0.0072409920 0.0965004935
0.1672996094 -0.1177289594 0.1002168545
0.0910181382 -0.0539059537 0.1408133866
0.2437046869 -0.0565820137 0.0559039614
0.0147366670 0.0099170520 0.1814099188
0.0911417445 0.0710639976 0.1370970256
0.0910181382 -0.0539059537 0.1408133866
0.1672028543 0.0070926996 0.0915065417
0.1670792481 -0.1178772517 0.0952229027
0.0907977768 -0.0540542461 0.1358194348
0.2434843255 -0.0567303061 0.0509100096
0.0145163056 0.0097687596 0.1764159669
0.0909213831 0.0709157053 0.1321030738
0.0907977768 -0.0540542461 0.1358194348
-0.1448361978 0.0079589599 0.1102578239
-0.1449598041 -0.1170109914 0.1139741849
-0.0651115685 -0.0535469697 0.1476920518
-0.2246844334 -0.0555050618 0.0765399569
0.0147366670 0.0099170520 0.1814099188
-0.0649879623 0.0714229816 0.1439756908
-0.0651115685 -0.0535469697 0.1476920518
-0.1448361978 0.0079589599 0.1102578239
-0.1449598041 -0.1170109914 0.1139741849
-0.0651115685 -0.0535469697 0.1476920518
-0.2246844334 -0.0555050618 0.0765399569
0.0147366670 0.0099170520 0.1814099188
-0.0649879623 0.0714229816 0.1439756908
-0.0651115685 -0.0535469697 0.1476920518
-0.1450565592 0.0078106676 0.1052638720
-0.1451801655 -0.1171592838 0.1089802330
-0.0653319299 -0.0536952621 0.1426981000
-0.2249047948 -0.0556533541 0.0715460051
0.0145163056 0.0097687596 0.1764159669
-0.0652083237 0.0712746892 0.1389817390
-0.0653319299 -0.0536952621 0.1426981000
0.0001377259 0.0000926827 -0.1494393895
0.0003849384 0.2500325854 -0.1568721115
0.2500688629 0.1244882597 -0.1641616147
0.1252269006 0.1872604225 -0.1605168631
0.1251032944 0.0622904712 -0.1568005021
0.0002613321 0.1250626341 -0.1531557505
0.2501924692 0.2494582110 -0.1678779757
0.3750344315 0.1866860482 -0.1715227274
0.1252269006 0.1872604225 -0.1605168631
-0.2495461987 0.1256370084 -0.1421498862
-0.2494225925 0.2506069597 -0.1458662472
-0.1245806302 0.1878347969 -0.1495109988
-0.3743881610 0.1884091713 -0.1385051346
-0.1247042364 0.0628648456 -0.1457946378
-0.1245806302 0.1878347969 -0.1495109988
0.0002613321 0.1250626341 -0.1531557505
0.2498216504 -0.1254516430 -0.1567288927
0.2500688629 0.1244882597 -0.1641616147
0.3749108252 0.0617160968 -0.1678063663
0.2499452567 -0.0004816916 -0.1604452537
0.3750344315 0.1866860482 -0.1715227274
0.1251032944 0.0622904712 -0.1568005021
0.2499452567 -0.0004816916 -0.1604452537
0.1249796881 -0.0626794801 -0.1530841411
0.4997527875 -0.0010560660 -0.1714511180
0.3746636127 -0.1882238058 -0.1603736443
0.3747872190 -0.0632538545 -0.1640900053
0.4996291813 -0.1260260173 -0.1677347570
0.3749108252 0.0617160968 -0.1678063663
0.4998763938 0.1239138853 -0.1751674790
0.3747872190 -0.0632538545 -0.1640900053
0.0001377259 0.0000926827 -0.1494393895
0.0003849384 0.2500325854 -0.1568721115
0.2500688629 0.1244882597 -0.1641616147
0.1252269006 0.1872604225 -0.1605168631
0.1251032944 0.0622904712 -0.1568005021
0.0002613321 0.1250626341 -0.1531557505
0.2501924692 0.2494582110 -0.1678779757
0.3750344315 0.1866860482 -0.1715227274
0.1252269006 0.1872604225 -0.1605168631
-0.2495461987 0.1256370084 -0.1421498862
-0.2494225925 0.2506069597 -0.1458662472
-0.1245806302 0.1878347969 -0.1495109988
-0.3743881610 0.1884091713 -0.1385051346
-0.1247042364 0.0628648456 -0.1457946378
-0.1245806302 0.1878347969 -0.1495109988
0.0002613321 0.1250626341 -0.1531557505
0.2498216504 -0.1254516430 -0.1567288927
0.2500688629 0.1244882597 -0.1641616147
0.3749108252 0.0617160968 -0.1678063663
0.2499452567 -0.0004816916 -0.1604452537
0.3750344315 0.1866860482 -0.1715227274
0.1251032944 0.0622904712 -0.1568005021
0.2499452567 -0.0004816916 -0.1604452537
0.1249796881 -0.0626794801 -0.1530841411
0.4997527875 -0.0010560660 -0.1714511180
0.3746636127 -0.1882238058 -0.1603736443
0.3747872190 -0.0632538545 -0.1640900053
0.4996291813 -0.1260260173 -0.1677347570
0.3749108252 0.0617160968 -0.1678063663
0.4998763938 0.1239138853 -0.1751674790
0.3747872190 -0.0632538545 -0.1640900053
-0.0001377259 -0.0000926827 -0.1556818292
0.0001094866 0.2498472199 -0.1631145512
0.2497934112 0.1243028942 -0.1704040545
0.1249514489 0.1870750571 -0.1667593029
0.1248278427 0.0621051058 -0.1630429419
-0.0000141196 0.1248772686 -0.1593981902
0.2499170175 0.2492728456 -0.1741204155
0.3747589797 0.1865006827 -0.1777651671
0.1249514489 0.1870750571 -0.1667593029
-0.2498216504 0.1254516430 -0.1483923260
-0.2496980442 0.2504215943 -0.1521086870
-0.1248560819 0.1876494314 -0.1557534386
-0.3746636127 0.1882238058 -0.1447475744
-0.1249796881 0.0626794801 -0.1520370776
-0.1248560819 0.1876494314 -0.1557534386
-0.0000141196 0.1248772686 -0.1593981902
0.2495461987 -0.1256370084 -0.1629713325
0.2497934112 0.1243028942 -0.1704040545
0.3746353735 0.0615307314 -0.1740488061
0.2496698050 -0.0006670571 -0.1666876935
0.3747589797 0.1865006827 -0.1777651671
0.1248278427 0.0621051058 -0.1630429419
0.2496698050 -0.0006670571 -0.1666876935
0.1247042364 -0.0628648456 -0.1593265809
0.4994773358 -0.0012414315 -0.1776935578
0.3743881610 -0.1884091713 -0.1666160841
0.3745117672 -0.0634392199 -0.1703324451
0.4993537295 -0.1262113828 -0.1739771968
0.3746353735 0.0615307314 -0.1740488061
0.4996009420 0.1237285199 -0.1814099188
0.3745117672 -0.0634392199 -0.1703324451
0.1282233173 -0.1229400625 -0.0763164204
0.0074513392 -0.1198723856 0.0228233712
0.1284705298 0.1269998402 -0.0837491424
0.0076985517 0.1300675170 0.0153906492
0.2546279475 0.0026695289 -0.0543235147
0.2547515538 0.1276394803 -0.0580398757
0.2504961601 -0.0001109607 -0.1479603742
0.0006886293 0.0004634136 -0.1369545099
0.0008122355 0.1254333650 -0.1406708709
0.1256541978 0.0626612021 -0.1443156225
-0.1241533330 0.0632355765 -0.1333097583
0.1255305916 -0.0623087492 -0.1405992615
0.1256541978 0.0626612021 -0.1443156225
0.2504961601 -0.0001109607 -0.1479603742
-0.2449871141 0.0038182777 -0.0323117861
-0.2448635079 0.1287882290 -0.0360281471
-0.2491189015 0.0010377880 -0.1259486456
-0.1131970673 0.0081652191 0.1182460133
0.0144611921 0.0097316709 0.1751669533
-0.1133206736 -0.1168047322 0.1219623743
0.1366104635 0.0075908448 0.1072401491
0.1367340698 0.1325607961 0.1035237881
0.2587597349 0.0054500186 0.0393133448
0.1674232157 0.0072409920 0.0965004935
0.1675468219 0.1322109433 0.0927841325
0.2438282931 0.0683879376 0.0521876004
0.0911417445 0.0710639976 0.1370970256
0.3201097643 0.0045649320 0.0115910683
0.2437046869 -0.0565820137 0.0559039614
0.2438282931 0.0683879376 0.0521876004
0.1674232157 0.0072409920 0.0965004935
0.1675468219 0.1322109433 0.0927841325
0.2438282931 0.0683879376 0.0521876004
0.0911417445 0.0710639976 0.1370970256
0.3201097643 0.0045649320 0.0115910683
0.2437046869 -0.0565820137 0.0559039614
0.2438282931 0.0683879376 0.0521876004
0.1672028543 0.0070926996 0.0915065417
0.1673264606 0.1320626509 0.0877901807
0.2436079318 0.0682396453 0.0471936486
0.0909213831 0.0709157053 0.1321030738
0.3198894030 0.0044166396 0.0065971165
0.2434843255 -0.0567303061 0.0509100096
0.2436079318 0.0682396453 0.0471936486
-0.1448361978 0.0079589599 0.1102578239
-0.1447125916 0.1329289113 0.1065414629
-0.2245608272 0.0694648896 0.0728235959
-0.0649879623 0.0714229816 0.1439756908
-0.3044090627 0.0060008679 0.0391057290
-0.2246844334 -0.0555050618 0.0765399569
-0.2245608272 0.0694648896 0.0728235959
-0.1448361978 0.0079589599 0.1102578239
-0.1447125916 0.1329289113 0.1065414629
-0.2245608272 0.0694648896 0.0728235959
-0.0649879623 0.0714229816 0.1439756908
-0.3044090627 0.0060008679 0.0391057290
-0.2246844334 -0.0555050618 0.0765399569
-0.2245608272 0.0694648896 0.0728235959
-0.1450565592 0.0078106676 0.1052638720
-0.1449329530 0.1327806189 0.1015475110
-0.2247811885 0.0693165972 0.0678296441
-0.0652083237 0.0712746892 0.1389817390
-0.3046294241 0.0058525755 0.0341117771
-0.2249047948 -0.0556533541 0.0715460051
-0.2247811885 0.0693165972 0.0678296441
-0.0624068615 -0.0934911872 -0.1439006526
-0.1873106269 -0.0932040000 -0.1383977205
-0.0624686647 -0.1559761628 -0.1420424721
-0.0624068615 -0.0934911872 -0.1439006526
-0.3123379986 -0.2178867641 -0.1291784274
-0.3748207829 -0.2489856584 -0.1254978711
-0.1250132520 -0.2495600327 -0.1365037353
-0.1873724301 -0.1556889757 -0.1365395400
0.1872770630 -0.2190355129 -0.1511901559
0.1247942788 -0.2501344071 -0.1475095996
0.3746018096 -0.2507087815 -0.1585154638
0.3122426316 -0.1568377244 -0.1585512685
0.0624351008 -0.1562633500 -0.1475454043
0.1873388662 -0.1565505372 -0.1530483364
0.0624969039 -0.0937783744 -0.1494035848
0.0624351008 -0.1562633500 -0.1475454043
-0.3121525892 -0.0304318371 -0.1347529689
-0.3120907861 0.0320531385 -0.1366111494
-0.4371799609 -0.1551146013 -0.1255336758
-0.3122761955 -0.1554017885 -0.1310366079
-0.1871870207 0.0317659513 -0.1421140815
-0.1872488238 -0.0307190243 -0.1402559010
-0.0622832553 0.0314787642 -0.1476170136
-0.1871870207 0.0317659513 -0.1421140815
-0.4368709453 0.1573102770 -0.1348245783
-0.4369945515 0.0323403257 -0.1311082173
-0.3119671799 0.1570230898 -0.1403275104
-0.4368709453 0.1573102770 -0.1348245783
-0.4371181578 -0.0926296256 -0.1273918563
-0.4371799609 -0.1551146013 -0.1255336758
-0.3120907861 0.0320531385 -0.1366111494
-0.4369945515 0.0323403257 -0.1311082173
-0.0624068615 -0.0934911872 -0.1439006526
-0.1873106269 -0.0932040000 -0.1383977205
-0.0624686647 -0.1559761628 -0.1420424721
-0.0624068615 -0.0934911872 -0.1439006526
-0.3123379986 -0.2178867641 -0.1291784274
-0.3748207829 -0.2489856584 -0.1254978711
-0.1250132520 -0.2495600327 -0.1365037353
-0.1873724301 -0.1556889757 -0.1365395400
0.1872770630 -0.2190355129 -0.1511901559
0.1247942788 -0.2501344071 -0.1475095996
0.3746018096 -0.2507087815 -0.1585154638
0.3122426316 -0.1568377244 -0.1585512685
0.0624351008 -0.1562633500 -0.1475454043
0.1873388662 -0.1565505372 -0.1530483364
0.0624969039 -0.0937783744 -0.1494035848
0.0624351008 -0.1562633500 -0.1475454043
-0.3121525892 -0.0304318371 -0.1347529689
-0.3120907861 0.0320531385 -0.1366111494
-0.4371799609 -0.1551146013 -0.1255336758
-0.3122761955 -0.1554017885 -0.1310366079
-0.1871870207 0.0317659513 -0.1421140815
-0.1872488238 -0.0307190243 -0.1402559010
-0.0622832553 0.0314787642 -0.1476170136
-0.1871870207 0.0317659513 -0.1421140815
-0.4368709453 0.1573102770 -0.1348245783
-0.4369945515 0.0323403257 -0.1311082173
-0.3119671799 0.1570230898 -0.1403275104
-0.4368709453 0.1573102770 -0.1348245783
-0.4371181578 -0.0926296256 -0.1273918563
-0.4371799609 -0.1551146013 -0.1255336758
-0.3120907861 0.0320531385 -0.1366111494
-0.4369945515 0.0323403257 -0.1311082173
-0.0626823133 -0.0936765526 -0.1501430924
-0.1875860787 -0.0933893655 -0.1446401603
-0.0627441164 -0.1561615283 -0.1482849119
-0.0626823133 -0.0936765526 -0.1501430924
-0.3126134503 -0.2180721296 -0.1354208672
-0.3750962346 -0.2491710238 -0.1317403108
-0.1252887038 -0.2497453982 -0.1427461751
-0.1876478818 -0.1558743411 -0.1427819798
0.1870016113 -0.2192208783 -0.1574325957
0.1245188271 -0.2503197726 -0.1537520394
0.3743263579 -0.2508941469 -0.1647579036
0.3119671799 -0.1570230898 -0.1647937083
0.0621596490 -0.1564487155 -0.1537878440
0.1870634144 -0.1567359027 -0.1592907762
0.0622214522 -0.0939637398 -0.1556460246
0.0621596490 -0.1564487155 -0.1537878440
-0.3124280409 -0.0306172026 -0.1409954087
-0.3123662378 0.0318677731 -0.1428535892
-0.4374554126 -0.1552999668 -0.1317761155
-0.3125516472 -0.1555871539 -0.1372790477
-0.1874624724 0.0315805859 -0.1483565213
-0.1875242755 -0.0309043898 -0.1464983408
-0.0625587070 0.0312933987 -0.1538594534
-0.1874624724 0.0315805859 -0.1483565213
-0.4371463970 0.1571249116 -0.1410670180
-0.4372700032 0.0321549602 -0.1373506570
-0.3122426316 0.1568377244 -0.1465699502
-0.4371463970 0.1571249116 -0.1410670180
-0.4373936095 -0.0928149911 -0.1336342960
-0.4374554126 -0.1552999668 -0.1317761155
-0.3123662378 0.0318677731 -0.1428535892
-0.4372700032 0.0321549602 -0.1373506570
0.1254687885 -0.1247937249 -0.1387410810
0.0671486990 -0.1218696377 -0.0423526240
-0.1653005315 -0.1222651726 -0.0633845299
-0.1680550603 -0.1241188350 -0.1258091905
-0.2464879790 -0.1220785009 -0.0598076240
0.0060740806 -0.1207992129 -0.0083888277
-0.1167637969 -0.1191217848 0.0439324028
-0.0522460379 -0.1178751453 0.0879989722
-0.1160751676 -0.1186583712 0.0595385022
0.1337323633 -0.1192327455 0.0485326380
0.0754122216 -0.1163086935 0.1449199122
-0.0403967660 -0.1225523598 -0.0688874620
0.1257160010 0.1251461778 -0.1461738030
0.0673959114 0.1280702649 -0.0497853460
-0.1650533190 0.1276747300 -0.0708172519
-0.2462407665 0.1278614017 -0.0672403460
-0.1622987902 0.1295283924 -0.0083925913
0.0063212931 0.1291406897 -0.0158215497
-0.1165165844 0.1308181178 0.0364996808
-0.0519988254 0.1320647574 0.0805662502
-0.1158279551 0.1312815315 0.0521057802
0.1339795758 0.1307071571 0.0410999160
0.0756594341 0.1336312092 0.1374871902
0.2566320381 -0.0584252019 -0.0056469044
0.2525002507 -0.0612056916 -0.0992837639
0.2567556443 0.0665447494 -0.0093632654
0.2566320381 -0.0584252019 -0.0056469044
-0.0618559581 -0.0931204563 -0.1314157731
-0.1243387424 -0.1242193505 -0.1277352168
0.1254687885 -0.1247937249 -0.1387410810
0.0631096104 -0.0309226678 -0.1387768857
-0.1866979204 -0.0303482934 -0.1277710215
-0.0617941550 -0.0306354806 -0.1332739536
-0.1866361173 0.0321366822 -0.1296292020
-0.1866979204 -0.0303482934 -0.1277710215
-0.2429830236 -0.0572764532 0.0163648241
-0.2471148109 -0.0600569428 -0.0772720354
-0.2428594173 0.0676934982 0.0126484631
-0.2429830236 -0.0572764532 0.0163648241
-0.1769643939 0.0698669689 0.0879273628
-0.1770880001 -0.0551029824 0.0916437239
-0.0493061345 0.0714334207 0.1448483028
-0.1769643939 0.0698669689 0.0879273628
0.0754740247 -0.0538237178 0.1430617317
0.1976232961 -0.0559645440 0.0751349275
0.0755976309 0.0711462335 0.1393453707
0.0754740247 -0.0538237178 0.1430617317
0.1673614126 -0.0552439837 0.0983586740
0.0909563351 -0.1163909294 0.1426715671
0.2436428838 -0.1190669894 0.0577621419
0.1673614126 -0.0552439837 0.0983586740
0.0910799413 0.0085790220 0.1389552061
0.0147984701 0.0724020276 0.1795517383
0.0146748639 -0.0525679237 0.1832680993
0.0910799413 0.0085790220 0.1389552061
0.1673614126 -0.0552439837 0.0983586740
0.0909563351 -0.1163909294 0.1426715671
0.2436428838 -0.1190669894 0.0577621419
0.1673614126 -0.0552439837 0.0983586740
0.0910799413 0.0085790220 0.1389552061
0.0147984701 0.0724020276 0.1795517383
0.0146748639 -0.0525679237 0.1832680993
0.0910799413 0.0085790220 0.1389552061
0.1671410512 -0.0553922761 0.0933647222
0.0907359737 -0.1165392217 0.1376776153
0.2434225224 -0.1192152817 0.0527681901
0.1671410512 -0.0553922761 0.0933647222
0.0908595800 0.0084307296 0.1339612543
0.0145781088 0.0722537353 0.1745577864
0.0144545025 -0.0527162161 0.1782741474
0.0908595800 0.0084307296 0.1339612543
-0.1448980010 -0.0545260157 0.1121160044
-0.0651733717 -0.1160319454 0.1495502323
-0.2247462365 -0.1179900374 0.0783981374
-0.1448980010 -0.0545260157 0.1121160044
-0.0650497654 0.0089380060 0.1458338713
0.0147984701 0.0724020276 0.1795517383
0.0146748639 -0.0525679237 0.1832680993
-0.0650497654 0.0089380060 0.1458338713
-0.1448980010 -0.0545260157 0.1121160044
-0.0651733717 -0.1160319454 0.1495502323
-0.2247462365 -0.1179900374 0.0783981374
-0.1448980010 -0.0545260157 0.1121160044
-0.0650497654 0.0089380060 0.1458338713
0.0147984701 0.0724020276 0.1795517383
0.0146748639 -0.0525679237 0.1832680993
-0.0650497654 0.0089380060 0.1458338713
-0.1451183623 -0.0546743081 0.1071220525
-0.0653937330 -0.1161802377 0.1445562805
-0.2249665979 -0.1181383298 0.0734041856
-0.1451183623 -0.0546743081 0.1071220525
-0.0652701268 0.0087897136 0.1408399195
0.0145781088 0.0722537353 0.1745577864
0.0144545025 -0.0527162161 0.1782741474
-0.0652701268 0.0087897136 0.1408399195
-0.0401721661 0.1323677966 -0.0770933453
0.1301207448 0.1256126183 -0.0462207022
0.1301256890 0.1306114163 -0.0463693567
0.0626823133 0.0936765526 -0.1549781263
0.1876478818 0.1558743411 -0.1623392389
0.0627441164 0.1561615283 -0.1568363068
0.0626823133 0.0936765526 -0.1549781263
0.3126134503 0.2180721296 -0.1697003515
0.3750962346 0.2491710238 -0.1733809079
0.1252887038 0.2497453982 -0.1623750436
0.1876478818 0.1558743411 -0.1623392389
-0.1870016113 0.2192208783 -0.1476886230
-0.1245188271 0.2503197726 -0.1513691793
-0.3743263579 0.2508941469 -0.1403633151
-0.3119671799 0.1570230898 -0.1403275104
-0.0621596490 0.1564487155 -0.1513333746
-0.1870634144 0.1567359027 -0.1458304425
-0.0622832553 0.0314787642 -0.1476170136
-0.0621596490 0.1564487155 -0.1513333746
0.3124280409 0.0306172026 -0.1641258100
0.3123662378 -0.0318677731 -0.1622676295
0.4374554126 0.1552999668 -0.1733451032
0.3125516472 0.1555871539 -0.1678421710
0.1874624724 -0.0315805859 -0.1567646974
0.1875242755 0.0309043898 -0.1586228779
0.0625587070 -0.0312933987 -0.1512617653
0.1874624724 -0.0315805859 -0.1567646974
0.4372082001 -0.0946399359 -0.1659123812
0.3123044347 -0.0943527487 -0.1604094490
0.4371463970 -0.1571249116 -0.1640542007
0.4372082001 -0.0946399359 -0.1659123812
0.4373318064 0.0303300154 -0.1696287422
0.4374554126 0.1552999668 -0.1733451032
0.3123662378 -0.0318677731 -0.1622676295
0.4372700032 -0.0321549602 -0.1677705617
0.0626823133 0.0936765526 -0.1549781263
0.1876478818 0.1558743411 -0.1623392389
0.0627441164 0.1561615283 -0.1568363068
0.0626823133 0.0936765526 -0.1549781263
0.3126134503 0.2180721296 -0.1697003515
0.3750962346 0.2491710238 -0.1733809079
0.1252887038 0.2497453982 -0.1623750436
0.1876478818 0.1558743411 -0.1623392389
-0.1870016113 0.2192208783 -0.1476886230
-0.1245188271 0.2503197726 -0.1513691793
-0.3743263579 0.2508941469 -0.1403633151
-0.3119671799 0.1570230898 -0.1403275104
-0.0621596490 0.1564487155 -0.1513333746
-0.1870634144 0.1567359027 -0.1458304425
-0.0622832553 0.0314787642 -0.1476170136
-0.0621596490 0.1564487155 -0.1513333746
0.3124280409 0.0306172026 -0.1641258100
0.3123662378 -0.0318677731 -0.1622676295
0.4374554126 0.1552999668 -0.1733451032
0.3125516472 0.1555871539 -0.1678421710
0.1874624724 -0.0315805859 -0.1567646974
0.1875242755 0.0309043898 -0.1586228779
0.0625587070 -0.0312933987 -0.1512617653
0.1874624724 -0.0315805859 -0.1567646974
0.4372082001 -0.0946399359 -0.1659123812
0.3123044347 -0.0943527487 -0.1604094490
0.4371463970 -0.1571249116 -0.1640542007
0.4372082001 -0.0946399359 -0.1659123812
0.4373318064 0.0303300154 -0.1696287422
0.4374554126 0.1552999668 -0.1733451032
0.3123662378 -0.0318677731 -0.1622676295
0.4372700032 -0.0321549602 -0.1677705617
0.0624068615 0.0934911872 -0.1612205661
0.1873724301 0.1556889757 -0.1685816787
0.0624686647 0.1559761628 -0.1630787466
0.0624068615 0.0934911872 -0.1612205661
0.3123379986 0.2178867641 -0.1759427913
0.3748207829 0.2489856584 -0.1796233476
0.1250132520 0.2495600327 -0.1686174834
0.1873724301 0.1556889757 -0.1685816787
-0.1872770630 0.2190355129 -0.1539310628
-0.1247942788 0.2501344071 -0.1576116191
-0.3746018096 0.2507087815 -0.1466057549
-0.3122426316 0.1568377244 -0.1465699502
-0.0624351008 0.1562633500 -0.1575758144
-0.1873388662 0.1565505372 -0.1520728823
-0.0625587070 0.0312933987 -0.1538594534
-0.0624351008 0.1562633500 -0.1575758144
0.3121525892 0.0304318371 -0.1703682498
0.3120907861 -0.0320531385 -0.1685100693
0.4371799609 0.1551146013 -0.1795875429
0.3122761955 0.1554017885 -0.1740846108
0.1871870207 -0.0317659513 -0.1630071372
0.1872488238 0.0307190243 -0.1648653177
0.0622832553 -0.0314787642 -0.1575042051
0.1871870207 -0.0317659513 -0.1630071372
0.4369327484 -0.0948253014 -0.1721548209
0.3120289830 -0.0945381142 -0.1666518888
0.4368709453 -0.1573102770 -0.1702966404
0.4369327484 -0.0948253014 -0.1721548209
0.4370563546 0.0301446500 -0.1758711819
0.4371799609 0.1551146013 -0.1795875429
0.3120907861 -0.0320531385 -0.1685100693
0.4369945515 -0.0323403257 -0.1740130014
0.1309778461 -0.1210864001 -0.0138917598
0.1892979356 -0.1240104873 -0.1102802168
-0.1653005315 -0.1222651726 -0.0633845299
-0.1625460027 -0.1204115102 -0.0009598693
-0.0841130839 -0.1224518443 -0.0669614358
0.0088285978 -0.1189455584 0.0540355701
0.1330437340 -0.1196961592 0.0329265385
-0.0403967660 -0.1225523598 -0.0688874620
0.1312250586 0.1288535025 -0.0213244818
0.1895451481 0.1259294154 -0.1177129388
-0.1650533190 0.1276747300 -0.0708172519
-0.0838658714 0.1274880584 -0.0743941578
-0.1678078478 0.1258210677 -0.1332419125
0.0090758103 0.1309943443 0.0466028481
0.1332909465 0.1302437435 0.0254938165
0.2526238569 0.0637642598 -0.1030001249
0.2567556443 0.0665447494 -0.0093632654
0.2525002507 -0.0612056916 -0.0992837639
0.2526238569 0.0637642598 -0.1030001249
0.0632332167 0.0940472835 -0.1424932467
0.1257160010 0.1251461778 -0.1461738030
-0.1240915299 0.1257205522 -0.1351679388
-0.0617323518 0.0318494951 -0.1351321341
0.1880751790 0.0312751207 -0.1461379983
0.0631714136 0.0315623079 -0.1406350662
0.1880133759 -0.0312098550 -0.1442798178
0.1880751790 0.0312751207 -0.1461379983
-0.2469912047 0.0649130085 -0.0809883964
-0.2428594173 0.0676934982 0.0126484631
-0.2471148109 -0.0600569428 -0.0772720354
-0.2469912047 0.0649130085 -0.0809883964
-0.0494297407 -0.0535365306 0.1485646638
-0.0493061345 0.0714334207 0.1448483028
-0.1770880001 -0.0551029824 0.0916437239
-0.0494297407 -0.0535365306 0.1485646638
0.1977469023 0.0690054074 0.0714185665
0.0755976309 0.0711462335 0.1393453707
0.1976232961 -0.0559645440 0.0751349275
0.1977469023 0.0690054074 0.0714185665
0.1674850188 0.0697259676 0.0946423130
0.2438900963 0.1308729133 0.0503294199
0.0912035476 0.1335489733 0.1352388451
0.1674850188 0.0697259676 0.0946423130
0.2437664900 0.0059029620 0.0540457809
0.3200479612 -0.0579200437 0.0134492488
0.3201715675 0.0670499076 0.0097328878
0.2437664900 0.0059029620 0.0540457809
0.1674850188 0.0697259676 0.0946423130
0.2438900963 0.1308729133 0.0503294199
0.0912035476 0.1335489733 0.1352388451
0.1674850188 0.0697259676 0.0946423130
0.2437664900 0.0059029620 0.0540457809
0.3200479612 -0.0579200437 0.0134492488
0.3201715675 0.0670499076 0.0097328878
0.2437664900 0.0059029620 0.0540457809
0.1672646574 0.0695776753 0.0896483612
0.2436697349 0.1307246209 0.0453354681
0.0909831862 0.1334006809 0.1302448933
0.1672646574 0.0695776753 0.0896483612
0.2435461286 0.0057546696 0.0490518291
0.3198275998 -0.0580683361 0.0084552970
0.3199512061 0.0669016153 0.0047389360
0.2435461286 0.0057546696 0.0490518291
-0.1447743947 0.0704439356 0.1083996434
-0.2244990240 0.1319498652 0.0709654154
-0.0649261592 0.1339079573 0.1421175103
-0.1447743947 0.0704439356 0.1083996434
-0.2246226303 0.0069799139 0.0746817764
-0.3044708658 -0.0564841078 0.0409639095
-0.3043472596 0.0684858435 0.0372475485
-0.2246226303 0.0069799139 0.0746817764
-0.1447743947 0.0704439356 0.1083996434
-0.2244990240 0.1319498652 0.0709654154
-0.0649261592 0.1339079573 0.1421175103
-0.1447743947 0.0704439356 0.1083996434
-0.2246226303 0.0069799139 0.0746817764
-0.3044708658 -0.0564841078 0.0409639095
-0.3043472596 0.0684858435 0.0372475485
-0.2246226303 0.0069799139 0.0746817764
-0.1449947561 0.0702956432 0.1034056915
-0.2247193854 0.1318015729 0.0659714636
-0.0651465205 0.1337596649 0.1371235585
-0.1449947561 0.0702956432 0.1034056915
-0.2248429917 0.0068316215 0.0696878246
-0.3046912272 -0.0566324001 0.0359699576
-0.3045676210 0.0683375512 0.0322535966
-0.2248429917 0.0068316215 0.0696878246
-0.0401721661 0.1323677966 -0.0770933453
0.1301207448 0.1256126183 -0.0462207022
0.1301256890 0.1306114163 -0.0463693567
-0.1248896458 -0.1245900814 -0.1402200963
-0.0623450584 -0.0310062115 -0.1457588331
-0.1248896458 -0.1245900814 -0.1402200963
-0.1873724301 -0.1556889757 -0.1365395400
-0.0000476835 -0.1873622443 -0.1438648480
-0.0625304678 -0.2184611385 -0.1401842916
0.0000759227 -0.0623922929 -0.1475812090
-0.0624686647 -0.1559761628 -0.1420424721
-0.3122761955 -0.1554017885 -0.1310366079
-0.2498552143 -0.1867878699 -0.1328589837
-0.4372417640 -0.2175995770 -0.1236754953
-0.3123379986 -0.2178867641 -0.1291784274
-0.1874342332 -0.2181739513 -0.1346813595
-0.0625304678 -0.2184611385 -0.1401842916
-0.1874342332 -0.2181739513 -0.1346813595
-0.2498552143 -0.1867878699 -0.1328589837
0.1873388662 -0.1565505372 -0.1530483364
0.2497598473 -0.1879366186 -0.1548707122
0.0623732976 -0.2187483257 -0.1456872238
0.1872770630 -0.2190355129 -0.1511901559
0.3121808285 -0.2193227000 -0.1566930880
0.4370845939 -0.2196098872 -0.1621960202
0.3121808285 -0.2193227000 -0.1566930880
0.2497598473 -0.1879366186 -0.1548707122
0.1249178850 -0.1251644558 -0.1512259606
0.0623732976 -0.2187483257 -0.1456872238
0.1249178850 -0.1251644558 -0.1512259606
0.1874006693 -0.0940655615 -0.1549065169
0.0000759227 -0.0623922929 -0.1475812090
0.0625587070 -0.0312933987 -0.1512617653
-0.0000476835 -0.1873622443 -0.1438648480
0.0624969039 -0.0937783744 -0.1494035848
-0.2497316081 -0.0618179186 -0.1365753447
-0.3122143924 -0.0929168128 -0.1328947884
-0.2496080018 0.0631520328 -0.1402917057
-0.3121525892 -0.0304318371 -0.1347529689
-0.3746971766 -0.1240157071 -0.1292142321
-0.4372417640 -0.2175995770 -0.1236754953
-0.3746971766 -0.1240157071 -0.1292142321
-0.3122143924 -0.0929168128 -0.1328947884
-0.1872488238 -0.0307190243 -0.1402559010
-0.2496080018 0.0631520328 -0.1402917057
-0.1873106269 -0.0932040000 -0.1383977205
-0.2497316081 -0.0618179186 -0.1365753447
-0.0623450584 -0.0310062115 -0.1457588331
-0.1247660396 0.0003798699 -0.1439364573
-0.1871252176 0.0942509270 -0.1439722620
-0.1247660396 0.0003798699 -0.1439364573
-0.4369327484 0.0948253014 -0.1329663978
-0.4992919264 0.1886963584 -0.1330022024
-0.4994155327 0.0637264071 -0.1292858414
-0.4369327484 0.0948253014 -0.1329663978
-0.3120289830 0.0945381142 -0.1384693299
-0.3744499641 0.1259241956 -0.1366469541
-0.4368091421 0.2197952527 -0.1366827588
-0.3744499641 0.1259241956 -0.1366469541
-0.4995391389 -0.0612435442 -0.1255694804
-0.4370563546 -0.0301446500 -0.1292500368
-0.4996627452 -0.1862134955 -0.1218531194
-0.4371181578 -0.0926296256 -0.1273918563
-0.3745735704 0.0009542443 -0.1329305931
-0.3120289830 0.0945381142 -0.1384693299
-0.3745735704 0.0009542443 -0.1329305931
-0.4370563546 -0.0301446500 -0.1292500368
-0.1248896458 -0.1245900814 -0.1402200963
-0.0623450584 -0.0310062115 -0.1457588331
-0.1248896458 -0.1245900814 -0.1402200963
-0.1873724301 -0.1556889757 -0.1365395400
-0.0000476835 -0.1873622443 -0.1438648480
-0.0625304678 -0.2184611385 -0.1401842916
0.0000759227 -0.0623922929 -0.1475812090
-0.0624686647 -0.1559761628 -0.1420424721
-0.3122761955 -0.1554017885 -0.1310366079
-0.2498552143 -0.1867878699 -0.1328589837
-0.4372417640 -0.2175995770 -0.1236754953
-0.3123379986 -0.2178867641 -0.1291784274
-0.1874342332 -0.2181739513 -0.1346813595
-0.0625304678 -0.2184611385 -0.1401842916
-0.1874342332 -0.2181739513 -0.1346813595
-0.2498552143 -0.1867878699 -0.1328589837
0.1873388662 -0.1565505372 -0.1530483364
0.2497598473 -0.1879366186 -0.1548707122
0.0623732976 -0.2187483257 -0.1456872238
0.1872770630 -0.2190355129 -0.1511901559
0.3121808285 -0.2193227000 -0.1566930880
0.4370845939 -0.2196098872 -0.1621960202
0.3121808285 -0.2193227000 -0.1566930880
0.2497598473 -0.1879366186 -0.1548707122
0.1249178850 -0.1251644558 -0.1512259606
0.0623732976 -0.2187483257 -0.1456872238
0.1249178850 -0.1251644558 -0.1512259606
0.1874006693 -0.0940655615 -0.1549065169
0.0000759227 -0.0623922929 -0.1475812090
0.0625587070 -0.0312933987 -0.1512617653
-0.0000476835 -0.1873622443 -0.1438648480
0.0624969039 -0.0937783744 -0.1494035848
-0.2497316081 -0.0618179186 -0.1365753447
-0.3122143924 -0.0929168128 -0.1328947884
-0.2496080018 0.0631520328 -0.1402917057
-0.3121525892 -0.0304318371 -0.1347529689
-0.3746971766 -0.1240157071 -0.1292142321
-0.4372417640 -0.2175995770 -0.1236754953
-0.3746971766 -0.1240157071 -0.1292142321
-0.3122143924 -0.0929168128 -0.1328947884
-0.1872488238 -0.0307190243 -0.1402559010
-0.2496080018 0.0631520328 -0.1402917057
-0.1873106269 -0.0932040000 -0.1383977205
-0.2497316081 -0.0618179186 -0.1365753447
-0.0623450584 -0.0310062115 -0.1457588331
-0.1247660396 0.0003798699 -0.1439364573
-0.1871252176 0.0942509270 -0.1439722620
-0.1247660396 0.0003798699 -0.1439364573
-0.4369327484 0.0948253014 -0.1329663978
-0.4992919264 0.1886963584 -0.1330022024
-0.4994155327 0.0637264071 -0.1292858414
-0.4369327484 0.0948253014 -0.1329663978
-0.3120289830 0.0945381142 -0.1384693299
-0.3744499641 0.1259241956 -0.1366469541
-0.4368091421 0.2197952527 -0.1366827588
-0.3744499641 0.1259241956 -0.1366469541
-0.4995391389 -0.0612435442 -0.1255694804
-0.4370563546 -0.0301446500 -0.1292500368
-0.4996627452 -0.1862134955 -0.1218531194
-0.4371181578 -0.0926296256 -0.1273918563
-0.3745735704 0.0009542443 -0.1329305931
-0.3120289830 0.0945381142 -0.1384693299
-0.3745735704 0.0009542443 -0.1329305931
-0.4370563546 -0.0301446500 -0.1292500368
-0.1251650975 -0.1247754469 -0.1464625361
-0.0626205101 -0.0311915770 -0.1520012729
-0.1251650975 -0.1247754469 -0.1464625361
-0.1876478818 -0.1558743411 -0.1427819798
-0.0003231352 -0.1875476097 -0.1501072877
-0.0628059195 -0.2186465040 -0.1464267314
-0.0001995290 -0.0625776584 -0.1538236487
-0.0627441164 -0.1561615283 -0.1482849119
-0.3125516472 -0.1555871539 -0.1372790477
-0.2501306661 -0.1869732354 -0.1391014235
-0.4375172157 -0.2177849424 -0.1299179350
-0.3126134503 -0.2180721296 -0.1354208672
-0.1877096849 -0.2183593168 -0.1409237993
-0.0628059195 -0.2186465040 -0.1464267314
-0.1877096849 -0.2183593168 -0.1409237993
-0.2501306661 -0.1869732354 -0.1391014235
0.1870634144 -0.1567359027 -0.1592907762
0.2494843956 -0.1881219841 -0.1611131520
0.0620978459 -0.2189336911 -0.1519296635
0.1870016113 -0.2192208783 -0.1574325957
0.3119053767 -0.2195080655 -0.1629355278
0.4368091421 -0.2197952527 -0.1684384599
0.3119053767 -0.2195080655 -0.1629355278
0.2494843956 -0.1881219841 -0.1611131520
0.1246424333 -0.1253498212 -0.1574684004
0.0620978459 -0.2189336911 -0.1519296635
0.1246424333 -0.1253498212 -0.1574684004
0.1871252176 -0.0942509270 -0.1611489567
-0.0001995290 -0.0625776584 -0.1538236487
0.0622832553 -0.0314787642 -0.1575042051
-0.0003231352 -0.1875476097 -0.1501072877
0.0622214522 -0.0939637398 -0.1556460246
-0.2500070598 -0.0620032840 -0.1428177845
-0.3124898441 -0.0931021783 -0.1391372282
-0.2498834536 0.0629666673 -0.1465341455
-0.3124280409 -0.0306172026 -0.1409954087
-0.3749726283 -0.1242010725 -0.1354566718
-0.4375172157 -0.2177849424 -0.1299179350
-0.3749726283 -0.1242010725 -0.1354566718
-0.3124898441 -0.0931021783 -0.1391372282
-0.1875242755 -0.0309043898 -0.1464983408
-0.2498834536 0.0629666673 -0.1465341455
-0.1875860787 -0.0933893655 -0.1446401603
-0.2500070598 -0.0620032840 -0.1428177845
-0.0626205101 -0.0311915770 -0.1520012729
-0.1250414913 0.0001945045 -0.1501788971
-0.1874006693 0.0940655615 -0.1502147018
-0.1250414913 0.0001945045 -0.1501788971
-0.4372082001 0.0946399359 -0.1392088375
-0.4995673781 0.1885109930 -0.1392446422
-0.4996909844 0.0635410417 -0.1355282812
-0.4372082001 0.0946399359 -0.1392088375
-0.3123044347 0.0943527487 -0.1447117697
-0.3747254158 0.1257388301 -0.1428893939
-0.4370845939 0.2196098872 -0.1429251985
-0.3747254158 0.1257388301 -0.1428893939
-0.4998145906 -0.0614289097 -0.1318119202
-0.4373318064 -0.0303300154 -0.1354924765
-0.4999381969 -0.1863988610 -0.1280955592
-0.4373936095 -0.0928149911 -0.1336342960
-0.3748490221 0.0007688788 -0.1391730328
-0.3123044347 0.0943527487 -0.1447117697
-0.3748490221 0.0007688788 -0.1391730328
-0.4373318064 -0.0303300154 -0.1354924765
-0.0002472125 -0.2499399027 -0.1451278873
0.0002472125 0.2499399027 -0.1599933314
0.0643941702 -0.1237233001 -0.1047772847
0.1892979356 -0.1240104873 -0.1102802168
0.0643941702 -0.1237233001 -0.1047772847
0.0033195518 -0.1226528753 -0.0708134883
-0.1181410555 -0.1200486121 0.0127202039
0.1316664754 -0.1206229865 0.0017143396
-0.1181410555 -0.1200486121 0.0127202039
-0.1802486235 -0.1196733117 0.0232747197
-0.0494915439 -0.1160215063 0.1504228443
0.0115830918 -0.1170919194 0.1164594422
-0.1771498033 -0.1175879581 0.0935019044
-0.0522460379 -0.1178751453 0.0879989722
0.0726577276 -0.1181623325 0.0824960401
0.1975614930 -0.1184495196 0.0769931080
0.0726577276 -0.1181623325 0.0824960401
0.0115830918 -0.1170919194 0.1164594422
0.0646413827 0.1262166026 -0.1122100067
0.1895451481 0.1259294154 -0.1177129388
0.0646413827 0.1262166026 -0.1122100067
0.0035667643 0.1272870274 -0.0782462103
-0.1178938430 0.1298912906 0.0052874819
0.1319136879 0.1293169162 -0.0057183824
-0.1178938430 0.1298912906 0.0052874819
-0.1800014110 0.1302665910 0.0158419977
-0.0492443314 0.1339183963 0.1429901223
0.0118303043 0.1328479833 0.1090267202
-0.1769025908 0.1323519446 0.0860691823
-0.0519988254 0.1320647574 0.0805662502
0.0729049400 0.1317775702 0.0750633181
0.1978087055 0.1314903830 0.0695603860
0.0729049400 0.1317775702 0.0750633181
0.0118303043 0.1328479833 0.1090267202
0.2545661444 -0.0598154467 -0.0524653342
0.2565702350 -0.1209101775 -0.0037887239
0.2524384476 -0.1236906672 -0.0974255834
0.2545661444 -0.0598154467 -0.0524653342
0.2566938412 0.0040597738 -0.0075050849
0.2588215380 0.0679349943 0.0374551643
0.2586979318 -0.0570349570 0.0411715253
0.2566938412 0.0040597738 -0.0075050849
-0.0617941550 -0.0306354806 -0.1332739536
0.0006268262 -0.0620215620 -0.1350963294
-0.1867597235 -0.0928332691 -0.1259128410
-0.0618559581 -0.0931204563 -0.1314157731
0.0630478073 -0.0934076434 -0.1369187052
0.1879515727 -0.0936948306 -0.1424216373
0.0630478073 -0.0934076434 -0.1369187052
0.0006268262 -0.0620215620 -0.1350963294
-0.1242151361 0.0007506008 -0.1314515778
-0.1867597235 -0.0928332691 -0.1259128410
-0.1242151361 0.0007506008 -0.1314515778
-0.0617323518 0.0318494951 -0.1351321341
-0.2490570984 0.0635227637 -0.1278068261
-0.1865743141 0.0946216579 -0.1314873825
-0.2491807046 -0.0614471877 -0.1240904651
-0.1866361173 0.0321366822 -0.1296292020
-0.2450489173 -0.0586666980 -0.0304536056
-0.2430448267 -0.1197614288 0.0182230046
-0.2471766141 -0.1225419185 -0.0754138549
-0.2450489173 -0.0586666980 -0.0304536056
-0.2429212204 0.0052085225 0.0145066436
-0.2407935236 0.0690837430 0.0594668929
-0.2409171299 -0.0558862083 0.0631832539
-0.2429212204 0.0052085225 0.0145066436
-0.1770261970 0.0073819932 0.0897855433
-0.2407935236 0.0690837430 0.0594668929
-0.2409171299 -0.0558862083 0.0631832539
-0.1770261970 0.0073819932 0.0897855433
-0.1131352642 0.0706501948 0.1163878328
-0.0492443314 0.1339183963 0.1429901223
-0.1769025908 0.1323519446 0.0860691823
-0.1131352642 0.0706501948 0.1163878328
0.1365486604 -0.0548941309 0.1090983296
0.0754122216 -0.1163086935 0.1449199122
0.1975614930 -0.1184495196 0.0769931080
0.1365486604 -0.0548941309 0.1090983296
0.0755358278 0.0086612578 0.1412035512
0.0145229952 0.0722166466 0.1733087728
0.0143993890 -0.0527533048 0.1770251338
0.0755358278 0.0086612578 0.1412035512
0.1273662392 0.1237589715 -0.1086448372
0.0676688620 0.1257562119 -0.0434692361
0.1273711834 0.1287577696 -0.1087934916
0.0676738063 0.1307550099 -0.0436178906
0.1619458805 0.1280202564 -0.0483222467
0.1619508248 0.1330190545 -0.0484709011
0.0994939978 0.1281638500 -0.0455707806
0.0994989421 0.1331626481 -0.0457194351
0.1251650975 0.1247754469 -0.1586586826
0.0626205101 0.0311915770 -0.1531199458
0.1875860787 0.0933893655 -0.1604810584
0.1251650975 0.1247754469 -0.1586586826
0.0003231352 0.1875476097 -0.1550139310
0.0628059195 0.2186465040 -0.1586944873
0.0001995290 0.0625776584 -0.1512975700
0.0627441164 0.1561615283 -0.1568363068
0.3125516472 0.1555871539 -0.1678421710
0.2501306661 0.1869732354 -0.1660197952
0.4375172157 0.2177849424 -0.1752032837
0.3126134503 0.2180721296 -0.1697003515
0.1877096849 0.2183593168 -0.1641974194
0.0628059195 0.2186465040 -0.1586944873
0.1877096849 0.2183593168 -0.1641974194
0.2501306661 0.1869732354 -0.1660197952
-0.1870634144 0.1567359027 -0.1458304425
-0.2494843956 0.1881219841 -0.1440080667
-0.0620978459 0.2189336911 -0.1531915551
-0.1870016113 0.2192208783 -0.1476886230
-0.3119053767 0.2195080655 -0.1421856909
-0.4368091421 0.2197952527 -0.1366827588
-0.3119053767 0.2195080655 -0.1421856909
-0.2494843956 0.1881219841 -0.1440080667
-0.1246424333 0.1253498212 -0.1476528183
-0.0620978459 0.2189336911 -0.1531915551
-0.1246424333 0.1253498212 -0.1476528183
-0.1871252176 0.0942509270 -0.1439722620
-0.0622214522 0.0939637398 -0.1494751941
0.0001995290 0.0625776584 -0.1512975700
0.0003231352 0.1875476097 -0.1550139310
-0.0622214522 0.0939637398 -0.1494751941
0.2500070598 0.0620032840 -0.1623034342
0.3124898441 0.0931021783 -0.1659839905
0.2498834536 -0.0629666673 -0.1585870732
0.3124280409 0.0306172026 -0.1641258100
0.3749726283 0.1242010725 -0.1696645469
0.4375172157 0.2177849424 -0.1752032837
0.3749726283 0.1242010725 -0.1696645469
0.3124898441 0.0931021783 -0.1659839905
0.1875242755 0.0309043898 -0.1586228779
0.2498834536 -0.0629666673 -0.1585870732
0.1875860787 0.0933893655 -0.1604810584
0.2500070598 0.0620032840 -0.1623034342
0.0626205101 0.0311915770 -0.1531199458
0.1250414913 -0.0001945045 -0.1549423216
0.1874006693 -0.0940655615 -0.1549065169
0.1250414913 -0.0001945045 -0.1549423216
0.3747254158 -0.1257388301 -0.1622318248
0.4372700032 -0.0321549602 -0.1677705617
0.3747254158 -0.1257388301 -0.1622318248
0.3122426316 -0.1568377244 -0.1585512685
0.4995673781 -0.1885109930 -0.1658765765
0.4370845939 -0.2196098872 -0.1621960202
0.4996909844 -0.0635410417 -0.1695929375
0.4371463970 -0.1571249116 -0.1640542007
0.4373936095 0.0928149911 -0.1714869227
0.4998145906 0.0614289097 -0.1733092985
0.4999381969 0.1863988610 -0.1770256595
0.4373936095 0.0928149911 -0.1714869227
0.3748490221 -0.0007688788 -0.1659481858
0.3123044347 -0.0943527487 -0.1604094490
0.3748490221 -0.0007688788 -0.1659481858
0.4373318064 0.0303300154 -0.1696287422
0.1251650975 0.1247754469 -0.1586586826
0.0626205101 0.0311915770 -0.1531199458
0.1875860787 0.0933893655 -0.1604810584
0.1251650975 0.1247754469 -0.1586586826
0.0003231352 0.1875476097 -0.1550139310
0.0628059195 0.2186465040 -0.1586944873
0.0001995290 0.0625776584 -0.1512975700
0.0627441164 0.1561615283 -0.1568363068
0.3125516472 0.1555871539 -0.1678421710
0.2501306661 0.1869732354 -0.1660197952
0.4375172157 0.2177849424 -0.1752032837
0.3126134503 0.2180721296 -0.1697003515
0.1877096849 0.2183593168 -0.1641974194
0.0628059195 0.2186465040 -0.1586944873
0.1877096849 0.2183593168 -0.1641974194
0.2501306661 0.1869732354 -0.1660197952
-0.1870634144 0.1567359027 -0.1458304425
-0.2494843956 0.1881219841 -0.1440080667
-0.0620978459 0.2189336911 -0.1531915551
-0.1870016113 0.2192208783 -0.1476886230
-0.3119053767 0.2195080655 -0.1421856909
-0.4368091421 0.2197952527 -0.1366827588
-0.3119053767 0.2195080655 -0.1421856909
-0.2494843956 0.1881219841 -0.1440080667
-0.1246424333 0.1253498212 -0.1476528183
-0.0620978459 0.2189336911 -0.1531915551
-0.1246424333 0.1253498212 -0.1476528183
-0.1871252176 0.0942509270 -0.1439722620
-0.0622214522 0.0939637398 -0.1494751941
0.0001995290 0.0625776584 -0.1512975700
0.0003231352 0.1875476097 -0.1550139310
-0.0622214522 0.0939637398 -0.1494751941
0.2500070598 0.0620032840 -0.1623034342
0.3124898441 0.0931021783 -0.1659839905
0.2498834536 -0.0629666673 -0.1585870732
0.3124280409 0.0306172026 -0.1641258100
0.3749726283 0.1242010725 -0.1696645469
0.4375172157 0.2177849424 -0.1752032837
0.3749726283 0.1242010725 -0.1696645469
0.3124898441 0.0931021783 -0.1659839905
0.1875242755 0.0309043898 -0.1586228779
0.2498834536 -0.0629666673 -0.1585870732
0.1875860787 0.0933893655 -0.1604810584
0.2500070598 0.0620032840 -0.1623034342
0.0626205101 0.0311915770 -0.1531199458
0.1250414913 -0.0001945045 -0.1549423216
0.1874006693 -0.0940655615 -0.1549065169
0.1250414913 -0.0001945045 -0.1549423216
0.3747254158 -0.1257388301 -0.1622318248
0.4372700032 -0.0321549602 -0.1677705617
0.3747254158 -0.1257388301 -0.1622318248
0.3122426316 -0.1568377244 -0.1585512685
0.4995673781 -0.1885109930 -0.1658765765
0.4370845939 -0.2196098872 -0.1621960202
0.4996909844 -0.0635410417 -0.1695929375
0.4371463970 -0.1571249116 -0.1640542007
0.4373936095 0.0928149911 -0.1714869227
0.4998145906 0.0614289097 -0.1733092985
0.4999381969 0.1863988610 -0.1770256595
0.4373936095 0.0928149911 -0.1714869227
0.3748490221 -0.0007688788 -0.1659481858
0.3123044347 -0.0943527487 -0.1604094490
0.3748490221 -0.0007688788 -0.1659481858
0.4373318064 0.0303300154 -0.1696287422
0.1248896458 0.1245900814 -0.1649011224
0.0623450584 0.0310062115 -0.1593623856
0.1873106269 0.0932040000 -0.1667234982
0.1248896458 0.1245900814 -0.1649011224
0.0000476835 0.1873622443 -0.1612563707
0.0625304678 0.2184611385 -0.1649369271
-0.0000759227 0.0623922929 -0.1575400097
0.0624686647 0.1559761628 -0.1630787466
0.3122761955 0.1554017885 -0.1740846108
0.2498552143 0.1867878699 -0.1722622350
0.4372417640 0.2175995770 -0.1814457234
0.3123379986 0.2178867641 -0.1759427913
0.1874342332 0.2181739513 -0.1704398592
0.0625304678 0.2184611385 -0.1649369271
0.1874342332 0.2181739513 -0.1704398592
0.2498552143 0.1867878699 -0.1722622350
-0.1873388662 0.1565505372 -0.1520728823
-0.2497598473 0.1879366186 -0.1502505065
-0.0623732976 0.2187483257 -0.1594339949
-0.1872770630 0.2190355129 -0.1539310628
-0.3121808285 0.2193227000 -0.1484281307
-0.4370845939 0.2196098872 -0.1429251985
-0.3121808285 0.2193227000 -0.1484281307
-0.2497598473 0.1879366186 -0.1502505065
-0.1249178850 0.1251644558 -0.1538952581
-0.0623732976 0.2187483257 -0.1594339949
-0.1249178850 0.1251644558 -0.1538952581
-0.1874006693 0.0940655615 -0.1502147018
-0.0624969039 0.0937783744 -0.1557176339
-0.0000759227 0.0623922929 -0.1575400097
0.0000476835 0.1873622443 -0.1612563707
-0.0624969039 0.0937783744 -0.1557176339
0.2497316081 0.0618179186 -0.1685458740
0.3122143924 0.0929168128 -0.1722264303
0.2496080018 -0.0631520328 -0.1648295130
0.3121525892 0.0304318371 -0.1703682498
0.3746971766 0.1240157071 -0.1759069866
0.4372417640 0.2175995770 -0.1814457234
0.3746971766 0.1240157071 -0.1759069866
0.3122143924 0.0929168128 -0.1722264303
0.1872488238 0.0307190243 -0.1648653177
0.2496080018 -0.0631520328 -0.1648295130
0.1873106269 0.0932040000 -0.1667234982
0.2497316081 0.0618179186 -0.1685458740
0.0623450584 0.0310062115 -0.1593623856
0.1247660396 -0.0003798699 -0.1611847614
0.1871252176 -0.0942509270 -0.1611489567
0.1247660396 -0.0003798699 -0.1611847614
0.3744499641 -0.1259241956 -0.1684742646
0.4369945515 -0.0323403257 -0.1740130014
0.3744499641 -0.1259241956 -0.1684742646
0.3119671799 -0.1570230898 -0.1647937083
0.4992919264 -0.1886963584 -0.1721190163
0.4368091421 -0.2197952527 -0.1684384599
0.4994155327 -0.0637264071 -0.1758353773
0.4368709453 -0.1573102770 -0.1702966404
0.4371181578 0.0926296256 -0.1777293624
0.4995391389 0.0612435442 -0.1795517383
0.4996627452 0.1862134955 -0.1832680993
0.4371181578 0.0926296256 -0.1777293624
0.3745735704 -0.0009542443 -0.1721906256
0.3120289830 -0.0945381142 -0.1666518888
0.3745735704 -0.0009542443 -0.1721906256
0.4370563546 0.0301446500 -0.1758711819
-0.0002472125 -0.2499399027 -0.1451278873
0.0002472125 0.2499399027 -0.1599933314
0.1920524644 -0.1221568249 -0.0478555562
0.0671486990 -0.1218696377 -0.0423526240
0.1920524644 -0.1221568249 -0.0478555562
0.2531270827 -0.1232272497 -0.0818193525
0.1330437340 -0.1196961592 0.0329265385
-0.1167637969 -0.1191217848 0.0439324028
0.1944626727 -0.1205348732 0.0067659233
0.1316664754 -0.1206229865 0.0017143396
0.1922996769 0.1277830778 -0.0552882782
0.0673959114 0.1280702649 -0.0497853460
0.1922996769 0.1277830778 -0.0552882782
0.2533742952 0.1267126530 -0.0892520745
0.1332909465 0.1302437435 0.0254938165
-0.1165165844 0.1308181178 0.0364996808
0.1947098852 0.1294050294 -0.0006667987
0.1319136879 0.1293169162 -0.0057183824
0.2546897506 0.0651545046 -0.0561816952
0.2526856601 0.1262492354 -0.1048583054
0.2568174475 0.1290297251 -0.0112214459
0.2546897506 0.0651545046 -0.0561816952
0.2525620538 0.0012792841 -0.1011419444
0.2504343570 -0.0625959364 -0.1461021937
0.2505579632 0.0623740149 -0.1498185547
0.2525620538 0.0012792841 -0.1011419444
0.0631714136 0.0315623079 -0.1406350662
0.0007504324 0.0629483893 -0.1388126904
0.1881369821 0.0937600964 -0.1479961789
0.0632332167 0.0940472835 -0.1424932467
-0.0616705487 0.0943344707 -0.1369903146
-0.1865743141 0.0946216579 -0.1314873825
-0.0616705487 0.0943344707 -0.1369903146
0.0007504324 0.0629483893 -0.1388126904
0.1255923947 0.0001762265 -0.1424574420
0.1881369821 0.0937600964 -0.1479961789
0.1255923947 0.0001762265 -0.1424574420
0.0631096104 -0.0309226678 -0.1387768857
0.2504343570 -0.0625959364 -0.1461021937
0.1879515727 -0.0936948306 -0.1424216373
0.2505579632 0.0623740149 -0.1498185547
0.1880133759 -0.0312098550 -0.1442798178
-0.2449253110 0.0663032533 -0.0341699666
-0.2469294016 0.1273979842 -0.0828465769
-0.2427976142 0.1301784738 0.0107902826
-0.2449253110 0.0663032533 -0.0341699666
-0.2470530078 0.0024280328 -0.0791302159
-0.2491807046 -0.0614471877 -0.1240904651
-0.2490570984 0.0635227637 -0.1278068261
-0.2470530078 0.0024280328 -0.0791302159
-0.0493679376 0.0089484450 0.1467064833
0.0143993890 -0.0527533048 0.1770251338
0.0145229952 0.0722166466 0.1733087728
-0.0493679376 0.0089484450 0.1467064833
-0.1132588704 -0.0543197565 0.1201041938
-0.1771498033 -0.1175879581 0.0935019044
-0.0494915439 -0.1160215063 0.1504228443
-0.1132588704 -0.0543197565 0.1201041938
0.1366722666 0.0700758204 0.1053819686
0.1978087055 0.1314903830 0.0695603860
0.0756594341 0.1336312092 0.1374871902
0.1366722666 0.0700758204 0.1053819686
0.1976850992 0.0065204317 0.0732767470
0.2586979318 -0.0570349570 0.0411715253
0.2588215380 0.0679349943 0.0374551643
0.1976850992 0.0065204317 0.0732767470
0.1328752504 0.1274662650 0.0162034327
0.1925726275 0.1254690247 -0.0489721683
0.1328801946 0.1324650631 0.0160547783
0.1925775717 0.1304678227 -0.0491208227
0.1619458805 0.1280202564 -0.0483222467
0.1619508248 0.1330190545 -0.0484709011
0.0994939978 0.1281638500 -0.0455707806
0.0994989421 0.1331626481 -0.0457194351
3 441 821 123
3 122 821 441
3 441 822 119
3 123 822 441
3 442 823 122
3 123 823 442
3 442 824 121
3 122 824 442
3 443 825 120
3 124 825 443
3 443 826 122
3 120 826 443
3 444 827 124
3 119 827 444
3 444 828 122
3 124 828 444
3 445 829 121
3 126 829 445
3 445 830 125
3 121 830 445
3 446 831 126
3 63 831 446
3 446 832 125
3 126 832 446
3 447 833 127
3 125 833 447
3 447 834 120
3 127 834 447
3 448 835 125
3 127 835 448
3 448 836 121
3 125 836 448
3 449 837 128
3 130 837 449
3 449 838 129
3 128 838 449
3 450 839 130
3 120 839 450
3 450 840 129
3 130 840 450
3 451 841 131
3 129 841 451
3 451 842 93
3 131 842 451
3 452 843 129
3 131 843 452
3 452 844 128
3 129 844 452
3 453 845 133
3 132 845 453
3 453 846 120
3 133 846 453
3 454 847 132
3 133 847 454
3 454 848 128
3 132 848 454
3 455 849 119
3 134 849 455
3 455 850 132
3 119 850 455
3 456 851 134
3 120 851 456
3 456 852 132
3 134 852 456
3 457 853 136
3 138 853 457
3 457 854 137
3 136 854 457
3 458 855 138
3 135 855 458
3 458 856 137
3 138 856 458
3 459 857 139
3 137 857 459
3 459 858 63
3 139 858 459
3 460 859 137
3 139 859 460
3 460 860 136
3 137 860 460
3 461 861 141
3 140 861 461
3 461 862 135
3 141 862 461
3 462 863 136
3 140 863 462
3 462 864 141
3 136 864 462
3 463 865 140
3 119 865 463
3 463 866 142
3 140 866 463
3 464 867 142
3 135 867 464
3 464 868 140
3 142 868 464
3 465 869 145
3 144 869 465
3 465 870 62
3 145 870 465
3 466 871 145
3 143 871 466
3 466 872 144
3 145 872 466
3 467 873 144
3 135 873 467
3 467 874 146
3 144 874 467
3 468 875 146
3 62 875 468
3 468 876 144
3 146 876 468
3 469 877 143
3 148 877 469
3 469 878 147
3 143 878 469
3 470 879 148
3 63 879 470
3 470 880 147
3 148 880 470
3 471 881 149
3 147 881 471
3 471 882 135
3 149 882 471
3 472 883 147
3 149 883 472
3 472 884 143
3 147 884 472
3 473 885 154
3 153 885 473
3 473 886 150
3 154 886 473
3 474 887 153
3 154 887 474
3 474 888 152
3 153 888 474
3 475 889 151
3 155 889 475
3 475 890 153
3 151 890 475
3 476 891 155
3 150 891 476
3 476 892 153
3 155 892 476
3 477 893 152
3 157 893 477
3 477 894 156
3 152 894 477
3 478 895 157
3 63 895 478
3 478 896 156
3 157 896 478
3 479 897 158
3 156 897 479
3 479 898 151
3 158 898 479
3 480 899 156
3 158 899 480
3 480 900 152
3 156 900 480
3 481 901 159
3 161 901 481
3 481 902 160
3 159 902 481
3 482 903 161
3 151 903 482
3 482 904 160
3 161 904 482
3 483 905 162
3 160 905 483
3 483 906 93
3 162 906 483
3 484 907 160
3 162 907 484
3 484 908 159
3 160 908 484
3 485 909 164
3 163 909 485
3 485 910 151
3 164 910 485
3 486 911 163
3 164 911 486
3 486 912 159
3 163 912 486
3 487 913 150
3 165 913 487
3 487 914 163
3 150 914 487
3 488 915 165
3 151 915 488
3 488 916 163
3 165 916 488
3 489 917 167
3 169 917 489
3 489 918 168
3 167 918 489
3 490 919 169
3 166 919 490
3 490 920 168
3 169 920 490
3 491 921 170
3 168 921 491
3 491 922 63
3 170 922 491
3 492 923 168
3 170 923 492
3 492 924 167
3 168 924 492
3 493 925 172
3 171 925 493
3 493 926 166
3 172 926 493
3 494 927 167
3 171 927 494
3 494 928 172
3 167 928 494
3 495 929 171
3 150 929 495
3 495 930 173
3 171 930 495
3 496 931 173
3 166 931 496
3 496 932 171
3 173 932 496
3 497 933 176
3 175 933 497
3 497 934 62
3 176 934 497
3 498 935 176
3 174 935 498
3 498 936 175
3 176 936 498
3 499 937 175
3 166 937 499
3 499 938 177
3 175 938 499
3 500 939 177
3 62 939 500
3 500 940 175
3 177 940 500
3 501 941 174
3 179 941 501
3 501 942 178
3 174 942 501
3 502 943 179
3 63 943 502
3 502 944 178
3 179 944 502
3 503 945 180
3 178 945 503
3 503 946 166
3 180 946 503
3 504 947 178
3 180 947 504
3 504 948 174
3 178 948 504
3 505 949 185
3 184 949 505
3 505 950 181
3 185 950 505
3 506 951 184
3 185 951 506
3 506 952 183
3 184 952 506
3 507 953 182
3 186 953 507
3 507 954 184
3 182 954 507
3 508 955 186
3 181 955 508
3 508 956 184
3 186 956 508
3 509 957 183
3 188 957 509
3 509 958 187
3 183 958 509
3 510 959 188
3 61 959 510
3 510 960 187
3 188 960 510
3 511 961 189
3 187 961 511
3 511 962 182
3 189 962 511
3 512 963 187
3 189 963 512
3 512 964 183
3 187 964 512
3 513 965 190
3 192 965 513
3 513 966 191
3 190 966 513
3 514 967 192
3 182 967 514
3 514 968 191
3 192 968 514
3 515 969 193
3 191 969 515
3 515 970 91
3 193 970 515
3 516 971 191
3 193 971 516
3 516 972 190
3 191 972 516
3 517 973 195
3 194 973 517
3 517 974 182
3 195 974 517
3 518 975 194
3 195 975 518
3 518 976 190
3 194 976 518
3 519 977 181
3 196 977 519
3 519 978 194
3 181 978 519
3 520 979 196
3 182 979 520
3 520 980 194
3 196 980 520
3 521 981 198
3 200 981 521
3 521 982 199
3 198 982 521
3 522 983 200
3 197 983 522
3 522 984 199
3 200 984 522
3 523 985 201
3 199 985 523
3 523 986 61
3 201 986 523
3 524 987 199
3 201 987 524
3 524 988 198
3 199 988 524
3 525 989 203
3 202 989 525
3 525 990 197
3 203 990 525
3 526 991 198
3 202 991 526
3 526 992 203
3 198 992 526
3 527 993 202
3 181 993 527
3 527 994 204
3 202 994 527
3 528 995 204
3 197 995 528
3 528 996 202
3 204 996 528
3 529 997 207
3 206 997 529
3 529 998 60
3 207 998 529
3 530 999 207
3 205 999 530
3 530 1000 206
3 207 1000 530
3 531 1001 206
3 197 1001 531
3 531 1002 208
3 206 1002 531
3 532 1003 208
3 60 1003 532
3 532 1004 206
3 208 1004 532
3 533 1005 205
3 210 1005 533
3 533 1006 209
3 205 1006 533
3 534 1007 210
3 61 1007 534
3 534 1008 209
3 210 1008 534
3 535 1009 211
3 209 1009 535
3 535 1010 197
3 211 1010 535
3 536 1011 209
3 211 1011 536
3 536 1012 205
3 209 1012 536
3 63 1013 93
3 61 1013 63
3 63 62 60
3 92 1014 62
3 90 1014 92
3 92 93 91
3 537 1015 212
3 80 1015 537
3 537 1016 11
3 212 1016 537
3 538 1017 80
3 212 1017 538
3 538 1018 77
3 80 1018 538
3 539 540 113
3 32 540 539
3 539 541 111
3 113 541 539
3 542 1019 213
3 111 1019 542
3 542 1020 9
3 213 1020 542
3 543 1021 111
3 213 1021 543
3 115 1022 111
3 543 1022 115
3 544 1023 72
3 215 1023 544
3 544 1024 214
3 72 1024 544
3 545 1025 215
3 115 1025 545
3 545 1026 214
3 215 1026 545
3 546 1027 216
3 214 1027 546
3 546 1028 14
3 216 1028 546
3 547 1029 214
3 216 1029 547
3 547 1030 72
3 214 1030 547
3 32 548 80
3 29 548 32
3 549 1031 217
3 81 1031 549
3 549 1032 12
3 217 1032 549
3 550 1033 81
3 217 1033 550
3 550 1034 78
3 81 1034 550
3 551 552 112
3 114 552 551
3 551 553 30
3 112 553 551
3 554 1035 218
3 112 1035 554
3 554 1036 10
3 218 1036 554
3 555 1037 112
3 218 1037 555
3 116 1038 112
3 555 1038 116
3 556 1039 73
3 220 1039 556
3 556 1040 219
3 73 1040 556
3 557 1041 220
3 116 1041 557
3 557 1042 219
3 220 1042 557
3 558 1043 221
3 219 1043 558
3 558 1044 15
3 221 1044 558
3 559 1045 219
3 221 1045 559
3 559 1046 73
3 219 1046 559
3 560 1047 223
3 222 1047 560
3 560 1048 14
3 223 1048 560
3 561 1049 223
3 11 1049 561
3 561 1050 222
3 223 1050 561
3 562 1051 224
3 222 1051 562
3 562 1052 15
3 224 1052 562
3 563 1053 224
3 14 1053 563
3 563 1054 222
3 224 1054 563
3 564 1055 225
3 227 1055 564
3 564 1056 226
3 225 1056 564
3 565 1057 227
3 113 1057 565
3 565 1058 226
3 227 1058 565
3 566 1059 228
3 226 1059 566
3 566 1060 11
3 228 1060 566
3 567 1061 226
3 228 1061 567
3 567 1062 225
3 226 1062 567
3 568 1063 230
3 229 1063 568
3 568 1064 113
3 230 1064 568
3 569 1065 229
3 230 1065 569
3 569 1066 225
3 229 1066 569
3 570 1067 114
3 231 1067 570
3 570 1068 229
3 114 1068 570
3 571 1069 231
3 113 1069 571
3 571 1070 229
3 231 1070 571
3 572 1071 233
3 232 1071 572
3 572 1072 115
3 233 1072 572
3 573 1073 233
3 113 1073 573
3 573 1074 232
3 233 1074 573
3 574 1075 234
3 232 1075 574
3 574 1076 116
3 234 1076 574
3 575 1077 234
3 115 1077 575
3 575 1078 232
3 234 1078 575
3 576 1079 236
3 235 1079 576
3 576 1080 116
3 236 1080 576
3 577 1081 236
3 115 1081 577
3 577 1082 235
3 236 1082 577
3 578 1083 237
3 235 1083 578
3 578 1084 73
3 237 1084 578
3 579 1085 237
3 116 1085 579
3 579 1086 235
3 237 1086 579
3 580 1087 239
3 238 1087 580
3 580 1088 72
3 239 1088 580
3 581 1089 239
3 14 1089 581
3 581 1090 238
3 239 1090 581
3 582 1091 240
3 238 1091 582
3 582 1092 73
3 240 1092 582
3 583 1093 240
3 72 1093 583
3 583 1094 238
3 240 1094 583
3 243 584 242
3 241 584 243
3 243 585 82
3 242 585 243
3 244 586 242
3 96 586 244
3 244 587 241
3 242 587 244
3 246 588 245
3 241 588 246
3 246 589 83
3 245 589 246
3 247 590 245
3 82 590 247
3 247 591 241
3 245 591 247
3 250 592 249
3 248 592 250
3 250 593 82
3 249 593 250
3 251 594 249
3 96 594 251
3 251 595 248
3 249 595 251
3 253 596 252
3 248 596 253
3 253 597 83
3 252 597 253
3 254 598 252
3 82 598 254
3 254 599 248
3 252 599 254
3 257 600 256
3 255 600 257
3 257 601 74
3 256 601 257
3 258 602 256
3 101 602 258
3 258 603 255
3 256 603 258
3 260 604 259
3 255 604 260
3 260 605 75
3 259 605 260
3 261 606 259
3 74 606 261
3 261 607 255
3 259 607 261
3 101 74 82
3 74 75 83
3 75 102 97
3 102 101 96
3 264 608 263
3 262 608 264
3 264 609 82
3 263 609 264
3 265 610 263
3 40 610 265
3 265 611 262
3 263 611 265
3 267 612 266
3 262 612 267
3 267 613 83
3 266 613 267
3 268 614 266
3 82 614 268
3 268 615 262
3 266 615 268
3 271 616 270
3 269 616 271
3 271 617 82
3 270 617 271
3 272 618 270
3 40 618 272
3 272 619 269
3 270 619 272
3 274 620 273
3 269 620 274
3 274 621 83
3 273 621 274
3 275 622 273
3 82 622 275
3 275 623 269
3 273 623 275
3 278 624 277
3 276 624 278
3 278 625 74
3 277 625 278
3 279 626 277
3 42 626 279
3 279 627 276
3 277 627 279
3 281 628 280
3 276 628 281
3 281 629 75
3 280 629 281
3 282 630 280
3 74 630 282
3 282 631 276
3 280 631 282
3 42 74 82
3 74 75 83
3 75 43 41
3 43 42 40
3 79 38 36
3 76 28 34
3 66 31 28
3 81 39 37
3 78 30 35
3 67 33 30
3 38 39 37
3 79 81 85
3 76 64 65
3 66 67 65
3 31 33 35
3 84 34 35
3 109 17 110
3 17 19 110
3 99 110 19
3 98 17 109
3 17 5 19
3 5 7 19
3 99 19 7
3 98 5 17
3 5 49 7
3 49 51 7
3 99 7 51
3 98 49 5
3 49 45 51
3 45 47 51
3 99 51 47
3 98 45 49
3 45 94 47
3 94 95 47
3 99 47 95
3 98 94 45
3 94 44 95
3 44 46 95
3 99 95 46
3 98 44 94
3 44 48 46
3 48 50 46
3 99 46 50
3 98 48 44
3 48 4 50
3 4 6 50
3 99 50 6
3 98 4 48
3 4 16 6
3 16 18 6
3 99 6 18
3 98 16 4
3 16 109 18
3 109 110 18
3 99 18 110
3 98 109 16
3 54 52 2
3 2 52 0
3 54 3 55
3 54 2 3
3 54 55 52
3 52 55 53
3 52 53 1
3 52 1 0
3 2 1 3
3 2 0 1
3 3 53 55
3 3 1 53
3 100 13 8
3 117 632 118
3 103 632 117
3 633 1095 22
3 70 1095 633
3 633 1096 20
3 22 1096 633
3 634 1097 23
3 71 1097 634
3 634 1098 21
3 23 1098 634
3 22 23 21
3 20 21 69
3 68 69 71
3 70 22 23
3 57 1099 25
3 59 1099 57
3 56 1100 24
3 58 1100 56
3 57 56 58
3 59 58 26
3 27 26 24
3 25 57 56
3 106 1101 87
3 108 1101 106
3 105 1102 86
3 107 1102 105
3 106 105 107
3 108 107 88
3 89 88 86
3 87 106 105
3 635 1103 287
3 286 1103 635
3 635 1104 283
3 287 1104 635
3 636 1105 287
3 285 1105 636
3 636 1106 286
3 287 1106 636
3 637 1107 284
3 288 1107 637
3 637 1108 286
3 284 1108 637
3 638 1109 288
3 283 1109 638
3 638 1110 286
3 288 1110 638
3 639 1111 285
3 290 1111 639
3 639 1112 289
3 285 1112 639
3 640 1113 290
3 92 1113 640
3 640 1114 289
3 290 1114 640
3 641 1115 291
3 289 1115 641
3 641 1116 284
3 291 1116 641
3 642 1117 289
3 291 1117 642
3 642 1118 285
3 289 1118 642
3 643 1119 292
3 294 1119 643
3 643 1120 293
3 292 1120 643
3 644 1121 294
3 284 1121 644
3 644 1122 293
3 294 1122 644
3 645 1123 295
3 293 1123 645
3 645 1124 62
3 295 1124 645
3 646 1125 293
3 295 1125 646
3 646 1126 292
3 293 1126 646
3 647 1127 297
3 296 1127 647
3 647 1128 284
3 297 1128 647
3 648 1129 296
3 297 1129 648
3 648 1130 292
3 296 1130 648
3 649 1131 298
3 296 1131 649
3 649 1132 283
3 298 1132 649
3 650 1133 298
3 284 1133 650
3 650 1134 296
3 298 1134 650
3 651 1135 300
3 302 1135 651
3 651 1136 301
3 300 1136 651
3 652 1137 302
3 299 1137 652
3 652 1138 301
3 302 1138 652
3 653 1139 303
3 301 1139 653
3 653 1140 92
3 303 1140 653
3 654 1141 301
3 303 1141 654
3 654 1142 300
3 301 1142 654
3 655 1143 305
3 304 1143 655
3 655 1144 299
3 305 1144 655
3 656 1145 300
3 304 1145 656
3 656 1146 305
3 300 1146 656
3 657 1147 304
3 283 1147 657
3 657 1148 306
3 304 1148 657
3 658 1149 306
3 299 1149 658
3 658 1150 304
3 306 1150 658
3 659 1151 309
3 308 1151 659
3 659 1152 307
3 309 1152 659
3 660 1153 308
3 309 1153 660
3 660 1154 299
3 308 1154 660
3 661 1155 93
3 310 1155 661
3 661 1156 308
3 93 1156 661
3 662 1157 310
3 307 1157 662
3 662 1158 308
3 310 1158 662
3 663 1159 312
3 311 1159 663
3 663 1160 307
3 312 1160 663
3 664 1161 312
3 92 1161 664
3 664 1162 311
3 312 1162 664
3 665 1163 313
3 311 1163 665
3 665 1164 299
3 313 1164 665
3 666 1165 311
3 313 1165 666
3 666 1166 307
3 311 1166 666
3 93 92 93
3 667 1167 318
3 317 1167 667
3 667 1168 314
3 318 1168 667
3 668 1169 318
3 316 1169 668
3 668 1170 317
3 318 1170 668
3 669 1171 315
3 319 1171 669
3 669 1172 317
3 315 1172 669
3 670 1173 319
3 314 1173 670
3 670 1174 317
3 319 1174 670
3 671 1175 316
3 321 1175 671
3 671 1176 320
3 316 1176 671
3 672 1177 321
3 92 1177 672
3 672 1178 320
3 321 1178 672
3 673 1179 322
3 320 1179 673
3 673 1180 315
3 322 1180 673
3 674 1181 320
3 322 1181 674
3 674 1182 316
3 320 1182 674
3 675 1183 323
3 325 1183 675
3 675 1184 324
3 323 1184 675
3 676 1185 325
3 315 1185 676
3 676 1186 324
3 325 1186 676
3 677 1187 326
3 324 1187 677
3 677 1188 62
3 326 1188 677
3 678 1189 324
3 326 1189 678
3 678 1190 323
3 324 1190 678
3 679 1191 328
3 327 1191 679
3 679 1192 315
3 328 1192 679
3 680 1193 327
3 328 1193 680
3 680 1194 323
3 327 1194 680
3 681 1195 329
3 327 1195 681
3 681 1196 314
3 329 1196 681
3 682 1197 329
3 315 1197 682
3 682 1198 327
3 329 1198 682
3 683 1199 331
3 333 1199 683
3 683 1200 332
3 331 1200 683
3 684 1201 333
3 330 1201 684
3 684 1202 332
3 333 1202 684
3 685 1203 334
3 332 1203 685
3 685 1204 92
3 334 1204 685
3 686 1205 332
3 334 1205 686
3 686 1206 331
3 332 1206 686
3 687 1207 336
3 335 1207 687
3 687 1208 330
3 336 1208 687
3 688 1209 331
3 335 1209 688
3 688 1210 336
3 331 1210 688
3 689 1211 335
3 314 1211 689
3 689 1212 337
3 335 1212 689
3 690 1213 337
3 330 1213 690
3 690 1214 335
3 337 1214 690
3 691 1215 340
3 339 1215 691
3 691 1216 338
3 340 1216 691
3 692 1217 339
3 340 1217 692
3 692 1218 330
3 339 1218 692
3 693 1219 93
3 341 1219 693
3 693 1220 339
3 93 1220 693
3 694 1221 341
3 338 1221 694
3 694 1222 339
3 341 1222 694
3 695 1223 343
3 342 1223 695
3 695 1224 338
3 343 1224 695
3 696 1225 343
3 92 1225 696
3 696 1226 342
3 343 1226 696
3 697 1227 344
3 342 1227 697
3 697 1228 330
3 344 1228 697
3 698 1229 342
3 344 1229 698
3 698 1230 338
3 342 1230 698
3 93 92 93
3 699 1231 349
3 348 1231 699
3 699 1232 345
3 349 1232 699
3 700 1233 349
3 347 1233 700
3 700 1234 348
3 349 1234 700
3 701 1235 346
3 350 1235 701
3 701 1236 348
3 346 1236 701
3 702 1237 350
3 345 1237 702
3 702 1238 348
3 350 1238 702
3 703 1239 347
3 352 1239 703
3 703 1240 351
3 347 1240 703
3 704 1241 352
3 90 1241 704
3 704 1242 351
3 352 1242 704
3 705 1243 353
3 351 1243 705
3 705 1244 346
3 353 1244 705
3 706 1245 351
3 353 1245 706
3 706 1246 347
3 351 1246 706
3 707 1247 354
3 356 1247 707
3 707 1248 355
3 354 1248 707
3 708 1249 356
3 346 1249 708
3 708 1250 355
3 356 1250 708
3 709 1251 357
3 355 1251 709
3 709 1252 60
3 357 1252 709
3 710 1253 355
3 357 1253 710
3 710 1254 354
3 355 1254 710
3 711 1255 359
3 358 1255 711
3 711 1256 346
3 359 1256 711
3 712 1257 358
3 359 1257 712
3 712 1258 354
3 358 1258 712
3 713 1259 360
3 358 1259 713
3 713 1260 345
3 360 1260 713
3 714 1261 360
3 346 1261 714
3 714 1262 358
3 360 1262 714
3 715 1263 362
3 364 1263 715
3 715 1264 363
3 362 1264 715
3 716 1265 364
3 361 1265 716
3 716 1266 363
3 364 1266 716
3 717 1267 365
3 363 1267 717
3 717 1268 90
3 365 1268 717
3 718 1269 363
3 365 1269 718
3 718 1270 362
3 363 1270 718
3 719 1271 367
3 366 1271 719
3 719 1272 361
3 367 1272 719
3 720 1273 362
3 366 1273 720
3 720 1274 367
3 362 1274 720
3 721 1275 366
3 345 1275 721
3 721 1276 368
3 366 1276 721
3 722 1277 368
3 361 1277 722
3 722 1278 366
3 368 1278 722
3 723 1279 371
3 370 1279 723
3 723 1280 369
3 371 1280 723
3 724 1281 370
3 371 1281 724
3 724 1282 361
3 370 1282 724
3 725 1283 91
3 372 1283 725
3 725 1284 370
3 91 1284 725
3 726 1285 372
3 369 1285 726
3 726 1286 370
3 372 1286 726
3 727 1287 374
3 373 1287 727
3 727 1288 369
3 374 1288 727
3 728 1289 374
3 90 1289 728
3 728 1290 373
3 374 1290 728
3 729 1291 375
3 373 1291 729
3 729 1292 361
3 375 1292 729
3 730 1293 373
3 375 1293 730
3 730 1294 369
3 373 1294 730
3 91 90 91
3 91 1295 61
3 93 1295 91
3 93 91 93
3 63 60 61
3 63 61 63
3 60 1296 90
3 62 1296 60
3 62 60 62
3 92 91 90
3 92 90 92
3 731 1297 376
3 9 1297 731
3 731 1298 77
3 376 1298 731
3 732 1299 9
3 376 1299 732
3 732 1300 11
3 9 1300 732
3 11 9 11
3 733 734 29
3 111 734 733
3 733 735 32
3 29 735 733
3 32 29 32
3 736 1301 377
3 14 1301 736
3 736 1302 115
3 377 1302 736
3 14 1303 737
3 9 1303 14
3 737 1304 377
3 9 1304 737
3 9 14 9
3 14 72 14
3 77 738 29
3 80 738 77
3 80 77 80
3 739 1305 378
3 10 1305 739
3 739 1306 78
3 378 1306 739
3 740 1307 10
3 378 1307 740
3 740 1308 12
3 10 1308 740
3 12 10 12
3 741 742 33
3 30 742 741
3 741 743 114
3 33 743 741
3 114 33 114
3 744 1309 379
3 15 1309 744
3 744 1310 116
3 379 1310 744
3 15 1311 745
3 10 1311 15
3 745 1312 379
3 10 1312 745
3 10 15 10
3 15 73 15
3 746 1313 381
3 380 1313 746
3 746 1314 12
3 381 1314 746
3 747 1315 381
3 15 1315 747
3 747 1316 380
3 381 1316 747
3 748 1317 382
3 380 1317 748
3 748 1318 11
3 382 1318 748
3 749 1319 382
3 12 1319 749
3 749 1320 380
3 382 1320 749
3 11 12 11
3 750 1321 383
3 385 1321 750
3 750 1322 384
3 383 1322 750
3 751 1323 385
3 12 1323 751
3 751 1324 384
3 385 1324 751
3 752 1325 386
3 384 1325 752
3 752 1326 114
3 386 1326 752
3 753 1327 384
3 386 1327 753
3 753 1328 383
3 384 1328 753
3 754 1329 388
3 387 1329 754
3 754 1330 12
3 388 1330 754
3 755 1331 387
3 388 1331 755
3 755 1332 383
3 387 1332 755
3 756 1333 11
3 389 1333 756
3 756 1334 387
3 11 1334 756
3 757 1335 389
3 12 1335 757
3 757 1336 387
3 389 1336 757
3 11 12 11
3 758 1337 391
3 390 1337 758
3 758 1338 114
3 391 1338 758
3 759 1339 391
3 116 1339 759
3 759 1340 390
3 391 1340 759
3 760 1341 392
3 390 1341 760
3 760 1342 113
3 392 1342 760
3 761 1343 392
3 114 1343 761
3 761 1344 390
3 392 1344 761
3 113 114 113
3 762 1345 394
3 393 1345 762
3 762 1346 72
3 394 1346 762
3 763 1347 394
3 73 1347 763
3 763 1348 393
3 394 1348 763
3 764 1349 395
3 393 1349 764
3 764 1350 115
3 395 1350 764
3 765 1351 395
3 72 1351 765
3 765 1352 393
3 395 1352 765
3 115 72 115
3 766 1353 397
3 396 1353 766
3 766 1354 15
3 397 1354 766
3 767 1355 397
3 73 1355 767
3 767 1356 396
3 397 1356 767
3 768 1357 398
3 396 1357 768
3 768 1358 14
3 398 1358 768
3 769 1359 398
3 15 1359 769
3 769 1360 396
3 398 1360 769
3 14 15 14
3 401 770 400
3 399 770 401
3 401 771 97
3 400 771 401
3 402 772 400
3 83 772 402
3 402 773 399
3 400 773 402
3 404 774 403
3 399 774 404
3 404 775 96
3 403 775 404
3 405 776 403
3 97 776 405
3 405 777 399
3 403 777 405
3 96 97 96
3 408 778 407
3 406 778 408
3 408 779 97
3 407 779 408
3 409 780 407
3 83 780 409
3 409 781 406
3 407 781 409
3 411 782 410
3 406 782 411
3 411 783 96
3 410 783 411
3 412 784 410
3 97 784 412
3 412 785 406
3 410 785 412
3 96 97 96
3 415 786 414
3 413 786 415
3 415 787 102
3 414 787 415
3 416 788 414
3 75 788 416
3 416 789 413
3 414 789 416
3 418 790 417
3 413 790 418
3 418 791 101
3 417 791 418
3 419 792 417
3 102 792 419
3 419 793 413
3 417 793 419
3 101 102 101
3 101 82 96
3 101 96 101
3 74 83 82
3 74 82 74
3 75 97 83
3 75 83 75
3 102 96 97
3 102 97 102
3 422 794 421
3 420 794 422
3 422 795 41
3 421 795 422
3 423 796 421
3 83 796 423
3 423 797 420
3 421 797 423
3 425 798 424
3 420 798 425
3 425 799 40
3 424 799 425
3 426 800 424
3 41 800 426
3 426 801 420
3 424 801 426
3 40 41 40
3 429 802 428
3 427 802 429
3 429 803 41
3 428 803 429
3 430 804 428
3 83 804 430
3 430 805 427
3 428 805 430
3 432 806 431
3 427 806 432
3 432 807 40
3 431 807 432
3 433 808 431
3 41 808 433
3 433 809 427
3 431 809 433
3 40 41 40
3 436 810 435
3 434 810 436
3 436 811 43
3 435 811 436
3 437 812 435
3 75 812 437
3 437 813 434
3 435 813 437
3 439 814 438
3 434 814 439
3 439 815 42
3 438 815 439
3 440 816 438
3 43 816 440
3 440 817 434
3 438 817 440
3 42 43 42
3 42 82 40
3 42 40 42
3 74 83 82
3 74 82 74
3 75 41 83
3 75 83 75
3 43 40 41
3 43 41 43
3 79 36 76
3 79 76 79
3 76 34 84
3 76 84 76
3 66 28 64
3 66 64 66
3 81 37 78
3 81 78 81
3 78 35 85
3 78 85 78
3 67 30 65
3 67 65 67
3 38 37 36
3 38 36 38
3 79 85 84
3 79 84 79
3 76 65 37
3 76 37 76
3 66 65 64
3 66 64 66
3 31 35 34
3 31 34 31
3 84 35 85
3 84 85 84
3 100 8 98
3 100 98 100
3 104 818 103
3 118 818 104
3 118 104 118
3 819 1361 68
3 20 1361 819
3 819 1362 70
3 68 1362 819
3 70 68 70
3 820 1363 69
3 21 1363 820
3 820 1364 71
3 69 1364 820
3 71 69 71
3 22 21 20
3 22 20 22
3 20 69 68
3 20 68 20
3 68 71 70
3 68 70 68
3 70 23 71
3 70 71 70
3 27 1365 59
3 25 1365 27
3 25 27 25
3 26 1366 58
3 24 1366 26
3 24 26 24
3 57 58 59
3 57 59 57
3 59 26 27
3 59 27 59
3 27 24 25
3 27 25 27
3 25 56 24
3 25 24 25
3 89 1367 108
3 87 1367 89
3 87 89 87
3 88 1368 107
3 86 1368 88
3 86 88 86
3 106 107 108
3 106 108 106
3 108 88 89
3 108 89 108
3 89 86 87
3 89 87 89
3 87 105 86
3 87 86 87