OFF

586 1168 0
-0.070225 0.273848 0.116176
-0.118259 0.132392 -0.074285
-0.218386 0.152393 -0.169551
0.126201 -0.085794 0.057187
0.246968 0.124578 -0.077867
0.289111 0.176496 -0.043441
0.114939 0.067414 0.052760
0.301945 -0.162203 -0.081243
-0.284122 0.037329 -0.139179
-0.328200 0.161985 -0.068287
0.197362 -0.162521 -0.090750
-0.260787 0.014682 -0.172093
0.008466 -0.205342 -0.091701
-0.009998 -0.183867 0.021517
0.016441 -0.262497 -0.068363
0.287026 -0.119813 0.103887
0.321689 -0.037608 0.118577
0.283098 0.006743 0.104969
0.141260 -0.111297 0.070656
0.183675 0.066910 0.116627
-0.136122 -0.005028 -0.087257
0.434439 -0.066843 -0.031522
0.404335 0.021298 -0.055961
0.440801 0.072398 0.109522
0.038273 -0.174852 -0.092416
-0.004206 -0.163178 -0.115817
-0.014014 -0.103547 -0.142783
0.016435 0.153214 0.063096
0.054111 0.142180 0.025433
0.048957 0.141239 0.088588
-0.101147 0.134902 -0.035892
-0.184633 0.025017 -0.177485
-0.035518 0.162776 -0.140378
-0.033621 -0.125887 -0.009966
-0.059938 -0.071799 -0.026322
-0.220743 0.171970 -0.144344
-0.107361 0.185511 -0.125684
-0.045211 0.088343 -0.017928
0.350592 -0.163761 0.095164
0.327523 -0.149594 0.106402
0.345140 -0.019537 0.118300
0.046420 -0.204934 0.042717
0.148558 -0.227616 0.071410
0.193946 -0.230758 -0.050697
-0.220677 0.038422 -0.120130
-0.011455 0.105984 -0.151631
0.164948 -0.201701 0.052223
0.090194 0.201866 -0.028546
0.270057 -0.242094 0.002287
0.237950 0.213702 0.103196
0.172684 -0.260765 0.019867
0.178369 -0.252094 -0.037921
-0.125127 0.282186 0.102639
-0.080009 0.250782 0.173223
0.348830 -0.226821 0.045686
0.379854 0.031921 -0.066240
0.266046 0.184872 0.135435
0.366815 -0.151779 -0.061862
0.473497 0.043782 0.070623
0.126546 0.128777 -0.097507
0.111131 0.069253 -0.127110
-0.048364 -0.030941 -0.172792
0.069669 -0.224914 -0.080794
-0.001156 0.071303 -0.155272
-0.051060 0.033434 -0.171461
0.069815 0.278767 0.137622
0.105242 0.224313 -0.010236
0.002026 -0.059138 -0.137156
-0.106400 0.029843 -0.065348
-0.020729 0.017748 -0.028886
-0.127435 0.056695 -0.146977
-0.055797 0.189354 -0.111667
-0.343279 0.058599 -0.094482
-0.266928 0.169876 -0.137305
-0.099669 0.163001 -0.163595
0.063054 0.207259 0.024404
0.115264 0.010450 -0.122541
0.256246 -0.243513 -0.040888
0.366479 0.162527 0.082749
0.460541 0.053410 0.005478
0.345974 0.189195 0.050515
0.108828 0.181329 -0.085819
0.124019 -0.238504 -0.059357
0.014710 0.008996 -0.163720
-0.011689 0.189739 -0.098231
0.019233 -0.139715 0.015120
-0.452982 0.150264 -0.012275
0.248735 0.224452 0.039383
0.376597 0.156719 0.003038
-0.110827 0.098947 -0.042281
-0.012308 -0.011986 -0.018545
0.308885 -0.213879 0.072001
0.069169 0.269547 0.092527
0.231713 -0.106897 -0.094841
-0.025649 0.268272 0.092106
0.022298 0.272749 0.136748
0.248461 -0.205131 -0.064956
-0.275151 0.243360 0.124394
-0.031972 -0.251188 0.013062
-0.031913 -0.056760 -0.017263
-0.013486 -0.173555 0.013749
-0.071014 0.264597 0.080868
0.034540 -0.039409 -0.139001
0.058929 -0.126499 0.032029
-0.415903 0.080057 -0.014935
0.165466 0.126140 -0.092269
0.030636 -0.145882 -0.115702
0.276403 -0.220806 0.071889
0.145385 -0.130808 -0.098850
0.224143 0.200467 0.145501
-0.083968 -0.031955 -0.044092
-0.224781 0.172075 -0.115419
-0.431214 0.160681 -0.058144
-0.372700 0.166521 -0.087009
0.102508 0.197780 -0.021750
0.308618 -0.070477 -0.090673
0.363694 -0.216404 -0.020510
-0.046205 -0.207395 0.012377
0.141901 0.202346 -0.045181
0.419277 -0.047584 -0.047488
0.338586 0.060518 -0.078550
0.138174 -0.254217 0.024276
0.391171 0.137930 0.084126
-0.453302 0.117576 0.002387
-0.159027 0.157697 -0.166573
0.370665 0.164598 0.051893
0.243912 0.227017 0.072561
0.357950 0.030921 -0.075384
0.363561 -0.091053 -0.071802
-0.304891 0.164981 -0.096762
0.361628 0.149562 0.104922
0.478828 0.021612 0.044634
0.123525 -0.255402 -0.047404
-0.244912 0.279012 0.139205
0.381909 -0.195888 0.050987
-0.156536 0.178523 -0.107594
-0.193172 0.264296 0.181300
0.024610 0.151912 0.104938
-0.082859 0.075667 -0.033299
0.050965 0.261367 0.153305
0.205750 -0.256771 0.028485
0.403794 0.096546 -0.031026
0.251267 0.217507 0.003179
0.331126 -0.096264 -0.081493
-0.345282 0.118852 -0.041681
0.034855 0.137625 -0.136449
-0.098071 0.273392 0.091753
0.006306 0.193153 0.052571
0.136722 -0.103323 -0.105224
0.398216 -0.159525 -0.026026
-0.006021 0.170688 -0.031682
0.432548 0.062165 -0.021495
-0.109596 -0.014064 -0.058378
-0.202496 0.033538 -0.088921
-0.036411 0.070376 -0.148709
0.427784 0.115491 0.029761
0.042581 0.071132 0.013728
0.433216 -0.118449 -0.022437
0.121285 -0.147948 -0.104104
-0.153277 0.268828 0.098386
-0.260541 0.037662 -0.145620
-0.423708 0.158730 -0.021988
0.072996 -0.095393 0.034653
-0.142999 -0.023374 -0.180499
-0.405043 0.095131 -0.101715
-0.032716 0.045782 -0.017014
0.209854 0.242532 0.070958
-0.351201 0.077181 -0.048471
0.272008 0.198187 0.104800
-0.018153 0.161803 0.096934
0.022106 0.011700 -0.010656
0.104825 0.269708 0.120956
0.106937 0.188625 0.162329
0.254436 -0.247435 0.019695
0.027577 -0.270175 -0.025114
-0.063564 0.023795 -0.047117
-0.114470 0.275559 0.146395
0.094682 -0.259224 -0.037699
-0.034818 -0.060913 -0.142390
-0.255354 0.163519 -0.087650
0.039744 0.180237 0.043750
0.084562 0.127874 0.091134
-0.001477 -0.243336 0.026853
0.175527 -0.256430 -0.009027
-0.364769 0.119725 -0.130703
0.354174 0.164729 -0.029876
-0.055953 0.175350 -0.054018
-0.008593 -0.221439 0.026510
-0.093711 0.199553 0.176506
-0.106626 -0.001132 -0.183480
-0.067240 0.127344 -0.151853
0.466619 0.064725 0.042288
-0.040473 0.239351 0.166070
-0.362647 0.098059 -0.128477
-0.228812 0.212963 0.124458
-0.080396 0.234726 0.061992
0.192633 0.154584 -0.074848
0.379364 0.117825 -0.039172
-0.276590 0.247998 0.152411
0.047368 -0.077502 0.020367
0.459188 0.069699 0.080081
0.183468 0.042406 -0.113713
0.107178 0.230015 0.162278
-0.055349 0.256600 0.141123
0.006777 0.040149 -0.159496
-0.142530 0.047052 -0.115429
0.354883 0.128448 -0.049451
0.063588 0.089708 -0.144312
0.212386 0.235586 0.034754
-0.481141 0.122766 -0.003232
0.303458 0.075982 0.121664
-0.117898 0.195616 0.157100
0.166209 -0.205194 -0.065199
0.022083 0.273520 0.114864
-0.131271 0.165976 -0.155606
-0.476269 0.098873 -0.004696
0.370648 -0.055628 -0.072627
0.192431 -0.017446 -0.107896
0.146684 -0.260251 0.000678
-0.071395 0.179065 0.107469
0.119397 -0.048354 -0.117972
0.004903 0.183517 -0.071569
0.151194 -0.245299 -0.048639
0.082781 0.202519 0.001327
0.117553 0.090961 0.073221
0.287020 -0.234168 -0.017801
0.101121 0.151567 -0.100620
0.103960 -0.092978 -0.116852
0.161038 0.238356 0.129928
0.157978 0.070956 -0.119701
0.021740 -0.059611 0.006081
-0.395117 0.119183 -0.114514
0.103663 -0.247669 0.028684
0.088523 -0.137602 -0.115732
0.086882 0.242320 0.018598
0.076363 0.074233 0.035264
0.287604 0.108579 0.137373
0.216840 0.125463 0.148502
-0.142084 0.191678 0.137694
0.066341 -0.241576 0.034664
0.153713 0.157220 -0.080087
-0.455751 0.118536 -0.066191
0.334380 -0.156991 -0.071553
0.201393 -0.077298 -0.102078
0.029018 -0.235484 0.040644
0.411772 0.094555 0.114357
0.040881 -0.005341 -0.152283
-0.217597 -0.031373 -0.173932
-0.284085 0.102522 -0.067174
0.214918 0.228641 -0.001451
-0.435944 0.073494 -0.064068
0.139188 0.251429 0.059195
0.434167 -0.025076 -0.033906
0.060711 -0.053746 -0.127564
-0.489008 0.119720 -0.036971
-0.049712 0.001246 -0.172127
-0.001315 0.079737 -0.002100
0.062921 0.039124 -0.145415
0.302926 0.030275 0.116718
0.449880 0.097750 0.057457
0.219800 0.183027 -0.057427
0.210356 -0.137150 -0.096261
-0.003888 -0.041720 -0.008205
0.217081 0.166852 0.148450
-0.076612 0.054387 -0.032842
-0.181224 -0.009131 -0.176914
0.238816 -0.252776 0.037103
0.057043 0.136554 0.059491
0.010571 0.164466 -0.005021
0.115726 -0.264243 0.002913
-0.282208 -0.019848 -0.165283
-0.018175 0.021215 -0.167590
-0.235593 0.260856 0.176023
0.045303 0.266923 0.081148
0.303845 -0.007910 -0.093963
0.214465 -0.252139 -0.010510
-0.244013 0.261207 0.093020
0.030882 0.055214 -0.150343
0.324340 -0.116455 0.110017
-0.379365 0.158088 -0.041227
-0.076569 -0.034279 -0.178438
0.043055 -0.243706 -0.074578
0.106190 -0.201000 0.058101
0.106295 0.093654 0.054323
-0.176639 0.209407 0.160889
-0.067593 0.162888 -0.151986
-0.048398 0.270189 0.135145
0.178379 0.222517 -0.011954
0.264288 -0.220004 -0.052172
0.075695 0.174358 -0.103733
0.323209 -0.037508 -0.090798
-0.022069 0.186101 0.066655
-0.144851 0.013111 -0.179896
0.118839 0.099015 -0.112309
-0.192641 0.260628 0.089516
0.141720 0.244484 0.022991
0.056155 -0.035925 0.013971
-0.193988 0.047178 -0.146298
-0.049678 0.194775 0.165853
-0.162759 0.218586 0.082056
0.036612 -0.070886 -0.132818
-0.029516 -0.023829 -0.022490
0.185145 0.099400 -0.102281
0.071197 -0.082633 -0.128480
0.335400 -0.189011 -0.049875
-0.039361 0.169128 -0.027356
-0.451439 0.072224 -0.035642
-0.075117 0.262315 0.144699
0.069646 0.236991 0.165633
0.309879 0.199313 0.077768
0.401670 -0.131536 -0.045282
0.302394 -0.015433 0.111773
0.055761 -0.127257 -0.127360
-0.065420 0.206887 0.071366
0.404115 -0.028325 -0.063454
-0.052740 0.170391 0.130773
0.180881 0.185664 -0.062666
-0.108479 0.035353 -0.182878
0.020924 0.175269 -0.112178
0.298231 -0.175265 0.102359
0.174844 0.251590 0.087624
0.302964 -0.194223 -0.059566
-0.199604 0.202712 0.105090
0.013398 -0.259454 -0.000490
0.345716 -0.063295 -0.081618
0.358972 0.023863 0.123907
0.217798 0.092276 0.128981
-0.194111 0.035688 -0.159535
0.210095 0.214882 0.129382
0.032534 -0.265670 -0.046537
-0.219094 0.278150 0.147839
0.263802 0.028918 0.098166
0.141841 0.216392 -0.022457
0.030527 -0.018034 -0.000315
-0.109198 0.217266 0.076057
0.105182 0.238359 0.012488
-0.089294 0.173789 -0.049692
-0.055144 -0.005939 -0.036776
0.380789 -0.169646 -0.034316
-0.107114 0.224985 0.176400
-0.285298 0.142392 -0.069034
-0.211194 0.227136 0.184083
-0.446189 0.083205 -0.006214
0.021231 0.259382 0.059718
-0.162873 0.168952 -0.147618
0.068522 0.260326 0.047432
0.021495 0.177294 -0.044908
-0.442385 0.094627 -0.071409
0.361246 -0.202374 0.064806
-0.026059 0.258438 0.072003
0.456455 0.089695 0.028455
0.418055 -0.099190 -0.038402
-0.393012 0.163403 -0.077900
-0.025220 0.266731 0.135874
-0.310678 0.168160 -0.121589
0.247948 0.061514 0.113875
-0.123675 0.170089 -0.071869
0.093413 0.121805 -0.115422
0.162111 0.012153 -0.115133
-0.118468 0.266031 0.082351
-0.225747 0.150762 -0.079526
0.082915 -0.195743 -0.086620
-0.093052 0.189552 0.086975
-0.039205 0.183132 -0.085005
0.054988 0.070278 -0.141191
-0.371383 0.078745 -0.033986
0.188699 -0.135036 -0.097124
0.336823 -0.199662 0.087083
-0.148036 0.159846 -0.072602
-0.080772 0.011952 -0.051062
-0.135934 -0.007208 -0.064238
-0.285909 0.167429 -0.117033
0.038942 0.224321 0.037946
0.013503 0.158840 0.029038
-0.220791 0.278023 0.135699
0.171074 -0.047699 -0.109315
0.212313 0.127843 -0.084860
0.253708 0.194700 -0.024810
-0.026108 0.052368 -0.163366
0.126028 0.247415 0.146594
-0.274348 0.265308 0.111621
0.370080 0.000798 -0.073991
0.068681 -0.258711 -0.056888
0.081215 -0.257695 0.007321
-0.172396 0.149603 -0.073335
0.303984 -0.226243 -0.037889
-0.187401 0.043180 -0.120469
0.233384 0.153803 -0.067647
0.157393 -0.198040 0.076651
-0.353783 0.160036 -0.054757
-0.153821 0.269927 0.163848
-0.037236 0.132291 -0.141063
-0.001783 0.270896 0.103485
0.067053 -0.019679 -0.140846
-0.221216 0.271261 0.108782
0.303917 0.185997 0.108403
0.043893 -0.251602 0.013301
0.022998 -0.116912 -0.138988
0.254455 0.179762 -0.050434
0.136621 0.040703 -0.121121
0.120168 0.114508 0.093681
-0.077733 0.176178 -0.137631
-0.382588 0.061274 -0.068074
-0.395529 0.138852 -0.022501
0.258984 0.151257 0.138384
0.365255 -0.184092 -0.041186
0.380989 -0.080931 -0.063512
0.294028 -0.103446 -0.090548
0.180036 -0.107552 -0.103498
-0.123971 0.059844 -0.097823
-0.138218 0.212999 0.175845
0.035517 0.090221 -0.151352
-0.075872 0.224065 0.171967
0.039067 -0.215128 -0.086247
-0.023169 -0.045040 -0.154974
0.089092 0.024787 -0.133978
-0.188087 0.271625 0.114420
0.365188 -0.121416 -0.066832
0.413810 0.106163 0.104366
-0.071735 0.197349 0.170712
-0.157559 0.248620 0.076645
0.218756 0.059090 0.109459
-0.025662 0.029207 -0.025353
0.104178 0.260488 0.075861
0.444879 0.095615 0.089539
-0.443016 0.143493 -0.070448
0.055075 0.028571 0.014641
0.247531 -0.248144 -0.001892
0.182000 0.174672 0.155618
0.223902 0.228117 0.087077
-0.165855 0.238777 0.180188
0.348971 -0.124022 -0.071678
-0.078421 0.002206 -0.177835
0.012095 0.214849 0.039974
0.096161 -0.166573 -0.092446
0.067988 0.144596 -0.118534
-0.469878 0.097477 -0.051093
-0.310286 0.157742 -0.134310
-0.316099 0.063844 -0.095086
-0.017793 -0.261909 -0.011562
0.420525 0.117840 0.070792
0.399114 0.141287 0.031066
0.299066 0.173033 0.130577
0.111858 -0.191604 -0.086635
0.120683 -0.259738 -0.018510
0.014829 0.241382 0.051488
0.008368 -0.025071 -0.150438
-0.405520 0.145166 -0.099782
0.160621 -0.244191 0.045639
-0.157625 0.037409 -0.083881
0.326407 -0.226532 0.003899
0.322754 0.053807 0.128468
-0.050443 0.179048 0.080739
-0.065375 0.139321 -0.027165
0.096844 -0.231709 -0.070076
0.316536 -0.129234 -0.081368
0.063869 0.116794 0.034351
-0.391537 0.099181 -0.018881
-0.115518 0.177800 -0.098777
0.182241 0.216062 0.155567
0.293926 -0.233459 0.003786
-0.089247 0.045064 -0.159219
0.016045 0.110163 -0.161514
-0.257378 -0.019467 -0.171522
0.217308 -0.247803 -0.039404
-0.276460 0.271573 0.150802
0.021437 0.264299 0.069769
-0.139395 0.039969 -0.076904
0.251998 0.199287 0.119316
-0.046779 -0.098843 -0.018144
-0.023184 0.174885 -0.125614
0.429762 -0.146438 -0.003181
0.175787 0.243508 0.046974
0.085007 0.047993 0.033700
-0.012017 0.231910 0.053516
-0.459533 0.152813 -0.042552
-0.011843 -0.134207 -0.139104
-0.092347 0.179082 0.134199
0.371796 -0.207167 0.019458
-0.315456 0.134383 -0.146724
0.182717 0.100096 0.136149
-0.009736 0.136470 -0.150946
-0.007084 -0.085627 -0.001235
-0.221005 0.002775 -0.174503
0.293806 -0.148460 0.107703
0.139834 0.260649 0.104290
0.123601 0.206307 -0.039070
0.321579 0.028870 -0.088073
-0.138000 0.199805 0.090122
-0.364662 0.142666 -0.126866
0.333839 -0.221324 -0.029199
-0.132422 -0.041738 -0.102949
0.042562 0.167387 -0.121647
0.322222 0.008100 0.123522
-0.243851 0.172615 -0.141335
0.014671 0.259059 0.151846
0.272330 -0.196496 -0.063456
0.340943 -0.000728 -0.084908
0.476784 0.039755 0.056122
0.217359 0.205834 -0.029439
0.085706 0.092044 -0.130223
-0.022613 0.176910 -0.058344
0.419251 -0.001889 -0.044934
0.088496 0.254391 0.149950
-0.120517 0.250418 0.176294
0.316349 -0.233748 0.045574
0.204825 0.072659 -0.112293
0.063398 -0.156227 -0.104074
0.360307 -0.030326 -0.081742
0.334213 0.039989 0.125856
-0.243083 0.232768 0.172109
0.134254 0.158539 -0.082706
0.138299 0.097697 -0.109689
0.045949 0.276144 0.126243
-0.361587 0.059433 -0.075521
0.283630 0.052450 0.109915
-0.227449 0.025185 -0.165814
0.225897 0.098618 -0.095080
0.178319 0.236562 0.010770
0.181785 -0.183857 -0.077974
-0.315241 0.121265 -0.050419
0.283868 -0.240675 0.045461
-0.038864 0.222438 0.055543
0.144348 0.160954 0.158999
0.288363 0.191434 -0.017816
-0.411692 0.119617 -0.003775
-0.174098 0.201616 0.118730
0.268039 0.150537 -0.060654
-0.193275 0.277288 0.156473
-0.240858 0.222823 0.109944
-0.245783 0.129989 -0.069550
0.006075 -0.112671 0.006943
-0.164693 0.170812 -0.080686
-0.258020 0.223213 0.143827
0.011179 0.037177 -0.001187
0.213788 0.012807 -0.106476
-0.366672 0.118271 -0.025708
0.470996 0.042715 0.086664
0.140754 -0.018101 -0.116552
-0.151278 0.273592 0.130408
-0.072545 0.181572 -0.080679
-0.318930 0.076278 -0.059093
0.097651 0.119895 0.055887
-0.427658 0.116318 -0.092028
-0.049490 0.262642 0.077133
-0.017063 -0.236724 -0.082894
-0.288919 0.069088 -0.095690
0.282793 0.208937 0.040986
0.267776 0.085046 0.125624
-0.141507 0.030826 -0.103364
-0.089736 0.179722 -0.091768
0.341788 0.187123 0.081372
0.356262 -0.221613 0.012588
0.045770 -0.099456 0.023852
0.036813 0.185862 0.009692
-0.117568 0.190615 0.112335
0.196047 0.229297 0.113263
0.058767 -0.267721 -0.014042
-0.412757 0.094129 -0.092278
0.093225 -0.034016 -0.129409
-0.420859 0.061491 -0.049011
0.144589 0.202344 0.158948
0.154048 -0.158293 -0.092476
0.178440 0.208471 -0.034678
-0.016827 -0.010973 -0.168256
0.402893 -0.079930 -0.054368
0.403034 0.122172 -0.013584
0.126111 -0.237642 0.050047
0.149716 -0.077953 -0.110735
-0.058340 -0.049846 -0.029806
-0.214188 0.230095 0.091966
0.141780 0.230438 0.000267
-0.210197 0.203426 0.147337
0.294666 0.142193 0.134424
0.277970 0.211502 0.074164
0.139034 -0.198399 -0.075917
-0.354427 0.166444 -0.105874
0.088788 -0.231550 0.056027
-0.020462 -0.152931 -0.001789
0.431787 0.087791 -0.004053
0.060280 0.114834 -0.133336
-0.139082 0.127670 -0.057168
-0.397855 0.071941 -0.092529
0.251922 0.117643 0.141334
0.105121 0.252405 0.035211
0.144709 0.223039 0.158922
3 52 0 146
3 52 176 0
3 124 1 2
3 1 581 2
3 581 530 2
3 530 546 2
3 546 72 2
3 72 479 2
3 72 193 479
3 124 70 1
3 70 409 1
3 124 461 70
3 124 74 461
3 72 514 193
3 409 467 1
3 467 89 1
3 530 248 546
3 467 68 89
3 68 264 89
3 264 138 89
3 581 384 530
3 384 360 530
3 514 582 193
3 89 30 1
3 479 73 2
3 479 437 73
3 74 190 461
3 190 154 461
3 193 184 479
3 248 541 546
3 154 64 461
3 479 489 437
3 264 37 138
3 42 140 388
3 140 266 388
3 266 107 388
3 107 319 388
3 319 484 388
3 484 15 388
3 15 18 388
3 15 331 18
3 331 421 18
3 421 19 18
3 15 17 331
3 19 3 18
3 19 6 3
3 6 473 3
3 473 296 3
3 473 426 296
3 426 333 296
3 426 170 333
3 42 448 140
3 266 521 107
3 448 50 140
3 15 311 17
3 296 162 3
3 296 199 162
3 107 91 319
3 91 367 319
3 319 39 484
3 206 5 185
3 206 527 5
3 206 4 527
3 206 120 4
3 120 487 4
3 487 517 4
3 487 506 517
3 487 535 506
3 487 274 535
3 274 290 535
3 290 115 535
3 115 407 535
3 407 93 535
3 407 261 93
3 407 7 261
3 7 496 261
3 496 96 261
3 96 10 261
3 93 243 535
3 243 217 535
3 5 524 185
3 524 80 185
3 524 547 80
3 547 309 80
3 309 551 80
3 80 88 185
3 547 574 309
3 80 125 88
3 524 142 547
3 524 377 142
3 125 441 88
3 142 87 547
3 243 375 217
3 463 8 270
3 463 247 8
3 247 153 8
3 247 491 153
3 247 163 491
3 163 280 491
3 280 178 491
3 178 26 491
3 26 476 491
3 476 545 491
3 545 439 491
3 439 98 491
3 98 117 491
3 117 370 491
3 117 34 370
3 117 469 34
3 117 33 469
3 117 578 33
3 280 61 178
3 117 100 578
3 117 13 100
3 247 265 163
3 163 189 280
3 189 432 280
3 270 11 463
3 163 292 189
3 495 308 139
3 495 192 308
3 192 298 308
3 298 172 308
3 298 137 172
3 298 315 137
3 137 29 172
3 315 169 137
3 172 202 308
3 29 181 172
3 181 400 172
3 139 65 495
3 81 114 47
3 81 223 114
3 81 289 223
3 289 75 223
3 289 346 75
3 289 492 346
3 492 318 346
3 318 221 346
3 318 84 221
3 346 554 75
3 346 268 554
3 47 486 81
3 13 46 100
3 46 388 100
3 491 449 153
3 491 549 449
3 13 282 46
3 388 18 100
3 282 42 46
3 476 25 545
3 15 16 311
3 15 278 16
3 278 38 16
3 38 134 16
3 134 471 16
3 471 40 16
3 471 537 40
3 471 131 537
3 131 498 537
3 498 58 537
3 34 152 370
3 153 160 8
3 278 39 38
3 13 41 282
3 18 103 100
3 471 157 131
3 537 23 40
3 23 325 40
3 103 85 100
3 8 11 270
3 545 14 439
3 153 44 160
3 157 21 131
3 34 110 152
3 23 245 325
3 245 509 325
3 245 451 509
3 245 210 451
3 245 130 210
3 25 12 545
3 19 224 6
3 19 400 224
3 19 480 400
3 480 523 400
3 523 172 400
3 491 20 549
3 134 149 471
3 134 478 149
3 478 116 149
3 116 338 149
3 130 236 210
3 130 573 236
3 130 442 573
3 14 174 439
3 14 329 174
3 21 252 131
3 252 79 131
3 252 502 79
3 502 151 79
3 502 22 151
3 22 55 151
3 55 141 151
3 55 197 141
3 55 120 197
3 120 206 197
3 116 405 338
3 245 418 130
3 38 348 134
3 38 367 348
3 169 27 137
3 55 127 120
3 418 122 130
3 130 395 442
3 130 551 395
3 169 147 27
3 34 569 110
3 18 162 103
3 18 3 162
3 480 237 523
3 237 428 523
3 178 67 26
3 331 355 421
3 237 263 428
3 174 323 439
3 25 24 12
3 169 452 147
3 395 56 442
3 41 577 282
3 117 187 13
3 141 579 151
3 162 553 103
3 13 244 41
3 480 326 237
3 236 548 210
3 348 54 134
3 153 386 44
3 197 566 141
3 329 557 174
3 405 57 338
3 162 199 553
3 386 297 44
3 451 493 509
3 245 424 418
3 338 310 149
3 498 259 58
3 96 77 10
3 77 464 10
3 464 43 10
3 43 519 10
3 43 212 519
3 464 51 43
3 279 144 9
3 279 536 144
3 114 66 47
3 486 118 81
3 118 511 81
3 118 240 511
3 118 316 240
3 118 563 316
3 316 196 240
3 486 332 118
3 240 59 511
3 268 28 373
3 268 305 28
3 305 453 28
3 453 37 28
3 453 138 37
3 37 256 28
3 256 456 28
3 256 156 456
3 453 30 138
3 305 336 453
3 156 235 456
3 190 391 154
3 391 45 154
3 391 481 45
3 391 32 481
3 32 470 481
3 470 318 481
3 318 492 481
3 492 145 481
3 145 462 481
3 45 63 154
3 470 84 318
3 32 71 470
3 292 31 317
3 31 70 317
3 360 111 179
3 360 532 111
3 360 384 532
3 532 135 111
3 135 35 111
3 35 494 111
3 135 36 35
3 294 570 276
3 294 420 570
3 420 299 570
3 420 334 299
3 420 195 334
3 420 359 195
3 334 488 299
3 359 101 195
3 299 322 570
3 516 327 11
3 51 82 222
3 218 50 444
3 444 177 382
3 183 50 51
3 42 388 46
3 244 98 182
3 266 48 173
3 225 385 48
3 12 413 62
3 361 434 62
3 54 552 116
3 57 128 417
3 508 216 406
3 283 6 542
3 200 424 58
3 314 21 119
3 508 55 381
3 429 49 166
3 468 56 49
3 419 412 53
3 0 203 192
3 52 146 101
3 53 0 307
3 47 66 486
3 500 60 580
3 59 60 293
3 584 335 66
3 303 300 67
3 204 63 83
3 64 63 378
3 67 61 414
3 64 255 61
3 63 257 277
3 71 336 540
3 213 65 513
3 95 353 65
3 459 585 202
3 411 462 364
3 214 74 344
3 74 32 285
3 68 369 337
3 262 34 99
3 175 69 68
3 90 69 262
3 449 70 205
3 438 72 546
3 371 73 129
3 73 576 354
3 389 279 9
3 458 356 36
3 384 368 356
3 291 147 452
3 114 223 75
3 445 522 474
3 372 75 445
3 77 496 288
3 551 122 78
3 108 562 148
3 528 133 330
3 159 416 359
3 165 426 534
3 350 498 191
3 194 533 322
3 366 408 10
3 343 349 345
3 543 582 558
3 539 528 176
3 539 416 528
3 539 52 416
3 539 176 52
3 504 53 176
3 307 176 53
3 307 0 176
3 339 410 188
3 339 504 410
3 339 53 504
3 339 188 53
3 284 410 341
3 284 238 410
3 341 510 572
3 430 410 504
3 430 341 410
3 211 477 188
3 211 238 477
3 533 572 510
3 272 510 136
3 284 572 238
3 284 341 572
3 136 528 272
3 390 528 136
3 390 176 528
3 390 504 176
3 390 136 504
3 430 136 341
3 430 504 136
3 330 272 528
3 330 133 272
3 211 410 238
3 211 188 410
3 341 136 510
3 273 466 213
3 273 345 466
3 392 466 94
3 392 213 466
3 513 92 213
3 513 65 92
3 273 92 345
3 273 213 92
3 133 465 272
3 495 353 192
3 495 65 353
3 437 576 73
3 198 510 465
3 433 445 75
3 433 522 445
3 372 345 75
3 372 445 345
3 343 445 349
3 343 345 445
3 474 349 445
3 474 522 349
3 180 147 75
3 180 27 147
3 334 362 488
3 334 195 362
3 433 147 522
3 433 75 147
3 291 522 147
3 291 452 522
3 458 135 356
3 458 36 135
3 532 356 135
3 532 384 356
3 368 581 356
3 368 384 581
3 340 9 520
3 340 179 9
3 124 344 74
3 124 2 344
3 214 36 74
3 214 344 36
3 437 489 576
3 272 465 510
3 555 488 362
3 555 238 488
3 526 322 488
3 526 572 322
3 529 97 276
3 380 276 97
3 555 477 238
3 555 362 477
3 97 198 380
3 465 380 198
3 570 529 276
3 194 572 533
3 194 322 572
3 526 238 572
3 526 488 238
3 299 488 322
3 570 322 529
3 529 322 533
3 420 294 359
3 340 530 179
3 340 520 530
3 164 193 582
3 193 164 231
3 447 489 231
3 129 9 179
3 129 576 9
3 461 317 70
3 461 64 317
3 189 317 432
3 280 432 61
3 432 64 61
3 432 317 64
3 531 33 85
3 531 482 33
3 578 85 33
3 103 553 85
3 531 553 482
3 531 85 553
3 469 482 34
3 469 33 482
3 354 129 73
3 354 576 129
3 371 179 73
3 371 129 179
3 401 36 71
3 401 74 36
3 550 336 71
3 550 356 336
3 550 36 356
3 550 71 36
3 401 32 74
3 401 71 32
3 342 215 306
3 104 342 560
3 457 104 365
3 457 525 104
3 306 560 342
3 457 536 525
3 457 365 536
3 250 582 560
3 342 104 123
3 525 123 104
3 402 560 582
3 391 190 32
3 112 352 425
3 447 425 352
3 352 112 279
3 285 190 74
3 285 32 190
3 161 279 112
3 403 161 525
3 403 279 161
3 248 520 541
3 248 530 520
3 403 536 279
3 403 525 536
3 161 86 525
3 475 86 112
3 356 30 336
3 123 525 86
3 209 86 254
3 475 254 86
3 161 112 86
3 254 215 209
3 483 31 265
3 483 11 31
3 292 265 31
3 483 247 11
3 483 265 247
3 463 11 247
3 163 265 292
3 189 292 317
3 438 541 72
3 438 546 541
3 297 327 160
3 297 70 327
3 516 160 327
3 516 11 160
3 186 305 501
3 186 336 305
3 150 305 268
3 150 501 305
3 363 540 501
3 363 71 540
3 186 540 336
3 186 501 540
3 481 462 45
3 327 31 11
3 327 70 31
3 221 84 501
3 363 84 71
3 363 501 84
3 150 346 501
3 150 268 346
3 221 501 346
3 205 386 449
3 205 70 386
3 153 449 386
3 386 70 297
3 44 297 160
3 333 170 262
3 90 170 69
3 90 262 170
3 175 337 69
3 175 68 337
3 301 69 337
3 301 262 69
3 230 296 262
3 230 199 296
3 333 262 296
3 453 336 30
3 422 165 68
3 422 426 165
3 264 68 165
3 256 37 165
3 264 165 37
3 156 256 426
3 534 256 165
3 534 426 256
3 89 138 30
3 422 69 426
3 422 68 69
3 170 426 69
3 224 542 6
3 224 400 542
3 373 180 268
3 373 27 180
3 554 180 75
3 554 268 180
3 207 364 462
3 207 60 364
3 411 63 462
3 411 364 63
3 181 542 400
3 181 29 542
3 227 148 233
3 227 220 148
3 158 148 562
3 158 233 148
3 312 303 233
3 312 397 303
3 227 303 220
3 227 233 303
3 253 303 67
3 253 220 303
3 300 397 67
3 300 303 397
3 246 102 83
3 246 393 102
3 446 102 67
3 446 83 102
3 559 253 393
3 559 220 253
3 102 253 67
3 102 393 253
3 571 66 295
3 571 332 66
3 486 66 332
3 234 584 66
3 234 345 584
3 335 295 66
3 335 584 295
3 287 563 332
3 287 249 563
3 118 332 563
3 571 518 332
3 571 295 518
3 287 518 249
3 287 332 518
3 228 556 485
3 228 459 556
3 320 556 166
3 320 485 556
3 171 379 485
3 171 65 379
3 228 379 459
3 228 485 379
3 283 235 6
3 283 542 235
3 473 235 426
3 473 6 235
3 423 92 485
3 423 345 92
3 171 92 65
3 171 485 92
3 320 251 485
3 320 166 251
3 423 251 345
3 423 485 251
3 454 382 62
3 454 82 382
3 132 82 51
3 132 382 82
3 518 472 249
3 518 295 472
3 208 472 166
3 208 249 472
3 584 251 295
3 584 345 251
3 472 251 166
3 472 295 251
3 139 308 65
3 503 308 202
3 503 65 308
3 585 379 202
3 585 459 379
3 503 379 65
3 503 202 379
3 281 382 14
3 281 62 382
3 470 71 84
3 204 271 63
3 204 83 271
3 378 271 64
3 378 63 271
3 364 257 63
3 364 60 257
3 277 83 63
3 277 257 83
3 415 76 393
3 415 60 76
3 559 76 220
3 559 393 76
3 246 257 393
3 246 83 257
3 415 257 60
3 415 393 257
3 361 24 434
3 361 62 24
3 443 434 562
3 443 62 434
3 45 462 63
3 156 426 235
3 456 235 542
3 456 542 28
3 373 28 27
3 267 28 542
3 267 27 28
3 414 564 67
3 414 61 564
3 446 564 83
3 446 67 564
3 413 24 62
3 413 12 24
3 106 25 397
3 106 24 25
3 476 397 25
3 145 580 462
3 207 580 60
3 207 462 580
3 26 67 397
3 215 123 209
3 86 209 123
3 113 489 447
3 510 198 533
3 533 198 97
3 267 29 27
3 267 542 29
3 137 27 29
3 476 26 397
3 575 212 82
3 575 562 212
3 222 212 51
3 222 82 212
3 454 443 82
3 454 62 443
3 575 443 562
3 575 82 443
3 187 98 244
3 187 117 98
3 507 106 233
3 507 24 106
3 312 106 397
3 312 233 106
3 158 434 233
3 158 562 434
3 507 434 24
3 507 233 434
3 281 12 62
3 281 14 12
3 533 97 529
3 250 560 306
3 123 215 342
3 241 543 347
3 234 75 345
3 234 66 75
3 114 75 66
3 271 564 64
3 271 83 564
3 255 564 61
3 255 64 564
3 152 68 370
3 409 70 467
3 68 467 370
3 178 61 67
3 154 63 64
3 141 566 579
3 151 579 79
3 440 424 259
3 440 122 424
3 155 566 441
3 155 350 566
3 155 259 350
3 155 441 259
3 440 441 122
3 440 259 441
3 245 23 424
3 579 350 79
3 579 566 350
3 502 314 22
3 502 252 314
3 316 563 260
3 499 563 249
3 499 260 563
3 351 565 21
3 351 310 565
3 119 565 314
3 119 21 565
3 351 157 310
3 351 21 157
3 252 21 314
3 157 471 310
3 149 310 471
3 435 357 580
3 435 289 357
3 500 357 60
3 500 580 357
3 145 492 580
3 435 492 289
3 435 580 492
3 226 81 59
3 226 289 81
3 511 59 81
3 293 357 59
3 293 60 357
3 226 357 289
3 226 59 357
3 418 424 122
3 242 304 7
3 242 57 304
3 321 304 385
3 321 7 304
3 490 304 116
3 490 385 304
3 405 304 57
3 405 116 304
3 191 79 350
3 191 498 79
3 131 79 498
3 498 350 259
3 537 58 424
3 200 259 424
3 200 58 259
3 537 424 23
3 70 549 467
3 356 1 30
3 112 425 475
3 294 276 394
3 528 374 133
3 449 549 70
3 250 306 347
3 558 250 543
3 558 582 250
3 425 241 475
3 447 543 425
3 479 184 489
3 466 349 94
3 466 345 349
3 581 1 356
3 95 213 353
3 95 65 213
3 392 353 213
3 392 94 353
3 344 35 36
3 344 2 35
3 130 122 551
3 417 310 57
3 417 128 310
3 406 128 508
3 406 310 128
3 236 573 583
3 404 573 56
3 404 583 573
3 38 39 367
3 565 406 314
3 565 310 406
3 216 314 406
3 216 508 314
3 442 56 573
3 325 509 40
3 197 185 566
3 206 185 197
3 338 57 310
3 22 314 55
3 88 441 566
3 127 55 508
3 381 314 508
3 381 55 314
3 109 263 56
3 109 459 263
3 404 263 583
3 404 56 263
3 237 583 263
3 428 263 459
3 547 87 574
3 126 87 166
3 126 574 87
3 348 367 54
3 88 566 185
3 125 122 441
3 478 134 54
3 478 54 116
3 78 125 551
3 78 122 125
3 80 551 125
3 203 53 192
3 203 0 53
3 286 0 192
3 477 315 419
3 298 419 315
3 353 286 192
3 188 477 419
3 412 192 53
3 412 419 192
3 188 419 53
3 419 298 192
3 219 315 477
3 219 452 315
3 219 362 452
3 219 477 362
3 101 544 195
3 195 544 522
3 349 522 544
3 313 362 195
3 313 452 362
3 313 522 452
3 313 195 522
3 394 276 374
3 133 374 276
3 347 436 241
3 475 241 436
3 20 491 370
3 549 20 467
3 370 467 20
3 164 582 543
3 231 164 543
3 231 543 447
3 215 254 436
3 475 436 254
3 543 250 347
3 425 543 241
3 231 489 184
3 306 436 347
3 374 416 394
3 286 544 0
3 544 286 94
3 353 94 286
3 146 0 101
3 416 294 394
3 528 416 374
3 52 359 416
3 359 52 101
3 101 0 544
3 94 349 544
3 159 294 416
3 159 359 294
3 208 87 249
3 208 166 87
3 142 249 87
3 402 365 560
3 104 560 365
3 290 274 508
3 497 274 487
3 497 508 274
3 115 290 143
3 324 290 508
3 324 143 290
3 455 407 143
3 455 7 407
3 115 143 407
3 242 455 57
3 242 7 455
3 431 455 143
3 431 57 455
3 324 128 143
3 324 508 128
3 431 128 57
3 431 143 128
3 120 127 487
3 497 127 508
3 497 487 127
3 509 493 40
3 16 40 493
3 168 395 574
3 168 56 395
3 309 395 551
3 309 574 395
3 548 355 515
3 548 583 355
3 331 515 355
3 236 583 548
3 210 548 515
3 140 275 266
3 140 50 275
3 427 275 77
3 427 266 275
3 306 215 436
3 355 583 421
3 480 19 326
3 237 326 583
3 326 421 583
3 326 19 421
3 319 367 39
3 460 450 521
3 460 385 450
3 505 450 54
3 505 521 450
3 552 450 116
3 552 54 450
3 490 450 385
3 490 116 450
3 464 275 51
3 464 77 275
3 183 275 50
3 183 51 275
3 41 244 577
3 282 577 42
3 311 493 17
3 311 16 493
3 258 451 515
3 258 493 451
3 210 515 451
3 331 17 515
3 258 17 493
3 258 515 17
3 484 39 15
3 380 465 276
3 133 276 465
3 278 15 39
3 177 557 382
3 177 444 557
3 269 444 50
3 269 557 444
3 329 382 557
3 329 14 382
3 218 51 50
3 218 444 51
3 132 444 382
3 132 51 444
3 169 315 452
3 567 121 42
3 567 232 121
3 448 121 50
3 448 42 121
3 383 269 232
3 383 557 269
3 121 269 50
3 121 232 269
3 91 54 367
3 505 91 521
3 505 54 91
3 107 521 91
3 328 109 49
3 328 459 109
3 468 109 56
3 468 49 109
3 429 556 49
3 429 166 556
3 328 556 459
3 328 49 556
3 383 239 557
3 383 232 239
3 396 239 244
3 396 557 239
3 567 577 232
3 567 42 577
3 239 577 244
3 239 232 577
3 126 49 574
3 126 166 49
3 168 49 56
3 168 574 49
3 398 377 5
3 398 260 377
3 524 5 377
3 187 244 13
3 578 100 85
3 142 377 249
3 499 377 260
3 499 249 377
3 569 34 262
3 99 482 262
3 99 34 482
3 553 199 482
3 230 482 199
3 230 262 482
3 110 569 337
3 301 569 262
3 301 337 569
3 369 152 337
3 369 68 152
3 110 337 152
3 182 323 244
3 182 98 323
3 396 323 557
3 396 244 323
3 174 557 323
3 439 323 98
3 427 48 266
3 427 77 48
3 173 521 266
3 173 48 521
3 398 527 260
3 398 5 527
3 387 527 4
3 387 260 527
3 517 376 4
3 517 506 376
3 387 376 260
3 387 4 376
3 460 48 385
3 460 521 48
3 225 77 385
3 225 48 77
3 96 496 77
3 288 385 77
3 288 496 385
3 321 496 7
3 321 385 496
3 545 12 14
3 111 494 179
3 35 2 494
3 494 2 73
3 389 113 279
3 389 9 113
3 576 489 113
3 113 447 352
3 184 193 231
3 352 279 113
3 73 179 494
3 360 179 530
3 160 11 8
3 576 113 9
3 519 562 10
3 43 51 212
3 519 212 562
3 167 365 514
3 402 514 365
3 167 541 144
3 520 144 541
3 536 365 144
3 144 520 9
3 167 144 365
3 167 514 541
3 72 541 514
3 402 582 514
3 302 229 105
3 302 506 229
3 512 229 60
3 512 105 229
3 196 376 105
3 196 260 376
3 302 376 506
3 302 105 376
3 316 260 196
3 240 196 105
3 512 59 105
3 512 60 59
3 240 105 59
3 399 229 358
3 399 60 229
3 201 229 506
3 201 358 229
3 538 76 358
3 538 220 76
3 399 76 60
3 399 358 76
3 108 408 562
3 108 148 408
3 568 148 220
3 568 408 148
3 261 10 408
3 366 562 408
3 366 10 562
3 217 375 358
3 538 375 220
3 538 358 375
3 201 535 358
3 201 506 535
3 217 358 535
3 243 93 408
3 261 408 93
3 568 375 408
3 568 220 375
3 243 408 375
3 561 202 172
3 561 459 202
3 561 523 459
3 561 172 523
3 428 459 523
