OFF

102 200 0
0.044031 -0.330446 0.122615
-0.155870 -0.045745 0.320079
-0.149935 0.095337 0.313731
-0.103998 0.220353 0.267630
-0.025565 0.308571 0.190147
0.071692 0.344661 0.094260
0.170532 0.321036 -0.004237
0.176590 0.243647 -0.062653
0.324177 -0.015101 -0.155326
0.297551 -0.151351 -0.128871
0.233651 -0.260773 -0.065947
0.144341 -0.323812 0.023120
0.171089 0.302923 0.012752
0.223352 -0.015053 -0.150959
0.171868 -0.117251 -0.188654
0.144677 0.243658 0.039050
-0.154115 -0.075019 0.180125
-0.140528 -0.088890 0.252570
-0.162722 0.027965 0.188170
-0.140840 0.127025 0.166298
-0.124934 0.148440 0.236329
-0.092619 0.204100 0.117783
-0.025217 0.248595 0.052317
0.010882 0.291242 0.102440
0.048077 0.249176 -0.021128
0.115851 0.208075 -0.088230
0.165828 0.132041 -0.137633
0.189628 0.033749 -0.160964
0.183453 -0.068980 -0.153827
0.255997 -0.081798 -0.139707
0.146644 -0.160087 -0.118514
0.212760 -0.188814 -0.098225
0.088201 -0.221639 -0.059853
0.016280 -0.244536 0.011441
0.059628 -0.288015 0.054426
-0.263468 0.035037 0.195781
0.141878 -0.211076 -0.205825
-0.087549 -0.305621 0.022282
0.101499 0.271071 -0.166227
0.186197 0.091865 -0.249820
0.144110 -0.261118 -0.029320
-0.028982 -0.321893 -0.035728
0.128899 0.208786 -0.147220
0.094449 -0.261100 -0.158436
-0.245739 0.115284 0.178071
-0.259164 -0.016455 0.191758
0.096978 0.291927 0.016170
-0.065152 0.282439 0.228598
0.191284 -0.003462 -0.208403
-0.150638 0.032079 0.262021
0.106415 0.250001 -0.036030
-0.108776 0.176270 0.177056
0.160282 -0.165523 -0.223481
-0.035634 -0.275078 0.016862
0.080195 -0.252827 -0.008939
0.267976 -0.224621 -0.100399
-0.233371 -0.144593 0.166353
0.171209 0.187844 -0.100143
-0.023935 0.324599 -0.041624
-0.162787 0.037156 0.326577
0.065227 -0.291876 -0.129105
0.029479 0.270209 0.040656
-0.204231 0.071625 0.183121
-0.083437 0.323929 0.017705
-0.151625 -0.030463 0.220370
0.120547 -0.210593 -0.138475
0.150481 -0.205227 -0.079039
-0.252241 -0.099858 0.185155
0.057845 0.270398 -0.076901
-0.206639 -0.045737 0.185941
0.012712 0.324890 -0.078346
-0.168231 0.177216 0.147118
0.212461 0.094041 -0.140824
0.319170 -0.097843 -0.149612
0.198097 0.042719 -0.261486
0.189851 -0.092038 -0.252274
0.263252 0.038874 -0.148091
0.176012 0.111953 -0.193727
0.086445 -0.342250 0.080509
0.047590 -0.266042 -0.065614
-0.046754 0.243787 0.115829
-0.195623 0.227408 0.127938
0.186582 -0.310363 -0.018753
0.192939 -0.040673 -0.255842
-0.068291 0.238978 0.179341
0.225093 0.287954 -0.058251
-0.145739 0.079552 0.214160
-0.125156 -0.134503 0.194262
-0.104878 0.252891 0.084111
0.201321 -0.120942 -0.129111
-0.171513 0.265945 0.103680
0.141947 0.209497 -0.206210
0.028643 0.344319 0.137395
0.166935 0.171480 -0.230912
-0.174874 -0.154541 0.154437
-0.132319 0.175084 0.296124
0.067612 0.291621 -0.132675
-0.117138 0.301682 0.050438
0.130726 0.345176 0.035174
-0.234798 0.164814 0.167135
0.006979 -0.310444 -0.071375
-0.024576 0.286597 0.005347
3 59 87 1
3 59 95 87
3 95 47 87
3 47 4 87
3 4 0 87
3 0 37 87
3 37 94 87
3 37 56 94
3 37 99 56
3 37 81 99
3 0 53 37
3 0 33 53
3 0 34 33
3 38 96 93
3 96 70 93
3 70 58 93
3 58 63 93
3 63 97 93
3 97 90 93
3 90 81 93
3 81 39 93
3 81 74 39
3 81 83 74
3 81 75 83
3 81 36 75
3 81 43 36
3 81 60 43
3 81 100 60
3 81 41 100
3 81 37 41
3 99 67 56
3 99 35 67
3 99 44 35
3 35 45 67
3 4 78 0
3 4 11 78
3 4 82 11
3 4 10 82
3 4 55 10
3 4 9 55
3 4 73 9
3 4 8 73
3 4 15 8
3 4 92 15
3 93 91 38
3 15 72 8
3 15 26 72
3 36 52 75
3 92 98 15
3 95 3 47
3 59 2 95
3 92 5 98
3 87 17 1
3 72 76 8
3 98 12 15
3 98 6 12
3 6 85 12
3 15 57 26
3 15 7 57
3 94 16 87
3 26 27 72
3 55 31 10
3 98 46 6
3 92 23 5
3 59 49 2
3 78 34 0
3 95 20 3
3 47 84 4
3 82 40 11
3 73 29 9
3 13 76 27
3 14 28 75
3 80 84 22
3 19 86 49
3 53 33 37
3 26 39 77
3 68 24 96
3 30 43 65
3 83 48 27
3 12 7 15
3 42 25 91
3 97 88 21
3 33 54 40
3 26 57 7
3 85 7 12
3 44 62 18
3 101 22 58
3 16 45 69
3 100 79 32
3 20 21 51
3 23 24 61
3 30 89 29
3 17 18 64
3 50 46 25
3 31 32 66
3 81 71 19
3 41 37 33
3 60 100 32
3 79 33 32
3 79 100 33
3 41 33 100
3 32 33 40
3 54 34 40
3 54 33 34
3 11 40 34
3 78 11 34
3 36 43 30
3 65 32 30
3 65 43 32
3 60 32 43
3 30 32 31
3 66 40 31
3 66 32 40
3 10 31 40
3 82 10 40
3 75 52 14
3 14 30 28
3 14 52 30
3 36 30 52
3 28 30 29
3 89 31 29
3 89 30 31
3 9 29 31
3 55 9 31
3 74 83 27
3 48 28 27
3 48 83 28
3 75 28 83
3 27 28 13
3 13 29 76
3 13 28 29
3 8 76 29
3 73 8 29
3 93 39 26
3 77 27 26
3 77 39 27
3 74 27 39
3 72 27 76
3 38 91 25
3 42 26 25
3 42 91 26
3 93 26 91
3 25 26 7
3 70 96 24
3 68 25 24
3 68 96 25
3 38 25 96
3 24 25 46
3 50 7 46
3 50 25 7
3 6 46 7
3 85 6 7
3 63 58 22
3 101 24 22
3 101 58 24
3 70 24 58
3 22 24 23
3 61 46 23
3 61 24 46
3 5 23 46
3 98 5 46
3 90 97 21
3 88 22 21
3 88 97 22
3 63 22 97
3 21 22 84
3 80 23 84
3 80 22 23
3 4 84 23
3 92 4 23
3 99 81 19
3 71 21 19
3 71 81 21
3 90 21 81
3 19 21 20
3 51 84 20
3 51 21 84
3 3 20 84
3 47 3 84
3 35 44 18
3 62 19 18
3 62 44 19
3 99 19 44
3 18 19 49
3 86 20 49
3 86 19 20
3 2 49 20
3 95 2 20
3 67 45 16
3 69 18 16
3 69 45 18
3 35 18 45
3 16 18 17
3 64 49 17
3 64 18 49
3 1 17 49
3 59 1 49
3 94 56 16
3 67 16 56
3 87 16 17
