OFF

18 32 0
0.049737 -0.145536 0.000212
0.067338 -0.144998 0.000234
0.066015 -0.104768 0.076096
0.089262 -0.144098 0.057279
0.093689 -0.144039 0.038279
0.076191 -0.144882 -0.037767
0.066625 -0.124731 0.076177
0.080618 -0.144823 -0.056767
0.040884 -0.145653 0.038213
0.067234 -0.144694 0.076257
0.076087 -0.144577 0.038257
0.101828 -0.123656 0.076006
0.084940 -0.144461 0.000256
0.030812 -0.105843 0.076052
0.093793 -0.144344 -0.037745
0.054059 -0.145173 0.057235
0.058486 -0.145115 0.038235
0.031421 -0.125806 0.076133
3 13 8 17
3 13 0 8
3 13 7 0
3 13 2 7
3 7 5 0
3 7 14 5
3 8 15 17
3 15 9 17
3 5 1 0
3 9 6 17
3 2 14 7
3 2 11 14
3 11 4 14
3 11 3 4
3 4 12 14
3 11 9 3
3 2 6 11
3 3 10 4
3 8 9 15
3 3 9 10
3 4 10 12
3 5 14 12
3 10 1 12
3 10 9 1
3 5 12 1
3 16 8 0
3 16 9 8
3 16 1 9
3 16 0 1
3 6 2 17
3 2 13 17
3 11 6 9
