OFF

153 302 0
-0.022685 0.027100 -0.000832
-0.023963 -0.036969 -0.133452
-0.037330 0.042128 -0.134141
-0.022139 0.026033 -0.133950
-0.103063 -0.050339 -0.133670
-0.125488 0.008565 -0.134234
-0.122163 -0.024619 0.099021
-0.095318 -0.017040 0.132353
-0.085093 0.050390 -0.067839
-0.060744 -0.060036 -0.133418
-0.118254 -0.034243 -0.133861
-0.041152 -0.050027 0.132840
-0.121344 -0.026220 -0.100656
-0.098834 -0.051003 0.066046
-0.055846 -0.057534 -0.066854
-0.045504 -0.053596 -0.066843
-0.015357 0.007482 0.132485
-0.058071 0.052253 -0.001178
-0.074391 0.052199 -0.067809
-0.067095 -0.058276 0.066235
-0.083415 -0.058330 -0.000396
-0.124434 -0.018196 -0.067451
-0.120783 0.023053 0.098645
-0.118968 0.024244 -0.067768
-0.015997 -0.014641 0.132659
-0.085639 0.051457 0.065279
-0.042652 0.044926 -0.067621
-0.030136 -0.042399 -0.100152
-0.023232 0.028167 0.132287
-0.032558 -0.043498 -0.000306
-0.034979 -0.044597 0.099539
-0.120496 -0.028539 -0.067351
-0.066777 0.053293 0.098624
-0.104156 -0.048205 0.132567
-0.038423 0.044262 0.132095
-0.017989 -0.020223 0.066131
-0.095982 0.047519 0.065268
-0.063329 0.051879 -0.067761
-0.079649 0.051825 -0.134392
-0.015621 -0.006611 0.099314
-0.072353 -0.058649 -0.000348
-0.105177 0.041753 0.065277
-0.126788 -0.006428 0.065574
-0.088737 -0.055532 0.066124
-0.028792 0.033936 0.098935
-0.015244 0.001418 0.065969
-0.113226 0.034157 0.065305
-0.126026 -0.004996 -0.100845
-0.050088 0.048056 -0.100959
-0.099256 -0.006698 0.132254
-0.015564 -0.009644 0.066057
-0.053944 -0.055216 0.099547
-0.047974 0.047724 -0.001101
-0.126581 0.010699 0.132002
-0.061291 -0.058969 -0.000300
-0.077611 -0.059023 -0.066931
-0.045859 0.047392 0.098757
-0.115276 -0.036667 0.065864
-0.126676 -0.012492 -0.000941
-0.108896 -0.044036 -0.100462
-0.050948 -0.055031 -0.000289
-0.026756 0.031657 0.065680
-0.040606 -0.051094 -0.000278
-0.028807 -0.039167 0.066239
-0.107680 -0.044714 0.065960
-0.116430 0.028759 -0.134358
-0.034352 0.039705 0.065584
-0.098288 -0.052070 -0.067072
-0.047953 -0.054847 -0.100125
-0.126468 0.004634 0.065487
-0.080741 0.053959 0.131844
-0.122738 -0.022834 -0.000842
-0.057525 0.051186 -0.134296
-0.066549 -0.059343 -0.066883
-0.082869 -0.059396 -0.133514
-0.053295 0.050522 0.065420
-0.101426 0.046084 0.131822
-0.126355 -0.001430 -0.001028
-0.118801 -0.033176 -0.000743
-0.069178 -0.059529 -0.100175
-0.111205 -0.041224 -0.000647
-0.030281 0.035147 -0.000927
-0.036855 -0.046762 0.066267
-0.025056 -0.034835 0.132784
-0.103609 -0.049272 -0.000552
-0.037876 0.043195 -0.001023
-0.095435 0.046452 -0.067850
-0.086358 0.022056 0.132077
-0.124043 0.015214 0.065412
-0.117523 0.030893 0.131878
-0.122228 0.016404 -0.101001
-0.104631 0.040686 -0.067841
-0.094406 0.014461 0.132104
-0.126242 -0.007494 -0.067544
-0.071289 -0.001971 0.132331
-0.088190 -0.056599 -0.066994
-0.056393 -0.056467 0.066264
-0.112679 0.033090 -0.067813
-0.046050 -0.052529 0.066275
-0.064953 0.025674 0.132135
-0.077625 -0.029617 0.132527
-0.058617 0.053320 0.131940
-0.074937 0.053266 0.065309
-0.083961 -0.057263 0.132722
-0.124980 -0.017129 0.065668
-0.071489 0.051852 -0.101077
-0.126035 0.009632 -0.001116
-0.119514 0.025311 0.065350
-0.096446 -0.051868 0.099345
-0.126129 -0.013559 -0.134059
-0.114730 -0.037734 -0.067254
-0.026210 0.030590 -0.067438
-0.040060 -0.052160 -0.133397
-0.028260 -0.040234 -0.066879
-0.043198 0.045993 0.065497
-0.107134 -0.045781 -0.067158
-0.113514 -0.038412 0.099167
-0.033805 0.038638 -0.067534
-0.017053 0.012120 0.065876
-0.126685 0.002136 0.098788
-0.121042 -0.027472 0.065767
-0.066563 -0.029937 0.132574
-0.088361 0.050739 0.098556
-0.056221 -0.025999 0.132585
-0.063875 0.052946 0.065357
-0.080195 0.052892 -0.001274
-0.125922 0.003567 -0.067631
-0.020990 0.022462 0.065777
-0.093512 -0.053801 -0.000474
-0.121506 0.019729 -0.001178
-0.031770 0.036359 -0.100790
-0.090537 0.048955 -0.001285
-0.021522 -0.027529 0.099458
-0.075528 -0.057769 0.099479
-0.052749 0.049455 -0.067699
-0.043643 -0.008306 0.132495
-0.107326 0.040121 0.098563
-0.047260 0.013098 0.132309
-0.100880 0.045017 -0.001296
-0.022518 -0.030320 0.066194
-0.092713 0.047170 -0.101126
-0.018174 0.014972 0.099131
-0.090578 -0.055733 -0.100293
-0.069133 0.052572 -0.001226
-0.108928 0.037422 -0.001268
-0.061837 -0.057902 0.132818
-0.078157 -0.057956 0.066187
-0.036309 -0.047829 -0.066851
-0.024510 -0.035902 -0.000334
-0.127222 -0.011425 0.132177
-0.123497 0.014147 -0.067706
-0.116977 0.029826 -0.001240
-0.110531 0.034722 -0.101100
3 74 9 4
3 9 112 4
3 112 1 4
3 1 10 4
3 1 109 10
3 1 5 109
3 1 65 5
3 1 38 65
3 1 72 38
3 1 2 72
3 1 3 2
3 38 152 65
3 38 140 152
3 140 91 152
3 1 111 3
3 1 0 111
3 1 148 0
3 148 50 0
3 50 45 0
3 148 35 50
3 45 118 0
3 140 86 91
3 148 139 35
3 118 127 0
3 140 8 86
3 35 24 50
3 86 138 91
3 45 16 118
3 33 6 149
3 33 116 6
3 116 57 6
3 57 120 6
3 149 7 33
3 149 49 7
3 116 64 57
3 120 104 6
3 57 78 120
3 49 94 7
3 68 14 112
3 79 55 9
3 12 21 10
3 94 121 145
3 51 98 145
3 63 11 30
3 76 136 46
3 123 11 94
3 94 76 87
3 141 127 16
3 19 103 133
3 22 88 89
3 23 5 90
3 45 24 39
3 26 72 48
3 147 1 27
3 44 66 28
3 102 101 32
3 108 43 33
3 75 34 56
3 35 83 132
3 122 36 70
3 37 38 105
3 42 53 119
3 47 126 109
3 110 4 59
3 91 65 152
3 142 67 74
3 130 111 2
3 87 70 94
3 87 76 70
3 92 76 94
3 92 89 76
3 92 53 89
3 92 94 53
3 49 53 94
3 49 149 53
3 7 94 33
3 100 33 94
3 100 103 33
3 100 145 103
3 100 94 145
3 121 11 145
3 121 94 11
3 123 83 11
3 123 94 83
3 135 83 94
3 135 24 83
3 135 16 24
3 135 94 16
3 137 16 94
3 137 28 16
3 137 34 28
3 137 94 34
3 99 34 94
3 99 101 34
3 99 70 101
3 99 94 70
3 36 138 131
3 36 76 138
3 86 131 138
3 122 76 36
3 122 70 76
3 25 36 131
3 25 70 36
3 8 125 131
3 8 38 125
3 25 125 70
3 25 131 125
3 140 38 8
3 86 8 131
3 46 151 144
3 46 89 151
3 97 151 65
3 97 144 151
3 136 89 46
3 136 76 89
3 41 46 144
3 41 76 46
3 91 138 144
3 41 138 76
3 41 144 138
3 97 91 144
3 97 65 91
3 88 106 129
3 88 53 106
3 150 106 5
3 150 129 106
3 22 53 88
3 22 89 53
3 107 88 129
3 107 89 88
3 23 151 129
3 23 65 151
3 107 151 89
3 107 129 151
3 90 65 23
3 90 5 65
3 150 23 129
3 150 5 23
3 42 58 77
3 42 149 58
3 93 58 109
3 93 77 58
3 119 149 42
3 119 53 149
3 69 42 77
3 69 53 42
3 126 106 77
3 126 5 106
3 69 106 53
3 69 77 106
3 47 5 126
3 47 109 5
3 93 126 77
3 93 109 126
3 120 78 71
3 31 78 10
3 31 71 78
3 120 71 104
3 6 104 149
3 21 58 71
3 21 109 58
3 104 58 149
3 104 71 58
3 12 109 21
3 12 10 109
3 31 21 71
3 31 10 21
3 64 84 80
3 64 33 84
3 115 84 4
3 115 80 84
3 116 33 64
3 57 64 80
3 110 78 80
3 110 10 78
3 57 80 78
3 59 10 110
3 59 4 10
3 115 110 80
3 115 4 110
3 43 20 128
3 43 103 20
3 95 20 74
3 95 128 20
3 108 103 43
3 108 33 103
3 13 43 128
3 13 33 43
3 67 84 128
3 67 4 84
3 13 84 33
3 13 128 84
3 142 4 67
3 142 74 4
3 95 67 128
3 95 74 67
3 19 54 40
3 19 145 54
3 73 54 9
3 73 40 54
3 133 145 19
3 133 103 145
3 146 19 40
3 146 103 19
3 55 20 40
3 55 74 20
3 146 20 103
3 146 40 20
3 79 74 55
3 79 9 74
3 73 55 40
3 73 9 55
3 98 62 60
3 98 11 62
3 15 62 112
3 15 60 62
3 51 11 98
3 51 145 11
3 96 98 60
3 96 145 98
3 14 54 60
3 14 9 54
3 96 54 145
3 96 60 54
3 68 9 14
3 68 112 9
3 15 14 60
3 15 112 14
3 63 148 29
3 63 83 148
3 113 148 1
3 113 29 148
3 30 83 63
3 30 11 83
3 82 63 29
3 82 11 63
3 147 62 29
3 147 112 62
3 82 62 11
3 82 29 62
3 27 112 147
3 27 1 112
3 113 147 29
3 113 1 147
3 132 24 35
3 132 83 24
3 139 83 35
3 139 148 83
3 39 16 45
3 39 24 16
3 50 24 45
3 127 28 0
3 141 28 127
3 141 16 28
3 118 16 127
3 66 85 81
3 66 34 85
3 117 85 2
3 117 81 85
3 44 34 66
3 44 28 34
3 61 66 81
3 61 28 66
3 111 0 81
3 61 0 28
3 61 81 0
3 130 3 111
3 130 2 3
3 117 111 81
3 117 2 111
3 75 17 52
3 75 101 17
3 134 17 72
3 134 52 17
3 56 101 75
3 56 34 101
3 114 75 52
3 114 34 75
3 26 85 52
3 26 2 85
3 114 85 34
3 114 52 85
3 48 2 26
3 48 72 2
3 134 26 52
3 134 72 26
3 102 125 143
3 102 70 125
3 18 125 38
3 18 143 125
3 32 70 102
3 32 101 70
3 124 102 143
3 124 101 102
3 37 17 143
3 37 72 17
3 124 17 101
3 124 143 17
3 105 72 37
3 105 38 72
3 18 37 143
3 18 38 37
