OFF
1296 1463 0
-0.2824598832 0.0614004821 -0.0964164786
-0.2824007566 -0.0612059107 -0.0959821307
-0.2877153936 0.0620545319 0.0889221327
-0.2876562670 -0.0605518608 0.0893564806
-0.1693705845 -0.0836459881 0.0674307460
-0.1694519650 0.0851068060 0.0668329190
-0.1655522081 -0.0841211862 -0.0672265034
-0.1656335887 0.0846316079 -0.0678243304
0.4812810638 0.0004022742 -0.1076644171
0.4812810897 0.0003484462 -0.1076642264
0.4777013138 0.0009480369 0.0185754758
0.4777013397 0.0008942090 0.0185756665
0.3919599922 0.0132057275 -0.0258959712
0.3919772530 -0.0120412784 -0.0259858874
0.3928096216 0.0005642359 -0.0564575210
0.1122330714 -0.2541019874 -0.1346648731
0.0418814681 0.0507766173 0.0132879703
0.1873471789 -0.1358857398 -0.1329520964
0.1872159328 0.1362695275 -0.1339162392
-0.3197004269 -0.1038907611 -0.0041442044
-0.3198010186 0.1046989519 -0.0048831586
-0.1966036989 0.0131723427 0.1079615983
-0.1965918258 -0.0114481482 0.1080488194
-0.1904254556 0.0124034584 -0.1099177221
-0.1904135825 -0.0122170325 -0.1098305011
0.1476532838 -0.2103157164 -0.1337263131
0.1474502719 0.2106548873 -0.1352176520
0.1476583397 -0.2103163457 -0.1339046125
0.1474553278 0.2106542581 -0.1353959515
-0.1487203359 0.0000059040 -0.1403447791
0.3923244667 -0.0172783125 -0.0384962298
0.3923071972 0.0185320632 -0.0386230924
-0.2528212665 0.3405091126 -0.1470261055
-0.2524927860 -0.3406365523 -0.1446130651
-0.2528162106 0.3405084834 -0.1472044050
-0.2524877301 -0.3406371815 -0.1447913646
-0.3476509303 -0.0316021644 0.0621917219
-0.3476820147 0.0328552454 0.0619633737
-0.3438325539 -0.0320773625 -0.0724655275
-0.3438636383 0.0323800473 -0.0726938757
-0.1513783641 -0.1037926807 0.0006284341
-0.1514789559 0.1047970323 -0.0001105200
-0.1565033763 -0.0985660117 0.0358897037
-0.1565990451 0.0998153853 0.0351869137
-0.1544959420 -0.0988158375 -0.0349036280
-0.1545916108 0.0995655595 -0.0356064179
-0.1529310455 0.0235884452 -0.0926100882
-0.1529084612 -0.0232429434 -0.0924441824
-0.1581865559 0.0242424950 0.0927285231
-0.1581639716 -0.0225888936 0.0928944290
0.0408153234 -0.0502115435 0.0127461802
0.4362215432 0.0001935922 -0.1446462510
0.4306185054 0.0010481446 0.0529448807
0.3926716412 -0.0119509177 -0.0512222997
0.3926124188 0.0005701760 -0.0470076574
0.3926124056 0.0005976177 -0.0470077546
0.3926123928 0.0006240040 -0.0470078481
0.3956575387 0.0001331636 -0.1543943768
0.3895672725 0.0010620718 0.0603788675
-0.4180646071 -0.0976872526 0.1181459495
-0.4181941261 0.1708868716 0.1171944933
-0.4181595877 0.0992671755 0.1174482147
-0.4180300687 -0.1693069486 0.1183996708
-0.3552174288 0.0009329406 0.1494461424
-0.3194321067 -0.1008919261 0.1097037273
-0.1420420994 0.0000008405 -0.1426831872
-0.1420370435 0.0000002113 -0.1428614866
-0.1420395864 0.0000005277 -0.1427718094
-0.1422122783 0.3580990081 -0.1440404163
-0.1418668940 -0.3580990081 -0.1415031987
-0.3055457941 -0.0837253367 0.0635696060
-0.3056271746 0.0850274574 0.0629717789
-0.3017274177 -0.0842005348 -0.0710876434
-0.3018087982 0.0845522593 -0.0716854705
-0.1835231157 0.0614581320 -0.0936112050
-0.1834639891 -0.0611482607 -0.0931768572
-0.1887786261 0.0621121819 0.0917274063
-0.1887194995 -0.0604942109 0.0921617542
-0.4315346817 -0.2106532065 -0.1501487283
-0.4317376935 0.2103173973 -0.1516400673
-0.4315296258 -0.2106538357 -0.1503270278
-0.4317326376 0.2103167681 -0.1518183668
-0.3207214878 0.1010800519 0.1103249597
-0.0315914126 0.3406380222 -0.1407533085
-0.0312629322 -0.3405076427 -0.1383402681
-0.0315863567 0.3406373929 -0.1409316080
-0.0312578763 -0.3405082720 -0.1385185676
-0.3994425777 0.1600926941 0.1000577020
-0.3993130587 -0.1084814301 0.1010091582
-0.4712952106 -0.1362695275 -0.1516273789
-0.4714264566 0.1358857397 -0.1525915216
-0.2782228032 0.3293727133 -0.1477957930
-0.2779050492 -0.3295302849 -0.1454615499
-0.4444525330 -0.1334236111 0.1424627098
-0.4445820520 0.1351505131 0.1415112537
-0.0566981292 0.1617014952 0.0022337524
-0.0565427062 -0.1605876649 0.0033755005
-0.0423717403 -0.1582807814 0.1470339715
-0.0425012594 0.1102933428 0.1460825154
-0.0993952703 -0.0393049624 0.0018749068
-0.0994336933 0.0403699309 0.0015926489
-0.3995521480 -0.1589734460 0.1014299628
-0.3996816676 0.1096017336 0.1004785029
0.5000000000 0.0006327502 -0.0439627677
0.4999999868 0.0006601919 -0.0439628650
0.4999999740 0.0006865782 -0.0439629584
-0.3963122441 0.2541030428 -0.1508787457
-0.3960670209 -0.2543981714 -0.1490773190
0.0613336232 0.0010032779 0.1125968129
-0.1527612561 0.1019255747 -0.0781626432
-0.1169759101 0.0001007051 -0.1179059023
-0.0850492216 -0.1333900185 0.1030205408
-0.0851787406 0.1351841056 0.1020690847
-0.0426453845 -0.1077901212 0.1465982101
-0.0427749036 0.1607840030 0.1456467540
-0.0601158449 -0.0974776668 0.1285806000
-0.0602453640 0.1710964573 0.1276291439
-0.0602108256 0.0994767612 0.1278828652
-0.0600813066 -0.1690973629 0.1288343214
-0.0775517640 -0.1587849089 0.1108166058
-0.0776812836 0.1097902707 0.1098651459
-0.0351479304 -0.1331839558 0.1543943768
-0.0352774495 0.1353901684 0.1534429207
0.2159147462 0.0002094202 -0.1325336048
0.2159198021 0.0002087910 -0.1327119043
0.2159172592 0.0002091075 -0.1326222270
0.2852258926 0.0005076024 -0.0500525172
0.2852258794 0.0005350441 -0.0500526144
0.2852258667 0.0005614304 -0.0500527079
-0.3165866870 -0.0986592914 0.0313506684
-0.3166823558 0.0997221056 0.0306478785
-0.3145792526 -0.0989091172 -0.0394426633
-0.3146749215 0.0994722797 -0.0401454532
-0.3130143561 0.0234951654 -0.0971491235
-0.3129917718 -0.0233362232 -0.0969832176
-0.3182698665 0.0241492152 0.0881894879
-0.3182472822 -0.0226821733 0.0883553937
-0.1273146894 -0.0314737755 0.0684391812
-0.1273457738 0.0329836343 0.0682108330
-0.1234963130 -0.0319489736 -0.0662180682
-0.1235273974 0.0325084362 -0.0664464164
0.1123455043 0.2543994352 -0.1364561588
-0.0779549308 0.1602809312 0.1094294900
-0.0778254117 -0.1082931929 0.1103809461
0.4925660139 0.0004784600 -0.0850137129
0.4902517233 0.0008319082 -0.0034002615
0.3142052438 0.0008824140 0.0270748158
0.3185293292 0.0002229107 -0.1254140611
-0.2807647303 0.0131233024 0.1055752791
-0.2807528571 -0.0114971885 0.1056625001
-0.2745864870 0.0123544182 -0.1123040414
-0.2745746138 -0.0122660727 -0.1122168204
-0.1403148494 -0.1125603617 -0.0747488529
-0.4367830946 -0.1585117165 0.1355364165
-0.4369126137 0.1100624076 0.1345849604
0.3918230669 0.0006905746 -0.0206607200
-0.1153016149 0.0509671179 -0.1135398478
0.3926554659 0.0132950297 -0.0511334049
-0.1392444559 0.1146582866 -0.0744560078
-0.5000000000 -0.0002077399 -0.1528327995
-0.4999949441 -0.0002083691 -0.1530110989
-0.4999974870 -0.0002080526 -0.1529214217
0.3546073613 0.0001460360 -0.1469603564
0.3490043235 0.0010005884 0.0506307754
-0.2388377767 0.0008578885 0.1124182321
-0.2361662737 0.1437562147 0.0152626623
-0.2360281197 -0.1427236251 0.0162775516
-0.2374485837 -0.1036041219 0.0655707396
-0.2375491754 0.1049855911 0.0648317854
-0.2336302073 -0.1040793199 -0.0690865098
-0.2337307991 0.1045103931 -0.0698254640
-0.2365342673 -0.1220278184 0.0337031221
-0.2366525199 0.1231839117 0.0328344301
-0.2345268329 -0.1222776442 -0.0370902095
-0.2346450856 0.1229340859 -0.0379589016
-0.2329984782 0.0759005871 -0.0950651081
-0.2329253942 -0.0756483658 -0.0945282277
-0.2323415856 0.0000494356 -0.1166736988
-0.2355275223 -0.1284622118 -0.0016706641
-0.2356518609 0.1293695384 -0.0025840641
-0.2386595940 -0.0389998699 0.1069531632
-0.2386980170 0.0406750235 0.1066709053
-0.2382539886 0.0765546370 0.0902735033
-0.2381809045 -0.0749943159 0.0908103836
-0.2324813507 -0.0397687541 -0.1109261573
-0.2325197737 0.0399061392 -0.1112084152
0.0742340439 0.0007507259 0.0395511079
-0.3916433038 -0.1335695354 0.0940828739
-0.3917728229 0.1350045888 0.0931314177
0.0260025948 -0.1135434052 0.0800641720
-0.1163677601 -0.0500199874 -0.1140816415
-0.0061751785 0.3295312341 -0.1400820984
-0.0058574245 -0.3293717640 -0.1377478553
-0.2646698249 -0.0314062820 0.1061888129
-0.2647009093 0.0330511278 0.1059604648
-0.2584915816 -0.0321751663 -0.1116905076
-0.2585226660 0.0322822436 -0.1119188557
0.0270729883 0.1136752432 0.0803570172
-0.4365433718 -0.1080207557 0.1351156336
-0.4366728908 0.1605533684 0.1341641775
0.4668030958 0.0009713320 0.0314016069
-0.1071010984 0.0385415417 0.0368067226
-0.1070645561 -0.0372334625 0.0370751646
-0.1050936641 0.0382917158 -0.0339866091
-0.1050571218 -0.0374832884 -0.0337181670
0.3075245265 0.0003010271 -0.1125911459
0.3075245524 0.0002471991 -0.1125909552
0.3039447764 0.0008467898 0.0136487471
0.3039448024 0.0007929619 0.0136489378
-0.3661211765 0.0383906119 0.0294624138
-0.3660846342 -0.0373843923 0.0297308558
-0.3641137422 0.0381407861 -0.0413309179
-0.3640771999 -0.0376342181 -0.0410624758
-0.3717456894 -0.0394636597 -0.0058473733
-0.3717841124 0.0402112336 -0.0061296312
-0.0372085927 -0.0712413830 -0.0501436418
-0.0372776694 0.0719980092 -0.0506510845
-0.1745755052 0.0001116061 -0.1069879101
0.3565323558 0.0010463515 0.0541817425
0.3565323817 0.0009925235 0.0541819332
0.3623245288 0.0001629842 -0.1500792479
0.3623245548 0.0001091562 -0.1500790572
0.4710195679 0.0003117660 -0.1210903214
-0.2126556467 -0.0313759736 0.1076636337
-0.2126867311 0.0330814362 0.1074352855
-0.2064774034 -0.0321448579 -0.1102156868
-0.2065084878 0.0323125520 -0.1104440349
0.2949731177 0.0003633236 -0.0906163027
0.2926588271 0.0007167717 -0.0090028514
0.4229013119 0.0010850244 0.0560635816
0.4229013379 0.0010311964 0.0560637723
0.4286934850 0.0002016571 -0.1481974088
0.4286935109 0.0001478291 -0.1481972181
-0.1514729301 -0.1000464039 -0.0787839055
0.0369388364 0.0001048176 -0.1376970182
0.0226537962 -0.0679426060 -0.1378619529
0.1121430076 -0.0678904611 -0.1353245573
-0.0525503750 0.0000526727 -0.1402344138
0.1121430076 -0.0678904611 -0.1353245573
0.2016322190 -0.0678383162 -0.1327871617
0.1264280478 0.0001569625 -0.1351596226
-0.0149032575 -0.1270507298 -0.1387183413
-0.0739485055 -0.1646856181 -0.1402598324
-0.0103803410 -0.2282112469 -0.1382330983
-0.0784714219 -0.0635251011 -0.1407450753
-0.0103803410 -0.2282112469 -0.1382330983
0.0531878234 -0.2917368757 -0.1362063642
0.0486649069 -0.1905763586 -0.1366916072
-0.1419532402 -0.1790492402 -0.1421375041
-0.2099723178 -0.1647648786 -0.1441166797
-0.2099291447 -0.2542897625 -0.1437995270
-0.1419964133 -0.0895243562 -0.1424546567
-0.2099291447 -0.2542897625 -0.1437995270
-0.2098859716 -0.3438146465 -0.1434823743
-0.1419100671 -0.2685741241 -0.1418203514
-0.2690533037 -0.1271988218 -0.1459245642
-0.3066673985 -0.0681344999 -0.1471995941
-0.3701742571 -0.1317341747 -0.1487759715
-0.2055464450 -0.0635991471 -0.1443481868
-0.3701742571 -0.1317341747 -0.1487759715
-0.4336811157 -0.1953338495 -0.1503523489
-0.3325601623 -0.1907984966 -0.1475009416
-0.3210185367 -0.0001037624 -0.1478466155
-0.3067330215 0.0679431337 -0.1476816655
-0.3962224967 0.0678909886 -0.1502190686
-0.2315290615 -0.0000516174 -0.1453092125
-0.3962224967 0.0678909886 -0.1502190686
-0.4857119718 0.0678388436 -0.1527564716
-0.4105080118 -0.0001559075 -0.1503840186
-0.2691759152 0.1270517853 -0.1468252775
-0.2101311948 0.1646866205 -0.1452838012
-0.2736993592 0.2282122493 -0.1473105353
-0.2056077508 0.0635261565 -0.1447985435
-0.2736993592 0.2282122493 -0.1473105353
-0.3372675237 0.2917378781 -0.1493372693
-0.3327440797 0.1905774141 -0.1488520116
-0.1421259323 0.1790497679 -0.1434061129
-0.0741073825 0.1647658809 -0.1414269539
-0.0741505554 0.2542905010 -0.1417441056
-0.1420827594 0.0895251478 -0.1430889611
-0.0741505554 0.2542905010 -0.1417441056
-0.0741937284 0.3438151211 -0.1420612574
-0.1421691053 0.2685743880 -0.1437232646
-0.0148470410 0.1271999815 -0.1396139841
0.0225881732 0.0681350276 -0.1383440243
0.0861844459 0.1317347545 -0.1367651116
-0.0784433137 0.0636002546 -0.1411928967
0.0861844459 0.1317347545 -0.1367651116
0.1497807186 0.1953344814 -0.1351861990
0.0487492317 0.1907997084 -0.1380350714
0.0027040863 0.1053278639 -0.1389504196
0.0369363234 0.0001051303 -0.1376083960
0.1093094163 0.0527686420 -0.1357420122
0.0560067513 0.0790482530 -0.1373462159
0.1264255348 0.0001572753 -0.1350710004
-0.0696690065 0.0526643522 -0.1408168034
-0.0525528880 0.0000529854 -0.1401457916
-0.0163663416 0.0263847413 -0.1392125997
0.1093094163 0.0527686420 -0.1357420122
0.1816825091 0.1054321537 -0.1338756284
0.1283798441 0.1317117647 -0.1354798321
0.1626120812 0.0264890311 -0.1341378085
0.0750771791 0.1579913756 -0.1370840358
0.0560067513 0.0790482530 -0.1373462159
0.1283798441 0.1317117647 -0.1354798321
0.0027091422 0.1053272347 -0.1391287191
0.1093144722 0.0527680128 -0.1359203117
0.0750822350 0.1579907464 -0.1372623353
0.1283849000 0.1317111355 -0.1356581316
0.0560118072 0.0790476238 -0.1375245154
0.1816875650 0.1054315245 -0.1340539279
0.1626171371 0.0264884019 -0.1343161080
0.1283849000 0.1317111355 -0.1356581316
0.0369413793 0.0001045011 -0.1377866955
-0.0696639506 0.0526637230 -0.1409951029
-0.0163612857 0.0263841120 -0.1393908992
-0.0525478321 0.0000523562 -0.1403240911
0.1093144722 0.0527680128 -0.1359203117
0.1264305907 0.0001566461 -0.1352492999
0.0560118072 0.0790476238 -0.1375245154
-0.0868167560 0.1703194313 -0.1417182478
0.0027040863 0.1053278639 -0.1389504196
0.0303167580 0.1904871593 -0.1384679499
-0.0282499990 0.1804032953 -0.1400930989
0.0750771791 0.1579913756 -0.1370840358
-0.1144294277 0.0851601359 -0.1422007175
-0.0696690065 0.0526643522 -0.1408168034
-0.0558626707 0.0952439999 -0.1405755686
0.0303167580 0.1904871593 -0.1384679499
0.0579294296 0.2756464547 -0.1379854803
-0.0006373273 0.2655625907 -0.1396106292
0.0888835150 0.2005710233 -0.1368428010
-0.0592040843 0.2554787267 -0.1412357782
-0.0282499990 0.1804032953 -0.1400930989
-0.0006373273 0.2655625907 -0.1396106292
-0.0868117001 0.1703188021 -0.1418965473
0.0303218139 0.1904865301 -0.1386462494
-0.0591990284 0.2554780975 -0.1414140777
-0.0006322714 0.2655619615 -0.1397889287
-0.0282449431 0.1804026661 -0.1402713984
0.0579344856 0.2756458255 -0.1381637797
0.0888885709 0.2005703941 -0.1370211005
-0.0006322714 0.2655619615 -0.1397889287
0.0027091422 0.1053272347 -0.1391287191
-0.1144243718 0.0851595067 -0.1423790170
-0.0558576148 0.0952433707 -0.1407538680
-0.0696639506 0.0526637230 -0.1409951029
0.0303218139 0.1904865301 -0.1386462494
0.0750822350 0.1579907464 -0.1372623353
-0.0282449431 0.1804026661 -0.1402713984
-0.0868167560 0.1703194313 -0.1417182478
-0.1698190112 0.2554142720 -0.1443721767
-0.0592040843 0.2554787267 -0.1412357782
-0.1007052119 0.2980261471 -0.1425627426
-0.1283178836 0.2128668516 -0.1430452123
-0.1422063396 0.3405735674 -0.1438897070
-0.2113201388 0.2979616923 -0.1456991411
-0.1007052119 0.2980261471 -0.1425627426
-0.1974316829 0.1702549765 -0.1448546463
-0.1697368911 0.0851279085 -0.1437689168
-0.1144294277 0.0851601359 -0.1422007175
-0.1282768236 0.1277236699 -0.1427435823
-0.1698190112 0.2554142720 -0.1443721767
-0.2251264747 0.2553820446 -0.1459403759
-0.1283178836 0.2128668516 -0.1430452123
-0.1974266270 0.1702543473 -0.1450329458
-0.1145064919 0.2554458701 -0.1429822769
-0.2251214188 0.2553814153 -0.1461186754
-0.1836613512 0.2979771768 -0.1450933409
-0.1559665594 0.2128501087 -0.1440076114
-0.1422012836 0.3405729382 -0.1440680065
-0.0730464243 0.2980416315 -0.1419569424
-0.1836613512 0.2979771768 -0.1450933409
-0.0868117001 0.1703188021 -0.1418965473
-0.1144243718 0.0851595067 -0.1423790170
-0.1697318352 0.0851272793 -0.1439472162
-0.1559254994 0.1277069270 -0.1437059814
-0.1145064919 0.2554458701 -0.1429822769
-0.0591990284 0.2554780975 -0.1414140777
-0.1559665594 0.2128501087 -0.1440076114
-0.2868898964 0.1051591189 -0.1471616272
-0.1974316829 0.1702549765 -0.1448546463
-0.2698555814 0.2228341157 -0.1470938664
-0.2783727389 0.1639966173 -0.1471277468
-0.2251264747 0.2553820446 -0.1459403759
-0.2144659979 0.0525799797 -0.1449224072
-0.1697368911 0.0851279085 -0.1437689168
-0.2059488404 0.1114174781 -0.1448885268
-0.2698555814 0.2228341157 -0.1470938664
-0.3422794800 0.2754132549 -0.1493330864
-0.3507966375 0.2165757565 -0.1493669668
-0.2613384240 0.2816716142 -0.1470599859
-0.3593137950 0.1577382581 -0.1494008473
-0.2783727389 0.1639966173 -0.1471277468
-0.3507966375 0.2165757565 -0.1493669668
-0.2868848405 0.1051584897 -0.1473399267
-0.2698505255 0.2228334865 -0.1472721658
-0.3593087391 0.1577376289 -0.1495791467
-0.3507915816 0.2165751273 -0.1495452663
-0.2783676830 0.1639959881 -0.1473060463
-0.3422744241 0.2754126257 -0.1495113859
-0.2613333680 0.2816709849 -0.1472382854
-0.3507915816 0.2165751273 -0.1495452663
-0.1974266270 0.1702543473 -0.1450329458
-0.2144609420 0.0525793505 -0.1451007067
-0.2059437845 0.1114168489 -0.1450668262
-0.1697318352 0.0851272793 -0.1439472162
-0.2698505255 0.2228334865 -0.1472721658
-0.2251214188 0.2553814153 -0.1461186754
-0.2783676830 0.1639959881 -0.1473060463
-0.3210210497 -0.0001034497 -0.1477579933
-0.2868898964 0.1051591189 -0.1471616272
-0.3763793716 0.1051069738 -0.1496990303
-0.3487002106 0.0525017620 -0.1487285118
-0.3593137950 0.1577382581 -0.1494008473
-0.2315315745 -0.0000513046 -0.1452205902
-0.2144659979 0.0525799797 -0.1449224072
-0.2592107355 0.0525539071 -0.1461911087
-0.3763793716 0.1051069738 -0.1496990303
-0.4658688468 0.1050548287 -0.1522364334
-0.4381896858 0.0524496170 -0.1512659149
-0.4040585326 0.1577121855 -0.1506695488
-0.4105105248 -0.0001555948 -0.1502953964
-0.3487002106 0.0525017620 -0.1487285118
-0.4381896858 0.0524496170 -0.1512659149
-0.3210159938 -0.0001040789 -0.1479362928
-0.3763743157 0.1051063446 -0.1498773298
-0.4105054689 -0.0001562240 -0.1504736959
-0.4381846299 0.0524489877 -0.1514442144
-0.3486951547 0.0525011328 -0.1489068113
-0.4658637908 0.1050541995 -0.1524147328
-0.4040534766 0.1577115563 -0.1508478483
-0.4381846299 0.0524489877 -0.1514442144
-0.2868848405 0.1051584897 -0.1473399267
-0.2315265186 -0.0000519338 -0.1453988897
-0.2592056796 0.0525532779 -0.1463694082
-0.2144609420 0.0525793505 -0.1451007067
-0.3763743157 0.1051063446 -0.1498773298
-0.3593087391 0.1577376289 -0.1495791467
-0.3486951547 0.0525011328 -0.1489068113
-0.3210210497 -0.0001034497 -0.1477579933
-0.3762778657 -0.1053783281 -0.1489533608
-0.4105105248 -0.0001555948 -0.1502953964
-0.4381389328 -0.0527930340 -0.1508930801
-0.3486494577 -0.0527408889 -0.1483556771
-0.4657673408 -0.1054304732 -0.1514907639
-0.4039062737 -0.1580157673 -0.1495510446
-0.4381389328 -0.0527930340 -0.1508930801
-0.2867883905 -0.1053261830 -0.1464159577
-0.2315315745 -0.0000513046 -0.1452205902
-0.2591599825 -0.0526887438 -0.1458182740
-0.2144152450 -0.0526626713 -0.1445495725
-0.3762778657 -0.1053783281 -0.1489533608
-0.3591615361 -0.1579896947 -0.1482823430
-0.3486494577 -0.0527408889 -0.1483556771
-0.3210159938 -0.0001040789 -0.1479362928
-0.2867833346 -0.1053268122 -0.1465942572
-0.3762728098 -0.1053789573 -0.1491316603
-0.3486444018 -0.0527415181 -0.1485339765
-0.3591564802 -0.1579903240 -0.1484606425
-0.2315265186 -0.0000519338 -0.1453988897
-0.2144101890 -0.0526633005 -0.1447278719
-0.2591549266 -0.0526893730 -0.1459965735
-0.3762728098 -0.1053789573 -0.1491316603
-0.4657622849 -0.1054311024 -0.1516690634
-0.4381338769 -0.0527936632 -0.1510713796
-0.4039012178 -0.1580163965 -0.1497293440
-0.4105054689 -0.0001562240 -0.1504736959
-0.3486444018 -0.0527415181 -0.1485339765
-0.4381338769 -0.0527936632 -0.1510713796
-0.1972674427 -0.1703178559 -0.1436481261
-0.2867883905 -0.1053261830 -0.1464159577
-0.3144010622 -0.1904855312 -0.1468984272
-0.2558342524 -0.1804016936 -0.1452732767
-0.3591615361 -0.1579896947 -0.1482823430
-0.1696547710 -0.0851585077 -0.1431656567
-0.2144152450 -0.0526626713 -0.1445495725
-0.2282215808 -0.0952423454 -0.1447908072
-0.3144010622 -0.1904855312 -0.1468984272
-0.3420137339 -0.2756448794 -0.1473808967
-0.2834469241 -0.2655610418 -0.1457557462
-0.3729678719 -0.2005693688 -0.1485235778
-0.2248801143 -0.2554772041 -0.1441305956
-0.2558342524 -0.1804016936 -0.1452732767
-0.2834469241 -0.2655610418 -0.1457557462
-0.1972623868 -0.1703184851 -0.1438264256
-0.3143960063 -0.1904861604 -0.1470767267
-0.2248750584 -0.2554778333 -0.1443088951
-0.2834418682 -0.2655616710 -0.1459340456
-0.2558291965 -0.1804023228 -0.1454515762
-0.3420086779 -0.2756455086 -0.1475591962
-0.3729628160 -0.2005699981 -0.1487018772
-0.2834418682 -0.2655616710 -0.1459340456
-0.2867833346 -0.1053268122 -0.1465942572
-0.1696497151 -0.0851591369 -0.1433439561
-0.2282165249 -0.0952429746 -0.1449691067
-0.2144101890 -0.0526633005 -0.1447278719
-0.3143960063 -0.1904861604 -0.1470767267
-0.3591564802 -0.1579903240 -0.1484606425
-0.2558291965 -0.1804023228 -0.1454515762
-0.1972674427 -0.1703178559 -0.1436481261
-0.1142651874 -0.2554127493 -0.1409941971
-0.2248801143 -0.2554772041 -0.1441305956
-0.1833789867 -0.2980246508 -0.1428036311
-0.1557663151 -0.2128653026 -0.1423211616
-0.1418778591 -0.3405720975 -0.1414766666
-0.0727640598 -0.2979601960 -0.1396672326
-0.1833789867 -0.2980246508 -0.1428036311
-0.0866525158 -0.1702534011 -0.1405117276
-0.1143473076 -0.0851262803 -0.1415974574
-0.1696547710 -0.0851585077 -0.1431656567
-0.1558073751 -0.1277220681 -0.1426227918
-0.1142651874 -0.2554127493 -0.1409941971
-0.0589577240 -0.2553805219 -0.1394259979
-0.1557663151 -0.2128653026 -0.1423211616
-0.0866474599 -0.1702540303 -0.1406900271
-0.1695675950 -0.2554456059 -0.1427406958
-0.0589526681 -0.2553811511 -0.1396042973
-0.1004127356 -0.2979769389 -0.1406296317
-0.1281075274 -0.2128498181 -0.1417153615
-0.1418728032 -0.3405727267 -0.1416549661
-0.2110276625 -0.2980413937 -0.1437660302
-0.1004127356 -0.2979769389 -0.1406296317
-0.1972623868 -0.1703184851 -0.1438264256
-0.1696497151 -0.0851591369 -0.1433439561
-0.1143422517 -0.0851269095 -0.1417757569
-0.1281485875 -0.1277065836 -0.1420169916
-0.1695675950 -0.2554456059 -0.1427406958
-0.2248750584 -0.2554778333 -0.1443088951
-0.1281075274 -0.2128498181 -0.1417153615
-0.0866525158 -0.1702534011 -0.1405117276
0.0305003840 -0.1902845588 -0.1371190203
-0.0589577240 -0.2553805219 -0.1394259979
-0.0003812741 -0.2653961008 -0.1377296442
-0.0280760659 -0.1802689800 -0.1388153740
0.0581951758 -0.2754116796 -0.1360332906
0.0890768339 -0.2003001376 -0.1354226667
-0.0003812741 -0.2653961008 -0.1377296442
0.0028055922 -0.1051574380 -0.1382047501
-0.1143473076 -0.0851262803 -0.1415974574
-0.0557708577 -0.0951418592 -0.1399011038
-0.0696182536 -0.0525782988 -0.1404439686
0.0305003840 -0.1902845588 -0.1371190203
0.0752294380 -0.1577365772 -0.1359655316
-0.0280760659 -0.1802689800 -0.1388153740
-0.0866474599 -0.1702540303 -0.1406900271
0.0028106481 -0.1051580672 -0.1383830496
0.0305054399 -0.1902851880 -0.1372973198
-0.0280710100 -0.1802696092 -0.1389936735
0.0752344939 -0.1577372064 -0.1361438311
-0.1143422517 -0.0851269095 -0.1417757569
-0.0696131977 -0.0525789280 -0.1406222681
-0.0557658018 -0.0951424884 -0.1400794032
0.0305054399 -0.1902851880 -0.1372973198
0.0582002317 -0.2754123088 -0.1362115901
-0.0003762182 -0.2653967300 -0.1379079437
0.0890818898 -0.2003007668 -0.1356009662
-0.0589526681 -0.2553811511 -0.1396042973
-0.0280710100 -0.1802696092 -0.1389936735
-0.0003762182 -0.2653967300 -0.1379079437
0.0028055922 -0.1051574380 -0.1382047501
0.1093601692 -0.0524740089 -0.1353691775
0.0752294380 -0.1577365772 -0.1359655316
0.1285067265 -0.1313948627 -0.1345477453
0.0560828807 -0.0788157234 -0.1367869638
0.1817840150 -0.1050531481 -0.1331299589
0.1626374577 -0.0261322943 -0.1339513911
0.1285067265 -0.1313948627 -0.1345477453
0.0369363234 0.0001051303 -0.1376083960
-0.0696182536 -0.0525782988 -0.1404439686
-0.0163409651 -0.0262365842 -0.1390261823
-0.0525528880 0.0000529854 -0.1401457916
0.1093601692 -0.0524740089 -0.1353691775
0.1264255348 0.0001572753 -0.1350710004
0.0560828807 -0.0788157234 -0.1367869638
0.0028106481 -0.1051580672 -0.1383830496
0.0369413793 0.0001045011 -0.1377866955
0.1093652251 -0.0524746381 -0.1355474769
0.0560879366 -0.0788163527 -0.1369652633
0.1264305907 0.0001566461 -0.1352492999
-0.0696131977 -0.0525789280 -0.1406222681
-0.0525478321 0.0000523562 -0.1403240911
-0.0163359092 -0.0262372134 -0.1392044818
0.1093652251 -0.0524746381 -0.1355474769
0.1817890709 -0.1050537773 -0.1333082584
0.1285117824 -0.1313954919 -0.1347260447
0.1626425136 -0.0261329236 -0.1341296906
0.0752344939 -0.1577372064 -0.1361438311
0.0560879366 -0.0788163527 -0.1369652633
0.1285117824 -0.1313954919 -0.1347260447
-0.2399297508 0.1352703407 0.1474770872
-0.2435416557 0.1227219279 0.1437968845
-0.2359751702 0.1479717684 0.1438035491
-0.2399297508 0.1352703407 0.1474770872
-0.2398002317 -0.1333037834 0.1484285433
-0.2434121366 -0.1458521962 0.1447483406
-0.2358456511 -0.1206023557 0.1447550052
-0.2398002317 -0.1333037834 0.1484285433
0.1220446428 0.0002850699 -0.0984011501
0.1382209308 -0.0247278757 -0.0852695813
-0.0133378465 0.0001454870 -0.1193729646
0.1381519406 -0.0309854525 -0.0826519706
0.1777315243 -0.0415961503 -0.0506829707
0.0108920903 -0.0405027200 -0.0983668061
0.1775579370 -0.0442598478 -0.0443199358
0.2165698950 -0.0337449280 -0.0128750248
0.0701746722 -0.0577506154 -0.0472317888
0.2163962882 -0.0311264109 -0.0066198536
0.2331056485 -0.0056452762 0.0067826102
0.1286058058 -0.0406689772 0.0030631633
0.2168522675 0.0257335959 -0.0036863748
0.1293668678 0.0382551066 0.0048007977
0.2330285554 0.0007206502 0.0094451940
0.1773411614 0.0426018683 -0.0382735279
0.0700317460 0.0572999388 -0.0444623062
0.2169207301 0.0319911724 -0.0063040005
0.1385027912 0.0347495906 -0.0760814701
0.0116005881 0.0428583542 -0.0948106589
0.1775147639 0.0452650362 -0.0446370885
0.1219675650 0.0066504668 -0.0957390920
-0.0133763855 0.0033281854 -0.1180419356
0.1386769255 0.0321310738 -0.0823366263
-0.0864552332 -0.1053038261 -0.0553530705
-0.0056029989 -0.0923923941 0.0149602651
-0.0056029989 -0.0923923941 0.0149602651
0.0436681090 -0.0562700637 0.0963304925
-0.0074083306 0.1062390562 0.0077608614
-0.0074083306 0.1062390562 0.0077608614
-0.0979712926 0.1381798909 -0.0361111277
-0.1462854130 -0.1516556450 0.0098265261
-0.1879874065 -0.1307397955 0.0565396139
-0.1467147559 -0.1072176657 0.0948839497
-0.1879874065 -0.1307397955 0.0565396139
-0.0603560806 -0.1103805354 0.0874740608
-0.1646074170 -0.0563052323 0.1147551572
-0.2599124229 -0.0276861459 0.1321006498
-0.3373247677 -0.0499794928 0.1295749349
-0.2420197618 -0.0785985792 0.1122294423
-0.1467147559 -0.1072176657 0.0948839497
-0.0693024111 -0.0849243188 0.0974096646
-0.2330734313 -0.1040547959 0.1022938385
-0.1469419028 0.0009681092 0.1310214777
-0.1646074170 -0.0563052323 0.1147551572
-0.0604696540 -0.0562876480 0.1055428248
-0.2510796658 0.0009505249 0.1402338100
-0.0604696540 -0.0562876480 0.1055428248
0.0004319846 -0.0276421850 0.1090698189
-0.0428041398 0.0009856936 0.1218091453
-0.1469419028 0.0009681092 0.1310214777
-0.1296939323 0.0510416649 0.1114608863
-0.2338316953 0.0510240806 0.1206732187
-0.0428041398 0.0009856936 0.1218091453
-0.2510796658 0.0009505249 0.1402338100
-0.2338316953 0.0510240806 0.1206732187
-0.2859005768 0.0510152884 0.1252793849
-0.1296939323 0.0510416649 0.1114608863
-0.0341801546 0.0260224714 0.1120288496
0.0442033057 0.0573392605 0.0964769151
-0.0513104720 0.0823584540 0.0959089518
-0.1468242498 0.1073776475 0.0953409885
-0.2252077100 0.0760608584 0.1108929230
-0.0598756308 0.1105264453 0.0878490028
-0.1468242498 0.1073776475 0.0953409885
-0.1045466427 0.1287157289 0.0478098398
-0.2337728688 0.1042288497 0.1028329741
-0.1045466427 0.1287157289 0.0478098398
-0.0387368272 0.1211954860 0.0640834285
-0.1464322015 0.1527288549 0.0087482074
-0.1464322015 0.1527288549 0.0087482074
-0.1047296927 0.1318135350 -0.0379644454
-0.1944637649 0.1228408947 -0.0314499904
-0.1765020149 -0.0713114600 -0.0508141754
-0.2182040084 -0.0503956105 -0.0041010875
-0.1765020149 -0.0713114600 -0.0508141754
-0.2688180575 -0.0756437683 0.0528013199
-0.2360966694 0.0005168228 0.0157701200
-0.2182040084 -0.0503956105 -0.0041010875
-0.2777643881 -0.0501875516 0.0627369237
-0.1765362898 0.0003087639 -0.0510678911
-0.2956570491 0.0007248817 0.0826081312
-0.2777643881 -0.0501875516 0.0627369237
-0.3373247677 -0.0499794928 0.1295749349
-0.2360966694 0.0005168228 0.0157701200
-0.2956570491 0.0007248817 0.0826081312
-0.2188486990 0.0505903785 -0.0037904713
-0.2188486990 0.0505903785 -0.0037904713
-0.2697850934 0.0758352152 0.0532672442
-0.1765710919 0.0719284599 -0.0513216200
-0.1765710919 0.0719284599 -0.0513216200
0.0745409220 -0.0338928218 -0.1365107878
0.1050004876 -0.1019141729 -0.1354070247
-0.0596928951 -0.0339710392 -0.1403168812
-0.0149482894 -0.0339449667 -0.1390481834
0.1640301334 -0.0338406768 -0.1339733922
0.1497450933 -0.1018881004 -0.1341383269
0.0745409220 -0.0338928218 -0.1365107878
0.1640301334 -0.0338406768 -0.1339733922
-0.0126417993 -0.1776309884 -0.1384757198
-0.0399029650 -0.2470286911 -0.1390038439
-0.1079940459 -0.0823425452 -0.1415158209
-0.0762099637 -0.1141053596 -0.1405024539
0.0509263652 -0.2411566171 -0.1364489857
-0.0081188828 -0.2787915055 -0.1379904768
-0.0126417993 -0.1776309884 -0.1384757198
0.0509263652 -0.2411566171 -0.1364489857
-0.1759411924 -0.2166695014 -0.1429685155
-0.2439386835 -0.2471475817 -0.1447891148
-0.1760059521 -0.0823821754 -0.1434442445
-0.1759843655 -0.1271446174 -0.1432856682
-0.1758980193 -0.3061943853 -0.1426513629
-0.2439170969 -0.2919100237 -0.1446305384
-0.1759411924 -0.2166695014 -0.1429685155
-0.1758980193 -0.3061943853 -0.1426513629
-0.3196137804 -0.1294664983 -0.1473502679
-0.3889813045 -0.1022020137 -0.1494134865
-0.2243534924 -0.0340669861 -0.1449857018
-0.2561069217 -0.0658668235 -0.1457738905
-0.3831206390 -0.1930661730 -0.1489266453
-0.4207347338 -0.1340018511 -0.1502016752
-0.3196137804 -0.1294664983 -0.1473502679
-0.3831206390 -0.1930661730 -0.1489266453
-0.3586205167 0.0338936131 -0.1490328421
-0.3890797391 0.1019144367 -0.1501365936
-0.2243863039 0.0339718307 -0.1452267375
-0.2691310415 0.0339457582 -0.1464954390
-0.4481099918 0.0338414680 -0.1515702451
-0.4338244766 0.1018883642 -0.1514052951
-0.3586205167 0.0338936131 -0.1490328421
-0.4481099918 0.0338414680 -0.1515702451
-0.2714376372 0.1776320173 -0.1470679064
-0.2441769990 0.2470296669 -0.1465397971
-0.1760853906 0.0823435741 -0.1440278053
-0.2078694728 0.1141063885 -0.1450411723
-0.3350058017 0.2411576461 -0.1490946405
-0.2759610812 0.2787924813 -0.1475531641
-0.2714376372 0.1776320173 -0.1470679064
-0.3350058017 0.2411576461 -0.1490946405
-0.1081382439 0.2166701345 -0.1425751093
-0.0401412805 0.2471485575 -0.1407545262
-0.1080734844 0.0823832043 -0.1420993817
-0.1080950709 0.1271455144 -0.1422579575
-0.1081814169 0.3061947546 -0.1428922610
-0.0401628670 0.2919108676 -0.1409131020
-0.1081382439 0.2166701345 -0.1425751093
-0.1081814169 0.3061947546 -0.1428922610
0.0356687024 0.1294673680 -0.1381895479
0.1049020530 0.1022022775 -0.1361301317
-0.0597257066 0.0340677777 -0.1405579168
-0.0279275702 0.0658676411 -0.1397684605
0.0992649751 0.1930670949 -0.1366106352
0.1367001894 0.1340021410 -0.1353406754
0.0356687024 0.1294673680 -0.1381895479
0.0992649751 0.1930670949 -0.1366106352
0.0198202049 0.0527164971 -0.1382794078
0.0731228698 0.0264368862 -0.1366752041
0.1626120812 0.0264890311 -0.1341378085
0.0731228698 0.0264368862 -0.1366752041
-0.0163663416 0.0263847413 -0.1392125997
-0.1058555530 0.0263325963 -0.1417499953
0.0198202049 0.0527164971 -0.1382794078
-0.0334824601 0.0789961080 -0.1398836115
0.1454959627 0.0791003979 -0.1348088203
0.1645663905 0.1580435205 -0.1345466402
0.1987986276 0.0528207870 -0.1332046166
0.1454959627 0.0791003979 -0.1348088203
0.0921932977 0.1053800088 -0.1364130240
0.0388906327 0.1316596197 -0.1380172277
0.1112637255 0.1843231314 -0.1361508439
0.0921932977 0.1053800088 -0.1364130240
0.0921983536 0.1053793796 -0.1365913235
0.1112687814 0.1843225022 -0.1363291434
0.0388956886 0.1316589905 -0.1381955272
0.0921983536 0.1053793796 -0.1365913235
0.1455010186 0.0790997687 -0.1349871198
0.1988036836 0.0528201578 -0.1333829161
0.1645714464 0.1580428913 -0.1347249397
0.1455010186 0.0790997687 -0.1349871198
-0.0334774042 0.0789954788 -0.1400619110
0.0198252608 0.0527158679 -0.1384577073
-0.1058504971 0.0263319671 -0.1419282948
-0.0163612857 0.0263841120 -0.1393908992
0.0731279257 0.0264362570 -0.1368535036
0.1626171371 0.0264884019 -0.1343161080
0.0731279257 0.0264362570 -0.1368535036
0.0198252608 0.0527158679 -0.1384577073
-0.0420563349 0.1378236476 -0.1403343337
0.0165104221 0.1479075116 -0.1387091848
0.0888835150 0.2005710233 -0.1368428010
0.0165104221 0.1479075116 -0.1387091848
-0.0558626707 0.0952439999 -0.1405755686
-0.1282357635 0.0425804882 -0.1424419523
-0.0420563349 0.1378236476 -0.1403343337
-0.1006230918 0.1277397836 -0.1419594827
0.0441230938 0.2330668070 -0.1382267151
0.0131690085 0.3081422384 -0.1393693944
0.1026898508 0.2431506710 -0.1366015661
0.0441230938 0.2330668070 -0.1382267151
-0.0144436632 0.2229829430 -0.1398518641
-0.0730104202 0.2128990790 -0.1414770130
-0.0453977485 0.2980583744 -0.1409945433
-0.0144436632 0.2229829430 -0.1398518641
-0.0144386073 0.2229823138 -0.1400301635
-0.0453926926 0.2980577452 -0.1411728428
-0.0730053643 0.2128984498 -0.1416553125
-0.0144386073 0.2229823138 -0.1400301635
0.0441281497 0.2330661778 -0.1384050146
0.1026949067 0.2431500418 -0.1367798656
0.0131740644 0.3081416092 -0.1395476939
0.0441281497 0.2330661778 -0.1384050146
-0.1006180359 0.1277391544 -0.1421377822
-0.0420512790 0.1378230184 -0.1405126332
-0.1282307076 0.0425798590 -0.1426202518
-0.0558576148 0.0952433707 -0.1407538680
0.0165154780 0.1479068824 -0.1388874842
0.0888885709 0.2005703941 -0.1370211005
0.0165154780 0.1479068824 -0.1388874842
-0.0420512790 0.1378230184 -0.1405126332
-0.1145115478 0.2554464993 -0.1428039774
-0.0453977485 0.2980583744 -0.1409945433
-0.0730104202 0.2128990790 -0.1414770130
-0.1145115478 0.2554464993 -0.1428039774
-0.1560126754 0.2979939197 -0.1441309418
-0.1975138030 0.3405413400 -0.1454579063
-0.0868988761 0.3406057948 -0.1423215078
-0.1560126754 0.2979939197 -0.1441309418
-0.1282768236 0.1277236699 -0.1427435823
-0.1282357635 0.0425804882 -0.1424419523
-0.1421242195 0.1702872039 -0.1432864471
-0.1835842870 0.1276914425 -0.1443117815
-0.2112790788 0.2128185105 -0.1453975111
-0.2113201388 0.2979616923 -0.1456991411
-0.1836253471 0.2128346242 -0.1446134115
-0.1421242195 0.1702872039 -0.1432864471
-0.1698139553 0.2554136427 -0.1445504761
-0.2389688147 0.2979449494 -0.1466615402
-0.2112740229 0.2128178813 -0.1455758106
-0.1698139553 0.2554136427 -0.1445504761
-0.1283538878 0.2980094041 -0.1435251417
-0.0868938202 0.3406051656 -0.1424998072
-0.1975087471 0.3405407108 -0.1456362057
-0.1283538878 0.2980094041 -0.1435251417
-0.1559254994 0.1277069270 -0.1437059814
-0.1558844394 0.0425637453 -0.1434043514
-0.1421191636 0.1702865747 -0.1434647466
-0.1006180359 0.1277391544 -0.1421377822
-0.0730053643 0.2128984498 -0.1416553125
-0.0730464243 0.2980416315 -0.1419569424
-0.1006590960 0.2128823361 -0.1424394121
-0.1421191636 0.1702865747 -0.1434647466
-0.2421607897 0.1377070477 -0.1460081368
-0.2336436322 0.1965445461 -0.1459742564
-0.2613384240 0.2816716142 -0.1470599859
-0.2336436322 0.1965445461 -0.1459742564
-0.2059488404 0.1114174781 -0.1448885268
-0.1782540486 0.0262904101 -0.1438027972
-0.2421607897 0.1377070477 -0.1460081368
-0.2506779472 0.0788695493 -0.1460420172
-0.3060675307 0.2491236853 -0.1482134764
-0.3870085867 0.2428653261 -0.1504865768
-0.2975503732 0.3079611838 -0.1481795959
-0.3060675307 0.2491236853 -0.1482134764
-0.3145846882 0.1902861869 -0.1482473568
-0.3231018457 0.1314486885 -0.1482812372
-0.3955257442 0.1840278277 -0.1505204573
-0.3145846882 0.1902861869 -0.1482473568
-0.3145796323 0.1902855577 -0.1484256563
-0.3955206883 0.1840271985 -0.1506987567
-0.3230967898 0.1314480593 -0.1484595367
-0.3145796323 0.1902855577 -0.1484256563
-0.3060624748 0.2491230561 -0.1483917759
-0.2975453173 0.3079605545 -0.1483578954
-0.3870035308 0.2428646969 -0.1506648763
-0.3060624748 0.2491230561 -0.1483917759
-0.2506728913 0.0788689201 -0.1462203167
-0.2421557338 0.1377064185 -0.1461864363
-0.1782489927 0.0262897809 -0.1439810967
-0.2059437845 0.1114168489 -0.1450668262
-0.2336385763 0.1965439169 -0.1461525558
-0.2613333680 0.2816709849 -0.1472382854
-0.2336385763 0.1965439169 -0.1461525558
-0.2421557338 0.1377064185 -0.1461864363
-0.3039554731 0.0525278346 -0.1474598103
-0.3316346340 0.1051330463 -0.1484303288
-0.4040585326 0.1577121855 -0.1506695488
-0.3316346340 0.1051330463 -0.1484303288
-0.2592107355 0.0525539071 -0.1461911087
-0.1867868370 -0.0000252321 -0.1439518887
-0.3039554731 0.0525278346 -0.1474598103
-0.2762763121 -0.0000773772 -0.1464892918
-0.4211241092 0.1050809012 -0.1509677318
-0.4829344234 0.0524235444 -0.1525346164
-0.4488032701 0.1576861130 -0.1519382503
-0.4211241092 0.1050809012 -0.1509677318
-0.3934449482 0.0524756895 -0.1499972133
-0.3657657873 -0.0001295222 -0.1490266949
-0.4552552624 -0.0001816673 -0.1515640979
-0.3934449482 0.0524756895 -0.1499972133
-0.3934398923 0.0524750603 -0.1501755128
-0.4552502065 -0.0001822965 -0.1517423974
-0.3657607314 -0.0001301515 -0.1492049943
-0.3934398923 0.0524750603 -0.1501755128
-0.4211190533 0.1050802720 -0.1511460313
-0.4487982142 0.1576854838 -0.1521165498
-0.4829293675 0.0524229152 -0.1527129159
-0.4211190533 0.1050802720 -0.1511460313
-0.2762712562 -0.0000780064 -0.1466675913
-0.3039504172 0.0525272054 -0.1476381097
-0.1867817810 -0.0000258613 -0.1441301882
-0.2592056796 0.0525532779 -0.1463694082
-0.3316295781 0.1051324171 -0.1486086282
-0.4040534766 0.1577115563 -0.1508478483
-0.3316295781 0.1051324171 -0.1486086282
-0.3039504172 0.0525272054 -0.1476381097
-0.3933941953 -0.0527669614 -0.1496243786
-0.4552552624 -0.0001816673 -0.1515640979
-0.3657657873 -0.0001295222 -0.1490266949
-0.3933941953 -0.0527669614 -0.1496243786
-0.4210226033 -0.1054044006 -0.1502220623
-0.4486510113 -0.1580418398 -0.1508197461
-0.4828836704 -0.0528191065 -0.1521617817
-0.4210226033 -0.1054044006 -0.1502220623
-0.2762763121 -0.0000773772 -0.1464892918
-0.3039047201 -0.0527148164 -0.1470869755
-0.1867868370 -0.0000252321 -0.1439518887
-0.2591599825 -0.0526887438 -0.1458182740
-0.3315331281 -0.1053522556 -0.1476846593
-0.4039062737 -0.1580157673 -0.1495510446
-0.3315331281 -0.1053522556 -0.1476846593
-0.3039047201 -0.0527148164 -0.1470869755
-0.3038996642 -0.0527154456 -0.1472652750
-0.3315280722 -0.1053528848 -0.1478629588
-0.4039012178 -0.1580163965 -0.1497293440
-0.3315280722 -0.1053528848 -0.1478629588
-0.2591549266 -0.0526893730 -0.1459965735
-0.1867817810 -0.0000258613 -0.1441301882
-0.3038996642 -0.0527154456 -0.1472652750
-0.2762712562 -0.0000780064 -0.1466675913
-0.4210175474 -0.1054050298 -0.1504003618
-0.4828786145 -0.0528197357 -0.1523400811
-0.4486459554 -0.1580424690 -0.1509980456
-0.4210175474 -0.1054050298 -0.1504003618
-0.3933891394 -0.0527675907 -0.1498026781
-0.3657607314 -0.0001301515 -0.1492049943
-0.4552502065 -0.0001822965 -0.1517423974
-0.3933891394 -0.0527675907 -0.1498026781
-0.2420279166 -0.1378220195 -0.1450320419
-0.3005947264 -0.1479058571 -0.1466571925
-0.3729678719 -0.2005693688 -0.1485235778
-0.3005947264 -0.1479058571 -0.1466571925
-0.2282215808 -0.0952423454 -0.1447908072
-0.1558484352 -0.0425788336 -0.1429244219
-0.2420279166 -0.1378220195 -0.1450320419
-0.1834611069 -0.1277381818 -0.1434068914
-0.3282073980 -0.2330652053 -0.1471396620
-0.2972532599 -0.3081407159 -0.1459969809
-0.3867742078 -0.2431490429 -0.1487648125
-0.3282073980 -0.2330652053 -0.1471396620
-0.2696405883 -0.2229813677 -0.1455145114
-0.2110737785 -0.2128975300 -0.1438893609
-0.2386864502 -0.2980568782 -0.1443718304
-0.2696405883 -0.2229813677 -0.1455145114
-0.2696355324 -0.2229819969 -0.1456928109
-0.2386813943 -0.2980575074 -0.1445501298
-0.2110687226 -0.2128981592 -0.1440676603
-0.2696355324 -0.2229819969 -0.1456928109
-0.3282023421 -0.2330658345 -0.1473179614
-0.3867691519 -0.2431496722 -0.1489431120
-0.2972482040 -0.3081413451 -0.1461752804
-0.3282023421 -0.2330658345 -0.1473179614
-0.1834560510 -0.1277388110 -0.1435851909
-0.2420228607 -0.1378226487 -0.1452103414
-0.1558433793 -0.0425794628 -0.1431027214
-0.2282165249 -0.0952429746 -0.1449691067
-0.3005896705 -0.1479064863 -0.1468354920
-0.3729628160 -0.2005699981 -0.1487018772
-0.3005896705 -0.1479064863 -0.1468354920
-0.2420228607 -0.1378226487 -0.1452103414
-0.1695726509 -0.2554449767 -0.1425623964
-0.2386864502 -0.2980568782 -0.1443718304
-0.2110737785 -0.2128975300 -0.1438893609
-0.1695726509 -0.2554449767 -0.1425623964
-0.1280715233 -0.2979924234 -0.1412354319
-0.0865703956 -0.3405398701 -0.1399084673
-0.1971853226 -0.3406043249 -0.1430448658
-0.1280715233 -0.2979924234 -0.1412354319
-0.1558073751 -0.1277220681 -0.1426227918
-0.1558484352 -0.0425788336 -0.1429244219
-0.1419599792 -0.1702856285 -0.1420799269
-0.1004999117 -0.1276898407 -0.1410545925
-0.0728051199 -0.2128169615 -0.1399688628
-0.0727640598 -0.2979601960 -0.1396672326
-0.1004588516 -0.2128330752 -0.1407529624
-0.1419599792 -0.1702856285 -0.1420799269
-0.1142601315 -0.2554133785 -0.1411724966
-0.0451052722 -0.2979447115 -0.1390614325
-0.0728000640 -0.2128175907 -0.1401471622
-0.1142601315 -0.2554133785 -0.1411724966
-0.1557201991 -0.2980091663 -0.1421978310
-0.1971802666 -0.3406049541 -0.1432231653
-0.0865653397 -0.3405404993 -0.1400867668
-0.1557201991 -0.2980091663 -0.1421978310
-0.1281485875 -0.1277065836 -0.1420169916
-0.1281896476 -0.0425633491 -0.1423186218
-0.1419549233 -0.1702862577 -0.1422582264
-0.1834560510 -0.1277388110 -0.1435851909
-0.2110687226 -0.2128981592 -0.1440676603
-0.2110276625 -0.2980413937 -0.1437660302
-0.1834149909 -0.2128820455 -0.1432835607
-0.1419549233 -0.1702862577 -0.1422582264
-0.0142286700 -0.2228325404 -0.1382725091
-0.0451103281 -0.2979440823 -0.1388831330
-0.0728051199 -0.2128169615 -0.1399688628
-0.0142286700 -0.2228325404 -0.1382725091
0.0443477799 -0.2328481192 -0.1365761555
0.1029242298 -0.2428636980 -0.1348798018
0.0134661218 -0.3079596612 -0.1371867793
0.0443477799 -0.2328481192 -0.1365761555
-0.1004999117 -0.1276898407 -0.1410545925
-0.0419234618 -0.1377054196 -0.1393582389
-0.1281947035 -0.0425627199 -0.1421403223
-0.0557708577 -0.0951418592 -0.1399011038
0.0166529881 -0.1477209984 -0.1376618852
0.0890768339 -0.2003001376 -0.1354226667
0.0166529881 -0.1477209984 -0.1376618852
-0.0419234618 -0.1377054196 -0.1393582389
-0.0419184059 -0.1377060488 -0.1395365384
0.0166580440 -0.1477216276 -0.1378401847
0.0890818898 -0.2003007668 -0.1356009662
0.0166580440 -0.1477216276 -0.1378401847
-0.0557658018 -0.0951424884 -0.1400794032
-0.1281896476 -0.0425633491 -0.1423186218
-0.0419184059 -0.1377060488 -0.1395365384
-0.1004948558 -0.1276904699 -0.1412328920
0.0443528358 -0.2328487484 -0.1367544549
0.0134711777 -0.3079602904 -0.1373650788
0.1029292857 -0.2428643272 -0.1350581013
0.0443528358 -0.2328487484 -0.1367544549
-0.0142236141 -0.2228331696 -0.1384508086
-0.0728000640 -0.2128175907 -0.1401471622
-0.0451052722 -0.2979447115 -0.1390614325
-0.0142236141 -0.2228331696 -0.1384508086
0.0922948036 -0.1051052931 -0.1356673545
0.1114413609 -0.1840261468 -0.1348459223
0.0390175151 -0.1314470076 -0.1370851408
0.0922948036 -0.1051052931 -0.1356673545
0.1455720921 -0.0787635785 -0.1342495682
0.1988493806 -0.0524218640 -0.1328317819
0.1647186494 -0.1576844323 -0.1334281360
0.1455720921 -0.0787635785 -0.1342495682
-0.0334063307 -0.0788678684 -0.1393243594
0.0198709578 -0.0525261538 -0.1379065731
-0.1058301765 -0.0262887291 -0.1415635779
-0.0163409651 -0.0262365842 -0.1390261823
0.0731482463 -0.0261844393 -0.1364887867
0.1626374577 -0.0261322943 -0.1339513911
0.0731482463 -0.0261844393 -0.1364887867
0.0198709578 -0.0525261538 -0.1379065731
0.0198760137 -0.0525267830 -0.1380848725
0.0731533022 -0.0261850685 -0.1366670862
0.1626425136 -0.0261329236 -0.1341296906
0.0731533022 -0.0261850685 -0.1366670862
-0.0163359092 -0.0262372134 -0.1392044818
-0.1058251206 -0.0262893584 -0.1417418774
0.0198760137 -0.0525267830 -0.1380848725
-0.0334012748 -0.0788684976 -0.1395026589
0.1455771480 -0.0787642077 -0.1344278677
0.1647237053 -0.1576850615 -0.1336064355
0.1988544365 -0.0524224932 -0.1330100813
0.1455771480 -0.0787642077 -0.1344278677
0.0922998595 -0.1051059223 -0.1358456540
0.0390225710 -0.1314476368 -0.1372634403
0.1114464168 -0.1840267760 -0.1350242218
0.0922998595 -0.1051059223 -0.1358456540
0.4463061962 0.0006289048 -0.0454853098
0.4318159867 0.0004546919 -0.0840490380
0.3941349721 0.0003653907 -0.1007010657
0.3555708674 0.0004102642 -0.0862109079
0.3389191425 0.0005663309 -0.0485301845
0.3534088247 0.0007400158 -0.0099664694
0.3910898390 0.0008298448 0.0066855564
0.4297077507 0.0007844749 -0.0078030739
0.4351568793 0.0007321925 -0.0142159954
0.4351568533 0.0007860205 -0.0142161861
0.4351568793 0.0007321925 -0.0142159954
0.4351568533 0.0007860205 -0.0142161861
0.4077568783 0.0008006862 0.0045280574
0.4077568524 0.0008545142 0.0045278667
0.3745724003 0.0007813498 0.0035871379
0.3745723743 0.0008351777 0.0035869472
0.3482786106 0.0006815689 -0.0166793598
0.3482785846 0.0007353969 -0.0166795505
0.3500684856 0.0004086876 -0.0797993063
0.3500684596 0.0004625155 -0.0797994970
0.3774684868 0.0003396661 -0.0985433573
0.3774684608 0.0003934941 -0.0985435480
0.4106529649 0.0003590026 -0.0976024378
0.4106529389 0.0004128305 -0.0976026285
0.4369467543 0.0004593111 -0.0773359419
0.4369467283 0.0005131391 -0.0773361326
0.4369467543 0.0004593111 -0.0773359419
0.4369467283 0.0005131391 -0.0773361326
-0.2435416557 0.1227219279 0.1437968845
-0.1376036001 0.1353302545 0.1504600039
-0.3440618539 0.1289362205 0.1426540691
-0.2397069365 0.1101778752 0.1403337379
-0.2397069365 0.1101778752 0.1403337379
-0.2485617197 0.1047695844 0.1312339128
-0.2391852067 0.0993719684 0.1226655400
-0.2479204357 0.1045287231 0.1136566803
-0.2386814756 0.1096960021 0.1051718244
-0.2424302041 0.1223929196 0.1012737938
-0.1581813796 0.1097431364 0.1075184852
-0.2424302041 0.1223929196 0.1012737938
-0.2348638768 0.1476427600 0.1012804539
-0.2386987542 0.1601868127 0.1047435960
-0.2298439709 0.1655945757 0.1138434229
-0.2392197451 0.1709916644 0.1224118186
-0.2304845149 0.1658354373 0.1314206236
-0.2397238972 0.1606686857 0.1399054657
-0.1356263098 0.1416809684 0.1486232349
-0.2397238972 0.1606686857 0.1399054657
-0.2359751702 0.1479717684 0.1438035491
-0.3422559014 0.1352104269 0.1444941704
-0.2434121366 -0.1458521962 0.1447483406
-0.1374740811 -0.1332438696 0.1514114600
-0.3439323348 -0.1396379036 0.1436055252
-0.2395774175 -0.1583962490 0.1412851940
-0.2395774175 -0.1583962490 0.1412851940
-0.2484322006 -0.1638045397 0.1321853690
-0.2390556876 -0.1692021558 0.1236169961
-0.2477909163 -0.1640459288 0.1146081383
-0.2385519560 -0.1588791774 0.1061232843
-0.2423006848 -0.1461817322 0.1022252518
-0.1580518600 -0.1588320432 0.1084699450
-0.2423006848 -0.1461817322 0.1022252518
-0.2347343578 -0.1209313641 0.1022319100
-0.2385692352 -0.1083873115 0.1056950521
-0.2297144518 -0.1029795484 0.1147948791
-0.2390902260 -0.0975824597 0.1233632747
-0.2303549958 -0.1027386869 0.1323720798
-0.2395943782 -0.1079054385 0.1408569218
-0.1354967908 -0.1268931558 0.1495746910
-0.2395943782 -0.1079054385 0.1408569218
-0.2358456511 -0.1206023557 0.1447550052
-0.3421263823 -0.1333636972 0.1454456266
0.0109265854 -0.0373739316 -0.0996756114
0.2574271322 0.0004246529 -0.0774293356
0.0028384414 -0.0248674587 -0.1062413958
-0.0810290912 0.0000756955 -0.1298588719
0.1382209308 -0.0247278757 -0.0852695813
0.0702614658 -0.0564187667 -0.0504133062
0.2654117909 -0.0214681851 -0.0669371351
0.0504716740 -0.0511134178 -0.0663978062
-0.0527378349 -0.0452613537 -0.1062242238
0.1777315243 -0.0415961503 -0.0506829707
0.1286926092 -0.0419782357 -0.0000644223
0.2849412018 -0.0307690801 -0.0414080828
0.1091866302 -0.0472356956 -0.0157868778
0.0164830398 -0.0644959992 -0.0486877153
0.2165698950 -0.0337449280 -0.0128750248
0.1536698462 -0.0024472752 0.0231668591
0.3041867706 -0.0215838446 -0.0163028705
0.1453151661 -0.0151878425 0.0164656271
0.0847105646 -0.0454402603 0.0079046718
0.2331056485 -0.0056452762 0.0067826102
0.0856241679 0.0445158619 0.0090443840
0.1455431557 0.0132421609 0.0179323665
0.3043376672 0.0132120853 -0.0121735474
0.1536312996 0.0007356881 0.0244981509
0.2168522675 0.0257335959 -0.0036863748
0.0163770383 0.0646489740 -0.0475566954
0.1096113147 0.0466892428 -0.0124927788
0.2846505768 0.0279037979 -0.0320847496
0.1294010991 0.0413838948 0.0034919849
0.1773411614 0.0426018683 -0.0382735279
-0.0518505134 0.0469127361 -0.1041752533
0.0506125609 0.0533737999 -0.0633662773
0.2654049942 0.0266408269 -0.0573522812
0.0701185472 0.0586315227 -0.0476440865
0.1385027912 0.0347495906 -0.0760814701
-0.0810483607 0.0016670447 -0.1291933574
0.0033329750 0.0288087924 -0.1046394699
0.2573115154 0.0099727483 -0.0734362484
0.0116876553 0.0415490959 -0.0979382370
0.1219675650 0.0066504668 -0.0957390920
-0.1445175926 -0.0562772289 -0.1075468160
-0.0864552332 -0.1053038261 -0.0553530705
-0.0984287778 -0.1365740133 -0.0356866762
-0.1014114966 -0.0776619068 -0.0847173560
-0.0767881764 -0.0606306852 -0.0821126417
-0.0468756495 -0.1159145239 -0.0233840706
-0.0152700557 -0.1370655350 0.0417198363
-0.0468756495 -0.1159145239 -0.0233840706
0.0018033654 -0.0607264632 -0.0186987308
0.0334089591 -0.0818774743 0.0464051761
0.0334089591 -0.0818774743 0.0464051761
0.0510744733 -0.0246041328 0.0626714966
0.0510744733 -0.0246041328 0.0626714966
0.0506535161 0.0572129845 0.0599540625
0.0442033057 0.0573392605 0.0964769151
0.0559935696 0.0291081312 0.0862754377
0.0506535161 0.0572129845 0.0599540625
-0.0148125705 0.1376883692 0.0412953848
0.0344772282 0.0822259302 0.0468224937
0.0023018993 0.0613873132 -0.0186815571
-0.0469878993 0.1168497522 -0.0242086661
-0.0469878993 0.1168497522 -0.0242086661
-0.0882610627 0.0933281479 -0.0625535461
-0.0882610627 0.0933281479 -0.0625535461
-0.1569099806 0.0573849464 -0.0907219590
-0.1342244201 -0.0499728494 -0.0983449039
-0.1881714845 -0.1276419934 -0.0292356507
-0.0984287778 -0.1365740133 -0.0356866762
-0.2537097566 -0.1158158608 0.0831216706
-0.1462854130 -0.1516556450 0.0098265261
-0.1222650564 -0.1456637302 0.0299575572
-0.2330734313 -0.1040547959 0.1022938385
-0.1016287311 -0.1339026653 0.0491297251
-0.0152700557 -0.1370655350 0.0417198363
-0.2896722648 -0.0642890360 0.1209021886
-0.3075649258 -0.0133766026 0.1407733961
-0.2122599199 -0.0419956891 0.1234279035
-0.2896722648 -0.0642890360 0.1209021886
-0.1169549140 -0.0706147755 0.1060824109
-0.0603560806 -0.1103805354 0.0874740608
-0.1898940936 -0.1056362308 0.0985888941
-0.2420197618 -0.0785985792 0.1122294423
-0.1037057784 -0.0276597694 0.1182821513
-0.0693024111 -0.0849243188 0.0974096646
-0.2599124229 -0.0276861459 0.1321006498
-0.2078435414 -0.0276773537 0.1274944836
-0.0172335296 -0.0849155266 0.0928034984
0.0436681090 -0.0562700637 0.0963304925
-0.1037057784 -0.0276597694 0.1182821513
0.0004319846 -0.0276421850 0.1090698189
-0.1817628138 0.0510328728 0.1160670525
-0.2252077100 0.0760608584 0.1108929230
-0.0341801546 0.0260224714 0.1120288496
-0.0948730213 0.0009769014 0.1264153115
-0.2859005768 0.0510152884 0.1252793849
-0.1990107843 0.0009593171 0.1356276439
-0.3379694583 0.0510064963 0.1298855511
-0.3031485473 0.0009417327 0.1448399762
-0.0035535831 0.0698488573 0.0961929334
0.0135767343 0.0135128746 0.1123128313
-0.0819370434 0.0385320682 0.1117448680
-0.0035535831 0.0698488573 0.0961929334
-0.1774508212 0.0635512617 0.1111769047
-0.2337728688 0.1042288497 0.1028329741
-0.0947847815 0.0807840551 0.0996549446
-0.0513104720 0.0823584540 0.0959089518
-0.1703564582 0.1362359718 0.0315362510
-0.0598756308 0.1105264453 0.0878490028
-0.1914952617 0.1255669311 0.0553018254
-0.2784438808 0.1224181333 0.0627938110
-0.0148125705 0.1376883692 0.0412953848
-0.0477174782 0.1414484906 0.0331585904
-0.1703564582 0.1362359718 0.0315362510
-0.1015651654 0.1572151751 0.0054909799
-0.1495967288 0.1273272148 -0.0347072179
-0.1015651654 0.1572151751 0.0054909799
-0.1912992376 0.1482425348 0.0120054348
-0.1495967288 0.1273272148 -0.0347072179
-0.1281101830 0.0573794959 -0.0961809551
-0.1467389625 -0.0356053775 -0.0843600389
-0.1937505249 -0.1213850145 -0.0312531770
-0.2062650673 -0.1070175425 -0.0172683119
-0.1675899593 -0.0251474527 -0.0610034949
-0.2271160640 -0.0965596178 0.0060882320
-0.2777301132 -0.1218077756 0.0629906394
-0.2479841982 -0.0502915811 0.0293179181
-0.2688180575 -0.0756437683 0.0528013199
-0.1675899593 -0.0251474527 -0.0610034949
-0.2063164796 0.0004127934 -0.0176488856
-0.3075445779 -0.0500835222 0.0961559293
-0.2658768593 0.0006208523 0.0491891256
-0.3254372389 0.0008289111 0.1160271368
-0.3075445779 -0.0500835222 0.0961559293
-0.3379694583 0.0510064963 0.1298855511
-0.3081892684 0.0509024668 0.0964665455
-0.3254372389 0.0008289111 0.1160271368
-0.2784090786 0.0507984374 0.0630475399
-0.2658768593 0.0006208523 0.0491891256
-0.3081892684 0.0509024668 0.0964665455
-0.1765362898 0.0003087639 -0.0510678911
-0.2063164796 0.0004127934 -0.0176488856
-0.1679123045 0.0253455418 -0.0608481868
-0.2784090786 0.0507984374 0.0630475399
-0.2697850934 0.0758352152 0.0532672442
-0.2486288888 0.0506944079 0.0296285343
-0.2784438808 0.1224181333 0.0627938110
-0.2275074863 0.0971732966 0.0057360955
-0.1679123045 0.0253455418 -0.0608481868
-0.2063686828 0.1078423373 -0.0180294788
-0.1944637649 0.1228408947 -0.0314499904
-0.1348685831 0.0510131399 -0.0980342728
3 235 689 234
3 236 689 235
3 236 690 17
3 235 690 236
3 237 691 235
3 67 691 237
3 234 692 235
3 237 692 234
3 239 693 238
3 125 693 239
3 239 694 17
3 238 694 239
3 240 695 238
3 234 695 240
3 240 696 125
3 238 696 240
3 242 697 241
3 243 697 242
3 243 698 192
3 242 698 243
3 244 699 242
3 67 699 244
3 241 700 242
3 244 700 241
3 246 701 245
3 15 701 246
3 246 702 192
3 245 702 246
3 247 703 245
3 241 703 247
3 247 704 15
3 245 704 247
3 249 705 248
3 250 705 249
3 250 706 92
3 249 706 250
3 251 707 249
3 67 707 251
3 248 708 249
3 251 708 248
3 253 709 252
3 69 709 253
3 253 710 92
3 252 710 253
3 254 711 252
3 248 711 254
3 254 712 69
3 252 712 254
3 256 713 255
3 257 713 256
3 257 714 89
3 256 714 257
3 258 715 256
3 67 715 258
3 255 716 256
3 258 716 255
3 260 717 259
3 107 717 260
3 260 718 89
3 259 718 260
3 261 719 259
3 255 719 261
3 261 720 107
3 259 720 261
3 263 721 262
3 264 721 263
3 264 722 90
3 263 722 264
3 265 723 263
3 67 723 265
3 262 724 263
3 265 724 262
3 267 725 266
3 161 725 267
3 267 726 90
3 266 726 267
3 268 727 266
3 262 727 268
3 268 728 161
3 266 728 268
3 270 729 269
3 271 729 270
3 271 730 91
3 270 730 271
3 272 731 270
3 67 731 272
3 269 732 270
3 272 732 269
3 274 733 273
3 106 733 274
3 274 734 91
3 273 734 274
3 275 735 273
3 269 735 275
3 275 736 106
3 273 736 275
3 277 737 276
3 278 737 277
3 278 738 191
3 277 738 278
3 279 739 277
3 67 739 279
3 276 740 277
3 279 740 276
3 281 741 280
3 68 741 281
3 281 742 191
3 280 742 281
3 282 743 280
3 276 743 282
3 282 744 68
3 280 744 282
3 284 745 283
3 285 745 284
3 285 746 18
3 284 746 285
3 286 747 284
3 67 747 286
3 283 748 284
3 286 748 283
3 288 749 287
3 141 749 288
3 288 750 18
3 287 750 288
3 289 751 287
3 283 751 289
3 289 752 141
3 287 752 289
3 124 28 123
3 28 26 123
3 293 753 291
3 290 753 293
3 293 754 292
3 291 754 293
3 294 755 292
3 123 755 294
3 294 756 291
3 292 756 294
3 296 757 295
3 291 757 296
3 296 758 65
3 295 758 296
3 297 759 290
3 291 759 297
3 297 760 295
3 290 760 297
3 300 761 299
3 298 761 300
3 300 762 26
3 299 762 300
3 301 763 299
3 123 763 301
3 301 764 298
3 299 764 301
3 303 765 302
3 298 765 303
3 303 766 290
3 302 766 303
3 304 767 302
3 26 767 304
3 304 768 298
3 302 768 304
3 308 769 307
3 306 769 308
3 308 770 28
3 307 770 308
3 309 771 307
3 305 771 309
3 309 772 306
3 307 772 309
3 311 773 310
3 306 773 311
3 311 774 124
3 310 774 311
3 312 775 310
3 28 775 312
3 312 776 306
3 310 776 312
3 315 777 305
3 314 777 315
3 315 778 313
3 305 778 315
3 316 779 314
3 66 779 316
3 316 780 313
3 314 780 316
3 318 781 317
3 313 781 318
3 318 782 124
3 317 782 318
3 319 783 313
3 317 783 319
3 319 784 305
3 313 784 319
3 28 85 26
3 85 83 26
3 323 785 321
3 320 785 323
3 323 786 322
3 321 786 323
3 324 787 322
3 26 787 324
3 324 788 321
3 322 788 324
3 326 789 325
3 321 789 326
3 326 790 65
3 325 790 326
3 327 791 320
3 321 791 327
3 327 792 325
3 320 792 327
3 330 793 329
3 328 793 330
3 330 794 83
3 329 794 330
3 331 795 329
3 26 795 331
3 331 796 328
3 329 796 331
3 333 797 332
3 328 797 333
3 333 798 320
3 332 798 333
3 334 799 332
3 83 799 334
3 334 800 328
3 332 800 334
3 338 801 337
3 336 801 338
3 338 802 85
3 337 802 338
3 339 803 337
3 335 803 339
3 339 804 336
3 337 804 339
3 341 805 340
3 336 805 341
3 341 806 28
3 340 806 341
3 342 807 340
3 85 807 342
3 342 808 336
3 340 808 342
3 345 809 335
3 344 809 345
3 345 810 343
3 335 810 345
3 346 811 344
3 66 811 346
3 346 812 343
3 344 812 346
3 348 813 347
3 343 813 348
3 348 814 28
3 347 814 348
3 349 815 343
3 347 815 349
3 349 816 335
3 343 816 349
3 85 34 83
3 34 32 83
3 353 817 352
3 351 817 353
3 353 818 83
3 352 818 353
3 354 819 352
3 350 819 354
3 354 820 351
3 352 820 354
3 356 821 355
3 351 821 356
3 356 822 32
3 355 822 356
3 357 823 355
3 83 823 357
3 357 824 351
3 355 824 357
3 360 825 359
3 350 825 360
3 359 826 360
3 65 826 359
3 361 827 358
3 350 827 361
3 361 828 359
3 358 828 361
3 362 829 358
3 363 829 362
3 363 830 32
3 362 830 363
3 364 831 358
3 362 831 364
3 364 832 350
3 358 832 364
3 368 833 367
3 366 833 368
3 368 834 34
3 367 834 368
3 369 835 367
3 365 835 369
3 369 836 366
3 367 836 369
3 371 837 370
3 366 837 371
3 371 838 85
3 370 838 371
3 372 839 370
3 34 839 372
3 372 840 366
3 370 840 372
3 375 841 374
3 365 841 375
3 374 842 375
3 66 842 374
3 376 843 373
3 365 843 376
3 376 844 374
3 373 844 376
3 377 845 373
3 378 845 377
3 378 846 85
3 377 846 378
3 379 847 373
3 377 847 379
3 379 848 365
3 373 848 379
3 34 81 32
3 81 79 32
3 383 849 381
3 380 849 383
3 383 850 382
3 381 850 383
3 384 851 382
3 32 851 384
3 384 852 381
3 382 852 384
3 386 853 385
3 381 853 386
3 386 854 65
3 385 854 386
3 387 855 380
3 381 855 387
3 387 856 385
3 380 856 387
3 390 857 389
3 388 857 390
3 390 858 79
3 389 858 390
3 391 859 389
3 32 859 391
3 391 860 388
3 389 860 391
3 393 861 392
3 388 861 393
3 393 862 380
3 392 862 393
3 394 863 392
3 79 863 394
3 394 864 388
3 392 864 394
3 398 865 397
3 396 865 398
3 398 866 81
3 397 866 398
3 399 867 397
3 395 867 399
3 399 868 396
3 397 868 399
3 401 869 400
3 396 869 401
3 401 870 34
3 400 870 401
3 402 871 400
3 81 871 402
3 402 872 396
3 400 872 402
3 405 873 395
3 404 873 405
3 405 874 403
3 395 874 405
3 406 875 404
3 66 875 406
3 406 876 403
3 404 876 406
3 408 877 407
3 403 877 408
3 408 878 34
3 407 878 408
3 409 879 403
3 407 879 409
3 409 880 395
3 403 880 409
3 81 160 79
3 160 159 79
3 413 881 411
3 410 881 413
3 413 882 412
3 411 882 413
3 414 883 412
3 79 883 414
3 414 884 411
3 412 884 414
3 416 885 415
3 411 885 416
3 416 886 65
3 415 886 416
3 417 887 410
3 411 887 417
3 417 888 415
3 410 888 417
3 420 889 419
3 418 889 420
3 420 890 159
3 419 890 420
3 421 891 419
3 79 891 421
3 421 892 418
3 419 892 421
3 423 893 422
3 418 893 423
3 423 894 410
3 422 894 423
3 424 895 422
3 159 895 424
3 424 896 418
3 422 896 424
3 428 897 427
3 426 897 428
3 428 898 160
3 427 898 428
3 429 899 427
3 425 899 429
3 429 900 426
3 427 900 429
3 431 901 430
3 426 901 431
3 431 902 81
3 430 902 431
3 432 903 430
3 160 903 432
3 432 904 426
3 430 904 432
3 435 905 425
3 434 905 435
3 435 906 433
3 425 906 435
3 436 907 434
3 66 907 436
3 436 908 433
3 434 908 436
3 438 909 437
3 433 909 438
3 438 910 81
3 437 910 438
3 439 911 433
3 437 911 439
3 439 912 425
3 433 912 439
3 160 80 159
3 80 78 159
3 443 913 442
3 441 913 443
3 443 914 159
3 442 914 443
3 444 915 442
3 440 915 444
3 444 916 441
3 442 916 444
3 446 917 445
3 441 917 446
3 446 918 78
3 445 918 446
3 447 919 445
3 159 919 447
3 447 920 441
3 445 920 447
3 450 921 440
3 449 921 450
3 450 922 448
3 440 922 450
3 451 923 449
3 65 923 451
3 451 924 448
3 449 924 451
3 453 925 452
3 448 925 453
3 453 926 78
3 452 926 453
3 454 927 448
3 452 927 454
3 454 928 440
3 448 928 454
3 458 929 456
3 455 929 458
3 458 930 457
3 456 930 458
3 459 931 457
3 80 931 459
3 459 932 456
3 457 932 459
3 461 933 460
3 456 933 461
3 461 934 66
3 460 934 461
3 462 935 455
3 456 935 462
3 462 936 460
3 455 936 462
3 465 937 464
3 463 937 465
3 465 938 160
3 464 938 465
3 466 939 464
3 80 939 466
3 466 940 463
3 464 940 466
3 468 941 467
3 463 941 468
3 468 942 455
3 467 942 468
3 469 943 467
3 160 943 469
3 469 944 463
3 467 944 469
3 80 35 78
3 35 33 78
3 473 945 471
3 470 945 473
3 473 946 472
3 471 946 473
3 474 947 472
3 78 947 474
3 474 948 471
3 472 948 474
3 476 949 475
3 471 949 476
3 476 950 65
3 475 950 476
3 477 951 470
3 471 951 477
3 477 952 475
3 470 952 477
3 480 953 479
3 478 953 480
3 480 954 33
3 479 954 480
3 481 955 479
3 78 955 481
3 481 956 478
3 479 956 481
3 483 957 482
3 478 957 483
3 483 958 470
3 482 958 483
3 484 959 482
3 33 959 484
3 484 960 478
3 482 960 484
3 488 961 487
3 486 961 488
3 488 962 35
3 487 962 488
3 489 963 487
3 485 963 489
3 489 964 486
3 487 964 489
3 491 965 490
3 486 965 491
3 491 966 80
3 490 966 491
3 492 967 490
3 35 967 492
3 492 968 486
3 490 968 492
3 495 969 485
3 494 969 495
3 495 970 493
3 485 970 495
3 496 971 494
3 66 971 496
3 496 972 493
3 494 972 496
3 498 973 497
3 493 973 498
3 498 974 80
3 497 974 498
3 499 975 493
3 497 975 499
3 499 976 485
3 493 976 499
3 35 86 33
3 86 84 33
3 503 977 502
3 501 977 503
3 503 978 33
3 502 978 503
3 504 979 502
3 500 979 504
3 504 980 501
3 502 980 504
3 506 981 505
3 501 981 506
3 506 982 84
3 505 982 506
3 507 983 505
3 33 983 507
3 507 984 501
3 505 984 507
3 510 985 509
3 500 985 510
3 509 986 510
3 65 986 509
3 511 987 508
3 500 987 511
3 511 988 509
3 508 988 511
3 512 989 508
3 513 989 512
3 513 990 84
3 512 990 513
3 514 991 508
3 512 991 514
3 514 992 500
3 508 992 514
3 518 993 517
3 516 993 518
3 518 994 86
3 517 994 518
3 519 995 517
3 515 995 519
3 519 996 516
3 517 996 519
3 521 997 520
3 516 997 521
3 521 998 35
3 520 998 521
3 522 999 520
3 86 999 522
3 522 1000 516
3 520 1000 522
3 525 1001 524
3 515 1001 525
3 524 1002 525
3 66 1002 524
3 526 1003 523
3 515 1003 526
3 526 1004 524
3 523 1004 526
3 527 1005 523
3 528 1005 527
3 528 1006 35
3 527 1006 528
3 529 1007 523
3 527 1007 529
3 529 1008 515
3 523 1008 529
3 86 27 84
3 27 25 84
3 533 1009 532
3 531 1009 533
3 533 1010 84
3 532 1010 533
3 534 1011 532
3 530 1011 534
3 534 1012 531
3 532 1012 534
3 536 1013 535
3 531 1013 536
3 536 1014 25
3 535 1014 536
3 537 1015 535
3 84 1015 537
3 537 1016 531
3 535 1016 537
3 540 1017 530
3 539 1017 540
3 540 1018 538
3 530 1018 540
3 541 1019 539
3 65 1019 541
3 541 1020 538
3 539 1020 541
3 543 1021 542
3 538 1021 543
3 543 1022 25
3 542 1022 543
3 544 1023 538
3 542 1023 544
3 544 1024 530
3 538 1024 544
3 548 1025 546
3 545 1025 548
3 548 1026 547
3 546 1026 548
3 549 1027 547
3 27 1027 549
3 549 1028 546
3 547 1028 549
3 551 1029 550
3 546 1029 551
3 551 1030 66
3 550 1030 551
3 552 1031 545
3 546 1031 552
3 552 1032 550
3 545 1032 552
3 555 1033 554
3 553 1033 555
3 555 1034 86
3 554 1034 555
3 556 1035 554
3 27 1035 556
3 556 1036 553
3 554 1036 556
3 558 1037 557
3 553 1037 558
3 558 1038 545
3 557 1038 558
3 559 1039 557
3 86 1039 559
3 559 1040 553
3 557 1040 559
3 27 124 25
3 124 123 25
3 563 1041 562
3 561 1041 563
3 563 1042 25
3 562 1042 563
3 564 1043 562
3 560 1043 564
3 564 1044 561
3 562 1044 564
3 566 1045 565
3 561 1045 566
3 566 1046 123
3 565 1046 566
3 567 1047 565
3 25 1047 567
3 567 1048 561
3 565 1048 567
3 570 1049 560
3 569 1049 570
3 570 1050 568
3 560 1050 570
3 571 1051 569
3 65 1051 571
3 571 1052 568
3 569 1052 571
3 573 1053 572
3 568 1053 573
3 573 1054 123
3 572 1054 573
3 574 1055 568
3 572 1055 574
3 574 1056 560
3 568 1056 574
3 578 1057 576
3 575 1057 578
3 578 1058 577
3 576 1058 578
3 579 1059 577
3 124 1059 579
3 579 1060 576
3 577 1060 579
3 581 1061 580
3 576 1061 581
3 581 1062 66
3 580 1062 581
3 582 1063 575
3 576 1063 582
3 582 1064 580
3 575 1064 582
3 585 1065 584
3 583 1065 585
3 585 1066 27
3 584 1066 585
3 586 1067 584
3 124 1067 586
3 586 1068 583
3 584 1068 586
3 588 1069 587
3 583 1069 588
3 588 1070 575
3 587 1070 588
3 589 1071 587
3 27 1071 589
3 589 1072 583
3 587 1072 589
3 144 1073 55
3 104 1073 144
3 51 1074 55
3 222 1074 51
3 162 1075 55
3 57 1075 162
3 227 1076 55
3 147 1076 227
3 228 1077 55
3 127 1077 228
3 163 1078 55
3 146 1078 163
3 52 1079 55
3 58 1079 52
3 145 1080 55
3 200 1080 145
3 105 10 103
3 10 11 103
3 103 1081 54
3 11 1081 103
3 105 1082 10
3 56 1082 105
3 10 229 11
3 229 230 11
3 230 1083 11
3 54 1083 230
3 229 1084 56
3 10 1084 229
3 229 218 230
3 218 219 230
3 219 1085 230
3 54 1085 219
3 218 1086 56
3 229 1086 218
3 218 207 219
3 207 208 219
3 208 1087 219
3 54 1087 208
3 207 1088 56
3 218 1088 207
3 207 128 208
3 128 126 208
3 126 1089 208
3 54 1089 126
3 128 1090 56
3 207 1090 128
3 128 205 126
3 205 206 126
3 126 1091 54
3 206 1091 126
3 128 1092 205
3 56 1092 128
3 205 220 206
3 220 221 206
3 206 1093 54
3 221 1093 206
3 205 1094 220
3 56 1094 205
3 220 231 221
3 231 232 221
3 221 1095 54
3 232 1095 221
3 220 1096 231
3 56 1096 220
3 231 8 232
3 8 9 232
3 232 1097 54
3 9 1097 232
3 231 1098 8
3 56 1098 231
3 8 105 9
3 105 103 9
3 103 1099 9
3 54 1099 103
3 105 1100 56
3 8 1100 105
3 185 196 177
3 196 150 177
3 150 151 177
3 151 195 177
3 195 184 177
3 184 225 177
3 225 24 177
3 24 23 177
3 23 226 177
3 226 185 177
3 185 175 196
3 175 0 196
3 196 0 150
3 0 133 150
3 150 133 151
3 133 134 151
3 151 134 195
3 134 1 195
3 195 1 184
3 1 176 184
3 184 176 225
3 176 75 225
3 225 75 24
3 75 47 24
3 24 47 23
3 47 46 23
3 23 46 226
3 46 74 226
3 226 74 185
3 74 175 185
3 175 170 0
3 170 73 0
3 0 73 133
3 73 39 133
3 133 39 134
3 39 38 134
3 134 38 1
3 38 72 1
3 1 72 176
3 72 169 176
3 176 169 75
3 169 6 75
3 75 6 47
3 6 139 47
3 47 139 46
3 139 140 46
3 46 140 74
3 140 7 74
3 74 7 175
3 7 170 175
3 170 174 73
3 174 132 73
3 73 132 39
3 132 211 39
3 39 211 38
3 211 212 38
3 38 212 72
3 212 131 72
3 72 131 169
3 131 173 169
3 169 173 6
3 173 44 6
3 6 44 139
3 44 204 139
3 139 204 140
3 204 203 140
3 140 203 7
3 203 45 7
3 7 45 170
3 45 174 170
3 174 179 132
3 179 20 132
3 132 20 211
3 20 214 211
3 211 214 212
3 214 213 212
3 212 213 131
3 213 19 131
3 131 19 173
3 19 178 173
3 173 178 44
3 178 40 44
3 44 40 204
3 40 99 204
3 204 99 203
3 99 100 203
3 203 100 45
3 100 41 45
3 45 41 174
3 41 179 174
3 179 172 20
3 172 130 20
3 20 130 214
3 130 209 214
3 214 209 213
3 209 210 213
3 213 210 19
3 210 129 19
3 19 129 178
3 129 171 178
3 178 171 40
3 171 42 40
3 40 42 99
3 42 202 99
3 99 202 100
3 202 201 100
3 100 201 41
3 201 43 41
3 41 43 179
3 43 172 179
3 172 168 130
3 168 71 130
3 130 71 209
3 71 37 209
3 209 37 210
3 37 36 210
3 210 36 129
3 36 70 129
3 129 70 171
3 70 167 171
3 171 167 42
3 167 4 42
3 42 4 202
3 4 137 202
3 202 137 201
3 137 138 201
3 201 138 43
3 138 5 43
3 43 5 172
3 5 168 172
3 168 182 71
3 182 2 71
3 71 2 37
3 2 135 37
3 37 135 36
3 135 136 36
3 36 136 70
3 136 3 70
3 70 3 167
3 3 183 167
3 167 183 4
3 183 77 4
3 4 77 137
3 77 49 137
3 137 49 138
3 49 48 138
3 138 48 5
3 48 76 5
3 5 76 168
3 76 182 168
3 182 181 2
3 181 194 2
3 2 194 135
3 194 148 135
3 135 148 136
3 148 149 136
3 136 149 3
3 149 193 3
3 3 193 183
3 193 180 183
3 183 180 77
3 180 223 77
3 77 223 49
3 223 22 49
3 49 22 48
3 22 21 48
3 48 21 76
3 21 224 76
3 76 224 182
3 224 181 182
3 181 164 194
3 164 164 194
3 194 164 148
3 164 164 148
3 148 164 149
3 164 164 149
3 149 164 193
3 193 164 180
3 164 164 180
3 180 164 223
3 164 164 223
3 223 164 22
3 164 164 22
3 22 164 21
3 164 164 21
3 21 164 224
3 164 164 224
3 224 164 181
3 164 164 181
3 61 154 94
3 102 61 94
3 188 102 94
3 87 188 94
3 60 87 94
3 199 60 94
3 590 1101 98
3 94 1101 590
3 98 1102 590
3 122 1102 98
3 154 1103 94
3 591 1103 154
3 591 1104 98
3 154 1104 591
3 117 1105 154
3 98 1105 117
3 61 1106 154
3 117 1106 61
3 120 1107 61
3 117 1107 120
3 102 1108 61
3 120 1108 102
3 1109 1110 112
3 102 1110 1109
3 112 1111 1109
3 120 1111 112
3 188 1112 102
3 112 1112 188
3 112 1113 142
3 188 1113 112
3 188 1114 142
3 87 1114 188
3 142 1115 116
3 87 1115 142
3 87 1116 116
3 60 1116 87
3 116 1117 114
3 60 1117 116
3 60 1118 114
3 199 1118 60
3 114 1119 122
3 592 1119 114
3 592 1120 199
3 114 1120 592
3 593 1121 199
3 122 1121 593
3 199 1122 593
3 94 1122 199
3 122 98 117
3 122 117 120
3 122 120 112
3 122 112 142
3 122 142 116
3 122 116 114
3 62 153 93
3 101 62 93
3 187 101 93
3 88 187 93
3 59 88 93
3 198 59 93
3 594 1123 97
3 93 1123 594
3 97 1124 594
3 121 1124 97
3 153 1125 93
3 595 1125 153
3 595 1126 97
3 153 1126 595
3 118 1127 153
3 97 1127 118
3 62 1128 153
3 118 1128 62
3 119 1129 62
3 118 1129 119
3 101 1130 62
3 119 1130 101
3 1131 1132 111
3 101 1132 1131
3 111 1133 1131
3 119 1133 111
3 187 1134 101
3 111 1134 187
3 111 1135 143
3 187 1135 111
3 187 1136 143
3 88 1136 187
3 143 1137 115
3 88 1137 143
3 88 1138 115
3 59 1138 88
3 115 1139 113
3 59 1139 115
3 59 1140 113
3 198 1140 59
3 113 1141 121
3 596 1141 113
3 596 1142 198
3 113 1142 596
3 597 1143 198
3 121 1143 597
3 198 1144 597
3 93 1144 198
3 121 97 118
3 121 118 119
3 121 119 111
3 121 111 143
3 121 143 115
3 121 115 113
3 30 53 14
3 13 30 14
3 155 13 14
3 12 155 14
3 31 12 14
3 157 31 14
3 598 1145 190
3 599 1145 598
3 599 1146 14
3 598 1146 599
3 600 1147 190
3 598 1147 600
3 190 1148 600
3 29 1148 190
3 53 1149 14
3 190 1149 53
3 601 1150 215
3 602 1150 601
3 602 1151 53
3 601 1151 602
3 603 1152 215
3 601 1152 603
3 215 1153 603
3 190 1153 215
3 30 1154 53
3 215 1154 30
3 604 1155 50
3 605 1155 604
3 605 1156 30
3 604 1156 605
3 606 1157 50
3 604 1157 606
3 50 1158 606
3 215 1158 50
3 13 1159 30
3 50 1159 13
3 607 1160 186
3 608 1160 607
3 608 1161 13
3 607 1161 608
3 609 1162 186
3 607 1162 609
3 186 1163 609
3 50 1163 186
3 155 1164 13
3 186 1164 155
3 186 1165 16
3 611 1165 186
3 611 1166 610
3 186 1166 611
3 612 1167 610
3 155 1167 612
3 610 1168 612
3 186 1168 610
3 12 1169 155
3 16 1169 12
3 16 1170 216
3 614 1170 16
3 614 1171 613
3 16 1171 614
3 615 1172 613
3 12 1172 615
3 613 1173 615
3 16 1173 613
3 31 1174 12
3 216 1174 31
3 216 1175 156
3 617 1175 216
3 617 1176 616
3 216 1176 617
3 618 1177 616
3 31 1177 618
3 616 1178 618
3 216 1178 616
3 157 1179 31
3 156 1179 157
3 156 1180 29
3 620 1180 156
3 620 1181 619
3 156 1181 620
3 621 1182 619
3 157 1182 621
3 619 1183 621
3 156 1183 619
3 14 1184 157
3 29 1184 14
3 217 1185 152
3 29 1185 217
3 29 190 152
3 1186 1187 152
3 96 1187 1186
3 152 1188 1186
3 190 1188 152
3 622 1189 215
3 190 1189 622
3 622 1190 96
3 215 1190 622
3 623 1191 96
3 189 1191 623
3 623 1192 215
3 96 1192 623
3 624 1193 50
3 215 1193 624
3 624 1194 189
3 50 1194 624
3 625 1195 50
3 189 1195 625
3 625 1196 108
3 50 1196 625
3 186 1197 50
3 108 1197 186
3 1198 1199 108
3 197 1199 1198
3 186 1200 108
3 1198 1200 186
3 16 1201 186
3 197 1201 16
3 626 1202 197
3 95 1202 626
3 626 1203 16
3 197 1203 626
3 627 1204 216
3 16 1204 627
3 627 1205 95
3 216 1205 627
3 628 1206 216
3 95 1206 628
3 628 1207 158
3 216 1207 628
3 156 1208 216
3 158 1208 156
3 156 1209 158
3 217 1209 156
3 156 29 217
3 217 1210 110
3 233 1210 217
3 217 152 233
3 152 166 233
3 629 1211 152
3 166 1211 629
3 629 1212 96
3 152 1212 629
3 166 1213 64
3 630 1213 166
3 630 1214 96
3 166 1214 630
3 631 1215 96
3 632 1215 631
3 632 1216 64
3 631 1216 632
3 633 1217 96
3 631 1217 633
3 633 1218 189
3 96 1218 633
3 636 1219 635
3 64 1219 636
3 636 1220 63
3 635 1220 636
3 637 1221 635
3 634 1221 637
3 637 1222 64
3 635 1222 637
3 638 1223 634
3 639 1223 638
3 639 1224 189
3 638 1224 639
3 634 1225 638
3 640 1225 634
3 640 1226 64
3 634 1226 640
3 642 1227 641
3 643 1227 642
3 643 1228 189
3 642 1228 643
3 644 1229 642
3 63 1229 644
3 641 1230 642
3 644 1230 641
3 646 1231 189
3 645 1231 646
3 646 1232 108
3 189 1232 646
3 647 1233 645
3 641 1233 647
3 647 1234 108
3 645 1234 647
3 648 1235 650
3 649 1235 648
3 650 1236 82
3 649 1236 650
3 651 1237 649
3 108 1237 651
3 649 1238 651
3 648 1238 649
3 653 1239 652
3 82 1239 653
3 653 1240 648
3 652 1240 653
3 654 1241 63
3 82 1241 654
3 654 1242 652
3 63 1242 654
3 657 1243 656
3 197 1243 657
3 657 1244 108
3 656 1244 657
3 658 1245 656
3 655 1245 658
3 658 1246 197
3 656 1246 658
3 659 1247 655
3 660 1247 659
3 660 1248 82
3 659 1248 660
3 659 1249 661
3 655 1249 659
3 661 1250 197
3 655 1250 661
3 662 1251 165
3 663 1251 662
3 663 1252 197
3 662 1252 663
3 664 1253 165
3 662 1253 664
3 664 1254 82
3 165 1254 664
3 666 1255 95
3 197 1255 666
3 665 1256 95
3 666 1256 665
3 667 1257 665
3 165 1257 667
3 665 1258 667
3 95 1258 665
3 669 1259 668
3 109 1259 669
3 669 1260 95
3 668 1260 669
3 670 1261 668
3 165 1261 670
3 670 1262 109
3 668 1262 670
3 95 158 109
3 158 110 109
3 217 1263 158
3 110 1263 217
3 233 1264 110
3 671 1264 233
3 671 1265 166
3 233 1265 671
3 672 1266 166
3 673 1266 672
3 673 1267 110
3 672 1267 673
3 674 1268 166
3 672 1268 674
3 674 1269 64
3 166 1269 674
3 675 1270 677
3 676 1270 675
3 677 1271 64
3 676 1271 677
3 678 1272 676
3 110 1272 678
3 676 1273 678
3 675 1273 676
3 680 1274 679
3 64 1274 680
3 680 1275 675
3 679 1275 680
3 681 1276 679
3 63 1276 681
3 681 1277 64
3 679 1277 681
3 1278 1279 683
3 82 1279 1278
3 1278 1280 63
3 683 1280 1278
3 1281 1282 683
3 682 1282 1281
3 1281 1283 82
3 683 1283 1281
3 684 1285 682
3 1284 1285 684
3 1284 1286 110
3 684 1286 1284
3 1287 1288 684
3 82 1288 1287
3 682 1289 684
3 1287 1289 682
3 686 1290 165
3 82 1290 686
3 686 1291 685
3 165 1291 686
3 687 1292 685
3 110 1292 687
3 685 1293 687
3 165 1293 685
3 688 1294 109
3 165 1294 688
3 688 1295 110
3 109 1295 688