OFF
1217 2076 0
-0.1270313909 0.3941873445 -0.1492042073
-0.0768363239 0.3998861180 0.0916041989
-0.2040963603 -0.3848034841 -0.1050166934
-0.1521719752 -0.3789083767 0.1440880330
0.2070766942 0.0746247559 -0.1630545647
0.2034997894 0.0742186608 -0.1802145925
-0.0218631319 0.4076502613 -0.1714445019
0.0283319350 0.4133490348 0.0693639042
0.2123366263 -0.4963065243 -0.1925366532
0.2126945808 -0.3529358745 -0.1960041584
0.2607750992 -0.4908071814 0.0398445779
0.2611330537 -0.3474365317 0.0363770727
-0.0877313830 0.1497442334 -0.0674390068
-0.0202952717 0.1618643437 -0.0678549101
-0.0209396834 0.1617804662 -0.0709460562
-0.0203020364 0.1592424954 -0.0677925491
-0.0209463918 0.1591811275 -0.0708842396
0.0712505608 0.1386396500 -0.0855176159
0.2297581328 -0.3577988186 -0.2057789567
0.2717435264 -0.3530321102 -0.0043560616
-0.0379098271 0.1473991981 -0.1169061703
-0.1129159371 -0.1510112572 -0.0973821195
-0.0971374618 0.1298643136 -0.1041427108
-0.2404891936 -0.1060437654 0.1988501742
0.0039001016 0.1435810355 -0.1079784612
0.0313439472 0.1025407324 -0.1251653824
-0.1927789835 0.3861197041 -0.1086380514
-0.1547202037 0.3904406141 0.0739471041
-0.0447480983 0.1300652510 -0.1017787296
-0.3204894106 0.2500863125 -0.0787983252
-0.2651311059 0.2563712814 0.1867804644
0.0868584262 0.1348410778 -0.1034511304
0.2387876982 0.1452194376 0.1053406385
0.0013473595 0.1436002672 -0.1074468126
0.3901802998 0.0109665446 -0.1609198494
0.0713205523 0.1408332942 -0.0905512872
-0.1393366150 -0.0293459269 -0.1100779563
-0.1380415020 -0.0291988894 -0.1038647144
0.1576952970 -0.3903546617 -0.1802986233
0.2096196821 -0.3844595544 0.0688061031
-0.0035473238 0.1535239499 -0.1159468419
0.1971817752 0.2037176491 -0.0946502928
0.3232388062 0.2395396045 0.0027931892
0.2867022490 0.2353915164 -0.1724891771
0.2248316983 0.1964566280 0.1454028846
-0.0279862241 0.1473233935 -0.1189716868
0.3215328521 -0.3145850572 -0.0156442040
0.3297425255 -0.3136529922 0.0237413070
0.3357631964 0.2340116451 -0.2152098325
0.3911215011 0.2402966141 0.0503689571
0.1342035682 0.1692213873 -0.1501032450
0.1306266634 0.1688152922 -0.1672632728
-0.1464210956 0.2663583830 0.1464348091
-0.0100563587 0.1430424964 -0.1175400120
0.0715561685 -0.1137040570 -0.1195905595
-0.1180715155 0.1342997809 -0.0808685183
0.0358467130 0.3249903085 0.1070546435
0.0449243364 -0.1311002714 -0.1495681760
0.0684228391 -0.1232446466 -0.1299149558
-0.0359013814 0.1539018038 -0.1092068448
0.4514988231 0.0250546579 -0.0354086403
-0.1780708617 0.3035378683 0.1299828479
0.0709341920 0.1149128773 -0.1323141476
0.0836397003 0.1288807761 -0.1027771925
0.0339272416 0.3215891560 0.1001962260
-0.2926729198 0.2228531566 0.1315711796
-0.3292094770 0.2187050684 -0.0437111868
0.0742426731 0.1182416628 -0.1394351433
-0.4445887111 0.0261574377 0.0127155768
-0.1438394039 -0.0715272425 0.2715656201
-0.4083506627 -0.2009675056 -0.0699463319
-0.4083004255 -0.1808461366 -0.0704329793
-0.3599120804 -0.1954681503 0.1624354238
-0.3598618433 -0.1753467813 0.1619487764
0.4198873567 -0.4754652580 -0.2362925695
0.4198371169 -0.4955876989 -0.2358058962
0.4683258296 -0.4699659151 -0.0039113384
0.4682755898 -0.4900883560 -0.0034246651
0.2624155177 0.2149537496 0.0624317706
-0.0008034494 0.1645386142 -0.0859109156
-0.0665003535 -0.2446154722 0.2165673513
0.3586704711 0.1206349991 0.0150917586
0.1899749805 0.1281042355 -0.1573882806
-0.1170162241 -0.1396195276 -0.1156098233
-0.0338583486 -0.1850020099 0.2513261296
0.0656979531 0.1408484438 -0.0885097915
0.1554150728 -0.0706287871 -0.1704079790
0.1593019211 -0.0701875034 -0.1517610125
-0.2145407251 0.3327790567 0.0893278033
-0.2556394005 0.3281130197 -0.1078411041
-0.1142711098 0.3395833825 0.1158322447
0.2302467103 0.2110114846 0.0932249319
0.4542625341 -0.0054084894 -0.0150993321
0.0504401031 -0.1037303884 -0.1478754528
0.0517352161 -0.1035833510 -0.1416622108
0.0669853037 0.0593169593 -0.1155126585
-0.2006163361 0.2176360399 0.1588845045
-0.2261787220 -0.0872702570 -0.0904804500
-0.2222918524 -0.0868203982 -0.0718336909
0.1985110557 0.3918268396 0.0018322624
0.1574123804 0.3871608026 -0.1953366449
-0.0237948602 0.1628992321 -0.0715014095
-0.0317670561 0.1330221234 -0.1359614066
0.0597385255 0.0893011487 -0.1359111183
-0.1014640404 -0.1392382964 -0.0982859637
0.0714762662 0.1197356711 -0.1388784113
0.1905030824 -0.3883309877 -0.1968739279
0.2406981494 -0.3826322143 0.0439344782
-0.1574622117 0.1483343808 0.1878628383
0.0457082588 0.1099541743 -0.1309906709
0.0909577110 0.4230518051 -0.1246319513
0.1186368820 0.4261667522 0.0081585296
0.0908660993 0.3869718686 -0.1237666860
0.1185452695 0.3900864940 0.0090238025
0.3315869399 0.1873848962 0.0191586056
-0.0355269449 0.1557617707 -0.0982943235
-0.1223555478 0.3824270410 -0.1232300064
-0.0669972431 0.3887120099 0.1423487832
-0.0057358479 0.1094260156 -0.1011110884
-0.1004023680 0.1049269351 -0.1209892529
-0.0962947753 0.1053932806 -0.1012832755
0.1581565031 0.1657098959 -0.0741536354
0.0024600746 0.1287398404 -0.1136144786
-0.0041047879 0.1124897884 -0.1166132983
-0.1195007064 -0.1496404863 -0.0914061251
-0.3093396546 0.2882408902 -0.1086959023
-0.2591445877 0.2939396636 0.1321125038
-0.0162148724 0.1334033546 -0.1186375471
0.4357697685 -0.0053013268 -0.0112471622
0.0496077394 0.1188226407 -0.1320140253
0.0010989125 -0.1651845019 -0.1439684752
0.0010627142 -0.1799281694 -0.1436089508
-0.2276356300 0.1417475397 -0.0706628361
-0.1166170986 0.1355607747 -0.0715063423
-0.2100891455 -0.0964655186 0.2429915784
0.0471282986 0.1408572215 -0.1262051809
0.2779946586 0.2415332034 -0.2033463265
0.3333529633 0.2478181723 0.0622324631
-0.2142801355 0.1226341028 -0.0085367676
0.0565809761 0.0889187614 -0.1300967309
0.0810666460 -0.4086133479 -0.1735825739
0.1312617130 -0.4029145744 0.0672258322
-0.1133937882 -0.1109495777 -0.0629308147
0.0416047315 -0.1230394724 -0.1243331339
0.0629103805 0.0863291779 -0.1191328435
0.0674283313 0.1432791090 -0.0857005458
-0.3056327335 0.1248427231 0.1608012067
0.0676222725 -0.1232617158 -0.1297721090
0.3690062386 -0.1176055753 -0.2404886041
0.4192013056 -0.1119068019 0.0003198020
0.1969666820 0.0702740623 -0.1565387693
0.1956486021 0.0701244173 -0.1628621938
-0.0028498027 0.1617790542 -0.1055444207
-0.0893263667 -0.1134889533 -0.0860637187
-0.1516870711 0.1993714706 0.2238169819
-0.2069037424 0.1362588739 -0.0285925548
0.0595644642 0.0875865573 -0.1293067164
0.1728412852 0.1566325523 -0.1082291778
-0.4370415577 0.1093752956 -0.0778443212
-0.3868464908 0.1150740690 0.1629640849
0.1220897595 -0.1862101110 0.2188482724
0.2008484083 0.1272539975 -0.1133729413
0.2053576689 -0.0708528315 -0.1808129113
0.2092445172 -0.0704115477 -0.1621659448
-0.0277350653 0.2829270663 -0.1270989560
-0.0291190273 0.2827699416 -0.1337384467
-0.1065506946 -0.1170914753 -0.0496138243
-0.1596377466 0.3714454392 -0.1151988743
-0.1042794419 0.3777304082 0.1503799153
-0.1157654869 0.1273382624 -0.0919310205
-0.0274018088 0.0875206962 0.2722012327
0.0608889542 0.1489909593 -0.0983640450
0.1369483106 0.2754164443 0.1111482686
0.0702071183 0.1384159679 -0.0902619921
-0.3332907743 -0.2071254170 0.1183067993
-0.3250811009 -0.2061933520 0.1576923104
0.0563289629 0.0503172644 -0.1015442767
-0.1583011495 -0.1456413314 0.1949946970
-0.1074667499 0.1373398085 -0.0534556380
-0.4292392054 -0.0040671529 -0.0767860391
-0.3790441385 0.0016316205 0.1640223670
0.4119171796 -0.4969290083 -0.2341232905
0.4127086129 -0.1799381267 -0.2417899052
0.4603556525 -0.4914296654 -0.0017420594
0.4611470858 -0.1744387839 -0.0094086741
-0.0900152817 0.1097869401 -0.1232691725
-0.0859076890 0.1102532856 -0.1035631950
0.1602710749 0.3902493458 -0.1823269458
0.1983298547 0.3945702557 0.0002582097
-0.2270687068 0.1704781544 0.1581753335
-0.0376993528 0.1149904137 -0.1159327524
-0.0376324056 0.1477165108 -0.1167951248
-0.1377971710 -0.3891370052 0.1180316616
-0.1378289051 -0.4018473820 0.1183390697
-0.1852104464 -0.3945199547 -0.1094312339
-0.1852421805 -0.4072303316 -0.1091238258
-0.1030449886 -0.1185115683 -0.1001636342
-0.2174391594 0.1337354384 -0.0725982927
-0.1024512231 0.0634081607 -0.1277894840
-0.0697290759 0.1039921324 -0.1027276236
0.0665767402 0.1443570086 -0.0871622728
0.0285522572 0.1042312212 -0.1232278713
0.1340107293 0.3831594534 0.0388378570
0.0974741721 0.3790113652 -0.1364445093
0.0267236191 0.2988757749 0.1335687748
-0.3824076618 0.2191484391 -0.0048402443
0.1496761436 0.2980549785 0.0766260025
0.3565424334 -0.2514756222 0.0110930585
0.0722605674 0.1408326560 -0.0857800436
-0.0731450494 0.1024598486 -0.1033765717
0.0472255376 0.1284392330 -0.1291385442
0.2372774849 0.2999006611 0.0434920531
-0.1183431596 -0.1132769466 -0.0800272614
-0.0019137099 0.1631597078 -0.0960774731
-0.0038522158 0.1617866061 -0.1053356525
0.2476442189 0.1517181157 0.1033407575
-0.1157752975 0.1154651936 -0.0823667093
-0.0889212983 0.1462127513 -0.0575269237
-0.1344283143 0.0320885879 -0.0613342493
-0.0514029168 0.0511753760 0.2780642381
-0.0895520912 -0.1780615197 -0.0758717024
-0.0895146653 -0.1633166413 -0.0762253763
0.2867581249 0.2459687167 0.0271165065
0.0311143027 0.1047348304 -0.1300338457
0.0908893094 0.0678674657 -0.1206997358
-0.0859871076 0.1353933367 -0.1064421046
-0.2833775423 -0.3492573516 -0.0990210404
-0.2413921487 -0.3444906432 0.1024018547
-0.0300262259 0.1648175805 -0.0797878612
-0.0888089062 0.1340407902 -0.1058064623
0.3357883782 0.0354694206 0.0513851665
-0.1150755469 0.1212815602 -0.1002052231
-0.2770847380 0.2445457127 0.1278085585
-0.3136212953 0.2403976246 -0.0474738079
0.1691454616 -0.0315079275 -0.1526363783
0.1655685568 -0.0319140225 -0.1697964061
-0.0045665776 0.1125766030 -0.1165303795
-0.2094111015 0.1330138216 -0.0279931161
0.0609183042 0.1489746596 -0.0983697771
0.2560561954 0.3305639334 -0.0087128791
0.2149575201 0.3258978964 -0.2058817864
0.0608423160 0.1489495191 -0.0983971644
-0.0941047002 -0.1185767253 -0.1020234506
-0.0929463261 -0.1230208509 -0.0963006893
-0.2398816926 0.1191990357 0.1933931336
0.2096886811 0.2659265133 0.0722149882
0.0583261718 -0.1187332484 -0.1337789145
0.1560437263 -0.4203707648 0.0568827440
-0.0810427835 0.1378227788 -0.0951477853
0.0418594276 -0.1498553369 -0.1250062316
0.2086638177 0.1051668010 -0.0983234210
0.0283425150 0.1062282278 -0.1295029278
-0.0599265814 0.0081448362 0.2808592701
-0.1144023543 0.1219977812 -0.0878168332
0.0802325448 0.1262293210 -0.1217176827
0.0738332607 -0.1175352951 -0.1018922468
-0.1825765185 0.2976918964 0.1237213623
-0.0011695100 0.1631541011 -0.0962324645
0.0789754610 0.1133216036 -0.1229113745
-0.0368782182 0.1488769401 -0.1046123741
-0.2572336123 0.1042217487 0.1660309965
0.0500544740 -0.1053299311 0.2606197796
-0.0369532990 0.1423471679 -0.1139448919
-0.0988076858 0.1369248455 -0.0549965829
-0.0930443573 0.1392038266 -0.0513022062
-0.0172224190 0.1110862393 -0.1203909735
-0.1941513065 0.1698873309 -0.0138507572
-0.1186455722 0.1340462316 -0.0808127547
0.2294146932 -0.4740302868 -0.1966236448
0.2293644533 -0.4941527277 -0.1961369715
0.2778531660 -0.4685309440 0.0357575862
0.2778029262 -0.4886533849 0.0362442596
-0.0361202862 -0.2374430354 0.1716993328
-0.4662366092 -0.2005314081 -0.0578906741
-0.4661863720 -0.1804100390 -0.0583773215
-0.4177980269 -0.1950320528 0.1744910816
-0.4177477898 -0.1749106837 0.1740044342
0.0474913676 -0.1111485644 -0.0964561731
0.0516996309 0.1416308050 -0.1161423156
0.0812375944 0.1121008151 -0.1233540125
-0.0276867040 0.1237515412 -0.1160182294
0.4035500365 0.0096332489 -0.0085064302
0.3670134793 0.0054851607 -0.1837887966
0.4102006123 -0.0173194555 -0.0092548623
0.3736640550 -0.0214675436 -0.1845372287
-0.4524673066 0.4543445676 -0.0361172810
-0.4554234496 0.4540089491 -0.0502992341
-0.0006853920 0.1644741256 -0.0859044183
0.0440730468 -0.2014307668 0.2354705874
0.3021693709 0.0036068942 0.1338461339
0.0563710405 -0.1311886146 -0.1519505483
-0.0450361160 0.1294032332 -0.1037267049
-0.0939808733 0.1389769972 -0.0560326434
-0.0328113319 0.1099332721 -0.0954823285
-0.0068559742 0.1422396238 -0.1167479186
0.2295782612 0.3010096681 0.0377316566
0.2649566940 0.2837942389 -0.2282992985
0.3151517609 0.2894930123 0.0125091076
-0.4518863838 -0.0038922474 -0.0720695099
-0.4016913168 0.0018065261 0.1687388962
-0.1506366499 -0.1406314986 -0.0678861139
-0.1507697290 -0.1930574959 -0.0666286592
-0.1499030617 -0.1358782748 -0.0645356888
-0.1477609863 -0.1927180489 -0.0521942840
-0.0944022660 -0.1184480276 -0.1019213063
0.0577014352 0.1428821293 -0.0977084346
0.2061706086 -0.1069646276 -0.1542628877
0.2048525287 -0.1071142726 -0.1605863121
-0.1463652733 0.2633057241 0.1391564063
-0.2385137673 -0.3850099193 -0.1075265342
-0.1883187004 -0.3793111458 0.1332818720
0.0556405524 -0.1069955653 -0.1352505151
0.0542565904 -0.1071526900 -0.1418900059
-0.0776052335 0.1335939629 -0.0907528175
-0.1209234198 -0.1183801932 -0.0964442546
0.2111519707 0.2602092476 0.0647073612
0.3566512488 0.2080542505 -0.0199897656
0.0259948432 0.0670957052 -0.1546525340
0.3179726028 0.2357461566 0.0039806703
0.2814360455 0.2315980684 -0.1713016960
0.3185238246 0.1069029584 0.0459543631
0.0568917674 0.1485785049 -0.1079812909
-0.0836223480 0.2771242576 0.1570844828
-0.2780141772 -0.4702074506 -0.0909436104
-0.2780644170 -0.4903298916 -0.0904569371
-0.2295757043 -0.4647081078 0.1414376206
-0.2296259441 -0.4848305487 0.1419242939
0.0084373905 0.1116525459 0.2641596822
-0.1015467213 0.3985811904 0.0911952841
-0.1104096317 -0.1779043845 -0.0715277919
-0.1103722058 -0.1631595061 -0.0718814658
0.3727420253 0.0418160222 0.0140249881
-0.1055695199 -0.1397078708 -0.1179921957
-0.0864692054 0.1412161620 -0.0983710074
-0.4806750254 -0.4902044524 -0.0482269404
-0.4798835921 -0.1732135709 -0.0558935551
-0.4322365525 -0.4847051096 0.1841542907
-0.4314451192 -0.1677142280 0.1764876760
-0.0597132044 0.2100265707 -0.1063426554
-0.0610312843 0.2098769258 -0.1126660798
-0.2066399779 0.1477099280 -0.0751802452
-0.3058854194 0.1509175423 -0.0796278245
-0.3045903065 0.1510645797 -0.0734145825
-0.2197012280 0.1413256972 -0.0260449030
-0.0938355929 -0.1498283327 -0.0967452835
-0.1521329791 0.0664351283 -0.0738367827
0.4151712895 -0.2071717043 -0.2414577167
0.4152215266 -0.1870503352 -0.2419443641
0.4636098717 -0.2016723490 -0.0090759609
0.4636601089 -0.1815509800 -0.0095626083
0.0270287652 0.2060780522 -0.1243300559
0.0257106854 0.2059284072 -0.1306534804
0.0503936117 0.1390950680 -0.1268441142
-0.0203203712 0.1329348496 -0.1383439098
-0.3602312260 -0.0128583172 0.1512314567
-0.3967677833 -0.0170064054 -0.0240509097
0.0600537302 0.1139922275 -0.1340760213
-0.2531559692 -0.0077266032 -0.0651729689
-0.2567328740 -0.0081326983 -0.0823329967
-0.1044089196 0.1137842285 -0.1203639398
0.0313911923 0.3712079319 0.0847203160
0.0766980792 -0.0295135449 -0.1551051250
0.0779931922 -0.0293665074 -0.1488918830
-0.1017492102 0.0886734279 -0.0956991346
0.0441756146 0.1288581604 -0.1305353022
0.3900000802 -0.2243750718 -0.0320506220
0.3982097536 -0.2234430068 0.0073348890
-0.2822991446 0.2484652826 0.1288027129
-0.3188357019 0.2443171944 -0.0464796534
0.0378162214 -0.1477352970 -0.1288515806
0.0389878096 -0.1498033052 -0.1231513234
-0.1434103098 0.0877241738 0.2677074651
-0.1149560629 0.1216751409 -0.1000611989
-0.1177840052 0.1203229685 -0.0994550695
-0.1134274672 -0.1171345185 -0.0628793119
0.2960714381 -0.0022427997 0.0968899066
0.2675185668 0.3507472489 -0.0115797833
0.2264198915 0.3460812119 -0.2087486906
-0.1141961929 0.1370816729 -0.0616305831
0.0029831914 0.1294000844 -0.1117155758
0.0484462199 -0.1512304186 -0.1309828744
0.4100097263 0.0096488974 -0.0098532841
0.3734731690 0.0055008092 -0.1851356505
-0.0875978737 0.1497374582 -0.0674392872
0.2326783158 -0.0744420773 0.1931517414
0.0241659274 0.3683366112 0.0789553207
0.0311355384 0.1027800784 -0.1260222213
-0.1185135654 0.1200296564 -0.0869132999
0.0832275411 0.3925604327 -0.1929929185
0.1334226081 0.3982592062 0.0478154876
-0.1071400860 0.4163633102 0.0919403704
0.1872953764 -0.3915861673 0.0503260311
0.1872636423 -0.4042965441 0.0506334392
0.1398821010 -0.3969691168 -0.1771368643
0.1398503669 -0.4096794937 -0.1768294562
-0.3833588279 0.0178984748 0.1387883518
-0.3042108108 0.1232450626 0.1532036156
-0.0880054124 0.1291440980 -0.1009614482
-0.0158799547 0.1616655826 -0.0728678647
-0.0148885363 0.1616527662 -0.0681070475
-0.0158868558 0.1589890684 -0.0728041815
-0.0148948165 0.1592249287 -0.0680493788
-0.0033718705 0.1619231173 -0.1054953188
0.4573199320 -0.0977841277 -0.2126907474
0.4543637890 -0.0981197461 -0.2268727004
-0.1975932884 -0.3703549997 -0.1067141456
-0.1456689033 -0.3644598923 0.1423905808
0.0631540824 0.1239971603 -0.1374156739
-0.0900269947 0.1435705334 -0.0561142795
0.2467640338 -0.1554148849 0.1107925835
-0.0007179310 0.1644743707 -0.0858976415
-0.0890268236 0.0853184194 -0.1311110500
-0.1223755416 -0.1495895102 -0.0895508499
-0.1235469741 -0.1475204128 -0.0952503984
0.2506998522 0.1435171911 -0.1043866380
-0.1291912336 -0.4069853721 -0.1297941072
-0.0789961667 -0.4012865986 0.1110142989
-0.2205344537 0.1186194659 -0.0253327796
0.0419430759 -0.1230651166 -0.1244272643
-0.2589772962 0.3411290406 -0.0937746985
-0.2209185164 0.3454499506 0.0888104571
-0.0722502367 0.1057493623 -0.1085124656
-0.1158858422 0.1282415193 -0.0808932698
-0.0750728227 0.1043967263 -0.1078806009
-0.0290302045 0.1111762309 -0.1179333749
0.0922790530 -0.0970717508 0.2516228883
-0.1671587199 -0.1521400016 0.1969947965
-0.4986819201 -0.1166718027 -0.0071108865
-0.5000000000 -0.1168214477 -0.0134343110
0.1354832209 -0.2680890879 0.1243158121
0.0655394050 -0.1225221760 -0.1306284642
-0.2862498173 -0.0078494177 -0.0798312683
-0.2867677883 -0.2153111082 -0.0748136828
-0.2896640291 -0.0082370418 -0.0962107845
-0.2901820002 -0.2156987324 -0.0911931990
0.3206044546 0.1019340236 0.0456382590
-0.0940218333 0.1186442335 -0.1226438593
-0.0899142406 0.1191105790 -0.1029378819
-0.1890804231 0.3804675695 -0.1092752354
-0.1510216433 0.3847884794 0.0733099201
0.4178772265 0.0141335330 -0.0281353967
-0.3552467487 0.2766869452 -0.0721828753
-0.2998884440 0.2829719142 0.1933959143
0.0806812100 0.1327106240 -0.0898277467
-0.2561487342 0.1094959094 0.1656800462
-0.1028586251 0.1350788878 -0.0500111921
-0.3939783818 0.2147157690 -0.0893134827
-0.3437833149 0.2204145424 0.1514949235
0.1976201788 0.1497550347 -0.1132325273
-0.1095130352 0.0733465035 -0.0790565131
-0.0366247032 0.1424680912 -0.1105519373
-0.1713704299 0.1584746674 -0.0203691032
-0.0215681683 0.1582493875 -0.0691188568
-0.0215570602 0.1626109002 -0.0692232927
-0.1022782815 -0.1510891912 -0.0995950014
0.0816414883 0.1363986810 -0.0885003665
-0.0339972984 0.1432249335 -0.1125569422
-0.3537718093 -0.0129520007 0.1498872471
-0.3903083665 -0.0171000888 -0.0253951193
-0.1565540232 0.3937193183 0.0757986612
-0.1976526985 0.3890532813 -0.1213702461
0.3229394947 0.1083258415 0.0523381836
-0.0881684096 0.1341551556 -0.1061113892
-0.2270513960 -0.3648266038 -0.1103934384
-0.1768563290 -0.3591278303 0.1304149677
-0.1038429275 -0.4004520541 0.1105831773
0.0758630385 0.1199651094 -0.1274312572
-0.2300613387 0.0077269869 0.2446889282
-0.2494468984 0.0744946508 -0.0678918829
-0.2530238032 0.0740885557 -0.0850519107
0.1870770248 0.3716433106 0.0046932643
0.1459783495 0.3669772736 -0.1924756430
0.0451949565 0.2147117914 0.2253886450
0.4972596987 -0.1074457888 -0.2149272747
0.4959416188 -0.1075954338 -0.2212506991
-0.1190969124 0.1257437163 -0.0911988696
-0.3225192158 0.2586819637 0.1405664142
-0.1076384658 0.3772301224 0.0893485000
-0.1441750230 0.3730820343 -0.0859338663
0.1150167775 0.0716706442 -0.1296485270
-0.2251855016 0.1085221590 -0.0059285523
-0.0362523717 0.3188608931 0.1222283186
0.0716048377 -0.1194784970 -0.1191427299
-0.0045956978 0.1617460672 -0.0711245931
-0.0052401095 0.1616621897 -0.0742157391
-0.0046024625 0.1591242190 -0.0710622320
-0.0052468179 0.1590628510 -0.0741539225
-0.0090331279 0.1473072048 -0.1228728827
0.2202677952 0.3359567722 -0.1935480588
0.2583265750 0.3402776821 -0.0109629032
-0.4464684576 0.0179685014 -0.0470456400
-0.3911101529 0.0242534703 0.2185331497
-0.4031406543 0.0169871488 -0.0560538366
-0.3477823496 0.0232721178 0.2095249530
0.0562149679 0.0890983233 -0.1309140458
0.0448992116 -0.1408393561 -0.1493312566
0.3578927874 0.2422912980 -0.0008734960
0.3701792964 -0.2125720269 -0.0281984198
0.3783889698 -0.2116399618 0.0111870913
0.2116745775 0.1055083661 -0.0838899546
-0.0429635971 0.1079206060 -0.0933190674
-0.0218011925 0.4307770487 -0.1720047123
0.0283938745 0.4364758221 0.0688036938
0.0604754678 -0.1307201042 -0.1322440719
0.0865157484 0.3803893257 -0.1667197516
0.1418740531 0.3866742947 0.0988590381
-0.0890389519 0.1411706041 -0.0562634364
0.0684339057 0.1169913907 -0.1332826892
0.1690063516 0.3384091357 0.0494735381
0.0675239291 -0.1500518254 -0.1303480159
-0.0408274990 0.1150137023 -0.1152927634
-0.0407613174 0.1477397125 -0.1161588085
-0.0031166026 0.1305458235 -0.1104706767
-0.1038550115 0.1375003180 -0.0498608049
0.0506619722 0.1199117981 0.2551627650
-0.2226172420 0.0967548418 -0.0082220200
0.1084354037 0.0356587357 -0.1120597504
0.1053664221 0.0353124496 -0.1267831185
-0.3211777786 0.2108894762 0.1212325307
-0.2127624686 -0.0332860043 -0.0729878839
-0.2163393734 -0.0336920994 -0.0901479117
-0.0008437292 0.1576717815 -0.0858506640
0.2138318772 0.1180421438 -0.0976654776
-0.1128856005 -0.1294119379 -0.0961403799
-0.2354712004 0.2501517369 0.1358730831
0.2316998929 0.1569266728 -0.1781947943
0.2303159309 0.1567695481 -0.1848342851
0.0707571031 0.0735308468 -0.1166377614
0.1606430275 0.0064370308 0.2349232745
-0.3868661282 0.0012938723 0.1600702765
-0.0180636489 0.1472475993 -0.1210368797
0.4059226886 -0.0105337639 -0.2507174899
0.4561177555 -0.0048349904 -0.0099090837
-0.2689349956 -0.2934535418 0.1069351938
-0.2607253222 -0.2925214767 0.1463207049
0.3644221408 0.1159937401 0.0213417025
0.2904534909 0.2484721707 0.0336259937
-0.2050353980 -0.0809033492 -0.0691662084
-0.2063534779 -0.0810529941 -0.0754896328
0.2917425656 -0.1101638660 0.0880071613
0.1570958987 0.3683819406 0.0343756045
0.1205593415 0.3642338525 -0.1409067619
-0.2283447005 0.1196234746 -0.0699909169
-0.0237828446 0.1579725353 -0.0712602405
-0.3240036313 -0.2572487396 0.1530854229
-0.0317921809 0.1232830387 -0.1357244873
-0.3249081000 0.1611200116 -0.0622724350
-0.3262920620 0.1609628869 -0.0689119258
0.0297136343 0.2105093386 -0.1293000321
0.0261367295 0.2101032435 -0.1464600599
0.2379477107 -0.1487562667 0.1124727158
0.0891870691 0.4150703934 -0.1947678485
0.1393821360 0.4207691669 0.0460405576
0.0425390062 -0.1134823210 -0.1135509689
-0.1658124780 0.1747177984 -0.0833913103
-0.1671305578 0.1745681534 -0.0897147347
0.0825880351 0.1320064465 -0.1226488512
-0.1718315708 0.4139709098 -0.1136635176
-0.1164732660 0.4202558788 0.1519152720
-0.3436927396 0.2183784622 -0.0732113587
-0.2883344349 0.2246634311 0.1923674310
-0.2646161707 0.1338871807 0.0032612677
-0.2095276659 0.1116057565 0.2379504979
-0.2308247990 0.1269313167 -0.0233856159
-0.1025720764 0.0880346032 -0.0846814592
-0.4053588937 0.0014010348 0.1639224465
-0.0988940048 0.0901402844 -0.0977246042
-0.4471427095 -0.0216975182 -0.0459663929
-0.3917844048 -0.0154125493 0.2196123968
-0.4038149063 -0.0226788708 -0.0549745895
-0.3484566015 -0.0163939018 0.2106042001
-0.1116498988 0.1168284873 -0.0943079345
0.1527733225 0.3010281447 0.0832490624
-0.1832472737 0.3003054471 0.1311394313
-0.0162399972 0.1236642699 -0.1184006277
-0.1029116577 -0.1023752751 -0.1023105985
-0.1042956197 -0.1025323998 -0.1089500893
-0.0998259890 0.1393968202 -0.0548428235
-0.1053762862 0.1328765935 -0.0536586774
0.1521193629 -0.0365935089 0.2377183065
0.0210974525 -0.1419546209 -0.1048648340
0.0209643954 -0.1943806157 -0.1036072745
0.0218310626 -0.1372013946 -0.1015143041
0.0239731818 -0.1940411637 -0.0891726894
0.3002154015 0.2088775153 -0.2072053044
0.3555737062 0.2151624842 0.0583734852
0.3695842972 0.0971060089 -0.2456902845
0.4197793641 0.1028047823 -0.0048818784
0.1930787302 0.2005044474 -0.0973331764
-0.0078538270 0.1124842667 -0.1172286234
-0.1172907387 0.1352389196 -0.0713583093
-0.0712066937 -0.1412299031 -0.0844286502
-0.0713397727 -0.1936559004 -0.0831711955
-0.0704731055 -0.1364766793 -0.0810782251
-0.0683310300 -0.1933164534 -0.0687368203
0.0520487508 0.1046552561 -0.1527590296
-0.3799982636 -0.1999777306 -0.0824137595
-0.3380128700 -0.1952110222 0.1190091356
0.0459636568 0.1336557858 -0.1338874727
-0.1398645960 -0.0331907223 -0.0962452450
-0.1412485580 -0.0333478471 -0.1028847357
0.0286713427 0.3210820825 0.1013037865
0.0251372512 -0.2898416771 0.1478315461
0.0827941649 -0.0314091468 -0.1426992886
0.0814102029 -0.0315662715 -0.1493387793
0.3329795066 -0.2054981127 -0.2308990557
0.3749649002 -0.2007314043 -0.0294761606
-0.1189354930 -0.1228555559 -0.0909074731
-0.1200820746 -0.1182600704 -0.0965790874
0.1584762137 0.4143279257 0.0366224147
-0.1012226917 0.0920307691 -0.1021483496
-0.3599844065 0.0141078099 0.1505418505
-0.3965209637 0.0099597218 -0.0247405159
-0.1040498711 0.0906776117 -0.1015385215
0.0459614402 0.1334243652 -0.1340106980
-0.0408285926 0.1150563898 -0.1155677588
-0.0987862600 0.1393943589 -0.0500923214
-0.0057054632 0.1146121687 -0.1225930641
-0.0056420157 0.1473378685 -0.1234722262
0.3773681016 0.0424998779 0.0203835354
-0.0949991764 0.1414489719 -0.0558788840
-0.1141662767 0.1371521804 -0.0615946660
-0.2105949560 0.1924931035 -0.0130057072
-0.0992927209 0.0902524358 -0.0985387646
-0.0868308346 0.1417495363 -0.0577299631
-0.0065797692 0.1095709476 -0.1054051161
-0.0277907139 0.2649040949 -0.1402925086
-0.0264956009 0.2650511324 -0.1340792667
-0.1064379728 -0.1133001660 -0.0492044709
-0.0895324398 0.1479751230 -0.0872031733
0.0830766299 0.1318910568 -0.1228018656
0.0455728709 0.1334872047 -0.1339802703
-0.0850874376 -0.2663812746 0.1702520263
-0.0884576109 0.1489026196 -0.0777005199
-0.0877850177 0.1492255545 -0.0778483602
-0.0032767546 0.1627425897 -0.0757712918
0.1281182549 -0.0729388292 0.2435813119
0.0431911036 0.1351490963 -0.1333602277
0.0439717615 -0.1223576134 -0.1261394516
0.0432747804 0.1376966297 -0.1210552016
-0.0328217562 0.1994911357 0.2420109600
0.2148473367 0.2627127016 0.0712168484
0.2237951033 -0.1880375895 0.1547180801
0.2053686452 -0.0971669158 -0.1601876203
0.2024125022 -0.0975025342 -0.1743695733
-0.1113428085 0.1308608617 -0.0621876911
-0.0300840076 0.1647623425 -0.0798161401
-0.0939666683 0.1414446192 -0.0511629848
0.1152428691 -0.2386541113 0.1401772519
0.1654183930 0.1538637628 -0.1528787729
0.0498957000 0.0756462352 -0.1598389554
0.1100450454 -0.3336565388 -0.1315328562
0.1099843096 -0.3579829010 -0.1309445085
0.1430662491 -0.3299075577 0.0268847714
0.1430055133 -0.3542339198 0.0274731191
-0.0389318284 0.1304602244 -0.1050244496
-0.1534638910 -0.3912368955 -0.1154184799
-0.1015395058 -0.3853417881 0.1336862465
0.2821971777 0.1077993997 0.1355434836
-0.2561286093 -0.0862985864 -0.0842608991
-0.2522417396 -0.0858487276 -0.0656141400
0.0545437133 0.1472914689 -0.1172264726
0.0219522544 -0.1653416055 -0.1483115112
0.0219160561 -0.1800852730 -0.1479519869
0.2326756588 0.3039828591 0.0443557658
-0.1119943845 0.1168685299 -0.0976988665
-0.2618415521 0.1307722308 -0.0008575487
0.2014949107 0.1309829067 -0.0954001565
0.1776370134 0.1410471550 -0.1551225828
0.3311633543 0.0347866288 0.0450263747
-0.0898006309 0.1396216159 -0.0976388565
0.3572851331 -0.2067356051 -0.2294020152
0.3573353702 -0.1866142361 -0.2298886626
0.4057237153 -0.2012362499 0.0029797406
0.4057739525 -0.1811148808 0.0024930932
0.3832755129 -0.0103577865 -0.2460009866
0.4334705799 -0.0046590130 -0.0051925804
-0.3062796049 0.1182398586 0.1537532924
0.3625756999 0.2158083622 -0.1600485112
0.3293124754 0.1974671860 -0.2396709299
0.3795075423 0.2031659595 0.0011374762
-0.1502821742 0.2597047003 0.1400580796
0.3910778625 -0.1238013068 -0.2449426786
0.4412729295 -0.1181025334 -0.0041342724
0.1068283201 -0.3937638331 -0.1696150286
0.1587527053 -0.3878687258 0.0794896978
0.0575511204 0.1482230255 -0.1081103166
0.2295781320 -0.4964364173 -0.1961274676
0.2299360865 -0.3530657675 -0.1995949728
0.2780166049 -0.4909370744 0.0362537634
0.2783745594 -0.3475664247 0.0327862582
-0.1037908383 0.0597803662 -0.0799245009
-0.3079455973 0.1191104909 0.1614200591
-0.0823632227 0.3849224739 0.0838979865
-0.1188997800 0.3807743858 -0.0913843799
-0.1527013244 0.0696134508 -0.0701071545
0.0407982602 -0.1184718280 -0.1301008380
-0.4149699311 0.1031806359 -0.0822984216
-0.3647748642 0.1088794094 0.1585099846
0.3674448180 0.0097100460 -0.2165052108
0.4228030571 0.0159950075 0.0490732641
-0.0082883510 0.1125487065 -0.1180236735
0.0838826583 0.1354534987 -0.0932922516
-0.1061065139 0.1255734716 -0.1021740324
0.0490036608 -0.1403708432 -0.1296246752
0.2230066918 0.1271613685 -0.0997937207
0.1673046494 0.1668480318 -0.0891210607
-0.3535249897 0.0140141265 0.1491976408
-0.3900615469 0.0098660384 -0.0260847255
-0.1783858373 -0.2019763149 0.1881753630
0.1019404796 0.3579492311 0.0629905968
-0.2243701782 0.1307847576 -0.0066264455
0.1754041221 -0.0713732132 -0.1745569593
0.1792909703 -0.0709319294 -0.1559099929
0.1612885416 -0.0705505585 -0.1457692356
0.1599704617 -0.0707002035 -0.1520926600
0.1231263546 0.1982841064 0.2095330769
0.0445629104 0.1291479411 -0.1271610990
-0.0347563204 0.2382322175 0.1601580835
-0.4155490420 -0.1115320122 -0.0770964967
-0.3653539751 -0.1058332388 0.1637119095
-0.2175455190 0.1335979643 -0.0725728694
0.0834759061 0.1315270487 -0.1228225776
0.1386083830 0.2559482814 0.1619677367
0.3053613557 -0.2978991212 -0.0126682283
0.3135710290 -0.2969670561 0.0267172828
0.5000000000 0.4834296056 -0.2294816446
0.4986819201 0.4832799606 -0.2358050690
-0.0880665705 -0.1172263363 -0.0534591554
-0.0879527991 -0.1134350349 -0.0530500206
-0.0439007428 0.1080651922 -0.0975926689
0.0475561878 0.0915999261 -0.1334281561
0.0857072422 0.1328893690 -0.1136251818
0.2331074099 0.0848093391 0.1892935864
-0.0811434005 0.0975184874 -0.1067415631
0.0663381126 0.1409109153 -0.0854172525
0.0432212872 -0.1643440533 -0.1052692821
0.0431850889 -0.1790877208 -0.1049097577
-0.0395067520 -0.2480497203 0.1726562304
0.4314027262 -0.4970758073 -0.2381814617
0.4321941595 -0.1800849257 -0.2458480764
0.4798411990 -0.4915764644 -0.0058002306
0.4806326323 -0.1745855829 -0.0134668453
0.1166124437 0.0749945552 -0.1263719952
0.0474549772 -0.1173334317 -0.0964019157
0.0523907681 0.0075210942 0.2676397012
-0.0872512468 -0.1792173470 -0.1238231854
-0.0872138236 -0.1644735405 -0.1241768333
-0.1095715237 -0.4183353882 0.1122004811
-0.1927741770 0.3788665799 0.0837000276
-0.2364667749 0.3739060483 -0.1259130978
-0.1862717080 0.3796048218 0.1148953083
-0.2338728524 0.3742005429 -0.1134688797
0.0657061022 0.1452642473 -0.0897400129
-0.0039844776 0.1581169165 -0.0727809367
-0.0039733695 0.1624784293 -0.0728853725
0.0647625269 0.1404175012 -0.0866908818
0.0286923780 0.1043936715 -0.1232814096
-0.1053404170 0.1378112231 -0.0511722661
0.4107795930 0.0094189459 -0.2255311956
0.4661378321 0.0157039074 0.0400472792
-0.3000277663 -0.0296584948 -0.0765754533
-0.2987326533 -0.0295114573 -0.0703622114
-0.1527236661 -0.1851227469 0.2331321775
-0.1351518115 -0.4294954321 -0.1280189560
-0.0849567446 -0.4237966586 0.1127894502
0.3135424535 0.2666673332 -0.2113508546
0.3689007582 0.2729523021 0.0542279350
0.0672651839 -0.1188016380 -0.1356394839
0.1016814509 0.3147496642 0.0935741342
0.1777574071 0.1409197635 -0.1551446634
-0.2275292677 0.1418860857 -0.0706882854
0.0563459158 -0.1409276993 -0.1517136290
0.0297666400 0.0813085208 -0.1557776109
-0.1949657937 0.1476268433 -0.0131541839
0.2298371450 -0.3286747600 -0.2064846523
0.2718225386 -0.3239080517 -0.0050617572
0.4430326078 -0.4954886708 -0.2374320693
0.4454124918 0.4577205629 -0.2604860066
0.4387859233 -0.4959708077 -0.2578053327
0.4411658073 0.4572384260 -0.2808592701
-0.0932567341 -0.1230435051 -0.0962494734
0.2923500639 0.1150778633 0.0825501467
-0.4684873656 -0.4687724755 -0.0512745765
-0.4685376054 -0.4888949165 -0.0507879032
-0.4200488927 -0.4632731327 0.1811066546
-0.4200991325 -0.4833955736 0.1815933279
-0.1169910993 -0.1298804430 -0.1158467427
-0.0877127793 0.2980667236 0.1334470294
-0.0867727098 0.1421704107 -0.0872836884
-0.0876283510 0.1497226812 -0.0674325847
0.0370951112 0.0972461308 -0.1313839647
-0.0241635500 -0.4452020874 -0.1507820922
0.0260315170 -0.4395033139 0.0900263140
-0.1197660980 -0.1228253828 -0.0907212487
-0.2060692483 0.1589651221 -0.0293038475
0.2167631870 -0.0116389859 -0.1845916292
0.2162452160 -0.2191006764 -0.1795740437
0.2133489752 -0.0120266100 -0.2009711454
0.2128310042 -0.2194883006 -0.1959535599
-0.3741586477 0.2029127319 -0.0931654663
-0.3239635808 0.2086115053 0.1476429398
0.0997619768 0.3113474399 0.0867157426
-0.3215597258 0.0478945843 0.1586041708
-0.0363409148 0.1127030812 -0.1112994544
-0.0899098491 0.1476384043 -0.0870626356
0.0667797237 0.1431963350 -0.0887908434
-0.0890253415 0.1338798077 -0.1058774993
-0.1780160890 0.3004852173 0.1227046637
-0.2623219681 0.0067486935 0.2007318315
0.1821979250 0.1659326041 -0.1104006961
0.3729083212 0.2532412772 -0.0042625271
0.4238016750 0.0218865728 -0.1681941164
-0.3255111511 0.3049268262 -0.1057199266
-0.2753160841 0.3106255997 0.1350884796
0.2102052668 0.1365540742 -0.1155434103
-0.0106495962 0.1589500625 -0.0738763096
-0.0096587135 0.1616129159 -0.0692148538
-0.0096647751 0.1591851032 -0.0691561357
-0.0106426950 0.1616265767 -0.0739399928
-0.3232259369 0.0487651918 0.1662698881
-0.1057658997 0.3709078707 0.0891077921
-0.1423024569 0.3667597826 -0.0861745743
-0.0381023429 0.2488692570 0.1606038144
-0.1014389183 -0.1295002836 -0.0985228572
-0.4169272537 0.0293247199 0.1455085114
-0.0300598146 0.1648178335 -0.0797808658
0.0416017103 0.1094856772 -0.1506968150
0.2851393942 -0.0021475778 0.0991663721
0.2483887972 0.0050636729 0.1879954682
-0.4938410860 -0.1205372012 -0.0144180695
-0.4976398455 -0.0844791040 -0.0339623898
-0.4937529759 -0.0840292452 -0.0153156308
-0.4977279530 -0.1209859881 -0.0330648545
-0.0355810949 0.1621699628 -0.0987913944
0.1563086855 0.3848253592 -0.1813726500
0.1943674654 0.3891462691 0.0012125056
0.2247792490 0.3553611320 -0.0027802174
0.1810866511 0.3504006004 -0.2123933428
0.2312817181 0.3560993739 0.0284150634
0.1836805737 0.3506950950 -0.1999491247
0.1796434912 0.1539050845 -0.0913878166
-0.0054042330 0.1147853303 -0.1229409571
-0.1142163372 0.3365307314 0.1085540605
0.4455615998 0.4420509320 -0.2230150856
0.4426054568 0.4417153136 -0.2371970386
-0.0870150431 -0.1111417445 -0.0684192805
-0.0847427860 0.1297010083 -0.1002141797
-0.2749447717 0.1924018634 0.1528067818
-0.0663968553 -0.1793744586 -0.1281664401
-0.0663594320 -0.1646306520 -0.1285200880
0.1745931419 0.1629829801 -0.1550073308
-0.4110200693 0.0147301457 0.0059964925
-0.0203454960 0.1231957649 -0.1381069905
0.3385309039 0.2174772010 0.0001277539
0.3019943467 0.2133291128 -0.1751546124
-0.1003023738 0.1142516537 -0.1006577697
-0.2433994516 -0.0051374051 -0.0629624661
-0.2436944089 -0.1232759524 -0.0601052145
-0.2447175315 -0.0052870501 -0.0692858906
-0.2450124888 -0.1234255974 -0.0664286389
0.0455011910 0.1183541436 -0.1517201695
-0.0347438400 -0.0097441978 -0.1322113395
-0.0352618110 -0.2172058884 -0.1271937540
-0.0381580518 -0.0101318220 -0.1485908556
-0.0386760228 -0.2175935125 -0.1435732702
0.0850468395 0.1332448563 -0.1134959375
0.1005274088 -0.1425530254 -0.1214073703
0.1003943517 -0.1949790202 -0.1201498108
0.1012610189 -0.1377997991 -0.1180568404
0.1034031381 -0.1946395682 -0.1057152257
-0.2361421716 0.2527663346 0.1432900768
-0.0241005606 -0.4220752007 -0.1513425238
0.0260945064 -0.4163764273 0.0894658823
-0.0998419609 -0.1393746096 0.2640002371
-0.1119842056 -0.1184464167 -0.0983039314
-0.0874773824 0.1406747580 -0.0549634745
0.2149883825 0.1469934155 -0.1881079771
0.2162834955 0.1471404529 -0.1818947351
0.0367865596 0.2774191707 0.1826837722
0.0404470763 -0.1185964638 -0.1300576620
0.2106697252 0.1401021314 -0.0975283995
0.1868117623 0.1501663723 -0.1572511407
0.1372549668 -0.2461923155 0.1741330940
-0.2552787358 0.3354769060 -0.0944118824
-0.2172199560 0.3397978159 0.0881732731
-0.0337579418 0.1635263102 -0.0894396455
0.0664764071 -0.1186684193 -0.1354454642
0.0593968186 0.0893211047 -0.1355647265
0.0035610311 0.1074032843 -0.1074669496
-0.2650334958 -0.4927101428 -0.0931168254
-0.2646755413 -0.3493394931 -0.0965843306
-0.2165950229 -0.4872108000 0.1392644057
-0.2162370684 -0.3438401502 0.1357969005
-0.0701830481 0.1038729478 -0.1026470466
0.3714239058 -0.2626894261 0.0082564815
0.0694252205 0.1152285912 -0.1354690925
-0.4611893738 -0.4903512522 -0.0522851335
-0.4603979405 -0.1733603707 -0.0599517482
-0.4127509010 -0.4848519094 0.1800960976
-0.4119594677 -0.1678610278 0.1724294829
-0.0892759919 -0.1192634538 -0.0856182151
-0.3089880974 -0.2462987604 0.1496963918
0.1319996863 0.3769007606 0.0394051599
0.0954631290 0.3727526725 -0.1358772064
-0.1840612612 0.1617377480 -0.0157611053
0.0757317201 0.1252737502 -0.1318035368
-0.0045762220 0.1485016725 -0.1113394990
-0.1189774114 0.1338660539 -0.0806694255
-0.0033177178 0.1555159971 -0.1049982738
-0.1772639277 0.2141662433 0.1780934206
0.1721035304 0.3413823019 0.0560965980
0.0394085477 0.1348155024 -0.1151717789
-0.2822739518 -0.4925802577 -0.0895262296
-0.2819159973 -0.3492096080 -0.0929937348
-0.2338354789 -0.4870809149 0.1428550015
-0.2334775245 -0.3437102652 0.1393874963
-0.4046019817 -0.1997870131 -0.0772897755
-0.3626165882 -0.1950203047 0.1241331196
-0.1286617363 0.0650002542 -0.0748664703
0.0543639905 0.1287421773 -0.1356981339
0.0928405326 0.1109995243 0.2465818077
-0.1328698897 0.4167895114 -0.1485220915
-0.0826748228 0.4224882848 0.0922863147
-0.1040779475 0.0907387566 -0.1018070146
0.1527476175 0.3964445916 0.0382397184
0.0590836049 -0.1513115980 -0.1331969377
0.1764792452 0.1759672317 -0.0912503531
0.0532610747 0.0499709753 -0.1162676535
-0.1037151516 -0.1004112841 -0.1158212624
-0.1024200386 -0.1002642466 -0.1096080204
0.0566296244 0.0908150236 -0.1350117722
0.0697304757 -0.1479788510 -0.1354942077
0.0709020859 -0.1500468567 -0.1297938456
-0.0000270508 0.1484674003 -0.1122869353
0.4037419695 -0.0173361838 -0.0079082011
0.3672054123 -0.0214842719 -0.1831905675
-0.2050547867 0.1557774902 -0.0112440803
-0.0958276636 -0.1222994680 -0.0970146090
-0.1031404435 0.0912129231 -0.0809519360
-0.0706471072 0.2168232429 -0.1085298575
-0.0742240120 0.2164171478 -0.1256898853
0.1126327267 -0.4085794458 -0.1704743083
0.1645571118 -0.4026843385 0.0786304182
0.0759845623 0.1363461091 -0.0864687372
-0.0394809636 0.1129744073 -0.1092741504
0.0493871379 -0.1186648613 -0.1319184500
0.0416706811 0.1335947139 -0.1156144169
0.2930516664 0.1695899711 0.0497803824
-0.2851965334 -0.3098887044 0.1107137548
-0.2769868600 -0.3089566394 0.1500992659
-0.2575696100 0.1110924902 0.1732774446
-0.0735903645 0.1024063333 -0.1041718397
0.2076257164 -0.0289248676 -0.1687784672
0.2062417545 -0.0290819923 -0.1754179580
-0.1182927849 -0.1190514472 -0.0795817578
-0.1683628136 0.1588184000 -0.0059350328
-0.0330137419 0.1635207036 -0.0895946368
-0.0349523272 0.1621508077 -0.0988533137
-0.1374961529 0.0317358750 -0.0760571558
-0.0036388585 0.1298887649 -0.1123708203
-0.2978862794 0.2267716466 0.1325651413
-0.3344228367 0.2226235585 -0.0427172250
0.0599334290 0.0872915561 -0.1293597724
0.0760619906 0.1385405977 -0.0914667303
0.2587201544 0.2124513675 0.0559222575
-0.4968336225 0.4970758073 -0.0220205986
-0.4981517024 0.4969261623 -0.0283440231
-0.0087647811 0.1473617679 -0.1228064230
-0.0088290160 0.1146359788 -0.1219310386
-0.0414263398 0.1489112045 -0.1036651563
-0.2715533699 0.0381353835 0.1705798095
-0.1662774851 0.1549929911 0.1895427519
-0.2167300862 0.1558605753 -0.0732702378
0.0461249720 0.0614323424 -0.1587139663
0.2816367477 -0.1002718833 0.1405843456
-0.0862307153 0.1291954866 -0.1033540759
0.1869321587 0.1500400527 -0.1572732472
0.1935924132 -0.0018738337 -0.1541280305
0.1922743333 -0.0020234787 -0.1604514550
0.0253320163 0.3717616882 0.0859713056
0.3630876309 0.1220589958 0.0214774333
-0.3547462044 0.2223157212 0.1279526903
0.3916891556 0.1029603511 -0.2504364536
0.4418842226 0.1086591246 -0.0096280475
-0.1999453649 0.2150214421 0.1514675109
-0.2732195810 0.0390059910 0.1782455268
-0.3488392386 0.2077211221 -0.0115603780
-0.0891362966 0.1447026014 -0.0547130034
0.0542054125 0.1474661395 -0.1170901941
0.1854251048 0.1434315748 -0.1105408915
-0.0978629020 0.1371524865 -0.0502317356
0.3360038783 0.1888077962 0.0255432568
-0.3531739287 -0.2186218396 0.1227233884
-0.3449642553 -0.2176897746 0.1621088994
0.1285473490 0.0863125871 0.2397231569
-0.2255568740 0.3534222050 0.0911355296
-0.2666555493 0.3487561680 -0.1060333777
-0.0084494142 0.1421292988 -0.1198775844
0.0871175318 0.0536535807 -0.1195745280
-0.0916319712 -0.1477531660 -0.1018898219
-0.0904605168 -0.1498222610 -0.0961901684
-0.0918171148 0.0924118996 -0.1043985820
-0.1345504238 0.4249516620 -0.1216944104
-0.0791921191 0.4312366310 0.1438843793
-0.1599659160 -0.4056864596 -0.1137212203
-0.1080415308 -0.3997913523 0.1353835061
0.0490298352 -0.1306317664 -0.1298618132
0.1265127791 0.1626647156 -0.1440395172
0.1251946992 0.1625150706 -0.1503629417
0.1991507791 0.1372234449 -0.1595170571
-0.2133706269 0.1956069895 -0.0088866462
-0.0516359574 -0.0350166656 0.2801525638
0.0283563041 0.1062408217 -0.1297789986
0.1882633203 0.1404549581 -0.1110620583
0.1791503319 -0.3679715014 -0.1949893260
0.2293453988 -0.3622727280 0.0458190801
0.0604503457 -0.1404581170 -0.1320071785
-0.0848771704 0.1435223176 -0.0679973569
-0.0359547404 0.1621583596 -0.0986445454
0.2362416231 0.3755455194 -0.0056471476
0.1925490252 0.3705849878 -0.2152602729
0.2427440921 0.3762837612 0.0255481332
0.1951429477 0.3708794824 -0.2028160549
0.0738696512 -0.1113504277 -0.1019465042
0.1883164989 -0.1416055465 0.2039881312
-0.2071933209 -0.0772292488 -0.0946797377
-0.2033064539 -0.0767804619 -0.0760329527
-0.2155848895 0.0018209059 0.2034454288
0.1984955934 -0.1063293318 -0.1785429952
0.2023824417 -0.1058880480 -0.1598960287
-0.2196094070 0.0970985991 0.0062130997
0.2465968046 0.1403029175 -0.1070694957
-0.1509533668 0.2623182013 0.1474740499
-0.0375370127 0.1475250739 -0.1169401902
-0.1129107253 -0.1391510226 -0.0959034605
-0.1147900604 0.1215528589 -0.1002220713
-0.0990484929 0.1548876430 0.2568710753
-0.2588989924 0.1050923235 0.1736954458
-0.0337496969 0.1100799901 -0.0997566027
0.3597971142 0.1153098765 0.0149829366
-0.2171928193 0.1445707416 -0.0266445603
-0.2832985327 -0.3201343649 -0.0997267101
-0.2413131392 -0.3153676565 0.1016961850
0.1888183057 0.1630243092 -0.0935160597
0.1523524009 0.0495974607 0.2356300067
-0.1141967539 0.1371374034 -0.0615879635
0.0798925302 0.1177909479 -0.1282197287
-0.0752984558 0.1346988658 -0.0912597992
0.1504514113 -0.4025886528 0.0576276116
0.1688840776 -0.0676708655 -0.1517260920
0.1653071728 -0.0680769606 -0.1688861198
-0.0278309055 -0.0717317920 0.2760594136
-0.0276615792 0.1334906259 -0.1162551488
-0.0461942973 0.3623645546 0.0937639125
0.1518908904 -0.3755390491 -0.1794393437
0.2038152755 -0.3696439417 0.0696653827
-0.0804906593 0.3785991503 0.0836573044
-0.1170272165 0.3744510622 -0.0916250619
-0.3784500778 0.2449790949 -0.0665959088
-0.3230917731 0.2512640639 0.1989828808
-0.2046538951 0.0017256919 0.2011691819
0.0425876754 -0.1192567610 -0.1131031393
-0.2455541149 -0.1214269503 -0.0661513806
-0.2494409845 -0.1218768091 -0.0847981397
0.1185878420 -0.2492911429 0.1397317396
0.1551455219 0.1653672341 -0.0885881252
0.0544492930 -0.1134948809 -0.0827303702
0.0543357377 -0.1172872294 -0.0831384297
-0.0081410955 0.1471718026 -0.1231021776
0.3575842771 -0.2056877662 -0.2360232842
0.3995696706 -0.2009210578 -0.0346003891
-0.0883903952 0.1412330123 -0.0531726462
0.3673772515 -0.0299648318 -0.2155522139
0.4227354906 -0.0236798703 0.0500262609
-0.3186489126 -0.0318438081 -0.0590106022
-0.3200328746 -0.0320009329 -0.0656500929
0.1371779146 0.4093938482 -0.1779663732
0.1925362193 0.4156788171 0.0876124164
-0.1044952245 0.1374164089 -0.0529528254
0.2242301819 0.3413796869 -0.1945023287
0.2622889617 0.3457005969 -0.0119171732
0.2065917236 0.2629544439 0.0655929518
0.1591069418 0.3746406333 0.0338083015
0.1225703846 0.3704925452 -0.1414740648
0.1614259005 -0.0281471436 -0.1468013515
0.1601078206 -0.0282967885 -0.1531247760
-0.1814214292 0.3585060218 0.0818154516
-0.2251140271 0.3535454902 -0.1277976738
-0.1749189601 0.3592442636 0.1130107324
-0.2225201045 0.3538399848 -0.1153534557
0.0561552773 0.1051237507 -0.1330529904
0.0816687140 0.1311009609 -0.0926006823
-0.2042756261 -0.0301073417 -0.0705266748
-0.2055937059 -0.0302569867 -0.0768500992
0.3491956270 0.2089625367 -0.2440874931
0.3993906940 0.2146613102 -0.0032790869
0.2033765083 -0.0040378499 -0.1604217187
0.1997996035 -0.0044439450 -0.1775817465
0.0640777780 -0.1645011806 -0.1096129739
0.0640415797 -0.1792448481 -0.1092534496
-0.0072336849 0.1535517220 -0.1151790993
0.0824956448 0.1366512281 -0.0902981143
-0.1055443952 -0.1299687862 -0.1182291150
0.2335821215 0.2973982789 0.0369825401
0.0749483352 0.1361221747 -0.0911784587
-0.0395291693 0.1127608455 -0.1092402049
0.2974675579 0.1710139510 0.0561652263
-0.0450273801 0.3657885270 0.1007786554
-0.0876569596 0.2950129927 0.1261686526
-0.2352757657 0.1166717170 -0.0040192536
-0.2510316731 -0.1119912118 -0.0643327114
-0.2541356134 -0.1123436100 -0.0792237148
0.0044058106 0.1072604658 -0.1031741367
-0.1096439903 0.1187916194 -0.0962117201
0.0078759135 -0.0964176573 0.2692007369
-0.0870487221 -0.1173266852 -0.0683677776
-0.2735228489 0.1908042028 0.1452091907
-0.0032649578 0.1578158681 -0.0755311722
-0.0395877425 0.1539295759 -0.1084391022
-0.0386425722 0.1311190411 -0.1030756707
0.4107120265 -0.0302559319 -0.2245781988
0.4660702656 -0.0239709704 0.0410002761
0.1166068348 0.2370211416 0.1286360026
0.0645070744 0.0896530785 -0.1158566351
0.1199922510 0.2476278344 0.1276793237
-0.4376528481 -0.1173852905 -0.0723505721
-0.3874577812 -0.1116865171 0.1684578341
0.3289541034 0.2048872373 -0.1527752676
0.0805510509 0.1340304624 -0.0882181226
0.4467779673 -0.1091795447 -0.2302285151
0.4468691151 -0.0726723154 -0.2311114643
0.4506648155 -0.1087382610 -0.2115815486
0.4507559634 -0.0722310317 -0.2124644979
0.2291248006 -0.2051310736 0.1033068743
0.0559471844 0.1135248022 -0.1537821914
-0.0893867843 0.1436533706 -0.0530222331
0.0712110461 0.1197947961 -0.1389444883
-0.0408259404 0.1440477085 -0.0986658632
0.0789970332 0.1235115968 -0.1324424700
-0.1036825525 0.1337833877 -0.0514225185
0.2812182318 0.3002294015 -0.2320778595
0.3314132988 0.3059281750 0.0087305466
0.0769945662 0.1385380433 -0.0867311389
-0.2399844654 0.0702859171 -0.0654592057
-0.2413025452 0.0701362721 -0.0717826302
0.0634921579 0.1409117094 -0.0890484435
-0.2284906322 0.1720747430 0.1657729504
-0.1173958070 -0.1221424632 -0.0925277235
-0.0433786825 0.1440669402 -0.0981342146
-0.0301245035 0.1578965569 -0.0797569638
0.1233311498 0.3675289086 -0.1740893570
0.1786894545 0.3738138775 0.0914894326
0.3902728453 0.2189753754 -0.0272630092
0.0550932835 0.1469867417 -0.1172639205
-0.0651469346 0.2575261967 0.2044019680
0.0353214699 -0.2660863615 0.1958513158
-0.1229395367 0.0514351888 -0.0757344840
-0.4513093487 -0.1089488530 -0.0230282122
-0.4542654917 -0.1092844714 -0.0372101652
-0.1017947485 0.0888887281 -0.0957152241
-0.1082821313 0.4245528259 -0.0831371239
-0.0806029602 0.4276677729 0.0496533569
-0.1083737430 0.3884728893 -0.0822718587
-0.0806945727 0.3915875148 0.0505186299
-0.1035071818 0.1350164796 -0.0531019823
-0.0890039532 0.1480721313 -0.0872617284
0.1891099668 0.1526567062 0.1968589694
-0.1957801714 0.1506532544 -0.0312518420
0.3332647005 0.2136837530 0.0013152350
0.2967281433 0.2095356649 -0.1739671313
0.0294727705 0.3678067715 0.0778616798
-0.2132381458 -0.0758197863 -0.0718821624
-0.2168150506 -0.0762258814 -0.0890421902
0.0868290762 0.1348573774 -0.1034453983
-0.1379078760 -0.3317885265 -0.0798927647
-0.1379686118 -0.3561148886 -0.0793044171
-0.1048866724 -0.3280395453 0.0785248628
-0.1049474082 -0.3523659075 0.0791132105
-0.1081734227 0.0769732261 -0.1269214704
-0.0851529449 0.1358546461 -0.0942444706
-0.2384348115 0.1277730501 -0.0680808837
0.0869061972 -0.4312144508 -0.1742649342
0.1371012642 -0.4255156773 0.0665434719
-0.0848662307 0.0536880697 -0.0721785148
-0.0879352502 0.0533353498 -0.0869018322
-0.0374182419 0.3154358409 0.1152133831
-0.0720588628 0.1060574690 -0.1088352851
0.0809928834 0.1363169789 -0.0915906900
0.0729340105 -0.1136373027 -0.0865778371
0.0728204578 -0.1174285793 -0.0869859225
-0.1455917441 0.3733617018 0.0739954065
-0.1866904194 0.3686956648 -0.1231735008
0.0298369914 0.3245060380 0.1083176987
0.0867808025 0.1349492627 -0.1034648989
-0.0833056763 0.0717522900 -0.1319788192
0.0799119437 0.1339690549 -0.0913109061
0.0719441743 0.1192521434 -0.1391332140
-0.0366644817 0.1128983251 -0.1121291641
-0.1591207912 0.0082184236 0.2728637383
-0.1180831248 0.1143602986 -0.0818595090
0.3252294813 0.1026178873 0.0519970249
0.1003635615 0.4222537215 -0.1705969734
0.1557218662 0.4285386904 0.0949818162
-0.3076377434 0.2474681598 0.1377298373
0.0473042720 0.1355224683 -0.1218436730
0.1038589041 0.3613514634 0.0698492070
-0.1706409878 0.1762611734 -0.0867268247
-0.1742178926 0.1758550783 -0.1038868525
0.1947830129 0.1527316435 -0.1127115791
-0.4917313796 -0.4884464038 -0.0427527830
-0.4893514956 0.4647628299 -0.0658067203
-0.4959780641 -0.4889285407 -0.0631260464
-0.4935981801 0.4642806930 -0.0861799838
0.1924597146 -0.0269266344 -0.1792961628
0.1937548276 -0.0267795970 -0.1730829208
0.3141828383 0.0022854043 0.0806684893
3 1102 964 1188
3 964 1102 200
3 200 35 964
3 200 806 35
3 1102 455 1143
3 1102 1143 208
3 208 200 1102
3 200 208 145
3 1196 1105 443
3 1105 173 756
3 756 443 1105
3 173 85 756
3 944 1129 443
3 443 756 17
3 17 944 443
3 735 17 756
3 1188 964 1105
3 1105 1196 1188
3 964 35 173
3 173 1105 964
3 35 806 85
3 85 173 35
3 806 200 756
3 756 85 806
3 200 145 735
3 735 756 200
3 145 208 17
3 17 735 145
3 208 1143 944
3 944 17 208
3 1143 455 1129
3 1129 944 1143
3 455 1102 443
3 443 1129 455
3 1102 1188 1196
3 1196 443 1102
3 631 717 201
3 201 1013 631
3 1197 103 963
3 963 62 1197
3 631 1013 791
3 791 920 631
3 920 791 731
3 731 407 920
3 407 731 103
3 103 1197 407
3 1013 201 25
3 25 791 1013
3 791 25 139
3 139 731 791
3 731 139 963
3 963 103 731
3 201 717 210
3 210 25 201
3 25 210 507
3 507 139 25
3 139 507 62
3 62 963 139
3 717 631 920
3 920 210 717
3 210 920 407
3 407 507 210
3 507 407 1197
3 1197 62 507
3 614 661 278
3 278 364 614
3 661 241 305
3 305 278 661
3 241 753 1146
3 1146 305 241
3 1137 896 254
3 254 630 1137
3 630 254 63
3 63 1194 630
3 1194 63 1092
3 1092 702 1194
3 614 364 896
3 896 1137 614
3 364 278 254
3 254 896 364
3 278 305 63
3 63 254 278
3 305 1146 1092
3 1092 63 305
3 1146 753 702
3 702 1092 1146
3 753 241 1194
3 1194 702 753
3 241 661 630
3 630 1194 241
3 661 614 1137
3 1137 630 661
3 598 352 135
3 135 637 598
3 352 1154 989
3 989 135 352
3 386 757 912
3 912 947 386
3 947 912 238
3 238 171 947
3 598 637 251
3 251 223 598
3 223 251 757
3 757 386 223
3 637 135 639
3 639 251 637
3 135 989 321
3 321 639 135
3 251 639 912
3 912 757 251
3 639 321 238
3 238 912 639
3 989 1154 686
3 686 321 989
3 321 686 171
3 171 238 321
3 1154 352 1205
3 1205 686 1154
3 352 598 223
3 223 1205 352
3 686 1205 947
3 947 171 686
3 1205 223 386
3 386 947 1205
3 105 906 1139
3 1139 67 105
3 906 556 722
3 722 1139 906
3 494 156 279
3 279 258 494
3 258 279 1174
3 1174 31 258
3 105 67 888
3 888 931 105
3 931 888 156
3 156 494 931
3 67 1139 1047
3 1047 888 67
3 1139 722 732
3 732 1047 1139
3 888 1047 279
3 279 156 888
3 1047 732 1174
3 1174 279 1047
3 722 556 866
3 866 732 722
3 732 866 31
3 31 1174 732
3 556 906 466
3 466 866 556
3 906 105 931
3 931 466 906
3 866 466 258
3 258 31 866
3 466 931 494
3 494 258 466
3 988 620 408
3 620 988 758
3 758 577 620
3 758 1079 577
3 988 1136 647
3 988 647 616
3 616 758 988
3 758 616 513
3 506 292 876
3 292 263 1140
3 1140 876 292
3 263 1165 1140
3 264 1072 876
3 876 1140 991
3 991 264 876
3 445 991 1140
3 408 620 292
3 292 506 408
3 620 577 263
3 263 292 620
3 577 1079 1165
3 1165 263 577
3 1079 758 1140
3 1140 1165 1079
3 758 513 445
3 445 1140 758
3 513 616 991
3 991 445 513
3 616 647 264
3 264 991 616
3 647 1136 1072
3 1072 264 647
3 1136 988 876
3 876 1072 1136
3 988 408 506
3 506 876 988
3 231 571 363
3 363 924 231
3 462 1187 199
3 199 847 462
3 231 924 1002
3 1002 703 231
3 703 1002 734
3 734 22 703
3 22 734 1187
3 1187 462 22
3 924 363 566
3 566 1002 924
3 1002 566 209
3 209 734 1002
3 734 209 199
3 199 1187 734
3 363 571 1114
3 1114 566 363
3 566 1114 397
3 397 209 566
3 209 397 847
3 847 199 209
3 571 231 703
3 703 1114 571
3 1114 703 22
3 22 397 1114
3 397 22 462
3 462 847 397
3 1036 267 422
3 422 665 1036
3 267 378 645
3 645 422 267
3 378 178 578
3 578 645 378
3 807 976 789
3 789 629 807
3 629 789 1018
3 1018 12 629
3 12 1018 624
3 624 217 12
3 1036 665 976
3 976 807 1036
3 665 422 789
3 789 976 665
3 422 645 1018
3 1018 789 422
3 645 578 624
3 624 1018 645
3 578 178 217
3 217 624 578
3 178 378 12
3 12 217 178
3 378 267 629
3 629 12 378
3 267 1036 807
3 807 629 267
3 372 169 475
3 475 373 372
3 169 55 908
3 908 475 169
3 623 1160 1200
3 1200 216 623
3 216 1200 621
3 621 1046 216
3 372 373 613
3 613 610 372
3 610 613 1160
3 1160 623 610
3 373 475 387
3 387 613 373
3 475 908 590
3 590 387 475
3 613 387 1200
3 1200 1160 613
3 387 590 621
3 621 1200 387
3 908 55 133
3 133 590 908
3 590 133 1046
3 1046 621 590
3 55 169 253
3 253 133 55
3 169 372 610
3 610 253 169
3 133 253 216
3 216 1046 133
3 253 610 623
3 623 216 253
3 229 670 333
3 333 225 229
3 670 805 1166
3 1166 333 670
3 952 894 1048
3 1048 313 952
3 313 1048 790
3 790 383 313
3 229 225 421
3 421 423 229
3 423 421 894
3 894 952 423
3 225 333 248
3 248 421 225
3 333 1166 634
3 634 248 333
3 421 248 1048
3 1048 894 421
3 248 634 790
3 790 1048 248
3 1166 805 633
3 633 634 1166
3 634 633 383
3 383 790 634
3 805 670 1180
3 1180 633 805
3 670 229 423
3 423 1180 670
3 633 1180 313
3 313 383 633
3 1180 423 952
3 952 313 1180
3 755 819 484
3 819 755 453
3 453 398 819
3 453 14 398
3 755 483 817
3 755 817 399
3 399 453 755
3 453 399 13
3 486 816 754
3 816 400 452
3 452 754 816
3 400 16 452
3 818 485 754
3 754 452 401
3 401 818 754
3 15 401 452
3 484 819 816
3 816 486 484
3 819 398 400
3 400 816 819
3 398 14 16
3 16 400 398
3 14 453 452
3 452 16 14
3 453 13 15
3 15 452 453
3 13 399 401
3 401 15 13
3 399 817 818
3 818 401 399
3 817 483 485
3 485 818 817
3 483 755 754
3 754 485 483
3 755 484 486
3 486 754 755
3 191 59 1119
3 1119 511 191
3 59 958 1019
3 1019 1119 59
3 1198 945 1149
3 1149 1138 1198
3 1138 1149 228
3 228 826 1138
3 191 511 510
3 510 190 191
3 190 510 945
3 945 1198 190
3 511 1119 970
3 970 510 511
3 1119 1019 886
3 886 970 1119
3 510 970 1149
3 1149 945 510
3 970 886 228
3 228 1149 970
3 1019 958 957
3 957 886 1019
3 886 957 826
3 826 228 886
3 958 59 259
3 259 957 958
3 59 191 190
3 190 259 59
3 957 259 1138
3 1138 826 957
3 259 190 1198
3 1198 1138 259
3 20 450 1106
3 1106 615 20
3 1069 842 123
3 123 294 1069
3 20 615 424
3 424 45 20
3 45 424 265
3 265 530 45
3 530 265 842
3 842 1069 530
3 615 1106 804
3 804 424 615
3 424 804 589
3 589 265 424
3 265 589 123
3 123 842 265
3 1106 450 456
3 456 804 1106
3 804 456 53
3 53 589 804
3 589 53 294
3 294 123 589
3 450 20 45
3 45 456 450
3 456 45 530
3 530 53 456
3 53 530 1069
3 1069 294 53
3 1034 834 115
3 115 262 1034
3 834 646 1150
3 1150 115 834
3 646 101 543
3 543 1150 646
3 487 998 909
3 909 402 487
3 402 909 521
3 521 79 402
3 79 521 1118
3 1118 635 79
3 1034 262 998
3 998 487 1034
3 262 115 909
3 909 998 262
3 115 1150 521
3 521 909 115
3 1150 543 1118
3 1118 521 1150
3 543 101 635
3 635 1118 543
3 101 646 79
3 79 635 101
3 646 834 402
3 402 79 646
3 834 1034 487
3 487 402 834
3 968 1101 40
3 40 618 968
3 1101 214 152
3 152 40 1101
3 701 236 24
3 24 33 701
3 33 24 410
3 410 287 33
3 968 618 617
3 617 969 968
3 969 617 236
3 236 701 969
3 618 40 934
3 934 617 618
3 40 152 257
3 257 934 40
3 617 934 24
3 24 236 617
3 934 257 410
3 410 24 934
3 152 214 213
3 213 257 152
3 257 213 287
3 287 410 257
3 214 1101 907
3 907 213 214
3 1101 968 969
3 969 907 1101
3 213 907 33
3 33 287 213
3 907 969 701
3 701 33 907
3 1039 655 291
3 291 730 1039
3 293 500 28
3 28 1120 293
3 1039 730 500
3 500 293 1039
3 730 291 28
3 28 500 730
3 291 655 1120
3 1120 28 291
3 655 1039 293
3 293 1120 655
3 625 960 122
3 122 889 625
3 118 1113 379
3 379 512 118
3 625 889 1113
3 1113 118 625
3 889 122 379
3 379 1113 889
3 122 960 512
3 512 379 122
3 960 625 118
3 118 512 960
3 880 143 370
3 370 369 880
3 768 932 933
3 933 58 768
3 880 369 380
3 380 946 880
3 946 380 926
3 926 246 946
3 246 926 932
3 932 768 246
3 369 370 249
3 249 380 369
3 380 249 509
3 509 926 380
3 926 509 933
3 933 932 926
3 370 143 638
3 638 249 370
3 249 638 430
3 430 509 249
3 509 430 58
3 58 933 509
3 143 880 946
3 946 638 143
3 638 946 246
3 246 430 638
3 430 246 768
3 768 58 430
3 501 923 922
3 501 502 923
3 502 1 923
3 502 7 1
3 7 0 1
3 7 6 0
3 6 922 0
3 6 501 922
3 923 1089 751
3 923 1 1089
3 0 750 1088
3 0 922 750
3 751 126 814
3 751 1089 126
3 1088 813 125
3 1088 750 813
3 813 447 446
3 813 814 447
3 814 801 447
3 814 126 801
3 126 800 801
3 126 125 800
3 125 446 800
3 125 813 446
3 446 159 158
3 446 447 159
3 447 698 159
3 447 801 698
3 801 697 698
3 801 800 697
3 800 158 697
3 800 446 158
3 158 299 298
3 158 159 299
3 159 180 299
3 159 698 180
3 698 179 180
3 698 697 179
3 697 298 179
3 697 158 298
3 298 1127 1126
3 298 299 1127
3 299 720 1127
3 299 180 720
3 180 719 720
3 180 179 719
3 179 1126 719
3 179 298 1126
3 1127 175 994
3 1127 720 175
3 994 534 950
3 994 175 534
3 950 464 310
3 950 534 464
3 309 765 764
3 309 310 765
3 310 416 765
3 310 464 416
3 464 415 416
3 464 463 415
3 463 764 415
3 463 309 764
3 764 793 792
3 764 765 793
3 765 873 793
3 765 416 873
3 416 872 873
3 416 415 872
3 415 792 872
3 415 764 792
3 792 1183 1182
3 792 793 1183
3 793 141 1183
3 793 873 141
3 873 140 141
3 873 872 140
3 872 1182 140
3 872 792 1182
3 1182 107 106
3 1182 1183 107
3 1183 1016 107
3 1183 141 1016
3 141 1015 1016
3 141 140 1015
3 140 106 1015
3 140 1182 106
3 107 725 47
3 107 1016 725
3 47 498 366
3 47 725 498
3 366 149 683
3 366 498 149
3 498 148 149
3 682 532 531
3 682 683 532
3 683 676 532
3 683 149 676
3 149 675 676
3 149 148 675
3 148 531 675
3 148 682 531
3 531 984 983
3 531 532 984
3 532 587 984
3 532 676 587
3 676 586 587
3 676 675 586
3 675 983 586
3 675 531 983
3 983 1096 1095
3 983 984 1096
3 984 680 1096
3 984 587 680
3 587 679 680
3 587 586 679
3 586 1095 679
3 586 983 1095
3 1095 1142 1141
3 1095 1096 1142
3 1096 297 1142
3 1096 680 297
3 680 296 297
3 680 679 296
3 679 1141 296
3 679 1095 1141
3 1142 839 1022
3 1142 297 839
3 296 1021 838
3 296 1141 1021
3 1022 389 552
3 1022 839 389
3 838 551 388
3 838 1021 551
3 551 502 501
3 551 552 502
3 552 7 502
3 552 389 7
3 389 6 7
3 389 388 6
3 388 501 6
3 388 551 501
3 750 922 460
3 752 750 460
3 749 751 814
3 751 749 923
3 460 922 923
3 923 749 459
3 460 923 459
3 1088 1090 0
3 1090 1088 125
3 1087 1089 1
3 1087 1 1191
3 1191 1 0
3 1191 0 1192
3 0 1090 1192
3 813 750 752
3 814 813 997
3 813 752 997
3 749 814 996
3 997 996 814
3 126 1089 1087
3 125 126 88
3 126 1087 88
3 89 1090 125
3 88 89 125
3 749 1087 459
3 1191 459 1087
3 459 1191 460
3 1090 752 460
3 460 1192 1090
3 1192 460 1191
3 1087 749 996
3 996 88 1087
3 89 997 752
3 752 1090 89
3 997 88 996
3 997 89 88
3 1021 1141 377
3 1023 1021 377
3 1020 1022 552
3 1022 1020 1142
3 377 1141 1142
3 1142 1020 376
3 377 1142 376
3 840 838 388
3 838 840 296
3 839 297 837
3 837 297 239
3 239 297 296
3 239 296 240
3 296 840 240
3 551 1021 1023
3 552 551 100
3 551 1023 100
3 99 1020 552
3 100 99 552
3 389 839 470
3 388 389 470
3 471 840 388
3 837 470 839
3 470 471 388
3 1020 837 376
3 239 376 837
3 376 239 377
3 840 1023 377
3 377 240 840
3 240 377 239
3 837 1020 99
3 471 100 1023
3 1023 840 471
3 99 470 837
3 100 471 99
3 99 471 470
3 993 994 950
3 994 993 1127
3 1126 917 719
3 917 1126 1127
3 1127 993 918
3 917 1127 918
3 175 720 174
3 174 720 597
3 596 720 719
3 596 597 720
3 596 719 917
3 949 950 310
3 949 993 950
3 175 533 534
3 174 533 175
3 309 226 310
3 949 310 227
3 226 227 310
3 464 534 533
3 463 464 1043
3 464 533 1043
3 1042 463 1043
3 463 1042 309
3 309 1042 226
3 993 174 918
3 597 918 174
3 918 597 917
3 917 597 596
3 993 533 174
3 993 949 533
3 533 949 227
3 227 1043 533
3 227 226 1043
3 1043 226 1042
3 46 47 366
3 47 46 107
3 106 18 1015
3 18 106 107
3 107 46 19
3 18 107 19
3 725 1016 724
3 724 1016 776
3 776 1016 1015
3 1015 775 776
3 775 1015 18
3 365 366 683
3 365 46 366
3 498 725 724
3 497 498 724
3 682 1070 683
3 365 683 1071
3 1070 1071 683
3 148 498 606
3 498 497 606
3 148 605 682
3 606 605 148
3 682 605 1070
3 46 724 19
3 776 19 724
3 19 776 18
3 18 776 775
3 724 46 365
3 365 497 724
3 497 365 1071
3 1071 606 497
3 1070 605 1071
3 1071 605 606
3 1214 361 362
3 1214 362 1215
3 361 93 94
3 361 94 362
3 93 929 930
3 93 930 94
3 929 36 37
3 929 37 930
3 36 761 762
3 36 762 37
3 761 341 342
3 761 342 762
3 341 626 627
3 341 627 342
3 626 877 878
3 626 878 627
3 877 1214 1215
3 877 1215 878
3 36 341 761
3 36 626 341
3 36 877 626
3 36 1214 877
3 36 361 1214
3 929 361 36
3 93 361 929
3 37 762 342
3 37 342 627
3 37 627 878
3 37 878 1215
3 37 1215 362
3 930 37 362
3 94 930 362
3 967 727 726
3 967 726 966
3 727 474 473
3 727 473 726
3 474 307 306
3 474 306 473
3 307 715 714
3 307 714 306
3 715 1086 1085
3 715 1085 714
3 1086 979 978
3 1086 978 1085
3 979 151 150
3 979 150 978
3 151 1009 1008
3 151 1008 150
3 1009 351 350
3 1009 350 1008
3 351 339 338
3 351 338 350
3 339 555 554
3 339 554 338
3 555 1145 1144
3 555 1144 554
3 1145 859 857
3 1145 857 1144
3 859 1094 1093
3 859 1093 857
3 1094 538 537
3 1094 537 1093
3 538 860 858
3 538 858 537
3 860 428 427
3 860 427 858
3 428 967 966
3 428 966 427
3 727 307 474
3 727 715 307
3 860 967 428
3 859 538 1094
3 859 860 538
3 859 967 860
3 1145 967 859
3 555 967 1145
3 555 727 967
3 339 727 555
3 351 727 339
3 1009 727 351
3 151 727 1009
3 715 979 1086
3 727 979 715
3 151 979 727
3 726 473 306
3 726 306 714
3 858 427 966
3 857 1093 537
3 857 537 858
3 857 858 966
3 1144 857 966
3 554 1144 966
3 554 966 726
3 338 554 726
3 350 338 726
3 1008 350 726
3 150 1008 726
3 714 1085 978
3 726 714 978
3 150 726 978
3 954 604 603
3 954 603 953
3 604 312 311
3 604 311 603
3 312 576 575
3 312 575 311
3 576 600 599
3 576 599 575
3 600 1076 1075
3 600 1075 599
3 1076 547 546
3 1076 546 1075
3 547 165 164
3 547 164 546
3 165 526 525
3 165 525 164
3 526 954 953
3 526 953 525
3 600 547 1076
3 600 165 547
3 600 526 165
3 600 954 526
3 600 604 954
3 576 604 600
3 312 604 576
3 599 1075 546
3 599 546 164
3 599 164 525
3 599 525 953
3 599 953 603
3 575 599 603
3 311 575 603
3 1130 1131 162
3 162 1029 1130
3 1029 162 712
3 712 86 1029
3 1132 1030 163
3 163 1133 1132
3 1030 87 713
3 713 163 1030
3 1130 1029 1030
3 1030 1132 1130
3 1029 86 87
3 87 1030 1029
3 86 712 713
3 713 87 86
3 712 162 163
3 163 713 712
3 162 1131 1133
3 1133 163 162
3 1131 1130 1132
3 1132 1133 1131
3 833 831 659
3 659 1064 833
3 1064 659 97
3 97 1026 1064
3 830 1063 660
3 660 832 830
3 1063 1027 98
3 98 660 1063
3 833 1064 1063
3 1063 830 833
3 1064 1026 1027
3 1027 1063 1064
3 1026 97 98
3 98 1027 1026
3 97 659 660
3 660 98 97
3 659 831 832
3 832 660 659
3 831 833 830
3 830 832 831
3 796 797 862
3 863 862 797
3 862 863 431
3 432 431 863
3 865 799 864
3 798 864 799
3 434 865 433
3 864 433 865
3 863 797 865
3 799 865 797
3 432 863 434
3 865 434 863
3 431 432 433
3 434 433 432
3 862 431 864
3 433 864 431
3 796 862 798
3 864 798 862
3 797 796 799
3 798 799 796
3 390 972 476
3 390 823 972
3 823 108 972
3 823 718 108
3 718 1204 108
3 718 328 1204
3 328 476 1204
3 328 390 476
3 476 1028 565
3 476 972 1028
3 972 1061 1028
3 972 108 1061
3 108 529 1061
3 108 1204 529
3 1204 565 529
3 1204 476 565
3 565 426 544
3 565 1028 426
3 1028 177 426
3 1028 1061 177
3 1061 902 177
3 1061 529 902
3 529 544 902
3 529 565 544
3 544 738 748
3 544 426 738
3 426 272 738
3 426 177 272
3 177 465 272
3 177 902 465
3 902 748 465
3 902 544 748
3 748 1065 247
3 748 738 1065
3 738 648 1065
3 738 272 648
3 272 1049 648
3 272 465 1049
3 465 247 1049
3 465 748 247
3 247 409 895
3 247 1065 409
3 1065 550 409
3 1065 648 550
3 648 207 550
3 648 1049 207
3 1049 895 207
3 1049 247 895
3 895 375 92
3 895 409 375
3 409 828 375
3 409 550 828
3 550 128 828
3 550 207 128
3 207 92 128
3 207 895 92
3 92 215 811
3 92 375 215
3 375 32 215
3 375 828 32
3 828 496 32
3 828 128 496
3 128 811 496
3 128 92 811
3 811 1125 609
3 811 215 1125
3 215 1123 1125
3 215 32 1123
3 32 925 1123
3 32 496 925
3 496 609 925
3 496 811 609
3 609 823 390
3 609 1125 823
3 1125 718 823
3 1125 1123 718
3 1123 328 718
3 1123 925 328
3 925 390 328
3 925 609 390
3 802 710 1171
3 1171 64 802
3 769 56 360
3 360 1206 769
3 802 64 56
3 56 769 802
3 64 1171 360
3 360 56 64
3 1171 710 1206
3 1206 360 1171
3 710 802 769
3 769 1206 710
3 601 385 1054
3 1054 1186 601
3 1193 481 1108
3 1108 980 1193
3 601 1186 481
3 481 1193 601
3 1186 1054 1108
3 1108 481 1186
3 1054 385 980
3 980 1108 1054
3 385 601 1193
3 1193 980 385
3 1109 843 808
3 808 308 1109
3 788 52 61
3 61 90 788
3 1109 308 52
3 52 788 1109
3 308 808 61
3 61 52 308
3 808 843 90
3 90 61 808
3 843 1109 788
3 788 90 843
3 681 256 524
3 524 985 681
3 1033 96 871
3 871 573 1033
3 681 985 96
3 96 1033 681
3 985 524 871
3 871 96 985
3 524 256 573
3 573 871 524
3 256 681 1033
3 1033 573 256
3 189 1117 396
3 396 444 189
3 1147 951 146
3 146 848 1147
3 189 444 951
3 951 1147 189
3 444 396 146
3 146 951 444
3 396 1117 848
3 848 146 396
3 1117 189 1147
3 1147 848 1117
3 260 677 803
3 803 971 260
3 1038 986 820
3 820 692 1038
3 260 971 986
3 986 1038 260
3 971 803 820
3 820 986 971
3 803 677 692
3 692 820 803
3 677 260 1038
3 1038 692 677
3 965 222 1104
3 1104 315 965
3 78 641 211
3 211 536 78
3 965 315 641
3 641 78 965
3 315 1104 211
3 211 641 315
3 1104 222 536
3 536 211 1104
3 222 965 78
3 78 536 222
3 1082 295 508
3 508 206 1082
3 245 572 911
3 911 664 245
3 1082 206 572
3 572 245 1082
3 206 508 911
3 911 572 206
3 508 295 664
3 664 911 508
3 295 1082 245
3 245 664 295
3 669 331 1040
3 1040 435 669
3 230 1201 535
3 535 619 230
3 669 435 1201
3 1201 230 669
3 435 1040 535
3 535 1201 435
3 1040 331 619
3 619 535 1040
3 331 669 230
3 230 619 331
3 320 81 114
3 114 948 320
3 461 1107 992
3 992 981 461
3 320 948 1107
3 1107 461 320
3 948 114 992
3 992 1107 948
3 114 81 981
3 981 992 114
3 81 320 461
3 461 981 81
3 286 845 844
3 286 844 285
3 845 404 403
3 845 403 844
3 404 644 643
3 404 643 403
3 644 1051 1050
3 644 1050 643
3 1051 235 234
3 1051 234 1050
3 235 1098 1097
3 235 1097 234
3 1098 5 4
3 1098 4 1097
3 5 51 50
3 5 50 4
3 51 549 548
3 51 548 50
3 549 941 940
3 549 940 548
3 941 1208 1207
3 941 1207 940
3 1208 469 468
3 1208 468 1207
3 469 358 357
3 469 357 468
3 358 520 519
3 358 519 357
3 520 1173 1172
3 520 1172 519
3 1173 1112 1111
3 1173 1111 1172
3 1112 1159 1158
3 1112 1158 1111
3 1159 286 285
3 1159 285 1158
3 845 644 404
3 845 1051 644
3 1112 286 1159
3 358 1173 520
3 358 1112 1173
3 358 286 1112
3 469 286 358
3 1208 286 469
3 1208 845 286
3 941 845 1208
3 549 845 941
3 51 845 549
3 5 845 51
3 1051 1098 235
3 845 1098 1051
3 5 1098 845
3 844 403 643
3 844 643 1050
3 1111 1158 285
3 357 519 1172
3 357 1172 1111
3 357 1111 285
3 468 357 285
3 1207 468 285
3 1207 285 844
3 940 1207 844
3 548 940 844
3 50 548 844
3 4 50 844
3 1050 234 1097
3 844 1050 1097
3 4 844 1097
3 488 1080 187
3 187 835 488
3 489 836 188
3 188 1081 489
3 488 835 836
3 836 489 488
3 835 187 188
3 188 836 835
3 187 1080 1081
3 1081 188 187
3 1080 488 489
3 489 1081 1080
3 113 112 1164
3 1163 1164 112
3 1161 110 1162
3 111 1162 110
3 1163 112 1161
3 110 1161 112
3 1164 1163 1162
3 1161 1162 1163
3 113 1164 111
3 1162 111 1164
3 112 113 110
3 111 110 113
3 518 987 395
3 852 395 987
3 68 205 825
3 982 825 205
3 852 987 68
3 205 68 987
3 395 852 825
3 68 825 852
3 518 395 982
3 825 982 395
3 987 518 205
3 982 205 518
3 440 34 316
3 1128 316 34
3 678 812 1153
3 60 1153 812
3 1128 34 678
3 812 678 34
3 316 1128 1153
3 678 1153 1128
3 440 316 60
3 1153 60 316
3 34 440 812
3 60 812 440
3 780 778 1213
3 1213 778 1211
3 780 1212 779
3 780 1213 1212
3 780 779 778
3 778 779 777
3 778 777 1210
3 778 1210 1211
3 1213 1210 1212
3 1213 1211 1210
3 1212 777 779
3 1212 1210 777
3 850 221 330
3 330 747 850
3 849 746 329
3 329 220 849
3 850 747 746
3 746 849 850
3 747 330 329
3 329 746 747
3 330 221 220
3 220 329 330
3 221 850 849
3 849 220 221
3 304 153 901
3 901 781 304
3 153 846 1116
3 1116 901 153
3 846 729 728
3 728 1116 846
3 608 607 955
3 955 212 608
3 212 955 374
3 374 142 212
3 142 374 166
3 166 628 142
3 304 781 607
3 607 608 304
3 781 901 955
3 955 607 781
3 901 1116 374
3 374 955 901
3 1116 728 166
3 166 374 1116
3 728 729 628
3 628 166 728
3 729 846 142
3 142 628 729
3 846 153 212
3 212 142 846
3 153 304 608
3 608 212 153
3 696 553 1062
3 1062 418 696
3 553 277 744
3 744 1062 553
3 277 1067 1068
3 1068 744 277
3 887 147 482
3 482 54 887
3 54 482 255
3 255 1024 54
3 1024 255 1190
3 1190 1189 1024
3 696 418 147
3 147 887 696
3 418 1062 482
3 482 147 418
3 1062 744 255
3 255 482 1062
3 744 1068 1190
3 1190 255 744
3 1068 1067 1189
3 1189 1190 1068
3 1067 277 1024
3 1024 1189 1067
3 277 553 54
3 54 1024 277
3 553 696 887
3 887 54 553
3 242 243 1001
3 1001 1000 242
3 314 413 412
3 412 794 314
3 242 1000 454
3 454 196 242
3 196 454 21
3 21 875 196
3 875 21 413
3 413 314 875
3 1000 1001 344
3 344 454 1000
3 454 344 124
3 124 21 454
3 21 124 412
3 412 413 21
3 1001 243 938
3 938 344 1001
3 344 938 1148
3 1148 124 344
3 124 1148 794
3 794 412 124
3 243 242 196
3 196 938 243
3 938 196 875
3 875 1148 938
3 1148 875 314
3 314 794 1148
3 591 593 302
3 302 300 591
3 592 301 303
3 303 594 592
3 591 300 301
3 301 592 591
3 300 302 303
3 303 301 300
3 302 593 594
3 594 303 302
3 593 591 592
3 592 594 593
3 867 869 582
3 582 580 867
3 868 581 583
3 583 870 868
3 867 580 581
3 581 868 867
3 580 582 583
3 583 581 580
3 582 869 870
3 870 583 582
3 869 867 868
3 868 870 869
3 130 736 1099
3 1099 662 130
3 131 663 1100
3 1100 737 131
3 130 662 663
3 663 131 130
3 662 1099 1100
3 1100 663 662
3 1099 736 737
3 737 1100 1099
3 736 130 131
3 131 737 736
3 1007 503 704
3 704 503 1017
3 1007 495 57
3 1007 704 495
3 1007 57 503
3 503 57 290
3 503 290 772
3 503 772 1017
3 704 772 495
3 704 1017 772
3 495 290 57
3 495 772 290
3 523 824 1035
3 1035 824 104
3 523 83 787
3 523 1035 83
3 523 787 824
3 824 787 1103
3 824 1103 332
3 824 332 104
3 1035 332 83
3 1035 104 332
3 83 1103 787
3 83 332 1103
3 1053 127 280
3 280 127 574
3 1053 545 102
3 1053 280 545
3 1053 102 127
3 127 102 353
3 127 353 853
3 127 853 574
3 280 853 545
3 280 574 853
3 545 353 102
3 545 853 353
3 856 437 120
3 120 437 186
3 856 119 359
3 856 120 119
3 856 359 437
3 437 359 436
3 437 436 185
3 437 185 186
3 120 185 119
3 120 186 185
3 119 436 359
3 119 185 436
3 129 356 109
3 109 356 1091
3 129 827 861
3 129 109 827
3 129 861 356
3 356 861 1135
3 356 1135 595
3 356 595 1091
3 109 595 827
3 109 1091 595
3 827 1135 861
3 827 595 1135
3 132 1041 795
3 795 973 132
3 1041 937 266
3 266 795 1041
3 721 340 1168
3 1168 155 721
3 155 1168 905
3 905 774 155
3 132 973 340
3 340 721 132
3 973 795 1168
3 1168 340 973
3 795 266 905
3 905 1168 795
3 266 937 774
3 774 905 266
3 937 1041 155
3 155 774 937
3 1041 132 721
3 721 155 1041
3 343 771 563
3 1181 563 771
3 711 343 1110
3 563 1110 343
3 542 197 417
3 237 417 197
3 417 237 480
3 138 480 237
3 1181 771 542
3 197 542 771
3 563 1181 417
3 542 417 1181
3 1110 563 480
3 417 480 563
3 711 1110 138
3 480 138 1110
3 343 711 237
3 138 237 711
3 771 343 197
3 237 197 343
3 622 1011 561
3 561 666 622
3 451 515 1031
3 1031 956 451
3 622 666 515
3 515 451 622
3 666 561 1031
3 1031 515 666
3 561 1011 956
3 956 1031 561
3 1011 622 451
3 451 956 1011
3 882 448 815
3 815 1010 882
3 448 881 705
3 705 815 448
3 668 82 161
3 161 1014 668
3 1014 161 522
3 522 667 1014
3 882 1010 82
3 82 668 882
3 1010 815 161
3 161 82 1010
3 815 705 522
3 522 161 815
3 705 881 667
3 667 522 705
3 881 448 1014
3 1014 667 881
3 448 882 668
3 668 1014 448
3 1209 977 810
3 851 810 977
3 1044 1209 927
3 810 927 1209
3 649 770 157
3 990 157 770
3 157 990 706
3 841 706 990
3 851 977 649
3 770 649 977
3 810 851 157
3 649 157 851
3 927 810 706
3 157 706 810
3 1044 927 841
3 706 841 927
3 1209 1044 990
3 841 990 1044
3 977 1209 770
3 990 770 1209
3 1032 414 41
3 41 588 1032
3 250 1066 121
3 121 499 250
3 1032 588 1066
3 1066 250 1032
3 588 41 121
3 121 1066 588
3 41 414 499
3 499 121 41
3 414 1032 250
3 250 499 414
3 773 527 224
3 224 650 773
3 317 974 999
3 999 95 317
3 773 650 974
3 974 317 773
3 650 224 999
3 999 974 650
3 224 527 95
3 95 999 224
3 527 773 317
3 317 95 527
3 479 743 1124
3 1124 144 479
3 517 928 176
3 176 516 517
3 479 144 928
3 928 517 479
3 144 1124 176
3 176 928 144
3 1124 743 516
3 516 176 1124
3 743 479 517
3 517 516 743
3 411 449 919
3 919 1179 411
3 1195 198 1157
3 1157 691 1195
3 411 1179 198
3 198 1195 411
3 1179 919 1157
3 1157 198 1179
3 919 449 691
3 691 1157 919
3 449 411 1195
3 1195 691 449
3 564 939 695
3 695 345 564
3 1185 959 218
3 218 1184 1185
3 564 345 959
3 959 1185 564
3 345 695 218
3 218 959 345
3 695 939 1184
3 1184 218 695
3 939 564 1185
3 1185 1184 939
3 70 71 274
3 274 273 70
3 72 275 276
3 276 73 72
3 70 273 275
3 275 72 70
3 273 274 276
3 276 275 273
3 274 71 73
3 73 276 274
3 71 70 72
3 72 73 71
3 890 891 914
3 914 913 890
3 892 915 916
3 916 893 892
3 890 913 915
3 915 892 890
3 913 914 916
3 916 915 913
3 914 891 893
3 893 916 914
3 891 890 892
3 892 893 891
3 897 898 335
3 335 334 897
3 899 336 337
3 337 900 899
3 897 334 336
3 336 899 897
3 334 335 337
3 337 336 334
3 335 898 900
3 900 337 335
3 898 897 899
3 899 900 898
3 324 323 783
3 783 784 324
3 326 786 785
3 785 325 326
3 324 784 786
3 786 326 324
3 784 783 785
3 785 786 784
3 783 323 325
3 325 785 783
3 323 324 326
3 326 325 323
3 739 740 182
3 182 181 739
3 741 183 184
3 184 742 741
3 739 181 183
3 183 741 739
3 181 182 184
3 184 183 181
3 182 740 742
3 742 184 182
3 740 739 741
3 741 742 740
3 75 74 268
3 268 269 75
3 77 271 270
3 270 76 77
3 75 269 271
3 271 77 75
3 269 268 270
3 270 271 269
3 268 74 76
3 76 270 268
3 74 75 77
3 77 76 74
3 687 688 9
3 9 8 687
3 689 10 11
3 11 690 689
3 687 8 10
3 10 689 687
3 8 9 11
3 11 10 8
3 9 688 690
3 690 11 9
3 688 687 689
3 689 690 688
3 346 347 672
3 672 671 346
3 348 673 674
3 674 349 348
3 346 671 673
3 673 348 346
3 671 672 674
3 674 673 671
3 672 347 349
3 349 674 672
3 347 346 348
3 348 349 347
3 438 26 419
3 419 884 438
3 439 885 420
3 420 27 439
3 438 884 885
3 885 439 438
3 884 419 420
3 420 885 884
3 419 26 27
3 27 420 419
3 26 438 439
3 439 27 26
3 1170 855 43
3 43 319 1170
3 1169 318 42
3 42 854 1169
3 1170 319 318
3 318 1169 1170
3 319 43 42
3 42 318 319
3 43 855 854
3 854 42 43
3 855 1170 1169
3 1169 854 855
3 48 49 766
3 766 49 767
3 48 136 584
3 48 766 136
3 48 584 49
3 49 584 585
3 49 585 137
3 49 137 767
3 766 137 136
3 766 767 137
3 136 585 584
3 136 137 585
3 541 1084 203
3 203 904 541
3 540 903 202
3 202 1083 540
3 541 904 903
3 903 540 541
3 904 203 202
3 202 903 904
3 203 1084 1083
3 1083 202 203
3 1084 541 540
3 540 1083 1084
3 1077 1078 1202
3 1202 1078 1203
3 1077 504 1151
3 1077 1202 504
3 1077 1151 1078
3 1078 1151 1152
3 1078 1152 505
3 1078 505 1203
3 1202 505 504
3 1202 1203 505
3 504 1152 1151
3 504 505 1152
3 1058 694 478
3 478 822 1058
3 1057 821 477
3 477 693 1057
3 1058 822 821
3 821 1057 1058
3 822 478 477
3 477 821 822
3 478 694 693
3 693 477 478
3 694 1058 1057
3 1057 693 694
3 1003 1004 557
3 557 1004 558
3 1003 167 116
3 1003 557 167
3 1003 116 1004
3 1004 116 117
3 1004 117 168
3 1004 168 558
3 557 168 167
3 557 558 168
3 167 117 116
3 167 168 117
3 233 368 962
3 962 66 233
3 232 65 961
3 961 367 232
3 233 66 65
3 65 232 233
3 66 962 961
3 961 65 66
3 962 368 367
3 367 961 962
3 368 233 232
3 232 367 368
3 441 442 1059
3 1059 442 1060
3 441 559 29
3 441 1059 559
3 441 29 442
3 442 29 30
3 442 30 560
3 442 560 1060
3 1059 560 559
3 1059 1060 560
3 559 30 29
3 559 560 30
3 1121 1122 759
3 759 1122 760
3 1121 699 1073
3 1121 759 699
3 1121 1073 1122
3 1122 1073 1074
3 1122 1074 700
3 1122 700 760
3 759 700 699
3 759 760 700
3 699 1074 1073
3 699 700 1074
3 936 284 382
3 382 282 936
3 935 281 381
3 381 283 935
3 936 282 281
3 281 935 936
3 282 382 381
3 381 281 282
3 382 284 283
3 283 381 382
3 284 936 935
3 935 283 284
3 490 491 567
3 567 491 568
3 490 569 492
3 490 567 569
3 490 492 491
3 491 492 493
3 491 493 570
3 491 570 568
3 567 570 569
3 567 568 570
3 569 493 492
3 569 570 493
3 708 612 355
3 355 458 708
3 707 457 354
3 354 611 707
3 708 458 457
3 457 707 708
3 458 355 354
3 354 457 458
3 355 612 611
3 611 354 355
3 612 708 707
3 707 611 612
3 394 393 194
3 194 195 394
3 392 193 192
3 192 391 392
3 394 195 193
3 193 392 394
3 195 194 192
3 192 193 195
3 194 393 391
3 391 192 194
3 393 394 392
3 392 391 393
3 1055 1056 684
3 684 1056 685
3 1055 942 38
3 1055 684 942
3 1055 38 1056
3 1056 38 39
3 1056 39 943
3 1056 943 685
3 684 943 942
3 684 685 943
3 942 39 38
3 942 943 39
3 656 657 405
3 405 657 406
3 656 2 1005
3 656 405 2
3 656 1005 657
3 657 1005 1006
3 657 1006 3
3 657 3 406
3 405 3 2
3 405 406 3
3 2 1006 1005
3 2 3 1006
3 514 745 921
3 921 745 995
3 995 745 1045
3 1045 745 528
3 528 745 579
3 579 745 636
3 636 745 425
3 425 745 261
3 261 745 1115
3 1115 745 1052
3 1052 745 1012
3 1012 745 252
3 252 745 219
3 219 745 170
3 170 745 327
3 327 745 514
3 472 514 716
3 716 514 921
3 716 921 1167
3 1167 921 995
3 1167 995 733
3 733 995 1045
3 733 1045 829
3 829 1045 528
3 829 528 384
3 384 528 579
3 384 579 1025
3 1025 579 636
3 1025 636 160
3 160 636 425
3 160 425 288
3 288 425 261
3 288 261 84
3 84 261 1115
3 84 1115 874
3 874 1115 1052
3 874 1052 69
3 69 1052 1012
3 69 1012 1199
3 1199 1012 252
3 1199 252 371
3 371 252 219
3 371 219 1037
3 1037 219 170
3 1037 170 640
3 640 170 327
3 640 327 472
3 472 327 514
3 879 472 723
3 723 472 716
3 723 716 44
3 44 716 1167
3 44 1167 658
3 658 1167 733
3 658 733 289
3 289 733 829
3 289 829 975
3 975 829 384
3 975 384 642
3 642 384 1025
3 642 1025 883
3 883 1025 160
3 883 160 1156
3 1156 160 288
3 1156 288 80
3 80 288 84
3 80 84 763
3 763 84 874
3 763 874 134
3 134 874 69
3 134 69 467
3 467 69 1199
3 467 1199 562
3 562 1199 371
3 562 371 154
3 154 371 1037
3 154 1037 1155
3 1155 1037 640
3 1155 640 879
3 879 640 472
3 204 879 172
3 172 879 723
3 172 723 91
3 91 723 44
3 91 44 782
3 782 44 658
3 782 658 1216
3 1216 658 289
3 1216 289 539
3 539 289 975
3 539 975 1134
3 1134 975 642
3 1134 642 429
3 429 642 883
3 429 883 602
3 602 883 1156
3 602 1156 632
3 632 1156 80
3 632 80 709
3 709 80 763
3 709 763 23
3 23 763 134
3 23 134 809
3 809 134 467
3 809 467 244
3 244 467 562
3 244 562 910
3 910 562 154
3 910 154 322
3 322 154 1155
3 322 1155 204
3 204 1155 879
3 651 653 1175
3 1175 653 1177
3 651 1176 652
3 651 1175 1176
3 651 652 653
3 653 652 654
3 653 654 1178
3 653 1178 1177
3 1175 1178 1176
3 1175 1177 1178
3 1176 654 652
3 1176 1178 654