OFF
1442 2817 0
0.3620816215 0.0457244270 -0.1510433941
-0.3229852117 0.0841026445 0.2580142274
-0.3066391908 0.0841026467 0.2786128088
-0.3445731206 0.0863155617 0.2751453298
-0.3282270997 0.0863155639 0.2957439111
0.0025993139 0.1495061399 -0.1178454284
0.1333647422 0.1495061577 0.0469397708
-0.4876781315 0.0616638721 0.4077753561
-0.4899023375 0.0616638718 0.4049725034
-0.3153023258 -0.0192749031 0.2687032952
-0.3125074536 -0.0195613978 0.2664854221
0.1234651988 0.1404486603 -0.0184359969
0.1493708919 0.1377931388 -0.0389934803
0.3902416217 0.1411051039 -0.1278781613
0.2029790456 0.1226967447 -0.0795125626
0.4241169876 0.1000285018 -0.2549967532
0.2522556183 0.1176455386 -0.1186160262
0.3748404149 0.1050797079 -0.2158932896
0.1403247303 0.0986205617 0.0515351480
0.2081484475 0.0916681387 -0.0022864170
0.3518514718 0.0571961619 -0.1530850882
0.4196751890 0.0502437390 -0.2069066533
0.4028538513 0.0252875128 -0.2479837514
0.2309924820 0.0429045496 -0.1116030245
0.2050857770 0.0455601748 -0.0910447380
0.3769481582 0.0279430342 -0.2274262679
-0.4914633853 0.0646727685 0.4043417712
-0.4874185688 0.0646727691 0.4094388821
0.3936567762 0.0514955429 -0.2629589593
0.2217954069 0.0691125797 -0.1265782324
0.1958887019 0.0717682048 -0.1060199460
0.3677510831 0.0541510643 -0.2424014759
-0.0829586411 0.1254758492 0.1271598770
-0.1246723717 0.1254758435 0.0745939541
0.0402343084 0.1128476784 0.0294000135
-0.0014794222 0.1128476727 -0.0231659094
-0.1689758854 0.1425684879 0.2621882963
-0.1350640268 0.1390922764 0.2352775138
0.3523761177 0.1111044561 -0.1016252124
0.4201998350 0.1041520331 -0.1554467774
0.1698201637 0.1748167390 0.0087672548
-0.2133228057 0.1264565566 0.1877773487
-0.2105289454 0.1261701657 0.1855602786
0.3367662944 0.1178700131 -0.1922641615
-0.1998898061 0.1475080627 0.2573804531
-0.1826186694 0.1457376460 0.2436749288
-0.1718176945 0.1506672962 0.2575609988
-0.1379058358 0.1471910848 0.2306502163
-0.2030765167 0.1623007737 0.2885391286
-0.1499213251 0.1568519810 0.2463577839
0.4505251120 0.0458728971 -0.2461964108
0.3707933366 0.0540459823 -0.1829251967
0.2786637427 0.0634899339 -0.1098156839
0.1989319673 0.0716630191 -0.0465444698
-0.1888547744 0.1848838327 0.2664583145
-0.1715836378 0.1831134160 0.2527527902
-0.0438494962 -0.0517143362 -0.0553413037
0.0619416675 -0.0517143218 0.0779723574
0.3778453209 -0.0949411133 -0.3899775628
0.4836364846 -0.0949410990 -0.2566639016
0.1517652514 -0.0717662665 -0.2105715430
0.2575564152 -0.0717662522 -0.0772578819
0.1822305732 -0.0748891830 -0.2347473234
0.2880217370 -0.0748891686 -0.1014336623
0.2063828294 0.1337875679 -0.0222588570
0.1266510541 0.1419606531 0.0410123570
0.3395863380 0.1027850101 -0.1935970361
0.3888629106 0.0977338041 -0.2327004997
0.1716492996 -0.1473385962 -0.1748300244
0.2272673386 -0.1473385887 -0.1047424656
0.2030071186 -0.1505530001 -0.1997140467
0.2586251576 -0.1505529926 -0.1296264879
0.3672640473 -0.1673905266 -0.3300602637
0.4228820863 -0.1673905191 -0.2599727049
0.0073923709 -0.1305010697 -0.0444838074
0.0630104099 -0.1305010622 0.0256037514
0.0728516219 -0.0386815533 0.0421573327
-0.0064923551 -0.0386815641 -0.0578286745
-0.0967086831 -0.0213003923 0.1767120482
-0.1760526601 -0.0213004031 0.0767260410
0.1835204017 0.1363379036 0.0577741026
0.2094260948 0.1336823821 0.0372166192
-0.1452939886 0.1468551733 0.2818940252
-0.1206551963 0.1443295183 0.2623418919
-0.1858858616 0.1277827323 0.2597263779
0.4540538708 0.0621842684 -0.2480983080
0.3702188344 0.0707779677 -0.1815709479
0.2821925015 0.0798013052 -0.1117175811
0.1983574651 0.0883950045 -0.0451902210
0.3999112819 0.1135476600 -0.1121331099
0.1448024246 0.1309395181 0.0688673538
-0.0161565396 0.1309394963 -0.1339664940
-0.2759715897 0.0050396530 0.1245140128
-0.1659483122 0.0050396679 0.2631608092
-0.2731777294 0.0047532621 0.1222969427
-0.1631544518 0.0047532770 0.2609437390
0.3723504340 0.0776399276 -0.1298939731
0.4401741512 0.0706875047 -0.1837155381
0.3969802891 0.0329699299 -0.1899542741
0.3710735841 0.0356255551 -0.1693959876
-0.1490440964 -0.0085428020 0.2040528355
-0.2145683509 -0.0085428109 0.1214818725
-0.2229594613 -0.0009659410 0.2627084324
-0.2884837159 -0.0009659499 0.1801374694
-0.2575358195 0.1166268405 0.2228626227
-0.2603296798 0.1169132314 0.2250796928
-0.1346806880 -0.0988283691 0.1253708567
-0.1318858157 -0.0991148637 0.1231529836
-0.0163898281 0.1345016123 -0.1337103932
0.1444999368 0.1345016341 0.0690362525
-0.1078359917 -0.0049337722 0.2365994046
-0.2369016465 -0.0049337897 0.0739561899
-0.1106308639 -0.0046472775 0.2388172778
-0.2396965187 -0.0046472950 0.0761740630
-0.1502353803 0.1432727067 0.3026507207
-0.1532679687 0.0036963017 0.1499365131
-0.1628277848 0.0036963004 0.1378896270
-0.2728656318 0.0159559295 0.2448433342
-0.2824254479 0.0159559282 0.2327964481
0.3837931208 0.0316818482 -0.1796318666
-0.2538919852 0.0805961140 0.1368030106
-0.1728997918 0.0805961250 0.2388660321
-0.4881522140 0.0651903130 0.4081515642
-0.4903764200 0.0651903127 0.4053487116
-0.4202414502 0.0627943930 0.3106965495
-0.3800405985 0.0627943984 0.3613560047
-0.4230363224 0.0630808876 0.3129144226
-0.3828354707 0.0630808931 0.3635738778
-0.0222770545 0.1679110296 0.0361728337
-0.0250719268 0.1681975242 0.0383907068
-0.1363992303 0.1779091167 0.2502408665
-0.1493525828 0.1792369293 0.2605200097
0.2423747552 0.0982411741 -0.0267086551
0.4635126972 0.0755729312 -0.2021928456
0.2916513279 0.0931899680 -0.0658121187
0.4142361246 0.0806241373 -0.1630893820
0.3684032015 0.1132596231 -0.1394693017
0.4362269187 0.1063072002 -0.1932908667
0.3740868115 0.0970618773 -0.1302147001
0.4419105287 0.0901094543 -0.1840362651
0.4473253526 0.1050192018 -0.2022419729
0.2754639833 0.1226362386 -0.0658612459
0.2495572783 0.1252918638 -0.0453029595
0.4214196595 0.1076747233 -0.1816844894
-0.1975433942 0.0622822913 0.0253423299
-0.0515510565 0.0622823111 0.2093158522
-0.1947485219 0.0619957966 0.0231244568
-0.0487561843 0.0619958164 0.2070979791
-0.3549218140 0.0401798381 0.3144210713
-0.3688261224 0.0401798362 0.2968994354
-0.2884783305 0.0333688991 0.2616947919
-0.3023826389 0.0333688972 0.2441731560
0.3584769882 0.1038274343 -0.2208536492
-0.1626637967 0.1483034762 0.2755550539
-0.1227979090 0.1442169336 0.2439194469
0.3362961164 0.0975009851 -0.1078246469
0.4160278918 0.0893278999 -0.1710958610
-0.1807294679 0.1854534490 0.2587746139
-0.2016931341 0.1498165637 0.2918950632
-0.1485379426 0.1443677710 0.2497137185
-0.1594840783 0.1607310014 0.2420112772
-0.2046998898 0.1653659500 0.2778923205
0.1956056283 0.1230395349 -0.0344514601
0.1158738529 0.1312126202 0.0288197540
0.3224774754 0.0868581634 -0.1794925204
0.3483831685 0.0842026419 -0.2000500039
-0.2326259338 0.0762960013 0.1239972093
-0.1555971933 0.0762960117 0.2210656510
-0.2714849794 0.0802793353 0.1548338360
-0.1944562389 0.0802793457 0.2519022777
-0.2553161913 0.0835019401 0.2397731023
-0.2735005454 0.0835019376 0.2168579292
-0.1535806154 0.0730733057 0.1590407548
-0.1717649696 0.0730733032 0.1361255817
0.0487358221 -0.1786683297 -0.0201794548
0.0445445257 -0.1782386914 -0.0168534482
0.1144072247 -0.1854001247 -0.0722930488
0.0459419618 -0.1783819387 -0.0179623847
-0.1669252906 0.1374564236 0.2558492375
-0.1422864984 0.1349307687 0.2362971042
-0.4871160042 0.0611102552 0.4092699225
-0.4912301005 0.0611102546 0.4040855079
0.4447769618 0.0494408469 -0.2539008841
0.3650451864 0.0576139322 -0.1906296700
0.2729155925 0.0670578837 -0.1175201572
0.1931838171 0.0752309690 -0.0542489431
0.4119531129 0.1270623959 -0.1564666274
0.4216227812 0.0995050812 -0.1407215825
-0.1532596942 0.1493970722 0.2811111073
-0.1193478356 0.1459208607 0.2542003248
-0.4891956256 0.0580809847 0.4070405766
-0.4895307468 0.0580809847 0.4066182706
0.3460913124 0.1449662441 -0.1330882406
0.3953678851 0.1399150380 -0.1721917043
0.2282951458 0.0505506419 -0.0382907543
0.4494330877 0.0278823990 -0.2137749448
0.2775717184 0.0454994358 -0.0773942179
0.4001565151 0.0329336051 -0.1746714812
0.1806859457 0.0767635922 0.0351259211
0.2559209173 0.0395095478 -0.0529767425
0.4277822866 0.0218925110 -0.1893574694
-0.1635091835 0.1391750601 0.2695155561
-0.1295973248 0.1356988487 0.2426047736
-0.1608919287 0.0861583661 0.0340304131
-0.0516851063 0.0861583809 0.1716483463
-0.0376989792 0.0735301953 -0.0637294504
0.0715078432 0.0735302101 0.0738884828
-0.3577192613 -0.0005656390 0.3023632867
-0.3605141336 -0.0002791443 0.3045811598
0.3390292132 0.1429217538 -0.1658767403
0.3649349063 0.1402662323 -0.1864342237
0.1319904628 0.1069928601 -0.0301429970
-0.2001001320 0.1676378444 0.2916004275
-0.1469449405 0.1621890517 0.2494190828
-0.1334578488 0.1741082545 0.2678243786
0.3237533052 0.1288725105 -0.1399896964
0.3915770225 0.1219200876 -0.1938112615
-0.1601959152 0.1624907090 0.2356308709
-0.1867894694 -0.0411789610 0.1969333088
-0.2162116626 -0.0411789650 0.1598566745
-0.2256485150 -0.0371956270 0.2277699355
-0.2550707082 -0.0371956310 0.1906933012
0.3255189152 0.0867529522 -0.1200172499
0.4052506906 0.0785798670 -0.1832884640
0.0321088689 0.1386139251 0.1084921976
-0.0803491933 0.1386139099 -0.0332228138
0.0293139966 0.1389004198 0.1107100707
-0.0831440655 0.1389004045 -0.0310049407
0.4377385855 0.0752853211 -0.1996853487
0.3580068101 0.0834584063 -0.1364141346
0.4592264663 0.0753477617 -0.2390387507
0.3794946909 0.0835208470 -0.1757675366
0.2873650970 0.0929647985 -0.1026580238
0.2076333216 0.1011378838 -0.0393868097
0.3167827900 0.0988367033 -0.1325870782
0.3965145654 0.0906636181 -0.1958582923
0.1951362558 0.1026705070 0.0499890697
0.1117019096 0.1163884869 0.0131706704
0.1795256269 0.1094360640 -0.0406508946
-0.0149100740 0.1434610328 0.0832717377
-0.0664712129 0.1434610258 0.0182965173
0.1173855196 0.1001907410 0.0224252720
0.1852092369 0.0932383181 -0.0313962930
0.3825318646 0.0827472775 -0.1032834296
0.4084375577 0.0800917561 -0.1238409131
-0.4887806701 0.0646782056 0.4067112876
-0.4891157913 0.0646782055 0.4062889817
-0.1641107850 0.1831900284 0.2978584677
-0.1468396483 0.1814196116 0.2841529434
0.4440693792 -0.1258670825 -0.1581270852
0.2728956624 -0.1258671057 -0.3738331429
-0.0135539027 -0.0898017530 -0.0122440879
0.0268547886 -0.0898017475 0.0386772781
0.4081409144 -0.1330285302 -0.3468803470
0.4485496057 -0.1330285247 -0.2959589809
0.1620999601 -0.0969631720 0.0656299726
-0.0090737567 -0.0969631952 -0.1500760851
0.1820608450 -0.1098536833 -0.1674743272
0.2224695363 -0.1098536779 -0.1165529612
0.3577147078 -0.1170151023 -0.0896002667
0.1865409910 -0.1170151256 -0.3053063244
0.2484546315 -0.1058151521 -0.0028968459
0.0772809147 -0.1058151753 -0.2186029036
0.2125261668 -0.1129765998 -0.1916501076
0.2529348580 -0.1129765943 -0.1407287416
0.1888985980 0.0750056957 -0.0910956512
0.4100365400 0.0523374528 -0.2665798417
0.2381751707 0.0699544897 -0.1301991148
0.3607599673 0.0573886589 -0.2274763781
0.3678009942 0.1309237690 -0.1616769254
0.4170775669 0.1258725630 -0.2007803890
0.4622152549 0.0668320896 -0.2341723870
0.3824834795 0.0750051749 -0.1709011729
0.2903538856 0.0844491264 -0.0977916601
0.2106221102 0.0926222117 -0.0345204460
-0.1993338664 0.1348033745 0.2758229186
-0.1664834926 0.1314359730 0.2497544782
-0.1359070646 -0.0593379183 0.2082530740
-0.2156739710 -0.0593379291 0.1077341085
-0.1387019368 -0.0590514236 0.2104709471
-0.2184688433 -0.0590514345 0.1099519816
-0.2382706120 -0.0134466131 0.1284765579
-0.1612418715 -0.0134466026 0.2255449996
-0.2771296576 -0.0094632790 0.1593131846
-0.2001009171 -0.0094632686 0.2563816263
-0.2609608695 -0.0062406743 0.2442524509
-0.2791452236 -0.0062406767 0.2213372778
-0.1592252936 -0.0166693087 0.1635201034
-0.1774096477 -0.0166693111 0.1406049303
0.3197707731 0.0903210312 -0.1277217297
0.3995025485 0.0821479460 -0.1909929438
0.3512157664 0.1437764111 -0.1774020023
0.1134382872 0.1358104365 0.0128499434
0.1812620044 0.1288580136 -0.0409716216
0.1214877617 0.0899671546 0.0097463191
0.1707643343 0.0849159485 -0.0293571445
0.1365356445 0.0806248616 0.0299158352
0.1858122172 0.0755736555 -0.0091876284
0.2117698106 0.0433708172 -0.0581878435
0.4329077526 0.0207025743 -0.2336720340
0.2610463833 0.0383196111 -0.0972913071
0.3836311799 0.0257537804 -0.1945685704
0.4534791298 0.0789158407 -0.2467422153
0.3737473544 0.0870889260 -0.1834710012
0.2816177605 0.0965328776 -0.1103614884
0.2018859851 0.1047059628 -0.0470902743
0.3866456001 0.1262236535 -0.2150237114
0.3607388951 0.1288792787 -0.1944654250
0.1339380631 0.1562543314 0.0360420673
0.2017617803 0.1493019085 -0.0177794977
0.3700938541 0.0701599340 -0.2286394851
0.3441871491 0.0728155591 -0.2080811987
0.3964663785 0.0829212826 -0.2634778473
0.2246050092 0.1005383194 -0.1270971204
0.1986983042 0.1031939445 -0.1065388339
0.3705606854 0.0855768040 -0.2429203639
-0.1667025130 0.1679920096 0.2617690125
-0.1327906544 0.1645157981 0.2348582300
0.1113916232 -0.0425813560 0.1365013256
-0.0896122324 -0.0425813832 -0.1167954427
0.1085967510 -0.0422948613 0.1387191987
-0.0924071046 -0.0422948885 -0.1145775696
0.1647503333 0.1087641372 0.0618359202
0.2140269060 0.1037129311 0.0227324566
0.0560731630 -0.0328943068 0.1608456600
-0.1258883153 -0.0328943314 -0.0684546899
0.0532782908 -0.0326078121 0.1630635331
-0.1286831876 -0.0326078368 -0.0662368168
0.0158187728 0.1339143036 0.0562943503
-0.0332176788 0.1339142970 -0.0054993634
-0.0489469778 0.1405532628 0.1076892634
-0.0979834294 0.1405532561 0.0458955497
-0.1555348250 0.1760388637 0.2652191300
-0.1308960327 0.1735132088 0.2456669967
-0.1783163044 -0.0753227885 0.0673467088
-0.0880881380 -0.0753227763 0.1810485226
-0.1755214322 -0.0756092832 0.0651288357
-0.0852932657 -0.0756092710 0.1788306495
0.2450542810 0.1375619195 -0.0793363852
0.4169156503 0.1199448827 -0.2157171121
-0.1461125221 0.1736888059 0.2385457370
-0.1590658746 0.1750166185 0.2488248802
0.4269613843 0.0645372882 -0.2118779517
0.3472296089 0.0727103734 -0.1486067377
-0.1475382720 0.1264175930 0.2562412708
-0.3168820601 0.0872850274 0.2876046566
-0.3340691064 0.0872850251 0.2659462498
-0.1958046549 -0.0321323618 0.1481742986
-0.1707760943 -0.0321323584 0.1797142584
-0.2697200199 -0.0245555008 0.2068298956
-0.2446914592 -0.0245554974 0.2383698553
-0.0346802724 -0.0918806236 0.1494072099
-0.1353688933 -0.0918806373 0.0225235628
-0.0374751447 -0.0915941290 0.1516250830
-0.1381637656 -0.0915941426 0.0247414359
-0.3028162670 0.0084577319 0.2730726757
-0.3167205754 0.0084577301 0.2555510398
-0.3438802462 0.0126670876 0.3056590292
-0.3577845546 0.0126670858 0.2881373933
-0.1243603867 0.1436016324 0.2698434042
-0.1373137392 0.1449294450 0.2801225474
-0.3841903716 0.0327124083 0.2647067794
-0.3270626759 0.0327124160 0.3366967452
-0.3869852438 0.0329989029 0.2669246525
-0.3298575482 0.0329989107 0.3389146183
0.1566339586 0.1735277784 0.0190888980
0.1825396517 0.1708722570 -0.0014685855
0.3295659691 0.1377862902 -0.1529853234
0.3788425418 0.1327350842 -0.1920887871
0.3454639908 0.1148298025 -0.1685791777
0.4132877081 0.1078773796 -0.2224007427
0.1869368650 0.0791341842 -0.0749319803
0.2547605823 0.0721817612 -0.1287535453
0.3587982343 0.0615171473 -0.2113127072
0.4266219516 0.0545647244 -0.2651342722
-0.1503003911 0.0508767007 0.1475815844
-0.1598602073 0.0508766994 0.1355346984
-0.2698980542 0.0631363286 0.2424884055
-0.2794578704 0.0631363273 0.2304415195
-0.2731352761 0.0624469321 0.3112840209
-0.3471898157 0.0624469221 0.2179635445
-0.2703404038 0.0621604374 0.3090661478
-0.3443949435 0.0621604274 0.2157456714
-0.1681613955 0.0418651039 0.1262379598
-0.1431328349 0.0418651073 0.1577779196
-0.2877590586 0.0541247318 0.2211447809
-0.2627304980 0.0541247352 0.2526847407
0.3316737124 0.0606496166 -0.1645183018
0.3575794055 0.0579940951 -0.1850757853
0.4301490571 0.0660491773 -0.1524293856
0.4042423521 0.0687048024 -0.1318710992
0.4565215814 0.0788105258 -0.1872677478
0.2846602121 0.0964275627 -0.0508870209
0.2587535071 0.0990831878 -0.0303287345
0.4306158883 0.0814660473 -0.1667102644
0.1593174220 0.1577903876 0.0486566032
0.2085939947 0.1527391816 0.0095531396
-0.1900676297 0.1614103380 0.3050474140
-0.1369124382 0.1559615453 0.2628660693
-0.0866740892 -0.1181119144 0.0872751835
-0.0894689614 -0.1178254197 0.0894930566
-0.1036062410 0.0623134428 0.2332428753
-0.2326718958 0.0623134253 0.0705996606
-0.1064011132 0.0625999375 0.2354607484
-0.2354667680 0.0625999200 0.0728175337
-0.1347400889 0.1590371971 0.2734114304
-0.1799559004 0.1636721457 0.3092924738
-0.1415597829 0.1359377515 0.2678014136
-0.1867755944 0.1405727001 0.3036824569
-0.0134741754 0.1309448145 -0.1315971954
0.1431050927 0.1309448358 0.0657175401
-0.1686941859 0.1487162054 0.2679024916
-0.1288282982 0.1446296628 0.2362668845
-0.1529711833 0.1754438435 0.2430619538
-0.0137074639 0.1345069305 -0.1313410946
0.1428026049 0.1345069518 0.0658864388
-0.1958919844 0.1694661290 0.2966671922
-0.1427367929 0.1640173363 0.2544858475
0.4182260566 0.0766209101 -0.2244467584
0.3384942812 0.0847939953 -0.1611755443
0.3729264602 0.1297338323 -0.2059914900
0.4427019286 0.0681678078 -0.2589348183
0.3629701532 0.0763408931 -0.1956636042
0.2708405593 0.0857848446 -0.1225540914
0.1911087839 0.0939579299 -0.0592828773
-0.0309155249 -0.1110036069 0.0959729036
-0.0824766637 -0.1110036139 0.0309976831
0.0786659549 0.0537583387 0.0375433541
-0.0006780221 0.0537583279 -0.0624426531
-0.0908943502 0.0711394997 0.1720980696
-0.1702383272 0.0711394890 0.0721120624
-0.1497898697 0.1325527373 0.2392254638
-0.1627432222 0.1338805499 0.2495046070
0.2155596369 0.0613654838 -0.0365674640
0.2833833542 0.0544130609 -0.0903890290
0.3874210062 0.0437484470 -0.1729481909
0.4552447235 0.0367960241 -0.2267697559
-0.1819655350 0.1227144253 0.2831706089
-0.1646943984 0.1209440085 0.2694650846
-0.4872589142 0.0596304074 0.4099954670
-0.4919691396 0.0596304068 0.4040598352
0.1677680495 0.0036330774 0.1135393308
-0.0544424542 0.0036330473 -0.1664811807
-0.0572891536 0.0037038927 -0.1686490961
0.1692326524 0.0037039234 0.1168043408
-0.4891219755 0.0595595303 0.4062277126
-0.4887232135 0.0595595303 0.4067302161
0.1475420884 0.0718338208 0.0207680570
0.1734477815 0.0691782994 0.0002105735
0.1926204669 0.0629363091 -0.0656773723
0.2604441842 0.0559838862 -0.1194989373
0.3644818362 0.0453192723 -0.2020580992
0.4323055535 0.0383668494 -0.2558796642
-0.4885472842 0.0611156813 0.4064549440
-0.4888131255 0.0611156812 0.4061199417
0.1416600986 0.0794350286 -0.0143979264
0.2168942646 0.0421809842 -0.1025016051
0.3887556339 0.0245639474 -0.2388823320
-0.1440988322 0.1602211660 0.2816735543
-0.1194600399 0.1576955111 0.2621214210
0.2000710067 0.1310450763 -0.0298584933
0.1203392313 0.1392181616 0.0334127207
-0.1708368986 0.1486036206 0.2494800466
-0.1461981063 0.1460779657 0.2299279133
0.2097406750 0.1034877616 -0.0141134485
0.1300088996 0.1116608468 0.0491577656
0.3689616788 0.1133307197 -0.1001814159
0.4182382514 0.1082795136 -0.1392848795
-0.1893021697 0.1285758681 0.2892688899
-0.1564517958 0.1252084666 0.2632004495
0.4212140397 0.0681052380 -0.2195814099
0.3414822643 0.0762783233 -0.1563101958
0.3792900992 0.0439515163 -0.2136652730
0.3533833942 0.0466071415 -0.1931069865
-0.1248334818 0.1167168072 0.1994656044
-0.2046003883 0.1167167964 0.0989466390
-0.1276283541 0.1170033018 0.2016834775
-0.2073952605 0.1170032910 0.1011645121
-0.3074487227 0.1055865768 0.2624710487
-0.3046538505 0.1053000821 0.2602531756
-0.4877183514 0.0610244312 0.4078072727
-0.4899425574 0.0610244309 0.4050044200
-0.1275537163 0.1724185818 0.2620968606
-0.1405070688 0.1737463944 0.2723760038
0.4087794169 0.0948907216 -0.1851903355
0.3249443805 0.1034844208 -0.1186629754
-0.1841457679 0.1862467141 0.2883171194
-0.1512953941 0.1828793125 0.2622486790
0.3154863515 0.0900956288 -0.1645674161
0.3647629242 0.0850444227 -0.2036708798
-0.3244777127 0.0639754026 0.2386042969
-0.2880759756 0.0639754076 0.2844762645
-0.3655416919 0.0681847583 0.2711906504
-0.3291399548 0.0681847633 0.3170626180
0.4399698192 0.0227465479 -0.2008835086
0.2681084499 0.0403635847 -0.0645027817
0.2422017449 0.0430192099 -0.0439444953
0.4140641261 0.0254020694 -0.1803260252
-0.0292670378 -0.1201399606 -0.1190647297
0.1273122304 -0.1201399393 0.0782500058
0.3422108733 0.1351875280 -0.3202068121
0.4075941514 0.1351875369 -0.2378135019
0.0602414542 0.1640914385 -0.0964497543
0.1256247323 0.1640914474 -0.0140564441
0.2558562019 0.1440395082 -0.2516799936
0.3212394800 0.1440395170 -0.1692866834
0.1465961257 0.1552394584 -0.1649765728
0.2119794037 0.1552394673 -0.0825832626
0.3219147001 -0.1874936932 -0.3041007327
0.3872979781 -0.1874936843 -0.2217074225
0.0399452810 -0.1585897827 -0.0803436749
0.1053285590 -0.1585897738 0.0020496353
0.2355600286 -0.1786417131 -0.2355739142
0.3009433067 -0.1786417042 -0.1531806040
0.1262999524 -0.1674417628 -0.1488704934
0.1916832304 -0.1674417540 -0.0664771832
-0.1614694459 0.1616694690 0.2753335679
-0.1216035582 0.1575829264 0.2436979609
-0.1538219612 0.1708826097 0.2478351056
-0.1990377727 0.1755175583 0.2837161489
0.3512756428 0.1237436860 -0.1815740017
0.4005522155 0.1186924799 -0.2206774653
0.3761452056 0.1403811764 -0.1187765168
0.4020508987 0.1377256550 -0.1393340003
-0.1978615764 0.1474378443 0.2970307063
-0.1447063849 0.1419890517 0.2548493616
0.3548820693 0.0656401874 -0.1117635151
0.4041586419 0.0605889813 -0.1508669787
0.3825078408 0.0545990933 -0.1264495033
-0.1529831993 0.1613696868 0.2314789202
-0.1659365518 0.1626974994 0.2417580634
-0.4870344953 0.0631983581 0.4098173788
-0.4917447208 0.0631983575 0.4038817470
0.1679924684 0.0072010281 0.1133612426
-0.0542180353 0.0072009980 -0.1666592689
-0.0570647347 0.0072718434 -0.1688271842
0.1694570713 0.0072718741 0.1166262526
-0.4888975567 0.0631274809 0.4060496245
-0.4884987947 0.0631274810 0.4065521279
-0.1657904344 0.1238213058 0.0574067730
-0.0755622679 0.1238213180 0.1711085869
-0.1629955621 0.1235348111 0.0551888999
-0.0727673957 0.1235348233 0.1688907138
-0.1373247514 0.1308550554 0.2685387173
-0.1427584602 0.1798814350 0.2553583787
0.0559440583 0.0823239013 0.0052201884
0.0256373385 0.0823238972 -0.0329710899
-0.0757967126 0.0876949915 -0.0531853085
0.0525840382 0.0876950089 0.1085948185
-0.1405624632 0.0943339506 -0.0017903953
-0.0121817124 0.0943339680 0.1599897316
-0.1136162467 0.0997050623 0.1397749040
-0.1439229666 0.0997050582 0.1015836256
-0.1606416634 0.1477830350 0.2422250952
-0.2058574749 0.1524179836 0.2781061385
-0.4885204709 0.0615419752 0.4064336663
-0.4887863123 0.0615419751 0.4060986640
0.3906721662 0.0992882446 -0.1287690855
0.4399487388 0.0942370385 -0.1678725491
0.1160540123 0.1389928883 -0.0034339873
0.1653305850 0.1339416822 -0.0425374509
-0.2036851255 0.1554936353 0.2886514997
-0.1505299340 0.1500448427 0.2464701550
0.4304899043 0.0808482465 -0.2137780050
0.3466548679 0.0894419458 -0.1472506449
0.2091721885 0.1189996411 -0.0520615792
0.2769959057 0.1120472182 -0.1058831442
0.3810335578 0.1013826043 -0.1884423061
0.4488572750 0.0944301814 -0.2422638712
-0.3986675987 0.0862134318 0.3348578636
-0.4014624709 0.0864999264 0.3370757368
-0.1575062841 0.1417833336 0.2767432376
-0.1235944255 0.1383071222 0.2498324551
0.1488179019 0.1138479096 0.0602708939
0.2166416192 0.1068954866 0.0064493288
0.3342210507 0.1162274293 -0.1128585553
0.4139528261 0.1080543441 -0.1761297694
0.3371960333 0.0760531537 -0.1931561009
0.3864726060 0.0710019476 -0.2322595645
0.1656852343 -0.0517167031 0.1107963438
-0.0522444986 -0.0517167326 -0.1638297169
0.1614939378 -0.0512870648 0.1141223504
-0.0564357951 -0.0512870944 -0.1605037102
0.2313566368 -0.0584484982 0.0586827498
0.0134269039 -0.0584485277 -0.2159433109
0.1628913739 -0.0514303122 0.1130134139
-0.0550383590 -0.0514303417 -0.1616126468
-0.0503672246 -0.0499196701 -0.1588014832
0.1612155863 -0.0499196414 0.1078264482
-0.1741140630 0.1800193369 0.3017630843
-0.1412636892 0.1766519353 0.2756946439
-0.1312318776 0.1312823841 0.2627755787
-0.1441852301 0.1326101967 0.2730547219
0.1448706695 0.1494676051 0.0506955653
0.2126943867 0.1425151821 -0.0031259997
-0.1759039872 0.1905109138 0.2820514821
-0.1586328505 0.1887404970 0.2683459578
0.1886732100 0.0985556171 -0.0752526815
0.2564969273 0.0916031941 -0.1290742465
0.3605345793 0.0809385803 -0.2116334084
0.4283582966 0.0739861573 -0.2654549734
-0.3441475723 0.0323647416 0.3187508785
-0.3705955646 0.0323647380 0.2854222095
-0.2876278079 0.0265710558 0.2738995743
-0.3140758002 0.0265710522 0.2405709053
-0.1699954223 0.0127066020 0.1276933564
-0.1449668617 0.0127066053 0.1592333162
-0.2895930854 0.0249662298 0.2226001775
-0.2645645248 0.0249662332 0.2541401373
-0.1594017195 0.1327857938 0.2659334622
-0.1347629272 0.1302601389 0.2463813289
-0.2174497991 0.0138900197 0.2866484442
-0.3105466355 0.0138900070 0.1693316509
-0.2202436595 0.0141764106 0.2888655143
-0.3133404958 0.0141763980 0.1715487210
-0.2755621196 0.0238634598 0.3132098487
-0.3496166593 0.0238634498 0.2198893723
-0.2727672474 0.0235769651 0.3109919756
-0.3468217870 0.0235769551 0.2176714992
0.1283189235 0.0934038855 0.0370797916
0.1961426408 0.0864514626 -0.0167417734
0.4237615924 0.1236830762 -0.1679234880
0.3978548874 0.1263387013 -0.1473652016
-0.2297105275 0.1016380929 0.2598630861
-0.2872474578 0.1016380851 0.1873574198
-0.2325043879 0.1019244839 0.2620801562
-0.2900413181 0.1019244761 0.1895744899
-0.1880354730 0.0913869383 0.1420090447
-0.1630069123 0.0913869417 0.1735490045
-0.2619508379 0.0989637993 0.2006646416
-0.2369222773 0.0989638027 0.2322046014
-0.3222172483 0.0024628780 0.2918384086
-0.3394042946 0.0024628757 0.2701800018
-0.3823181562 0.0624780561 0.2632210782
-0.3251904605 0.0624780638 0.3352110440
-0.3851130285 0.0627645508 0.2654389513
-0.3279853328 0.0627645585 0.3374289171
-0.0299421518 -0.1236022636 -0.1184580170
0.1265679170 -0.1236022424 0.0787695163
-0.2984999826 0.0770807136 0.2696474773
-0.3124042910 0.0770807117 0.2521258414
-0.3395639618 0.0812900693 0.3022338308
-0.3534682702 0.0812900674 0.2847121949
0.3765917511 0.0515977123 -0.1403521998
0.4258683238 0.0465465063 -0.1794556634
0.4042185346 0.0405565145 -0.1550389910
-0.0207021151 0.1303528395 0.1383148079
-0.1213907360 0.1303528258 0.0114311608
-0.0234969873 0.1306393341 0.1405326810
-0.1241856083 0.1306393205 0.0136490339
0.0060931481 0.0616794818 0.1809520033
-0.1568251474 0.0616794598 -0.0243509130
0.0032982759 0.0619659765 0.1831698764
-0.1596200197 0.0619659544 -0.0221330399
0.0005966428 -0.1080966123 0.0683739099
-0.0484398087 -0.1080966190 0.0065801961
-0.0641691077 -0.1014576531 0.1197688230
-0.1132055593 -0.1014576598 0.0579751093
0.0620364315 0.0619134541 0.1561134933
-0.1199250469 0.0619134294 -0.0731868566
0.0592415592 0.0621999487 0.1583313664
-0.1227199191 0.0621999241 -0.0709689835
0.1179789093 0.0621474263 0.1312739681
-0.0830249463 0.0621473990 -0.1220228001
0.1151840370 0.0624339209 0.1334918412
-0.0858198186 0.0624338937 -0.1198049270
-0.1937587210 0.1300355690 0.2673636103
-0.1764875844 0.1282651523 0.2536580860
0.3383567341 0.0584603627 -0.1316606043
0.3876333068 0.0534091566 -0.1707640679
-0.2270301221 0.1097559112 0.1668864942
-0.1960934388 0.1097559154 0.2058716264
0.4296351383 0.1160004007 -0.2259529524
0.2577737690 0.1336174375 -0.0895722255
0.2318670640 0.1362730627 -0.0690139391
0.4037294452 0.1186559222 -0.2053954690
-0.1301000114 0.1438083190 0.2759697937
0.1884205809 0.1632703779 0.0336982396
0.3252862396 0.1182833863 -0.1800123977
0.3511919327 0.1156278649 -0.2005698812
-0.1936534207 0.1492662581 0.3020974646
-0.1404982291 0.1438174655 0.2599161199
0.2072245557 0.0697376530 -0.1182466178
0.3790859250 0.0521206162 -0.2546273447
0.1505542714 0.1332697300 0.0599501733
0.2183779886 0.1263173071 0.0061286083
-0.1568380778 0.1321907736 0.2437762860
0.1349444480 0.1400352870 -0.0306887758
0.2345515393 0.1205355682 -0.0394470369
0.4556894813 0.0978673253 -0.2149312274
0.2838281120 0.1154843621 -0.0785505005
0.4064129086 0.1029185314 -0.1758277638
0.3372090256 0.1077116280 -0.1079932004
0.4169408010 0.0995385428 -0.1712644144
0.3716420101 0.1526514650 -0.1528081309
0.4566131085 0.0735609494 -0.1680811932
0.2854393917 0.0735609262 -0.3837872509
-0.0010101734 0.1096262789 -0.0221981959
0.0393985179 0.1096262844 0.0287231701
0.4206846437 0.0663995017 -0.3568344550
0.4610933350 0.0663995072 -0.3059130889
0.1746436894 0.1024648599 0.0556758646
0.0034699726 0.1024648367 -0.1600301931
0.1946045743 0.0895743485 -0.1774284352
0.2350132656 0.0895743540 -0.1265070692
0.3702584371 0.0824129295 -0.0995543747
0.1990847203 0.0824129063 -0.3152604324
0.2609983608 0.0936128798 -0.0128509539
0.0898246440 0.0936128565 -0.2285570116
0.2250698961 0.0864514321 -0.2016042156
0.2654785873 0.0864514376 -0.1506828496
-0.1606996137 0.1706002831 0.2689966940
-0.1267877551 0.1671240716 0.2420859115
-0.2249910009 -0.0590516880 0.1970366744
-0.2221971406 -0.0593380789 0.1948196043
-0.2916690657 -0.0073515891 0.2969447562
-0.3374364742 -0.0073515953 0.2392705558
-0.2888741934 -0.0076380838 0.2947268831
-0.3346416019 -0.0076380900 0.2370526827
-0.1290301088 0.0021459815 0.1637199408
-0.1707438394 0.0021459759 0.1111540179
0.0702993297 -0.0182867316 0.0055419056
0.0285855990 -0.0182867373 -0.0470240172
-0.0693961299 0.1565838582 0.0735642153
-0.0721910022 0.1568703529 0.0757820884
0.3284729004 0.1197953792 -0.1205630287
0.4082046758 0.1116222939 -0.1838342427
0.2703703487 0.0654153000 -0.0381145510
0.4422317180 0.0477982632 -0.1744952780
-0.1709491029 0.1603782711 0.2574011429
-0.1370372443 0.1569020596 0.2304903603
-0.1480104402 0.1713683631 0.2753043634
-0.1233716479 0.1688427082 0.2557522301
0.1980902411 0.1357129339 0.0494432909
0.3421465685 0.0764551585 -0.1100402312
0.4099702858 0.0695027356 -0.1638617962
0.4356635117 0.0940116361 -0.2047192507
0.3559317363 0.1021847213 -0.1414480366
-0.1920596130 0.1670875388 0.3018038440
-0.1389044215 0.1616387461 0.2596224993
-0.1191978763 0.1473270277 0.1130844325
-0.1164030040 0.1470405330 0.1108665594
-0.1358976658 0.1460893598 0.2736252420
-0.1811134773 0.1507243084 0.3095062853
0.4471672989 0.0761732201 -0.2543418451
0.3674355235 0.0843463053 -0.1910706311
0.2753059296 0.0937902569 -0.1179611182
0.1955741542 0.1019633421 -0.0546899042
-0.1674990295 0.1620821982 0.2676820207
-0.1276331419 0.1579956556 0.2360464137
0.3600672215 0.0444178876 -0.1602482739
0.4093437942 0.0393666816 -0.1993517375
0.1290165418 -0.1200342914 0.0813942809
-0.0319424223 -0.1200343132 -0.1214395669
-0.1776562240 0.1040270718 0.1896855989
-0.2070784171 0.1040270679 0.1526089646
-0.2165152696 0.1080104059 0.2205222255
-0.2459374627 0.1080104019 0.1834455912
0.1182869377 -0.1435791663 0.0629333363
-0.0164015840 -0.1435791846 -0.1067955834
0.1140956412 -0.1431495280 0.0662593429
-0.0205928805 -0.1431495463 -0.1034695767
0.1839583402 -0.1503109614 0.0108197423
0.0492698185 -0.1503109796 -0.1589091773
0.1154930773 -0.1432927754 0.0651504064
-0.0191954443 -0.1432927936 -0.1045785133
-0.3516607652 0.0957561111 0.2975555518
-0.3544556375 0.0960426057 0.2997734249
-0.1688946297 -0.0410735663 0.0403809767
-0.0596878073 -0.0410735515 0.1779989099
-0.0457016802 -0.0537017371 -0.0573788868
0.0635051422 -0.0537017223 0.0802390464
-0.0415744908 -0.1388916486 0.0514863629
-0.0443693631 -0.1386051539 0.0537042360
0.3434819937 0.0572705297 -0.1759733508
-0.0155753563 -0.1391060790 -0.1034228731
0.1151900720 -0.1391060613 0.0613623261
-0.3371778199 0.0686966399 0.2421193646
-0.2943846123 0.0686966457 0.2960455999
-0.3497831583 0.0726998931 0.3064388355
-0.3598859353 0.0726998918 0.2937077326
-0.3587657289 0.0709095571 0.2592504670
-0.3159725212 0.0709095629 0.3131767023
-0.2932633939 0.0669062074 0.2615875313
-0.3033661709 0.0669062060 0.2488564284
0.3853414344 0.1141725004 -0.1038022918
0.4112471275 0.1115169790 -0.1243597753
0.2142060454 0.1114931738 -0.0095204753
0.1344742700 0.1196662591 0.0537507388
0.1442694741 0.1671316472 0.0284871386
0.1935460468 0.1620804412 -0.0106163250
0.4386514947 0.0854959640 -0.1998539022
0.3589197193 0.0936690492 -0.1365826881
-0.1211328768 -0.0624048245 -0.0239930516
0.0138541928 -0.0624048062 0.1461120858
-0.1598680958 0.1260017316 0.2927429551
-0.1903629809 0.1681826031 0.2488658266
-0.1634098781 0.1374972078 0.1481689034
-0.1662047504 0.1377837025 0.1503867765
0.0164968985 -0.1095949164 0.1208811160
-0.0959611636 -0.1095949317 -0.0208338954
0.0137020263 -0.1093084217 0.1230989892
-0.0987560358 -0.1093084370 -0.0186160223
0.1629194984 0.0242943615 -0.1679025020
0.2185375374 0.0242943690 -0.0978149432
0.2330776726 0.0171026398 -0.2235765772
0.2886957116 0.0171026473 -0.1534890185
0.4286924203 -0.0029492906 -0.3788068165
0.4843104593 -0.0029492830 -0.3087192578
-0.0326952493 0.0443462919 -0.0126722627
0.0229227897 0.0443462994 0.0574152961
0.3176956992 0.1090473462 -0.1327556317
0.3974274746 0.1008742610 -0.1960268458
0.1372073750 0.1650871569 -0.0043013610
0.1631130681 0.1624316355 -0.0248588445
0.4299153696 0.0975797151 -0.2124237305
0.3501835942 0.1057528004 -0.1491525164
0.3729034239 0.1015851569 -0.2291583473
0.3469967189 0.1042407821 -0.2086000609
0.0718478750 0.1887815006 -0.0385200826
0.0676565785 0.1892111389 -0.0351940759
0.1375192775 0.1820497056 -0.0906336765
0.0690540146 0.1890678916 -0.0363030125
-0.1547124996 0.1836725776 0.2917901695
0.1967218465 0.0527118184 -0.0783572952
0.4178597884 0.0300435755 -0.2538414857
0.2459984191 0.0476606123 -0.1174607588
0.3685832158 0.0350947816 -0.2147380221
-0.1696417422 0.1619696134 0.2492595758
-0.1450029499 0.1594439585 0.2297074425
0.1298518985 0.0828154072 -0.0029429419
0.1557575916 0.0801598858 -0.0235004254
0.1206556290 0.1090234373 -0.0179171347
0.1465613221 0.1063679159 -0.0384746182
-0.4870822032 0.0616476438 0.4092430996
-0.4911962996 0.0616476433 0.4040586851
-0.1409451695 0.1270620733 0.2510804492
-0.1538985220 0.1283898859 0.2613595924
0.4613023782 0.0566219634 -0.2340038593
0.3815706028 0.0647950487 -0.1707326453
0.2894410089 0.0742390002 -0.0976231324
0.2097092335 0.0824120855 -0.0343519184
0.2399852237 0.0715088010 -0.0262666789
0.4611231657 0.0488405581 -0.2017508694
0.2892617963 0.0664575949 -0.0653701425
0.4118465930 0.0538917642 -0.1626474058
0.2240528330 0.0765932193 -0.0278317375
0.2918765502 0.0696407963 -0.0816533025
0.3959142023 0.0589761825 -0.1642124644
0.4637379195 0.0520237595 -0.2180340294
0.0686197933 0.1871094905 -0.0336753263
0.0663955873 0.1871094902 -0.0364781789
0.3933526957 0.1386087571 -0.1813976121
0.3687896803 0.0581086517 -0.1174180591
0.3946953734 0.0554531303 -0.1379755425
-0.1690147234 0.1283418939 0.2987637571
-0.1517435868 0.1265714771 0.2850582328
-0.2023278543 -0.0137840400 0.0291390503
-0.0563355166 -0.0137840202 0.2131125726
-0.1995329821 -0.0140705347 0.0269211772
-0.0535406444 -0.0140705149 0.2108946995
-0.3522896179 0.0186633333 0.2518497478
-0.3072939549 0.0186633394 0.3085514264
-0.1579796918 0.1657176639 0.3078416185
-0.1407085551 0.1639472471 0.2941360942
-0.3539029102 0.0563790058 0.3136125176
-0.3678072186 0.0563790040 0.2960908817
-0.2874594268 0.0495680669 0.2608862382
-0.3013637351 0.0495680650 0.2433646023
-0.0959073481 -0.0803907705 0.1374353560
-0.1376210787 -0.0803907762 0.0848694332
0.0272856015 -0.0930189414 0.0396754925
-0.0144281292 -0.0930189470 -0.0128904303
0.2862306774 0.0747282383 -0.0591248713
0.1406214735 0.0747282186 -0.2426155843
0.3175884964 0.0715138345 -0.0840088936
0.1719792925 0.0715138147 -0.2674996066
0.4818454251 0.0546763080 -0.2143551106
0.3362362212 0.0546762882 -0.3978458236
0.1219737487 0.0915657648 0.0712213457
-0.0236354552 0.0915657451 -0.1122693673
0.0248420128 0.1792380717 -0.0012185416
0.0220471405 0.1795245664 0.0009993316
0.1219314588 0.1510377844 0.0215856893
0.1897551761 0.1440853615 -0.0322358758
0.1912889352 0.1017380689 -0.0915366122
0.4124268771 0.0790698260 -0.2670208027
0.2405655078 0.0966868628 -0.1306400758
0.3631503045 0.0841210321 -0.2279173391
-0.1552337173 0.1672068553 0.2763229386
-0.1213218587 0.1637306439 0.2494121561
0.3338115036 0.0848275861 -0.1917193979
0.3638572542 0.0624124506 -0.1386297125
0.4316809714 0.0554600276 -0.1924512775
0.3409180842 0.0639832758 -0.1677396208
0.4087418014 0.0570308529 -0.2215611858
0.1807108320 0.1049126806 0.0582929648
0.2066165251 0.1022571592 0.0377354813
-0.1734855754 0.1200852874 0.2763470279
0.2035530489 0.0561491952 -0.0510238549
0.2713767662 0.0491967723 -0.1048454199
0.3754144182 0.0385321584 -0.1874045818
0.4432381355 0.0315797355 -0.2412261468
-0.4215588749 0.0418491532 0.3117419952
-0.3813580232 0.0418491587 0.3624014504
-0.4243537471 0.0421356479 0.3139598683
-0.3841528955 0.0421356534 0.3646193235
0.3651926875 0.0432279509 -0.2045628385
-0.4886272149 0.0576384522 0.4085285024
-0.4908514209 0.0576384519 0.4057256498
0.1710068657 0.1679683188 -0.0466150296
0.1022594862 0.1679683095 -0.1332476417
0.3666216134 0.1479163885 -0.2018452689
0.2978742338 0.1479163792 -0.2884778810
-0.2598271404 -0.0137646841 0.1415128679
-0.1788349470 -0.0137646731 0.2435758894
0.4329586268 0.0974744002 -0.1529482478
0.4070519218 0.1001300254 -0.1323899614
0.2034288442 0.1007451409 -0.0217130783
0.1236970688 0.1089182261 0.0415581358
-0.1442424108 0.0677973908 0.2002424458
-0.2097666653 0.0677973819 0.1176714828
-0.2181577757 0.0753742518 0.2588980427
-0.2836820302 0.0753742429 0.1763270797
-0.1523911108 0.1591079178 0.2809512578
-0.1184792522 0.1556317063 0.2540404753
-0.2723659379 0.0623645548 0.1216527387
-0.1623426603 0.0623645697 0.2602995351
-0.2695720776 0.0620781639 0.1194356686
-0.1595488000 0.0620781788 0.2580824649
-0.0326175364 -0.1234966162 -0.1208328543
0.1282722284 -0.1234965944 0.0819137914
-0.1286234215 0.1603295325 0.2756963967
-0.1906762386 0.1546031996 0.3051597851
-0.1375210471 0.1491544070 0.2629784404
-0.2674089484 -0.0403423201 0.2306974690
-0.2702028087 -0.0400559291 0.2329145391
0.4191381684 0.0868316822 -0.2246163335
0.3394063930 0.0950047674 -0.1613451194
0.1946927190 0.1128288920 -0.0342829066
0.1149609436 0.1210019773 0.0289883075
0.3969572966 0.0805052330 -0.1115873312
0.2201055923 0.1122127856 -0.0374070596
0.2879293096 0.1052603627 -0.0912286246
0.3919669616 0.0945957488 -0.1737877865
0.4597906789 0.0876433259 -0.2276093515
-0.3489923185 0.0710858554 0.2492331675
-0.3039966555 0.0710858615 0.3059348462
0.2755603823 -0.0949147687 -0.0506574317
0.1299511784 -0.0949147885 -0.2341481447
0.3069182012 -0.0981291726 -0.0755414540
0.1613089973 -0.0981291923 -0.2590321670
0.4711751299 -0.1149666991 -0.2058876710
0.3255659260 -0.1149667188 -0.3893783840
0.1113034535 -0.0780772422 0.0796887853
-0.0343057503 -0.0780772620 -0.1038019277
-0.1923325729 0.1461543185 0.2492293407
0.3135237560 0.0942232130 -0.1484047153
0.3813474733 0.0872707900 -0.2022262803
0.2257892024 0.0960150397 -0.0281524580
0.2936129196 0.0890626168 -0.0819740230
0.3976505717 0.0783980029 -0.1645331850
0.4654742889 0.0714455800 -0.2183547500
-0.1604319130 0.1523062469 0.2778505221
-0.1205660253 0.1482197043 0.2462149151
0.2101785735 0.1027805967 -0.1187924223
0.3820399428 0.0851635599 -0.2551731492
0.4164060672 0.0414105515 -0.1665650302
0.3904993622 0.0440661766 -0.1460067438
0.4205432356 0.0143059264 -0.2242737676
0.2486818663 0.0319229632 -0.0878930407
0.2227751613 0.0345785883 -0.0673347543
0.3946375425 0.0169614478 -0.2037162842
-0.0360970523 0.0715388532 -0.0614932752
0.0696941115 0.0715388675 0.0718203859
0.3855977648 0.0283120760 -0.3961295342
0.4913889286 0.0283120904 -0.2628158731
0.1595176954 0.0514869228 -0.2167235145
0.2653088592 0.0514869372 -0.0834098534
0.1899830172 0.0483640064 -0.2408992949
0.2957741809 0.0483640207 -0.1075856338
-0.1598524698 0.1447675152 0.3081878650
-0.1425813331 0.1429970984 0.2944823407
0.1602605320 0.0678889258 0.0105330455
0.2354946980 0.0306348814 -0.0775706332
0.4073560673 0.0130178446 -0.2139513602
0.4568369347 0.0486153886 -0.2385967745
0.3771051593 0.0567884738 -0.1753255604
0.2849755654 0.0662324254 -0.1022160476
0.2052437900 0.0744055106 -0.0389448335
0.1976815077 0.1043132199 -0.0294165429
0.1179497323 0.1124863052 0.0338546711
0.1493939200 0.1659416851 -0.0158266166
-0.4918714343 0.0581853506 0.4046655796
-0.4878266178 0.0581853512 0.4097626904
0.3555230029 0.0707850073 -0.2203078705
0.1889142666 0.1271506176 -0.1885306825
0.2445323057 0.1271506251 -0.1184431237
0.2202720856 0.1239362137 -0.2134147048
0.2758901246 0.1239362213 -0.1433271460
0.3845290143 0.1070986872 -0.3437609218
0.4401470533 0.1070986948 -0.2736733630
0.0246573379 0.1439881441 -0.0581844654
0.0802753769 0.1439881516 0.0119030933
-0.1543879882 0.1456570107 0.2317383545
-0.1673413407 0.1469848233 0.2420174977
0.2636546982 0.1260155584 -0.0544054004
0.4355160675 0.1083985216 -0.1907861274
0.3357591039 0.1340890575 -0.1255343336
0.4035828211 0.1271366346 -0.1793558986
0.2733243665 0.0984582436 -0.0386603556
0.4451857358 0.0808412068 -0.1750410825
-0.1112409786 0.0948627418 -0.0318427923
0.0237460909 0.0948627601 0.1382623451
0.1588438020 -0.0405036013 -0.1646682228
0.2144618410 -0.0405035938 -0.0945806641
0.2290019763 -0.0476953230 -0.2203422981
0.2846200153 -0.0476953155 -0.1502547393
0.4246167239 -0.0677472534 -0.3755725374
0.4802347629 -0.0677472459 -0.3054849786
-0.0367709457 -0.0204516710 -0.0094379835
0.0188470933 -0.0204516634 0.0606495752
0.0701270140 0.1835722486 -0.0371544915
0.3665721797 0.0865988633 -0.0997394655
0.4158487524 0.0815476572 -0.1388429291
-0.3280592550 0.0034323392 0.2620407473
-0.3117132341 0.0034323414 0.2826393286
-0.3496471639 0.0056452564 0.2791718497
-0.3333011430 0.0056452586 0.2997704310
0.1530602554 0.0878059781 0.0498118448
0.2023368281 0.0827547720 0.0107083812
0.3192073579 0.0780253379 -0.1391501073
0.3870310752 0.0710729150 -0.1929716723
-0.1658201108 0.1469322305 0.2717547282
-0.1259542231 0.1428456878 0.2401191212
-0.1701881734 0.1529741060 0.2654698141
-0.1303222857 0.1488875634 0.2338342070
-0.3403137523 0.0188396319 0.2446078916
-0.2975205446 0.0188396377 0.2985341269
-0.3529190906 0.0228428852 0.3089273625
-0.3630218676 0.0228428838 0.2961962596
-0.3619016612 0.0210525492 0.2617389940
-0.3191084535 0.0210525550 0.3156652293
-0.2963993262 0.0170491994 0.2640760583
-0.3065021033 0.0170491980 0.2513449554
-0.3648448176 0.0351741131 0.3025631278
-0.3595336296 0.0351741138 0.3092560679
-0.2984013342 0.0283631741 0.2498368484
-0.2930901462 0.0283631749 0.2565297885
0.0476628715 -0.1731719116 -0.0193280146
-0.1704921249 0.1473351269 0.3105492978
-0.1376417511 0.1439677253 0.2844808574
0.4186687959 0.0664626542 -0.1401758038
0.1277441227 0.1599515642 0.0085900623
0.1770206954 0.1549003581 -0.0305134013
-0.1568523242 0.1369844947 0.2483951701
-0.2020681357 0.1416194433 0.2842762134
0.3152601254 0.1136450334 -0.1487254358
0.3830838427 0.1066926105 -0.2025470008
0.2093599783 -0.1065202416 0.0371731550
0.0293768430 -0.1065202660 -0.1896341685
0.4049747260 -0.1265721719 -0.1180570843
0.2249915907 -0.1265721963 -0.3448644078
0.3352344498 0.0801806342 -0.1769942030
0.4030581670 0.0732282112 -0.2308157680
-0.1458180981 0.1743602647 0.2574720163
-0.1910339096 0.1789952133 0.2933530596
0.3611384628 0.1356251137 -0.1129197977
0.4104150355 0.1305739076 -0.1520232613
-0.1951626634 0.1814600782 0.2750523976
-0.1623122896 0.1780926766 0.2489839572
0.0457723954 -0.1761326900 -0.0155447161
0.0435481895 -0.1761326903 -0.0183475688
-0.1637970898 0.1724489513 0.2552710930
-0.1391582975 0.1699232964 0.2357189597
0.2225492083 0.1031703635 0.0267068083
0.0425660730 0.1031703391 -0.2001005153
0.4181639560 0.0831184332 -0.1285234310
0.2381808207 0.0831184088 -0.3553307546
-0.1538524056 0.0657619438 0.1242222875
-0.1379188416 0.0657619459 0.1443011076
0.0454770329 0.0453292307 -0.0339557477
0.0614105969 0.0453292328 -0.0138769275
0.3584549913 0.1513623753 -0.1424874964
0.3843606844 0.1487068539 -0.1630449799
-0.2451722015 0.0108976338 0.2619348313
-0.2927779432 0.0108976274 0.2019440391
-0.1434366256 0.0004689995 0.1812024838
-0.1910423673 0.0004689930 0.1212116916
0.3574706032 0.1200464787 -0.1541228061
0.4252943204 0.1130940558 -0.2079443712
-0.1688991228 0.1651564075 0.3102546621
-0.1360487490 0.1617890059 0.2841862217
0.1747713564 -0.0605277856 -0.1420103431
0.1960153029 -0.0605277827 -0.1152395980
0.2449295307 -0.0677195073 -0.1976844183
0.2661734772 -0.0677195044 -0.1709136733
0.4405442784 -0.0877714377 -0.3529146576
0.4617882248 -0.0877714348 -0.3261439126
-0.0208433912 -0.0404758552 0.0132198962
0.0004005552 -0.0404758523 0.0399906413
-0.1259733162 0.0507447766 0.1612942153
-0.1676870469 0.0507447710 0.1087282925
0.0733561223 0.0303120635 0.0031161801
0.0316423916 0.0303120578 -0.0494497427
-0.2853153800 0.0936632690 0.2919027729
-0.3310827885 0.0936632628 0.2342285724
-0.2825205077 0.0933767744 0.2896848998
-0.3282879162 0.0933767682 0.2320106993
-0.1770975422 -0.0801178131 0.1590307838
-0.1798924145 -0.0798313184 0.1612486569
0.1136645132 0.1122610319 -0.0029920369
0.1629410859 0.1072098258 -0.0420955005
0.2195035914 0.1298768278 -0.0596165014
0.4406415334 0.1072085849 -0.2351006920
0.2687801641 0.1248256217 -0.0987199651
0.3913649607 0.1122597910 -0.1959972284
0.3221610777 0.1170528876 -0.1281626650
0.4018928531 0.1088798024 -0.1914338790
-0.3345866101 0.0865584999 0.3202598034
-0.3698927586 0.0865584951 0.2757684513
-0.3373814824 0.0868449945 0.3224776765
-0.3726876308 0.0868449897 0.2779863244
0.3369708192 0.0996024546 -0.1773149235
0.4047945364 0.0926500317 -0.2311364885
0.4102093602 0.1075597792 -0.2493421963
0.2383479909 0.1251768160 -0.1129614694
0.2124412859 0.1278324411 -0.0924031829
0.3843036672 0.1102153006 -0.2287847128
-0.2045496122 0.1496663039 0.2673303257
-0.1716992384 0.1462989023 0.2412618853
0.1671406379 0.1354959936 0.0613949849
0.2164172106 0.1304447875 0.0222915213
0.1231233397 0.1256496948 0.0429134255
-0.1661074854 0.1552979520 0.2724327778
-0.1982434567 0.1585921222 0.2979343035
-0.1423541070 0.1528630585 0.2535832654
-0.1241894612 0.1510010505 0.2391686962
0.2069583761 0.1170559955 -0.0236139346
0.0007539786 -0.0232059658 0.1851889147
-0.1621643170 -0.0232059879 -0.0201140016
-0.0020408937 -0.0229194711 0.1874067878
-0.1649591892 -0.0229194932 -0.0178961285
-0.2366334121 -0.0429231827 0.1745072091
-0.2056967288 -0.0429231785 0.2134923414
-0.2484365570 0.1087414574 0.1458168023
-0.1804383667 0.1087414666 0.2315053171
-0.2456426967 0.1084550664 0.1435997322
-0.1776445064 0.1084550756 0.2292882470
-0.4114976009 0.0797402220 0.3195262033
-0.3866527125 0.0797402254 0.3508347070
-0.4142924732 0.0800267167 0.3217440764
-0.3894475848 0.0800267200 0.3530525801
0.3828489502 0.1215826386 -0.1415074672
0.4321255229 0.1165314325 -0.1806109308
0.3882818534 0.0725562590 -0.1283281438
0.4375584261 0.0675050529 -0.1674316074
-0.2376980344 -0.0253522729 0.2662015923
-0.2952349646 -0.0253522807 0.1936959260
-0.2404918947 -0.0250658819 0.2684186624
-0.2980288250 -0.0250658897 0.1959129961
-0.3630736181 0.0484546164 0.3066122356
0.0602918485 0.0050565855 -0.0293497687
-0.3113755649 0.0431551909 0.2655872042
-0.1534865330 0.0269704201 0.1402942368
0.2230643188 -0.0081052574 -0.0879252447
0.1543169393 -0.0081052667 -0.1745578569
0.2589631814 -0.0261530925 -0.4042708799
0.4705459923 -0.0261530638 -0.1376429486
0.0561005521 0.0054862238 -0.0260237621
-0.1269392943 0.0242491356 0.1192276543
-0.0524602454 0.0099122568 -0.0741528555
0.0783051829 0.0099122746 0.0906323437
0.2656876372 -0.0159979725 -0.1923417609
0.2980825355 -0.0100939088 -0.0332327124
0.1180994001 -0.0100939332 -0.2600400360
-0.1720324703 0.0272858525 0.1232430718
-0.1410957869 0.0272858567 0.1622282041
-0.2445400878 0.0314240470 0.1147798369
-0.1493277988 0.0314240599 0.2347624365
-0.2624723839 0.0381422602 0.2267800458
-0.2909016333 0.0437674965 0.3036549395
-0.3437968124 0.0437674893 0.2369986165
0.3294403544 -0.0133083126 -0.0581167347
0.1494572191 -0.0133083370 -0.2849240583
0.0147273342 -0.0016752247 -0.2216382771
0.2371985235 -0.0016751945 0.0587107397
0.1259632511 -0.0016752096 -0.0814633627
0.1818526008 -0.0074042733 -0.1258144008
0.3692345717 -0.0333145204 -0.4087891145
0.5000000000 -0.0333145026 -0.2440039153
-0.0319257808 0.0145095613 0.0438296047
-0.0230062377 0.0027508180 -0.1805138221
0.1885765732 0.0027508467 0.0861141092
0.2932224931 -0.0152969791 -0.1435993200
0.2244751135 -0.0152969884 -0.2302319321
-0.2191569236 0.0337021114 0.1924070277
0.0851236136 0.0075377480 0.0516515933
-0.0129500951 0.0075377347 -0.0719368493
-0.0347206530 0.0147960560 0.0460474778
-0.3546900133 0.0475952361 0.2999594193
-0.0956539311 0.0129088316 -0.0685480234
0.0630330563 0.0129088531 0.1314227728
-0.3559521969 0.0448739478 0.2438485498
-0.3003341578 0.0448739553 0.3139361086
-0.1702537427 0.0286891807 0.1535998694
-0.2833991334 0.0354073810 0.1456164636
-0.1881868444 0.0354073939 0.2655990631
0.1431545023 -0.0101396735 -0.2293830948
0.2739199306 -0.0101396558 -0.0645978956
0.4613023849 -0.0360499029 -0.3475720002
-0.3400569355 0.0477707448 0.3219156536
-0.3727481717 0.0477707404 0.2807195060
0.4936972832 -0.0301458391 -0.1884629517
0.3137141478 -0.0301458635 -0.4152702753
-0.3574848855 0.0478817307 0.3021772924
-0.1777834431 0.0225423982 0.0209620421
-0.0427963735 0.0225424165 0.1910671795
-0.2966525385 0.0386299818 0.1934790956
-0.2378081521 0.0386299898 0.2676323642
-0.1730486149 0.0289756753 0.1558177425
0.2103420819 -0.0217271550 -0.3768685164
0.4328132712 -0.0217271249 -0.0965194996
-0.1949169626 0.0282013474 0.1127467481
-0.1360725762 0.0282013554 0.1869000166
0.0574979882 0.0053429764 -0.0271326986
0.1726085100 -0.0173011124 -0.3357440614
0.3841913209 -0.0173010837 -0.0691161301
0.4888372408 -0.0353489095 -0.2988295593
0.4200898612 -0.0353489188 -0.3854621714
-0.3301085133 0.0427692188 0.2342479116
-0.2851128503 0.0427692249 0.2909495903
-0.1321200490 0.0162283106 -0.0479961008
0.0347336653 0.0162283332 0.1622660679
-0.2199018803 0.0296272845 0.1098301408
-0.1389096869 0.0296272954 0.2118931623
-0.3124895423 0.0459804137 0.3207860419
-0.3653847214 0.0459804066 0.2541297189
-0.3711724925 0.0469785745 0.2668342651
-0.3261768295 0.0469785806 0.3235359438
-0.0780351014 0.0192361011 0.0804196929
-0.2652662443 0.0384286512 0.2289971159
-0.0545904936 0.0099142274 -0.0767978214
0.0803965760 0.0099142457 0.0933073159
-0.0808299737 0.0195225958 0.0826375660
-0.1225780490 0.0264447338 0.1687117591
-0.1741391879 0.0264447268 0.1037365386
-0.4007993339 0.0523217758 0.3365495075
-0.2835371711 0.0419770590 0.2770643494
-0.3162284073 0.0419770546 0.2358682019
-0.2932119310 0.0412932867 0.2511734380
-0.3527713959 0.0482794222 0.3160846723
-0.3699584422 0.0482794199 0.2944262655
0.0274495711 0.0119466730 0.0673049946
-0.0412978084 0.0119466637 -0.0193276176
-0.2664193790 0.0334157137 0.1271110532
-0.1663075532 0.0334157272 0.2532678468
-0.2163630633 0.0334157204 0.1901899576
-0.1604196817 0.0195477907 -0.0171531103
-0.0017326943 0.0195478122 0.1828176860
0.0633484337 -0.0061011621 -0.2490406406
0.2749312446 -0.0061011334 0.0175872907
-0.2916301333 0.0395454804 0.2181498929
-0.2606934500 0.0395454846 0.2571350252
0.0141835398 0.0097830215 0.0072395165
-0.4035942062 0.0526082705 0.3387673806
-0.0844366914 0.0249189091 0.1862063088
-0.1825104001 0.0249188958 0.0626178662
-0.2792385817 0.0398609171 0.2400848755
0.1338256068 0.0067436177 0.0971135046
-0.0461575286 0.0067435933 -0.1296938190
0.0113886676 0.0100695162 0.0094573896
-0.0137621469 0.0126476571 0.0294158385
0.1736198240 -0.0132625900 -0.2535588752
0.3043852523 -0.0132625723 -0.0887736760
-0.3085806927 0.0428686963 0.2633693311
-0.2938172453 0.0372041454 0.1684857377
-0.2128250519 0.0372041564 0.2705487592
0.0588954243 0.0051997291 -0.0282416352
-0.2863279125 0.0414684832 0.2633583929
-0.3035149588 0.0414684809 0.2416999861
-0.1241444221 0.0239626409 0.1170097812
0.0767513895 0.0060120207 0.0105337239
0.0251902506 0.0060120137 -0.0544414966
0.0849198528 0.1468750107 0.0786695873
-0.0393074088 0.1468749939 -0.0778764839
0.0821249805 0.1471615054 0.0808874604
-0.0421022811 0.1471614886 -0.0756586108
0.0466808741 -0.1727479716 -0.0162656405
0.0444566681 -0.1727479719 -0.0190684931
0.0690935072 0.1835820473 -0.0340512419
0.0668693012 0.1835820470 -0.0368540946
0.3318307379 0.0894954437 -0.1124176136
0.4115625133 0.0813223585 -0.1756888277
-0.1511394466 0.1363758353 0.2758814928
-0.1265006543 0.1338501804 0.2563293595
0.4060721837 0.1346642751 -0.1916334524
0.3801654787 0.1373199002 -0.1710751660
0.0035251075 -0.1596713828 0.0156975423
0.0007302353 -0.1593848881 0.0179154154
-0.2143988567 0.0623958052 0.2842273611
-0.3074956931 0.0623957926 0.1669105678
-0.2171927170 0.0626821961 0.2864444312
-0.3102895534 0.0626821835 0.1691276379
-0.4149467609 0.0249033263 0.3222632929
-0.3901018724 0.0249033297 0.3535717965
-0.4177416331 0.0251898210 0.3244811660
-0.3928967447 0.0251898244 0.3557896696
-0.1782852660 0.1333626332 0.3025336053
-0.1454348922 0.1299952317 0.2764651649
-0.2578762861 -0.0413372438 0.1533077232
-0.1898780959 -0.0413372346 0.2389962379
-0.2550824258 -0.0416236348 0.1510906531
-0.1870842355 -0.0416236255 0.2367791678
0.3233087700 0.0678013639 -0.1518300560
0.3725853426 0.0627501579 -0.1909335196
-0.3422094613 0.0631780389 0.3172128857
-0.3686574536 0.0631780353 0.2838842166
-0.2856896969 0.0573843532 0.2723615815
-0.3121376893 0.0573843496 0.2390329124
0.1743233592 0.1625464504 0.0427988689
0.2002290523 0.1598909289 0.0222413854
0.1971663817 0.1137829650 -0.0665169356
0.2649900990 0.1068305420 -0.1203385007
0.3690277510 0.0961659282 -0.2028976626
0.4368514683 0.0892135052 -0.2567192276
0.1369849352 0.1536932598 0.0480954932
0.0022964135 0.1536932415 -0.1216334264
0.1327936387 0.1541228981 0.0514214999
-0.0018948829 0.1541228798 -0.1183074198
0.2026563377 0.1469614647 -0.0040181007
0.0679678161 0.1469614465 -0.1737470204
0.1341910748 0.1539796508 0.0503125633
-0.0004974468 0.1539796325 -0.1194163563
-0.0434251397 0.0603203914 -0.1643103921
0.1681576711 0.0603204201 0.1023175393
0.1728272297 0.0618311954 0.1051287953
-0.0451025032 0.0618311659 -0.1694972654
0.1686359333 0.0622608337 0.1084548019
-0.0492937996 0.0622608041 -0.1661712588
0.2384986323 0.0550994003 0.0530152013
0.0205688994 0.0550993708 -0.2216108594
0.1700333694 0.0621175864 0.1073458654
-0.0478963635 0.0621175568 -0.1672801953
-0.3394880736 0.0086319770 0.3241493721
-0.3747942220 0.0086319722 0.2796580200
-0.3422829458 0.0089184717 0.3263672452
-0.3775890943 0.0089184669 0.2818758931
-0.2029558046 0.1674875845 0.2670367051
-0.1701054307 0.1641201830 0.2409682647
0.4236035469 0.0948372236 -0.2200233667
0.3438717715 0.1030103088 -0.1567521527
-0.4029309879 0.0184314117 0.3382410869
-0.4057258601 0.0187179064 0.3404589600
0.1813659552 0.0443172586 -0.1472435036
0.2026099017 0.0443172615 -0.1204727585
0.2515241295 0.0371255369 -0.2029175788
0.2727680759 0.0371255398 -0.1761468337
0.4471388772 0.0170736065 -0.3581478181
0.4683828236 0.0170736094 -0.3313770730
-0.0142487925 0.0643691890 0.0079867357
0.0069951540 0.0643691919 0.0347574808
0.1496662429 -0.1713182120 -0.0296801246
0.0809188634 -0.1713182213 -0.1163127367
0.3452809906 -0.1913701423 -0.1849103639
0.2765336111 -0.1913701517 -0.2715429760
-0.1599754584 0.1574115684 0.2777662454
-0.1201095707 0.1533250258 0.2461306384
-0.1643427154 0.1634534439 0.2714823464
-0.1244768277 0.1593669013 0.2398467394
0.4417890112 0.0579570357 -0.2587662584
0.3620572358 0.0661301210 -0.1954950443
0.2699276419 0.0755740725 -0.1223855315
0.1901958665 0.0837471578 -0.0591143174
0.2246288511 0.1286869948 -0.1039292479
0.3964902204 0.1110699580 -0.2403099748
-0.1229555978 0.1593143084 0.2695839699
-0.1359089503 0.1606421210 0.2798631131
-0.2416835529 0.0663623441 0.2591664055
-0.2892892947 0.0663623377 0.1991756133
-0.1399479771 0.0559337098 0.1784340579
-0.1875537188 0.0559337033 0.1184432658
0.0465362613 -0.0672471226 0.0126857694
0.0162295415 -0.0672471267 -0.0255055089
-0.0852045095 -0.0618760324 -0.0457197275
0.0431762413 -0.0618760150 0.1160603995
-0.1499702601 -0.0552370733 0.0056751856
-0.0215895093 -0.0552370559 0.1674553126
-0.1230240437 -0.0498659616 0.1472404850
-0.1533307636 -0.0498659657 0.1090492066
-0.1587983953 -0.0128724853 0.1281471901
-0.1428648313 -0.0128724831 0.1482260102
0.0405310432 -0.0333051984 -0.0300308451
0.0564646072 -0.0333051962 -0.0099520249
-0.1495644597 0.1324599674 0.2581634941
-0.1947802712 0.1370949160 0.2940445375
-0.1980162225 0.1684582114 0.2570352218
-0.1807450858 0.1666877946 0.2433296975
-0.1385294280 0.1698357374 0.2672413555
-0.1837452395 0.1744706860 0.3031223989
0.3506397483 0.0916826356 -0.1013044918
0.4184634656 0.0847302127 -0.1551260569
0.2121309797 0.1302196180 -0.0145543837
0.1323992043 0.1383927032 0.0487168304
-0.5000000000 0.0625568701 0.4152702753
0.0676740694 -0.1273092092 0.0923550222
-0.0565531922 -0.1273092260 -0.0641910490
0.0648791972 -0.1270227145 0.0945728953
-0.0593480644 -0.1270227314 -0.0619731759
0.4332732070 0.0672797797 -0.2042783154
0.3535414316 0.0754528649 -0.1410071014
0.3178758506 0.1168274852 -0.1650093666
0.3671524232 0.1117762791 -0.2041128302
-0.1671119721 0.1913701517 0.2751705281
0.3450192574 0.0537588889 -0.1804177256
0.3942958301 0.0487076828 -0.2195211892
0.3466925158 0.1273023311 -0.1108798204
0.4145162331 0.1203499082 -0.1647013854
-0.1697317188 0.1580794275 0.2653855373
-0.1298658311 0.1539928848 0.2337499303
-0.1482657883 0.1653009913 0.3022872066
0.3301399643 0.0712386116 -0.1244966092
0.3979636816 0.0642861886 -0.1783181743
-0.3271453068 0.0215643279 0.2407211729
-0.2907435697 0.0215643328 0.2865931405
-0.3682092860 0.0257736836 0.2733075264
-0.3318075489 0.0257736885 0.3191794940
0.4537119954 0.0473850445 -0.1867488728
0.2818506261 0.0650020813 -0.0503681458
0.2559439211 0.0676577065 -0.0298098594
0.4278063023 0.0500405660 -0.1661913893
0.1669678665 0.0802744424 0.0441573009
0.1928735595 0.0776189209 0.0235998174
-0.3631962086 0.0613847282 0.3012548699
-0.3578850205 0.0613847290 0.3079478100
-0.2967527251 0.0545737893 0.2485285905
-0.2914415371 0.0545737900 0.2552215306
0.3493630967 0.0496680301 -0.1408083181
0.3752687898 0.0470125087 -0.1613658015
0.2151189627 0.1217039459 -0.0096890352
0.1353871873 0.1298770312 0.0535821789
-0.1616733107 0.1459694955 0.2359032527
3 1404 6 1022
3 1278 1022 6
3 1404 1335 6
3 1278 6 1335
3 1404 588 1335
3 1278 1335 588
3 1404 776 588
3 1278 588 776
3 1404 1049 776
3 1278 776 1049
3 1404 775 1049
3 1278 1049 775
3 1404 587 775
3 1278 775 587
3 1404 1334 587
3 1278 587 1334
3 1404 5 1334
3 1278 1334 5
3 1404 1022 5
3 1278 5 1022
3 174 758 177
3 758 764 177
3 1225 177 764
3 1162 758 174
3 758 579 764
3 579 585 764
3 1225 764 585
3 1162 579 758
3 579 1336 585
3 1336 1342 585
3 1225 585 1342
3 1162 1336 579
3 1336 1326 1342
3 1326 1332 1342
3 1225 1342 1332
3 1162 1326 1336
3 1326 819 1332
3 819 822 1332
3 1225 1332 822
3 1162 819 1326
3 819 1327 822
3 1327 1333 822
3 1225 822 1333
3 1162 1327 819
3 1327 1337 1333
3 1337 1343 1333
3 1225 1333 1343
3 1162 1337 1327
3 1337 580 1343
3 580 586 1343
3 1225 1343 586
3 1162 580 1337
3 580 759 586
3 759 765 586
3 1225 586 765
3 1162 759 580
3 759 174 765
3 174 177 765
3 1225 765 177
3 1162 174 759
3 1298 1405 1299
3 1405 1407 1299
3 1271 1299 1407
3 1264 1405 1298
3 1405 318 1407
3 318 320 1407
3 1271 1407 320
3 1264 318 1405
3 318 662 320
3 662 664 320
3 1271 320 664
3 1264 662 318
3 662 1284 664
3 1284 1286 664
3 1271 664 1286
3 1264 1284 662
3 1284 881 1286
3 881 882 1286
3 1271 1286 882
3 1264 881 1284
3 881 1285 882
3 1285 1287 882
3 1271 882 1287
3 1264 1285 881
3 1285 663 1287
3 663 665 1287
3 1271 1287 665
3 1264 663 1285
3 663 319 665
3 319 321 665
3 1271 665 321
3 1264 319 663
3 319 1406 321
3 1406 1408 321
3 1271 321 1408
3 1264 1406 319
3 1406 1298 1408
3 1298 1299 1408
3 1271 1408 1299
3 1264 1298 1406
3 772 799 773
3 799 801 773
3 1199 773 801
3 1191 799 772
3 799 324 801
3 324 326 801
3 1199 801 326
3 1191 324 799
3 324 658 326
3 658 660 326
3 1199 326 660
3 1191 658 324
3 658 224 660
3 224 226 660
3 1199 660 226
3 1191 224 658
3 224 128 226
3 128 129 226
3 1199 226 129
3 1191 128 224
3 128 225 129
3 225 227 129
3 1199 129 227
3 1191 225 128
3 225 659 227
3 659 661 227
3 1199 227 661
3 1191 659 225
3 659 325 661
3 325 327 661
3 1199 661 327
3 1191 325 659
3 325 800 327
3 800 802 327
3 1199 327 802
3 1191 800 325
3 800 772 802
3 772 773 802
3 1199 802 773
3 1191 772 800
3 399 351 400
3 351 353 400
3 1244 400 353
3 1240 351 399
3 351 1139 353
3 1139 1141 353
3 1244 353 1141
3 1240 1139 351
3 1139 650 1141
3 650 652 1141
3 1244 1141 652
3 1240 650 1139
3 650 646 652
3 646 648 652
3 1244 652 648
3 1240 646 650
3 646 723 648
3 723 724 648
3 1244 648 724
3 1240 723 646
3 723 647 724
3 647 649 724
3 1244 724 649
3 1240 647 723
3 647 651 649
3 651 653 649
3 1244 649 653
3 1240 651 647
3 651 1140 653
3 1140 1142 653
3 1244 653 1142
3 1240 1140 651
3 1140 352 1142
3 352 354 1142
3 1244 1142 354
3 1240 352 1140
3 352 399 354
3 399 400 354
3 1244 354 400
3 1240 399 352
3 107 337 106
3 337 335 106
3 1170 106 335
3 1281 337 107
3 337 860 335
3 860 858 335
3 1170 335 858
3 1281 860 337
3 860 147 858
3 147 145 858
3 1170 858 145
3 1281 147 860
3 147 542 145
3 542 540 145
3 1170 145 540
3 1281 542 147
3 542 741 540
3 741 740 540
3 1170 540 740
3 1281 741 542
3 741 541 740
3 541 539 740
3 1170 740 539
3 1281 541 741
3 541 146 539
3 146 144 539
3 1170 539 144
3 1281 146 541
3 146 859 144
3 859 857 144
3 1170 144 857
3 1281 859 146
3 859 336 857
3 336 334 857
3 1170 857 334
3 1281 336 859
3 336 107 334
3 107 106 334
3 1170 334 106
3 1281 107 336
3 1109 277 1110
3 277 279 1110
3 1220 1110 279
3 1205 277 1109
3 277 110 279
3 110 112 279
3 1220 279 112
3 1205 110 277
3 110 401 112
3 401 403 112
3 1220 112 403
3 1205 401 110
3 401 474 403
3 474 476 403
3 1220 403 476
3 1205 474 401
3 474 797 476
3 797 798 476
3 1220 476 798
3 1205 797 474
3 797 475 798
3 475 477 798
3 1220 798 477
3 1205 475 797
3 475 402 477
3 402 404 477
3 1220 477 404
3 1205 402 475
3 402 111 404
3 111 113 404
3 1220 404 113
3 1205 111 402
3 111 278 113
3 278 280 113
3 1220 113 280
3 1205 278 111
3 278 1109 280
3 1109 1110 280
3 1220 280 1110
3 1205 1109 278
3 714 1313 713
3 1313 1311 713
3 1196 713 1311
3 1257 1313 714
3 1313 95 1311
3 95 93 1311
3 1196 1311 93
3 1257 95 1313
3 95 929 93
3 929 927 93
3 1196 93 927
3 1257 929 95
3 929 1148 927
3 1148 1146 927
3 1196 927 1146
3 1257 1148 929
3 1148 42 1146
3 42 41 1146
3 1196 1146 41
3 1257 42 1148
3 42 1147 41
3 1147 1145 41
3 1196 41 1145
3 1257 1147 42
3 1147 928 1145
3 928 926 1145
3 1196 1145 926
3 1257 928 1147
3 928 94 926
3 94 92 926
3 1196 926 92
3 1257 94 928
3 94 1312 92
3 1312 1310 92
3 1196 92 1310
3 1257 1312 94
3 1312 714 1310
3 714 713 1310
3 1196 1310 713
3 1257 714 1312
3 935 1157 936
3 1157 1159 936
3 1241 936 1159
3 1180 1157 935
3 1157 611 1159
3 611 613 1159
3 1241 1159 613
3 1180 611 1157
3 611 1300 613
3 1300 1302 613
3 1241 613 1302
3 1180 1300 611
3 1300 623 1302
3 623 625 1302
3 1241 1302 625
3 1180 623 1300
3 623 104 625
3 104 105 625
3 1241 625 105
3 1180 104 623
3 104 624 105
3 624 626 105
3 1241 105 626
3 1180 624 104
3 624 1301 626
3 1301 1303 626
3 1241 626 1303
3 1180 1301 624
3 1301 612 1303
3 612 614 1303
3 1241 1303 614
3 1180 612 1301
3 612 1158 614
3 1158 1160 614
3 1241 614 1160
3 1180 1158 612
3 1158 935 1160
3 935 936 1160
3 1241 1160 936
3 1180 935 1158
3 10 717 9
3 717 715 9
3 1163 9 715
3 1275 717 10
3 717 617 715
3 617 615 715
3 1163 715 615
3 1275 617 717
3 617 381 615
3 381 379 615
3 1163 615 379
3 1275 381 617
3 381 1107 379
3 1107 1105 379
3 1163 379 1105
3 1275 1107 381
3 1107 479 1105
3 479 478 1105
3 1163 1105 478
3 1275 479 1107
3 479 1108 478
3 1108 1106 478
3 1163 478 1106
3 1275 1108 479
3 1108 382 1106
3 382 380 1106
3 1163 1106 380
3 1275 382 1108
3 382 618 380
3 618 616 380
3 1163 380 616
3 1275 618 382
3 618 718 616
3 718 716 616
3 1163 616 716
3 1275 718 618
3 718 10 716
3 10 9 716
3 1163 716 9
3 1275 10 718
3 207 1344 208
3 1344 1346 208
3 1215 208 1346
3 1200 1344 207
3 1344 362 1346
3 362 364 1346
3 1215 1346 364
3 1200 362 1344
3 362 634 364
3 634 636 364
3 1215 364 636
3 1200 634 362
3 634 1119 636
3 1119 1121 636
3 1215 636 1121
3 1200 1119 634
3 1119 766 1121
3 766 767 1121
3 1215 1121 767
3 1200 766 1119
3 766 1120 767
3 1120 1122 767
3 1215 767 1122
3 1200 1120 766
3 1120 633 1122
3 633 635 1122
3 1215 1122 635
3 1200 633 1120
3 633 361 635
3 361 363 635
3 1215 635 363
3 1200 361 633
3 361 1345 363
3 1345 1347 363
3 1215 363 1347
3 1200 1345 361
3 1345 207 1347
3 207 208 1347
3 1215 1347 208
3 1200 207 1345
3 1352 1305 1353
3 1305 1307 1353
3 1265 1353 1307
3 1247 1305 1352
3 1305 904 1307
3 904 906 1307
3 1265 1307 906
3 1247 904 1305
3 904 125 906
3 125 127 906
3 1265 906 127
3 1247 125 904
3 125 1150 127
3 1150 1152 127
3 1265 127 1152
3 1247 1150 125
3 1150 569 1152
3 569 570 1152
3 1265 1152 570
3 1247 569 1150
3 569 1149 570
3 1149 1151 570
3 1265 570 1151
3 1247 1149 569
3 1149 124 1151
3 124 126 1151
3 1265 1151 126
3 1247 124 1149
3 124 903 126
3 903 905 126
3 1265 126 905
3 1247 903 124
3 903 1304 905
3 1304 1306 905
3 1265 905 1306
3 1247 1304 903
3 1304 1352 1306
3 1352 1353 1306
3 1265 1306 1353
3 1247 1352 1304
3 538 533 446
3 446 533 441
3 538 439 531
3 538 446 439
3 538 531 533
3 533 531 536
3 533 536 444
3 533 444 441
3 446 444 439
3 446 441 444
3 439 536 531
3 439 444 536
3 532 535 440
3 440 535 443
3 532 445 537
3 532 440 445
3 532 537 535
3 535 537 534
3 535 534 442
3 535 442 443
3 440 442 445
3 440 443 442
3 445 534 537
3 445 442 534
3 123 851 8
3 8 851 1291
3 123 7 122
3 123 8 7
3 123 122 851
3 851 122 850
3 851 850 1290
3 851 1290 1291
3 8 1290 7
3 8 1291 1290
3 7 850 122
3 7 1290 850
3 481 1289 909
3 909 1289 1072
3 481 908 480
3 481 909 908
3 481 480 1289
3 1289 480 1288
3 1289 1288 1071
3 1289 1071 1072
3 909 1071 908
3 909 1072 1071
3 908 1288 480
3 908 1071 1288
3 556 499 191
3 191 499 638
3 556 994 834
3 556 191 994
3 556 834 499
3 499 834 752
3 499 752 931
3 499 931 638
3 191 931 994
3 191 638 931
3 994 752 834
3 994 931 752
3 246 415 454
3 454 415 410
3 246 180 27
3 246 454 180
3 246 27 415
3 415 27 109
3 415 109 90
3 415 90 410
3 454 90 180
3 454 410 90
3 180 109 27
3 180 90 109
3 26 108 181
3 181 108 91
3 26 453 245
3 26 181 453
3 26 245 108
3 108 245 414
3 108 414 409
3 108 409 91
3 181 409 453
3 181 91 409
3 453 414 245
3 453 409 414
3 835 753 993
3 993 753 930
3 835 190 555
3 835 993 190
3 835 555 753
3 753 555 498
3 753 498 637
3 753 637 930
3 993 637 190
3 993 930 637
3 190 498 555
3 190 637 498
3 176 762 175
3 762 760 175
3 1169 175 760
3 1187 762 176
3 762 583 760
3 583 581 760
3 1169 760 581
3 1187 583 762
3 583 1340 581
3 1340 1338 581
3 1169 581 1338
3 1187 1340 583
3 1340 1330 1338
3 1330 1328 1338
3 1169 1338 1328
3 1187 1330 1340
3 1330 821 1328
3 821 820 1328
3 1169 1328 820
3 1187 821 1330
3 821 1331 820
3 1331 1329 820
3 1169 820 1329
3 1187 1331 821
3 1331 1341 1329
3 1341 1339 1329
3 1169 1329 1339
3 1187 1341 1331
3 1341 584 1339
3 584 582 1339
3 1169 1339 582
3 1187 584 1341
3 584 763 582
3 763 761 582
3 1169 582 761
3 1187 763 584
3 763 176 761
3 176 175 761
3 1169 761 175
3 1187 176 763
3 1279 867 1250
3 867 1436 1250
3 1436 1435 1250
3 1435 868 1250
3 868 1280 1250
3 1280 151 1250
3 151 1047 1250
3 1047 1048 1250
3 1048 150 1250
3 150 1279 1250
3 1279 1248 867
3 1248 1318 867
3 867 1318 1436
3 1318 783 1436
3 1436 783 1435
3 783 784 1435
3 1435 784 868
3 784 1319 868
3 868 1319 1280
3 1319 1249 1280
3 1280 1249 151
3 1249 604 151
3 151 604 1047
3 604 1044 1047
3 1047 1044 1048
3 1044 1043 1048
3 1048 1043 150
3 1043 603 150
3 150 603 1279
3 603 1248 1279
3 1248 1231 1318
3 1231 491 1318
3 1318 491 783
3 491 639 783
3 783 639 784
3 639 640 784
3 784 640 1319
3 640 490 1319
3 1319 490 1249
3 490 1230 1249
3 1249 1230 604
3 1230 1423 604
3 604 1423 1044
3 1423 356 1044
3 1044 356 1043
3 356 355 1043
3 1043 355 603
3 355 1424 603
3 603 1424 1248
3 1424 1231 1248
3 1231 1181 491
3 1181 778 491
3 491 778 639
3 778 2 639
3 639 2 640
3 2 1 640
3 640 1 490
3 1 777 490
3 490 777 1230
3 777 1182 1230
3 1230 1182 1423
3 1182 1037 1423
3 1423 1037 356
3 1037 1025 356
3 356 1025 355
3 1025 1026 355
3 355 1026 1424
3 1026 1038 1424
3 1424 1038 1231
3 1038 1181 1231
3 1181 1204 778
3 1204 947 778
3 778 947 2
3 947 345 2
3 2 345 1
3 345 346 1
3 1 346 777
3 346 946 777
3 777 946 1182
3 946 1203 1182
3 1182 1203 1037
3 1203 861 1037
3 1037 861 1025
3 861 632 1025
3 1025 632 1026
3 632 631 1026
3 1026 631 1038
3 631 862 1038
3 1038 862 1181
3 862 1204 1181
3 1204 1236 947
3 1236 782 947
3 947 782 345
3 782 4 345
3 345 4 346
3 4 3 346
3 346 3 946
3 3 781 946
3 946 781 1203
3 781 1237 1203
3 1203 1237 861
3 1237 1041 861
3 861 1041 632
3 1041 1027 632
3 632 1027 631
3 1027 1028 631
3 631 1028 862
3 1028 1042 862
3 862 1042 1204
3 1042 1236 1204
3 1236 1239 782
3 1239 493 782
3 782 493 4
3 493 641 4
3 4 641 3
3 641 642 3
3 3 642 781
3 642 492 781
3 781 492 1237
3 492 1238 1237
3 1237 1238 1041
3 1238 1425 1041
3 1041 1425 1027
3 1425 358 1027
3 1027 358 1028
3 358 357 1028
3 1028 357 1042
3 357 1426 1042
3 1042 1426 1236
3 1426 1239 1236
3 1239 1211 493
3 1211 1316 493
3 493 1316 641
3 1316 779 641
3 641 779 642
3 779 780 642
3 642 780 492
3 780 1317 492
3 492 1317 1238
3 1317 1212 1238
3 1238 1212 1425
3 1212 602 1425
3 1425 602 358
3 602 1040 358
3 358 1040 357
3 1040 1039 357
3 357 1039 1426
3 1039 601 1426
3 1426 601 1239
3 601 1211 1239
3 1211 1251 1316
3 1251 865 1316
3 1316 865 779
3 865 1434 779
3 779 1434 780
3 1434 1433 780
3 780 1433 1317
3 1433 866 1317
3 1317 866 1212
3 866 1252 1212
3 1212 1252 602
3 1252 149 602
3 602 149 1040
3 149 1045 1040
3 1040 1045 1039
3 1045 1046 1039
3 1039 1046 601
3 1046 148 601
3 601 148 1211
3 148 1251 1211
3 1251 1161 865
3 1161 1161 865
3 865 1161 1434
3 1161 1161 1434
3 1434 1161 1433
3 1161 1161 1433
3 1433 1161 866
3 1161 1161 866
3 866 1161 1252
3 1161 1161 1252
3 1252 1161 149
3 1161 1161 149
3 149 1161 1045
3 1161 1161 1045
3 1045 1161 1046
3 1161 1161 1046
3 1046 1161 148
3 1161 1161 148
3 148 1161 1251
3 1161 1161 1251
3 1177 384 1164
3 384 375 1164
3 375 376 1164
3 376 383 1164
3 383 1176 1164
3 1176 605 1164
3 605 116 1164
3 116 115 1164
3 115 606 1164
3 606 1177 1164
3 1177 1224 384
3 1224 1380 384
3 384 1380 375
3 1380 172 375
3 375 172 376
3 172 173 376
3 376 173 383
3 173 1381 383
3 383 1381 1176
3 1381 1223 1176
3 1176 1223 605
3 1223 1088 605
3 605 1088 116
3 1088 288 116
3 116 288 115
3 288 287 115
3 115 287 606
3 287 1087 606
3 606 1087 1177
3 1087 1224 1177
3 1224 1235 1380
3 1235 920 1380
3 1380 920 172
3 920 628 172
3 172 628 173
3 628 627 173
3 173 627 1381
3 627 921 1381
3 1381 921 1223
3 921 1234 1223
3 1223 1234 1088
3 1234 101 1088
3 1088 101 288
3 101 347 288
3 288 347 287
3 347 348 287
3 287 348 1087
3 348 100 1087
3 1087 100 1224
3 100 1235 1224
3 1235 1179 920
3 1179 167 920
3 920 167 628
3 167 754 628
3 628 754 627
3 754 755 627
3 627 755 921
3 755 166 921
3 921 166 1234
3 166 1178 1234
3 1234 1178 101
3 1178 281 101
3 101 281 347
3 281 219 347
3 347 219 348
3 219 218 348
3 348 218 100
3 218 282 100
3 100 282 1235
3 282 1179 1235
3 1179 1256 167
3 1256 121 167
3 167 121 754
3 121 671 754
3 754 671 755
3 671 670 755
3 755 670 166
3 670 120 166
3 166 120 1178
3 120 1255 1178
3 1178 1255 281
3 1255 914 281
3 281 914 219
3 914 1143 219
3 219 1143 218
3 1143 1144 218
3 218 1144 282
3 1144 915 282
3 282 915 1179
3 915 1256 1179
3 1256 1207 121
3 1207 169 121
3 121 169 671
3 169 756 671
3 671 756 670
3 756 757 670
3 670 757 120
3 757 168 120
3 120 168 1255
3 168 1206 1255
3 1255 1206 914
3 1206 283 914
3 914 283 1143
3 283 221 1143
3 1143 221 1144
3 221 220 1144
3 1144 220 915
3 220 284 915
3 915 284 1256
3 284 1207 1256
3 1207 1277 169
3 1277 922 169
3 169 922 756
3 922 630 756
3 756 630 757
3 630 629 757
3 757 629 168
3 629 923 168
3 168 923 1206
3 923 1276 1206
3 1206 1276 283
3 1276 103 283
3 283 103 221
3 103 349 221
3 221 349 220
3 349 350 220
3 220 350 284
3 350 102 284
3 284 102 1207
3 102 1277 1207
3 1277 1219 922
3 1219 1378 922
3 922 1378 630
3 1378 170 630
3 630 170 629
3 170 171 629
3 629 171 923
3 171 1379 923
3 923 1379 1276
3 1379 1218 1276
3 1276 1218 103
3 1218 1086 103
3 103 1086 349
3 1086 286 349
3 349 286 350
3 286 285 350
3 350 285 102
3 285 1085 102
3 102 1085 1277
3 1085 1219 1277
3 1219 1263 1378
3 1263 386 1378
3 1378 386 170
3 386 377 170
3 170 377 171
3 377 378 171
3 171 378 1379
3 378 385 1379
3 1379 385 1218
3 385 1262 1218
3 1218 1262 1086
3 1262 607 1086
3 1086 607 286
3 607 118 286
3 286 118 285
3 118 117 285
3 285 117 1085
3 117 608 1085
3 1085 608 1219
3 608 1263 1219
3 1263 1268 386
3 1268 1268 386
3 386 1268 377
3 1268 1268 377
3 377 1268 378
3 1268 1268 378
3 378 1268 385
3 1268 1268 385
3 385 1268 1262
3 1268 1268 1262
3 1262 1268 607
3 1268 1268 607
3 607 1268 118
3 1268 1268 118
3 118 1268 117
3 1268 1268 117
3 117 1268 608
3 1268 1268 608
3 608 1268 1263
3 1268 1268 1263
3 1282 1103 1169
3 1103 1082 1169
3 1082 1081 1169
3 1081 1104 1169
3 1104 1283 1169
3 1283 722 1169
3 722 1392 1169
3 1392 1393 1169
3 1393 721 1169
3 721 1282 1169
3 1282 1197 1103
3 1197 427 1103
3 1103 427 1082
3 427 545 1082
3 1082 545 1081
3 545 546 1081
3 1081 546 1104
3 546 428 1104
3 1104 428 1283
3 428 1198 1283
3 1283 1198 722
3 1198 77 722
3 722 77 1392
3 77 1383 1392
3 1392 1383 1393
3 1383 1382 1393
3 1393 1382 721
3 1382 76 721
3 721 76 1282
3 76 1197 1282
3 1197 1243 427
3 1243 206 427
3 427 206 545
3 206 34 545
3 545 34 546
3 34 35 546
3 546 35 428
3 35 205 428
3 428 205 1198
3 205 1242 1198
3 1198 1242 77
3 1242 770 77
3 77 770 1383
3 770 872 1383
3 1383 872 1382
3 872 871 1382
3 1382 871 76
3 871 771 76
3 76 771 1197
3 771 1243 1197
3 1243 1202 206
3 1202 548 206
3 206 548 34
3 548 328 34
3 34 328 35
3 328 329 35
3 35 329 205
3 329 547 205
3 205 547 1242
3 547 1201 1242
3 1242 1201 770
3 1201 1384 770
3 770 1384 872
3 1384 655 872
3 872 655 871
3 655 654 871
3 871 654 771
3 654 1385 771
3 771 1385 1243
3 1385 1202 1243
3 1202 1233 548
3 1233 1013 548
3 548 1013 328
3 1013 239 328
3 328 239 329
3 239 240 329
3 329 240 547
3 240 1012 547
3 547 1012 1201
3 1012 1232 1201
3 1201 1232 1384
3 1232 793 1384
3 1384 793 655
3 793 426 655
3 655 426 654
3 426 425 654
3 654 425 1385
3 425 794 1385
3 1385 794 1202
3 794 1233 1202
3 1233 1259 1013
3 1259 550 1013
3 1013 550 239
3 550 330 239
3 239 330 240
3 330 331 240
3 240 331 1012
3 331 549 1012
3 1012 549 1232
3 549 1258 1232
3 1232 1258 793
3 1258 1386 793
3 793 1386 426
3 1386 657 426
3 426 657 425
3 657 656 425
3 425 656 794
3 656 1387 794
3 794 1387 1233
3 1387 1259 1233
3 1259 1217 550
3 1217 204 550
3 550 204 330
3 204 32 330
3 330 32 331
3 32 33 331
3 331 33 549
3 33 203 549
3 549 203 1258
3 203 1216 1258
3 1258 1216 1386
3 1216 768 1386
3 1386 768 657
3 768 870 657
3 657 870 656
3 870 869 656
3 656 869 1387
3 869 769 1387
3 1387 769 1259
3 769 1217 1259
3 1217 1266 204
3 1266 429 204
3 204 429 32
3 429 551 32
3 32 551 33
3 551 552 33
3 33 552 203
3 552 430 203
3 203 430 1216
3 430 1267 1216
3 1216 1267 768
3 1267 79 768
3 768 79 870
3 79 1389 870
3 870 1389 869
3 1389 1388 869
3 869 1388 769
3 1388 78 769
3 769 78 1217
3 78 1266 1217
3 1266 1245 429
3 1245 1101 429
3 429 1101 551
3 1101 1080 551
3 551 1080 552
3 1080 1079 552
3 552 1079 430
3 1079 1102 430
3 430 1102 1267
3 1102 1246 1267
3 1267 1246 79
3 1246 720 79
3 79 720 1389
3 720 1390 1389
3 1389 1390 1388
3 1390 1391 1388
3 1388 1391 78
3 1391 719 78
3 78 719 1266
3 719 1245 1266
3 1245 1164 1101
3 1164 1164 1101
3 1101 1164 1080
3 1164 1164 1080
3 1080 1164 1079
3 1164 1164 1079
3 1079 1164 1102
3 1164 1164 1102
3 1102 1164 1246
3 1164 1164 1246
3 1246 1164 720
3 1164 1164 720
3 720 1164 1390
3 1164 1164 1390
3 1390 1164 1391
3 1164 1164 1391
3 1391 1164 719
3 1164 1164 719
3 719 1164 1245
3 1164 1164 1245
3 1194 806 1173
3 806 1357 1173
3 1357 1356 1173
3 1356 805 1173
3 805 1195 1173
3 1195 1016 1173
3 1016 1095 1173
3 1095 1096 1173
3 1096 1017 1173
3 1017 1194 1173
3 1194 1274 806
3 1274 980 806
3 806 980 1357
3 980 710 1357
3 1357 710 1356
3 710 709 1356
3 1356 709 805
3 709 979 805
3 805 979 1195
3 979 1273 1195
3 1195 1273 1016
3 1273 62 1016
3 1016 62 1095
3 62 263 1095
3 1095 263 1096
3 263 264 1096
3 1096 264 1017
3 264 63 1017
3 1017 63 1194
3 63 1274 1194
3 1274 1174 980
3 1174 873 980
3 980 873 710
3 873 997 710
3 710 997 709
3 997 996 709
3 709 996 979
3 996 874 979
3 979 874 1273
3 874 1175 1273
3 1273 1175 62
3 1175 949 62
3 62 949 263
3 949 68 263
3 263 68 264
3 68 69 264
3 264 69 63
3 69 948 63
3 63 948 1274
3 948 1174 1274
3 1174 1261 873
3 1261 707 873
3 873 707 997
3 707 507 997
3 997 507 996
3 507 506 996
3 996 506 874
3 506 708 874
3 874 708 1175
3 708 1260 1175
3 1175 1260 949
3 1260 262 949
3 949 262 68
3 262 514 68
3 68 514 69
3 514 515 69
3 69 515 948
3 515 261 948
3 948 261 1174
3 261 1261 1174
3 1261 1186 707
3 1186 1075 707
3 707 1075 507
3 1075 910 507
3 507 910 506
3 910 911 506
3 506 911 708
3 911 1076 708
3 708 1076 1260
3 1076 1185 1260
3 1260 1185 262
3 1185 1060 262
3 262 1060 514
3 1060 1363 514
3 514 1363 515
3 1363 1362 515
3 515 1362 261
3 1362 1059 261
3 261 1059 1261
3 1059 1186 1261
3 1186 1193 1075
3 1193 701 1075
3 1075 701 910
3 701 503 910
3 910 503 911
3 503 502 911
3 911 502 1076
3 502 702 1076
3 1076 702 1185
3 702 1192 1185
3 1185 1192 1060
3 1192 256 1060
3 1060 256 1363
3 256 510 1363
3 1363 510 1362
3 510 511 1362
3 1362 511 1059
3 511 255 1059
3 1059 255 1186
3 255 1193 1186
3 1193 1269 701
3 1269 879 701
3 701 879 503
3 879 1003 503
3 503 1003 502
3 1003 1002 502
3 502 1002 702
3 1002 880 702
3 702 880 1192
3 880 1270 1192
3 1192 1270 256
3 1270 955 256
3 256 955 510
3 955 74 510
3 510 74 511
3 74 75 511
3 511 75 255
3 75 954 255
3 255 954 1193
3 954 1269 1193
3 1269 1172 879
3 1172 974 879
3 879 974 1003
3 974 698 1003
3 1003 698 1002
3 698 697 1002
3 1002 697 880
3 697 973 880
3 880 973 1270
3 973 1171 1270
3 1270 1171 955
3 1171 56 955
3 955 56 74
3 56 251 74
3 74 251 75
3 251 252 75
3 75 252 954
3 252 57 954
3 954 57 1269
3 57 1172 1269
3 1172 1253 974
3 1253 810 974
3 974 810 698
3 810 1361 698
3 698 1361 697
3 1361 1360 697
3 697 1360 973
3 1360 809 973
3 973 809 1171
3 809 1254 1171
3 1171 1254 56
3 1254 1020 56
3 56 1020 251
3 1020 1099 251
3 251 1099 252
3 1099 1100 252
3 252 1100 57
3 1100 1021 57
3 57 1021 1172
3 1021 1253 1172
3 1253 1272 810
3 1272 1272 810
3 810 1272 1361
3 1272 1272 1361
3 1361 1272 1360
3 1272 1272 1360
3 1360 1272 809
3 1272 1272 809
3 809 1272 1254
3 1272 1272 1254
3 1254 1272 1020
3 1272 1272 1020
3 1020 1272 1099
3 1272 1272 1099
3 1099 1272 1100
3 1272 1272 1100
3 1100 1272 1021
3 1272 1272 1021
3 1021 1272 1253
3 1272 1272 1253
3 1228 808 1210
3 808 1359 1210
3 1359 1358 1210
3 1358 807 1210
3 807 1229 1210
3 1229 1018 1210
3 1018 1097 1210
3 1097 1098 1210
3 1098 1019 1210
3 1019 1228 1210
3 1228 1190 808
3 1190 976 808
3 808 976 1359
3 976 700 1359
3 1359 700 1358
3 700 699 1358
3 1358 699 807
3 699 975 807
3 807 975 1229
3 975 1189 1229
3 1229 1189 1018
3 1189 58 1018
3 1018 58 1097
3 58 253 1097
3 1097 253 1098
3 253 254 1098
3 1098 254 1019
3 254 59 1019
3 1019 59 1228
3 59 1190 1228
3 1190 1213 976
3 1213 877 976
3 976 877 700
3 877 1001 700
3 700 1001 699
3 1001 1000 699
3 699 1000 975
3 1000 878 975
3 975 878 1189
3 878 1214 1189
3 1189 1214 58
3 1214 953 58
3 58 953 253
3 953 72 253
3 253 72 254
3 72 73 254
3 254 73 59
3 73 952 59
3 59 952 1190
3 952 1213 1190
3 1213 1168 877
3 1168 695 877
3 877 695 1001
3 695 501 1001
3 1001 501 1000
3 501 500 1000
3 1000 500 878
3 500 696 878
3 878 696 1214
3 696 1167 1214
3 1214 1167 953
3 1167 250 953
3 953 250 72
3 250 508 72
3 72 508 73
3 508 509 73
3 73 509 952
3 509 249 952
3 952 249 1213
3 249 1168 1213
3 1168 1222 695
3 1222 1077 695
3 695 1077 501
3 1077 912 501
3 501 912 500
3 912 913 500
3 500 913 696
3 913 1078 696
3 696 1078 1167
3 1078 1221 1167
3 1167 1221 250
3 1221 1062 250
3 250 1062 508
3 1062 1365 508
3 508 1365 509
3 1365 1364 509
3 509 1364 249
3 1364 1061 249
3 249 1061 1168
3 1061 1222 1168
3 1222 1227 1077
3 1227 705 1077
3 1077 705 912
3 705 505 912
3 912 505 913
3 505 504 913
3 913 504 1078
3 504 706 1078
3 1078 706 1221
3 706 1226 1221
3 1221 1226 1062
3 1226 260 1062
3 1062 260 1365
3 260 512 1365
3 1365 512 1364
3 512 513 1364
3 1364 513 1061
3 513 259 1061
3 1061 259 1222
3 259 1227 1222
3 1227 1183 705
3 1183 875 705
3 705 875 505
3 875 999 505
3 505 999 504
3 999 998 504
3 504 998 706
3 998 876 706
3 706 876 1226
3 876 1184 1226
3 1226 1184 260
3 1184 951 260
3 260 951 512
3 951 70 512
3 512 70 513
3 70 71 513
3 513 71 259
3 71 950 259
3 259 950 1227
3 950 1183 1227
3 1183 1209 875
3 1209 978 875
3 875 978 999
3 978 704 999
3 999 704 998
3 704 703 998
3 998 703 876
3 703 977 876
3 876 977 1184
3 977 1208 1184
3 1184 1208 951
3 1208 60 951
3 951 60 70
3 60 257 70
3 70 257 71
3 257 258 71
3 71 258 950
3 258 61 950
3 950 61 1183
3 61 1209 1183
3 1209 1165 978
3 1165 804 978
3 978 804 704
3 804 1355 704
3 704 1355 703
3 1355 1354 703
3 703 1354 977
3 1354 803 977
3 977 803 1208
3 803 1166 1208
3 1208 1166 60
3 1166 1014 60
3 60 1014 257
3 1014 1093 257
3 257 1093 258
3 1093 1094 258
3 258 1094 61
3 1094 1015 61
3 61 1015 1209
3 1015 1165 1209
3 1165 1188 804
3 1188 1188 804
3 804 1188 1355
3 1188 1188 1355
3 1355 1188 1354
3 1188 1188 1354
3 1354 1188 803
3 1188 1188 803
3 803 1188 1166
3 1188 1188 1166
3 1166 1188 1014
3 1188 1188 1014
3 1014 1188 1093
3 1188 1188 1093
3 1093 1188 1094
3 1188 1188 1094
3 1094 1188 1015
3 1188 1188 1015
3 1015 1188 1165
3 1188 1188 1165
3 576 726 484
3 726 1118 484
3 1118 812 484
3 812 235 484
3 235 290 484
3 290 223 484
3 223 1293 484
3 1293 156 484
3 156 693 484
3 693 576 484
3 576 1417 726
3 1417 1009 726
3 726 1009 1118
3 1009 216 1118
3 1118 216 812
3 216 1058 812
3 812 1058 235
3 1058 958 235
3 235 958 290
3 958 1032 290
3 290 1032 223
3 1032 1422 223
3 223 1422 1293
3 1422 735 1293
3 1293 735 156
3 735 1401 156
3 156 1401 693
3 1401 39 693
3 693 39 576
3 39 1417 576
3 1417 1068 1009
3 1068 193 1009
3 1009 193 216
3 193 368 216
3 216 368 1058
3 368 1412 1058
3 1058 1412 958
3 1412 489 958
3 958 489 1032
3 489 1315 1032
3 1032 1315 1422
3 1315 669 1422
3 1422 669 735
3 669 527 735
3 735 527 1401
3 527 1024 1401
3 1401 1024 39
3 1024 467 39
3 39 467 1417
3 467 1068 1417
3 1068 523 193
3 523 1084 193
3 193 1084 368
3 1084 210 368
3 368 210 1412
3 210 679 1412
3 1412 679 489
3 679 165 489
3 489 165 1315
3 165 388 1315
3 1315 388 669
3 388 1438 669
3 669 1438 527
3 1438 854 527
3 527 854 1024
3 854 244 1024
3 1024 244 467
3 244 786 467
3 467 786 1068
3 786 523 1068
3 523 13 1084
3 13 694 1084
3 1084 694 210
3 694 291 210
3 210 291 679
3 291 43 679
3 679 43 165
3 43 891 165
3 165 891 388
3 891 774 388
3 388 774 1438
3 774 0 1438
3 1438 0 854
3 0 528 854
3 854 528 244
3 528 941 244
3 244 941 786
3 941 89 786
3 786 89 523
3 89 13 523
3 13 522 694
3 522 1083 694
3 694 1083 291
3 1083 209 291
3 291 209 43
3 209 678 43
3 43 678 891
3 678 164 891
3 891 164 774
3 164 387 774
3 774 387 0
3 387 1437 0
3 0 1437 528
3 1437 853 528
3 528 853 941
3 853 243 941
3 941 243 89
3 243 785 89
3 89 785 13
3 785 522 13
3 522 1067 1083
3 1067 192 1083
3 1083 192 209
3 192 367 209
3 209 367 678
3 367 1411 678
3 678 1411 164
3 1411 488 164
3 164 488 387
3 488 1314 387
3 387 1314 1437
3 1314 668 1437
3 1437 668 853
3 668 526 853
3 853 526 243
3 526 1023 243
3 243 1023 785
3 1023 466 785
3 785 466 522
3 466 1067 522
3 1067 1416 192
3 1416 1008 192
3 192 1008 367
3 1008 215 367
3 367 215 1411
3 215 1057 1411
3 1411 1057 488
3 1057 957 488
3 488 957 1314
3 957 1031 1314
3 1314 1031 668
3 1031 1421 668
3 668 1421 526
3 1421 734 526
3 526 734 1023
3 734 1400 1023
3 1023 1400 466
3 1400 38 466
3 466 38 1067
3 38 1416 1067
3 1416 575 1008
3 575 725 1008
3 1008 725 215
3 725 1117 215
3 215 1117 1057
3 1117 811 1057
3 1057 811 957
3 811 234 957
3 957 234 1031
3 234 289 1031
3 1031 289 1421
3 289 222 1421
3 1421 222 734
3 222 1292 734
3 734 1292 1400
3 1292 155 1400
3 1400 155 38
3 155 692 38
3 38 692 1416
3 692 575 1416
3 575 485 725
3 725 485 1117
3 1117 485 811
3 811 485 234
3 234 485 289
3 289 485 222
3 222 485 1292
3 1292 485 155
3 155 485 692
3 692 485 575
3 736 815 563
3 815 1350 563
3 1350 937 563
3 937 418 563
3 418 470 563
3 470 342 563
3 342 1409 563
3 1409 228 563
3 228 791 563
3 791 736 563
3 736 137 815
3 137 1090 815
3 815 1090 1350
3 1090 370 1350
3 1350 370 937
3 370 1124 937
3 937 1124 418
3 1124 1064 418
3 418 1064 470
3 1064 895 470
3 470 895 342
3 895 21 342
3 342 21 1409
3 21 893 1409
3 1409 893 228
3 893 97 228
3 228 97 791
3 97 139 791
3 791 139 736
3 139 137 736
3 137 1154 1090
3 1154 270 1090
3 1090 270 370
3 270 521 370
3 370 521 1124
3 521 67 1124
3 1124 67 1064
3 67 578 1064
3 1064 578 895
3 578 1415 895
3 895 1415 21
3 1415 751 21
3 21 751 893
3 751 644 893
3 893 644 97
3 644 1156 97
3 97 1156 139
3 1156 558 139
3 139 558 137
3 558 1154 137
3 1154 621 270
3 621 1296 270
3 270 1296 521
3 1296 306 521
3 521 306 67
3 306 817 67
3 67 817 578
3 817 310 578
3 578 310 1415
3 310 472 1415
3 1415 472 751
3 472 98 751
3 751 98 644
3 98 967 644
3 644 967 1156
3 967 389 1156
3 1156 389 558
3 389 916 558
3 558 916 1154
3 916 621 1154
3 621 186 1296
3 186 852 1296
3 1296 852 306
3 852 420 306
3 306 420 817
3 420 152 817
3 817 152 310
3 152 995 310
3 310 995 472
3 995 907 472
3 472 907 98
3 907 119 98
3 98 119 967
3 119 645 967
3 967 645 389
3 645 1052 389
3 389 1052 916
3 1052 187 916
3 916 187 621
3 187 186 621
3 186 622 852
3 622 1297 852
3 852 1297 420
3 1297 307 420
3 420 307 152
3 307 818 152
3 152 818 995
3 818 311 995
3 995 311 907
3 311 473 907
3 907 473 119
3 473 99 119
3 119 99 645
3 99 968 645
3 645 968 1052
3 968 390 1052
3 1052 390 187
3 390 917 187
3 187 917 186
3 917 622 186
3 622 1153 1297
3 1153 269 1297
3 1297 269 307
3 269 520 307
3 307 520 818
3 520 66 818
3 818 66 311
3 66 577 311
3 311 577 473
3 577 1414 473
3 473 1414 99
3 1414 750 99
3 99 750 968
3 750 643 968
3 968 643 390
3 643 1155 390
3 390 1155 917
3 1155 557 917
3 917 557 622
3 557 1153 622
3 1153 136 269
3 136 1089 269
3 269 1089 520
3 1089 369 520
3 520 369 66
3 369 1123 66
3 66 1123 577
3 1123 1063 577
3 577 1063 1414
3 1063 894 1414
3 1414 894 750
3 894 20 750
3 750 20 643
3 20 892 643
3 643 892 1155
3 892 96 1155
3 1155 96 557
3 96 138 557
3 557 138 1153
3 138 136 1153
3 136 737 1089
3 737 816 1089
3 1089 816 369
3 816 1351 369
3 369 1351 1123
3 1351 938 1123
3 1123 938 1063
3 938 419 1063
3 1063 419 894
3 419 471 894
3 894 471 20
3 471 343 20
3 20 343 892
3 343 1410 892
3 892 1410 96
3 1410 229 96
3 96 229 138
3 229 792 138
3 138 792 136
3 792 737 136
3 737 564 816
3 816 564 1351
3 1351 564 938
3 564 564 938
3 938 564 419
3 419 564 471
3 471 564 343
3 564 564 343
3 343 564 1410
3 1410 564 229
3 564 564 229
3 229 564 792
3 792 564 737
3 564 564 737
3 230 302 85
3 302 744 85
3 744 421 85
3 421 1370 85
3 1370 182 85
3 182 50 85
3 50 986 85
3 986 838 85
3 838 271 85
3 271 230 85
3 230 945 302
3 945 568 302
3 302 568 744
3 568 1325 744
3 744 1325 421
3 1325 600 421
3 421 600 1370
3 600 374 1370
3 1370 374 182
3 374 452 182
3 182 452 50
3 452 902 50
3 50 902 986
3 902 436 986
3 986 436 838
3 436 849 838
3 838 849 271
3 849 962 271
3 271 962 230
3 962 945 230
3 945 689 568
3 689 1114 568
3 568 1114 1325
3 1114 15 1325
3 1325 15 600
3 15 886 600
3 600 886 374
3 886 266 374
3 374 266 452
3 266 825 452
3 452 825 902
3 825 299 902
3 902 299 436
3 299 195 436
3 436 195 849
3 195 843 849
3 849 843 962
3 843 133 962
3 962 133 945
3 133 689 945
3 689 140 1114
3 140 672 1114
3 1114 672 15
3 672 1125 15
3 15 1125 886
3 1125 312 886
3 886 312 266
3 312 28 266
3 266 28 825
3 28 22 825
3 825 22 299
3 22 969 299
3 299 969 195
3 969 494 195
3 195 494 843
3 494 1427 843
3 843 1427 133
3 1427 391 133
3 133 391 689
3 391 140 689
3 140 1007 672
3 1007 339 672
3 672 339 1125
3 339 1375 1125
3 1125 1375 312
3 1375 966 312
3 312 966 28
3 966 683 28
3 28 683 22
3 683 457 22
3 22 457 969
3 457 985 969
3 969 985 494
3 985 200 494
3 494 200 1427
3 200 728 1427
3 1427 728 391
3 728 1011 391
3 391 1011 140
3 1011 1007 140
3 1007 143 339
3 143 675 339
3 339 675 1375
3 675 1128 1375
3 1375 1128 966
3 1128 315 966
3 966 315 683
3 315 31 683
3 683 31 457
3 31 25 457
3 457 25 985
3 25 972 985
3 985 972 200
3 972 497 200
3 200 497 728
3 497 1430 728
3 728 1430 1011
3 1430 394 1011
3 1011 394 1007
3 394 143 1007
3 143 691 675
3 691 1116 675
3 675 1116 1128
3 1116 17 1128
3 1128 17 315
3 17 888 315
3 315 888 31
3 888 268 31
3 31 268 25
3 268 827 25
3 25 827 972
3 827 301 972
3 972 301 497
3 301 197 497
3 497 197 1430
3 197 845 1430
3 1430 845 394
3 845 135 394
3 394 135 143
3 135 691 143
3 691 944 1116
3 944 567 1116
3 1116 567 17
3 567 1324 17
3 17 1324 888
3 1324 599 888
3 888 599 268
3 599 373 268
3 268 373 827
3 373 451 827
3 827 451 301
3 451 901 301
3 301 901 197
3 901 435 197
3 197 435 845
3 435 848 845
3 845 848 135
3 848 961 135
3 135 961 691
3 961 944 691
3 944 231 567
3 231 303 567
3 567 303 1324
3 303 745 1324
3 1324 745 599
3 745 422 599
3 599 422 373
3 422 1371 373
3 373 1371 451
3 1371 183 451
3 451 183 901
3 183 51 901
3 901 51 435
3 51 987 435
3 435 987 848
3 987 839 848
3 848 839 961
3 839 272 961
3 961 272 944
3 272 231 944
3 231 86 303
3 303 86 745
3 745 86 422
3 86 86 422
3 422 86 1371
3 1371 86 183
3 183 86 51
3 86 86 51
3 51 86 987
3 987 86 839
3 839 86 272
3 272 86 231
3 86 86 231
3 232 304 87
3 304 746 87
3 746 423 87
3 423 1372 87
3 1372 184 87
3 184 52 87
3 52 988 87
3 988 840 87
3 840 273 87
3 273 232 87
3 232 943 304
3 943 566 304
3 304 566 746
3 566 1323 746
3 746 1323 423
3 1323 598 423
3 423 598 1372
3 598 372 1372
3 1372 372 184
3 372 450 184
3 184 450 52
3 450 900 52
3 52 900 988
3 900 434 988
3 988 434 840
3 434 847 840
3 840 847 273
3 847 960 273
3 273 960 232
3 960 943 232
3 943 690 566
3 690 1115 566
3 566 1115 1323
3 1115 16 1323
3 1323 16 598
3 16 887 598
3 598 887 372
3 887 267 372
3 372 267 450
3 267 826 450
3 450 826 900
3 826 300 900
3 900 300 434
3 300 196 434
3 434 196 847
3 196 844 847
3 847 844 960
3 844 134 960
3 960 134 943
3 134 690 943
3 690 141 1115
3 141 673 1115
3 1115 673 16
3 673 1126 16
3 16 1126 887
3 1126 313 887
3 887 313 267
3 313 29 267
3 267 29 826
3 29 23 826
3 826 23 300
3 23 970 300
3 300 970 196
3 970 495 196
3 196 495 844
3 495 1428 844
3 844 1428 134
3 1428 392 134
3 134 392 690
3 392 141 690
3 141 1006 673
3 1006 338 673
3 673 338 1126
3 338 1374 1126
3 1126 1374 313
3 1374 965 313
3 313 965 29
3 965 682 29
3 29 682 23
3 682 456 23
3 23 456 970
3 456 984 970
3 970 984 495
3 984 199 495
3 495 199 1428
3 199 727 1428
3 1428 727 392
3 727 1010 392
3 392 1010 141
3 1010 1006 141
3 1006 142 338
3 142 674 338
3 338 674 1374
3 674 1127 1374
3 1374 1127 965
3 1127 314 965
3 965 314 682
3 314 30 682
3 682 30 456
3 30 24 456
3 456 24 984
3 24 971 984
3 984 971 199
3 971 496 199
3 199 496 727
3 496 1429 727
3 727 1429 1010
3 1429 393 1010
3 1010 393 1006
3 393 142 1006
3 142 688 674
3 688 1113 674
3 674 1113 1127
3 1113 14 1127
3 1127 14 314
3 14 885 314
3 314 885 30
3 885 265 30
3 30 265 24
3 265 824 24
3 24 824 971
3 824 298 971
3 971 298 496
3 298 194 496
3 496 194 1429
3 194 842 1429
3 1429 842 393
3 842 132 393
3 393 132 142
3 132 688 142
3 688 942 1113
3 942 565 1113
3 1113 565 14
3 565 1322 14
3 14 1322 885
3 1322 597 885
3 885 597 265
3 597 371 265
3 265 371 824
3 371 449 824
3 824 449 298
3 449 899 298
3 298 899 194
3 899 433 194
3 194 433 842
3 433 846 842
3 842 846 132
3 846 959 132
3 132 959 688
3 959 942 688
3 942 233 565
3 233 305 565
3 565 305 1322
3 305 747 1322
3 1322 747 597
3 747 424 597
3 597 424 371
3 424 1373 371
3 371 1373 449
3 1373 185 449
3 449 185 899
3 185 53 899
3 899 53 433
3 53 989 433
3 433 989 846
3 989 841 846
3 846 841 959
3 841 274 959
3 959 274 942
3 274 233 942
3 233 88 305
3 305 88 747
3 747 88 424
3 88 88 424
3 424 88 1373
3 1373 88 185
3 185 88 53
3 88 88 53
3 53 88 989
3 989 88 841
3 88 88 841
3 841 88 274
3 274 88 233
3 88 88 233
3 1402 64 1138
3 64 460 1138
3 460 162 1138
3 162 939 1138
3 939 990 1138
3 990 918 1138
3 918 464 1138
3 464 787 1138
3 787 1439 1138
3 1439 1402 1138
3 1402 594 64
3 594 309 64
3 64 309 460
3 309 884 460
3 460 884 162
3 884 293 162
3 162 293 939
3 293 238 939
3 939 238 990
3 238 242 990
3 990 242 918
3 242 620 918
3 918 620 464
3 620 19 464
3 464 19 787
3 19 574 787
3 787 574 1439
3 574 685 1439
3 1439 685 1402
3 685 594 1402
3 594 396 309
3 396 790 309
3 309 790 884
3 790 1054 884
3 884 1054 293
3 1054 560 293
3 293 560 238
3 560 1112 238
3 238 1112 242
3 1112 295 242
3 242 295 620
3 295 297 620
3 620 297 19
3 297 1030 19
3 19 1030 574
3 1030 323 574
3 574 323 685
3 323 1132 685
3 685 1132 594
3 1132 396 594
3 396 1321 790
3 1321 366 790
3 790 366 1054
3 366 814 1054
3 1054 814 560
3 814 12 560
3 560 12 1112
3 12 833 1112
3 1112 833 295
3 833 831 295
3 295 831 297
3 831 448 297
3 297 448 1030
3 448 1432 1030
3 1030 1432 323
3 1432 897 323
3 323 897 1132
3 897 81 1132
3 1132 81 396
3 81 1321 396
3 1321 677 366
3 677 40 366
3 366 40 814
3 40 992 814
3 814 992 12
3 992 687 12
3 12 687 833
3 687 211 833
3 833 211 831
3 211 455 831
3 831 455 448
3 455 983 448
3 448 983 1432
3 983 198 1432
3 1432 198 897
3 198 236 897
3 897 236 81
3 236 733 81
3 81 733 1321
3 733 677 1321
3 677 1320 40
3 1320 365 40
3 40 365 992
3 365 813 992
3 992 813 687
3 813 11 687
3 687 11 211
3 11 832 211
3 211 832 455
3 832 830 455
3 455 830 983
3 830 447 983
3 983 447 198
3 447 1431 198
3 198 1431 236
3 1431 896 236
3 236 896 733
3 896 80 733
3 733 80 677
3 80 1320 677
3 1320 395 365
3 395 789 365
3 365 789 813
3 789 1053 813
3 813 1053 11
3 1053 559 11
3 11 559 832
3 559 1111 832
3 832 1111 830
3 1111 294 830
3 830 294 447
3 294 296 447
3 447 296 1431
3 296 1029 1431
3 1431 1029 896
3 1029 322 896
3 896 322 80
3 322 1131 80
3 80 1131 1320
3 1131 395 1320
3 395 593 789
3 593 308 789
3 789 308 1053
3 308 883 1053
3 1053 883 559
3 883 292 559
3 559 292 1111
3 292 237 1111
3 1111 237 294
3 237 241 294
3 294 241 296
3 241 619 296
3 296 619 1029
3 619 18 1029
3 1029 18 322
3 18 573 322
3 322 573 1131
3 573 684 1131
3 1131 684 395
3 684 593 395
3 593 1403 308
3 1403 65 308
3 308 65 883
3 65 461 883
3 883 461 292
3 461 163 292
3 292 163 237
3 163 940 237
3 237 940 241
3 940 991 241
3 241 991 619
3 991 919 619
3 619 919 18
3 919 465 18
3 18 465 573
3 465 788 573
3 573 788 684
3 788 1440 684
3 684 1440 593
3 1440 1403 593
3 1403 1133 65
3 65 1133 461
3 461 1133 163
3 163 1133 940
3 940 1133 991
3 991 1133 919
3 919 1133 465
3 465 1133 788
3 788 1133 1440
3 1440 1133 1403
3 739 417 1136
3 417 213 1136
3 213 49 1136
3 49 562 1136
3 562 159 1136
3 159 525 1136
3 525 681 1136
3 681 934 1136
3 934 398 1136
3 398 739 1136
3 739 1398 417
3 1398 1065 417
3 417 1065 213
3 1065 518 213
3 213 518 49
3 518 160 49
3 49 160 562
3 160 553 562
3 562 553 159
3 553 1055 159
3 159 1055 525
3 1055 1394 525
3 525 1394 681
3 1394 407 681
3 681 407 934
3 407 742 934
3 934 742 398
3 742 405 398
3 398 405 739
3 405 1398 739
3 1398 590 1065
3 590 487 1065
3 1065 487 518
3 487 1070 518
3 518 1070 160
3 1070 1349 160
3 160 1349 553
3 1349 1130 553
3 553 1130 1055
3 1130 276 1055
3 1055 276 1394
3 276 469 1394
3 1394 469 407
3 469 1309 407
3 407 1309 742
3 1309 1051 742
3 742 1051 405
3 1051 1092 405
3 405 1092 1398
3 1092 590 1398
3 590 248 487
3 248 596 487
3 487 596 1070
3 596 55 1070
3 1070 55 1349
3 55 1397 1349
3 1349 1397 1130
3 1397 45 1130
3 1130 45 276
3 45 667 276
3 276 667 469
3 667 438 469
3 469 438 1309
3 438 856 1309
3 1309 856 1051
3 856 982 1051
3 1051 982 1092
3 982 864 1092
3 1092 864 590
3 864 248 590
3 248 823 596
3 823 1413 596
3 596 1413 55
3 1413 157 55
3 55 157 1397
3 157 796 1397
3 1397 796 45
3 796 956 45
3 45 956 667
3 956 84 667
3 667 84 438
3 84 898 438
3 438 898 856
3 898 795 856
3 856 795 982
3 795 114 982
3 982 114 864
3 114 1420 864
3 864 1420 248
3 1420 823 248
3 823 247 1413
3 247 595 1413
3 1413 595 157
3 595 54 157
3 157 54 796
3 54 1396 796
3 796 1396 956
3 1396 44 956
3 956 44 84
3 44 666 84
3 84 666 898
3 666 437 898
3 898 437 795
3 437 855 795
3 795 855 114
3 855 981 114
3 114 981 1420
3 981 863 1420
3 1420 863 823
3 863 247 823
3 247 589 595
3 589 486 595
3 595 486 54
3 486 1069 54
3 54 1069 1396
3 1069 1348 1396
3 1396 1348 44
3 1348 1129 44
3 44 1129 666
3 1129 275 666
3 666 275 437
3 275 468 437
3 437 468 855
3 468 1308 855
3 855 1308 981
3 1308 1050 981
3 981 1050 863
3 1050 1091 863
3 863 1091 247
3 1091 589 247
3 589 1399 486
3 1399 1066 486
3 486 1066 1069
3 1066 519 1069
3 1069 519 1348
3 519 161 1348
3 1348 161 1129
3 161 554 1129
3 1129 554 275
3 554 1056 275
3 275 1056 468
3 1056 1395 468
3 468 1395 1308
3 1395 408 1308
3 1308 408 1050
3 408 743 1050
3 1050 743 1091
3 743 406 1091
3 1091 406 589
3 406 1399 589
3 1399 738 1066
3 738 416 1066
3 1066 416 519
3 416 212 519
3 519 212 161
3 212 48 161
3 161 48 554
3 48 561 554
3 554 561 1056
3 561 158 1056
3 1056 158 1395
3 158 524 1395
3 1395 524 408
3 524 680 408
3 408 680 743
3 680 933 743
3 743 933 406
3 933 397 406
3 406 397 1399
3 397 738 1399
3 738 1135 416
3 416 1135 212
3 212 1135 48
3 48 1135 561
3 561 1135 158
3 158 1135 524
3 524 1135 680
3 680 1135 933
3 933 1135 397
3 397 1135 738
3 517 1369 1137
3 1369 749 1137
3 749 1419 1137
3 1419 1036 1137
3 1036 412 1137
3 412 1034 1137
3 1034 154 1137
3 154 964 1137
3 964 1367 1137
3 1367 517 1137
3 517 890 1369
3 890 712 1369
3 1369 712 749
3 712 317 749
3 749 317 1419
3 317 730 1419
3 1419 730 1036
3 730 47 1036
3 1036 47 412
3 47 37 412
3 412 37 1034
3 37 202 1034
3 1034 202 154
3 202 572 154
3 154 572 964
3 572 189 964
3 964 189 1367
3 189 925 1367
3 1367 925 517
3 925 890 517
3 890 732 712
3 732 333 712
3 712 333 317
3 333 1074 317
3 317 1074 730
3 1074 829 730
3 730 829 47
3 829 463 47
3 47 463 37
3 463 179 37
3 37 179 202
3 179 610 202
3 202 610 572
3 610 1295 572
3 572 1295 189
3 1295 83 189
3 189 83 925
3 83 459 925
3 925 459 890
3 459 732 890
3 732 482 333
3 482 130 333
3 333 130 1074
3 130 340 1074
3 1074 340 829
3 340 529 829
3 829 529 463
3 529 1004 463
3 463 1004 179
3 1004 431 179
3 179 431 610
3 431 836 610
3 610 836 1295
3 836 591 1295
3 1295 591 83
3 591 359 83
3 83 359 459
3 359 1376 459
3 459 1376 732
3 1376 482 732
3 482 214 130
3 214 544 130
3 130 544 340
3 544 413 340
3 340 413 529
3 413 217 529
3 529 217 1004
3 217 1441 1004
3 1004 1441 431
3 1441 686 431
3 431 686 836
3 686 344 836
3 836 344 591
3 344 543 591
3 591 543 359
3 543 676 359
3 359 676 1376
3 676 932 1376
3 1376 932 482
3 932 214 482
3 214 483 544
3 483 131 544
3 544 131 413
3 131 341 413
3 413 341 217
3 341 530 217
3 217 530 1441
3 530 1005 1441
3 1441 1005 686
3 1005 432 686
3 686 432 344
3 432 837 344
3 344 837 543
3 837 592 543
3 543 592 676
3 592 360 676
3 676 360 932
3 360 1377 932
3 932 1377 214
3 1377 483 214
3 483 731 131
3 731 332 131
3 131 332 341
3 332 1073 341
3 341 1073 530
3 1073 828 530
3 530 828 1005
3 828 462 1005
3 1005 462 432
3 462 178 432
3 432 178 837
3 178 609 837
3 837 609 592
3 609 1294 592
3 592 1294 360
3 1294 82 360
3 360 82 1377
3 82 458 1377
3 1377 458 483
3 458 731 483
3 731 889 332
3 889 711 332
3 332 711 1073
3 711 316 1073
3 1073 316 828
3 316 729 828
3 828 729 462
3 729 46 462
3 462 46 178
3 46 36 178
3 178 36 609
3 36 201 609
3 609 201 1294
3 201 571 1294
3 1294 571 82
3 571 188 82
3 82 188 458
3 188 924 458
3 458 924 731
3 924 889 731
3 889 516 711
3 516 1368 711
3 711 1368 316
3 1368 748 316
3 316 748 729
3 748 1418 729
3 729 1418 46
3 1418 1035 46
3 46 1035 36
3 1035 411 36
3 36 411 201
3 411 1033 201
3 201 1033 571
3 1033 153 571
3 571 153 188
3 153 963 188
3 188 963 924
3 963 1366 924
3 924 1366 889
3 1366 516 889
3 516 1134 1368
3 1368 1134 748
3 748 1134 1418
3 1418 1134 1035
3 1035 1134 411
3 411 1134 1033
3 1033 1134 153
3 153 1134 963
3 963 1134 1366
3 1366 1134 516