OFF

119 234 0
0.301487 -0.041652 -0.027730
0.262522 -0.050885 -0.027199
0.360778 -0.049945 -0.014418
0.340738 -0.050407 0.016658
0.340690 -0.050133 -0.017116
0.417510 -0.031849 0.014165
0.199406 -0.105394 0.024592
0.341176 -0.106847 -0.002264
0.442127 -0.108723 0.012232
0.361062 -0.073681 0.011142
0.402714 -0.126044 -0.006019
0.433377 -0.049273 -0.003491
0.442253 -0.123341 -0.006575
0.452378 -0.116366 0.009525
0.455081 -0.111288 -0.005579
0.433270 -0.037556 0.009314
0.361326 -0.099097 0.009337
0.361347 -0.116396 0.004526
0.263081 -0.104646 0.016655
0.402519 -0.106259 0.004482
0.381497 -0.061535 -0.009314
0.402476 -0.098329 -0.006991
0.262923 -0.107661 -0.004732
0.442000 -0.099172 -0.006549
0.150777 -0.109022 0.015048
0.341205 -0.099074 -0.014696
0.455125 -0.114256 0.003776
0.402228 -0.073192 0.003959
0.302104 -0.105607 -0.010025
0.263107 -0.100205 0.022079
0.442010 -0.099219 -0.000762
0.302093 -0.105742 0.006676
0.442271 -0.123432 0.004658
0.455138 -0.116231 -0.003134
0.455141 -0.116229 -0.000918
0.341200 -0.108457 0.002068
0.452276 -0.109300 -0.011354
0.402681 -0.120711 0.010839
0.402719 -0.126032 -0.000925
0.262954 -0.091654 -0.023351
0.422083 -0.061208 0.002717
0.452238 -0.104429 -0.000818
0.402394 -0.090327 -0.005092
0.341205 -0.108959 0.002051
0.341193 -0.108412 -0.003470
0.452233 -0.104438 -0.005524
0.455095 -0.111364 0.003823
0.402494 -0.098431 0.005589
0.442018 -0.099265 0.005025
0.455143 -0.116267 0.001298
0.302002 -0.082968 0.018050
0.402727 -0.126126 0.004168
0.341198 -0.108915 -0.003462
0.464790 -0.048969 -0.000387
0.361243 -0.090889 0.010996
0.442088 -0.108511 -0.013910
0.402600 -0.112926 0.010965
0.230795 -0.062959 -0.031195
0.452412 -0.121078 -0.000953
0.341162 -0.091120 0.013515
0.452407 -0.121088 -0.005524
0.341221 -0.103587 -0.011127
0.231169 -0.106553 0.013135
0.361320 -0.103722 0.006403
0.452348 -0.116197 -0.011354
0.231090 -0.108061 0.002441
0.442218 -0.117398 0.012091
0.262934 -0.107728 0.003549
0.282126 -0.056585 -0.024027
0.361297 -0.098936 -0.010640
0.361028 -0.073493 -0.012032
0.452246 -0.104514 0.003887
0.402408 -0.090399 0.003820
0.361264 -0.108986 0.001811
0.381291 -0.039183 0.016180
0.360821 -0.050174 0.013910
0.281886 -0.037412 -0.033036
0.361364 -0.118762 -0.000811
0.433387 -0.049324 0.002799
0.433502 -0.061044 -0.002669
0.455065 -0.109248 -0.003134
0.452420 -0.121162 0.003617
0.455067 -0.109247 -0.000861
0.341119 -0.090892 -0.014634
0.361295 -0.112845 -0.006108
0.361256 -0.108945 -0.003275
0.402506 -0.106174 -0.006011
0.442183 -0.072736 -0.000551
0.263021 -0.092025 0.022426
0.361366 -0.118806 0.001666
0.301946 -0.082669 -0.018952
0.440000 -0.097980 -0.001526
0.402647 -0.120522 -0.012601
0.301606 -0.050509 -0.022157
0.455070 -0.109285 0.001412
0.341207 -0.109301 0.000723
0.440002 -0.097993 0.000026
0.199257 -0.108461 0.009615
0.442263 -0.123327 -0.000958
0.452306 -0.109470 0.009637
0.361331 -0.116310 -0.006110
0.341204 -0.109286 -0.000708
0.361359 -0.118766 -0.003289
0.262774 -0.074446 -0.023270
0.435000 -0.090021 -0.000681
0.361298 -0.103608 -0.007781
0.381524 -0.061683 0.008935
0.401984 -0.049679 0.005984
0.341181 -0.106872 0.000887
0.341248 -0.099302 0.013443
0.341253 -0.103757 0.009802
0.402214 -0.073119 -0.004952
0.455112 -0.114180 -0.005579
0.442178 -0.117188 -0.013909
0.361311 -0.112932 0.004581
0.402565 -0.112735 -0.012601
0.341202 -0.109278 -0.002139
0.361208 -0.090701 -0.012166
0.198817 -0.051472 -0.039120
3 0 93 4
3 4 6 0
3 24 118 6
3 118 76 6
3 76 0 6
3 4 3 6
3 4 2 3
3 2 74 3
3 2 5 74
3 3 88 6
3 3 50 88
3 24 97 118
3 97 57 118
3 97 65 57
3 65 39 57
3 65 22 39
3 88 29 6
3 22 28 39
3 28 25 39
3 28 61 25
3 39 103 57
3 28 7 61
3 2 20 5
3 74 75 3
3 118 1 76
3 20 11 5
3 20 111 11
3 111 79 11
3 79 53 11
3 53 5 11
3 53 15 5
3 4 70 2
3 4 83 70
3 4 93 83
3 93 90 83
3 3 59 50
3 3 9 59
3 9 54 59
3 5 107 74
3 93 68 90
3 68 103 90
3 93 1 68
3 65 97 22
3 110 67 31
3 40 107 87
3 45 41 30
3 45 80 82
3 44 84 85
3 84 115 86
3 115 55 23
3 55 36 45
3 36 14 80
3 52 100 84
3 100 92 115
3 92 113 55
3 113 64 36
3 64 112 14
3 116 102 100
3 102 10 92
3 10 12 113
3 12 60 64
3 60 33 112
3 101 77 102
3 77 38 10
3 38 98 12
3 98 58 60
3 58 34 33
3 91 21 86
3 105 61 7
3 85 86 21
3 117 83 25
3 42 117 69
3 111 70 117
3 87 111 42
3 42 21 91
3 20 2 70
3 69 25 61
3 28 22 7
3 90 39 83
3 90 103 39
3 68 1 103
3 93 0 1
3 76 1 0
3 62 6 18
3 62 97 6
3 29 88 59
3 18 29 109
3 31 18 110
3 31 67 18
3 22 67 108
3 109 16 63
3 3 75 9
3 78 87 107
3 78 53 87
3 106 107 27
3 106 75 107
3 47 72 104
3 27 87 104
3 9 27 72
3 54 72 47
3 59 54 16
3 19 73 63
3 110 63 73
3 96 91 23
3 48 96 23
3 47 96 48
3 34 58 81
3 58 98 32
3 98 38 51
3 38 77 89
3 77 101 95
3 49 81 13
3 81 32 66
3 32 51 37
3 51 89 17
3 89 95 43
3 26 13 99
3 13 66 8
3 66 37 56
3 37 17 114
3 17 43 35
3 46 99 71
3 99 8 48
3 8 56 19
3 56 114 73
3 114 35 108
3 94 71 41
3 41 71 48
3 23 45 30
3 41 45 82
3 7 44 85
3 85 84 86
3 86 115 23
3 23 55 45
3 45 36 80
3 44 52 84
3 84 100 115
3 115 92 55
3 55 113 36
3 36 64 14
3 52 116 100
3 100 102 92
3 92 10 113
3 113 12 64
3 64 60 112
3 116 101 102
3 102 77 10
3 10 38 12
3 12 98 60
3 60 58 33
3 23 91 86
3 85 105 7
3 105 85 21
3 69 117 25
3 21 42 69
3 117 70 83
3 42 111 117
3 104 87 42
3 104 42 91
3 20 70 111
3 79 87 53
3 79 111 87
3 21 69 105
3 105 69 61
3 83 39 25
3 57 1 118
3 57 103 1
3 24 6 97
3 18 6 29
3 62 67 97
3 62 18 67
3 67 22 97
3 50 59 88
3 109 29 59
3 110 18 109
3 108 67 110
3 7 22 108
3 110 109 63
3 47 63 16
3 5 15 107
3 78 15 53
3 78 107 15
3 74 107 75
3 40 27 107
3 40 87 27
3 106 9 75
3 106 27 9
3 96 47 104
3 72 27 104
3 54 9 72
3 91 96 104
3 16 54 47
3 109 59 16
3 47 19 63
3 108 110 73
3 30 48 23
3 19 47 48
3 116 52 44
3 101 116 44
3 95 101 44
3 43 95 44
3 35 43 44
3 108 35 44
3 7 108 44
3 49 34 81
3 81 58 32
3 32 98 51
3 51 38 89
3 89 77 95
3 26 49 13
3 13 81 66
3 66 32 37
3 37 51 17
3 17 89 43
3 46 26 99
3 99 13 8
3 8 66 56
3 56 37 114
3 114 17 35
3 94 46 71
3 71 99 48
3 48 8 19
3 19 56 73
3 73 114 108
3 82 94 41
3 30 41 48
3 80 14 112
3 82 80 112
3 94 82 112
3 46 94 112
3 26 46 112
3 49 26 112
3 34 49 112
3 33 34 112
