OFF

48 92 0
-0.138665 0.119979 -0.119805
-0.308077 -0.036067 -0.081435
-0.116702 0.127531 -0.075103
-0.199873 0.044184 -0.047368
-0.232859 -0.026972 0.004864
-0.157556 0.119445 -0.079014
-0.101444 0.029138 -0.042819
-0.188247 -0.026371 0.018173
-0.197358 0.082409 -0.081326
-0.110502 -0.085453 0.019162
-0.132044 0.014840 -0.010617
-0.100070 0.088231 -0.074149
-0.165472 -0.059859 0.042481
-0.092188 -0.095060 -0.017980
-0.124169 0.073511 -0.033314
-0.144764 -0.006287 0.021042
-0.180905 0.001024 0.006218
-0.217046 0.008336 -0.008606
-0.253187 0.015647 -0.023429
-0.091058 -0.030015 -0.004756
-0.090814 -0.035966 -0.049310
-0.089105 0.043917 -0.090386
-0.088882 0.016026 -0.108091
-0.209500 0.123011 -0.110480
-0.253990 -0.060604 -0.061595
-0.147330 -0.107688 0.020003
-0.086602 0.105432 -0.125304
-0.133056 -0.043892 -0.130502
-0.148720 -0.092128 0.064319
-0.147863 -0.096412 -0.066946
-0.276072 0.011822 -0.131372
-0.091729 -0.134215 -0.002077
-0.201950 -0.071875 -0.086785
-0.185947 -0.047931 -0.111754
-0.093119 -0.118655 0.042239
-0.178118 -0.014015 -0.140311
-0.145816 -0.109678 -0.021916
-0.095822 -0.107683 -0.092136
-0.227938 0.069661 -0.133211
-0.201542 -0.096721 -0.002232
-0.157103 0.066629 -0.142536
-0.154051 0.014904 -0.141231
-0.199903 -0.085141 -0.041756
-0.086267 0.063597 -0.151862
-0.083216 0.011872 -0.150556
-0.080164 -0.039853 -0.149251
-0.227095 -0.001097 -0.135842
-0.093775 -0.120949 -0.047106
3 5 0 2
3 5 23 0
3 0 26 2
3 28 39 12
3 39 4 12
3 39 1 4
3 1 18 4
3 1 30 18
3 30 38 18
3 38 8 18
3 28 25 39
3 28 34 25
3 8 3 18
3 39 24 1
3 1 35 30
3 1 33 35
3 1 32 33
3 4 7 12
3 39 42 24
3 33 27 35
3 27 45 35
3 33 37 27
3 14 11 6
3 15 16 10
3 18 3 17
3 34 28 9
3 13 20 37
3 9 19 13
3 2 11 5
3 8 38 23
3 5 8 23
3 7 15 12
3 13 37 47
3 14 6 10
3 44 22 43
3 8 5 14
3 26 21 11
3 4 17 7
3 21 6 11
3 14 10 3
3 6 20 19
3 16 7 17
3 10 16 3
3 16 17 3
3 46 30 35
3 12 15 9
3 15 7 16
3 12 9 28
3 22 21 43
3 21 22 6
3 19 20 13
3 20 45 37
3 22 44 45
3 11 2 26
3 15 10 19
3 43 21 26
3 17 4 18
3 31 13 47
3 31 34 9
3 31 36 42
3 3 8 14
3 10 6 19
3 9 15 19
3 14 5 11
3 6 22 20
3 45 20 22
3 9 13 31
3 39 31 42
3 29 32 42
3 29 37 32
3 24 32 1
3 24 42 32
3 29 36 37
3 29 42 36
3 47 36 31
3 47 37 36
3 33 32 37
3 27 37 45
3 46 38 30
3 46 35 38
3 41 35 45
3 41 38 35
3 40 41 43
3 40 38 41
3 44 41 45
3 44 43 41
3 40 0 38
3 40 43 0
3 23 38 0
3 26 0 43
3 25 31 39
3 34 31 25
