OFF
1009 1998 0
0.2010144622 -0.0894112037 -0.1771609203
-0.0236576558 0.0436810032 0.0848533203
-0.0235805989 -0.0434263652 0.0848877168
0.2008558788 0.0898561648 -0.1772317085
0.2230270685 -0.0660147762 -0.1769314868
0.2822051032 -0.0845259841 -0.1005938628
0.2229098443 0.0664989080 -0.1769838131
0.1053364631 -0.1949095498 -0.0703398896
0.3346317825 -0.0497958072 -0.0670634368
0.3291633711 -0.0497997733 -0.0648568011
-0.1175302190 -0.0721767077 0.0559763043
0.3478859757 -0.0558948418 -0.0169903948
0.3533543870 -0.0558908757 -0.0191970305
0.0952817226 -0.0173545470 0.0510693131
-0.3360397911 0.1774571386 -0.0518149820
-0.1716647438 0.0796776920 0.0214237707
0.2584668637 -0.1778304415 0.0161600851
0.3460136693 0.0340291063 -0.0456630428
0.3405452580 0.0340251402 -0.0434564071
0.3243449590 0.0609468042 -0.0723228586
0.3298133704 0.0609507703 -0.0745294943
0.3556793309 0.0541932088 -0.0143233788
0.3502118957 0.0541892434 -0.0121171370
0.0243690195 0.4402741574 -0.0836695940
-0.2941477978 -0.2650176247 -0.0807014437
-0.2557070398 0.1599537554 -0.1390088050
0.1256199213 -0.1363432813 -0.1666879112
-0.0618011272 0.3318955699 -0.1880202812
0.0877756925 -0.3494109086 -0.0340732474
-0.2854628549 -0.2473590784 0.0907175786
0.1478912491 -0.1545582291 -0.1104427767
0.3476861713 -0.0016960504 -0.0383926026
0.3531575111 -0.0016920822 -0.0406004200
0.0539594536 0.2849848472 -0.1625051848
0.3466277233 0.0018050534 -0.0412315457
0.3520990631 0.0018090216 -0.0434393631
-0.1399830949 0.3283275419 -0.1771448843
-0.1434585903 -0.4829415784 -0.0985593944
0.0289604522 -0.0335518370 0.0785917173
0.0622236422 -0.1853205780 -0.1349941289
-0.3300367217 -0.1868874061 0.0173942131
0.1214953433 -0.2975339205 -0.0400581173
-0.1479005049 -0.1390320166 0.0107626489
-0.1202828129 0.2817635651 -0.1912526355
0.3037200282 0.1429819644 0.0467343217
0.3414952315 0.0098568368 -0.0505606762
0.3469665713 0.0098608051 -0.0527684936
0.3308592530 -0.0391351021 -0.0648487892
0.3363305928 -0.0391311338 -0.0670566066
0.3540711002 -0.0493307446 -0.0044919299
0.3595424400 -0.0493267764 -0.0066997473
0.3646154686 0.0634353294 0.0109918160
0.3591480334 0.0634313640 0.0131980578
0.3615631172 0.0710780344 0.0939712474
0.2995214071 -0.1469419588 0.0229024175
-0.2569566998 -0.1886885989 -0.0400447040
-0.0012497698 0.4517891662 -0.0869276429
0.3493099914 -0.1023481436 0.0715334482
-0.1530245369 -0.2158242388 -0.1764695074
-0.2436639987 0.3326780258 -0.0036372263
-0.2451076668 -0.1376956124 0.1527784926
0.2025448189 0.2041165524 -0.0363553851
-0.2331825954 -0.1990550966 0.1595043550
-0.2876285262 0.0616836305 0.1683383685
-0.1829812000 0.4604393633 -0.0618578454
0.3358218719 0.0090567769 -0.0646582142
0.3412902833 0.0090607430 -0.0668648499
0.0669542392 -0.3925599866 -0.0582980266
-0.2514846133 0.2447226709 0.0845017164
0.0715150662 0.2442417154 -0.1510224329
0.1832632672 -0.0617567013 -0.0260922401
0.3391166999 0.0343730865 -0.0467906397
0.3445851113 0.0343770526 -0.0489972754
0.1833177213 -0.2057874546 -0.0184495487
0.0988010217 -0.1934509548 -0.1498954132
0.0403233274 -0.1886587207 -0.1665242442
-0.2466325285 0.1954721137 0.1243196657
0.3285088740 -0.0136832937 -0.0803886927
0.3339772854 -0.0136793276 -0.0825953284
0.2586010038 -0.0751452714 -0.1498959783
-0.1002074833 0.1978397816 -0.0083578925
-0.2446794654 0.4095678460 -0.0539823500
0.1673762158 -0.1088523653 -0.1740074760
0.1911512533 -0.0797644397 -0.0953064887
0.3236893965 -0.0575423819 -0.0751759032
0.3291578078 -0.0575384158 -0.0773825389
0.1405604214 -0.0844375077 0.0169357270
0.3529844115 -0.0138705576 -0.0363226701
0.3475130717 -0.0138745258 -0.0341148527
0.3541104441 0.0152409300 -0.0178200254
0.3595817839 0.0152448982 -0.0200278428
0.3634036044 0.0091878525 -0.0130964843
0.3579322646 0.0091838843 -0.0108886669
0.1545895824 0.1641748970 -0.1276195324
-0.3437911966 -0.1341745888 0.0298925265
0.3405342586 0.0030142030 -0.0710559112
0.3350658473 0.0030102369 -0.0688492755
0.3456997690 0.0258038994 -0.0341348993
0.3511681803 0.0258078655 -0.0363415350
0.3401146698 0.0065171270 -0.0707166953
0.3346433300 0.0065131588 -0.0685088779
0.3384250377 0.0196590102 -0.0541964696
0.3438963775 0.0196629784 -0.0564042870
0.0879817444 -0.0329325368 0.0538905260
-0.1821664471 -0.4605811630 -0.0614941578
-0.2422621501 0.2519486377 0.1215862752
0.3485650650 0.0137241530 -0.0318858052
0.3540325002 0.0137281184 -0.0340920470
0.3550044651 0.0041008545 -0.0199874372
0.3604758049 0.0041048228 -0.0221952546
0.3467795178 0.0040795640 -0.0554787483
0.3413081780 0.0040755957 -0.0532709309
0.1409987974 -0.1465087101 -0.1562181629
0.0385254689 0.0480518711 0.0743573667
0.3487505743 0.0110967216 -0.0324547270
0.3542219141 0.0111006898 -0.0346625444
0.3456716187 0.0284074101 -0.0331844975
0.3511429585 0.0284113784 -0.0353923149
0.0652334723 -0.3836700125 -0.0478654862
0.1150853368 -0.3132048713 0.0052530224
0.3636420696 -0.0025589281 -0.0147798329
0.3581707298 -0.0025628963 -0.0125720155
0.3709327552 0.0672007028 0.0530902001
0.3594057194 -0.0045140084 -0.0088202076
0.3648741307 -0.0045100423 -0.0110268433
0.3451596974 -0.0195672829 -0.0531387334
0.3396883576 -0.0195712512 -0.0509309160
0.3330146863 -0.0195835588 -0.0671487297
0.3384860261 -0.0195795906 -0.0693565471
0.1622764001 -0.1563356457 -0.1201282377
0.0213589609 -0.2716831495 -0.1777092777
0.3482571056 -0.0697615331 -0.0107425076
0.3537255169 -0.0697575669 -0.0129491433
-0.2906932531 -0.0972506091 -0.1217214294
-0.2021661580 -0.2577605630 -0.0756313322
0.2373095882 0.0510016218 -0.1756759210
0.3306162431 -0.0323490172 -0.0835656133
0.3251449033 -0.0323529855 -0.0813577959
0.3554772584 -0.0019184900 -0.0193723125
0.3609476220 -0.0019145225 -0.0215797360
0.2540677724 0.1829231942 -0.0069541082
-0.2904479555 -0.2949143135 0.0367589844
0.2059094600 0.1380328293 -0.1278053014
0.3437559505 -0.0218169017 -0.0556875884
0.3382846107 -0.0218208700 -0.0534797710
0.0017842122 -0.3020697722 -0.1425592906
-0.2805484949 -0.1386979432 0.1569655570
0.3639493815 -0.0450424516 0.0023669008
0.3584809701 -0.0450464177 0.0045735365
0.0706382020 -0.3991999392 -0.0264291558
-0.0606943759 -0.3834081877 -0.1743239771
0.3414887756 -0.0124824956 -0.0647970268
0.3360213404 -0.0124864611 -0.0625907850
0.1421278616 0.0845779775 -0.1743496513
-0.0947003835 -0.2368296827 -0.1369307657
-0.0602336718 -0.2367722849 -0.0687880597
0.3495181472 -0.0294419574 -0.0387295931
0.3440507120 -0.0294459228 -0.0365233513
0.0851891165 0.2145075524 -0.1081568400
0.0026804442 0.2048473457 0.0095394798
-0.1772861219 0.4337757096 -0.0731429345
-0.2625557039 0.2433629321 -0.1272821512
0.0251477860 -0.4400663689 -0.0833219698
0.3306630444 -0.0575219582 -0.0737310453
0.3251917046 -0.0575259264 -0.0715232279
-0.2740495317 -0.3456891777 0.0051521355
0.3580404063 0.0302441849 -0.0024223842
0.3635117461 0.0302481531 -0.0046302016
-0.2430204294 0.3547263335 -0.1013850842
0.3325459173 0.0317407607 -0.0792731556
0.3270745775 0.0317367925 -0.0770653382
0.0063366504 0.2221339076 -0.1766735210
0.0253270162 0.0235824805 0.0802022303
0.3452965823 -0.0036264806 -0.0434542897
0.3507679221 -0.0036225124 -0.0456621071
0.3402930920 -0.0036418279 -0.0711113698
0.3348256568 -0.0036457933 -0.0689051280
0.1919061048 0.0742390045 -0.0726468373
0.3399177212 0.0129988186 -0.0686726924
0.3344463814 0.0129948504 -0.0664648750
0.3453683118 -0.0158916652 -0.0540497621
0.3398969720 -0.0158956335 -0.0518419447
0.3297726278 -0.0159143071 -0.0764507736
0.3352439676 -0.0159103388 -0.0786585910
0.3477220850 -0.0027524742 -0.0534055438
0.3422507452 -0.0027564424 -0.0511977264
0.3345771385 0.0103673169 -0.0671694821
0.3400484783 0.0103712852 -0.0693772995
-0.1903164324 -0.2742967948 -0.1672364459
-0.0169849955 0.1502998966 0.0588518485
-0.1255967466 -0.2216980983 -0.1823640479
-0.2845752648 0.3420804554 -0.0071531677
-0.1764818196 0.2083183616 -0.1689907483
0.1202244343 -0.1059625329 -0.1687720190
0.3495785904 0.0626567554 -0.0103548581
0.3550470017 0.0626607215 -0.0125614937
-0.2850177398 -0.1282955076 -0.0294751236
-0.1259888631 0.2215619017 -0.1825390801
0.3339150163 0.0523801633 -0.0679078050
0.3284436765 0.0523761950 -0.0656999876
-0.0445476143 -0.2286568147 -0.1820629892
0.3274660101 0.0587692634 -0.0810791257
0.3219985749 0.0587652979 -0.0788728839
0.3399400313 -0.0122211814 -0.0686627337
0.3344686915 -0.0122251496 -0.0664549163
0.3404138602 -0.0087176803 -0.0688633795
0.3349454489 -0.0087216464 -0.0666567438
0.0020782853 0.2772540619 -0.1828685473
0.3452894523 0.0044335194 -0.0434574724
0.3507607921 0.0044374876 -0.0456652898
0.3402859620 0.0044181721 -0.0711145525
0.3348185268 0.0044142067 -0.0689083107
0.3332353117 -0.0052282926 -0.0876622321
0.3277639719 -0.0052322608 -0.0854544147
0.1592037881 0.1395371620 -0.0628528689
-0.2648416732 -0.3740349725 -0.0220864351
0.0791883908 -0.0444262620 0.0575190041
-0.0095763110 0.4563089897 -0.1220465174
-0.2792281531 -0.1963610423 0.1303017946
0.0236000336 -0.2291187072 -0.0782804162
-0.3169568602 0.2176429332 -0.0639920303
-0.3666331973 0.0770589443 -0.0877618479
0.3550319184 0.0682047080 -0.0104426094
0.3495605786 0.0682007397 -0.0082347920
0.3485442745 -0.0338757154 -0.0393900595
0.3430758632 -0.0338796815 -0.0371834238
-0.1562123195 0.2795581788 -0.1830429728
-0.1815677362 -0.3240091059 -0.1592486086
-0.2009725700 0.4507419833 -0.0815379448
-0.3798953006 -0.0783748528 -0.0339761919
0.3407178392 -0.0156360734 -0.0654586178
0.3352464994 -0.0156400417 -0.0632508004
0.3407852483 -0.0121333184 -0.0666383113
0.3353168370 -0.0121372845 -0.0644316756
0.1099485630 0.2084742027 -0.1227768115
-0.2621248411 -0.2436970679 -0.1270898236
0.3611477755 0.0487435015 -0.0031612316
0.3556793641 0.0487395353 -0.0009545960
-0.2605337136 0.1938810770 0.1515074793
0.0095261085 0.1079916406 0.0719537125
0.3527301868 -0.0674365974 -0.0162667096
0.3472588470 -0.0674405656 -0.0140588922
-0.1468457939 -0.4707803419 -0.1131932713
-0.0888715362 0.4723668673 -0.1017651413
-0.0132845638 0.0759749339 0.0808225997
-0.2036400380 -0.4421559140 -0.0929065782
0.3571774462 0.0046280997 -0.0145058388
0.3626448814 0.0046320651 -0.0167120806
-0.0366452979 0.4919985507 -0.0879261812
0.0667475586 0.1941053184 -0.1231011444
0.3356211326 0.0212309228 -0.0604023766
0.3410895440 0.0212348889 -0.0626090123
-0.2480371871 0.2559351902 -0.1367913484
0.1204382073 0.1522299601 -0.0022740719
0.2469286462 0.1130211447 -0.1159429817
0.3247295939 0.1118135399 0.0637107357
0.2294827397 0.0537249019 -0.1071899659
0.2783239087 0.0579286095 -0.1485810091
-0.0290602715 0.2260570015 -0.0309035090
0.3283067368 0.0609648375 -0.0781815822
0.3228383254 0.0609608714 -0.0759749465
0.0339512814 0.4478139709 -0.0523117570
0.1798604175 -0.0391126512 -0.1762076076
-0.0490857994 -0.1054409434 0.0706002435
0.3345656993 0.0142215771 -0.0656944010
0.3400370391 0.0142255453 -0.0679022184
-0.0415314513 0.4740346578 -0.1267819825
-0.3616544286 -0.0717334156 0.0380788129
0.2461509609 -0.1953583262 0.0318220636
-0.2678582212 0.2458187714 0.1113049060
-0.1301080346 -0.4901487179 -0.0790881718
0.1864705544 -0.0787210265 -0.1188311740
0.3508226004 0.0056641072 -0.0450373341
0.3453512606 0.0056601389 -0.0428295167
0.3527366447 -0.0618942658 -0.0183870432
0.3472682334 -0.0618982319 -0.0161804075
0.0455558897 -0.2186074969 -0.0484535172
0.1541583768 -0.2377742195 -0.0368243648
0.3352353905 0.0108054417 -0.0653967877
0.3407057541 0.0108094093 -0.0676042112
0.3352730690 0.0143092110 -0.0639412632
0.3407444088 0.0143131792 -0.0661490806
0.0677143998 -0.0527071683 0.0622880625
0.3492617282 0.0697512093 0.0695937474
0.3625707555 0.0236578333 0.0060135208
0.3680391668 0.0236617994 0.0038068851
0.0434149016 -0.3395313931 -0.1465374843
0.0289656490 0.4297533650 -0.1039460552
-0.2483539627 0.4012960713 -0.0648866600
-0.1277463774 -0.4622575366 -0.0897173069
0.1149623137 0.1802525799 -0.0447506337
-0.2324313201 0.1386708138 0.1826493558
0.0412767098 0.2803086953 -0.1243365114
0.3358372112 -0.0082832231 -0.0646513671
0.3413085510 -0.0082792549 -0.0668591845
-0.3210388370 -0.1730563850 -0.1028413595
0.3235449904 0.0476158973 -0.0794601388
0.3290134017 0.0476198634 -0.0816667745
-0.3609901003 0.1312362781 -0.0406409981
-0.2211969354 -0.4142557734 -0.0364907230
-0.2321859443 -0.1387091862 0.1827588861
0.3432603357 0.0301708008 -0.0538546767
0.3377889959 0.0301668326 -0.0516468593
0.2030131290 0.2018539794 -0.0092604714
0.3476835531 0.0330149885 -0.0265081486
0.3531519645 0.0330189546 -0.0287147843
0.0775651498 -0.1658758639 0.0184675046
-0.2751405763 -0.2903938162 -0.0975828791
0.0594703358 0.1646129546 -0.1646963454
-0.2236953347 0.1857904493 -0.1525135984
0.1729674903 0.0530118888 -0.1761447411
0.0929035566 0.3627672781 -0.0091936700
0.3371792467 0.0218046085 -0.0718876632
0.3317118115 0.0218006431 -0.0696814214
-0.2660985859 -0.0579442416 0.1857581544
0.0007510848 0.4733897474 -0.0739949687
-0.2989505608 0.0792403651 -0.0252019286
0.0235901569 0.2093540178 -0.1723646440
-0.0426657552 0.4874176705 -0.1086460250
0.3672954318 -0.0081389067 0.0117576619
0.3727638431 -0.0081349406 0.0095510262
0.3505502228 0.0705260830 -0.0049229650
0.3560186342 0.0705300491 -0.0071296007
-0.0587558709 -0.3065503036 -0.1495532459
0.3397330952 0.0180853876 -0.0516356398
0.3452044350 0.0180893558 -0.0538434572
0.3386437028 0.0180833756 -0.0542903321
0.3441121141 0.0180873417 -0.0564969677
0.3343819542 0.0180755196 -0.0646378841
0.3398532940 0.0180794878 -0.0668457015
0.1207071494 -0.1517900399 -0.0021540221
0.3605274898 -0.0487745160 -0.0045164304
0.3550561500 -0.0487784843 -0.0023086130
0.3345529212 0.0084406574 -0.0679812106
0.3400242610 0.0084446256 -0.0701890280
0.0297280871 0.1717171799 0.0405727655
-0.2399669308 -0.3776601744 -0.0056733672
-0.2607635543 0.1356736968 0.1761224718
0.3352545849 -0.0280747910 -0.0739339737
0.3297861736 -0.0280787571 -0.0717273380
-0.0999917765 -0.4922715210 -0.1112646719
0.0863800654 -0.1812122354 -0.1599961393
0.3471108647 -0.0263870562 -0.0302620081
0.3525812283 -0.0263830887 -0.0324694316
0.0699324150 -0.3859955536 -0.0804167180
0.3311060371 0.0372482372 -0.0651238511
0.3365773769 0.0372522055 -0.0673316685
-0.2135336794 0.3900523359 -0.0510279660
0.0871571842 0.3497690914 -0.0343493359
-0.3499921820 -0.1252515757 -0.0925562947
0.1569934867 0.1180900755 -0.0171502886
-0.0979491453 -0.2271284536 -0.1852095166
0.3498108510 0.0341159259 -0.0209052530
0.3552821908 0.0341198941 -0.0231130704
0.1406327257 0.2588867406 0.0107220560
-0.1195824409 -0.3035931485 -0.1404559685
0.3379935178 -0.0334091257 -0.0497155924
0.3434638814 -0.0334051581 -0.0519230159
0.1547025157 0.2361879122 -0.0097798338
-0.2793499866 0.1288431094 -0.1289236902
0.3303224947 0.0405241425 -0.0657488660
0.3357938346 0.0405281107 -0.0679566834
0.1957094828 -0.2161721134 0.0086597230
-0.0247918928 0.2795894335 -0.1877139881
0.0925232807 0.3571572532 -0.0417133305
0.3409396298 -0.0054803597 -0.0688373321
0.3354682900 -0.0054843280 -0.0666295147
-0.1507466158 0.3789932538 -0.1573473107
-0.2696125416 0.3686278337 -0.0380458441
-0.1176579757 0.0722432923 0.0559192765
-0.2247359307 -0.2645732370 -0.1504502920
0.1325069083 -0.2476320877 -0.0175520010
-0.0892035462 0.5000000000 -0.0918208211
0.1049913022 0.1952704502 -0.0704939618
0.0778453391 0.1194346710 0.0438409230
-0.2021825703 -0.2002880105 -0.1612350051
-0.0248820400 -0.3296466002 -0.1840168724
0.3358490483 0.0025758216 -0.0671229397
0.3413174596 0.0025797877 -0.0693295754
-0.2563734268 -0.3055028461 -0.1118086925
-0.0986344802 0.1259931579 0.0488210677
-0.1116189854 -0.3832087714 -0.1710139894
-0.0555889951 0.2812212333 -0.1901402203
0.1120443133 -0.1089443079 0.0290013819
0.3496040416 -0.0300682152 -0.0227792704
0.3550753814 -0.0300642469 -0.0249870878
0.0322225732 -0.3062806497 -0.1689764206
0.1179595783 0.3003066697 -0.0160689016
0.0412685702 0.2554201601 -0.1725313955
0.0025687361 -0.2771659381 -0.1826496208
0.0608662701 -0.2226051460 -0.1620932974
0.0676484875 -0.3135368055 -0.1372888318
0.1551408591 -0.1499363123 -0.0871859621
-0.0217306276 0.3797955838 -0.1685718901
-0.3192226003 0.2314543852 -0.0032901446
-0.0574822599 0.1792876824 0.0332716181
-0.2970372033 0.0631433515 -0.1151879992
0.1873519556 0.1236466358 -0.1605284498
0.1062060696 0.3009424485 -0.0244211037
0.3404403558 0.0217630496 -0.0484867110
0.3459116956 0.0217670178 -0.0506945284
-0.2475988842 -0.0628167918 0.1631919447
0.2928755464 0.1632391694 0.0639024559
-0.2725005393 0.0833686390 -0.0715104660
-0.2190527097 0.0834369451 -0.0182654173
0.3405510329 -0.0174699814 -0.0496528688
0.3460194443 -0.0174660153 -0.0518595045
-0.1986980876 -0.3697106476 -0.1326650439
0.3406076832 -0.0332316998 -0.0434310308
0.3460790230 -0.0332277315 -0.0456388482
0.3762019010 -0.0593580009 0.0795240911
0.3638805441 -0.0283451093 -0.0042491438
0.3584092043 -0.0283490776 -0.0020413264
-0.0637188467 -0.0604223990 0.0755971470
0.3444589375 -0.0200958668 -0.0546456194
0.3389875977 -0.0200998350 -0.0524378020
0.3636392067 0.0062109835 -0.0136853570
0.3581678669 0.0062070152 -0.0114775396
0.3355388407 0.0193041584 -0.0613495849
0.3410101805 0.0193081266 -0.0635574023
0.3376463851 0.0333228469 -0.0507653307
0.3431177249 0.0333268152 -0.0529731481
0.2344565229 0.1850345549 0.0044335889
0.0527453634 -0.0544611455 0.0684273586
-0.2334062787 -0.3587850710 -0.0248188933
-0.0373025464 -0.4666243842 -0.0988054609
0.0124222023 -0.3668635266 -0.1584176235
-0.1911763144 0.1456130174 -0.0321637353
-0.2400264913 0.1455472839 -0.0891938347
0.3613714219 0.0613046080 0.0177702555
0.3668427617 0.0613085762 0.0155624381
0.3347396481 -0.0222199805 -0.0619448180
0.3402109879 -0.0222160123 -0.0641526354
0.0963023666 0.3525409710 -0.0647450009
-0.2762832773 -0.3347486140 -0.0737458379
-0.1721215525 0.2882886229 -0.1023137229
0.3618732663 0.0501145268 -0.0008601709
0.3564058311 0.0501105614 0.0013460709
0.3216613404 -0.0423410564 -0.0859719808
0.3271297518 -0.0423370903 -0.0881786165
0.1607352962 -0.0443996917 0.0087645881
0.3359808798 -0.0042572551 -0.0658633615
0.3414492912 -0.0042532889 -0.0680699972
0.3355195022 -0.0042581047 -0.0669814168
0.3409879136 -0.0042541386 -0.0691880525
0.3353386413 -0.0068854101 -0.0664104201
0.3408099812 -0.0068814419 -0.0686182375
-0.0381281911 0.4667085632 -0.0991740105
-0.2921147496 0.2098715462 -0.1138087306
-0.2542887600 0.3011940249 0.0687538240
0.0903056497 0.1359489457 -0.1665531715
-0.1072066388 0.3310003830 -0.1860703597
-0.2351193122 -0.0593644221 0.1905436956
-0.0938491309 -0.2820676897 -0.1923293858
0.3556790813 0.0566577995 -0.0133659695
0.3502077415 0.0566538312 -0.0111581521
0.1617172226 0.0682791491 -0.1752431240
-0.2537556820 0.2922643877 0.0351779573
0.0060150991 0.3221199124 -0.1769784279
0.3278116825 -0.0093483910 -0.0837486220
0.3332830223 -0.0093444228 -0.0859564394
0.3468213505 -0.0010284935 -0.0413109537
0.3522926903 -0.0010245253 -0.0435187711
0.3456620961 0.1052447109 0.0451222365
0.3533528114 -0.0534270439 -0.0201585437
0.3478814716 -0.0534310121 -0.0179507263
0.3356781127 0.0038020142 -0.0670548851
0.3411494525 0.0038059824 -0.0692627025
0.0825849232 0.2650130411 -0.1231977123
0.3397673252 -0.0172988208 -0.0516228492
0.3452386650 -0.0172948526 -0.0538306666
0.3386750043 -0.0173008349 -0.0542763597
0.3441434157 -0.0172968688 -0.0564829954
0.3344161842 -0.0173086888 -0.0646250935
0.3398845955 -0.0173047227 -0.0668317292
0.0311918985 0.4295464799 -0.0677229892
0.0427968576 0.1233494679 0.0585234460
-0.2796408465 0.2942463105 0.0553802160
-0.0748460923 0.2281096310 -0.1842526874
0.3477601207 0.0326321081 -0.0419704750
0.3422887809 0.0326281398 -0.0397626576
0.0635787976 -0.1980098477 -0.0175250426
-0.2213471186 -0.3176163971 -0.1312641930
0.3364812505 0.1162101665 0.0874768627
0.2831266260 -0.1554424145 0.0398368941
-0.0160882724 -0.2274741984 -0.1805501754
-0.3069191306 0.2753678786 -0.0314405843
-0.3064316400 -0.2757058056 -0.0312229793
0.3511951168 -0.0177734601 -0.0236609761
0.3566635282 -0.0177694940 -0.0258676118
-0.0164907799 0.2275321174 -0.1807298459
0.3608232650 0.0458443620 0.0104149137
0.3662946048 0.0458483303 0.0082070963
0.3433159438 -0.0293797234 -0.0538323434
0.3378485086 -0.0293836888 -0.0516261016
0.2828509375 0.1562039013 0.0397138329
0.2296717129 0.1023190177 -0.1572847210
-0.3721143050 -0.0002490731 -0.0876055294
-0.2290216979 -0.0000914631 -0.0090299362
-0.2920184822 -0.0000760618 0.1711017928
0.3399846384 0.0003936657 -0.0551847694
0.3454559782 0.0003976339 -0.0573925868
0.3871757949 0.0004892559 0.0811724784
-0.2366092881 -0.0000185756 0.1925521134
0.3631204382 0.0004302118 -0.0144637549
0.3576490984 0.0004262435 -0.0122559375
0.1912772623 0.0002138676 -0.1773718621
0.1991644446 0.0002428997 -0.1215190057
-0.0279959052 0.0001242338 0.0868625391
-0.3021141766 -0.0001941093 -0.1052305495
0.2433725705 0.0002867794 -0.1094333530
-0.1260205798 0.0000266119 0.0592402447
0.3171062240 0.0003548478 -0.1022356800
0.3275573110 0.0003707468 -0.0853854506
0.3330286508 0.0003747150 -0.0875932680
0.3440170761 0.0003949808 -0.0608881067
0.3385457363 0.0003910125 -0.0586802893
0.1907391962 0.0002722959 -0.0281998330
0.2007315287 0.0002625277 -0.0753227253
0.3401058133 0.0003877667 -0.0703952250
0.3346334974 0.0003837977 -0.0681870137
0.2899346874 0.0003118732 -0.1501955949
0.1670812991 0.0002652833 0.0070408692
0.3529356559 0.0004114289 -0.0392139206
0.3474643161 0.0004074607 -0.0370061032
-0.2511100008 -0.0000428248 0.1636273776
0.2006508234 0.0002536822 -0.0975427001
-0.3695001302 -0.0001967838 0.0389582077
0.3354136776 0.0003852336 -0.0662986020
0.3408820889 0.0003891997 -0.0685052377
0.0976980540 0.0002210646 0.0504953649
-0.2818103393 -0.0001576868 -0.0584782259
0.3731175216 0.0004842619 0.1000193251
-0.2702647289 -0.0000502123 0.1878305084
0.0231429787 0.0001673232 0.0814201091
-0.3079409765 -0.0001672239 -0.0240910650
0.3840628941 0.0004774901 0.0583496883
0.3460283425 0.0004048096 -0.0405028048
0.3514967538 0.0004087757 -0.0427094405
0.2496035057 0.0002656732 -0.1768426069
0.3678368090 0.0004450285 0.0124930464
0.3733052204 0.0004489947 0.0102864107
0.3599669361 0.0004619725 0.0730333838
-0.1811550208 -0.0000344321 0.0281646289
-0.3871757949 -0.0002414897 -0.0346592633
-0.0699819305 0.0000835157 0.0778053983
0.3580305902 0.0004208229 -0.0268381613
0.3525592504 0.0004168546 -0.0246303439
0.2298522871 -0.1018072981 -0.1572041167
0.3526851195 0.0315208237 -0.0149346937
0.3581564593 0.0315247920 -0.0171425111
0.3366860633 -0.1153161493 0.0875682866
-0.2219088223 0.3173499187 -0.1315149251
0.0632281809 0.1983375208 -0.0176815501
0.3478200652 -0.0318205214 -0.0419462060
0.3423487254 -0.0318244896 -0.0397383886
-0.0744424692 -0.2281577375 -0.1840725190
-0.2791200588 -0.2944673737 0.0556126841
0.0430147813 -0.1229979006 0.0586207224
0.3545395687 -0.0171240354 -0.0312790651
0.3490682289 -0.0171280037 -0.0290712477
0.3680854617 -0.0225550715 0.0037400892
0.3626141219 -0.0225590398 0.0059479066
0.3228137464 -0.0555706103 -0.0780624874
0.3282821577 -0.0555666442 -0.0802691231
-0.0124271820 -0.4677139973 -0.1029013108
0.3589939455 0.0673718875 -0.0011346904
0.3535255342 0.0673679214 0.0010719453
0.3458475235 -0.1043679206 0.0452050072
0.3277944855 0.0100916090 -0.0837562983
0.3332658253 0.0100955772 -0.0859641157
0.0065849171 -0.3220190350 -0.1767240737
-0.2532384272 -0.2924556123 0.0354088484
0.0662594413 0.3928600134 -0.0586081691
-0.0943480974 0.2819786261 -0.1925521134
0.3407280970 -0.0100337458 -0.0675975564
0.3352567572 -0.0100377140 -0.0653897390
0.0830535482 -0.2647343274 -0.1229885285
0.3356841580 -0.0030316700 -0.0670521867
0.3411554978 -0.0030277018 -0.0692600041
0.0347433516 -0.4475655028 -0.0519581944
0.0852306040 -0.2012210952 -0.1051696921
-0.1066209256 -0.3311069854 -0.1858089103
0.0905459478 -0.1356910543 -0.1664459077
-0.1022095724 0.4795648427 -0.1276780073
-0.2537557292 -0.3013596594 0.0689917572
-0.2917431032 -0.2102484538 -0.1136428358
0.3407941894 0.0076596086 -0.0686227977
0.3353218734 0.0076556397 -0.0664145864
0.3359697365 0.0050290586 -0.0658658467
0.3414410763 0.0050330268 -0.0680736641
0.3355112874 0.0050282111 -0.0669850837
0.3409796987 0.0050321772 -0.0691917194
0.1606562819 0.0449203083 0.0087293178
0.3549439102 -0.0051819450 -0.0349166726
0.3494725704 -0.0051859133 -0.0327088552
-0.2352243100 0.0593282095 0.1904968269
-0.0132547910 0.4678394763 -0.1032707372
0.3498155330 0.0163500249 -0.0278201802
0.3552868728 0.0163539932 -0.0300279976
0.0969257869 -0.3521916606 -0.0644667198
0.3383649456 0.0268400075 -0.0515532631
0.3438333569 0.0268439736 -0.0537598988
0.3520812468 0.0703920433 -0.0012556568
0.3575516105 0.0703960108 -0.0034630803
0.3707266015 0.0166519845 0.0076018420
0.3652542855 0.0166480155 0.0098100533
0.3346967237 0.0229926490 -0.0619614896
0.3401680635 0.0229966172 -0.0641693070
-0.1909185716 -0.1457469826 -0.0320486846
-0.2397687486 -0.1458127161 -0.0890787840
0.0117730219 0.3669891049 -0.1587074033
-0.1716113635 -0.2884440087 -0.1020859858
-0.2768752461 0.3344303334 -0.0740100797
0.0526486754 0.0548378019 0.0683841992
0.3431798896 -0.0325321293 -0.0529487177
0.3377114783 -0.0325360955 -0.0507420820
-0.0418034577 -0.4873488559 -0.1082611143
0.3355752376 -0.0185295237 -0.0613358270
0.3410465774 -0.0185255555 -0.0635436444
0.3356885049 0.0173778195 -0.0617388444
0.3411569162 0.0173817856 -0.0639454801
0.2174761228 -0.1069074725 -0.1139135283
0.3389484110 0.0208875313 -0.0524528052
0.3444197508 0.0208914995 -0.0546606226
-0.0638259043 0.0605986537 0.0755493588
0.3760960353 0.0603156833 0.0794768350
-0.1993519929 0.3694830366 -0.1329569328
-0.0612138990 -0.3319244301 -0.1877581555
0.3405164947 0.0182626480 -0.0496657970
0.3459849060 0.0182666142 -0.0518724327
0.0015884715 -0.4732167789 -0.0736211778
-0.2723527669 -0.0836776768 -0.0714445036
-0.2189049372 -0.0836093707 -0.0181994549
-0.2340408750 0.3585812448 -0.0251021631
0.1875703318 -0.1232123116 -0.1604309714
-0.2969251452 -0.0635303327 -0.1151379790
-0.3188128035 -0.2317919306 -0.0031072204
0.3604925115 -0.0552180092 0.0133883376
0.3659609229 -0.0552140431 0.0111817019
-0.0210587301 -0.3797370478 -0.1682719699
0.1548752013 0.1503710561 -0.0873045458
0.0670935535 0.3137768787 -0.1375365421
0.0604722438 0.2228138013 -0.1622691821
0.0417203221 -0.2552535241 -0.1723297434
0.2931636493 -0.1624408306 0.0640310587
-0.2477099515 0.0627368924 0.1631423667
0.3404810864 -0.0209695799 -0.0484710187
0.3459524262 -0.0209656116 -0.0506788361
0.1067381562 -0.3005438673 -0.0241835920
-0.0406928204 -0.4739782896 -0.1264076362
0.0316805546 0.3064330345 -0.1692183657
0.1118511664 0.1093946394 0.0289151653
-0.0550914310 -0.2812398194 -0.1899181187
-0.1122968815 0.3831049128 -0.1713165872
-0.0984116511 -0.1258994737 0.0489205338
0.3572228659 -0.0109938941 -0.0116224508
0.3626942057 -0.0109899258 -0.0138302681
-0.2569136575 0.3051897855 -0.1120498396
0.3358529238 -0.0018052311 -0.0671212097
0.3413213352 -0.0018012649 -0.0693278454
-0.0254652986 0.3296860313 -0.1842772261
0.3544546081 -0.0148384184 -0.0168692926
0.3599259479 -0.0148344501 -0.0190771100
0.3230337589 -0.0507309344 -0.0793876275
0.3285050987 -0.0507269662 -0.0815954449
0.3218104685 -0.0375983382 -0.0874307641
0.3272818083 -0.0375943699 -0.0896385815
0.1184905158 -0.2998806987 -0.0158319028
0.2820549833 0.0851740159 -0.1006608730
-0.2025367012 0.2000319895 -0.1613930813
0.0780562920 -0.1190326974 0.0439350877
0.3706708354 -0.0159839305 0.0074865623
0.3651994956 -0.0159878987 0.0096943797
-0.0883189265 -0.5000000000 -0.0914259464
0.1320683903 0.2480815966 -0.0177477458
-0.2252037697 0.2642857104 -0.1506591250
-0.2689601058 -0.3689047979 -0.0377546111
-0.1500759438 -0.3791541147 -0.1570479375
0.3409292453 0.0062585876 -0.0688419676
0.3354579055 0.0062546194 -0.0666341502
0.0931548582 -0.3567964310 -0.0414314083
-0.0242972657 -0.2795516192 -0.1874931974
0.1953265077 0.2167542024 0.0084887714
-0.1285641610 0.4621889897 -0.0900823475
0.1410903273 -0.2583995751 0.0109263193
-0.0983509097 0.2270378622 -0.1853888554
0.1572019795 -0.1175962403 -0.0170572220
-0.3502133723 0.1247884243 -0.0926550292
-0.2128434172 -0.3902402957 -0.0507198482
0.0692492410 0.3862844464 -0.0807216718
0.3470595500 0.0272066252 -0.0302815953
0.3525308898 0.0272105934 -0.0324894127
0.0860592315 0.1814677646 -0.1601393524
-0.2791217082 -0.1292095222 -0.1288217917
0.3544936800 0.0611118954 0.0009845111
0.3599620914 0.0611158615 -0.0012221246
0.1551199500 -0.2356920878 -0.0095935003
0.3434011471 0.0342011555 -0.0519485302
0.3379298073 0.0341971873 -0.0497407128
-0.1162801344 0.3035066366 -0.1311811252
-0.1013610625 -0.4796156836 -0.1272992512
0.3297299697 0.0288349228 -0.0717474484
0.3352013095 0.0288388911 -0.0739552658
-0.2605234331 -0.1357663032 0.1762296566
-0.2406349248 0.3774598256 -0.0059715450
0.0300316178 -0.1714028201 0.0407082549
0.3345671757 -0.0076730268 -0.0679748477
0.3400385155 -0.0076690586 -0.0701826651
0.3520043900 -0.0027910768 -0.0274710796
0.3574757298 -0.0027871085 -0.0296788970
-0.0554576248 0.3065642206 -0.1402776540
0.3672802461 0.0090274091 0.0117508834
0.3727486574 0.0090313752 0.0095442477
0.0239604344 -0.2092186138 -0.1721993602
-0.2988100832 -0.0795596349 -0.0251392225
-0.2662010193 0.0578494426 0.1857124304
0.3587142426 -0.0306037693 -0.0159337839
0.3532429028 -0.0306077376 -0.0137259665
0.3068183950 -0.0630437657 -0.0995179419
0.0935450362 -0.3623800903 -0.0089073277
0.1730609304 -0.0526154796 -0.1761030315
-0.2233663735 -0.1860769191 -0.1523667574
-0.1340869967 -0.2073152148 -0.0547774943
-0.1736340226 -0.2073739950 -0.1150400598
0.0597613943 -0.1644080980 -0.1645664233
-0.2756540561 0.2900588153 -0.0978120852
0.0772713387 0.1662567676 0.0183363539
0.2033697424 -0.2012723364 -0.0091012870
0.3617353846 0.0631594465 0.0038793084
0.3562640448 0.0631554783 0.0060871258
0.3372210484 -0.0210353886 -0.0718723224
0.3317526370 -0.0210393547 -0.0696656867
-0.2472410603 -0.3490856371 0.0207120797
0.3274767190 -0.0312425377 -0.0761200757
0.3329451303 -0.0312385715 -0.0783267114
-0.2219296836 0.4140642266 -0.0368178056
-0.3607575217 -0.1316774061 -0.0405371801
-0.3213446435 0.1726362466 -0.1029778648
0.3226246147 0.0353091371 -0.0864917116
0.3280930260 0.0353131032 -0.0886983473
0.0417724618 -0.2801039363 -0.1241152187
0.3627105806 0.0465679540 0.0152817663
0.3681789919 0.0465719202 0.0130751306
-0.2476437435 -0.4015565603 -0.0645696339
0.3635383438 0.0501837241 0.0187010798
0.3690096836 0.0501876923 0.0164932624
0.3573918512 0.0495659797 0.0035298209
0.3628631910 0.0495699479 0.0013220035
-0.0023266300 0.2292714000 -0.1289784154
0.0428140214 0.3397212385 -0.1468057040
0.3493843365 -0.0688487907 0.0696484770
0.0676207959 0.0531054633 0.0622462798
0.3353006309 -0.0135371027 -0.0639314491
0.3407719707 -0.0135331344 -0.0661392665
-0.2478585071 0.3488943629 0.0204364651
0.1152808717 -0.1798547885 -0.0446084364
0.3477379177 -0.0106177615 -0.0348232575
0.3532092575 -0.0106137932 -0.0370310749
0.0319516634 -0.4293140464 -0.0673838469
0.0451688807 0.2188788189 -0.0486262695
0.3576744210 0.0047966076 -0.0287284268
0.3522060096 0.0047926415 -0.0265217911
0.3508319010 -0.0048495770 -0.0450331825
0.3453605612 -0.0048535453 -0.0428253651
0.1863308665 0.0791863419 -0.1188935276
-0.1344537423 0.2072647852 -0.0549412015
-0.1740007682 0.2072060050 -0.1152037670
-0.2674231709 -0.2459749128 0.1114991029
0.2458047152 0.1960479896 0.0316675071
-0.3617810055 0.0713529002 0.0380223117
0.3277749025 0.0533889958 -0.0824358524
0.3223035627 0.0533850276 -0.0802280350
0.1537372792 0.2382468331 -0.0370123334
-0.1765185436 -0.4339172378 -0.0728003045
0.3501562685 0.0067186370 -0.0307427857
0.3556276083 0.0067226052 -0.0329506031
-0.0286604589 -0.2259029985 -0.0307250415
0.2784258635 -0.0573240221 -0.1485354988
0.2295773046 -0.0531740455 -0.1071477542
0.3249266630 -0.1109590916 0.0637987030
0.2471280990 -0.1124462237 -0.1158539503
0.3446510842 -0.0335797852 -0.0489728044
0.3391797443 -0.0335837535 -0.0467649870
-0.2475840961 -0.2562521782 -0.1365890986
0.3356580092 -0.0204553930 -0.0603859158
0.3411293490 -0.0204514247 -0.0625937332
0.3345931084 -0.0134521050 -0.0656846550
0.3400644482 -0.0134481367 -0.0678924724
-0.0492725249 0.1056390566 0.0705168933
0.1797908566 0.0395210330 -0.1762386580
-0.0004505872 -0.4516303075 -0.0865709054
-0.0131503846 -0.0757050661 0.0808824943
-0.1476786102 0.4706596581 -0.1135650221
-0.2900968728 -0.3150954131 -0.0573993976
0.0097169032 -0.1076883594 0.0720388791
-0.2601905929 -0.1939926072 0.1516606408
0.3407630919 0.0129129974 -0.0666482014
0.3352946805 0.0129090312 -0.0644415657
0.3406865563 0.0164165560 -0.0654700929
0.3352152165 0.0164125878 -0.0632622755
-0.3800335490 0.0779051472 -0.0340379029
0.3230770923 -0.0344701605 -0.0855605134
0.3285484321 -0.0344661922 -0.0877683308
-0.1821407928 0.3237908941 -0.1595044084
-0.1008626907 0.4922355316 -0.1116534288
-0.1557175453 -0.2797491896 -0.1828221164
0.3430083750 0.0346866293 -0.0372077416
0.3484797148 0.0346905975 -0.0394155590
-0.1443129378 0.4828378953 -0.0989407563
0.1103171142 -0.2081468499 -0.1226122984
-0.3165714603 -0.2180244352 -0.0638199963
0.0231944829 0.2293276086 -0.0784614450
-0.2795754194 0.1961989577 0.1301467826
0.0791094231 0.0448411064 0.0574837547
0.3612019723 -0.0493775819 0.0128672366
0.3666733121 -0.0493736136 0.0106594192
-0.3664964295 -0.0775473715 -0.0877007978
0.1594502543 -0.1390754696 -0.0627428519
0.3332253984 0.0059780232 -0.0876666571
0.3277540586 0.0059740550 -0.0854588397
0.3403977490 0.0094949513 -0.0688705712
0.3349264092 0.0094909831 -0.0666627538
-0.0449521685 0.2286631853 -0.1822435733
-0.1309751684 0.4900847558 -0.0794752411
0.3567091754 0.0118220352 -0.0128375753
0.3621805152 0.0118260034 -0.0150453927
-0.2852444613 0.1279971239 -0.0295763271
0.1200366882 0.1062711513 -0.1688558247
-0.1761130636 -0.2085342699 -0.1688261437
-0.2839697958 -0.3423595446 -0.0068828997
-0.2655032029 0.3737776591 -0.0223817274
0.3658389498 -0.0457620168 0.0072339294
0.3603676100 -0.0457659850 0.0094417468
0.3247250762 0.0329631754 -0.0822976787
0.3301964160 0.0329671436 -0.0845054961
-0.0167192968 -0.1500537876 0.0589704505
0.2172865134 0.1074325275 -0.1139981657
0.3357185642 -0.0166021805 -0.0617254266
0.3411899040 -0.0165982123 -0.0639332440
-0.1908015168 0.2740568894 -0.1674529768
0.3345948011 -0.0095989989 -0.0671615979
0.3400661409 -0.0095950306 -0.0693694153
0.3477165054 0.0035548942 -0.0534080344
0.3422451656 0.0035509260 -0.0512002170
0.3568368566 -0.0626362579 0.0073705711
0.3623052680 -0.0626322917 0.0051639354
0.3274486716 -0.0550789781 -0.0669861802
0.3329170829 -0.0550750120 -0.0691928159
0.3453394900 0.0166893874 -0.0540626275
0.3398681502 0.0166854192 -0.0518548101
0.3352122173 0.0166707117 -0.0786702747
0.3297408775 0.0166667435 -0.0764624573
0.1920369987 -0.0737273113 -0.0725884091
0.3588106179 -0.0479546467 -0.0090003156
0.3533431827 -0.0479586121 -0.0067940738
0.3539527843 -0.0623721428 0.0002604021
0.3594251002 -0.0623681739 -0.0019478092
0.0297258089 -0.4295536876 -0.1036067366
0.0067295687 -0.2220324082 -0.1764981310
0.3492180886 0.0301542174 -0.0238947175
0.3546864999 0.0301581835 -0.0261013532
0.3538356640 -0.0075730999 -0.0366856615
0.3483643242 -0.0075770681 -0.0344778441
-0.2423925859 -0.3550062981 -0.1011048287
-0.2746609156 0.3454371381 0.0048792272
0.0253684406 -0.0232448879 0.0802207213
0.0030426541 -0.2046052859 0.0097011622
0.0855683706 -0.2142124476 -0.1079875493
0.3494624060 0.0302590931 -0.0387519858
0.3439949708 0.0302551277 -0.0365457441
-0.0912775164 0.2367901070 -0.1275970647
-0.0606526388 0.2368403467 -0.0689750773
-0.2001749319 -0.4509314903 -0.0811818967
0.1422771966 -0.0842346541 -0.1742829915
0.3414630705 0.0132648707 -0.0648060121
0.3359956353 0.0132609052 -0.0625997703
-0.0613727023 0.3833918123 -0.1746267670
0.0848743323 0.2015189048 -0.1053287240
0.0699316275 0.3995326924 -0.0267445551
0.3521793925 -0.0603357258 -0.0048451938
0.3576478038 -0.0603317597 -0.0070518295
0.3437137207 0.0226104646 -0.0557039499
0.3382453094 0.0226064984 -0.0534973142
0.2061532370 -0.1375398023 -0.1276964848
-0.2909695030 0.2946583181 0.0365261771
0.2543908113 -0.1822494374 -0.0068099108
0.2373993706 -0.0504910097 -0.1756358441
-0.2026220313 0.2575720686 -0.0758348241
-0.2906540593 0.3147645869 -0.0576481134
-0.2908649755 0.0968693909 -0.1217980824
-0.2044221365 0.4419511386 -0.0932556897
0.0208781766 0.2718094821 -0.1779238892
0.1619994323 0.1567569858 -0.1202518700
-0.2807937580 0.1385546884 0.1568560769
0.0012496729 0.3021891751 -0.1427978971
0.3710508287 -0.0662729814 0.0531429055
0.1145308163 0.3136414445 0.0050054967
0.0645543973 0.3839763033 -0.0481686103
0.3511964018 -0.0275886188 -0.0353717776
0.3457240858 -0.0275925877 -0.0331635663
0.0386101689 -0.0476954974 0.0743951749
0.1407392742 0.1468639215 -0.1563340084
0.3590574556 -0.0605061711 0.0119406940
0.3645287954 -0.0605022028 0.0097328766
0.3384117391 -0.0260568346 -0.0515323755
0.3438830789 -0.0260528664 -0.0537401929
0.3467860286 -0.0032804360 -0.0554758420
0.3413146888 -0.0032844043 -0.0532680246
-0.2418163018 -0.2520513623 0.1217852920
0.3569961273 0.0168835445 -0.0256646442
0.3515247875 0.0168795762 -0.0234568268
0.3396530324 0.0203613804 -0.0509466844
0.3451214437 0.0203653465 -0.0531533201
0.3384477725 0.0203530388 -0.0693711338
0.3329764327 0.0203490706 -0.0671633164
0.3384620529 -0.0188736193 -0.0541824357
0.3439333927 -0.0188696510 -0.0563902531
0.3401255143 -0.0057418204 -0.0707118546
0.3346541745 -0.0057457886 -0.0685040372
0.3457486067 -0.0249897820 -0.0341164178
0.3512189703 -0.0249858144 -0.0363238413
0.3405418337 -0.0022384264 -0.0710550188
0.3350734223 -0.0022423925 -0.0688483831
-0.3440282691 0.1338190954 0.0297867026
0.1548796910 -0.1637724714 -0.1274900343
0.3682852153 0.0560272630 0.0170150431
0.3628168039 0.0560232969 0.0192216788
0.1404105967 0.0849288081 0.0168688485
0.3646241168 -0.0073132385 -0.0105572111
0.3591518008 -0.0073172075 -0.0083489998
0.0879231006 0.0333600948 0.0538643488
0.1671832868 0.1092402663 -0.1740935952
-0.2439546248 -0.4098132067 -0.0536587972
-0.0998574980 -0.1977939026 -0.0082016667
0.2584675510 0.0757136760 -0.1499555486
0.3284810757 0.0144303884 -0.0803986124
0.3339524155 0.0144343567 -0.0826064298
-0.2462865957 -0.1955805179 0.1244740825
0.0399893956 0.1888275950 -0.1666733040
0.0984585082 0.1937364136 -0.1500483037
0.1829531574 0.2063262296 -0.0186122820
-0.0019211027 -0.2291486000 -0.1287973970
0.1831535334 0.0622896145 -0.0261412228
0.1910096955 0.0802566129 -0.0953696769
0.0719469785 -0.2440046004 -0.1508296368
-0.2510515092 -0.2448710133 0.0846950446
0.1618376901 -0.0679008509 -0.1751893499
0.3497824073 -0.0696218943 -0.0070776365
0.3552537471 -0.0696179261 -0.0092854539
-0.2875192636 -0.0618300537 0.1683871409
-0.2335347206 0.1989975350 0.1593471741
0.2029054550 -0.2035571318 -0.0361944051
-0.2453512091 0.1376117560 0.1526697807
-0.2430752312 -0.3328819742 -0.0033744136
0.3267721471 0.0387880487 -0.0905505342
0.3213037357 0.0387840826 -0.0883438985
-0.1534062214 0.2156431296 -0.1766398829
0.3219434805 0.0471402388 -0.0835366954
0.3274118918 0.0471442049 -0.0857433311
-0.0357749202 -0.4919019756 -0.0875376638
-0.2572903075 0.1884314011 -0.0401936192
0.3555387883 -0.0331334539 -0.0226768207
0.3500674485 -0.0331374222 -0.0204690033
0.2992607441 0.1477190938 0.0227860633
0.3616880367 -0.0701345971 0.0940270087
0.3067062429 0.0637362343 -0.0995680041
0.3491281136 0.1032518564 0.0714522620
-0.0880358002 -0.4723736590 -0.1013920872
0.3469862368 -0.0090591928 -0.0527622042
0.3415148969 -0.0090631611 -0.0505543868
0.3039722863 -0.1421780356 0.0468469242
0.3265399703 0.0440621187 -0.0890657698
0.3210686305 0.0440581505 -0.0868579524
0.3480620618 -0.0317508066 -0.0258834565
0.3535294970 -0.0317468412 -0.0280896983
0.3241883713 -0.0455359102 -0.0785929426
0.3296597111 -0.0455319419 -0.0808007600
-0.1197841872 -0.2818974875 -0.1910300601
-0.1481464645 0.1390079834 0.0106528580
0.1209685700 0.2979460795 -0.0402932572
-0.3303670684 0.1865462781 0.0172467536
0.0289007879 0.0338944788 0.0785650845
0.2347833190 -0.1843854451 0.0045794635
0.1476174417 0.1549617709 -0.1105649983
-0.2859003114 0.2471546058 0.0905223077
0.3512213403 -0.0665933846 -0.0047524244
0.3566897516 -0.0665894185 -0.0069590601
0.1253784146 0.1366630345 -0.1667957144
-0.2554237492 -0.1602862446 -0.1388823503
-0.2946163632 0.2646623753 -0.0809106009
0.3492610350 0.0086446505 -0.0321730425
0.3547294463 0.0086486166 -0.0343796782
-0.1394020655 -0.3284850897 -0.1768855256
0.3315916128 -0.0361836707 -0.0642043976
0.3370629526 -0.0361797024 -0.0664122150
0.0544634856 -0.2847877843 -0.1622801960
0.3476824504 0.0025102653 -0.0383942636
0.3531537902 0.0025142336 -0.0406020810
-0.0087690951 -0.4561915366 -0.1216861941
0.3280515519 -0.0451118152 -0.0848753069
0.3225802121 -0.0451157834 -0.0826674895
-0.0571651946 -0.1791323176 0.0334131491
0.2581516206 0.1785295585 0.0160193676
-0.1715237243 -0.0797349396 0.0214867187
-0.3357254681 -0.1778628614 -0.0516746751
0.0952506305 0.0177928215 0.0510554343
0.3321065128 0.0582408977 -0.0700077076
0.3266390776 0.0582369322 -0.0678014658
3 61 303 1003
3 23 597 315
3 865 477 449
3 809 228 64
3 483 967 44
3 885 477 865
3 565 999 858
3 971 54 568
3 551 57 410
3 557 165 733
3 873 37 270
3 533 314 452
3 830 677 215
3 533 499 950
3 215 677 744
3 532 965 410
3 674 340 617
3 796 768 909
3 149 580 67
3 697 277 952
3 894 337 238
3 191 865 831
3 716 533 503
3 228 81 64
3 755 705 831
3 879 573 23
3 140 1003 44
3 266 318 597
3 433 364 387
3 1003 303 683
3 311 897 387
3 81 736 64
3 354 683 303
3 831 368 191
3 499 533 716
3 16 886 54
3 580 162 67
3 336 733 165
3 873 104 299
3 971 551 645
3 557 141 830
3 704 146 218
3 933 744 245
3 617 565 631
3 685 119 668
3 300 452 314
3 565 580 631
3 67 344 600
3 340 701 650
3 368 831 81
3 597 318 248
3 897 354 387
3 596 291 337
3 122 626 502
3 980 387 358
3 898 348 311
3 56 475 261
3 634 736 705
3 76 68 951
3 484 983 268
3 968 289 270
3 946 909 585
3 946 938 62
3 424 336 299
3 371 649 119
3 542 751 965
3 68 449 105
3 684 243 372
3 422 495 402
3 475 898 879
3 447 56 315
3 59 634 705
3 525 646 596
3 983 73 362
3 289 774 104
3 572 585 733
3 938 60 300
3 774 689 299
3 73 371 685
3 646 953 291
3 59 755 449
3 243 447 248
3 495 255 483
3 283 542 532
3 398 675 354
3 634 347 736
3 68 105 951
3 118 759 580
3 791 425 960
3 585 572 946
3 60 401 452
3 299 689 424
3 759 791 631
3 28 118 149
3 68 457 449
3 347 160 64
3 675 941 683
3 255 283 53
3 348 398 897
3 59 705 755
3 953 76 951
3 780 484 645
3 425 968 674
3 954 572 733
3 401 525 503
3 424 954 733
3 649 28 720
3 751 780 551
3 457 59 449
3 160 684 824
3 941 422 769
3 584 805 318
3 690 573 364
3 483 53 626
3 879 311 364
3 81 831 705
3 44 402 483
3 813 238 269
3 668 41 277
3 410 896 536
3 965 551 410
3 720 149 67
3 215 933 299
3 362 685 697
3 165 830 215
3 314 950 146
3 873 245 242
3 37 340 674
3 617 960 674
3 585 909 768
3 57 568 896
3 162 858 344
3 985 269 477
3 288 81 228
3 53 532 502
3 318 805 372
3 269 238 951
3 261 879 23
3 773 358 303
3 287 23 573
3 463 967 626
3 105 449 477
3 318 372 248
3 805 809 824
3 793 809 805
3 985 477 885
3 617 650 999
3 681 600 41
3 728 16 268
3 119 720 681
3 299 933 873
3 971 57 551
3 796 218 29
3 768 29 141
3 37 242 701
3 645 268 16
3 668 697 685
3 704 796 62
3 565 162 580
3 728 952 886
3 63 716 337
3 891 228 809
3 769 402 44
3 354 358 387
3 238 337 291
3 964 44 967
3 217 597 23
3 825 826 91
3 106 107 599
3 762 761 776
3 92 91 416
3 199 198 1007
3 202 201 771
3 973 972 955
3 170 169 703
3 194 195 454
3 116 117 305
3 437 436 748
3 745 746 926
3 730 729 696
3 321 322 222
3 126 125 470
3 473 474 788
3 206 205 708
3 176 175 922
3 211 210 592
3 822 821 187
3 328 329 419
3 912 913 624
3 852 851 937
3 513 514 212
3 182 183 128
3 578 579 442
3 293 294 575
3 753 754 230
3 181 180 907
3 850 849 327
3 280 281 875
3 65 66 587
3 466 467 378
3 524 997 998
3 34 537 538
3 930 929 657
3 709 710 139
3 88 87 758
3 656 657 663
3 606 605 285
3 860 861 692
3 480 479 17
3 420 421 301
3 629 630 46
3 185 184 969
3 905 906 493
3 783 782 409
3 920 921 343
3 412 411 561
3 144 143 432
3 734 735 136
3 438 439 1000
3 563 564 85
3 9 8 48
3 465 464 12
3 131 132 949
3 856 857 846
3 815 816 832
3 49 50 854
3 974 975 899
3 332 331 50
3 638 639 816
3 880 881 857
3 241 240 132
3 225 224 464
3 847 848 8
3 664 665 564
3 666 667 439
3 339 338 735
3 994 995 143
3 718 717 411
3 157 156 921
3 356 357 782
3 647 648 906
3 500 501 184
3 399 400 630
3 699 698 421
3 870 869 479
3 549 550 861
3 712 713 605
3 662 663 489
3 757 758 862
3 138 139 120
3 173 764 763
3 208 34 35
3 31 524 523
3 589 590 467
3 278 279 66
3 800 799 281
3 111 110 849
3 471 472 180
3 152 151 754
3 445 446 294
3 659 660 579
3 77 78 183
3 820 819 514
3 915 914 851
3 324 325 913
3 264 265 329
3 333 334 821
3 96 95 210
3 443 444 175
3 841 842 205
3 618 619 474
3 415 414 125
3 603 604 322
3 52 51 729
3 742 743 746
3 237 236 436
3 807 808 117
3 607 608 882
3 834 835 169
3 958 959 972
3 260 259 201
3 360 361 198
3 417 416 247
3 775 776 992
3 598 599 910
3 294 442 515
3 782 357 615
3 147 832 904
3 771 201 1007
3 454 195 566
3 819 570 334
3 467 590 529
3 630 400 98
3 416 91 605
3 808 305 117
3 977 1000 136
3 922 175 212
3 619 917 414
3 151 232 575
3 594 32 523
3 411 717 663
3 546 710 594
3 538 462 501
3 561 411 657
3 546 139 710
3 294 446 365
3 175 444 918
3 48 8 665
3 501 843 35
3 90 910 861
3 761 109 546
3 590 679 587
3 819 99 592
3 297 771 198
3 848 163 85
3 222 322 604
3 962 854 464
3 110 515 590
3 301 421 698
3 949 132 240
3 703 169 297
3 937 851 178
3 624 913 325
3 400 602 869
3 91 826 167
3 501 35 538
3 995 48 977
3 842 203 183
3 917 470 125
3 921 156 906
3 862 758 763
3 922 514 519
3 143 995 338
3 385 343 559
3 546 504 120
3 174 763 969
3 529 515 442
3 922 212 514
3 975 962 464
3 110 66 875
3 91 285 605
3 998 992 776
3 529 378 467
3 851 914 329
3 729 51 492
3 608 312 703
3 987 949 240
3 301 72 17
3 294 515 907
3 905 494 555
3 491 742 429
3 137 802 666
3 304 352 22
3 96 820 513
3 528 516 589
3 208 273 45
3 547 505 246
3 860 691 598
3 431 732 339
3 856 845 148
3 182 127 473
3 528 659 578
3 31 863 595
3 138 121 547
3 488 560 342
3 431 339 994
3 520 513 923
3 31 764 757
3 647 905 157
3 415 126 469
3 77 182 204
3 339 734 976
3 537 34 500
3 284 166 825
3 97 870 601
3 101 324 912
3 186 179 852
3 345 360 296
3 241 131 948
3 71 699 420
3 589 516 111
3 465 855 963
3 603 321 223
3 563 84 164
3 360 199 772
3 211 591 100
3 65 588 680
3 547 108 762
3 549 860 911
3 34 844 500
3 976 664 9
3 213 919 443
3 441 366 445
3 709 138 547
3 930 656 412
3 500 461 537
3 709 547 524
3 225 974 900
3 123 930 673
3 405 647 920
3 578 441 528
3 213 459 707
3 11 275 986
3 547 762 775
3 166 549 89
3 775 997 524
3 876 798 278
3 418 101 623
3 96 211 820
3 296 958 834
3 664 563 847
3 567 603 223
3 352 237 22
3 516 441 293
3 494 616 356
3 845 903 833
3 199 1008 202
3 695 567 194
3 100 333 569
3 528 589 466
3 106 97 399
3 540 712 606
3 116 304 807
3 734 137 1001
3 213 176 923
3 785 415 916
3 293 576 233
3 524 31 595
3 656 662 718
3 524 595 709
3 185 173 461
3 560 88 920
3 123 540 505
3 970 405 88
3 127 785 618
3 880 856 332
3 883 345 702
3 96 513 520
3 991 114 273
3 273 114 106
3 328 418 250
3 437 747 730
3 1008 19 260
3 903 638 815
3 870 480 302
3 65 589 111
3 494 783 408
3 742 745 927
3 958 973 956
3 237 437 695
3 333 822 186
3 850 326 620
3 505 540 417
3 691 97 106
3 34 208 844
3 465 11 880
3 459 77 841
3 152 753 231
3 121 123 505
3 662 488 384
3 500 185 461
3 908 293 152
3 930 562 673
3 121 505 547
3 185 970 764
3 441 516 528
3 513 213 923
3 225 465 963
3 850 876 65
3 606 284 92
3 775 991 997
3 466 377 528
3 179 264 328
3 747 491 52
3 702 313 607
3 275 241 948
3 480 18 71
3 908 516 293
3 156 554 493
3 51 430 743
3 1000 439 667
3 808 21 353
3 514 819 95
3 590 515 529
3 843 46 272
3 109 247 504
3 910 599 692
3 338 731 432
3 331 147 846
3 203 788 474
3 579 660 529
3 594 862 32
3 672 561 929
3 180 151 294
3 462 184 501
3 717 385 489
3 504 124 120
3 180 472 839
3 708 205 842
3 854 50 881
3 843 209 35
3 599 107 98
3 247 416 541
3 875 281 799
3 570 937 187
3 21 454 696
3 835 740 955
3 430 926 746
3 554 409 782
3 110 590 66
3 602 301 479
3 832 816 639
3 201 259 20
3 696 729 748
3 914 251 419
3 46 630 107
3 998 272 115
3 519 514 95
3 608 703 346
3 50 331 857
3 474 619 786
3 763 758 87
3 504 541 124
3 343 921 87
3 462 174 184
3 899 975 224
3 541 320 672
3 87 921 648
3 529 442 579
3 918 708 460
3 881 987 274
3 523 776 761
3 826 90 550
3 523 998 776
3 66 279 797
3 251 624 102
3 819 210 95
3 169 835 959
3 8 848 564
3 195 222 604
3 21 236 353
3 89 90 826
3 114 115 107
3 108 109 761
3 883 882 346
3 1008 1007 20
3 772 771 297
3 956 955 740
3 702 703 312
3 455 454 21
3 304 305 353
3 747 748 492
3 927 926 430
3 695 696 566
3 223 222 195
3 469 470 917
3 787 788 203
3 707 708 918
3 923 922 519
3 591 592 99
3 186 187 178
3 418 419 102
3 623 624 251
3 936 937 570
3 213 212 460
3 127 128 786
3 441 442 365
3 576 575 232
3 231 230 839
3 908 907 515
3 326 327 621
3 876 875 797
3 588 587 679
3 377 378 529
3 997 273 272
3 537 461 462
3 123 124 929
3 595 594 710
3 560 559 87
3 319 320 541
3 284 285 167
3 691 692 98
3 18 17 72
3 302 301 602
3 45 46 843
3 970 969 406
3 494 493 615
3 408 409 554
3 342 343 385
3 562 561 672
3 431 432 731
3 137 136 803
3 1001 1000 977
3 84 85 163
3 47 48 995
3 11 12 274
3 948 949 987
3 845 846 904
3 833 832 147
3 855 854 962
3 963 962 975
3 148 147 331
3 903 904 639
3 986 987 881
3 275 274 240
3 900 899 224
3 164 163 848
3 976 977 665
3 802 803 667
3 732 731 338
3 673 672 320
3 384 385 717
3 555 554 156
3 616 615 357
3 405 406 648
3 844 843 501
3 601 602 400
3 71 72 698
3 97 98 869
3 166 167 550
3 540 541 713
3 488 489 559
3 863 862 594
3 121 120 124
3 461 173 174
3 273 208 209
3 764 31 32
3 680 679 590
3 798 797 279
3 620 621 799
3 516 515 110
3 838 839 472
3 233 232 151
3 366 365 446
3 528 529 660
3 459 460 78
3 569 570 819
3 250 251 914
3 101 102 325
3 179 178 265
3 100 99 334
3 520 519 95
3 919 918 444
3 204 203 842
3 916 917 619
3 785 786 414
3 567 566 604
3 429 430 51
3 491 492 743
3 352 353 236
3 22 21 808
3 313 312 608
3 739 740 835
3 296 297 959
3 19 20 259
3 345 346 361
3 246 247 109
3 991 992 115
3 911 910 90
3 1 508 534
3 625 1 244
3 380 789 189
3 80 395 159
3 872 258 760
3 812 878 249
3 534 530 1006
3 103 86 440
3 440 70 517
3 545 511 10
3 10 1004 42
3 42 609 723
3 219 942 39
3 498 531 632
3 7 30 392
3 276 219 581
3 867 777 276
3 836 1002 867
3 792 263 836
3 866 2 792
3 428 427 766
3 765 944 526
3 641 214 177
3 290 253 350
3 553 727 253
3 335 476 374
3 476 239 113
3 1 172 982
3 789 244 239
3 395 189 335
3 258 159 553
3 812 760 373
3 878 641 984
3 531 498 404
3 440 522 530
3 508 545 413
3 413 10 655
3 655 42 934
3 934 723 155
3 7 581 30
3 530 534 866
3 39 581 219
3 777 155 219
3 1002 934 777
3 263 655 1002
3 2 413 263
3 508 2 866
3 403 404 427
3 984 641 944
3 373 290 214
3 760 553 290
3 159 335 727
3 189 239 476
3 244 982 113
3 191 889 486
3 894 924 770
3 448 220 990
3 552 804 226
3 27 661 363
3 397 496 3
3 463 669 254
3 217 287 611
3 932 153 828
3 382 823 478
3 252 309 161
3 254 669 935
3 393 611 458
3 658 613 168
3 220 981 394
3 434 864 744
3 637 29 218
3 737 229 817
3 307 235 784
3 628 582 453
3 635 112 26
3 719 896 568
3 925 952 277
3 721 4 0
3 75 644 130
3 58 188 370
3 133 349 817
3 884 925 112
3 150 381 582
3 24 307 794
3 229 737 94
3 40 94 737
3 434 794 307
3 640 150 628
3 548 781 884
3 636 497 509
3 370 784 375
3 485 682 653
3 193 26 341
3 426 999 640
3 5 568 54
3 548 635 82
3 376 628 653
3 227 188 806
3 24 586 235
3 75 714 859
3 829 375 262
3 262 721 947
3 190 58 874
3 874 725 75
3 141 29 637
3 257 935 669
3 220 394 486
3 168 627 804
3 611 651 458
3 142 496 397
3 161 309 25
3 226 957 840
3 643 308 939
3 266 217 393
3 140 964 254
3 122 966 463
3 69 940 693
3 804 36 43
3 990 726 161
3 790 506 509
3 490 171 317
3 197 686 823
3 828 153 192
3 308 957 197
3 813 981 924
3 891 627 168
3 891 168 288
3 885 486 394
3 197 823 939
3 450 828 192
3 823 490 939
3 456 25 309
3 456 310 790
3 14 220 448
3 804 43 226
3 651 33 388
3 257 521 539
3 254 142 140
3 393 877 266
3 643 939 388
3 574 478 686
3 676 192 670
3 135 790 310
3 642 468 69
3 367 654 451
3 990 220 486
3 527 770 801
3 434 677 830
3 267 950 499
3 75 200 190
3 829 262 947
3 75 485 200
3 375 722 989
3 1005 737 349
3 379 307 784
3 582 993 978
3 112 74 341
3 391 600 344
3 810 277 41
3 947 0 82
3 714 130 389
3 58 190 806
3 694 295 349
3 884 635 548
3 286 426 571
3 434 307 379
3 40 737 1005
3 512 719 778
3 24 794 487
3 678 407 227
3 810 577 945
3 133 817 636
3 375 784 235
3 859 389 682
3 874 82 26
3 577 41 600
3 286 344 858
3 79 548 0
3 571 376 682
3 482 379 370
3 811 1005 295
3 637 218 40
3 744 677 434
3 298 801 770
3 889 726 990
3 654 877 27
3 93 142 397
3 448 25 359
3 43 686 197
3 693 450 308
3 611 393 217
3 61 140 142
3 935 257 135
3 458 651 892
3 552 226 840
3 990 161 448
3 894 770 63
3 191 486 885
3 793 367 627
3 765 837 893
3 895 711 871
3 888 428 767
3 941 675 158
3 56 447 895
3 888 435 634
3 953 827 961
3 837 283 255
3 741 39 942
3 610 55 134
3 983 484 622
3 759 118 741
3 289 968 323
3 954 424 134
3 525 401 715
3 715 401 60
3 612 424 689
3 118 28 741
3 632 531 535
3 145 741 942
3 316 827 953
3 634 435 347
3 348 898 292
3 531 403 316
3 292 895 749
3 581 39 868
3 984 893 158
3 428 961 827
3 675 398 158
3 684 160 700
3 316 953 646
3 129 30 581
3 55 610 632
3 649 371 868
3 774 289 355
3 196 715 60
3 622 780 751
3 572 134 55
3 289 323 355
3 759 741 145
3 371 73 129
3 134 724 610
3 323 145 942
3 622 271 30
3 76 953 961
3 634 59 888
3 243 684 700
3 398 348 292
3 403 827 316
3 700 435 767
3 893 984 765
3 765 256 837
3 292 749 249
3 888 961 428
3 495 422 893
3 447 711 895
3 160 347 435
3 961 457 68
3 837 256 283
3 741 868 39
3 355 154 724
3 510 507 271
3 28 868 741
3 425 145 323
3 424 612 134
3 60 938 55
3 751 542 510
3 134 572 954
3 791 759 145
3 484 780 622
3 355 323 154
3 542 283 256
3 457 888 59
3 475 56 895
3 255 495 837
3 711 700 871
3 779 271 622
3 158 878 984
3 435 888 767
3 422 941 893
3 447 243 711
3 76 961 68
3 868 129 581
3 134 612 724
3 73 983 129
3 968 425 323
3 55 938 946
3 779 622 751
3 55 946 572
3 689 774 355
3 425 791 145
3 28 649 868
3 196 632 715
3 724 612 355
3 129 622 30
3 646 525 535
3 961 888 457
3 243 700 711
3 898 475 895
3 765 507 510
3 700 767 871
3 249 158 292
3 158 249 878
3 288 613 368
3 985 981 813
3 298 14 738
3 726 676 252
3 451 574 43
3 940 902 988
3 433 642 750
3 773 234 468
3 6 310 456
3 207 171 490
3 252 670 309
3 539 506 790
3 750 642 33
3 168 552 658
3 220 14 981
3 678 242 245
3 830 141 487
3 146 950 267
3 307 24 235
3 993 806 978
3 74 945 390
3 568 5 719
3 781 886 884
3 640 650 150
3 341 390 725
3 351 978 806
3 989 586 295
3 5 781 548
3 426 640 376
3 379 864 434
3 1005 811 40
3 267 527 544
3 811 487 637
3 381 678 993
3 925 810 74
3 636 817 497
3 375 829 370
3 556 453 978
3 390 644 75
3 426 858 999
3 884 952 925
3 778 79 4
3 386 571 389
3 227 482 188
3 24 811 586
3 636 509 506
3 375 636 262
3 200 351 190
3 58 829 874
3 874 193 725
3 637 487 141
3 381 701 242
3 981 14 298
3 889 613 726
3 611 750 651
3 142 254 496
3 738 359 890
3 226 197 957
3 892 317 171
3 3 456 153
3 61 93 234
3 966 669 463
3 902 397 932
3 451 27 382
3 726 252 161
3 801 298 688
3 456 890 359
3 686 478 823
3 153 456 192
3 308 450 957
3 63 770 527
3 368 613 889
3 584 654 367
3 885 394 985
3 197 939 308
3 450 192 957
3 456 309 192
3 309 670 192
3 456 396 890
3 14 448 738
3 658 552 840
3 661 458 207
3 496 935 6
3 690 750 611
3 980 468 642
3 988 828 450
3 363 490 823
3 676 670 252
3 221 396 509
3 234 93 902
3 877 393 661
3 613 658 726
3 298 924 981
3 407 245 744
3 40 218 146
3 75 190 874
3 193 583 725
3 200 556 351
3 375 694 133
3 229 544 497
3 379 784 370
3 582 978 453
3 945 996 644
3 512 536 896
3 884 886 952
3 150 650 701
3 75 725 390
3 806 188 58
3 722 235 586
3 262 887 4
3 577 391 996
3 407 864 482
3 811 24 487
3 79 778 719
3 811 637 40
3 379 482 864
3 391 286 386
3 506 539 887
3 375 235 722
3 200 653 453
3 725 583 341
3 640 999 650
3 781 54 886
3 521 778 887
3 996 386 130
3 993 227 806
3 811 295 586
3 267 94 146
3 487 794 830
3 966 512 521
3 990 486 889
3 627 367 36
3 468 234 940
3 688 890 396
3 840 957 192
3 388 939 317
3 266 877 654
3 142 93 61
3 536 512 966
3 33 69 643
3 43 36 451
3 726 658 676
3 544 801 221
3 985 394 981
3 288 168 613
3 928 931 1006
3 943 593 522
3 511 545 625
3 15 369 380
3 427 979 80
3 749 812 249
3 558 671 282
3 671 306 330
3 383 330 687
3 687 818 853
3 853 83 526
3 543 498 633
3 723 724 154
3 609 610 724
3 83 271 507
3 818 392 83
3 330 756 818
3 306 481 756
3 558 706 306
3 795 558 423
3 871 872 812
3 404 15 979
3 543 511 369
3 177 943 517
3 350 928 593
3 652 814 931
3 374 752 814
3 522 593 1006
3 545 508 1
3 369 625 789
3 979 380 395
3 766 80 258
3 878 373 641
3 282 671 383
3 216 383 86
3 86 687 70
3 70 853 518
3 511 543 1004
3 1004 633 609
3 155 154 942
3 633 632 610
3 392 30 271
3 756 7 392
3 481 276 7
3 706 867 481
3 795 836 706
3 38 792 795
3 767 766 872
3 498 543 15
3 944 177 518
3 214 350 943
3 253 652 928
3 727 374 652
3 374 476 614
3 61 1003 140
3 23 315 261
3 865 449 755
3 809 64 824
3 885 865 191
3 565 858 162
3 971 568 57
3 557 733 585
3 873 270 104
3 533 452 503
3 533 950 314
3 215 744 933
3 532 410 502
3 796 909 62
3 697 952 728
3 894 238 813
3 716 503 596
3 755 831 865
3 140 44 964
3 266 597 217
3 433 387 980
3 1003 683 769
3 311 387 364
3 354 303 358
3 499 716 63
3 16 54 971
3 336 165 215
3 557 830 165
3 704 218 796
3 933 245 873
3 617 631 960
3 300 314 704
3 67 600 681
3 340 650 617
3 368 81 288
3 597 248 315
3 596 337 716
3 122 502 536
3 980 358 773
3 898 311 879
3 56 261 315
3 484 268 645
3 968 270 674
3 946 62 909
3 371 119 685
3 542 965 532
3 684 372 824
3 422 402 769
3 475 879 261
3 447 315 248
3 525 596 503
3 983 362 268
3 289 104 270
3 938 300 62
3 774 299 104
3 73 685 362
3 646 291 596
3 243 248 372
3 495 483 402
3 283 532 53
3 398 354 897
3 118 580 149
3 791 960 631
3 60 452 300
3 759 631 580
3 28 149 720
3 347 64 736
3 675 683 354
3 255 53 483
3 348 897 311
3 953 951 291
3 780 645 551
3 425 674 960
3 401 503 452
3 424 733 336
3 649 720 119
3 751 551 965
3 160 824 64
3 941 769 683
3 584 318 266
3 690 364 433
3 483 626 967
3 879 364 573
3 81 705 736
3 813 269 985
3 668 277 697
3 410 536 502
3 720 67 681
3 215 299 336
3 362 697 728
3 314 146 704
3 873 242 37
3 37 674 270
3 585 768 557
3 57 896 410
3 162 344 67
3 288 228 891
3 53 502 626
3 269 951 105
3 773 303 61
3 287 573 690
3 463 626 122
3 105 477 269
3 805 824 372
3 793 805 584
3 617 999 565
3 681 41 668
3 728 268 362
3 119 681 668
3 796 29 768
3 768 141 557
3 37 701 340
3 645 16 971
3 704 62 300
3 728 886 16
3 63 337 894
3 891 809 793
3 769 44 1003
3 238 291 951
3 964 967 463
3 217 23 287
3 825 91 92
3 106 599 598
3 762 776 775
3 92 416 417
3 199 1007 1008
3 202 771 772
3 973 955 956
3 170 703 702
3 194 454 455
3 116 305 304
3 437 748 747
3 745 926 927
3 730 696 695
3 321 222 223
3 126 470 469
3 473 788 787
3 206 708 707
3 176 922 923
3 211 592 591
3 822 187 186
3 328 419 418
3 912 624 623
3 852 937 936
3 513 212 213
3 182 128 127
3 578 442 441
3 293 575 576
3 753 230 231
3 181 907 908
3 850 327 326
3 280 875 876
3 65 587 588
3 466 378 377
3 524 998 523
3 34 538 35
3 930 657 656
3 709 139 138
3 88 758 757
3 656 663 662
3 606 285 284
3 860 692 691
3 480 17 18
3 420 301 302
3 629 46 45
3 185 969 970
3 905 493 494
3 783 409 408
3 920 343 342
3 412 561 562
3 144 432 431
3 734 136 137
3 438 1000 1001
3 563 85 84
3 9 48 47
3 465 12 11
3 131 949 948
3 856 846 845
3 815 832 833
3 49 854 855
3 974 899 900
3 332 50 49
3 638 816 815
3 880 857 856
3 241 132 131
3 225 464 465
3 847 8 9
3 664 564 563
3 666 439 438
3 339 735 734
3 994 143 144
3 718 411 412
3 157 921 920
3 356 782 783
3 647 906 905
3 500 184 185
3 399 630 629
3 699 421 420
3 870 479 480
3 549 861 860
3 712 605 606
3 662 489 488
3 757 862 863
3 138 120 121
3 173 763 174
3 208 35 209
3 31 523 32
3 589 467 466
3 278 66 65
3 800 281 280
3 111 849 850
3 471 180 181
3 152 754 753
3 445 294 293
3 659 579 578
3 77 183 182
3 820 514 513
3 915 851 852
3 324 913 912
3 264 329 328
3 333 821 822
3 96 210 211
3 443 175 176
3 841 205 206
3 618 474 473
3 415 125 126
3 603 322 321
3 52 729 730
3 742 746 745
3 237 436 437
3 807 117 116
3 607 882 883
3 834 169 170
3 958 972 973
3 260 201 202
3 360 198 199
3 417 247 246
3 775 992 991
3 598 910 911
3 782 615 493
3 147 904 846
3 771 1007 198
3 454 566 696
3 819 334 99
3 630 98 107
3 416 605 713
3 416 713 541
3 977 136 735
3 619 414 786
3 151 575 294
3 411 663 657
3 546 594 523
3 561 657 929
3 294 365 442
3 175 918 212
3 48 665 977
3 90 861 550
3 590 587 66
3 819 592 210
3 297 198 361
3 848 85 564
3 301 698 72
3 703 297 361
3 703 361 346
3 937 178 187
3 624 325 102
3 400 869 98
3 91 167 285
3 995 977 735
3 995 735 338
3 842 183 78
3 917 125 414
3 921 906 648
3 862 763 32
3 143 338 432
3 385 559 489
3 546 120 139
3 174 969 184
3 975 464 224
3 110 875 849
3 851 329 265
3 851 265 178
3 729 492 748
3 987 240 274
3 301 17 479
3 905 555 157
3 491 429 52
3 137 666 438
3 137 438 1001
3 304 22 807
3 208 45 844
3 547 246 108
3 860 598 911
3 856 148 332
3 182 473 787
3 182 787 204
3 488 342 384
3 431 994 144
3 31 757 863
3 647 157 920
3 415 469 916
3 77 204 841
3 339 976 47
3 339 47 994
3 284 825 92
3 97 601 399
3 101 912 623
3 186 852 936
3 345 296 170
3 345 170 702
3 71 420 302
3 563 164 847
3 360 772 296
3 211 100 820
3 65 680 589
3 549 911 89
3 976 9 47
3 213 443 176
3 441 445 293
3 930 412 562
3 123 673 319
3 123 319 540
3 405 920 88
3 213 707 919
3 11 986 880
3 547 775 524
3 166 89 825
3 876 278 65
3 418 623 250
3 296 834 170
3 664 847 9
3 567 223 194
3 494 356 783
3 845 833 148
3 199 202 772
3 695 194 455
3 100 569 820
3 106 399 629
3 540 606 92
3 540 92 417
3 734 1001 976
3 785 916 618
3 293 233 152
3 656 718 412
3 560 920 342
3 970 88 757
3 970 757 764
3 127 618 473
3 880 332 49
3 883 702 607
3 991 273 997
3 273 106 629
3 273 629 45
3 328 250 915
3 437 730 695
3 1008 260 202
3 903 815 833
3 870 302 601
3 494 408 555
3 742 927 429
3 958 956 739
3 958 739 834
3 237 695 455
3 237 455 22
3 333 186 936
3 333 936 569
3 850 620 800
3 850 800 280
3 850 280 876
3 505 417 246
3 691 106 598
3 465 880 49
3 465 49 855
3 459 841 206
3 459 206 707
3 152 231 838
3 152 838 471
3 152 471 181
3 662 384 718
3 908 152 181
3 185 764 173
3 225 963 974
3 850 65 111
3 179 328 915
3 179 915 852
3 747 52 730
3 275 948 986
3 480 71 302
3 156 493 906
3 51 743 492
3 1000 667 803
3 1000 803 136
3 808 353 305
3 843 272 209
3 109 504 546
3 910 692 861
3 331 846 857
3 203 474 128
3 203 128 183
3 180 294 907
3 717 489 663
3 180 839 230
3 180 230 754
3 180 754 151
3 708 842 78
3 708 78 460
3 854 881 12
3 854 12 464
3 599 98 692
3 247 541 504
3 875 799 621
3 875 621 327
3 875 327 849
3 570 187 821
3 570 821 334
3 21 696 436
3 21 436 236
3 835 955 972
3 835 972 959
3 430 746 743
3 554 782 493
3 602 479 869
3 832 639 904
3 201 20 1007
3 696 748 436
3 914 419 329
3 46 107 115
3 46 115 272
3 998 115 992
3 608 346 882
3 50 857 881
3 474 786 128
3 763 87 406
3 763 406 969
3 343 87 559
3 541 672 929
3 541 929 124
3 87 648 406
3 918 460 212
3 881 274 12
3 523 761 546
3 826 550 167
3 66 797 875
3 251 102 419
3 169 959 297
3 8 564 665
3 195 604 566
3 89 826 825
3 114 107 106
3 108 761 762
3 883 346 345
3 1008 20 19
3 772 297 296
3 956 740 739
3 702 312 313
3 455 21 22
3 304 353 352
3 747 492 491
3 927 430 429
3 695 566 567
3 223 195 194
3 469 917 916
3 787 203 204
3 707 918 919
3 923 519 520
3 591 99 100
3 186 178 179
3 418 102 101
3 623 251 250
3 936 570 569
3 213 460 459
3 127 786 785
3 441 365 366
3 576 232 233
3 231 839 838
3 908 515 516
3 326 621 620
3 876 797 798
3 588 679 680
3 377 529 528
3 997 272 998
3 537 462 538
3 123 929 930
3 595 710 709
3 560 87 88
3 319 541 540
3 284 167 166
3 691 98 97
3 18 72 71
3 302 602 601
3 45 843 844
3 970 406 405
3 494 615 616
3 408 554 555
3 342 385 384
3 562 672 673
3 431 731 732
3 137 803 802
3 1001 977 976
3 84 163 164
3 47 995 994
3 11 274 275
3 948 987 986
3 845 904 903
3 833 147 148
3 855 962 963
3 963 975 974
3 148 331 332
3 903 639 638
3 986 881 880
3 275 240 241
3 900 224 225
3 164 848 847
3 976 665 664
3 802 667 666
3 732 338 339
3 673 320 319
3 384 717 718
3 555 156 157
3 616 357 356
3 405 648 647
3 844 501 500
3 601 400 399
3 71 698 699
3 97 869 870
3 166 550 549
3 540 713 712
3 488 559 560
3 863 594 595
3 121 124 123
3 461 174 462
3 273 209 272
3 764 32 763
3 680 590 589
3 798 279 278
3 620 799 800
3 516 110 111
3 838 472 471
3 233 151 152
3 366 446 445
3 528 660 659
3 459 78 77
3 569 819 820
3 250 914 915
3 101 325 324
3 179 265 264
3 100 334 333
3 520 95 96
3 919 444 443
3 204 842 841
3 916 619 618
3 785 414 415
3 567 604 603
3 429 51 52
3 491 743 742
3 352 236 237
3 22 808 807
3 313 608 607
3 739 835 834
3 296 959 958
3 19 259 260
3 345 361 360
3 246 109 108
3 991 115 114
3 911 90 89
3 1 534 172
3 625 244 789
3 380 189 395
3 80 159 258
3 872 760 812
3 534 1006 931
3 534 931 814
3 534 814 752
3 534 752 614
3 534 614 113
3 534 113 982
3 534 982 172
3 103 440 13
3 440 517 522
3 545 10 413
3 10 42 655
3 42 723 934
3 498 632 633
3 276 581 7
3 867 276 481
3 836 867 706
3 792 836 795
3 866 792 38
3 428 766 767
3 765 526 507
3 641 177 944
3 290 350 214
3 553 253 290
3 335 374 727
3 476 113 614
3 1 982 244
3 789 239 189
3 395 335 159
3 258 553 760
3 812 373 878
3 531 404 403
3 440 530 13
3 508 413 2
3 413 655 263
3 655 934 1002
3 934 155 777
3 530 866 38
3 530 38 901
3 530 901 423
3 530 423 282
3 530 282 216
3 530 216 103
3 530 103 13
3 777 219 276
3 1002 777 867
3 263 1002 836
3 2 263 792
3 508 866 534
3 403 427 428
3 984 944 765
3 373 214 641
3 760 290 373
3 159 727 553
3 189 476 335
3 244 113 239
3 27 363 382
3 397 3 932
3 463 254 964
3 932 828 988
3 382 478 574
3 254 935 496
3 393 458 661
3 737 817 349
3 628 453 653
3 635 26 82
3 925 277 810
3 721 0 947
3 75 130 714
3 58 370 829
3 884 112 635
3 150 582 628
3 229 94 267
3 640 628 376
3 485 653 200
3 193 341 583
3 5 54 781
3 548 82 0
3 376 653 682
3 75 859 485
3 257 669 966
3 168 804 552
3 161 25 448
3 69 693 643
3 790 509 396
3 490 317 939
3 813 924 894
3 456 790 396
3 651 388 892
3 257 539 135
3 574 686 43
3 135 310 6
3 642 69 33
3 367 451 36
3 527 801 544
3 434 830 794
3 267 499 527
3 829 947 874
3 375 989 694
3 1005 349 295
3 112 341 26
3 391 344 286
3 810 41 577
3 947 82 874
3 714 389 859
3 694 349 133
3 286 571 386
3 512 778 521
3 678 227 993
3 810 945 74
3 859 682 485
3 874 26 193
3 577 600 391
3 286 858 426
3 79 0 4
3 571 682 389
3 482 370 188
3 298 770 924
3 654 27 451
3 93 397 902
3 448 359 738
3 43 197 226
3 693 308 643
3 935 135 6
3 458 892 207
3 793 627 891
3 895 871 749
3 941 158 893
3 983 622 129
3 525 715 535
3 632 535 715
3 531 316 535
3 428 827 403
3 55 632 196
3 371 129 868
3 323 942 154
3 398 292 158
3 495 893 837
3 160 435 700
3 510 271 779
3 60 55 196
3 751 510 779
3 542 256 510
3 689 355 612
3 646 535 316
3 898 895 292
3 765 510 256
3 298 738 688
3 940 988 693
3 433 750 690
3 773 468 980
3 6 456 3
3 207 490 363
3 539 790 135
3 750 33 651
3 678 245 407
3 74 390 341
3 351 806 190
3 989 295 694
3 5 548 79
3 426 376 571
3 267 544 229
3 381 993 582
3 925 74 112
3 556 978 351
3 778 4 887
3 386 389 130
3 636 506 262
3 381 242 678
3 738 890 688
3 892 171 207
3 3 153 932
3 61 234 773
3 902 932 988
3 451 382 574
3 801 688 221
3 456 359 25
3 63 527 499
3 368 889 191
3 584 367 793
3 658 840 676
3 661 207 363
3 496 6 3
3 690 611 287
3 980 642 433
3 988 450 693
3 363 823 382
3 221 509 497
3 234 902 940
3 877 661 27
3 407 744 864
3 40 146 94
3 375 133 636
3 229 497 817
3 945 644 390
3 512 896 719
3 150 701 381
3 722 586 989
3 262 4 721
3 577 996 945
3 407 482 227
3 79 719 5
3 391 386 996
3 506 887 262
3 200 453 556
3 521 887 539
3 996 130 644
3 966 521 257
3 627 36 804
3 468 940 69
3 688 396 221
3 840 192 676
3 388 317 892
3 266 654 584
3 536 966 122
3 33 643 388
3 544 221 497
3 928 1006 593
3 943 522 517
3 511 625 369
3 15 380 979
3 427 80 766
3 558 282 423
3 671 330 383
3 383 687 86
3 687 853 70
3 853 526 518
3 543 633 1004
3 723 154 155
3 609 724 723
3 83 507 526
3 818 83 853
3 330 818 687
3 306 756 330
3 558 306 671
3 795 423 901
3 871 812 749
3 404 979 427
3 543 369 15
3 177 517 518
3 350 593 943
3 652 931 928
3 374 814 652
3 522 1006 530
3 545 1 625
3 369 789 380
3 979 395 80
3 766 258 872
3 282 383 216
3 216 86 103
3 86 70 440
3 70 518 517
3 511 1004 10
3 1004 609 42
3 155 942 219
3 633 610 609
3 392 271 83
3 756 392 818
3 481 7 756
3 706 481 306
3 795 706 558
3 38 795 901
3 767 872 871
3 498 15 404
3 944 518 526
3 214 943 177
3 253 928 350
3 727 652 253
3 374 614 752