OFF
1530 1930 0
-0.1039411056 0.2957433091 0.0020653763
-0.0476998129 0.2955658792 -0.0196883737
-0.0862741060 0.2957968283 0.0088449842
-0.0121947902 0.2957864918 0.0080231703
0.0082181557 0.2956436392 -0.0096477139
0.0082672048 0.2957243398 0.0004078262
-0.0123171565 0.2955851622 -0.0170631102
-0.0864009648 0.2955881070 -0.0171623182
-0.0475501527 0.2958121156 0.0109934300
-0.1040009861 0.2956447875 -0.0102107096
-0.1181748663 -0.2325698554 -0.4992203983
-0.1357421367 -0.2325682807 -0.4991347210
-0.1133027812 -0.2245537977 0.4996046845
-0.1308700516 -0.2245522229 0.4996903618
0.0253076291 -0.2232360446 0.3795836183
0.0381350590 -0.2232371944 0.3795210577
0.0215996236 -0.2293368383 -0.3805937646
0.0344270535 -0.2293379881 -0.3806563252
-0.0687822879 -0.2935157344 -0.0318835570
-0.0758709442 -0.2934924840 -0.0290311798
-0.0616671941 -0.2934937573 -0.0291004528
-0.0686884566 -0.2933613536 -0.0126472373
-0.0756490387 -0.2931273821 0.0164616229
-0.0614452886 -0.2931286554 0.0163923498
-0.0785577598 -0.2930725333 0.0232774439
-0.0584702148 -0.2930743339 0.0231794750
-0.0787796704 -0.2934376436 -0.0222164101
-0.0586921255 -0.2934394443 -0.0223143790
-0.0758045967 -0.2933833222 -0.0154292849
-0.0616008466 -0.2933845954 -0.0154985580
-0.0755826911 -0.2930182203 0.0300635177
-0.0613789411 -0.2930194935 0.0299942446
-0.0685603772 -0.2931506241 0.0136102970
-0.0684665460 -0.2929962432 0.0328466167
-0.0120517110 0.2388688078 -0.0040649820
-0.0277085355 0.2388702113 -0.0039886222
0.1495723626 -0.2554521575 -0.1228513845
0.1495859891 -0.2554297379 -0.1200578284
0.1507484789 -0.2535170896 0.1182639391
0.1507621053 -0.2534946700 0.1210574952
0.0718525665 -0.0881485544 0.0204123165
0.0716354049 -0.0885058512 -0.0241079459
-0.0511103732 -0.1718260562 -0.0177082186
-0.0392355377 -0.1718271207 -0.0177661333
-0.0508884677 -0.1714609543 0.0277845841
-0.0390136322 -0.1714620188 0.0277266693
-0.0452391133 -0.1719354381 -0.0313001692
-0.0450172077 -0.1715703362 0.0141926335
-0.0365817421 -0.1715073232 0.0220970726
-0.0533751610 -0.1715058179 0.0221789757
-0.0368036528 -0.1718724335 -0.0233967815
-0.0535970717 -0.1718709282 -0.0233148783
-0.0451616061 -0.1718079152 -0.0154104392
-0.0449397006 -0.1714428133 0.0300823634
-0.0511651816 -0.1719162326 -0.0289444751
-0.0392903461 -0.1719172971 -0.0290023898
-0.0509432761 -0.1715511307 0.0165483276
-0.0390684406 -0.1715521952 0.0164904128
0.0680155569 -0.0240608062 -0.0186108583
0.0053758650 -0.0243229758 -0.0516711155
-0.0374694330 -0.0235831872 0.0402363747
-0.0574910369 -0.0240783982 -0.0215925035
0.0453685251 -0.0236025616 0.0383435555
0.0449726554 -0.0242538874 -0.0428136110
-0.0572973126 -0.0237596629 0.0181228846
-0.0378798267 -0.0242584093 -0.0438983419
0.0058600272 -0.0235263822 0.0475868642
0.0681742227 -0.0237997527 0.0139171948
0.0860081747 -0.2261234891 -0.0210768302
0.0595675402 -0.2263642550 -0.0512424364
-0.0354654250 -0.2263706216 -0.0526336560
-0.0579487815 -0.2261465155 -0.0248516839
0.0147476664 -0.2254581961 0.0613697807
0.0141444407 -0.2264506853 -0.0622973813
-0.0577074236 -0.2257494085 0.0246290593
-0.0349541125 -0.2255293574 0.0521904079
0.0600607593 -0.2255527599 0.0498723066
0.0862058583 -0.2257982396 0.0194502347
-0.0865077982 -0.2234798410 0.0000087741
-0.1061085317 -0.2234780839 0.0001043688
0.1495797898 -0.2433339881 -0.1215512479
0.1507559009 -0.2413989286 0.1195630243
0.0247743805 -0.2058667476 0.3794468223
0.0386700619 -0.2058679932 0.3793790517
0.0210663750 -0.2119675413 -0.3807305605
0.0349620564 -0.2119687870 -0.3807983311
-0.1024409853 -0.1923368983 -0.1239855674
-0.1012204921 -0.1903288168 0.1262274756
-0.1024536220 -0.1923576895 -0.1265762042
-0.1012331288 -0.1903496079 0.1236368388
-0.1265013545 0.3615704934 0.0025272209
-0.0328602236 0.3615601079 0.0018223890
-0.0069686010 0.3615252316 -0.0023602647
-0.0775606581 0.3615762324 0.0035502362
-0.1488420353 0.3614895801 -0.0076950727
-0.1488097155 0.3615427561 -0.0010691825
-0.0776414321 0.3614433346 -0.0130092322
-0.0069950744 0.3614816748 -0.0077875648
-0.0329262686 0.3614514439 -0.0117174735
-0.1265698202 0.3614578467 -0.0115089000
0.0060805849 -0.3849623355 -0.0098510227
-0.0033314036 -0.3847705305 0.0139885114
-0.0137702534 -0.3847856024 0.0120448793
0.0116339723 -0.3849113590 -0.0034644461
-0.0185491792 -0.3848321845 0.0062107266
-0.0186002796 -0.3849162602 -0.0042653714
0.0116758209 -0.3848425053 0.0051149357
-0.0138784958 -0.3849636939 -0.0101458599
-0.0034591035 -0.3849806356 -0.0121912197
0.0061850014 -0.3847905388 0.0115553760
0.1495782614 -0.2736008508 -0.1213083342
0.1507543725 -0.2716657914 0.1198059380
-0.0630605857 -0.3157969123 -0.0233449329
-0.0664913974 -0.3157966048 -0.0233282005
-0.0645560425 -0.3154357407 0.0216473583
-0.0630485747 -0.3157771507 -0.0208825662
-0.0664793865 -0.3157768431 -0.0208658338
-0.0669731957 -0.3154215500 0.0234002983
-0.0621229552 -0.3154219848 0.0233766432
-0.0645390569 -0.3154077942 0.0251295780
-0.0647779532 -0.3158008510 -0.0238464957
-0.0671951063 -0.3157866603 -0.0220935558
-0.0623448658 -0.3157870951 -0.0221172109
-0.0628386750 -0.3154318020 0.0221489212
-0.0662694868 -0.3154314945 0.0221656536
-0.0647609675 -0.3157729045 -0.0203642761
-0.0628266640 -0.3154120403 0.0246112879
-0.0662574758 -0.3154117328 0.0246280203
0.0814806064 -0.2005396043 0.0212673456
0.0622129655 -0.2005378771 0.0213613158
0.0812634447 -0.2008969011 -0.0232529168
0.0619958039 -0.2008951739 -0.0231589467
0.0384024143 -0.2174471182 0.3794732854
0.0250408586 -0.2174459205 0.3795384510
0.0346944088 -0.2235479119 -0.3807040975
0.0213328531 -0.2235467142 -0.3806389319
-0.0637913970 -0.2212987629 0.0193193140
-0.0637591130 -0.2212456460 0.0259378444
-0.0690925361 -0.2216180699 -0.0204994380
-0.0588789579 -0.2216189855 -0.0205492506
-0.0691153682 -0.2216556357 -0.0251802477
-0.0589017900 -0.2216565513 -0.0252300603
-0.0565529888 -0.2212728477 0.0225938812
-0.0709964646 -0.2212715529 0.0226643234
-0.0567748995 -0.2216379580 -0.0228999728
-0.0712183753 -0.2216366633 -0.0228295306
-0.0688706255 -0.2212529596 0.0249944161
-0.0586570472 -0.2212538751 0.0249446035
-0.0688934576 -0.2212905254 0.0203136063
-0.0586798794 -0.2212914409 0.0202637937
-0.0640133025 -0.2216638648 -0.0261734886
-0.0639810185 -0.2216107479 -0.0195549582
-0.0198820195 0.2117305837 -0.0038089898
-0.1269607192 -0.2764874035 -0.4988250828
-0.0963106395 -0.2724819038 0.0004498560
-0.1220886342 -0.2684713458 0.5000000000
-0.0473723183 0.2664500193 0.0115615293
0.0155821517 0.2662699371 -0.0104804566
-0.0215470512 0.2664703193 0.0142533821
0.0020179390 0.2664411365 0.0107654985
-0.0592419390 0.2662659023 -0.0114539898
-0.0591697604 0.2663846581 0.0033433410
0.0018704430 0.2661984609 -0.0194726166
-0.0217274517 0.2661735057 -0.0227304822
0.0156412732 0.2663672099 0.0016400229
-0.0475252300 0.2661984332 -0.0197868588
-0.0465334298 0.2810233791 0.1923541709
-0.0371935889 0.2810225419 0.1923086196
-0.0484511133 0.2778682082 -0.2007896901
-0.0391112723 0.2778673710 -0.2008352414
0.0216104452 0.2399156125 0.0040807371
0.0094671674 0.2400165022 0.0165751034
-0.0115672140 0.2400555420 0.0213070917
-0.0451883686 0.2399363507 0.0062444033
-0.0348443291 0.2396812499 -0.0254758625
-0.0346344499 0.2400265648 0.0175514193
-0.0452874412 0.2397733463 -0.0140664420
-0.0118148287 0.2396481407 -0.0294563532
0.0092647143 0.2396834054 -0.0249297586
0.0215293019 0.2397821072 -0.0125544318
-0.1202034993 -0.2618482136 -0.4989755299
-0.1337164607 -0.2618470023 -0.4989096259
-0.1153314142 -0.2538321558 0.4998495529
-0.1288443756 -0.2538309445 0.4999154569
-0.1269533267 -0.1300936529 -0.5000000000
-0.1220812416 -0.1220775951 0.4988250828
-0.0198751672 0.3474252134 -0.0048980387
0.0659161732 -0.2406777868 0.0216653945
0.0777733447 -0.2406788497 0.0216075659
0.0656990116 -0.2410350836 -0.0228548679
0.0775561831 -0.2410361465 -0.0229126965
-0.1012187425 -0.1869585602 0.1265242773
-0.1012345383 -0.1869845492 0.1232859812
-0.1024392357 -0.1889666418 -0.1236887657
-0.1024550315 -0.1889926307 -0.1269270618
-0.0273955524 0.2320854517 -0.0039356979
-0.0123653794 0.2320841044 -0.0040090015
-0.0868850345 -0.2398144715 0.0001417076
-0.1057329451 -0.2398127819 0.0002336307
-0.0463464799 0.2769754442 0.1923857456
-0.0373798962 0.2769746404 0.1923420147
-0.0482641634 0.2738202732 -0.2007581153
-0.0392975796 0.2738194694 -0.2008018462
-0.1053558945 -0.2479790965 0.0002973301
-0.0872629098 -0.2479807183 0.0002090889
-0.0170521778 -0.3449791626 0.0177117682
0.0340687452 -0.3450677580 0.0069945106
0.0039082979 -0.3449564182 0.0206775850
-0.0267153772 -0.3451799155 -0.0073626776
0.0230263912 -0.3449875989 0.0169127861
0.0228657970 -0.3452518251 -0.0160105914
-0.0266367879 -0.3450506122 0.0087488967
0.0037118862 -0.3452795751 -0.0195887340
0.0340043824 -0.3451736543 -0.0062004944
-0.0172186595 -0.3452530755 -0.0164186106
-0.0741424811 -0.2342423306 0.0159901048
-0.0598640796 -0.2342436105 0.0159204677
-0.0669232858 -0.2341113553 0.0323549427
-0.0568732754 -0.2341893580 0.0226991048
-0.0770670146 -0.2341875479 0.0227975916
-0.0670170042 -0.2342655505 0.0131417537
-0.0740762104 -0.2341332954 0.0295762287
-0.0597978089 -0.2341345753 0.0295065916
-0.0743643917 -0.2346074410 -0.0295037492
-0.0600859902 -0.2346087209 -0.0295733863
-0.0671451965 -0.2344764657 -0.0131389113
-0.0570951860 -0.2345544684 -0.0227947492
-0.0772889253 -0.2345526582 -0.0226962624
-0.0672389149 -0.2346306609 -0.0323521003
-0.0742981211 -0.2344984057 -0.0159176253
-0.0600197196 -0.2344996856 -0.0159872624
-0.0427372202 -0.3796558961 0.0073270904
0.0204424908 -0.3796089798 0.0135703539
-0.0305610684 -0.3796006274 0.0142901392
-0.0038956943 -0.3795838372 0.0165499669
0.0345193697 -0.3796719434 0.0058137177
0.0344692129 -0.3797544666 -0.0044689237
-0.0040487598 -0.3798356764 -0.0148299630
-0.0306908197 -0.3798141077 -0.0123101498
0.0203173346 -0.3798148997 -0.0120878854
-0.0427984648 -0.3797566622 -0.0052286666
-0.1272109809 0.3320717152 -0.0139407129
-0.0280703983 0.3322155973 0.0046106736
-0.1507175980 0.3321882894 0.0004364412
-0.0007277185 0.3321080711 -0.0086149591
-0.0754607992 0.3320530938 -0.0159353062
-0.0753492848 0.3322365687 0.0069262229
-0.0006911727 0.3321682000 -0.0011227196
-0.1507622161 0.3321148792 -0.0087106937
-0.0281615730 0.3320655873 -0.0140810236
-0.1271164625 0.3322272267 0.0054364937
0.0317263145 -0.1248091225 0.3787623851
0.0280183090 -0.1309099162 -0.3814149977
-0.1024388734 -0.1754954828 -0.1238620723
-0.1024540384 -0.1755204339 -0.1269710468
-0.1012183750 -0.1734873929 0.1263520221
-0.1012335400 -0.1735123439 0.1232430476
0.1507617761 -0.2656001098 0.1212124807
0.1507475803 -0.2656234661 0.1183022198
0.1495856650 -0.2675351693 -0.1199017915
0.1495714693 -0.2675585256 -0.1228120524
-0.0418638012 0.2648333905 0.1924613259
-0.0437814846 0.2616782195 -0.2006825351
-0.0467426036 -0.0623059535 0.0137016338
-0.0494961803 -0.0622449670 0.0212831832
-0.0439151969 -0.0622454673 0.0212559642
-0.0449279635 -0.0625675552 -0.0188823058
-0.0488739753 -0.0625672015 -0.0188630607
-0.0469645143 -0.0626710639 -0.0317922203
-0.0447060580 -0.0622024533 0.0266104969
-0.0486520698 -0.0622020996 0.0266297420
-0.0449801666 -0.0626534451 -0.0295844537
-0.0489261785 -0.0626530914 -0.0295652086
-0.0447582611 -0.0622883432 0.0159083490
-0.0487042729 -0.0622879895 0.0159275940
-0.0466687736 -0.0621844807 0.0288375137
-0.0497180910 -0.0626100773 -0.0242106708
-0.0441371075 -0.0626105776 -0.0242378898
-0.0468906842 -0.0625495911 -0.0166563404
-0.1350638503 -0.1886510572 -0.4994904867
-0.1188476658 -0.1886525108 -0.4995695746
-0.1301917652 -0.1806349995 0.4993345961
-0.1139755807 -0.1806364531 0.4992555082
-0.1350671769 -0.2545280347 -0.4989617756
-0.1188509924 -0.2545294884 -0.4990408635
-0.1301950919 -0.2465119770 0.4998633072
-0.1139789073 -0.2465134306 0.4997842193
-0.0472573128 0.3915266836 -0.0055316440
-0.0898140376 0.3915354433 -0.0047079587
-0.0816296656 0.3915365239 -0.0045218194
-0.0377448837 0.3915278139 -0.0053309534
-0.0636705658 0.3915274123 -0.0055441199
-0.0636656322 0.3915355296 -0.0045326781
-0.0377432631 0.3915304803 -0.0049987126
-0.0816338504 0.3915296385 -0.0053797576
-0.0898160172 0.3915321862 -0.0051137971
-0.0472532817 0.3915333158 -0.0047052477
-0.0280211761 0.2524397023 -0.0040959990
-0.0117377001 0.2524382427 -0.0041754151
-0.1024457730 -0.1620362721 -0.1255241540
-0.1012252798 -0.1600281905 0.1246888890
-0.0601819583 -0.1889478066 0.0264445480
-0.0602218838 -0.1890134961 0.0182594393
-0.0553092298 -0.1893229850 -0.0202717202
-0.0655101909 -0.1893220706 -0.0202219692
-0.0550873243 -0.1889578831 0.0252210824
-0.0652882854 -0.1889569687 0.0252708335
-0.0529891178 -0.1889812937 0.0223173419
-0.0674147193 -0.1889800006 0.0223876969
-0.0553374623 -0.1893694360 -0.0260596487
-0.0655384234 -0.1893685216 -0.0260098977
-0.0532110284 -0.1893464041 -0.0231765122
-0.0676366299 -0.1893451110 -0.0231061571
-0.0551155568 -0.1890043341 0.0194331539
-0.0653165178 -0.1890034197 0.0194829050
-0.0604038639 -0.1893129085 -0.0190482546
-0.0604437893 -0.1893785980 -0.0272333633
0.0718444587 -0.2487068646 0.0217009147
0.0716272970 -0.2490641614 -0.0228193477
-0.0669767969 -0.3069420478 -0.0242769900
-0.0632200422 -0.3069423846 -0.0242953120
-0.0651021607 -0.3069492366 -0.0251609141
-0.0667548913 -0.3065769459 0.0212158127
-0.0629981367 -0.3065772827 0.0211974906
-0.0650730308 -0.3069013090 -0.0191889915
-0.0675226454 -0.3065599243 0.0233318595
-0.0622097763 -0.3065604006 0.0233059481
-0.0677445560 -0.3069250347 -0.0221619945
-0.0624316869 -0.3069255109 -0.0221879059
-0.0648802501 -0.3065841263 0.0203329400
-0.0669561956 -0.3069081526 -0.0200535370
-0.0631994410 -0.3069084893 -0.0200718590
-0.0648511201 -0.3065361987 0.0263048626
-0.0667342901 -0.3065430507 0.0254392657
-0.0629775354 -0.3065433874 0.0254209436
-0.0353619783 0.1526899876 -0.0310599314
0.0235678187 0.1531230133 0.0232655114
0.0396165586 0.1528201123 -0.0143747335
-0.0047308943 0.1526471425 -0.0362056692
-0.0491253546 0.1530196361 0.0099274025
-0.0492533623 0.1528090247 -0.0163154123
-0.0044109676 0.1531735190 0.0293824427
0.0397214059 0.1529926179 0.0071199823
0.0233062339 0.1526926270 -0.0303619330
-0.0350907929 0.1531361698 0.0245357241
0.0629566551 -0.1523708711 0.0209711245
0.0807419918 -0.1523724654 0.0208843837
0.0627394934 -0.1527281679 -0.0235491379
0.0805248301 -0.1527297622 -0.0236358787
0.0629530066 -0.2246214798 0.0215509886
0.0807383433 -0.2246230741 0.0214642478
0.0627358449 -0.2249787766 -0.0229692738
0.0805211816 -0.2249803709 -0.0230560146
-0.0613738206 -0.2659407089 -0.0265849369
0.0119207807 -0.2662698712 -0.0671371307
-0.0385211297 -0.2661834126 -0.0566818340
0.0850072479 -0.2659148873 -0.0224465490
0.0581107662 -0.2661759404 -0.0551428024
0.0586452185 -0.2652966042 0.0544251550
0.0852214555 -0.2655624507 0.0214681100
-0.0379670659 -0.2652718096 0.0569066572
0.0125744401 -0.2651944032 0.0668694480
-0.0611122769 -0.2655103901 0.0270340963
-0.0963023910 -0.1091384156 -0.0008610953
-0.0279303984 -0.1901059170 -0.0157240720
-0.0532267210 -0.1901036494 -0.0156006994
-0.0278316848 -0.1899435032 0.0045131755
-0.0531280074 -0.1899412356 0.0046365481
-0.0902792321 -0.2643151123 0.0003548934
-0.1023412220 -0.2643140310 0.0004137209
0.0809378438 -0.2588030147 0.0204621309
0.0555982490 -0.2585489494 0.0519590311
-0.0585900958 -0.2587532940 0.0257793837
0.0116707954 -0.2584512862 0.0638513897
-0.0365206651 -0.2585252748 0.0543292480
-0.0370501838 -0.2593964937 -0.0542272676
0.0110460915 -0.2594791136 -0.0642190139
-0.0588400492 -0.2591645431 -0.0254634973
0.0550874699 -0.2593893360 -0.0527556878
0.0807331239 -0.2591398410 -0.0215074476
0.0815304672 -0.1067766396 -0.0204219047
0.0817126319 -0.1064769234 0.0169236395
0.0156072425 -0.1070781754 -0.0584078211
-0.0503046062 -0.1064319770 0.0216932717
-0.0294313308 -0.1062291912 0.0470915560
0.0572745262 -0.1069985136 -0.0482198542
0.0577290250 -0.1062507251 0.0449568579
-0.0299025076 -0.1070044199 -0.0495042920
-0.0505270194 -0.1067979142 -0.0239036190
0.0161631115 -0.1061636023 0.0555507611
0.1495860998 -0.2645087549 -0.1198682503
0.1507622161 -0.2625736870 0.1212470733
0.1495713349 -0.2645330478 -0.1228952160
0.1507474511 -0.2625979799 0.1182201076
-0.0261436435 0.2253006080 -0.0038873528
-0.0136179736 0.2252994852 -0.0039484417
-0.0418597135 0.3457812406 0.1918116600
-0.0437773969 0.3426260697 -0.2013322010
-0.0032117991 -0.3914963717 0.0022011048
-0.0127123018 -0.3915315099 -0.0022368660
-0.0088353660 -0.3915365239 -0.0028372093
-0.0144565315 -0.3914931444 0.0025324698
-0.0052876049 -0.3915312557 -0.0021584722
-0.0052571723 -0.3914811848 0.0040805047
-0.0144714247 -0.3915176482 -0.0005207807
-0.0087981433 -0.3914752812 0.0047938143
-0.0126807512 -0.3914795996 0.0042313150
-0.0032239947 -0.3915164372 -0.0002991121
-0.0273924689 0.2931480351 -0.0044257699
-0.0123622959 0.2931466878 -0.0044990735
0.0274445989 -0.2348164365 0.3796661328
0.0359958683 -0.2348172030 0.3796244275
0.0237365934 -0.2409172302 -0.3805112500
0.0322878628 -0.2409179967 -0.3805529554
-0.0467201754 0.2891181809 0.1922901171
-0.0370060258 0.2891173102 0.1922427402
-0.0486378588 0.2859630100 -0.2008537439
-0.0389237093 0.2859621392 -0.2009011207
0.1495737940 -0.2720943003 -0.1222520211
0.1495828766 -0.2720793567 -0.1203900009
0.1507499102 -0.2701592324 0.1188633024
0.1507589928 -0.2701442888 0.1207253227
0.0792558440 -0.2326514876 0.0215359111
0.0644351156 -0.2326501591 0.0216081932
0.0790386823 -0.2330087844 -0.0229843513
0.0642179539 -0.2330074559 -0.0229120692
-0.0475253720 -0.3631897135 0.0169761016
0.0004594135 -0.3636443393 -0.0393679959
-0.0323362248 -0.3630471410 0.0348360908
0.0485673634 -0.3632216173 0.0136055292
0.0307867170 -0.3635884109 -0.0322085372
0.0311063771 -0.3630624731 0.0333249022
0.0484392429 -0.3634324143 -0.0126604162
-0.0326676087 -0.3635923679 -0.0331008372
0.0008503599 -0.3630011140 0.0407798316
-0.0476818018 -0.3634470880 -0.0150935434
-0.0275696657 -0.1691210100 -0.0510181361
-0.0270789698 -0.1683136664 0.0495793206
0.0624004941 -0.1683359736 0.0473628668
0.0191495711 -0.1691977683 -0.0602882010
-0.0485093994 -0.1685248829 0.0231270767
0.0868308533 -0.1688836480 -0.0207232149
0.0870205671 -0.1685715112 0.0181699825
-0.0487410235 -0.1689059747 -0.0243581191
0.0197284774 -0.1682452919 0.0583932468
0.0619271634 -0.1691147463 -0.0496745670
0.0005333630 0.0742299037 0.0347950813
0.0531476283 0.0740223194 0.0092612921
0.0335870967 0.0736784775 -0.0337042087
-0.0363499792 0.0736756923 -0.0344912923
-0.0527663228 0.0740536690 0.0125010221
-0.0529130803 0.0738122085 -0.0175856922
-0.0360390889 0.0741872011 0.0292442620
0.0338869812 0.0741718785 0.0277750523
0.0530274365 0.0738245675 -0.0153791970
0.0001665822 0.0736264380 -0.0403985737
-0.1012319470 -0.1920308269 0.1239100430
-0.1012218387 -0.1920141957 0.1259823422
-0.1024524454 -0.1940389169 -0.1263040514
-0.1024423371 -0.1940222856 -0.1242317522
-0.1215549548 -0.2691679903 -0.4989101930
-0.1323657445 -0.2691670212 -0.4988574677
-0.1166828697 -0.2611519325 0.4999148898
-0.1274936594 -0.2611509634 0.4999676151
0.1507602077 -0.2686294404 0.1209465896
0.1507488481 -0.2686481305 0.1186177501
0.1495727370 -0.2705831899 -0.1224965221
0.1495840915 -0.2705645083 -0.1201687340
-0.0668988742 -0.2041799796 -0.0252797871
-0.0573844961 -0.2041808325 -0.0253261897
-0.0619238747 -0.2038229068 0.0192425049
-0.0668765447 -0.2041432408 -0.0207020141
-0.0573621666 -0.2041440937 -0.0207484166
-0.0551799919 -0.2037975295 0.0224469361
-0.0686361762 -0.2037963233 0.0225125632
-0.0621457854 -0.2041880172 -0.0262513491
-0.0618922933 -0.2037709459 0.0257169943
-0.0554019026 -0.2041626398 -0.0230469180
-0.0688580868 -0.2041614336 -0.0229812909
-0.0666769636 -0.2038148693 0.0202140669
-0.0571625854 -0.2038157222 0.0201676644
-0.0621142040 -0.2041360562 -0.0197768598
-0.0666546340 -0.2037781304 0.0247918400
-0.0571402559 -0.2037789833 0.0247454374
0.0253102605 -0.1711272460 0.3791654070
0.0381376904 -0.1711283958 0.3791028464
0.0216022550 -0.1772280397 -0.3810119759
0.0344296849 -0.1772291896 -0.3810745365
-0.0122182208 -0.3719335934 -0.0114572271
0.0150852660 -0.3718755121 -0.0040485544
-0.0009265950 -0.3717195357 0.0152852399
0.0091415732 -0.3719320146 -0.0111261131
-0.0172702150 -0.3718810417 -0.0049411220
0.0151316329 -0.3717992246 0.0054571062
-0.0172136065 -0.3717879036 0.0066641741
0.0092572622 -0.3717416712 0.0125912514
-0.0010680803 -0.3719523220 -0.0137206405
-0.0120982854 -0.3717362634 0.0131306922
-0.0381276663 0.2729278406 0.1923781398
-0.0456001699 0.2729285104 0.1924145839
-0.0400453498 0.2697726696 -0.2007657212
-0.0475178534 0.2697733395 -0.2007292771
-0.0279305516 -0.1931413299 -0.0156997106
-0.0532268743 -0.1931390624 -0.0155763380
-0.0278318381 -0.1929789162 0.0045375370
-0.0531281607 -0.1929766486 0.0046609096
0.0370654637 -0.2290271987 0.3795727426
0.0263766397 -0.2290262406 0.3796248730
0.0333574582 -0.2351279924 -0.3806046403
0.0226686342 -0.2351270343 -0.3805525099
-0.1012346810 -0.1836163548 0.1231948098
-0.1024551793 -0.1856244448 -0.1270192846
-0.1012182544 -0.1835893280 0.1265624274
-0.1024387527 -0.1855974180 -0.1236516670
0.1495716749 -0.2690720880 -0.1227420745
0.1495853013 -0.2690496684 -0.1199485185
0.1507477911 -0.2671370201 0.1183732491
0.1507614175 -0.2671146005 0.1211668051
0.0173390925 -0.1908865792 0.0595729044
0.0609326917 -0.1917705462 -0.0502943833
0.0866521259 -0.1915356394 -0.0208633565
-0.0310073282 -0.1909560225 0.0506161310
-0.0533745874 -0.1915581490 -0.0245490821
-0.0531391067 -0.1911707118 0.0237267627
-0.0315061785 -0.1917767824 -0.0516530435
0.0868449887 -0.1912183216 0.0186753973
0.0614138896 -0.1909788297 0.0483558902
0.0167505652 -0.1918548852 -0.0610809600
0.0317204670 -0.2406058685 0.3796917389
0.0280124615 -0.2467066623 -0.3804856439
0.0462470326 -0.3142923262 -0.0504150155
0.0467396979 -0.3134817424 0.0505861769
-0.0601695001 -0.3140758180 -0.0241078375
0.0057069096 -0.3133876635 0.0620501584
-0.0398203900 -0.3142994796 -0.0518478581
0.0702073931 -0.3140516080 -0.0202709582
0.0704048510 -0.3137267298 0.0202098453
-0.0393096518 -0.3134591605 0.0528584496
0.0051043609 -0.3143790389 -0.0614782194
-0.0599284088 -0.3136791497 0.0253182332
-0.1024396386 -0.1906504681 -0.1237404425
-0.1024548037 -0.1906754191 -0.1268494170
-0.1012191403 -0.1886423781 0.1264736519
-0.1012343053 -0.1886673291 0.1233646774
-0.0448528086 0.2688805252 0.1924434255
-0.0388754365 0.2688799894 0.1924142732
-0.0467704920 0.2657253543 -0.2007004355
-0.0407931200 0.2657248184 -0.2007295877
-0.0148705677 0.2185148659 -0.0038878819
-0.0248917345 0.2185157642 -0.0038390077
-0.0671635386 -0.3057204107 -0.0140811966
-0.0669416330 -0.3053553088 0.0314116061
-0.0610547708 -0.3054667004 0.0175693415
-0.0729632520 -0.3054656329 0.0176274203
-0.0585602097 -0.3054210022 0.0232790020
-0.0754019944 -0.3054194925 0.0233611410
-0.0612766814 -0.3058318108 -0.0279245126
-0.0731851627 -0.3058307433 -0.0278664338
-0.0609989521 -0.3053748617 0.0290127227
-0.0729074333 -0.3053737942 0.0290708015
-0.0587821204 -0.3057861125 -0.0222148520
-0.0756239050 -0.3057846028 -0.0221327130
-0.0612208627 -0.3057399720 -0.0164811313
-0.0731293440 -0.3057389046 -0.0164230525
-0.0672424817 -0.3058502962 -0.0302653171
-0.0670205762 -0.3054851943 0.0152274855
-0.1053521828 -0.1744752102 -0.0002925924
-0.0872591980 -0.1744768321 -0.0003808337
-0.1144608726 0.3756432318 -0.0103926861
-0.0715226945 0.3757396143 0.0018866651
-0.1339764057 0.3756692585 -0.0072725720
-0.0323556319 0.3757262051 0.0004623281
-0.0096682821 0.3756975988 -0.0029592414
-0.0096898936 0.3756620413 -0.0073898192
-0.0324095428 0.3756375053 -0.0105899343
-0.1339500246 0.3757126633 -0.0018641971
-0.0715886369 0.3756311190 -0.0116321695
-0.1144049821 0.3757351886 0.0010654147
-0.0463446405 0.3134025024 0.1920933918
-0.0373780567 0.3134016987 0.1920496609
-0.0482623239 0.3102473315 -0.2010504692
-0.0392957401 0.3102465277 -0.2010942001
-0.1354053673 -0.2472081066 -0.4990188720
-0.1185131141 -0.2472096208 -0.4991012571
-0.1305332823 -0.2391920488 0.4998062108
-0.1136410291 -0.2391935631 0.4997238257
0.0625833090 -0.2165939517 0.0214883671
0.0811092721 -0.2165956124 0.0213980142
0.0623661474 -0.2169512485 -0.0230318953
0.0808921105 -0.2169529092 -0.0231222482
-0.1038485582 -0.2561465638 0.0003555255
-0.0887710710 -0.2561479153 0.0002819912
-0.1024474737 -0.1957149516 -0.1252538579
-0.1012269805 -0.1937068700 0.1249591851
0.0871108848 -0.3759481410 -0.0140440373
0.1373326525 -0.3757904312 0.0059224698
0.0006112922 -0.3759662087 -0.0168395151
-0.1370453096 -0.3757555832 0.0085381128
-0.0938898020 -0.3756960708 0.0162248536
-0.0940357184 -0.3759361475 -0.0136894320
-0.1371141855 -0.3758689050 -0.0055821197
0.0007834358 -0.3756829803 0.0184516036
0.1372762389 -0.3758832487 -0.0056428732
0.0872516419 -0.3757165528 0.0148125451
-0.0343674165 -0.3602538411 -0.0384714108
0.0319350152 -0.3596397972 0.0384551440
0.0005017616 -0.3595690840 0.0470681710
0.0499181489 -0.3600678192 -0.0147629086
-0.0499587271 -0.3600858270 -0.0176350858
-0.0497776599 -0.3597879165 0.0194854598
0.0500664449 -0.3598238273 0.0156392241
0.0000492218 -0.3603136492 -0.0457069082
-0.0339838244 -0.3596227158 0.0401687164
0.0315650034 -0.3602485788 -0.0374008897
-0.0422537951 -0.0685602724 0.0448928689
0.0742097128 -0.0690864090 -0.0199305553
0.0050514568 -0.0693751914 -0.0563477470
-0.0643584614 -0.0691057668 -0.0232143920
0.0492051397 -0.0685816347 0.0428065999
0.0487690727 -0.0692990971 -0.0465913992
0.0055847808 -0.0684977115 0.0529889035
0.0743844821 -0.0687988604 0.0158988775
-0.0427058630 -0.0693040613 -0.0477854820
-0.0641450692 -0.0687546719 0.0205330952
0.0476819452 -0.2449906958 -0.2016652989
0.0441838229 -0.2380810589 -0.2017036889
0.0429087888 -0.2311721471 -0.2017529169
0.0420343490 -0.2242627454 -0.2018041028
0.0417162612 -0.2144593949 -0.2018812279
0.0315245572 -0.2190030546 -0.2912600799
0.0418495003 -0.2202489813 -0.2018354136
0.0417990294 -0.1890616068 -0.2020854613
0.0314327022 -0.2005145741 -0.2914080109
0.0317006422 -0.1831448233 -0.2915487186
0.0265174786 -0.1888713069 -0.3362099934
0.0415310894 -0.2064313576 -0.2019447536
0.0518974166 -0.1949783904 -0.1126222040
0.0314327022 -0.2005145741 -0.2914080109
0.0421708742 -0.1649781038 -0.2022805569
0.0453789012 -0.1418190420 -0.2024820678
0.0350945916 -0.1479440100 -0.2918477773
0.0386327329 -0.1564610569 -0.2470641671
0.0366986051 -0.1363644791 -0.2919485328
0.0524551838 -0.1588531358 -0.1129148474
0.0540591973 -0.1472736050 -0.1130156029
0.0489170425 -0.1503360889 -0.1576984576
0.0350945916 -0.1479440100 -0.2918477773
0.0283484233 -0.1625860249 -0.3364298766
0.0315564503 -0.1394269631 -0.3366313875
0.0281833661 -0.1467479705 -0.3589224372
0.0318865646 -0.1711030718 -0.2916462664
0.0386327329 -0.1564610569 -0.2470641671
0.0283484233 -0.1625860249 -0.3364298766
0.0530325449 -0.1328675204 -0.2025912412
0.0437311149 -0.1550483550 -0.2918328889
0.0358747119 -0.1429791356 -0.3366239433
0.0390803999 -0.1661387723 -0.3364537127
0.0351521984 -0.1601041626 -0.3588492399
0.0405254269 -0.1318887183 -0.2920031195
0.0483818299 -0.1439579377 -0.2472120650
0.0358747119 -0.1429791356 -0.3366239433
0.0498268569 -0.1097078837 -0.2027614718
0.0623339749 -0.1106866858 -0.1133495936
0.0576832599 -0.1217771031 -0.1579704174
0.0607311309 -0.0991068675 -0.1134347089
0.0389225829 -0.1203089000 -0.2920882348
0.0459775639 -0.1265882102 -0.2473397380
0.0405254269 -0.1318887183 -0.2920031195
0.0577434433 -0.1823492746 -0.2022171049
0.0463527498 -0.1971590308 -0.2915077180
0.0403912174 -0.1871941102 -0.3362911273
0.0460865641 -0.1797892321 -0.2916458207
0.0574772575 -0.1649794759 -0.2023552076
0.0691341367 -0.1675395184 -0.1129264918
0.0459534712 -0.1711043327 -0.2917148721
0.0579789268 -0.2122224065 -0.2019785071
0.0463366678 -0.2178851592 -0.2913413023
0.0581127506 -0.2064328440 -0.2020256240
0.0576595820 -0.2231454486 -0.2018892867
0.0569393199 -0.2300541817 -0.2018303275
0.0556632726 -0.2369633906 -0.2017686534
0.0527843223 -0.2438714044 -0.2016991702
0.0476819452 -0.2449906958 -0.2016652989
0.0441838229 -0.2380810589 -0.2017036889
0.0429087888 -0.2311721471 -0.2017529169
0.0420343490 -0.2242627454 -0.2018041028
0.0417162612 -0.2144593949 -0.2018812279
0.0518560325 -0.2076772844 -0.1125200873
0.0415310894 -0.2064313576 -0.2019447536
0.0417990294 -0.1890616068 -0.2020854613
0.0522692614 -0.1708948873 -0.1128172996
0.0518974166 -0.1949783904 -0.1126222040
0.0571325326 -0.1858950306 -0.0679881231
0.0470341454 -0.1799782471 -0.1574513804
0.0571325326 -0.1858950306 -0.0679881231
0.0599360130 -0.1693115993 -0.0457686305
0.0575043774 -0.1618115276 -0.0681832188
0.0421708742 -0.1649781038 -0.2022805569
0.0317006422 -0.1831448233 -0.2915487186
0.0369357582 -0.1740614635 -0.2469146377
0.0318865646 -0.1711030718 -0.2916462664
0.0522692614 -0.1708948873 -0.1128172996
0.0524551838 -0.1588531358 -0.1129148474
0.0470341454 -0.1799782471 -0.1574513804
0.0498268569 -0.1097078837 -0.2027614718
0.0453789012 -0.1418190420 -0.2024820678
0.0562831752 -0.1312180258 -0.1131553049
0.0530550160 -0.1204629548 -0.1579583883
0.0540591973 -0.1472736050 -0.1130156029
0.0389225829 -0.1203089000 -0.2920882348
0.0366986051 -0.1363644791 -0.2919485328
0.0421507421 -0.1310639710 -0.2472851513
0.0562831752 -0.1312180258 -0.1131553049
0.0639592900 -0.1098619385 -0.0686316254
0.0595113343 -0.1419730968 -0.0683522214
0.0671874491 -0.1206170095 -0.0238285419
0.0607311309 -0.0991068675 -0.1134347089
0.0530550160 -0.1204629548 -0.1579583883
0.0639592900 -0.1098619385 -0.0686316254
0.0530325449 -0.1328675204 -0.2025912412
0.0623339749 -0.1106866858 -0.1133495936
0.0714294025 -0.1317082240 -0.0684927362
0.0669846899 -0.0995962685 -0.0687287697
0.0760801175 -0.1206178067 -0.0238719123
0.0667786875 -0.1427986413 -0.1131135600
0.0576832599 -0.1217771031 -0.1579704174
0.0714294025 -0.1317082240 -0.0684927362
0.0574772575 -0.1649794759 -0.2023552076
0.0437311149 -0.1550483550 -0.2918328889
0.0483818299 -0.1439579377 -0.2472120650
0.0459534712 -0.1711043327 -0.2917148721
0.0667786875 -0.1427986413 -0.1131135600
0.0690010438 -0.1588546190 -0.1129955432
0.0621279725 -0.1538890586 -0.1577343838
0.0577434433 -0.1823492746 -0.2022171049
0.0691341367 -0.1675395184 -0.1129264918
0.0751987907 -0.1842182097 -0.0680897043
0.0748294834 -0.1601346403 -0.0682811853
0.0778618104 -0.1684739859 -0.0458627915
0.0695034440 -0.1916230878 -0.1127350109
0.0634387900 -0.1749443965 -0.1575717984
0.0751987907 -0.1842182097 -0.0680897043
0.0581127506 -0.2064328440 -0.2020256240
0.0463527498 -0.1971590308 -0.2915077180
0.0520480966 -0.1897541527 -0.2468624115
0.0465374035 -0.2092008155 -0.2914119775
0.0695034440 -0.1916230878 -0.1127350109
0.0696880977 -0.2036648725 -0.1126392704
0.0638080973 -0.1990279659 -0.1573803174
0.0579789268 -0.2122224065 -0.2019785071
0.0696211857 -0.2065596538 -0.1126157120
0.0577932596 -0.2202504105 -0.2019131729
0.0576595820 -0.2231454486 -0.2018892867
0.0569393199 -0.2300541817 -0.2018303275
0.0556632726 -0.2369633906 -0.2017686534
0.0527843223 -0.2438714044 -0.2016991702
0.0496445288 -0.2417616505 0.2006835238
0.0461464065 -0.2348520137 0.2006451338
0.0448713724 -0.2279431018 0.2005959058
0.0439969326 -0.2210337001 0.2005447198
0.0436788447 -0.2112303497 0.2004675947
0.0343598517 -0.2143381351 0.2900030228
0.0438120838 -0.2170199361 0.2005134090
0.0437616130 -0.1858325616 0.2002633614
0.0342679967 -0.1958496546 0.2898550918
0.0345359368 -0.1784799038 0.2897143842
0.0297891286 -0.1834884503 0.3345102494
0.0434936730 -0.2032023124 0.2004040690
0.0529872893 -0.1931852193 0.1108123386
0.0342679967 -0.1958496546 0.2898550918
0.0441334578 -0.1617490585 0.2000682657
0.0473414848 -0.1385899968 0.1998667548
0.0379298861 -0.1432790905 0.2894153254
0.0410316719 -0.1525140745 0.2447417956
0.0395338996 -0.1316995596 0.2893145700
0.0535450564 -0.1570599648 0.1105196951
0.0551490699 -0.1454804339 0.1104189397
0.0504432706 -0.1478249808 0.1551932250
0.0379298861 -0.1432790905 0.2894153254
0.0316200733 -0.1572031683 0.3342903662
0.0348281003 -0.1340441065 0.3340888553
0.0316731939 -0.1410061454 0.3565263757
0.0347218591 -0.1664381523 0.2896168364
0.0410316719 -0.1525140745 0.2447417956
0.0316200733 -0.1572031683 0.3342903662
0.0549951285 -0.1296384751 0.1997575814
0.0465664094 -0.1503834355 0.2894302139
0.0391463620 -0.1375962790 0.3340962995
0.0423520499 -0.1607559157 0.3342665301
0.0386420262 -0.1543623374 0.3565995729
0.0433607215 -0.1272237988 0.2892599833
0.0507807690 -0.1400109553 0.2445938977
0.0391463620 -0.1375962790 0.3340962995
0.0517894405 -0.1064788385 0.1995873508
0.0634238475 -0.1088935148 0.1100849490
0.0592094880 -0.1192659950 0.1549212652
0.0618210035 -0.0973136964 0.1099998337
0.0417578775 -0.1156439805 0.2891748680
0.0483765030 -0.1226412278 0.2444662247
0.0433607215 -0.1272237988 0.2892599833
0.0597060268 -0.1791202293 0.2001317177
0.0491880444 -0.1924941113 0.2897553847
0.0436628674 -0.1818112536 0.3344291155
0.0489218586 -0.1751243126 0.2896172820
0.0594398411 -0.1617504306 0.1999936150
0.0702240093 -0.1657463473 0.1105080507
0.0487887658 -0.1664394132 0.2895482307
0.0599415103 -0.2089933612 0.2003703155
0.0491719623 -0.2132202397 0.2899218004
0.0600753341 -0.2032037988 0.2003231987
0.0596221656 -0.2199164034 0.2004595359
0.0589019035 -0.2268251364 0.2005184952
0.0576258562 -0.2337343453 0.2005801693
0.0547469059 -0.2406423591 0.2006496524
0.0496445288 -0.2417616505 0.2006835238
0.0461464065 -0.2348520137 0.2006451338
0.0448713724 -0.2279431018 0.2005959058
0.0439969326 -0.2210337001 0.2005447198
0.0436788447 -0.2112303497 0.2004675947
0.0529459051 -0.2058841134 0.1109144552
0.0434936730 -0.2032023124 0.2004040690
0.0437616130 -0.1858325616 0.2002633614
0.0533591340 -0.1691017163 0.1106172429
0.0529872893 -0.1931852193 0.1108123386
0.0577860498 -0.1848197967 0.0659892793
0.0485603735 -0.1774671389 0.1554403021
0.0577860498 -0.1848197967 0.0659892793
0.0603713524 -0.1685953339 0.0434802019
0.0581578945 -0.1607362937 0.0657941837
0.0441334578 -0.1617490585 0.2000682657
0.0345359368 -0.1784799038 0.2897143842
0.0393346973 -0.1701144812 0.2448913249
0.0347218591 -0.1664381523 0.2896168364
0.0533591340 -0.1691017163 0.1106172429
0.0535450564 -0.1570599648 0.1105196951
0.0485603735 -0.1774671389 0.1554403021
0.0517894405 -0.1064788385 0.1995873508
0.0473414848 -0.1385899968 0.1998667548
0.0573730478 -0.1294248548 0.1102792377
0.0545812441 -0.1179518466 0.1549332942
0.0551490699 -0.1454804339 0.1104189397
0.0417578775 -0.1156439805 0.2891748680
0.0395338996 -0.1316995596 0.2893145700
0.0445496811 -0.1271169886 0.2445208114
0.0573730478 -0.1294248548 0.1102792377
0.0646128072 -0.1087867046 0.0653457771
0.0601648514 -0.1408978629 0.0656251811
0.0674046108 -0.1202597128 0.0206917205
0.0618210035 -0.0973136964 0.1099998337
0.0545812441 -0.1179518466 0.1549332942
0.0646128072 -0.1087867046 0.0653457771
0.0549951285 -0.1296384751 0.1997575814
0.0634238475 -0.1088935148 0.1100849490
0.0720829196 -0.1306329901 0.0654846663
0.0676382070 -0.0985210346 0.0652486327
0.0762972792 -0.1202605099 0.0206483501
0.0678685601 -0.1410054702 0.1103209826
0.0592094880 -0.1192659950 0.1549212652
0.0720829196 -0.1306329901 0.0654846663
0.0594398411 -0.1617504306 0.1999936150
0.0465664094 -0.1503834355 0.2894302139
0.0507807690 -0.1400109553 0.2445938977
0.0487887658 -0.1664394132 0.2895482307
0.0678685601 -0.1410054702 0.1103209826
0.0700909164 -0.1570614480 0.1104389994
0.0636542006 -0.1513779504 0.1551572988
0.0597060268 -0.1791202293 0.2001317177
0.0702240093 -0.1657463473 0.1105080507
0.0758523078 -0.1831429758 0.0658876982
0.0754830005 -0.1590594063 0.0656962172
0.0782971498 -0.1677577206 0.0433860409
0.0705933166 -0.1898299168 0.1106995317
0.0649650181 -0.1724332883 0.1553198842
0.0758523078 -0.1831429758 0.0658876982
0.0600753341 -0.2032037988 0.2003231987
0.0491880444 -0.1924941113 0.2897553847
0.0544470356 -0.1858071703 0.2449435512
0.0493726980 -0.2045358960 0.2898511252
0.0705933166 -0.1898299168 0.1106995317
0.0707779703 -0.2018717015 0.1107952721
0.0653343254 -0.1965168578 0.1555113652
0.0599415103 -0.2089933612 0.2003703155
0.0707110584 -0.2047664828 0.1108188306
0.0597558432 -0.2170213653 0.2004356498
0.0596221656 -0.2199164034 0.2004595359
0.0589019035 -0.2268251364 0.2005184952
0.0576258562 -0.2337343453 0.2005801693
0.0547469059 -0.2406423591 0.2006496524
-0.1143381920 -0.2708244625 -0.2492038058
-0.1233519682 -0.2699957418 -0.3740306368
-0.1116356794 -0.2744846537 -0.2491876134
-0.1180288413 -0.2630805166 -0.2492479525
-0.1194578676 -0.2553372992 -0.2493031250
-0.1203806309 -0.2475936015 -0.2493607709
-0.1207375409 -0.2361905313 -0.2494505452
-0.1280714541 -0.2416993189 -0.3742347086
-0.1205691562 -0.2435104443 -0.2493926206
-0.1205861910 -0.2060645706 -0.2496930589
-0.1281641638 -0.2193164256 -0.3744138900
-0.1278250206 -0.1973578139 -0.3745917728
-0.1316140071 -0.2039837414 -0.4369521883
-0.1243751774 -0.2126904981 -0.3120534744
-0.1316140071 -0.2039837414 -0.4369521883
-0.1336780719 -0.2182760111 -0.4680434547
-0.1319531503 -0.2259423532 -0.4367743055
-0.1209253342 -0.2280231823 -0.2495151761
-0.1133473613 -0.2147713273 -0.1247943451
-0.1171363477 -0.2213972548 -0.1871547606
-0.1135169329 -0.2257506331 -0.1247054036
-0.1281641638 -0.2193164256 -0.3744138900
-0.1283337354 -0.2302957315 -0.3743249486
-0.1243751774 -0.2126904981 -0.3120534744
-0.1161527547 -0.1522844315 -0.2501462962
-0.1256083025 -0.1704677444 -0.3748183914
-0.1215530407 -0.1411890422 -0.3750731481
-0.1262808146 -0.1502806986 -0.4374091957
-0.1208805286 -0.1613760880 -0.3124823438
-0.1262808146 -0.1502806986 -0.4374091957
-0.1306723325 -0.1694658779 -0.4684498412
-0.1303360764 -0.1795594008 -0.4371544391
-0.1202080165 -0.1815631337 -0.2498915396
-0.1107524687 -0.1633798209 -0.1252194443
-0.1154802426 -0.1724714773 -0.1875554919
-0.1127800996 -0.1780191720 -0.1250920660
-0.1256083025 -0.1704677444 -0.3748183914
-0.1276359334 -0.1851070955 -0.3746910131
-0.1208805286 -0.1613760880 -0.3124823438
-0.1075750284 -0.1488954632 -0.2502153349
-0.1132113471 -0.1687739870 -0.3748924547
-0.1200823369 -0.1494338199 -0.4374462274
-0.1160295064 -0.1787132489 -0.4372310147
-0.1194650013 -0.1690431654 -0.4685079010
-0.1172641775 -0.1394945580 -0.3751076675
-0.1103931877 -0.1588347251 -0.3125538948
-0.1200823369 -0.1494338199 -0.4374462274
-0.1116278588 -0.1196160342 -0.2504305476
-0.1019387097 -0.1290169394 -0.1255382151
-0.1047568690 -0.1389562013 -0.1878767750
-0.1039651249 -0.1143772249 -0.1256458214
-0.1172641775 -0.1394945580 -0.3751076675
-0.1192905928 -0.1248548435 -0.3752152738
-0.1144460182 -0.1295552961 -0.3127691075
-0.1027170321 -0.2035233437 -0.2498006160
-0.1104459492 -0.2180465996 -0.3745105071
-0.1146468075 -0.2033495552 -0.4370400409
-0.1143104077 -0.2253082275 -0.4368654527
-0.1164108369 -0.2179597053 -0.4681302196
-0.1107823489 -0.1960879273 -0.3746850953
-0.1065814907 -0.2107849717 -0.3121555616
-0.1146468075 -0.2033495552 -0.4370400409
-0.1030534319 -0.1815646714 -0.2499752041
-0.0949881151 -0.1890000879 -0.1250907248
-0.0988525736 -0.1962617158 -0.1874456704
-0.0951563149 -0.1780207518 -0.1251780189
-0.1107823489 -0.1960879273 -0.3746850953
-0.1109505488 -0.1851085911 -0.3747723893
-0.1069178904 -0.1888262994 -0.3123301497
-0.1025104562 -0.2353447309 -0.2495462415
-0.1105117852 -0.2412771758 -0.3743237493
-0.1023413322 -0.2280248482 -0.2496058121
-0.1028680135 -0.2471719799 -0.2494495780
-0.1037332045 -0.2549144659 -0.2493832205
-0.1051630129 -0.2626579528 -0.2493141009
-0.1086199757 -0.2704012579 -0.2492350947
-0.1177903475 -0.2734443307 -0.3740300887
-0.1059170934 -0.2667415513 -0.2492776498
-0.1143381920 -0.2708244625 -0.2492038058
-0.1053244157 -0.2716531831 -0.1243769749
-0.1173534832 -0.2667405261 -0.2492218734
-0.1180288413 -0.2630805166 -0.2492479525
-0.1101850316 -0.2636972738 -0.1244171158
-0.1187825095 -0.2589967830 -0.2492770502
-0.1194578676 -0.2553372992 -0.2493031250
-0.1116532129 -0.2557419315 -0.1244737998
-0.1202115357 -0.2512535656 -0.2493322227
-0.1203806309 -0.2475936015 -0.2493607709
-0.1130567880 -0.2437031917 -0.1245635701
-0.1205691562 -0.2435104443 -0.2493926206
-0.1207375409 -0.2361905313 -0.2494505452
-0.1134230363 -0.2298343076 -0.1246730882
-0.1132352430 -0.2380016566 -0.1246084572
-0.1095779907 -0.2348235448 -0.0622197288
-0.1209253342 -0.2280231823 -0.2495151761
-0.1282398388 -0.2343794060 -0.3742926331
-0.1134230363 -0.2298343076 -0.1246730882
-0.1205861910 -0.2060645706 -0.2496930589
-0.1129691869 -0.1902698904 -0.1249928257
-0.1133473613 -0.2147713273 -0.1247943451
-0.1095388593 -0.2068739872 -0.0624442284
-0.1167776889 -0.1981672305 -0.1873429423
-0.1095388593 -0.2068739872 -0.0624442284
-0.1074455210 -0.1906745987 -0.0313684104
-0.1091606848 -0.1823725503 -0.0626427091
-0.1202080165 -0.1815631337 -0.2498915396
-0.1278250206 -0.1973578139 -0.3745917728
-0.1240165186 -0.1894604738 -0.3122416562
-0.1276359334 -0.1851070955 -0.3746910131
-0.1129691869 -0.1902698904 -0.1249928257
-0.1127800996 -0.1780191720 -0.1250920660
-0.1167776889 -0.1981672305 -0.1873429423
-0.1161527547 -0.1522844315 -0.2501462962
-0.1062275729 -0.1307114236 -0.1255036957
-0.1107524687 -0.1633798209 -0.1252194443
-0.1057898778 -0.1525933169 -0.0628981441
-0.1060087253 -0.1416523702 -0.0942009199
-0.1080523258 -0.1689275155 -0.0627560184
-0.1111901638 -0.1414979275 -0.1878249960
-0.1134526117 -0.1578321262 -0.1876828703
-0.1109713163 -0.1524388742 -0.1565222202
-0.1057898778 -0.1525933169 -0.0628981441
-0.1010461344 -0.1308658662 -0.0318796197
-0.1055710303 -0.1635342635 -0.0315953683
-0.1008272869 -0.1418068129 -0.0005768439
-0.1012649819 -0.1199249196 -0.0631823955
-0.1060087253 -0.1416523702 -0.0942009199
-0.1010461344 -0.1308658662 -0.0318796197
-0.1116278588 -0.1196160342 -0.2504305476
-0.1215530407 -0.1411890422 -0.3750731481
-0.1165904498 -0.1304025382 -0.3127518479
-0.1188528977 -0.1467367369 -0.3126097222
-0.1163716022 -0.1413434849 -0.2814490720
-0.1192905928 -0.1248548435 -0.3752152738
-0.1242531837 -0.1356413475 -0.4375365741
-0.1165904498 -0.1304025382 -0.3127518479
-0.1062275729 -0.1307114236 -0.1255036957
-0.1039651249 -0.1143772249 -0.1256458214
-0.1089277158 -0.1251637289 -0.1879671217
-0.1012649819 -0.1199249196 -0.0631823955
-0.1111901638 -0.1414979275 -0.1878249960
-0.1089277158 -0.1251637289 -0.1879671217
-0.1114090113 -0.1305569809 -0.2191277718
-0.1075750284 -0.1488954632 -0.2502153349
-0.1019387097 -0.1290169394 -0.1255382151
-0.0945989538 -0.1517468857 -0.0629595244
-0.0991205503 -0.1190776775 -0.0631996552
-0.0954506724 -0.1304426506 -0.0319103098
-0.0982688318 -0.1403819126 -0.0942488697
-0.0954506724 -0.1304426506 -0.0319103098
-0.0917807945 -0.1418076238 -0.0006209645
-0.0909290759 -0.1631118589 -0.0316701790
-0.0974171132 -0.1616861476 -0.1252980843
-0.1047568690 -0.1389562013 -0.1878767750
-0.1010869911 -0.1503211745 -0.1565874297
-0.1024960708 -0.1552908054 -0.1877567096
-0.0945989538 -0.1517468857 -0.0629595244
-0.0923381556 -0.1680814898 -0.0628394590
-0.0982688318 -0.1403819126 -0.0942488697
-0.1030534319 -0.1815646714 -0.2499752041
-0.1132113471 -0.1687739870 -0.3748924547
-0.1103931877 -0.1588347251 -0.3125538948
-0.1067233098 -0.1701996983 -0.2812645495
-0.1081323895 -0.1751693292 -0.3124338294
-0.1109505488 -0.1851085911 -0.3747723893
-0.1160295064 -0.1787132489 -0.4372310147
-0.1081323895 -0.1751693292 -0.3124338294
-0.0974171132 -0.1616861476 -0.1252980843
-0.0951563149 -0.1780207518 -0.1251780189
-0.1002352725 -0.1716254095 -0.1876366442
-0.0923381556 -0.1680814898 -0.0628394590
-0.1002352725 -0.1716254095 -0.1876366442
-0.1039051504 -0.1602604364 -0.2189259896
-0.1024960708 -0.1552908054 -0.1877567096
-0.1027170321 -0.2035233437 -0.2498006160
-0.0949881151 -0.1890000879 -0.1250907248
-0.0907479566 -0.2062399644 -0.0625409753
-0.0911236565 -0.1817384600 -0.0627357793
-0.0890035773 -0.1903583982 -0.0314609045
-0.0946124152 -0.2135015924 -0.1248959209
-0.0988525736 -0.1962617158 -0.1874456704
-0.0907479566 -0.2062399644 -0.0625409753
-0.1023413322 -0.2280248482 -0.2496058121
-0.1104459492 -0.2180465996 -0.3745105071
-0.1065814907 -0.2107849717 -0.3121555616
-0.1102580992 -0.2302973518 -0.3744131052
-0.0946124152 -0.2135015924 -0.1248959209
-0.0944245652 -0.2257523446 -0.1247985190
-0.0984768737 -0.2207632203 -0.1872508665
-0.1025104562 -0.2353447309 -0.2495462415
-0.0945091272 -0.2294122859 -0.1247687337
-0.0906970808 -0.2346133787 -0.0623135130
-0.0946977453 -0.2375796012 -0.1247022669
-0.1026990743 -0.2435120461 -0.2494797748
-0.1105117852 -0.2412771758 -0.3743237493
-0.0946977453 -0.2375796012 -0.1247022669
-0.1028680135 -0.2471719799 -0.2494495780
-0.0948765240 -0.2434932257 -0.1246539352
-0.1030569511 -0.2512551033 -0.2494158873
-0.1037332045 -0.2549144659 -0.2493832205
-0.0954980572 -0.2514475921 -0.1245870658
-0.1044872851 -0.2589980644 -0.2493467694
-0.1051630129 -0.2626579528 -0.2493141009
-0.0969670419 -0.2594029340 -0.1245160549
-0.1059170934 -0.2667415513 -0.2492776498
-0.1086199757 -0.2704012579 -0.2492350947
-0.0994496039 -0.2673581851 -0.1244401006
-0.1116356794 -0.2744846537 -0.2491876134
-0.1119021494 -0.2668164336 0.2502087356
-0.1196979044 -0.2639836985 0.3750881753
-0.1091996368 -0.2704766248 0.2502249280
-0.1155927988 -0.2590724878 0.2501645889
-0.1170218251 -0.2513292704 0.2501094164
-0.1179445884 -0.2435855727 0.2500517705
-0.1183014983 -0.2321825024 0.2499619962
-0.1244173903 -0.2356872756 0.3748841035
-0.1181331137 -0.2395024154 0.2500199207
-0.1181501484 -0.2020565417 0.2497194825
-0.1245101000 -0.2133043823 0.3747049221
-0.1241709568 -0.1913457706 0.3745270393
-0.1273509326 -0.1969696909 0.4370197591
-0.1213301242 -0.2076804620 0.3122122023
-0.1273509326 -0.1969696909 0.4370197591
-0.1291104921 -0.2107609569 0.4683550605
-0.1276900758 -0.2189283026 0.4371976420
-0.1184892916 -0.2240151534 0.2498973653
-0.1121293401 -0.2127673128 0.1249119256
-0.1153093158 -0.2183912331 0.1874046455
-0.1122989116 -0.2237466187 0.1250008671
-0.1245101000 -0.2133043823 0.3747049221
-0.1246796716 -0.2242836882 0.3747938635
-0.1213301242 -0.2076804620 0.3122122023
-0.1137167122 -0.1482764027 0.2492662452
-0.1219542387 -0.1644557011 0.3743004206
-0.1178989769 -0.1351769989 0.3740456640
-0.1220177401 -0.1432666481 0.4365627517
-0.1178354754 -0.1563660519 0.3117833329
-0.1220177401 -0.1432666481 0.4365627517
-0.1261047527 -0.1619508238 0.4679486739
-0.1260730020 -0.1725453503 0.4368175084
-0.1177719740 -0.1775551048 0.2495210018
-0.1095344475 -0.1613758064 0.1244868264
-0.1136532107 -0.1694654556 0.1870039141
-0.1115620784 -0.1760151575 0.1246142047
-0.1219542387 -0.1644557011 0.3743004206
-0.1239818696 -0.1790950522 0.3744277990
-0.1178354754 -0.1563660519 0.3117833329
-0.1051389858 -0.1448874343 0.2491972065
-0.1095572832 -0.1627619437 0.3742263574
-0.1158192624 -0.1424197694 0.4365257201
-0.1117664320 -0.1716991984 0.4367409328
-0.1148974215 -0.1615281113 0.4678906141
-0.1136101137 -0.1334825147 0.3740111446
-0.1073481345 -0.1538246890 0.3117117819
-0.1158192624 -0.1424197694 0.4365257201
-0.1091918163 -0.1156080053 0.2489819938
-0.1007206884 -0.1270129250 0.1241680556
-0.1029298371 -0.1359501796 0.1866826310
-0.1027471036 -0.1123732105 0.1240604492
-0.1136101137 -0.1334825147 0.3740111446
-0.1156365289 -0.1188428002 0.3739035383
-0.1114009650 -0.1245452600 0.3114965692
-0.1002809896 -0.1995153149 0.2496119254
-0.1067918854 -0.2120345563 0.3746083050
-0.1103837330 -0.1963355047 0.4369319066
-0.1100473333 -0.2182941770 0.4371064947
-0.1118432571 -0.2104446512 0.4682682956
-0.1071282851 -0.1900758840 0.3744337168
-0.1035364375 -0.2057749356 0.3121101152
-0.1103837330 -0.1963355047 0.4369319066
-0.1006173893 -0.1775566426 0.2494373373
-0.0937700938 -0.1869960735 0.1246155459
-0.0970255417 -0.1932556942 0.1871137356
-0.0939382937 -0.1760167373 0.1245282518
-0.1071282851 -0.1900758840 0.3744337168
-0.1072964850 -0.1790965478 0.3743464227
-0.1038728372 -0.1838162633 0.3119355270
-0.1000744136 -0.2313367020 0.2498662999
-0.1068577213 -0.2352651325 0.3747950628
-0.0999052897 -0.2240168193 0.2498067293
-0.1004319709 -0.2431639510 0.2499629634
-0.1012971620 -0.2509064371 0.2500293209
-0.1027269703 -0.2586499239 0.2500984405
-0.1061839331 -0.2663932290 0.2501774467
-0.1141362837 -0.2674322874 0.3750887234
-0.1034810509 -0.2627335224 0.2501348916
-0.1119021494 -0.2668164336 0.2502087356
-0.1041063944 -0.2696491687 0.1253292958
-0.1149174407 -0.2627324972 0.2501906680
-0.1155927988 -0.2590724878 0.2501645889
-0.1089670104 -0.2616932594 0.1252891549
-0.1163464669 -0.2549887541 0.2501354912
-0.1170218251 -0.2513292704 0.2501094164
-0.1104351917 -0.2537379171 0.1252324709
-0.1177754932 -0.2472455367 0.2500803187
-0.1179445884 -0.2435855727 0.2500517705
-0.1118387667 -0.2416991773 0.1251427006
-0.1181331137 -0.2395024154 0.2500199207
-0.1183014983 -0.2321825024 0.2499619962
-0.1122050150 -0.2278302932 0.1250331825
-0.1120172217 -0.2359976422 0.1250978135
-0.1089689800 -0.2338215376 0.0626334066
-0.1184892916 -0.2240151534 0.2498973653
-0.1245857750 -0.2283673627 0.3748261790
-0.1122050150 -0.2278302932 0.1250331825
-0.1181501484 -0.2020565417 0.2497194825
-0.1117511656 -0.1882658760 0.1247134450
-0.1121293401 -0.2127673128 0.1249119256
-0.1089298486 -0.2058719800 0.0624089069
-0.1149506570 -0.1951612088 0.1872164637
-0.1089298486 -0.2058719800 0.0624089069
-0.1071410157 -0.1901735951 0.0310581572
-0.1085516742 -0.1813705431 0.0622104263
-0.1177719740 -0.1775551048 0.2495210018
-0.1241709568 -0.1913457706 0.3745270393
-0.1209714654 -0.1844504377 0.3120240206
-0.1239818696 -0.1790950522 0.3744277990
-0.1117511656 -0.1882658760 0.1247134450
-0.1115620784 -0.1760151575 0.1246142047
-0.1149506570 -0.1951612088 0.1872164637
-0.1137167122 -0.1482764027 0.2492662452
-0.1050095516 -0.1287074091 0.1242025750
-0.1095344475 -0.1613758064 0.1244868264
-0.1051808672 -0.1515913097 0.0619549913
-0.1050952094 -0.1401493594 0.0930787831
-0.1074433151 -0.1679255083 0.0620971170
-0.1093631319 -0.1384919059 0.1867344101
-0.1116255798 -0.1548261045 0.1868765358
-0.1094487897 -0.1499338562 0.1556106182
-0.1051808672 -0.1515913097 0.0619549913
-0.1007416291 -0.1303648626 0.0305469480
-0.1052665250 -0.1630332599 0.0308311994
-0.1008272869 -0.1418068129 -0.0005768439
-0.1006559713 -0.1189229123 0.0616707398
-0.1050952094 -0.1401493594 0.0930787831
-0.1007416291 -0.1303648626 0.0305469480
-0.1091918163 -0.1156080053 0.2489819938
-0.1178989769 -0.1351769989 0.3740456640
-0.1135453966 -0.1253925021 0.3115138289
-0.1158078445 -0.1417267008 0.3116559546
-0.1136310544 -0.1368344524 0.2803900370
-0.1156365289 -0.1188428002 0.3739035383
-0.1199901092 -0.1286272970 0.4364353734
-0.1135453966 -0.1253925021 0.3115138289
-0.1050095516 -0.1287074091 0.1242025750
-0.1027471036 -0.1123732105 0.1240604492
-0.1071006839 -0.1221577072 0.1865922844
-0.1006559713 -0.1189229123 0.0616707398
-0.1093631319 -0.1384919059 0.1867344101
-0.1071006839 -0.1221577072 0.1865922844
-0.1092774741 -0.1270499556 0.2178582019
-0.1051389858 -0.1448874343 0.2491972065
-0.1007206884 -0.1270129250 0.1241680556
-0.0939899432 -0.1507448785 0.0618936110
-0.0985115397 -0.1180756703 0.0616534802
-0.0951461671 -0.1299416470 0.0305162578
-0.0973553158 -0.1388789017 0.0930308333
-0.0951461671 -0.1299416470 0.0305162578
-0.0917807945 -0.1418076238 -0.0006209645
-0.0906245706 -0.1626108553 0.0307563886
-0.0961990919 -0.1596821332 0.1244081864
-0.1029298371 -0.1359501796 0.1866826310
-0.0995644645 -0.1478161564 0.1555454087
-0.1006690389 -0.1522847838 0.1868026964
-0.0939899432 -0.1507448785 0.0618936110
-0.0917291450 -0.1670794826 0.0620136764
-0.0973553158 -0.1388789017 0.0930308333
-0.1006173893 -0.1775566426 0.2494373373
-0.1095572832 -0.1627619437 0.3742263574
-0.1073481345 -0.1538246890 0.3117117819
-0.1039827619 -0.1656906658 0.2805745596
-0.1050873363 -0.1701592931 0.3118318473
-0.1072964850 -0.1790965478 0.3743464227
-0.1117664320 -0.1716991984 0.4367409328
-0.1050873363 -0.1701592931 0.3118318473
-0.0961990919 -0.1596821332 0.1244081864
-0.0939382937 -0.1760167373 0.1245282518
-0.0984082406 -0.1686193879 0.1869227618
-0.0917291450 -0.1670794826 0.0620136764
-0.0984082406 -0.1686193879 0.1869227618
-0.1017736132 -0.1567534111 0.2180599842
-0.1006690389 -0.1522847838 0.1868026964
-0.1002809896 -0.1995153149 0.2496119254
-0.0937700938 -0.1869960735 0.1246155459
-0.0901389460 -0.2052379572 0.0623121600
-0.0905146459 -0.1807364528 0.0621173561
-0.0886990720 -0.1898573946 0.0309656632
-0.0933943939 -0.2114975779 0.1248103498
-0.0970255417 -0.1932556942 0.1871137356
-0.0901389460 -0.2052379572 0.0623121600
-0.0999052897 -0.2240168193 0.2498067293
-0.1067918854 -0.2120345563 0.3746083050
-0.1035364375 -0.2057749356 0.3121101152
-0.1066040354 -0.2242853085 0.3747057069
-0.0933943939 -0.2114975779 0.1248103498
-0.0932065439 -0.2237483301 0.1249077517
-0.0966498418 -0.2177571986 0.1873085396
-0.1000744136 -0.2313367020 0.2498662999
-0.0932911059 -0.2274082715 0.1249375370
-0.0900880702 -0.2336113715 0.0625396223
-0.0934797241 -0.2355755867 0.1250040037
-0.1002630318 -0.2395040173 0.2499327666
-0.1068577213 -0.2352651325 0.3747950628
-0.0934797241 -0.2355755867 0.1250040037
-0.1004319709 -0.2431639510 0.2499629634
-0.0936585027 -0.2414892113 0.1250523355
-0.1006209086 -0.2472470745 0.2499966541
-0.1012971620 -0.2509064371 0.2500293209
-0.0942800359 -0.2494435777 0.1251192049
-0.1020512426 -0.2549900356 0.2500657720
-0.1027269703 -0.2586499239 0.2500984405
-0.0957490206 -0.2573989196 0.1251902158
-0.1034810509 -0.2627335224 0.2501348916
-0.1061839331 -0.2663932290 0.2501774467
-0.0982315826 -0.2653541707 0.1252661701
-0.1091996368 -0.2704766248 0.2502249280
-0.0381417500 0.2813435169 -0.1025732341
-0.0432020370 0.2957954242 -0.1518118516
-0.0383295174 0.2692013562 -0.1024748714
-0.0355849329 0.3178870524 -0.1028789854
-0.0396811649 0.3302565610 -0.1521055932
-0.0378273964 0.3016976833 -0.1027381195
-0.0295854537 0.3288358705 -0.1029961194
-0.0344405969 0.3195411991 -0.1520451597
-0.0318262821 0.3450256415 -0.1031151198
-0.0258290180 0.3016966077 -0.1027966368
-0.0256430026 0.2895544135 -0.1027000971
-0.0323763636 0.2938293735 -0.1518488788
-0.0381731972 0.2624166106 -0.1024211830
-0.0381417500 0.2813435169 -0.1025732341
-0.0330814630 0.2668916096 -0.0533346165
-0.0302369659 0.2800198224 -0.0288801932
-0.0327671094 0.2872457760 -0.0534995020
-0.0378273964 0.3016976833 -0.1027381195
-0.0432020370 0.2957954242 -0.1518118516
-0.0327671094 0.2872457760 -0.0534995020
-0.0355849329 0.3178870524 -0.1028789854
-0.0277300500 0.3326561329 -0.0538885121
-0.0314887009 0.3055175437 -0.0536523777
-0.0275612595 0.3129020840 -0.0291571410
-0.0318262821 0.3450256415 -0.1031151198
-0.0396811649 0.3302565610 -0.1521055932
-0.0277300500 0.3326561329 -0.0538885121
-0.0295854537 0.3288358705 -0.1029961194
-0.0209738748 0.3109912792 -0.0537475964
-0.0247303104 0.3381305420 -0.0539470790
-0.0204245210 0.3292082463 -0.0293228176
-0.0258290180 0.3016966077 -0.1027966368
-0.0344405969 0.3195411991 -0.1520451597
-0.0209738748 0.3109912792 -0.0537475964
-0.0253307047 0.2692001910 -0.1025382679
-0.0256430026 0.2895544135 -0.1027000971
-0.0188465003 0.2811734394 -0.0535186707
-0.0321272070 0.2775811651 -0.1517196943
-0.0188465003 0.2811734394 -0.0535186707
-0.0152921002 0.2668058410 -0.0288470429
-0.0185342024 0.2608192168 -0.0533568415
-0.0255814917 0.2583680894 -0.1024501117
-0.0371829083 0.2829211024 0.0939986964
-0.0417637744 0.2981618024 0.1430460441
-0.0373706757 0.2707789416 0.0940970591
-0.0346260912 0.3194646378 0.0936929451
-0.0382429023 0.3326229392 0.1427523025
-0.0368685547 0.3032752688 0.0938338109
-0.0286266119 0.3304134560 0.0935758111
-0.0330023343 0.3219075773 0.1428127360
-0.0308674403 0.3466032270 0.0934568107
-0.0248701763 0.3032741932 0.0937752937
-0.0246841608 0.2911319990 0.0938718334
-0.0309381010 0.2961957517 0.1430090170
-0.0372143555 0.2639941961 0.0941507474
-0.0371829083 0.2829211024 0.0939986964
-0.0326020422 0.2676804024 0.0449513487
-0.0299972555 0.2804142187 0.0202627894
-0.0322876886 0.2880345687 0.0447864633
-0.0368685547 0.3032752688 0.0938338109
-0.0417637744 0.2981618024 0.1430460441
-0.0322876886 0.2880345687 0.0447864633
-0.0346260912 0.3194646378 0.0936929451
-0.0272506292 0.3334449256 0.0443974532
-0.0310092800 0.3063063365 0.0446335876
-0.0273215490 0.3132964803 0.0199858416
-0.0308674403 0.3466032270 0.0934568107
-0.0382429023 0.3326229392 0.1427523025
-0.0272506292 0.3334449256 0.0443974532
-0.0286266119 0.3304134560 0.0935758111
-0.0204944539 0.3117800719 0.0445383688
-0.0242508895 0.3389193347 0.0443388862
-0.0201848105 0.3296026426 0.0198201651
-0.0248701763 0.3032741932 0.0937752937
-0.0330023343 0.3219075773 0.1428127360
-0.0204944539 0.3117800719 0.0445383688
-0.0243718629 0.2707777764 0.0940336626
-0.0246841608 0.2911319990 0.0938718334
-0.0183670794 0.2819622321 0.0447672945
-0.0306889444 0.2799475433 0.1431382014
-0.0183670794 0.2819622321 0.0447672945
-0.0150523897 0.2672002374 0.0202959397
-0.0180547815 0.2616080096 0.0449291238
-0.0246226500 0.2599456749 0.0941218188
-0.0198855841 -0.3373065644 -0.0487773832
-0.0549435680 -0.3368824883 0.0038415737
-0.0141384574 -0.3365051896 0.0511094374
0.0236207297 -0.3365254132 0.0488271740
0.0511699331 -0.3366832635 0.0293324947
0.0601369190 -0.3369377176 -0.0023158670
0.0480825908 -0.3371800727 -0.0325889621
0.0183346821 -0.3373138089 -0.0494395546
-0.0167083844 -0.2902812258 -0.0590800267
-0.0606408885 -0.2897931040 0.0014631294
-0.0133676059 -0.2893267818 0.0598639488
0.0321760641 -0.2893421339 0.0582376567
0.0659805767 -0.2895220966 0.0360271434
0.0777060494 -0.2898208085 -0.0011183518
0.0641590796 -0.2901137742 -0.0377068803
0.0290839066 -0.2902810987 -0.0587760731
-0.0053764682 -0.1381010941 -0.0548962465
-0.0390483426 -0.1379594621 -0.0374608776
-0.0495228148 -0.1376689759 -0.0013324237
-0.0389703651 -0.1373770370 0.0351093164
-0.0054579292 -0.1372386344 0.0525650409
0.0387287512 -0.1372480085 0.0516750523
0.0720565630 -0.1374064485 0.0321432532
0.0842755172 -0.1376740754 -0.0011259611
0.0720526897 -0.1379410808 -0.0344715345
0.0387672029 -0.1380964608 -0.0540411941
-0.0164141850 -0.0468168003 -0.0501230445
-0.0181968839 -0.0460433273 0.0462398666
-0.0154870571 0.0246763582 -0.0430812039
-0.0453964535 0.0247768996 -0.0307420170
-0.0551286799 0.0249876354 -0.0045457407
-0.0466682008 0.0252137691 0.0236835733
-0.0184680350 0.0253233583 0.0375157280
0.0198735042 0.0253227482 0.0376809582
0.0492580767 0.0252098789 0.0238024238
0.0606008296 0.0250124074 -0.0007310011
0.0508013268 0.0248088357 -0.0261575335
0.0225696188 0.0246862753 -0.0416060924
-0.0175976980 0.1131582128 -0.0357292526
-0.0510192175 0.1134159223 -0.0038291448
-0.0202250282 0.1136803601 0.0293133523
0.0120505909 0.1136764585 0.0290302963
0.0144281012 0.1131628100 -0.0349549389
-0.0197876117 0.1961641962 -0.0308407659
-0.0233290034 0.1965958559 0.0229214079
0.0025280999 0.1965950106 0.0229787731
0.0057457026 0.1961703838 -0.0299091431
-0.0874553969 0.3138187972 -0.0168145433
-0.1066952842 0.3140120275 0.0071407390
-0.0167083844 -0.2902812258 -0.0590800267
-0.0606408885 -0.2897931040 0.0014631294
-0.0133676059 -0.2893267818 0.0598639488
0.0321760641 -0.2893421339 0.0582376567
0.0659805767 -0.2895220966 0.0360271434
0.0777060494 -0.2898208085 -0.0011183518
0.0641590796 -0.2901137742 -0.0377068803
0.0290839066 -0.2902810987 -0.0587760731
-0.0053764682 -0.1381010941 -0.0548962465
-0.0390483426 -0.1379594621 -0.0374608776
-0.0495228148 -0.1376689759 -0.0013324237
-0.0389703651 -0.1373770370 0.0351093164
-0.0054579292 -0.1372386344 0.0525650409
0.0387287512 -0.1372480085 0.0516750523
0.0720565630 -0.1374064485 0.0321432532
0.0842755172 -0.1376740754 -0.0011259611
0.0720526897 -0.1379410808 -0.0344715345
0.0387672029 -0.1380964608 -0.0540411941
-0.0164141850 -0.0468168003 -0.0501230445
-0.0608278870 -0.0464327149 -0.0025457537
-0.0181968839 -0.0460433273 0.0462398666
0.0254766530 -0.0460501365 0.0456662295
0.0270724689 -0.0468110365 -0.0491312574
-0.0154870571 0.0246763582 -0.0430812039
-0.0050555960 0.0001766912 -0.0473761597
-0.0371149030 0.0247086415 -0.0391948171
-0.0453964535 0.0247768996 -0.0307420170
-0.0551286799 0.0249876354 -0.0045457407
-0.0562129962 0.0006139862 0.0067885719
-0.0550318177 0.0251470031 0.0153119533
-0.0466682008 0.0252137691 0.0236835733
-0.0184680350 0.0253233583 0.0375157280
-0.0063040039 0.0008984880 0.0425512961
0.0031966951 0.0253517608 0.0411909727
0.0198735042 0.0253227482 0.0376809582
0.0326210147 0.0008600933 0.0380122569
0.0396277532 0.0252846585 0.0330593039
0.0492580767 0.0252098789 0.0238024238
0.0606008296 0.0250124074 -0.0007310011
0.0508013268 0.0248088357 -0.0261575335
0.0225696188 0.0246862753 -0.0416060924
0.0337711371 0.0002161940 -0.0422098517
0.0027712236 0.0246517311 -0.0460348446
-0.0175976980 0.1131582128 -0.0357292526
-0.0428016708 0.1132423585 -0.0254033523
-0.0510192175 0.1134159223 -0.0038291448
-0.0439285578 0.1135949194 0.0185183731
-0.0202250282 0.1136803601 0.0293133523
0.0120505909 0.1136764585 0.0290302963
0.0368041936 0.1135822482 0.0174475173
0.0463820935 0.1134212159 -0.0025567207
0.0381668352 0.1132585972 -0.0228705650
0.0144281012 0.1131628100 -0.0349549389
-0.0197876117 0.1961641962 -0.0308407659
-0.0472208654 0.1963726877 -0.0050355045
-0.0233290034 0.1965958559 0.0229214079
0.0025280999 0.1965950106 0.0229787731
0.0225891319 0.1965193129 0.0136731243
0.0306253539 0.1963873625 -0.0027172248
0.0244406365 0.1962517589 -0.0196522461
0.0057457026 0.1961703838 -0.0299091431
0.0241467064 -0.2190592069 -0.0043754696
0.0241513529 -0.2077766808 -0.0036301074
-0.0391472100 -0.1849064764 -0.0645771307
0.0241472202 -0.2145187617 -0.0043535538
0.0241550639 -0.2017176003 -0.0029805649
0.0241585138 -0.2084472057 -0.0021495240
-0.0391453545 -0.1818769362 -0.0642523594
0.0241616160 -0.2144950764 -0.0014022886
0.0241467064 -0.2190592069 -0.0043754696
0.0241513529 -0.2077766808 -0.0036301074
0.0874499159 -0.2306468852 0.0573169159
0.0241550639 -0.2017176003 -0.0029805649
0.0241616160 -0.2144950764 -0.0014022886
0.0241585138 -0.2084472057 -0.0021495240
0.0874618606 -0.2339948732 0.0598276033
0.0241617317 -0.2240855525 -0.0012022968
0.0241688974 -0.2190226959 0.0001739158
0.0241735414 -0.2077401740 0.0009187523
-0.0385258692 -0.1838841823 0.0628038206
0.0241694113 -0.2144822507 0.0001958316
0.0241772550 -0.2016810893 0.0015688205
0.0241807074 -0.2084106905 0.0024003871
-0.0385240124 -0.1808546399 0.0631288548
0.0241838070 -0.2144585654 0.0031470968
0.0241688974 -0.2190226959 0.0001739158
0.0241735414 -0.2077401740 0.0009187523
0.0868729520 -0.2315961658 -0.0609663161
0.0241772550 -0.2016810893 0.0015688205
0.0241838070 -0.2144585654 0.0031470968
0.0241807074 -0.2084106905 0.0024003871
0.0868848981 -0.2349441516 -0.0584553658
0.0241839227 -0.2240490415 0.0033470886
3 529 624 412
3 318 624 529
3 412 625 509
3 189 625 412
3 509 626 16
3 425 626 509
3 16 627 135
3 351 627 16
3 84 629 628
3 135 629 84
3 628 630 588
3 135 630 628
3 632 633 486
3 631 633 632
3 84 634 486
3 632 634 84
3 635 636 631
3 131 636 635
3 635 637 84
3 631 637 635
3 639 641 638
3 640 641 639
3 640 642 252
3 639 642 640
3 643 644 639
3 347 644 643
3 638 645 639
3 643 645 638
3 647 648 252
3 646 648 647
3 486 649 252
3 647 649 486
3 650 651 646
3 638 651 650
3 650 652 486
3 646 652 650
3 655 656 487
3 654 656 655
3 252 657 487
3 655 657 252
3 658 659 654
3 653 659 658
3 658 660 252
3 654 660 658
3 661 663 653
3 662 663 661
3 662 664 41
3 661 664 662
3 661 666 665
3 653 666 661
3 665 667 252
3 653 667 665
3 85 670 669
3 487 670 85
3 669 671 668
3 487 671 669
3 672 673 668
3 348 673 672
3 668 674 672
3 487 674 668
3 85 676 134
3 675 676 85
3 675 677 130
3 85 677 675
3 134 678 17
3 589 678 134
3 17 679 508
3 352 679 17
3 508 680 413
3 424 680 508
3 413 681 529
3 190 681 413
3 189 682 318
3 412 682 189
3 425 683 189
3 509 683 425
3 351 684 425
3 16 684 351
3 588 685 351
3 135 685 588
3 588 687 686
3 131 687 588
3 686 688 84
3 131 688 686
3 691 692 690
3 131 692 691
3 691 693 689
3 690 693 691
3 131 695 694
3 347 695 131
3 694 696 690
3 347 696 694
3 689 699 698
3 697 699 689
3 698 700 486
3 697 700 698
3 701 702 697
3 347 702 701
3 697 703 701
3 689 703 697
3 705 707 704
3 706 707 705
3 706 708 347
3 705 708 706
3 709 710 705
3 252 710 709
3 704 711 705
3 709 711 704
3 713 714 347
3 712 714 713
3 713 715 41
3 347 715 713
3 716 717 712
3 704 717 716
3 716 718 41
3 712 718 716
3 721 722 41
3 720 722 721
3 721 723 348
3 41 723 721
3 724 725 720
3 719 725 724
3 724 726 348
3 720 726 724
3 727 729 719
3 728 729 727
3 728 730 487
3 727 730 728
3 731 732 727
3 348 732 731
3 719 733 727
3 731 733 719
3 736 737 348
3 735 737 736
3 130 738 348
3 736 738 130
3 739 740 735
3 734 740 739
3 739 741 130
3 735 741 739
3 742 744 734
3 743 744 742
3 743 745 85
3 742 745 743
3 746 747 742
3 130 747 746
3 734 748 742
3 746 748 734
3 589 750 130
3 749 750 589
3 749 751 134
3 589 751 749
3 352 752 589
3 17 752 352
3 424 753 352
3 508 753 424
3 190 754 424
3 413 754 190
3 318 755 190
3 529 755 318
3 528 756 410
3 317 756 528
3 410 757 507
3 187 757 410
3 507 758 14
3 423 758 507
3 14 759 133
3 349 759 14
3 82 761 760
3 133 761 82
3 760 762 586
3 133 762 760
3 764 765 484
3 763 765 764
3 82 766 484
3 764 766 82
3 767 768 763
3 129 768 767
3 767 769 82
3 763 769 767
3 771 773 770
3 772 773 771
3 772 774 251
3 771 774 772
3 775 776 771
3 345 776 775
3 770 777 771
3 775 777 770
3 779 780 251
3 778 780 779
3 484 781 251
3 779 781 484
3 782 783 778
3 770 783 782
3 782 784 484
3 778 784 782
3 787 788 485
3 786 788 787
3 251 789 485
3 787 789 251
3 790 791 786
3 785 791 790
3 790 792 251
3 786 792 790
3 793 795 785
3 794 795 793
3 794 796 40
3 793 796 794
3 793 798 797
3 785 798 793
3 797 799 251
3 785 799 797
3 83 802 801
3 485 802 83
3 801 803 800
3 485 803 801
3 804 805 800
3 346 805 804
3 800 806 804
3 485 806 800
3 83 808 132
3 807 808 83
3 807 809 128
3 83 809 807
3 132 810 15
3 587 810 132
3 15 811 506
3 350 811 15
3 506 812 411
3 422 812 506
3 411 813 528
3 188 813 411
3 187 814 317
3 410 814 187
3 423 815 187
3 507 815 423
3 349 816 423
3 14 816 349
3 586 817 349
3 133 817 586
3 586 819 818
3 129 819 586
3 818 820 82
3 129 820 818
3 823 824 822
3 129 824 823
3 823 825 821
3 822 825 823
3 129 827 826
3 345 827 129
3 826 828 822
3 345 828 826
3 821 831 830
3 829 831 821
3 830 832 484
3 829 832 830
3 833 834 829
3 345 834 833
3 829 835 833
3 821 835 829
3 837 839 836
3 838 839 837
3 838 840 345
3 837 840 838
3 841 842 837
3 251 842 841
3 836 843 837
3 841 843 836
3 845 846 345
3 844 846 845
3 845 847 40
3 345 847 845
3 848 849 844
3 836 849 848
3 848 850 40
3 844 850 848
3 853 854 40
3 852 854 853
3 853 855 346
3 40 855 853
3 856 857 852
3 851 857 856
3 856 858 346
3 852 858 856
3 859 861 851
3 860 861 859
3 860 862 485
3 859 862 860
3 863 864 859
3 346 864 863
3 851 865 859
3 863 865 851
3 868 869 346
3 867 869 868
3 128 870 346
3 868 870 128
3 871 872 867
3 866 872 871
3 871 873 128
3 867 873 871
3 874 876 866
3 875 876 874
3 875 877 83
3 874 877 875
3 878 879 874
3 128 879 878
3 866 880 874
3 878 880 866
3 587 882 128
3 881 882 587
3 881 883 132
3 587 883 881
3 350 884 587
3 15 884 350
3 422 885 350
3 506 885 422
3 188 886 422
3 411 886 188
3 317 887 188
3 528 887 317
3 153 889 461
3 888 889 153
3 888 890 154
3 153 890 888
3 461 891 181
3 369 891 461
3 181 892 283
3 590 892 181
3 283 893 582
3 203 893 283
3 11 895 894
3 582 895 11
3 894 896 198
3 582 896 894
3 899 900 898
3 279 900 899
3 899 901 897
3 898 901 899
3 279 903 902
3 11 903 279
3 902 904 898
3 11 904 902
3 897 907 906
3 905 907 897
3 906 908 79
3 905 908 906
3 909 910 905
3 11 910 909
3 905 911 909
3 897 911 905
3 914 915 913
3 184 915 914
3 914 916 912
3 913 916 914
3 184 918 917
3 279 918 184
3 917 919 913
3 279 919 917
3 912 922 921
3 920 922 912
3 921 923 566
3 920 923 921
3 924 925 920
3 279 925 924
3 920 926 924
3 912 926 920
3 929 930 280
3 928 930 929
3 184 931 280
3 929 931 184
3 932 933 928
3 927 933 932
3 932 934 184
3 928 934 932
3 935 937 927
3 936 937 935
3 936 938 363
3 935 938 936
3 939 940 935
3 184 940 939
3 927 941 935
3 939 941 927
3 944 945 10
3 943 945 944
3 280 946 10
3 944 946 280
3 947 948 943
3 942 948 947
3 947 949 280
3 943 949 947
3 950 952 942
3 951 952 950
3 951 953 567
3 950 953 951
3 954 955 950
3 280 955 954
3 942 956 950
3 954 956 942
3 10 958 583
3 957 958 10
3 957 959 78
3 10 959 957
3 583 960 284
3 197 960 583
3 284 961 180
3 204 961 284
3 180 962 460
3 591 962 180
3 460 964 153
3 963 964 460
3 963 965 368
3 460 965 963
3 369 967 154
3 966 967 369
3 966 968 461
3 369 968 966
3 590 970 369
3 969 970 590
3 969 971 181
3 590 971 969
3 203 973 590
3 972 973 203
3 972 974 283
3 203 974 972
3 203 976 975
3 198 976 203
3 975 977 582
3 198 977 975
3 979 980 198
3 978 980 979
3 79 981 198
3 979 981 79
3 982 983 978
3 11 983 982
3 982 984 79
3 978 984 982
3 987 988 986
3 79 988 987
3 987 989 985
3 986 989 987
3 79 991 990
3 566 991 79
3 990 992 986
3 566 992 990
3 985 995 994
3 993 995 985
3 994 996 279
3 993 996 994
3 997 998 993
3 566 998 997
3 993 999 997
3 985 999 993
3 1002 1004 1001
3 1003 1004 1002
3 1003 1005 566
3 1002 1005 1003
3 1006 1007 1002
3 1000 1007 1006
3 1001 1008 1002
3 1006 1008 1001
3 1010 1011 566
3 1009 1011 1010
3 1010 1012 363
3 566 1012 1010
3 1013 1014 1009
3 1001 1014 1013
3 1013 1015 363
3 1009 1015 1013
3 1018 1019 1000
3 1017 1019 1018
3 1016 1020 1000
3 1018 1020 1016
3 1021 1022 1017
3 184 1022 1021
3 1021 1023 1016
3 1017 1023 1021
3 1025 1026 1024
3 1016 1026 1025
3 1025 1027 363
3 1024 1027 1025
3 1028 1029 1016
3 1024 1029 1028
3 1000 1030 1016
3 1028 1030 1000
3 1034 1035 1033
3 363 1035 1034
3 1034 1036 1032
3 1033 1036 1034
3 1037 1038 567
3 363 1038 1037
3 1037 1039 1033
3 567 1039 1037
3 1032 1042 1041
3 1040 1042 1032
3 1041 1043 1031
3 1040 1043 1041
3 1044 1045 1040
3 567 1045 1044
3 1040 1046 1044
3 1032 1046 1040
3 1031 1050 1049
3 1047 1050 1031
3 1049 1051 1048
3 1047 1051 1049
3 1052 1053 1048
3 280 1053 1052
3 1052 1054 1047
3 1048 1054 1052
3 1056 1057 1055
3 1047 1057 1056
3 1056 1058 567
3 1055 1058 1056
3 1047 1060 1059
3 1031 1060 1047
3 1059 1061 1055
3 1031 1061 1059
3 1064 1065 567
3 1063 1065 1064
3 78 1066 567
3 1064 1066 78
3 1067 1068 1063
3 1062 1068 1067
3 1067 1069 78
3 1063 1069 1067
3 1070 1072 1062
3 1071 1072 1070
3 1071 1073 10
3 1070 1073 1071
3 1074 1075 1070
3 78 1075 1074
3 1062 1076 1070
3 1074 1076 1062
3 78 1079 1078
3 197 1079 78
3 1078 1080 1077
3 197 1080 1078
3 1081 1082 1077
3 583 1082 1081
3 1081 1083 197
3 1077 1083 1081
3 204 1085 197
3 1084 1085 204
3 1084 1086 284
3 204 1086 1084
3 591 1088 204
3 1087 1088 591
3 1087 1089 180
3 591 1089 1087
3 368 1091 591
3 1090 1091 368
3 1090 1092 460
3 368 1092 1090
3 154 1094 368
3 1093 1094 154
3 1093 1095 153
3 154 1095 1093
3 155 1097 463
3 1096 1097 155
3 1096 1098 154
3 155 1098 1096
3 463 1099 183
3 369 1099 463
3 183 1100 285
3 590 1100 183
3 285 1101 584
3 203 1101 285
3 13 1103 1102
3 584 1103 13
3 1102 1104 198
3 584 1104 1102
3 1107 1108 1106
3 281 1108 1107
3 1107 1109 1105
3 1106 1109 1107
3 281 1111 1110
3 13 1111 281
3 1110 1112 1106
3 13 1112 1110
3 1105 1115 1114
3 1113 1115 1105
3 1114 1116 79
3 1113 1116 1114
3 1117 1118 1113
3 13 1118 1117
3 1113 1119 1117
3 1105 1119 1113
3 1122 1123 1121
3 185 1123 1122
3 1122 1124 1120
3 1121 1124 1122
3 185 1126 1125
3 281 1126 185
3 1125 1127 1121
3 281 1127 1125
3 1120 1130 1129
3 1128 1130 1120
3 1129 1131 566
3 1128 1131 1129
3 1132 1133 1128
3 281 1133 1132
3 1128 1134 1132
3 1120 1134 1128
3 1137 1138 282
3 1136 1138 1137
3 185 1139 282
3 1137 1139 185
3 1140 1141 1136
3 1135 1141 1140
3 1140 1142 185
3 1136 1142 1140
3 1143 1145 1135
3 1144 1145 1143
3 1144 1146 363
3 1143 1146 1144
3 1147 1148 1143
3 185 1148 1147
3 1135 1149 1143
3 1147 1149 1135
3 1152 1153 12
3 1151 1153 1152
3 282 1154 12
3 1152 1154 282
3 1155 1156 1151
3 1150 1156 1155
3 1155 1157 282
3 1151 1157 1155
3 1158 1160 1150
3 1159 1160 1158
3 1159 1161 567
3 1158 1161 1159
3 1162 1163 1158
3 282 1163 1162
3 1150 1164 1158
3 1162 1164 1150
3 12 1166 585
3 1165 1166 12
3 1165 1167 78
3 12 1167 1165
3 585 1168 286
3 197 1168 585
3 286 1169 182
3 204 1169 286
3 182 1170 462
3 591 1170 182
3 462 1172 155
3 1171 1172 462
3 1171 1173 368
3 462 1173 1171
3 369 1175 154
3 1174 1175 369
3 1174 1176 463
3 369 1176 1174
3 590 1178 369
3 1177 1178 590
3 1177 1179 183
3 590 1179 1177
3 203 1181 590
3 1180 1181 203
3 1180 1182 285
3 203 1182 1180
3 203 1184 1183
3 198 1184 203
3 1183 1185 584
3 198 1185 1183
3 1187 1188 198
3 1186 1188 1187
3 79 1189 198
3 1187 1189 79
3 1190 1191 1186
3 13 1191 1190
3 1190 1192 79
3 1186 1192 1190
3 1195 1196 1194
3 79 1196 1195
3 1195 1197 1193
3 1194 1197 1195
3 79 1199 1198
3 566 1199 79
3 1198 1200 1194
3 566 1200 1198
3 1193 1203 1202
3 1201 1203 1193
3 1202 1204 281
3 1201 1204 1202
3 1205 1206 1201
3 566 1206 1205
3 1201 1207 1205
3 1193 1207 1201
3 1210 1212 1209
3 1211 1212 1210
3 1211 1213 566
3 1210 1213 1211
3 1214 1215 1210
3 1208 1215 1214
3 1209 1216 1210
3 1214 1216 1209
3 1218 1219 566
3 1217 1219 1218
3 1218 1220 363
3 566 1220 1218
3 1221 1222 1217
3 1209 1222 1221
3 1221 1223 363
3 1217 1223 1221
3 1226 1227 1208
3 1225 1227 1226
3 1224 1228 1208
3 1226 1228 1224
3 1229 1230 1225
3 185 1230 1229
3 1229 1231 1224
3 1225 1231 1229
3 1233 1234 1232
3 1224 1234 1233
3 1233 1235 363
3 1232 1235 1233
3 1236 1237 1224
3 1232 1237 1236
3 1208 1238 1224
3 1236 1238 1208
3 1242 1243 1241
3 363 1243 1242
3 1242 1244 1240
3 1241 1244 1242
3 1245 1246 567
3 363 1246 1245
3 1245 1247 1241
3 567 1247 1245
3 1240 1250 1249
3 1248 1250 1240
3 1249 1251 1239
3 1248 1251 1249
3 1252 1253 1248
3 567 1253 1252
3 1248 1254 1252
3 1240 1254 1248
3 1239 1258 1257
3 1255 1258 1239
3 1257 1259 1256
3 1255 1259 1257
3 1260 1261 1256
3 282 1261 1260
3 1260 1262 1255
3 1256 1262 1260
3 1264 1265 1263
3 1255 1265 1264
3 1264 1266 567
3 1263 1266 1264
3 1255 1268 1267
3 1239 1268 1255
3 1267 1269 1263
3 1239 1269 1267
3 1272 1273 567
3 1271 1273 1272
3 78 1274 567
3 1272 1274 78
3 1275 1276 1271
3 1270 1276 1275
3 1275 1277 78
3 1271 1277 1275
3 1278 1280 1270
3 1279 1280 1278
3 1279 1281 12
3 1278 1281 1279
3 1282 1283 1278
3 78 1283 1282
3 1270 1284 1278
3 1282 1284 1270
3 78 1287 1286
3 197 1287 78
3 1286 1288 1285
3 197 1288 1286
3 1289 1290 1285
3 585 1290 1289
3 1289 1291 197
3 1285 1291 1289
3 204 1293 197
3 1292 1293 204
3 1292 1294 286
3 204 1294 1292
3 591 1296 204
3 1295 1296 591
3 1295 1297 182
3 591 1297 1295
3 368 1299 591
3 1298 1299 368
3 1298 1300 462
3 368 1300 1298
3 154 1302 368
3 1301 1302 154
3 1301 1303 155
3 154 1303 1301
3 152 546 262
3 549 501 546
3 394 201 501
3 195 168 201
3 35 416 168
3 416 1305 580
3 1304 1305 416
3 1304 1306 297
3 416 1306 1304
3 580 1308 397
3 1307 1308 580
3 1307 1309 408
3 580 1309 1307
3 397 1311 581
3 1310 1311 397
3 1310 1312 186
3 397 1312 1310
3 1313 1314 417
3 409 1314 1313
3 581 1315 417
3 1313 1315 581
3 298 169 417
3 34 202 169
3 196 500 202
3 395 547 500
3 548 262 547
3 152 549 546
3 549 394 501
3 394 195 201
3 195 35 168
3 297 1316 35
3 416 1316 297
3 297 1319 1318
3 408 1319 297
3 1318 1320 1317
3 408 1320 1318
3 1321 1322 1317
3 580 1322 1321
3 1321 1323 408
3 1317 1323 1321
3 1325 1326 408
3 1324 1326 1325
3 186 1327 408
3 1325 1327 186
3 1328 1329 1324
3 397 1329 1328
3 1328 1330 186
3 1324 1330 1328
3 1332 1333 186
3 1331 1333 1332
3 409 1334 186
3 1332 1334 409
3 1335 1336 1331
3 581 1336 1335
3 1335 1337 409
3 1331 1337 1335
3 1339 1340 1338
3 409 1340 1339
3 1339 1341 417
3 1338 1341 1339
3 409 1343 1342
3 298 1343 409
3 1342 1344 1338
3 298 1344 1342
3 298 1345 169
3 34 1345 298
3 34 196 202
3 196 395 500
3 395 548 547
3 548 152 262
3 152 544 261
3 549 499 544
3 394 199 499
3 195 166 199
3 35 414 166
3 414 1347 578
3 1346 1347 414
3 1346 1348 297
3 414 1348 1346
3 578 1350 396
3 1349 1350 578
3 1349 1351 408
3 578 1351 1349
3 396 1353 579
3 1352 1353 396
3 1352 1354 186
3 396 1354 1352
3 1355 1356 415
3 409 1356 1355
3 579 1357 415
3 1355 1357 579
3 298 167 415
3 34 200 167
3 196 498 200
3 395 545 498
3 548 261 545
3 152 549 544
3 549 394 499
3 394 195 199
3 195 35 166
3 297 1358 35
3 414 1358 297
3 297 1361 1360
3 408 1361 297
3 1360 1362 1359
3 408 1362 1360
3 1363 1364 1359
3 578 1364 1363
3 1363 1365 408
3 1359 1365 1363
3 1367 1368 408
3 1366 1368 1367
3 186 1369 408
3 1367 1369 186
3 1370 1371 1366
3 396 1371 1370
3 1370 1372 186
3 1366 1372 1370
3 1374 1375 186
3 1373 1375 1374
3 409 1376 186
3 1374 1376 409
3 1377 1378 1373
3 579 1378 1377
3 1377 1379 409
3 1373 1379 1377
3 1381 1382 1380
3 409 1382 1381
3 1381 1383 415
3 1380 1383 1381
3 409 1385 1384
3 298 1385 409
3 1384 1386 1380
3 298 1386 1384
3 298 1387 167
3 34 1387 298
3 34 196 200
3 196 395 498
3 395 548 545
3 548 152 261
3 400 107 108
3 399 105 107
3 404 104 105
3 401 102 104
3 406 101 102
3 405 109 101
3 403 106 109
3 398 103 106
3 407 100 103
3 402 108 100
3 108 238 237
3 107 240 238
3 105 231 240
3 104 233 231
3 102 234 233
3 101 232 234
3 109 235 232
3 106 236 235
3 103 239 236
3 100 237 239
3 237 599 596
3 238 600 599
3 240 597 600
3 231 598 597
3 233 601 598
3 234 603 601
3 232 595 603
3 235 602 595
3 236 594 602
3 239 596 594
3 596 488 496
3 599 492 488
3 600 494 492
3 597 497 494
3 598 490 497
3 601 495 490
3 603 493 495
3 595 489 493
3 602 491 489
3 594 496 491
3 496 214 212
3 488 208 214
3 492 211 208
3 494 205 211
3 497 207 205
3 490 209 207
3 495 206 209
3 493 213 206
3 489 210 213
3 491 212 210
3 212 433 427
3 214 435 433
3 208 426 435
3 211 428 426
3 205 434 428
3 207 431 434
3 209 429 431
3 206 432 429
3 213 430 432
3 210 427 430
3 427 604 611
3 433 608 604
3 435 609 608
3 426 612 609
3 428 606 612
3 434 605 606
3 431 610 605
3 429 607 610
3 432 613 607
3 430 611 613
3 538 1388 534
3 611 1388 538
3 604 532 534
3 532 1389 539
3 608 1389 532
3 609 537 539
3 537 1390 533
3 612 1390 537
3 533 1391 531
3 606 1391 533
3 531 1392 536
3 605 1392 531
3 536 1393 535
3 610 1393 536
3 535 1394 530
3 607 1394 535
3 530 1395 538
3 613 1395 530
3 354 1396 355
3 538 1396 354
3 534 353 355
3 353 1397 362
3 532 1397 353
3 539 360 362
3 360 1398 361
3 537 1398 360
3 361 1399 358
3 533 1399 361
3 358 1400 359
3 531 1400 358
3 359 1401 356
3 536 1401 359
3 356 1402 357
3 535 1402 356
3 357 1403 354
3 530 1403 357
3 354 375 376
3 355 377 375
3 353 372 377
3 362 374 372
3 360 373 374
3 361 371 373
3 358 370 371
3 359 379 370
3 356 378 379
3 357 376 378
3 376 70 73
3 375 71 70
3 377 74 71
3 372 75 74
3 374 72 75
3 373 76 72
3 371 77 76
3 370 68 77
3 379 69 68
3 378 73 69
3 73 524 527
3 70 522 524
3 71 523 522
3 74 521 523
3 75 518 521
3 72 526 518
3 76 525 526
3 77 520 525
3 68 519 520
3 69 527 519
3 527 436 439
3 524 443 436
3 522 440 443
3 523 437 440
3 521 444 437
3 518 438 444
3 526 442 438
3 525 441 442
3 520 445 441
3 519 439 445
3 382 1404 387
3 439 1404 382
3 387 1405 388
3 436 1405 387
3 388 1406 383
3 443 1406 388
3 383 1407 384
3 440 1407 383
3 384 1408 389
3 437 1408 384
3 389 1409 386
3 444 1409 389
3 386 1410 381
3 438 1410 386
3 381 1411 380
3 442 1411 381
3 380 1412 385
3 441 1412 380
3 385 1413 382
3 445 1413 385
3 382 622 616
3 387 617 622
3 388 623 617
3 383 614 623
3 384 620 614
3 389 618 620
3 386 621 618
3 381 615 621
3 380 619 615
3 385 616 619
3 59 1414 65
3 616 1414 59
3 622 61 65
3 617 64 61
3 623 60 64
3 60 1415 66
3 614 1415 60
3 620 62 66
3 618 67 62
3 621 58 67
3 615 63 58
3 619 59 63
3 455 1416 449
3 59 1416 455
3 449 1417 451
3 65 1417 449
3 451 1418 450
3 61 1418 451
3 450 1419 452
3 64 1419 450
3 452 1420 446
3 60 1420 452
3 446 1421 453
3 66 1421 446
3 453 1422 447
3 62 1422 453
3 447 1423 454
3 67 1423 447
3 454 1424 448
3 58 1424 454
3 448 1425 455
3 63 1425 448
3 338 1426 335
3 455 1426 338
3 449 340 335
3 340 1427 339
3 451 1427 340
3 450 344 339
3 344 1428 341
3 452 1428 344
3 341 1429 336
3 446 1429 341
3 453 342 336
3 447 337 342
3 454 343 337
3 343 1430 338
3 448 1430 343
3 177 1431 174
3 338 1431 177
3 335 176 174
3 340 173 176
3 339 175 173
3 175 1432 172
3 344 1432 175
3 172 1433 171
3 341 1433 172
3 336 170 171
3 342 179 170
3 337 178 179
3 178 1434 177
3 343 1434 178
3 177 165 163
3 174 160 165
3 176 161 160
3 173 156 161
3 175 158 156
3 172 159 158
3 171 164 159
3 170 157 164
3 179 162 157
3 178 163 162
3 163 7 1
3 165 9 7
3 160 0 9
3 161 2 0
3 156 8 2
3 158 3 8
3 159 5 3
3 164 4 5
3 157 6 4
3 162 1 6
3 245 1435 241
3 1 1435 245
3 7 248 241
3 9 243 248
3 0 250 243
3 246 1436 2
3 250 1436 246
3 8 242 246
3 3 247 242
3 5 244 247
3 4 249 244
3 6 245 249
3 245 99 96
3 241 94 99
3 248 95 94
3 243 90 95
3 250 93 90
3 246 91 93
3 242 92 91
3 247 97 92
3 244 98 97
3 249 96 98
3 96 568 576
3 99 570 568
3 94 575 570
3 95 577 575
3 90 569 577
3 93 571 569
3 91 572 571
3 92 573 572
3 97 574 573
3 98 576 574
3 576 294 291
3 568 295 294
3 570 288 295
3 575 289 288
3 577 292 289
3 569 296 292
3 571 293 296
3 572 290 293
3 573 287 290
3 574 291 287
3 400 399 107
3 399 404 105
3 404 401 104
3 401 406 102
3 406 405 101
3 405 403 109
3 403 398 106
3 398 407 103
3 407 402 100
3 402 400 108
3 108 107 238
3 107 105 240
3 105 104 231
3 104 102 233
3 102 101 234
3 101 109 232
3 109 106 235
3 106 103 236
3 103 100 239
3 100 108 237
3 237 238 599
3 238 240 600
3 240 231 597
3 231 233 598
3 233 234 601
3 234 232 603
3 232 235 595
3 235 236 602
3 236 239 594
3 239 237 596
3 596 599 488
3 599 600 492
3 600 597 494
3 597 598 497
3 598 601 490
3 601 603 495
3 603 595 493
3 595 602 489
3 602 594 491
3 594 596 496
3 496 488 214
3 488 492 208
3 492 494 211
3 494 497 205
3 497 490 207
3 490 495 209
3 495 493 206
3 493 489 213
3 489 491 210
3 491 496 212
3 212 214 433
3 214 208 435
3 208 211 426
3 211 205 428
3 205 207 434
3 207 209 431
3 209 206 429
3 206 213 432
3 213 210 430
3 210 212 427
3 427 433 604
3 433 435 608
3 435 426 609
3 426 428 612
3 428 434 606
3 434 431 605
3 431 429 610
3 429 432 607
3 432 430 613
3 430 427 611
3 611 604 534
3 604 608 532
3 608 609 539
3 609 612 537
3 612 606 533
3 606 605 531
3 605 610 536
3 610 607 535
3 607 613 530
3 613 611 538
3 534 1437 538
3 355 1437 534
3 534 532 353
3 539 1438 532
3 362 1438 539
3 539 537 360
3 533 1439 537
3 361 1439 533
3 531 1440 533
3 358 1440 531
3 536 1441 531
3 359 1441 536
3 535 1442 536
3 356 1442 535
3 530 1443 535
3 357 1443 530
3 538 1444 530
3 354 1444 538
3 354 355 375
3 355 353 377
3 353 362 372
3 362 360 374
3 360 361 373
3 361 358 371
3 358 359 370
3 359 356 379
3 356 357 378
3 357 354 376
3 376 375 70
3 375 377 71
3 377 372 74
3 372 374 75
3 374 373 72
3 373 371 76
3 371 370 77
3 370 379 68
3 379 378 69
3 378 376 73
3 73 70 524
3 70 71 522
3 71 74 523
3 74 75 521
3 75 72 518
3 72 76 526
3 76 77 525
3 77 68 520
3 68 69 519
3 69 73 527
3 527 524 436
3 524 522 443
3 522 523 440
3 523 521 437
3 521 518 444
3 518 526 438
3 526 525 442
3 525 520 441
3 520 519 445
3 519 527 439
3 436 1445 439
3 387 1445 436
3 443 1446 436
3 388 1446 443
3 440 1447 443
3 383 1447 440
3 437 1448 440
3 384 1448 437
3 444 1449 437
3 389 1449 444
3 438 1450 444
3 386 1450 438
3 442 1451 438
3 381 1451 442
3 441 1452 442
3 380 1452 441
3 445 1453 441
3 385 1453 445
3 439 1454 445
3 382 1454 439
3 382 387 622
3 387 388 617
3 388 383 623
3 383 384 614
3 384 389 620
3 389 386 618
3 386 381 621
3 381 380 615
3 380 385 619
3 385 382 616
3 622 1455 616
3 65 1455 622
3 622 617 61
3 623 1456 617
3 64 1456 623
3 623 614 60
3 620 1457 614
3 66 1457 620
3 618 1458 620
3 62 1458 618
3 618 621 67
3 621 615 58
3 615 619 63
3 616 1459 619
3 59 1459 616
3 65 1461 59
3 1460 1461 65
3 1460 1462 449
3 65 1462 1460
3 61 1463 65
3 451 1463 61
3 61 1465 1464
3 64 1465 61
3 1464 1466 450
3 64 1466 1464
3 60 1467 64
3 452 1467 60
3 60 1469 1468
3 66 1469 60
3 1468 1470 446
3 66 1470 1468
3 66 1472 1471
3 62 1472 66
3 1471 1473 453
3 62 1473 1471
3 67 1474 62
3 447 1474 67
3 58 1475 67
3 454 1475 58
3 63 1476 58
3 448 1476 63
3 59 1478 63
3 1477 1478 59
3 1477 1479 455
3 59 1479 1477
3 449 1480 455
3 335 1480 449
3 451 1481 449
3 340 1481 451
3 450 1482 451
3 339 1482 450
3 452 1483 450
3 344 1483 452
3 446 1484 452
3 341 1484 446
3 453 1485 446
3 336 1485 453
3 447 1486 453
3 342 1486 447
3 454 1487 447
3 337 1487 454
3 448 1488 454
3 343 1488 448
3 455 1489 448
3 338 1489 455
3 335 1490 338
3 174 1490 335
3 335 340 176
3 339 1491 340
3 173 1491 339
3 339 344 175
3 341 1492 344
3 172 1492 341
3 336 1493 341
3 171 1493 336
3 342 1494 336
3 170 1494 342
3 337 1495 342
3 179 1495 337
3 343 1496 337
3 178 1496 343
3 338 1497 343
3 177 1497 338
3 177 174 165
3 174 176 160
3 176 173 161
3 173 175 156
3 175 172 158
3 172 171 159
3 171 170 164
3 170 179 157
3 179 178 162
3 178 177 163
3 163 165 7
3 165 160 9
3 160 161 0
3 161 156 2
3 156 158 8
3 158 159 3
3 159 164 5
3 164 157 4
3 157 162 6
3 162 163 1
3 1 7 241
3 7 9 248
3 9 0 243
3 0 2 250
3 2 8 246
3 8 3 242
3 3 5 247
3 5 4 244
3 4 6 249
3 6 1 245
3 245 241 99
3 241 248 94
3 248 243 95
3 243 250 90
3 250 246 93
3 246 242 91
3 242 247 92
3 247 244 97
3 244 249 98
3 249 245 96
3 96 99 568
3 99 94 570
3 94 95 575
3 95 90 577
3 90 93 569
3 93 91 571
3 91 92 572
3 92 97 573
3 97 98 574
3 98 96 576
3 576 568 294
3 568 570 295
3 570 575 288
3 575 577 289
3 577 569 292
3 569 571 296
3 571 572 293
3 572 573 290
3 573 574 287
3 574 576 291
3 120 319 321
3 113 327 319
3 121 330 327
3 116 324 330
3 125 331 324
3 115 328 331
3 122 320 328
3 112 321 320
3 321 557 564
3 319 561 557
3 327 563 561
3 330 550 563
3 324 562 550
3 331 560 562
3 328 556 560
3 320 564 556
3 564 19 18
3 557 26 19
3 561 28 26
3 563 21 28
3 550 29 21
3 562 27 29
3 560 20 27
3 556 18 20
3 18 223 228
3 19 227 223
3 26 229 227
3 28 225 229
3 21 230 225
3 29 226 230
3 27 224 226
3 20 228 224
3 228 140 150
3 223 145 140
3 227 138 145
3 229 151 138
3 225 139 151
3 230 144 139
3 226 141 144
3 224 150 141
3 150 468 475
3 140 478 468
3 145 471 478
3 138 481 471
3 151 472 481
3 139 477 472
3 144 469 477
3 141 475 469
3 475 310 316
3 468 312 310
3 478 304 312
3 471 315 304
3 481 303 315
3 472 311 303
3 477 309 311
3 469 316 309
3 316 54 46
3 310 51 54
3 312 42 51
3 304 52 42
3 315 43 52
3 303 50 43
3 311 55 50
3 309 46 55
3 46 272 268
3 54 276 272
3 51 267 276
3 42 278 267
3 52 266 278
3 43 277 266
3 50 271 277
3 55 268 271
3 120 113 319
3 113 121 327
3 121 116 330
3 116 125 324
3 125 115 331
3 115 122 328
3 122 112 320
3 112 120 321
3 321 319 557
3 319 327 561
3 327 330 563
3 330 324 550
3 324 331 562
3 331 328 560
3 328 320 556
3 320 321 564
3 564 557 19
3 557 561 26
3 561 563 28
3 563 550 21
3 550 562 29
3 562 560 27
3 560 556 20
3 556 564 18
3 18 19 223
3 19 26 227
3 26 28 229
3 28 21 225
3 21 29 230
3 29 27 226
3 27 20 224
3 20 18 228
3 228 223 140
3 223 227 145
3 227 229 138
3 229 225 151
3 225 230 139
3 230 226 144
3 226 224 141
3 224 228 150
3 150 140 468
3 140 145 478
3 145 138 471
3 138 151 481
3 151 139 472
3 139 144 477
3 144 141 469
3 141 150 475
3 475 468 310
3 468 478 312
3 478 471 304
3 471 481 315
3 481 472 303
3 472 477 311
3 477 469 309
3 469 475 316
3 316 310 54
3 310 312 51
3 312 304 42
3 304 315 52
3 315 303 43
3 303 311 50
3 311 309 55
3 309 316 46
3 46 54 272
3 54 51 276
3 51 42 267
3 42 52 278
3 52 43 266
3 43 50 277
3 50 55 271
3 55 46 268
3 114 322 329
3 124 325 322
3 117 333 325
3 127 332 333
3 119 334 332
3 126 326 334
3 118 323 326
3 123 329 323
3 329 553 565
3 322 555 553
3 325 559 555
3 333 551 559
3 332 558 551
3 334 554 558
3 326 552 554
3 323 565 552
3 565 22 32
3 553 24 22
3 555 30 24
3 559 33 30
3 551 31 33
3 558 25 31
3 554 23 25
3 552 32 23
3 32 215 220
3 22 219 215
3 24 221 219
3 30 217 221
3 33 222 217
3 31 218 222
3 25 216 218
3 23 220 216
3 220 148 136
3 215 143 148
3 219 146 143
3 221 137 146
3 217 147 137
3 222 142 147
3 218 149 142
3 216 136 149
3 136 479 470
3 148 474 479
3 143 482 474
3 146 476 482
3 137 483 476
3 147 473 483
3 142 480 473
3 149 470 480
3 470 314 302
3 479 308 314
3 474 306 308
3 482 301 306
3 476 305 301
3 483 307 305
3 473 313 307
3 480 302 313
3 302 56 47
3 314 49 56
3 308 44 49
3 306 53 44
3 301 45 53
3 305 48 45
3 307 57 48
3 313 47 57
3 47 274 263
3 56 264 274
3 49 270 264
3 44 275 270
3 53 269 275
3 45 265 269
3 48 273 265
3 57 263 273
3 114 124 322
3 124 117 325
3 117 127 333
3 127 119 332
3 119 126 334
3 126 118 326
3 118 123 323
3 123 114 329
3 329 322 553
3 322 325 555
3 325 333 559
3 333 332 551
3 332 334 558
3 334 326 554
3 326 323 552
3 323 329 565
3 565 553 22
3 553 555 24
3 555 559 30
3 559 551 33
3 551 558 31
3 558 554 25
3 554 552 23
3 552 565 32
3 32 22 215
3 22 24 219
3 24 30 221
3 30 33 217
3 33 31 222
3 31 25 218
3 25 23 216
3 23 32 220
3 220 215 148
3 215 219 143
3 219 221 146
3 221 217 137
3 217 222 147
3 222 218 142
3 218 216 149
3 216 220 136
3 136 148 479
3 148 143 474
3 143 146 482
3 146 137 476
3 137 147 483
3 147 142 473
3 142 149 480
3 149 136 470
3 470 479 314
3 479 474 308
3 474 482 306
3 482 476 301
3 476 483 305
3 483 473 307
3 473 480 313
3 480 470 302
3 302 314 56
3 314 308 49
3 308 306 44
3 306 301 53
3 301 305 45
3 305 307 48
3 307 313 57
3 313 302 47
3 47 56 274
3 56 49 264
3 49 44 270
3 44 53 275
3 53 45 269
3 45 48 265
3 48 57 273
3 57 47 263
3 111 458 592
3 420 88 458
3 465 541 88
3 516 194 541
3 258 511 194
3 511 1498 254
3 393 1498 511
3 254 1500 299
3 1499 1500 254
3 1499 1501 38
3 254 1501 1499
3 1502 1503 253
3 81 1503 1502
3 253 1504 1502
3 299 1504 253
3 513 1505 39
3 253 1505 513
3 391 193 513
3 257 540 193
3 517 86 540
3 464 459 86
3 421 592 459
3 111 420 458
3 420 465 88
3 465 516 541
3 516 258 194
3 258 393 511
3 38 1506 393
3 254 1506 38
3 81 1508 38
3 1507 1508 81
3 1507 1509 299
3 81 1509 1507
3 1510 1511 81
3 253 1511 1510
3 81 1512 1510
3 39 1512 81
3 39 1513 513
3 391 1513 39
3 391 257 193
3 257 517 540
3 517 464 86
3 464 421 459
3 421 111 592
3 110 456 593
3 418 89 456
3 466 543 89
3 514 192 543
3 260 510 192
3 510 1514 256
3 392 1514 510
3 256 1516 300
3 1515 1516 256
3 1515 1517 36
3 256 1517 1515
3 1518 1519 255
3 80 1519 1518
3 255 1520 1518
3 300 1520 255
3 512 1521 37
3 255 1521 512
3 390 191 512
3 259 542 191
3 515 87 542
3 467 457 87
3 419 593 457
3 110 418 456
3 418 466 89
3 466 514 543
3 514 260 192
3 260 392 510
3 36 1522 392
3 256 1522 36
3 80 1524 36
3 1523 1524 80
3 1523 1525 300
3 80 1525 1523
3 1526 1527 80
3 255 1527 1526
3 80 1528 1526
3 37 1528 80
3 37 1529 512
3 390 1529 37
3 390 259 191
3 259 515 542
3 515 467 87
3 467 419 457
3 419 110 593
3 504 502 366
3 366 502 364
3 504 367 505
3 504 366 367
3 504 505 502
3 502 505 503
3 502 503 365
3 502 365 364
3 366 365 367
3 366 364 365
3 367 503 505
3 367 365 503