OFF
1018 1024 0
0.5000000000 0.3338353382 0.3314878162
-0.4997665855 0.3340579100 0.3316922472
0.4999145123 0.3324491198 -0.0850789475
-0.4998520732 0.3326716916 -0.0848745164
0.4998520732 -0.3326716916 0.3337057966
-0.4999145123 -0.3324491198 0.3339102277
0.4997665855 -0.3340579100 -0.0828609670
-0.5000000000 -0.3338353382 -0.0826565360
0.4997892564 -0.0016356006 -0.3339102277
-0.4999773291 -0.0014130288 -0.3337057966
0.0000739634 0.3332535149 0.1233066499
-0.0000739634 -0.3332535149 0.1255246303
0.0000427438 0.0006931092 0.3326990219
-0.0000314084 0.1655180455 -0.2093923720
-0.0001053718 -0.1677354694 -0.2082833818
-0.4999459207 -0.1669310743 0.0001022155
0.4998206648 -0.1671536461 -0.0001022155
0.0000739634 0.3332535149 0.1233066499
-0.0000739634 -0.3332535149 0.1255246303
0.0000427438 0.0006931092 0.3326990219
-0.0000314084 0.1655180455 -0.2093923720
-0.0001053718 -0.1677354694 -0.2082833818
-0.0000312196 -0.3325604057 0.3338080121
0.4999260366 0.0005818233 0.3325968064
-0.4998405489 0.0008043951 0.3328012375
-0.4998719573 0.1663224406 -0.0010067747
0.4998946282 0.1660998688 -0.0012112057
0.4999260366 0.0005818233 0.3325968064
0.0001167072 0.3339466241 0.3315900317
-0.4998405489 0.0008043951 0.3328012375
0.0000312196 0.3325604057 -0.0849767319
-0.2498463111 0.3336557125 0.2274994486
0.2498890549 -0.3329626033 0.2296152135
-0.0000312196 -0.3325604057 0.3338080121
-0.0000940364 -0.0015243147 -0.3338080121
-0.2500043688 0.0820525084 -0.2715490843
0.2498419423 -0.0846855350 -0.2710968047
-0.0001167072 -0.3339466241 -0.0827587515
0.0001167072 0.3339466241 0.3315900317
0.2499942379 0.3328513174 0.0191138512
-0.2500369817 -0.3335444265 0.0214340472
-0.0001167072 -0.3339466241 -0.0827587515
0.0000312196 0.3325604057 -0.0849767319
0.2498789240 0.0819412225 -0.2716512998
-0.2500413505 -0.0845742491 -0.2709945892
-0.0000940364 -0.0015243147 -0.3338080121
-0.4999459207 -0.1669310743 0.0001022155
0.4998946282 0.1660998688 -0.0012112057
0.2499474085 -0.1659892912 0.3332024093
-0.2499358842 -0.1658780053 0.3333046248
0.2500213719 0.1672642237 0.3320934191
0.2499474085 -0.1659892912 0.3332024093
-0.4998719573 0.1663224406 -0.0010067747
0.4998206648 -0.1671536461 -0.0001022155
-0.2498619209 0.1673755096 0.3321956346
0.2500213719 0.1672642237 0.3320934191
-0.2499358842 -0.1658780053 0.3333046248
-0.2498619209 0.1673755096 0.3321956346
-0.2498890549 0.3329626033 0.0192160668
0.2499942379 0.3328513174 0.0191138512
-0.2498890549 0.3329626033 0.0192160668
-0.4998093294 0.3333648008 0.1234088654
0.2498463111 -0.3336557125 0.0213318316
0.4998093294 -0.3333648008 0.1254224148
-0.2499942379 -0.3328513174 0.2297174290
0.2498890549 -0.3329626033 0.2296152135
-0.2500043688 0.0820525084 -0.2715490843
0.2498789240 0.0819412225 -0.2716512998
-0.4999147012 0.1656293314 -0.2092901565
-0.2499417408 0.2490948686 -0.1471334442
0.4997779210 -0.1678467553 -0.2083855973
0.2498306069 -0.2508966897 -0.1455721744
-0.2500526859 -0.2507854038 -0.1454699589
0.2498306069 -0.2508966897 -0.1455721744
-0.4998562531 0.0835634178 0.1658972314
-0.4999302165 -0.2496900971 0.1670062216
-0.4999616249 -0.0841720515 -0.1668017905
-0.4998562531 0.0835634178 0.1658972314
0.4999103324 0.0833408460 0.1656928003
0.4998049606 -0.0843946234 -0.1670062216
0.4998363690 -0.2499126689 0.1668017905
0.4999103324 0.0833408460 0.1656928003
0.2500369817 0.3335444265 0.2273972330
-0.2498463111 0.3336557125 0.2274994486
0.2500369817 0.3335444265 0.2273972330
0.4999572562 0.3331422290 0.1232044344
-0.2499942379 -0.3328513174 0.2297174290
-0.4999572562 -0.3331422290 0.1256268458
0.2498463111 -0.3336557125 0.0213318316
-0.2500369817 -0.3335444265 0.0214340472
0.2499415520 0.2489835827 -0.1472356597
-0.2499417408 0.2490948686 -0.1471334442
0.2499415520 0.2489835827 -0.1472356597
0.4998518844 0.1654067596 -0.2094945876
-0.2500526859 -0.2507854038 -0.1454699589
-0.4999886646 -0.1676241835 -0.2081811663
0.2498419423 -0.0846855350 -0.2710968047
-0.2500413505 -0.0845742491 -0.2709945892
-0.4999886646 -0.1676241835 -0.2081811663
-0.4999572562 -0.3331422290 0.1256268458
0.4998518844 0.1654067596 -0.2094945876
0.4999572562 0.3331422290 0.1232044344
0.0000057621 -0.1659336483 0.3332535170
0.2499104268 -0.3326160487 0.3337569044
-0.2499728659 -0.3325047628 0.3338591199
0.0000057621 -0.1659336483 0.3332535170
0.2499843902 0.0006374662 0.3326479142
0.4999630183 0.1672085807 0.3320423113
0.4998890549 -0.1660449342 0.3331513015
0.2499843902 0.0006374662 0.3326479142
-0.4998093294 0.3333648008 0.1234088654
-0.4999147012 0.1656293314 -0.2092901565
0.4998093294 -0.3333648008 0.1254224148
0.4997779210 -0.1678467553 -0.2083855973
0.0000797255 0.1673198666 0.3321445268
-0.2498249392 0.3340022670 0.3316411395
0.2500583536 0.3338909811 0.3315389240
0.0000797255 0.1673198666 0.3321445268
-0.2498989025 0.0007487521 0.3327501297
-0.4998775306 -0.1658223624 0.3333557326
-0.4998035672 0.1674311525 0.3322467423
-0.2498989025 0.0007487521 0.3327501297
-0.1249289177 0.3327615045 -0.0328803326
-0.2499104268 0.3326160487 -0.0849256242
0.2499728659 0.3325047628 -0.0850278397
0.1250341006 0.3330524161 0.0712102506
-0.3748491921 0.3331637020 0.0713124661
-0.1249075458 0.3331080591 0.0712613583
-0.3748278202 0.3335102566 0.1754541570
-0.3748491921 0.3331637020 0.0713124661
0.3748278202 -0.3335102566 0.0733771232
0.1248861738 -0.3334546137 0.0734282310
0.3748491921 -0.3331637020 0.1775188141
0.3748278202 -0.3335102566 0.0733771232
-0.1250127287 -0.3327058615 0.2817627206
-0.2499728659 -0.3325047628 0.3338591199
0.2499104268 -0.3326160487 0.3337569044
0.1249075458 -0.3331080591 0.1775699219
-0.1250492026 0.0402640968 -0.3026785482
-0.2500356828 -0.0014686717 -0.3337569044
0.2498476100 -0.0015799577 -0.3338591199
0.1248924438 0.0402084539 -0.3027296560
-0.3749282210 0.2073621000 -0.1782118004
-0.3749595350 0.1238409199 -0.2404196204
-0.1250178886 0.1237852769 -0.2404707282
-0.3749282210 0.2073621000 -0.1782118004
0.3748042639 -0.2093717225 -0.1769788859
0.3748155994 -0.0431605678 -0.3025035162
0.1248626175 -0.2093160795 -0.1769277781
0.3748042639 -0.2093717225 -0.1769788859
-0.1250846966 -0.2923660139 -0.1141143552
-0.2500583536 -0.3338909811 -0.0827076437
0.2498249392 -0.3340022670 -0.0828098593
0.1248626175 -0.2093160795 -0.1769277781
-0.4998932348 -0.0830633396 0.1664517265
-0.4998035672 0.1674311525 0.3322467423
-0.4998775306 -0.1658223624 0.3333557326
-0.4998932348 -0.0830633396 0.1664517265
-0.4999089390 -0.0003043168 -0.0004522796
-0.4999246432 0.0824547059 -0.1673562856
-0.4998192714 0.2501901753 0.1653427363
-0.4999089390 -0.0003043168 -0.0004522796
0.4998576465 -0.0005268887 -0.0006567106
0.4999473141 0.2499676035 0.1651383052
0.4998419423 0.0822321341 -0.1675607167
0.4998576465 -0.0005268887 -0.0006567106
0.4998733507 -0.0832859114 0.1662472954
0.4998890549 -0.1660449342 0.3331513015
0.4999630183 0.1672085807 0.3320423113
0.4998733507 -0.0832859114 0.1662472954
0.1250768445 0.3337455253 0.2794936324
0.2500583536 0.3338909811 0.3315389240
-0.2498249392 0.3340022670 0.3316411395
-0.1248861738 0.3334546137 0.1754030492
0.3749971189 0.3333433278 0.1753008337
0.1250554725 0.3333989707 0.1753519415
0.3749757470 0.3329967732 0.0711591428
0.3749971189 0.3333433278 0.1753008337
-0.3749757470 -0.3329967732 0.1776721374
-0.1250341006 -0.3330524161 0.1776210296
-0.3749971189 -0.3333433278 0.0735304465
-0.3749757470 -0.3329967732 0.1776721374
0.1248648019 -0.3338011683 -0.0307134599
0.2498249392 -0.3340022670 -0.0828098593
-0.2500583536 -0.3338909811 -0.0827076437
-0.1250554725 -0.3333989707 0.0734793387
0.1249863858 0.2907719942 -0.1161061958
0.2499728659 0.3325047628 -0.0850278397
-0.2499104268 0.3326160487 -0.0849256242
-0.1249552606 0.2908276372 -0.1160550881
0.3748967182 0.2071951711 -0.1783651236
0.1249550718 0.2072508141 -0.1783140159
0.3748654042 0.1236739910 -0.2405729437
0.3748967182 0.2071951711 -0.1783651236
-0.3750206752 -0.2092047936 -0.1768255626
-0.1250790288 -0.2092604366 -0.1768766704
-0.3750150075 -0.1260992163 -0.2395878777
-0.3750206752 -0.2092047936 -0.1768255626
0.1248739530 -0.0431049248 -0.3024524084
0.2498476100 -0.0015799577 -0.3338591199
-0.2500356828 -0.0014686717 -0.3337569044
-0.1250676934 -0.0430492819 -0.3024013007
-0.4999943323 -0.2507297608 -0.1454188511
-0.4999616249 -0.0841720515 -0.1668017905
-0.4999302165 -0.2496900971 0.1670062216
-0.4999515884 -0.2500366516 0.0628645307
0.4998732563 0.1657533142 -0.1053528966
0.4998419423 0.0822321341 -0.1675607167
0.4999473141 0.2499676035 0.1651383052
0.4999358842 0.3327956744 0.0190627435
0.1249580945 -0.2492748485 0.3335052107
0.1249950762 -0.0826480910 0.3329507156
0.3748997409 -0.2493304914 0.3334541029
0.1249580945 -0.2492748485 0.3335052107
-0.1249835519 -0.2492192055 0.3335563185
-0.3749251983 -0.2491635626 0.3336074262
-0.1249465702 -0.0825924481 0.3330018234
-0.1249835519 -0.2492192055 0.3335563185
0.3749737043 0.0839230235 0.3323451127
0.1250320579 0.0839786664 0.3323962205
0.3750106860 0.2505497809 0.3317906176
0.3749737043 0.0839230235 0.3323451127
0.3749367226 -0.0827037340 0.3328996078
0.3748997409 -0.2493304914 0.3334541029
0.1249950762 -0.0826480910 0.3329507156
0.3749367226 -0.0827037340 0.3328996078
-0.4998307013 0.3330182462 0.0192671745
-0.4998192714 0.2501901753 0.1653427363
-0.4999246432 0.0824547059 -0.1673562856
-0.4998933293 0.1659758860 -0.1051484656
0.4998149971 -0.2502592235 0.0626600996
0.4998363690 -0.2499126689 0.1668017905
0.4998049606 -0.0843946234 -0.1670062216
0.4997722533 -0.2509523326 -0.1456232822
-0.1248726068 0.2506610668 0.3318928332
-0.1249095885 0.0840343094 0.3324473283
-0.3748142532 0.2507167098 0.3319439409
-0.1248726068 0.2506610668 0.3318928332
0.1250690396 0.2506054239 0.3318417254
0.3750106860 0.2505497809 0.3317906176
0.1250320579 0.0839786664 0.3323962205
0.1250690396 0.2506054239 0.3318417254
-0.3748882166 -0.0825368051 0.3330529311
-0.1249465702 -0.0825924481 0.3330018234
-0.3749251983 -0.2491635626 0.3336074262
-0.3748882166 -0.0825368051 0.3330529311
-0.3748512349 0.0840899523 0.3324984360
-0.3748142532 0.2507167098 0.3319439409
-0.1249095885 0.0840343094 0.3324473283
-0.3748512349 0.0840899523 0.3324984360
-0.1249075458 0.3331080591 0.0712613583
0.0000525915 0.3329069603 0.0191649590
-0.3748705641 0.3328171475 -0.0328292248
-0.1249289177 0.3327615045 -0.0328803326
0.1250127287 0.3327058615 -0.0329314403
0.3749543751 0.3326502186 -0.0329825481
0.1250127287 0.3327058615 -0.0329314403
0.0000525915 0.3329069603 0.0191649590
-0.2498676830 0.3333091579 0.1233577577
-0.3748705641 0.3328171475 -0.0328292248
-0.2498676830 0.3333091579 0.1233577577
-0.1248861738 0.3334546137 0.1754030492
-0.4997879575 0.3337113554 0.2275505563
-0.3748064483 0.3338568112 0.2795958479
-0.4998307013 0.3330182462 0.0192671745
-0.3748278202 0.3335102566 0.1754541570
0.2498676830 -0.3333091579 0.1254735225
0.3748064483 -0.3338568112 -0.0307645677
0.2498676830 -0.3333091579 0.1254735225
0.1249075458 -0.3331080591 0.1775699219
0.4998307013 -0.3330182462 0.2295641057
0.3748705641 -0.3328171475 0.2816605050
0.4997879575 -0.3337113554 0.0212807239
0.3748491921 -0.3331637020 0.1775188141
-0.1250341006 -0.3330524161 0.1776210296
-0.0000525915 -0.3329069603 0.2296663212
-0.3749543751 -0.3326502186 0.2818138283
-0.1250127287 -0.3327058615 0.2817627206
0.1249289177 -0.3327615045 0.2817116128
0.3748705641 -0.3328171475 0.2816605050
0.1249289177 -0.3327615045 0.2817116128
-0.0000525915 -0.3329069603 0.2296663212
-0.1250178886 0.1237852769 -0.2404707282
-0.0000627224 0.0819968654 -0.2716001921
-0.3749908490 0.0403197398 -0.3026274405
-0.1250492026 0.0402640968 -0.3026785482
0.1248924438 0.0402084539 -0.3027296560
0.3748340902 0.0401528109 -0.3027807637
-0.0000627224 0.0819968654 -0.2716001921
0.1249237578 0.1237296340 -0.2405218359
-0.3749595350 0.1238409199 -0.2404196204
-0.4998833872 0.2491505115 -0.1470823364
-0.3749908490 0.0403197398 -0.3026274405
-0.4999460152 0.0821081513 -0.2714979765
-0.2499730548 0.1655736885 -0.2093412643
-0.1249865746 0.2073064571 -0.1782629081
-0.3748969070 0.2908832801 -0.1160039803
-0.2499730548 0.1655736885 -0.2093412643
0.3748099316 -0.1262661451 -0.2397412010
0.4997722533 -0.2509523326 -0.1456232822
0.4997835887 -0.0847411780 -0.2711479125
0.3748099316 -0.1262661451 -0.2397412010
0.1248682853 -0.1262105022 -0.2396900933
0.2498362746 -0.1677911123 -0.2083344896
0.3747985962 -0.2924772998 -0.1142165707
0.2498362746 -0.1677911123 -0.2083344896
-0.1250790288 -0.2092604366 -0.1768766704
-0.0001110395 -0.2508410467 -0.1455210667
-0.3750263429 -0.2923103710 -0.1140632474
-0.1250846966 -0.2923660139 -0.1141143552
0.1248569498 -0.2924216569 -0.1141654630
0.3747985962 -0.2924772998 -0.1142165707
0.1248569498 -0.2924216569 -0.1141654630
-0.0001110395 -0.2508410467 -0.1455210667
-0.4998484010 0.0421839065 0.2493492344
-0.4999010869 -0.0416838282 0.0829997235
-0.4998114193 0.2088106639 0.2487947393
-0.4998484010 0.0421839065 0.2493492344
-0.4998853827 -0.1244428510 0.2499037295
-0.4999223644 -0.2910696084 0.2504582246
-0.4999380686 -0.2083105857 0.0835542186
-0.4998853827 -0.1244428510 0.2499037295
-0.4999167911 0.0410751945 -0.0839042826
-0.4999537728 -0.1255515629 -0.0833497875
-0.4999694770 -0.0427925402 -0.2502537936
-0.4999167911 0.0410751945 -0.0839042826
-0.4998641052 0.1249429292 0.0824452284
-0.4998114193 0.2088106639 0.2487947393
-0.4999010869 -0.0416838282 0.0829997235
-0.4998641052 0.1249429292 0.0824452284
0.4999024803 0.1247203574 0.0822407973
0.4998654986 -0.0419064001 0.0827952924
0.4999551662 0.2085880921 0.2485903083
0.4999024803 0.1247203574 0.0822407973
0.4998497944 0.0408526227 -0.0841087137
0.4997971085 -0.0430151120 -0.2504582246
0.4998128127 -0.1257741347 -0.0835542186
0.4998497944 0.0408526227 -0.0841087137
0.4998812028 -0.1246654228 0.2496992985
0.4998285169 -0.2085331575 0.0833497875
0.4998442211 -0.2912921803 0.2502537936
0.4998812028 -0.1246654228 0.2496992985
0.4999181845 0.0419613346 0.2491448034
0.4999551662 0.2085880921 0.2485903083
0.4998654986 -0.0419064001 0.0827952924
0.4999181845 0.0419613346 0.2491448034
0.1250554725 0.3333989707 0.1753519415
0.0000953353 0.3336000695 0.2274483408
0.3750184908 0.3336898824 0.2794425246
0.1250768445 0.3337455253 0.2794936324
-0.1248648019 0.3338011683 0.2795447401
-0.3748064483 0.3338568112 0.2795958479
-0.1248648019 0.3338011683 0.2795447401
0.0000953353 0.3336000695 0.2274483408
0.2500156098 0.3331978720 0.1232555421
0.3750184908 0.3336898824 0.2794425246
0.2500156098 0.3331978720 0.1232555421
0.1250341006 0.3330524161 0.0712102506
0.4999358842 0.3327956744 0.0190627435
0.3749543751 0.3326502186 -0.0329825481
0.4999786281 0.3334887836 0.2273461253
0.3749757470 0.3329967732 0.0711591428
-0.2500156098 -0.3331978720 0.1255757381
-0.3749543751 -0.3326502186 0.2818138283
-0.2500156098 -0.3331978720 0.1255757381
-0.1250554725 -0.3333989707 0.0734793387
-0.4999786281 -0.3334887836 0.0214851549
-0.3750184908 -0.3336898824 -0.0306112444
-0.4999358842 -0.3327956744 0.2297685367
-0.3749971189 -0.3333433278 0.0735304465
0.1248861738 -0.3334546137 0.0734282310
-0.0000953353 -0.3336000695 0.0213829394
0.3748064483 -0.3338568112 -0.0307645677
0.1248648019 -0.3338011683 -0.0307134599
-0.1250768445 -0.3337455253 -0.0306623522
-0.3750184908 -0.3336898824 -0.0306112444
-0.1250768445 -0.3337455253 -0.0306623522
-0.0000953353 -0.3336000695 0.0213829394
0.1249550718 0.2072508141 -0.1783140159
-0.0000000944 0.2490392256 -0.1471845520
0.3749280321 0.2907163512 -0.1161573036
0.1249863858 0.2907719942 -0.1161061958
-0.1249552606 0.2908276372 -0.1160550881
-0.3748969070 0.2908832801 -0.1160039803
-0.0000000944 0.2490392256 -0.1471845520
-0.1249865746 0.2073064571 -0.1782629081
0.2499102380 0.1654624026 -0.2094434798
0.3749280321 0.2907163512 -0.1161573036
0.2499102380 0.1654624026 -0.2094434798
0.1249237578 0.1237296340 -0.2405218359
0.4998205704 0.0818855795 -0.2717024076
0.3748340902 0.0401528109 -0.3027807637
0.4998831983 0.2489279397 -0.1472867675
0.3748654042 0.1236739910 -0.2405729437
-0.2500470182 -0.1676798264 -0.2082322741
-0.3750263429 -0.2923103710 -0.1140632474
-0.2500470182 -0.1676798264 -0.2082322741
-0.1250733611 -0.1261548592 -0.2396389855
-0.4999829969 -0.0845186061 -0.2709434814
-0.3750093398 -0.0429936389 -0.3023501929
-0.4999943323 -0.2507297608 -0.1454188511
-0.3750150075 -0.1260992163 -0.2395878777
0.1248682853 -0.1262105022 -0.2396900933
-0.0000997041 -0.0846298920 -0.2710456970
0.3748155994 -0.0431605678 -0.3025035162
0.1248739530 -0.0431049248 -0.3024524084
-0.1250676934 -0.0430492819 -0.3024013007
-0.3750093398 -0.0429936389 -0.3023501929
-0.0000997041 -0.0846298920 -0.2710456970
-0.1250733611 -0.1261548592 -0.2396389855
-0.4999729604 -0.2503832062 -0.0412771602
-0.4999672926 -0.1672776289 -0.1040394754
-0.4999829969 -0.0845186061 -0.2709434814
-0.4999672926 -0.1672776289 -0.1040394754
-0.4999515884 -0.2500366516 0.0628645307
-0.4999358842 -0.3327956744 0.2297685367
-0.4999729604 -0.2503832062 -0.0412771602
-0.4999786281 -0.3334887836 0.0214851549
0.4998831983 0.2489279397 -0.1472867675
0.4999045703 0.2492744943 -0.0431450766
0.4998205704 0.0818855795 -0.2717024076
0.4998732563 0.1657533142 -0.1053528966
0.4999259422 0.2496210489 0.0609966143
0.4999786281 0.3334887836 0.2273461253
0.4999259422 0.2496210489 0.0609966143
0.4999045703 0.2492744943 -0.0431450766
0.1249765853 -0.1659614698 0.3332279631
-0.0000127287 -0.2492470270 0.3335307646
0.0000242530 -0.0826202696 0.3329762695
0.1249765853 -0.1659614698 0.3332279631
0.2499289177 -0.2493026700 0.3334796568
0.3748812500 -0.3326438702 0.3337313505
0.1249396036 -0.3325882272 0.3337824582
0.2499289177 -0.2493026700 0.3334796568
-0.2499543751 -0.2491913841 0.3335818723
-0.1250020428 -0.3325325843 0.3338335660
-0.3749436891 -0.3324769413 0.3338846738
-0.2499543751 -0.2491913841 0.3335818723
-0.1249650611 -0.1659058268 0.3332790709
0.0000242530 -0.0826202696 0.3329762695
-0.0000127287 -0.2492470270 0.3335307646
-0.1249650611 -0.1659058268 0.3332790709
0.2500028811 0.0839508449 0.3323706666
0.3749552134 0.0006096447 0.3326223603
0.1250135670 0.0006652877 0.3326734680
0.2500028811 0.0839508449 0.3323706666
0.3749921951 0.1672364022 0.3320678652
0.4999815092 0.2505219594 0.3317650637
0.4999445275 0.0838952020 0.3323195588
0.3749921951 0.1672364022 0.3320678652
0.3749182317 -0.1660171127 0.3331768554
0.4999075458 -0.0827315555 0.3328740539
0.4998705641 -0.2493583129 0.3334285490
0.3749182317 -0.1660171127 0.3331768554
0.2499658994 -0.0826759125 0.3329251617
0.1250135670 0.0006652877 0.3326734680
0.3749552134 0.0006096447 0.3326223603
0.2499658994 -0.0826759125 0.3329251617
-0.4998620153 0.2494970661 -0.0429406455
-0.4998406434 0.2498436207 0.0612010454
-0.4997879575 0.3337113554 0.2275505563
-0.4998406434 0.2498436207 0.0612010454
-0.4998933293 0.1659758860 -0.1051484656
-0.4999460152 0.0821081513 -0.2714979765
-0.4998620153 0.2494970661 -0.0429406455
-0.4998833872 0.2491505115 -0.1470823364
0.4997879575 -0.3337113554 0.0212807239
0.4997936252 -0.2506057781 -0.0414815913
0.4998307013 -0.3330182462 0.2295641057
0.4998149971 -0.2502592235 0.0626600996
0.4997992929 -0.1675002007 -0.1042439064
0.4997835887 -0.0847411780 -0.2711479125
0.4997992929 -0.1675002007 -0.1042439064
0.4997936252 -0.2506057781 -0.0414815913
-0.1248910977 0.1673476881 0.3321700807
0.0000982164 0.2506332454 0.3318672793
0.0000612347 0.0840064879 0.3324217744
-0.1248910977 0.1673476881 0.3321700807
-0.2498434300 0.2506888883 0.3319183870
-0.3747957623 0.3340300885 0.3316666934
-0.1248541160 0.3339744456 0.3316155856
-0.2498434300 0.2506888883 0.3319183870
0.2500398628 0.2505776024 0.3318161715
0.1250875304 0.3339188026 0.3315644778
0.3750291768 0.3338631596 0.3315133701
0.2500398628 0.2505776024 0.3318161715
0.1250505487 0.1672920452 0.3321189729
0.0000612347 0.0840064879 0.3324217744
0.0000982164 0.2506332454 0.3318672793
0.1250505487 0.1672920452 0.3321189729
-0.2499173934 -0.0825646266 0.3330273772
-0.3748697257 0.0007765736 0.3327756836
-0.1249280794 0.0007209307 0.3327245758
-0.2499173934 -0.0825646266 0.3330273772
-0.3749067074 -0.1658501838 0.3333301787
-0.4998960215 -0.2491357411 0.3336329801
-0.4998590398 -0.0825089836 0.3330784850
-0.3749067074 -0.1658501838 0.3333301787
-0.3748327440 0.1674033311 0.3322211885
-0.4998220581 0.0841177738 0.3325239899
-0.4997850764 0.2507445313 0.3319694948
-0.3748327440 0.1674033311 0.3322211885
-0.2498804117 0.0840621309 0.3324728821
-0.1249280794 0.0007209307 0.3327245758
-0.3748697257 0.0007765736 0.3327756836
-0.2498804117 0.0840621309 0.3324728821
-0.0624274771 0.3330075097 0.0452131587
-0.1874089863 0.3328620539 -0.0068321329
-0.0624381631 0.3328342324 -0.0068576868
-0.0624274771 0.3330075097 0.0452131587
-0.3123904954 0.3327165981 -0.0588774245
-0.3748812500 0.3326438702 -0.0849000703
-0.1249396036 0.3325882272 -0.0849511780
-0.1874089863 0.3328620539 -0.0068321329
0.1874927973 0.3326053122 -0.0589796400
0.1250020428 0.3325325843 -0.0850022858
0.3749436891 0.3324769413 -0.0850533936
0.3124743065 0.3327507680 -0.0069343484
0.0625326601 0.3328064109 -0.0068832407
0.1875034833 0.3327785895 -0.0069087946
0.0625540320 0.3331529655 0.0972584502
0.0625326601 0.3328064109 -0.0068832407
-0.3123584376 0.3332364300 0.0973351119
-0.3123477516 0.3334097072 0.1494059573
-0.4373506327 0.3329176968 -0.0067810251
-0.3123798095 0.3328898754 -0.0068065790
-0.1873769284 0.3333818858 0.1493804034
-0.1873876144 0.3332086085 0.0973095580
-0.0624061052 0.3333540643 0.1493548496
-0.1873769284 0.3333818858 0.1493804034
-0.4372972029 0.3337840833 0.2535732021
-0.4373078888 0.3336108060 0.2015023567
-0.3123263797 0.3337562618 0.2535476482
-0.4372972029 0.3337840833 0.2535732021
-0.4373292608 0.3332642514 0.0973606658
-0.4373506327 0.3329176968 -0.0067810251
-0.3123477516 0.3334097072 0.1494059573
-0.4373185748 0.3334375287 0.1494315112
0.3123477516 -0.3334097072 0.0994253229
0.3123584376 -0.3332364300 0.1514961683
0.4372972029 -0.3337840833 -0.0047419219
0.3123263797 -0.3337562618 -0.0047163680
0.1873876144 -0.3332086085 0.1515217222
0.1873769284 -0.3333818858 0.0994508768
0.0624167912 -0.3331807870 0.1515472761
0.1873876144 -0.3332086085 0.1515217222
0.4373506327 -0.3329176968 0.2556123054
0.4373399467 -0.3330909741 0.2035414599
0.3123798095 -0.3328898754 0.2556378592
0.4373506327 -0.3329176968 0.2556123054
0.4373185748 -0.3334375287 0.0993997690
0.4372972029 -0.3337840833 -0.0047419219
0.3123584376 -0.3332364300 0.1514961683
0.4373292608 -0.3332642514 0.1514706144
-0.0625433461 -0.3329796882 0.2036436754
-0.1875141692 -0.3329518668 0.2036692293
-0.0625326601 -0.3328064109 0.2557145209
-0.0625433461 -0.3329796882 0.2036436754
-0.3124636205 -0.3325774907 0.3078364741
-0.3749436891 -0.3324769413 0.3338846738
-0.1250020428 -0.3325325843 0.3338335660
-0.1875034833 -0.3327785895 0.2557400748
0.1874196723 -0.3326887766 0.3077342586
0.1249396036 -0.3325882272 0.3337824582
0.3748812500 -0.3326438702 0.3337313505
0.3123798095 -0.3328898754 0.2556378592
0.0624381631 -0.3328342324 0.2556889670
0.1874089863 -0.3328620539 0.2556634131
0.0624274771 -0.3330075097 0.2036181215
0.0624381631 -0.3328342324 0.2556889670
-0.0625403055 0.1028910712 -0.2560354601
-0.1875111287 0.1029188927 -0.2560099062
-0.0625559625 0.0611304811 -0.2871393701
-0.0625403055 0.1028910712 -0.2560354601
-0.3125132659 0.0194255340 -0.3181921724
-0.3750065059 -0.0014408503 -0.3337313505
-0.1250648596 -0.0014964932 -0.3337824582
-0.1875267857 0.0611583026 -0.2871138163
0.1873856839 0.0610748382 -0.2871904779
0.1248767868 -0.0015521362 -0.3338335660
0.3748184332 -0.0016077791 -0.3338846738
0.3123565071 0.0610470167 -0.2872160318
0.0624305177 0.1028632497 -0.2560610140
0.0624148607 0.0611026596 -0.2871649240
0.1873856839 0.0610748382 -0.2871904779
0.0624305177 0.1028632497 -0.2560610140
-0.4374371181 0.1447351257 -0.2248548884
-0.3124662949 0.1447073042 -0.2248804423
-0.4373901471 0.2700168958 -0.1315431584
-0.4374058041 0.2282563058 -0.1626470684
-0.4374684321 0.0612139456 -0.2870627085
-0.3124976089 0.0611861241 -0.2870882624
-0.4374527751 0.1029745356 -0.2559587985
-0.4374684321 0.0612139456 -0.2870627085
-0.1874798147 0.1864400728 -0.1938020862
-0.1875111287 0.1029188927 -0.2560099062
-0.0625089915 0.1864122513 -0.1938276401
-0.1874798147 0.1864400728 -0.1938020862
-0.3124193239 0.2699890743 -0.1315687123
-0.4373901471 0.2700168958 -0.1315431584
-0.3124662949 0.1447073042 -0.2248804423
-0.3124506379 0.1864678942 -0.1937765323
0.4372939263 -0.1470564502 -0.2240633992
0.3123231031 -0.1470286287 -0.2240378453
0.4372854247 -0.2717148162 -0.1299199265
0.4372882586 -0.2301620276 -0.1613010840
0.4372967602 -0.1055036616 -0.2554445568
0.4372995940 -0.0639508729 -0.2868257143
0.3123287708 -0.0639230514 -0.2868001605
0.4372967602 -0.1055036616 -0.2554445568
0.1873522799 -0.1470008073 -0.2240122914
0.0623814567 -0.1469729858 -0.2239867375
0.1873494461 -0.1885535959 -0.1926311339
0.1873522799 -0.1470008073 -0.2240122914
0.3123146015 -0.2716869948 -0.1298943726
0.4372854247 -0.2717148162 -0.1299199265
0.3123231031 -0.1470286287 -0.2240378453
0.3123202693 -0.1885814174 -0.1926566877
-0.0625950342 -0.2300507417 -0.1611988685
-0.1875658574 -0.2300229202 -0.1611733146
-0.0625978680 -0.2716035303 -0.1298177109
-0.0625950342 -0.2300507417 -0.1611988685
-0.3125423483 -0.3131006761 -0.0983854456
-0.3750291768 -0.3338631596 -0.0826820899
-0.1250875304 -0.3339188026 -0.0827331976
-0.1875686912 -0.2715757089 -0.1297921571
0.1873409445 -0.3132119620 -0.0984876611
0.1248541160 -0.3339744456 -0.0827843054
0.3747957623 -0.3340300885 -0.0828354132
0.3123146015 -0.2716869948 -0.1298943726
0.0623729552 -0.2716313518 -0.1298432648
0.1873437783 -0.2716591733 -0.1298688187
0.0623757890 -0.2300785631 -0.1612244224
0.0623729552 -0.2716313518 -0.1298432648
-0.4998747440 0.0002500391 0.1661744789
-0.4998668919 -0.0411294723 0.2496264820
-0.4999195778 -0.1249972070 0.0832769710
-0.4998747440 0.0002500391 0.1661744789
-0.4998299102 0.1254972852 0.2490719869
-0.4997850764 0.2507445313 0.3319694948
-0.4998220581 0.0841177738 0.3325239899
-0.4998299102 0.1254972852 0.2490719869
-0.4999038736 -0.2077562297 0.2501809771
-0.4998590398 -0.0825089836 0.3330784850
-0.4998960215 -0.2491357411 0.3336329801
-0.4999038736 -0.2077562297 0.2501809771
-0.4999117257 -0.1663767183 0.1667289740
-0.4999195778 -0.1249972070 0.0832769710
-0.4998668919 -0.0411294723 0.2496264820
-0.4999117257 -0.1663767183 0.1667289740
-0.4999352820 -0.0422381842 -0.0836270351
-0.4998904482 0.0830090619 -0.0007295271
-0.4999274299 -0.0836176956 -0.0001750320
-0.4999352820 -0.0422381842 -0.0836270351
-0.4999431341 -0.0008586728 -0.1670790381
-0.4999509862 0.0405208386 -0.2505310411
-0.4998983003 0.1243885733 -0.0841815302
-0.4999431341 -0.0008586728 -0.1670790381
-0.4998377623 0.1668767966 0.1656199838
-0.4998456144 0.2082563080 0.0821679808
-0.4997929285 0.2921240426 0.2485174918
-0.4998377623 0.1668767966 0.1656199838
-0.4998825961 0.0416295505 0.0827224759
-0.4999274299 -0.0836176956 -0.0001750320
-0.4998904482 0.0830090619 -0.0007295271
-0.4998825961 0.0416295505 0.0827224759
0.4998839895 0.0414069787 0.0825180448
0.4998761374 0.0827864901 -0.0009339582
0.4998391557 -0.0838402674 -0.0003794631
0.4998839895 0.0414069787 0.0825180448
0.4999288233 0.1666542248 0.1654155528
0.4999736571 0.2919014708 0.2483130607
0.4999209712 0.2080337361 0.0819635497
0.4999288233 0.1666542248 0.1654155528
0.4998234515 -0.0010812446 -0.1672834691
0.4998682853 0.1241660014 -0.0843859612
0.4998155994 0.0402982667 -0.2507354722
0.4998234515 -0.0010812446 -0.1672834691
0.4998313036 -0.0424607560 -0.0838314661
0.4998391557 -0.0838402674 -0.0003794631
0.4998761374 0.0827864901 -0.0009339582
0.4998313036 -0.0424607560 -0.0838314661
0.4998548599 -0.1665992902 0.1665245430
0.4998996937 -0.0413520441 0.2494220509
0.4998470078 -0.1252197788 0.0830725400
0.4998548599 -0.1665992902 0.1665245430
0.4998627120 -0.2079788015 0.2499765460
0.4998705641 -0.2493583129 0.3334285490
0.4999075458 -0.0827315555 0.3328740539
0.4998627120 -0.2079788015 0.2499765460
0.4999366754 0.1252747134 0.2488675558
0.4999445275 0.0838952020 0.3323195588
0.4999815092 0.2505219594 0.3317650637
0.4999366754 0.1252747134 0.2488675558
0.4998918416 0.0000274673 0.1659700479
0.4998470078 -0.1252197788 0.0830725400
0.4998996937 -0.0413520441 0.2494220509
0.4998918416 0.0000274673 0.1659700479
0.0625754039 0.3334995201 0.2014001411
0.1875462271 0.3334716986 0.2013745873
0.0625860899 0.3336727974 0.2534709866
0.0625754039 0.3334995201 0.2014001411
0.3125384222 0.3337904317 0.3054907243
0.3750291768 0.3338631596 0.3315133701
0.1250875304 0.3339188026 0.3315644778
0.1875569131 0.3336449759 0.2534454327
-0.1873448705 0.3339017177 0.3055929398
-0.1248541160 0.3339744456 0.3316155856
-0.3747957623 0.3340300885 0.3316666934
-0.3123263797 0.3337562618 0.2535476482
-0.0623847333 0.3337006189 0.2534965405
-0.1873555565 0.3337284404 0.2535220944
-0.0623954193 0.3335273416 0.2014256950
-0.0623847333 0.3337006189 0.2534965405
0.3125063644 0.3332705999 0.1492781879
0.3124956784 0.3330973226 0.0972073425
0.4374985595 0.3335893330 0.2533943249
0.3125277363 0.3336171544 0.2534198788
0.1875248552 0.3331251440 0.0972328963
0.1875355412 0.3332984213 0.1493037418
0.0625540320 0.3331529655 0.0972584502
0.1875248552 0.3331251440 0.0972328963
0.4374451297 0.3327229465 -0.0069599023
0.4374665016 0.3330695011 0.0971817886
0.3124743065 0.3327507680 -0.0069343484
0.4374451297 0.3327229465 -0.0069599023
0.4374878735 0.3334160557 0.2013234795
0.4374985595 0.3335893330 0.2533943249
0.3124956784 0.3330973226 0.0972073425
0.4374665016 0.3330695011 0.0971817886
-0.3124956784 -0.3330973226 0.1516239377
-0.3125063644 -0.3332705999 0.0995530923
-0.4374451297 -0.3327229465 0.2557911825
-0.3124743065 -0.3327507680 0.2557656286
-0.1875355412 -0.3332984213 0.0995275384
-0.1875248552 -0.3331251440 0.1515983839
-0.0625647180 -0.3333262428 0.0995019845
-0.1875355412 -0.3332984213 0.0995275384
-0.4374985595 -0.3335893330 -0.0045630447
-0.4374771875 -0.3332427784 0.0995786462
-0.3125277363 -0.3336171544 -0.0045885986
-0.4374985595 -0.3335893330 -0.0045630447
-0.4374558156 -0.3328962238 0.2037203371
-0.4374451297 -0.3327229465 0.2557911825
-0.3125063644 -0.3332705999 0.0995530923
-0.4374771875 -0.3332427784 0.0995786462
0.0623954193 -0.3335273416 0.0474055852
0.1873555565 -0.3337284404 -0.0046908142
0.0623847333 -0.3337006189 -0.0046652603
0.0623954193 -0.3335273416 0.0474055852
0.3123156937 -0.3339295391 -0.0567872135
0.3747957623 -0.3340300885 -0.0828354132
0.1248541160 -0.3339744456 -0.0827843054
0.1873555565 -0.3337284404 -0.0046908142
-0.1875675990 -0.3338182532 -0.0566849980
-0.1250875304 -0.3339188026 -0.0827331976
-0.3750291768 -0.3338631596 -0.0826820899
-0.3125277363 -0.3336171544 -0.0045885986
-0.0625860899 -0.3336727974 -0.0046397064
-0.1875569131 -0.3336449759 -0.0046141525
-0.0625647180 -0.3333262428 0.0995019845
-0.0625860899 -0.3336727974 -0.0046397064
0.0624774887 0.2281450199 -0.1627492839
0.1874483119 0.2281171984 -0.1627748378
0.0625088027 0.3116662000 -0.1005414639
0.0624774887 0.2281450199 -0.1627492839
0.3124504490 0.3116105570 -0.1005925716
0.3749436891 0.3324769413 -0.0850533936
0.1250020428 0.3325325843 -0.0850022858
0.1874796259 0.3116383785 -0.1005670178
-0.1874328437 0.3117218429 -0.1004903561
-0.1249396036 0.3325882272 -0.0849511780
-0.3748812500 0.3326438702 -0.0849000703
-0.3124036669 0.3117496644 -0.1004648022
-0.0624933345 0.2281728413 -0.1627237300
-0.0624620205 0.3116940214 -0.1005159100
-0.1874641577 0.2282006628 -0.1626981762
-0.0624933345 0.2281728413 -0.1627237300
0.3124034781 0.1863287869 -0.1939043017
0.3123878211 0.1445681968 -0.2250082117
0.4374056152 0.2698221455 -0.1317220355
0.3124347921 0.2698499670 -0.1316964817
0.1874169979 0.1445960183 -0.2249826579
0.1874326549 0.1863566083 -0.1938787478
0.0624461747 0.1446238398 -0.2249571040
0.1874169979 0.1445960183 -0.2249826579
0.4373273303 0.0610191952 -0.2872415857
0.4373429873 0.1027797853 -0.2561376757
0.3123565071 0.0610470167 -0.2872160318
0.4373273303 0.0610191952 -0.2872415857
0.4373899583 0.2280615554 -0.1628259456
0.4374056152 0.2698221455 -0.1317220355
0.3123878211 0.1445681968 -0.2250082117
0.4373586443 0.1445403753 -0.2250337656
-0.3125338467 -0.1884423100 -0.1925289183
-0.3125310129 -0.1468895214 -0.2239100759
-0.4375103376 -0.2715200659 -0.1297410493
-0.3125395144 -0.2715478874 -0.1297666032
-0.1875601897 -0.1469173428 -0.2239356298
-0.1875630235 -0.1884701315 -0.1925544722
-0.0625893665 -0.1469451643 -0.2239611837
-0.1875601897 -0.1469173428 -0.2239356298
-0.4374961683 -0.0637561225 -0.2866468372
-0.4374990022 -0.1053089112 -0.2552656796
-0.3125253451 -0.0637839440 -0.2866723911
-0.4374961683 -0.0637561225 -0.2866468372
-0.4375075038 -0.2299672772 -0.1611222069
-0.4375103376 -0.2715200659 -0.1297410493
-0.3125310129 -0.1468895214 -0.2239100759
-0.4375018360 -0.1468616999 -0.2238845220
0.0623842906 -0.1054201971 -0.2553678951
0.1873579476 -0.0638952299 -0.2867746066
0.0623871244 -0.0638674084 -0.2867490527
0.0623842906 -0.1054201971 -0.2553678951
0.3123316047 -0.0223702627 -0.3181813180
0.3748184332 -0.0016077791 -0.3338846738
0.1248767868 -0.0015521362 -0.3338335660
0.1873579476 -0.0638952299 -0.2867746066
-0.1875516881 -0.0222589768 -0.3180791025
-0.1250648596 -0.0014964932 -0.3337824582
-0.3750065059 -0.0014408503 -0.3337313505
-0.3125253451 -0.0637839440 -0.2866723911
-0.0625865326 -0.1053923756 -0.2553423412
-0.0625836987 -0.0638395870 -0.2867234988
-0.1875545219 -0.0638117655 -0.2866979449
-0.0625865326 -0.1053923756 -0.2553423412
-0.4999701265 -0.2088304176 -0.0726583178
-0.4999971661 -0.2922825495 -0.1140376936
-0.4999914984 -0.2091769722 -0.1768000087
-0.4999701265 -0.2088304176 -0.0726583178
-0.4999858307 -0.1260713948 -0.2395623239
-0.4999694770 -0.0427925402 -0.2502537936
-0.4999537728 -0.1255515629 -0.0833497875
-0.4999644588 -0.1257248402 -0.1354206330
-0.4999544223 -0.2915894403 0.0942456883
-0.4999380686 -0.2083105857 0.0835542186
-0.4999223644 -0.2910696084 0.2504582246
-0.4999330504 -0.2912428857 0.1983873792
-0.4999757942 -0.2919359949 -0.0098960026
-0.4999487546 -0.2084838630 0.0314833731
-0.4999544223 -0.2915894403 0.0942456883
-0.4999757942 -0.2919359949 -0.0098960026
0.4998938843 0.2491012170 -0.0952159220
0.4998625703 0.1655800369 -0.1574237421
0.4998839422 0.1659265915 -0.0532820512
0.4998938843 0.2491012170 -0.0952159220
0.4998312563 0.0820588568 -0.2196315621
0.4998155994 0.0402982667 -0.2507354722
0.4998682853 0.1241660014 -0.0843859612
0.4998625703 0.1655800369 -0.1574237421
0.4999366281 0.2497943262 0.1130674598
0.4999209712 0.2080337361 0.0819635497
0.4999736571 0.2919014708 0.2483130607
0.4999679421 0.3333155063 0.1752752798
0.4999152562 0.2494477716 0.0089257689
0.4999465702 0.3329689517 0.0711335889
0.4999251983 0.3326223971 -0.0330081020
0.4999152562 0.2494477716 0.0089257689
0.0624819283 -0.2076042484 0.3333793639
0.1874527515 -0.2076320699 0.3333538100
0.0624634375 -0.2909176271 0.3336566114
0.0624819283 -0.2076042484 0.3333793639
0.0625004192 -0.1242908697 0.3331021163
0.0625189100 -0.0409774909 0.3328248688
0.1874712424 -0.1243186911 0.3330765624
0.0625004192 -0.1242908697 0.3331021163
0.3124050838 -0.2909732701 0.3336055036
0.3124235747 -0.2076598913 0.3333282561
0.4373759070 -0.2910010915 0.3335799498
0.3124050838 -0.2909732701 0.3336055036
0.1874342607 -0.2909454486 0.3336310575
0.0624634375 -0.2909176271 0.3336566114
0.1874527515 -0.2076320699 0.3333538100
0.1874342607 -0.2909454486 0.3336310575
-0.1874782089 -0.2908619842 0.3337077192
-0.1874597181 -0.2075486054 0.3334304716
-0.0625073857 -0.2908898056 0.3336821653
-0.1874782089 -0.2908619842 0.3337077192
-0.3124490321 -0.2908341627 0.3337332731
-0.4374198553 -0.2908063412 0.3337588269
-0.3124305413 -0.2075207839 0.3334560255
-0.3124490321 -0.2908341627 0.3337332731
-0.0624704040 -0.1242630482 0.3331276702
-0.1874412272 -0.1242352267 0.3331532241
-0.0624519132 -0.0409496694 0.3328504226
-0.0624704040 -0.1242630482 0.3331276702
-0.0624888949 -0.2075764269 0.3334049177
-0.0625073857 -0.2908898056 0.3336821653
-0.1874597181 -0.2075486054 0.3334304716
-0.0624888949 -0.2075764269 0.3334049177
0.3124790472 0.0422802448 0.3324965134
0.3124975381 0.1255936236 0.3322192659
0.4374498704 0.0422524234 0.3324709596
0.3124790472 0.0422802448 0.3324965134
0.1875082240 0.0423080663 0.3325220673
0.0625374009 0.0423358878 0.3325476212
0.1875267149 0.1256214450 0.3322448198
0.1875082240 0.0423080663 0.3325220673
0.4374868521 0.2088791808 0.3319164645
0.3125160289 0.2089070023 0.3319420183
0.4375053430 0.2921925595 0.3316392169
0.4374868521 0.2088791808 0.3319164645
0.4374683613 0.1255658021 0.3321937120
0.4374498704 0.0422524234 0.3324709596
0.3124975381 0.1255936236 0.3322192659
0.4374683613 0.1255658021 0.3321937120
0.4374128887 -0.1243743341 0.3330254547
0.3124420655 -0.1243465126 0.3330510085
0.4374313796 -0.0410609554 0.3327482071
0.4374128887 -0.1243743341 0.3330254547
0.4373943979 -0.2076877128 0.3333027022
0.4373759070 -0.2910010915 0.3335799498
0.3124235747 -0.2076598913 0.3333282561
0.4373943979 -0.2076877128 0.3333027022
0.1874897332 -0.0410053124 0.3327993149
0.1874712424 -0.1243186911 0.3330765624
0.0625189100 -0.0409774909 0.3328248688
0.1874897332 -0.0410053124 0.3327993149
0.3124605564 -0.0410331339 0.3327737610
0.4374313796 -0.0410609554 0.3327482071
0.3124420655 -0.1243465126 0.3330510085
0.3124605564 -0.0410331339 0.3327737610
-0.4998513293 0.2496703434 0.0091301999
-0.4998413873 0.3328449689 -0.0328036709
-0.4998200153 0.3331915235 0.0713380200
-0.4998513293 0.2496703434 0.0091301999
-0.4997986434 0.3335380781 0.1754797109
-0.4997929285 0.2921240426 0.2485174918
-0.4998456144 0.2082563080 0.0821679808
-0.4998299574 0.2500168980 0.1132718908
-0.4999040152 0.1658026087 -0.1572193110
-0.4998983003 0.1243885733 -0.0841815302
-0.4999509862 0.0405208386 -0.2505310411
-0.4999353292 0.0822814286 -0.2194271311
-0.4998727012 0.2493237888 -0.0950114910
-0.4998826433 0.1661491633 -0.0530776201
-0.4999040152 0.1658026087 -0.1572193110
-0.4998727012 0.2493237888 -0.0950114910
0.4997907913 -0.2921585667 -0.0101004337
0.4998121632 -0.2918120121 0.0940412572
0.4998178310 -0.2087064348 0.0312789420
0.4997907913 -0.2921585667 -0.0101004337
0.4998335352 -0.2914654576 0.1981829481
0.4998442211 -0.2912921803 0.2502537936
0.4998285169 -0.2085331575 0.0833497875
0.4998121632 -0.2918120121 0.0940412572
0.4998021267 -0.1259474120 -0.1356250640
0.4998128127 -0.1257741347 -0.0835542186
0.4997971085 -0.0430151120 -0.2504582246
0.4997807548 -0.1262939666 -0.2397667549
0.4997964590 -0.2090529894 -0.0728627489
0.4997750871 -0.2093995440 -0.1770044398
0.4997694194 -0.2925051213 -0.1142421246
0.4997964590 -0.2090529894 -0.0728627489
-0.0623964406 0.2089904667 0.3320186800
-0.1873672638 0.2090182882 0.3320442339
-0.0623779498 0.2923038455 0.3317414324
-0.0623964406 0.2089904667 0.3320186800
-0.0624149315 0.1256770880 0.3322959275
-0.0624334223 0.0423637093 0.3325731751
-0.1873857547 0.1257049095 0.3323214814
-0.0624149315 0.1256770880 0.3322959275
-0.3123195962 0.2923594884 0.3317925402
-0.3123380870 0.2090461097 0.3320697878
-0.4372904194 0.2923873099 0.3318180941
-0.3123195962 0.2923594884 0.3317925402
-0.1873487730 0.2923316669 0.3317669863
-0.0623779498 0.2923038455 0.3317414324
-0.1873672638 0.2090182882 0.3320442339
-0.1873487730 0.2923316669 0.3317669863
0.1875636966 0.2922482025 0.3316903247
0.1875452057 0.2089348238 0.3319675722
0.0625928734 0.2922760240 0.3317158786
0.1875636966 0.2922482025 0.3316903247
0.3125345198 0.2922203810 0.3316647708
0.4375053430 0.2921925595 0.3316392169
0.3125160289 0.2089070023 0.3319420183
0.3125345198 0.2922203810 0.3316647708
0.0625558917 0.1256492665 0.3322703737
0.1875267149 0.1256214450 0.3322448198
0.0625374009 0.0423358878 0.3325476212
0.0625558917 0.1256492665 0.3322703737
0.0625743826 0.2089626453 0.3319931261
0.0625928734 0.2922760240 0.3317158786
0.1875452057 0.2089348238 0.3319675722
0.0625743826 0.2089626453 0.3319931261
-0.3123935596 -0.0408940265 0.3329015304
-0.3124120504 -0.1242074052 0.3331787780
-0.4373643828 -0.0408662050 0.3329270843
-0.3123935596 -0.0408940265 0.3329015304
-0.1874227364 -0.0409218480 0.3328759765
-0.0624519132 -0.0409496694 0.3328504226
-0.1874412272 -0.1242352267 0.3331532241
-0.1874227364 -0.0409218480 0.3328759765
-0.4374013645 -0.2074929625 0.3334815794
-0.3124305413 -0.2075207839 0.3334560255
-0.4374198553 -0.2908063412 0.3337588269
-0.4374013645 -0.2074929625 0.3334815794
-0.4373828736 -0.1241795837 0.3332043318
-0.4373643828 -0.0408662050 0.3329270843
-0.3124120504 -0.1242074052 0.3331787780
-0.4373828736 -0.1241795837 0.3332043318
-0.4373274011 0.1257605524 0.3323725892
-0.3123565779 0.1257327310 0.3323470353
-0.4373458919 0.0424471737 0.3326498367
-0.4373274011 0.1257605524 0.3323725892
-0.4373089102 0.2090739312 0.3320953416
-0.4372904194 0.2923873099 0.3318180941
-0.3123380870 0.2090461097 0.3320697878
-0.4373089102 0.2090739312 0.3320953416
-0.1874042455 0.0423915308 0.3325987290
-0.1873857547 0.1257049095 0.3323214814
-0.0624334223 0.0423637093 0.3325731751
-0.1874042455 0.0423915308 0.3325987290
-0.3123750687 0.0424193522 0.3326242829
-0.4373458919 0.0424471737 0.3326498367
-0.3123565779 0.1257327310 0.3323470353
-0.3123750687 0.0424193522 0.3326242829
3 410 826 202
3 46 826 410
3 410 827 7
3 202 827 410
3 411 828 202
3 98 828 411
3 411 829 46
3 202 829 411
3 203 830 98
3 412 830 203
3 412 831 9
3 203 831 412
3 413 832 203
3 46 832 413
3 98 833 203
3 413 833 98
3 204 834 99
3 414 834 204
3 414 835 46
3 204 835 414
3 415 836 204
3 5 836 415
3 99 837 204
3 415 837 99
3 416 838 205
3 7 838 416
3 416 839 46
3 205 839 416
3 417 840 205
3 99 840 417
3 417 841 7
3 205 841 417
3 418 842 206
3 2 842 418
3 418 843 100
3 206 843 418
3 419 844 206
3 47 844 419
3 419 845 2
3 206 845 419
3 100 846 420
3 207 846 100
3 420 847 8
3 207 847 420
3 421 848 207
3 47 848 421
3 207 849 421
3 100 849 207
3 101 850 422
3 208 850 101
3 422 851 47
3 208 851 422
3 423 852 208
3 0 852 423
3 208 853 423
3 101 853 208
3 424 854 209
3 47 854 424
3 424 855 101
3 209 855 424
3 425 856 209
3 2 856 425
3 425 857 47
3 209 857 425
3 250 506 122
3 10 506 250
3 250 507 58
3 122 507 250
3 30 508 251
3 122 508 30
3 251 509 10
3 122 509 251
3 58 510 252
3 123 510 58
3 252 511 3
3 123 511 252
3 253 512 123
3 30 512 253
3 123 513 253
3 58 513 123
3 59 514 254
3 124 514 59
3 254 515 30
3 124 515 254
3 255 516 124
3 2 516 255
3 124 517 255
3 59 517 124
3 256 518 125
3 30 518 256
3 125 519 256
3 59 519 125
3 257 520 125
3 10 520 257
3 257 521 30
3 125 521 257
3 60 522 258
3 126 522 60
3 258 523 31
3 126 523 258
3 259 524 126
3 3 524 259
3 126 525 259
3 60 525 126
3 260 526 127
3 31 526 260
3 60 527 127
3 260 527 60
3 127 528 10
3 261 528 127
3 261 529 31
3 127 529 261
3 262 530 128
3 1 530 262
3 61 531 128
3 262 531 61
3 128 532 31
3 263 532 128
3 263 533 1
3 128 533 263
3 264 534 129
3 61 534 264
3 264 535 3
3 129 535 264
3 265 536 129
3 31 536 265
3 129 537 265
3 61 537 129
3 62 538 266
3 130 538 62
3 266 539 32
3 130 539 266
3 267 540 130
3 6 540 267
3 130 541 267
3 62 541 130
3 268 542 131
3 32 542 268
3 62 543 131
3 268 543 62
3 131 544 11
3 269 544 131
3 269 545 32
3 131 545 269
3 270 546 132
3 4 546 270
3 63 547 132
3 270 547 63
3 132 548 32
3 271 548 132
3 271 549 4
3 132 549 271
3 272 550 133
3 63 550 272
3 272 551 6
3 133 551 272
3 273 552 133
3 32 552 273
3 133 553 273
3 63 553 133
3 274 554 134
3 11 554 274
3 134 555 274
3 64 555 134
3 33 556 275
3 134 556 33
3 275 557 11
3 134 557 275
3 64 558 276
3 135 558 64
3 276 559 5
3 135 559 276
3 277 560 135
3 33 560 277
3 135 561 277
3 64 561 135
3 65 562 278
3 136 562 65
3 278 563 33
3 136 563 278
3 279 564 136
3 4 564 279
3 136 565 279
3 65 565 136
3 280 566 137
3 33 566 280
3 137 567 280
3 65 567 137
3 11 568 281
3 137 568 11
3 281 569 33
3 137 569 281
3 426 858 210
3 102 858 426
3 426 859 48
3 210 859 426
3 427 860 210
3 22 860 427
3 427 861 102
3 210 861 427
3 428 862 211
3 102 862 428
3 428 863 12
3 211 863 428
3 429 864 211
3 48 864 429
3 429 865 102
3 211 865 429
3 430 866 212
3 103 866 430
3 430 867 48
3 212 867 430
3 431 868 212
3 4 868 431
3 431 869 103
3 212 869 431
3 432 870 213
3 103 870 432
3 432 871 22
3 213 871 432
3 433 872 213
3 48 872 433
3 433 873 103
3 213 873 433
3 434 874 214
3 104 874 434
3 434 875 49
3 214 875 434
3 435 876 214
3 22 876 435
3 435 877 104
3 214 877 435
3 436 878 215
3 104 878 436
3 436 879 5
3 215 879 436
3 437 880 215
3 49 880 437
3 437 881 104
3 215 881 437
3 438 882 216
3 105 882 438
3 438 883 49
3 216 883 438
3 439 884 216
3 12 884 439
3 439 885 105
3 216 885 439
3 440 886 217
3 105 886 440
3 440 887 22
3 217 887 440
3 441 888 217
3 49 888 441
3 441 889 105
3 217 889 441
3 442 890 218
3 106 890 442
3 442 891 50
3 218 891 442
3 443 892 218
3 23 892 443
3 443 893 106
3 218 893 443
3 444 894 219
3 106 894 444
3 444 895 12
3 219 895 444
3 445 896 219
3 50 896 445
3 445 897 106
3 219 897 445
3 446 898 220
3 107 898 446
3 446 899 50
3 220 899 446
3 447 900 220
3 0 900 447
3 447 901 107
3 220 901 447
3 448 902 221
3 107 902 448
3 448 903 23
3 221 903 448
3 449 904 221
3 50 904 449
3 449 905 107
3 221 905 449
3 450 906 222
3 108 906 450
3 450 907 51
3 222 907 450
3 451 908 222
3 23 908 451
3 451 909 108
3 222 909 451
3 452 910 223
3 108 910 452
3 452 911 4
3 223 911 452
3 453 912 223
3 51 912 453
3 453 913 108
3 223 913 453
3 454 914 224
3 109 914 454
3 454 915 51
3 224 915 454
3 455 916 224
3 12 916 455
3 455 917 109
3 224 917 455
3 456 918 225
3 109 918 456
3 456 919 23
3 225 919 456
3 457 920 225
3 51 920 457
3 457 921 109
3 225 921 457
3 282 570 138
3 13 570 282
3 138 571 282
3 66 571 138
3 34 572 283
3 138 572 34
3 283 573 13
3 138 573 283
3 66 574 284
3 139 574 66
3 284 575 9
3 139 575 284
3 285 576 139
3 34 576 285
3 139 577 285
3 66 577 139
3 140 578 67
3 286 578 140
3 286 579 34
3 140 579 286
3 287 580 140
3 8 580 287
3 140 581 287
3 67 581 140
3 288 582 141
3 13 582 288
3 34 583 141
3 288 583 34
3 289 584 141
3 67 584 289
3 289 585 13
3 141 585 289
3 142 586 68
3 290 586 142
3 290 587 35
3 142 587 290
3 291 588 142
3 3 588 291
3 68 589 142
3 291 589 68
3 292 590 143
3 9 590 292
3 143 591 292
3 35 591 143
3 68 592 293
3 143 592 68
3 293 593 9
3 143 593 293
3 294 594 144
3 69 594 294
3 294 595 35
3 144 595 294
3 144 596 13
3 295 596 144
3 295 597 69
3 144 597 295
3 145 598 69
3 296 598 145
3 296 599 3
3 145 599 296
3 297 600 145
3 35 600 297
3 69 601 145
3 297 601 69
3 146 602 70
3 298 602 146
3 298 603 36
3 146 603 298
3 299 604 146
3 6 604 299
3 70 605 146
3 299 605 70
3 300 606 147
3 70 606 300
3 8 607 147
3 300 607 8
3 301 608 147
3 36 608 301
3 301 609 70
3 147 609 301
3 302 610 148
3 36 610 302
3 148 611 302
3 14 611 148
3 71 612 303
3 148 612 71
3 303 613 36
3 148 613 303
3 149 614 71
3 304 614 149
3 304 615 6
3 149 615 304
3 305 616 149
3 36 616 305
3 71 617 149
3 305 617 71
3 306 618 150
3 14 618 306
3 150 619 306
3 72 619 150
3 37 620 307
3 150 620 37
3 307 621 14
3 150 621 307
3 72 622 308
3 151 622 72
3 308 623 7
3 151 623 308
3 309 624 151
3 37 624 309
3 151 625 309
3 72 625 151
3 73 626 310
3 152 626 73
3 310 627 37
3 152 627 310
3 311 628 152
3 6 628 311
3 152 629 311
3 73 629 152
3 312 630 153
3 37 630 312
3 153 631 312
3 73 631 153
3 14 632 313
3 153 632 14
3 313 633 37
3 153 633 313
3 314 634 154
3 74 634 314
3 314 635 24
3 154 635 314
3 315 636 154
3 15 636 315
3 315 637 74
3 154 637 315
3 316 638 155
3 74 638 316
3 316 639 1
3 155 639 316
3 317 640 155
3 24 640 317
3 317 641 74
3 155 641 317
3 318 642 156
3 75 642 318
3 318 643 24
3 156 643 318
3 319 644 156
3 5 644 319
3 319 645 75
3 156 645 319
3 320 646 157
3 75 646 320
3 320 647 15
3 157 647 320
3 321 648 157
3 24 648 321
3 321 649 75
3 157 649 321
3 322 650 158
3 76 650 322
3 322 651 25
3 158 651 322
3 323 652 158
3 15 652 323
3 323 653 76
3 158 653 323
3 324 654 159
3 76 654 324
3 324 655 9
3 159 655 324
3 325 656 159
3 25 656 325
3 325 657 76
3 159 657 325
3 326 658 160
3 77 658 326
3 326 659 25
3 160 659 326
3 327 660 160
3 1 660 327
3 327 661 77
3 160 661 327
3 328 662 161
3 77 662 328
3 328 663 15
3 161 663 328
3 329 664 161
3 25 664 329
3 329 665 77
3 161 665 329
3 458 922 226
3 52 922 458
3 458 923 3
3 226 923 458
3 459 924 226
3 110 924 459
3 459 925 52
3 226 925 459
3 227 926 110
3 460 926 227
3 460 927 1
3 227 927 460
3 461 928 227
3 52 928 461
3 110 929 227
3 461 929 110
3 228 930 111
3 462 930 228
3 462 931 52
3 228 931 462
3 463 932 228
3 9 932 463
3 111 933 228
3 463 933 111
3 464 934 229
3 3 934 464
3 464 935 52
3 229 935 464
3 465 936 229
3 111 936 465
3 465 937 3
3 229 937 465
3 330 666 162
3 78 666 330
3 330 667 26
3 162 667 330
3 331 668 162
3 16 668 331
3 331 669 78
3 162 669 331
3 332 670 163
3 78 670 332
3 332 671 0
3 163 671 332
3 333 672 163
3 26 672 333
3 333 673 78
3 163 673 333
3 334 674 164
3 79 674 334
3 334 675 26
3 164 675 334
3 335 676 164
3 8 676 335
3 335 677 79
3 164 677 335
3 336 678 165
3 79 678 336
3 336 679 16
3 165 679 336
3 337 680 165
3 26 680 337
3 337 681 79
3 165 681 337
3 338 682 166
3 80 682 338
3 338 683 27
3 166 683 338
3 339 684 166
3 16 684 339
3 339 685 80
3 166 685 339
3 340 686 167
3 80 686 340
3 340 687 4
3 167 687 340
3 341 688 167
3 27 688 341
3 341 689 80
3 167 689 341
3 342 690 168
3 81 690 342
3 342 691 27
3 168 691 342
3 343 692 168
3 0 692 343
3 343 693 81
3 168 693 343
3 344 694 169
3 81 694 344
3 344 695 16
3 169 695 344
3 345 696 169
3 27 696 345
3 345 697 81
3 169 697 345
3 466 938 230
3 6 938 466
3 466 939 112
3 230 939 466
3 467 940 230
3 53 940 467
3 467 941 6
3 230 941 467
3 112 942 468
3 231 942 112
3 468 943 4
3 231 943 468
3 469 944 231
3 53 944 469
3 231 945 469
3 112 945 231
3 113 946 470
3 232 946 113
3 470 947 53
3 232 947 470
3 471 948 232
3 8 948 471
3 232 949 471
3 113 949 232
3 472 950 233
3 53 950 472
3 472 951 113
3 233 951 472
3 473 952 233
3 6 952 473
3 473 953 53
3 233 953 473
3 346 698 170
3 17 698 346
3 170 699 346
3 82 699 170
3 38 700 347
3 170 700 38
3 347 701 17
3 170 701 347
3 82 702 348
3 171 702 82
3 348 703 0
3 171 703 348
3 349 704 171
3 38 704 349
3 171 705 349
3 82 705 171
3 83 706 350
3 172 706 83
3 350 707 38
3 172 707 350
3 351 708 172
3 1 708 351
3 172 709 351
3 83 709 172
3 352 710 173
3 38 710 352
3 173 711 352
3 83 711 173
3 17 712 353
3 173 712 17
3 353 713 38
3 173 713 353
3 84 714 354
3 174 714 84
3 354 715 39
3 174 715 354
3 355 716 174
3 0 716 355
3 174 717 355
3 84 717 174
3 356 718 175
3 39 718 356
3 84 719 175
3 356 719 84
3 175 720 17
3 357 720 175
3 357 721 39
3 175 721 357
3 358 722 176
3 2 722 358
3 358 723 85
3 176 723 358
3 176 724 39
3 359 724 176
3 359 725 2
3 176 725 359
3 85 726 360
3 177 726 85
3 360 727 0
3 177 727 360
3 361 728 177
3 39 728 361
3 177 729 361
3 85 729 177
3 86 730 362
3 178 730 86
3 362 731 40
3 178 731 362
3 363 732 178
3 5 732 363
3 178 733 363
3 86 733 178
3 364 734 179
3 40 734 364
3 86 735 179
3 364 735 86
3 179 736 18
3 365 736 179
3 365 737 40
3 179 737 365
3 366 738 180
3 7 738 366
3 366 739 87
3 180 739 366
3 180 740 40
3 367 740 180
3 367 741 7
3 180 741 367
3 87 742 368
3 181 742 87
3 368 743 5
3 181 743 368
3 369 744 181
3 40 744 369
3 181 745 369
3 87 745 181
3 370 746 182
3 18 746 370
3 370 747 88
3 182 747 370
3 41 748 371
3 182 748 41
3 371 749 18
3 182 749 371
3 88 750 372
3 183 750 88
3 372 751 6
3 183 751 372
3 373 752 183
3 41 752 373
3 183 753 373
3 88 753 183
3 89 754 374
3 184 754 89
3 374 755 41
3 184 755 374
3 375 756 184
3 7 756 375
3 184 757 375
3 89 757 184
3 376 758 185
3 41 758 376
3 185 759 376
3 89 759 185
3 377 760 185
3 18 760 377
3 377 761 41
3 185 761 377
3 474 954 234
3 114 954 474
3 474 955 54
3 234 955 474
3 475 956 234
3 28 956 475
3 475 957 114
3 234 957 475
3 476 958 235
3 114 958 476
3 476 959 19
3 235 959 476
3 477 960 235
3 54 960 477
3 477 961 114
3 235 961 477
3 478 962 236
3 115 962 478
3 478 963 54
3 236 963 478
3 479 964 236
3 1 964 479
3 479 965 115
3 236 965 479
3 480 966 237
3 115 966 480
3 480 967 28
3 237 967 480
3 481 968 237
3 54 968 481
3 481 969 115
3 237 969 481
3 482 970 238
3 116 970 482
3 482 971 55
3 238 971 482
3 483 972 238
3 28 972 483
3 483 973 116
3 238 973 483
3 484 974 239
3 116 974 484
3 484 975 0
3 239 975 484
3 485 976 239
3 55 976 485
3 485 977 116
3 239 977 485
3 486 978 240
3 117 978 486
3 486 979 55
3 240 979 486
3 487 980 240
3 19 980 487
3 487 981 117
3 240 981 487
3 488 982 241
3 117 982 488
3 488 983 28
3 241 983 488
3 489 984 241
3 55 984 489
3 489 985 117
3 241 985 489
3 490 986 242
3 118 986 490
3 490 987 56
3 242 987 490
3 491 988 242
3 29 988 491
3 491 989 118
3 242 989 491
3 492 990 243
3 118 990 492
3 492 991 19
3 243 991 492
3 493 992 243
3 56 992 493
3 493 993 118
3 243 993 493
3 494 994 244
3 119 994 494
3 494 995 56
3 244 995 494
3 495 996 244
3 5 996 495
3 495 997 119
3 244 997 495
3 496 998 245
3 119 998 496
3 496 999 29
3 245 999 496
3 497 1000 245
3 56 1000 497
3 497 1001 119
3 245 1001 497
3 498 1002 246
3 120 1002 498
3 498 1003 57
3 246 1003 498
3 499 1004 246
3 29 1004 499
3 499 1005 120
3 246 1005 499
3 500 1006 247
3 120 1006 500
3 500 1007 1
3 247 1007 500
3 501 1008 247
3 57 1008 501
3 501 1009 120
3 247 1009 501
3 502 1010 248
3 121 1010 502
3 502 1011 57
3 248 1011 502
3 503 1012 248
3 19 1012 503
3 503 1013 121
3 248 1013 503
3 504 1014 249
3 121 1014 504
3 504 1015 29
3 249 1015 504
3 505 1016 249
3 57 1016 505
3 505 1017 121
3 249 1017 505
3 378 762 186
3 20 762 378
3 186 763 378
3 90 763 186
3 379 764 186
3 42 764 379
3 379 765 20
3 186 765 379
3 90 766 380
3 187 766 90
3 380 767 2
3 187 767 380
3 381 768 187
3 42 768 381
3 90 769 187
3 381 769 90
3 91 770 382
3 188 770 91
3 382 771 42
3 188 771 382
3 383 772 188
3 3 772 383
3 91 773 188
3 383 773 91
3 384 774 189
3 20 774 384
3 384 775 42
3 189 775 384
3 189 776 91
3 385 776 189
3 385 777 20
3 189 777 385
3 92 778 386
3 190 778 92
3 386 779 43
3 190 779 386
3 387 780 190
3 2 780 387
3 190 781 387
3 92 781 190
3 388 782 191
3 43 782 388
3 92 783 191
3 388 783 92
3 191 784 20
3 389 784 191
3 389 785 43
3 191 785 389
3 390 786 192
3 8 786 390
3 93 787 192
3 390 787 93
3 192 788 43
3 391 788 192
3 391 789 8
3 192 789 391
3 93 790 392
3 193 790 93
3 392 791 2
3 193 791 392
3 393 792 193
3 43 792 393
3 193 793 393
3 93 793 193
3 94 794 394
3 194 794 94
3 394 795 44
3 194 795 394
3 395 796 194
3 7 796 395
3 194 797 395
3 94 797 194
3 396 798 195
3 44 798 396
3 94 799 195
3 396 799 94
3 195 800 21
3 397 800 195
3 397 801 44
3 195 801 397
3 398 802 196
3 9 802 398
3 95 803 196
3 398 803 95
3 196 804 44
3 399 804 196
3 399 805 9
3 196 805 399
3 95 806 400
3 197 806 95
3 400 807 7
3 197 807 400
3 401 808 197
3 44 808 401
3 197 809 401
3 95 809 197
3 402 810 198
3 21 810 402
3 402 811 96
3 198 811 402
3 45 812 403
3 198 812 45
3 403 813 21
3 198 813 403
3 96 814 404
3 199 814 96
3 404 815 8
3 199 815 404
3 405 816 199
3 45 816 405
3 199 817 405
3 96 817 199
3 97 818 406
3 200 818 97
3 406 819 45
3 200 819 406
3 407 820 200
3 9 820 407
3 200 821 407
3 97 821 200
3 408 822 201
3 21 822 408
3 45 823 201
3 408 823 45
3 409 824 201
3 97 824 409
3 409 825 21
3 201 825 409