OFF
1166 1561 0
0.4725007763 0.0807820385 0.0437085941
-0.4123866483 -0.1327707471 0.0164453836
-0.2612948295 0.0189805649 -0.0730658938
0.0956369193 0.1063254438 0.0007808111
-0.3561077977 -0.0036691257 -0.0638988912
-0.3396851284 0.0014377816 -0.0037654562
-0.2426939832 0.0254166565 0.0290312489
-0.1888375167 0.1001696856 -0.0430523145
-0.0037446289 -0.1294079206 0.0430185102
-0.1146135769 -0.1574782575 -0.0289096683
-0.0346836624 -0.1364623806 0.0635558345
-0.0577468253 0.0823707392 0.0344101207
-0.2968550655 -0.1405072457 -0.0698026632
-0.1423975177 0.0112837280 0.0414832389
0.4558160048 0.1524138154 -0.1089588415
-0.4356124754 -0.0603314685 -0.0120100594
0.4544649960 0.1519733219 -0.1149680655
0.0486404686 -0.0879663685 0.1002404821
0.0458598707 -0.0887801224 0.0927140588
0.0470799287 -0.0882275876 0.1062090619
-0.1210530499 -0.1311617777 -0.0219262390
-0.2950986995 -0.1738263396 -0.0617829615
-0.3752817247 -0.0958160623 0.0315223561
-0.0181337653 -0.0899599922 -0.0492051230
-0.1335572113 -0.0251781425 0.0376896409
-0.0420748613 -0.0028716094 0.0524380302
0.1487700686 0.0429800748 0.0476002997
-0.4727152707 -0.1069756302 0.0299849520
-0.0419033492 0.1135693239 0.0162433398
-0.0063874598 0.1214970770 -0.0162109290
-0.0063350593 0.1214522431 -0.0192063981
-0.0332734557 0.1157640880 0.0223534243
0.4164951746 0.0551527911 -0.0272963811
-0.3093759441 -0.1188406097 0.0120469138
0.4297435217 0.1747740786 -0.0618118164
0.0163359429 -0.1129534782 0.0865674275
0.0226567124 -0.1119758604 0.0581993691
-0.0235897280 -0.1234950300 0.0380888781
-0.0063027080 -0.1191276597 0.0488118631
0.0410851989 -0.1069887125 0.0869100248
0.0144873030 -0.1129681994 0.1090051927
0.0031281514 -0.1160217864 0.0923742730
0.1297282337 0.1166287799 0.0296858924
-0.4441655547 -0.0847215430 0.0286533060
-0.5000000000 -0.0992121326 -0.0260364028
0.1750368516 0.0639946068 0.0102933120
-0.3898826560 -0.1230136769 0.0017130935
-0.4746040788 -0.0797634485 0.0265486354
-0.3657451651 -0.0547625730 -0.0363381426
0.4291262529 0.1352286213 -0.1076704186
0.4181759387 0.1334224482 -0.0643913442
0.4497852982 0.1415001357 -0.0399904525
-0.4974522757 -0.0857583428 0.0007717321
-0.4015764062 -0.0624216543 0.0140835676
-0.2331914127 -0.1468604611 0.0048110566
-0.4571095093 -0.1264910524 0.0215620860
0.4673468423 0.0963109572 0.0343980567
0.4431737195 0.0898531386 0.0011149436
0.4656661086 0.0945559327 -0.0360138220
0.1269570048 0.1305587554 -0.0125159335
0.1699435638 -0.0336487808 -0.0362722327
0.2342937697 0.1059434410 0.0077060678
0.4125453439 0.1466058349 -0.1096287505
0.1028758199 0.0747014084 0.0283456996
0.1508923274 0.0863025260 0.0305100214
0.4242706510 0.1493455685 -0.1139588338
0.4231443950 0.1503091913 -0.0495766114
0.1741595976 0.0919388618 0.0323306741
0.3705766941 0.1378122527 -0.0413207658
-0.1785561092 0.0691353152 -0.0229329894
0.0282687892 -0.1166121156 0.0673559603
0.0073368527 -0.1210537302 0.0985151801
0.0074416163 -0.1211433658 0.0925263854
-0.0033926375 -0.1246449116 0.0459493631
0.3714449314 0.1495113225 -0.0849242780
-0.4480976722 -0.0465120057 -0.0184272742
-0.4599544698 -0.0491398075 -0.0066103473
0.0432349301 -0.0959472031 0.0733004398
0.0388152197 -0.0969549495 0.0762341922
-0.4215428214 -0.1022586026 0.0353035016
-0.2105536788 -0.1022087239 0.0404916385
0.2597451976 0.0094714963 -0.0398404609
-0.4042478504 -0.1504129877 -0.0415720290
0.4090678007 0.0461488676 -0.0018246061
0.5000000000 0.0689259946 0.0443670976
-0.4221362380 -0.1542646861 -0.0178583581
-0.4243729377 -0.0905891990 0.0365773274
-0.0757062807 0.1092389136 -0.0262290974
-0.0168020955 0.1242970104 0.0195178638
-0.0062187798 0.1264168440 -0.0027996833
-0.2025211838 0.0788477652 -0.0190036087
-0.0175244887 0.1233186744 -0.0224260577
-0.0076221741 0.1260211715 -0.0058142957
-0.3851878999 -0.1335253298 -0.0429893615
-0.4547125814 -0.1490750340 0.0189460510
-0.3269131667 -0.0029374106 -0.0708895233
-0.4612304707 -0.0842137129 0.0283471839
0.4349582242 0.1292479825 -0.0910002195
0.4402578027 0.1310996724 -0.0609742028
-0.3124159148 0.0146601131 0.0219806105
-0.4078484792 -0.0599732618 -0.0205176909
-0.4826521022 -0.1407512978 0.0003557349
-0.3538837769 -0.1104350797 -0.0352973855
0.0370960338 -0.1033006606 0.0882841059
-0.0010443312 -0.1121768882 0.1042276731
0.0325977507 -0.1042411804 0.0957094544
0.0316647694 -0.1050404803 0.0657441797
0.0119801238 -0.1089517177 0.1089012184
-0.1358612739 -0.1293917752 0.0152401753
-0.1459741766 -0.1319152362 0.0106070600
-0.3735655779 -0.1019079614 0.0136665767
-0.4624397011 -0.1248496747 -0.0669412332
0.2506327538 0.0473229262 -0.0405663980
-0.4937454205 -0.1315903989 -0.0254423772
-0.4364551990 -0.1167489547 0.0292675466
0.3999553569 0.0840002975 -0.0025505432
0.4908613653 0.1067998334 0.0451383591
-0.1658535527 0.0636616442 -0.0660728813
0.0061367500 0.1189291326 0.0140075125
0.0135476463 0.1205715969 0.0066215368
0.0136524099 0.1204819613 0.0006327420
-0.3669181343 -0.0355395620 -0.0636109876
-0.3317799017 -0.0256922719 0.0087628315
-0.4794109880 -0.0622204878 -0.0427088826
-0.0193301519 -0.1347906488 0.0383324561
-0.2430440019 -0.0567436619 -0.0731112382
-0.2212587006 -0.0514357703 -0.0698134946
0.1513308732 0.0384764438 -0.0586495567
-0.3526242668 -0.0827226223 -0.0521683673
-0.3422242968 -0.0804459183 -0.0640049877
-0.4919245548 -0.1152037541 0.0028071381
-0.1283467747 -0.0287559655 -0.0535471558
-0.3144325469 -0.0738914765 -0.0711072037
0.4085852733 0.1627097006 -0.1039468717
0.1422867420 0.0999942857 -0.0312652725
0.1553373880 0.1031970473 -0.0280889259
-0.3243487146 -0.1484727164 -0.0596780216
-0.3801884060 -0.0754346033 0.0311314684
0.1110576307 0.0422706206 0.0020092923
-0.3976215948 -0.0812733262 -0.0544752021
0.2365739030 0.0721764609 -0.0142196034
-0.0170677087 0.1279919435 -0.0254839974
-0.0288459335 0.1252969150 -0.0181586666
-0.0076368492 0.1310978169 0.0180784125
-0.0070868213 0.1306272139 -0.0133638314
-0.0337894808 0.1247373626 0.0147201312
-0.0060501184 0.1313366271 0.0106126341
0.4743303393 0.0672164006 0.0364536778
0.4501572165 0.0607585820 0.0031705646
0.4726757965 0.0654389672 -0.0354553996
0.4887315810 0.0708595521 0.0456390283
-0.2074393809 0.0941749877 -0.0417900059
-0.4173878386 -0.1360332864 -0.0105582051
0.4955422683 0.0854556582 0.0784976803
0.4975327669 0.0837524765 -0.0352947793
0.4974018124 0.0838645210 -0.0278087860
-0.4335595830 -0.1397584702 -0.0017963205
-0.0585569486 0.0662732264 -0.0717253905
-0.1513740398 0.0451098384 -0.0101139535
0.2215036509 0.1347755401 -0.0154201656
-0.2108708070 -0.1369463202 0.0005591532
-0.2665590590 -0.1499655780 0.0207517368
-0.3936115776 -0.0651633015 -0.0681287496
-0.3552202537 -0.0549053794 -0.0151789263
0.4181022195 0.1295763827 -0.1032844756
0.1503478079 0.0665100880 -0.0306230928
-0.4217147662 -0.0590104873 -0.0372536547
-0.3882036388 -0.0509627349 -0.0382858801
-0.4299103664 -0.0599804174 0.0150493676
0.0226928871 -0.1131627858 0.0761947461
-0.1465925477 -0.1551109362 0.0139394022
0.0397703611 -0.1086161283 0.0988963921
0.0359006785 -0.1100944776 0.0703879006
0.0353506507 -0.1096238747 0.1018301446
0.0243058088 -0.1129463845 0.0672317690
0.0428128680 -0.1080264633 0.0914508287
0.0308513255 -0.1105646456 0.1092554786
-0.2827190921 -0.1712053301 -0.0001849465
0.0505514677 -0.0891608934 0.0942998215
0.0520858166 -0.0888772654 0.0898284405
0.0372399547 -0.0921393148 0.1060954762
0.0327678438 -0.0931022274 0.1120246977
0.4632490449 0.1035593184 -0.0182139881
-0.3372904268 0.0270219367 -0.0655271731
0.0098728160 0.1239906217 -0.0099718360
0.0097942433 0.1240578484 -0.0054802400
-0.0169346071 0.1181904061 0.0241009213
-0.1394852919 -0.1707143685 -0.0051777001
-0.3427865177 -0.1297255592 -0.0557869608
0.4490054343 0.0613042353 -0.0343095941
0.1624148619 -0.0079963593 -0.0502698099
-0.3036387963 -0.1484648755 0.0021047225
0.1550588261 0.0575820786 0.0070438242
-0.1190619400 -0.0877265366 -0.0315294662
-0.1251456862 -0.0601180843 0.0383597397
-0.3949886100 -0.1261865806 -0.0193017005
-0.4248013838 -0.1342046666 -0.0631468131
-0.4835594077 -0.1477914043 -0.0340096599
-0.4452204675 -0.1374886627 0.0219346679
-0.3709831307 -0.0578236704 -0.0498661003
-0.3974762479 -0.0638928058 -0.0337605845
0.4660452595 0.1439936068 -0.0337512566
0.1630477437 0.0711696357 -0.0274746853
0.0435330327 -0.0973582336 0.0763227583
-0.0126419132 -0.1115574914 0.0410977040
0.4426707268 0.0875310779 -0.0333150668
-0.3885602303 -0.1128602443 -0.0478517374
-0.0598663452 0.0833031513 -0.0510304375
-0.4227661441 -0.0546432551 -0.0373374121
0.4508677449 0.1557664929 -0.0326949762
-0.4363133940 -0.0574199804 -0.0120658976
-0.1986661314 0.0628345804 -0.0186964984
-0.3328384693 0.0307563689 -0.0070815602
-0.1341620804 -0.1591952546 -0.0337199137
0.0195178999 -0.1198592475 0.0882244428
-0.0226492931 -0.1300793710 0.0846427105
-0.4486540014 -0.0487894602 -0.0498619357
-0.0527808991 0.0483427364 0.0454922413
-0.4298326344 -0.0441384603 -0.0436102247
0.1676734202 0.0374319225 0.0030721098
0.4703278325 0.0596313716 0.0125282394
-0.2426504110 -0.1110249649 0.0640310643
0.1276148114 -0.0239132830 -0.0416520696
-0.0268718467 -0.0593651262 0.0490555548
0.2618941158 -0.0016144133 -0.0021852078
-0.0060778665 0.1251403872 0.0092068970
-0.0309056765 0.1192428322 0.0133548240
-0.0091203734 0.1245507222 0.0166524604
-0.0026948590 0.1254387204 -0.0177033210
-0.0074550512 0.1247222897 0.0046940142
-0.0071669512 0.1244757918 -0.0117751712
0.4420521724 0.0643352234 -0.0299827254
0.4882876231 0.0774602103 0.0739953934
-0.4700351597 -0.1546815119 -0.0007130492
0.1627702740 0.1149477334 0.0093161028
-0.0781597467 0.1194301642 -0.0264245512
-0.1376103862 -0.1322440409 -0.0311876360
0.0421688019 -0.0865030129 0.0971093846
-0.2111364647 -0.1332511835 -0.0444430335
-0.0189242658 -0.0853753607 0.0390979392
-0.3800758118 -0.0669991743 -0.0124367365
-0.3954203805 -0.0698356737 0.0322792031
-0.2744227177 0.0225063657 0.0345117373
-0.4049269681 -0.0604359646 -0.0009846873
0.3770263384 0.1262407859 -0.0829802462
-0.4173386160 -0.1259472223 0.0327356152
0.4833272538 0.0916667962 0.0736959872
-0.3879339314 -0.1191763903 0.0166696720
0.0255111416 -0.1073169959 0.1046194762
0.0107700246 -0.1106686649 0.1148987890
0.0319366560 -0.1064289976 0.0702636948
-0.0063336403 -0.1151929135 0.0936943416
0.0299832338 -0.1063540672 0.0986913265
-0.3727698544 -0.1037446728 -0.0117589534
0.1708076178 0.0266590666 -0.0356606937
-0.1873407784 0.0569428279 -0.0663482013
0.4540637082 0.1596925358 -0.1090984371
-0.4914139302 -0.0658779974 -0.0024161755
-0.4757147018 -0.0617496725 0.0157736451
0.4527126994 0.1592520422 -0.1151076611
0.0049528604 0.1171897605 0.0185068127
0.1142382063 0.0291454730 0.0007633857
0.2468238135 0.0609848742 -0.0033857740
0.4601673283 0.1748937217 -0.0358144547
0.4221168158 0.1643445448 -0.1082288210
0.4111665016 0.1625383716 -0.0649497465
0.4427758611 0.1706160592 -0.0405488549
-0.2153491643 -0.1406574201 -0.0563902435
-0.3160376191 -0.1646657119 -0.0443097034
-0.4134004138 -0.0848930308 0.0351860247
-0.0272230344 0.1243488880 -0.0076301417
-0.0313022442 0.1230498098 -0.0241610438
-0.0667919614 0.1150996639 0.0067970980
-0.0350519432 0.1230652172 0.0237110274
-0.0606545470 0.1162341601 -0.0110894979
-0.4237701360 -0.1521524995 -0.0478795782
0.1948822217 -0.0029657290 -0.0347961493
-0.2868009400 -0.1176768889 0.0304013861
-0.0115819895 -0.1233083218 0.0577700375
-0.1317356412 -0.1530131682 0.0171638849
-0.1193393491 -0.0665167145 -0.0468322296
-0.2402905787 0.0210485241 -0.0682352211
0.0419053859 -0.0924977811 0.1091784396
0.0374332749 -0.0934606937 0.1151076611
0.3768768034 0.1189908849 -0.0574074108
-0.3937849533 -0.0661708532 -0.0381558923
0.4770158519 0.1434699335 -0.0380454839
-0.2500962578 0.0323005500 -0.0011621910
-0.2492842965 0.0316058372 -0.0475778150
-0.0078577598 -0.1392100713 0.0655642249
-0.1231202273 -0.1683105635 -0.0049273998
-0.3447599116 -0.1047536166 -0.0142498512
-0.3822454852 -0.1141900827 -0.0357373227
-0.3601982712 -0.1091062833 -0.0474117802
-0.3587424950 -0.1087554286 -0.0473915652
-0.4602370315 -0.0687147105 0.0206426242
0.4601640107 0.1018500337 0.0117185450
-0.0583875316 0.0937624742 -0.0062195251
-0.0701628931 0.1035057854 0.0069116575
0.1966544546 -0.0125732901 0.0043275219
0.1389333355 0.0895416197 -0.0521404510
0.3677643596 0.1568423149 -0.0581333479
-0.1477431897 0.0343525702 0.0260634545
-0.1466955159 0.0334561821 -0.0338266361
0.2147444524 0.1201355219 -0.0512722791
0.0995768122 0.0925514529 -0.0438856991
0.4679034081 0.1813213634 -0.0387714210
-0.0139051159 -0.0973208697 -0.0040793880
-0.0178733909 0.1309930673 -0.0195510409
-0.0284839396 0.1288953914 0.0042636904
-0.0694300701 0.1192280859 0.0141791191
-0.0837269462 0.1154951824 -0.0009961036
-0.0101801020 -0.1291315065 0.0578817179
0.0273306204 -0.1197177004 0.0778719763
0.1899540958 0.0139675459 0.0262840242
0.4561731108 0.0767499662 -0.0419056705
0.1739133247 0.0101303015 0.0275588436
0.1214509159 -0.0024561535 0.0298254730
0.4507318096 0.0766161771 0.0194211867
0.2541150959 0.0293160211 0.0211847172
0.3984265462 0.0638952686 0.0127046240
-0.4045415074 -0.1303450729 -0.0358855579
0.4692757218 0.0799078095 -0.0417237271
-0.4018384589 -0.1294638250 -0.0238664523
-0.3739157414 -0.1230214389 -0.0384554118
-0.0644836594 0.1322259780 -0.0128938269
0.0380080054 -0.1001725788 0.0792642149
-0.0260492731 -0.1156109407 0.0783747126
-0.4681344150 -0.1321424029 0.0259477860
-0.3820199786 -0.1132263068 -0.0687045973
0.4108875748 0.0784457382 -0.0277431070
-0.2759230639 0.0307254094 -0.0000924187
-0.3566649341 0.0104042404 -0.0461426190
-0.1412288406 0.0114397014 -0.0453858475
-0.4020599670 -0.0511643728 -0.0355292702
0.4827751800 0.1624332558 -0.0052716609
-0.4521346790 -0.0626009083 -0.0032760939
-0.2357880035 0.0026100595 0.0384813619
0.3970522403 0.1524301563 -0.0935083915
-0.4059529883 -0.0401819639 -0.0567340683
0.1840374176 0.0398355806 0.0033223936
-0.3931177566 -0.1001542218 -0.0511177290
-0.4091684603 -0.1023854106 0.0340238755
-0.2355200032 -0.1390884163 0.0376108976
0.4741137853 0.0584291681 -0.0173484553
0.1296327769 -0.0348871498 0.0034890697
-0.2069956397 -0.1172525813 -0.0655828007
-0.0638557565 0.1095602997 0.0024363217
-0.0162059405 0.1214751578 0.0255624967
-0.0797655730 0.1056110108 -0.0037748522
-0.0037215844 0.1235648789 -0.0221882847
-0.2038412854 0.0744726297 -0.0698953133
-0.0175569530 0.1210346675 0.0195534870
0.1600638410 -0.0036730463 0.0440021555
-0.4573051079 -0.1539578993 -0.0424471167
0.4240672929 0.1744005417 -0.0903685536
-0.0284417861 0.1300160440 -0.0182222289
-0.0271955372 0.1305461699 -0.0062244245
-0.0312223652 0.1292022740 -0.0257497240
-0.0620566351 0.1220581784 -0.0112011944
-0.0618208982 0.1218564823 -0.0246770542
0.0041548956 -0.1141479608 0.0968581649
-0.0245425970 -0.1215238652 0.0724976004
-0.0389170225 -0.1251892749 0.0618150599
0.0452330227 -0.1045924487 0.0794567572
0.0367602746 -0.1069216662 0.0643634806
0.0455879590 -0.0873915009 0.0881945416
0.0424144976 -0.0878691213 0.1031260985
-0.2593201761 0.0227964943 -0.0596058909
0.1291792106 0.1166580003 -0.0422305647
-0.3801706167 -0.0680739510 0.0130446319
-0.4313315501 -0.0677367422 0.0301215918
0.4067814767 0.1315558786 -0.0990179488
0.4957804704 0.0910311968 -0.0354343750
0.4956495158 0.0911432413 -0.0279483816
0.4522130383 0.0928538335 -0.0362236846
-0.4517678184 -0.1235198449 0.0291010201
0.1871716152 0.0290627246 -0.0354104099
-0.3877901547 -0.1080145075 0.0344821040
0.4813714338 0.1014322617 0.0450526868
-0.1148709528 -0.1001194453 -0.0073017165
-0.2258970594 -0.1280553176 -0.0702459527
-0.0235096378 -0.0793069120 -0.0689333686
-0.0608263226 0.0988770793 -0.0303076871
0.0098812364 0.1166075445 0.0066167301
0.0099860000 0.1165179089 0.0006279354
-0.3562566303 0.0275609182 -0.0404002952
0.4004729583 0.1577603139 -0.0995205130
-0.2707423491 -0.0007340600 0.0618888962
-0.3090502937 -0.1813213634 -0.0364481150
0.0399991093 -0.0952155774 0.0717348921
0.1715210573 -0.0481543092 -0.0090615248
-0.0284854967 0.1226767426 0.0013607545
-0.0586649564 0.1149723924 -0.0215228263
-0.1853489049 0.0844691994 -0.0217833310
-0.0359477328 0.1210793472 0.0117411421
-0.0477259389 0.1183843027 0.0190654012
-0.0179535395 0.1248416612 -0.0179613090
-0.1815730094 0.0844313783 -0.0711529224
0.4602741042 0.0593696357 -0.0355815049
-0.3796395395 -0.1431717379 -0.0532341900
0.1792191430 -0.0082808752 -0.0349905949
-0.4343696858 -0.1554143350 -0.0045721516
-0.0089485971 -0.1235245107 0.0937732983
0.0010323090 -0.1208892564 0.1058923925
0.0266458838 -0.1156640004 0.0568263617
-0.0260784529 -0.1280263504 0.0740660496
-0.4031396701 -0.1361680492 -0.0357738814
-0.4166869200 -0.1389447745 -0.0105023669
0.1417408705 0.1129024374 0.0059828576
0.2242073555 0.0808283479 -0.0505184228
0.1090397153 0.0532442789 -0.0431318429
-0.4005300367 -0.0695377348 -0.0487095460
-0.3685019185 -0.0618186795 -0.0482648021
-0.1179790785 -0.0893685654 0.0299349520
0.1809914009 -0.0178885405 0.0041330783
-0.3819474077 -0.1156010090 -0.0327150062
0.4378466606 0.0818041523 -0.0303177549
-0.4967435453 -0.0801447503 -0.0367507682
-0.4409232647 -0.0672373132 -0.0644311526
0.4725564776 0.1537809071 -0.0068189101
0.4012580029 0.1349601854 -0.0931733420
-0.4183107991 -0.0610407276 -0.0251787109
0.1178014490 0.0168496351 -0.0424338449
0.1683081867 -0.0373138097 0.0341628668
-0.2058943257 -0.1274424107 0.0319628705
0.0085941215 0.1211764729 0.0200088325
0.0076611402 0.1203771730 -0.0099564422
0.0075825674 0.1204443997 -0.0054648462
0.0101284704 0.1214601009 0.0155374515
0.1375289289 0.0895873360 0.0482040665
0.4690780754 0.1683159389 -0.0085953000
-0.3105807948 -0.0187269417 0.0255084086
0.0367717591 -0.1018672373 0.0867579144
0.0100952718 -0.1077794814 0.1133457501
-0.2192324192 -0.0472243182 0.0440108320
-0.4158753237 -0.0945020654 0.0472715612
-0.2600999769 -0.0569588504 0.0494346647
-0.4884467425 -0.1138306441 -0.0495844482
-0.2975069778 -0.0664625432 0.0234555972
-0.3715451437 -0.0845361755 0.0104459289
-0.4245051985 -0.0966968454 0.0411604049
-0.3655910844 -0.0832448010 0.0030407954
-0.4268819430 -0.0994525502 -0.0726916265
-0.3923723166 -0.0890674256 0.0356163541
-0.4549203951 -0.1041994994 0.0317526839
-0.4591829600 -0.1053416993 0.0257032443
-0.3378255311 -0.0766679455 -0.0025639003
-0.4389330479 -0.1003176884 0.0334722473
-0.0482335350 -0.0083386069 -0.0749222598
-0.3675335300 -0.0847756767 -0.0523984506
-0.4796434415 -0.1101866900 0.0299118162
-0.4690986789 -0.0971894953 -0.0674717165
-0.0075682352 0.1321950025 -0.0059057572
-0.0063219863 0.1327251284 0.0060920472
-0.0580510309 0.1195112081 -0.0335639581
-0.0047352555 0.1329639387 -0.0013737312
-0.0355695254 0.1258198431 0.0131747984
0.4255599865 0.0552420455 -0.0159036657
0.4253435832 0.0803082373 0.0084353218
0.3307601643 0.0628843322 -0.0341547525
0.3708238695 0.0706650352 -0.0309489297
0.3252940553 0.0656616119 -0.0215584706
0.3252940553 0.0656616119 -0.0215584706
0.3233895852 0.0724925859 -0.0029681586
0.2860589344 0.0633232431 -0.0124721223
0.3626247061 0.0748309547 -0.0120545069
0.2860589344 0.0633232431 -0.0124721223
0.2683458441 0.0553230846 -0.0265192601
0.2879634045 0.0564922691 -0.0310624343
0.3353163862 0.0439586173 -0.0337917839
0.3381201861 0.0323121437 -0.0335684210
0.3731019805 0.0612021778 -0.0307674454
0.3353163862 0.0439586173 -0.0337917839
0.3307601643 0.0628843322 -0.0341547525
0.2929745700 0.0456407717 -0.0371790909
0.3731019805 0.0612021778 -0.0307674454
0.2929745700 0.0456407717 -0.0371790909
0.2763598838 0.0275561340 -0.0385097759
0.2975307919 0.0267150568 -0.0368161224
0.3391946452 0.0267691889 -0.0147407944
0.3354809582 0.0222672271 -0.0020049069
0.3778449099 0.0409609900 -0.0210185878
0.3391946452 0.0267691889 -0.0147407944
0.3381201861 0.0323121437 -0.0335684210
0.2994699214 0.0181203426 -0.0272906277
0.3778449099 0.0409609900 -0.0210185878
0.2994699214 0.0181203426 -0.0272906277
0.2806820186 0.0082529646 -0.0147379177
0.3005443805 0.0125773878 -0.0084630011
0.3315914483 0.0377324443 0.0096800556
0.3262708211 0.0466056448 0.0169446706
0.3703296245 0.0419406559 0.0039277248
0.3315914483 0.0377324443 0.0096800556
0.3354809582 0.0222672271 -0.0020049069
0.2967427820 0.0180590155 0.0037474239
0.3703296245 0.0419406559 0.0039277248
0.2967427820 0.0180590155 0.0037474239
0.2754289390 0.0236875183 0.0124660706
0.2928532721 0.0335242327 0.0154323864
0.3233895852 0.0724925859 -0.0029681586
0.3616724711 0.0782464417 -0.0027593509
0.3226251799 0.0624400714 0.0046594250
0.3226251799 0.0624400714 0.0046594250
0.3262708211 0.0466056448 0.0169446706
0.2883701379 0.0458780462 0.0129220711
0.3605258630 0.0631676700 0.0086820245
0.2883701379 0.0458780462 0.0129220711
0.2675969757 0.0534314602 0.0047681486
0.2847244967 0.0617124728 0.0006368255
0.2169977143 0.0450237994 -0.0193980919
0.2169977143 0.0450237994 -0.0193980919
0.2154306156 0.0504102274 -0.0000316902
0.2005175660 0.0424296900 -0.0080378492
0.2227574878 0.0221785986 -0.0376812736
0.2227574878 0.0221785986 -0.0376812736
0.2281998261 -0.0015508969 -0.0177564695
0.2281998261 -0.0015508969 -0.0177564695
0.2273137097 0.0032528836 -0.0373183051
0.1957683382 -0.0077695096 -0.0152343137
0.2259241058 0.0061765663 0.0120494082
0.2259241058 0.0061765663 0.0120494082
0.2190762568 0.0345758008 0.0122535554
0.2154306156 0.0504102274 -0.0000316902
0.2329500351 0.0477803375 0.0044338907
0.2190762568 0.0345758008 0.0122535554
0.1427374346 0.0271407788 -0.0196808676
0.1427374346 0.0271407788 -0.0196808676
0.1492112146 0.0013728918 -0.0386563817
0.1492112146 0.0013728918 -0.0386563817
0.1544259599 -0.0215840125 -0.0157507626
0.1544259599 -0.0215840125 -0.0157507626
0.1512211584 -0.0101723470 0.0169792757
0.1512211584 -0.0101723470 0.0169792757
0.1440757655 0.0196378873 0.0141611147
0.1440757655 0.0196378873 0.0141611147
0.4686814151 0.0809942432 -0.0177812217
0.3890674031 0.1269755351 -0.0752903764
0.3954543773 0.1535757531 -0.0538549796
0.2930946919 0.1348234222 -0.0680982785
0.3322698117 0.1421673724 -0.0765112782
0.2912544060 0.1384889184 -0.0547028135
0.2912544060 0.1384889184 -0.0547028135
0.2946340053 0.1458089275 -0.0367767567
0.2563790285 0.1366322292 -0.0350614895
0.3295093828 0.1476656166 -0.0564180807
0.2563790285 0.1366322292 -0.0350614895
0.2355617405 0.1283838756 -0.0431668843
0.2529994292 0.1293122202 -0.0529875463
0.2978261435 0.1151698352 -0.0677213504
0.3006168470 0.1035345669 -0.0667493345
0.3346355374 0.1323405789 -0.0763228142
0.2978261435 0.1151698352 -0.0677213504
0.2930946919 0.1348234222 -0.0680982785
0.2562852980 0.1176526786 -0.0594968147
0.3346355374 0.1323405789 -0.0763228142
0.2562852980 0.1176526786 -0.0594968147
0.2402463268 0.0992405133 -0.0550076188
0.2610167495 0.0979990916 -0.0591198866
0.3068001207 0.0992086234 -0.0485999248
0.3067253532 0.0955836729 -0.0358135071
0.3419132296 0.1127247046 -0.0657900855
0.3068001207 0.0992086234 -0.0485999248
0.3006168470 0.1035345669 -0.0667493345
0.2655037381 0.0900184857 -0.0495591738
0.3419132296 0.1127247046 -0.0657900855
0.2655037381 0.0900184857 -0.0495591738
0.2510388206 0.0810974733 -0.0318893886
0.2716870119 0.0856925421 -0.0314097641
0.3055852865 0.1124671630 -0.0248506715
0.3024352319 0.1218778468 -0.0168073490
0.3412310450 0.1157290239 -0.0411290412
0.3055852865 0.1124671630 -0.0248506715
0.3067253532 0.0955836729 -0.0358135071
0.2710795948 0.0923218119 -0.0195351375
0.3412310450 0.1157290239 -0.0411290412
0.2710795948 0.0923218119 -0.0195351375
0.2526866822 0.0991326265 -0.0059145349
0.2699395281 0.1092053020 -0.0085723019
0.2946340053 0.1458089275 -0.0367767567
0.3311991824 0.1513256212 -0.0474550523
0.2960401725 0.1362938964 -0.0283704657
0.2960401725 0.1362938964 -0.0283704657
0.3024352319 0.1218778468 -0.0168073490
0.2651669711 0.1211186687 -0.0103321990
0.3333084333 0.1370530745 -0.0348456158
0.2651669711 0.1211186687 -0.0103321990
0.2433353110 0.1279471044 -0.0128761823
0.2587719117 0.1355347182 -0.0218953156
0.1884205195 0.1189862937 -0.0217545458
0.1884205195 0.1189862937 -0.0217545458
0.1921369625 0.1248616367 -0.0030520314
0.1755953967 0.1169670136 -0.0062192215
0.1888960981 0.0956525788 -0.0393734822
0.1936275496 0.0759989918 -0.0389965541
0.2194759040 0.1004819349 -0.0508953510
0.1888960981 0.0956525788 -0.0393734822
0.1996221036 0.0724114774 -0.0201125554
0.1996221036 0.0724114774 -0.0201125554
0.1936275496 0.0759989918 -0.0389965541
0.1690422976 0.0675821213 -0.0085906866
0.2053667503 0.0820576613 0.0090555354
0.2042266836 0.0989411514 0.0200183710
0.2354338363 0.0890599509 -0.0032567678
0.2053667503 0.0820576613 0.0090555354
0.1985320218 0.1104455872 0.0085110853
0.1985320218 0.1104455872 0.0085110853
0.1206588414 0.1027269452 -0.0189514208
0.1206588414 0.1027269452 -0.0189514208
0.1256632287 0.0766192823 -0.0371985577
0.1256632287 0.0766192823 -0.0371985577
0.1307027193 0.0543903543 -0.0143069002
0.1307027193 0.0543903543 -0.0143069002
0.1289673230 0.0661417435 0.0176947619
0.1289673230 0.0661417435 0.0176947619
0.1232646233 0.0963139849 0.0156454162
0.1232646233 0.0963139849 0.0156454162
0.4295127585 0.1518242621 -0.0906843865
-0.2546047350 -0.1304952714 0.0423914005
-0.2546047350 -0.1304952714 0.0423914005
-0.2952198682 -0.1330708822 0.0162530543
-0.3241993540 -0.1266092460 -0.0060725644
-0.3314670353 -0.1458782216 -0.0358727502
-0.3287612866 -0.1294499776 -0.0165963315
-0.3063445450 -0.1648931194 -0.0171716963
-0.3287612866 -0.1294499776 -0.0165963315
-0.1630037088 -0.1166853144 -0.0258723750
-0.1389373308 -0.1084023798 -0.0165870458
-0.1650992024 -0.1104888600 -0.0379862498
-0.1630037088 -0.1166853144 -0.0258723750
-0.1869372579 -0.1268158173 -0.0126566109
-0.1628708799 -0.1185328828 -0.0033712817
-0.2242702885 -0.1437589406 -0.0257895935
-0.2561021149 -0.1405823329 -0.0630964533
-0.2552239319 -0.1572418798 -0.0590866025
-0.2561021149 -0.1405823329 -0.0630964533
-0.2760394987 -0.1488745628 -0.0644446328
-0.1843186767 -0.0038537207 -0.0608911884
-0.1563327257 -0.0163048431 -0.0572191721
-0.1907597096 0.0162441127 -0.0568105343
-0.1843186767 -0.0038537207 -0.0608911884
-0.2307746396 -0.0151936231 -0.0690243578
-0.2027886887 -0.0276447455 -0.0653523415
-0.2123046277 0.0085974017 -0.0645632047
-0.1748027377 -0.0400958679 -0.0616803252
-0.1563327257 -0.0163048431 -0.0572191721
-0.2027886887 -0.0276447455 -0.0653523415
-0.2412767651 -0.0162276027 -0.0714396942
-0.2412767651 -0.0162276027 -0.0714396942
-0.2849785843 -0.0298405363 -0.0720003808
-0.2521694157 -0.0188815485 -0.0730885660
-0.2731367069 -0.0054299857 -0.0725331373
-0.2640112931 -0.0432920991 -0.0725558095
-0.2941039981 0.0080215771 -0.0719777086
-0.3059458755 -0.0163889734 -0.0714449521
-0.2731367069 -0.0054299857 -0.0725331373
-0.2849785843 -0.0298405363 -0.0720003808
-0.3206728568 -0.0384144435 -0.0709983635
-0.2787382744 -0.0653175692 -0.0721092210
-0.3195396811 -0.1104765820 -0.0669038255
-0.3195396811 -0.1104765820 -0.0669038255
-0.3459411223 -0.1166241966 -0.0560382361
-0.3618206639 -0.0442224012 -0.0581486709
-0.1952565685 0.0215227693 -0.0464818312
-0.1952565685 0.0215227693 -0.0464818312
-0.1983958868 0.0328783660 -0.0174944136
-0.1983958868 0.0328783660 -0.0174944136
-0.2238400916 0.0322421016 -0.0325361143
-0.1979899062 0.0325310097 -0.0407022256
-0.1917655966 0.0184813148 0.0322724082
-0.1952185864 0.0298846133 0.0275473517
-0.2941694893 0.0226927613 0.0109440959
-0.3043807666 0.0307408891 -0.0035869895
-0.3610008977 -0.0136008274 -0.0383692189
-0.3479708793 0.0144993499 -0.0220828757
-0.3527151467 -0.0266623957 -0.0200517994
-0.3474526910 -0.0267337989 -0.0094721913
-0.3527151467 -0.0266623957 -0.0200517994
-0.3242031629 -0.0476974436 0.0114722541
-0.2841246635 -0.0335983016 0.0426722467
-0.3040438863 -0.0425947425 0.0244820029
-0.2906615720 -0.0097305008 0.0436986524
-0.2841246635 -0.0335983016 0.0426722467
-0.2654211630 -0.0288464552 0.0556617805
-0.2788034774 -0.0617106968 0.0364451309
-0.3123132356 -0.0971724172 0.0139187429
-0.2700786944 -0.0887437540 0.0437433307
-0.2647256755 -0.1143509269 0.0472162252
-0.2921539589 -0.0920697161 0.0269284916
-0.2700786944 -0.0887437540 0.0437433307
-0.2788034774 -0.0617106968 0.0364451309
-0.2513751940 -0.0839919076 0.0567328645
-0.3348027164 -0.0511801087 0.0030994656
-0.3236007376 -0.0977542776 0.0047415067
-0.2233304772 0.0398696611 -0.0629770461
-0.2705658561 0.0507472832 -0.0677112432
-0.2983053014 0.0249092155 -0.0625665320
-0.2315807307 0.0486345620 -0.0647506021
-0.2316319211 0.0438341187 -0.0332203100
-0.2372945976 0.0467799949 -0.0093944585
-0.2094863497 0.0503884733 -0.0497842556
-0.2316319211 0.0438341187 -0.0332203100
-0.2233304772 0.0398696611 -0.0629770461
-0.2676216200 0.0267609518 -0.0298491548
-0.2676798266 0.0548020670 -0.0130425845
-0.2657523003 0.0467954746 -0.0128890293
-0.2793889070 0.0532043417 -0.0297019519
-0.2818480056 0.0608679530 -0.0410951505
-0.2434141440 0.0736896647 -0.0357459789
-0.2793889070 0.0532043417 -0.0297019519
-0.2676798266 0.0548020670 -0.0130425845
-0.3178227687 0.0403826300 -0.0350511235
-0.2723649038 0.0605984622 -0.0536585895
-0.2705658561 0.0507472832 -0.0677112432
-0.2399021423 0.0773867250 -0.0477242977
-0.2818480056 0.0608679530 -0.0410951505
-0.3190523180 0.0442144356 -0.0407477228
-0.2723649038 0.0605984622 -0.0536585895
-0.3160898471 0.0291431638 -0.0202463569
-0.3160898471 0.0291431638 -0.0202463569
-0.3066067454 0.0288736731 -0.0328097959
-0.3266901370 0.0280825503 -0.0428867650
-0.3066067454 0.0288736731 -0.0328097959
-0.2676216200 0.0267609518 -0.0298491548
-0.2983053014 0.0249092155 -0.0625665320
-0.2711208532 -0.1640909123 -0.0158185292
-0.2641450561 -0.1603434003 -0.0284859525
-0.2865976749 -0.1708323819 -0.0324670337
-0.2711208532 -0.1640909123 -0.0158185292
-0.2641450561 -0.1603434003 -0.0284859525
-0.2242702885 -0.1437589406 -0.0257895935
-0.2397471102 -0.1505004102 -0.0424380980
-0.2486682344 -0.1536019307 -0.0118374480
-0.2552239319 -0.1572418798 -0.0590866025
-0.2796218778 -0.1670848700 -0.0451344570
-0.2397471102 -0.1505004102 -0.0424380980
-0.2163545429 -0.1530351902 -0.0464852988
-0.2163545429 -0.1530351902 -0.0464852988
-0.1752583116 -0.1561152224 -0.0401026062
-0.2146303899 -0.1665107971 -0.0477514376
-0.1806616704 -0.1362863281 -0.0228915918
-0.2242702885 -0.1437589406 -0.0257895935
-0.2069265416 -0.1415733946 -0.0090402676
-0.1980054173 -0.1384718741 -0.0396409176
-0.1895827946 -0.1393878486 0.0077090583
-0.1633179235 -0.1341007822 -0.0061422659
-0.2069265416 -0.1415733946 -0.0090402676
-0.1806616704 -0.1362863281 -0.0228915918
-0.1633179235 -0.1341007822 -0.0061422659
-0.1764797753 -0.1364507305 -0.0437889398
-0.2146558199 -0.1631581331 0.0068772278
-0.1895827946 -0.1393878486 0.0077090583
-0.2242677928 -0.1760178660 -0.0208129075
-0.2111021920 -0.1709598493 -0.0026813233
-0.2469106420 -0.1710825897 -0.0014331349
-0.1818765423 -0.1733661172 -0.0129953038
-0.2666590432 -0.1786696147 -0.0286305113
-0.2534934424 -0.1736115980 -0.0104989270
-0.2958846929 -0.1762633468 -0.0183165308
-0.2111021920 -0.1709598493 -0.0026813233
-0.1752937419 -0.1708371089 -0.0039295117
-0.2146558199 -0.1631581331 0.0068772278
-0.2216061871 -0.1702583090 -0.0350840143
-0.2653282404 -0.1757898362 -0.0357660647
-0.2146303899 -0.1665107971 -0.0477514376
-0.2216061871 -0.1702583090 -0.0350840143
-0.1778841337 -0.1647267818 -0.0344019640
-0.1586847128 -0.1677205752 -0.0197898320
-0.1805457395 -0.1704863388 -0.0201308572
-0.2242677928 -0.1760178660 -0.0208129075
-0.2653282404 -0.1757898362 -0.0357660647
-0.1805457395 -0.1704863388 -0.0201308572
-0.2915791320 0.0069630266 0.0419347534
-0.2915791320 0.0069630266 0.0419347534
-0.2449873842 -0.0239791891 0.0529498641
-0.2449873842 -0.0239791891 0.0529498641
-0.1846726074 -0.0112840415 0.0380855014
-0.1890927606 0.0069468938 0.0399823004
-0.1591149094 -0.0182310920 0.0378875711
-0.1846726074 -0.0112840415 0.0380855014
-0.1763948153 -0.0362012304 0.0408502364
-0.2102303054 -0.0043369910 0.0382834316
-0.1720554451 -0.0636934332 0.0390906397
-0.1528063282 -0.0444357879 0.0383901403
-0.1678496825 -0.0811634041 0.0394256891
-0.1720554451 -0.0636934332 0.0390906397
-0.2148930490 -0.0747165211 0.0422512352
-0.1763948153 -0.0362012304 0.0408502364
-0.1678496825 -0.0811634041 0.0394256891
-0.1429143805 -0.0852659847 0.0346803206
-0.1642663787 -0.0957886446 0.0352132953
-0.1619367021 -0.1084054880 0.0309489113
-0.2309414151 -0.0791246416 0.0540209481
-0.2309414151 -0.0791246416 0.0540209481
-0.3063445450 -0.1648931194 -0.0171716963
-0.1628708799 -0.1185328828 -0.0033712817
-0.1843826028 -0.1229876467 0.0142957944
-0.1603826392 -0.1137809280 0.0123305770
-0.1676712072 -0.0730042734 -0.0595649782
-0.1631674944 -0.0918846479 -0.0562075151
-0.1480089909 -0.0508801194 -0.0565560670
-0.1676712072 -0.0730042734 -0.0595649782
-0.1748027377 -0.0400958679 -0.0616803252
-0.1944649539 -0.0622200218 -0.0646892364
-0.1480089909 -0.0508801194 -0.0565560670
-0.2141271702 -0.0843441758 -0.0676981477
-0.1873334234 -0.0951284273 -0.0625738894
-0.1944649539 -0.0622200218 -0.0646892364
-0.1652379069 -0.0998839490 -0.0456376315
-0.1652379069 -0.0998839490 -0.0456376315
-0.1631674944 -0.0918846479 -0.0562075151
-0.1881871858 -0.1165675663 -0.0450403325
-0.2235778800 -0.0897455439 -0.0700297237
-0.2235778800 -0.0897455439 -0.0700297237
-0.2699495337 -0.0986254538 -0.0714569507
-0.2787382744 -0.0653175692 -0.0721092210
-0.3056438062 -0.1071993611 -0.0704549334
-0.2699495337 -0.0986254538 -0.0714569507
-0.2613760624 -0.1342812816 -0.0700243079
-0.2344705306 -0.0923994897 -0.0716785955
-0.3345687318 -0.0416916645 -0.0674472555
-0.3345687318 -0.0416916645 -0.0674472555
-0.2983053014 0.0249092155 -0.0625665320
-0.1603826392 -0.1137809280 0.0123305770
-0.1619367021 -0.1084054880 0.0309489113
-0.1391808589 -0.1015747467 0.0211327645
-0.2676216200 0.0267609518 -0.0298491548
-0.1970340115 0.0352632474 0.0094586477
-0.1723886006 0.0348079088 0.0177610511
-0.1952185864 0.0298846133 0.0275473517
-0.1970340115 0.0352632474 0.0094586477
-0.2235651346 0.0337818987 0.0041482283
-0.2007351488 0.0387051942 -0.0056380723
-0.1056201925 0.0642064948 -0.0305721955
-0.1284971161 0.0546581666 -0.0203430745
-0.1032809305 0.0583796667 -0.0424285368
-0.1056201925 0.0642064948 -0.0305721955
-0.0820038620 0.0789844845 -0.0183958603
-0.1048807857 0.0694361563 -0.0081667393
-0.0759282062 -0.0540314387 -0.0612402622
-0.1021374905 -0.0413937021 -0.0573937090
-0.0714244935 -0.0729118133 -0.0578827991
-0.0759282062 -0.0540314387 -0.0612402622
-0.0358715864 -0.0438227595 -0.0719278142
-0.0620808706 -0.0311850228 -0.0680812610
-0.0497189220 -0.0666691754 -0.0650868154
-0.0882901548 -0.0185472862 -0.0642347078
-0.1021374905 -0.0413937021 -0.0573937090
-0.0620808706 -0.0311850228 -0.0680812610
-0.0687365572 -0.0782383534 -0.0480186763
-0.0938992486 -0.0829824450 -0.0397740712
-0.0685978527 -0.0888432644 -0.0403672946
-0.0687365572 -0.0782383534 -0.0480186763
-0.0664835280 -0.0925237032 -0.0178044271
-0.0927727340 -0.0901251199 -0.0246669466
-0.0643880343 -0.0987201575 -0.0056905523
-0.0664835280 -0.0925237032 -0.0178044271
-0.0423086466 -0.0912418477 -0.0335047750
-0.0685978527 -0.0888432644 -0.0403672946
-0.0760087664 -0.0597416053 0.0437076473
-0.0724254626 -0.0743668458 0.0394952534
-0.0969939225 -0.0745550853 0.0368212996
-0.0684516722 -0.0873719631 0.0345164456
-0.0724254626 -0.0743668458 0.0394952534
-0.0476617594 -0.0733685446 0.0417860002
-0.0802145290 -0.0422716344 0.0433725978
-0.0760087664 -0.0597416053 0.0437076473
-0.1068858702 -0.0337248884 0.0405311193
-0.0802145290 -0.0422716344 0.0433725978
-0.0878160363 -0.0140248759 0.0450638355
-0.0611446951 -0.0225716219 0.0479053140
-0.1068858702 -0.0337248884 0.0405311193
-0.0344733540 -0.0311183678 0.0507467925
-0.0535431878 -0.0508183803 0.0462140763
-0.0611446951 -0.0225716219 0.0479053140
-0.0931690552 0.0115822969 0.0415909411
-0.1133631333 -0.0067979228 0.0396402910
-0.0975892084 0.0298132322 0.0434877401
-0.0931690552 0.0115822969 0.0415909411
-0.0729749771 0.0299625167 0.0435415912
-0.0878160363 -0.0140248759 0.0450638355
-0.1002620444 0.0413476533 0.0357778479
-0.0975892084 0.0298132322 0.0434877401
-0.1213297810 0.0263156906 0.0386305434
-0.1027450075 0.0583616547 0.0302367876
-0.0777629533 0.0533521955 0.0378645144
-0.1002620444 0.0413476533 0.0357778479
-0.1045604326 0.0637402888 0.0121480836
-0.1048807857 0.0694361563 -0.0081667393
-0.0814739821 0.0787513815 0.0029642793
-0.0934518617 0.0187586305 -0.0626362731
-0.0998928946 0.0388564639 -0.0585556190
-0.1108993182 -0.0049986675 -0.0580917145
-0.0934518617 0.0187586305 -0.0626362731
-0.0882901548 -0.0185472862 -0.0642347078
-0.0708426983 0.0052100118 -0.0687792665
-0.1108993182 -0.0049986675 -0.0580917145
-0.0533952418 0.0289673097 -0.0733238252
-0.0760044051 0.0425159284 -0.0671808318
-0.0708426983 0.0052100118 -0.0687792665
-0.1005475929 0.0473714263 -0.0482081425
-0.1005475929 0.0473714263 -0.0482081425
-0.0998928946 0.0388564639 -0.0585556190
-0.0802069690 0.0653372888 -0.0496192900
-0.1045604326 0.0637402888 0.0121480836
-0.1027450075 0.0583616547 0.0302367876
-0.1279672362 0.0544250636 0.0010170651
-0.0668976093 -0.0927474030 0.0158981113
-0.0908842811 -0.0964334241 0.0042981974
-0.0684516722 -0.0873719631 0.0345164456
-0.0668976093 -0.0927474030 0.0158981113
-0.0404013626 -0.0950341364 0.0059093617
-0.0643880343 -0.0987201575 -0.0056905523
0.0766936460 -0.0690571507 -0.0291333239
0.1233186049 -0.0513529657 -0.0327027783
0.1241073517 -0.0586057299 -0.0190974243
0.1474198311 -0.0497536375 -0.0208821515
0.0759048992 -0.0618043865 -0.0427386778
0.0292799403 -0.0795085715 -0.0391692234
0.1233186049 -0.0513529657 -0.0327027783
0.0766936460 -0.0690571507 -0.0291333239
0.0292799403 -0.0795085715 -0.0391692234
0.0076874122 -0.0884147206 -0.0216243057
0.0313942651 -0.0831890102 -0.0166063560
0.0788079707 -0.0727375895 -0.0065704564
0.1241073517 -0.0586057299 -0.0190974243
0.0313942651 -0.0831890102 -0.0166063560
0.0463869623 0.0523748351 -0.0651874736
0.0988589178 0.0454256394 -0.0619185151
0.1188961266 0.0674836295 -0.0570294830
0.0926601489 0.0709582274 -0.0586639623
0.0401881934 0.0779074230 -0.0619329207
-0.0060849932 0.0593240307 -0.0684564321
0.0926601489 0.0709582274 -0.0586639623
0.0463869623 0.0523748351 -0.0651874736
-0.0009232863 0.0220181141 -0.0700548667
-0.0060849932 0.0593240307 -0.0684564321
-0.0297401175 0.0441456702 -0.0708901286
0.0227318380 0.0371964746 -0.0676211702
-0.0533952418 0.0289673097 -0.0733238252
-0.0245784107 0.0068397536 -0.0724885633
-0.0297401175 0.0441456702 -0.0708901286
0.0515486691 0.0150689184 -0.0667859082
0.0988589178 0.0454256394 -0.0619185151
0.0752037934 0.0302472789 -0.0643522117
0.1014397712 0.0267726811 -0.0627177325
-0.0009232863 0.0220181141 -0.0700548667
0.0016575671 0.0033651558 -0.0708540840
0.0227318380 0.0371964746 -0.0676211702
0.0395334951 0.0864223855 -0.0515854443
0.0892334153 0.0879820026 -0.0518629476
0.1092063129 0.1023200015 -0.0470467562
0.0843563529 0.1015401929 -0.0469080045
0.0346564327 0.0999805758 -0.0466305011
-0.0101664250 0.0848627684 -0.0513079409
0.0819178216 0.1083192881 -0.0444305329
0.0401881934 0.0779074230 -0.0619329207
0.0395334951 0.0864223855 -0.0515854443
-0.0098390759 0.0806052871 -0.0564816791
0.0895607644 0.0837245213 -0.0570366859
-0.0098390759 0.0806052871 -0.0564816791
-0.0341980122 0.0734392568 -0.0641035348
-0.0091843776 0.0720903247 -0.0668291556
0.0353958395 0.1052102373 -0.0242250449
0.0822875250 0.1109341188 -0.0332278048
0.1046222649 0.1207464371 -0.0228718692
0.0811764222 0.1178844963 -0.0183704892
0.0342847366 0.1121606148 -0.0093677293
-0.0114958460 0.0994863557 -0.0152222850
0.0811764222 0.1178844963 -0.0183704892
0.0353958395 0.1052102373 -0.0242250449
-0.0122352528 0.0942566943 -0.0376277412
-0.0114958460 0.0994863557 -0.0152222850
-0.0353113922 0.0940095842 -0.0219236331
0.0346564327 0.0999805758 -0.0466305011
0.0822875250 0.1109341188 -0.0332278048
-0.0122352528 0.0942566943 -0.0376277412
0.0384736673 0.0824857581 0.0375890669
0.0880012981 0.0860365471 0.0428965667
0.0841009505 0.0995572690 0.0336374796
0.1088647659 0.1013326635 0.0362912296
0.0423740149 0.0689650362 0.0468481539
-0.0071536159 0.0654142473 0.0415406541
0.0880012981 0.0860365471 0.0428965667
0.0384736673 0.0824857581 0.0375890669
-0.0071536159 0.0654142473 0.0415406541
-0.0324502206 0.0738924932 0.0379753874
-0.0096365790 0.0824282487 0.0359995938
0.0359907042 0.0994997596 0.0320480066
0.0841009505 0.0995572690 0.0336374796
-0.0096365790 0.0824282487 0.0359995938
0.0479945848 0.0456614056 0.0465462705
0.0423740149 0.0689650362 0.0468481539
0.0927617568 0.0676243708 0.0473751685
-0.0023931571 0.0470020710 0.0460192559
0.0983823267 0.0443207402 0.0470732851
0.0927617568 0.0676243708 0.0473751685
0.1179556278 0.0669540381 0.0476386758
0.0479945848 0.0456614056 0.0465462705
0.0533476037 0.0200542327 0.0500191650
0.0029598618 0.0213948981 0.0494921503
0.0983823267 0.0443207402 0.0470732851
0.0029598618 0.0213948981 0.0494921503
-0.0249105187 0.0348688172 0.0474921958
-0.0023931571 0.0470020710 0.0460192559
0.0609491110 -0.0081925257 0.0483279273
0.1048595898 0.0173937745 0.0479641135
0.1324617154 0.0068603641 0.0459831345
0.1105064760 -0.0059327860 0.0461650414
0.0665959972 -0.0315190863 0.0465288551
0.0170386322 -0.0337788260 0.0486917410
0.1105064760 -0.0059327860 0.0461650414
0.0609491110 -0.0081925257 0.0483279273
0.0094371248 -0.0055320675 0.0503829787
0.0170386322 -0.0337788260 0.0486917410
-0.0087173609 -0.0324485969 0.0497192668
0.0351931179 -0.0068622966 0.0493554530
-0.0087173609 -0.0324485969 0.0497192668
-0.0344733540 -0.0311183678 0.0507467925
-0.0163188682 -0.0042018384 0.0514105045
0.0533476037 0.0200542327 0.0500191650
0.1048595898 0.0173937745 0.0479641135
0.0791035967 0.0187240036 0.0489916392
0.1010588361 0.0315171538 0.0488097323
0.0094371248 -0.0055320675 0.0503829787
0.0056363712 0.0085913117 0.0512285976
0.0351931179 -0.0068622966 0.0493554530
0.0707181700 -0.0483394680 0.0416092108
0.0665959972 -0.0315190863 0.0465288551
0.1153910055 -0.0260062571 0.0428056831
0.0219231617 -0.0538522971 0.0453323828
0.1153910055 -0.0260062571 0.0428056831
0.1418495961 -0.0316600334 0.0384842750
0.1195131784 -0.0428266389 0.0378860388
0.0707181700 -0.0483394680 0.0416092108
0.0746919604 -0.0613445852 0.0366304030
0.0258969521 -0.0668574144 0.0403535750
0.1195131784 -0.0428266389 0.0378860388
0.0219231617 -0.0538522971 0.0453323828
0.0258969521 -0.0668574144 0.0403535750
0.0014994479 -0.0696138289 0.0422151610
0.0762983958 -0.0667648350 0.0150182072
0.0788079707 -0.0727375895 -0.0065704564
0.0311966399 -0.0820428523 0.0054694096
0.1239097265 -0.0574595721 0.0029783412
0.0286870650 -0.0760700978 0.0270580732
0.0311966399 -0.0820428523 0.0054694096
0.0073909745 -0.0866954838 0.0114893426
0.0639106177 -0.0204152341 -0.0637914626
0.0694526120 -0.0436516356 -0.0596015892
0.1131627398 -0.0142057967 -0.0570306363
0.0202004899 -0.0498610731 -0.0663624156
0.1076207455 0.0090306048 -0.0612205096
0.1131627398 -0.0142057967 -0.0570306363
0.1350178037 0.0005171228 -0.0557451598
0.0639106177 -0.0204152341 -0.0637914626
0.0515486691 0.0150689184 -0.0667859082
0.0078385414 -0.0143769205 -0.0693568612
0.0358745795 -0.0173960773 -0.0665741619
0.0016575671 0.0033651558 -0.0708540840
0.1076207455 0.0090306048 -0.0612205096
0.1014397712 0.0267726811 -0.0627177325
0.0795847073 0.0120497616 -0.0640032089
0.0078385414 -0.0143769205 -0.0693568612
-0.0358715864 -0.0438227595 -0.0719278142
-0.0078355482 -0.0468419163 -0.0691451149
-0.0201974968 -0.0113577637 -0.0721395605
0.0202004899 -0.0498610731 -0.0663624156
0.0358745795 -0.0173960773 -0.0665741619
-0.0078355482 -0.0468419163 -0.0691451149
0.0721405483 -0.0489781757 -0.0497374664
0.0759048992 -0.0618043865 -0.0427386778
0.1210420560 -0.0413134783 -0.0430048496
0.0270033915 -0.0694690840 -0.0494712947
0.1210420560 -0.0413134783 -0.0430048496
0.1417284589 -0.0246549188 -0.0466373297
0.1172777051 -0.0284872675 -0.0500036382
0.0694526120 -0.0436516356 -0.0596015892
0.0229714871 -0.0614792738 -0.0642674789
0.0721405483 -0.0489781757 -0.0497374664
0.0762983958 -0.0667648350 0.0150182072
0.0746919604 -0.0613445852 0.0366304030
0.1223032912 -0.0520393223 0.0245905370
0.0286870650 -0.0760700978 0.0270580732
0.1239097265 -0.0574595721 0.0029783412
0.1223032912 -0.0520393223 0.0245905370
0.1461089566 -0.0473866909 0.0185706040
0.0346050897 0.1064647473 0.0109470936
0.0807810473 0.1185117513 -0.0007844200
0.1052546405 0.1175702656 0.0144507362
0.0821666617 0.1115467636 0.0203164930
0.0359907042 0.0994997596 0.0320480066
-0.0115708678 0.0944177433 0.0226786072
0.0821666617 0.1115467636 0.0203164930
0.0346050897 0.1064647473 0.0109470936
-0.0115708678 0.0944177433 0.0226786072
-0.0349791997 0.0940901087 0.0082295411
-0.0118912209 0.1001136107 0.0023637843
0.0342847366 0.1121606148 -0.0093677293
0.0807810473 0.1185117513 -0.0007844200
-0.0118912209 0.1001136107 0.0023637843
-0.0636277451 -0.1345178744 0.0060940179
-0.0891206610 -0.1459980660 -0.0114078252
-0.0668474815 -0.1213596345 0.0095857325
-0.0591791029 -0.1434430891 0.0070544210
-0.0735511615 -0.1233863592 0.0282242368
-0.0973021057 -0.1272740685 0.0031489989
-0.0809552735 -0.1225013579 0.0468074439
-0.0735511615 -0.1233863592 0.0282242368
-0.0498002173 -0.1194986499 0.0532994747
-0.0668474815 -0.1213596345 0.0095857325
-0.0792552835 -0.1297355731 0.0499414429
-0.1075582787 -0.1295636741 0.0325908091
-0.0771924672 -0.1415462696 0.0509032977
-0.0792552835 -0.1297355731 0.0499414429
-0.0654889936 -0.1537603174 0.0303184126
-0.0697967005 -0.1461116197 0.0413640549
-0.0943046104 -0.1610354404 0.0126955064
-0.0697967005 -0.1461116197 0.0413640549
-0.0388272302 -0.1426608455 0.0534641399
-0.0771924672 -0.1415462696 0.0509032977
-0.0591791029 -0.1434430891 0.0070544210
-0.0634324281 -0.1488592421 0.0190455552
-0.0911496651 -0.1558768263 0.0010635106
-0.0654889936 -0.1537603174 0.0303184126
-0.0634324281 -0.1488592421 0.0190455552
-0.0366733767 -0.1464851943 0.0479413187
-0.1119522918 0.0915864262 -0.0498184197
-0.1198120202 0.1019712932 -0.0523584403
-0.1506925148 0.0932013358 -0.0617556814
-0.1119522918 0.0915864262 -0.0498184197
-0.1196912159 0.0840061973 -0.0266203382
-0.1243595011 0.0863205503 -0.0080106659
-0.0949270545 0.0937559913 -0.0098543404
-0.1196912159 0.0840061973 -0.0266203382
-0.1133399377 0.0812693618 -0.0481902842
-0.1427723843 0.0738339207 -0.0463466098
-0.1273894875 0.1018486427 -0.0038021060
-0.1277558990 0.0939874924 -0.0074358367
-0.1291337934 0.1096988858 -0.0144365977
-0.1266605881 0.1161978318 -0.0279730707
-0.0968087264 0.1209624319 -0.0136652123
-0.1291337934 0.1096988858 -0.0144365977
-0.1273894875 0.1018486427 -0.0038021060
-0.1589856551 0.1049342857 -0.0287444561
-0.1230283344 0.1083286782 -0.0420233747
-0.1198120202 0.1019712932 -0.0523584403
-0.0937559969 0.1202773281 -0.0274586008
-0.1230283344 0.1083286782 -0.0420233747
-0.1266605881 0.1161978318 -0.0279730707
-0.1523006719 0.0963800282 -0.0565881485
-0.4543042356 -0.0489646339 -0.0282361415
-0.4696827289 -0.0556801477 -0.0246596150
-0.4458373968 -0.1546861171 -0.0235096342
-0.4290699109 -0.1537834172 -0.0262258649
-0.4034106812 -0.1237154867 -0.0659257052
-0.4410532459 -0.1440812830 -0.0527969649
-0.4446608221 -0.1121511125 -0.0698164298
-0.4034106812 -0.1237154867 -0.0659257052
-0.3878157781 -0.0891948042 -0.0684166734
-0.4479903110 -0.0983210228 -0.0700816715
-0.4102467603 -0.0823079258 -0.0704101880
-0.3477053922 -0.1062240907 -0.0539776640
-0.3878157781 -0.0891948042 -0.0684166734
-0.3597712005 -0.0591310921 -0.0578896774
-0.4601671263 -0.0647289005 -0.0535700176
3 330 417 57
3 115 330 57
3 32 231 417
3 330 32 417
3 148 458 83
3 231 458 148
3 32 83 231
3 320 318 148
3 83 320 148
3 115 57 318
3 320 459 318
3 115 459 320
3 115 461 330
3 460 461 115
3 460 462 112
3 115 462 460
3 464 465 463
3 262 465 464
3 464 466 115
3 463 466 464
3 262 468 467
3 112 468 262
3 467 469 463
3 112 469 467
3 470 471 32
3 81 471 470
3 32 472 470
3 330 472 32
3 474 475 473
3 112 475 474
3 474 476 330
3 473 476 474
3 112 478 477
3 81 478 112
3 477 479 473
3 81 479 477
3 480 481 83
3 224 481 480
3 83 482 480
3 32 482 83
3 484 485 483
3 81 485 484
3 484 486 32
3 483 486 484
3 81 488 487
3 224 488 81
3 487 489 483
3 224 489 487
3 490 491 320
3 319 491 490
3 320 492 490
3 83 492 320
3 494 495 493
3 224 495 494
3 494 496 83
3 493 496 494
3 224 498 497
3 319 498 224
3 497 499 493
3 319 499 497
3 320 501 115
3 500 501 320
3 500 502 262
3 320 502 500
3 504 505 503
3 319 505 504
3 504 506 320
3 503 506 504
3 319 508 507
3 262 508 319
3 507 509 503
3 262 509 507
3 112 510 377
3 262 510 112
3 511 512 340
3 262 512 511
3 377 513 340
3 511 513 377
3 81 514 276
3 112 514 81
3 377 515 112
3 276 515 377
3 224 516 299
3 81 516 224
3 517 518 276
3 81 518 517
3 517 519 299
3 276 519 517
3 319 520 314
3 224 520 319
3 299 521 224
3 314 521 299
3 522 523 262
3 340 523 522
3 319 524 262
3 522 524 319
3 314 525 319
3 340 525 314
3 254 377 340
3 219 254 340
3 401 276 377
3 254 401 377
3 415 299 276
3 401 415 276
3 316 314 299
3 415 316 299
3 219 340 314
3 316 219 314
3 254 526 423
3 219 526 254
3 261 527 219
3 423 527 261
3 401 528 222
3 254 528 401
3 423 529 254
3 222 529 423
3 415 530 345
3 401 530 415
3 222 531 401
3 345 531 222
3 316 532 317
3 415 532 316
3 345 533 415
3 317 533 345
3 219 534 261
3 316 534 219
3 317 535 316
3 261 535 317
3 246 0 56
3 379 246 56
3 150 147 0
3 232 150 0
3 149 399 220
3 344 149 220
3 322 315 399
3 149 322 399
3 58 375 315
3 322 58 315
3 182 296 375
3 58 182 375
3 116 379 296
3 182 116 296
3 153 246 379
3 116 153 379
3 153 232 246
3 84 150 232
3 153 84 232
3 344 220 150
3 84 344 150
3 379 56 296
3 375 296 205
3 315 375 205
3 399 315 189
3 315 205 189
3 220 399 189
3 150 220 147
3 246 232 0
3 149 154 322
3 322 373 58
3 154 373 322
3 155 149 344
3 155 154 149
3 58 374 182
3 373 374 58
3 374 155 344
3 374 536 182
3 344 536 374
3 147 220 148
3 318 147 148
3 220 189 231
3 148 220 231
3 205 296 57
3 205 57 417
3 296 56 57
3 56 318 57
3 56 0 318
3 0 147 318
3 205 417 231
3 189 205 231
3 74 338 265
3 301 74 265
3 244 421 338
3 74 244 338
3 50 537 284
3 421 537 50
3 244 284 421
3 68 66 50
3 284 68 50
3 301 265 66
3 68 538 66
3 301 538 68
3 301 540 74
3 539 540 301
3 539 541 304
3 301 541 539
3 543 544 542
3 159 544 543
3 543 545 301
3 542 545 543
3 159 547 546
3 304 547 159
3 546 548 542
3 304 548 546
3 549 550 244
3 410 550 549
3 244 551 549
3 74 551 244
3 553 554 552
3 304 554 553
3 553 555 74
3 552 555 553
3 304 557 556
3 410 557 304
3 556 558 552
3 410 558 556
3 559 560 284
3 140 560 559
3 284 561 559
3 244 561 284
3 563 564 562
3 410 564 563
3 563 565 244
3 562 565 563
3 410 567 566
3 140 567 410
3 566 568 562
3 140 568 566
3 569 570 68
3 61 570 569
3 68 571 569
3 284 571 68
3 573 574 572
3 140 574 573
3 573 575 284
3 572 575 573
3 140 577 576
3 61 577 140
3 576 578 572
3 61 578 576
3 68 580 301
3 579 580 68
3 579 581 159
3 68 581 579
3 583 584 582
3 61 584 583
3 583 585 68
3 582 585 583
3 61 587 586
3 159 587 61
3 586 588 582
3 159 588 586
3 304 589 135
3 159 589 304
3 590 591 234
3 159 591 590
3 135 592 234
3 590 592 135
3 593 594 410
3 202 594 593
3 593 595 304
3 410 595 593
3 135 596 304
3 202 596 135
3 140 597 45
3 410 597 140
3 598 599 202
3 410 599 598
3 598 600 45
3 202 600 598
3 601 602 61
3 67 602 601
3 601 603 140
3 61 603 601
3 45 604 140
3 67 604 45
3 159 605 234
3 61 605 159
3 67 606 61
3 234 606 67
3 134 135 234
3 409 134 234
3 165 202 135
3 134 165 135
3 192 45 202
3 165 192 202
3 64 67 45
3 192 64 45
3 409 234 67
3 64 409 67
3 134 607 305
3 409 607 134
3 3 608 409
3 305 608 3
3 165 609 411
3 134 609 165
3 305 610 134
3 411 610 305
3 192 611 138
3 165 611 192
3 411 612 165
3 138 612 411
3 64 613 63
3 192 613 64
3 138 614 192
3 63 614 138
3 409 615 3
3 64 615 409
3 63 616 64
3 3 616 63
3 431 209 266
3 263 431 266
3 201 51 209
3 420 201 209
3 49 164 98
3 97 49 98
3 65 62 164
3 49 65 164
3 264 133 62
3 65 264 62
3 355 34 133
3 264 355 133
3 306 263 34
3 355 306 34
3 335 431 263
3 306 335 263
3 335 420 431
3 286 201 420
3 335 286 420
3 97 98 201
3 286 97 201
3 263 266 34
3 133 34 387
3 62 133 387
3 164 62 372
3 62 387 372
3 98 164 372
3 201 98 51
3 431 420 209
3 49 16 65
3 65 259 264
3 16 259 65
3 14 49 97
3 14 16 49
3 264 256 355
3 259 256 264
3 256 14 97
3 256 617 355
3 97 617 256
3 51 98 50
3 66 51 50
3 98 372 421
3 50 98 421
3 209 51 66
3 34 265 338
3 387 34 338
3 266 66 265
3 34 266 265
3 266 209 66
3 387 338 421
3 372 387 421
3 366 364 179
3 366 326 364
3 18 326 366
3 18 433 326
3 178 433 18
3 178 39 433
3 179 39 178
3 179 364 39
3 326 70 364
3 326 174 70
3 433 174 326
3 433 169 174
3 39 169 433
3 39 313 169
3 364 313 39
3 364 70 313
3 366 179 178
3 178 18 366
3 237 175 17
3 237 103 175
3 367 103 237
3 367 105 103
3 19 105 367
3 19 171 105
3 17 171 19
3 17 175 171
3 103 313 175
3 103 169 313
3 105 169 103
3 105 35 169
3 171 35 105
3 171 214 35
3 175 214 171
3 175 313 214
3 237 17 19
3 19 367 237
3 390 365 77
3 390 106 365
3 78 106 390
3 78 250 106
3 203 250 78
3 203 172 250
3 77 172 203
3 77 365 172
3 106 405 365
3 106 36 405
3 250 36 106
3 250 174 36
3 172 174 250
3 172 70 174
3 365 70 172
3 365 405 70
3 390 77 203
3 203 78 390
3 180 173 282
3 180 252 173
3 181 252 180
3 181 248 252
3 283 248 181
3 283 176 248
3 282 176 283
3 282 173 176
3 252 214 173
3 252 35 214
3 248 35 252
3 248 41 35
3 176 41 248
3 176 72 41
3 173 72 176
3 173 214 72
3 180 282 283
3 283 181 180
3 249 104 434
3 249 404 104
3 40 404 249
3 40 71 404
3 107 71 40
3 107 361 71
3 434 361 107
3 434 104 361
3 404 251 104
3 404 403 251
3 71 403 404
3 71 72 403
3 361 72 71
3 361 41 72
3 104 41 361
3 104 251 41
3 249 434 107
3 107 40 249
3 70 405 312
3 313 70 312
3 214 313 312
3 72 214 312
3 403 72 312
3 278 36 174
3 278 174 169
3 278 169 35
3 278 35 41
3 278 41 251
3 406 403 312
3 278 251 362
3 36 278 38
3 73 312 405
3 251 403 406
3 251 406 362
3 36 38 73
3 405 36 73
3 124 73 38
3 38 37 124
3 363 406 10
3 363 362 406
3 10 406 312
3 124 312 73
3 124 10 312
3 278 362 363
3 38 278 37
3 37 278 363
3 184 230 427
3 184 144 230
3 185 144 184
3 185 453 144
3 428 453 185
3 428 92 453
3 427 92 428
3 427 230 92
3 144 142 230
3 144 356 142
3 453 356 144
3 453 357 356
3 92 357 453
3 92 270 357
3 230 270 92
3 230 142 270
3 184 427 428
3 428 185 184
3 120 89 385
3 120 456 89
3 119 456 120
3 119 454 456
3 384 454 119
3 384 229 454
3 385 229 384
3 385 89 229
3 456 270 89
3 456 357 270
3 454 357 456
3 454 309 357
3 229 309 454
3 229 392 309
3 89 392 229
3 89 270 392
3 120 385 384
3 384 119 120
3 350 91 30
3 350 141 91
3 228 141 350
3 228 308 141
3 29 308 228
3 29 397 308
3 30 397 29
3 30 91 397
3 141 271 91
3 141 358 271
3 308 358 141
3 308 356 358
3 397 356 308
3 397 142 356
3 91 142 397
3 91 271 142
3 350 30 29
3 29 228 350
3 429 225 118
3 429 146 225
3 426 146 429
3 426 143 146
3 260 143 426
3 260 227 143
3 118 227 260
3 118 225 227
3 146 392 225
3 146 309 392
3 143 309 146
3 143 457 309
3 227 457 143
3 227 395 457
3 225 395 227
3 225 392 395
3 429 118 260
3 260 426 429
3 186 273 348
3 186 31 273
3 352 31 186
3 352 226 31
3 88 226 352
3 88 145 226
3 348 145 88
3 348 273 145
3 31 396 273
3 31 28 396
3 226 28 31
3 226 395 28
3 145 395 226
3 145 457 395
3 273 457 145
3 273 396 457
3 186 348 88
3 88 352 186
3 457 396 359
3 309 457 359
3 357 309 359
3 356 357 359
3 358 356 359
3 274 395 392
3 274 392 270
3 274 270 142
3 274 142 271
3 359 396 272
3 360 358 359
3 271 393 274
3 28 274 347
3 393 271 358
3 393 358 360
3 28 347 272
3 28 272 396
3 274 28 395
3 349 311 347
3 347 311 272
3 393 360 235
3 87 393 235
3 359 272 311
3 235 360 359
3 235 359 311
3 274 349 347
3 393 87 274
3 274 87 349
3 269 342 436
3 444 378 342
3 269 444 342
3 241 444 269
3 22 247 378
3 444 22 378
3 137 22 444
3 241 137 444
3 53 137 241
3 110 46 247
3 22 110 247
3 440 110 22
3 137 440 22
3 370 440 137
3 53 370 137
3 243 370 53
3 253 195 46
3 110 253 46
3 243 240 370
3 100 240 243
3 253 416 195
3 100 200 240
3 441 269 436
3 86 241 269
3 441 86 269
3 448 86 441
3 371 53 241
3 86 371 241
3 43 371 86
3 448 43 86
3 445 43 448
3 168 243 53
3 371 168 53
3 295 168 371
3 43 295 371
3 96 295 43
3 445 96 43
3 446 96 445
3 15 100 243
3 168 15 243
3 336 15 168
3 295 336 168
3 15 166 100
3 342 441 436
3 79 448 441
3 342 79 441
3 378 79 342
3 114 445 448
3 79 114 448
3 245 114 79
3 378 245 79
3 247 245 378
3 376 446 445
3 114 376 445
3 198 376 114
3 245 198 114
3 1 198 245
3 247 1 245
3 46 1 247
3 376 55 446
3 198 55 376
3 1 156 198
3 152 156 1
3 46 152 1
3 195 152 46
3 195 321 152
3 416 206 321
3 200 100 166
3 195 416 321
3 440 370 240
3 110 440 253
3 442 440 240
3 440 442 253
3 447 291 442
3 163 447 442
3 163 442 240
3 48 163 240
3 48 240 200
3 199 48 200
3 199 200 412
3 450 199 412
3 450 412 139
3 291 253 442
3 291 102 253
3 102 416 253
3 102 294 416
3 294 206 416
3 294 450 206
3 450 341 206
3 343 618 221
3 161 618 343
3 277 619 161
3 221 619 277
3 161 620 277
3 191 620 161
3 191 33 277
3 33 621 291
3 191 621 33
3 622 623 191
3 102 623 622
3 622 624 389
3 191 624 622
3 291 625 102
3 191 625 291
3 193 627 380
3 626 627 193
3 626 628 238
3 193 628 626
3 238 630 629
3 160 630 238
3 629 631 380
3 160 631 629
3 160 238 267
3 160 632 54
3 267 632 160
3 238 346 381
3 381 267 238
3 381 633 267
3 12 633 381
3 634 635 12
3 267 635 634
3 21 636 12
3 634 636 21
3 21 12 136
3 136 268 21
3 268 136 294
3 294 102 268
3 333 638 131
3 637 638 333
3 637 639 281
3 333 639 637
3 641 642 640
3 126 642 641
3 641 643 281
3 640 643 641
3 644 645 640
3 131 645 644
3 644 646 126
3 640 646 644
3 281 647 126
3 2 647 281
3 125 648 2
3 126 648 125
3 650 651 649
3 2 651 650
3 650 652 125
3 649 652 650
3 653 654 649
3 95 654 653
3 653 655 2
3 649 655 653
3 656 657 132
3 95 657 656
3 656 658 125
3 132 658 656
3 132 659 12
3 129 659 132
3 136 660 129
3 12 660 136
3 129 661 136
3 450 661 129
3 450 294 136
3 129 662 450
3 4 662 129
3 303 663 333
3 288 663 303
3 281 664 288
3 333 664 281
3 158 665 303
3 287 665 158
3 287 667 666
3 288 667 287
3 666 668 303
3 288 668 666
3 4 332 199
3 199 450 4
3 48 199 332
3 13 669 302
3 337 669 13
3 337 670 302
3 6 670 337
3 287 6 242
3 242 331 287
3 6 337 388
3 388 242 6
3 242 671 331
3 99 671 242
3 99 672 331
3 212 672 99
3 212 99 5
3 5 386 212
3 673 674 5
3 386 674 673
3 673 675 48
3 5 675 673
3 122 676 5
3 163 676 122
3 163 677 5
3 48 677 163
3 432 447 122
3 439 678 432
3 447 678 439
3 679 680 432
3 439 680 679
3 679 681 388
3 432 681 679
3 682 683 437
3 388 683 682
3 682 684 439
3 437 684 682
3 277 33 447
3 439 685 447
3 277 685 439
3 686 687 277
3 221 687 686
3 686 688 439
3 277 688 686
3 689 690 437
3 439 690 689
3 689 691 221
3 437 691 689
3 163 692 447
3 122 692 163
3 291 693 33
3 447 693 291
3 21 268 389
3 332 183 386
3 255 117 398
3 351 255 398
3 211 69 117
3 255 211 117
3 90 394 69
3 211 90 69
3 151 7 394
3 90 151 394
3 351 398 7
3 151 351 7
3 351 694 255
3 368 694 351
3 695 696 368
3 183 696 695
3 695 697 351
3 368 697 695
3 698 699 211
3 331 699 698
3 211 700 698
3 255 700 211
3 701 702 368
3 255 702 701
3 701 703 331
3 368 703 701
3 211 704 90
3 212 704 211
3 331 705 211
3 212 705 331
3 706 707 151
3 386 707 706
3 90 708 151
3 706 708 90
3 709 710 212
3 90 710 709
3 212 711 709
3 386 711 212
3 712 713 351
3 183 713 712
3 351 714 712
3 151 714 351
3 183 716 386
3 715 716 183
3 715 717 151
3 183 717 715
3 212 718 386
3 331 718 212
3 719 720 183
3 331 720 719
3 386 721 183
3 719 721 386
3 722 723 368
3 331 723 722
3 722 724 183
3 368 724 722
3 177 725 389
3 54 725 177
3 21 727 726
3 389 727 21
3 726 728 54
3 389 728 726
3 730 731 729
3 267 731 730
3 730 732 54
3 729 732 730
3 733 734 729
3 21 734 733
3 733 735 267
3 729 735 733
3 267 736 21
3 236 736 267
3 236 738 737
3 213 738 236
3 737 739 21
3 213 739 737
3 741 742 740
3 54 742 741
3 741 743 267
3 740 743 741
3 744 745 740
3 109 745 744
3 744 746 54
3 740 746 744
3 236 748 109
3 747 748 236
3 747 749 267
3 236 749 747
3 54 750 170
3 177 750 54
3 170 751 54
3 109 751 170
3 752 754 177
3 753 754 752
3 753 755 187
3 752 755 753
3 756 757 177
3 752 757 756
3 756 758 389
3 177 758 756
3 170 760 187
3 759 760 170
3 759 761 177
3 170 761 759
3 21 763 389
3 762 763 21
3 762 764 213
3 21 764 762
3 213 767 766
3 187 767 213
3 766 768 765
3 187 768 766
3 769 770 765
3 389 770 769
3 769 771 187
3 765 771 769
3 213 236 20
3 213 20 9
3 236 109 108
3 236 108 20
3 109 170 279
3 109 279 108
3 170 187 290
3 170 290 279
3 187 213 9
3 187 9 290
3 242 772 99
3 388 772 242
3 432 773 388
3 99 773 432
3 5 432 122
3 99 432 5
3 337 774 388
3 435 774 337
3 437 775 435
3 388 775 437
3 776 777 13
3 337 777 776
3 13 778 776
3 24 778 13
3 779 780 435
3 24 780 779
3 435 781 779
3 337 781 435
3 194 783 24
3 782 783 194
3 782 784 80
3 194 784 782
3 785 786 435
3 80 786 785
3 785 787 24
3 435 787 785
3 194 789 788
3 414 789 194
3 788 790 80
3 414 790 788
3 80 791 425
3 414 791 80
3 80 792 435
3 221 792 80
3 437 793 221
3 435 793 437
3 80 425 221
3 425 343 221
3 161 177 191
3 177 794 191
3 389 794 177
3 425 160 343
3 160 54 343
3 343 54 161
3 54 177 161
3 160 796 795
3 425 796 160
3 795 797 380
3 425 797 795
3 798 799 280
3 346 799 798
3 280 800 798
3 131 800 280
3 802 803 801
3 126 803 802
3 802 804 131
3 801 804 802
3 805 806 801
3 346 806 805
3 805 807 126
3 801 807 805
3 193 808 238
3 280 808 193
3 809 810 346
3 280 810 809
3 346 811 809
3 238 811 346
3 125 812 126
3 381 812 125
3 346 813 381
3 126 813 346
3 814 815 132
3 125 815 814
3 814 816 12
3 132 816 814
3 817 818 381
3 12 818 817
3 817 819 125
3 381 819 817
3 132 820 129
3 95 820 132
3 4 821 95
3 129 821 4
3 95 183 4
3 183 332 4
3 281 288 2
3 288 368 2
3 2 368 95
3 95 822 183
3 368 822 95
3 823 824 414
3 425 824 823
3 380 825 414
3 823 825 380
3 288 287 368
3 287 826 368
3 331 826 287
3 158 828 827
3 302 828 158
3 827 829 6
3 302 829 827
3 6 831 830
3 287 831 6
3 830 832 158
3 287 832 830
3 303 834 158
3 833 834 303
3 833 835 207
3 303 835 833
3 207 837 836
3 297 837 207
3 836 838 158
3 297 838 836
3 280 840 131
3 839 840 280
3 839 841 382
3 280 841 839
3 843 844 842
3 449 844 843
3 843 845 382
3 842 845 843
3 846 847 842
3 131 847 846
3 846 848 449
3 842 848 846
3 280 850 849
3 193 850 280
3 849 851 23
3 193 851 849
3 382 852 23
3 280 852 382
3 380 854 193
3 853 854 380
3 853 855 307
3 380 855 853
3 307 857 856
3 23 857 307
3 856 858 193
3 23 858 856
3 859 860 414
3 223 860 859
3 194 861 414
3 859 861 194
3 862 863 223
3 414 863 862
3 239 864 223
3 862 864 239
3 865 866 194
3 223 866 865
3 194 867 865
3 24 867 194
3 869 870 868
3 25 870 869
3 869 871 24
3 868 871 869
3 872 873 868
3 223 873 872
3 872 874 25
3 868 874 872
3 13 876 24
3 875 876 13
3 875 877 217
3 13 877 875
3 25 879 217
3 878 879 25
3 878 880 24
3 25 880 878
3 881 882 13
3 217 882 881
3 302 883 13
3 881 883 302
3 11 885 884
3 217 885 11
3 884 886 302
3 217 886 884
3 887 888 297
3 158 888 887
3 11 889 297
3 887 889 11
3 890 891 333
3 157 891 890
3 333 892 890
3 131 892 333
3 894 895 893
3 449 895 894
3 894 896 131
3 893 896 894
3 897 898 893
3 157 898 897
3 897 899 449
3 893 899 897
3 303 900 207
3 333 900 303
3 901 902 157
3 333 902 901
3 157 903 901
3 207 903 157
3 904 905 302
3 11 905 904
3 302 906 904
3 158 906 302
3 414 908 380
3 907 908 414
3 907 909 239
3 414 909 907
3 239 911 910
3 307 911 239
3 910 912 380
3 307 912 910
3 914 915 391
3 913 915 914
3 60 916 391
3 914 916 60
3 917 918 913
3 23 918 917
3 917 919 60
3 913 919 917
3 23 922 921
3 307 922 23
3 921 923 920
3 307 923 921
3 924 925 920
3 391 925 924
3 924 926 307
3 920 926 924
3 127 929 928
3 300 929 127
3 928 930 927
3 300 930 928
3 931 932 927
3 157 932 931
3 931 933 300
3 927 933 931
3 936 937 935
3 157 937 936
3 936 938 934
3 935 938 936
3 939 940 935
3 449 940 939
3 939 941 157
3 935 941 939
3 934 944 943
3 942 944 934
3 943 945 127
3 942 945 943
3 946 947 942
3 449 947 946
3 942 948 946
3 934 948 942
3 300 951 950
3 369 951 300
3 950 952 949
3 369 952 950
3 953 954 949
3 207 954 953
3 949 955 953
3 369 955 949
3 957 958 956
3 207 958 957
3 957 959 300
3 956 959 957
3 207 961 960
3 157 961 207
3 960 962 956
3 157 962 960
3 369 965 964
3 59 965 369
3 964 966 963
3 59 966 964
3 967 968 963
3 297 968 967
3 967 969 59
3 963 969 967
3 971 972 297
3 970 972 971
3 207 973 297
3 971 973 207
3 974 975 970
3 369 975 974
3 974 976 207
3 970 976 974
3 978 979 42
3 977 979 978
3 430 980 42
3 978 980 430
3 981 982 977
3 217 982 981
3 981 983 430
3 977 983 981
3 217 986 985
3 11 986 217
3 985 987 984
3 11 987 985
3 988 989 984
3 42 989 988
3 988 990 11
3 984 990 988
3 992 993 991
3 430 993 992
3 992 994 217
3 991 994 992
3 995 996 430
3 991 996 995
3 26 997 430
3 995 997 26
3 999 1000 998
3 25 1000 999
3 999 1001 26
3 998 1001 999
3 25 1003 1002
3 217 1003 25
3 1002 1004 998
3 217 1004 1002
3 26 1007 1006
3 353 1007 26
3 1006 1008 1005
3 353 1008 1006
3 1009 1010 1005
3 223 1010 1009
3 1009 1011 353
3 1005 1011 1009
3 1014 1015 1013
3 223 1015 1014
3 1014 1016 1012
3 1013 1016 1014
3 1017 1018 25
3 223 1018 1017
3 1017 1019 1013
3 25 1019 1017
3 1012 1022 1021
3 1020 1022 1012
3 1021 1023 26
3 1020 1023 1021
3 1024 1025 1020
3 25 1025 1024
3 1020 1026 1024
3 1012 1026 1020
3 1028 1029 1027
3 353 1029 1028
3 1028 1030 223
3 1027 1030 1028
3 353 1032 1031
3 424 1032 353
3 1031 1033 1027
3 424 1033 1031
3 1035 1036 1034
3 239 1036 1035
3 1035 1037 424
3 1034 1037 1035
3 1038 1039 239
3 1034 1039 1038
3 223 1040 239
3 1038 1040 223
3 1042 1043 1041
3 307 1043 1042
3 1042 1044 391
3 1041 1044 1042
3 1045 1046 307
3 1041 1046 1045
3 239 1047 307
3 1045 1047 239
3 1049 1050 1048
3 190 1050 1049
3 1049 1051 382
3 1048 1051 1049
3 1052 1053 190
3 1048 1053 1052
3 127 1054 190
3 1052 1054 127
3 1056 1058 1055
3 1057 1058 1056
3 1057 1059 449
3 1056 1059 1057
3 1060 1061 1056
3 127 1061 1060
3 1055 1062 1056
3 1060 1062 1055
3 1064 1065 1063
3 382 1065 1064
3 1064 1066 449
3 1063 1066 1064
3 1067 1068 1063
3 1055 1068 1067
3 1067 1069 382
3 1063 1069 1067
3 1071 1072 1070
3 60 1072 1071
3 1071 1073 23
3 1070 1073 1071
3 60 1075 1074
3 190 1075 60
3 1074 1076 1070
3 190 1076 1074
3 23 1078 382
3 1077 1078 23
3 1077 1079 190
3 23 1079 1077
3 1081 1082 1080
3 424 1082 1081
3 1081 1083 239
3 1080 1083 1081
3 1084 1085 424
3 1080 1085 1084
3 391 1086 424
3 1084 1086 391
3 59 1089 1088
3 42 1089 59
3 1088 1090 1087
3 42 1090 1088
3 1091 1092 1087
3 11 1092 1091
3 1091 1093 42
3 1087 1093 1091
3 11 1096 1095
3 297 1096 11
3 1095 1097 1094
3 297 1097 1095
3 1098 1099 1094
3 59 1099 1098
3 1098 1100 297
3 1094 1100 1098
3 389 268 102
3 332 386 48
3 450 139 341
3 412 200 166
3 20 1102 9
3 1101 1102 20
3 1101 1103 204
3 20 1103 1101
3 204 1104 9
3 8 1104 204
3 108 1106 20
3 1105 1106 108
3 1105 1107 327
3 108 1107 1105
3 204 1109 327
3 1108 1109 204
3 1108 1110 20
3 204 1110 1108
3 279 1112 108
3 1111 1112 279
3 1111 1113 215
3 279 1113 1111
3 327 1114 215
3 108 1114 327
3 1115 1116 279
3 289 1116 1115
3 279 1117 1115
3 290 1117 279
3 215 1119 289
3 1118 1119 215
3 1118 1120 279
3 215 1120 1118
3 1121 1122 290
3 8 1122 1121
3 9 1123 290
3 1121 1123 9
3 1124 1125 8
3 290 1125 1124
3 8 1126 1124
3 289 1126 8
3 383 1127 117
3 455 1127 383
3 117 1129 398
3 1128 1129 117
3 1128 1130 455
3 117 1130 1128
3 1131 1132 298
3 69 1132 1131
3 383 1133 298
3 1131 1133 383
3 1134 1135 117
3 383 1135 1134
3 69 1136 117
3 1134 1136 69
3 298 1137 310
3 394 1137 298
3 69 1138 298
3 394 1138 69
3 1139 1140 325
3 7 1140 1139
3 310 1141 325
3 1139 1141 310
3 1142 1143 394
3 310 1143 1142
3 394 1144 1142
3 7 1144 394
3 1145 1146 455
3 398 1146 1145
3 455 1147 1145
3 325 1147 455
3 1148 1149 7
3 325 1149 1148
3 7 1150 1148
3 398 1150 7
3 451 47 27
3 257 76 258
3 47 257 258
3 52 257 47
3 451 52 47
3 130 52 451
3 216 218 75
3 76 216 75
3 123 1151 76
3 216 1151 123
3 257 1152 76
3 123 1152 257
3 418 123 257
3 52 418 257
3 44 418 52
3 130 44 52
3 328 451 27
3 101 130 451
3 328 101 451
3 233 101 328
3 94 233 328
3 402 233 94
3 101 113 130
3 197 113 101
3 233 197 101
3 354 197 233
3 233 1153 354
3 402 1153 233
3 354 1154 275
3 402 1154 354
3 85 275 402
3 82 275 85
3 400 275 82
3 196 354 275
3 400 196 275
3 400 1155 196
3 329 1155 400
3 111 197 354
3 111 1156 196
3 354 1156 111
3 196 1157 111
3 443 1157 196
3 443 1158 329
3 196 1158 443
3 443 1159 162
3 329 1159 443
3 438 113 197
3 111 438 197
3 452 438 111
3 443 452 111
3 419 1160 443
3 452 1160 419
3 419 1161 162
3 443 1161 419
3 339 419 162
3 438 44 113
3 418 44 438
3 452 418 438
3 123 418 452
3 216 123 419
3 339 216 419
3 218 216 339
3 44 130 113
3 446 55 328
3 27 446 328
3 96 446 27
3 47 96 27
3 295 96 47
3 295 47 258
3 336 295 258
3 76 336 258
3 210 336 76
3 75 210 76
3 208 210 75
3 218 208 75
3 334 208 218
3 339 334 218
3 55 94 328
3 55 198 94
3 156 402 94
3 198 156 94
3 408 85 402
3 156 408 402
3 407 82 85
3 408 407 85
3 93 400 82
3 407 93 82
3 152 408 156
3 323 407 408
3 323 408 152
3 93 407 323
3 292 93 323
3 210 15 336
3 422 15 210
3 208 422 210
3 422 208 285
3 285 208 334
3 121 167 339
3 167 334 339
3 188 400 93
3 324 188 93
3 324 93 292
3 167 285 334
3 188 329 400
3 162 121 339
3 293 324 292
3 293 188 324
3 167 413 285
3 121 413 167
3 329 1162 128
3 188 1162 329
3 128 1163 329
3 162 1163 128
3 162 1164 121
3 128 1164 162
3 293 128 188
3 128 413 121
3 452 1165 123
3 419 1165 452