OFF

899 1794 0
0.350499 -0.060827 0.022801
0.329396 -0.043952 0.047628
0.313202 -0.015271 0.057225
0.345240 -0.056331 0.033204
0.261307 -0.065111 -0.026977
0.247492 -0.000248 -0.041662
0.310531 -0.092032 0.005606
0.317917 0.011384 0.036881
0.339476 0.011035 0.082582
0.369103 0.015888 0.078976
0.411128 0.016487 0.079102
0.406607 0.017798 0.075999
0.393871 -0.033935 0.062942
0.378263 -0.038671 0.054739
0.380956 -0.040526 0.052519
0.478203 0.039249 0.043799
0.319432 -0.030762 0.064087
0.403589 -0.034568 0.075962
0.314662 -0.017992 0.069664
0.340879 -0.018857 0.080458
0.322650 0.009994 0.078074
0.398674 0.040662 0.067416
0.479386 0.038705 0.045198
0.394232 -0.044441 0.051637
0.393928 0.033199 0.062940
0.339574 -0.006164 0.083757
0.394762 -0.019972 0.070481
0.394174 -0.052420 -0.085914
0.363494 -0.017063 0.079597
0.391741 0.040240 0.053700
0.322350 -0.092079 -0.076584
0.381338 -0.019257 0.071412
0.440870 -0.009621 0.093698
0.451597 -0.074300 -0.005792
0.396846 0.040704 0.074963
0.479747 -0.025157 0.050286
0.451958 -0.082862 0.017606
0.497513 -0.026825 -0.008035
0.337226 0.012608 0.082887
0.369411 0.015604 0.079464
0.394337 -0.044681 0.051363
0.478761 0.011954 0.051254
0.343247 0.018823 0.081891
0.494743 -0.000455 0.003277
0.301430 -0.000295 -0.112059
0.401749 -0.022341 0.079375
0.414346 -0.065178 0.030558
0.296446 -0.088155 -0.093621
0.399365 -0.077123 -0.062918
0.375166 0.005176 0.089383
0.335196 0.048052 0.037722
0.478459 0.011960 0.049354
0.477169 -0.000439 0.050282
0.363912 0.059736 0.032301
0.387512 0.041950 0.050566
0.331367 -0.038455 0.063835
0.398382 0.043729 0.054514
0.394465 0.039518 0.056976
0.350057 -0.081570 -0.066645
0.341845 0.054019 0.023679
0.411192 0.030586 0.072130
0.360748 -0.051001 -0.082957
0.388726 0.050466 0.045776
0.318759 0.016400 0.035293
0.364805 0.006107 0.092643
0.331431 0.037823 0.063833
0.387436 -0.011365 0.077013
0.273037 -0.086833 -0.022324
0.385111 0.015922 0.072345
0.436992 0.083270 -0.002651
0.330215 0.007291 0.082383
0.434460 0.021220 0.094148
0.277865 -0.100289 -0.056816
0.377575 0.069164 0.022953
0.241339 -0.026962 -0.053878
0.390807 0.032343 0.062469
0.440886 0.008806 0.093698
0.423877 -0.079543 -0.016115
0.391818 0.043551 0.063843
0.478449 -0.040319 0.045026
0.388101 0.039977 0.049171
0.316083 -0.000304 0.038119
0.470352 0.051876 0.052431
0.368295 0.011730 0.087914
0.323738 -0.037367 0.056761
0.397200 -0.016365 0.070448
0.338361 -0.018240 0.077568
0.330202 -0.007920 0.082384
0.407550 -0.008101 0.081031
0.392722 0.033059 0.062620
0.375865 0.027536 0.065876
0.399644 0.038228 0.077434
0.496965 0.009496 -0.002164
0.406577 -0.018555 0.076000
0.347154 -0.007031 0.089584
0.394071 0.010053 0.076974
0.408297 -0.037989 0.066575
0.394412 0.043944 0.051360
0.452096 0.082025 0.017602
0.377111 0.078929 0.016611
0.396777 -0.041444 0.074965
0.398897 -0.081565 -0.044013
0.329470 0.043323 0.047626
0.398605 -0.041406 0.067418
0.425777 0.049838 0.059305
0.359125 -0.041321 0.068554
0.376978 -0.079640 0.016615
0.362737 0.016235 0.078698
0.340831 -0.027125 0.074433
0.460803 -0.060594 0.059159
0.401933 0.056223 -0.086153
0.339285 -0.028112 0.073546
0.388570 0.025233 0.066824
0.395144 -0.014595 0.070354
0.378204 0.015575 -0.090836
0.376256 0.035563 0.058861
0.381261 0.080028 -0.046481
0.376965 -0.059508 0.022950
0.313521 -0.011092 0.071179
0.330071 -0.000314 0.083329
0.381507 0.013630 0.075617
0.378327 0.037960 0.054737
0.381822 -0.038647 0.051040
0.368725 0.042899 0.062861
0.322368 -0.018381 0.077014
0.449073 0.024831 0.101794
0.391708 -0.043309 0.053481
0.398308 -0.044473 0.054516
0.357934 -0.090560 -0.012456
0.394798 -0.043857 0.068522
0.356857 0.042281 -0.085798
0.497204 0.017759 -0.002636
0.342170 0.012114 0.085553
0.409823 -0.049355 0.060310
0.360295 -0.048536 0.061954
0.407563 0.007342 0.081030
0.388583 -0.006052 0.078385
0.477837 0.052857 0.021437
0.364688 0.023572 0.075198
0.487988 -0.009616 0.066322
0.463952 -0.026865 0.102827
0.312149 -0.009006 0.058964
0.394261 0.051675 -0.085917
0.484373 -0.011729 -0.076049
0.339014 0.052001 0.029174
0.441378 0.015251 -0.101569
0.322834 -0.000308 0.078808
0.421824 -0.085215 -0.004731
0.437722 0.070735 0.024526
0.368274 -0.012423 0.087915
0.444606 -0.052614 0.079057
0.485955 -0.010337 0.032638
0.488003 0.008721 0.066322
0.392666 -0.033794 0.062622
0.340616 0.027533 0.073711
0.340910 0.018211 0.080457
0.333732 0.013004 0.082183
0.425693 -0.050629 0.059308
0.388498 0.019267 0.069639
0.366288 0.084783 -0.030513
0.355810 -0.000336 0.083687
0.444954 0.073741 0.042499
0.434591 0.067848 0.043829
0.400579 0.036213 0.062728
0.398697 -0.017319 -0.096100
0.486669 -0.048342 0.013871
0.466440 0.036591 -0.087222
0.474312 0.047870 0.059735
0.339346 -0.000322 0.084363
0.456807 0.080849 0.013560
0.397873 -0.021136 0.070529
0.400518 -0.036961 0.062730
0.339869 0.027401 0.073726
0.250906 -0.000252 -0.098523
0.432640 -0.065064 0.023619
0.466182 -0.000428 0.093652
0.440820 0.081510 0.013664
0.380882 -0.082375 -0.024408
0.455634 0.069105 -0.047626
0.356785 -0.042962 -0.085796
0.396314 0.025353 0.069447
0.398513 -0.044684 0.054303
0.439808 0.037389 -0.098311
0.375023 -0.019169 0.075786
0.447773 -0.074352 -0.030526
0.497173 -0.018673 -0.002635
0.428450 0.059054 0.041791
0.364911 -0.000343 0.093817
0.322504 0.091456 -0.076589
0.337232 -0.097571 -0.025113
0.431463 0.035244 0.086141
0.367330 0.040019 0.066405
0.436852 -0.084082 -0.002647
0.461328 0.068170 -0.019275
0.477748 -0.053736 0.021440
0.402005 -0.034192 0.081341
0.313539 0.010492 0.071179
0.358969 0.058903 0.041233
0.400361 -0.018227 0.075804
0.350600 0.060162 0.022798
0.428350 -0.059850 0.041794
0.383949 0.041208 0.050513
0.489654 0.016237 0.064361
0.365359 0.079735 -0.053454
0.369490 -0.016485 0.079226
0.412214 -0.059124 0.047775
0.254585 0.077001 -0.054692
0.461213 -0.069024 -0.019271
0.492941 0.039067 -0.027183
0.398869 0.061944 0.019533
0.483513 -0.000444 0.031565
0.484319 -0.000448 -0.079509
0.420107 0.081325 0.008740
0.478516 0.039440 0.045024
0.399320 -0.018675 0.076011
0.399350 0.017930 0.076010
0.474346 0.040275 0.084960
0.381886 0.037929 0.051038
0.362668 0.053016 0.055266
0.479788 0.024276 0.050284
0.429354 -0.014224 0.080874
0.311563 -0.059803 -0.101777
0.362709 -0.016918 0.078699
0.345772 0.013191 0.086211
0.340603 -0.023221 0.077269
0.399791 -0.072562 0.019369
0.398587 0.043940 0.054300
0.486634 0.030635 0.055986
0.456564 -0.053308 0.075648
0.362579 -0.053700 0.055269
0.477461 -0.000439 0.052197
0.351532 0.039991 0.069439
0.409905 0.048593 0.060307
0.409383 -0.000381 0.081857
0.340642 0.022574 0.077268
0.467155 0.050827 0.068768
0.394054 -0.010789 0.076974
0.324588 0.022409 -0.097835
0.311663 0.059196 -0.101780
0.361539 -0.016491 0.079207
0.322632 -0.010609 0.078075
0.332911 -0.000317 0.085187
0.331024 0.049587 -0.092507
0.337153 -0.023373 0.075127
0.401427 0.050487 0.052534
0.337232 0.017696 0.077341
0.494521 -0.000456 -0.058041
0.425063 0.035765 0.072484
0.384101 -0.022483 0.067231
0.489626 -0.017135 0.064362
0.399248 -0.080037 0.011813
0.398769 -0.084600 -0.003362
0.398861 -0.038640 0.078076
0.391745 -0.044283 0.063845
0.397955 -0.036270 0.058868
0.333151 -0.018810 0.076152
0.316783 -0.081169 -0.095491
0.360833 0.050314 -0.082959
0.250090 -0.051154 -0.044545
0.319624 0.031390 0.045674
0.406306 -0.018811 0.075905
0.460378 0.040604 0.090816
0.439481 -0.078268 -0.013527
0.418853 0.034560 -0.098829
0.350731 0.094009 -0.040437
0.387454 0.010641 0.077012
0.398726 0.016566 -0.096101
0.389594 0.043714 0.054240
0.359647 0.009274 0.082924
0.395050 -0.025336 0.069566
0.401821 -0.013081 0.078218
0.335676 0.065072 -0.087534
0.382355 0.029810 0.061056
0.398954 0.017365 0.070756
0.391783 -0.019589 0.070375
0.431816 0.075268 -0.057404
0.364980 -0.011701 0.087691
0.445415 0.076364 -0.009114
0.370090 -0.000348 0.093906
0.391781 0.042576 0.053479
0.479059 0.038747 0.043282
0.358086 0.089879 -0.012460
0.367281 0.015866 0.080628
0.326708 -0.032453 0.069164
0.478754 -0.012886 0.051244
0.316918 0.080554 -0.095496
0.377322 0.033860 0.057115
0.388465 -0.019994 0.069640
0.457447 -0.071113 0.007727
0.261884 -0.068394 -0.084890
0.389090 -0.000364 0.078904
0.385849 -0.044084 -0.087678
0.379370 0.083410 -0.007318
0.387441 -0.042677 0.050568
0.347516 -0.000329 0.089205
0.482023 -0.000442 0.081510
0.485413 0.028464 -0.067357
0.492875 -0.039974 -0.027181
0.376945 0.026176 0.063833
0.429377 0.013429 0.080873
0.352075 0.056926 0.036632
0.268033 -0.086675 -0.073338
0.341326 0.074173 -0.076388
0.388704 -0.031331 0.063008
0.400538 -0.016066 0.073698
0.350193 0.080900 -0.066649
0.394251 -0.043654 0.069724
0.396271 -0.026093 0.069448
0.356345 -0.005211 0.084323
0.313227 0.014669 0.057224
0.393516 -0.037144 0.057639
0.338018 -0.023272 0.075294
0.377506 0.023272 0.069163
0.388527 -0.025961 0.066825
0.497557 0.025912 -0.008036
0.394891 0.014674 0.072683
0.439612 0.077451 -0.013530
0.397190 0.026137 0.069186
0.339331 0.027468 0.073545
0.395152 -0.000373 -0.096549
0.384689 0.039268 0.049121
0.330743 0.030849 0.070892
0.384551 -0.000360 0.082250
0.446862 0.081934 0.004850
0.399033 0.080815 -0.044017
0.361107 0.033975 0.072008
0.443050 0.078436 0.022328
0.466103 -0.009878 0.099613
0.340373 0.026939 0.074079
0.485364 -0.029360 -0.067356
0.446723 -0.082762 0.004854
0.368761 -0.016238 0.079706
0.366145 -0.085477 -0.030509
0.443641 -0.062052 0.065248
0.372970 -0.013147 0.083588
0.331708 0.092345 -0.061803
0.479320 -0.039586 0.045200
0.381024 0.039811 0.052517
0.339851 0.027861 0.073461
0.409941 0.023945 0.074877
0.384623 -0.039990 0.049123
0.424641 -0.044001 0.067766
0.369076 -0.016582 0.078976
0.324550 -0.023036 -0.097834
0.336444 -0.046251 0.052927
0.358869 -0.059583 0.041236
0.406337 0.018054 0.075904
0.332532 0.044365 0.023109
0.398764 -0.062691 0.019536
0.304480 0.101009 -0.073496
0.400175 -0.022630 0.070811
0.418794 -0.035346 -0.098827
0.457143 -0.000421 0.093903
0.357623 0.021666 0.076851
0.398926 0.037897 0.078074
0.379306 0.036157 0.053165
0.463957 0.015686 -0.093279
0.326762 0.031830 0.069162
0.418860 -0.033942 0.073881
0.418917 0.033164 0.073880
0.378520 0.022091 0.066981
0.399494 0.076370 -0.062922
0.316921 0.005611 0.037677
0.379229 -0.084126 -0.007313
0.338057 0.022631 0.075293
0.323800 0.036748 0.056759
0.460309 -0.041451 0.090818
0.417020 0.032325 0.074048
0.389520 -0.044444 0.054242
0.358084 -0.005194 0.085235
0.398089 -0.028322 0.068476
0.402062 0.033444 0.081339
0.315595 -0.020871 0.068601
0.345749 -0.013846 0.086211
0.337191 0.022733 0.075126
0.470327 0.061681 -0.034168
0.367515 -0.057167 0.046815
0.321355 -0.000312 -0.100334
0.444693 0.051793 0.079055
0.385084 -0.016642 0.072346
0.450832 0.073782 0.039836
0.376682 0.029978 0.060622
0.323037 0.101679 -0.011787
0.388391 0.043580 0.054614
0.391673 -0.040973 0.053702
0.341316 -0.028312 0.073696
0.324542 0.029309 0.028382
0.290579 0.064689 -0.102942
0.333182 0.018177 0.076151
0.409901 -0.024708 0.074878
0.249035 -0.063567 -0.062942
0.335566 -0.065718 -0.087531
0.387815 -0.029658 0.063905
0.439745 -0.038210 -0.098309
0.391947 0.023846 0.069008
0.420197 0.051169 0.058322
0.486434 -0.008157 0.082044
0.483293 -0.000443 0.066832
0.381126 -0.080749 -0.046477
0.383374 0.005306 0.082516
0.464490 0.054232 -0.073391
0.381369 0.018542 0.071411
0.379245 -0.036869 0.053166
0.350573 -0.094678 -0.040432
0.434477 -0.068654 0.043833
0.375156 -0.005880 0.089384
0.435572 0.058433 -0.085660
0.415919 -0.042162 0.068658
0.367548 0.034001 0.069304
0.342957 -0.048044 0.056502
0.499088 0.009743 -0.036379
0.486360 0.017841 0.030902
0.333710 -0.013639 0.082183
0.311489 -0.000299 0.060415
0.403647 0.033815 0.075960
0.310685 0.091433 0.005602
0.486329 -0.018735 0.030903
0.393578 0.036409 0.057637
0.395168 0.013856 0.070353
0.382217 0.017562 0.069133
0.304493 0.028522 -0.108311
0.387181 -0.035710 0.057867
0.353302 -0.091104 0.001072
0.400623 -0.015766 0.073733
0.401785 0.021592 0.079374
0.337202 -0.018336 0.077342
0.375325 0.049714 0.047102
0.396325 -0.000370 0.080030
0.389889 0.014124 0.070194
0.478775 0.012006 0.051243
0.338751 -0.028179 0.073365
0.395270 0.014796 0.072698
0.364648 -0.024258 0.075199
0.341201 -0.074828 -0.076385
0.486447 0.007265 0.082043
0.340328 -0.027584 0.074081
0.440682 -0.082328 0.013668
0.394866 -0.015412 0.072684
0.481732 -0.037723 0.072166
0.477866 -0.024095 0.096021
0.350885 0.049894 0.060306
0.263236 0.083483 -0.040011
0.451721 0.073463 -0.005795
0.336521 0.045610 0.052925
0.369284 0.005641 0.093289
0.347165 0.006374 0.089583
0.463996 0.026013 0.102826
0.432075 -0.081577 0.008348
0.373892 0.080240 -0.049336
0.364361 -0.058565 -0.077670
0.351031 -0.000336 -0.091527
0.343215 -0.019474 0.081892
0.377458 -0.069874 0.022956
0.432572 0.057380 0.063725
0.402520 0.059923 0.041470
0.362671 0.015827 0.080101
0.402610 -0.027009 0.081213
0.474231 -0.048742 0.059737
0.401466 0.023310 0.070710
0.398911 0.083852 -0.003366
0.489734 0.019312 0.082806
0.382304 -0.030527 0.061058
0.364061 0.014541 0.081904
0.500000 -0.000460 -0.036620
0.399382 0.079289 0.011809
0.438749 -0.083125 -0.007584
0.460404 0.062909 0.032524
0.408705 0.037311 0.066492
0.376631 -0.030686 0.060624
0.437603 -0.071547 0.024529
0.332940 0.006624 0.084397
0.312828 -0.000300 0.072036
0.391510 -0.037002 0.057481
0.339834 0.028321 0.073195
0.395245 -0.015534 0.072699
0.322866 -0.102300 -0.011782
0.330090 0.013274 0.077995
0.356353 0.004539 0.084323
0.353330 -0.056882 0.051195
0.497565 -0.018933 -0.042007
0.479420 -0.025099 0.048402
0.381971 0.035994 -0.089726
0.398486 -0.029922 0.067461
0.453682 0.008576 0.099060
0.418753 -0.074038 0.014527
0.391907 -0.024580 0.069009
0.375054 0.018464 0.075786
0.414455 0.064406 0.030555
0.474277 -0.041144 0.084962
0.348476 -0.022349 0.079777
0.371560 0.056998 0.039868
0.370986 -0.046552 0.056703
0.466118 0.009022 0.099612
0.350801 -0.050558 0.060308
0.256552 0.034367 -0.095066
0.391571 0.036270 0.057479
0.330940 -0.050226 -0.092504
0.400649 0.015019 0.073732
0.444830 -0.074564 0.042503
0.489701 -0.020209 0.082807
0.354764 0.014376 0.083036
0.304444 -0.029116 -0.108310
0.484392 0.010833 -0.076049
0.475980 -0.009940 0.093199
0.369274 -0.006335 0.093289
0.425002 -0.036554 0.072486
0.370257 0.064944 -0.072688
0.481166 -0.049262 -0.053387
0.254455 -0.077509 -0.054688
0.263095 -0.084005 -0.040007
0.404220 0.025137 0.077561
0.261416 0.064593 -0.026981
0.339457 -0.011679 0.082583
0.496949 -0.010408 -0.002164
0.358092 0.004520 0.085234
0.337205 -0.013248 0.082888
0.381925 -0.026433 0.064031
0.397226 0.015623 0.070447
0.460904 0.059746 0.059156
0.481248 0.048372 -0.053389
0.398458 -0.083157 -0.008309
0.376196 -0.036269 0.058863
0.478663 -0.040242 0.041543
0.464398 -0.055093 -0.073388
0.391090 0.058926 0.035124
0.328926 -0.000313 0.079092
0.449031 -0.025659 0.101796
0.369384 -0.016299 0.079465
0.486750 0.047448 0.013868
0.396487 0.032733 0.064172
0.399912 0.071813 0.019365
0.388318 -0.044308 0.054616
0.322142 0.023537 0.032913
0.297302 0.069076 0.016662
0.423185 -0.000393 0.082300
0.401868 -0.038539 0.072635
0.432749 0.064260 0.023615
0.331552 -0.092983 -0.061799
0.241384 0.026476 -0.053879
0.435509 0.072211 0.015972
0.478993 -0.039627 0.043284
0.455518 -0.069951 -0.047623
0.430110 0.064759 0.017102
0.398806 -0.081721 -0.020102
0.456803 0.069413 0.038226
0.420110 -0.051950 0.058325
0.353425 0.056213 0.051192
0.336841 -0.006596 0.084894
0.338549 0.022549 0.075534
0.432475 -0.058180 0.063728
0.411514 -0.031337 0.072110
0.418769 0.011660 0.081169
0.400565 0.015318 0.073697
0.401932 0.037789 0.072633
0.338510 -0.023192 0.075535
0.330067 -0.013903 0.077996
0.328828 0.007083 0.077854
0.314692 0.017390 0.069663
0.358056 -0.000338 0.085241
0.395550 -0.051080 0.048446
0.441474 -0.000413 -0.102818
0.378812 0.057555 0.032715
0.401842 0.012331 0.078217
0.387865 0.028932 0.063904
0.399162 -0.021870 0.070657
0.388034 -0.040705 0.049173
0.390752 -0.033074 0.062471
0.404210 0.040718 0.059598
0.238883 -0.000242 -0.080643
0.375241 -0.050421 0.047104
0.387240 0.034985 0.057866
0.388756 0.030604 0.063007
0.388443 0.042125 0.050725
0.453667 -0.009411 0.099061
0.497597 0.018018 -0.042008
0.373756 -0.080948 -0.049332
0.389355 -0.015681 0.072518
0.331424 0.013401 0.079961
0.419970 -0.082108 0.008744
0.367610 0.056473 0.046812
0.485972 0.009444 0.032638
0.467069 -0.051685 0.068770
0.442917 -0.079256 0.022332
0.378715 -0.058268 0.032718
0.376288 -0.000358 -0.092252
0.278033 0.099742 -0.056821
0.419604 0.064962 0.016714
0.331401 -0.014032 0.079962
0.323332 0.022040 0.074683
0.470222 -0.062549 -0.034165
0.378482 -0.022802 0.066982
0.394871 0.043119 0.068519
0.250175 0.050654 -0.044548
0.395092 0.024598 0.069565
0.363811 -0.060423 0.032304
0.457566 0.070267 0.007724
0.360690 -0.009856 0.083874
0.398924 -0.018110 0.070756
0.353740 0.017955 -0.088420
0.395888 -0.036990 0.058064
0.364459 0.057871 -0.077673
0.296593 0.087575 -0.093626
0.353709 -0.018632 -0.088419
0.381969 0.025717 0.064029
0.367254 -0.016557 0.080629
0.402191 0.025514 0.070371
0.431689 -0.076074 -0.057401
0.478729 0.039362 0.041541
0.402918 0.020877 0.077185
0.378178 -0.016293 -0.090835
0.395949 0.036249 0.058063
0.449136 -0.082914 -0.000390
0.353502 0.033175 0.073438
0.447897 0.073520 -0.030530
0.347235 0.052631 0.046182
0.378070 -0.084467 0.000245
0.404141 -0.041473 0.059601
0.391746 0.032775 0.062484
0.400972 0.022293 0.079289
0.243245 -0.029493 -0.074972
0.415247 0.023726 0.077620
0.480158 0.057110 -0.010506
0.389380 0.014953 0.072517
0.341101 -0.052375 0.042606
0.378656 0.069482 -0.070283
0.496043 -0.009694 -0.050023
0.340876 0.026478 0.074432
0.381910 -0.036718 -0.089724
0.445572 -0.040138 0.092579
0.357173 0.060519 0.027548
0.425999 -0.024945 0.078291
0.479462 0.024218 0.048401
0.402147 -0.026264 0.070373
0.385776 -0.015775 0.070029
0.382187 -0.018278 0.069133
0.390991 -0.059658 0.035127
0.383364 -0.006023 0.082516
0.431239 -0.047993 0.077406
0.365224 -0.080430 -0.053450
0.353446 -0.033844 0.073440
0.389775 -0.032418 0.062601
0.342079 -0.000324 0.088175
0.436738 -0.000404 0.080203
0.394324 0.042918 0.069721
0.418749 -0.012438 0.081170
0.392127 -0.044636 0.062426
0.398136 0.027580 0.068474
0.412848 0.049719 0.059682
0.432212 0.080774 0.008344
0.343037 0.047393 0.056499
0.339130 0.022498 0.075646
0.399198 0.021125 0.070656
0.387709 0.027032 0.065224
0.329520 0.037170 0.021830
0.389828 0.031688 0.062600
0.336852 0.005957 0.084894
0.400862 -0.034015 0.081065
0.395210 -0.006531 0.078407
0.486087 0.031382 0.027760
0.338797 0.027535 0.073363
0.426055 -0.066385 0.015897
0.388641 -0.051195 0.045779
0.412313 0.058355 0.047772
0.367262 -0.040710 0.066407
0.392202 0.043903 0.062424
0.339786 -0.028967 0.073197
0.450708 -0.074615 0.039840
0.402882 -0.021628 0.077186
0.364999 0.011015 0.087691
0.445639 0.039315 0.092577
0.372991 0.012446 0.083588
0.395394 0.014493 0.072841
0.397391 -0.041800 0.073894
0.499071 -0.010661 -0.036379
0.429721 -0.073604 0.013674
0.370147 -0.065648 -0.072685
0.429844 0.072805 0.013670
0.496058 0.008781 -0.050023
0.364036 -0.015227 0.081904
0.409528 -0.024799 0.074863
0.314193 -0.107397 -0.056746
0.390392 -0.024808 0.068312
0.438888 0.082310 -0.007588
0.360376 0.047857 0.061952
0.411140 -0.031352 0.072132
0.389516 0.035869 0.057508
0.339092 -0.023142 0.075647
0.341363 0.027665 0.073694
0.408360 0.037228 0.066573
0.336936 -0.000320 0.085527
0.445695 -0.000411 0.090424
0.236810 -0.000240 -0.061681
0.418457 0.042116 0.068472
0.387663 -0.027758 0.065226
0.316886 0.023223 0.052130
0.328816 -0.007710 0.077855
0.409569 0.024038 0.074862
0.351979 -0.057594 0.036635
0.360565 0.062039 0.022963
0.368788 0.015544 0.079705
0.395220 0.005794 0.078407
0.443745 0.061233 0.065245
0.405941 -0.046138 -0.092205
0.375590 0.031509 0.062523
0.406018 0.045373 -0.092207
0.449274 0.082082 -0.000394
0.388372 -0.042852 0.050727
0.399580 -0.038973 0.077436
0.384138 0.021764 0.067230
0.368652 -0.043594 0.062864
0.470264 -0.052740 0.052434
0.390433 0.024077 0.068311
0.421967 0.084428 -0.004736
0.291217 0.106226 -0.040158
0.397690 -0.032483 0.065332
0.475996 0.009068 0.093199
0.370526 0.060450 0.023126
0.400918 0.033267 0.081063
0.408967 -0.029411 -0.098078
0.357071 -0.061196 0.027551
0.342387 -0.006632 0.088069
0.426040 0.024155 0.078290
0.419494 -0.065744 0.016717
0.375818 -0.028243 0.065877
0.408642 -0.038072 0.066494
0.399695 0.017865 0.076817
0.453445 -0.062968 0.063451
0.463930 -0.016549 -0.093278
0.397908 0.020394 0.070528
0.290470 -0.065260 -0.102939
0.369518 0.015790 0.079226
0.385802 0.015053 0.070028
0.378777 -0.050852 0.045098
0.453550 0.062132 0.063448
0.456686 -0.070257 0.038229
0.351464 -0.040656 0.069441
0.398015 0.035526 0.058866
0.341189 0.051725 0.042604
0.415989 0.041390 0.068656
0.400934 -0.023040 0.079290
0.409016 0.028641 -0.098079
0.418877 0.073258 0.014524
0.397524 -0.038735 0.062089
0.378211 0.083754 0.000240
0.431403 -0.036043 0.086143
0.338391 0.017597 0.077567
0.396185 -0.043087 0.062198
0.404177 -0.025891 0.077563
0.273182 0.086295 -0.022329
0.398456 0.030023 0.066819
0.371064 0.045854 0.056700
0.335119 0.017937 0.077015
0.256494 -0.034881 -0.095065
0.399664 -0.018611 0.076818
0.284377 -0.032540 -0.107185
0.435474 -0.059248 -0.085657
0.364794 -0.006792 0.092643
0.397744 0.031740 0.065330
0.377466 -0.023980 0.069164
0.396257 0.042347 0.062196
0.361049 -0.034656 0.072010
0.338140 0.068856 0.026444
0.427986 -0.078299 -0.037776
0.339584 0.005520 0.083757
0.345492 -0.084418 0.015723
0.398597 0.082409 -0.008313
0.361566 0.015809 0.079207
0.412764 -0.050487 0.059685
0.360460 -0.062722 0.022966
0.486034 -0.032274 0.027761
0.422569 -0.082921 -0.010544
0.339553 0.037761 0.067253
0.243294 0.029003 -0.074974
0.312163 0.008407 0.058963
0.377264 -0.034569 0.057117
0.404408 -0.041627 0.059471
0.335088 -0.018574 0.077016
0.486581 -0.031527 0.055987
0.395635 0.050339 0.048444
0.430000 -0.065558 0.017105
0.339804 -0.028506 0.073462
0.315630 0.020266 0.068600
0.415206 -0.024497 0.077621
0.396431 -0.033473 0.064173
0.388592 0.005325 0.078385
0.375536 -0.032215 0.062524
0.394795 0.019235 0.070480
0.441351 -0.016075 -0.101569
0.465751 -0.000433 -0.093777
0.384614 0.033134 0.058892
0.339489 -0.038405 0.067254
0.418386 -0.042893 0.068474
0.378539 -0.070199 -0.070279
0.255355 -0.062954 -0.033948
0.362644 -0.016510 0.080102
0.456670 -0.081693 0.013564
0.391815 0.018857 0.070374
0.434424 -0.022024 0.094149
0.466378 -0.037456 -0.087220
0.281103 -0.000278 -0.109614
0.360706 0.009177 0.083874
0.401446 -0.032476 0.068181
0.340569 -0.028180 0.073713
0.367490 -0.034692 0.069306
0.376668 -0.000353 0.089443
0.394398 -0.040255 0.056978
0.398405 -0.030767 0.066821
0.354739 -0.015046 0.083037
0.330690 -0.031479 0.070894
0.411566 0.030572 0.072109
0.371666 -0.026323 0.072116
0.398535 0.029177 0.067459
0.431319 0.047195 0.077404
0.397460 0.041059 0.073892
0.376901 -0.026883 0.063834
0.404477 0.040874 0.059469
0.377065 0.058797 0.022947
0.400391 0.017480 0.075803
0.378862 0.050141 0.045095
0.370424 -0.061150 0.023129
0.401341 -0.051236 0.052536
0.478740 -0.012834 0.051254
0.328985 0.040056 0.027752
0.478438 -0.012839 0.049355
0.249142 0.063066 -0.062945
0.481794 0.036840 0.072164
0.394306 0.043703 0.051635
0.384558 -0.033856 0.058894
0.345334 0.055674 0.033201
0.342397 0.005983 0.088068
0.323579 0.036828 0.037442
0.456653 0.052467 0.075646
0.371463 -0.057699 0.039871
0.416965 -0.033100 0.074050
0.428116 0.077500 -0.037780
0.401472 -0.027827 0.080907
0.304310 -0.101602 -0.073491
0.401518 0.027079 0.080905
0.398943 0.080972 -0.020106
0.291039 -0.106795 -0.040152
0.371709 0.025624 0.072115
0.357586 -0.022340 0.076852
0.411100 -0.017252 0.079102
0.480061 -0.057995 -0.010503
0.424714 0.043213 0.067764
0.388137 0.042273 0.050372
0.445286 -0.077190 -0.009110
0.391690 -0.033507 0.062485
0.347146 -0.053291 0.046184
0.401500 0.031728 0.068179
0.383880 -0.041929 0.050515
0.473188 -0.000434 0.090437
0.402419 -0.060674 0.041473
0.393421 0.024007 0.069407
0.400212 0.021884 0.070809
0.397145 -0.026879 0.069188
0.381483 -0.014344 0.075618
0.389865 -0.014854 0.070195
0.395763 0.014830 0.072903
0.470610 -0.064511 -0.002374
0.402655 0.026259 0.081212
0.337395 0.096925 -0.025118
0.332928 -0.007257 0.084397
0.381020 0.081656 -0.024412
0.385922 0.043354 -0.087680
0.353454 0.090432 0.001067
0.401426 -0.024058 0.070711
0.314373 0.106789 -0.056751
0.348513 0.021689 0.079776
0.422707 0.082132 -0.010548
0.401170 0.020953 0.071480
0.268178 0.086143 -0.073342
0.393380 -0.024743 0.069408
0.435387 -0.073020 0.015975
0.424010 0.078752 -0.016119
0.470717 0.063642 -0.002377
0.397588 0.037993 0.062087
0.359631 -0.009951 0.082925
0.261998 0.067872 -0.084894
0.359194 0.040643 0.068551
0.460298 -0.063759 0.032527
0.322399 0.017766 0.077013
0.284431 0.031978 -0.107186
0.342149 -0.012761 0.085553
0.345633 0.083760 0.015718
0.319483 0.030151 0.064085
0.478136 -0.040127 0.043801
0.401134 -0.021700 0.071481
0.388065 -0.043000 0.050374
0.477906 0.023219 0.096020
0.389455 -0.036598 0.057510
0.363523 0.016378 0.079596
0.395738 -0.015569 0.072904
0.395369 -0.015231 0.072842
0.401838 -0.056980 -0.086150
0.426166 0.065592 0.015894
0.323295 -0.022658 0.074685
0.339822 -0.028046 0.073728
0.255460 0.062445 -0.033951
3 1 3 84
3 3 0 84
3 0 81 84
3 81 2 84
3 2 16 84
3 1 623 3
3 0 764 81
3 764 6 81
3 6 67 81
3 67 4 81
3 0 768 764
3 81 141 2
3 768 452 764
3 4 793 81
3 793 258 81
3 258 74 81
3 74 5 81
3 5 362 81
3 5 7 362
3 5 63 7
3 5 532 63
3 5 386 532
3 5 653 386
3 5 347 653
3 5 59 347
3 5 533 59
3 5 511 533
3 5 898 511
3 5 592 898
3 5 538 592
3 511 748 533
3 748 415 533
3 5 691 538
3 511 441 748
3 748 382 415
3 67 509 4
3 6 839 67
3 358 791 833
3 133 791 767
3 692 359 738
3 647 738 232
3 833 782 358
3 407 833 791
3 407 791 133
3 767 820 133
3 359 620 367
3 367 738 359
3 692 738 647
3 647 232 244
3 14 402 122
3 850 122 340
3 565 293 340
3 474 85 437
3 576 113 857
3 379 857 633
3 31 633 634
3 758 634 590
3 723 590 814
3 785 814 468
3 521 468 774
3 13 774 402
3 430 790 55
3 430 55 808
3 665 639 735
3 665 735 790
3 385 489 841
3 385 841 639
3 706 40 888
3 23 181 40
3 127 775 181
3 616 724 775
3 893 304 892
3 260 423 93
3 679 93 389
3 684 389 550
3 96 550 724
3 893 474 437
3 28 342 222
3 596 239 877
3 369 877 308
3 558 308 160
3 342 527 204
3 239 28 222
3 820 545 205
3 767 341 545
3 791 505 341
3 358 630 505
3 604 334 527
3 604 527 331
3 149 405 334
3 504 804 405
3 785 803 723
3 14 491 13
3 260 198 304
3 819 768 594
3 719 345 594
3 697 478 345
3 848 493 478
3 23 746 127
3 697 623 848
3 3 719 0
3 409 623 344
3 409 735 493
3 55 409 344
3 55 344 84
3 344 623 1
3 141 18 2
3 471 141 413
3 16 55 84
3 372 283 16
3 18 896 372
3 118 124 18
3 146 118 471
3 525 695 146
3 695 555 240
3 896 555 255
3 896 255 283
3 678 596 276
3 369 276 596
3 558 756 369
3 160 308 294
3 877 373 94
3 308 877 94
3 489 239 222
3 841 489 222
3 451 807 489
3 504 187 278
3 149 756 504
3 678 149 604
3 678 604 794
3 432 222 342
3 760 841 432
3 105 639 760
3 134 735 105
3 229 493 134
3 376 478 229
3 832 345 376
3 583 819 594
3 583 594 832
3 660 200 174
3 779 660 174
3 46 722 348
3 635 117 583
3 852 348 635
3 205 46 852
3 205 545 200
3 782 644 630
3 630 644 220
3 88 534 644
3 657 233 88
3 136 427 657
3 136 657 66
3 657 88 236
3 88 644 270
3 732 14 850
3 732 850 661
3 893 270 423
3 576 236 893
3 576 893 437
3 746 103 127
3 103 535 616
3 535 17 96
3 17 747 684
3 747 667 679
3 888 40 661
3 40 181 559
3 181 775 820
3 775 724 133
3 724 550 407
3 550 389 833
3 389 93 782
3 93 423 842
3 709 13 491
3 663 521 709
3 810 723 803
3 183 758 810
3 379 183 856
3 379 856 576
3 636 66 856
3 322 136 636
3 322 636 804
3 636 856 405
3 527 334 204
3 856 183 334
3 810 342 204
3 183 810 204
3 810 803 432
3 803 105 760
3 663 709 105
3 709 491 134
3 569 229 491
3 832 569 732
3 732 661 583
3 559 635 661
3 820 852 559
3 217 121 337
3 320 337 201
3 54 80 201
3 418 431 315
3 428 315 622
3 731 622 68
3 419 68 401
3 360 401 312
3 298 312 90
3 381 90 703
3 286 703 115
3 355 115 121
3 321 771 473
3 321 473 659
3 771 612 687
3 473 771 687
3 612 868 626
3 687 612 626
3 845 826 572
3 97 56 826
3 226 567 56
3 815 688 567
3 858 497 671
3 11 552 346
3 339 346 696
3 809 696 60
3 467 60 688
3 858 671 431
3 107 699 891
3 268 455 800
3 477 800 514
3 558 160 514
3 699 730 39
3 107 455 766
3 662 647 244
3 395 692 647
3 844 359 692
3 247 620 359
3 699 670 83
3 699 83 282
3 83 670 444
3 49 278 444
3 703 90 191
3 337 121 426
3 346 552 608
3 698 716 629
3 53 300 629
3 197 614 300
3 546 649 614
3 826 56 279
3 653 830 386
3 386 259 532
3 532 694 63
3 7 63 309
3 7 773 362
3 81 362 413
3 300 614 828
3 199 300 828
3 443 614 649
3 440 771 649
3 443 771 65
3 443 65 102
3 443 50 737
3 737 144 828
3 59 199 144
3 347 50 822
3 822 102 830
3 830 365 259
3 259 885 694
3 694 781 309
3 309 196 773
3 471 413 196
3 365 357 885
3 885 588 781
3 781 881 557
3 557 20 196
3 146 471 20
3 556 525 20
3 476 556 881
3 388 881 588
3 388 588 321
3 668 455 462
3 514 800 64
3 558 514 187
3 160 445 477
3 477 223 500
3 477 500 268
3 353 766 500
3 353 500 868
3 868 223 42
3 444 278 64
3 83 444 668
3 282 668 462
3 282 462 891
3 9 353 138
3 138 612 325
3 325 231 879
3 879 440 683
3 683 546 218
3 218 197 579
3 579 53 490
3 490 716 816
3 490 816 561
3 542 186 487
3 895 542 487
3 209 895 487
3 561 209 524
3 524 487 454
3 454 186 662
3 662 104 395
3 721 10 620
3 721 534 551
3 551 233 135
3 135 427 700
3 700 290 784
3 700 784 95
3 135 700 562
3 551 135 10
3 201 426 818
3 201 818 845
3 671 497 95
3 315 95 265
3 622 315 265
3 21 759 567
3 553 21 688
3 414 553 60
3 510 414 696
3 608 510 346
3 845 778 97
3 97 244 226
3 226 232 815
3 815 738 467
3 467 367 809
3 809 620 339
3 339 10 11
3 11 562 497
3 750 115 123
3 123 703 191
3 408 312 840
3 840 401 486
3 120 401 68
3 120 68 265
3 120 784 399
3 399 290 322
3 399 322 49
3 120 399 670
3 120 39 730
3 120 730 486
3 486 9 138
3 840 486 138
3 408 840 325
3 408 325 191
3 123 191 683
3 750 123 218
3 750 579 426
3 818 579 490
3 818 524 62
3 62 454 778
3 778 662 244
3 13 402 14
3 14 122 850
3 850 340 293
3 85 113 437
3 437 113 576
3 576 857 379
3 379 633 31
3 31 634 758
3 758 590 723
3 723 814 785
3 785 468 521
3 521 774 13
3 888 850 293
3 243 430 808
3 665 790 430
3 385 639 665
3 489 385 108
3 451 489 108
3 23 40 706
3 127 181 23
3 616 775 127
3 96 724 616
3 304 893 423
3 304 423 260
3 260 93 679
3 679 389 684
3 684 550 96
3 888 293 706
3 892 474 893
3 342 28 331
3 239 596 794
3 596 877 369
3 369 308 558
3 331 527 342
3 28 239 794
3 767 545 820
3 791 341 767
3 358 505 791
3 782 630 358
3 604 331 28
3 149 334 604
3 504 405 149
3 804 504 278
3 803 785 663
3 569 491 14
3 198 892 304
3 667 198 260
3 719 594 768
3 697 345 719
3 848 478 697
3 409 493 848
3 126 746 23
3 413 141 81
3 3 623 697
3 768 0 719
3 697 719 3
3 848 623 409
3 790 735 409
3 790 409 55
3 84 344 1
3 372 16 2
3 18 372 2
3 118 18 141
3 118 141 471
3 808 55 283
3 283 55 16
3 896 283 372
3 896 18 124
3 124 118 240
3 240 118 146
3 240 146 695
3 124 240 555
3 124 555 896
3 808 283 255
3 808 255 243
3 794 596 678
3 276 369 756
3 756 558 187
3 94 294 308
3 373 877 807
3 807 877 239
3 807 239 489
3 373 807 451
3 756 187 504
3 276 756 149
3 276 149 678
3 28 794 604
3 841 222 432
3 639 841 760
3 735 639 105
3 493 735 134
3 478 493 229
3 345 478 376
3 594 345 832
3 117 819 583
3 200 660 46
3 660 722 46
3 348 117 635
3 46 348 852
3 200 46 205
3 157 200 545
3 644 782 842
3 642 220 534
3 534 220 644
3 534 88 233
3 233 657 427
3 427 136 290
3 66 657 236
3 236 88 270
3 270 644 842
3 341 157 545
3 569 14 732
3 888 661 850
3 236 270 893
3 66 236 576
3 23 706 126
3 616 127 103
3 96 616 535
3 684 96 17
3 679 684 747
3 260 679 667
3 559 661 40
3 820 559 181
3 133 820 775
3 407 133 724
3 833 407 550
3 782 833 389
3 842 782 93
3 270 842 423
3 521 13 709
3 785 521 663
3 758 723 810
3 31 758 183
3 31 183 379
3 66 576 856
3 136 66 636
3 290 136 322
3 405 804 636
3 334 405 856
3 204 334 183
3 432 342 810
3 760 432 803
3 663 105 803
3 134 105 709
3 229 134 491
3 376 229 569
3 376 569 832
3 583 832 732
3 635 583 661
3 852 635 559
3 205 852 820
3 355 121 217
3 217 337 320
3 320 201 80
3 517 431 418
3 418 315 428
3 428 622 731
3 731 68 419
3 419 401 360
3 360 312 298
3 298 90 381
3 381 703 286
3 286 115 355
3 54 201 845
3 321 659 374
3 65 771 321
3 612 771 231
3 353 868 612
3 42 626 868
3 97 826 845
3 226 56 97
3 815 567 226
3 467 688 815
3 497 858 552
3 497 552 11
3 11 346 339
3 339 696 809
3 809 60 467
3 845 572 54
3 431 671 315
3 699 107 9
3 766 455 268
3 268 800 477
3 477 514 160
3 699 9 730
3 455 107 891
3 395 647 662
3 844 692 395
3 247 359 844
3 721 620 247
3 282 891 699
3 670 699 39
3 49 444 670
3 804 278 49
3 408 191 90
3 750 426 121
3 552 858 817
3 817 608 552
3 53 629 716
3 197 300 53
3 546 614 197
3 440 649 546
3 759 279 56
3 653 347 822
3 822 830 653
3 830 259 386
3 259 694 532
3 694 309 63
3 309 773 7
3 413 362 773
3 737 828 614
3 698 629 199
3 629 300 199
3 737 614 443
3 231 771 440
3 649 771 443
3 102 65 365
3 50 443 102
3 144 737 50
3 828 144 199
3 347 59 144
3 144 50 347
3 50 102 822
3 102 365 830
3 365 885 259
3 885 781 694
3 309 781 557
3 557 196 309
3 773 196 413
3 65 321 357
3 65 357 365
3 588 885 357
3 588 881 781
3 20 557 881
3 196 20 471
3 146 20 525
3 20 881 556
3 476 881 388
3 357 321 588
3 321 374 388
3 800 455 668
3 64 800 668
3 187 514 64
3 294 445 160
3 445 223 477
3 500 766 268
3 107 766 353
3 500 223 868
3 187 64 278
3 64 668 444
3 83 668 282
3 455 891 462
3 107 353 9
3 353 612 138
3 612 231 325
3 231 440 879
3 440 546 683
3 546 197 218
3 197 53 579
3 53 716 490
3 536 186 542
3 586 895 209
3 816 209 561
3 209 487 524
3 487 186 454
3 186 104 662
3 551 10 721
3 299 642 534
3 299 534 721
3 534 233 551
3 233 427 135
3 427 290 700
3 265 95 784
3 562 700 95
3 10 135 562
3 844 395 104
3 337 426 201
3 845 818 62
3 562 95 497
3 671 95 315
3 826 279 572
3 56 567 759
3 567 688 21
3 688 60 553
3 60 696 414
3 696 346 510
3 62 778 845
3 778 244 97
3 244 232 226
3 232 738 815
3 738 367 467
3 367 620 809
3 620 10 339
3 10 562 11
3 121 115 750
3 115 703 123
3 90 312 408
3 312 401 840
3 486 401 120
3 622 265 68
3 265 784 120
3 784 290 399
3 804 49 322
3 49 670 399
3 670 39 120
3 730 9 486
3 138 325 840
3 191 325 879
3 879 683 191
3 683 218 123
3 218 579 750
3 426 579 818
3 818 490 561
3 561 524 818
3 524 454 62
3 454 662 778
3 214 892 753
3 384 805 253
3 384 531 293
3 565 384 293
3 706 531 368
3 126 368 645
3 746 645 129
3 103 129 672
3 535 672 707
3 17 707 195
3 747 195 456
3 667 456 45
3 198 45 753
3 85 474 597
3 887 597 739
3 632 887 835
3 801 632 656
3 171 801 252
3 742 171 100
3 805 742 306
3 100 129 306
3 252 672 100
3 656 707 252
3 835 195 656
3 753 45 214
3 739 456 835
3 129 645 306
3 253 368 531
3 725 431 215
3 57 29 643
3 80 383 78
3 29 80 78
3 267 54 572
3 664 572 279
3 591 279 759
3 813 759 21
3 91 21 553
3 371 553 414
3 860 414 510
3 424 510 608
3 725 608 817
3 431 517 215
3 273 870 215
3 870 605 618
3 605 849 837
3 849 163 717
3 163 876 354
3 876 57 34
3 643 813 34
3 34 91 354
3 354 371 717
3 717 860 837
3 725 618 424
3 837 424 618
3 591 78 664
3 78 383 664
3 474 892 214
3 253 805 306
3 253 531 384
3 293 531 706
3 706 368 126
3 126 645 746
3 746 129 103
3 103 672 535
3 535 707 17
3 17 195 747
3 747 456 667
3 667 45 198
3 198 753 892
3 597 474 214
3 739 597 214
3 739 835 887
3 835 656 632
3 656 252 801
3 252 100 171
3 100 306 742
3 672 129 100
3 707 672 252
3 195 707 656
3 456 195 835
3 739 214 45
3 45 456 739
3 253 306 645
3 645 368 253
3 858 431 725
3 643 29 78
3 383 80 54
3 383 54 267
3 267 572 664
3 664 279 591
3 591 759 813
3 813 21 91
3 91 553 371
3 371 414 860
3 860 510 424
3 424 608 725
3 817 858 725
3 273 215 517
3 215 870 618
3 837 618 605
3 717 837 849
3 354 717 163
3 34 354 876
3 643 34 57
3 591 813 643
3 813 91 34
3 91 371 354
3 371 860 717
3 215 618 725
3 860 424 837
3 643 78 591
3 267 664 383
3 897 686 435
3 385 780 802
3 108 802 435
3 451 108 19
3 451 19 373
3 883 94 373
3 720 294 94
3 86 883 19
3 25 641 720
3 512 25 883
3 224 86 19
3 650 172 234
3 338 473 154
3 687 328 154
3 626 42 234
3 42 132 155
3 223 829 132
3 445 641 829
3 155 8 745
3 829 168 763
3 763 8 829
3 155 650 234
3 435 686 224
3 108 435 224
3 385 665 780
3 108 385 802
3 224 19 108
3 883 373 19
3 720 94 883
3 294 720 641
3 512 883 86
3 641 25 168
3 720 883 25
3 686 86 224
3 435 802 897
3 780 897 802
3 234 172 328
3 626 234 328
3 687 154 473
3 626 328 687
3 155 234 42
3 223 132 42
3 445 829 223
3 294 641 445
3 8 155 132
3 641 168 829
3 132 829 8
3 745 650 155
3 328 172 154
3 338 154 172
3 430 243 111
3 311 897 111
3 776 243 255
3 780 665 111
3 311 425 554
3 776 515 425
3 412 547 515
3 862 689 547
3 86 686 425
3 86 425 512
3 168 547 689
3 87 241 862
3 555 695 587
3 695 525 87
3 515 25 512
3 412 87 862
3 776 255 412
3 374 659 364
3 318 548 364
3 388 364 751
3 659 338 318
3 364 548 751
3 245 156 751
3 38 470 156
3 655 241 470
3 650 745 548
3 745 38 245
3 168 689 763
3 470 119 70
3 556 476 70
3 525 556 119
3 8 655 38
3 156 470 577
3 388 751 577
3 311 111 243
3 897 311 554
3 686 897 554
3 311 243 776
3 665 430 111
3 776 425 311
3 412 515 776
3 862 547 412
3 689 862 241
3 554 425 686
3 515 512 425
3 547 168 25
3 111 897 780
3 241 87 119
3 255 555 587
3 587 695 87
3 119 87 525
3 547 25 515
3 587 87 412
3 587 412 255
3 318 364 659
3 548 318 172
3 650 548 172
3 374 364 388
3 473 338 659
3 245 751 548
3 38 156 245
3 655 470 38
3 689 241 655
3 245 548 745
3 8 38 745
3 763 689 655
3 318 338 172
3 241 119 470
3 476 388 577
3 70 476 577
3 70 119 556
3 763 655 8
3 70 577 470
3 156 577 751
3 143 246 211
3 625 463 246
3 480 336 35
3 480 35 823
3 821 52 823
3 886 540 522
3 336 886 79
3 851 327 175
3 821 397 230
3 157 505 637
3 157 637 549
3 619 691 74
3 5 74 691
3 503 140 327
3 295 503 851
3 396 397 139
3 396 139 499
3 366 439 488
3 488 457 581
3 439 396 499
3 439 499 488
3 777 499 249
3 777 249 35
3 249 821 284
3 151 52 210
3 416 823 151
3 480 769 540
3 457 777 336
3 457 336 79
3 228 488 581
3 726 581 109
3 726 734 666
3 710 734 109
3 710 581 457
3 710 79 886
3 522 880 710
3 886 522 710
3 769 194 522
3 540 769 522
3 666 734 36
3 880 795 734
3 194 288 880
3 165 859 194
3 37 843 165
3 151 43 513
3 769 513 185
3 769 185 165
3 673 43 463
3 479 37 673
3 795 330 36
3 288 611 795
3 859 33 288
3 843 207 859
3 297 589 843
3 479 507 297
3 143 479 625
3 33 262 465
3 33 465 611
3 207 262 846
3 207 846 33
3 589 184 207
3 507 541 589
3 329 523 507
3 143 798 329
3 788 143 211
3 508 4 509
3 390 793 508
3 619 258 390
3 619 173 568
3 619 390 752
3 390 508 289
3 72 508 509
3 47 72 836
3 729 301 47
3 754 289 729
3 799 752 754
3 799 754 44
3 754 729 501
3 729 47 221
3 30 47 836
3 391 30 433
3 496 256 391
3 343 221 496
3 377 501 343
3 61 433 449
3 179 391 61
3 602 496 179
3 450 343 602
3 351 627 291
3 351 291 27
3 351 27 702
3 164 627 718
3 584 164 319
3 450 602 584
3 602 179 609
3 179 61 627
3 675 291 449
3 894 792 48
3 787 788 560
3 393 727 787
3 755 798 393
3 606 523 755
3 606 755 48
3 393 702 894
3 755 393 894
3 787 718 351
3 787 560 164
3 32 352 573
3 175 327 352
3 327 140 573
3 366 526 140
3 228 628 366
3 726 150 228
3 726 666 333
3 666 36 498
3 36 330 582
3 192 611 465
3 447 330 192
3 526 32 573
3 628 797 526
3 150 744 628
3 333 637 150
3 498 549 333
3 582 404 498
3 873 174 469
3 797 642 32
3 744 220 797
3 637 630 744
3 404 157 549
3 469 200 404
3 436 469 582
3 674 436 447
3 660 873 674
3 452 348 225
3 484 447 578
3 722 674 484
3 722 484 348
3 250 484 578
3 106 225 250
3 764 452 106
3 839 509 67
3 680 72 839
3 537 836 680
3 58 30 537
3 675 433 58
3 675 58 792
3 58 537 638
3 537 680 403
3 680 839 189
3 6 764 475
3 106 250 615
3 422 106 615
3 422 615 128
3 251 363 615
3 251 770 520
3 250 578 251
3 447 192 578
3 192 465 147
3 77 465 262
3 543 770 77
3 543 77 101
3 184 77 262
3 606 184 541
3 606 48 762
3 398 48 792
3 575 177 398
3 638 332 575
3 398 177 101
3 363 543 177
3 128 177 332
3 128 403 189
3 128 189 422
3 211 677 502
3 246 410 677
3 219 280 631
3 219 631 429
3 51 230 41
3 213 607 280
3 213 280 22
3 851 175 715
3 73 199 761
3 41 230 152
3 453 247 844
3 453 844 104
3 538 568 772
3 492 889 715
3 295 851 434
3 152 295 434
3 152 434 202
3 216 446 261
3 235 825 216
3 460 715 889
3 460 889 825
3 202 825 227
3 202 227 429
3 41 152 429
3 210 51 580
3 580 631 411
3 631 280 411
3 213 227 825
3 213 825 167
3 235 261 831
3 518 831 733
3 380 518 733
3 518 466 82
3 167 518 82
3 15 167 82
3 15 466 137
3 15 137 607
3 280 137 528
3 280 528 658
3 380 169 544
3 544 595 466
3 137 466 875
3 528 137 621
3 528 208 314
3 92 210 580
3 131 411 658
3 131 658 314
3 463 92 410
3 410 208 574
3 98 705 169
3 169 442 595
3 595 193 875
3 875 375 621
3 621 519 208
3 574 208 296
3 502 677 296
3 705 316 277
3 705 277 442
3 442 316 613
3 442 613 193
3 193 178 375
3 375 400 519
3 519 166 296
3 502 296 356
3 788 211 356
3 441 898 206
3 206 592 824
3 824 538 772
3 772 568 494
3 824 772 878
3 206 824 871
3 441 871 585
3 349 871 601
3 601 878 387
3 387 494 882
3 882 173 799
3 882 799 420
3 387 882 238
3 601 387 285
3 349 285 188
3 302 285 271
3 271 238 242
3 242 420 237
3 237 44 377
3 600 271 257
3 257 242 130
3 130 237 598
3 598 377 450
3 704 864 481
3 704 481 740
3 704 740 263
3 740 114 266
3 584 319 114
3 598 450 114
3 130 598 481
3 257 130 864
3 600 142 506
3 361 142 110
3 560 356 145
3 145 166 182
3 182 400 406
3 406 178 275
3 406 275 110
3 406 704 263
3 182 406 263
3 263 266 145
3 560 145 319
3 483 690 76
3 175 483 492
3 492 125 446
3 261 446 669
3 831 261 378
3 733 831 701
3 380 733 161
3 380 326 98
3 98 176 323
3 682 323 69
3 69 176 648
3 483 71 125
3 125 190 669
3 669 812 378
3 378 453 701
3 701 162 161
3 161 148 326
3 148 542 539
3 76 299 71
3 71 721 190
3 190 247 812
3 453 186 162
3 162 536 148
3 326 539 176
3 648 539 676
3 676 542 895
3 530 816 73
3 212 676 741
3 741 895 586
3 741 586 530
3 212 530 464
3 464 73 99
3 99 761 884
3 415 761 533
3 748 585 713
3 713 349 867
3 867 188 335
3 335 302 305
3 305 600 506
3 305 506 203
3 335 305 264
3 867 335 861
3 713 867 382
3 415 865 884
3 464 99 459
3 743 884 865
3 743 865 292
3 743 765 459
3 459 765 712
3 212 464 712
3 69 648 712
3 682 69 869
3 316 869 874
3 874 765 838
3 874 838 834
3 613 316 834
3 275 178 834
3 275 324 361
3 624 324 116
3 116 159 448
3 448 264 203
3 116 838 863
3 863 765 292
3 159 292 281
3 861 159 281
3 861 281 382
3 625 246 143
3 673 463 625
3 336 480 540
3 823 35 284
3 52 821 230
3 540 886 336
3 823 284 821
3 503 327 851
3 768 819 452
3 819 117 452
3 139 397 821
3 341 505 157
3 691 619 568
3 140 503 439
3 503 295 396
3 397 396 295
3 249 499 139
3 140 439 366
3 457 488 438
3 503 396 439
3 438 488 499
3 438 499 777
3 284 35 249
3 821 249 139
3 823 52 151
3 480 823 416
3 769 480 416
3 777 35 336
3 438 777 457
3 366 488 228
3 228 581 726
3 109 734 726
3 880 734 710
3 109 581 710
3 457 79 710
3 194 880 522
3 165 194 769
3 795 36 734
3 288 795 880
3 859 288 194
3 843 859 165
3 297 843 37
3 43 151 210
3 416 151 513
3 416 513 769
3 37 165 185
3 625 479 673
3 513 43 673
3 513 673 185
3 37 185 673
3 297 37 479
3 330 795 611
3 33 611 288
3 207 33 859
3 589 207 843
3 507 589 297
3 329 507 479
3 329 479 143
3 846 262 33
3 184 262 207
3 541 184 589
3 541 507 523
3 523 329 798
3 798 143 727
3 727 143 788
3 793 4 508
3 258 793 390
3 74 258 619
3 173 619 752
3 752 390 289
3 289 508 301
3 301 508 72
3 301 72 47
3 289 301 729
3 752 289 754
3 173 752 799
3 44 754 501
3 501 729 221
3 221 47 256
3 256 47 30
3 256 30 391
3 221 256 496
3 501 221 343
3 44 501 377
3 391 433 61
3 496 391 179
3 343 496 602
3 377 343 450
3 718 627 351
3 627 164 609
3 609 164 584
3 609 584 602
3 627 609 179
3 291 627 61
3 291 61 449
3 27 291 675
3 27 675 792
3 27 792 894
3 27 894 702
3 727 788 787
3 798 727 393
3 523 798 755
3 541 523 606
3 894 48 755
3 351 702 393
3 393 787 351
3 164 718 787
3 319 164 560
3 352 32 690
3 573 352 327
3 526 573 140
3 628 526 366
3 150 628 228
3 333 150 726
3 498 333 666
3 582 498 36
3 436 582 330
3 330 611 192
3 436 330 447
3 797 32 526
3 744 797 628
3 637 744 150
3 549 637 333
3 404 549 498
3 469 404 582
3 779 174 873
3 690 32 642
3 220 642 797
3 630 220 744
3 505 630 637
3 200 157 404
3 174 200 469
3 873 469 436
3 873 436 674
3 779 873 660
3 117 348 452
3 674 447 484
3 660 674 722
3 225 348 484
3 225 484 250
3 452 225 106
3 72 509 839
3 836 72 680
3 30 836 537
3 433 30 58
3 449 433 675
3 792 58 638
3 638 537 403
3 189 403 680
3 189 839 475
3 475 839 6
3 475 764 422
3 251 615 250
3 764 106 422
3 128 615 363
3 363 251 520
3 770 251 147
3 147 251 578
3 147 578 192
3 770 147 465
3 770 465 77
3 520 770 543
3 101 77 762
3 762 77 184
3 762 184 606
3 101 762 48
3 101 48 398
3 332 177 575
3 332 638 403
3 792 638 575
3 792 575 398
3 543 101 177
3 520 543 363
3 363 177 128
3 332 403 128
3 475 422 189
3 246 677 211
3 463 410 246
3 22 280 219
3 429 631 51
3 52 230 51
3 15 607 213
3 51 41 429
3 492 715 175
3 73 716 698
3 698 199 73
3 716 73 816
3 152 230 397
3 761 199 59
3 812 247 453
3 691 568 538
3 889 492 446
3 434 851 715
3 397 295 152
3 202 434 460
3 889 446 216
3 167 825 235
3 434 715 460
3 216 825 889
3 460 825 202
3 219 429 227
3 429 152 202
3 52 51 210
3 51 631 580
3 658 411 280
3 22 219 227
3 22 227 213
3 216 261 235
3 235 831 518
3 518 380 544
3 544 466 518
3 235 518 167
3 213 167 15
3 82 466 15
3 607 137 280
3 98 169 380
3 169 595 544
3 595 875 466
3 875 621 137
3 621 208 528
3 43 210 92
3 92 580 411
3 92 411 131
3 528 314 658
3 677 410 574
3 43 92 463
3 92 131 410
3 410 131 314
3 314 208 410
3 705 98 323
3 705 442 169
3 442 193 595
3 193 375 875
3 375 519 621
3 519 296 208
3 574 296 677
3 316 705 682
3 277 316 442
3 178 193 613
3 400 375 178
3 166 519 400
3 356 296 166
3 502 356 211
3 511 898 441
3 898 592 206
3 592 538 824
3 494 568 173
3 878 772 494
3 871 824 878
3 206 871 441
3 585 871 349
3 871 878 601
3 878 494 387
3 494 173 882
3 420 799 44
3 238 882 420
3 285 387 238
3 601 285 349
3 188 285 302
3 285 238 271
3 238 420 242
3 420 44 237
3 302 271 600
3 271 242 257
3 242 237 130
3 237 377 598
3 864 704 142
3 114 740 481
3 266 114 319
3 584 114 450
3 114 481 598
3 481 864 130
3 600 257 864
3 864 142 600
3 624 506 142
3 624 142 361
3 142 704 110
3 788 356 560
3 356 166 145
3 166 400 182
3 400 178 406
3 361 110 275
3 110 704 406
3 182 263 145
3 740 266 263
3 266 319 145
3 352 690 483
3 352 483 175
3 483 125 492
3 125 669 446
3 669 378 261
3 378 701 831
3 701 161 733
3 161 326 380
3 326 176 98
3 705 323 682
3 323 176 69
3 76 71 483
3 71 190 125
3 190 812 669
3 812 453 378
3 453 162 701
3 162 148 161
3 536 542 148
3 76 690 642
3 642 299 76
3 299 721 71
3 721 247 190
3 104 186 453
3 186 536 162
3 148 539 326
3 176 539 648
3 539 542 676
3 209 816 530
3 648 676 212
3 676 895 741
3 209 530 586
3 741 530 212
3 530 73 464
3 73 761 99
3 884 761 415
3 761 59 533
3 441 585 748
3 585 349 713
3 349 188 867
3 188 302 335
3 302 600 305
3 203 506 624
3 203 264 305
3 861 335 264
3 861 382 867
3 713 382 748
3 865 415 382
3 743 459 99
3 99 884 743
3 281 292 865
3 292 765 743
3 712 765 869
3 459 712 464
3 212 712 648
3 712 869 69
3 682 869 316
3 869 765 874
3 834 838 324
3 874 834 316
3 613 834 178
3 834 324 275
3 361 324 624
3 159 116 863
3 264 448 159
3 448 203 624
3 624 116 448
3 324 838 116
3 838 765 863
3 863 292 159
3 264 159 861
3 865 382 281
3 384 310 599
3 805 599 254
3 597 866 350
3 85 350 564
3 113 564 170
3 857 170 26
3 633 26 274
3 634 274 287
3 590 287 248
3 814 248 516
3 468 516 461
3 774 461 827
3 402 827 421
3 122 421 890
3 340 890 472
3 565 472 310
3 610 80 29
3 736 29 57
3 854 870 273
3 651 273 517
3 728 517 418
3 786 418 428
3 796 428 731
3 158 731 419
3 708 419 360
3 603 360 298
3 272 298 381
3 789 381 286
3 570 286 355
3 685 355 217
3 495 217 320
3 417 320 80
3 254 171 742
3 887 632 866
3 565 310 384
3 384 599 805
3 887 866 597
3 597 350 85
3 85 564 113
3 113 170 857
3 857 26 633
3 633 274 634
3 634 287 590
3 590 248 814
3 814 516 468
3 468 461 774
3 774 827 402
3 402 421 122
3 122 890 340
3 340 472 565
3 742 805 254
3 876 163 736
3 458 605 870
3 417 80 610
3 610 29 736
3 458 870 854
3 854 273 651
3 651 517 728
3 728 418 786
3 786 428 796
3 796 731 158
3 158 419 708
3 708 360 603
3 603 298 272
3 272 381 789
3 789 286 570
3 570 355 685
3 685 217 495
3 495 320 417
3 876 736 57
3 806 714 482
3 370 714 783
3 370 783 12
3 370 12 153
3 370 153 847
3 370 847 566
3 370 566 640
3 370 640 303
3 370 303 392
3 370 392 693
3 370 693 313
3 370 313 681
3 370 681 485
3 370 485 872
3 370 872 269
3 370 269 307
3 855 370 307
3 593 853 180
3 317 853 394
3 317 394 711
3 317 711 112
3 317 112 652
3 317 652 563
3 317 563 571
3 317 571 654
3 317 654 75
3 317 75 617
3 317 617 89
3 317 89 24
3 317 24 529
3 317 529 757
3 317 757 749
3 317 749 811
3 646 317 811
3 482 714 370
3 180 853 317
3 783 714 254
3 632 806 482
3 866 482 370
3 350 370 855
3 564 855 307
3 170 307 269
3 26 269 872
3 274 872 485
3 287 485 681
3 248 681 313
3 516 313 693
3 461 693 392
3 827 392 303
3 421 303 640
3 890 640 566
3 472 566 847
3 310 847 153
3 599 153 12
3 783 254 12
3 801 171 806
3 757 529 163
3 811 849 605
3 646 605 458
3 317 458 854
3 180 854 651
3 593 651 728
3 853 728 786
3 394 786 796
3 711 796 158
3 112 158 708
3 652 708 603
3 563 603 272
3 571 272 789
3 654 789 570
3 75 570 685
3 617 685 495
3 89 495 417
3 24 417 610
3 529 610 736
3 163 849 757
3 171 254 714
3 801 806 632
3 632 482 866
3 866 370 350
3 350 855 564
3 564 307 170
3 170 269 26
3 26 872 274
3 274 485 287
3 287 681 248
3 248 313 516
3 516 693 461
3 461 392 827
3 827 303 421
3 421 640 890
3 890 566 472
3 472 847 310
3 310 153 599
3 599 12 254
3 714 806 171
3 736 163 529
3 849 811 749
3 811 605 646
3 646 458 317
3 317 854 180
3 180 651 593
3 593 728 853
3 853 786 394
3 394 796 711
3 711 158 112
3 112 708 652
3 652 603 563
3 563 272 571
3 571 789 654
3 654 570 75
3 75 685 617
3 617 495 89
3 89 417 24
3 24 610 529
3 749 757 849
