OFF

1307 2610 0
-0.072087 -0.319124 0.051827
-0.215439 0.232110 -0.059046
-0.273715 0.020529 0.194594
-0.216678 0.232398 0.067593
-0.297085 -0.294585 -0.279429
-0.066386 0.235913 -0.243139
-0.048164 -0.315703 0.094616
-0.239432 0.201488 0.141663
0.220705 -0.238825 -0.048509
-0.143012 -0.270069 0.168816
-0.174415 -0.261119 0.081651
-0.032133 0.007301 -0.487685
0.011804 -0.314250 0.064395
-0.123443 0.325760 0.030462
-0.275448 0.134255 0.121108
-0.016532 0.305997 -0.049861
0.206310 0.229104 -0.146243
-0.327109 0.096683 -0.020031
-0.031526 0.007369 -0.483514
-0.045873 0.306440 -0.100482
-0.216143 -0.222513 0.118642
0.076979 -0.338320 0.038608
0.090150 0.279761 -0.104610
0.220613 0.094603 -0.202711
0.133084 -0.322560 0.008308
0.170232 0.201576 -0.157890
-0.161915 0.268372 0.049892
-0.244270 0.207887 -0.000831
-0.023235 -0.176141 -0.461526
0.080991 0.276062 -0.119293
0.208881 -0.235720 -0.058829
-0.014559 -0.035518 -0.496085
-0.025457 -0.173677 -0.457091
-0.096128 -0.317708 0.006156
-0.272417 0.079244 0.154434
-0.309053 0.117503 0.049096
0.002266 -0.274090 -0.252372
-0.050148 -0.312435 0.089111
0.071977 -0.314718 0.037273
-0.145528 -0.305098 -0.093032
-0.101819 -0.292965 0.115974
0.041774 0.257888 -0.179662
0.167007 -0.274935 -0.026562
0.055614 0.090593 -0.353556
-0.327078 0.042540 -0.006669
-0.065352 -0.254078 -0.424306
0.059282 0.151635 -0.301425
0.020700 0.249016 -0.213058
-0.096607 -0.287073 -0.401030
-0.097528 -0.284210 -0.399511
0.154176 0.273228 -0.128757
0.201603 -0.239926 -0.073721
0.041226 -0.307404 -0.118995
-0.087757 -0.292743 0.144338
0.220964 0.095366 -0.218111
0.049267 0.203291 -0.241496
0.063030 -0.311663 -0.089191
-0.267522 -0.048210 0.169671
0.107428 0.311635 -0.103476
0.190029 0.215470 -0.147743
0.144192 0.260864 -0.129280
-0.295373 0.019081 0.190752
-0.221903 -0.160427 0.190875
0.234524 0.098974 -0.176354
-0.424079 -0.011382 -0.252157
-0.382136 0.011949 -0.145953
0.100309 0.290056 -0.094934
0.261594 -0.202603 -0.096557
-0.137464 -0.257820 0.159492
-0.048210 0.151743 -0.370261
0.229699 -0.185720 -0.098347
-0.061233 0.321167 0.003859
-0.095222 0.308014 -0.054190
-0.250985 -0.105856 0.188540
-0.326804 -0.010622 0.021903
-0.286029 0.152557 -0.002085
-0.063577 0.291863 -0.129464
-0.068111 0.309498 -0.010429
0.175063 -0.292973 -0.033041
-0.034652 -0.241897 -0.369250
0.282025 -0.146994 -0.124209
-0.245337 0.179072 0.092349
0.238382 -0.148103 -0.164560
-0.047298 0.240539 -0.210043
0.122447 -0.193263 -0.227698
-0.081085 0.085423 -0.473626
0.242135 -0.092899 -0.194705
-0.199685 0.241273 0.101049
-0.199600 0.179646 -0.352094
0.073713 0.274488 -0.132415
0.234947 -0.028268 -0.205065
0.163044 0.016894 -0.273252
0.266819 -0.142195 -0.124917
0.159473 -0.279383 -0.041256
-0.093097 -0.304304 0.145810
-0.284447 -0.049746 0.203336
-0.251625 -0.105653 0.177422
-0.057966 0.330149 0.011618
-0.078722 0.301555 -0.029637
-0.356587 -0.226631 -0.246470
-0.325087 -0.068056 0.052109
0.224110 -0.253419 -0.064673
-0.184699 -0.211640 0.169503
0.019272 -0.123833 -0.423699
-0.307681 0.151842 -0.352200
0.198346 0.216921 -0.129866
-0.022420 -0.329302 0.006990
0.168988 0.076607 -0.256876
0.208320 0.229339 -0.141565
-0.032566 -0.272327 -0.298573
-0.175414 -0.290990 -0.035808
0.046823 0.320886 -0.078532
-0.306370 0.008071 0.128026
-0.077317 -0.316584 -0.088979
-0.131520 -0.307802 -0.376410
0.287954 -0.141506 -0.104984
-0.267727 -0.047862 0.175921
-0.128041 0.268698 -0.117754
-0.041216 -0.214417 -0.443578
0.256382 -0.190460 -0.078855
0.242087 0.101424 -0.163868
0.192318 0.213261 -0.134728
-0.170964 -0.267257 0.100444
0.131971 0.252847 -0.142648
0.261090 -0.137185 -0.116935
0.274299 0.047715 -0.165594
0.304579 -0.016658 -0.151577
-0.232786 0.228634 0.042376
-0.291563 -0.285080 -0.278339
-0.237148 0.182481 0.107660
-0.146032 0.246581 -0.152764
-0.095188 -0.286336 0.122387
0.135626 -0.313183 0.017936
-0.056391 -0.303799 0.072697
-0.298662 -0.297577 -0.279444
-0.270477 0.186748 -0.178923
-0.284738 0.015189 0.165409
-0.365304 -0.137732 -0.127343
-0.174169 0.256614 -0.088148
0.247721 0.173461 -0.160130
-0.038610 -0.324834 0.117483
-0.203576 -0.213621 0.124861
0.282112 -0.016216 -0.144068
0.257979 0.044391 -0.162387
-0.007050 -0.085778 -0.492454
-0.008778 -0.315805 0.029080
0.142155 0.253740 -0.121167
-0.194393 -0.215698 0.156013
-0.001031 0.327847 -0.025447
0.207452 0.028961 -0.234017
-0.372500 0.057348 -0.160321
-0.119989 0.291355 0.014162
-0.016309 -0.318794 0.016414
-0.306967 -0.061894 0.087770
0.038641 0.297379 -0.080869
0.034105 -0.327352 -0.026835
-0.318914 -0.125476 0.017525
0.258604 0.107477 -0.153766
-0.261468 -0.172306 0.118495
0.243177 0.167460 -0.139360
-0.037949 -0.310022 0.110561
-0.092690 -0.288435 0.129709
-0.289917 0.012873 0.152840
0.200494 -0.147738 -0.196170
-0.024898 -0.172328 -0.453136
0.080674 -0.319627 0.049789
-0.000501 0.335727 -0.025365
0.127368 -0.303743 0.011525
-0.043097 -0.211230 -0.439483
-0.142704 -0.252397 0.137927
-0.023301 0.313353 -0.062305
-0.014082 0.322539 -0.047383
-0.213934 -0.316279 -0.324499
-0.285985 0.020642 0.197940
0.023404 0.244525 -0.202768
0.294889 -0.086380 -0.143392
0.060982 -0.308276 0.021517
0.129255 -0.287519 -0.090750
0.149655 0.013372 -0.283243
0.191683 -0.039027 -0.259267
-0.051878 0.046973 -0.479029
0.117886 0.116879 -0.287243
-0.276582 0.149955 0.160563
-0.097600 -0.283000 0.113924
-0.096839 0.248280 -0.182201
-0.153154 -0.305547 -0.220865
0.119486 0.243095 -0.153512
-0.397396 -0.195788 -0.238921
-0.122767 0.307157 0.019875
-0.170552 -0.314782 -0.350459
-0.013829 0.309168 -0.045536
-0.112110 0.319932 0.043702
-0.178951 0.261355 0.019623
0.257603 0.107630 -0.167150
-0.071316 0.304107 -0.017078
-0.139471 0.255488 -0.139760
-0.046935 0.052483 -0.495241
0.038446 0.195561 -0.252203
0.165594 0.135936 -0.229663
-0.211200 0.240018 0.085027
-0.159388 0.276556 0.061336
-0.146130 -0.298866 0.032151
0.169762 -0.287634 -0.035135
-0.241065 -0.163250 0.137432
-0.170895 0.262969 0.032278
-0.064358 0.316339 -0.002498
-0.253637 -0.299370 -0.298057
0.177838 -0.195970 -0.173555
-0.316288 0.131294 -0.075272
0.236253 0.100318 -0.192766
-0.284001 -0.053520 0.141898
-0.257623 -0.309454 -0.299946
0.038715 -0.316894 -0.016513
-0.123778 0.302303 0.015345
0.226860 -0.248376 -0.054222
0.184976 0.022030 -0.266952
-0.130764 -0.301034 0.065714
0.276237 0.114016 -0.144915
0.087601 -0.304087 -0.047890
0.083113 -0.322874 0.052774
-0.098987 -0.279528 -0.396959
0.033559 0.304470 -0.094260
-0.261086 -0.109263 0.175167
-0.017935 0.060336 -0.436834
-0.186787 0.259399 0.006941
0.117387 0.058907 -0.318112
-0.112629 0.125148 -0.468713
0.143046 0.067917 -0.292788
-0.174801 0.271616 0.035323
0.188437 -0.096328 -0.235376
0.099502 -0.309576 -0.033593
0.249626 0.173836 -0.155417
-0.285798 0.167012 0.025883
-0.402447 0.070486 -0.284176
0.070239 0.281604 -0.147072
-0.216670 0.254983 0.099146
-0.312537 -0.221941 -0.142498
0.092491 -0.003651 -0.357391
-0.277109 0.088554 0.185518
0.109655 -0.295524 -0.009723
-0.240281 -0.171898 0.194602
0.189461 -0.099537 -0.246402
-0.274493 0.017838 0.178842
0.164227 -0.282215 -0.037474
0.108025 0.173898 -0.239367
0.106747 -0.306573 -0.020938
0.272579 -0.017510 -0.149637
0.209099 0.225779 -0.128423
-0.218063 -0.261740 -0.016151
-0.268505 0.129751 0.115474
-0.163535 0.265501 0.044868
-0.311490 0.060712 0.067044
-0.143050 0.285366 -0.023901
-0.063037 0.337344 0.005542
-0.282537 0.012031 0.146249
0.236516 -0.141573 -0.149348
-0.195834 -0.226148 0.184565
-0.274437 0.015460 0.164760
-0.094164 0.298174 -0.055277
-0.434565 -0.109794 -0.234858
0.242468 -0.194034 -0.100611
-0.067468 -0.250010 -0.421247
-0.291432 -0.117641 0.089217
0.161585 -0.272988 -0.032124
0.014196 -0.324457 -0.057848
-0.367787 -0.235573 -0.248850
-0.232693 0.174482 -0.408593
-0.258823 -0.221374 0.000267
-0.254154 0.204167 0.131029
-0.131596 -0.292580 -0.367036
0.274980 0.048704 -0.152239
-0.198745 -0.225701 0.175345
-0.418723 -0.154285 -0.234222
-0.135879 -0.259740 0.166518
0.066673 0.214851 -0.222712
-0.252421 -0.105593 0.168307
-0.271357 0.084355 0.173418
-0.007902 0.318288 -0.036282
-0.272609 0.080106 0.157442
0.302813 -0.017517 -0.156280
-0.099988 -0.310072 0.137949
0.092058 -0.234467 -0.201848
0.137944 0.250025 -0.124069
-0.324697 0.046736 0.009708
0.149297 0.267132 -0.128918
-0.213744 0.245840 0.090002
0.201964 0.225903 -0.148006
0.131976 -0.306188 0.016861
-0.168701 0.297190 0.068612
0.143263 -0.148955 -0.248475
-0.207959 -0.219452 0.131166
-0.017712 -0.035915 -0.491561
0.070800 -0.329063 0.031341
0.211848 0.029385 -0.242364
-0.039139 0.300074 -0.088205
-0.112511 -0.313242 -0.026896
-0.288639 0.072239 0.120638
-0.304972 -0.175434 -0.023420
0.229425 -0.144250 -0.162334
0.062472 0.278172 -0.159207
-0.109870 0.316552 0.044931
-0.202849 0.230037 0.081435
-0.294469 -0.289689 -0.279330
-0.069017 0.307263 -0.012511
-0.251839 0.213049 -0.003002
-0.270182 0.137305 0.133485
0.144756 -0.240820 -0.145415
0.184282 0.208140 -0.140454
-0.224591 -0.157926 0.165206
0.044859 0.304777 -0.073328
-0.036892 -0.219772 -0.449217
0.153201 -0.269669 -0.040429
-0.285854 0.016249 0.171922
-0.291671 0.086581 0.170732
0.058525 0.268940 -0.157386
-0.197547 0.264657 -0.002742
-0.066831 0.339837 0.000183
-0.079935 0.087953 -0.478380
0.220908 -0.146046 -0.174275
-0.143367 -0.251610 0.135019
-0.048975 -0.301548 0.085308
0.249462 0.104120 -0.159173
0.123032 -0.315380 -0.002183
0.086398 0.227282 -0.200230
0.010435 -0.312948 0.061898
-0.038550 -0.217744 -0.447103
-0.255439 -0.167666 0.111764
-0.044410 -0.305468 0.095988
-0.305123 0.150887 -0.348988
-0.182597 0.269745 0.022778
0.130883 -0.324197 0.004010
-0.340820 0.132167 -0.328832
-0.275233 0.014439 0.158896
0.100304 0.300735 -0.106337
0.236696 -0.192352 -0.103571
-0.218047 -0.217907 0.099225
0.236575 0.037319 -0.201224
-0.307996 0.105790 0.019843
-0.338083 0.044983 -0.003668
0.016469 -0.291852 -0.146159
-0.231784 -0.259851 -0.050621
-0.096714 -0.283941 0.116730
0.065949 -0.311031 0.028678
-0.163862 0.295135 0.073270
-0.284874 0.125531 0.090543
0.010061 -0.167227 -0.409965
0.131364 0.189604 -0.225315
-0.329139 -0.013524 0.005251
0.003183 0.019241 -0.441487
-0.035228 -0.312538 0.117028
-0.191068 0.219992 -0.232264
-0.276746 -0.257387 -0.156914
-0.161988 0.270354 -0.061451
-0.402449 -0.048965 -0.188407
-0.291627 -0.221200 -0.088536
0.057181 -0.117593 -0.381222
-0.059041 -0.321595 -0.056947
0.264377 -0.085530 -0.156419
-0.224324 -0.158255 0.168262
-0.069539 0.339883 -0.004136
-0.201261 0.237342 0.093603
0.112779 0.306171 -0.086765
-0.001246 -0.312412 0.041705
0.144469 -0.282878 -0.065301
-0.167380 0.277171 -0.065227
0.179344 -0.237050 -0.097287
-0.170721 -0.280400 -0.037562
-0.064027 -0.256562 -0.426135
0.006198 -0.310166 0.054300
0.055571 -0.268637 -0.173731
-0.270635 0.149412 0.164275
-0.209676 0.230471 -0.157298
0.273058 -0.080797 -0.134782
-0.222369 -0.162630 0.202977
0.129588 -0.200339 -0.233618
-0.047641 -0.301824 0.087951
0.182434 -0.289982 -0.019988
-0.384842 -0.188665 -0.236996
-0.326307 -0.261250 -0.262325
-0.259115 0.142031 0.155164
-0.116223 0.243698 -0.215130
-0.042150 -0.329215 0.113285
-0.161136 0.272297 0.054784
0.062475 -0.303286 -0.084796
-0.202920 0.250988 0.110606
-0.187107 -0.208293 0.152636
-0.268313 -0.048560 0.166826
-0.202731 0.231818 0.084069
-0.004139 0.323137 -0.030306
0.059063 -0.066376 -0.392112
-0.195199 0.245347 -0.126475
-0.407316 0.073101 -0.284377
-0.228948 0.162986 -0.400923
0.218791 -0.033825 -0.234408
-0.284469 -0.168367 0.008372
-0.266534 -0.046368 0.195516
-0.310427 0.070036 0.101212
-0.337225 0.086722 -0.054373
-0.143892 0.221620 -0.260495
-0.198870 -0.227540 0.180715
-0.092577 -0.309175 0.008090
-0.047254 0.099732 -0.427002
0.280812 -0.138447 -0.103241
-0.190712 0.268039 0.009954
0.200569 -0.233352 -0.065820
-0.014957 -0.328047 0.019720
0.098451 -0.057900 -0.350563
-0.417202 -0.105965 -0.233629
0.215473 0.156534 -0.173683
-0.089261 -0.299422 0.148403
-0.038494 0.309972 -0.088136
-0.261045 -0.110593 0.208230
0.007056 -0.321370 0.056962
-0.118048 0.294417 0.018959
-0.305456 0.142780 -0.041645
-0.282362 0.079925 0.151646
0.081608 -0.332190 0.047739
-0.289256 -0.118229 0.124619
-0.054576 -0.313480 -0.050106
-0.323140 -0.000667 0.079990
0.287169 -0.085213 -0.143257
-0.182496 -0.216209 0.189607
-0.027143 0.009643 -0.497258
0.193834 -0.231615 -0.071740
-0.265525 -0.111559 0.188867
0.113288 -0.296789 -0.005101
-0.276062 -0.113323 0.130920
-0.268067 -0.110701 0.143382
-0.249010 0.207116 -0.129561
-0.046484 0.296337 -0.100469
0.268110 0.046245 -0.167706
-0.014773 -0.084046 -0.480522
0.303100 -0.014450 -0.138200
-0.078079 0.090931 -0.482629
-0.141705 -0.254431 0.143827
-0.016511 0.317485 -0.051036
-0.363726 -0.231884 -0.249375
-0.162485 0.266629 0.047411
0.112431 0.302949 -0.084035
0.096474 -0.111663 -0.339131
-0.149193 0.145758 -0.448425
-0.214742 -0.285371 -0.121789
-0.224555 0.230449 0.055110
-0.080132 0.084938 -0.469554
-0.321302 -0.005835 0.049025
0.191919 0.084708 -0.235465
-0.027598 0.267216 -0.187947
-0.020039 -0.036102 -0.486558
-0.373265 0.082076 -0.230692
0.162215 -0.102542 -0.271595
0.073801 -0.241927 -0.234894
-0.343656 -0.076574 -0.019397
0.274563 -0.144602 -0.124461
0.176938 0.208315 -0.160761
-0.425950 -0.108016 -0.236194
0.289207 -0.144258 -0.110994
0.122133 -0.301579 0.005081
0.054636 0.332406 -0.070286
-0.333237 -0.269790 -0.262767
-0.150957 -0.273026 0.156097
0.167294 -0.098339 -0.253771
-0.199636 0.248401 0.111065
0.211977 -0.093645 -0.213291
-0.234958 0.193456 0.131052
-0.267465 -0.048004 0.172749
-0.208288 0.253529 0.107504
0.277548 0.115416 -0.166703
0.172750 -0.276798 -0.020476
-0.169957 -0.304489 -0.346603
-0.272160 0.077535 0.148414
-0.290938 0.009642 0.133947
-0.073312 0.315525 -0.017045
-0.420558 -0.106841 -0.236019
0.066400 -0.201809 -0.304125
0.177875 -0.278935 -0.015504
-0.312793 0.005617 0.114908
0.300627 -0.081805 -0.123880
-0.188244 0.164812 -0.431534
-0.238650 -0.164846 0.156422
0.177762 0.204078 -0.145394
0.181188 -0.293999 -0.025613
-0.259737 -0.107941 0.155656
-0.185581 -0.219030 0.190062
-0.015118 0.307225 -0.047552
0.230014 -0.149999 -0.176632
-0.376194 0.106078 -0.306508
0.079317 -0.336646 0.042817
0.145683 -0.271935 -0.052977
-0.283445 0.081839 0.157977
-0.135292 0.287276 -0.011163
-0.247344 -0.222818 0.035641
0.024692 -0.324892 0.087734
-0.048470 0.051146 -0.492558
-0.111897 0.127410 -0.471098
0.232183 -0.186185 -0.096577
0.215154 0.153836 -0.157933
0.270255 -0.080776 -0.136186
0.137993 -0.049518 -0.309611
-0.023828 0.262324 -0.178213
-0.012597 0.311415 -0.043650
-0.275314 0.170139 -0.381021
0.021070 -0.074877 -0.434108
-0.186444 -0.209673 0.158702
-0.200114 -0.216627 0.143500
0.084325 -0.314195 -0.059068
-0.277352 0.163037 0.027308
-0.410272 0.074712 -0.284454
-0.231932 0.171636 -0.406981
-0.098810 -0.282769 0.111217
0.083429 -0.282346 -0.148755
-0.235726 0.199472 0.141764
-0.189739 0.235132 -0.124712
0.304557 -0.015489 -0.144658
-0.222888 -0.224145 0.105558
-0.096383 0.214198 -0.287195
-0.384562 -0.143083 -0.181027
-0.425824 -0.058897 -0.242054
0.042195 0.204180 -0.259112
-0.290006 0.017253 0.178768
0.048953 0.309408 -0.068235
0.262706 0.045633 -0.158891
0.195902 0.086608 -0.243850
-0.387967 -0.190130 -0.239409
0.157989 0.276958 -0.126780
-0.121778 -0.291276 0.073580
-0.274459 0.014945 0.161721
-0.265107 -0.168869 0.083416
-0.260443 0.146851 0.166436
-0.331793 -0.006999 0.044424
-0.117431 0.296578 0.021225
0.156007 0.197707 -0.184157
0.147490 -0.247542 -0.151416
-0.344675 0.135597 -0.330796
0.091954 0.281569 -0.102872
-0.235714 -0.224096 0.070897
-0.098692 -0.273043 -0.390239
0.169401 -0.040982 -0.265966
0.082955 0.163814 -0.275530
-0.425671 0.034027 -0.266055
-0.411821 0.030637 -0.262889
0.297401 -0.017996 -0.157932
-0.007328 -0.324695 0.032517
0.059288 0.322974 -0.056406
-0.278806 0.147196 0.151548
-0.405193 -0.149062 -0.232510
-0.171844 0.293176 0.060381
0.196120 0.220763 -0.147778
0.293195 -0.080115 -0.121704
-0.261890 -0.109848 0.181809
0.212135 0.091764 -0.214476
-0.095692 -0.312883 -0.121040
0.193563 0.147244 -0.196750
-0.014156 0.171065 -0.327625
-0.017932 -0.307091 -0.104304
-0.272117 -0.046763 0.208393
0.118480 -0.309375 -0.005216
-0.384017 -0.039267 -0.135063
0.260873 -0.192197 -0.077372
-0.018305 -0.180209 -0.467768
0.049243 -0.322744 -0.001335
-0.266421 -0.045876 0.202952
0.096231 0.293757 -0.107175
0.095638 0.285644 -0.099727
-0.287553 0.077219 0.139159
0.271566 0.112217 -0.145616
-0.149155 -0.260500 0.137792
0.024019 -0.328978 0.087003
-0.274741 0.015976 0.167886
-0.012417 0.116296 -0.384678
0.198089 -0.232408 -0.067577
-0.135968 -0.262285 0.170866
0.172151 -0.239898 -0.110181
-0.211649 -0.305929 -0.321654
-0.123690 -0.299679 0.078656
-0.273745 0.019287 0.187252
-0.421823 -0.155521 -0.233671
0.147355 0.257788 -0.116618
0.228028 0.034731 -0.212996
-0.237139 -0.170645 0.198416
-0.149941 0.281695 -0.036446
0.135922 -0.105917 -0.297620
-0.114290 0.118307 -0.460251
0.243757 -0.188436 -0.088495
-0.070038 0.305330 -0.014688
-0.165710 0.241989 -0.185516
0.300274 -0.086664 -0.141579
0.008690 0.287719 -0.131477
0.077633 0.283272 -0.133814
-0.232979 0.209011 -0.205364
-0.052630 0.047188 -0.483168
-0.272127 0.078356 0.151388
-0.258705 -0.312632 -0.300218
0.105296 0.294586 -0.089622
0.007668 -0.310464 0.056867
0.181449 -0.201504 -0.180301
-0.354572 0.071977 -0.107246
-0.233161 -0.163605 0.169013
-0.190545 -0.288135 -0.069628
0.267644 -0.137586 -0.112338
0.269677 -0.017831 -0.150903
-0.392731 -0.192910 -0.239649
0.274525 -0.137895 -0.107223
0.139700 0.256614 -0.131866
0.259808 -0.023628 -0.183047
-0.010838 0.337531 -0.043372
-0.293754 -0.174438 0.011980
-0.260295 0.134106 0.133743
-0.012384 0.330136 -0.045258
-0.171800 0.199902 -0.306310
0.111382 -0.295786 -0.007315
0.089350 0.163595 -0.257640
0.031031 -0.317937 -0.029091
0.046148 -0.313910 -0.003788
-0.225038 -0.296731 -0.246109
0.242917 0.170873 -0.161738
-0.068261 -0.308829 -0.074186
-0.236622 -0.167802 0.182498
0.222171 0.157228 -0.153159
-0.268036 -0.045923 0.207727
-0.250894 -0.213483 -0.002887
-0.067987 -0.244288 -0.413899
0.077626 0.156762 -0.267984
-0.253951 0.196044 -0.029370
-0.066513 -0.271736 -0.344698
0.179334 -0.246710 -0.110792
-0.270639 0.161547 -0.375974
-0.329571 0.053512 0.031558
0.057181 0.329988 -0.064202
0.117513 0.249181 -0.168860
-0.101267 0.294447 -0.067686
0.000454 0.332167 -0.023341
-0.343210 -0.180726 -0.132212
-0.314866 0.147893 -0.277817
-0.370249 -0.237827 -0.248482
-0.278419 -0.048237 0.206610
-0.216741 0.198352 -0.279417
-0.206670 -0.254894 -0.002568
0.279750 -0.080557 -0.130389
0.252919 -0.026148 -0.196442
0.252271 -0.142566 -0.138368
-0.250065 0.196598 0.120896
-0.116253 0.323404 0.039698
0.184050 0.022553 -0.255472
-0.292092 0.019849 0.194577
-0.380515 0.109435 -0.307174
-0.113781 0.121469 -0.464747
0.213277 -0.191046 -0.126151
-0.429539 -0.010718 -0.252643
-0.171670 0.297127 0.064469
-0.100517 -0.295976 0.121834
0.300563 -0.013983 -0.134879
-0.099777 -0.275110 -0.393745
0.279159 -0.084058 -0.143318
0.219565 0.155884 -0.154404
-0.347017 -0.132804 -0.072628
0.079704 -0.305184 -0.060331
-0.314743 -0.065543 0.056540
-0.238719 -0.216886 0.040436
-0.258917 0.144674 0.162139
0.026172 0.302662 -0.107059
-0.253623 0.177197 0.079880
-0.320447 -0.068497 0.029188
-0.111958 0.307878 0.036416
0.171178 -0.248255 -0.123056
-0.260640 0.136494 0.139595
0.287264 -0.147954 -0.122180
-0.261193 0.132217 0.128106
-0.391441 0.043385 -0.212550
0.037257 -0.241322 -0.279336
-0.168375 -0.302215 -0.343430
0.289156 -0.015153 -0.139311
0.023748 0.293315 -0.106439
0.105038 -0.278015 -0.114810
-0.042413 -0.209615 -0.435653
-0.181336 0.261378 -0.095848
0.040349 0.032088 -0.399832
-0.255812 -0.304254 -0.299427
-0.193486 0.255841 -0.005740
0.016275 0.291416 -0.119348
-0.089885 -0.290451 0.137563
0.206099 -0.200913 -0.152760
-0.011355 0.313559 -0.041735
0.203764 0.220419 -0.126144
0.241222 -0.088665 -0.179926
0.123258 -0.239033 -0.169562
-0.237027 0.185324 0.113241
-0.006312 0.341926 -0.036033
-0.098551 0.259025 -0.186285
-0.076914 0.092766 -0.485188
0.125311 -0.155906 -0.281798
-0.290792 -0.054558 0.148713
-0.316197 -0.063877 0.087946
0.041770 -0.326090 -0.014226
-0.000454 0.233431 -0.239455
0.237472 -0.187462 -0.093361
0.151625 -0.279928 -0.052584
0.041781 0.264374 -0.186569
-0.086493 0.300061 -0.042483
0.179657 0.205054 -0.143322
-0.282372 -0.115254 0.117699
0.265565 0.046328 -0.157672
-0.023965 0.303445 -0.062404
-0.124151 0.321493 0.026750
0.252151 0.105119 -0.157897
0.104117 -0.236666 -0.189977
-0.148781 0.149943 -0.452051
-0.014289 -0.083332 -0.476403
-0.300008 0.114806 0.049923
-0.046371 -0.327888 0.104672
-0.299913 -0.257455 -0.209293
-0.081466 0.133613 -0.413222
0.207643 0.223484 -0.125215
-0.292389 0.166682 -0.228602
0.278491 0.115038 -0.148353
-0.260026 0.139208 0.147113
-0.335267 -0.272471 -0.262573
0.195770 -0.231719 -0.069486
0.104173 0.307524 -0.105710
-0.259503 0.183068 0.084838
-0.118545 0.289966 -0.096571
-0.400229 -0.197543 -0.238429
0.111669 0.309458 -0.092529
0.181452 -0.281706 -0.013283
0.064257 -0.309633 0.026368
0.184938 0.211813 -0.150087
-0.064093 -0.307164 0.060167
0.262949 -0.194740 -0.080024
0.124776 0.250938 -0.155542
-0.160810 -0.295042 -0.001786
0.123250 -0.279330 -0.091038
-0.188458 0.167571 -0.433453
0.257325 -0.020999 -0.166948
0.041750 0.300485 -0.076771
-0.116768 0.298639 0.023498
0.214217 -0.032617 -0.226266
-0.287709 -0.050689 0.199535
0.230849 0.161485 -0.147649
-0.078926 -0.311209 0.034699
0.083119 -0.326937 0.051636
-0.279825 0.149518 0.156653
-0.420699 -0.011181 -0.249653
0.289069 -0.146763 -0.117564
-0.025340 0.010460 -0.500000
0.236246 0.166844 -0.161233
0.182601 -0.285290 -0.015188
0.129046 0.185047 -0.217408
0.249688 -0.197556 -0.099631
0.266741 -0.021184 -0.170101
-0.251590 -0.105385 0.171156
-0.021369 0.218950 -0.266542
0.018636 0.301048 -0.120243
-0.181869 -0.214193 0.185041
-0.305184 0.004779 0.108288
0.223707 0.159720 -0.163088
-0.148479 -0.263082 0.143940
-0.126542 0.192833 -0.331746
-0.120598 0.325751 0.034692
0.219568 -0.251295 -0.067336
-0.056736 -0.312781 0.077000
-0.277564 -0.050130 0.173632
-0.046204 -0.311174 -0.150654
-0.016022 -0.130510 -0.466371
0.237362 0.036521 -0.216584
-0.347836 0.036731 -0.038551
-0.071635 0.320552 -0.012943
0.250369 -0.189322 -0.083111
-0.249670 -0.105991 0.204514
-0.077144 -0.307334 -0.199030
-0.264436 0.148256 0.166622
0.161584 0.275223 -0.115535
-0.282579 -0.050354 0.187278
-0.060865 0.284666 -0.124030
0.282203 0.049397 -0.166013
-0.044796 -0.330868 0.109254
-0.186960 0.156427 -0.424520
-0.295717 0.136543 -0.043173
0.009069 -0.311539 0.059394
0.288316 0.052101 -0.144054
-0.346727 0.118055 -0.253265
-0.271300 0.086341 0.180602
-0.141287 -0.290820 0.033415
-0.070841 0.335459 -0.007466
0.040191 0.298586 -0.078637
0.272908 -0.083810 -0.145720
0.243527 -0.025957 -0.193260
-0.275621 -0.050936 0.154175
-0.156340 0.172889 -0.376407
0.244141 0.102146 -0.161842
-0.008114 -0.205919 -0.391823
-0.002653 -0.311686 -0.081177
-0.010894 -0.134846 -0.479294
-0.397500 0.068287 -0.283094
-0.040772 -0.326355 -0.024955
-0.295568 0.074967 0.126816
-0.273143 0.165543 -0.378846
-0.348338 0.139569 -0.331968
0.249435 0.171577 -0.141949
-0.097202 -0.308470 0.141906
-0.313906 0.097577 -0.006384
0.047546 -0.162992 -0.366854
0.256636 -0.201039 -0.098867
0.153809 -0.099261 -0.264201
-0.023753 -0.319827 0.003692
0.043877 0.313485 -0.079956
0.245754 0.039086 -0.204653
-0.205057 -0.264697 0.018608
0.000124 -0.321664 0.045044
-0.127371 0.288810 0.001587
0.155035 -0.269867 -0.038097
-0.394308 0.067923 -0.280371
-0.431307 -0.109123 -0.235395
-0.298264 -0.058220 0.116218
0.162692 0.204438 -0.187058
0.250592 -0.023491 -0.180218
0.272416 0.113470 -0.168239
-0.291833 0.130027 0.096143
-0.266891 -0.112749 0.204973
-0.203219 0.228480 0.078800
-0.008866 0.341977 -0.040443
-0.231596 -0.167895 0.201740
-0.353486 0.097826 -0.179301
-0.129924 0.298263 0.003677
0.229298 0.098142 -0.206187
-0.349907 -0.019667 -0.026560
-0.155979 0.285161 0.074402
-0.223230 -0.159864 0.182424
-0.297936 0.010495 0.140524
0.148443 0.069289 -0.274612
0.031180 0.294831 -0.093396
0.190609 -0.037155 -0.247956
-0.002548 0.223679 -0.233309
0.109577 0.245866 -0.180918
0.078806 0.045461 -0.358667
-0.309684 -0.123331 0.053545
-0.149034 0.142137 -0.444238
-0.275416 0.021257 0.199271
-0.334124 -0.223575 -0.195513
0.012008 -0.331093 0.066523
0.014901 -0.315750 -0.054262
-0.340225 -0.013343 0.008733
-0.155147 -0.261158 0.125388
-0.132765 -0.299583 -0.373141
-0.292611 0.142909 -0.027639
-0.272940 0.076875 0.145622
-0.238014 0.181562 0.104969
0.163883 -0.241275 -0.122349
0.063858 -0.319409 0.022971
-0.283439 0.132114 0.108729
0.289630 -0.018210 -0.157503
0.135917 0.248372 -0.125704
-0.161555 0.270378 0.052340
0.206143 -0.193812 -0.139095
0.281568 -0.018468 -0.157263
0.131742 0.007389 -0.316774
-0.285715 0.172742 -0.101277
-0.132916 -0.294785 -0.370377
0.243294 -0.138718 -0.136174
0.122810 -0.245466 -0.179101
0.227680 -0.185731 -0.100530
-0.420427 0.032211 -0.266229
-0.249972 -0.105806 0.197060
0.053511 -0.310523 0.008938
0.262606 -0.081044 -0.141182
-0.225918 -0.164828 0.203588
-0.299206 -0.057162 0.136237
-0.008221 0.283216 -0.160574
-0.233596 -0.164907 0.175574
0.052236 0.332431 -0.074782
-0.213589 0.255153 0.103202
-0.003139 0.339412 -0.030301
0.097970 -0.243203 -0.206724
0.263863 -0.198208 -0.085698
0.134130 0.247289 -0.127820
-0.170520 -0.309473 -0.348909
-0.228839 0.211916 -0.097140
-0.076117 0.270491 -0.148826
0.143472 0.128099 -0.262635
-0.359512 -0.228366 -0.248951
-0.204169 0.227446 0.076180
-0.138512 -0.265645 0.171103
-0.239294 -0.283073 -0.174175
-0.271197 -0.220820 -0.034746
-0.246150 0.188467 0.109496
-0.106866 -0.305313 -0.020719
0.160122 0.277073 -0.122152
0.037096 -0.276302 -0.206610
-0.184185 0.243773 -0.111061
-0.113102 0.117589 -0.456275
0.019550 -0.319002 0.078247
-0.289120 -0.282941 -0.275650
-0.196496 -0.221720 0.169042
0.193502 -0.240710 -0.084853
-0.274945 0.016490 0.170967
0.028530 -0.203470 -0.347874
-0.428857 0.035150 -0.265903
-0.224259 -0.159212 0.174509
-0.209772 -0.303644 -0.318658
-0.157338 0.280933 0.068417
-0.246754 -0.215198 0.013578
-0.246754 0.191815 0.115270
-0.118831 0.292547 0.016629
-0.246570 -0.167573 0.144114
-0.016518 -0.131561 -0.470420
-0.068286 -0.293536 -0.273384
-0.009079 -0.085405 -0.489806
-0.035232 -0.296354 -0.225931
-0.159084 0.292039 0.076827
-0.283477 0.088905 0.183426
-0.144464 -0.251459 0.132259
-0.431317 -0.059149 -0.242346
-0.168513 0.279996 0.052133
-0.089143 0.257225 -0.169877
-0.251462 -0.297131 -0.295228
-0.286603 -0.050802 0.193956
0.155870 -0.043197 -0.276123
-0.106202 -0.285030 0.098594
-0.030800 0.311561 -0.075040
-0.313731 -0.000316 0.080019
-0.261592 0.175091 0.067304
0.016306 -0.340413 0.074915
-0.079345 -0.320410 0.038982
-0.005945 -0.319762 -0.088719
-0.167632 -0.259826 0.094714
0.204704 -0.151994 -0.203515
-0.156304 0.288981 0.077675
0.147811 0.194417 -0.196003
0.202987 -0.234214 -0.064028
-0.272131 0.082178 0.165163
0.151241 -0.154241 -0.255232
0.161115 0.269560 -0.106474
0.302046 -0.085629 -0.136913
0.154595 0.201283 -0.199050
0.009796 -0.324758 0.062042
-0.059603 0.333686 0.010002
0.259609 0.043742 -0.178273
0.268344 0.047009 -0.156388
-0.132010 -0.304684 -0.375196
0.185202 0.144176 -0.208541
0.208442 0.154439 -0.186637
-0.118946 -0.300911 -0.045701
0.062589 -0.308569 0.024002
0.007326 0.232056 -0.222165
0.112184 0.241106 -0.166505
-0.254055 -0.258408 -0.103670
-0.383135 0.111501 -0.307536
0.135385 0.064585 -0.284573
-0.333761 -0.072196 0.016141
-0.287545 0.084255 0.164522
-0.128761 -0.292429 0.060608
0.265149 0.110601 -0.167602
-0.254974 -0.108289 0.209992
-0.190716 -0.222828 0.188031
0.059018 0.326430 -0.058815
0.057123 0.318763 -0.058130
0.000767 -0.241110 -0.324259
-0.338028 0.131351 -0.325785
0.178075 -0.153172 -0.229425
0.206914 -0.242237 -0.070368
-0.219690 0.223201 0.051016
-0.408464 -0.150244 -0.234892
0.094947 -0.301124 -0.035109
-0.034141 -0.315700 0.120798
0.263464 -0.201274 -0.092005
-0.002238 -0.299656 -0.178873
-0.012598 -0.035267 -0.498812
-0.026138 -0.314818 -0.119604
-0.265327 0.177746 -0.069023
-0.185258 0.155439 -0.420796
0.207605 0.151359 -0.170422
0.011053 0.297548 -0.132474
-0.204552 0.245083 -0.031437
-0.281104 -0.169042 0.025096
-0.269197 -0.113268 0.195579
-0.198413 -0.298477 -0.195429
0.250547 -0.090798 -0.182697
-0.128858 -0.308533 -0.060012
0.186426 -0.243582 -0.097633
-0.067175 0.311631 -0.008332
0.286768 -0.080221 -0.125477
0.134824 -0.318250 0.013584
0.157155 -0.270743 -0.036034
-0.171828 -0.301541 -0.144100
0.251632 0.105378 -0.169241
-0.236138 0.190057 0.123269
-0.305468 0.153980 -0.151960
-0.186161 -0.210405 0.161733
0.067624 -0.312323 0.030992
0.264898 -0.018608 -0.154456
0.246696 0.103087 -0.160383
0.114324 -0.306189 -0.009419
-0.226947 0.161952 -0.397367
-0.323618 -0.259281 -0.259750
0.281945 0.050503 -0.147576
0.267010 -0.018184 -0.152408
-0.147600 0.141249 -0.440374
0.074060 -0.335257 0.034805
-0.253418 0.201240 0.126206
-0.187851 0.160324 -0.428327
-0.334611 0.114467 -0.127170
0.111201 0.111647 -0.279243
0.018797 -0.338735 0.079032
0.066787 -0.271625 -0.161212
-0.211508 0.224932 0.063574
0.179110 -0.295564 -0.029997
-0.298975 0.007236 0.121469
0.224783 -0.241127 -0.046673
0.258352 -0.136854 -0.118437
0.056586 -0.319715 0.011257
-0.008889 -0.135838 -0.481811
-0.030040 0.008325 -0.492710
0.092170 -0.312886 -0.046574
0.157775 0.265966 -0.107620
-0.295722 0.154970 -0.007841
-0.041334 -0.307787 0.103010
-0.014124 -0.133213 -0.475112
0.227722 0.096853 -0.189654
-0.329882 -0.265400 -0.263008
-0.139736 -0.256167 0.151392
-0.087284 -0.295675 0.148427
-0.230646 0.167010 -0.404276
-0.254861 -0.170489 0.131625
0.053360 0.314155 -0.062621
-0.195444 -0.210544 0.137191
0.289822 0.051004 -0.166617
-0.363444 -0.184179 -0.185681
0.186611 0.209714 -0.139073
0.248294 -0.086088 -0.166909
-0.278585 -0.049933 0.180253
0.264711 -0.080774 -0.139100
-0.267894 -0.047700 0.179047
-0.364685 0.024321 -0.092164
-0.095970 -0.285186 0.119572
0.087587 0.232959 -0.207682
0.220126 -0.188039 -0.113048
-0.100657 -0.292008 -0.320621
0.026782 -0.295377 -0.133002
-0.202538 0.233523 0.086688
-0.110081 0.312414 0.042037
0.019870 0.190666 -0.285550
0.201410 0.152413 -0.200041
-0.216349 0.251497 0.094675
-0.276619 0.172966 -0.382307
-0.213016 -0.310941 -0.323479
-0.046511 -0.302856 0.090629
-0.274939 0.143645 0.145726
0.228382 -0.193421 -0.114523
-0.194315 -0.217689 0.162402
-0.305654 -0.059384 0.123091
-0.298307 0.127137 0.083140
-0.323825 -0.177935 -0.077739
-0.211715 -0.252282 -0.018668
0.043310 0.302681 -0.075069
-0.076429 -0.305001 -0.088670
0.086361 -0.159319 -0.324049
0.257441 -0.088100 -0.169340
-0.413622 -0.152257 -0.235045
-0.142232 -0.253458 0.140894
0.093058 0.106249 -0.312751
-0.322924 -0.070093 0.012372
-0.292025 -0.056039 0.129433
0.053386 -0.014697 -0.398617
-0.177869 -0.268728 0.087425
-0.214470 -0.319542 -0.325078
-0.145621 0.294810 -0.021842
0.260728 -0.141189 -0.127559
-0.100954 -0.307322 0.133050
0.275284 -0.019075 -0.159483
-0.292834 0.088227 0.176051
0.275394 -0.017181 -0.148308
-0.019518 -0.035727 -0.482395
-0.050932 0.048979 -0.488105
-0.378340 -0.090947 -0.128558
0.224709 0.158521 -0.151849
-0.071176 0.328105 -0.010076
-0.164729 -0.283660 -0.021899
-0.319130 0.053339 0.036444
-0.224190 0.220022 -0.082852
0.214382 -0.199198 -0.140602
-0.038457 0.249307 -0.198362
-0.415140 0.030735 -0.265486
-0.123408 0.314422 0.023448
0.102159 -0.297777 -0.022286
-0.108096 -0.293429 0.103702
-0.186658 -0.208869 0.155631
-0.114514 0.303200 0.029694
0.107233 0.176792 -0.250483
-0.170545 -0.318026 -0.351363
-0.235879 0.221195 -0.097790
-0.273229 -0.173685 0.083477
-0.313856 0.160042 -0.356283
-0.100680 -0.301693 0.127602
-0.320840 0.061977 0.066671
-0.291144 0.122557 0.077497
-0.124319 -0.308963 -0.170800
-0.305846 -0.120893 0.030548
-0.266407 -0.110831 0.162539
-0.149673 -0.268090 0.150183
-0.274156 -0.169267 0.052319
0.123701 0.117439 -0.269160
0.127370 -0.321292 0.000590
-0.045471 -0.304215 0.093318
-0.224333 -0.158761 0.171408
0.140070 0.251925 -0.122646
0.285591 -0.139576 -0.102044
-0.168927 0.275497 0.047182
0.200719 0.149401 -0.183703
-0.150549 -0.275394 0.161252
-0.296671 0.069945 0.108135
-0.047010 0.250974 -0.215251
-0.436788 -0.059237 -0.241674
-0.329301 -0.128092 -0.018059
0.213368 -0.246797 -0.068737
0.302049 -0.083751 -0.130144
-0.316532 0.092235 -0.022397
-0.134165 0.273736 -0.126124
0.209287 0.227981 -0.134750
-0.223540 0.236321 -0.066088
0.143462 0.126278 -0.251250
-0.068854 -0.246149 -0.417574
0.126622 0.244765 -0.140325
0.177303 -0.148778 -0.218775
0.106721 -0.285723 -0.120000
-0.197366 -0.257840 0.023780
0.104373 -0.200480 -0.260899
0.152875 0.261954 -0.111551
-0.280722 0.168166 -0.301893
0.040693 0.308549 -0.083185
-0.274391 0.178050 0.059268
0.221376 -0.196202 -0.127361
0.245312 -0.145247 -0.151253
-0.267833 0.181123 0.072186
-0.239470 0.225392 0.029564
-0.400651 -0.000010 -0.198816
-0.035500 -0.319681 0.120453
-0.211057 0.236041 0.079647
-0.239698 -0.170672 0.189078
-0.280246 0.074437 0.132981
-0.149730 0.257259 -0.155659
-0.245292 0.203362 0.138979
0.215096 -0.237139 -0.053108
-0.272971 0.087836 0.185115
-0.012345 -0.084782 -0.485409
-0.151834 -0.253733 0.119625
0.043476 -0.299603 -0.110784
0.131338 -0.278119 -0.078731
0.252664 0.041424 -0.191236
-0.181778 -0.303490 -0.270421
0.049589 0.328091 -0.077333
0.023416 0.133857 -0.342759
-0.283582 -0.174125 0.047792
-0.440113 -0.059282 -0.241216
0.084920 0.285117 -0.120963
-0.270108 -0.113853 0.201175
0.093808 0.283653 -0.101324
-0.289559 0.088820 0.179912
0.250168 0.173049 -0.148458
-0.125970 -0.297260 -0.060828
-0.211070 0.251231 -0.034419
-0.162903 -0.264072 0.113018
0.155612 -0.200996 -0.207002
0.060011 -0.278753 -0.177474
-0.371743 0.103206 -0.305003
-0.262920 0.199440 -0.035742
0.076644 -0.317032 0.044081
0.237314 0.164561 -0.142934
0.169830 0.206319 -0.173689
-0.053468 0.198029 -0.309506
-0.182935 -0.212787 0.177807
-0.251559 0.185109 0.097262
-0.251456 -0.105458 0.174241
-0.422431 -0.058361 -0.239622
0.088476 0.278600 -0.106777
-0.159831 -0.256944 0.107241
0.021711 -0.334258 0.083582
0.234864 -0.186856 -0.094992
0.267366 -0.080727 -0.137530
-0.191936 -0.267451 0.053264
0.216491 -0.096468 -0.221089
-0.315643 0.162742 -0.357260
0.181898 0.206497 -0.141773
0.279616 0.115747 -0.154948
0.168880 0.139194 -0.237895
-0.299682 -0.119596 0.057944
0.250859 -0.136385 -0.123667
0.115269 -0.298111 -0.002977
0.135017 -0.309278 0.019461
-0.279583 0.021199 0.199839
-0.071724 -0.310136 0.047557
0.169574 0.077304 -0.268388
0.260073 0.044972 -0.160357
0.229309 0.162689 -0.160915
-0.234486 0.196686 0.137753
-0.114414 0.282818 -0.091985
-0.154097 -0.287514 0.003837
-0.225488 -0.158006 0.162372
0.066329 0.272556 -0.145371
-0.271104 0.139978 0.139576
-0.276862 0.127725 0.103076
-0.227600 0.221177 0.038390
-0.300252 -0.121100 0.089432
-0.188096 -0.208247 0.149834
0.162030 0.272393 -0.109465
-0.006938 0.276242 -0.154337
-0.137631 0.296442 -0.008930
-0.308654 -0.121306 0.013702
-0.079762 0.311403 -0.028518
-0.256668 0.187892 -0.253791
-0.268345 0.160522 -0.372594
-0.310897 0.155652 -0.354614
0.226076 -0.251962 -0.060203
0.155335 -0.195546 -0.196847
-0.020196 -0.178668 -0.465424
-0.438275 -0.009223 -0.251860
0.135209 -0.194512 -0.216425
-0.366661 -0.029442 -0.080732
-0.249011 -0.165964 0.124960
-0.434972 -0.009796 -0.252185
-0.274381 -0.113451 0.150242
0.217142 0.154687 -0.155892
-0.318185 0.107147 0.014582
0.193175 0.149444 -0.211988
-0.031568 0.301956 -0.075351
-0.064300 -0.315795 0.064536
0.092365 0.289079 -0.110049
-0.261520 0.185062 -0.054086
0.163231 0.199772 -0.171132
-0.211456 -0.216428 0.112366
-0.102398 0.304490 -0.066657
-0.108214 -0.303995 -0.247758
-0.303998 0.072723 0.114281
-0.273838 0.185644 -0.068539
0.018255 0.075082 -0.394963
0.250409 0.041969 -0.174874
-0.085660 0.177428 -0.353000
-0.081070 0.275568 -0.157896
-0.282750 -0.116218 0.137771
0.117217 -0.299331 -0.000838
0.015644 -0.025480 -0.440326
-0.117264 0.158165 -0.396723
0.014057 -0.337329 0.070712
0.243656 0.039672 -0.188169
0.298117 -0.080561 -0.120723
-0.047199 -0.321844 0.099797
0.226437 -0.244239 -0.048967
0.247516 0.169905 -0.138585
0.022927 -0.321621 0.084345
-0.350556 0.142012 -0.332641
0.064947 0.218671 -0.233451
-0.294183 0.018198 0.185271
0.137259 -0.286114 -0.078369
-0.027236 -0.303302 -0.118108
-0.236943 0.183814 0.110436
-0.360702 -0.083692 -0.073904
-0.114058 -0.288336 0.086144
0.159393 -0.271912 -0.034091
-0.368732 0.102596 -0.302125
-0.260513 0.135322 0.136685
0.138606 -0.275203 -0.065895
-0.267966 0.171902 0.054361
0.109688 0.311660 -0.098907
0.164357 -0.044216 -0.283996
-0.302892 0.067214 0.095013
-0.251090 -0.106741 0.209307
-0.242558 0.178164 -0.326389
-0.251702 -0.105811 0.180557
-0.250977 0.204466 0.135004
0.279378 0.115940 -0.161973
-0.237023 0.186771 0.116021
0.156503 -0.149180 -0.237680
0.252936 -0.136253 -0.121541
0.243231 0.102521 -0.179800
0.255035 -0.083404 -0.153681
0.186296 -0.233900 -0.084273
0.015521 -0.316667 0.071057
-0.087370 0.309610 -0.041189
0.232655 -0.090704 -0.191791
0.197729 -0.195391 -0.151138
-0.038648 -0.317599 -0.022217
-0.152617 0.291332 -0.034424
0.084746 -0.275099 -0.139886
-0.058778 0.325854 0.009109
0.109652 0.298969 -0.085440
-0.147635 -0.273881 0.165151
-0.138821 -0.302007 -0.296126
-0.221281 -0.161234 0.198258
0.265382 0.109940 -0.149119
-0.267361 -0.047083 0.187014
-0.282785 -0.052054 0.161013
-0.234120 0.217786 0.025572
0.104179 0.237629 -0.178429
-0.185912 -0.260215 0.053983
-0.260385 0.133015 0.130855
-0.232817 -0.160327 0.149723
0.295611 -0.014303 -0.135696
0.244500 -0.028480 -0.208401
-0.198810 0.245050 0.107407
0.255534 -0.136477 -0.119886
-0.115761 -0.296405 0.091290
-0.170138 0.286677 0.056400
0.019331 -0.302906 -0.148788
0.067348 -0.322771 0.027602
0.157893 0.014637 -0.291405
-0.264115 -0.282008 -0.225792
-0.397023 -0.098363 -0.182189
-0.228559 -0.217979 0.071160
-0.148500 0.152517 -0.454227
-0.325722 0.135466 -0.202917
3 801 84 289
3 801 281 84
3 801 1058 281
3 801 347 1058
3 801 44 347
3 801 1113 44
3 801 775 1113
3 801 966 775
3 801 914 966
3 217 777 713
3 777 1180 713
3 777 1266 1180
3 777 1023 1266
3 1023 466 1266
3 777 650 1023
3 650 432 1023
3 432 512 1023
3 512 126 1023
3 126 279 1023
3 1023 814 466
3 217 564 777
3 279 540 1023
3 564 1285 777
3 1285 992 777
3 1023 772 814
3 1008 558 310
3 367 1008 310
3 1008 367 144
3 367 48 144
3 48 964 144
3 964 48 114
3 742 964 114
3 1086 742 114
3 742 1086 196
3 1086 1062 196
3 1062 688 196
3 688 1062 591
3 493 688 591
3 134 493 591
3 493 134 1305
3 134 715 1305
3 715 730 1305
3 730 715 633
3 266 730 633
3 720 266 633
3 266 720 1041
3 720 575 1041
3 575 1178 1041
3 1178 575 259
3 1246 1178 259
3 1150 1246 259
3 1246 1150 944
3 1150 1212 944
3 1212 506 944
3 506 1212 894
3 1050 366 1156
3 1052 1050 1156
3 1050 1052 619
3 1052 1250 619
3 1250 394 619
3 394 1250 339
3 1204 394 339
3 369 1204 339
3 1204 369 1058
3 369 281 1058
3 178 966 914
3 966 178 874
3 178 945 874
3 945 511 874
3 511 945 999
3 130 511 999
3 621 130 999
3 130 621 184
3 621 197 184
3 197 83 184
3 83 197 830
3 493 1305 705
3 493 705 226
3 688 493 226
3 688 226 433
3 196 688 433
3 196 433 492
3 742 196 492
3 742 492 422
3 964 742 422
3 964 422 31
3 144 964 31
3 144 31 904
3 1008 144 904
3 1008 904 790
3 558 1008 790
3 558 790 1211
3 310 558 1211
3 310 1211 325
3 367 310 325
3 367 325 45
3 48 367 45
3 48 45 49
3 114 48 49
3 114 49 936
3 1086 114 936
3 1086 936 189
3 1062 1086 189
3 1062 189 172
3 591 1062 172
3 591 172 211
3 134 591 211
3 134 211 4
3 715 134 4
3 715 4 458
3 633 715 458
3 633 458 265
3 720 633 265
3 720 265 187
3 575 720 187
3 575 187 272
3 259 575 272
3 259 272 810
3 1150 259 810
3 1150 810 1109
3 1212 1150 1109
3 1212 1109 1216
3 894 1212 1216
3 894 1216 538
3 506 894 538
3 506 538 391
3 944 506 391
3 944 391 644
3 1246 944 644
3 1246 644 795
3 1178 1246 795
3 1178 795 1089
3 1041 1178 1089
3 1041 1089 500
3 266 1041 500
3 266 500 507
3 730 266 507
3 730 507 477
3 1305 730 477
3 1305 477 705
3 226 705 440
3 226 440 645
3 433 226 645
3 433 645 317
3 492 433 317
3 492 317 1070
3 422 492 1070
3 422 1070 1009
3 31 422 1009
3 31 1009 291
3 904 31 291
3 904 291 1141
3 790 904 1141
3 790 1141 1014
3 1014 1211 790
3 1211 1014 28
3 325 1211 28
3 325 28 118
3 45 325 118
3 45 118 261
3 49 45 261
3 49 261 220
3 936 49 220
3 936 220 841
3 189 936 841
3 189 841 873
3 172 189 873
3 172 873 1042
3 211 172 1042
3 211 1042 676
3 4 211 676
3 4 676 302
3 458 4 302
3 458 302 1016
3 265 458 1016
3 265 1016 436
3 187 265 436
3 187 436 600
3 272 187 600
3 272 600 1055
3 810 272 1055
3 810 1055 454
3 1109 810 454
3 1109 454 909
3 1216 1109 909
3 1216 909 647
3 647 538 1216
3 538 647 859
3 391 538 859
3 391 859 233
3 644 391 233
3 644 233 485
3 795 644 485
3 795 485 532
3 1089 795 532
3 1089 532 1208
3 500 1089 1208
3 500 1208 794
3 507 500 794
3 507 794 1019
3 477 507 1019
3 477 1019 997
3 705 477 997
3 705 997 440
3 645 440 834
3 645 834 581
3 317 645 581
3 317 581 85
3 1070 317 85
3 1070 85 589
3 1009 1070 589
3 1009 589 11
3 291 1009 11
3 291 11 447
3 1141 291 447
3 1141 447 431
3 1014 1141 431
3 1014 431 902
3 28 1014 902
3 28 902 32
3 118 28 32
3 118 32 168
3 261 118 168
3 261 168 1118
3 220 261 1118
3 220 1118 651
3 841 220 651
3 841 651 855
3 873 841 855
3 873 855 468
3 1042 873 468
3 1042 468 572
3 572 676 1042
3 676 572 206
3 302 676 206
3 302 206 128
3 1016 302 128
3 1016 128 378
3 436 1016 378
3 436 378 877
3 600 436 877
3 600 877 522
3 1055 600 522
3 1055 522 959
3 454 1055 959
3 454 959 472
3 909 454 472
3 909 472 516
3 647 909 516
3 647 516 64
3 859 647 64
3 859 64 1079
3 233 859 1079
3 233 1079 791
3 485 233 791
3 485 791 1161
3 532 485 1161
3 532 1161 331
3 1208 532 331
3 1208 331 104
3 794 1208 104
3 794 104 625
3 1019 794 625
3 1019 625 392
3 392 997 1019
3 997 392 774
3 440 997 774
3 440 774 834
3 581 834 994
3 581 994 887
3 85 581 887
3 85 887 443
3 589 85 443
3 589 443 180
3 180 11 589
3 11 180 18
3 447 11 18
3 447 18 1069
3 431 447 1069
3 1069 706 431
3 706 902 431
3 902 706 761
3 32 902 761
3 32 761 164
3 168 32 164
3 168 164 673
3 1118 168 673
3 1118 673 620
3 651 1118 620
3 651 620 535
3 535 855 651
3 855 535 269
3 468 855 269
3 468 269 669
3 572 468 669
3 669 896 572
3 896 206 572
3 206 896 912
3 128 206 912
3 128 912 889
3 378 128 889
3 378 889 991
3 877 378 991
3 877 991 99
3 522 877 99
3 522 99 377
3 377 959 522
3 959 377 544
3 472 959 544
3 472 544 407
3 516 472 407
3 407 1170 516
3 1170 64 516
3 64 1170 740
3 1079 64 740
3 1079 740 539
3 791 1079 539
3 791 539 809
3 1161 791 809
3 1161 809 1255
3 331 1161 1255
3 331 1255 955
3 955 104 331
3 104 955 328
3 625 104 328
3 625 328 1207
3 392 625 1207
3 1207 990 392
3 990 774 392
3 774 990 967
3 834 774 967
3 834 967 994
3 887 994 1238
3 887 1238 710
3 443 887 710
3 443 710 401
3 180 443 401
3 180 401 223
3 18 180 223
3 18 223 348
3 1069 18 348
3 1069 348 1237
3 706 1069 1237
3 706 1237 501
3 761 706 501
3 761 501 103
3 103 164 761
3 164 103 345
3 673 164 345
3 673 345 788
3 620 673 788
3 620 788 79
3 535 620 79
3 535 79 623
3 269 535 623
3 269 623 1034
3 669 269 1034
3 669 1034 1283
3 896 669 1283
3 896 1283 1146
3 1146 912 896
3 912 1146 613
3 889 912 613
3 889 613 1302
3 991 889 1302
3 991 1302 709
3 99 991 709
3 99 709 836
3 377 99 836
3 377 836 1024
3 544 377 1024
3 544 1024 515
3 407 544 515
3 407 515 1303
3 1170 407 1303
3 1170 1303 353
3 740 1170 353
3 740 353 1132
3 1132 539 740
3 539 1132 667
3 809 539 667
3 809 667 448
3 1255 809 448
3 1255 448 778
3 955 1255 778
3 955 778 632
3 328 955 632
3 328 632 1125
3 1207 328 1125
3 1207 1125 1263
3 990 1207 1263
3 990 1263 88
3 88 967 990
3 967 88 786
3 994 967 786
3 994 786 1238
3 710 1238 1233
3 710 1233 69
3 401 710 69
3 401 69 568
3 223 401 568
3 223 568 1231
3 348 223 1231
3 348 1231 675
3 1237 348 675
3 1237 675 1060
3 501 1237 1060
3 501 1060 389
3 103 501 389
3 103 389 355
3 345 103 355
3 345 355 799
3 788 345 799
3 788 799 893
3 79 788 893
3 79 893 954
3 623 79 954
3 623 954 109
3 1034 623 109
3 1034 109 903
3 1283 1034 903
3 1283 903 1228
3 1146 1283 1228
3 1146 1228 185
3 613 1146 185
3 613 185 973
3 1302 613 973
3 1302 973 880
3 709 1302 880
3 709 880 351
3 836 709 351
3 836 351 236
3 1024 836 236
3 1024 236 631
3 515 1024 631
3 515 631 137
3 1303 515 137
3 1303 137 1071
3 353 1303 1071
3 353 1071 556
3 1132 353 556
3 1132 556 65
3 667 1132 65
3 667 65 150
3 448 667 150
3 448 150 820
3 778 448 820
3 778 820 1306
3 632 778 1306
3 632 1306 712
3 1125 632 712
3 1125 712 1206
3 1263 1125 1206
3 1263 1206 635
3 88 1263 635
3 88 635 608
3 786 88 608
3 786 608 755
3 1238 786 755
3 1238 755 1233
3 69 1233 1166
3 69 1166 552
3 568 69 552
3 568 552 1148
3 1231 568 1148
3 1231 1148 43
3 675 1231 43
3 675 43 832
3 1060 675 832
3 1060 832 237
3 389 1060 237
3 389 237 406
3 406 355 389
3 355 406 439
3 799 355 439
3 799 439 1053
3 893 799 1053
3 893 1053 473
3 954 893 473
3 954 473 668
3 109 954 668
3 109 668 36
3 903 109 36
3 903 36 905
3 1228 903 905
3 1228 905 767
3 185 1228 767
3 185 767 1093
3 1093 973 185
3 973 1093 981
3 981 880 973
3 880 981 441
3 351 880 441
3 351 441 943
3 236 351 943
3 236 943 354
3 631 236 354
3 631 354 1049
3 137 631 1049
3 137 1049 654
3 1071 137 654
3 1071 654 1252
3 556 1071 1252
3 556 1252 1214
3 1214 65 556
3 65 1214 1030
3 150 65 1030
3 150 1030 595
3 820 150 595
3 820 595 998
3 1306 820 998
3 1306 998 984
3 712 1306 984
3 712 984 135
3 1206 712 135
3 1206 135 588
3 635 1206 588
3 635 588 350
3 608 635 350
3 608 350 398
3 398 755 608
3 755 398 514
3 1233 755 514
3 1233 514 1166
3 552 1166 749
3 552 749 1038
3 1148 552 1038
3 1148 1038 46
3 43 1148 46
3 43 46 1057
3 832 43 1057
3 832 1057 225
3 237 832 225
3 237 225 853
3 406 237 853
3 406 853 497
3 439 406 497
3 439 497 580
3 1053 439 580
3 1053 580 689
3 473 1053 689
3 473 689 1123
3 668 473 1123
3 668 1123 450
3 36 668 450
3 450 885 36
3 885 905 36
3 905 885 963
3 767 905 963
3 767 963 760
3 1093 767 760
3 1093 760 550
3 981 1093 550
3 981 550 39
3 441 981 39
3 441 39 597
3 943 441 597
3 943 597 340
3 354 943 340
3 354 340 881
3 1049 354 881
3 1049 881 297
3 654 1049 297
3 654 297 1110
3 1252 654 1110
3 1252 1110 451
3 1214 1252 451
3 1214 451 823
3 1030 1214 823
3 1030 823 763
3 595 1030 763
3 595 763 397
3 998 595 397
3 998 397 208
3 984 998 208
3 984 208 854
3 135 984 854
3 854 428 135
3 428 588 135
3 588 428 371
3 350 588 371
3 350 371 584
3 398 350 584
3 398 584 380
3 514 398 380
3 514 380 5
3 1166 514 5
3 1166 5 749
3 1038 749 693
3 1038 693 517
3 46 1038 517
3 46 517 537
3 1057 46 537
3 1057 537 181
3 225 1057 181
3 225 181 227
3 853 225 227
3 853 227 1301
3 497 853 1301
3 497 1301 1260
3 580 497 1260
3 580 1260 449
3 689 580 449
3 689 449 928
3 1123 689 928
3 1123 928 374
3 450 1123 374
3 450 374 870
3 885 450 870
3 885 870 1160
3 963 885 1160
3 963 1160 1299
3 760 963 1299
3 760 1299 965
3 550 760 965
3 550 965 113
3 39 550 113
3 39 113 975
3 597 39 975
3 597 975 110
3 340 597 110
3 340 110 248
3 881 340 248
3 881 248 267
3 297 881 267
3 297 267 605
3 1110 297 605
3 1110 605 156
3 451 1110 156
3 451 156 946
3 823 451 946
3 823 946 839
3 763 823 839
3 763 839 338
3 397 763 338
3 397 338 17
3 208 397 17
3 208 17 414
3 854 208 414
3 854 414 1230
3 428 854 1230
3 428 1230 1087
3 371 428 1087
3 371 1087 390
3 584 371 390
3 584 390 1137
3 380 584 1137
3 380 1137 687
3 5 380 687
3 5 687 1108
3 749 5 1108
3 749 1108 693
3 517 693 47
3 517 47 1247
3 537 517 1247
3 537 1247 1085
3 181 537 1085
3 181 1085 876
3 227 181 876
3 227 876 1188
3 1301 227 1188
3 1301 1188 215
3 1260 1301 215
3 1260 215 179
3 179 449 1260
3 449 179 241
3 928 449 241
3 928 241 956
3 374 928 956
3 374 956 1159
3 870 374 1159
3 870 1159 857
3 1160 870 857
3 1160 857 509
3 1299 1160 509
3 1299 509 52
3 965 1299 52
3 965 52 921
3 113 965 921
3 113 921 356
3 356 975 113
3 975 356 295
3 110 975 295
3 110 295 728
3 248 110 728
3 248 728 805
3 267 248 805
3 267 805 490
3 605 267 490
3 605 490 1149
3 156 605 1149
3 156 1149 833
3 946 156 833
3 946 833 100
3 839 946 100
3 839 100 528
3 528 338 839
3 338 528 626
3 17 338 626
3 17 626 1219
3 414 17 1219
3 414 1219 1012
3 1230 414 1012
3 1230 1012 1162
3 1087 1230 1162
3 1087 1162 1116
3 390 1087 1116
3 390 1116 674
3 1137 390 674
3 1137 674 1114
3 687 1137 1114
3 687 1114 1234
3 1234 1108 687
3 1108 1234 446
3 693 1108 446
3 693 446 47
3 1247 47 696
3 1247 696 1032
3 1085 1247 1032
3 1085 1032 346
3 876 1085 346
3 876 346 1181
3 1188 876 1181
3 1188 1181 521
3 215 1188 521
3 215 521 293
3 179 215 293
3 179 293 393
3 241 179 393
3 241 393 1177
3 956 241 1177
3 956 1177 923
3 1159 956 923
3 1159 923 594
3 857 1159 594
3 857 594 531
3 509 857 531
3 509 531 1121
3 52 509 1121
3 52 1121 56
3 921 52 56
3 921 56 264
3 356 921 264
3 356 264 792
3 295 356 792
3 295 792 33
3 728 295 33
3 728 33 201
3 805 728 201
3 805 201 1176
3 490 805 1176
3 490 1176 534
3 1149 490 534
3 1149 534 1088
3 833 1149 1088
3 833 1088 1199
3 100 833 1199
3 100 1199 691
3 528 100 691
3 528 691 419
3 626 528 419
3 626 419 1091
3 1219 626 1091
3 1219 1091 35
3 1012 1219 35
3 1012 35 232
3 1162 1012 232
3 1162 232 304
3 1116 1162 304
3 1116 304 1157
3 674 1116 1157
3 674 1157 364
3 1114 674 364
3 1114 364 719
3 1234 1114 719
3 1234 719 76
3 446 1234 76
3 446 76 865
3 47 446 865
3 47 865 696
3 1032 696 299
3 1032 299 831
3 346 1032 831
3 346 831 931
3 1181 346 931
3 1181 931 1220
3 521 1181 1220
3 521 1220 54
3 293 521 54
3 293 54 762
3 393 293 762
3 393 762 1294
3 1177 393 1294
3 1177 1294 86
3 923 1177 86
3 923 86 484
3 594 923 484
3 594 484 680
3 531 594 680
3 531 680 663
3 1121 531 663
3 1121 663 177
3 56 1121 177
3 56 177 504
3 264 56 504
3 264 504 155
3 792 264 155
3 792 155 106
3 33 792 106
3 33 106 920
3 201 33 920
3 201 920 216
3 1176 201 216
3 1176 216 1061
3 534 1176 1061
3 534 1061 513
3 1088 534 513
3 1088 513 158
3 1199 1088 158
3 1199 158 417
3 691 1199 417
3 691 417 1047
3 419 691 1047
3 419 1047 475
3 1091 419 475
3 1091 475 396
3 35 1091 396
3 35 396 1048
3 232 35 1048
3 232 1048 1127
3 304 232 1127
3 304 1127 1131
3 1157 304 1131
3 1157 1131 315
3 364 1157 315
3 364 315 1278
3 719 364 1278
3 719 1278 1227
3 76 719 1227
3 76 1227 19
3 865 76 19
3 865 19 969
3 696 865 969
3 696 969 299
3 831 299 234
3 831 234 628
3 931 831 628
3 931 628 812
3 812 1220 931
3 1220 812 1039
3 54 1220 1039
3 54 1039 822
3 762 54 822
3 762 822 804
3 804 1294 762
3 1294 804 638
3 86 1294 638
3 86 638 974
3 484 86 974
3 484 974 82
3 680 484 82
3 680 82 1077
3 663 680 1077
3 663 1077 624
3 177 663 624
3 177 624 1249
3 504 177 1249
3 504 1249 1010
3 155 504 1010
3 155 1010 692
3 106 155 692
3 106 692 405
3 920 106 405
3 920 405 0
3 216 920 0
3 216 0 573
3 1061 216 573
3 1061 573 122
3 513 1061 122
3 513 122 20
3 20 158 513
3 158 20 1020
3 417 158 1020
3 417 1020 1235
3 1047 417 1235
3 1047 1235 864
3 864 475 1047
3 475 864 112
3 396 475 112
3 396 112 1229
3 1048 396 1229
3 1048 1229 815
3 1127 1048 815
3 1127 815 1130
3 1131 1127 1130
3 1131 1130 127
3 315 1131 127
3 315 127 403
3 1278 315 403
3 1278 403 1063
3 1227 1278 1063
3 1227 1063 72
3 19 1227 72
3 19 72 410
3 969 19 410
3 969 410 750
3 299 969 750
3 299 750 234
3 628 234 587
3 628 587 727
3 812 628 727
3 812 727 1165
3 1039 812 1165
3 1039 1165 938
3 822 1039 938
3 822 938 209
3 804 822 209
3 804 209 1145
3 638 804 1145
3 638 1145 603
3 974 638 603
3 974 603 1054
3 82 974 1054
3 82 1054 1129
3 1077 82 1129
3 1077 1129 1128
3 624 1077 1128
3 624 1128 976
3 1249 624 976
3 1249 976 363
3 1010 1249 363
3 1010 363 230
3 692 1010 230
3 692 230 559
3 405 692 559
3 405 559 541
3 0 405 541
3 0 541 1222
3 573 0 1222
3 573 1222 1297
3 122 573 1297
3 122 1297 1158
3 20 122 1158
3 20 1158 290
3 1020 20 290
3 1020 290 901
3 1235 1020 901
3 1235 901 1217
3 864 1235 1217
3 864 1217 690
3 112 864 690
3 112 690 826
3 1229 112 826
3 1229 826 793
3 815 1229 793
3 815 793 847
3 1130 815 847
3 1130 847 718
3 127 1130 718
3 127 718 442
3 403 127 442
3 403 442 329
3 1063 403 329
3 1063 329 1203
3 72 1063 1203
3 72 1203 1274
3 410 72 1274
3 410 1274 916
3 750 410 916
3 750 916 659
3 234 750 659
3 234 659 587
3 727 587 1151
3 727 1151 123
3 1165 727 123
3 1165 123 453
3 938 1165 453
3 938 453 408
3 209 938 408
3 209 408 1270
3 1145 209 1270
3 1145 1270 934
3 603 1145 934
3 603 934 747
3 1054 603 747
3 1054 747 357
3 1129 1054 357
3 1129 357 639
3 1128 1129 639
3 1128 639 1045
3 976 1128 1045
3 976 1045 891
3 891 363 976
3 363 891 695
3 230 363 695
3 230 695 245
3 559 230 245
3 559 245 1007
3 541 559 1007
3 541 1007 806
3 1222 541 806
3 1222 806 758
3 1297 1222 758
3 1297 758 1082
3 1158 1297 1082
3 1158 1082 840
3 290 1158 840
3 290 840 503
3 901 290 503
3 901 503 478
3 1217 901 478
3 1217 478 1095
3 690 1217 1095
3 690 1095 1287
3 826 690 1287
3 826 1287 162
3 793 826 162
3 793 162 563
3 847 793 563
3 847 563 14
3 718 847 14
3 718 14 1168
3 442 718 1168
3 442 1168 3
3 3 329 442
3 329 3 228
3 1203 329 228
3 1203 228 821
3 1274 1203 821
3 1274 821 1205
3 916 1274 1205
3 916 1205 170
3 659 916 170
3 659 170 221
3 587 659 221
3 587 221 1151
3 123 1151 1223
3 123 1223 602
3 453 123 602
3 453 602 724
3 408 453 724
3 408 724 753
3 753 1270 408
3 1270 753 982
3 934 1270 982
3 934 982 430
3 747 934 430
3 747 430 1066
3 357 747 1066
3 357 1066 783
3 639 357 783
3 639 783 1064
3 1045 639 1064
3 1045 1064 334
3 891 1045 334
3 891 334 51
3 695 891 51
3 695 51 93
3 93 245 695
3 245 93 989
3 1007 245 989
3 1007 989 846
3 806 1007 846
3 806 846 412
3 758 806 412
3 758 412 37
3 1082 758 37
3 1082 37 40
3 840 1082 40
3 840 40 565
3 503 840 565
3 503 565 147
3 478 503 147
3 478 147 596
3 596 1095 478
3 1095 596 222
3 1287 1095 222
3 1287 222 759
3 162 1287 759
3 162 759 136
3 563 162 136
3 563 136 415
3 14 563 415
3 14 415 305
3 1168 14 305
3 1168 305 882
3 3 1168 882
3 3 882 1134
3 228 3 1134
3 228 1134 1104
3 1104 821 228
3 821 1104 213
3 1205 821 213
3 1205 213 471
3 170 1205 471
3 170 471 435
3 221 170 435
3 221 435 1126
3 1151 221 1126
3 1151 1126 1223
3 602 1223 561
3 602 561 60
3 724 602 60
3 724 60 59
3 753 724 59
3 753 59 1190
3 982 753 1190
3 982 1190 193
3 193 430 982
3 430 193 125
3 1066 430 125
3 1066 125 852
3 783 1066 852
3 783 852 652
3 1064 783 652
3 1064 652 92
3 334 1064 92
3 334 92 260
3 51 334 260
3 51 260 957
3 93 51 957
3 93 957 243
3 989 93 243
3 989 243 555
3 555 846 989
3 846 555 1300
3 412 846 1300
3 412 1300 932
3 37 412 932
3 37 932 6
3 40 37 6
3 40 6 649
3 565 40 649
3 565 649 754
3 147 565 754
3 147 754 1046
3 596 147 1046
3 596 1046 866
3 222 596 866
3 222 866 548
3 548 759 222
3 759 548 1027
3 136 759 1027
3 136 1027 312
3 415 136 312
3 415 312 488
3 305 415 488
3 305 488 1196
3 882 305 1196
3 882 1196 899
3 1134 882 899
3 1134 899 199
3 1104 1134 199
3 1104 199 910
3 213 1104 910
3 213 910 188
3 188 471 213
3 471 188 764
3 435 471 764
3 435 764 171
3 1126 435 171
3 1126 171 803
3 1223 1126 803
3 1223 803 561
3 60 561 333
3 60 333 284
3 59 60 284
3 59 284 546
3 1190 59 546
3 1190 546 743
3 193 1190 743
3 193 743 949
3 125 193 949
3 125 949 772
3 852 125 772
3 852 772 848
3 652 852 848
3 652 848 420
3 92 652 420
3 92 420 452
3 260 92 452
3 260 452 746
3 957 260 746
3 957 746 1111
3 243 957 1111
3 243 1111 202
3 555 243 202
3 555 202 322
3 1300 555 322
3 1300 322 292
3 932 1300 292
3 932 292 837
3 6 932 837
3 6 837 1242
3 649 6 1242
3 649 1242 1090
3 754 649 1090
3 754 1090 1096
3 1046 754 1096
3 1046 1096 890
3 866 1046 890
3 866 890 616
3 548 866 616
3 548 616 424
3 1027 548 424
3 1027 424 770
3 312 1027 770
3 312 770 518
3 488 312 518
3 488 518 947
3 1196 488 947
3 1196 947 1044
3 899 1196 1044
3 899 1044 640
3 199 899 640
3 199 640 285
3 910 199 285
3 910 285 1298
3 188 910 1298
3 188 1298 1080
3 764 188 1080
3 764 1080 1073
3 171 764 1073
3 171 1073 607
3 803 171 607
3 803 607 111
3 561 803 111
3 561 111 333
3 284 333 717
3 284 717 50
3 546 284 50
3 546 50 286
3 743 546 286
3 743 286 614
3 949 743 614
3 949 614 814
3 772 949 814
3 848 772 1023
3 848 1023 540
3 420 848 540
3 420 540 175
3 452 420 175
3 452 175 80
3 746 452 80
3 746 80 800
3 1111 746 800
3 1111 800 757
3 202 1111 757
3 202 757 78
3 322 202 78
3 322 78 1099
3 292 322 1099
3 292 1099 995
3 837 292 995
3 837 995 1239
3 1242 837 1239
3 1242 1239 708
3 1090 1242 708
3 1090 708 1065
3 1096 1090 1065
3 1096 1065 459
3 890 1096 459
3 890 459 271
3 616 890 271
3 616 271 1135
3 424 616 1135
3 424 1135 972
3 770 424 972
3 770 972 913
3 518 770 913
3 518 913 1248
3 947 518 1248
3 947 1248 313
3 1044 947 313
3 1044 313 543
3 640 1044 543
3 640 543 996
3 285 640 996
3 285 996 1040
3 1298 285 1040
3 1298 1040 545
3 1080 1298 545
3 1080 545 702
3 1073 1080 702
3 1073 702 781
3 607 1073 781
3 607 781 604
3 111 607 604
3 111 604 1147
3 333 111 1147
3 333 1147 717
3 50 717 58
3 50 58 523
3 286 50 523
3 286 523 16
3 614 286 16
3 614 16 139
3 814 614 139
3 814 139 466
3 175 540 279
3 175 279 585
3 80 175 585
3 80 585 665
3 800 80 665
3 800 665 67
3 757 800 67
3 757 67 101
3 78 757 101
3 78 101 1003
3 1099 78 1003
3 1099 1003 330
3 1099 330 995
3 330 21 995
3 21 1239 995
3 1239 21 919
3 708 1239 919
3 708 919 773
3 1065 708 773
3 1065 773 280
3 459 1065 280
3 459 280 1106
3 271 459 1106
3 271 1106 399
3 1135 271 399
3 1135 399 240
3 972 1135 240
3 972 240 1152
3 913 972 1152
3 913 1152 735
3 1248 913 735
3 1248 735 61
3 313 1248 61
3 313 61 1067
3 543 313 1067
3 543 1067 739
3 996 543 739
3 996 739 268
3 1040 996 268
3 1040 268 235
3 545 1040 235
3 545 235 648
3 702 545 648
3 702 648 13
3 702 13 781
3 13 359 781
3 359 604 781
3 604 359 818
3 1147 604 818
3 1147 818 867
3 717 1147 867
3 717 867 58
3 523 58 1259
3 523 1259 884
3 16 523 884
3 16 884 108
3 139 16 108
3 139 108 231
3 466 139 231
3 466 231 1266
3 585 279 126
3 585 126 930
3 665 585 930
3 665 930 741
3 741 67 665
3 67 741 962
3 101 67 962
3 101 962 1209
3 1003 101 1209
3 1003 1209 480
3 330 1003 480
3 330 480 24
3 21 330 24
3 21 24 486
3 919 21 486
3 919 486 1000
3 773 919 1000
3 773 1000 381
3 280 773 381
3 280 381 797
3 797 1106 280
3 1106 797 1282
3 399 1106 1282
3 399 1282 256
3 240 399 256
3 240 256 578
3 1152 240 578
3 1152 578 816
3 735 1152 816
3 735 816 95
3 61 735 95
3 61 95 643
3 1067 61 643
3 1067 643 1154
3 739 1067 1154
3 739 1154 182
3 182 268 739
3 268 182 1265
3 235 268 1265
3 235 1265 868
3 648 235 868
3 648 868 288
3 13 648 288
3 13 288 756
3 359 13 756
3 359 756 316
3 818 359 316
3 818 316 686
3 867 818 686
3 867 686 457
3 58 867 457
3 58 457 1259
3 884 1259 721
3 884 721 769
3 108 884 769
3 108 769 1115
3 231 108 1115
3 231 1115 1155
3 1155 1266 231
3 1266 1155 1180
3 930 126 512
3 930 512 1112
3 741 930 1112
3 741 1112 455
3 962 741 455
3 962 455 871
3 1209 962 871
3 1209 871 214
3 480 1209 214
3 480 214 376
3 24 480 376
3 24 376 979
3 486 24 979
3 486 979 416
3 1000 486 416
3 1000 416 1173
3 381 1000 1173
3 381 1173 140
3 797 381 140
3 797 140 94
3 1282 797 94
3 1282 94 9
3 256 1282 9
3 256 9 951
3 578 256 951
3 578 951 819
3 819 816 578
3 816 819 411
3 95 816 411
3 95 411 634
3 643 95 634
3 643 634 173
3 1154 643 173
3 1154 173 907
3 182 1154 907
3 182 907 370
3 1265 182 370
3 1265 370 1138
3 868 1265 1138
3 868 1138 465
3 288 868 465
3 288 465 343
3 756 288 343
3 756 343 641
3 316 756 641
3 316 641 253
3 686 316 253
3 686 253 869
3 457 686 869
3 457 869 627
3 1259 457 627
3 1259 627 721
3 769 721 361
3 769 361 1201
3 1115 769 1201
3 1115 1201 247
3 1155 1115 247
3 1155 247 796
3 1180 1155 796
3 1180 796 713
3 1112 512 432
3 432 476 1112
3 476 455 1112
3 455 476 115
3 871 455 115
3 871 115 726
3 214 871 726
3 214 726 1243
3 376 214 1243
3 376 1243 744
3 744 979 376
3 979 744 132
3 416 979 132
3 416 132 738
3 1173 416 738
3 1173 738 566
3 140 1173 566
3 566 1133 140
3 1133 94 140
3 94 1133 409
3 9 94 409
3 9 409 879
3 951 9 879
3 951 879 482
3 819 951 482
3 819 482 863
3 411 819 863
3 411 863 950
3 634 411 950
3 634 950 554
3 173 634 554
3 173 554 1186
3 907 173 1186
3 1186 238 907
3 238 370 907
3 370 238 768
3 1138 370 768
3 1138 768 7
3 465 1138 7
3 465 7 384
3 343 465 384
3 343 384 906
3 906 641 343
3 641 906 191
3 253 641 191
3 253 191 933
3 869 253 933
3 869 933 166
3 627 869 166
3 627 166 952
3 721 627 952
3 721 952 361
3 1201 361 438
3 1201 438 929
3 247 1201 929
3 247 929 711
3 796 247 711
3 796 711 1244
3 713 796 1244
3 713 1244 217
3 476 432 650
3 476 650 1241
3 115 476 1241
3 115 1241 1103
3 726 115 1103
3 726 1103 557
3 1243 726 557
3 1243 557 1005
3 744 1243 1005
3 744 1005 722
3 132 744 722
3 132 722 1185
3 738 132 1185
3 738 1185 219
3 566 738 219
3 566 219 491
3 1133 566 491
3 1133 491 961
3 409 1133 961
3 409 961 1018
3 879 409 1018
3 879 1018 570
3 482 879 570
3 482 570 421
3 863 482 421
3 863 421 373
3 950 863 373
3 950 373 1262
3 554 950 1262
3 554 1262 618
3 1186 554 618
3 1186 618 835
3 238 1186 835
3 238 835 1140
3 768 238 1140
3 768 1140 527
3 7 768 527
3 7 527 510
3 384 7 510
3 384 510 461
3 906 384 461
3 906 461 924
3 191 906 924
3 191 924 300
3 933 191 300
3 933 300 97
3 166 933 97
3 166 97 630
3 952 166 630
3 952 630 542
3 361 952 542
3 361 542 438
3 929 438 1281
3 929 1281 1011
3 711 929 1011
3 711 1011 682
3 1244 711 682
3 1244 682 159
3 159 217 1244
3 217 159 564
3 650 777 1293
3 1241 650 1293
3 1241 1293 547
3 1103 1241 547
3 1103 547 402
3 557 1103 402
3 557 402 119
3 1005 557 119
3 1005 119 8
3 722 1005 8
3 722 8 474
3 474 1185 722
3 1185 474 287
3 219 1185 287
3 219 287 165
3 491 219 165
3 491 165 1245
3 961 491 1245
3 961 1245 349
3 1018 961 349
3 1018 349 53
3 570 1018 53
3 570 53 273
3 421 570 273
3 421 273 751
3 373 421 751
3 373 751 1284
3 1284 1262 373
3 1262 1284 766
3 618 1262 766
3 618 766 560
3 835 618 560
3 835 560 2
3 1140 835 2
3 1140 2 779
3 527 1140 779
3 527 779 658
3 510 527 658
3 510 658 1191
3 461 510 1191
3 461 1191 1295
3 924 461 1295
3 924 1295 824
3 824 300 924
3 300 824 1037
3 97 300 1037
3 97 1037 1280
3 630 97 1280
3 630 1280 148
3 542 630 148
3 542 148 953
3 438 542 953
3 438 953 1281
3 1011 1281 592
3 1011 592 1124
3 682 1011 1124
3 682 1124 105
3 159 682 105
3 159 105 1164
3 564 159 1164
3 564 1164 1285
3 1293 777 992
3 1293 992 670
3 547 1293 670
3 547 670 978
3 402 547 978
3 402 978 601
3 601 119 402
3 119 601 765
3 8 119 765
3 8 765 1139
3 474 8 1139
3 474 1139 467
3 287 474 467
3 287 467 167
3 165 287 167
3 165 167 1163
3 1245 165 1163
3 1245 1163 888
3 349 1245 888
3 349 888 160
3 53 349 160
3 53 160 679
3 679 273 53
3 273 679 68
3 751 273 68
3 751 68 1167
3 1284 751 1167
3 1284 1167 62
3 766 1284 62
3 766 62 860
3 560 766 860
3 560 860 395
3 2 560 395
3 2 395 574
3 779 2 574
3 779 574 276
3 658 779 276
3 658 276 379
3 379 1191 658
3 1191 379 463
3 1295 1191 463
3 1295 463 87
3 824 1295 87
3 824 87 897
3 1037 824 897
3 1037 897 662
3 1280 1037 662
3 1280 662 71
3 148 1280 71
3 148 71 388
3 953 148 388
3 953 388 1021
3 1281 953 1021
3 1281 1021 592
3 1124 592 66
3 1124 66 576
3 105 1124 576
3 105 576 121
3 1164 105 121
3 1164 121 736
3 736 1285 1164
3 1285 736 157
3 992 1285 157
3 992 157 270
3 670 992 270
3 670 270 142
3 978 670 142
3 978 142 637
3 601 978 637
3 601 637 598
3 765 601 598
3 765 598 582
3 1139 765 582
3 1139 582 30
3 467 1139 30
3 467 30 42
3 167 467 42
3 167 42 456
3 1163 167 456
3 1163 456 38
3 888 1163 38
3 888 38 1273
3 160 888 1273
3 160 1273 1013
3 679 160 1013
3 679 1013 161
3 68 679 161
3 68 161 1017
3 1167 68 1017
3 1167 1017 102
3 62 1167 102
3 62 102 825
3 825 860 62
3 860 825 73
3 395 860 73
3 395 73 1286
3 574 395 1286
3 574 1286 242
3 276 574 242
3 276 242 927
3 379 276 927
3 379 927 714
3 463 379 714
3 463 714 983
3 87 463 983
3 87 983 360
3 897 87 360
3 897 360 200
3 662 897 200
3 662 200 1084
3 71 662 1084
3 71 1084 205
3 388 71 205
3 388 205 277
3 1021 388 277
3 1021 277 519
3 592 1021 519
3 592 519 66
3 576 66 562
3 576 562 146
3 121 576 146
3 121 146 1025
3 736 121 1025
3 736 1025 1072
3 157 736 1072
3 157 1072 703
3 270 157 703
3 270 703 935
3 142 270 935
3 142 935 1068
3 637 142 1068
3 637 1068 372
3 598 637 372
3 598 372 124
3 582 598 124
3 582 124 694
3 30 582 694
3 30 694 926
3 42 30 926
3 42 926 263
3 456 42 263
3 456 263 1236
3 38 456 1236
3 38 1236 986
3 1273 38 986
3 1273 986 12
3 1013 1273 12
3 1013 12 327
3 161 1013 327
3 161 327 131
3 1017 161 131
3 1017 131 434
3 102 1017 434
3 102 434 985
3 825 102 985
3 825 985 895
3 73 825 895
3 73 895 1264
3 1286 73 1264
3 1286 1264 1029
3 242 1286 1029
3 242 1029 892
3 927 242 892
3 927 892 278
3 714 927 278
3 714 278 664
3 983 714 664
3 983 664 1267
3 360 983 1267
3 360 1267 1036
3 200 360 1036
3 200 1036 382
3 1084 200 382
3 1084 382 733
3 205 1084 733
3 205 733 977
3 277 205 977
3 277 977 681
3 519 277 681
3 519 681 309
3 66 519 309
3 66 309 562
3 146 562 1153
3 146 1153 1102
3 1025 146 1102
3 1025 1102 307
3 1072 1025 307
3 1072 307 617
3 703 1072 617
3 703 617 321
3 935 703 321
3 935 321 700
3 1068 935 700
3 1068 700 246
3 372 1068 246
3 246 496 372
3 496 124 372
3 124 496 1006
3 694 124 1006
3 694 1006 1174
3 926 694 1174
3 926 1174 404
3 263 926 404
3 263 404 1254
3 1236 263 1254
3 1236 1254 1184
3 986 1236 1184
3 986 1184 342
3 12 986 342
3 12 342 324
3 327 12 324
3 327 324 1100
3 1100 131 327
3 131 1100 1031
3 434 131 1031
3 434 1031 1056
3 985 434 1056
3 985 1056 502
3 895 985 502
3 895 502 1101
3 1264 895 1101
3 1264 1101 96
3 1029 1264 96
3 1029 96 116
3 892 1029 116
3 892 116 567
3 278 892 567
3 567 34 278
3 34 664 278
3 664 34 1256
3 1267 664 1256
3 1267 1256 685
3 1036 1267 685
3 1036 685 387
3 382 1036 387
3 382 387 850
3 733 382 850
3 733 850 529
3 977 733 529
3 977 529 77
3 681 977 77
3 681 77 499
3 309 681 499
3 309 499 1051
3 562 309 1051
3 562 1051 1153
3 1102 1153 533
3 1102 533 282
3 307 1102 282
3 307 282 1179
3 617 307 1179
3 617 1179 653
3 321 617 653
3 321 653 988
3 700 321 988
3 700 988 520
3 246 700 520
3 246 520 599
3 496 246 599
3 496 599 1175
3 1006 496 1175
3 1006 1175 1296
3 1174 1006 1296
3 1174 1296 494
3 404 1174 494
3 404 494 569
3 1254 404 569
3 1254 569 980
3 1184 1254 980
3 1184 980 425
3 342 1184 425
3 342 425 723
3 324 342 723
3 324 723 776
3 1100 324 776
3 1100 776 1043
3 1031 1100 1043
3 1031 1043 341
3 1056 1031 341
3 1056 341 169
3 502 1056 169
3 502 169 1083
3 1101 502 1083
3 1101 1083 358
3 96 1101 358
3 96 358 1169
3 116 96 1169
3 116 1169 464
3 567 116 464
3 567 464 257
3 34 567 257
3 34 257 590
3 1256 34 590
3 1256 590 606
3 685 1256 606
3 685 606 1251
3 387 685 1251
3 387 1251 301
3 850 387 301
3 850 301 26
3 529 850 26
3 529 26 413
3 77 529 413
3 77 413 303
3 499 77 303
3 499 303 190
3 1051 499 190
3 1051 190 732
3 1153 1051 732
3 1153 732 533
3 282 533 22
3 282 22 849
3 1179 282 849
3 849 698 1179
3 698 653 1179
3 653 698 1218
3 988 653 1218
3 988 1218 787
3 520 988 787
3 520 787 1189
3 599 520 1189
3 599 1189 993
3 1175 599 993
3 993 1028 1175
3 1028 1296 1175
3 1296 1028 1269
3 494 1296 1269
3 494 1269 70
3 569 494 70
3 70 716 569
3 716 980 569
3 980 716 808
3 425 980 808
3 425 808 609
3 723 425 609
3 723 609 940
3 940 776 723
3 776 940 593
3 1043 776 593
3 1043 593 375
3 341 1043 375
3 341 375 183
3 169 341 183
3 169 183 319
3 1083 169 319
3 319 385 1083
3 385 358 1083
3 358 385 308
3 1169 358 308
3 1169 308 748
3 464 1169 748
3 464 748 57
3 257 464 57
3 257 57 525
3 590 257 525
3 525 469 590
3 469 606 590
3 606 469 1291
3 1251 606 1291
3 1251 1291 129
3 301 1251 129
3 129 817 301
3 817 26 301
3 26 817 437
3 413 26 437
3 413 437 900
3 303 413 900
3 303 900 583
3 583 190 303
3 190 583 483
3 732 190 483
3 732 483 782
3 533 732 782
3 533 782 22
3 849 22 1171
3 849 1171 872
3 698 849 872
3 698 872 479
3 1218 698 479
3 1218 479 495
3 787 1218 495
3 787 495 120
3 120 1189 787
3 1189 120 143
3 143 993 1189
3 993 143 987
3 1028 993 987
3 1028 987 862
3 1269 1028 862
3 1269 862 1183
3 70 1269 1183
3 70 1183 858
3 716 70 858
3 716 858 423
3 808 716 423
3 808 423 311
3 609 808 311
3 609 311 239
3 940 609 239
3 940 239 176
3 593 940 176
3 593 176 368
3 375 593 368
3 375 368 320
3 183 375 320
3 183 320 508
3 319 183 508
3 319 508 908
3 385 319 908
3 385 908 1200
3 308 385 1200
3 308 1200 1194
3 748 308 1194
3 748 1194 275
3 275 57 748
3 57 275 386
3 386 525 57
3 525 386 332
3 469 525 332
3 469 332 843
3 1291 469 843
3 1291 843 666
3 129 1291 666
3 129 666 844
3 817 129 844
3 817 844 878
3 437 817 878
3 437 878 250
3 900 437 250
3 900 250 151
3 583 900 151
3 583 151 194
3 483 583 194
3 483 194 15
3 782 483 15
3 782 15 154
3 22 782 154
3 22 154 1171
3 872 1171 29
3 872 29 1119
3 479 872 1119
3 479 1119 25
3 495 479 25
3 495 25 968
3 120 495 968
3 120 968 63
3 143 120 63
3 143 63 1232
3 987 143 1232
3 987 1232 731
3 862 987 731
3 862 731 1271
3 1183 862 1271
3 1183 1271 856
3 858 1183 856
3 858 856 1033
3 423 858 1033
3 423 1033 1272
3 311 423 1272
3 311 1272 487
3 239 311 487
3 239 487 1081
3 176 239 1081
3 176 1081 861
3 368 176 861
3 368 861 362
3 320 368 362
3 320 362 133
3 508 320 133
3 508 133 915
3 908 508 915
3 908 915 1142
3 1200 908 1142
3 1200 1142 1022
3 1194 1200 1022
3 1194 1022 1292
3 275 1194 1292
3 275 1292 481
3 386 275 481
3 386 481 785
3 332 386 785
3 332 785 254
3 843 332 254
3 843 254 1136
3 666 843 1136
3 666 1136 249
3 844 666 249
3 844 249 81
3 878 844 81
3 878 81 1002
3 250 878 1002
3 250 1002 204
3 151 250 204
3 151 204 807
3 194 151 807
3 194 807 98
3 15 194 98
3 15 98 701
3 154 15 701
3 154 701 828
3 1171 154 828
3 1171 828 29
3 1119 29 89
3 1119 89 186
3 25 1119 186
3 25 186 1225
3 968 25 1225
3 968 1225 1105
3 63 968 1105
3 63 1105 1015
3 1232 63 1015
3 1232 1015 1240
3 731 1232 1240
3 731 1240 813
3 1271 731 813
3 1271 813 1026
3 856 1271 1026
3 856 1026 255
3 1033 856 255
3 1033 255 646
3 1272 1033 646
3 1272 646 365
3 487 1272 365
3 487 365 1257
3 1081 487 1257
3 1081 1257 960
3 861 1081 960
3 861 960 612
3 362 861 612
3 362 612 145
3 133 362 145
3 133 145 725
3 915 133 725
3 915 725 1253
3 1142 915 1253
3 1142 1253 1172
3 1022 1142 1172
3 1022 1172 141
3 1292 1022 141
3 1292 141 203
3 481 1292 203
3 481 203 427
3 785 481 427
3 785 427 210
3 254 785 210
3 254 210 470
3 1136 254 470
3 1136 470 296
3 249 1136 296
3 249 296 1197
3 81 249 1197
3 81 1197 660
3 1002 81 660
3 1002 660 958
3 204 1002 958
3 204 958 192
3 807 204 192
3 807 192 489
3 98 807 489
3 98 489 697
3 701 98 697
3 701 697 1221
3 828 701 1221
3 828 1221 671
3 29 828 671
3 29 671 89
3 186 89 1195
3 186 1195 942
3 1225 186 942
3 1225 942 530
3 1105 1225 530
3 1105 530 551
3 1015 1105 551
3 1015 551 23
3 1240 1015 23
3 1240 23 336
3 813 1240 336
3 813 336 784
3 1026 813 784
3 1026 784 683
3 255 1026 683
3 255 683 298
3 646 255 298
3 646 298 851
3 365 646 851
3 365 851 571
3 1257 365 571
3 1257 571 1144
3 960 1257 1144
3 960 1144 218
3 612 960 218
3 612 218 212
3 145 612 212
3 145 212 152
3 725 145 152
3 725 152 1187
3 1253 725 1187
3 1253 1187 524
3 1172 1253 524
3 1172 524 922
3 141 1172 922
3 141 922 1226
3 203 141 1226
3 203 1226 1215
3 427 203 1215
3 427 1215 426
3 210 427 426
3 210 426 1059
3 470 210 1059
3 470 1059 1004
3 296 470 1004
3 296 1004 1107
3 1197 296 1107
3 1197 1107 344
3 660 1197 344
3 660 344 918
3 958 660 918
3 958 918 1198
3 192 958 1198
3 192 1198 224
3 489 192 224
3 489 224 252
3 697 489 252
3 697 252 258
3 1221 697 258
3 1221 258 294
3 671 1221 294
3 671 294 678
3 89 671 678
3 89 678 1195
3 942 1195 314
3 942 314 1289
3 530 942 1289
3 530 1289 925
3 551 530 925
3 551 925 937
3 23 551 937
3 23 937 549
3 336 23 549
3 336 549 577
3 784 336 577
3 784 577 90
3 683 784 90
3 683 90 1275
3 298 683 1275
3 298 1275 318
3 851 298 318
3 851 318 1276
3 571 851 1276
3 571 1276 845
3 1144 571 845
3 1144 845 729
3 218 1144 729
3 218 729 655
3 212 218 655
3 212 655 611
3 152 212 611
3 152 611 802
3 1187 152 802
3 1187 802 737
3 524 1187 737
3 524 737 948
3 922 524 948
3 922 948 10
3 1226 922 10
3 1226 10 335
3 1215 1226 335
3 1215 335 326
3 426 1215 326
3 426 326 699
3 1059 426 699
3 1059 699 811
3 1004 1059 811
3 1004 811 752
3 1107 1004 752
3 1107 752 1261
3 344 1107 1261
3 344 1261 1092
3 918 344 1092
3 918 1092 1258
3 1198 918 1258
3 1198 1258 1288
3 224 1198 1288
3 224 1288 677
3 252 224 677
3 252 677 579
3 258 252 579
3 258 579 629
3 294 258 629
3 294 629 429
3 678 294 429
3 429 586 678
3 586 1195 678
3 1195 586 314
3 1289 314 41
3 1289 41 323
3 925 1289 323
3 925 323 745
3 937 925 745
3 937 745 198
3 549 937 198
3 549 198 445
3 577 549 445
3 577 445 149
3 90 577 149
3 90 149 734
3 1275 90 734
3 1275 734 462
3 318 1275 462
3 318 462 163
3 1276 318 163
3 1276 163 207
3 845 1276 207
3 845 207 306
3 729 845 306
3 729 306 672
3 655 729 672
3 655 672 383
3 611 655 383
3 611 383 838
3 802 611 838
3 802 838 1277
3 737 802 1277
3 737 1277 400
3 948 737 400
3 948 400 780
3 10 948 780
3 10 780 1290
3 335 10 1290
3 335 1290 1304
3 326 335 1304
3 326 1304 526
3 699 326 526
3 699 526 262
3 811 699 262
3 811 262 153
3 752 811 153
3 752 153 917
3 1261 752 917
3 1261 917 251
3 1092 1261 251
3 1092 251 707
3 1258 1092 707
3 1258 707 505
3 1288 1258 505
3 1288 505 27
3 677 1288 27
3 677 27 970
3 579 677 970
3 579 970 352
3 629 579 352
3 629 352 1192
3 429 629 1192
3 429 1192 771
3 586 429 771
3 586 771 1202
3 314 586 1202
3 314 1202 41
3 323 41 174
3 323 174 274
3 745 323 274
3 745 274 244
3 198 745 244
3 198 244 1117
3 445 198 1117
3 445 1117 107
3 149 445 107
3 149 107 642
3 734 149 642
3 734 642 829
3 462 734 829
3 462 829 229
3 163 462 229
3 163 229 1120
3 207 163 1120
3 207 1120 1210
3 306 207 1210
3 306 1210 684
3 672 306 684
3 672 684 1279
3 383 672 1279
3 383 1279 1143
3 838 383 1143
3 838 1143 789
3 1277 838 789
3 1277 789 418
3 400 1277 418
3 400 418 883
3 780 400 883
3 780 883 1193
3 1290 780 1193
3 1290 1193 1122
3 1304 1290 1122
3 1304 1122 657
3 526 1304 657
3 526 657 1097
3 262 526 1097
3 262 1097 1182
3 153 262 1182
3 153 1182 656
3 917 153 656
3 917 656 444
3 251 917 444
3 251 444 1075
3 707 251 1075
3 707 1075 337
3 505 707 337
3 505 337 75
3 27 505 75
3 27 75 622
3 970 27 622
3 970 622 1
3 352 970 1
3 352 1 138
3 1192 352 138
3 1192 138 117
3 771 1192 117
3 771 117 875
3 1202 771 875
3 1202 875 498
3 41 1202 498
3 41 498 174
3 274 174 941
3 274 941 55
3 244 274 55
3 244 55 610
3 1117 244 610
3 1117 610 1098
3 107 1117 1098
3 107 1098 827
3 642 107 827
3 642 827 91
3 829 642 91
3 829 91 536
3 229 829 536
3 229 536 460
3 1120 229 460
3 1120 460 1268
3 1210 1120 1268
3 1210 1268 1213
3 684 1210 1213
3 684 1213 704
3 1279 684 704
3 1279 704 1001
3 1143 1279 1001
3 1143 1001 1035
3 789 1143 1035
3 789 1035 553
3 418 789 553
3 418 553 615
3 883 418 615
3 883 615 939
3 1193 883 939
3 1193 939 1074
3 1122 1193 1074
3 1122 1074 636
3 657 1122 636
3 657 636 898
3 1097 657 898
3 1097 898 971
3 1182 1097 971
3 1182 971 1094
3 656 1182 1094
3 656 1094 661
3 444 656 661
3 444 661 74
3 1075 444 74
3 1075 74 283
3 337 1075 283
3 337 283 798
3 75 337 798
3 75 798 842
3 622 75 842
3 622 842 1224
3 1 622 1224
3 1 1224 1076
3 138 1 1076
3 138 1076 886
3 117 138 886
3 117 886 195
3 875 117 195
3 875 195 911
3 498 875 911
3 498 911 1078
3 174 498 1078
3 174 1078 941
3 55 941 830
3 55 830 197
3 197 610 55
3 610 197 621
3 1098 610 621
3 1098 621 999
3 827 1098 999
3 827 999 945
3 91 827 945
3 91 945 178
3 536 91 178
3 536 178 914
3 914 460 536
3 460 914 801
3 801 1268 460
3 1268 801 289
3 1213 1268 289
3 1213 289 84
3 84 704 1213
3 704 84 281
3 1001 704 281
3 1001 281 369
3 1035 1001 369
3 1035 369 339
3 553 1035 339
3 553 339 1250
3 615 553 1250
3 615 1250 1052
3 939 615 1052
3 939 1052 1156
3 1156 1074 939
3 1074 1156 366
3 636 1074 366
3 636 366 1050
3 1050 898 636
3 898 1050 619
3 971 898 619
3 971 619 394
3 1094 971 394
3 1094 394 1204
3 661 1094 1204
3 661 1204 1058
3 74 661 1058
3 74 1058 347
3 347 283 74
3 283 347 44
3 44 798 283
3 798 44 1113
3 842 798 1113
3 842 1113 775
3 775 1224 842
3 1224 775 966
3 1076 1224 966
3 1076 966 874
3 886 1076 874
3 886 874 511
3 195 886 511
3 195 511 130
3 911 195 130
3 911 130 184
3 1078 911 184
3 1078 184 83
3 941 1078 83
3 941 83 830
