OFF

98 192 0
0.000099 -0.021018 0.025763
0.462482 0.069669 -0.031619
0.500000 0.038967 0.024066
0.118925 0.028384 0.004459
0.118875 0.028402 -0.009505
-0.128695 -0.015324 -0.022648
-0.122446 -0.049765 0.026161
0.376240 0.017096 0.024477
-0.217392 -0.054137 0.026492
0.128695 -0.026639 0.018317
0.375025 0.023971 0.024490
-0.004761 0.006484 0.025816
0.435082 0.045221 0.024305
0.305247 0.057727 0.024782
-0.127306 -0.022263 0.026214
0.128645 -0.026621 0.004352
-0.221422 -0.031762 0.003844
-0.027499 -0.045394 0.025829
0.245189 0.036477 0.024968
-0.066703 -0.004429 0.008566
0.366321 0.072173 -0.031274
-0.187364 -0.043513 0.026400
0.128720 -0.026648 0.025299
0.185132 0.015228 0.025153
-0.035732 0.001028 0.017191
0.366395 0.072146 -0.010328
0.304602 0.061178 0.014315
0.057032 0.017452 0.001173
-0.277450 -0.075386 0.026678
0.125074 -0.006021 0.025339
0.495041 0.066506 -0.003810
0.397366 0.077603 -0.001703
0.367734 0.065225 0.024570
-0.064819 -0.014765 0.026002
0.065017 -0.027271 0.025524
0.467541 0.042094 0.024185
0.428337 0.083059 0.006922
-0.190463 -0.026301 0.008977
0.437512 0.031469 0.024278
0.307677 0.043976 0.024755
0.118974 0.028365 0.018423
-0.124876 -0.036014 0.026187
0.277648 0.033351 0.024848
-0.066802 -0.004393 -0.019362
0.459308 0.088516 0.015547
-0.128596 -0.015361 0.005281
0.180842 0.039306 0.014726
0.066827 -0.037580 0.022013
-0.184933 -0.057264 0.026373
0.217591 0.012101 0.025034
0.490279 0.093972 0.024172
-0.128521 -0.015388 0.026227
0.187562 0.001477 0.025127
0.057726 0.013983 0.025604
0.027698 0.003358 0.025697
0.494941 0.066543 -0.031738
0.430222 0.072723 0.024358
-0.066654 -0.004447 0.022531
0.127505 -0.019773 0.025312
0.190563 -0.015699 0.014620
0.026111 0.011977 0.006513
-0.032360 -0.017891 0.025882
0.370164 0.051474 0.024543
0.428238 0.083096 -0.021006
-0.062388 -0.028516 0.025975
0.057082 0.017434 0.015138
0.310107 0.030224 0.024729
0.459209 0.088552 -0.012381
0.366519 0.072100 0.024583
0.250050 0.008975 0.024914
0.120214 0.021481 0.025392
0.490180 0.094009 -0.003756
0.428387 0.083041 0.020887
0.189992 -0.012275 0.025100
0.060157 0.000232 0.025578
0.462681 0.069597 0.024238
-0.066753 -0.004411 -0.005398
0.367536 0.065298 -0.031287
0.402623 0.048347 0.024424
0.499901 0.039004 -0.003863
0.242759 0.050228 0.024994
0.190538 -0.015690 0.007638
-0.189794 -0.029762 0.026426
-0.059958 -0.042267 0.025949
0.342566 0.027098 0.024610
0.312537 0.016473 0.024702
0.182702 0.028979 0.025180
-0.249851 -0.051011 0.026612
0.490081 0.094045 -0.031685
0.366494 0.072110 0.017601
-0.190513 -0.026283 -0.004987
0.122644 0.007730 0.025365
0.495140 0.066470 0.024119
0.430024 0.072796 -0.031499
-0.128645 -0.015342 -0.008683
0.062587 -0.013520 0.025551
0.118999 0.028356 0.025405
0.066778 -0.037561 0.008049
3 34 43 0
3 0 95 34
3 28 16 87
3 28 90 16
3 28 5 90
3 28 43 5
3 28 17 43
3 17 0 43
3 34 47 43
3 47 97 43
3 28 6 17
3 28 48 6
3 6 83 17
3 97 4 43
3 16 82 87
3 16 37 82
3 37 51 82
3 34 22 47
3 34 58 22
3 5 94 90
3 22 9 47
3 51 14 82
3 97 15 4
3 15 81 4
3 81 85 4
3 85 7 4
3 7 2 4
3 2 79 4
3 79 55 4
3 55 77 4
3 4 27 43
3 27 60 43
3 60 24 43
3 60 11 24
3 24 76 43
3 24 19 76
3 77 20 4
3 55 1 77
3 1 93 77
3 81 59 85
3 59 73 85
3 73 69 85
3 28 8 48
3 20 46 4
3 20 80 46
3 20 26 80
3 28 87 8
3 20 25 26
3 59 22 73
3 46 3 4
3 20 63 25
3 20 88 63
3 85 10 7
3 59 9 22
3 22 58 73
3 27 65 60
3 19 45 76
3 37 45 51
3 45 57 51
3 45 19 57
3 57 11 51
3 79 30 55
3 25 89 26
3 16 90 37
3 81 9 59
3 8 87 21
3 44 50 36
3 50 89 72
3 70 53 11
3 11 19 24
3 11 74 54
3 35 2 12
3 2 10 38
3 10 66 84
3 42 18 66
3 61 0 33
3 80 32 13
3 69 23 49
3 64 33 0
3 64 41 33
3 61 11 0
3 61 33 11
3 21 14 41
3 21 87 14
3 33 14 11
3 33 41 14
3 51 11 14
3 82 14 87
3 86 80 18
3 86 70 80
3 96 70 11
3 96 80 70
3 68 32 80
3 68 50 32
3 13 18 80
3 13 32 18
3 53 74 11
3 53 70 74
3 54 0 11
3 54 74 0
3 86 91 70
3 86 18 91
3 74 91 0
3 74 70 91
3 21 48 8
3 21 41 48
3 64 6 41
3 64 0 6
3 48 41 6
3 95 29 34
3 52 58 29
3 52 69 58
3 34 29 58
3 7 10 2
3 73 58 69
3 17 83 0
3 83 6 0
3 78 10 62
3 78 12 10
3 38 12 2
3 38 10 12
3 85 66 10
3 85 69 66
3 84 62 10
3 84 66 62
3 35 75 2
3 35 12 75
3 92 75 50
3 92 2 75
3 78 56 12
3 78 62 56
3 75 56 50
3 75 12 56
3 52 23 69
3 52 29 23
3 49 18 69
3 49 23 18
3 95 91 29
3 95 0 91
3 23 91 18
3 23 29 91
3 39 32 62
3 39 18 32
3 56 32 50
3 56 62 32
3 39 66 18
3 39 62 66
3 42 69 18
3 42 66 69
3 76 94 43
3 43 94 5
3 90 94 45
3 76 45 94
3 37 90 45
3 27 3 65
3 60 65 11
3 46 40 3
3 65 40 11
3 65 3 40
3 26 89 80
3 68 89 50
3 68 80 89
3 96 40 80
3 96 11 40
3 46 80 40
3 57 19 11
3 31 89 25
3 31 36 89
3 72 36 50
3 72 89 36
3 44 67 50
3 44 36 67
3 71 67 88
3 71 50 67
3 31 63 36
3 31 25 63
3 67 63 88
3 67 36 63
3 27 4 3
3 71 30 50
3 71 88 30
3 92 30 2
3 92 50 30
3 79 2 30
3 55 30 88
3 47 9 97
3 81 15 9
3 97 9 15
3 20 77 88
3 93 88 77
3 1 88 93
3 55 88 1
