OFF
1455 1660 0
-0.2673461241 0.2276208702 -0.1667861771
-0.3601091129 0.2274498236 -0.0609153313
-0.4948472837 -0.2487237841 0.0352180918
-0.1609013074 -0.2481080177 -0.3459160590
-0.1158844656 0.2222335159 -0.3383488980
0.1965754455 0.2150674057 -0.0700670213
-0.1429519539 0.2252294864 -0.3113958875
-0.1243989644 0.2252636965 -0.3325705038
-0.2548460387 -0.2281771515 -0.1807603337
-0.3476090275 -0.2283481981 -0.0748894879
-0.1545667144 0.2450625180 -0.3489263020
-0.1256717473 -0.2086061363 -0.3476204889
-0.3475977407 -0.2388530993 -0.0748952532
-0.2548347519 -0.2386820527 -0.1807660990
-0.1456343652 0.2499906173 -0.3410919041
0.4715299369 -0.2177119162 -0.3599757900
-0.1440712730 -0.2188470295 0.3426128351
0.2038416705 0.2110722553 -0.0637068814
0.4598722495 0.1972254633 -0.3075380198
0.3155876147 0.1969594154 -0.1428652714
0.4042145868 0.1971228356 -0.2440156614
0.3601136143 0.1970415174 -0.1936830091
-0.0191885622 -0.2249573007 0.2370834106
0.0735744266 -0.2247862541 0.1312125648
-0.3584398034 0.2242450338 -0.0836467726
-0.2577754511 0.2244207712 -0.1825958315
-0.3505384399 0.2242497246 -0.0767249857
-0.2656768146 0.2244160805 -0.1895176185
0.4784342767 -0.2444410616 -0.3633267848
-0.4725358202 -0.2189987981 0.0548151998
-0.1385898439 -0.2183830317 -0.3263189510
0.0826374369 0.2278336805 0.1156932143
-0.0101255519 0.2276626339 0.2215640601
-0.1361538056 -0.2451148294 -0.3335850317
-0.0112889517 -0.2249525136 0.2440062961
0.0814746900 -0.2247814658 0.1381347052
-0.0216066037 -0.2281796068 0.2349595405
0.0711563851 -0.2280085601 0.1290886947
0.4868886723 0.2170630928 -0.3551735134
0.4963105378 -0.2444303519 -0.3476637642
-0.0096044591 -0.2386623978 0.2212685515
0.0831585297 -0.2384913512 0.1153977057
-0.4953895681 0.2474069946 0.0355445044
-0.1614435918 0.2480227610 -0.3455896464
0.0771451912 -0.2227450068 0.1222500832
-0.0156177976 -0.2229160534 0.2281209290
-0.1084486972 0.2148942814 -0.3373264404
-0.4948817960 -0.2190144395 0.0352358514
-0.1609358197 -0.2183986731 -0.3458982994
0.1527414841 -0.2391975832 0.0036412016
0.1898468102 -0.2391291643 -0.0387072857
-0.3579360312 -0.2251456541 -0.0839142917
-0.2572724240 -0.2249699172 -0.1828640034
-0.3500354128 -0.2251409638 -0.0769931576
-0.2751184539 -0.2249880071 -0.1864034652
-0.2593170328 -0.2249786280 -0.1725584010
-0.2651730423 -0.2249746075 -0.1897851375
-0.3678814428 -0.2251590537 -0.0805326194
-0.3520800216 -0.2251496746 -0.0666875552
-0.1451265934 -0.2164305196 -0.3414005569
-0.1152343250 -0.2109040870 -0.3439598671
-0.3481315011 0.2379773265 -0.0745925540
-0.2553685123 0.2381483731 -0.1804633998
-0.1497139621 -0.2213501271 -0.3180421934
-0.1311609726 -0.2213159171 -0.3392168097
0.0766233736 0.2435777451 0.1225462703
-0.0161396152 0.2434066985 0.2284171161
0.1856734373 0.2117726737 -0.0234793085
0.2042264268 0.2118068837 -0.0446539247
-0.4678893876 -0.2338502274 0.0588623639
-0.1324654623 -0.2332277845 -0.3303341369
-0.1339434113 -0.2332344610 -0.3222717868
0.4779170021 0.2457475023 -0.3629880592
-0.1226533921 -0.2182591305 -0.3449914315
0.1527165921 -0.2180835621 0.0036535036
0.1898219182 -0.2180151432 -0.0386949837
-0.0018453011 0.2244521696 0.2408939061
0.0809721661 0.2246098182 0.1384020018
-0.0117908227 0.2244387716 0.2442728476
0.0909176877 0.2246232162 0.1350230603
0.4710752328 0.2189985993 -0.3596686407
-0.1445259771 0.2178634859 0.3429199844
-0.0101381450 0.2381680280 0.2215713160
0.0826248438 0.2383390746 0.1157004702
0.1685972215 -0.2180740369 0.0175679695
0.2057025476 -0.2180056180 -0.0247805178
0.4462726920 0.2197241557 -0.3194174684
0.3019880573 0.2194581078 -0.1547447200
0.3906150293 0.2196215280 -0.2558951099
0.3465140569 0.2195402098 -0.2055624577
0.4709813799 0.0659818953 -0.2980163487
0.3266967451 0.0657158474 -0.1333436003
0.4153237172 0.0658792676 -0.2344939903
0.3712227447 0.0657979494 -0.1841613380
-0.3541090208 0.2222091693 -0.0677597077
-0.2613460320 0.2223802159 -0.1736305535
0.4742283603 0.2338608535 -0.3662392150
0.4995106342 0.2338758601 -0.3440871122
0.4980328343 0.2338691837 -0.3360246316
0.4664299919 0.2338504255 -0.3637147600
-0.1175683757 0.2327340703 0.3665639935
-0.1491712180 0.2327153121 0.3388738651
-0.4994922273 -0.2338712642 0.0311722341
-0.1577480317 -0.2332450698 -0.3524865022
-0.1655462510 -0.2332554978 -0.3499619167
0.4962827019 -0.2206606572 -0.3476497510
-0.1754575069 -0.2394046735 -0.2839238455
-0.1383521808 -0.2393362546 -0.3262723328
0.4467716638 -0.2184998286 -0.3196882759
0.3024870290 -0.2187658765 -0.1550155275
0.3911140011 -0.2186024563 -0.2561659175
0.3470130286 -0.2186837746 -0.2058332653
0.2068529351 0.2014295602 -0.0610840201
0.4873780389 -0.2493578569 -0.3554982924
0.4826960811 -0.2115517420 -0.3501821723
-0.1329051288 -0.2126868554 0.3524064528
0.3970022861 -0.1934804087 -0.2509673899
0.4526599488 -0.1933777809 -0.3144897484
0.3083746612 -0.1936438301 -0.1498162548
0.3529006608 -0.1935617281 -0.2006339926
0.4985222013 -0.2325521623 -0.3363494108
-0.1170790086 -0.2336872757 0.3662392143
0.1680836799 0.2182835556 0.0178229958
0.2051890060 0.2183519745 -0.0245254916
0.1521965895 0.2393651772 0.0039369440
0.1893019156 0.2394335961 -0.0384115434
-0.1545382065 0.2212916348 -0.3489397284
0.1522197675 0.2182513532 0.0039231404
0.1893250936 0.2183197721 -0.0384253469
0.4717150673 0.1325703740 -0.2972659176
0.3274304326 0.1323043261 -0.1325931692
0.4160574046 0.1324677463 -0.2337435592
0.3719564322 0.1323864280 -0.1834109070
0.4522175714 0.1946094298 -0.3142491996
0.3079329367 0.1943433819 -0.1495764511
0.3965599087 0.1945068020 -0.2507268411
0.3524589363 0.1944254838 -0.2003941889
-0.2553559203 0.2276439698 -0.1804706551
-0.3481189091 0.2274729231 -0.0745998093
0.4711302408 -0.0647282457 -0.2980970957
0.3268456060 -0.0649942936 -0.1334243473
0.4154725781 -0.0648308735 -0.2345747372
0.3713716056 -0.0649121917 -0.1842420850
-0.1913634009 -0.2183000787 -0.2978263357
-0.1542580748 -0.2182316598 -0.3401748230
0.4784063688 -0.2206735465 -0.3633128382
-0.1261384549 0.2085735768 -0.3473554113
-0.1366908269 0.2450741191 -0.3332636073
-0.1532059432 0.2115695472 -0.3204024008
-0.1346529537 0.2116037573 -0.3415770171
0.1970647513 -0.2147176870 -0.0703326641
-0.1424472906 -0.2253447819 -0.3116816615
-0.1238943011 -0.2253105719 -0.3328562778
-0.1754822500 -0.2182905532 -0.2839114128
-0.1383769239 -0.2182221343 -0.3262599001
-0.1361830548 -0.2213473151 -0.3335722603
-0.4730075884 0.2177121034 0.0551073982
-0.1390616121 0.2183278698 -0.3260267525
-0.1502087905 0.2212267064 -0.3177607230
-0.1316558010 0.2212609164 -0.3389353392
-0.2668362448 -0.2281981706 -0.1670758545
-0.3595992336 -0.2283692172 -0.0612050086
0.2073186648 -0.2010566581 -0.0613262154
-0.1231420473 0.2182307355 -0.3447143863
0.1861645004 -0.2114947887 -0.0237328815
0.2047174899 -0.2114605786 -0.0449074977
-0.1079676536 -0.2148986428 -0.3375993351
-0.3536110804 -0.2231056651 -0.0680428750
-0.2608480916 -0.2229346185 -0.1739137208
-0.3525830498 0.2242420045 -0.0664193827
-0.3683844710 0.2242326254 -0.0802644469
0.0002003709 0.2244588988 0.2305905493
-0.2598194081 0.2244130523 -0.1722909736
0.0850637491 0.2246252573 0.1177968179
-0.2697641668 0.2243996539 -0.1689100465
-0.2776641323 0.2243949648 -0.1758319258
-0.0076992398 0.2244542107 0.2236676637
-0.3625271556 0.2242286073 -0.0630392007
-0.3704271211 0.2242239182 -0.0699610800
-0.2756214822 0.2244036720 -0.1861352927
0.0929633597 0.2246299454 0.1247197035
-0.1153867207 -0.2222537853 -0.3386308995
-0.1450883884 -0.2500445152 -0.3414213893
0.4822553636 0.2128529769 -0.3498826496
-0.1333458463 0.2117178635 0.3527059755
0.4939108014 -0.2474090867 -0.3404138769
0.4715645994 -0.2474223504 -0.3599934197
-0.1216904085 -0.2485442000 0.3621747482
-0.1440366105 -0.2485574638 0.3425952054
-0.5000000000 0.2325506653 0.0314808874
-0.1582558043 0.2331768596 -0.3521778489
-0.1660540237 0.2331664317 -0.3496532634
0.1985620375 0.2224112423 -0.0628336924
-0.3541328979 0.2432169877 -0.0677466880
-0.2613699091 0.2433880343 -0.1736175338
0.2093212117 -0.2084061092 -0.0541026456
0.1753975882 0.2254095294 -0.0324608740
0.1939505777 0.2254437395 -0.0536354902
-0.0221283477 0.2381439377 0.2352557933
0.0706346412 0.2383149844 0.1293849475
-0.1455946704 0.2163771180 -0.3411114304
0.0771690695 -0.2437538160 0.1222370629
-0.0155939193 -0.2439248626 0.2281079087
0.4733973174 0.0006287108 -0.2960064310
0.4813375948 0.0006334238 -0.2890492308
0.3291120297 0.0003626617 -0.1313329375
0.3370523072 0.0003673747 -0.1243757372
0.4177390018 0.0005260819 -0.2324833274
0.4256792792 0.0005307949 -0.2255261272
0.3736380293 0.0004447636 -0.1821506752
0.3815783068 0.0004494766 -0.1751934749
-0.0215946652 -0.2386834169 0.2349530307
0.0711683236 -0.2385123703 0.1290821849
-0.1157055338 0.2108915014 -0.3436912759
-0.3620247816 -0.2251619832 -0.0633066274
-0.3699253999 -0.2251666735 -0.0702277615
-0.2771617582 -0.2249956257 -0.1760993525
-0.2692617927 -0.2249909366 -0.1691774732
0.0766473264 0.2225689360 0.1225333153
-0.0161156624 0.2223978893 0.2284041611
0.4827447304 -0.2535681710 -0.3502074286
-0.1328564795 -0.2547032844 0.3523811965
0.4957949760 0.2457591046 -0.3473235364
0.4868512130 0.2506765935 -0.3551520284
-0.1540319283 -0.2451266300 -0.3492496852
0.0855669250 -0.2247652328 0.1175287767
-0.0071960639 -0.2249362795 0.2233996225
0.0756194447 -0.2247786345 0.1209099536
-0.0171435441 -0.2249496811 0.2267807994
0.4934214337 0.2190128538 -0.3400890973
-0.1221797762 0.2178777404 0.3624995278
0.4873389408 -0.2157448526 -0.3554782440
0.4822083523 0.2548705956 -0.3498559561
-0.1333928577 0.2537354823 0.3527326690
-0.1760022043 0.2391812695 -0.2836278929
-0.1388968782 0.2392496884 -0.3259763802
-0.1759789519 0.2180674455 -0.2836416311
-0.1918601029 0.2180580191 -0.2975565540
-0.1388736258 0.2181358644 -0.3259901185
-0.1547547768 0.2181264380 -0.3399050413
-0.4842239462 0.2535678620 0.0453376655
-0.1502779699 0.2541836284 -0.3357964852
0.0007035466 -0.2249314923 0.2303225081
0.0914208658 -0.2247691563 0.1347550179
0.0934665355 -0.2247604457 0.1244516623
-0.0013421231 -0.2249402029 0.2406258637
0.0831472441 -0.2279875398 0.1154034703
-0.0096157447 -0.2281585865 0.2212743161
-0.0221164085 0.2276395332 0.2352492832
0.0706465803 0.2278105798 0.1293784374
0.2043136243 -0.2107232336 -0.0639748197
0.4163585063 -0.1314173993 -0.2339073911
0.4720161690 -0.1313147715 -0.2974297496
0.3277308813 -0.1315808206 -0.1327562560
0.3722568809 -0.1314987187 -0.1835739938
0.4933884864 0.2487220011 -0.3400699668
0.4710405706 0.2487087363 -0.3596510112
-0.1222127235 0.2475868878 0.3625186583
-0.1445606393 0.2475736230 0.3429376139
0.1831586403 -0.2211613647 -0.0263822039
0.2017116298 -0.2211271547 -0.0475568201
0.4639026347 0.1308141760 -0.3041139313
0.3196179999 0.1305481281 -0.1394411829
0.4082449719 0.1307115482 -0.2405915728
0.3641439995 0.1306302300 -0.1902589206
0.4747177262 -0.2325595018 -0.3665639935
0.4669194324 -0.2325699297 -0.3640394733
-0.1486817776 -0.2337050431 0.3385491518
0.4958211716 0.2219902015 -0.3473389855
0.4779449104 0.2219795909 -0.3630020060
-0.4836676732 -0.2548705956 0.0450036252
-0.1497216969 -0.2542548292 -0.3361305256
0.2063161713 -0.2180726847 -0.0567512498
0.4788889902 0.0668653415 -0.2910863514
0.3346043554 0.0665992936 -0.1264136030
0.4232313275 0.0667627138 -0.2275639930
0.3791303550 0.0666813955 -0.1772313407
0.4046629746 -0.1960870545 -0.2442593817
0.4603206374 -0.1959844267 -0.3077817401
0.3160353497 -0.1962504758 -0.1431082466
0.3605613493 -0.1961683739 -0.1939259843
0.5000000000 -0.2325443962 -0.3444118907
0.4538478534 0.2226769807 -0.3127754162
0.3095632187 0.2224109328 -0.1481026678
0.3981901907 0.2225743530 -0.2492530578
0.3540892183 0.2224930348 -0.1989204055
-0.2673580632 0.2381252748 -0.1667796670
-0.3601210520 0.2379542282 -0.0609088212
0.2088387074 0.2087733963 -0.0538514093
0.1527165934 -0.2180846519 0.0036535030
0.1898219195 -0.2180162330 -0.0386949844
-0.0176467211 0.2244417998 0.2270488413
0.0751169206 0.2246128476 0.1211772503
0.0730719038 0.2246041382 0.1314798608
-0.0196910851 0.2244330916 0.2373507066
0.4543535271 -0.2214435579 -0.3130498782
0.3100688923 -0.2217096059 -0.1483771298
0.3986958644 -0.2215461857 -0.2495275197
0.3545948919 -0.2216275039 -0.1991948675
0.1759105856 -0.2251547278 -0.0327393295
0.1944635751 -0.2251205178 -0.0539139457
-0.3535872022 -0.2441144743 -0.0680558953
-0.2608242134 -0.2439434276 -0.1739267411
-0.4683979039 0.2325704137 0.0591703636
-0.1329739787 0.2331928566 -0.3300261372
-0.1344519276 0.2331861801 -0.3219637872
-0.4953535624 0.2176948769 0.0355280488
-0.1614075861 0.2183106434 -0.3456061019
-0.2668243064 -0.2387019808 -0.1670823642
-0.3595872952 -0.2388730274 -0.0612115184
-0.4841732103 0.2115512361 0.0453142371
-0.1502272340 0.2121670025 -0.3358199137
0.0443039270 0.0000898304 -0.2038331422
0.1990681166 -0.2220660479 -0.0631083754
-0.4730443370 0.2474222393 0.0551231996
-0.1390983607 0.2480380057 -0.3260109511
-0.4837154295 -0.2128530764 0.0450296657
-0.1497694532 -0.2122373100 -0.3361044851
0.4790398486 -0.0656023034 -0.2911681876
0.3347552138 -0.0658683514 -0.1264954392
0.4233821859 -0.0657049312 -0.2276458291
0.3792812134 -0.0657862494 -0.1773131769
0.1826638865 0.2214153698 -0.0261006682
0.2012168760 0.2214495798 -0.0472752845
-0.1366623224 0.2213062080 -0.3332770318
-0.1187026876 0.2012353329 -0.3463329531
0.2058275162 0.2184170821 -0.0564742048
-0.4724990726 -0.2487081414 0.0547993988
-0.1385530963 -0.2480923750 -0.3263347519
0.4641997558 -0.1295688409 -0.3042755928
0.3199144682 -0.1298348900 -0.1396020992
0.4085414402 -0.1296714698 -0.2407524892
0.3644404678 -0.1297527880 -0.1904198370
0.4938761363 -0.2176963737 -0.3403962458
-0.1217250736 -0.2188314871 0.3621923793
0.1522031261 0.2182731388 0.0039085946
0.1893084522 0.2183415577 -0.0384398927
-0.1540589420 -0.2213591143 -0.3492349552
-0.1182526801 -0.2012510928 -0.3465889245
-0.1527323172 -0.2116971329 -0.3206712508
-0.1341793277 -0.2116629229 -0.3418458671
0.1884158964 -0.2405481812 0.0129126687
0.3434690489 -0.2365501717 -0.1617183710
0.1907215964 -0.2331197190 0.0149449018
0.1884158964 -0.2405481812 0.0129126687
0.0333627439 -0.2445461906 0.1875437085
0.1861101964 -0.2479766433 0.0108804357
0.1805271610 -0.2510561855 0.0059836598
0.3372189812 -0.2492326361 -0.1672151085
0.1861101964 -0.2479766433 0.0108804357
0.1805271610 -0.2510561855 0.0059836598
0.0238353407 -0.2528797349 0.1791824281
0.1749441255 -0.2541357277 0.0010868839
0.1693540599 -0.2510628174 -0.0038061116
0.3260493952 -0.2523154942 -0.1770067701
0.1749441255 -0.2541357277 0.0010868839
0.1693540599 -0.2510628174 -0.0038061116
0.0126587247 -0.2498101406 0.1693945469
0.1637639944 -0.2479899071 -0.0086991071
0.1614414109 -0.2405636968 -0.0107221339
0.3165030052 -0.2439930236 -0.1853577768
0.1637639944 -0.2479899071 -0.0086991071
0.1614414109 -0.2405636968 -0.0107221339
0.0063798167 -0.2371343699 0.1639135089
0.1591188274 -0.2331374864 -0.0127451608
0.1614240797 -0.2257084796 -0.0107133191
0.3141717560 -0.2291392047 -0.1873763962
0.1591188274 -0.2331374864 -0.0127451608
0.1614240797 -0.2257084796 -0.0107133191
0.0086764033 -0.2222777546 0.1659497580
0.1637293319 -0.2182794728 -0.0086814774
0.1693124040 -0.2151993858 -0.0037846686
0.3204211705 -0.2164556510 -0.1818802293
0.1637293319 -0.2182794728 -0.0086814774
0.1693124040 -0.2151993858 -0.0037846686
0.0182036376 -0.2139431206 0.1743108921
0.1748954762 -0.2121192987 0.0011121403
0.1804855038 -0.2151916146 0.0060051035
0.3315907924 -0.2133716783 -0.1720885344
0.1748954762 -0.2121192987 0.0011121403
0.1804855038 -0.2151916146 0.0060051035
0.0293802151 -0.2170115508 0.1840987414
0.1860755313 -0.2182639304 0.0108980668
0.1883985638 -0.2256918247 0.0129214843
0.3411373501 -0.2216940992 -0.1637373807
0.1860755313 -0.2182639304 0.0108980668
0.1883985638 -0.2256918247 0.0129214843
0.0356597776 -0.2296895502 0.1895803493
0.1907215964 -0.2331197190 0.0149449018
0.1799978144 0.2512287417 0.0063313511
0.3311030833 0.2530496687 -0.1717623025
0.1744077473 0.2543030390 0.0014383564
0.1799978144 0.2512287417 0.0063313511
0.0288925455 0.2494078147 0.1844250047
0.1855878815 0.2481544445 0.0112243458
0.1879100554 0.2407280357 0.0132470134
0.3429714448 0.2372986097 -0.1613888091
0.1855878815 0.2481544445 0.0112243458
0.1879100554 0.2407280357 0.0132470134
0.0351708399 0.2367310530 0.1899055034
0.1902322293 0.2333016270 0.0152696810
0.1879265290 0.2258734620 0.0132374481
0.3429796816 0.2298713228 -0.1613935917
0.1902322293 0.2333016270 0.0152696810
0.1879265290 0.2258734620 0.0132374481
0.0328733764 0.2218756012 0.1878684879
0.1856208287 0.2184452971 0.0112052152
0.1800377937 0.2153653586 0.0063084391
0.3367296137 0.2171891062 -0.1668903291
0.1856208287 0.2184452971 0.0112052152
0.1800377937 0.2153653586 0.0063084391
0.0233459737 0.2135416111 0.1795072073
0.1744547586 0.2122854202 0.0014116630
0.1688646932 0.2153582314 -0.0034813326
0.3255600284 0.2141056041 -0.1766819911
0.1744547586 0.2122854202 0.0014116630
0.1688646932 0.2153582314 -0.0034813326
0.0121693581 0.2166108586 0.1697193259
0.1632746278 0.2184310426 -0.0083743282
0.1609520074 0.2258569557 -0.0103973878
0.3160136201 0.2224277775 -0.1850330143
0.1632746278 0.2184310426 -0.0083743282
0.1609520074 0.2258569557 -0.0103973878
0.0058903947 0.2292861339 0.1642382386
0.1586293870 0.2332828688 -0.0124204475
0.1609346763 0.2407120242 -0.0103885731
0.3136823341 0.2372812249 -0.1870516665
0.1586293870 0.2332828688 -0.0124204475
0.1609346763 0.2407120242 -0.0103885731
0.0058817292 0.2367136682 0.1642426460
0.1632399657 0.2481411796 -0.0083566987
0.1688238565 0.2512221093 -0.0034591711
0.3199322135 0.2499654228 -0.1815550912
0.1632399657 0.2481411796 -0.0083566987
0.1688238565 0.2512221093 -0.0034591711
0.0177154994 0.2524787958 0.1746367489
0.1744077473 0.2543030390 0.0014383564
-0.0116312413 -0.0000196000 -0.1399941362
-0.0118795922 0.2181593994 -0.1398592453
-0.0938050966 0.1090239228 -0.2118178836
-0.0117554167 0.1090698997 -0.1399266908
-0.0528423444 0.1635916611 -0.1758385645
-0.0527802567 0.1090469112 -0.1758722872
-0.0118175045 0.1636146495 -0.1398929681
-0.0527181689 0.0545021614 -0.1759060099
-0.0116933290 0.0545251499 -0.1399604135
-0.0527802567 0.1090469112 -0.1758722872
-0.0939292720 0.2181134225 -0.2117504382
-0.1348920242 0.1635456842 -0.2477297574
-0.0938671843 0.1635686726 -0.2117841609
-0.1349541119 0.2180904340 -0.2476960347
-0.0528423444 0.1635916611 -0.1758385645
-0.0529044321 0.2181364109 -0.1758048418
-0.0938671843 0.1635686726 -0.2117841609
0.0702942631 0.1091158766 -0.0680354979
0.0701700876 0.2182053763 -0.0679680525
0.0292073354 0.1636376380 -0.1039473716
0.0702321754 0.1636606265 -0.0680017752
0.0291452477 0.2181823879 -0.1039136489
0.1112570153 0.1636836149 -0.0320561787
0.1111949275 0.2182283648 -0.0320224560
0.0702321754 0.1636606265 -0.0680017752
-0.0117554167 0.1090698997 -0.1399266908
0.0293315109 0.0545481383 -0.1040148170
0.0292694232 0.1090928882 -0.1039810943
-0.0116933290 0.0545251499 -0.1399604135
0.0292073354 0.1636376380 -0.1039473716
-0.0118175045 0.1636146495 -0.1398929681
0.0292694232 0.1090928882 -0.1039810943
-0.1757306009 -0.0001115538 -0.2837765219
-0.0935567456 -0.1091550766 -0.2119527745
-0.0936809211 -0.0000655769 -0.2118853291
-0.1346436733 -0.0546333152 -0.2478646482
-0.0936188334 -0.0546103268 -0.2119190518
-0.1347057610 -0.0000885654 -0.2478309255
-0.0525939935 -0.0545873383 -0.1759734553
-0.0526560812 -0.0000425885 -0.1759397326
-0.0936188334 -0.0546103268 -0.2119190518
-0.1756064255 -0.1092010535 -0.2838439674
-0.1345194978 -0.1637228149 -0.2479320936
-0.1345815855 -0.1091780651 -0.2478983709
-0.1755443377 -0.1637458034 -0.2838776901
-0.1346436733 -0.0546333152 -0.2478646482
-0.1756685132 -0.0546563037 -0.2838102447
-0.1345815855 -0.1091780651 -0.2478983709
-0.0938050966 0.1090239228 -0.2118178836
-0.1758547764 0.1089779458 -0.2837090765
-0.1347678487 0.0544561845 -0.2477972028
-0.1348299365 0.1090009343 -0.2477634801
-0.1757926887 0.0544331960 -0.2837427992
-0.1348920242 0.1635456842 -0.2477297574
-0.1759168641 0.1635226957 -0.2836753538
-0.1348299365 0.1090009343 -0.2477634801
-0.0936809211 -0.0000655769 -0.2118853291
-0.0527181689 0.0545021614 -0.1759060099
-0.0937430088 0.0544791729 -0.2118516064
-0.0526560812 -0.0000425885 -0.1759397326
-0.1347678487 0.0544561845 -0.2477972028
-0.1347057610 -0.0000885654 -0.2478309255
-0.0937430088 0.0544791729 -0.2118516064
-0.0116312413 -0.0000196000 -0.1399941362
-0.0113828289 -0.2181870577 -0.1401289546
0.0705426754 -0.1090515810 -0.0681703163
-0.0115070351 -0.1091033288 -0.1400615454
0.0295799232 -0.1636193194 -0.1041496354
0.0295178202 -0.1090774549 -0.1041159308
-0.0114449320 -0.1636451932 -0.1400952500
0.0294557171 -0.0545355905 -0.1040822262
-0.0115691382 -0.0545614644 -0.1400278408
0.0295178202 -0.1090774549 -0.1041159308
0.0706668816 -0.2181353099 -0.0682377255
0.1116296338 -0.1635675716 -0.0322584063
0.0706047785 -0.1635934455 -0.0682040209
0.1116917369 -0.2181094360 -0.0322921109
0.0295799232 -0.1636193194 -0.1041496354
0.0296420263 -0.2181611838 -0.1041833400
0.0706047785 -0.1635934455 -0.0682040209
-0.0935567456 -0.1091550766 -0.2119527745
-0.0934325395 -0.2182388054 -0.2120201837
-0.0524697873 -0.1636710671 -0.1760408645
-0.0934946426 -0.1636969410 -0.2119864791
-0.0524076842 -0.2182129316 -0.1760745691
-0.1345194978 -0.1637228149 -0.2479320936
-0.1344573947 -0.2182646793 -0.2479657982
-0.0934946426 -0.1636969410 -0.2119864791
-0.0115070351 -0.1091033288 -0.1400615454
-0.0525939935 -0.0545873383 -0.1759734553
-0.0525318904 -0.1091292027 -0.1760071599
-0.0115691382 -0.0545614644 -0.1400278408
-0.0524697873 -0.1636710671 -0.1760408645
-0.0114449320 -0.1636451932 -0.1400952500
-0.0525318904 -0.1091292027 -0.1760071599
0.1524681798 0.0000838956 0.0037883220
0.0702942631 0.1091158766 -0.0680354979
0.0704184693 0.0000321478 -0.0681029071
0.1113812214 0.0545998861 -0.0321235879
0.0703563662 0.0545740122 -0.0680692025
0.1114433245 0.0000580217 -0.0321572925
0.0293315109 0.0545481383 -0.1040148170
0.0293936140 0.0000062739 -0.1040485216
0.0703563662 0.0545740122 -0.0680692025
0.1523439736 0.1091676244 0.0038557312
0.1112570153 0.1636836149 -0.0320561787
0.1113191184 0.1091417505 -0.0320898833
0.1522818705 0.1637094888 0.0038894358
0.1113812214 0.0545998861 -0.0321235879
0.1524060767 0.0546257600 0.0038220266
0.1113191184 0.1091417505 -0.0320898833
0.0705426754 -0.1090515810 -0.0681703163
0.1525923860 -0.1089998333 0.0037209128
0.1115054276 -0.0544838427 -0.0321909971
0.1115675307 -0.1090257071 -0.0322247017
0.1525302829 -0.0544579688 0.0037546174
0.1116296338 -0.1635675716 -0.0322584063
0.1526544890 -0.1635416977 0.0036872082
0.1115675307 -0.1090257071 -0.0322247017
0.0704184693 0.0000321478 -0.0681029071
0.0294557171 -0.0545355905 -0.1040822262
0.0704805723 -0.0545097166 -0.0681366117
0.0293936140 0.0000062739 -0.1040485216
0.1115054276 -0.0544838427 -0.0321909971
0.1114433245 0.0000580217 -0.0321572925
0.0704805723 -0.0545097166 -0.0681366117
-0.1730590889 -0.0000868203 -0.3188656885
-0.1916117519 -0.0001210298 -0.2976914448
-0.1824595959 0.1089855994 -0.3082111212
-0.1822112449 -0.1091934495 -0.3083460121
-0.1639069329 0.1090198088 -0.3293853649
-0.1824595959 0.1089855994 -0.3082111212
-0.1778835179 0.1635389140 -0.3134709594
-0.1730590889 -0.0000868203 -0.3188656885
-0.1545064258 -0.0000526109 -0.3400399322
-0.1636585819 -0.1091592401 -0.3295202558
-0.1639069329 0.1090198088 -0.3293853649
-0.1822112449 -0.1091934495 -0.3083460121
-0.1636585819 -0.1091592401 -0.3295202558
-0.1682346599 -0.1637125547 -0.3242604176
-0.1571779379 -0.0000773444 -0.3049507656
-0.1757306009 -0.0001115538 -0.2837765219
-0.1663300939 -0.1091839488 -0.2944310892
-0.1665784449 0.1089950506 -0.2942961984
-0.1477774309 -0.1091497394 -0.3156053329
-0.1663300939 -0.1091839488 -0.2944310892
-0.1616298404 -0.1637201463 -0.2997583728
-0.1571779379 -0.0000773444 -0.3049507656
-0.1386252748 -0.0000431350 -0.3261250093
-0.1480257818 0.1090292600 -0.3154704420
-0.1477774309 -0.1091497394 -0.3156053329
-0.1480257818 0.1090292600 -0.3154704420
-0.1620023668 0.1635483528 -0.2995560366
-0.1665784449 0.1089950506 -0.2942961984
-0.1465658503 -0.0000478977 -0.3330824708
-0.1465658503 -0.0000478977 -0.3330824708
-0.1836711765 -0.0001162670 -0.2907339834
-0.1836711765 -0.0001162670 -0.2907339834
0.0066730709 0.2181936088 -0.1610334890
-0.0118795922 0.2181593994 -0.1398592453
-0.0846529405 0.2181305272 -0.2223375601
0.0794464192 0.2182224810 -0.0785551743
-0.0661002775 0.2181647366 -0.2435118037
-0.0846529405 0.2181305272 -0.2223375601
-0.1210396147 0.2181160911 -0.2635767174
0.0066730709 0.2181936088 -0.1610334890
0.0252257339 0.2182278183 -0.1822077327
0.0979990822 0.2182566905 -0.0997294180
-0.0661002775 0.2181647366 -0.2435118037
0.0979990822 0.2182566905 -0.0997294180
0.1251094248 0.2182540219 -0.0479031388
0.0794464192 0.2182224810 -0.0785551743
0.0066498557 0.2393074328 -0.1610197181
-0.0119028074 0.2392732234 -0.1398454744
0.0794232226 0.2393363050 -0.0785413871
-0.0846761743 0.2392443511 -0.2223238055
0.0979758856 0.2393705145 -0.0997156307
0.0794232226 0.2393363050 -0.0785413871
0.1250862376 0.2393678458 -0.0478893434
0.0066498557 0.2393074328 -0.1610197181
0.0252025187 0.2393416422 -0.1821939618
-0.0661235113 0.2392785606 -0.2434980492
0.0979758856 0.2393705145 -0.0997156307
-0.0661235113 0.2392785606 -0.2434980492
-0.1210628578 0.2392299150 -0.2635629710
-0.0846761743 0.2392443511 -0.2223238055
0.0252141077 0.2287847303 -0.1822008636
0.0252141077 0.2287847303 -0.1822008636
-0.0118911812 0.2287163114 -0.1398523436
-0.0118911812 0.2287163114 -0.1398523436
0.0071698341 -0.2181528482 -0.1613031982
-0.0113828289 -0.2181870577 -0.1401289546
0.0799432131 -0.2181182052 -0.0788248473
-0.0841562079 -0.2182217007 -0.2226073055
0.0984958762 -0.2180839957 -0.0999990910
0.0799432131 -0.2181182052 -0.0788248473
0.1256062341 -0.2180837789 -0.0481727937
0.0071698341 -0.2181528482 -0.1613031982
0.0257224972 -0.2181186388 -0.1824774419
-0.0656035449 -0.2181874913 -0.2437815492
0.0984958762 -0.2180839957 -0.0999990910
-0.0656035449 -0.2181874913 -0.2437815492
-0.1205428974 -0.2182390223 -0.2638464810
-0.0841562079 -0.2182217007 -0.2226073055
0.0071946516 -0.2392669189 -0.1613155656
-0.0113580114 -0.2393011283 -0.1401413219
-0.0841314276 -0.2393357962 -0.2226197055
0.0799680679 -0.2392322510 -0.0788371820
-0.0655787646 -0.2393015867 -0.2437939492
-0.0841314276 -0.2393357962 -0.2226197055
-0.1205181358 -0.2393531301 -0.2638588973
0.0071946516 -0.2392669189 -0.1613155656
0.0257473147 -0.2392327095 -0.1824898093
0.0985207309 -0.2391980416 -0.1000114257
-0.0655787646 -0.2393015867 -0.2437939492
0.0799680679 -0.2392322510 -0.0788371820
0.0985207309 -0.2391980416 -0.1000114257
0.1349074390 -0.2391807077 -0.0587722339
0.0257349432 -0.2286756493 -0.1824835929
0.0257349432 -0.2286756493 -0.1824835929
-0.0113704574 -0.2287441178 -0.1401351709
-0.0113704574 -0.2287441178 -0.1401351709
-0.1730590889 -0.0000868203 -0.3188656885
-0.1916117519 -0.0001210298 -0.2976914448
-0.1824595959 0.1089855994 -0.3082111212
-0.1822112449 -0.1091934495 -0.3083460121
-0.1639069329 0.1090198088 -0.3293853649
-0.1824595959 0.1089855994 -0.3082111212
-0.1778835179 0.1635389140 -0.3134709594
-0.1730590889 -0.0000868203 -0.3188656885
-0.1545064258 -0.0000526109 -0.3400399322
-0.1636585819 -0.1091592401 -0.3295202558
-0.1639069329 0.1090198088 -0.3293853649
-0.1822112449 -0.1091934495 -0.3083460121
-0.1636585819 -0.1091592401 -0.3295202558
-0.1682346599 -0.1637125547 -0.3242604176
-0.1571779379 -0.0000773444 -0.3049507656
-0.1757306009 -0.0001115538 -0.2837765219
-0.1663300939 -0.1091839488 -0.2944310892
-0.1665784449 0.1089950506 -0.2942961984
-0.1477774309 -0.1091497394 -0.3156053329
-0.1663300939 -0.1091839488 -0.2944310892
-0.1616298404 -0.1637201463 -0.2997583728
-0.1571779379 -0.0000773444 -0.3049507656
-0.1386252748 -0.0000431350 -0.3261250093
-0.1480257818 0.1090292600 -0.3154704420
-0.1477774309 -0.1091497394 -0.3156053329
-0.1480257818 0.1090292600 -0.3154704420
-0.1620023668 0.1635483528 -0.2995560366
-0.1665784449 0.1089950506 -0.2942961984
-0.1465658503 -0.0000478977 -0.3330824708
-0.1465658503 -0.0000478977 -0.3330824708
-0.1836711765 -0.0001162670 -0.2907339834
-0.1836711765 -0.0001162670 -0.2907339834
0.1868931137 0.0001389688 -0.0034787610
0.1683404507 0.0001047593 0.0176954826
0.1777451676 -0.1089675341 0.0070446042
0.1774883968 0.1092112622 0.0071721174
0.1962978307 -0.1089333246 -0.0141296394
0.1777451676 -0.1089675341 0.0070446042
0.1824475261 -0.1635036808 0.0017191651
0.1868931137 0.0001389688 -0.0034787610
0.2054457768 0.0001731782 -0.0246530047
0.1960410599 0.1092454716 -0.0140021263
0.1962978307 -0.1089333246 -0.0141296394
0.1960410599 0.1092454716 -0.0140021263
0.1820623699 0.1637645136 0.0019104347
0.1774883968 0.1092112622 0.0071721174
0.1710125228 0.0001284529 -0.0173931949
0.1524598597 0.0000942435 0.0037810488
0.1616078244 0.1092007959 -0.0067423001
0.1618645581 -0.1089780995 -0.0068698460
0.1801604875 0.1092350053 -0.0279165438
0.1616078244 0.1092007959 -0.0067423001
0.1661818068 0.1637540721 -0.0120039746
0.1710125228 0.0001284529 -0.0173931949
0.1895651858 0.0001626624 -0.0385674386
0.1804172211 -0.1089438900 -0.0280440896
0.1801604875 0.1092350053 -0.0279165438
0.1804172211 -0.1089438900 -0.0280440896
0.1665669072 -0.1635142709 -0.0121952933
0.1618645581 -0.1089780995 -0.0068698460
0.1975054627 0.0001678707 -0.0316102380
0.1975054627 0.0001678707 -0.0316102380
0.1604001738 0.0000995509 0.0107382821
0.1604001738 0.0000995509 0.0107382821
-0.3307217959 0.2402867132 -0.1570543795
-0.3307217959 0.2402867132 -0.1570543795
-0.3228337690 0.2507953115 -0.1501259904
-0.3228337690 0.2507953115 -0.1501259904
-0.3116611535 0.2508029338 -0.1403366428
-0.3116611535 0.2508029338 -0.1403366428
-0.3037481323 0.2403042097 -0.1334202938
-0.3037481323 0.2403042097 -0.1334202938
-0.3037297580 0.2254491418 -0.1334281945
-0.3037297580 0.2254491418 -0.1334281945
-0.3116174112 0.2149395530 -0.1403562577
-0.3116174112 0.2149395530 -0.1403562577
-0.3227903982 0.2149309397 -0.1501459324
-0.3227903982 0.2149309397 -0.1501459324
-0.3307037931 0.2254306543 -0.1570626073
-0.3307037931 0.2254306543 -0.1570626073
-0.3222844903 -0.2514893067 -0.1504562169
-0.3222844903 -0.2514893067 -0.1504562169
-0.3301967674 -0.2409896409 -0.1573719125
-0.3301967674 -0.2409896409 -0.1573719125
-0.3302140235 -0.2261349686 -0.1573630327
-0.3302140235 -0.2261349686 -0.1573630327
-0.3223256246 -0.2156258747 -0.1504343168
-0.3223256246 -0.2156258747 -0.1504343168
-0.3111526367 -0.2156180541 -0.1406446426
-0.3111526367 -0.2156180541 -0.1406446426
-0.3032396158 -0.2261166296 -0.1337282935
-0.3032396158 -0.2261166296 -0.1337282935
-0.3032212419 -0.2409713012 -0.1337361940
-0.3032212419 -0.2409713012 -0.1337361940
-0.3111103847 -0.2514814853 -0.1406655634
-0.3111103847 -0.2514814853 -0.1406655634
-0.1436926355 -0.0000466878 -0.3311241339
-0.1482124763 -0.1058719104 -0.3258976924
-0.1529691302 -0.0000637929 -0.3205368258
-0.1436926355 -0.0000466878 -0.3311241339
-0.1484492893 0.1057614297 -0.3257632674
-0.1344161407 -0.0000295828 -0.3417114421
0.1951954636 0.0001560475 -0.0341934031
0.1906799820 -0.1056693706 -0.0289631423
0.2044719583 0.0001731525 -0.0447807112
0.1951954636 0.0001560475 -0.0341934031
0.1904344504 0.1059643606 -0.0288363558
0.1859189689 0.0001389425 -0.0236060950
0.0254993119 0.2253366129 -0.1825156889
0.1097249448 0.2253901762 -0.1180755896
0.0347758066 0.2253537180 -0.1931029970
0.0254993119 0.2253366129 -0.1825156889
-0.0587263210 0.2252830497 -0.2469557882
0.0162228171 0.2253195079 -0.1719283808
0.0260081423 -0.2252326499 -0.1827978036
0.1009593640 -0.2251936888 -0.1077685665
0.0167316475 -0.2252497549 -0.1722104955
0.0260081423 -0.2252326499 -0.1827978036
-0.0582195742 -0.2252887159 -0.2472397326
0.0352846370 -0.2252155448 -0.1933851117
0.0445485488 -0.2148081649 -0.2039659996
-0.0318318633 -0.1074044062 -0.2707162386
0.0444262379 -0.1073591673 -0.2038995709
0.0063583428 -0.1611062855 -0.2373411191
0.0062360319 -0.0536572879 -0.2372746904
-0.0317095524 -0.2148534038 -0.2707826674
-0.0698997584 -0.1611515245 -0.3041577869
0.0063583428 -0.1611062855 -0.2373411191
0.1206843391 -0.1073139283 -0.1370829032
0.1208066500 -0.2147629259 -0.1371493319
0.0826164440 -0.1610610466 -0.1705244514
0.1588745452 -0.1610158076 -0.1037077836
0.0444262379 -0.1073591673 -0.2038995709
0.0824941331 -0.0536120490 -0.1704580227
0.0826164440 -0.1610610466 -0.1705244514
0.2070857999 0.0001864511 -0.0612051177
0.1258112959 -0.1004834139 -0.1325796788
0.1256948635 0.0001381407 -0.1325191300
0.1664485479 -0.0501484814 -0.0968923983
0.0850576115 -0.0501967917 -0.1682064105
0.2072022324 -0.1004351035 -0.0612656666
0.1665649804 -0.1507700360 -0.0969529471
0.1664485479 -0.0501484814 -0.0968923983
0.1255784311 0.1007596953 -0.1324585811
0.2069693675 0.1008080056 -0.0611445689
0.1663321155 0.0504730732 -0.0968318494
0.1662156831 0.1510946277 -0.0967713006
0.1256948635 0.0001381407 -0.1325191300
0.0849411790 0.0504247628 -0.1681458617
0.1663321155 0.0504730732 -0.0968318494
0.0440633742 0.2149808436 -0.2036967309
0.1204396863 0.1075786180 -0.1369500818
0.0441836506 0.1075353370 -0.2037649365
0.0822515302 0.1612797308 -0.1703234063
0.0823718067 0.0538342242 -0.1703916120
0.1203194099 0.2150241246 -0.1368818761
0.1585075659 0.1613230119 -0.1035085515
0.0822515302 0.1612797308 -0.1703234063
-0.0320723851 0.1074920559 -0.2705797913
-0.0321926615 0.2149375625 -0.2705115857
0.0059954945 0.1612364497 -0.2371382611
-0.0702605411 0.1611931686 -0.3039531159
0.0441836506 0.1075353370 -0.2037649365
0.0061157710 0.0537909431 -0.2372064668
0.0059954945 0.1612364497 -0.2371382611
-0.1184776838 -0.0000078800 -0.3464609388
-0.0371993803 0.1006625816 -0.2750830477
-0.0370868784 0.0000409752 -0.2751470405
-0.0778385321 0.0503273508 -0.3107719932
0.0035522734 0.0503762060 -0.2394580949
-0.1185901857 0.1006137265 -0.3463969460
-0.0779510339 0.1509489573 -0.3107080004
-0.0778385321 0.0503273508 -0.3107719932
-0.0369743765 -0.1005806312 -0.2752110333
-0.1183651820 -0.1006294864 -0.3465249316
-0.0777260302 -0.0502942556 -0.3108359861
-0.0776135283 -0.1509158620 -0.3108999789
-0.0370868784 0.0000409752 -0.2751470405
0.0036647752 -0.0502454004 -0.2395220878
-0.0777260302 -0.0502942556 -0.3108359861
0.4379648270 0.1648466048 -0.2706407895
0.4379648270 0.1648466048 -0.2706407895
0.4522844612 0.0336980688 -0.2583066119
0.4522844612 0.0336980688 -0.2583066119
0.4476991774 -0.0985098514 -0.2625377894
0.4476991774 -0.0985098514 -0.2625377894
0.4383395718 -0.1637009130 -0.2708445656
0.4383395718 -0.1637009130 -0.2708445656
0.4523595639 -0.0325357543 -0.2583471574
0.4523595639 -0.0325357543 -0.2583471574
0.4474731974 0.0996665439 -0.2624149553
0.4474731974 0.0996665439 -0.2624149553
0.4302312717 0.1626604890 -0.2774203862
0.4302312717 0.1626604890 -0.2774203862
0.4443601908 0.0332539886 -0.2652498381
0.4443601908 0.0332539886 -0.2652498381
0.4398358405 -0.0971998578 -0.2694247924
0.4398358405 -0.0971998578 -0.2694247924
0.4306010210 -0.1615246248 -0.2776214914
0.4306010210 -0.1615246248 -0.2776214914
0.4444349477 -0.0321010813 -0.2652905841
0.4444349477 -0.0321010813 -0.2652905841
0.4396131759 0.0983467218 -0.2693039608
0.4396131759 0.0983467218 -0.2693039608
0.3437720234 0.1646729217 -0.1631380892
0.3437720234 0.1646729217 -0.1631380892
0.3580913311 0.0335243851 -0.1508035390
0.3580913311 0.0335243851 -0.1508035390
0.3535060474 -0.0986835350 -0.1550347165
0.3535060474 -0.0986835350 -0.1550347165
0.3441461153 -0.1638745973 -0.1633411202
0.3441461153 -0.1638745973 -0.1633411202
0.3581667603 -0.0327094374 -0.1508444571
0.3581667603 -0.0327094374 -0.1508444571
0.3532803938 0.0994928608 -0.1549122550
0.3532803938 0.0994928608 -0.1549122550
0.3360384681 0.1624868059 -0.1699176859
0.3360384681 0.1624868059 -0.1699176859
0.3501673872 0.0330803055 -0.1577471378
0.3501673872 0.0330803055 -0.1577471378
0.3456430369 -0.0973735408 -0.1619220921
0.3456430369 -0.0973735408 -0.1619220921
0.3364075645 -0.1616983090 -0.1701180459
0.3364075645 -0.1616983090 -0.1701180459
0.3502418177 -0.0322747650 -0.1577875112
0.3502418177 -0.0322747650 -0.1577875112
0.3454203723 0.0981730387 -0.1618012604
0.3454203723 0.0981730387 -0.1618012604
0.3411633489 -0.2439786339 -0.1637506041
0.4186899251 -0.2419796292 -0.2510661239
0.0356684439 -0.2371177284 0.1895759415
0.3434690489 -0.2365501717 -0.1617183710
0.0356684439 -0.2371177284 0.1895759415
-0.0418581323 -0.2391167331 0.2768914614
0.3411633489 -0.2439786339 -0.1637506041
0.0333627439 -0.2445461906 0.1875437085
0.3316359457 -0.2523121782 -0.1721118844
0.4099818558 -0.2514004035 -0.2587112686
0.0294183762 -0.2498001928 0.1840792040
0.3372189812 -0.2492326361 -0.1672151085
0.0294183762 -0.2498001928 0.1840792040
-0.0489275339 -0.2507119675 0.2706785882
0.3316359457 -0.2523121782 -0.1721118844
0.0238353407 -0.2528797349 0.1791824281
0.3204593297 -0.2492425839 -0.1818997656
0.3988069973 -0.2498689223 -0.2685000949
0.0182487902 -0.2528830509 0.1742875424
0.3260493952 -0.2523154942 -0.1770067701
0.0182487902 -0.2528830509 0.1742875424
-0.0600988774 -0.2522567125 0.2608878717
0.3204593297 -0.2492425839 -0.1818997656
0.0126587247 -0.2498101406 0.1693945469
0.3141804216 -0.2365668133 -0.1873808036
0.3917112188 -0.2382814767 -0.2746986251
0.0087024002 -0.2445605803 0.1659365357
0.3165030052 -0.2439930236 -0.1853577768
0.0087024002 -0.2445605803 0.1659365357
-0.0688283969 -0.2428459169 0.2532543572
0.3141804216 -0.2365668133 -0.1873808036
0.0063798167 -0.2371343699 0.1639135089
0.3164770083 -0.2217101979 -0.1853445545
0.3928508464 -0.2234255604 -0.2736760931
0.0063711510 -0.2297067614 0.1639179164
0.3141717560 -0.2291392047 -0.1873763962
0.0063711510 -0.2297067614 0.1639179164
-0.0700026871 -0.2279913988 0.2522494549
0.3164770083 -0.2217101979 -0.1853445545
0.0086764033 -0.2222777546 0.1659497580
0.3260042426 -0.2133755639 -0.1769834204
0.4015586258 -0.2140036965 -0.2660312008
0.0126205655 -0.2170232077 0.1694140833
0.3204211705 -0.2164556510 -0.1818802293
0.0126205655 -0.2170232077 0.1694140833
-0.0629338177 -0.2163950751 0.2584618636
0.3260042426 -0.2133755639 -0.1769834204
0.0182036376 -0.2139431206 0.1743108921
0.3371808200 -0.2164439942 -0.1671955711
0.4127334644 -0.2155340260 -0.2562423901
0.0237901875 -0.2139392350 0.1792057782
0.3315907924 -0.2133716783 -0.1720885344
0.0237901875 -0.2139392350 0.1792057782
-0.0517624569 -0.2148492031 0.2682525971
0.3371808200 -0.2164439942 -0.1671955711
0.0293802151 -0.2170115508 0.1840987414
0.3434603826 -0.2291219935 -0.1617139632
0.4198297757 -0.2271231308 -0.2500433957
0.0333367451 -0.2222616559 0.1875569318
0.3411373501 -0.2216940992 -0.1637373807
0.0333367451 -0.2222616559 0.1875569318
-0.0430326480 -0.2242605187 0.2758863643
0.3434603826 -0.2291219935 -0.1617139632
0.0356597776 -0.2296895502 0.1895803493
0.3366931504 0.2499753714 -0.1668693078
0.4122457849 0.2508858349 -0.2559161346
0.0233024784 0.2524821120 0.1795320100
0.3311030833 0.2530496687 -0.1717623025
0.0233024784 0.2524821120 0.1795320100
-0.0522501561 0.2515716485 0.2685788368
0.3366931504 0.2499753714 -0.1668693078
0.0288925455 0.2494078147 0.1844250047
0.4181799656 0.2430103054 -0.2507293879
0.3406492709 0.2447250184 -0.1634114767
0.0328486660 0.2441574617 0.1878828358
0.3406492709 0.2447250184 -0.1634114767
0.0328486660 0.2441574617 0.1878828358
-0.0435209418 0.2421589704 0.2762120809
0.3429714448 0.2372986097 -0.1613888091
0.0351708399 0.2367310530 0.1899055034
0.3406739813 0.2224431579 -0.1634258246
0.4182005577 0.2244420883 -0.2507413445
0.0351790767 0.2293037662 0.1899007208
0.3429796816 0.2298713228 -0.1613935917
0.0351790767 0.2293037662 0.1899007208
-0.0423474996 0.2273048357 0.2772162407
0.3406739813 0.2224431579 -0.1634258246
0.0328733764 0.2218756012 0.1878684879
0.3311465786 0.2141091677 -0.1717871052
0.4094924886 0.2150210415 -0.2583864893
0.0289290087 0.2166215495 0.1844039834
0.3367296137 0.2171891062 -0.1668903291
0.0289290087 0.2166215495 0.1844039834
-0.0494169013 0.2157096757 0.2710033675
0.3311465786 0.2141091677 -0.1717871052
0.0233459737 0.2135416111 0.1795072073
0.3199699630 0.2171784153 -0.1815749867
0.3983176306 0.2165521017 -0.2681753159
0.0177594235 0.2135380474 0.1746123215
0.3255600284 0.2141056041 -0.1766819911
0.0177594235 0.2135380474 0.1746123215
-0.0605882441 0.2141643611 0.2612126507
0.3199699630 0.2171784153 -0.1815749867
0.0121693581 0.2166108586 0.1697193259
0.3136909997 0.2298536906 -0.1870560739
0.3912218060 0.2281391015 -0.2743738872
0.0082130151 0.2218602208 0.1662612983
0.3160136201 0.2224277775 -0.1850330143
0.0082130151 0.2218602208 0.1662612983
-0.0693177912 0.2235748099 0.2535791115
0.3136909997 0.2298536906 -0.1870560739
0.0058903947 0.2292861339 0.1642382386
0.3159876235 0.2447103803 -0.1850197921
0.3923614524 0.2429949806 -0.2733513389
0.0058817292 0.2367136682 0.1642426460
0.3136823341 0.2372812249 -0.1870516665
-0.0693394551 0.2421436456 0.2535901299
0.0081870185 0.2441428236 0.1662745204
0.3159876235 0.2447103803 -0.1850197921
0.0081870185 0.2441428236 0.1662745204
0.3255161044 0.2530463525 -0.1766575636
0.4010702829 0.2524180092 -0.2657055236
0.0121316086 0.2493978661 0.1697392214
0.3199322135 0.2499654228 -0.1815550912
0.0121316086 0.2493978661 0.1697392214
-0.0634225700 0.2500262094 0.2587871814
0.3255161044 0.2530463525 -0.1766575636
0.0177154994 0.2524787958 0.1746367489
-0.1870356739 0.0544322848 -0.3029512830
-0.1917359274 0.1089684947 -0.2976239994
-0.1914875764 -0.1092105542 -0.2977588903
-0.1776351669 -0.0546401349 -0.3136058503
-0.1778835179 0.1635389140 -0.3134709594
-0.1684830109 0.0544664943 -0.3241255267
-0.1663191474 0.1908326760 -0.3266880004
-0.1593308548 0.1635731234 -0.3346452031
-0.1590825038 -0.0546059255 -0.3347800940
-0.1543822503 -0.1091421354 -0.3401073776
-0.1546306013 0.1090369136 -0.3399724867
-0.1684830109 0.0544664943 -0.3241255267
-0.1682346599 -0.1637125547 -0.3242604176
-0.1683588354 -0.0546230302 -0.3241929721
-0.1797990304 -0.1910063167 -0.3110433766
-0.1867873229 -0.1637467641 -0.3030861739
-0.1710303474 -0.0546477513 -0.2891038056
-0.1756064255 -0.1092010535 -0.2838439674
-0.1758547764 0.1089779458 -0.2837090765
-0.1618781914 0.0544588531 -0.2996234820
-0.1616298404 -0.1637201463 -0.2997583728
-0.1524776844 -0.0546135419 -0.3102780493
-0.1500033822 -0.1909711403 -0.3130091365
-0.1430771774 -0.1636859369 -0.3209326165
-0.1433255283 0.0544930625 -0.3207977257
-0.1387494503 0.1090463647 -0.3260575639
-0.1385010994 -0.1091326346 -0.3261924547
-0.1524776844 -0.0546135419 -0.3102780493
-0.1434497038 0.1635825622 -0.3207302803
-0.1504379963 0.1908421086 -0.3127730775
-0.1618781914 0.0544588531 -0.2996234820
-0.1620023668 0.1635483528 -0.2995560366
-0.1545064258 -0.0000526109 -0.3400399322
-0.1506603136 0.1090392702 -0.3364937560
-0.1386252748 -0.0000431350 -0.3261250093
-0.1504119626 -0.1091397788 -0.3366286469
-0.1757306009 -0.0001115538 -0.2837765219
-0.1877656397 0.1089708760 -0.2941452687
-0.1916117519 -0.0001210298 -0.2976914448
-0.1875172887 -0.1092081729 -0.2942801595
-0.0482662664 0.2181449633 -0.1810984027
-0.0939292720 0.2181134225 -0.2117504382
0.0701700876 0.2182053763 -0.0679680525
0.0430597450 0.2182080449 -0.1197943317
-0.1210396147 0.2181160911 -0.2635767174
-0.0389899348 0.2181620680 -0.1916855245
-0.1299566202 0.2181259778 -0.2947834179
-0.1024869516 0.2181503005 -0.2847509611
0.0616124081 0.2182422544 -0.1409685753
0.1072754137 0.2182737952 -0.1103165398
-0.0568239459 0.2181818414 -0.2540989256
-0.0297136033 0.2181791727 -0.2022726464
0.1436620879 0.2182882313 -0.0690773824
0.1572172592 0.2182868970 -0.0431642428
0.0523360765 0.2182251497 -0.1303814535
0.1251094248 0.2182540219 -0.0479031388
0.0337602076 0.2393047642 -0.1091934308
0.0701468911 0.2393192003 -0.0679542652
-0.0939525059 0.2392272464 -0.2117366836
-0.0390131593 0.2392758920 -0.1916717618
0.1250862376 0.2393678458 -0.0478893434
0.0523128706 0.2393389736 -0.1303676744
0.1571940766 0.2394007210 -0.0431504434
0.1436389006 0.2394020553 -0.0690635871
-0.0204604963 0.2393101014 -0.2128460055
-0.0568471798 0.2392956653 -0.2540851710
0.1072522172 0.2393876192 -0.1103027526
0.0523128706 0.2393389736 -0.1303676744
-0.1025101947 0.2392641245 -0.2847372147
-0.1299798680 0.2392398017 -0.2947696756
-0.0297368278 0.2392929967 -0.2022588836
-0.1210628578 0.2392299150 -0.2635629710
0.0252257339 0.2182278183 -0.1822077327
-0.0568297590 0.2234602973 -0.2540954910
0.0252025187 0.2393416422 -0.1821939618
0.1072580117 0.2341091632 -0.1103062035
-0.0119028074 0.2392732234 -0.1398454744
-0.0939350665 0.2233918785 -0.2117469873
-0.0118795922 0.2181593994 -0.1398592453
0.0701527042 0.2340407443 -0.0679576998
0.0342801921 -0.2181526314 -0.1094769009
0.0706668816 -0.2181353099 -0.0682377255
-0.0934325395 -0.2182388054 -0.2120201837
-0.0384931869 -0.2181872745 -0.1919552519
0.1256062341 -0.2180837789 -0.0481727937
0.0528328551 -0.2181184220 -0.1306511446
0.1577140762 -0.2180494611 -0.0434338887
0.1441588972 -0.2180495695 -0.0693470373
-0.0199405239 -0.2181530650 -0.2131294956
-0.0563272134 -0.2181703866 -0.2543686710
0.1077722077 -0.2180668910 -0.1105862128
0.0528328551 -0.2181184220 -0.1306511446
-0.1019902344 -0.2182048128 -0.2850207247
-0.1294599107 -0.2182305783 -0.2950531906
-0.0292168554 -0.2181701697 -0.2025423737
-0.1205428974 -0.2182390223 -0.2638464810
-0.0477447195 -0.2393184623 -0.1813805137
-0.0934077592 -0.2393529009 -0.2120325837
0.0706917363 -0.2392493558 -0.0682500602
0.0435813598 -0.2392495850 -0.1200763738
-0.1205181358 -0.2393531301 -0.2638588973
-0.0291920565 -0.2392842528 -0.2025547574
-0.1294351583 -0.2393446924 -0.2950656151
-0.1019654727 -0.2393189207 -0.2850331410
0.0621340228 -0.2392153755 -0.1412506175
0.1077970625 -0.2391809369 -0.1105985475
-0.0563024331 -0.2392844820 -0.2543810710
-0.0291920565 -0.2392842528 -0.2025547574
0.1349074390 -0.2391807077 -0.0587722339
0.0528576913 -0.2392324802 -0.1306634956
0.1438244616 -0.2391891454 -0.0275655161
0.1163547760 -0.2392149171 -0.0375979902
0.0257224972 -0.2181186388 -0.1824774419
0.1077908767 -0.2339024068 -0.1105954393
0.0257473147 -0.2392327095 -0.1824898093
-0.0563209904 -0.2234488918 -0.2543717465
-0.0113580114 -0.2393011283 -0.1401413219
0.0706855133 -0.2339708505 -0.0682469847
-0.0113828289 -0.2181870577 -0.1401289546
-0.0934263537 -0.2235173355 -0.2120232918
-0.1870356739 0.0544322848 -0.3029512830
-0.1917359274 0.1089684947 -0.2976239994
-0.1914875764 -0.1092105542 -0.2977588903
-0.1776351669 -0.0546401349 -0.3136058503
-0.1778835179 0.1635389140 -0.3134709594
-0.1684830109 0.0544664943 -0.3241255267
-0.1663191474 0.1908326760 -0.3266880004
-0.1593308548 0.1635731234 -0.3346452031
-0.1590825038 -0.0546059255 -0.3347800940
-0.1543822503 -0.1091421354 -0.3401073776
-0.1546306013 0.1090369136 -0.3399724867
-0.1684830109 0.0544664943 -0.3241255267
-0.1682346599 -0.1637125547 -0.3242604176
-0.1683588354 -0.0546230302 -0.3241929721
-0.1797990304 -0.1910063167 -0.3110433766
-0.1867873229 -0.1637467641 -0.3030861739
-0.1710303474 -0.0546477513 -0.2891038056
-0.1756064255 -0.1092010535 -0.2838439674
-0.1758547764 0.1089779458 -0.2837090765
-0.1618781914 0.0544588531 -0.2996234820
-0.1616298404 -0.1637201463 -0.2997583728
-0.1524776844 -0.0546135419 -0.3102780493
-0.1500033822 -0.1909711403 -0.3130091365
-0.1430771774 -0.1636859369 -0.3209326165
-0.1433255283 0.0544930625 -0.3207977257
-0.1387494503 0.1090463647 -0.3260575639
-0.1385010994 -0.1091326346 -0.3261924547
-0.1524776844 -0.0546135419 -0.3102780493
-0.1434497038 0.1635825622 -0.3207302803
-0.1504379963 0.1908421086 -0.3127730775
-0.1618781914 0.0544588531 -0.2996234820
-0.1620023668 0.1635483528 -0.2995560366
-0.1545064258 -0.0000526109 -0.3400399322
-0.1506603136 0.1090392702 -0.3364937560
-0.1386252748 -0.0000431350 -0.3261250093
-0.1504119626 -0.1091397788 -0.3366286469
-0.1757306009 -0.0001115538 -0.2837765219
-0.1877656397 0.1089708760 -0.2941452687
-0.1916117519 -0.0001210298 -0.2976914448
-0.1875172887 -0.1092081729 -0.2942801595
0.1730428091 -0.0544313874 0.0123700434
0.1684688361 -0.1089846388 0.0176317261
0.1682120653 0.1091941574 0.0177592392
0.1821907553 0.0546751155 0.0018466782
0.1824475261 -0.1635036808 0.0017191651
0.1915954722 -0.0543971779 -0.0088042002
0.1940750368 -0.1907546494 -0.0115306764
0.2010001891 -0.1634694713 -0.0194550786
0.2007434183 0.0547093249 -0.0193275655
0.2053173914 0.1092625763 -0.0245892481
0.2055741622 -0.1089162199 -0.0247167613
0.1915954722 -0.0543971779 -0.0088042002
0.2006150329 0.1637987230 -0.0192638089
0.1936256880 0.1910582440 -0.0113075284
0.1914670868 0.0546922202 -0.0087404437
0.1820623699 0.1637645136 0.0019104347
0.1570338421 0.0546475197 -0.0014806257
0.1523314929 0.1091836911 0.0038448217
0.1525882265 -0.1089952042 0.0037172759
0.1664385404 -0.0544248233 -0.0121315204
0.1661818068 0.1637540721 -0.0120039746
0.1755865051 0.0546817291 -0.0226548693
0.1777451295 0.1910478149 -0.0252219337
0.1847344698 0.1637882815 -0.0331782183
0.1849912035 -0.0543906138 -0.0333057641
0.1896935526 -0.1089267853 -0.0386312115
0.1894368190 0.1092521100 -0.0385036656
0.1755865051 0.0546817291 -0.0226548693
0.1851195703 -0.1634800615 -0.0333695370
0.1781944133 -0.1907652520 -0.0254451389
0.1757148719 -0.0544077186 -0.0227186423
0.1665669072 -0.1635142709 -0.0121952933
0.2054457768 0.0001731782 -0.0246530047
0.1936636911 -0.1089241811 -0.0351526112
0.1895651858 0.0001626624 -0.0385674386
0.1934069575 0.1092547142 -0.0350250654
0.1524598597 0.0000942435 0.0037810488
0.1565583836 -0.1089925505 0.0071958925
0.1683404507 0.0001047593 0.0176954826
0.1563016499 0.1091863449 0.0073234383
-0.2460826938 0.2441547371 -0.2513220129
-0.3330270119 0.2328585485 -0.1590861880
-0.4130556820 0.2438468539 -0.0607549376
-0.3284165799 0.2477148778 -0.1550225710
-0.2421386804 0.2494090363 -0.2478578184
-0.3284165799 0.2477148778 -0.1550225710
-0.4035288576 0.2521815867 -0.0523941625
-0.3172509581 0.2538757452 -0.1452294099
-0.2309695617 0.2524932811 -0.2380665640
-0.3172509581 0.2538757452 -0.1452294099
-0.3923527452 0.2491125865 -0.0426067216
-0.3060713489 0.2477301225 -0.1354438757
-0.2214232465 0.2441711077 -0.2297156224
-0.3060713489 0.2477301225 -0.1354438757
-0.3860730181 0.2364373117 -0.0371249651
-0.3014249158 0.2328782969 -0.1313967118
-0.2190908428 0.2293176609 -0.2276959908
-0.3014249158 0.2328782969 -0.1313967118
-0.3883686732 0.2215806226 -0.0391603981
-0.3060346003 0.2180199866 -0.1354596772
-0.2253395117 0.2166337114 -0.2331915051
-0.3060346003 0.2180199866 -0.1354596772
-0.3978953108 0.2132453945 -0.0475210103
-0.3172002222 0.2118591193 -0.1452528383
-0.2365088161 0.2135489711 -0.2429829231
-0.3172002222 0.2118591193 -0.1452528383
-0.4090719803 0.2163129083 -0.0573089418
-0.3283805743 0.2180027602 -0.1550390266
-0.2460556896 0.2218706488 -0.2513343546
-0.3283805743 0.2180027602 -0.1550390266
-0.4153518965 0.2289906598 -0.0627908600
-0.3330270119 0.2328585485 -0.1590861880
-0.2360030936 -0.2528720680 -0.2432933712
-0.3166946850 -0.2545627124 -0.1455634502
-0.4085658870 -0.2501065454 -0.0576190626
-0.3278742956 -0.2484159009 -0.1553489836
-0.2455490374 -0.2445488293 -0.2516439857
-0.3278742956 -0.2484159009 -0.1553489836
-0.4148444974 -0.2374304526 -0.0630998392
-0.3325192392 -0.2335633810 -0.1593948413
-0.2478801373 -0.2296952332 -0.2536624747
-0.3325192392 -0.2335633810 -0.1593948413
-0.4125479098 -0.2225747041 -0.0610635906
-0.3279088078 -0.2187065563 -0.1553312240
-0.2416307222 -0.2170122739 -0.2481663081
-0.3279088078 -0.2187065563 -0.1553312240
-0.4030205271 -0.2142394756 -0.0527023256
-0.3167424414 -0.2125451932 -0.1455374097
-0.2304610450 -0.2139276820 -0.2383745639
-0.3167424414 -0.2125451932 -0.1455374097
-0.3918442285 -0.2173084261 -0.0429147214
-0.3055628321 -0.2186909149 -0.1357518756
-0.2209147298 -0.2222498307 -0.2300236223
-0.3055628321 -0.2186909149 -0.1357518756
-0.3855645017 -0.2299834285 -0.0374329648
-0.3009163994 -0.2335423442 -0.1317047115
-0.2185823266 -0.2371028811 -0.2280039904
-0.3009163994 -0.2335423442 -0.1317047115
-0.3878601572 -0.2448397213 -0.0394683976
-0.3055260844 -0.2484002582 -0.1357676765
-0.2248317405 -0.2497869302 -0.2335001577
-0.3055260844 -0.2484002582 -0.1357676765
-0.3918047286 -0.2500948134 -0.0429330823
-0.3166946850 -0.2545627124 -0.1455634502
-0.1259051011 -0.0000162798 -0.3474879501
-0.1221955675 0.0036612420 -0.3469721679
-0.1344161407 -0.0000295828 -0.3417114421
-0.1301623505 0.0014988105 -0.3445987530
0.2080870734 -0.0034882745 -0.0575933328
0.2090799596 0.0001836435 -0.0539770274
0.2067780987 -0.0013435912 -0.0493794535
0.2044719583 0.0001731525 -0.0447807112
0.0450566702 0.2186527618 -0.2000800664
0.0413387859 0.2223223791 -0.2005912952
0.0390330560 0.2238386277 -0.1959921941
0.0347758066 0.2253537180 -0.1931029970
0.0418406980 -0.2221599166 -0.2008696375
0.0408390153 -0.2184857361 -0.2044817818
0.0352846370 -0.2252155448 -0.1933851117
0.0375869078 -0.2236883099 -0.1979823266
0.0062971873 -0.1073817867 -0.2373079048
0.0444873934 -0.1610836661 -0.2039327853
0.0443650825 -0.0536346684 -0.2038663565
0.0062971873 -0.1073817867 -0.2373079048
-0.0317707078 -0.1611289050 -0.2707494530
-0.0698386030 -0.2148760233 -0.3041910012
0.0064194982 -0.2148307843 -0.2373743335
-0.0317707078 -0.1611289050 -0.2707494530
0.1207454946 -0.1610384271 -0.1371161175
0.0826775994 -0.2147855454 -0.1705576657
0.1589357007 -0.2147403064 -0.1037409980
0.1207454946 -0.1610384271 -0.1371161175
0.0825552885 -0.1073365478 -0.1704912370
0.0443650825 -0.0536346684 -0.2038663565
0.0444873934 -0.1610836661 -0.2039327853
0.0825552885 -0.1073365478 -0.1704912370
0.1257530797 -0.0501726366 -0.1325494044
0.1663903317 0.0001622959 -0.0968621239
0.0849993953 0.0001139855 -0.1681761361
0.1257530797 -0.0501726366 -0.1325494044
0.1665067641 -0.1004592587 -0.0969226727
0.2072604486 -0.1507458808 -0.0612959410
0.2071440161 -0.0501243262 -0.0612353922
0.1665067641 -0.1004592587 -0.0969226727
0.1662738993 0.1007838505 -0.0968015750
0.2070275837 0.0504972283 -0.0611748433
0.2069111513 0.1511187829 -0.0611142945
0.1662738993 0.1007838505 -0.0968015750
0.1256366473 0.0504489180 -0.1324888555
0.0849993953 0.0001139855 -0.1681761361
0.1663903317 0.0001622959 -0.0968621239
0.1256366473 0.0504489180 -0.1324888555
0.0823116684 0.1075569775 -0.1703575091
0.0441235124 0.1612580903 -0.2037308337
0.0442437888 0.0538125837 -0.2037990394
0.0823116684 0.1075569775 -0.1703575091
0.1203795481 0.1613013713 -0.1369159789
0.1584474277 0.2150457652 -0.1034744487
0.0821913920 0.2150024841 -0.1702893035
0.1203795481 0.1613013713 -0.1369159789
-0.0321325233 0.1612148092 -0.2705456885
0.0059353563 0.2149592030 -0.2371041583
-0.0703206793 0.2149159219 -0.3039190130
-0.0321325233 0.1612148092 -0.2705456885
0.0060556328 0.1075136964 -0.2371723639
0.0442437888 0.0538125837 -0.2037990394
0.0441235124 0.1612580903 -0.2037308337
0.0060556328 0.1075136964 -0.2371723639
-0.0371431293 0.0503517784 -0.2751150441
-0.0777822811 0.0000165476 -0.3108039896
0.0036085243 0.0000654028 -0.2394900913
-0.0371431293 0.0503517784 -0.2751150441
-0.0778947830 0.1006381540 -0.3107399968
-0.1186464367 0.1509245297 -0.3463649495
-0.1185339348 0.0503029233 -0.3464289424
-0.0778947830 0.1006381540 -0.3107399968
-0.0776697792 -0.1006050588 -0.3108679825
-0.1184214329 -0.0503186832 -0.3464929352
-0.1183089310 -0.1509402896 -0.3465569280
-0.0776697792 -0.1006050588 -0.3108679825
-0.0370306275 -0.0502698280 -0.2751790369
0.0036085243 0.0000654028 -0.2394900913
-0.0777822811 0.0000165476 -0.3108039896
-0.0370306275 -0.0502698280 -0.2751790369
0.0743456742 -0.0000872481 0.1261949072
0.0743456742 -0.0000872481 0.1261949072
0.0772732964 -0.0000882180 0.1348072833
0.0772732964 -0.0000882180 0.1348072833
0.0861961889 -0.0000791248 0.1365788827
0.0861961889 -0.0000791248 0.1365788827
0.0921921127 -0.0000696054 0.1297373607
0.0921921127 -0.0000696054 0.1297373607
0.0892651423 -0.0000675942 0.1211242401
0.0892651423 -0.0000675942 0.1211242401
0.0803419228 -0.0000761926 0.1193530135
0.0803419228 -0.0000761926 0.1193530135
-0.2645406004 -0.0002889421 -0.1707342234
-0.2645406004 -0.0002889421 -0.1707342234
-0.2734629625 -0.0002979859 -0.1725046995
-0.2734629625 -0.0002979859 -0.1725046995
-0.2763912931 -0.0002965211 -0.1811176955
-0.2763912931 -0.0002965211 -0.1811176955
-0.2703972622 -0.0002854677 -0.1879602151
-0.2703972622 -0.0002854677 -0.1879602151
-0.2614746193 -0.0002769184 -0.1861908109
-0.2614746193 -0.0002769184 -0.1861908109
-0.2585462419 -0.0002789284 -0.1775771162
-0.2585462419 -0.0002789284 -0.1775771162
-0.0953493988 0.2250949031 -0.0221264309
-0.0953493988 0.2250949031 -0.0221264309
-0.0983557415 0.2329679273 -0.0187006148
-0.0983557415 0.2329679273 -0.0187006148
-0.0953676340 0.2408515094 -0.0221162931
-0.0953676340 0.2408515094 -0.0221162931
-0.0893725693 0.2408630591 -0.0289585648
-0.0893725693 0.2408630591 -0.0289585648
-0.0863655383 0.2329915222 -0.0323850925
-0.0863655383 0.2329915222 -0.0323850925
-0.0893542975 0.2251069482 -0.0289686696
-0.0893542975 0.2251069482 -0.0289686696
-0.0948458532 -0.2254715893 -0.0224125131
-0.0948458532 -0.2254715893 -0.0224125131
-0.0978339606 -0.2333552704 -0.0189968348
-0.0978339606 -0.2333552704 -0.0189968348
-0.0948276184 -0.2412278984 -0.0224226507
-0.0948276184 -0.2412278984 -0.0224226507
-0.0888328418 -0.2412173894 -0.0292645177
-0.0888328418 -0.2412173894 -0.0292645177
-0.0858437539 -0.2333347962 -0.0326813144
-0.0858437539 -0.2333347962 -0.0326813144
-0.0888504237 -0.2254610792 -0.0292551252
-0.0888504237 -0.2254610792 -0.0292551252
-0.0184173146 -0.0002582948 0.2320657530
-0.0184173146 -0.0002582948 0.2320657530
-0.0154896924 -0.0002592646 0.2406781291
-0.0154896924 -0.0002592646 0.2406781291
-0.0065671264 -0.0002501720 0.2424501011
-0.0065671264 -0.0002501720 0.2424501011
-0.0005708761 -0.0002406521 0.2356082065
-0.0005708761 -0.0002406521 0.2356082065
-0.0034978466 -0.0002386408 0.2269950859
-0.0034978466 -0.0002386408 0.2269950859
-0.0124213925 -0.0002472398 0.2252242319
-0.0124213925 -0.0002472398 0.2252242319
-0.3573039157 -0.0004599894 -0.0648630051
-0.3573039157 -0.0004599894 -0.0648630051
-0.3662262778 -0.0004690331 -0.0666334811
-0.3662262778 -0.0004690331 -0.0666334811
-0.3691542819 -0.0004675677 -0.0752468497
-0.3691542819 -0.0004675677 -0.0752468497
-0.3631602511 -0.0004565144 -0.0820893693
-0.3631602511 -0.0004565144 -0.0820893693
-0.3542376081 -0.0004479650 -0.0803199651
-0.3542376081 -0.0004479650 -0.0803199651
-0.3513092308 -0.0004499750 -0.0717062704
-0.3513092308 -0.0004499750 -0.0717062704
-0.1881123877 0.2249238565 0.0837444149
-0.1881123877 0.2249238565 0.0837444149
-0.1911187303 0.2327968807 0.0871702310
-0.1911187303 0.2327968807 0.0871702310
-0.1881306228 0.2406804627 0.0837545527
-0.1881306228 0.2406804627 0.0837545527
-0.1821355582 0.2406920125 0.0769122810
-0.1821355582 0.2406920125 0.0769122810
-0.1791285271 0.2328204756 0.0734857534
-0.1791285271 0.2328204756 0.0734857534
-0.1821172863 0.2249359016 0.0769021762
-0.1821172863 0.2249359016 0.0769021762
-0.1876088421 -0.2256426359 0.0834583328
-0.1876088421 -0.2256426359 0.0834583328
-0.1905969494 -0.2335263171 0.0868740110
-0.1905969494 -0.2335263171 0.0868740110
-0.1875906073 -0.2413989450 0.0834481952
-0.1875906073 -0.2413989450 0.0834481952
-0.1815958307 -0.2413884360 0.0766063281
-0.1815958307 -0.2413884360 0.0766063281
-0.1786067427 -0.2335058429 0.0731895315
-0.1786067427 -0.2335058429 0.0731895315
-0.1816134125 -0.2256321258 0.0766157206
-0.1816134125 -0.2256321258 0.0766157206
3 261 133 18
3 129 261 18
3 203 90 273
3 204 203 273
3 329 139 318
3 252 329 318
3 117 329 252
3 278 117 252
3 278 295 108
3 117 278 108
3 139 203 204
3 318 139 204
3 90 261 129
3 273 90 129
3 133 86 282
3 18 133 282
3 131 20 135
3 263 131 135
3 208 275 92
3 207 208 92
3 251 320 141
3 331 251 141
3 277 251 331
3 116 277 331
3 116 110 297
3 277 116 297
3 320 208 207
3 141 320 207
3 275 131 263
3 92 275 263
3 20 284 88
3 135 20 88
3 18 839 129
3 20 839 18
3 131 840 20
3 129 840 131
3 273 841 204
3 275 841 273
3 208 842 275
3 204 842 208
3 318 843 252
3 320 843 318
3 251 844 320
3 252 844 251
3 252 845 278
3 251 845 252
3 277 846 251
3 278 846 277
3 277 297 295
3 278 277 295
3 204 847 318
3 208 847 204
3 320 848 208
3 318 848 320
3 129 849 273
3 131 849 129
3 275 850 131
3 273 850 275
3 18 282 284
3 20 18 284
3 135 851 263
3 133 851 135
3 261 852 133
3 263 852 261
3 92 853 207
3 90 853 92
3 203 854 90
3 207 854 203
3 141 855 331
3 139 855 141
3 329 856 139
3 331 856 329
3 331 857 116
3 329 857 331
3 117 858 329
3 116 858 117
3 117 108 110
3 116 117 110
3 207 859 141
3 203 859 207
3 139 860 203
3 141 860 139
3 263 861 92
3 261 861 263
3 90 862 261
3 92 862 90
3 135 88 86
3 133 135 86
3 264 136 21
3 132 264 21
3 209 93 276
3 210 209 276
3 332 142 321
3 254 332 321
3 119 332 254
3 280 119 254
3 280 298 111
3 119 280 111
3 142 209 210
3 321 142 210
3 93 264 132
3 276 93 132
3 136 89 285
3 21 136 285
3 130 19 134
3 262 130 134
3 206 274 91
3 205 206 91
3 253 319 140
3 330 253 140
3 279 253 330
3 118 279 330
3 118 109 296
3 279 118 296
3 319 206 205
3 140 319 205
3 274 130 262
3 91 274 262
3 19 283 87
3 134 19 87
3 21 863 132
3 19 863 21
3 130 864 19
3 132 864 130
3 276 865 210
3 274 865 276
3 206 866 274
3 210 866 206
3 321 867 254
3 319 867 321
3 253 868 319
3 254 868 253
3 254 869 280
3 253 869 254
3 279 870 253
3 280 870 279
3 279 296 298
3 280 279 298
3 210 871 321
3 206 871 210
3 319 872 206
3 321 872 319
3 132 873 276
3 130 873 132
3 274 874 130
3 276 874 274
3 21 285 283
3 19 21 283
3 134 875 262
3 136 875 134
3 264 876 136
3 262 876 264
3 91 877 205
3 93 877 91
3 209 878 93
3 205 878 209
3 140 879 330
3 142 879 140
3 332 880 142
3 330 880 332
3 330 881 118
3 332 881 330
3 119 882 332
3 118 882 119
3 119 111 109
3 118 119 109
3 205 883 140
3 209 883 205
3 142 884 209
3 140 884 142
3 262 885 91
3 264 885 262
3 93 886 264
3 91 886 93
3 134 87 89
3 136 134 89
3 15 114 333
3 266 15 333
3 186 266 333
3 220 186 333
3 185 220 333
3 120 185 333
3 342 887 185
3 341 887 342
3 120 888 185
3 342 888 120
3 343 889 341
3 121 889 343
3 343 890 120
3 341 890 343
3 345 891 121
3 344 891 345
3 187 892 121
3 345 892 187
3 346 893 344
3 185 893 346
3 346 894 187
3 344 894 346
3 348 895 220
3 347 895 348
3 185 896 220
3 348 896 185
3 349 897 347
3 187 897 349
3 349 898 185
3 347 898 349
3 351 899 187
3 350 899 351
3 221 900 187
3 351 900 221
3 352 901 350
3 220 901 352
3 352 902 221
3 350 902 352
3 354 903 186
3 353 903 354
3 220 904 186
3 354 904 220
3 355 905 353
3 221 905 355
3 355 906 220
3 353 906 355
3 357 907 221
3 356 907 357
3 188 908 221
3 357 908 188
3 358 909 356
3 186 909 358
3 358 910 188
3 356 910 358
3 360 911 266
3 359 911 360
3 186 912 266
3 360 912 186
3 361 913 359
3 188 913 361
3 361 914 186
3 359 914 361
3 363 915 188
3 362 915 363
3 267 916 188
3 363 916 267
3 364 917 362
3 266 917 364
3 364 918 267
3 362 918 364
3 366 919 15
3 365 919 366
3 266 920 15
3 366 920 266
3 367 921 365
3 267 921 367
3 367 922 266
3 365 922 367
3 369 923 267
3 368 923 369
3 16 924 267
3 369 924 16
3 370 925 368
3 15 925 370
3 370 926 16
3 368 926 370
3 372 927 114
3 371 927 372
3 15 928 114
3 372 928 15
3 373 929 371
3 16 929 373
3 373 930 15
3 371 930 373
3 375 931 16
3 374 931 375
3 115 932 16
3 375 932 115
3 376 933 374
3 114 933 376
3 376 934 115
3 374 934 376
3 378 935 333
3 377 935 378
3 114 936 333
3 378 936 114
3 379 937 377
3 115 937 379
3 379 938 114
3 377 938 379
3 381 939 115
3 380 939 381
3 334 940 115
3 381 940 334
3 382 941 380
3 333 941 382
3 382 942 334
3 380 942 382
3 384 943 120
3 383 943 384
3 333 944 120
3 384 944 333
3 385 945 383
3 334 945 385
3 385 946 333
3 383 946 385
3 387 947 334
3 386 947 387
3 121 948 334
3 387 948 121
3 388 949 386
3 120 949 388
3 388 950 121
3 386 950 388
3 145 231 105
3 265 145 105
3 28 265 105
3 113 28 105
3 39 113 105
3 281 39 105
3 105 231 114
3 333 105 114
3 231 145 15
3 114 231 15
3 145 265 266
3 15 145 266
3 265 28 186
3 266 265 186
3 28 113 220
3 186 28 220
3 113 39 185
3 220 113 185
3 39 281 120
3 185 39 120
3 281 105 333
3 120 281 333
3 80 99 256
3 183 80 256
3 229 183 256
3 98 229 256
3 255 98 256
3 232 255 256
3 390 951 255
3 389 951 390
3 232 952 255
3 390 952 232
3 391 953 389
3 233 953 391
3 391 954 232
3 389 954 391
3 393 955 233
3 392 955 393
3 257 956 233
3 393 956 257
3 394 957 392
3 255 957 394
3 394 958 257
3 392 958 394
3 98 959 396
3 255 959 98
3 396 960 395
3 255 960 396
3 397 961 395
3 257 961 397
3 397 962 255
3 395 962 397
3 399 963 257
3 398 963 399
3 100 964 257
3 399 964 100
3 400 965 398
3 98 965 400
3 400 966 100
3 398 966 400
3 402 967 229
3 401 967 402
3 98 968 229
3 402 968 98
3 403 969 401
3 100 969 403
3 403 970 98
3 401 970 403
3 405 971 100
3 404 971 405
3 230 972 100
3 405 972 230
3 406 973 404
3 229 973 406
3 406 974 230
3 404 974 406
3 408 975 183
3 407 975 408
3 229 976 183
3 408 976 229
3 409 977 407
3 230 977 409
3 409 978 229
3 407 978 409
3 411 979 230
3 410 979 411
3 184 980 230
3 411 980 184
3 412 981 410
3 183 981 412
3 412 982 184
3 410 982 412
3 414 983 80
3 413 983 414
3 183 984 80
3 414 984 183
3 415 985 413
3 184 985 415
3 415 986 183
3 413 986 415
3 417 987 184
3 416 987 417
3 81 988 184
3 417 988 81
3 418 989 416
3 80 989 418
3 418 990 81
3 416 990 418
3 420 991 99
3 419 991 420
3 80 992 99
3 420 992 80
3 421 993 419
3 81 993 421
3 421 994 80
3 419 994 421
3 423 995 81
3 422 995 423
3 101 996 81
3 423 996 101
3 424 997 422
3 99 997 424
3 424 998 101
3 422 998 424
3 426 999 256
3 425 999 426
3 99 1000 256
3 426 1000 99
3 427 1001 425
3 101 1001 427
3 427 1002 99
3 425 1002 427
3 101 1003 429
3 258 1003 101
3 429 1004 428
3 258 1004 429
3 430 1005 428
3 256 1005 430
3 430 1006 258
3 428 1006 430
3 432 1007 232
3 431 1007 432
3 256 1008 232
3 432 1008 256
3 433 1009 431
3 258 1009 433
3 433 1010 256
3 431 1010 433
3 435 1011 258
3 434 1011 435
3 233 1012 258
3 435 1012 233
3 436 1013 434
3 232 1013 436
3 436 1014 233
3 434 1014 436
3 269 96 72
3 38 269 72
3 268 38 72
3 97 268 72
3 222 97 72
3 223 222 72
3 72 96 99
3 256 72 99
3 96 269 80
3 99 96 80
3 269 38 183
3 80 269 183
3 38 268 229
3 183 38 229
3 268 97 98
3 229 268 98
3 97 222 255
3 98 97 255
3 222 223 232
3 255 222 232
3 223 72 256
3 232 223 256
3 441 442 440
3 439 442 441
3 441 443 438
3 440 443 441
3 444 445 440
3 437 445 444
3 444 446 439
3 440 446 444
3 448 449 447
3 439 449 448
3 448 450 236
3 447 450 448
3 451 452 447
3 438 452 451
3 451 453 439
3 447 453 451
3 456 457 455
3 454 457 456
3 456 458 438
3 455 458 456
3 459 460 455
3 127 460 459
3 459 461 454
3 455 461 459
3 463 464 462
3 454 464 463
3 463 465 437
3 462 465 463
3 466 467 462
3 438 467 466
3 466 468 454
3 462 468 466
3 472 473 471
3 470 473 472
3 472 474 469
3 471 474 472
3 475 476 471
3 437 476 475
3 475 477 470
3 471 477 475
3 479 480 478
3 470 480 479
3 479 481 153
3 478 481 479
3 482 483 478
3 469 483 482
3 482 484 470
3 478 484 482
3 487 488 486
3 485 488 487
3 487 489 469
3 486 489 487
3 490 491 486
3 236 491 490
3 490 492 485
3 486 492 490
3 494 495 493
3 485 495 494
3 494 496 437
3 493 496 494
3 497 498 493
3 469 498 497
3 497 499 485
3 493 499 497
3 504 505 503
3 502 505 504
3 504 506 501
3 503 506 504
3 507 508 503
3 500 508 507
3 507 509 502
3 503 509 507
3 511 512 510
3 502 512 511
3 511 513 74
3 510 513 511
3 514 515 510
3 501 515 514
3 514 516 502
3 510 516 514
3 519 520 518
3 517 520 519
3 519 521 501
3 518 521 519
3 522 523 518
3 153 523 522
3 522 524 517
3 518 524 522
3 526 527 525
3 517 527 526
3 526 528 500
3 525 528 526
3 529 530 525
3 501 530 529
3 529 531 517
3 525 531 529
3 535 536 534
3 533 536 535
3 535 537 532
3 534 537 535
3 538 539 534
3 500 539 538
3 538 540 533
3 534 540 538
3 542 543 541
3 533 543 542
3 542 544 127
3 541 544 542
3 545 546 541
3 532 546 545
3 545 547 533
3 541 547 545
3 550 551 549
3 548 551 550
3 550 552 532
3 549 552 550
3 553 554 549
3 74 554 553
3 553 555 548
3 549 555 553
3 557 558 556
3 548 558 557
3 557 559 500
3 556 559 557
3 560 561 556
3 532 561 560
3 560 562 548
3 556 562 560
3 563 1015 565
3 564 1015 563
3 565 1016 237
3 564 1016 565
3 566 1017 564
3 143 1017 566
3 564 1018 566
3 563 1018 564
3 568 1019 567
3 237 1019 568
3 568 1020 563
3 567 1020 568
3 237 1021 569
3 239 1021 237
3 569 1022 567
3 239 1022 569
3 570 1023 572
3 571 1023 570
3 572 1024 144
3 571 1024 572
3 573 1025 571
3 239 1025 573
3 571 1026 573
3 570 1026 571
3 575 1027 574
3 144 1027 575
3 574 1028 575
3 570 1028 574
3 144 1029 576
3 143 1029 144
3 576 1030 574
3 143 1030 576
3 577 1031 579
3 578 1031 577
3 579 1032 153
3 578 1032 579
3 580 1033 578
3 236 1033 580
3 578 1034 580
3 577 1034 578
3 582 1035 581
3 153 1035 582
3 582 1036 577
3 581 1036 582
3 153 1037 583
3 154 1037 153
3 583 1038 581
3 154 1038 583
3 584 1039 586
3 585 1039 584
3 586 1040 238
3 585 1040 586
3 587 1041 585
3 154 1041 587
3 585 1042 587
3 584 1042 585
3 589 1043 238
3 588 1043 589
3 236 1044 238
3 589 1044 236
3 588 1045 584
3 590 1045 588
3 590 1046 236
3 588 1046 590
3 153 143 144
3 154 153 144
3 591 1047 239
3 144 1047 591
3 238 1048 239
3 591 1048 238
3 592 1049 154
3 238 1049 592
3 154 1050 592
3 144 1050 154
3 237 236 238
3 239 237 238
3 593 1051 236
3 153 1051 593
3 236 1052 593
3 237 1052 236
3 594 1053 143
3 237 1053 594
3 153 1054 143
3 594 1054 153
3 595 1055 597
3 596 1055 595
3 597 1056 236
3 596 1056 597
3 598 1057 596
3 127 1057 598
3 596 1058 598
3 595 1058 596
3 600 1059 599
3 236 1059 600
3 599 1060 600
3 595 1060 599
3 236 1061 601
3 238 1061 236
3 601 1062 599
3 238 1062 601
3 602 1063 604
3 603 1063 602
3 604 1064 128
3 603 1064 604
3 605 1065 603
3 238 1065 605
3 603 1066 605
3 602 1066 603
3 607 1067 128
3 606 1067 607
3 127 1068 128
3 607 1068 127
3 608 1069 606
3 602 1069 608
3 608 1070 127
3 606 1070 608
3 609 1071 611
3 610 1071 609
3 611 1072 124
3 610 1072 611
3 612 1073 610
3 234 1073 612
3 610 1074 612
3 609 1074 610
3 614 1075 613
3 124 1075 614
3 614 1076 609
3 613 1076 614
3 124 1077 615
3 125 1077 124
3 615 1078 613
3 125 1078 615
3 616 1079 618
3 617 1079 616
3 618 1080 235
3 617 1080 618
3 619 1081 617
3 125 1081 619
3 617 1082 619
3 616 1082 617
3 621 1083 235
3 620 1083 621
3 234 1084 235
3 621 1084 234
3 622 1085 620
3 616 1085 622
3 622 1086 234
3 620 1086 622
3 124 127 128
3 125 124 128
3 623 1087 238
3 128 1087 623
3 235 1088 238
3 623 1088 235
3 624 1089 125
3 235 1089 624
3 128 1090 125
3 624 1090 128
3 236 234 235
3 238 236 235
3 625 1091 234
3 124 1091 625
3 234 1092 625
3 236 1092 234
3 626 1093 127
3 236 1093 626
3 127 1094 626
3 124 1094 127
3 627 1095 629
3 628 1095 627
3 629 1096 74
3 628 1096 629
3 630 1097 628
3 153 1097 630
3 628 1098 630
3 627 1098 628
3 632 1099 631
3 74 1099 632
3 632 1100 627
3 631 1100 632
3 74 1101 633
3 75 1101 74
3 633 1102 631
3 75 1102 633
3 634 1103 636
3 635 1103 634
3 636 1104 154
3 635 1104 636
3 637 1105 635
3 75 1105 637
3 635 1106 637
3 634 1106 635
3 639 1107 154
3 638 1107 639
3 153 1108 154
3 639 1108 153
3 640 1109 638
3 634 1109 640
3 640 1110 153
3 638 1110 640
3 641 1111 643
3 642 1111 641
3 643 1112 106
3 642 1112 643
3 644 1113 642
3 49 1113 644
3 642 1114 644
3 641 1114 642
3 646 1115 645
3 106 1115 646
3 646 1116 641
3 645 1116 646
3 106 1117 647
3 107 1117 106
3 647 1118 645
3 107 1118 647
3 648 1119 650
3 649 1119 648
3 650 1120 50
3 649 1120 650
3 651 1121 649
3 107 1121 651
3 649 1122 651
3 648 1122 649
3 653 1123 652
3 50 1123 653
3 652 1124 653
3 648 1124 652
3 50 1125 654
3 49 1125 50
3 654 1126 652
3 49 1126 654
3 74 49 50
3 75 74 50
3 655 1127 75
3 154 1127 655
3 75 1128 655
3 50 1128 75
3 656 1129 107
3 50 1129 656
3 107 1130 656
3 154 1130 107
3 106 153 154
3 107 106 154
3 657 1131 49
3 106 1131 657
3 74 1132 49
3 657 1132 74
3 658 1133 153
3 74 1133 658
3 106 1134 153
3 658 1134 106
3 659 1135 661
3 660 1135 659
3 661 1136 237
3 660 1136 661
3 662 1137 660
3 143 1137 662
3 660 1138 662
3 659 1138 660
3 664 1139 663
3 237 1139 664
3 664 1140 659
3 663 1140 664
3 237 1141 665
3 239 1141 237
3 665 1142 663
3 239 1142 665
3 666 1143 668
3 667 1143 666
3 668 1144 144
3 667 1144 668
3 669 1145 667
3 239 1145 669
3 667 1146 669
3 666 1146 667
3 671 1147 670
3 144 1147 671
3 670 1148 671
3 666 1148 670
3 144 1149 672
3 143 1149 144
3 672 1150 670
3 143 1150 672
3 673 1151 675
3 674 1151 673
3 675 1152 153
3 674 1152 675
3 676 1153 674
3 236 1153 676
3 674 1154 676
3 673 1154 674
3 678 1155 677
3 153 1155 678
3 678 1156 673
3 677 1156 678
3 153 1157 679
3 154 1157 153
3 679 1158 677
3 154 1158 679
3 680 1159 682
3 681 1159 680
3 682 1160 238
3 681 1160 682
3 683 1161 681
3 154 1161 683
3 681 1162 683
3 680 1162 681
3 685 1163 238
3 684 1163 685
3 236 1164 238
3 685 1164 236
3 684 1165 680
3 686 1165 684
3 686 1166 236
3 684 1166 686
3 153 143 144
3 154 153 144
3 687 1167 239
3 144 1167 687
3 238 1168 239
3 687 1168 238
3 688 1169 154
3 238 1169 688
3 154 1170 688
3 144 1170 154
3 237 236 238
3 239 237 238
3 689 1171 236
3 153 1171 689
3 236 1172 689
3 237 1172 236
3 690 1173 143
3 237 1173 690
3 153 1174 143
3 690 1174 153
3 691 1175 693
3 692 1175 691
3 693 1176 84
3 692 1176 693
3 694 1177 692
3 122 1177 694
3 692 1178 694
3 691 1178 692
3 696 1179 695
3 84 1179 696
3 696 1180 691
3 695 1180 696
3 84 1181 697
3 85 1181 84
3 697 1182 695
3 85 1182 697
3 698 1183 700
3 699 1183 698
3 700 1184 123
3 699 1184 700
3 701 1185 699
3 85 1185 701
3 699 1186 701
3 698 1186 699
3 703 1187 123
3 702 1187 703
3 122 1188 123
3 703 1188 122
3 704 1189 702
3 698 1189 704
3 704 1190 122
3 702 1190 704
3 705 1191 707
3 706 1191 705
3 707 1192 335
3 706 1192 707
3 708 1193 706
3 289 1193 708
3 706 1194 708
3 705 1194 706
3 710 1195 709
3 335 1195 710
3 710 1196 705
3 709 1196 710
3 335 1197 711
3 336 1197 335
3 711 1198 709
3 336 1198 711
3 712 1199 714
3 713 1199 712
3 714 1200 290
3 713 1200 714
3 715 1201 713
3 336 1201 715
3 713 1202 715
3 712 1202 713
3 717 1203 290
3 716 1203 717
3 289 1204 290
3 717 1204 289
3 718 1205 716
3 712 1205 718
3 718 1206 289
3 716 1206 718
3 84 289 290
3 85 84 290
3 719 1207 85
3 123 1207 719
3 85 1208 719
3 290 1208 85
3 720 1209 336
3 290 1209 720
3 123 1210 336
3 720 1210 123
3 335 122 123
3 336 335 123
3 721 1211 289
3 335 1211 721
3 84 1212 289
3 721 1212 84
3 722 1213 122
3 84 1213 722
3 122 1214 722
3 335 1214 122
3 157 311 307
3 305 157 307
3 315 305 307
3 241 315 307
3 43 241 307
3 191 43 307
3 191 1215 43
3 723 1215 191
3 723 1216 189
3 191 1216 723
3 189 1217 724
3 42 1217 189
3 724 1218 43
3 42 1218 724
3 241 1219 725
3 43 1219 241
3 725 1220 42
3 43 1220 725
3 42 1221 726
3 240 1221 42
3 726 1222 241
3 240 1222 726
3 315 1223 727
3 241 1223 315
3 727 1224 240
3 241 1224 727
3 240 1225 728
3 314 1225 240
3 728 1226 315
3 314 1226 728
3 305 1227 729
3 315 1227 305
3 729 1228 314
3 315 1228 729
3 314 1229 730
3 303 1229 314
3 730 1230 305
3 303 1230 730
3 157 1231 731
3 305 1231 157
3 731 1232 303
3 305 1232 731
3 303 1233 732
3 156 1233 303
3 732 1234 157
3 156 1234 732
3 311 1235 733
3 157 1235 311
3 733 1236 156
3 157 1236 733
3 156 1237 734
3 310 1237 156
3 734 1238 311
3 310 1238 734
3 307 1239 735
3 311 1239 307
3 735 1240 310
3 311 1240 735
3 310 1241 736
3 306 1241 310
3 736 1242 307
3 306 1242 736
3 191 1243 737
3 307 1243 191
3 737 1244 306
3 307 1244 737
3 306 1245 738
3 189 1245 306
3 738 1246 191
3 189 1246 738
3 324 200 126
3 304 324 126
3 147 304 126
3 14 147 126
3 10 14 126
3 190 10 126
3 126 200 311
3 307 126 311
3 200 324 157
3 311 200 157
3 324 304 305
3 157 324 305
3 304 147 315
3 305 304 315
3 147 14 241
3 315 147 241
3 14 10 43
3 241 14 43
3 10 190 191
3 43 10 191
3 190 126 307
3 191 190 307
3 30 71 328
3 317 30 328
3 48 317 328
3 104 48 328
3 3 104 328
3 271 3 328
3 3 1247 739
3 271 1247 3
3 739 1248 270
3 271 1248 739
3 270 1249 740
3 2 1249 270
3 740 1250 3
3 2 1250 740
3 104 1251 741
3 3 1251 104
3 741 1252 2
3 3 1252 741
3 2 1253 742
3 102 1253 2
3 742 1254 104
3 102 1254 742
3 48 1255 743
3 104 1255 48
3 743 1256 102
3 104 1256 743
3 102 1257 744
3 47 1257 102
3 744 1258 48
3 47 1258 744
3 317 1259 745
3 48 1259 317
3 745 1260 47
3 48 1260 745
3 47 1261 746
3 316 1261 47
3 746 1262 317
3 316 1262 746
3 30 1263 747
3 317 1263 30
3 747 1264 316
3 317 1264 747
3 316 1265 748
3 29 1265 316
3 748 1266 30
3 29 1266 748
3 71 1267 749
3 30 1267 71
3 749 1268 29
3 30 1268 749
3 29 1269 750
3 69 1269 29
3 750 1270 71
3 69 1270 750
3 328 1271 751
3 71 1271 328
3 751 1272 69
3 71 1272 751
3 69 1273 752
3 327 1273 69
3 752 1274 328
3 327 1274 752
3 271 1275 753
3 328 1275 271
3 753 1276 327
3 328 1276 753
3 270 1277 327
3 754 1277 270
3 754 1278 271
3 270 1278 754
3 155 70 33
3 59 155 33
3 337 59 33
3 103 337 33
3 224 103 33
3 182 224 33
3 33 70 71
3 328 33 71
3 70 155 30
3 71 70 30
3 155 59 317
3 30 155 317
3 59 337 48
3 317 59 48
3 337 103 104
3 48 337 104
3 103 224 3
3 104 103 3
3 224 182 271
3 3 224 271
3 182 33 328
3 271 182 328
3 260 272 195
3 165 260 195
3 259 260 165
3 164 259 165
3 323 322 67
3 68 323 67
3 288 326 323
3 68 288 323
3 326 192 197
3 323 326 197
3 322 323 197
3 196 322 197
3 159 158 6
3 7 159 6
3 4 163 159
3 7 4 159
3 163 146 149
3 159 163 149
3 158 159 149
3 148 158 149
3 64 63 339
3 340 64 339
3 11 73 64
3 340 11 64
3 73 181 152
3 64 73 152
3 63 64 152
3 151 63 152
3 260 259 299
3 300 260 299
3 300 313 272
3 260 300 272
3 272 250 162
3 195 272 162
3 112 17 326
3 288 112 326
3 17 5 192
3 326 17 192
3 46 213 163
3 4 46 163
3 213 325 146
3 163 213 146
3 338 60 73
3 11 338 73
3 60 166 181
3 73 60 181
3 313 150 250
3 272 313 250
3 338 1279 146
3 11 1279 338
3 325 1280 146
3 338 1280 325
3 11 1281 149
3 340 1281 11
3 146 1282 149
3 11 1282 146
3 340 756 755
3 339 756 340
3 755 757 148
3 339 757 755
3 149 759 148
3 758 759 149
3 758 760 340
3 149 760 758
3 162 1283 195
3 112 1283 162
3 112 1284 195
3 288 1284 112
3 195 1285 165
3 288 1285 195
3 288 1286 165
3 68 1286 288
3 165 762 164
3 761 762 165
3 761 763 68
3 165 763 761
3 68 765 764
3 67 765 68
3 764 766 164
3 67 766 764
3 5 1287 192
3 46 1287 5
3 46 1288 192
3 4 1288 46
3 192 1289 197
3 4 1289 192
3 4 1290 197
3 7 1290 4
3 196 768 767
3 197 768 196
3 767 769 7
3 197 769 767
3 7 771 770
3 6 771 7
3 770 772 196
3 6 772 770
3 150 1291 181
3 313 1291 150
3 166 1292 181
3 150 1292 166
3 313 1293 152
3 300 1293 313
3 181 1294 152
3 313 1294 181
3 300 774 773
3 299 774 300
3 773 775 151
3 299 775 773
3 152 777 151
3 776 777 152
3 776 778 300
3 152 778 776
3 60 338 312
3 166 60 312
3 782 1295 781
3 780 1295 782
3 782 1296 779
3 781 1296 782
3 783 1297 781
3 312 1297 783
3 783 1298 780
3 781 1298 783
3 785 1299 784
3 780 1299 785
3 785 1300 166
3 784 1300 785
3 786 1301 784
3 779 1301 786
3 786 1302 780
3 784 1302 786
3 789 1303 788
3 787 1303 789
3 789 1304 779
3 788 1304 789
3 790 1305 788
3 150 1305 790
3 790 1306 787
3 788 1306 790
3 792 1307 791
3 787 1307 792
3 792 1308 312
3 791 1308 792
3 793 1309 791
3 779 1309 793
3 793 1310 787
3 791 1310 793
3 250 150 312
3 162 250 312
3 797 1311 796
3 795 1311 797
3 797 1312 794
3 796 1312 797
3 798 1313 796
3 312 1313 798
3 798 1314 795
3 796 1314 798
3 800 1315 799
3 795 1315 800
3 800 1316 162
3 799 1316 800
3 801 1317 799
3 794 1317 801
3 801 1318 795
3 799 1318 801
3 804 1319 803
3 802 1319 804
3 804 1320 794
3 803 1320 804
3 805 1321 803
3 112 1321 805
3 805 1322 802
3 803 1322 805
3 807 1323 806
3 802 1323 807
3 807 1324 312
3 806 1324 807
3 808 1325 806
3 794 1325 808
3 808 1326 802
3 806 1326 808
3 17 112 312
3 5 17 312
3 812 1327 811
3 810 1327 812
3 812 1328 809
3 811 1328 812
3 813 1329 811
3 312 1329 813
3 813 1330 810
3 811 1330 813
3 815 1331 814
3 810 1331 815
3 815 1332 5
3 814 1332 815
3 816 1333 814
3 809 1333 816
3 816 1334 810
3 814 1334 816
3 819 1335 818
3 817 1335 819
3 819 1336 809
3 818 1336 819
3 820 1337 818
3 46 1337 820
3 820 1338 817
3 818 1338 820
3 822 1339 821
3 817 1339 822
3 822 1340 312
3 821 1340 822
3 823 1341 821
3 809 1341 823
3 823 1342 817
3 821 1342 823
3 213 46 312
3 325 213 312
3 827 1343 826
3 825 1343 827
3 827 1344 824
3 826 1344 827
3 828 1345 826
3 312 1345 828
3 828 1346 825
3 826 1346 828
3 830 1347 829
3 825 1347 830
3 830 1348 325
3 829 1348 830
3 831 1349 829
3 824 1349 831
3 831 1350 825
3 829 1350 831
3 834 1351 833
3 832 1351 834
3 834 1352 824
3 833 1352 834
3 835 1353 833
3 338 1353 835
3 835 1354 832
3 833 1354 835
3 837 1355 836
3 832 1355 837
3 837 1356 312
3 836 1356 837
3 838 1357 836
3 824 1357 838
3 838 1358 832
3 836 1358 838
3 292 1359 293
3 227 1359 292
3 23 1360 227
3 293 1360 23
3 293 1361 77
3 23 1361 293
3 35 1362 23
3 77 1362 35
3 77 1363 79
3 35 1363 77
3 243 1364 35
3 79 1364 243
3 79 1365 180
3 243 1365 79
3 244 1366 243
3 180 1366 244
3 180 1367 173
3 244 1367 180
3 225 1368 244
3 173 1368 225
3 173 1369 292
3 225 1369 173
3 227 1370 225
3 292 1370 227
3 174 1371 172
3 217 1371 174
3 55 1372 217
3 172 1372 55
3 175 1373 174
3 216 1373 175
3 217 1374 216
3 174 1374 217
3 179 1375 175
3 54 1375 179
3 216 1376 54
3 175 1376 216
3 27 1377 179
3 56 1377 27
3 54 1378 56
3 179 1378 54
3 25 1379 27
3 52 1379 25
3 56 1380 52
3 27 1380 56
3 172 1381 25
3 55 1381 172
3 52 1382 55
3 25 1382 52
3 95 1383 0
3 218 1383 95
3 249 1384 218
3 0 1384 249
3 0 1385 286
3 249 1385 0
3 199 1386 249
3 286 1386 199
3 286 1387 194
3 199 1387 286
3 65 1388 199
3 194 1388 65
3 194 1389 62
3 65 1389 194
3 83 1390 65
3 62 1390 83
3 62 1391 137
3 83 1391 62
3 31 1392 83
3 137 1392 31
3 137 1393 95
3 31 1393 137
3 218 1394 31
3 95 1394 218
3 160 1395 168
3 37 1395 160
3 44 1396 37
3 168 1396 44
3 308 1397 160
3 212 1397 308
3 37 1398 212
3 160 1398 37
3 302 1399 308
3 201 1399 302
3 212 1400 201
3 308 1400 212
3 13 1401 302
3 41 1401 13
3 201 1402 41
3 302 1402 201
3 8 1403 13
3 246 1403 8
3 41 1404 246
3 13 1404 41
3 168 1405 8
3 44 1405 168
3 246 1406 44
3 8 1406 246
3 291 1407 294
3 228 1407 291
3 22 1408 228
3 294 1408 22
3 294 1409 78
3 22 1409 294
3 34 1410 22
3 78 1410 34
3 78 1411 76
3 34 1411 78
3 245 1412 34
3 76 1412 245
3 76 1413 171
3 245 1413 76
3 242 1414 245
3 171 1414 242
3 171 1415 176
3 242 1415 171
3 226 1416 242
3 176 1416 226
3 176 1417 291
3 226 1417 176
3 228 1418 226
3 291 1418 228
3 177 1419 169
3 214 1419 177
3 58 1420 214
3 169 1420 58
3 178 1421 177
3 215 1421 178
3 214 1422 215
3 177 1422 214
3 170 1423 178
3 57 1423 170
3 215 1424 57
3 178 1424 215
3 24 1425 170
3 51 1425 24
3 57 1426 51
3 170 1426 57
3 26 1427 24
3 53 1427 26
3 51 1428 53
3 24 1428 51
3 169 1429 26
3 58 1429 169
3 53 1430 58
3 26 1430 53
3 94 1431 1
3 219 1431 94
3 248 1432 219
3 1 1432 248
3 1 1433 287
3 248 1433 1
3 198 1434 248
3 287 1434 198
3 287 1435 193
3 198 1435 287
3 66 1436 198
3 193 1436 66
3 193 1437 61
3 66 1437 193
3 82 1438 66
3 61 1438 82
3 61 1439 138
3 82 1439 61
3 32 1440 82
3 138 1440 32
3 138 1441 94
3 32 1441 138
3 219 1442 32
3 94 1442 219
3 161 1443 167
3 36 1443 161
3 45 1444 36
3 167 1444 45
3 309 1445 161
3 211 1445 309
3 36 1446 211
3 161 1446 36
3 301 1447 309
3 202 1447 301
3 211 1448 202
3 309 1448 211
3 12 1449 301
3 40 1449 12
3 202 1450 40
3 301 1450 202
3 9 1451 12
3 247 1451 9
3 40 1452 247
3 12 1452 40
3 167 1453 9
3 45 1453 167
3 247 1454 45
3 9 1454 247