OFF
1444 1672 0
0.2279273682 0.2437304685 0.1432133663
0.2279273682 0.3276999419 0.1432131712
0.2279273682 -0.3276979506 0.1432146938
0.2279273682 -0.2437284772 0.1432144987
-0.3571431565 -0.3571428248 -0.1424989203
-0.3571431565 -0.2142849306 -0.1424992522
-0.3571431565 0.2142855943 -0.1425002479
-0.3571431565 0.3571434886 -0.1425005797
-0.3571431563 -0.3571424929 0.0003579213
-0.3571431563 -0.2142845987 0.0003575894
-0.3571431563 0.2142859262 0.0003565938
-0.3571431563 0.3571438205 0.0003562619
-0.3571431567 -0.3571431567 -0.2853561830
-0.3571431567 -0.2142852624 -0.2853565149
-0.3571431567 0.2142852624 -0.2853575105
-0.3571431567 0.3571431567 -0.2853578424
-0.3571431562 -0.3571421611 0.1432147629
-0.3571431562 -0.2142842668 0.1432144311
-0.3571431562 -0.2857137402 0.1432145970
-0.3571431562 0.2857157315 0.1432132695
-0.3571431562 0.2142862581 0.1432134354
-0.3571431562 0.3571441524 0.1432131035
-0.0714284206 -0.2857144040 -0.1424990866
-0.0714284206 0.2857150678 -0.1425004142
-0.0714284208 -0.2857147359 -0.2853563493
-0.0714284208 0.2857147359 -0.2853576768
0.4285714724 -0.1785849322 -0.1431572309
0.4285714724 0.0357003302 -0.1431577287
0.4285714724 -0.0714280889 -0.1424995851
0.4285714724 0.1428571735 -0.1425000829
0.4285714724 -0.2142849306 -0.1424992532
0.4285714724 0.0000003319 -0.1424997510
0.4285714724 0.2142855943 -0.1425002488
0.4285714724 -0.1428565097 -0.1424994191
0.4285714724 0.0714287527 -0.1424999170
0.4285714725 -0.0356995868 -0.1075565103
0.4285714725 0.1785856756 -0.1075570081
0.4285714725 -0.1785564282 -0.1074424942
0.4285714725 0.0357288343 -0.1074429920
0.4285714723 -0.0714284208 -0.2853568478
0.4285714723 0.1428568416 -0.2853573456
0.4285714723 -0.2142852624 -0.2853565159
0.4285714723 0.0000000000 -0.2853570137
0.4285714723 0.2142852624 -0.2853575115
0.4285714723 -0.1428568416 -0.2853566818
0.4285714723 0.0714284208 -0.2853571796
0.4285714724 -0.0357280908 -0.1432712470
0.4285714724 0.1785571716 -0.1432717448
-0.4999999983 -0.5000000000 -0.2860701667
-0.4999999983 0.4999999967 -0.2860724899
-0.4999999983 -0.4999999967 -0.2846416404
-0.4999999983 0.5000000000 -0.2846439636
0.3435010520 0.2437304685 0.1432133661
0.3435010520 0.3276999419 0.1432131710
0.3435010520 -0.3276979506 0.1432146937
0.3435010520 -0.2437284772 0.1432144986
-0.2142852623 -0.3571428248 -0.1424989205
-0.2142852623 -0.2142849306 -0.1424992524
-0.2142852623 -0.2857144040 -0.1424990864
-0.2142852623 0.2857150678 -0.1425004140
-0.2142852623 0.2142855943 -0.1425002480
-0.2142852623 0.3571434886 -0.1425005799
-0.2142852621 -0.3571424929 0.0003579211
-0.2142852621 -0.2142845987 0.0003575892
-0.2142852621 0.2142859262 0.0003565936
-0.2142852621 0.3571438205 0.0003562617
-0.2142852624 -0.3571431567 -0.2853561832
-0.2142852624 -0.2142852624 -0.2853565151
-0.2142852624 -0.2857147359 -0.2853563491
-0.2142852624 0.2857147359 -0.2853576767
-0.2142852624 0.2142852624 -0.2853575107
-0.2142852624 0.3571431567 -0.2853578426
-0.2142852619 -0.3571421611 0.1432147628
-0.2142852619 -0.2142842668 0.1432144309
-0.2142852619 -0.2857137402 0.1432145968
-0.2142852619 0.2857157315 0.1432132693
-0.2142852619 0.2142862581 0.1432134352
-0.2142852619 0.3571441524 0.1432131033
-0.2636421038 -0.2177811089 0.1432144391
-0.2636421038 0.3536483629 0.1432131115
-0.2636421038 -0.3536463716 0.1432147547
-0.2636421038 0.2177831002 0.1432134272
-0.2857147357 -0.1785849322 -0.1431572300
-0.2857147357 0.0357003302 -0.1431577278
-0.2857147357 -0.0714280889 -0.1424995842
-0.2857147357 0.1428571735 -0.1425000820
-0.2857147357 -0.2142849306 -0.1424992523
-0.2857147357 0.0000003319 -0.1424997501
-0.2857147357 0.2142855943 -0.1425002479
-0.2857147357 -0.1428565097 -0.1424994182
-0.2857147357 0.0714287527 -0.1424999161
-0.2857147357 -0.0356995868 -0.1075565094
-0.2857147357 0.1785856756 -0.1075570072
-0.2857147352 -0.2857134084 0.2860724912
-0.2857147352 0.2857160634 0.2860711636
-0.2857147357 -0.1785564282 -0.1074424933
-0.2857147357 0.0357288343 -0.1074429911
-0.2857147359 -0.0714284208 -0.2853568469
-0.2857147359 0.1428568416 -0.2853573447
-0.2857147359 -0.2142852624 -0.2853565150
-0.2857147359 0.0000000000 -0.2853570128
-0.2857147359 0.2142852624 -0.2853575106
-0.2857147359 -0.1428568416 -0.2853566809
-0.2857147359 0.0714284208 -0.2853571787
-0.2857147354 -0.2857137402 0.1432145969
-0.2857147354 0.2857157315 0.1432132694
-0.2857147357 -0.0357280908 -0.1432712461
-0.2857147357 0.1785571716 -0.1432717439
-0.3077873669 -0.2177811089 0.1432144391
-0.3077873669 0.3536483629 0.1432131116
-0.3077873669 -0.3536463716 0.1432147548
-0.3077873669 0.2177831002 0.1432134272
0.3077873679 -0.2177811089 0.1432144383
0.3077873679 0.3536483629 0.1432131108
0.3077873679 -0.3536463716 0.1432147540
0.3077873679 0.2177831002 0.1432134264
0.2857147361 -0.1785849322 -0.1431572307
0.2857147361 0.0357003302 -0.1431577285
0.2857147361 -0.0714280889 -0.1424995849
0.2857147361 0.1428571735 -0.1425000827
0.2857147361 -0.2142849306 -0.1424992530
0.2857147361 0.0000003319 -0.1424997508
0.2857147361 0.2142855943 -0.1425002487
0.2857147361 -0.1428565097 -0.1424994190
0.2857147361 0.0714287527 -0.1424999168
0.2857147361 -0.0356995868 -0.1075565101
0.2857147361 0.1785856756 -0.1075570079
0.2857147366 -0.2857134084 0.2860724905
0.2857147366 0.2857160634 0.2860711629
0.2857147361 -0.1785564282 -0.1074424940
0.2857147361 0.0357288343 -0.1074429919
0.2857147359 -0.0714284208 -0.2853568476
0.2857147359 0.1428568416 -0.2853573454
0.2857147359 -0.2142852624 -0.2853565157
0.2857147359 0.0000000000 -0.2853570135
0.2857147359 0.2142852624 -0.2853575114
0.2857147359 -0.1428568416 -0.2853566816
0.2857147359 0.0714284208 -0.2853571795
0.2857147364 -0.2857137402 0.1432145962
0.2857147364 0.2857157315 0.1432132687
0.2857147361 -0.0357280908 -0.1432712468
0.2857147361 0.1785571716 -0.1432717446
0.2636421049 -0.2177811089 0.1432144384
0.2636421049 0.3536483629 0.1432131109
0.2636421049 -0.3536463716 0.1432147540
0.2636421049 0.2177831002 0.1432134265
0.2142852626 -0.3571428248 -0.1424989210
0.2142852626 -0.2142849306 -0.1424992529
0.2142852626 -0.2857144040 -0.1424990870
0.2142852626 0.2857150678 -0.1425004145
0.2142852626 0.2142855943 -0.1425002486
0.2142852626 0.3571434886 -0.1425005805
0.2142852628 -0.3571424929 0.0003579206
0.2142852628 -0.2142845987 0.0003575887
0.2142852628 0.2142859262 0.0003565931
0.2142852628 0.3571438205 0.0003562612
0.2142852624 -0.3571431567 -0.2853561837
0.2142852624 -0.2142852624 -0.2853565156
0.2142852624 -0.2857147359 -0.2853563497
0.2142852624 0.2857147359 -0.2853576772
0.2142852624 0.2142852624 -0.2853575113
0.2142852624 0.3571431567 -0.2853578431
0.2142852630 -0.3571421611 0.1432147622
0.2142852630 -0.2142842668 0.1432144303
0.2142852630 -0.2857137402 0.1432145963
0.2142852630 0.2857157315 0.1432132687
0.2142852630 0.2142862581 0.1432134347
0.2142852630 0.3571441524 0.1432131028
-0.3435010509 0.2437304685 0.1432133670
-0.3435010509 0.3276999419 0.1432131719
-0.3435010509 -0.3276979506 0.1432146945
-0.3435010509 -0.2437284772 0.1432144994
0.4999999983 -0.5000000000 -0.2860701680
0.4999999983 0.4999999967 -0.2860724912
0.4999999983 -0.4999999967 -0.2846416417
0.4999999983 0.5000000000 -0.2846439649
-0.4285715773 -0.1785849322 -0.1431572298
-0.4285715773 0.0357003302 -0.1431577276
-0.4285715773 -0.0714280889 -0.1424995840
-0.4285715773 0.1428571735 -0.1425000818
-0.4285715773 -0.2142849306 -0.1424992521
-0.4285715773 0.0000003319 -0.1424997499
-0.4285715773 0.2142855943 -0.1425002478
-0.4285715773 -0.1428565097 -0.1424994181
-0.4285715773 0.0714287527 -0.1424999159
-0.4285715773 -0.0356995868 -0.1075565092
-0.4285715773 0.1785856756 -0.1075570070
-0.4285715773 -0.1785564282 -0.1074424931
-0.4285715773 0.0357288343 -0.1074429909
-0.4285715775 -0.0714284208 -0.2853568467
-0.4285715775 0.1428568416 -0.2853573445
-0.4285715775 -0.2142852624 -0.2853565148
-0.4285715775 0.0000000000 -0.2853570126
-0.4285715775 0.2142852624 -0.2853575104
-0.4285715775 -0.1428568416 -0.2853566807
-0.4285715775 0.0714284208 -0.2853571786
-0.4285715773 -0.0357280908 -0.1432712459
-0.4285715773 0.1785571716 -0.1432717437
0.0714284210 -0.2857144040 -0.1424990868
0.0714284210 0.2857150678 -0.1425004143
0.0714284208 -0.2857147359 -0.2853563495
0.0714284208 0.2857147359 -0.2853576770
0.3571431569 -0.3571428248 -0.1424989212
0.3571431569 -0.2142849306 -0.1424992531
0.3571431569 0.2142855943 -0.1425002488
0.3571431569 0.3571434886 -0.1425005806
0.3571431571 -0.3571424929 0.0003579204
0.3571431571 -0.2142845987 0.0003575885
0.3571431571 0.2142859262 0.0003565929
0.3571431571 0.3571438205 0.0003562610
0.3571431567 -0.3571431567 -0.2853561839
0.3571431567 -0.2142852624 -0.2853565158
0.3571431567 0.2142852624 -0.2853575114
0.3571431567 0.3571431567 -0.2853578433
0.3571431573 -0.3571421611 0.1432147620
0.3571431573 -0.2142842668 0.1432144302
0.3571431573 -0.2857137402 0.1432145961
0.3571431573 0.2857157315 0.1432132686
0.3571431573 0.2142862581 0.1432134345
0.3571431573 0.3571441524 0.1432131026
-0.2279273671 0.2437304685 0.1432133668
-0.2279273671 0.3276999419 0.1432131718
-0.2279273671 -0.3276979506 0.1432146944
-0.2279273671 -0.2437284772 0.1432144993
-0.0000000000 -0.0000000017 -0.2860713289
-0.0000000000 -0.5000000000 -0.2860701674
0.2499999992 -0.2500000008 -0.2860707485
-0.0000000000 -0.2500000008 -0.2860707482
0.1249999996 -0.3750000004 -0.2860704579
0.1249999996 -0.2500000008 -0.2860707483
-0.0000000000 -0.3750000004 -0.2860704578
0.1249999996 -0.1250000012 -0.2860710387
-0.0000000000 -0.1250000012 -0.2860710386
0.1249999996 -0.2500000008 -0.2860707483
0.2499999992 -0.5000000000 -0.2860701677
0.3749999988 -0.3750000004 -0.2860704582
0.2499999992 -0.3750000004 -0.2860704581
0.3749999988 -0.5000000000 -0.2860701678
0.1249999996 -0.3750000004 -0.2860704579
0.1249999996 -0.5000000000 -0.2860701675
0.2499999992 -0.3750000004 -0.2860704581
-0.2499999992 -0.2500000008 -0.2860707478
-0.2499999992 -0.5000000000 -0.2860701670
-0.1249999996 -0.3750000004 -0.2860704576
-0.2499999992 -0.3750000004 -0.2860704574
-0.1249999996 -0.5000000000 -0.2860701672
-0.3749999988 -0.3750000004 -0.2860704573
-0.3749999988 -0.5000000000 -0.2860701669
-0.2499999992 -0.3750000004 -0.2860704574
-0.0000000000 -0.2500000008 -0.2860707482
-0.1249999996 -0.1250000012 -0.2860710384
-0.1249999996 -0.2500000008 -0.2860707480
-0.0000000000 -0.1250000012 -0.2860710386
-0.1249999996 -0.3750000004 -0.2860704576
-0.0000000000 -0.3750000004 -0.2860704578
-0.1249999996 -0.2500000008 -0.2860707480
0.4999999983 -0.0000000017 -0.2860713296
0.2499999992 0.2499999975 -0.2860719101
0.2499999992 -0.0000000017 -0.2860713293
0.3749999988 0.1249999979 -0.2860716198
0.2499999992 0.1249999979 -0.2860716197
0.3749999988 -0.0000000017 -0.2860713294
0.1249999996 0.1249999979 -0.2860716195
0.1249999996 -0.0000000017 -0.2860713291
0.2499999992 0.1249999979 -0.2860716197
0.4999999983 0.2499999975 -0.2860719104
0.3749999988 0.3749999971 -0.2860722006
0.3749999988 0.2499999975 -0.2860719102
0.4999999983 0.3749999971 -0.2860722008
0.3749999988 0.1249999979 -0.2860716198
0.4999999983 0.1249999979 -0.2860716200
0.3749999988 0.2499999975 -0.2860719102
0.2499999992 -0.2500000008 -0.2860707485
0.4999999983 -0.2500000008 -0.2860707488
0.3749999988 -0.1250000012 -0.2860710390
0.3749999988 -0.2500000008 -0.2860707486
0.4999999983 -0.1250000012 -0.2860710392
0.3749999988 -0.3750000004 -0.2860704582
0.4999999983 -0.3750000004 -0.2860704584
0.3749999988 -0.2500000008 -0.2860707486
0.2499999992 -0.0000000017 -0.2860713293
0.1249999996 -0.1250000012 -0.2860710387
0.2499999992 -0.1250000012 -0.2860710389
0.1249999996 -0.0000000017 -0.2860713291
0.3749999988 -0.1250000012 -0.2860710390
0.3749999988 -0.0000000017 -0.2860713294
0.2499999992 -0.1250000012 -0.2860710389
-0.0000000000 -0.0000000017 -0.2860713289
-0.0000000000 0.4999999967 -0.2860724905
-0.2499999992 0.2499999975 -0.2860719094
-0.0000000000 0.2499999975 -0.2860719097
-0.1249999996 0.3749999971 -0.2860722000
-0.1249999996 0.2499999975 -0.2860719096
-0.0000000000 0.3749999971 -0.2860722001
-0.1249999996 0.1249999979 -0.2860716192
-0.0000000000 0.1249999979 -0.2860716193
-0.1249999996 0.2499999975 -0.2860719096
-0.2499999992 0.4999999967 -0.2860724902
-0.3749999988 0.3749999971 -0.2860721997
-0.2499999992 0.3749999971 -0.2860721998
-0.3749999988 0.4999999967 -0.2860724901
-0.1249999996 0.3749999971 -0.2860722000
-0.1249999996 0.4999999967 -0.2860724904
-0.2499999992 0.3749999971 -0.2860721998
0.2499999992 0.2499999975 -0.2860719101
0.2499999992 0.4999999967 -0.2860724909
0.1249999996 0.3749999971 -0.2860722003
0.2499999992 0.3749999971 -0.2860722005
0.1249999996 0.4999999967 -0.2860724907
0.3749999988 0.3749999971 -0.2860722006
0.3749999988 0.4999999967 -0.2860724910
0.2499999992 0.3749999971 -0.2860722005
-0.0000000000 0.2499999975 -0.2860719097
0.1249999996 0.1249999979 -0.2860716195
0.1249999996 0.2499999975 -0.2860719099
-0.0000000000 0.1249999979 -0.2860716193
0.1249999996 0.3749999971 -0.2860722003
-0.0000000000 0.3749999971 -0.2860722001
0.1249999996 0.2499999975 -0.2860719099
-0.4999999983 -0.0000000017 -0.2860713283
-0.2499999992 -0.2500000008 -0.2860707478
-0.2499999992 -0.0000000017 -0.2860713286
-0.3749999988 -0.1250000012 -0.2860710381
-0.2499999992 -0.1250000012 -0.2860710382
-0.3749999988 -0.0000000017 -0.2860713285
-0.1249999996 -0.1250000012 -0.2860710384
-0.1249999996 -0.0000000017 -0.2860713288
-0.2499999992 -0.1250000012 -0.2860710382
-0.4999999983 -0.2500000008 -0.2860707475
-0.3749999988 -0.3750000004 -0.2860704573
-0.3749999988 -0.2500000008 -0.2860707477
-0.4999999983 -0.3750000004 -0.2860704571
-0.3749999988 -0.1250000012 -0.2860710381
-0.4999999983 -0.1250000012 -0.2860710379
-0.3749999988 -0.2500000008 -0.2860707477
-0.2499999992 0.2499999975 -0.2860719094
-0.4999999983 0.2499999975 -0.2860719091
-0.3749999988 0.1249999979 -0.2860716189
-0.3749999988 0.2499999975 -0.2860719093
-0.4999999983 0.1249999979 -0.2860716187
-0.3749999988 0.3749999971 -0.2860721997
-0.4999999983 0.3749999971 -0.2860721995
-0.3749999988 0.2499999975 -0.2860719093
-0.2499999992 -0.0000000017 -0.2860713286
-0.1249999996 0.1249999979 -0.2860716192
-0.2499999992 0.1249999979 -0.2860716190
-0.1249999996 -0.0000000017 -0.2860713288
-0.3749999988 0.1249999979 -0.2860716189
-0.3749999988 -0.0000000017 -0.2860713285
-0.2499999992 0.1249999979 -0.2860716190
0.0000000000 0.0000000017 -0.2846428026
0.4999999983 0.0000000017 -0.2846428033
0.2499999992 -0.2499999975 -0.2846422222
0.2499999992 0.0000000017 -0.2846428030
0.3749999988 -0.1249999979 -0.2846425127
0.2499999992 -0.1249999979 -0.2846425126
0.3749999988 0.0000000017 -0.2846428031
0.1249999996 -0.1249999979 -0.2846425124
0.1249999996 0.0000000017 -0.2846428028
0.2499999992 -0.1249999979 -0.2846425126
0.4999999983 -0.2499999975 -0.2846422225
0.3749999988 -0.3749999971 -0.2846419319
0.3749999988 -0.2499999975 -0.2846422223
0.4999999983 -0.3749999971 -0.2846419321
0.3749999988 -0.1249999979 -0.2846425127
0.4999999983 -0.1249999979 -0.2846425129
0.3749999988 -0.2499999975 -0.2846422223
0.2499999992 0.2500000008 -0.2846433838
0.4999999983 0.2500000008 -0.2846433841
0.3749999988 0.1250000012 -0.2846430935
0.3749999988 0.2500000008 -0.2846433839
0.4999999983 0.1250000012 -0.2846430937
0.3749999988 0.3750000004 -0.2846436743
0.4999999983 0.3750000004 -0.2846436745
0.3749999988 0.2500000008 -0.2846433839
0.2499999992 0.0000000017 -0.2846428030
0.1249999996 0.1250000012 -0.2846430932
0.2499999992 0.1250000012 -0.2846430934
0.1249999996 0.0000000017 -0.2846428028
0.3749999988 0.1250000012 -0.2846430935
0.3749999988 0.0000000017 -0.2846428031
0.2499999992 0.1250000012 -0.2846430934
0.0000000000 -0.4999999967 -0.2846416410
-0.2499999992 -0.2499999975 -0.2846422215
0.0000000000 -0.2499999975 -0.2846422218
-0.1249999996 -0.3749999971 -0.2846419313
-0.1249999996 -0.2499999975 -0.2846422217
0.0000000000 -0.3749999971 -0.2846419314
-0.1249999996 -0.1249999979 -0.2846425121
0.0000000000 -0.1249999979 -0.2846425122
-0.1249999996 -0.2499999975 -0.2846422217
-0.2499999992 -0.4999999967 -0.2846416407
-0.3749999988 -0.3749999971 -0.2846419310
-0.2499999992 -0.3749999971 -0.2846419311
-0.3749999988 -0.4999999967 -0.2846416406
-0.1249999996 -0.3749999971 -0.2846419313
-0.1249999996 -0.4999999967 -0.2846416409
-0.2499999992 -0.3749999971 -0.2846419311
0.2499999992 -0.2499999975 -0.2846422222
0.2499999992 -0.4999999967 -0.2846416414
0.1249999996 -0.3749999971 -0.2846419316
0.2499999992 -0.3749999971 -0.2846419318
0.1249999996 -0.4999999967 -0.2846416412
0.3749999988 -0.3749999971 -0.2846419319
0.3749999988 -0.4999999967 -0.2846416415
0.2499999992 -0.3749999971 -0.2846419318
0.0000000000 -0.2499999975 -0.2846422218
0.1249999996 -0.1249999979 -0.2846425124
0.1249999996 -0.2499999975 -0.2846422220
0.0000000000 -0.1249999979 -0.2846425122
0.1249999996 -0.3749999971 -0.2846419316
0.0000000000 -0.3749999971 -0.2846419314
0.1249999996 -0.2499999975 -0.2846422220
0.0000000000 0.0000000017 -0.2846428026
-0.4999999983 0.0000000017 -0.2846428020
-0.2499999992 0.2500000008 -0.2846433831
-0.2499999992 0.0000000017 -0.2846428023
-0.3749999988 0.1250000012 -0.2846430926
-0.2499999992 0.1250000012 -0.2846430927
-0.3749999988 0.0000000017 -0.2846428022
-0.1249999996 0.1250000012 -0.2846430929
-0.1249999996 0.0000000017 -0.2846428025
-0.2499999992 0.1250000012 -0.2846430927
-0.4999999983 0.2500000008 -0.2846433828
-0.3749999988 0.3750000004 -0.2846436734
-0.3749999988 0.2500000008 -0.2846433830
-0.4999999983 0.3750000004 -0.2846436732
-0.3749999988 0.1250000012 -0.2846430926
-0.4999999983 0.1250000012 -0.2846430924
-0.3749999988 0.2500000008 -0.2846433830
-0.2499999992 -0.2499999975 -0.2846422215
-0.4999999983 -0.2499999975 -0.2846422212
-0.3749999988 -0.1249999979 -0.2846425118
-0.3749999988 -0.2499999975 -0.2846422214
-0.4999999983 -0.1249999979 -0.2846425116
-0.3749999988 -0.3749999971 -0.2846419310
-0.4999999983 -0.3749999971 -0.2846419308
-0.3749999988 -0.2499999975 -0.2846422214
-0.2499999992 0.0000000017 -0.2846428023
-0.1249999996 -0.1249999979 -0.2846425121
-0.2499999992 -0.1249999979 -0.2846425119
-0.1249999996 0.0000000017 -0.2846428025
-0.3749999988 -0.1249999979 -0.2846425118
-0.3749999988 0.0000000017 -0.2846428022
-0.2499999992 -0.1249999979 -0.2846425119
0.0000000000 0.5000000000 -0.2846439642
0.2499999992 0.2500000008 -0.2846433838
0.0000000000 0.2500000008 -0.2846433834
0.1249999996 0.3750000004 -0.2846436740
0.1249999996 0.2500000008 -0.2846433836
0.0000000000 0.3750000004 -0.2846436738
0.1249999996 0.1250000012 -0.2846430932
0.0000000000 0.1250000012 -0.2846430930
0.1249999996 0.2500000008 -0.2846433836
0.2499999992 0.5000000000 -0.2846439646
0.3749999988 0.3750000004 -0.2846436743
0.2499999992 0.3750000004 -0.2846436742
0.3749999988 0.5000000000 -0.2846439647
0.1249999996 0.3750000004 -0.2846436740
0.1249999996 0.5000000000 -0.2846439644
0.2499999992 0.3750000004 -0.2846436742
-0.2499999992 0.2500000008 -0.2846433831
-0.2499999992 0.5000000000 -0.2846439639
-0.1249999996 0.3750000004 -0.2846436737
-0.2499999992 0.3750000004 -0.2846436735
-0.1249999996 0.5000000000 -0.2846439641
-0.3749999988 0.3750000004 -0.2846436734
-0.3749999988 0.5000000000 -0.2846439638
-0.2499999992 0.3750000004 -0.2846436735
0.0000000000 0.2500000008 -0.2846433834
-0.1249999996 0.1250000012 -0.2846430929
-0.1249999996 0.2500000008 -0.2846433833
0.0000000000 0.1250000012 -0.2846430930
-0.1249999996 0.3750000004 -0.2846436737
0.0000000000 0.3750000004 -0.2846436738
-0.1249999996 0.2500000008 -0.2846433833
0.0624999998 -0.3125000006 -0.2860706030
0.1874999994 -0.3125000006 -0.2860706032
0.0624999998 -0.4375000002 -0.2860703126
0.0624999998 -0.3125000006 -0.2860706030
0.0624999998 -0.1875000010 -0.2860708934
0.0624999998 -0.0625000015 -0.2860711838
0.1874999994 -0.1875000010 -0.2860708936
0.0624999998 -0.1875000010 -0.2860708934
0.3124999990 -0.4375000002 -0.2860703130
0.3124999990 -0.3125000006 -0.2860706033
0.4374999985 -0.4375000002 -0.2860703131
0.3124999990 -0.4375000002 -0.2860703130
0.1874999994 -0.4375000002 -0.2860703128
0.0624999998 -0.4375000002 -0.2860703126
0.1874999994 -0.3125000006 -0.2860706032
0.1874999994 -0.4375000002 -0.2860703128
-0.1874999994 -0.4375000002 -0.2860703123
-0.1874999994 -0.3125000006 -0.2860706027
-0.0624999998 -0.4375000002 -0.2860703125
-0.1874999994 -0.4375000002 -0.2860703123
-0.3124999990 -0.4375000002 -0.2860703122
-0.4374999986 -0.4375000002 -0.2860703120
-0.3124999990 -0.3125000006 -0.2860706026
-0.3124999990 -0.4375000002 -0.2860703122
-0.0624999998 -0.1875000010 -0.2860708933
-0.1874999994 -0.1875000010 -0.2860708931
-0.0624999998 -0.0625000015 -0.2860711837
-0.0624999998 -0.1875000010 -0.2860708933
-0.0624999998 -0.3125000006 -0.2860706029
-0.0624999998 -0.4375000002 -0.2860703125
-0.1874999994 -0.3125000006 -0.2860706027
-0.0624999998 -0.3125000006 -0.2860706029
0.3124999990 0.0624999981 -0.2860714745
0.3124999990 0.1874999977 -0.2860717649
0.4374999985 0.0624999981 -0.2860714747
0.3124999990 0.0624999981 -0.2860714745
0.1874999994 0.0624999981 -0.2860714744
0.0624999998 0.0624999981 -0.2860714742
0.1874999994 0.1874999977 -0.2860717648
0.1874999994 0.0624999981 -0.2860714744
0.4374999985 0.3124999973 -0.2860720555
0.3124999990 0.3124999973 -0.2860720553
0.4374999985 0.4374999969 -0.2860723459
0.4374999985 0.3124999973 -0.2860720555
0.4374999985 0.1874999977 -0.2860717651
0.4374999985 0.0624999981 -0.2860714747
0.3124999990 0.1874999977 -0.2860717649
0.4374999985 0.1874999977 -0.2860717651
0.4374999985 -0.1875000010 -0.2860708939
0.3124999990 -0.1875000010 -0.2860708937
0.4374999985 -0.0625000015 -0.2860711843
0.4374999985 -0.1875000010 -0.2860708939
0.4374999985 -0.3125000006 -0.2860706035
0.4374999985 -0.4375000002 -0.2860703131
0.3124999990 -0.3125000006 -0.2860706033
0.4374999985 -0.3125000006 -0.2860706035
0.1874999994 -0.0625000015 -0.2860711840
0.1874999994 -0.1875000010 -0.2860708936
0.0624999998 -0.0625000015 -0.2860711838
0.1874999994 -0.0625000015 -0.2860711840
0.3124999990 -0.0625000015 -0.2860711841
0.4374999985 -0.0625000015 -0.2860711843
0.3124999990 -0.1875000010 -0.2860708937
0.3124999990 -0.0625000015 -0.2860711841
-0.0624999998 0.3124999973 -0.2860720549
-0.1874999994 0.3124999973 -0.2860720547
-0.0624999998 0.4374999969 -0.2860723453
-0.0624999998 0.3124999973 -0.2860720549
-0.0624999998 0.1874999977 -0.2860717645
-0.0624999998 0.0624999981 -0.2860714741
-0.1874999994 0.1874999977 -0.2860717643
-0.0624999998 0.1874999977 -0.2860717645
-0.3124999990 0.4374999969 -0.2860723449
-0.3124999990 0.3124999973 -0.2860720545
-0.4374999986 0.4374999969 -0.2860723448
-0.3124999990 0.4374999969 -0.2860723449
-0.1874999994 0.4374999969 -0.2860723451
-0.0624999998 0.4374999969 -0.2860723453
-0.1874999994 0.3124999973 -0.2860720547
-0.1874999994 0.4374999969 -0.2860723451
0.1874999994 0.4374999969 -0.2860723456
0.1874999994 0.3124999973 -0.2860720552
0.0624999998 0.4374999969 -0.2860723454
0.1874999994 0.4374999969 -0.2860723456
0.3124999990 0.4374999969 -0.2860723457
0.4374999985 0.4374999969 -0.2860723459
0.3124999990 0.3124999973 -0.2860720553
0.3124999990 0.4374999969 -0.2860723457
0.0624999998 0.1874999977 -0.2860717646
0.1874999994 0.1874999977 -0.2860717648
0.0624999998 0.0624999981 -0.2860714742
0.0624999998 0.1874999977 -0.2860717646
0.0624999998 0.3124999973 -0.2860720550
0.0624999998 0.4374999969 -0.2860723454
0.1874999994 0.3124999973 -0.2860720552
0.0624999998 0.3124999973 -0.2860720550
-0.3124999990 -0.0625000015 -0.2860711834
-0.3124999990 -0.1875000010 -0.2860708930
-0.4374999986 -0.0625000015 -0.2860711832
-0.3124999990 -0.0625000015 -0.2860711834
-0.1874999994 -0.0625000015 -0.2860711835
-0.0624999998 -0.0625000015 -0.2860711837
-0.1874999994 -0.1875000010 -0.2860708931
-0.1874999994 -0.0625000015 -0.2860711835
-0.4374999986 -0.3125000006 -0.2860706024
-0.3124999990 -0.3125000006 -0.2860706026
-0.4374999986 -0.4375000002 -0.2860703120
-0.4374999986 -0.3125000006 -0.2860706024
-0.4374999986 -0.1875000010 -0.2860708928
-0.4374999986 -0.0625000015 -0.2860711832
-0.3124999990 -0.1875000010 -0.2860708930
-0.4374999986 -0.1875000010 -0.2860708928
-0.4374999986 0.1874999977 -0.2860717640
-0.3124999990 0.1874999977 -0.2860717642
-0.4374999986 0.0624999981 -0.2860714736
-0.4374999986 0.1874999977 -0.2860717640
-0.4374999986 0.3124999973 -0.2860720544
-0.4374999986 0.4374999969 -0.2860723448
-0.3124999990 0.3124999973 -0.2860720545
-0.4374999986 0.3124999973 -0.2860720544
-0.1874999994 0.0624999981 -0.2860714739
-0.1874999994 0.1874999977 -0.2860717643
-0.0624999998 0.0624999981 -0.2860714741
-0.1874999994 0.0624999981 -0.2860714739
-0.3124999990 0.0624999981 -0.2860714738
-0.4374999986 0.0624999981 -0.2860714736
-0.3124999990 0.1874999977 -0.2860717642
-0.3124999990 0.0624999981 -0.2860714738
0.3124999990 -0.0624999981 -0.2846426578
0.3124999990 -0.1874999977 -0.2846423674
0.4374999986 -0.0624999981 -0.2846426580
0.3124999990 -0.0624999981 -0.2846426578
0.1874999994 -0.0624999981 -0.2846426577
0.0624999998 -0.0624999981 -0.2846426575
0.1874999994 -0.1874999977 -0.2846423673
0.1874999994 -0.0624999981 -0.2846426577
0.4374999986 -0.3124999973 -0.2846420772
0.3124999990 -0.3124999973 -0.2846420770
0.4374999986 -0.4374999969 -0.2846417868
0.4374999986 -0.3124999973 -0.2846420772
0.4374999986 -0.1874999977 -0.2846423676
0.4374999986 -0.0624999981 -0.2846426580
0.3124999990 -0.1874999977 -0.2846423674
0.4374999986 -0.1874999977 -0.2846423676
0.4374999986 0.1875000010 -0.2846432388
0.3124999990 0.1875000010 -0.2846432386
0.4374999986 0.0625000015 -0.2846429484
0.4374999986 0.1875000010 -0.2846432388
0.4374999986 0.3125000006 -0.2846435292
0.4374999986 0.4375000002 -0.2846438196
0.3124999990 0.3125000006 -0.2846435290
0.4374999986 0.3125000006 -0.2846435292
0.1874999994 0.0625000015 -0.2846429481
0.1874999994 0.1875000010 -0.2846432385
0.0624999998 0.0625000015 -0.2846429479
0.1874999994 0.0625000015 -0.2846429481
0.3124999990 0.0625000015 -0.2846429482
0.4374999986 0.0625000015 -0.2846429484
0.3124999990 0.1875000010 -0.2846432386
0.3124999990 0.0625000015 -0.2846429482
-0.0624999998 -0.3124999973 -0.2846420766
-0.1874999994 -0.3124999973 -0.2846420764
-0.0624999998 -0.4374999969 -0.2846417862
-0.0624999998 -0.3124999973 -0.2846420766
-0.0624999998 -0.1874999977 -0.2846423670
-0.0624999998 -0.0624999981 -0.2846426574
-0.1874999994 -0.1874999977 -0.2846423668
-0.0624999998 -0.1874999977 -0.2846423670
-0.3124999990 -0.4374999969 -0.2846417858
-0.3124999990 -0.3124999973 -0.2846420762
-0.4374999985 -0.4374999969 -0.2846417857
-0.3124999990 -0.4374999969 -0.2846417858
-0.1874999994 -0.4374999969 -0.2846417860
-0.0624999998 -0.4374999969 -0.2846417862
-0.1874999994 -0.3124999973 -0.2846420764
-0.1874999994 -0.4374999969 -0.2846417860
0.1874999994 -0.4374999969 -0.2846417865
0.1874999994 -0.3124999973 -0.2846420769
0.0624999998 -0.4374999969 -0.2846417863
0.1874999994 -0.4374999969 -0.2846417865
0.3124999990 -0.4374999969 -0.2846417866
0.4374999986 -0.4374999969 -0.2846417868
0.3124999990 -0.3124999973 -0.2846420770
0.3124999990 -0.4374999969 -0.2846417866
0.0624999998 -0.1874999977 -0.2846423671
0.1874999994 -0.1874999977 -0.2846423673
0.0624999998 -0.0624999981 -0.2846426575
0.0624999998 -0.1874999977 -0.2846423671
0.0624999998 -0.3124999973 -0.2846420767
0.0624999998 -0.4374999969 -0.2846417863
0.1874999994 -0.3124999973 -0.2846420769
0.0624999998 -0.3124999973 -0.2846420767
-0.3124999990 0.0625000015 -0.2846429474
-0.3124999990 0.1875000010 -0.2846432378
-0.4374999985 0.0625000015 -0.2846429473
-0.3124999990 0.0625000015 -0.2846429474
-0.1874999994 0.0625000015 -0.2846429476
-0.0624999998 0.0625000015 -0.2846429478
-0.1874999994 0.1875000010 -0.2846432380
-0.1874999994 0.0625000015 -0.2846429476
-0.4374999985 0.3125000006 -0.2846435281
-0.3124999990 0.3125000006 -0.2846435282
-0.4374999985 0.4375000002 -0.2846438185
-0.4374999985 0.3125000006 -0.2846435281
-0.4374999985 0.1875000010 -0.2846432377
-0.4374999985 0.0625000015 -0.2846429473
-0.3124999990 0.1875000010 -0.2846432378
-0.4374999985 0.1875000010 -0.2846432377
-0.4374999985 -0.1874999977 -0.2846423665
-0.3124999990 -0.1874999977 -0.2846423666
-0.4374999985 -0.0624999981 -0.2846426569
-0.4374999985 -0.1874999977 -0.2846423665
-0.4374999985 -0.3124999973 -0.2846420761
-0.4374999985 -0.4374999969 -0.2846417857
-0.3124999990 -0.3124999973 -0.2846420762
-0.4374999985 -0.3124999973 -0.2846420761
-0.1874999994 -0.0624999981 -0.2846426572
-0.1874999994 -0.1874999977 -0.2846423668
-0.0624999998 -0.0624999981 -0.2846426574
-0.1874999994 -0.0624999981 -0.2846426572
-0.3124999990 -0.0624999981 -0.2846426570
-0.4374999985 -0.0624999981 -0.2846426569
-0.3124999990 -0.1874999977 -0.2846423666
-0.3124999990 -0.0624999981 -0.2846426570
0.0624999998 0.3125000006 -0.2846435287
0.1874999994 0.3125000006 -0.2846435289
0.0624999998 0.4375000002 -0.2846438191
0.0624999998 0.3125000006 -0.2846435287
0.0624999998 0.1875000010 -0.2846432383
0.0624999998 0.0625000015 -0.2846429479
0.1874999994 0.1875000010 -0.2846432385
0.0624999998 0.1875000010 -0.2846432383
0.3124999990 0.4375000002 -0.2846438194
0.3124999990 0.3125000006 -0.2846435290
0.4374999986 0.4375000002 -0.2846438196
0.3124999990 0.4375000002 -0.2846438194
0.1874999994 0.4375000002 -0.2846438193
0.0624999998 0.4375000002 -0.2846438191
0.1874999994 0.3125000006 -0.2846435289
0.1874999994 0.4375000002 -0.2846438193
-0.1874999994 0.4375000002 -0.2846438188
-0.1874999994 0.3125000006 -0.2846435284
-0.0624999998 0.4375000002 -0.2846438190
-0.1874999994 0.4375000002 -0.2846438188
-0.3124999990 0.4375000002 -0.2846438186
-0.4374999985 0.4375000002 -0.2846438185
-0.3124999990 0.3125000006 -0.2846435282
-0.3124999990 0.4375000002 -0.2846438186
-0.0624999998 0.1875000010 -0.2846432382
-0.1874999994 0.1875000010 -0.2846432380
-0.0624999998 0.0625000015 -0.2846429478
-0.0624999998 0.1875000010 -0.2846432382
-0.0624999998 0.3125000006 -0.2846435286
-0.0624999998 0.4375000002 -0.2846438190
-0.1874999994 0.3125000006 -0.2846435284
-0.0624999998 0.3125000006 -0.2846435286
-0.2857142095 -0.2142850965 -0.2139278836
-0.2857142095 -0.2142850965 -0.2139278836
-0.2857142096 -0.2857142096 -0.2853563490
-0.2857142096 -0.2857142096 -0.2853563490
-0.2142852624 -0.2857140436 -0.2139277178
-0.2142852624 -0.2857140436 -0.2139277178
-0.2857142094 -0.2857138777 -0.1424990863
-0.2857142094 -0.2857138777 -0.1424990863
-0.3571431566 -0.2857140436 -0.2139277176
-0.3571431566 -0.2857140436 -0.2139277176
-0.2857142095 -0.3571429908 -0.2139275517
-0.2857142095 -0.3571429908 -0.2139275517
-0.2857142093 -0.2142847646 -0.0710708315
-0.2857142093 -0.2142847646 -0.0710708315
-0.2857142094 -0.2857138777 -0.1424990863
-0.2857142094 -0.2857138777 -0.1424990863
-0.2142852622 -0.2857137118 -0.0710706656
-0.2142852622 -0.2857137118 -0.0710706656
-0.2857142092 -0.2857135458 0.0003577553
-0.2857142092 -0.2857135458 0.0003577553
-0.3571431564 -0.2857137118 -0.0710706654
-0.3571431564 -0.2857137118 -0.0710706654
-0.2857142093 -0.3571426589 -0.0710704996
-0.2857142093 -0.3571426589 -0.0710704996
-0.2857142091 -0.2142844327 0.0717860102
-0.2857142091 -0.2142844327 0.0717860102
-0.2857142092 -0.2857135458 0.0003577553
-0.2857142092 -0.2857135458 0.0003577553
-0.2142852620 -0.2857133799 0.0717861760
-0.2142852620 -0.2857133799 0.0717861760
-0.2857142090 -0.2857132139 0.1432145969
-0.2857142090 -0.2857132139 0.1432145969
-0.3571431563 -0.2857133799 0.0717861762
-0.3571431563 -0.2857133799 0.0717861762
-0.2857142091 -0.3571423270 0.0717863420
-0.2857142091 -0.3571423270 0.0717863420
-0.2857142095 0.3571433227 -0.2139292112
-0.2857142095 0.3571433227 -0.2139292112
-0.2857142096 0.2857142096 -0.2853576766
-0.2857142096 0.2857142096 -0.2853576766
-0.2142852624 0.2857143755 -0.2139290453
-0.2142852624 0.2857143755 -0.2139290453
-0.2857142094 0.2857145415 -0.1425004139
-0.2857142094 0.2857145415 -0.1425004139
-0.3571431566 0.2857143755 -0.2139290451
-0.3571431566 0.2857143755 -0.2139290451
-0.2857142095 0.2142854284 -0.2139288793
-0.2857142095 0.2142854284 -0.2139288793
-0.2857142093 0.3571436545 -0.0710721590
-0.2857142093 0.3571436545 -0.0710721590
-0.2857142094 0.2857145415 -0.1425004139
-0.2857142094 0.2857145415 -0.1425004139
-0.2142852622 0.2857147074 -0.0710719932
-0.2142852622 0.2857147074 -0.0710719932
-0.2857142092 0.2857148733 0.0003564277
-0.2857142092 0.2857148733 0.0003564277
-0.3571431564 0.2857147074 -0.0710719930
-0.3571431564 0.2857147074 -0.0710719930
-0.2857142093 0.2142857603 -0.0710718271
-0.2857142093 0.2142857603 -0.0710718271
-0.2857142091 0.3571439864 0.0717846826
-0.2857142091 0.3571439864 0.0717846826
-0.2857142092 0.2857148733 0.0003564277
-0.2857142092 0.2857148733 0.0003564277
-0.2142852620 0.2857150393 0.0717848485
-0.2142852620 0.2857150393 0.0717848485
-0.2857142090 0.2857152052 0.1432132694
-0.2857142090 0.2857152052 0.1432132694
-0.3571431563 0.2857150393 0.0717848487
-0.3571431563 0.2857150393 0.0717848487
-0.2857142091 0.2142860922 0.0717850145
-0.2857142091 0.2142860922 0.0717850145
0.2857142097 0.3571433227 -0.2139292119
0.2857142097 0.3571433227 -0.2139292119
0.2857142096 0.2857142096 -0.2853576773
0.2857142096 0.2857142096 -0.2853576773
0.3571431568 0.2857143755 -0.2139290460
0.3571431568 0.2857143755 -0.2139290460
0.2857142098 0.2857145415 -0.1425004146
0.2857142098 0.2857145415 -0.1425004146
0.2142852625 0.2857143755 -0.2139290459
0.2142852625 0.2857143755 -0.2139290459
0.2857142097 0.2142854284 -0.2139288800
0.2857142097 0.2142854284 -0.2139288800
0.2857142099 0.3571436545 -0.0710721597
0.2857142099 0.3571436545 -0.0710721597
0.2857142098 0.2857145415 -0.1425004146
0.2857142098 0.2857145415 -0.1425004146
0.3571431570 0.2857147074 -0.0710719939
0.3571431570 0.2857147074 -0.0710719939
0.2857142099 0.2857148733 0.0003564270
0.2857142099 0.2857148733 0.0003564270
0.2142852627 0.2857147074 -0.0710719937
0.2142852627 0.2857147074 -0.0710719937
0.2857142099 0.2142857603 -0.0710718279
0.2857142099 0.2142857603 -0.0710718279
0.2857142100 0.3571439864 0.0717846819
0.2857142100 0.3571439864 0.0717846819
0.2857142099 0.2857148733 0.0003564270
0.2857142099 0.2857148733 0.0003564270
0.3571431572 0.2857150393 0.0717848477
0.3571431572 0.2857150393 0.0717848477
0.2857142101 0.2857152052 0.1432132687
0.2857142101 0.2857152052 0.1432132687
0.2142852629 0.2857150393 0.0717848479
0.2142852629 0.2857150393 0.0717848479
0.2857142100 0.2142860922 0.0717850138
0.2857142100 0.2142860922 0.0717850138
0.2857142097 -0.2142850965 -0.2139278844
0.2857142097 -0.2142850965 -0.2139278844
0.2857142096 -0.2857142096 -0.2853563498
0.2857142096 -0.2857142096 -0.2853563498
0.3571431568 -0.2857140436 -0.2139277185
0.3571431568 -0.2857140436 -0.2139277185
0.2857142098 -0.2857138777 -0.1424990871
0.2857142098 -0.2857138777 -0.1424990871
0.2142852625 -0.2857140436 -0.2139277183
0.2142852625 -0.2857140436 -0.2139277183
0.2857142097 -0.3571429908 -0.2139275525
0.2857142097 -0.3571429908 -0.2139275525
0.2857142099 -0.2142847646 -0.0710708322
0.2857142099 -0.2142847646 -0.0710708322
0.2857142098 -0.2857138777 -0.1424990871
0.2857142098 -0.2857138777 -0.1424990871
0.3571431570 -0.2857137118 -0.0710706663
0.3571431570 -0.2857137118 -0.0710706663
0.2857142099 -0.2857135458 0.0003577546
0.2857142099 -0.2857135458 0.0003577546
0.2142852627 -0.2857137118 -0.0710706662
0.2142852627 -0.2857137118 -0.0710706662
0.2857142099 -0.3571426589 -0.0710705003
0.2857142099 -0.3571426589 -0.0710705003
0.2857142100 -0.2142844327 0.0717860094
0.2857142100 -0.2142844327 0.0717860094
0.2857142099 -0.2857135458 0.0003577546
0.2857142099 -0.2857135458 0.0003577546
0.3571431572 -0.2857133799 0.0717861753
0.3571431572 -0.2857133799 0.0717861753
0.2857142101 -0.2857132139 0.1432145962
0.2857142101 -0.2857132139 0.1432145962
0.2142852629 -0.2857133799 0.0717861755
0.2142852629 -0.2857133799 0.0717861755
0.2857142100 -0.3571423270 0.0717863413
0.2857142100 -0.3571423270 0.0717863413
0.3571431042 0.0000001659 -0.2139283823
0.3571431042 0.0000001659 -0.2139283823
0.3571431042 -0.0714282549 -0.2139282163
0.3571431042 -0.0714282549 -0.2139282163
0.3571431043 -0.1071280075 -0.1074995022
0.3571431043 -0.1071280075 -0.1074995022
0.3571431043 -0.1071565115 -0.1432142388
0.3571431043 -0.1071565115 -0.1432142388
0.3571431042 -0.1428566757 -0.2139280504
0.3571431042 -0.1428566757 -0.2139280504
0.3571431042 -0.2142850965 -0.2139278844
0.3571431042 -0.2142850965 -0.2139278844
0.3571431042 0.2142854284 -0.2139288801
0.3571431042 0.2142854284 -0.2139288801
0.3571431042 0.1428570076 -0.2139287142
0.3571431042 0.1428570076 -0.2139287142
0.3571431043 0.1071572549 -0.1075000000
0.3571431043 0.1071572549 -0.1075000000
0.3571431043 0.1071287509 -0.1432147367
0.3571431043 0.1071287509 -0.1432147367
0.3571431042 0.0714285868 -0.2139285482
0.3571431042 0.0714285868 -0.2139285482
0.3571431042 0.0000001659 -0.2139283823
0.3571431042 0.0000001659 -0.2139283823
-0.3571431566 0.0000001659 -0.2139283814
-0.3571431566 0.0000001659 -0.2139283814
-0.3571431566 -0.0714282549 -0.2139282154
-0.3571431566 -0.0714282549 -0.2139282154
-0.3571431565 -0.1071280075 -0.1074995013
-0.3571431565 -0.1071280075 -0.1074995013
-0.3571431565 -0.1071565115 -0.1432142379
-0.3571431565 -0.1071565115 -0.1432142379
-0.3571431566 -0.1428566757 -0.2139280495
-0.3571431566 -0.1428566757 -0.2139280495
-0.3571431566 -0.2142850965 -0.2139278835
-0.3571431566 -0.2142850965 -0.2139278835
-0.3571431566 0.2142854284 -0.2139288792
-0.3571431566 0.2142854284 -0.2139288792
-0.3571431566 0.1428570076 -0.2139287133
-0.3571431566 0.1428570076 -0.2139287133
-0.3571431565 0.1071572549 -0.1074999991
-0.3571431565 0.1071572549 -0.1074999991
-0.3571431565 0.1071287509 -0.1432147357
-0.3571431565 0.1071287509 -0.1432147357
-0.3571431566 0.0714285868 -0.2139285473
-0.3571431566 0.0714285868 -0.2139285473
-0.3571431566 0.0000001659 -0.2139283814
-0.3571431566 0.0000001659 -0.2139283814
0.0000000001 -0.2857145700 -0.2139277181
0.0000000001 -0.2857145700 -0.2139277181
0.0000000001 -0.2857145700 -0.2139277181
0.0000000001 -0.2857145700 -0.2139277181
-0.1428568415 -0.2857145700 -0.2139277179
-0.1428568415 -0.2857145700 -0.2139277179
-0.1428568415 -0.2857145700 -0.2139277179
-0.1428568415 -0.2857145700 -0.2139277179
0.1428568417 -0.2857145700 -0.2139277182
0.1428568417 -0.2857145700 -0.2139277182
0.1428568417 -0.2857145700 -0.2139277182
0.1428568417 -0.2857145700 -0.2139277182
0.0000000001 0.2857149018 -0.2139290456
0.0000000001 0.2857149018 -0.2139290456
0.0000000001 0.2857149018 -0.2139290456
0.0000000001 0.2857149018 -0.2139290456
-0.1428568415 0.2857149018 -0.2139290454
-0.1428568415 0.2857149018 -0.2139290454
-0.1428568415 0.2857149018 -0.2139290454
-0.1428568415 0.2857149018 -0.2139290454
0.1428568417 0.2857149018 -0.2139290458
0.1428568417 0.2857149018 -0.2139290458
0.1428568417 0.2857149018 -0.2139290458
0.1428568417 0.2857149018 -0.2139290458
-0.2857142096 -0.2142852624 -0.2853565150
-0.2142852624 -0.2142850965 -0.2139278837
-0.2857142094 -0.2142849306 -0.1424992523
-0.3571431566 -0.2142850965 -0.2139278835
-0.2857142096 -0.3571431567 -0.2853561831
-0.2142852624 -0.2857142096 -0.2853563491
-0.2857142096 -0.2142852624 -0.2853565150
-0.3571431567 -0.2857142096 -0.2853563489
-0.2142852624 -0.2142850965 -0.2139278837
-0.2142852624 -0.2857142096 -0.2853563491
-0.2142852624 -0.3571429908 -0.2139275518
-0.2142852623 -0.2857138777 -0.1424990864
-0.2142852623 -0.2857138777 -0.1424990864
-0.2857142094 -0.3571428248 -0.1424989204
-0.3571431565 -0.2857138777 -0.1424990863
-0.2857142094 -0.2142849306 -0.1424992523
-0.3571431566 -0.3571429908 -0.2139275517
-0.3571431567 -0.2857142096 -0.2853563489
-0.3571431566 -0.2142850965 -0.2139278835
-0.3571431565 -0.2857138777 -0.1424990863
-0.2142852624 -0.3571429908 -0.2139275518
-0.2857142096 -0.3571431567 -0.2853561831
-0.3571431566 -0.3571429908 -0.2139275517
-0.2857142094 -0.3571428248 -0.1424989204
-0.2857142094 -0.2142849306 -0.1424992523
-0.2142852622 -0.2142847646 -0.0710708316
-0.2857142092 -0.2142845987 0.0003575893
-0.3571431564 -0.2142847646 -0.0710708314
-0.2857142094 -0.3571428248 -0.1424989204
-0.2142852623 -0.2857138777 -0.1424990864
-0.2857142094 -0.2142849306 -0.1424992523
-0.3571431565 -0.2857138777 -0.1424990863
-0.2142852622 -0.2142847646 -0.0710708316
-0.2142852623 -0.2857138777 -0.1424990864
-0.2142852622 -0.3571426589 -0.0710704997
-0.2142852621 -0.2857135458 0.0003577552
-0.2142852621 -0.2857135458 0.0003577552
-0.2857142092 -0.3571424929 0.0003579212
-0.3571431563 -0.2857135458 0.0003577554
-0.2857142092 -0.2142845987 0.0003575893
-0.3571431564 -0.3571426589 -0.0710704995
-0.3571431565 -0.2857138777 -0.1424990863
-0.3571431564 -0.2142847646 -0.0710708314
-0.3571431563 -0.2857135458 0.0003577554
-0.2142852622 -0.3571426589 -0.0710704997
-0.2857142094 -0.3571428248 -0.1424989204
-0.3571431564 -0.3571426589 -0.0710704995
-0.2857142092 -0.3571424929 0.0003579212
-0.2857142092 -0.2142845987 0.0003575893
-0.2142852620 -0.2142844327 0.0717860101
-0.2857142090 -0.2142842668 0.1432144310
-0.3571431563 -0.2142844327 0.0717860102
-0.2857142092 -0.3571424929 0.0003579212
-0.2142852621 -0.2857135458 0.0003577552
-0.2857142092 -0.2142845987 0.0003575893
-0.3571431563 -0.2857135458 0.0003577554
-0.2142852620 -0.2142844327 0.0717860101
-0.2142852621 -0.2857135458 0.0003577552
-0.2142852620 -0.3571423270 0.0717863420
-0.2142852619 -0.2857132139 0.1432145968
-0.2142852619 -0.2857132139 0.1432145968
-0.2857142090 -0.3571421611 0.1432147629
-0.3571431562 -0.2857132139 0.1432145970
-0.2857142090 -0.2142842668 0.1432144310
-0.3571431563 -0.3571423270 0.0717863421
-0.3571431563 -0.2857135458 0.0003577554
-0.3571431563 -0.2142844327 0.0717860102
-0.3571431562 -0.2857132139 0.1432145970
-0.2142852620 -0.3571423270 0.0717863420
-0.2857142092 -0.3571424929 0.0003579212
-0.3571431563 -0.3571423270 0.0717863421
-0.2857142090 -0.3571421611 0.1432147629
-0.2857142096 0.3571431567 -0.2853578425
-0.2142852624 0.3571433227 -0.2139292113
-0.2857142094 0.3571434886 -0.1425005798
-0.3571431566 0.3571433227 -0.2139292111
-0.2857142096 0.2142852624 -0.2853575106
-0.2142852624 0.2857142096 -0.2853576767
-0.2857142096 0.3571431567 -0.2853578425
-0.3571431567 0.2857142096 -0.2853576765
-0.2142852624 0.3571433227 -0.2139292113
-0.2142852624 0.2857142096 -0.2853576767
-0.2142852624 0.2142854284 -0.2139288794
-0.2142852623 0.2857145415 -0.1425004140
-0.2142852623 0.2857145415 -0.1425004140
-0.2857142094 0.2142855943 -0.1425002479
-0.3571431565 0.2857145415 -0.1425004138
-0.2857142094 0.3571434886 -0.1425005798
-0.3571431566 0.2142854284 -0.2139288792
-0.3571431567 0.2857142096 -0.2853576765
-0.3571431566 0.3571433227 -0.2139292111
-0.3571431565 0.2857145415 -0.1425004138
-0.2142852624 0.2142854284 -0.2139288794
-0.2857142096 0.2142852624 -0.2853575106
-0.3571431566 0.2142854284 -0.2139288792
-0.2857142094 0.2142855943 -0.1425002479
-0.2857142094 0.3571434886 -0.1425005798
-0.2142852622 0.3571436545 -0.0710721591
-0.2857142092 0.3571438205 0.0003562618
-0.3571431564 0.3571436545 -0.0710721589
-0.2857142094 0.2142855943 -0.1425002479
-0.2142852623 0.2857145415 -0.1425004140
-0.2857142094 0.3571434886 -0.1425005798
-0.3571431565 0.2857145415 -0.1425004138
-0.2142852622 0.3571436545 -0.0710721591
-0.2142852623 0.2857145415 -0.1425004140
-0.2142852622 0.2142857603 -0.0710718272
-0.2142852621 0.2857148733 0.0003564277
-0.2142852621 0.2857148733 0.0003564277
-0.2857142092 0.2142859262 0.0003565937
-0.3571431563 0.2857148733 0.0003564278
-0.2857142092 0.3571438205 0.0003562618
-0.3571431564 0.2142857603 -0.0710718270
-0.3571431565 0.2857145415 -0.1425004138
-0.3571431564 0.3571436545 -0.0710721589
-0.3571431563 0.2857148733 0.0003564278
-0.2142852622 0.2142857603 -0.0710718272
-0.2857142094 0.2142855943 -0.1425002479
-0.3571431564 0.2142857603 -0.0710718270
-0.2857142092 0.2142859262 0.0003565937
-0.2857142092 0.3571438205 0.0003562618
-0.2142852620 0.3571439864 0.0717846825
-0.2857142090 0.3571441524 0.1432131034
-0.3571431563 0.3571439864 0.0717846827
-0.2857142092 0.2142859262 0.0003565937
-0.2142852621 0.2857148733 0.0003564277
-0.2857142092 0.3571438205 0.0003562618
-0.3571431563 0.2857148733 0.0003564278
-0.2142852620 0.3571439864 0.0717846825
-0.2142852621 0.2857148733 0.0003564277
-0.2142852620 0.2142860922 0.0717850144
-0.2142852619 0.2857152052 0.1432132693
-0.2142852619 0.2857152052 0.1432132693
-0.2857142090 0.2142862581 0.1432134353
-0.3571431562 0.2857152052 0.1432132695
-0.2857142090 0.3571441524 0.1432131034
-0.3571431563 0.2142860922 0.0717850146
-0.3571431563 0.2857148733 0.0003564278
-0.3571431563 0.3571439864 0.0717846827
-0.3571431562 0.2857152052 0.1432132695
-0.2142852620 0.2142860922 0.0717850144
-0.2857142092 0.2142859262 0.0003565937
-0.3571431563 0.2142860922 0.0717850146
-0.2857142090 0.2142862581 0.1432134353
0.2857142096 0.3571431567 -0.2853578432
0.3571431568 0.3571433227 -0.2139292120
0.2857142098 0.3571434886 -0.1425005806
0.2142852625 0.3571433227 -0.2139292118
0.2857142096 0.2142852624 -0.2853575114
0.3571431567 0.2857142096 -0.2853576774
0.2857142096 0.3571431567 -0.2853578432
0.2142852624 0.2857142096 -0.2853576772
0.3571431568 0.3571433227 -0.2139292120
0.3571431567 0.2857142096 -0.2853576774
0.3571431568 0.2142854284 -0.2139288801
0.3571431569 0.2857145415 -0.1425004147
0.3571431569 0.2857145415 -0.1425004147
0.2857142098 0.2142855943 -0.1425002487
0.2142852626 0.2857145415 -0.1425004145
0.2857142098 0.3571434886 -0.1425005806
0.2142852625 0.2142854284 -0.2139288799
0.2142852624 0.2857142096 -0.2853576772
0.2142852625 0.3571433227 -0.2139292118
0.2142852626 0.2857145415 -0.1425004145
0.3571431568 0.2142854284 -0.2139288801
0.2857142096 0.2142852624 -0.2853575114
0.2142852625 0.2142854284 -0.2139288799
0.2857142098 0.2142855943 -0.1425002487
0.2857142098 0.3571434886 -0.1425005806
0.3571431570 0.3571436545 -0.0710721598
0.2857142099 0.3571438205 0.0003562611
0.2142852627 0.3571436545 -0.0710721596
0.2857142098 0.2142855943 -0.1425002487
0.3571431569 0.2857145415 -0.1425004147
0.2857142098 0.3571434886 -0.1425005806
0.2142852626 0.2857145415 -0.1425004145
0.3571431570 0.3571436545 -0.0710721598
0.3571431569 0.2857145415 -0.1425004147
0.3571431570 0.2142857603 -0.0710718279
0.3571431571 0.2857148733 0.0003564269
0.3571431571 0.2857148733 0.0003564269
0.2857142099 0.2142859262 0.0003565930
0.2142852628 0.2857148733 0.0003564271
0.2857142099 0.3571438205 0.0003562611
0.2142852627 0.2142857603 -0.0710718278
0.2142852626 0.2857145415 -0.1425004145
0.2142852627 0.3571436545 -0.0710721596
0.2142852628 0.2857148733 0.0003564271
0.3571431570 0.2142857603 -0.0710718279
0.2857142098 0.2142855943 -0.1425002487
0.2142852627 0.2142857603 -0.0710718278
0.2857142099 0.2142859262 0.0003565930
0.2857142099 0.3571438205 0.0003562611
0.3571431572 0.3571439864 0.0717846818
0.2857142101 0.3571441524 0.1432131027
0.2142852629 0.3571439864 0.0717846820
0.2857142099 0.2142859262 0.0003565930
0.3571431571 0.2857148733 0.0003564269
0.2857142099 0.3571438205 0.0003562611
0.2142852628 0.2857148733 0.0003564271
0.3571431572 0.3571439864 0.0717846818
0.3571431571 0.2857148733 0.0003564269
0.3571431572 0.2142860922 0.0717850137
0.3571431573 0.2857152052 0.1432132686
0.3571431573 0.2857152052 0.1432132686
0.2857142101 0.2142862581 0.1432134346
0.2142852630 0.2857152052 0.1432132687
0.2857142101 0.3571441524 0.1432131027
0.2142852629 0.2142860922 0.0717850139
0.2142852628 0.2857148733 0.0003564271
0.2142852629 0.3571439864 0.0717846820
0.2142852630 0.2857152052 0.1432132687
0.3571431572 0.2142860922 0.0717850137
0.2857142099 0.2142859262 0.0003565930
0.2142852629 0.2142860922 0.0717850139
0.2857142101 0.2142862581 0.1432134346
0.2857142096 -0.2142852624 -0.2853565157
0.3571431568 -0.2142850965 -0.2139278844
0.2857142098 -0.2142849306 -0.1424992530
0.2142852625 -0.2142850965 -0.2139278843
0.2857142096 -0.3571431567 -0.2853561838
0.3571431567 -0.2857142096 -0.2853563498
0.2857142096 -0.2142852624 -0.2853565157
0.2142852624 -0.2857142096 -0.2853563497
0.3571431568 -0.2142850965 -0.2139278844
0.3571431567 -0.2857142096 -0.2853563498
0.3571431568 -0.3571429908 -0.2139275526
0.3571431569 -0.2857138777 -0.1424990872
0.3571431569 -0.2857138777 -0.1424990872
0.2857142098 -0.3571428248 -0.1424989211
0.2142852626 -0.2857138777 -0.1424990870
0.2857142098 -0.2142849306 -0.1424992530
0.2142852625 -0.3571429908 -0.2139275524
0.2142852624 -0.2857142096 -0.2853563497
0.2142852625 -0.2142850965 -0.2139278843
0.2142852626 -0.2857138777 -0.1424990870
0.3571431568 -0.3571429908 -0.2139275526
0.2857142096 -0.3571431567 -0.2853561838
0.2142852625 -0.3571429908 -0.2139275524
0.2857142098 -0.3571428248 -0.1424989211
0.2857142098 -0.2142849306 -0.1424992530
0.3571431570 -0.2142847646 -0.0710708323
0.2857142099 -0.2142845987 0.0003575886
0.2142852627 -0.2142847646 -0.0710708321
0.2857142098 -0.3571428248 -0.1424989211
0.3571431569 -0.2857138777 -0.1424990872
0.2857142098 -0.2142849306 -0.1424992530
0.2142852626 -0.2857138777 -0.1424990870
0.3571431570 -0.2142847646 -0.0710708323
0.3571431569 -0.2857138777 -0.1424990872
0.3571431570 -0.3571426589 -0.0710705004
0.3571431571 -0.2857135458 0.0003577545
0.3571431571 -0.2857135458 0.0003577545
0.2857142099 -0.3571424929 0.0003579205
0.2142852628 -0.2857135458 0.0003577546
0.2857142099 -0.2142845987 0.0003575886
0.2142852627 -0.3571426589 -0.0710705002
0.2142852626 -0.2857138777 -0.1424990870
0.2142852627 -0.2142847646 -0.0710708321
0.2142852628 -0.2857135458 0.0003577546
0.3571431570 -0.3571426589 -0.0710705004
0.2857142098 -0.3571428248 -0.1424989211
0.2142852627 -0.3571426589 -0.0710705002
0.2857142099 -0.3571424929 0.0003579205
0.2857142099 -0.2142845987 0.0003575886
0.3571431572 -0.2142844327 0.0717860093
0.2857142101 -0.2142842668 0.1432144302
0.2142852629 -0.2142844327 0.0717860095
0.2857142099 -0.3571424929 0.0003579205
0.3571431571 -0.2857135458 0.0003577545
0.2857142099 -0.2142845987 0.0003575886
0.2142852628 -0.2857135458 0.0003577546
0.3571431572 -0.2142844327 0.0717860093
0.3571431571 -0.2857135458 0.0003577545
0.3571431572 -0.3571423270 0.0717863412
0.3571431573 -0.2857132139 0.1432145961
0.3571431573 -0.2857132139 0.1432145961
0.2857142101 -0.3571421611 0.1432147621
0.2142852630 -0.2857132139 0.1432145963
0.2857142101 -0.2142842668 0.1432144302
0.2142852629 -0.3571423270 0.0717863414
0.2142852628 -0.2857135458 0.0003577546
0.2142852629 -0.2142844327 0.0717860095
0.2142852630 -0.2857132139 0.1432145963
0.3571431572 -0.3571423270 0.0717863412
0.2857142099 -0.3571424929 0.0003579205
0.2142852629 -0.3571423270 0.0717863414
0.2857142101 -0.3571421611 0.1432147621
0.3571431041 0.0000000000 -0.2853570136
0.4285714724 0.0000001659 -0.2139283824
0.3571431043 0.0000003319 -0.1424997509
0.2857147360 0.0000001659 -0.2139283822
0.3571431041 -0.0357142104 -0.2853569306
0.3571431041 -0.0357142104 -0.2853569306
0.4285714724 -0.0357140445 -0.2139282994
0.4285714724 -0.0357140445 -0.2139282994
0.3571431043 -0.0357138785 -0.1424996680
0.3571431043 -0.0357138785 -0.1424996680
0.2857147360 -0.0357140445 -0.2139282992
0.2857147360 -0.0357140445 -0.2139282992
0.4285714724 -0.0714282549 -0.2139282164
0.3571431041 -0.0714284208 -0.2853568477
0.2857147360 -0.0714282549 -0.2139282162
0.3571431043 -0.0714280889 -0.1424995850
0.3571431043 -0.0356995868 -0.1075565102
0.4285714725 -0.1071280075 -0.1074995023
0.3571431043 -0.1785564282 -0.1074424941
0.2857147361 -0.1071280075 -0.1074995021
0.4285714724 -0.1071565115 -0.1432142389
0.3571431043 -0.0357280908 -0.1432712469
0.2857147361 -0.1071565115 -0.1432142387
0.3571431043 -0.1785849322 -0.1431572308
0.3571431041 -0.1428568416 -0.2853566817
0.4285714724 -0.1428566757 -0.2139280505
0.3571431043 -0.1428565097 -0.1424994190
0.2857147360 -0.1428566757 -0.2139280503
0.3571431041 -0.1785710520 -0.2853565988
0.3571431041 -0.1785710520 -0.2853565988
0.4285714724 -0.1785708861 -0.2139279675
0.4285714724 -0.1785708861 -0.2139279675
0.3571431043 -0.1785707202 -0.1424993361
0.3571431043 -0.1785707202 -0.1424993361
0.2857147360 -0.1785708861 -0.2139279673
0.2857147360 -0.1785708861 -0.2139279673
0.4285714724 -0.2142850965 -0.2139278845
0.3571431041 -0.2142852624 -0.2853565158
0.2857147360 -0.2142850965 -0.2139278844
0.3571431043 -0.2142849306 -0.1424992531
0.3571431041 0.2142852624 -0.2853575114
0.4285714724 0.2142854284 -0.2139288802
0.3571431043 0.2142855943 -0.1425002488
0.2857147360 0.2142854284 -0.2139288800
0.3571431041 0.1785710520 -0.2853574285
0.3571431041 0.1785710520 -0.2853574285
0.4285714724 0.1785712180 -0.2139287972
0.4285714724 0.1785712180 -0.2139287972
0.3571431043 0.1785713839 -0.1425001658
0.3571431043 0.1785713839 -0.1425001658
0.2857147360 0.1785712180 -0.2139287970
0.2857147360 0.1785712180 -0.2139287970
0.4285714724 0.1428570076 -0.2139287142
0.3571431041 0.1428568416 -0.2853573455
0.2857147360 0.1428570076 -0.2139287141
0.3571431043 0.1428571735 -0.1425000828
0.3571431043 0.1785856756 -0.1075570080
0.4285714725 0.1071572549 -0.1075000001
0.3571431043 0.0357288343 -0.1074429919
0.2857147361 0.1071572549 -0.1074999999
0.4285714724 0.1071287509 -0.1432147367
0.3571431043 0.1785571716 -0.1432717447
0.2857147361 0.1071287509 -0.1432147366
0.3571431043 0.0357003302 -0.1431577286
0.3571431041 0.0714284208 -0.2853571796
0.4285714724 0.0714285868 -0.2139285483
0.3571431043 0.0714287527 -0.1424999169
0.2857147360 0.0714285868 -0.2139285481
0.3571431041 0.0357142104 -0.2853570966
0.3571431041 0.0357142104 -0.2853570966
0.4285714724 0.0357143764 -0.2139284653
0.4285714724 0.0357143764 -0.2139284653
0.3571431043 0.0357145423 -0.1424998339
0.3571431043 0.0357145423 -0.1424998339
0.2857147360 0.0357143764 -0.2139284652
0.2857147360 0.0357143764 -0.2139284652
0.4285714724 0.0000001659 -0.2139283824
0.3571431041 0.0000000000 -0.2853570136
0.2857147360 0.0000001659 -0.2139283822
0.3571431043 0.0000003319 -0.1424997509
-0.3571431567 0.0000000000 -0.2853570127
-0.2857147358 0.0000001659 -0.2139283815
-0.3571431565 0.0000003319 -0.1424997500
-0.4285715774 0.0000001659 -0.2139283813
-0.3571431567 -0.0357142104 -0.2853569297
-0.3571431567 -0.0357142104 -0.2853569297
-0.2857147358 -0.0357140445 -0.2139282985
-0.2857147358 -0.0357140445 -0.2139282985
-0.3571431565 -0.0357138785 -0.1424996671
-0.3571431565 -0.0357138785 -0.1424996671
-0.4285715774 -0.0357140445 -0.2139282983
-0.4285715774 -0.0357140445 -0.2139282983
-0.2857147358 -0.0714282549 -0.2139282155
-0.3571431567 -0.0714284208 -0.2853568468
-0.4285715774 -0.0714282549 -0.2139282153
-0.3571431565 -0.0714280889 -0.1424995841
-0.3571431565 -0.0356995868 -0.1075565093
-0.2857147357 -0.1071280075 -0.1074995014
-0.3571431565 -0.1785564282 -0.1074424932
-0.4285715773 -0.1071280075 -0.1074995012
-0.2857147357 -0.1071565115 -0.1432142380
-0.3571431565 -0.0357280908 -0.1432712460
-0.4285715773 -0.1071565115 -0.1432142378
-0.3571431565 -0.1785849322 -0.1431572299
-0.3571431567 -0.1428568416 -0.2853566808
-0.2857147358 -0.1428566757 -0.2139280496
-0.3571431565 -0.1428565097 -0.1424994181
-0.4285715774 -0.1428566757 -0.2139280494
-0.3571431567 -0.1785710520 -0.2853565979
-0.3571431567 -0.1785710520 -0.2853565979
-0.2857147358 -0.1785708861 -0.2139279666
-0.2857147358 -0.1785708861 -0.2139279666
-0.3571431565 -0.1785707202 -0.1424993352
-0.3571431565 -0.1785707202 -0.1424993352
-0.4285715774 -0.1785708861 -0.2139279664
-0.4285715774 -0.1785708861 -0.2139279664
-0.2857147358 -0.2142850965 -0.2139278836
-0.3571431567 -0.2142852624 -0.2853565149
-0.4285715774 -0.2142850965 -0.2139278835
-0.3571431565 -0.2142849306 -0.1424992522
-0.3571431567 0.2142852624 -0.2853575105
-0.2857147358 0.2142854284 -0.2139288793
-0.3571431565 0.2142855943 -0.1425002479
-0.4285715774 0.2142854284 -0.2139288791
-0.3571431567 0.1785710520 -0.2853574276
-0.3571431567 0.1785710520 -0.2853574276
-0.2857147358 0.1785712180 -0.2139287963
-0.2857147358 0.1785712180 -0.2139287963
-0.3571431565 0.1785713839 -0.1425001649
-0.3571431565 0.1785713839 -0.1425001649
-0.4285715774 0.1785712180 -0.2139287961
-0.4285715774 0.1785712180 -0.2139287961
-0.2857147358 0.1428570076 -0.2139287133
-0.3571431567 0.1428568416 -0.2853573446
-0.4285715774 0.1428570076 -0.2139287132
-0.3571431565 0.1428571735 -0.1425000819
-0.3571431565 0.1785856756 -0.1075570071
-0.2857147357 0.1071572549 -0.1074999992
-0.3571431565 0.0357288343 -0.1074429910
-0.4285715773 0.1071572549 -0.1074999990
-0.2857147357 0.1071287509 -0.1432147358
-0.3571431565 0.1785571716 -0.1432717438
-0.4285715773 0.1071287509 -0.1432147357
-0.3571431565 0.0357003302 -0.1431577277
-0.3571431567 0.0714284208 -0.2853571787
-0.2857147358 0.0714285868 -0.2139285474
-0.3571431565 0.0714287527 -0.1424999160
-0.4285715774 0.0714285868 -0.2139285472
-0.3571431567 0.0357142104 -0.2853570957
-0.3571431567 0.0357142104 -0.2853570957
-0.2857147358 0.0357143764 -0.2139284644
-0.2857147358 0.0357143764 -0.2139284644
-0.3571431565 0.0357145423 -0.1424998330
-0.3571431565 0.0357145423 -0.1424998330
-0.4285715774 0.0357143764 -0.2139284642
-0.4285715774 0.0357143764 -0.2139284642
-0.2857147358 0.0000001659 -0.2139283815
-0.3571431567 0.0000000000 -0.2853570127
-0.4285715774 0.0000001659 -0.2139283813
-0.3571431565 0.0000003319 -0.1424997500
0.0000000000 -0.2857147359 -0.2853563494
0.0714284209 -0.2857145700 -0.2139277181
0.0000000002 -0.2857144040 -0.1424990867
-0.0714284207 -0.2857145700 -0.2139277180
0.0714284209 -0.2857145700 -0.2139277181
0.0000000000 -0.2857147359 -0.2853563494
-0.0714284207 -0.2857145700 -0.2139277180
0.0000000002 -0.2857144040 -0.1424990867
-0.1428568416 -0.2857147359 -0.2853563492
-0.0714284207 -0.2857145700 -0.2139277180
-0.1428568415 -0.2857144040 -0.1424990865
-0.2142852624 -0.2857145700 -0.2139277178
-0.0714284207 -0.2857145700 -0.2139277180
-0.1428568416 -0.2857147359 -0.2853563492
-0.2142852624 -0.2857145700 -0.2139277178
-0.1428568415 -0.2857144040 -0.1424990865
0.1428568416 -0.2857147359 -0.2853563496
0.2142852625 -0.2857145700 -0.2139277183
0.1428568418 -0.2857144040 -0.1424990869
0.0714284209 -0.2857145700 -0.2139277181
0.2142852625 -0.2857145700 -0.2139277183
0.1428568416 -0.2857147359 -0.2853563496
0.0714284209 -0.2857145700 -0.2139277181
0.1428568418 -0.2857144040 -0.1424990869
-0.0000000000 0.2857147359 -0.2853576769
0.0714284209 0.2857149018 -0.2139290457
0.0000000002 0.2857150678 -0.1425004142
-0.0714284207 0.2857149018 -0.2139290455
0.0714284209 0.2857149018 -0.2139290457
-0.0000000000 0.2857147359 -0.2853576769
-0.0714284207 0.2857149018 -0.2139290455
0.0000000002 0.2857150678 -0.1425004142
-0.1428568416 0.2857147359 -0.2853576768
-0.0714284207 0.2857149018 -0.2139290455
-0.1428568415 0.2857150678 -0.1425004141
-0.2142852624 0.2857149018 -0.2139290453
-0.0714284207 0.2857149018 -0.2139290455
-0.1428568416 0.2857147359 -0.2853576768
-0.2142852624 0.2857149018 -0.2139290453
-0.1428568415 0.2857150678 -0.1425004141
0.1428568416 0.2857147359 -0.2853576771
0.2142852625 0.2857149018 -0.2139290459
0.1428568418 0.2857150678 -0.1425004144
0.0714284209 0.2857149018 -0.2139290457
0.2142852625 0.2857149018 -0.2139290459
0.1428568416 0.2857147359 -0.2853576771
0.0714284209 0.2857149018 -0.2139290457
0.1428568418 0.2857150678 -0.1425004144
3 173 175 49
3 49 175 51
3 229 476 228
3 227 476 229
3 229 477 226
3 228 477 229
3 230 478 228
3 225 478 230
3 230 479 227
3 228 479 230
3 232 480 231
3 227 480 232
3 232 481 224
3 231 481 232
3 233 482 231
3 226 482 233
3 233 483 227
3 231 483 233
3 236 484 235
3 234 484 236
3 236 485 226
3 235 485 236
3 237 486 235
3 172 486 237
3 237 487 234
3 235 487 237
3 239 488 238
3 234 488 239
3 239 489 225
3 238 489 239
3 240 490 238
3 226 490 240
3 240 491 234
3 238 491 240
3 244 492 243
3 242 492 244
3 244 493 241
3 243 493 244
3 245 494 243
3 225 494 245
3 245 495 242
3 243 495 245
3 247 496 246
3 242 496 247
3 247 497 48
3 246 497 247
3 248 498 246
3 241 498 248
3 248 499 242
3 246 499 248
3 251 500 250
3 249 500 251
3 251 501 241
3 250 501 251
3 252 502 250
3 224 502 252
3 252 503 249
3 250 503 252
3 254 504 253
3 249 504 254
3 254 505 225
3 253 505 254
3 255 506 253
3 241 506 255
3 255 507 249
3 253 507 255
3 260 508 259
3 258 508 260
3 260 509 257
3 259 509 260
3 261 510 259
3 256 510 261
3 261 511 258
3 259 511 261
3 263 512 262
3 258 512 263
3 263 513 224
3 262 513 263
3 264 514 262
3 257 514 264
3 264 515 258
3 262 515 264
3 267 516 266
3 265 516 267
3 267 517 257
3 266 517 267
3 268 518 266
3 173 518 268
3 268 519 265
3 266 519 268
3 270 520 269
3 265 520 270
3 270 521 256
3 269 521 270
3 271 522 269
3 257 522 271
3 271 523 265
3 269 523 271
3 275 524 274
3 273 524 275
3 275 525 272
3 274 525 275
3 276 526 274
3 256 526 276
3 276 527 273
3 274 527 276
3 278 528 277
3 273 528 278
3 278 529 172
3 277 529 278
3 279 530 277
3 272 530 279
3 279 531 273
3 277 531 279
3 282 532 281
3 280 532 282
3 282 533 272
3 281 533 282
3 283 534 281
3 224 534 283
3 283 535 280
3 281 535 283
3 285 536 284
3 280 536 285
3 285 537 256
3 284 537 285
3 286 538 284
3 272 538 286
3 286 539 280
3 284 539 286
3 292 540 291
3 290 540 292
3 292 541 289
3 291 541 292
3 293 542 291
3 288 542 293
3 293 543 290
3 291 543 293
3 295 544 294
3 290 544 295
3 295 545 287
3 294 545 295
3 296 546 294
3 289 546 296
3 296 547 290
3 294 547 296
3 299 548 298
3 297 548 299
3 299 549 289
3 298 549 299
3 300 550 298
3 49 550 300
3 300 551 297
3 298 551 300
3 302 552 301
3 297 552 302
3 302 553 288
3 301 553 302
3 303 554 301
3 289 554 303
3 303 555 297
3 301 555 303
3 307 556 306
3 305 556 307
3 307 557 304
3 306 557 307
3 308 558 306
3 288 558 308
3 308 559 305
3 306 559 308
3 310 560 309
3 305 560 310
3 310 561 173
3 309 561 310
3 311 562 309
3 304 562 311
3 311 563 305
3 309 563 311
3 314 564 313
3 312 564 314
3 314 565 304
3 313 565 314
3 315 566 313
3 287 566 315
3 315 567 312
3 313 567 315
3 317 568 316
3 312 568 317
3 317 569 288
3 316 569 317
3 318 570 316
3 304 570 318
3 318 571 312
3 316 571 318
3 323 572 322
3 321 572 323
3 323 573 320
3 322 573 323
3 324 574 322
3 319 574 324
3 324 575 321
3 322 575 324
3 326 576 325
3 321 576 326
3 326 577 287
3 325 577 326
3 327 578 325
3 320 578 327
3 327 579 321
3 325 579 327
3 330 580 329
3 328 580 330
3 330 581 320
3 329 581 330
3 331 582 329
3 48 582 331
3 331 583 328
3 329 583 331
3 333 584 332
3 328 584 333
3 333 585 319
3 332 585 333
3 334 586 332
3 320 586 334
3 334 587 328
3 332 587 334
3 338 588 337
3 336 588 338
3 338 589 335
3 337 589 338
3 339 590 337
3 319 590 339
3 339 591 336
3 337 591 339
3 341 592 340
3 336 592 341
3 341 593 49
3 340 593 341
3 342 594 340
3 335 594 342
3 342 595 336
3 340 595 342
3 345 596 344
3 343 596 345
3 345 597 335
3 344 597 345
3 346 598 344
3 287 598 346
3 346 599 343
3 344 599 346
3 348 600 347
3 343 600 348
3 348 601 319
3 347 601 348
3 349 602 347
3 335 602 349
3 349 603 343
3 347 603 349
3 173 172 175
3 175 172 174
3 355 604 354
3 353 604 355
3 355 605 352
3 354 605 355
3 356 606 354
3 351 606 356
3 356 607 353
3 354 607 356
3 358 608 357
3 353 608 358
3 358 609 350
3 357 609 358
3 359 610 357
3 352 610 359
3 359 611 353
3 357 611 359
3 362 612 361
3 360 612 362
3 362 613 352
3 361 613 362
3 363 614 361
3 174 614 363
3 363 615 360
3 361 615 363
3 365 616 364
3 360 616 365
3 365 617 351
3 364 617 365
3 366 618 364
3 352 618 366
3 366 619 360
3 364 619 366
3 370 620 369
3 368 620 370
3 370 621 367
3 369 621 370
3 371 622 369
3 351 622 371
3 371 623 368
3 369 623 371
3 373 624 372
3 368 624 373
3 373 625 175
3 372 625 373
3 374 626 372
3 367 626 374
3 374 627 368
3 372 627 374
3 377 628 376
3 375 628 377
3 377 629 367
3 376 629 377
3 378 630 376
3 350 630 378
3 378 631 375
3 376 631 378
3 380 632 379
3 375 632 380
3 380 633 351
3 379 633 380
3 381 634 379
3 367 634 381
3 381 635 375
3 379 635 381
3 386 636 385
3 384 636 386
3 386 637 383
3 385 637 386
3 387 638 385
3 382 638 387
3 387 639 384
3 385 639 387
3 389 640 388
3 384 640 389
3 389 641 350
3 388 641 389
3 390 642 388
3 383 642 390
3 390 643 384
3 388 643 390
3 393 644 392
3 391 644 393
3 393 645 383
3 392 645 393
3 394 646 392
3 50 646 394
3 394 647 391
3 392 647 394
3 396 648 395
3 391 648 396
3 396 649 382
3 395 649 396
3 397 650 395
3 383 650 397
3 397 651 391
3 395 651 397
3 401 652 400
3 399 652 401
3 401 653 398
3 400 653 401
3 402 654 400
3 382 654 402
3 402 655 399
3 400 655 402
3 404 656 403
3 399 656 404
3 404 657 174
3 403 657 404
3 405 658 403
3 398 658 405
3 405 659 399
3 403 659 405
3 408 660 407
3 406 660 408
3 408 661 398
3 407 661 408
3 409 662 407
3 350 662 409
3 409 663 406
3 407 663 409
3 411 664 410
3 406 664 411
3 411 665 382
3 410 665 411
3 412 666 410
3 398 666 412
3 412 667 406
3 410 667 412
3 418 668 417
3 416 668 418
3 418 669 415
3 417 669 418
3 419 670 417
3 414 670 419
3 419 671 416
3 417 671 419
3 421 672 420
3 416 672 421
3 421 673 413
3 420 673 421
3 422 674 420
3 415 674 422
3 422 675 416
3 420 675 422
3 425 676 424
3 423 676 425
3 425 677 415
3 424 677 425
3 426 678 424
3 51 678 426
3 426 679 423
3 424 679 426
3 428 680 427
3 423 680 428
3 428 681 414
3 427 681 428
3 429 682 427
3 415 682 429
3 429 683 423
3 427 683 429
3 433 684 432
3 431 684 433
3 433 685 430
3 432 685 433
3 434 686 432
3 414 686 434
3 434 687 431
3 432 687 434
3 436 688 435
3 431 688 436
3 436 689 50
3 435 689 436
3 437 690 435
3 430 690 437
3 437 691 431
3 435 691 437
3 440 692 439
3 438 692 440
3 440 693 430
3 439 693 440
3 441 694 439
3 413 694 441
3 441 695 438
3 439 695 441
3 443 696 442
3 438 696 443
3 443 697 414
3 442 697 443
3 444 698 442
3 430 698 444
3 444 699 438
3 442 699 444
3 449 700 448
3 447 700 449
3 449 701 446
3 448 701 449
3 450 702 448
3 445 702 450
3 450 703 447
3 448 703 450
3 452 704 451
3 447 704 452
3 452 705 413
3 451 705 452
3 453 706 451
3 446 706 453
3 453 707 447
3 451 707 453
3 456 708 455
3 454 708 456
3 456 709 446
3 455 709 456
3 457 710 455
3 175 710 457
3 457 711 454
3 455 711 457
3 459 712 458
3 454 712 459
3 459 713 445
3 458 713 459
3 460 714 458
3 446 714 460
3 460 715 454
3 458 715 460
3 464 716 463
3 462 716 464
3 464 717 461
3 463 717 464
3 465 718 463
3 445 718 465
3 465 719 462
3 463 719 465
3 467 720 466
3 462 720 467
3 467 721 51
3 466 721 467
3 468 722 466
3 461 722 468
3 468 723 462
3 466 723 468
3 471 724 470
3 469 724 471
3 471 725 461
3 470 725 471
3 472 726 470
3 413 726 472
3 472 727 469
3 470 727 472
3 474 728 473
3 469 728 474
3 474 729 445
3 473 729 474
3 475 730 473
3 461 730 475
3 475 731 469
3 473 731 475
3 49 50 48
3 49 51 50
3 48 174 172
3 48 50 174
3 732 948 67
3 13 948 732
3 732 949 57
3 67 949 732
3 733 950 5
3 57 950 733
3 733 951 13
3 5 951 733
3 734 952 66
3 12 952 734
3 734 953 67
3 66 953 734
3 735 954 13
3 67 954 735
3 735 955 12
3 13 955 735
3 736 956 67
3 57 956 736
3 736 957 66
3 67 957 736
3 737 958 56
3 66 958 737
3 737 959 57
3 56 959 737
3 738 960 56
3 57 960 738
3 738 961 4
3 56 961 738
3 739 962 5
3 4 962 739
3 739 963 57
3 5 963 739
3 740 964 12
3 4 964 740
3 740 965 13
3 12 965 740
3 741 966 5
3 13 966 741
3 741 967 4
3 5 967 741
3 742 968 66
3 56 968 742
3 742 969 12
3 66 969 742
3 743 970 4
3 12 970 743
3 743 971 56
3 4 971 743
3 744 972 57
3 5 972 744
3 744 973 63
3 57 973 744
3 745 974 9
3 63 974 745
3 745 975 5
3 9 975 745
3 746 976 56
3 4 976 746
3 746 977 57
3 56 977 746
3 747 978 5
3 57 978 747
3 747 979 4
3 5 979 747
3 748 980 57
3 63 980 748
3 748 981 56
3 57 981 748
3 749 982 62
3 56 982 749
3 749 983 63
3 62 983 749
3 750 984 62
3 63 984 750
3 750 985 8
3 62 985 750
3 751 986 9
3 8 986 751
3 751 987 63
3 9 987 751
3 752 988 4
3 8 988 752
3 752 989 5
3 4 989 752
3 753 990 9
3 5 990 753
3 753 991 8
3 9 991 753
3 754 992 56
3 62 992 754
3 754 993 4
3 56 993 754
3 755 994 8
3 4 994 755
3 755 995 62
3 8 995 755
3 756 996 63
3 9 996 756
3 756 997 73
3 63 997 756
3 757 998 17
3 73 998 757
3 757 999 9
3 17 999 757
3 758 1000 62
3 8 1000 758
3 758 1001 63
3 62 1001 758
3 759 1002 9
3 63 1002 759
3 759 1003 8
3 9 1003 759
3 760 1004 63
3 73 1004 760
3 760 1005 62
3 63 1005 760
3 761 1006 72
3 62 1006 761
3 761 1007 73
3 72 1007 761
3 762 1008 72
3 73 1008 762
3 762 1009 16
3 72 1009 762
3 763 1010 17
3 16 1010 763
3 763 1011 73
3 17 1011 763
3 764 1012 8
3 16 1012 764
3 764 1013 9
3 8 1013 764
3 765 1014 17
3 9 1014 765
3 765 1015 16
3 17 1015 765
3 766 1016 62
3 72 1016 766
3 766 1017 8
3 62 1017 766
3 767 1018 16
3 8 1018 767
3 767 1019 72
3 16 1019 767
3 93 170 18
3 104 18 170
3 93 110 170
3 104 170 110
3 93 80 110
3 104 110 80
3 93 222 80
3 104 80 222
3 93 74 222
3 104 222 74
3 93 223 74
3 104 74 223
3 93 78 223
3 104 223 78
3 93 108 78
3 104 78 108
3 93 171 108
3 104 108 171
3 93 18 171
3 104 171 18
3 768 1020 71
3 15 1020 768
3 768 1021 61
3 71 1021 768
3 769 1022 7
3 61 1022 769
3 769 1023 15
3 7 1023 769
3 770 1024 70
3 14 1024 770
3 770 1025 71
3 70 1025 770
3 771 1026 15
3 71 1026 771
3 771 1027 14
3 15 1027 771
3 772 1028 71
3 61 1028 772
3 772 1029 70
3 71 1029 772
3 773 1030 60
3 70 1030 773
3 773 1031 61
3 60 1031 773
3 774 1032 60
3 61 1032 774
3 774 1033 6
3 60 1033 774
3 775 1034 7
3 6 1034 775
3 775 1035 61
3 7 1035 775
3 776 1036 14
3 6 1036 776
3 776 1037 15
3 14 1037 776
3 777 1038 7
3 15 1038 777
3 777 1039 6
3 7 1039 777
3 778 1040 70
3 60 1040 778
3 778 1041 14
3 70 1041 778
3 779 1042 6
3 14 1042 779
3 779 1043 60
3 6 1043 779
3 780 1044 61
3 7 1044 780
3 780 1045 65
3 61 1045 780
3 781 1046 11
3 65 1046 781
3 781 1047 7
3 11 1047 781
3 782 1048 60
3 6 1048 782
3 782 1049 61
3 60 1049 782
3 783 1050 7
3 61 1050 783
3 783 1051 6
3 7 1051 783
3 784 1052 61
3 65 1052 784
3 784 1053 60
3 61 1053 784
3 785 1054 64
3 60 1054 785
3 785 1055 65
3 64 1055 785
3 786 1056 64
3 65 1056 786
3 786 1057 10
3 64 1057 786
3 787 1058 11
3 10 1058 787
3 787 1059 65
3 11 1059 787
3 788 1060 6
3 10 1060 788
3 788 1061 7
3 6 1061 788
3 789 1062 11
3 7 1062 789
3 789 1063 10
3 11 1063 789
3 790 1064 60
3 64 1064 790
3 790 1065 6
3 60 1065 790
3 791 1066 10
3 6 1066 791
3 791 1067 64
3 10 1067 791
3 792 1068 65
3 11 1068 792
3 792 1069 77
3 65 1069 792
3 793 1070 21
3 77 1070 793
3 793 1071 11
3 21 1071 793
3 794 1072 64
3 10 1072 794
3 794 1073 65
3 64 1073 794
3 795 1074 11
3 65 1074 795
3 795 1075 10
3 11 1075 795
3 796 1076 65
3 77 1076 796
3 796 1077 64
3 65 1077 796
3 797 1078 76
3 64 1078 797
3 797 1079 77
3 76 1079 797
3 798 1080 76
3 77 1080 798
3 798 1081 20
3 76 1081 798
3 799 1082 21
3 20 1082 799
3 799 1083 77
3 21 1083 799
3 800 1084 10
3 20 1084 800
3 800 1085 11
3 10 1085 800
3 801 1086 21
3 11 1086 801
3 801 1087 20
3 21 1087 801
3 802 1088 64
3 76 1088 802
3 802 1089 10
3 64 1089 802
3 803 1090 20
3 10 1090 803
3 803 1091 76
3 20 1091 803
3 94 168 19
3 105 19 168
3 94 111 168
3 105 168 111
3 94 81 111
3 105 111 81
3 94 220 81
3 105 81 220
3 94 75 220
3 105 220 75
3 94 221 75
3 105 75 221
3 94 79 221
3 105 221 79
3 94 109 79
3 105 79 109
3 94 169 109
3 105 109 169
3 94 19 169
3 105 169 19
3 804 1092 213
3 161 1092 804
3 804 1093 205
3 213 1093 804
3 805 1094 151
3 205 1094 805
3 805 1095 161
3 151 1095 805
3 806 1096 212
3 160 1096 806
3 806 1097 213
3 212 1097 806
3 807 1098 161
3 213 1098 807
3 807 1099 160
3 161 1099 807
3 808 1100 213
3 205 1100 808
3 808 1101 212
3 213 1101 808
3 809 1102 204
3 212 1102 809
3 809 1103 205
3 204 1103 809
3 810 1104 204
3 205 1104 810
3 810 1105 150
3 204 1105 810
3 811 1106 151
3 150 1106 811
3 811 1107 205
3 151 1107 811
3 812 1108 160
3 150 1108 812
3 812 1109 161
3 160 1109 812
3 813 1110 151
3 161 1110 813
3 813 1111 150
3 151 1111 813
3 814 1112 212
3 204 1112 814
3 814 1113 160
3 212 1113 814
3 815 1114 150
3 160 1114 815
3 815 1115 204
3 150 1115 815
3 816 1116 205
3 151 1116 816
3 816 1117 209
3 205 1117 816
3 817 1118 155
3 209 1118 817
3 817 1119 151
3 155 1119 817
3 818 1120 204
3 150 1120 818
3 818 1121 205
3 204 1121 818
3 819 1122 151
3 205 1122 819
3 819 1123 150
3 151 1123 819
3 820 1124 205
3 209 1124 820
3 820 1125 204
3 205 1125 820
3 821 1126 208
3 204 1126 821
3 821 1127 209
3 208 1127 821
3 822 1128 208
3 209 1128 822
3 822 1129 154
3 208 1129 822
3 823 1130 155
3 154 1130 823
3 823 1131 209
3 155 1131 823
3 824 1132 150
3 154 1132 824
3 824 1133 151
3 150 1133 824
3 825 1134 155
3 151 1134 825
3 825 1135 154
3 155 1135 825
3 826 1136 204
3 208 1136 826
3 826 1137 150
3 204 1137 826
3 827 1138 154
3 150 1138 827
3 827 1139 208
3 154 1139 827
3 828 1140 209
3 155 1140 828
3 828 1141 219
3 209 1141 828
3 829 1142 167
3 219 1142 829
3 829 1143 155
3 167 1143 829
3 830 1144 208
3 154 1144 830
3 830 1145 209
3 208 1145 830
3 831 1146 155
3 209 1146 831
3 831 1147 154
3 155 1147 831
3 832 1148 209
3 219 1148 832
3 832 1149 208
3 209 1149 832
3 833 1150 218
3 208 1150 833
3 833 1151 219
3 218 1151 833
3 834 1152 218
3 219 1152 834
3 834 1153 166
3 218 1153 834
3 835 1154 167
3 166 1154 835
3 835 1155 219
3 167 1155 835
3 836 1156 154
3 166 1156 836
3 836 1157 155
3 154 1157 836
3 837 1158 167
3 155 1158 837
3 837 1159 166
3 167 1159 837
3 838 1160 208
3 218 1160 838
3 838 1161 154
3 208 1161 838
3 839 1162 166
3 154 1162 839
3 839 1163 218
3 166 1163 839
3 128 0 165
3 139 165 0
3 128 145 0
3 139 0 145
3 128 115 145
3 139 145 115
3 128 52 115
3 139 115 52
3 128 217 52
3 139 52 217
3 128 53 217
3 139 217 53
3 128 113 53
3 139 53 113
3 128 143 113
3 139 113 143
3 128 1 143
3 139 143 1
3 128 165 1
3 139 1 165
3 840 1164 211
3 157 1164 840
3 840 1165 203
3 211 1165 840
3 841 1166 147
3 203 1166 841
3 841 1167 157
3 147 1167 841
3 842 1168 210
3 156 1168 842
3 842 1169 211
3 210 1169 842
3 843 1170 157
3 211 1170 843
3 843 1171 156
3 157 1171 843
3 844 1172 211
3 203 1172 844
3 844 1173 210
3 211 1173 844
3 845 1174 202
3 210 1174 845
3 845 1175 203
3 202 1175 845
3 846 1176 202
3 203 1176 846
3 846 1177 146
3 202 1177 846
3 847 1178 147
3 146 1178 847
3 847 1179 203
3 147 1179 847
3 848 1180 156
3 146 1180 848
3 848 1181 157
3 156 1181 848
3 849 1182 147
3 157 1182 849
3 849 1183 146
3 147 1183 849
3 850 1184 210
3 202 1184 850
3 850 1185 156
3 210 1185 850
3 851 1186 146
3 156 1186 851
3 851 1187 202
3 146 1187 851
3 852 1188 203
3 147 1188 852
3 852 1189 207
3 203 1189 852
3 853 1190 153
3 207 1190 853
3 853 1191 147
3 153 1191 853
3 854 1192 202
3 146 1192 854
3 854 1193 203
3 202 1193 854
3 855 1194 147
3 203 1194 855
3 855 1195 146
3 147 1195 855
3 856 1196 203
3 207 1196 856
3 856 1197 202
3 203 1197 856
3 857 1198 206
3 202 1198 857
3 857 1199 207
3 206 1199 857
3 858 1200 206
3 207 1200 858
3 858 1201 152
3 206 1201 858
3 859 1202 153
3 152 1202 859
3 859 1203 207
3 153 1203 859
3 860 1204 146
3 152 1204 860
3 860 1205 147
3 146 1205 860
3 861 1206 153
3 147 1206 861
3 861 1207 152
3 153 1207 861
3 862 1208 202
3 206 1208 862
3 862 1209 146
3 202 1209 862
3 863 1210 152
3 146 1210 863
3 863 1211 206
3 152 1211 863
3 864 1212 207
3 153 1212 864
3 864 1213 215
3 207 1213 864
3 865 1214 163
3 215 1214 865
3 865 1215 153
3 163 1215 865
3 866 1216 206
3 152 1216 866
3 866 1217 207
3 206 1217 866
3 867 1218 153
3 207 1218 867
3 867 1219 152
3 153 1219 867
3 868 1220 207
3 215 1220 868
3 868 1221 206
3 207 1221 868
3 869 1222 214
3 206 1222 869
3 869 1223 215
3 214 1223 869
3 870 1224 214
3 215 1224 870
3 870 1225 162
3 214 1225 870
3 871 1226 163
3 162 1226 871
3 871 1227 215
3 163 1227 871
3 872 1228 152
3 162 1228 872
3 872 1229 153
3 152 1229 872
3 873 1230 163
3 153 1230 873
3 873 1231 162
3 163 1231 873
3 874 1232 206
3 214 1232 874
3 874 1233 152
3 206 1233 874
3 875 1234 162
3 152 1234 875
3 875 1235 214
3 162 1235 875
3 127 2 164
3 138 164 2
3 127 144 2
3 138 2 144
3 127 114 144
3 138 144 114
3 127 54 114
3 138 114 54
3 127 216 54
3 138 54 216
3 127 55 216
3 138 216 55
3 127 112 55
3 138 55 112
3 127 142 112
3 138 112 142
3 127 3 142
3 138 142 3
3 127 164 3
3 138 3 164
3 876 1236 42
3 134 1236 876
3 876 1237 31
3 42 1237 876
3 877 1238 121
3 31 1238 877
3 877 1239 134
3 121 1239 877
3 39 1240 131
3 42 1240 39
3 134 1241 42
3 131 1241 134
3 42 1242 31
3 39 1242 42
3 28 1243 39
3 31 1243 28
3 28 1244 31
3 118 1244 28
3 121 1245 118
3 31 1245 121
3 131 1246 118
3 134 1246 131
3 121 1247 134
3 118 1247 121
3 878 1248 39
3 28 1248 878
3 878 1249 131
3 39 1249 878
3 879 1250 118
3 131 1250 879
3 879 1251 28
3 118 1251 879
3 880 1252 35
3 125 1252 880
3 880 1253 37
3 35 1253 880
3 881 1254 129
3 37 1254 881
3 881 1255 125
3 129 1255 881
3 35 140 46
3 35 125 140
3 35 46 37
3 37 46 26
3 37 26 116
3 37 116 129
3 125 116 140
3 125 129 116
3 882 1256 46
3 26 1256 882
3 882 1257 140
3 46 1257 882
3 883 1258 116
3 140 1258 883
3 883 1259 26
3 116 1259 883
3 884 1260 44
3 136 1260 884
3 884 1261 33
3 44 1261 884
3 885 1262 123
3 33 1262 885
3 885 1263 136
3 123 1263 885
3 41 1264 133
3 44 1264 41
3 136 1265 44
3 133 1265 136
3 44 1266 33
3 41 1266 44
3 30 1267 41
3 33 1267 30
3 30 1268 33
3 120 1268 30
3 123 1269 120
3 33 1269 123
3 133 1270 120
3 136 1270 133
3 123 1271 136
3 120 1271 123
3 886 1272 41
3 30 1272 886
3 886 1273 133
3 41 1273 886
3 887 1274 120
3 133 1274 887
3 887 1275 30
3 120 1275 887
3 888 1276 43
3 135 1276 888
3 888 1277 32
3 43 1277 888
3 889 1278 122
3 32 1278 889
3 889 1279 135
3 122 1279 889
3 40 1280 132
3 43 1280 40
3 135 1281 43
3 132 1281 135
3 43 1282 32
3 40 1282 43
3 29 1283 40
3 32 1283 29
3 29 1284 32
3 119 1284 29
3 122 1285 119
3 32 1285 122
3 132 1286 119
3 135 1286 132
3 122 1287 135
3 119 1287 122
3 890 1288 40
3 29 1288 890
3 890 1289 132
3 40 1289 890
3 891 1290 119
3 132 1290 891
3 891 1291 29
3 119 1291 891
3 892 1292 36
3 126 1292 892
3 892 1293 38
3 36 1293 892
3 893 1294 130
3 38 1294 893
3 893 1295 126
3 130 1295 893
3 36 141 47
3 36 126 141
3 36 47 38
3 38 47 27
3 38 27 117
3 38 117 130
3 126 117 141
3 126 130 117
3 894 1296 47
3 27 1296 894
3 894 1297 141
3 47 1297 894
3 895 1298 117
3 141 1298 895
3 895 1299 27
3 117 1299 895
3 896 1300 45
3 137 1300 896
3 896 1301 34
3 45 1301 896
3 897 1302 124
3 34 1302 897
3 897 1303 137
3 124 1303 897
3 42 1304 134
3 45 1304 42
3 137 1305 45
3 134 1305 137
3 45 1306 34
3 42 1306 45
3 31 1307 42
3 34 1307 31
3 31 1308 34
3 121 1308 31
3 124 1309 121
3 34 1309 124
3 134 1310 121
3 137 1310 134
3 124 1311 137
3 121 1311 124
3 898 1312 42
3 31 1312 898
3 898 1313 134
3 42 1313 898
3 899 1314 121
3 134 1314 899
3 899 1315 31
3 121 1315 899
3 900 1316 100
3 192 1316 900
3 900 1317 87
3 100 1317 900
3 901 1318 181
3 87 1318 901
3 901 1319 192
3 181 1319 901
3 97 1320 189
3 100 1320 97
3 192 1321 100
3 189 1321 192
3 100 1322 87
3 97 1322 100
3 84 1323 97
3 87 1323 84
3 84 1324 87
3 178 1324 84
3 181 1325 178
3 87 1325 181
3 189 1326 178
3 192 1326 189
3 181 1327 192
3 178 1327 181
3 902 1328 97
3 84 1328 902
3 902 1329 189
3 97 1329 902
3 903 1330 178
3 189 1330 903
3 903 1331 84
3 178 1331 903
3 904 1332 91
3 185 1332 904
3 904 1333 95
3 91 1333 904
3 905 1334 187
3 95 1334 905
3 905 1335 185
3 187 1335 905
3 91 196 106
3 91 185 196
3 91 106 95
3 95 106 82
3 95 82 176
3 95 176 187
3 185 176 196
3 185 187 176
3 906 1336 106
3 82 1336 906
3 906 1337 196
3 106 1337 906
3 907 1338 176
3 196 1338 907
3 907 1339 82
3 176 1339 907
3 908 1340 102
3 194 1340 908
3 908 1341 89
3 102 1341 908
3 909 1342 183
3 89 1342 909
3 909 1343 194
3 183 1343 909
3 99 1344 191
3 102 1344 99
3 194 1345 102
3 191 1345 194
3 102 1346 89
3 99 1346 102
3 86 1347 99
3 89 1347 86
3 86 1348 89
3 180 1348 86
3 183 1349 180
3 89 1349 183
3 191 1350 180
3 194 1350 191
3 183 1351 194
3 180 1351 183
3 910 1352 99
3 86 1352 910
3 910 1353 191
3 99 1353 910
3 911 1354 180
3 191 1354 911
3 911 1355 86
3 180 1355 911
3 912 1356 101
3 193 1356 912
3 912 1357 88
3 101 1357 912
3 913 1358 182
3 88 1358 913
3 913 1359 193
3 182 1359 913
3 98 1360 190
3 101 1360 98
3 193 1361 101
3 190 1361 193
3 101 1362 88
3 98 1362 101
3 85 1363 98
3 88 1363 85
3 85 1364 88
3 179 1364 85
3 182 1365 179
3 88 1365 182
3 190 1366 179
3 193 1366 190
3 182 1367 193
3 179 1367 182
3 914 1368 98
3 85 1368 914
3 914 1369 190
3 98 1369 914
3 915 1370 179
3 190 1370 915
3 915 1371 85
3 179 1371 915
3 916 1372 92
3 186 1372 916
3 916 1373 96
3 92 1373 916
3 917 1374 188
3 96 1374 917
3 917 1375 186
3 188 1375 917
3 92 197 107
3 92 186 197
3 92 107 96
3 96 107 83
3 96 83 177
3 96 177 188
3 186 177 197
3 186 188 177
3 918 1376 107
3 83 1376 918
3 918 1377 197
3 107 1377 918
3 919 1378 177
3 197 1378 919
3 919 1379 83
3 177 1379 919
3 920 1380 103
3 195 1380 920
3 920 1381 90
3 103 1381 920
3 921 1382 184
3 90 1382 921
3 921 1383 195
3 184 1383 921
3 100 1384 192
3 103 1384 100
3 195 1385 103
3 192 1385 195
3 103 1386 90
3 100 1386 103
3 87 1387 100
3 90 1387 87
3 87 1388 90
3 181 1388 87
3 184 1389 181
3 90 1389 184
3 192 1390 181
3 195 1390 192
3 184 1391 195
3 181 1391 184
3 922 1392 100
3 87 1392 922
3 922 1393 192
3 100 1393 922
3 923 1394 181
3 192 1394 923
3 923 1395 87
3 181 1395 923
3 924 1396 200
3 24 1396 924
3 924 1397 198
3 200 1397 924
3 925 1398 22
3 198 1398 925
3 925 1399 24
3 22 1399 925
3 200 24 200
3 200 24 24
3 200 200 198
3 198 200 198
3 198 198 22
3 198 22 22
3 24 22 24
3 24 22 22
3 926 1400 200
3 198 1400 926
3 926 1401 24
3 200 1401 926
3 927 1402 22
3 24 1402 927
3 927 1403 198
3 22 1403 927
3 928 1404 24
3 68 1404 928
3 928 1405 22
3 24 1405 928
3 929 1406 58
3 22 1406 929
3 929 1407 68
3 58 1407 929
3 24 68 24
3 24 68 68
3 24 24 22
3 22 24 22
3 22 22 58
3 22 58 58
3 68 58 68
3 68 58 58
3 930 1408 24
3 22 1408 930
3 930 1409 68
3 24 1409 930
3 931 1410 58
3 68 1410 931
3 931 1411 22
3 58 1411 931
3 932 1412 158
3 200 1412 932
3 932 1413 148
3 158 1413 932
3 933 1414 198
3 148 1414 933
3 933 1415 200
3 198 1415 933
3 158 200 158
3 158 200 200
3 158 158 148
3 148 158 148
3 148 148 198
3 148 198 198
3 200 198 200
3 200 198 198
3 934 1416 158
3 148 1416 934
3 934 1417 200
3 158 1417 934
3 935 1418 198
3 200 1418 935
3 935 1419 148
3 198 1419 935
3 936 1420 201
3 25 1420 936
3 936 1421 199
3 201 1421 936
3 937 1422 23
3 199 1422 937
3 937 1423 25
3 23 1423 937
3 201 25 201
3 201 25 25
3 201 201 199
3 199 201 199
3 199 199 23
3 199 23 23
3 25 23 25
3 25 23 23
3 938 1424 201
3 199 1424 938
3 938 1425 25
3 201 1425 938
3 939 1426 23
3 25 1426 939
3 939 1427 199
3 23 1427 939
3 940 1428 25
3 69 1428 940
3 940 1429 23
3 25 1429 940
3 941 1430 59
3 23 1430 941
3 941 1431 69
3 59 1431 941
3 25 69 25
3 25 69 69
3 25 25 23
3 23 25 23
3 23 23 59
3 23 59 59
3 69 59 69
3 69 59 59
3 942 1432 25
3 23 1432 942
3 942 1433 69
3 25 1433 942
3 943 1434 59
3 69 1434 943
3 943 1435 23
3 59 1435 943
3 944 1436 159
3 201 1436 944
3 944 1437 149
3 159 1437 944
3 945 1438 199
3 149 1438 945
3 945 1439 201
3 199 1439 945
3 159 201 159
3 159 201 201
3 159 159 149
3 149 159 149
3 149 149 199
3 149 199 199
3 201 199 201
3 201 199 199
3 946 1440 159
3 149 1440 946
3 946 1441 201
3 159 1441 946
3 947 1442 199
3 201 1442 947
3 947 1443 149
3 199 1443 947