OFF

18 32 0
0.097823 -0.153056 -0.038216
0.100402 -0.112741 -0.027137
0.252334 -0.063870 -0.030146
0.099477 -0.131665 0.024162
0.178660 -0.054195 -0.032914
0.250694 -0.090543 0.046318
0.107055 -0.084294 -0.119265
0.184851 -0.035209 -0.099392
0.248003 -0.093371 -0.127802
0.177020 -0.080868 0.043549
0.103346 -0.071193 0.040781
0.246363 -0.120044 -0.051338
0.244975 -0.148431 0.025610
0.109536 -0.052207 -0.025697
0.171302 -0.138755 0.022842
0.115727 -0.033222 -0.092176
0.176179 -0.086281 -0.126481
0.253975 -0.037197 -0.106609
3 6 0 16
3 0 8 16
3 0 12 8
3 0 14 12
3 0 3 14
3 12 11 8
3 6 1 0
3 10 3 1
3 10 1 13
3 13 6 15
3 0 1 3
3 6 13 1
3 12 14 5
3 9 14 10
3 9 5 14
3 8 11 17
3 2 11 5
3 2 17 11
3 6 16 15
3 7 16 17
3 7 15 16
3 9 4 5
3 9 10 4
3 2 4 17
3 2 5 4
3 3 10 14
3 12 5 11
3 8 17 16
3 7 4 15
3 7 17 4
3 13 4 10
3 13 15 4
