OFF

624 1244 0
-0.136354 -0.045949 -0.225011
-0.197559 -0.078027 -0.276093
-0.187127 -0.187209 -0.261652
-0.195399 -0.115950 -0.272227
-0.166651 0.044081 -0.255624
-0.056746 0.107731 -0.139479
-0.028301 0.105936 -0.103342
0.000026 0.104006 -0.067287
0.063225 0.190163 0.010249
0.095742 0.108353 0.044980
0.041916 0.220691 0.014765
0.115339 0.123190 0.063049
-0.012487 -0.120703 -0.032477
-0.033056 -0.127007 -0.055537
-0.061817 -0.074653 -0.089863
-0.002064 0.198656 -0.041854
-0.029791 0.046171 -0.060696
-0.070728 -0.051086 -0.101048
-0.094008 -0.086251 -0.125263
-0.069974 -0.122676 -0.097188
-0.048629 -0.134527 -0.072810
-0.074340 -0.095845 -0.102990
-0.012369 0.046692 -0.040724
0.046640 -0.068889 0.030009
0.036788 -0.157809 0.025034
-0.073105 0.050607 -0.112668
0.024541 0.032712 0.002618
-0.069251 -0.009148 -0.102475
-0.129248 -0.092477 -0.163272
-0.082760 -0.181817 -0.110943
0.041381 -0.036295 0.022961
-0.062437 -0.197208 -0.087956
-0.076115 0.115787 -0.125113
-0.152859 0.205615 -0.223333
-0.091341 0.164749 -0.148756
-0.096947 -0.205812 -0.127611
-0.082572 0.025206 -0.120817
-0.207917 0.111123 -0.266540
-0.179085 0.141811 -0.240577
-0.024049 0.016354 -0.052326
0.019431 -0.099080 0.001976
0.053389 0.037667 0.034133
-0.000805 -0.025053 -0.024250
0.021964 -0.016096 0.000950
-0.079770 -0.071255 -0.110089
0.054070 -0.149898 0.043463
-0.127587 -0.029375 -0.164896
-0.119889 0.016895 -0.160627
-0.081423 -0.032769 -0.114243
-0.113694 -0.074687 -0.147507
-0.104004 0.033720 -0.145470
-0.129550 0.170792 -0.192811
-0.024829 -0.193651 -0.043612
-0.026381 -0.056209 -0.051169
-0.005367 0.149395 -0.041282
-0.199988 0.136069 -0.260994
-0.045075 -0.175402 -0.067626
-0.073036 0.147133 -0.125017
-0.106526 0.143380 -0.163847
0.019097 0.095525 -0.007232
0.028284 0.204215 -0.002868
-0.184871 0.029894 -0.233369
-0.086744 -0.148160 -0.114991
0.019269 -0.131871 0.003897
0.015038 0.189514 -0.019102
0.059555 -0.009439 0.041543
-0.001870 -0.138306 -0.019547
-0.003003 -0.174874 -0.018978
0.039765 -0.097985 0.024224
-0.102620 0.108472 -0.155533
-0.154868 0.176425 -0.220779
-0.172230 0.165749 -0.236844
-0.054691 -0.103470 -0.080688
-0.110629 -0.015239 -0.147741
0.004470 0.054396 -0.021311
-0.050165 0.106977 -0.092445
-0.002073 -0.063593 -0.023897
-0.026016 -0.098131 -0.048740
-0.045554 0.016460 -0.077177
-0.046618 -0.017563 -0.076372
0.033226 -0.188150 0.025043
0.050021 -0.174609 0.041063
-0.017528 0.069327 -0.048534
0.051734 0.111311 0.027286
-0.093517 0.002649 -0.130653
-0.119338 -0.145861 -0.150482
0.042687 0.004275 0.023252
-0.076608 -0.213783 -0.106049
-0.063247 0.019142 -0.097959
-0.145401 0.060251 -0.193612
0.068491 0.180829 0.040770
-0.109551 0.221959 -0.183010
-0.065115 0.078852 -0.106206
-0.066673 -0.151749 -0.092682
-0.193114 -0.090557 -0.235279
-0.145551 -0.212776 -0.188360
-0.133146 -0.120917 -0.165969
-0.223812 -0.046723 -0.272222
-0.088559 -0.112810 -0.118192
-0.082448 0.087247 -0.129072
-0.169964 0.068588 -0.220683
-0.215349 0.082143 -0.271471
-0.191563 0.156979 -0.254830
-0.168650 0.191910 -0.236967
-0.089672 0.199437 -0.150544
0.058466 -0.093507 0.044397
-0.005933 -0.206498 -0.020641
0.081472 0.075527 0.059655
0.056103 0.079868 0.034412
-0.025618 -0.022597 -0.052346
0.074251 0.137803 0.048162
0.052923 0.193412 0.025352
-0.002535 -0.096795 -0.022348
0.027652 0.117642 0.000689
0.038894 -0.129058 0.025274
0.059520 -0.041772 0.042629
-0.024524 -0.148363 -0.045061
-0.131634 -0.063065 -0.167592
-0.124108 0.071160 -0.173111
-0.206582 0.063069 -0.260205
-0.223784 -0.015234 -0.273768
-0.022979 0.145054 -0.063105
-0.222527 -0.078115 -0.269524
-0.219977 0.047531 -0.273697
0.002180 0.176586 -0.033935
-0.028784 0.112184 -0.067579
-0.089301 0.130218 -0.142715
-0.189215 0.120098 -0.248164
-0.041930 0.197186 -0.092063
-0.069457 0.216428 -0.128737
-0.211947 -0.093480 -0.256863
-0.189695 -0.126142 -0.230549
-0.184734 0.055963 -0.235512
-0.222508 0.016231 -0.274262
-0.099762 -0.051719 -0.133263
-0.118765 0.117180 -0.174060
-0.137659 0.140627 -0.197030
-0.139479 0.189008 -0.206634
-0.164482 0.106648 -0.220698
-0.018924 0.212669 -0.064969
-0.000029 0.093898 -0.030393
-0.048948 0.163300 -0.097098
0.078143 0.162933 0.050841
0.024055 0.167462 -0.007327
0.001269 0.018826 -0.023406
-0.050990 -0.049235 -0.078812
0.076944 0.107551 0.052983
0.048589 0.151346 0.020867
0.004698 0.126547 -0.026805
-0.111512 0.182742 -0.174768
-0.191982 0.080807 -0.245770
-0.168346 0.020707 -0.214072
-0.109687 -0.109277 -0.141667
-0.171462 -0.004437 -0.215478
-0.174532 -0.055062 -0.215575
-0.203377 -0.073953 -0.247724
-0.154238 0.079668 -0.204952
-0.174426 -0.087663 -0.213814
-0.158151 -0.178182 -0.195303
-0.173006 -0.120187 -0.210951
-0.173515 -0.029714 -0.215973
-0.017038 0.178720 -0.058957
-0.156476 0.148358 -0.218736
-0.073210 0.181285 -0.128785
-0.056596 0.129895 -0.103551
-0.047798 0.052833 -0.081227
-0.203957 -0.044983 -0.249696
-0.165402 -0.206906 -0.208460
-0.181726 -0.184677 -0.223593
-0.194540 -0.148184 -0.236396
-0.163673 0.045289 -0.211328
-0.201538 -0.110056 -0.244300
-0.105000 -0.179919 -0.134098
-0.203326 -0.015964 -0.250604
-0.090952 0.053828 -0.133838
-0.201533 0.013012 -0.250523
-0.198548 0.041792 -0.249438
-0.144989 0.090780 -0.197587
0.021449 -0.169760 0.008766
0.021935 -0.071388 0.003002
0.069837 -0.166446 0.061879
0.073297 -0.146027 0.064053
0.076083 -0.125419 0.065593
0.078140 -0.104715 0.066429
0.079466 -0.083913 0.066560
0.080167 -0.063106 0.066136
0.080132 -0.042383 0.065012
0.079310 -0.021655 0.063113
0.076458 0.009179 0.058747
0.071349 0.039124 0.052318
0.061697 0.057020 0.042247
0.046129 0.069603 0.026829
0.029668 0.075034 0.008007
-0.034453 0.080112 -0.072381
-0.099794 0.078018 -0.149825
-0.115988 0.063193 -0.162948
-0.127542 0.044683 -0.171920
-0.134261 0.024576 -0.176660
-0.138609 0.003353 -0.179308
-0.141952 -0.018153 -0.181114
-0.144392 -0.039760 -0.182119
-0.145927 -0.061466 -0.182321
-0.146605 -0.083273 -0.181800
-0.146423 -0.105090 -0.180557
-0.145331 -0.126824 -0.178517
-0.143327 -0.148386 -0.175682
-0.140300 -0.169597 -0.172020
-0.134886 -0.189742 -0.166391
-0.124547 -0.208576 -0.156600
-0.109232 -0.223735 -0.142687
-0.044030 -0.226093 -0.065136
-0.059546 -0.228470 -0.085778
-0.106595 -0.234484 -0.147338
-0.065386 -0.233135 -0.098191
-0.080795 -0.235335 -0.118913
-0.084293 0.234283 -0.148080
-0.035541 0.231553 -0.088448
-0.050868 0.233714 -0.109348
-0.066141 0.235876 -0.130174
-0.135246 -0.133763 -0.219644
-0.097299 0.132148 -0.192977
-0.105539 -0.132806 -0.186645
0.041727 0.040724 -0.010700
0.076992 0.183503 0.023657
0.041267 -0.175663 0.004593
-0.023101 -0.165027 -0.079629
0.025884 -0.021553 -0.026920
-0.218091 0.033442 -0.299354
0.009047 -0.084095 -0.044100
0.055455 0.040301 0.006631
-0.075451 -0.000323 -0.155747
0.013143 0.196700 -0.055526
-0.018340 -0.227211 -0.036629
-0.074657 0.021892 -0.156184
0.077023 -0.097609 0.038648
-0.136366 -0.241681 -0.190231
-0.091131 -0.045152 -0.172781
0.069031 0.079960 0.021664
0.013978 0.161524 -0.052718
-0.012421 0.199966 -0.089214
-0.073864 0.044107 -0.156622
-0.163069 0.217461 -0.261484
0.047163 0.206961 -0.010291
0.106412 0.030921 0.086005
-0.165079 -0.234559 -0.215154
0.118546 -0.032251 0.074391
-0.199027 0.191449 -0.265766
-0.190827 -0.216563 -0.238206
0.085192 -0.146485 0.048939
0.027771 0.061591 -0.029577
-0.077680 -0.130643 -0.151265
-0.003584 -0.043061 -0.062789
-0.083438 0.131049 -0.175235
-0.019597 -0.085707 -0.080257
0.040837 -0.000440 -0.009326
0.054677 0.099743 0.002572
-0.049769 0.219848 -0.139819
0.106035 0.117951 0.054495
0.026084 -0.194726 -0.013171
-0.165125 0.065606 -0.255415
-0.013250 -0.214498 -0.063459
-0.089712 -0.190374 -0.164537
-0.229217 0.066608 -0.285405
-0.135385 -0.000148 -0.226448
-0.128804 0.111578 -0.226495
0.105987 -0.053821 0.063677
0.101901 -0.062562 0.086710
-0.207782 0.020244 -0.289830
-0.105943 -0.089990 -0.189100
-0.047908 -0.065643 -0.117189
0.025045 -0.042268 -0.026620
0.051776 -0.061778 0.008595
0.093428 -0.075391 0.052964
-0.072007 0.087713 -0.157354
-0.197731 0.161929 -0.288398
-0.066787 0.169729 -0.157216
0.069394 -0.208790 0.037264
0.097219 0.154512 0.070636
-0.050490 -0.234563 -0.111902
0.021771 -0.103317 -0.026519
-0.234201 -0.031228 -0.284686
0.087760 -0.154873 0.078249
-0.090045 -0.000308 -0.174133
-0.046013 -0.000356 -0.118819
0.010991 -0.211344 -0.031344
-0.063567 -0.129562 -0.133372
0.068263 0.208199 0.040423
0.024103 -0.062983 -0.026413
0.088620 0.182942 0.061020
-0.163599 0.087131 -0.255205
-0.159516 0.128806 -0.253852
0.082386 0.094157 0.033322
-0.089251 0.021907 -0.174571
0.013551 0.041562 -0.046526
-0.182207 -0.101501 -0.261635
0.054669 -0.000454 0.008097
-0.120012 -0.000221 -0.209484
0.039998 -0.021155 -0.009026
-0.001512 0.020587 -0.064208
0.067362 0.117867 0.017774
0.055010 0.019719 0.007318
0.003907 -0.162309 -0.044979
-0.020482 -0.106014 -0.080093
-0.211023 -0.189082 -0.256892
-0.025436 0.216730 -0.107257
-0.064565 -0.233812 -0.098796
-0.037690 -0.217785 -0.095767
-0.119403 -0.153610 -0.201313
-0.207777 -0.161086 -0.280679
0.028209 -0.220081 0.025298
0.035188 -0.207924 0.000465
-0.036886 -0.184519 -0.096391
-0.018099 -0.043456 -0.081064
-0.016575 -0.000388 -0.081889
0.082307 -0.020899 0.039591
-0.104957 -0.152992 -0.185191
0.108150 -0.019620 0.063913
0.000715 -0.197733 -0.046320
-0.107074 0.241681 -0.214686
-0.122129 -0.242432 -0.203117
-0.004103 -0.227962 -0.049516
-0.152010 0.000026 -0.240792
-0.132088 0.067712 -0.227082
-0.105789 -0.067768 -0.190082
-0.062975 -0.087846 -0.134866
-0.150448 0.235925 -0.226397
-0.093626 0.172462 -0.191997
-0.101593 0.067161 -0.193307
0.073081 -0.134112 0.036845
-0.049453 -0.128481 -0.115479
0.064029 -0.080865 0.025507
-0.000939 0.041985 -0.064821
-0.205388 0.056076 -0.289597
-0.027174 0.146003 -0.104551
-0.024890 -0.201008 -0.079631
-0.188159 0.116840 -0.277790
-0.129714 -0.211537 -0.211109
-0.151003 -0.235310 -0.228260
-0.016002 0.021010 -0.082503
-0.076461 -0.207286 -0.146669
-0.104639 -0.000293 -0.192520
-0.084971 0.109661 -0.175440
-0.122280 0.173678 -0.224080
-0.221844 -0.160062 -0.267579
0.068501 -0.000467 0.025521
-0.077524 -0.150551 -0.150176
0.053830 -0.021169 0.008397
0.112377 -0.094365 0.071883
0.039159 -0.041870 -0.008727
0.069182 0.039879 0.023963
-0.196740 0.125790 -0.285705
-0.086589 -0.224224 -0.160369
-0.088342 0.044529 -0.174924
-0.151899 -0.109591 -0.235176
-0.021367 -0.126321 -0.079929
-0.045324 0.021451 -0.119347
0.041859 0.061172 -0.011665
-0.096716 -0.241163 -0.174069
0.120487 0.030171 0.072899
-0.173708 -0.195940 -0.249681
-0.136281 -0.090667 -0.222650
-0.119103 0.022401 -0.209837
-0.116940 0.067370 -0.210290
-0.148656 0.067069 -0.241297
-0.196479 -0.096988 -0.274160
-0.076039 -0.022540 -0.155122
-0.091028 -0.151910 -0.167501
-0.160288 -0.204670 -0.237710
-0.015428 0.042409 -0.083116
-0.182164 0.022293 -0.267887
-0.031966 -0.022316 -0.099837
-0.110286 0.152780 -0.209009
-0.052397 0.186481 -0.140051
0.105775 0.062010 0.083733
-0.233824 0.001489 -0.286012
0.055379 0.060342 0.005482
0.068279 -0.168835 0.034151
-0.057538 0.087018 -0.139045
0.082338 0.207449 0.027317
-0.105635 -0.045547 -0.191064
0.045479 -0.139707 0.006705
0.115977 -0.063313 0.073604
-0.219186 0.131129 -0.279987
0.056162 0.220213 0.001871
-0.195816 0.039751 -0.280542
-0.063070 -0.108843 -0.133929
0.040815 0.121430 -0.016206
-0.004192 0.227735 -0.047502
-0.197913 -0.058527 -0.277376
-0.063410 -0.149470 -0.132283
0.083623 0.056797 0.036682
-0.110791 -0.240412 -0.160963
0.106963 0.100355 0.056200
0.048961 -0.101427 0.007998
0.013001 0.020572 -0.045931
-0.035841 -0.147032 -0.097199
0.083508 0.018081 0.038668
-0.008224 -0.144593 -0.061980
-0.147130 0.088594 -0.241087
0.036888 -0.082477 -0.008708
0.101835 -0.155624 0.065143
0.027639 0.041143 -0.028613
-0.050671 -0.204011 -0.113153
-0.134450 0.022610 -0.226821
-0.112094 -0.226360 -0.191552
-0.002062 -0.000403 -0.063612
-0.078614 0.189345 -0.174274
0.077244 -0.182869 0.069763
-0.103730 0.022329 -0.192874
0.050694 0.191936 -0.006103
-0.117045 -0.192357 -0.197423
-0.033279 -0.065249 -0.098828
-0.230926 -0.096431 -0.278565
-0.224849 0.099013 -0.283236
0.104308 -0.031501 0.087277
-0.219040 -0.064711 -0.295172
0.098065 0.073715 0.049401
-0.126947 0.133099 -0.226021
-0.048956 -0.107762 -0.116036
-0.151382 -0.131139 -0.233673
0.109219 0.014726 0.063092
0.093541 -0.124384 0.082090
-0.047356 -0.044243 -0.117785
-0.044635 0.043257 -0.119876
-0.120995 -0.045748 -0.208038
-0.004333 -0.064187 -0.062385
-0.184951 0.190698 -0.278872
0.102844 -0.087468 0.062469
0.000221 0.143536 -0.069333
0.014350 0.123351 -0.050245
-0.035936 0.233468 -0.123087
-0.086186 0.088542 -0.175370
-0.041453 -0.230512 -0.067713
0.080864 0.131795 0.029832
-0.135763 -0.112215 -0.221147
-0.192685 0.078710 -0.279839
-0.050315 -0.167743 -0.114468
-0.000109 0.083830 -0.066321
-0.062137 -0.220937 -0.128070
-0.029467 0.063959 -0.102102
0.015528 -0.178660 -0.028621
-0.005275 -0.084901 -0.062179
0.098515 0.036630 0.051815
-0.077367 -0.170460 -0.149086
0.120117 -0.000909 0.074219
-0.113980 0.111102 -0.209973
-0.176590 -0.217314 -0.251093
-0.043851 0.064790 -0.120306
0.033893 -0.121989 -0.009511
-0.219964 -0.031978 -0.297572
-0.014299 0.084661 -0.084329
-0.060732 -0.000339 -0.137283
-0.050011 0.234219 -0.109982
0.080106 -0.059598 0.039557
-0.072935 0.065910 -0.156988
-0.061991 -0.044500 -0.136141
-0.151074 0.022784 -0.241165
0.109183 0.048944 0.061221
-0.214980 0.065858 -0.298292
-0.027101 0.230977 -0.078741
-0.102821 0.044951 -0.193227
-0.133267 -0.174414 -0.215980
-0.038007 0.203233 -0.122885
-0.205111 0.130378 -0.293093
-0.028683 0.085491 -0.102532
0.089712 -0.111623 0.051334
-0.171201 0.142564 -0.264565
0.004781 -0.223639 -0.005553
0.053810 0.138603 -0.000385
0.093887 0.143546 0.041569
-0.062424 -0.066447 -0.135462
-0.073603 -0.237864 -0.142986
0.119851 0.061259 0.070627
-0.089012 0.209221 -0.190013
-0.102058 -0.210289 -0.179987
-0.043068 0.086322 -0.120735
-0.208820 -0.015736 -0.288860
-0.104375 -0.173177 -0.183737
-0.018848 -0.064581 -0.080661
-0.063602 0.206228 -0.156551
0.097950 -0.000719 0.053285
-0.175463 0.187870 -0.270615
-0.042277 0.107036 -0.121169
0.012451 -0.000417 -0.045336
-0.098832 0.110760 -0.193182
-0.034525 -0.107094 -0.097868
-0.006160 -0.105208 -0.062015
-0.149978 -0.151059 -0.231469
-0.073928 0.222966 -0.172170
-0.136372 0.235174 -0.239503
-0.076627 -0.044756 -0.154498
-0.031294 -0.000372 -0.100354
0.027089 0.020153 -0.028018
-0.216851 -0.097182 -0.291671
0.098785 -0.120425 0.060411
-0.227265 -0.128646 -0.273779
-0.081754 0.239952 -0.185567
0.051366 -0.191186 0.019362
0.055318 -0.208040 0.050370
-0.130661 0.090057 -0.226969
-0.090543 -0.022935 -0.173405
-0.118168 0.045160 -0.210211
-0.069576 0.129950 -0.157493
-0.058845 0.236710 -0.154327
-0.087678 -0.237112 -0.129880
0.038164 0.193710 -0.022454
-0.197676 0.000506 -0.280149
-0.147564 0.204482 -0.247487
-0.048459 -0.087042 -0.116592
-0.152648 -0.088860 -0.236847
0.052075 0.174474 -0.003884
-0.165136 0.178900 -0.261277
0.022968 -0.083286 -0.026404
-0.017337 -0.021922 -0.081477
0.042447 -0.220832 0.012411
-0.121112 -0.090329 -0.205875
-0.077059 -0.066703 -0.153818
0.065986 0.155238 0.014685
0.098139 -0.093614 0.084769
0.111457 0.153761 0.057749
-0.193813 -0.134373 -0.269990
-0.140898 0.151242 -0.238966
-0.182708 0.153318 -0.275068
-0.010492 -0.181658 -0.062305
0.019010 -0.224662 -0.018432
-0.120392 -0.133284 -0.203145
-0.060043 0.021467 -0.137811
-0.030721 0.021026 -0.100967
-0.136566 -0.238871 -0.215688
-0.095829 0.240703 -0.172461
-0.077492 -0.088650 -0.153139
-0.013917 0.105105 -0.085139
-0.059249 0.043682 -0.138249
0.090759 0.176843 0.037066
-0.072920 0.237461 -0.141221
0.107617 -0.125135 0.068984
-0.054741 0.148471 -0.139980
-0.179707 0.063441 -0.267874
0.027304 0.141345 -0.034394
-0.082043 0.150938 -0.175096
-0.133515 0.045368 -0.227194
-0.035410 -0.127401 -0.097704
-0.091515 -0.110728 -0.169892
0.011691 -0.021542 -0.044924
-0.115513 0.089714 -0.210178
-0.012864 0.230226 -0.091628
-0.219748 0.000738 -0.299118
0.066664 -0.041079 0.025897
-0.121311 0.242432 -0.201800
-0.099165 0.225461 -0.203386
0.060897 -0.200266 0.028779
-0.145001 -0.208104 -0.224409
-0.046685 -0.022299 -0.118302
0.013816 0.062281 -0.047420
-0.145273 0.110115 -0.240613
-0.177145 0.218212 -0.248377
0.107701 0.123434 0.069028
-0.105137 -0.022920 -0.191792
0.030341 -0.159586 -0.010922
-0.058466 0.065215 -0.138678
-0.176100 0.103758 -0.266845
0.091474 -0.183892 0.056883
-0.135870 -0.023049 -0.225730
-0.032727 -0.043850 -0.099425
0.006653 -0.124158 -0.044330
-0.120958 -0.068107 -0.206857
-0.232167 0.034193 -0.286249
-0.039906 0.166993 -0.122467
-0.087414 0.066332 -0.175291
-0.012862 0.164257 -0.087499
0.026644 -0.000429 -0.027331
0.038023 -0.062173 -0.008717
0.026071 0.177617 -0.037586
0.102858 0.182191 0.048134
0.069250 0.213831 0.014594
0.018900 -0.142149 -0.027245
0.041282 0.020142 -0.010013
-0.034028 -0.086374 -0.098424
-0.091285 -0.067373 -0.171799
-0.120594 -0.111876 -0.204372
-0.150083 0.044724 -0.241409
0.079347 -0.179701 0.045147
0.056450 -0.156601 0.022357
-0.210773 0.098262 -0.296342
-0.100365 0.089372 -0.193386
0.096184 -0.038331 0.053607
-0.211807 0.162680 -0.275292
-0.063388 -0.187515 -0.130568
-0.070792 0.108831 -0.157424
-0.077586 -0.109647 -0.152202
0.010931 -0.042667 -0.044513
-0.213189 -0.129397 -0.286885
0.078556 0.166854 0.025909
-0.061320 -0.022556 -0.136658
-0.000673 0.062704 -0.065714
-0.030032 0.042833 -0.101496
0.060618 -0.119827 0.024332
-0.208653 -0.051869 -0.286916
-0.196785 -0.189832 -0.269778
-0.116575 0.210971 -0.221206
-0.091717 -0.089320 -0.171120
-0.001188 0.213475 -0.074801
-0.201569 0.091349 -0.288041
-0.027215 -0.231262 -0.080599
0.027448 0.102215 -0.032260
0.000141 0.180479 -0.071513
-0.091610 -0.131724 -0.168955
0.103946 0.093107 0.080307
-0.002824 -0.021937 -0.063200
-0.135409 0.189629 -0.236272
-0.026163 0.183480 -0.105841
0.041992 0.081620 -0.012629
-0.120497 -0.023121 -0.208766
-0.105741 -0.111398 -0.187873
-0.112123 0.132623 -0.209499
0.009989 -0.063381 -0.044307
-0.154243 0.168288 -0.251339
-0.014863 0.063535 -0.083722
-0.233277 -0.063960 -0.282285
0.105879 -0.000158 0.087106
-0.105646 0.191450 -0.207046
-0.127319 0.223081 -0.231087
-0.146778 -0.189542 -0.226845
-0.136317 -0.068308 -0.223831
3 597 476 388
3 476 506 388
3 506 321 388
3 321 562 388
3 562 0 388
3 0 623 388
3 623 509 388
3 509 1 388
3 509 294 1
3 506 369 321
3 597 449 476
3 321 263 562
3 623 360 509
3 388 415 597
3 591 520 308
3 520 2 308
3 520 359 2
3 520 367 359
3 520 622 367
3 520 487 622
3 520 419 487
3 520 3 419
3 3 294 419
3 294 353 419
3 294 509 353
3 369 456 321
3 369 4 456
3 487 461 622
3 419 219 487
3 509 360 353
3 569 428 333
3 428 531 333
3 531 6 333
3 6 482 333
3 482 536 333
3 536 567 333
3 428 7 531
3 428 429 7
3 429 437 7
3 429 604 437
3 604 553 437
3 553 594 437
3 482 5 536
3 604 249 553
3 5 502 536
3 604 611 249
3 482 475 5
3 242 10 383
3 242 505 10
3 505 387 10
3 505 231 387
3 231 601 387
3 601 545 387
3 387 60 10
3 387 64 60
3 387 15 64
3 505 572 231
3 505 409 572
3 409 510 572
3 510 538 572
3 510 468 538
3 468 386 538
3 538 238 572
3 510 517 468
3 409 8 510
3 373 472 607
3 472 11 607
3 472 392 11
3 11 556 607
3 11 519 556
3 392 257 11
3 472 416 392
3 392 9 257
3 257 469 11
3 70 51 137
3 70 162 51
3 162 136 51
3 204 159 205
3 159 158 205
3 159 168 158
3 159 169 168
3 315 477 221
3 364 1 3
3 525 221 219
3 359 367 2
3 367 336 551
3 259 4 289
3 252 220 502
3 349 229 222
3 614 417 220
3 611 222 356
3 571 348 399
3 512 399 228
3 8 223 533
3 378 574 383
3 242 383 505
3 144 26 74
3 114 105 68
3 309 498 80
3 62 85 172
3 88 25 36
3 48 84 73
3 277 146 607
3 83 147 113
3 148 113 143
3 42 53 76
3 196 50 195
3 194 99 69
3 201 202 117
3 134 46 117
3 85 152 96
3 93 20 19
3 80 24 178
3 96 204 205
3 40 68 179
3 53 109 145
3 145 17 14
3 26 191 192
3 43 179 30
3 45 114 24
3 72 20 13
3 12 116 66
3 32 92 75
3 74 26 192
3 266 414 186
3 189 107 190
3 189 373 107
3 99 92 32
3 280 120 374
3 117 28 49
3 167 158 168
3 31 87 211
3 19 72 21
3 124 161 54
3 98 18 152
3 232 52 210
3 164 121 141
3 78 27 79
3 119 262 123
3 57 126 32
3 51 149 137
3 58 34 149
3 504 305 214
3 214 35 504
3 89 197 196
3 195 50 174
3 160 200 199
3 162 138 136
3 176 123 133
3 138 156 177
3 63 112 66
3 27 17 79
3 21 14 44
3 116 67 66
3 78 16 165
3 190 41 189
3 112 63 40
3 63 24 114
3 134 48 73
3 82 193 16
3 80 498 81
3 166 173 97
3 518 184 183
3 23 30 179
3 50 47 84
3 157 202 201
3 19 21 98
3 29 31 93
3 174 50 36
3 18 98 21
3 202 157 203
3 78 79 39
3 34 126 57
3 82 16 22
3 58 135 69
3 192 59 74
3 13 116 12
3 52 106 67
3 178 66 67
3 39 79 109
3 34 57 163
3 325 137 548
3 103 555 246
3 207 172 85
3 113 59 192
3 128 161 139
3 534 529 215
3 217 218 129
3 146 110 83
3 73 84 47
3 148 121 125
3 108 191 190
3 156 170 89
3 200 117 46
3 165 88 78
3 56 52 116
3 305 432 211
3 108 83 192
3 43 26 144
3 121 54 161
3 107 373 607
3 421 182 281
3 81 180 45
3 407 180 81
3 114 68 40
3 232 106 52
3 26 43 86
3 83 113 192
3 149 104 91
3 165 16 193
3 129 104 163
3 102 246 586
3 33 137 325
3 58 149 51
3 172 29 62
3 117 202 28
3 92 165 193
3 135 58 136
3 141 121 161
3 44 17 48
3 128 139 216
3 36 84 27
3 66 112 12
3 66 178 63
3 13 12 77
3 77 112 76
3 46 198 199
3 99 25 92
3 20 72 19
3 40 63 114
3 182 181 281
3 182 105 114
3 115 185 186
3 178 67 467
3 68 23 179
3 190 107 108
3 619 188 187
3 164 32 75
3 79 145 109
3 52 67 116
3 17 44 14
3 208 209 35
3 45 180 181
3 216 217 128
3 16 78 39
3 247 244 167
3 140 74 59
3 31 211 210
3 25 99 174
3 100 150 132
3 139 15 387
3 193 75 92
3 128 163 141
3 22 144 74
3 90 147 142
3 198 73 47
3 178 24 63
3 432 210 211
3 200 160 154
3 618 97 280
3 155 97 122
3 158 206 205
3 210 56 31
3 197 198 47
3 150 138 127
3 201 200 154
3 305 211 213
3 104 215 91
3 127 38 55
3 194 174 99
3 196 118 89
3 198 46 73
3 153 199 198
3 119 101 262
3 37 382 413
3 128 129 163
3 160 199 153
3 58 69 126
3 189 243 373
3 45 182 114
3 76 112 179
3 81 45 24
3 36 27 88
3 188 189 41
3 189 188 243
3 26 41 191
3 187 414 619
3 28 96 152
3 185 115 23
3 91 529 548
3 110 146 277
3 204 96 203
3 182 45 181
3 139 387 459
3 34 58 126
3 72 77 53
3 179 112 40
3 72 53 145
3 39 109 42
3 305 213 87
3 176 175 61
3 432 232 210
3 87 35 214
3 198 197 151
3 157 201 154
3 413 101 37
3 100 132 170
3 412 495 130
3 495 343 169
3 193 82 125
3 57 141 163
3 133 566 374
3 101 150 37
3 120 97 173
3 173 153 175
3 53 42 109
3 191 108 192
3 194 69 118
3 140 148 125
3 102 586 55
3 101 119 150
3 132 61 170
3 61 132 176
3 143 54 148
3 143 64 124
3 548 137 91
3 218 534 129
3 618 122 97
3 244 95 167
3 206 85 205
3 171 169 131
3 156 89 177
3 134 44 48
3 71 103 102
3 175 153 61
3 459 452 216
3 81 498 407
3 555 103 33
3 215 129 534
3 215 104 129
3 71 70 103
3 10 60 111
3 119 132 150
3 72 14 21
3 194 118 195
3 161 124 15
3 22 16 39
3 146 83 108
3 216 452 217
3 69 135 118
3 71 162 70
3 143 111 60
3 266 186 185
3 459 216 139
3 141 161 128
3 28 203 96
3 65 115 187
3 184 185 105
3 67 106 467
3 142 147 110
3 64 143 60
3 59 113 148
3 127 37 150
3 57 32 164
3 149 91 137
3 137 33 70
3 74 140 82
3 196 195 118
3 197 47 196
3 165 25 88
3 134 73 46
3 203 157 159
3 94 155 130
3 151 153 198
3 98 62 19
3 158 207 206
3 166 154 160
3 197 89 170
3 18 21 44
3 163 104 34
3 171 131 94
3 123 176 119
3 209 391 504
3 262 566 123
3 97 155 166
3 200 46 199
3 235 391 208
3 155 154 166
3 95 158 167
3 17 145 79
3 92 25 165
3 135 136 177
3 149 34 104
3 103 246 102
3 42 144 39
3 182 421 183
3 555 33 325
3 32 69 99
3 146 108 107
3 84 36 50
3 130 155 122
3 18 134 49
3 159 157 94
3 412 130 122
3 122 618 412
3 95 207 158
3 85 96 205
3 37 127 55
3 132 119 176
3 31 56 93
3 208 212 209
3 280 97 120
3 130 495 171
3 90 142 288
3 145 14 72
3 133 123 566
3 173 166 160
3 200 201 117
3 174 36 25
3 195 174 194
3 129 128 217
3 208 35 172
3 156 100 170
3 80 81 24
3 77 12 112
3 184 518 266
3 23 105 185
3 309 80 178
3 23 68 105
3 281 181 180
3 41 26 86
3 30 23 115
3 90 288 286
3 20 56 116
3 49 152 18
3 467 309 178
3 42 76 179
3 183 105 182
3 140 125 82
3 286 10 111
3 43 144 42
3 90 111 147
3 65 187 188
3 107 607 146
3 124 54 143
3 143 113 147
3 22 39 144
3 20 116 13
3 142 110 277
3 218 452 534
3 118 177 89
3 382 55 586
3 164 75 125
3 120 175 133
3 71 102 38
3 138 100 156
3 150 100 138
3 382 37 55
3 41 65 188
3 84 48 27
3 18 44 134
3 153 151 61
3 153 173 160
3 17 27 48
3 374 120 133
3 266 185 184
3 155 94 154
3 27 78 88
3 303 247 168
3 38 162 71
3 204 203 159
3 169 171 495
3 13 77 72
3 159 94 131
3 42 179 43
3 95 208 207
3 117 49 134
3 94 130 171
3 62 98 152
3 168 247 167
3 35 29 172
3 28 152 49
3 102 55 38
3 87 29 35
3 244 235 95
3 518 183 421
3 303 168 169
3 214 305 87
3 208 172 207
3 173 175 120
3 115 65 30
3 85 206 207
3 91 215 529
3 32 126 69
3 136 58 51
3 197 170 151
3 217 452 218
3 83 110 147
3 138 162 38
3 148 140 59
3 184 105 183
3 190 191 41
3 210 52 56
3 76 53 77
3 30 86 43
3 187 115 186
3 188 619 243
3 106 232 467
3 136 138 177
3 41 86 65
3 75 193 125
3 288 142 277
3 286 111 90
3 124 64 15
3 143 147 111
3 121 164 125
3 138 38 127
3 177 118 135
3 50 196 47
3 65 86 30
3 61 151 170
3 176 133 175
3 94 157 154
3 203 28 202
3 19 62 93
3 208 95 235
3 131 169 159
3 31 29 87
3 209 212 391
3 391 212 208
3 85 62 152
3 303 169 343
3 29 93 62
3 504 35 209
3 414 187 186
3 213 211 87
3 407 281 180
3 56 20 93
3 70 33 103
3 161 15 139
3 82 22 74
3 148 54 121
3 57 164 141
3 413 262 101
3 227 435 332
3 347 248 494
3 443 250 345
3 295 254 344
3 319 337 528
3 541 354 329
3 602 458 335
3 350 583 522
3 427 381 465
3 556 277 607
3 556 519 277
3 519 573 277
3 288 277 573
3 573 378 288
3 286 288 378
3 358 472 243
3 373 243 472
3 444 358 619
3 243 619 358
3 245 444 414
3 619 414 444
3 381 245 266
3 414 266 245
3 347 381 518
3 266 518 381
3 535 347 421
3 518 421 347
3 400 535 281
3 421 281 535
3 276 561 498
3 407 498 561
3 561 400 407
3 281 407 400
3 378 383 286
3 10 286 383
3 514 276 309
3 498 309 276
3 524 514 467
3 309 467 514
3 320 524 232
3 467 232 524
3 459 387 545
3 603 320 432
3 232 432 320
3 545 430 459
3 452 459 430
3 278 603 305
3 432 305 603
3 430 503 452
3 534 452 503
3 471 278 504
3 305 504 278
3 503 496 534
3 529 534 496
3 357 471 391
3 504 391 471
3 496 318 529
3 548 529 318
3 319 357 235
3 391 235 357
3 318 489 548
3 325 548 489
3 337 319 244
3 235 244 319
3 489 241 325
3 555 325 241
3 446 337 247
3 244 247 337
3 241 426 555
3 246 555 426
3 426 274 246
3 586 246 274
3 274 463 586
3 382 586 463
3 463 583 382
3 413 382 583
3 583 458 413
3 262 413 458
3 458 227 262
3 566 262 227
3 227 546 566
3 374 566 546
3 546 449 374
3 280 374 449
3 449 415 280
3 618 280 415
3 415 493 618
3 412 618 493
3 493 591 412
3 495 412 591
3 591 308 495
3 343 495 308
3 598 446 303
3 247 303 446
3 308 598 343
3 303 343 598
3 257 9 469
3 519 11 533
3 469 533 11
3 433 469 9
3 433 517 469
3 433 299 517
3 433 9 299
3 592 533 469
3 592 8 533
3 592 517 8
3 592 469 517
3 468 517 299
3 468 299 386
3 510 8 517
3 519 533 573
3 378 573 533
3 392 416 9
3 457 358 442
3 457 472 358
3 457 416 472
3 457 442 416
3 420 444 480
3 420 358 444
3 420 442 358
3 420 480 442
3 316 245 585
3 316 444 245
3 316 480 444
3 316 585 480
3 265 381 272
3 265 245 381
3 265 585 245
3 265 272 585
3 347 465 381
3 427 272 381
3 427 465 272
3 535 248 347
3 494 465 347
3 494 248 465
3 400 581 535
3 248 535 581
3 561 276 400
3 581 400 276
3 223 378 533
3 223 8 378
3 574 8 383
3 574 378 8
3 291 416 237
3 291 9 416
3 291 299 9
3 291 237 299
3 390 442 349
3 390 416 442
3 390 237 416
3 390 349 237
3 396 480 344
3 396 442 480
3 396 349 442
3 396 344 349
3 314 585 547
3 314 480 585
3 314 344 480
3 314 547 344
3 453 272 330
3 453 585 272
3 453 547 585
3 453 330 547
3 234 465 596
3 234 272 465
3 234 330 272
3 234 596 330
3 328 248 582
3 328 465 248
3 328 596 465
3 328 582 596
3 376 581 497
3 376 248 581
3 376 582 248
3 376 497 582
3 550 276 514
3 550 581 276
3 550 497 581
3 550 514 497
3 409 383 8
3 409 505 383
3 255 237 611
3 255 299 237
3 255 386 299
3 255 611 386
3 375 349 222
3 375 237 349
3 375 611 237
3 375 222 611
3 300 344 254
3 300 349 344
3 229 300 222
3 229 349 300
3 576 300 254
3 576 222 300
3 346 547 348
3 346 344 547
3 295 346 254
3 295 344 346
3 297 346 348
3 297 254 346
3 271 330 399
3 271 547 330
3 271 348 547
3 271 399 348
3 393 596 448
3 393 330 596
3 393 399 330
3 393 448 399
3 380 582 558
3 380 596 582
3 380 448 596
3 380 558 448
3 224 497 258
3 224 582 497
3 224 558 582
3 224 258 558
3 310 514 524
3 310 497 514
3 310 258 497
3 310 524 258
3 572 238 231
3 538 386 429
3 538 429 238
3 604 386 611
3 604 429 386
3 401 249 222
3 401 293 249
3 356 249 611
3 356 222 249
3 553 249 293
3 570 492 254
3 570 483 492
3 576 492 222
3 576 254 492
3 401 492 293
3 401 222 492
3 394 492 483
3 394 293 492
3 270 226 348
3 270 590 226
3 297 226 254
3 297 348 226
3 570 226 483
3 570 254 226
3 543 226 590
3 543 483 226
3 512 287 399
3 512 228 287
3 571 287 348
3 571 399 287
3 270 287 590
3 270 348 287
3 615 287 228
3 615 590 287
3 279 448 564
3 279 399 448
3 279 228 399
3 279 564 228
3 575 558 301
3 575 448 558
3 575 564 448
3 575 301 564
3 440 258 317
3 440 558 258
3 440 301 558
3 440 317 301
3 284 524 320
3 284 258 524
3 284 317 258
3 284 320 317
3 601 231 239
3 601 239 545
3 605 238 569
3 605 231 238
3 605 239 231
3 605 569 239
3 428 238 429
3 428 569 238
3 437 450 7
3 531 7 450
3 331 594 293
3 331 368 594
3 553 293 594
3 437 594 450
3 617 594 368
3 617 450 594
3 405 298 483
3 405 313 298
3 394 298 293
3 394 483 298
3 331 298 368
3 331 293 298
3 338 298 313
3 338 368 298
3 251 608 590
3 251 312 608
3 543 608 483
3 543 590 608
3 405 608 313
3 405 483 608
3 513 608 312
3 513 313 608
3 441 425 228
3 441 253 425
3 615 425 590
3 615 228 425
3 251 425 312
3 251 590 425
3 478 425 253
3 478 312 425
3 486 564 354
3 486 228 564
3 441 486 253
3 441 228 486
3 302 486 354
3 302 253 486
3 397 301 225
3 397 564 301
3 397 354 564
3 397 225 354
3 523 317 334
3 523 301 317
3 523 225 301
3 523 334 225
3 260 320 603
3 260 317 320
3 260 334 317
3 260 603 334
3 304 239 462
3 304 545 239
3 304 430 545
3 304 462 430
3 610 569 567
3 610 239 569
3 610 462 239
3 610 567 462
3 333 567 569
3 464 6 450
3 464 475 6
3 531 450 6
3 482 6 475
3 595 439 368
3 595 423 439
3 617 439 450
3 617 368 439
3 464 439 475
3 464 450 439
3 447 439 423
3 447 475 439
3 491 527 313
3 491 283 527
3 338 527 368
3 338 313 527
3 595 527 423
3 595 368 527
3 355 527 283
3 355 423 527
3 563 370 312
3 563 422 370
3 513 370 313
3 513 312 370
3 491 370 283
3 491 313 370
3 552 370 422
3 552 283 370
3 577 411 253
3 577 508 411
3 478 411 312
3 478 253 411
3 563 411 422
3 563 312 411
3 269 411 508
3 269 422 411
3 541 485 354
3 541 329 485
3 302 485 253
3 302 354 485
3 577 485 508
3 577 253 485
3 418 485 329
3 418 508 485
3 395 225 436
3 395 354 225
3 395 329 354
3 395 436 329
3 311 334 402
3 311 225 334
3 311 436 225
3 311 402 436
3 306 603 278
3 306 334 603
3 306 402 334
3 306 278 402
3 256 462 479
3 256 430 462
3 256 503 430
3 256 479 503
3 372 567 275
3 372 462 567
3 372 479 462
3 372 275 479
3 536 275 567
3 536 502 275
3 377 5 475
3 377 273 5
3 588 5 273
3 588 502 5
3 532 559 423
3 532 240 559
3 447 559 475
3 447 423 559
3 377 559 273
3 377 475 559
3 454 559 240
3 454 273 559
3 451 526 283
3 451 230 526
3 355 526 423
3 355 283 526
3 532 526 240
3 532 423 526
3 233 526 230
3 233 240 526
3 455 593 422
3 455 490 593
3 552 593 283
3 552 422 593
3 451 593 230
3 451 283 593
3 365 593 490
3 365 230 593
3 324 470 508
3 324 530 470
3 269 470 422
3 269 508 470
3 455 470 490
3 455 422 470
3 516 470 530
3 516 490 470
3 285 385 329
3 285 250 385
3 418 385 508
3 418 329 385
3 324 385 530
3 324 508 385
3 589 385 250
3 589 530 385
3 389 436 443
3 389 329 436
3 285 389 250
3 285 329 389
3 345 389 443
3 345 250 389
3 587 402 339
3 587 436 402
3 587 443 436
3 587 339 443
3 438 278 471
3 438 402 278
3 438 339 402
3 438 471 339
3 488 479 473
3 488 503 479
3 488 496 503
3 488 473 496
3 406 275 326
3 406 479 275
3 406 473 479
3 406 326 473
3 539 502 220
3 539 275 502
3 539 326 275
3 539 220 326
3 431 341 273
3 431 584 341
3 588 341 502
3 588 273 341
3 252 341 220
3 252 502 341
3 484 341 584
3 484 220 341
3 352 568 240
3 352 460 568
3 454 568 273
3 454 240 568
3 431 568 584
3 431 273 568
3 327 568 460
3 327 584 568
3 282 292 230
3 282 340 292
3 233 292 240
3 233 230 292
3 352 292 460
3 352 240 292
3 408 292 340
3 408 460 292
3 236 500 490
3 236 379 500
3 365 500 230
3 365 490 500
3 282 500 340
3 282 230 500
3 557 500 379
3 557 340 500
3 600 578 530
3 600 268 578
3 516 578 490
3 516 530 578
3 236 578 379
3 236 490 578
3 323 578 268
3 323 379 578
3 606 542 250
3 606 221 542
3 589 542 530
3 589 250 542
3 600 542 268
3 600 530 542
3 613 542 221
3 613 268 542
3 366 443 477
3 366 250 443
3 606 366 221
3 606 250 366
3 315 366 477
3 315 221 366
3 261 339 474
3 261 443 339
3 261 477 443
3 261 474 477
3 351 471 357
3 351 339 471
3 351 474 339
3 351 357 474
3 549 473 599
3 549 496 473
3 549 318 496
3 549 599 318
3 620 326 342
3 620 473 326
3 620 599 473
3 620 342 599
3 371 220 417
3 371 326 220
3 371 342 326
3 371 417 342
3 544 445 584
3 544 499 445
3 484 445 220
3 484 584 445
3 614 445 417
3 614 220 445
3 264 445 499
3 264 417 445
3 501 362 460
3 501 540 362
3 327 362 584
3 327 460 362
3 544 362 499
3 544 584 362
3 322 362 540
3 322 499 362
3 296 361 340
3 296 263 361
3 408 361 460
3 408 340 361
3 501 361 540
3 501 460 361
3 403 361 263
3 403 540 361
3 424 612 379
3 424 0 612
3 557 612 340
3 557 379 612
3 296 612 263
3 296 340 612
3 562 612 0
3 562 263 612
3 515 565 268
3 515 360 565
3 323 565 379
3 323 268 565
3 424 565 0
3 424 379 565
3 623 565 360
3 623 0 565
3 525 579 221
3 525 219 579
3 613 579 268
3 613 221 579
3 515 579 360
3 515 268 579
3 434 579 219
3 434 360 579
3 307 477 461
3 307 221 477
3 307 219 221
3 307 461 219
3 410 474 336
3 410 477 474
3 410 461 477
3 410 336 461
3 404 357 319
3 404 474 357
3 404 336 474
3 404 319 336
3 621 599 507
3 621 318 599
3 621 489 318
3 621 507 489
3 609 342 616
3 609 599 342
3 609 507 599
3 609 616 507
3 521 417 290
3 521 342 417
3 521 616 342
3 521 290 616
3 398 554 499
3 398 289 554
3 264 554 417
3 264 499 554
3 554 290 417
3 554 289 290
3 580 363 540
3 580 4 363
3 322 363 499
3 322 540 363
3 398 363 289
3 398 499 363
3 259 363 4
3 259 289 363
3 321 456 263
3 403 456 540
3 403 263 456
3 580 456 4
3 580 540 456
3 419 353 219
3 434 353 360
3 434 219 353
3 487 219 461
3 622 336 367
3 622 461 336
3 528 336 319
3 528 337 336
3 551 337 367
3 551 336 337
3 507 481 489
3 241 489 481
3 511 616 522
3 511 507 616
3 511 481 507
3 511 522 481
3 466 290 335
3 466 616 290
3 466 522 616
3 466 335 522
3 560 289 435
3 560 290 289
3 560 335 290
3 560 435 335
3 537 4 384
3 537 289 4
3 537 435 289
3 537 384 435
3 369 384 4
3 369 506 384
3 294 3 1
3 337 446 367
3 2 367 446
3 481 274 241
3 426 241 274
3 522 463 481
3 274 481 463
3 350 335 583
3 350 522 335
3 463 522 583
3 602 435 458
3 602 335 435
3 583 335 458
3 332 384 227
3 332 435 384
3 458 435 227
3 267 506 546
3 267 384 506
3 267 227 384
3 267 546 227
3 476 546 506
3 476 449 546
3 388 1 415
3 597 415 449
3 364 493 1
3 364 3 493
3 415 1 493
3 520 591 3
3 493 3 591
3 446 598 2
3 308 2 598
