OFF

158 312 0
-0.082370 -0.042061 0.083809
-0.149778 0.038177 0.031155
-0.070839 -0.043926 0.002067
-0.086848 0.045201 -0.183461
-0.069132 0.043916 -0.233850
-0.071162 -0.044512 -0.017213
-0.125785 -0.018606 -0.488357
-0.125230 -0.024547 -0.475278
-0.068948 0.041817 -0.302864
-0.076636 -0.043910 0.012005
-0.069720 -0.051248 -0.268408
-0.162263 -0.005701 -0.478834
-0.075343 -0.051234 -0.266310
-0.075320 -0.051198 -0.264937
-0.071201 -0.044582 -0.019526
-0.069624 -0.051097 -0.262719
-0.074399 -0.049744 -0.210024
-0.149755 -0.031490 0.032878
-0.116969 0.042711 -0.302177
-0.069496 -0.046213 -0.077413
-0.069821 0.042971 -0.274909
-0.147581 0.031488 -0.389452
-0.156057 0.000576 -0.476040
-0.149501 -0.045001 -0.387527
-0.166180 0.003623 -0.408329
-0.142912 0.025636 -0.419591
-0.163189 -0.019606 -0.454526
-0.074793 0.043952 -0.233951
-0.088675 0.042695 -0.292344
-0.073467 -0.048274 -0.154494
-0.074107 0.044892 -0.193072
-0.166064 -0.010655 -0.453003
-0.071831 -0.045461 -0.048177
-0.068457 -0.049256 -0.193152
-0.069097 0.043964 -0.231731
-0.070021 0.042698 -0.286791
-0.066096 -0.050285 -0.243879
-0.140456 0.039873 -0.308376
-0.075281 -0.051137 -0.262623
-0.075479 0.043011 -0.274815
-0.111999 0.045000 -0.219301
-0.071848 -0.045722 -0.058087
-0.158765 -0.006221 -0.485515
-0.164461 -0.009948 -0.474240
-0.069782 0.043024 -0.272595
-0.086044 -0.047856 -0.135083
-0.156981 -0.040961 -0.319607
-0.074754 0.044005 -0.231637
-0.141388 -0.018846 -0.485274
-0.075678 0.042737 -0.286697
-0.074114 -0.049295 -0.193056
-0.073428 -0.048213 -0.152180
-0.131176 -0.051982 -0.304701
-0.066039 -0.050163 -0.240487
-0.093910 -0.052062 -0.292256
-0.068418 -0.049194 -0.190839
-0.077777 0.042703 -0.296166
-0.069982 0.042751 -0.284477
-0.069232 -0.051132 -0.319332
-0.069262 0.040437 -0.321597
-0.143157 0.015536 -0.449092
-0.100310 0.042676 -0.294674
-0.086816 -0.049075 -0.181129
-0.107406 0.052524 0.085790
-0.075440 0.043064 -0.272501
-0.152153 -0.037536 -0.421030
-0.125145 -0.033343 -0.450757
-0.119095 -0.038287 0.170513
-0.105888 0.053060 0.174364
-0.071810 -0.045660 -0.055773
-0.069751 0.043066 -0.270741
-0.074426 -0.051006 -0.326527
-0.163816 -0.000885 -0.461078
-0.069790 -0.051358 -0.272575
-0.066943 -0.052016 -0.306533
-0.106044 -0.045106 0.017805
-0.088032 0.043577 -0.254012
-0.070878 -0.043996 -0.000247
-0.074761 -0.050316 -0.231619
-0.074075 -0.049234 -0.190743
-0.075639 0.042791 -0.284383
-0.067926 -0.051222 -0.323089
-0.075414 0.043100 -0.270959
-0.069065 -0.050215 -0.229401
-0.074456 0.039948 -0.328777
-0.069718 0.043113 -0.268739
-0.069989 -0.051673 -0.284457
-0.069695 0.043145 -0.267366
-0.103499 -0.043876 0.065391
-0.072457 -0.046681 -0.094335
-0.075447 -0.051398 -0.272479
-0.163393 0.016526 -0.390059
-0.119126 0.051791 0.168285
-0.087489 0.044322 -0.221656
-0.067818 0.040271 -0.325351
-0.069751 -0.051297 -0.270261
-0.069101 -0.050271 -0.231520
-0.158657 -0.011439 0.026870
-0.068875 -0.051519 -0.298085
-0.143120 0.000587 -0.484212
-0.152172 0.021770 -0.422497
-0.159046 -0.036860 -0.398087
-0.112295 -0.052444 -0.297677
-0.071525 -0.045168 -0.038806
-0.074722 -0.050255 -0.229305
-0.127553 -0.042532 -0.419555
-0.156051 -0.019018 -0.475556
-0.158977 0.013033 -0.435759
-0.075375 0.043153 -0.268645
-0.075352 0.043185 -0.267272
-0.165034 0.003928 -0.439164
-0.143345 -0.028469 -0.459738
-0.075646 -0.051712 -0.284361
-0.153852 -0.013114 -0.487916
-0.069950 -0.051611 -0.282143
-0.069656 0.043198 -0.265052
-0.138079 -0.002529 -0.489435
-0.149180 -0.009531 -0.493067
-0.128508 0.050488 0.044333
-0.068780 -0.049766 -0.212433
-0.164934 -0.021320 -0.437143
-0.075408 -0.051336 -0.270166
-0.143174 -0.049060 -0.306546
-0.135949 -0.048282 -0.387673
-0.163377 -0.030702 -0.388891
-0.112720 -0.044861 0.052634
-0.166170 -0.018668 -0.407551
-0.071486 -0.045098 -0.036493
-0.129593 -0.009738 -0.497055
-0.072172 -0.046232 -0.077367
-0.094216 -0.042521 0.078139
-0.075313 0.043238 -0.264958
-0.088000 -0.050943 -0.251674
-0.075607 -0.051651 -0.282047
-0.075382 -0.051296 -0.268624
-0.106077 0.051060 0.015427
-0.142889 -0.041247 -0.417937
-0.157786 -0.009758 -0.489535
-0.069686 -0.051195 -0.266406
-0.069663 -0.051158 -0.265033
-0.081157 -0.050809 -0.319141
-0.159066 0.022225 -0.399549
-0.074437 -0.049805 -0.212338
-0.066975 0.041950 -0.308857
-0.096415 0.045410 -0.179200
-0.068741 -0.049705 -0.210120
-0.076759 -0.050901 -0.331396
-0.162261 -0.012891 -0.478656
-0.087457 -0.050086 -0.219320
-0.157005 0.030202 -0.321368
-0.072133 -0.046171 -0.075055
-0.074145 0.044838 -0.195385
-0.161247 -0.010171 -0.485373
-0.103532 0.052186 0.063015
-0.070067 -0.043387 0.019024
-0.069681 -0.046154 -0.075096
-0.128476 -0.043120 0.046649
-0.067809 -0.048234 -0.154590
3 92 67 68
3 67 0 68
3 0 153 68
3 0 154 153
3 154 19 153
3 19 157 153
3 157 30 153
3 157 55 30
3 154 77 19
3 154 2 77
3 55 33 30
3 77 155 19
3 77 5 155
3 5 14 155
3 33 145 30
3 145 119 30
3 14 127 155
3 127 103 155
3 103 32 155
3 119 34 30
3 119 4 34
3 119 53 4
3 32 69 155
3 69 41 155
3 34 151 30
3 19 89 157
3 92 1 67
3 1 97 67
3 97 17 67
3 92 118 1
3 17 156 67
3 30 3 153
3 89 51 157
3 89 45 51
3 3 144 153
3 67 130 0
3 1 91 97
3 91 24 97
3 67 88 130
3 67 125 88
3 0 9 154
3 3 93 144
3 144 61 153
3 93 76 144
3 76 28 144
3 53 36 4
3 36 115 4
3 36 87 115
3 36 85 87
3 36 70 85
3 36 44 70
3 36 20 44
3 36 57 20
3 36 35 57
3 36 86 35
3 119 83 53
3 154 9 2
3 34 47 151
3 47 93 151
3 157 79 55
3 157 62 79
3 115 76 4
3 33 16 145
3 119 104 83
3 33 148 16
3 146 59 140
3 146 84 59
3 146 7 84
3 7 6 84
3 6 128 84
3 146 66 7
3 128 116 84
3 116 99 84
3 99 60 84
3 60 25 84
3 146 105 66
3 25 21 84
3 146 123 105
3 21 18 84
3 21 37 18
3 146 52 123
3 146 102 52
3 18 61 84
3 61 28 84
3 28 56 84
3 146 54 102
3 86 58 35
3 58 59 35
3 86 98 58
3 59 8 35
3 36 114 86
3 36 73 114
3 36 95 73
3 36 10 95
3 36 138 10
3 36 139 138
3 36 15 139
3 8 143 35
3 83 96 53
3 86 74 98
3 143 56 35
3 56 49 35
3 86 112 74
3 112 54 74
3 36 132 15
3 56 28 49
3 134 10 12
3 10 138 12
3 13 139 38
3 139 15 38
3 142 119 16
3 119 145 16
3 155 129 19
3 155 150 129
3 64 20 39
3 64 44 20
3 47 4 27
3 47 34 4
3 29 157 51
3 50 33 79
3 33 55 79
3 57 35 80
3 35 49 80
3 108 70 82
3 108 85 70
3 95 121 73
3 121 90 73
3 78 96 104
3 96 83 104
3 114 133 86
3 133 112 86
3 87 131 115
3 87 109 131
3 81 74 71
3 54 71 74
3 94 84 143
3 56 143 84
3 44 64 82
3 87 108 109
3 85 108 87
3 70 44 82
3 20 80 39
3 57 80 20
3 36 53 96
3 95 134 121
3 138 13 12
3 139 13 138
3 10 134 95
3 73 90 133
3 114 73 133
3 155 41 150
3 5 77 32
3 2 32 77
3 14 5 32
3 127 14 32
3 103 127 32
3 74 81 98
3 94 143 8
3 58 140 59
3 98 81 58
3 59 94 8
3 146 140 71
3 58 71 140
3 71 58 81
3 84 94 59
3 146 71 54
3 115 131 76
3 109 76 131
3 108 76 109
3 82 76 108
3 64 76 82
3 39 76 64
3 80 49 28
3 78 36 96
3 132 36 78
3 15 132 38
3 121 134 90
3 112 133 90
3 148 119 142
3 148 142 16
3 148 50 79
3 148 33 50
3 41 69 32
3 32 2 9
3 156 125 67
3 156 52 125
3 105 123 136
3 136 111 105
3 66 105 111
3 7 66 111
3 111 48 7
3 6 7 48
3 117 6 48
3 117 128 6
3 126 97 24
3 124 97 126
3 17 97 124
3 46 124 101
3 124 46 17
3 101 23 46
3 122 46 23
3 46 122 17
3 156 17 122
3 122 52 156
3 122 123 52
3 23 123 122
3 136 23 65
3 111 136 65
3 23 136 123
3 65 106 111
3 48 111 106
3 113 117 48
3 106 113 48
3 106 152 113
3 113 137 117
3 113 152 137
3 106 147 152
3 147 43 152
3 26 43 147
3 31 126 24
3 126 120 124
3 31 120 126
3 31 26 120
3 43 26 31
3 23 101 65
3 101 26 65
3 101 120 26
3 124 120 101
3 26 106 65
3 26 147 106
3 92 63 118
3 63 18 118
3 118 18 37
3 116 128 117
3 141 91 149
3 1 149 91
3 149 21 141
3 21 149 37
3 1 37 149
3 37 1 118
3 100 21 25
3 100 25 60
3 60 22 100
3 22 60 99
3 116 42 99
3 117 42 116
3 99 42 22
3 42 117 137
3 42 137 152
3 42 11 22
3 42 152 11
3 152 43 11
3 11 43 72
3 43 31 72
3 72 31 110
3 91 110 24
3 24 110 31
3 100 141 21
3 100 107 141
3 107 110 141
3 141 110 91
3 100 22 107
3 22 72 107
3 22 11 72
3 107 72 110
3 125 52 102
3 63 92 68
3 135 18 63
3 45 9 0
3 27 93 47
3 76 93 27
3 4 76 27
3 39 28 76
3 80 28 39
3 30 151 3
3 93 3 151
3 32 45 41
3 9 45 32
3 104 148 78
3 132 78 148
3 38 132 13
3 13 132 12
3 12 132 134
3 134 132 90
3 132 54 90
3 90 54 112
3 119 148 104
3 79 62 148
3 29 62 157
3 29 45 62
3 51 45 29
3 19 45 89
3 41 45 150
3 150 45 129
3 129 45 19
3 45 130 62
3 0 130 45
3 88 54 130
3 61 144 28
3 132 148 130
3 54 132 130
3 148 62 130
3 88 102 54
3 153 61 40
3 18 40 61
3 88 125 75
3 75 102 88
3 125 102 75
3 68 153 63
3 135 153 40
3 18 135 40
3 153 135 63
