OFF
1253 1394 0
-0.0278397216 -0.3458293295 -0.1552279463
-0.0124317486 -0.4377357007 0.1234198130
-0.0041245036 -0.4087044606 -0.2638746229
0.0263001235 -0.2683320145 -0.0068277192
-0.0742113771 -0.4281817390 -0.0776505780
0.0280352447 0.2326706536 0.2579213010
-0.1155571973 -0.3706588140 0.2284474688
-0.0361057249 0.2290845989 -0.0014119597
-0.0404378491 -0.4365338790 0.0289356688
-0.0482851538 0.3381466375 0.1913419759
-0.0050560671 0.2097986525 0.2556135761
-0.0362770500 0.4534352598 0.0496209207
-0.0813763756 0.3152735957 0.1890341766
-0.0652802837 0.3796652077 0.0161499711
-0.0807979843 0.3799025563 0.0157809513
-0.0496591649 0.3362359927 0.0095041408
-0.0517780279 0.2965099333 0.1986431590
-0.0629320625 -0.4445200470 0.2242472280
-0.0194785530 0.2987482045 -0.1204283064
0.0014108142 0.2393705850 -0.1990454403
-0.0619827089 0.3894263128 -0.1162385704
-0.0721289578 0.3895815032 -0.1164798540
-0.0104545377 -0.2916437039 0.1342402825
-0.0755060947 -0.2731279677 0.0765222814
-0.0174987279 0.1201927967 -0.1757044791
0.0396241285 -0.3730186015 0.2319516914
0.0063005929 -0.2653793877 -0.0430404865
-0.0437990964 0.3046962426 -0.1316146172
0.0341761552 0.3378345505 -0.1162618518
-0.0525847268 -0.4156924839 -0.1608225250
-0.0276838147 -0.3251554142 -0.1594461653
-0.0496008589 0.4548389668 0.0331029081
-0.1048400263 -0.3446915702 -0.1565184955
0.0421514273 -0.4985830833 0.1078649883
0.1072063349 -0.4995781207 0.1094120313
0.0976575736 -0.4994320691 0.1091849563
0.0421698679 -0.3655049258 0.1300400244
-0.0886756018 -0.2938216988 -0.2569106142
0.0481227655 -0.4365737584 -0.0028777014
-0.0760025118 -0.4334841326 -0.0057417647
-0.0449595025 -0.4171776448 -0.0698822852
-0.0609548517 -0.2984280502 0.2350676976
-0.0509639619 0.3323744277 0.0618886245
-0.0418319929 0.3403202955 0.0095211390
-0.0898505682 -0.3806125375 -0.2633334255
-0.0201431167 0.1906658838 -0.0191775874
-0.0720530947 0.3394516739 -0.1186840900
-0.0677098854 -0.1934682958 -0.2000811072
-0.0062359455 -0.1944085610 -0.1986192217
-0.0455682384 0.2103997677 0.2549007032
0.0241942566 -0.4179378302 0.2282732954
-0.0900346110 0.2722262102 0.2586322259
-0.0349669430 -0.3467135978 0.1329516844
0.0267410377 -0.4104241704 0.1263616532
0.0487939944 -0.4789216832 -0.1588165251
0.1138489020 -0.4799167206 -0.1572694821
-0.0789326893 0.1241101436 -0.1769458348
-0.0359794742 -0.3214200504 -0.1598564307
0.1007416281 -0.4903032251 -0.0146314731
-0.0283141471 0.2330626717 0.0000334867
-0.0696928779 0.3666036069 0.1933035035
-0.0798391269 0.3667587973 0.1930622199
-0.0778144154 0.5000000000 0.0429156425
0.0996501119 -0.0286513473 0.0016517304
0.0366932459 0.2757179658 0.1883242857
-0.0244842307 0.2712535077 0.2597866694
-0.0363667122 -0.3517140847 -0.1630573517
0.0657775906 -0.3625324004 -0.0194964454
-0.0495306855 0.3440465285 0.0091250699
-0.0516969941 0.3041792010 0.2001683649
0.0606036229 -0.4143029479 0.1145389915
0.0737346020 -0.4145037908 0.1148512537
0.0437173623 -0.3727830058 0.1229285807
0.1087722700 -0.3737780432 0.1244756237
-0.0185596440 -0.3043905572 -0.0776773270
-0.0268582617 -0.3000948243 -0.0775676987
-0.0189975151 0.0094506281 -0.1839066667
-0.0077725918 0.3375454394 0.1920558976
-0.0223731295 0.1840649689 0.0703513556
0.0491606613 -0.3469671669 -0.1539363557
-0.0519955891 0.2804337472 0.1974518632
-0.0780198732 0.4999633666 0.0515318150
-0.0030950549 -0.2759662468 -0.1496323362
0.0410661495 0.2702808053 0.2609411129
-0.0354204433 -0.3643250759 0.1282884412
-0.0521477972 0.2725530586 0.1987836305
-0.0263021670 -0.0338896791 0.0953863058
-0.0851316152 0.2997476232 -0.1219251222
-0.0663953031 0.3763647120 0.0609149621
-0.0819130037 0.3766020606 0.0605459423
0.0254162321 -0.3276486674 0.2349606288
0.0045213237 -0.2706457040 0.0283925750
-0.0000646240 0.2338871503 -0.1247470076
-0.0480473299 -0.4245419207 0.0301089299
-0.0034007439 0.3321072557 0.2646726232
-0.0712358208 -0.2604871305 -0.0949171510
0.0246864625 0.3136996967 0.1909025394
0.0503680032 -0.3525251466 -0.1437088107
0.1154148511 -0.3541156040 -0.1422058129
0.0688616450 -0.3534035565 -0.1433128748
0.0468797727 0.1848407477 0.0472198442
-0.0360085180 -0.3298629467 -0.1590416985
0.0279630132 -0.3201350076 0.1330489866
-0.0279900189 -0.3477801809 -0.1611218805
-0.0508829281 0.3400436954 0.0634138303
0.0330962612 0.2580436147 -0.1221715534
-0.0975811952 -0.3182259925 0.1302152466
-0.0264098154 -0.3085450240 -0.0767416115
-0.1039687918 -0.3370003334 -0.2603686976
0.0459139913 0.0131981272 0.0527464118
-0.0438445384 0.2971312032 -0.1345694639
-0.0517134948 -0.4080012548 -0.2646726232
-0.0892561067 0.0953279192 0.2135387749
-0.0272253945 0.0914014217 0.2147946336
-0.0433622275 -0.3660959684 0.1293973918
-0.0216055106 0.0228781245 -0.0656011154
-0.0352731472 -0.3693383644 0.1312759692
-0.0218809475 -0.3142218151 0.0556639108
-0.0301795652 -0.3099260822 0.0557735390
-0.0835459352 0.4532937975 0.0278311463
-0.0360484198 0.2366837138 0.0010659425
-0.0731329887 0.2596607382 -0.1245937916
-0.0431605327 0.3363875386 0.0628582421
-0.1130106504 -0.3631452275 0.1265368605
-0.0354860651 0.3790684633 0.0187650158
-0.0439129151 0.3327083710 0.2639597503
-0.0770041228 0.3098363683 0.2616520279
-0.0774365520 -0.2222596707 0.1904180054
-0.0159626121 -0.2231999360 0.1918798909
-0.0437200750 0.2760678519 0.1982949461
-0.0432863311 -0.3430483867 0.1334941153
0.0567567880 -0.0313128294 0.0454232094
-0.0374176751 0.3690916868 -0.1904084415
-0.0287241766 -0.0193407316 0.2065922382
-0.0603856198 -0.4370064590 0.1223366173
-0.0478794788 -0.4171865758 0.0277814601
-0.0845627461 0.1846627165 0.0736365983
0.0505103494 -0.3521043064 -0.1494239497
0.1155571973 -0.3536947638 -0.1479209518
-0.0137355970 -0.2731904753 0.0660781372
0.0654454786 -0.3635152725 -0.0061629296
-0.0437210147 -0.3734836892 0.1321974711
0.0997088023 0.0143875562 0.0268657825
-0.0269686094 -0.3381381447 -0.2590774236
-0.0794886547 0.1591039761 -0.1561737295
-0.0174176438 0.1581545784 -0.1546976453
-0.0820955101 0.1919659689 -0.0254161142
-0.0406402127 0.2345047690 -0.1256713761
-0.0224932147 -0.4331373339 -0.0201932517
0.0495025096 -0.4342653404 -0.0342939439
-0.0752196304 -0.4311665855 -0.0371722009
0.0338668578 -0.3901447604 -0.1573942732
0.0031581012 0.3684740037 -0.1894832368
-0.0584084089 -0.2909144622 0.1331570869
-0.0149785038 -0.4452492840 0.2253304163
-0.0435777318 0.3202110843 -0.1309443110
-0.0396158161 -0.4215875092 0.0291003718
0.0719226409 -0.0290390239 0.0119521767
-0.0022237073 -0.2682739878 -0.2534822511
-0.0105579563 0.3764986891 0.0489003530
-0.0800056125 0.1764341493 -0.1232885309
-0.0179346016 0.1754847516 -0.1218124467
0.0476492183 0.3032322317 -0.1932299407
0.0500320063 -0.3392749155 -0.2577861668
-0.0759775434 -0.2179411883 0.1318426310
-0.0145036035 -0.2188814536 0.1333045165
0.0356505674 0.3433180470 -0.1905609327
0.0486516741 -0.4793424469 -0.1531024251
0.1137065817 -0.4803374843 -0.1515553821
0.1041578204 -0.4801914326 -0.1517824571
-0.0371960256 -0.4144255250 -0.0680480639
-0.0130012929 -0.2991572871 0.2361508858
-0.0770107510 -0.4364679400 0.0347366893
-0.0501702200 0.4531536808 0.0559612323
-0.0379705872 -0.4292305501 -0.0701180827
-0.0883138249 0.1329808280 0.1981326081
-0.0262428141 0.1320314304 0.1996086923
-0.0691688874 -0.1977877561 -0.1415066408
-0.0076949475 -0.1987280214 -0.1400447553
-0.0907218013 -0.3883047675 -0.1594839236
-0.0351538013 0.3242862594 -0.1309131215
-0.0767752858 -0.2768842652 0.1274772011
-0.0153013459 -0.2778245305 0.1289390866
-0.0360597148 0.4535070078 0.0405278805
-0.0506836294 -0.2752630474 -0.1504303265
-0.0823994413 0.2396827361 0.1834362127
-0.0705778492 0.3449351577 -0.1929831510
0.0584411684 -0.0263270477 -0.0222001058
0.0496657209 0.1877631843 0.0072598523
-0.0101072127 0.3778332877 0.0308044714
0.0496026012 -0.3991053224 -0.0158884531
-0.0699666298 -0.2567308330 -0.1458720707
-0.0084926899 -0.2576710983 -0.1444101852
-0.0049958397 -0.4163956882 -0.1600245272
-0.0780271767 0.2342445461 0.2560529482
-0.0499404911 0.2158369951 0.1822828519
0.0350416030 -0.3033539569 -0.1509709475
-0.0374243910 0.2326107279 0.0563073993
-0.0375765991 0.2247300392 0.0576391666
0.0290582986 0.3082624757 0.2635203808
-0.0449339857 -0.4102441027 -0.0664957318
-0.0361739880 -0.3448183194 -0.1591907115
-0.0944069679 0.2776634391 0.1860143721
-0.0180034221 0.3042316593 -0.1947269544
0.0671038697 -0.3950623115 -0.1464284219
0.0802348488 -0.3952631544 -0.1461161597
-0.0434411927 0.3286170401 -0.1312793369
-0.0275342468 -0.4628630055 -0.0383205969
-0.0354405449 0.3005758438 -0.1341054519
-0.0286803242 -0.4651915678 -0.0066606658
-0.0288566918 0.2766907383 0.1871688131
0.1002544606 0.0160027659 0.0049591157
-0.1013497176 -0.4160287417 0.2254385215
0.0438677564 -0.3717657830 0.1172586027
0.1089146043 -0.3733562404 0.1187616005
0.0623613983 -0.3726441929 0.1176545386
-0.0800500682 0.4659278107 -0.1110479880
-0.0388928987 0.3636092651 -0.1161096152
-0.0895468478 -0.3015139671 -0.1530605929
0.0359129494 -0.2956626987 -0.2548214588
-0.0295106820 0.2288106903 0.0576618423
0.0461748216 0.2977487810 -0.1189314832
-0.0988031448 -0.4085150788 0.1235268743
-0.0379671985 -0.3718386591 0.2301990445
0.0345706759 0.2635271189 -0.1964707381
-0.0872569782 0.1555414620 0.1682017066
-0.0251859673 0.1545920643 0.1696777907
0.0347381913 -0.3824535405 -0.2612442650
-0.0100503790 -0.2617097335 -0.0815051907
-0.0836563749 0.3052310917 -0.1962239755
-0.0255198780 0.0112915044 0.0915501039
-0.0296599329 -0.3181658235 0.0537415373
-0.0220319331 -0.0212499576 -0.0760521646
-0.0716577407 0.2651442296 -0.1988929565
-0.1001277421 -0.3257395789 0.2321258549
0.0478118663 0.0188160936 -0.0234479765
0.1010737401 -0.4893203531 -0.0279649888
-0.0433858741 0.2999185731 0.1995818839
0.0420090671 -0.4990049626 0.1135800504
0.1070639747 -0.5000000000 0.1151270934
0.0991044536 -0.0302665571 0.0235583972
-0.0877005454 0.4431046075 0.1984955360
-0.0094279291 0.2152357970 0.1829967736
-0.0364943184 0.3760836169 0.0592433929
0.0236633968 0.2381088372 0.1853045754
-0.0432441889 -0.3512808247 0.1314507586
0.0016826641 0.3629915699 -0.1151842077
-0.0842965763 0.4533580341 0.0594377707
-0.0498123860 -0.2675707867 -0.2542802440
-0.0391649620 0.2399882681 -0.1999706450
0.0906542944 -0.4422917537 -0.0870405743
0.0834256654 -0.4259263768 -0.0237307171
0.0730062197 -0.3788977774 -0.0828063026
0.1080604696 -0.4364671805 0.1140868159
0.0695900403 -0.3890095317 0.0543441620
-0.0239465038 0.0976782366 0.0809507298
-0.0253529227 0.0829417843 0.1306139473
-0.0245662356 0.1261351505 0.1253142603
-0.0203015129 0.0161643763 -0.1247538911
0.0382219823 -0.1498423640 0.0201723759
0.0491113822 -0.1486855192 0.0025622288
0.0213716530 -0.2102440340 0.0242824755
-0.0160411560 -0.1414798456 -0.0787786776
-0.0148634403 -0.1099889895 -0.1080484600
-0.0130457675 -0.2015947895 -0.0801419342
-0.0271220273 -0.0040246136 0.1490711710
0.0391116169 -0.1472092058 -0.0155441549
0.0227061049 -0.2062942968 -0.0292923207
0.0491113822 -0.1486855192 0.0025622288
0.0140301052 0.1053206544 -0.0291706316
0.0318479130 0.1465419193 -0.0109553896
-0.0208743137 0.1067720042 -0.0423893514
-0.0443842163 0.2802148404 0.0656331589
-0.0644734812 0.2324387785 0.0696348786
-0.0754790246 0.2805137142 0.0672757802
-0.0427117002 0.2851655457 -0.0015138082
-0.0736878969 0.2858155883 -0.0046330716
-0.0624036051 0.2385657573 -0.0134649612
-0.0443842163 0.2802148404 0.0656331589
0.0140301052 0.1053206544 -0.0291706316
-0.0037877027 0.0640993895 -0.0473858735
0.0487387936 0.1032896389 -0.0080940621
0.0241953947 -0.1440183906 -0.0518526482
0.0010817308 -0.0826341741 -0.0639524064
0.0413182815 -0.0851727191 -0.0370263770
0.0182046177 -0.0237885027 -0.0491261352
-0.0160411560 -0.1414798456 -0.0787786776
0.0070725078 -0.2028640620 -0.0666789195
0.0010817308 -0.0826341741 -0.0639524064
-0.0453731740 -0.3548292076 0.0504074132
-0.0158349971 -0.3473049689 -0.0565792846
0.0753906685 -0.4363915029 0.1190278371
-0.0200188820 -0.1535400772 0.0807322215
-0.0168772395 -0.2133652762 0.0734051793
-0.0204028853 -0.1263855664 0.1143454111
-0.0733212873 -0.0346790761 -0.1885134710
-0.0433537002 -0.0920088338 -0.1919938869
-0.0311756077 -0.0412791029 -0.1879502768
-0.0705155863 -0.1140736859 -0.1942972891
-0.0761269883 0.0447155338 -0.1827296529
-0.0747241378 0.0050182288 -0.1856215619
-0.0489651022 0.0667803858 -0.1804262507
0.0382219823 -0.1498423640 0.0201723759
0.0306390558 -0.1509792667 0.0369078922
0.0550723116 -0.0894406940 0.0160622763
-0.0500150558 0.1837253603 -0.0736142805
-0.0133462313 -0.0946386967 -0.1619757110
-0.0126167303 -0.0924789665 -0.1912629442
-0.0105205894 -0.1466833590 -0.1510102332
0.0583532355 -0.3970838170 -0.0811584375
-0.0197700561 0.0991814381 -0.0937067810
-0.0208743137 0.1067720042 -0.0423893514
-0.0194044576 0.1411283779 -0.0821008990
-0.0197700561 0.0991814381 -0.0937067810
0.0019034544 -0.3507346742 -0.0135104854
0.0856308451 -0.4376268721 -0.1491054395
0.0768301650 -0.4572283865 -0.0930382005
0.0889519526 -0.4732743698 -0.0605015947
0.1026157803 -0.4847558929 -0.0898737230
0.0821796257 -0.4160105135 -0.1533467159
-0.0421308781 -0.3449457362 -0.0795778843
-0.0566833495 -0.3027164334 -0.0872475177
-0.0727235990 -0.3443344348 -0.0862838645
0.0391116169 -0.1472092058 -0.0155441549
0.0555171289 -0.0881241149 -0.0017959891
0.0323708807 -0.1458532177 -0.0326202961
0.0182046177 -0.0237885027 -0.0491261352
-0.0427117002 0.2851655457 -0.0015138082
0.0051927271 0.2804621823 0.0532316186
-0.0489651022 0.0667803858 -0.1804262507
0.0241953947 -0.1440183906 -0.0518526482
0.0070725078 -0.2028640620 -0.0666789195
0.0323708807 -0.1458532177 -0.0326202961
-0.0179582627 -0.3535897915 0.0286641219
-0.0089859455 -0.3518915190 0.0040996617
-0.0202257387 -0.3933635627 0.0042354351
0.0559819997 -0.3858747577 0.0508830428
-0.0589901417 0.0379935938 0.2100655065
-0.0263726363 0.0513464630 0.1531723687
-0.0271220273 -0.0040246136 0.1490711710
-0.0279747856 0.0360303450 0.2106934359
-0.0500150558 0.1837253603 -0.0736142805
-0.0216138900 -0.1191110926 0.1699483773
-0.0180587468 -0.1689962731 0.1516264469
-0.0223433944 -0.1212703338 0.1992360645
0.0768301650 -0.4572283865 -0.0930382005
0.0856308451 -0.4376268721 -0.1491054395
0.0583031897 -0.4146638260 -0.0903611829
0.0730062197 -0.3788977774 -0.0828063026
0.0872381150 -0.4524035080 0.0501098903
0.0991996009 -0.4948676471 0.0472767416
0.0856960878 -0.4569679299 0.1120181050
-0.0726651760 0.4227965092 -0.0474490084
-0.0710163886 0.4276770617 -0.1136432792
-0.0636314963 0.3845457602 -0.0500442996
-0.0530803643 -0.1208002012 0.1985051218
-0.0223433944 -0.1212703338 0.1992360645
-0.0345214882 -0.1720000686 0.1951925064
0.0791305983 -0.4568675085 0.1118619739
-0.0216138900 -0.1191110926 0.1699483773
-0.0239580285 -0.0765003859 0.1326673415
-0.0251690333 -0.0692259121 0.1882703078
-0.0275131718 -0.0266152054 0.1509892720
-0.0204028853 -0.1263855664 0.1143454111
-0.0180587468 -0.1689962731 0.1516264469
-0.0239580285 -0.0765003859 0.1326673415
0.0728901696 -0.4680029137 0.0531536275
0.0991996009 -0.4948676471 0.0472767416
0.0868158988 -0.4791530694 0.0192610772
-0.0158349971 -0.3473049689 -0.0565792846
-0.0191641059 -0.3902211514 -0.0383862682
-0.0080963109 -0.3492583608 -0.0316168691
0.0215105955 -0.1522516523 0.0557506733
-0.0200188820 -0.1535400772 0.0807322215
-0.0023957858 -0.0930706657 0.0755684895
0.0038874992 -0.2127210638 0.0609144052
-0.0023957858 -0.0930706657 0.0755684895
0.0152273105 -0.0326012543 0.0704047576
0.0391336917 -0.0917822409 0.0505869414
0.0070898279 0.2834158238 0.0130124341
-0.0726651760 0.4227965092 -0.0474490084
-0.0781055556 0.4380451533 -0.0098089311
-0.0817980017 0.4596108041 -0.0416084208
-0.0770479242 0.4097346597 0.1297052490
-0.0680440905 0.3714841594 0.1271092328
-0.0786967116 0.4048541072 0.1958995198
0.0051927271 0.2804621823 0.0532316186
0.0260362499 0.2326514650 0.0502257314
-0.0294337239 0.2800742929 0.0647973743
0.0152273105 -0.0326012543 0.0704047576
-0.0179582627 -0.3535897915 0.0286641219
-0.0421308781 -0.3449457362 -0.0795778843
0.0592321231 -0.3762544395 -0.0796006639
-0.0133462313 -0.0946386967 -0.1619757110
-0.0148634403 -0.1099889895 -0.1080484600
-0.0176890822 -0.0579443271 -0.1190139378
-0.0105205894 -0.1466833590 -0.1510102332
-0.0176890822 -0.0579443271 -0.1190139378
-0.0205147241 -0.0058996648 -0.1299794156
-0.0161718732 -0.0425940343 -0.1729411888
-0.0195521193 0.0715354606 -0.1206527973
-0.0182481215 0.0648217124 -0.1798055729
-0.0203015129 0.0161643763 -0.1247538911
-0.0548743567 0.1696273904 0.1216571945
0.0473458195 0.1018284207 0.0118859338
0.0466299054 0.0575132739 0.0323161728
0.0463968820 0.0990194375 0.0499831280
0.0559819997 -0.3858747577 0.0508830428
-0.0195115772 0.0905163515 -0.1101493804
0.0551031121 -0.4067041352 0.0493252692
-0.0770479242 0.4097346597 0.1297052490
-0.0859985609 0.4482313208 0.1289666534
-0.0806722503 0.4315463469 0.0945715099
-0.0433537002 -0.0920088338 -0.1919938869
-0.0247948229 -0.1432086974 -0.1953065543
-0.0126167303 -0.0924789665 -0.1912629442
0.0106799473 0.0980661261 0.0693849741
0.0463968820 0.0990194375 0.0499831280
-0.0074199654 0.0546788152 0.0804675390
0.0592321231 -0.3762544395 -0.0796006639
-0.0453731740 -0.3548292076 0.0504074132
-0.0762584229 -0.3547979538 0.0556294853
-0.0604396344 -0.3139785876 0.0634648473
0.0215105955 -0.1522516523 0.0557506733
0.0306390558 -0.1509792667 0.0369078922
0.0038874992 -0.2127210638 0.0609144052
-0.0253529227 0.0829417843 0.1306139473
0.0070898279 0.2834158238 0.0130124341
-0.0278145909 0.2848671736 -0.0002062858
0.0283777744 0.2355895040 0.0101361432
0.0195538823 0.2821309367 0.0280801026
-0.0833463294 -0.0634658758 0.2019783902
-0.0863012181 0.0159310217 0.2077585825
-0.0589901417 0.0379935938 0.2100655065
-0.0848237737 -0.0237674270 0.2048684863
-0.0530803643 -0.1208002012 0.1985051218
-0.0803914407 -0.1428627732 0.1961981978
-0.0409022704 -0.0700704664 0.2025486800
0.0019034544 -0.3507346742 -0.0135104854
-0.0548743567 0.1696273904 0.1216571945
0.0106799473 0.0980661261 0.0693849741
-0.0239465038 0.0976782366 0.0809507298
0.0287798600 0.1414534369 0.0583024091
-0.0258813460 0.0716614674 0.1455793981
0.0728901696 -0.4680029137 0.0531536275
0.0543631942 -0.4254383531 0.0558306451
0.0791305983 -0.4568675085 0.1118619739
0.0906542944 -0.4422917537 -0.0870405743
0.0921963346 -0.4377272935 -0.1489493084
0.1026157803 -0.4847558929 -0.0898737230
0.1145607164 -0.4172265441 -0.1468805975
0.0872381150 -0.4524035080 0.0501098903
0.0695900403 -0.3890095317 0.0543441620
0.0830935533 -0.4269092488 -0.0103972013
0.0337930500 -0.3465767966 0.1825003266
0.0337930500 -0.3465767966 0.1825003266
0.0074808601 -0.3096461474 0.1845999362
0.0074808601 -0.3096461474 0.1845999362
-0.0357046947 -0.2950358770 0.1846539901
-0.0357046947 -0.2950358770 0.1846539901
-0.0792680755 -0.3083270205 0.1826414709
-0.0792680755 -0.3083270205 0.1826414709
-0.1065691963 -0.3444424032 0.1793313577
-0.1065691963 -0.3444424032 0.1793313577
-0.1071801840 -0.3895869846 0.1759876910
-0.1071801840 -0.3895869846 0.1759876910
-0.0808676037 -0.4265175629 0.1738870512
-0.0808676037 -0.4265175629 0.1738870512
-0.0376820618 -0.4411278715 0.1738335168
-0.0376820618 -0.4411278715 0.1738335168
0.0058812540 -0.4278367654 0.1758465542
0.0058812540 -0.4278367654 0.1758465542
0.0331825831 -0.3917213859 0.1791566723
0.0331825831 -0.3917213859 0.1791566723
0.0425368046 -0.3213144362 -0.2043785571
0.0425368046 -0.3213144362 -0.2043785571
0.0164089473 -0.2858144728 -0.2022268975
0.0164089473 -0.2858144728 -0.2022268975
-0.0264536684 -0.2717685176 -0.2019562888
-0.0264536684 -0.2717685176 -0.2019562888
-0.0696796169 -0.2845423769 -0.2036704184
-0.0696796169 -0.2845423769 -0.2036704184
-0.0967578141 -0.3192566345 -0.2067145549
-0.0967578141 -0.3192566345 -0.2067145549
-0.0973452965 -0.3626525504 -0.2099263106
-0.0973452965 -0.3626525504 -0.2099263106
-0.0712176475 -0.3981525107 -0.2120779752
-0.0712176475 -0.3981525107 -0.2120779752
-0.0283546673 -0.4121984715 -0.2123485752
-0.0283546673 -0.4121984715 -0.2123485752
0.0148711771 -0.3994246105 -0.2106344481
0.0148711771 -0.3994246105 -0.2106344481
0.0419494263 -0.3647103537 -0.2075903104
0.0419494263 -0.3647103537 -0.2075903104
0.0753906685 -0.4363915029 0.1190278371
0.0821796257 -0.4160105135 -0.1533467159
0.0473458195 0.1018284207 0.0118859338
0.0782159425 -0.4024120771 -0.0532685099
0.0958640173 -0.4658060534 -0.0575027816
0.0854445716 -0.4187774541 -0.1165783670
0.0782159425 -0.4024120771 -0.0532685099
0.0659757193 -0.3808268623 0.0859993503
0.0639034384 -0.3680797327 0.0557458045
-0.0245662356 0.1261351505 0.1253142603
-0.0247331909 0.0544848705 0.0862504168
-0.0237795484 0.1693285166 0.1200145732
-0.0231598166 0.1408716028 0.0756510427
0.0135546932 -0.4161213282 -0.0180408524
-0.0112791939 -0.1543585054 -0.1240466076
-0.0190365445 -0.0813649016 -0.0774154211
-0.0118680518 -0.1701039335 -0.1094117165
-0.0088726633 -0.2302188774 -0.1107749730
-0.0388307886 -0.2277294272 -0.1429584130
0.0147613021 0.1892145341 -0.0059588676
-0.0030565058 0.1479932691 -0.0241741095
-0.0037877027 0.0640993895 -0.0473858735
-0.0030565058 0.1479932691 -0.0241741095
-0.0333786729 0.2321399047 0.0679922573
-0.0434233053 0.2082518737 0.0699931171
-0.0553897597 0.3282897762 0.0632740605
-0.0644734812 0.2324387785 0.0696348786
-0.0624036051 0.2385657573 -0.0134649612
-0.0539959919 0.3324153767 0.0073180814
-0.0412733609 0.2146158206 -0.0163212743
-0.0314274084 0.2379157148 -0.0103456978
-0.0736878969 0.2858155883 -0.0046330716
-0.0553897597 0.3282897762 0.0632740605
-0.0294337239 0.2800742929 0.0647973743
0.0131031778 0.0208471091 -0.0445245460
0.0309209857 0.0620683740 -0.0263093041
0.0318479130 0.1465419193 -0.0109553896
0.0309209857 0.0620683740 -0.0263093041
0.0297614496 -0.0544806109 -0.0430762561
0.0126385627 -0.1133262823 -0.0579025273
-0.0104751011 -0.0519420659 -0.0700022855
0.0297614496 -0.0544806109 -0.0430762561
-0.0044843241 -0.1721719538 -0.0727287986
-0.0130457675 -0.2015947895 -0.0801419342
-0.0190365445 -0.0813649016 -0.0774154211
0.0126385627 -0.1133262823 -0.0579025273
-0.0270867231 -0.3548621771 0.0475069030
-0.0611919625 -0.3956485738 0.0425720512
-0.0129426881 -0.3045073512 -0.0690422376
-0.0240104831 -0.3454701418 -0.0758116367
-0.0481751665 0.1411323610 -0.1658217400
0.1079181223 -0.4368890216 0.1198013585
0.0586998678 -0.4676982327 0.1163039437
-0.0141196003 -0.2460359644 0.0996913268
-0.0172612428 -0.1862107654 0.1070183690
-0.0231605245 -0.0937148782 0.0880592636
-0.0174532444 -0.1726335100 0.1238249638
-0.0810505613 0.1842000591 -0.0743523226
-0.0489701071 0.1759594505 -0.1225504888
-0.0097910884 -0.1445236288 -0.1802974664
-0.0161718732 -0.0425940343 -0.1729411888
-0.0097910884 -0.1445236288 -0.1802974664
-0.0083782674 -0.1705459600 -0.1748147274
-0.0185938500 0.1286680083 -0.1242022132
-0.0195115772 0.0905163515 -0.1101493804
0.0135546932 -0.4161213282 -0.0180408524
-0.0205087152 0.1487189440 -0.0307834694
-0.0190388591 0.1830753177 -0.0704950170
-0.0212399121 0.0648250644 -0.0539952334
-0.0194044576 0.1411283779 -0.0821008990
-0.0089859455 -0.3518915190 0.0040996617
0.0032123890 -0.3106901891 0.0074410448
0.1147030497 -0.4168057422 -0.1525952170
0.0663449876 -0.3840574099 -0.1513853328
0.0782327951 -0.0084626366 0.0361444959
-0.0398642554 -0.2590791144 -0.1196636681
-0.0260906286 -0.3033277349 -0.0805415375
-0.0406430999 -0.2610984320 -0.0882111709
-0.0581711276 -0.3865637376 -0.0786142312
-0.0566833495 -0.3027164334 -0.0872475177
-0.0754790246 0.2805137142 0.0672757802
-0.0278145909 0.2848671736 -0.0002062858
-0.0539959919 0.3324153767 0.0073180814
-0.0595160002 0.4161811304 0.0232980811
-0.0156507956 0.3282728996 0.0562375057
0.0181609082 0.2806697184 0.0480600986
-0.0182481215 0.0648217124 -0.1798055729
-0.0639488958 0.0954452647 -0.1786860428
-0.0577494604 0.1136796748 0.2065737336
-0.0377024164 -0.1960981586 -0.1700629313
-0.0741231242 0.0666607565 0.2118021407
-0.0279747856 0.0360303450 0.2106934359
-0.0275484064 0.0160028657 0.1798823034
-0.0259462572 0.0313189837 0.1223612363
-0.0267990154 0.0713739424 0.1839835011
-0.0275484064 0.0160028657 0.1798823034
-0.0190388591 0.1830753177 -0.0704950170
-0.0350790863 0.1871956220 -0.0463959339
-0.0170106795 -0.1960981045 0.1717531689
-0.0187882511 -0.1711555143 0.1809141341
-0.0251690333 -0.0692259121 0.1882703078
-0.0187882511 -0.1711555143 0.1809141341
0.0719670174 -0.4261453490 -0.1197333112
0.0904939927 -0.4687099096 -0.1224103288
0.0631663373 -0.4457468635 -0.0636660722
0.0719670174 -0.4261453490 -0.1197333112
0.0673196178 -0.3579679785 -0.0814046601
0.0766205342 -0.3870804659 -0.1144612311
0.0924478443 -0.4759177885 0.0796474233
0.0939898716 -0.4713533666 0.0177392086
0.0804863585 -0.4334536494 0.0824805720
0.0924478443 -0.4759177885 0.0796474233
-0.0673239424 0.4061114110 -0.0818437894
-0.0763576221 0.4443621599 -0.0792484982
-0.0689727298 0.4012308584 -0.0156495187
-0.0673239424 0.4061114110 -0.0818437894
-0.0345214882 -0.1720000686 0.1951925064
-0.0409022704 -0.0700704664 0.2025486800
-0.0559790201 -0.1971298697 0.1928052559
-0.0652584582 -0.1715299359 0.1944615636
-0.0263411025 -0.0479205587 0.1696297899
-0.0227859593 -0.0978057392 0.1513078594
-0.0251300978 -0.0551950325 0.1140268236
-0.0263411025 -0.0479205587 0.1696297899
-0.0192308160 -0.1476909197 0.1329859290
-0.0174532444 -0.1726335100 0.1238249638
-0.0233525261 -0.0801376227 0.1048658584
-0.0227859593 -0.0978057392 0.1513078594
0.0095574048 -0.1226611590 0.0656595814
-0.0231605245 -0.0937148782 0.0880592636
-0.0168772395 -0.2133652762 0.0734051793
-0.0080656914 -0.1831305705 0.0708233133
0.0271805011 -0.0621917476 0.0604958495
-0.0143489764 -0.0634801724 0.0854773976
0.0095574048 -0.1226611590 0.0656595814
0.0271805011 -0.0621917476 0.0604958495
0.0128899666 -0.0012169320 -0.0497500706
0.0197792541 0.2827982360 0.0190321619
-0.0141981186 0.3312421436 0.0158887250
-0.0689727298 0.4012308584 -0.0156495187
-0.0744131095 0.4164795026 0.0219905587
-0.0763576221 0.4443621599 -0.0792484982
-0.0781055556 0.4380451533 -0.0098089311
-0.0603954474 0.4147208255 0.0593405818
-0.0733704011 0.3881691333 0.1615043763
-0.0717216136 0.3930496858 0.0953101056
-0.0823742348 0.4264196336 0.1641003925
-0.0733704011 0.3881691333 0.1615043763
0.0122533216 0.1844528583 0.0587855999
-0.0085902012 0.2322635756 0.0617914871
-0.0156507956 0.3282728996 0.0562375057
-0.0085902012 0.2322635756 0.0617914871
-0.0270867231 -0.3548621771 0.0475069030
-0.0158469299 -0.3133901334 0.0473711295
-0.0581711276 -0.3865637376 -0.0786142312
-0.0240104831 -0.3454701418 -0.0758116367
0.0793478145 -0.0051621409 -0.0086204950
0.0583532355 -0.3970838170 -0.0811584375
0.0631679964 -0.3856583755 -0.1130145429
-0.0459700778 -0.2205705621 0.1618612610
-0.0155176567 -0.0762915119 -0.1404948244
-0.0184476867 -0.0656194736 -0.0920503123
-0.0112791939 -0.1543585054 -0.1240466076
-0.0126920148 -0.1283361743 -0.1295293466
-0.0183432986 -0.0242468495 -0.1514603022
-0.0198605076 -0.0395971424 -0.0975330512
-0.0155176567 -0.0762915119 -0.1404948244
-0.0183432986 -0.0242468495 -0.1514603022
-0.0192748172 0.0404930443 -0.1522797320
-0.0185254236 0.0958641286 -0.1481786382
-0.0205788149 0.0472067926 -0.0931269563
-0.0192748172 0.0404930443 -0.1522797320
-0.0386237431 0.1768461796 0.0960042751
-0.0237795484 0.1693285166 0.1200145732
0.0475788429 0.0603222571 -0.0057810214
0.0468629288 0.0160071104 0.0146492176
0.0471127961 0.1433345842 0.0295528890
0.0466299054 0.0575132739 0.0323161728
0.0582928113 -0.4000888528 0.0827110171
0.0551031121 -0.4067041352 0.0493252692
-0.0184646105 0.1243354650 -0.1324235128
-0.0195521193 0.0715354606 -0.1206527973
-0.0806722503 0.4315463469 0.0945715099
-0.0823742348 0.4264196336 0.1641003925
-0.0753459397 0.4148613730 0.0601763664
-0.0717216136 0.3930496858 0.0953101056
-0.0555317928 -0.1427385648 -0.1960374971
-0.0462523541 -0.1683384966 -0.1976938308
-0.0311756077 -0.0412791029 -0.1879502768
-0.0247948229 -0.1432086974 -0.1953065543
0.0282969693 0.0556321266 0.0610656929
0.0287798600 0.1414534369 0.0583024091
0.0282969693 0.0556321266 0.0610656929
0.0101970566 0.0122448158 0.0721482578
-0.0141196003 -0.2460359644 0.0996913268
-0.0456394446 -0.2478828594 0.1303908588
0.0104110927 -0.4497284541 -0.0204773049
-0.0454037203 -0.2754762491 0.1027306840
-0.0604396344 -0.3139785876 0.0634648473
-0.0611919625 -0.3956485738 0.0425720512
-0.0446208459 -0.2731592215 0.0713002093
-0.0295543855 -0.3140098414 0.0582427752
-0.0258813460 0.0716614674 0.1455793981
-0.0257978684 0.1074866074 0.1651113198
-0.0065266444 0.2370408538 -0.0030825767
-0.0141981186 0.3312421436 0.0158887250
-0.0065266444 0.2370408538 -0.0030825767
0.0147613021 0.1892145341 -0.0059588676
0.0332168275 0.2334858422 0.0376499734
0.0181609082 0.2806697184 0.0480600986
0.0098059122 -0.0103457759 0.0740663588
0.0041020237 -0.3080570309 -0.0282754860
-0.0080963109 -0.3492583608 -0.0316168691
-0.0088726633 -0.2302188774 -0.1107749730
-0.0562214728 0.1550667631 0.1689397487
-0.0859098622 0.1701020892 0.1209191524
-0.0058465911 0.1410655475 0.0698681649
-0.0074199654 0.0546788152 0.0804675390
-0.0058465911 0.1410655475 0.0698681649
0.0122533216 0.1844528583 0.0587855999
-0.0263726363 0.0513464630 0.1531723687
-0.0260620800 0.1018464489 0.1725940452
0.0667468962 -0.4411529308 0.0838463095
0.0605064675 -0.4522883360 0.0251379631
0.0852738716 -0.4837174914 0.0811692919
0.0667468962 -0.4411529308 0.0838463095
0.0974060574 -0.4612415932 -0.1194115157
0.0854445716 -0.4187774541 -0.1165783670
0.0958640173 -0.4658060534 -0.0575027816
0.0974060574 -0.4612415932 -0.1194115157
0.0763417968 -0.4079593902 0.0219734803
0.0804863585 -0.4334536494 0.0824805720
0.0939898716 -0.4713533666 0.0177392086
0.0763417968 -0.4079593902 0.0219734803
-0.0857054933 0.2937499029 0.2238332013
-0.0857054933 0.2937499029 0.2238332013
-0.0626446383 0.3239915029 0.2264970019
-0.0626446383 0.3239915029 0.2264970019
-0.0258427535 0.3351269052 0.2280078240
-0.0258427535 0.3351269052 0.2280078240
0.0106428593 0.3229034762 0.2277875813
0.0106428593 0.3229034762 0.2277875813
0.0328757722 0.2919902208 0.2259223332
0.0328757722 0.2919902208 0.2259223332
0.0323647732 0.2541948213 0.2231228441
0.0323647732 0.2541948213 0.2231228441
0.0093036578 0.2239532253 0.2204590373
0.0093036578 0.2239532253 0.2204590373
-0.0274982791 0.2128178238 0.2189482140
-0.0274982791 0.2128178238 0.2189482140
-0.0639838398 0.2250412519 0.2191684579
-0.0639838398 0.2250412519 0.2191684579
-0.0862170723 0.2559539926 0.2210336601
-0.0862170723 0.2559539926 0.2210336601
-0.0778547322 0.3223413905 -0.1574541366
-0.0778547322 0.3223413905 -0.1574541366
-0.0457658239 0.3190999392 -0.1195561982
-0.0442906357 0.3245834085 -0.1938550527
-0.0547353849 0.3542716804 -0.1545462657
-0.0547353849 0.3542716804 -0.1545462657
-0.0291857259 0.3311787348 -0.1182689608
-0.0277105486 0.3366616730 -0.1925676979
-0.0178673987 0.3660416344 -0.1527964260
-0.0178673987 0.3660416344 -0.1527964260
-0.0291857259 0.3311787348 -0.1182689608
-0.0277105486 0.3366616730 -0.1925676979
0.0186666157 0.3531548084 -0.1528725702
0.0186666157 0.3531548084 -0.1528725702
-0.0088979445 0.3308698872 -0.1178062571
-0.0074226604 0.3363528315 -0.1921050956
0.0409126867 0.3205333911 -0.1547458963
0.0409126867 0.3205333911 -0.1547458963
0.0073488011 0.3182913775 -0.1183450791
0.0088235726 0.3237748531 -0.1926439435
0.0403727488 0.2806379500 -0.1577011107
0.0403727488 0.2806379500 -0.1577011107
0.0068088541 0.2783959096 -0.1212999299
0.0082836269 0.2838793891 -0.1955988463
0.0172535377 0.2487070999 -0.1606084968
0.0172535377 0.2487070999 -0.1606084968
-0.0097715885 0.2663176774 -0.1225876570
-0.0082963039 0.2718011222 -0.1968861973
-0.0196147930 0.2369377092 -0.1623588263
-0.0196147930 0.2369377092 -0.1623588263
-0.0300593828 0.2666264868 -0.1230498413
-0.0082963039 0.2718011222 -0.1968861973
-0.0561489767 0.2498244993 -0.1622821663
-0.0561489767 0.2498244993 -0.1622821663
-0.0300593828 0.2666264868 -0.1230498413
-0.0285841920 0.2721099637 -0.1973487997
-0.0783946818 0.2824459149 -0.1604088835
-0.0783946818 0.2824459149 -0.1604088835
-0.0463057709 0.2792044713 -0.1225110490
-0.0448305814 0.2846879444 -0.1968099554
0.0033747123 -0.3649150008 0.1291642328
0.0008284650 -0.3724286303 0.2310753680
-0.0037287151 -0.3422300417 0.1306687139
-0.0062754832 -0.3497436632 0.2325798367
-0.0229374905 -0.3279843899 0.1312643619
-0.0254842457 -0.3354979731 0.2331749652
-0.0665008193 -0.3412755342 0.1292518439
-0.0690474703 -0.3487891190 0.2311624497
-0.0742155469 -0.3637351517 0.1274126509
-0.0767621979 -0.3712487365 0.2293232567
-0.0742155469 -0.3637351517 0.1274126509
-0.0767621979 -0.3712487365 0.2293232567
-0.0671117941 -0.3864200773 0.1259076578
-0.0696584581 -0.3939337004 0.2278187830
-0.0239260960 -0.4010303883 0.1258541271
-0.0264728512 -0.4085439715 0.2277647304
-0.0043397028 -0.3873746231 0.1273250472
-0.0068864710 -0.3948882446 0.2292361700
0.0033747123 -0.3649150008 0.1291642328
0.0008284650 -0.3724286303 0.2310753680
0.0115316985 -0.3387065301 -0.2584317952
0.0106604698 -0.3463982482 -0.1545821510
0.0044721700 -0.3169004217 -0.2569494412
0.0036009407 -0.3245916432 -0.1530994469
-0.0145961584 -0.3032060662 -0.2562798374
-0.0392616755 -0.3105461884 -0.1528291364
-0.0578221056 -0.3159799218 -0.2579940189
-0.0586932847 -0.3236716483 -0.1541442696
-0.0654687006 -0.3375692390 -0.2597230606
-0.0663398740 -0.3452604499 -0.1558732209
-0.0654687006 -0.3375692390 -0.2597230606
-0.0663398740 -0.3452604499 -0.1558732209
-0.0584095888 -0.3593753411 -0.2612054245
-0.0592807614 -0.3670670485 -0.1573559350
-0.0155465565 -0.3734213026 -0.2614760233
-0.0402122242 -0.3807609067 -0.1580252357
0.0038847910 -0.3602958426 -0.2601608443
0.0030135681 -0.3679870450 -0.1563111098
0.0115316985 -0.3387065301 -0.2584317952
0.0106604698 -0.3463982482 -0.1545821510
-0.0388307886 -0.2277294272 -0.1429584130
0.0468629288 0.0160071104 0.0146492176
0.0428632147 -0.4358939842 0.1182543156
0.0595540154 -0.4045872543 0.1209782089
0.0496521719 -0.4155129948 -0.1541202374
0.0980142639 -0.4479636170 -0.1553080990
-0.0398642554 -0.2590791144 -0.1196636681
-0.0377024164 -0.1960981586 -0.1700629313
-0.0459700778 -0.2205705621 0.1618612610
0.0471127961 0.1433345842 0.0295528890
0.0487387936 0.1032896389 -0.0080940621
-0.0456394446 -0.2478828594 0.1303908588
-0.0454037203 -0.2754762491 0.1027306840
0.0195538823 0.2821309367 0.0280801026
0.0832596093 -0.4264178128 -0.0170639592
0.0870399799 -0.4341090652 -0.0553856457
0.0746016280 -0.3942293886 -0.0216135813
0.0922497027 -0.4576233649 -0.0258478530
0.0870399799 -0.4341090652 -0.0553856457
0.0818302571 -0.4105947656 -0.0849234384
0.0766205342 -0.3870804659 -0.1144612311
0.0693919051 -0.3707150889 -0.0511513740
0.0818302571 -0.4105947656 -0.0849234384
0.1084875370 -0.4049117105 0.1164242082
0.0904704685 -0.4570409558 0.1121316425
-0.0242563697 0.1119066936 0.1031324950
-0.0252694450 0.1187669243 0.1501458690
-0.0254364004 0.0471166444 0.1110820256
-0.0250430568 0.0687133274 0.1084321821
-0.0234696825 0.1551000597 0.0978328080
-0.0248761014 0.1403636074 0.1474960255
-0.0242563697 0.1119066936 0.1031324950
-0.0234696825 0.1551000597 0.0978328080
-0.0205147241 -0.0058996648 -0.1299794156
-0.0211667230 -0.0025427907 -0.1004030278
0.0377057529 -0.2085087668 -0.0021327452
0.0550723116 -0.0894406940 0.0160622763
0.0322610529 -0.2090871892 0.0066723283
0.0238358883 -0.2392880242 0.0087273781
-0.0118680518 -0.1701039335 -0.1094117165
-0.0136601750 -0.1479191755 -0.1014126426
-0.0184476867 -0.0656194736 -0.0920503123
-0.0175388503 -0.1114223736 -0.0780970494
-0.0103703575 -0.2001614054 -0.1100933447
-0.0145434618 -0.1715373175 -0.0794603059
-0.0115480733 -0.2316522615 -0.0808235624
-0.0103703575 -0.2001614054 -0.1100933447
-0.0695677586 -0.2272592945 -0.1436893558
-0.0392296598 -0.2572009656 -0.1451411280
0.0097212206 -0.4508826631 -0.0047691836
-0.0523414180 -0.4493378502 -0.0062012152
-0.0487116281 0.1672943639 -0.1389930881
-0.0267120972 -0.0189571464 0.1222287384
-0.0275131718 -0.0266152054 0.1509892720
0.0245031142 -0.2373131556 -0.0180600199
0.0327058702 -0.2077706101 -0.0111859370
0.0555171289 -0.0881241149 -0.0017959891
0.0377057529 -0.2085087668 -0.0021327452
-0.0303640881 0.4148261849 0.0524307926
0.0220120818 0.0414577415 -0.0354169250
-0.0126966067 0.0434887570 -0.0564934945
0.0051212012 0.0847100219 -0.0382782525
0.0220120818 0.0414577415 -0.0354169250
0.0229390091 0.1259312869 -0.0200630106
0.0492022573 0.1455264116 -0.0004171049
0.0482753299 0.0610528663 -0.0157710193
0.0398298897 0.0826790065 -0.0172016831
-0.0047672021 -0.3063421783 -0.0498098855
-0.0033210476 -0.2849433694 -0.0560413621
-0.0269027922 -0.3882677595 -0.0633486837
-0.0129426881 -0.3045073512 -0.0690422376
0.0912273216 -0.4681957514 0.1170774652
0.0920814692 -0.4050847730 0.1217517304
0.0912273216 -0.4681957514 0.1170774652
0.0745365209 -0.4995024813 0.1143535719
-0.0156904215 -0.2161233649 0.1033548479
-0.0153064183 -0.2432778758 0.0697416582
-0.0184480608 -0.1834526767 0.0770687004
-0.0156904215 -0.2161233649 0.1033548479
-0.0215897033 -0.1236274777 0.0843957425
-0.0233525261 -0.0801376227 0.1048658584
-0.0189280648 -0.1495095382 0.1190851875
-0.0172612428 -0.1862107654 0.1070183690
-0.0461594012 -0.0126142240 -0.1862100688
-0.0583374938 -0.0633439550 -0.1902536790
-0.0555317928 -0.1427385648 -0.1960374971
-0.0719184368 -0.0743763810 -0.1914053800
-0.0461594012 -0.0126142240 -0.1862100688
-0.0475622517 0.0270830809 -0.1833181598
-0.0775298388 0.0844128387 -0.1798377438
-0.0475622517 0.0270830809 -0.1833181598
0.0436979219 -0.0911460480 0.0411655508
0.0213716530 -0.2102440340 0.0242824755
0.0474893851 -0.0905775967 0.0327977927
0.0559145498 -0.0603767617 0.0307427429
0.0539779183 -0.3980945697 -0.0485234453
0.0583031897 -0.4146638260 -0.0903611829
-0.0197737872 0.1658971309 -0.0506392432
-0.0201393856 0.1239501910 -0.0622451252
-0.0186695296 0.1583065648 -0.1019566729
-0.0197737872 0.1658971309 -0.0506392432
-0.0205049841 0.0820032512 -0.0738510072
-0.0206877834 0.0610297813 -0.0796539482
-0.0188523289 0.1373330949 -0.1077596139
-0.0201393856 0.1239501910 -0.0622451252
0.0032123890 -0.3106901891 0.0074410448
-0.0102948802 -0.3919360040 -0.0168518686
0.0147562563 -0.2895111018 0.0003066628
0.0141017890 -0.3095333443 -0.0101691023
0.0671412596 -0.4584846595 -0.1511039323
0.0578777719 -0.4372023792 -0.1497654235
0.0631663373 -0.4457468635 -0.0636660722
0.0752881249 -0.4617928467 -0.0311294664
0.0904939927 -0.4687099096 -0.1224103288
0.0889519526 -0.4732743698 -0.0605015947
0.0988684115 -0.3848526386 -0.1506338339
0.0980142639 -0.4479636170 -0.1553080990
0.0988684115 -0.3848526386 -0.1506338339
0.0830337733 -0.3528995351 -0.1486724507
0.0569791487 -0.0572255813 -0.0119980474
0.0487763927 -0.0867681267 -0.0188721303
0.0227061049 -0.2062942968 -0.0292923207
0.0454060245 -0.0860901327 -0.0274102009
0.0330082420 -0.0024862045 -0.0362870559
0.0128899666 -0.0012169320 -0.0497500706
-0.0603954474 0.4147208255 0.0593405818
-0.0332319150 0.0934865912 -0.1780653649
-0.0339813086 0.0381155069 -0.1821664587
-0.0332319150 0.0934865912 -0.1780653649
-0.0482157086 0.1221514701 -0.1763251569
0.0066865504 -0.2341217249 -0.0548597030
0.0152479938 -0.2046988891 -0.0474465674
0.0413182815 -0.0851727191 -0.0370263770
0.0152479938 -0.2046988891 -0.0474465674
-0.0202257387 -0.3933635627 0.0042354351
-0.0067184695 -0.3121177478 0.0285283485
-0.0303317939 -0.4149487208 0.0165855519
-0.0291980559 -0.3950618352 0.0287998953
0.0793478145 -0.0051621409 -0.0086204950
-0.0513769386 -0.4470147955 -0.0377463989
0.0527923005 -0.3924900401 0.0174972948
0.0639034384 -0.3680797327 0.0557458045
-0.0384319174 -0.1982578887 -0.1407756981
-0.0069654465 -0.1965682912 -0.1693319885
-0.0582407506 0.0933646704 0.2141667042
-0.0431077681 0.0646975077 0.2124300700
-0.0438571591 0.0093264311 0.2083288723
-0.0431077681 0.0646975077 0.2124300700
0.0978248499 -0.3746893792 -0.1441609863
0.0913246032 -0.3939300156 0.1168064271
0.0513775251 -0.4564430156 0.1112019899
0.0606410128 -0.4777252959 0.1098634811
0.0868158988 -0.4791530694 0.0192610772
0.0852738716 -0.4837174914 0.0811692919
0.0744321968 -0.4634384917 -0.0087545872
0.0605064675 -0.4522883360 0.0251379631
-0.0497519829 -0.4348026369 0.0072717188
-0.0269027922 -0.3882677595 -0.0633486837
-0.0285673466 -0.4097258507 -0.0542521754
-0.0047672021 -0.3063421783 -0.0498098855
-0.0191641059 -0.3902211514 -0.0383862682
0.0131031778 0.0208471091 -0.0445245460
-0.0045709832 -0.0112334448 -0.0629011176
-0.0595160002 0.4161811304 0.0232980811
-0.0298540358 0.4163361272 0.0319536898
0.0018315602 0.2083582169 0.0602885435
0.0364580113 0.2087461064 0.0487227878
0.0156144885 0.2565568236 0.0517286750
0.0018315602 0.2083582169 0.0602885435
-0.0052290342 0.3043675409 0.0547345621
-0.0329640212 0.3280789549 0.0620203836
-0.0259034267 0.2320696309 0.0675743650
-0.0190119626 0.2561689342 0.0632944307
0.0098059122 -0.0103457759 0.0740663588
0.0305706509 -0.0097015635 0.0615755847
-0.0158469299 -0.3133901334 0.0473711295
-0.0291980559 -0.3950618352 0.0287998953
-0.0056628031 -0.2920179187 0.0378818523
-0.0067184695 -0.3121177478 0.0285283485
-0.0577494604 0.1136796748 0.2065737336
-0.0519499773 -0.4481790767 -0.0219164334
-0.0452405734 -0.2184113209 0.1325735738
-0.0767070477 -0.2201004295 0.1611303182
0.0543631942 -0.4254383531 0.0558306451
0.0523528566 -0.4029047288 0.0167184080
0.0430095919 -0.4351744331 0.1125617955
0.0373469257 0.0773257821 0.0555244105
0.0461554367 0.0561087824 0.0513647699
0.0466383273 0.1419300926 0.0486014861
0.0197299037 0.1197597815 0.0638436916
0.0192470130 0.0339384712 0.0666069754
0.0016299910 0.0763724706 0.0749262565
-0.0164699217 0.0329851598 0.0860088214
0.0192470130 0.0339384712 0.0666069754
-0.0145184715 -0.2755075029 0.0975086119
-0.0149024747 -0.2483529920 0.1311218016
-0.0149024747 -0.2483529920 0.1311218016
-0.0460383158 -0.2773543978 0.1282081438
0.0673196178 -0.3579679785 -0.0814046601
0.0544173622 -0.3876798809 -0.0477445585
-0.0567498961 0.1437864462 0.1839051994
-0.0145184715 -0.2755075029 0.0975086119
-0.0446208459 -0.2731592215 0.0713002093
0.0175801897 -0.2108124854 0.0326502336
0.0391336917 -0.0917822409 0.0505869414
0.0130159596 -0.2114486782 0.0420716242
0.0042044114 -0.2416833839 0.0446534901
-0.0171706176 0.2609540137 -0.0016444312
-0.0239788538 0.2377665287 -0.0096919366
-0.0316503280 0.3319678184 0.0092793650
-0.0035541454 0.3073289837 0.0144505795
0.0041173289 0.2131276939 -0.0045207221
0.0177338012 0.2595026639 0.0115742886
0.0390217477 0.2116763442 0.0086979977
0.0041173289 0.2131276939 -0.0045207221
0.0346098016 0.2349470605 0.0176699775
0.0414412742 0.2106245132 0.0224549129
0.0044979630 0.3293148129 0.0384902278
0.0332168275 0.2334858422 0.0376499734
-0.0575126973 -0.0017048549 0.2071754103
-0.0877786624 0.0556294705 0.2106486787
-0.0575126973 -0.0017048549 0.2071754103
-0.0560352530 -0.0414033037 0.2042853142
-0.0818688850 -0.1031643245 0.1990882940
-0.0652584582 -0.1715299359 0.1944615636
-0.0682133468 -0.0921330385 0.2002417560
-0.0560352530 -0.0414033037 0.2042853142
-0.0082481274 -0.0221177275 0.0847263323
0.0101970566 0.0122448158 0.0721482578
0.0141017890 -0.3095333443 -0.0101691023
0.0152010736 -0.2881945227 -0.0175516026
-0.0102948802 -0.3919360040 -0.0168518686
0.0041020237 -0.3080570309 -0.0282754860
0.0782327951 -0.0084626366 0.0361444959
-0.0481751665 0.1411323610 -0.1658217400
0.0109841314 -0.4485641730 -0.0363072704
0.0745982528 -0.4629470557 -0.0154213451
-0.0080938187 -0.2281995598 -0.1422274703
-0.0092715345 -0.2596904159 -0.1129576880
0.0495098387 -0.4159337967 -0.1484056179
0.0969707152 -0.4378003193 -0.1488357709
0.1149877838 -0.3856710740 -0.1445432052
0.0784140777 -0.4207065198 0.0522270262
0.0675177594 -0.3762624021 0.0240906162
0.0716623211 -0.4017566612 0.0845977079
0.0784140777 -0.4207065198 0.0522270262
0.0851658342 -0.4396563784 0.0198563445
0.0919175907 -0.4586062370 -0.0125143372
0.0742695160 -0.3952122606 -0.0082800655
0.0851658342 -0.4396563784 0.0198563445
-0.0572594208 0.2717398590 0.2592094477
-0.0616318298 0.2771770887 0.1865915926
-0.0507441768 0.2905449380 0.2607193487
-0.0551165337 0.2959821670 0.1881014949
-0.0341985729 0.3019809394 0.2618732099
-0.0183146418 0.3071180888 0.1896123554
0.0022870339 0.2897579917 0.2616535251
-0.0020851146 0.2951952175 0.1890356762
0.0082909594 0.2707671565 0.2603638912
0.0039182771 0.2762043521 0.1877465494
0.0082909594 0.2707671565 0.2603638912
0.0039182771 0.2762043521 0.1877465494
0.0017755070 0.2519620807 0.2588539852
-0.0025966475 0.2573997878 0.1862366943
-0.0350262346 0.2408266377 0.2573436863
-0.0191423104 0.2459632677 0.1850827934
-0.0512557037 0.2527490269 0.2579198088
-0.0556280665 0.2581867372 0.1853025129
-0.0572594208 0.2717398590 0.2592094477
-0.0616318298 0.2771770887 0.1865915926
0.0408969982 -0.3692617636 0.1809958579
0.0296046410 -0.3371127320 0.2087304777
0.0266896226 -0.3238918375 0.1840048077
0.0379814590 -0.3560408612 0.1562701755
0.0156688627 -0.3425250042 0.1311066097
-0.0037287151 -0.3422300417 0.1306687139
-0.0062754832 -0.3497436632 0.2325798367
0.0131223485 -0.3500386488 0.2330179984
0.0266896226 -0.3238918375 0.1840048077
-0.0027602164 -0.3044017172 0.2103754110
-0.0117279153 -0.2954004955 0.1851955842
0.0177219367 -0.3148905775 0.1588244614
-0.0070916264 -0.3169368728 0.1324544982
-0.0229374905 -0.3279843899 0.1312643619
-0.0254842457 -0.3354979731 0.2331749652
-0.0096383881 -0.3244504752 0.2343653613
-0.0117279153 -0.2954004955 0.1851955842
-0.0483297732 -0.2967319636 0.2098608438
-0.0596816303 -0.2946712562 0.1841123922
-0.0230796162 -0.2933397904 0.1594471363
-0.0406729497 -0.3094494260 0.1322107244
-0.0469144261 -0.3276197690 0.1307227640
-0.0494610251 -0.3351333547 0.2326333711
-0.0432195487 -0.3169630117 0.2341213314
-0.0596816303 -0.2946712562 0.1841123922
-0.0896979088 -0.3170332997 0.2073836629
-0.0988544686 -0.3219827857 0.1811705508
-0.0688382422 -0.2996207413 0.1578992789
-0.0469144261 -0.3276197690 0.1307227640
-0.0624546141 -0.3160949982 0.1312044654
-0.0650011610 -0.3236085846 0.2331150737
-0.0494610251 -0.3351333547 0.2326333711
-0.0988544686 -0.3219827857 0.1811705508
-0.1110631968 -0.3575506086 0.2038894132
-0.1142839239 -0.3669020208 0.1774921646
-0.1020751957 -0.3313341979 0.1547733022
-0.0665008193 -0.3412755342 0.1292518439
-0.0858983710 -0.3409805721 0.1288139488
-0.0884449700 -0.3484941577 0.2307245558
-0.0690474703 -0.3487891190 0.2311624497
-0.1142839239 -0.3669020208 0.1774921646
-0.1113686907 -0.3801228993 0.2022175799
-0.1000764312 -0.4122719102 0.1744826979
-0.1029916644 -0.3990510317 0.1497572826
-0.0865093458 -0.3861251152 0.1254697626
-0.0671117941 -0.3864200773 0.1259076578
-0.0696584581 -0.3939337004 0.2278187830
-0.0890559577 -0.3936387391 0.2273808891
-0.1000764312 -0.4122719102 0.1744826979
-0.0911086606 -0.4212731523 0.1996627863
-0.0616588412 -0.4407632530 0.1732919226
-0.0706266117 -0.4317620110 0.1481118342
-0.0637487069 -0.4117132682 0.1241221375
-0.0479030316 -0.4006657674 0.1253125293
-0.0504496305 -0.4081793531 0.2272231363
-0.0662952603 -0.4192268737 0.2260330055
-0.0616588412 -0.4407632530 0.1732919226
-0.0503070622 -0.4428239593 0.1990403724
-0.0137051262 -0.4414924924 0.1743751146
-0.0250569052 -0.4394317861 0.1486266649
-0.0479030316 -0.4006657674 0.1253125293
-0.0421558579 -0.4190184237 0.1240953722
-0.0447024569 -0.4265320093 0.2260059792
-0.0504496305 -0.4081793531 0.2272231363
-0.0137051262 -0.4414924924 0.1743751146
-0.0045486249 -0.4365430247 0.2005884852
0.0254676471 -0.4141810003 0.1773174743
0.0163111458 -0.4191304679 0.1511041037
-0.0239260960 -0.4010303883 0.1258541271
-0.0083857257 -0.4125551619 0.1253724301
-0.0109324874 -0.4200687643 0.2272832931
-0.0264728512 -0.4085439715 0.2277647304
0.0254676471 -0.4141810003 0.1773174743
0.0286884198 -0.4048296080 0.2037149839
0.0408969982 -0.3692617636 0.1809958579
0.0376762255 -0.3786131559 0.1545983484
-0.0043397028 -0.3873746231 0.1273250472
0.0150578750 -0.3876695856 0.1277629430
0.0125113608 -0.3951832302 0.2296743317
-0.0068864710 -0.3948882446 0.2292361700
0.0495963338 -0.3431210412 -0.2058612613
0.0458487330 -0.3341408016 -0.1791574564
0.0354772762 -0.2995083278 -0.2028962031
0.0392248770 -0.3084885674 -0.2296000080
0.0354772762 -0.2995083278 -0.2028962031
0.0257252751 -0.2945842148 -0.1765989225
-0.0026593811 -0.2721201173 -0.2015572936
0.0070926200 -0.2770442303 -0.2278545743
-0.0026593811 -0.2721201173 -0.2015572936
-0.0147743616 -0.2738673822 -0.1757943125
-0.0502480077 -0.2714169170 -0.2023552852
-0.0381330272 -0.2696696521 -0.2281182664
-0.0502480077 -0.2714169170 -0.2023552852
-0.0601816232 -0.2799027122 -0.1770503725
-0.0891112248 -0.2976678330 -0.2049856036
-0.0791776094 -0.2891820379 -0.2302905163
-0.0891112248 -0.2976678330 -0.2049856036
-0.0931523309 -0.3103853008 -0.1798875739
-0.1044044091 -0.3408459518 -0.2084435966
-0.1003633029 -0.3281284840 -0.2335416262
-0.1044044091 -0.3408459518 -0.2084435966
-0.0940335489 -0.3754786590 -0.1847051171
-0.0902861847 -0.3844586525 -0.2114086745
-0.1006570442 -0.3498264419 -0.2351475041
-0.0902861847 -0.3844586525 -0.2114086745
-0.0619011871 -0.4069224973 -0.1864502501
-0.0521491108 -0.4118468694 -0.2127475741
-0.0805341079 -0.3893825241 -0.2377057003
-0.0521491108 -0.4118468694 -0.2127475741
-0.0166752535 -0.4142970798 -0.1861865512
-0.0045601717 -0.4125500744 -0.2119495751
-0.0400340811 -0.4100998631 -0.2385105992
-0.0045601717 -0.4125500744 -0.2119495751
0.0243690175 -0.3947846855 -0.1840143606
0.0343025246 -0.3862991505 -0.2093192691
0.0053733367 -0.4040645355 -0.2372545355
0.0343025246 -0.3862991505 -0.2093192691
0.0455550438 -0.3558387603 -0.1807633331
0.0495963338 -0.3431210412 -0.2058612613
0.0383438088 -0.3735819471 -0.2344172877
0.0832596093 -0.4264178128 -0.0170639592
-0.0080938187 -0.2281995598 -0.1422274703
-0.0384319174 -0.1982578887 -0.1407756981
-0.0487116281 0.1672943639 -0.1389930881
0.0740331634 0.0174094298 -0.0092444304
0.0730842259 0.0146004466 0.0288527637
0.0595540154 -0.4045872543 0.1209782089
0.0586998678 -0.4676982327 0.1163039437
0.0762448161 -0.3732805245 0.1237021022
0.0920814692 -0.4050847730 0.1217517304
0.0654868100 -0.4474660983 -0.1560816205
0.0663449876 -0.3840574099 -0.1513853328
0.0654868100 -0.4474660983 -0.1560816205
0.0813214482 -0.4794192019 -0.1580430036
-0.0488564225 -0.4321519597 -0.0286827263
-0.0406430999 -0.2610984320 -0.0882111709
-0.0092715345 -0.2596904159 -0.1129576880
-0.0369729154 -0.1939384284 -0.1993501645
-0.0684393864 -0.1956280259 -0.1707938740
-0.0497519829 -0.4348026369 0.0072717188
-0.0519499773 -0.4481790767 -0.0219164334
-0.0466995821 -0.2227298034 0.1911489482
-0.0152331078 -0.2210406948 0.1625922037
0.0483892585 0.1655488842 0.0184063707
0.0485057702 0.1447958025 0.0095728931
0.0475788429 0.0603222571 -0.0057810214
0.0485057702 0.1447958025 0.0095728931
-0.0763764146 -0.2474127267 0.1296599160
-0.0452405734 -0.2184113209 0.1325735738
0.0104110927 -0.4497284541 -0.0204773049
-0.0567498961 0.1437864462 0.1839051994
-0.0713903466 0.3846644345 -0.0502288096
-0.0731172150 0.3715617546 0.1269885910
0.0044979630 0.3293148129 0.0384902278
0.0197792541 0.2827982360 0.0190321619
3 59 208 110
3 198 85 129
3 170 103 66
3 75 57 30
3 231 245 52
3 107 75 74
3 200 201 103
3 42 16 237
3 15 68 43
3 120 27 208
3 43 180 155
3 220 129 80
3 74 30 101
3 156 116 114
3 117 52 130
3 93 141 116
3 122 237 69
3 68 206 180
3 7 120 59
3 67 842 140
3 236 842 67
3 497 843 251
3 250 843 497
3 497 844 67
3 251 844 497
3 498 845 251
3 236 845 498
3 498 846 250
3 251 846 498
3 499 847 252
3 250 847 499
3 499 848 205
3 252 848 499
3 500 849 252
3 67 849 500
3 500 850 250
3 252 850 500
3 168 169 205
3 71 851 214
3 253 851 71
3 253 852 34
3 71 852 253
3 71 501 254
3 215 501 71
3 254 502 140
3 215 502 254
3 256 853 255
3 503 853 256
3 503 854 226
3 256 854 503
3 504 855 256
3 230 855 504
3 255 856 256
3 504 856 255
3 505 857 257
3 78 857 505
3 505 858 226
3 257 858 505
3 506 859 257
3 255 859 506
3 506 860 78
3 257 860 506
3 81 11 173
3 38 507 190
3 148 507 38
3 258 861 232
3 76 861 258
3 115 862 232
3 258 862 115
3 259 863 3
3 260 863 259
3 260 864 157
3 259 864 260
3 261 865 3
3 259 865 261
3 91 866 3
3 261 866 91
3 169 55 54
3 508 867 262
3 178 867 508
3 263 868 262
3 508 868 263
3 509 869 263
3 232 869 509
3 263 870 509
3 262 870 263
3 510 871 264
3 178 871 510
3 510 872 262
3 264 872 510
3 511 873 264
3 228 873 511
3 511 874 178
3 264 874 511
3 512 875 191
3 177 875 512
3 512 876 192
3 191 876 512
3 55 168 98
3 148 877 209
3 38 877 148
3 148 878 39
3 209 878 148
3 145 879 144
3 161 879 145
3 230 880 265
3 86 880 230
3 265 881 133
3 86 881 265
3 26 882 267
3 3 882 26
3 267 883 266
3 3 883 267
3 268 884 266
3 157 884 268
3 266 885 268
3 3 885 266
3 270 513 45
3 188 513 270
3 270 514 269
3 45 514 270
3 271 515 269
3 115 515 271
3 271 516 45
3 269 516 271
3 273 517 78
3 272 517 273
3 136 518 78
3 273 518 136
3 274 519 272
3 88 519 274
3 274 520 136
3 272 520 274
3 276 521 275
3 146 521 276
3 276 522 13
3 275 522 276
3 146 523 277
3 45 523 146
3 277 524 275
3 45 524 277
3 243 886 159
3 173 886 243
3 21 20 216
3 173 11 159
3 14 525 13
3 146 525 14
3 243 526 88
3 278 526 243
3 278 527 78
3 243 527 278
3 528 887 280
3 235 887 528
3 528 888 115
3 280 888 528
3 529 889 280
3 279 889 529
3 529 890 235
3 280 890 529
3 281 891 279
3 530 891 281
3 530 892 188
3 281 892 530
3 531 893 281
3 235 893 531
3 279 894 281
3 531 894 279
3 284 532 283
3 187 532 284
3 284 533 282
3 283 533 284
3 285 534 283
3 232 534 285
3 285 535 187
3 283 535 285
3 282 536 287
3 286 536 282
3 287 537 228
3 286 537 287
3 288 538 286
3 232 538 288
3 286 539 288
3 282 539 286
3 289 540 8
3 139 540 289
3 8 541 289
3 172 541 8
3 542 895 26
3 290 895 542
3 228 896 26
3 542 896 228
3 543 897 290
3 174 897 543
3 543 898 228
3 290 898 543
3 211 142 109
3 24 544 56
3 145 544 24
3 545 899 291
3 239 899 545
3 545 900 73
3 291 900 545
3 546 901 239
3 291 901 546
3 546 902 238
3 239 902 546
3 140 190 67
3 213 70 215
3 547 903 293
3 165 903 547
3 547 904 139
3 293 904 547
3 548 905 293
3 292 905 548
3 548 906 165
3 293 906 548
3 294 907 292
3 549 907 294
3 549 908 86
3 294 908 549
3 292 909 294
3 550 909 292
3 550 910 165
3 292 910 550
3 297 911 295
3 76 911 297
3 297 912 296
3 295 912 297
3 298 913 296
3 47 913 298
3 296 914 298
3 295 914 296
3 300 915 76
3 295 915 300
3 300 916 299
3 76 916 300
3 301 917 299
3 56 917 301
3 301 918 76
3 299 918 301
3 302 919 131
3 303 919 302
3 303 920 91
3 302 920 303
3 304 921 131
3 302 921 304
3 157 922 131
3 304 922 157
3 305 551 160
3 146 551 305
3 305 552 161
3 160 552 305
3 169 168 55
3 97 99 204
3 307 553 306
3 48 553 307
3 307 554 76
3 306 554 307
3 308 555 48
3 306 555 308
3 178 556 48
3 308 556 178
3 149 923 190
3 309 923 149
3 309 924 204
3 149 924 309
3 161 557 310
3 145 557 161
3 310 558 115
3 145 558 310
3 62 31 183
3 149 559 148
3 190 559 149
3 560 925 312
3 45 925 560
3 560 926 311
3 312 926 560
3 561 927 312
3 161 927 561
3 561 928 45
3 312 928 561
3 311 929 562
3 313 929 311
3 562 930 115
3 313 930 562
3 563 931 313
3 161 931 563
3 313 932 563
3 311 932 313
3 564 933 314
3 91 933 564
3 564 934 148
3 314 934 564
3 91 935 565
3 3 935 91
3 565 936 314
3 3 936 565
3 167 169 54
3 169 937 315
3 167 937 169
3 315 938 204
3 167 938 315
3 317 939 149
3 316 939 317
3 317 940 236
3 149 940 317
3 318 941 316
3 169 941 318
3 318 942 236
3 316 942 318
3 566 943 319
3 138 943 566
3 566 944 55
3 319 944 566
3 567 945 138
3 319 945 567
3 567 946 137
3 138 946 567
3 174 4 150
3 109 568 131
3 142 568 109
3 191 569 192
3 95 569 191
3 321 570 228
3 320 570 321
3 321 571 95
3 228 571 321
3 322 572 320
3 4 572 322
3 322 573 95
3 320 573 322
3 157 947 324
3 187 947 157
3 324 948 323
3 187 948 324
3 325 949 323
3 26 949 325
3 323 950 325
3 187 950 323
3 187 951 326
3 235 951 187
3 326 952 232
3 235 952 326
3 89 574 136
3 88 574 89
3 327 575 124
3 45 575 327
3 124 576 327
3 13 576 124
3 31 577 124
3 119 577 31
3 88 953 243
3 247 953 88
3 31 189 183
3 62 119 31
3 159 578 243
3 328 578 159
3 328 579 100
3 159 579 328
3 580 954 329
3 24 954 580
3 580 955 76
3 329 955 580
3 581 956 24
3 329 956 581
3 581 957 56
3 24 957 581
3 228 958 331
3 26 958 228
3 331 959 330
3 26 959 331
3 332 960 330
3 187 960 332
3 332 961 26
3 330 961 332
3 334 962 333
3 148 962 334
3 334 963 91
3 333 963 334
3 148 964 335
3 8 964 148
3 335 965 333
3 8 965 335
3 63 966 187
3 211 966 63
3 113 582 176
3 112 582 113
3 148 967 207
3 150 967 148
3 140 968 190
3 336 968 140
3 336 969 215
3 140 969 336
3 215 73 72
3 583 970 178
3 177 970 583
3 583 971 48
3 178 971 583
3 584 972 113
3 112 972 584
3 584 973 337
3 113 973 584
3 585 974 337
3 133 974 585
3 585 975 113
3 337 975 585
3 339 586 338
3 133 586 339
3 339 587 230
3 338 587 339
3 340 588 338
3 113 588 340
3 340 589 133
3 338 589 340
3 341 590 45
3 161 590 341
3 146 591 45
3 341 591 146
3 138 98 99
3 62 183 11
3 165 592 343
3 128 592 165
3 343 593 342
3 128 593 343
3 344 594 342
3 133 594 344
3 344 595 128
3 342 595 344
3 346 596 345
3 204 596 346
3 346 597 169
3 345 597 346
3 347 598 345
3 149 598 347
3 347 599 204
3 345 599 347
3 348 600 99
3 67 600 348
3 99 601 348
3 205 601 99
3 99 976 205
3 98 976 99
3 71 35 34
3 215 977 214
3 71 977 215
3 350 602 349
3 35 602 350
3 350 603 58
3 349 603 350
3 351 604 349
3 71 604 351
3 351 605 35
3 349 605 351
3 353 606 352
3 20 606 353
3 353 607 216
3 352 607 353
3 354 608 352
3 13 608 354
3 354 609 20
3 352 609 354
3 356 610 355
3 128 610 356
3 356 611 133
3 355 611 356
3 128 612 357
3 127 612 128
3 357 613 355
3 127 613 357
3 358 978 33
3 70 978 358
3 35 979 33
3 358 979 35
3 361 614 360
3 133 614 361
3 361 615 359
3 360 615 361
3 362 616 360
3 86 616 362
3 362 617 133
3 360 617 362
3 359 618 364
3 363 618 359
3 364 619 165
3 363 619 364
3 365 620 363
3 86 620 365
3 363 621 365
3 359 621 363
3 131 240 157
3 239 35 238
3 97 137 99
3 73 214 34
3 367 980 366
3 58 980 367
3 367 981 35
3 366 981 367
3 368 982 38
3 58 982 368
3 368 983 366
3 38 983 368
3 8 984 172
3 148 984 8
3 63 187 157
3 370 985 174
3 369 985 370
3 148 986 174
3 370 986 148
3 371 987 369
3 26 987 371
3 371 988 148
3 369 988 371
3 373 622 372
3 374 622 373
3 374 623 86
3 373 623 374
3 375 624 373
3 139 624 375
3 372 625 373
3 375 625 372
3 377 626 376
3 131 626 377
3 377 627 86
3 376 627 377
3 378 628 376
3 372 628 378
3 378 629 131
3 376 629 378
3 630 989 115
3 235 989 630
3 115 990 630
3 232 990 115
3 379 631 189
3 188 631 379
3 189 632 379
3 124 632 189
3 381 633 13
3 380 633 381
3 381 634 119
3 13 634 381
3 382 635 380
3 216 635 382
3 382 636 119
3 380 636 382
3 13 991 119
3 124 991 13
3 173 637 247
3 243 637 173
3 124 992 31
3 189 992 124
3 384 638 383
3 60 638 384
3 384 639 88
3 383 639 384
3 385 640 383
3 241 640 385
3 385 641 60
3 383 641 385
3 81 173 247
3 642 993 387
3 78 993 642
3 642 994 100
3 387 994 642
3 643 995 387
3 386 995 643
3 643 996 78
3 387 996 643
3 388 997 386
3 644 997 388
3 644 998 243
3 388 998 644
3 645 999 388
3 78 999 645
3 386 1000 388
3 645 1000 386
3 389 1001 109
3 86 1001 389
3 131 1002 109
3 389 1002 131
3 646 1003 390
3 139 1003 646
3 646 1004 8
3 390 1004 646
3 139 1005 647
3 91 1005 139
3 647 1006 390
3 91 1006 647
3 174 648 4
3 391 648 174
3 391 649 228
3 174 649 391
3 235 650 211
3 187 650 235
3 175 1007 112
3 176 1007 175
3 207 1008 209
3 150 1008 207
3 392 651 204
3 190 651 392
3 99 652 204
3 392 652 99
3 167 54 137
3 653 1009 164
3 165 1009 653
3 653 1010 127
3 164 1010 653
3 394 654 393
3 395 654 394
3 395 655 232
3 394 655 395
3 396 656 394
3 178 656 396
3 393 657 394
3 396 657 393
3 398 658 397
3 76 658 398
3 398 659 232
3 397 659 398
3 399 660 397
3 393 660 399
3 399 661 76
3 397 661 399
3 401 662 400
3 76 662 401
3 401 663 24
3 400 663 401
3 402 664 400
3 115 664 402
3 402 665 76
3 400 665 402
3 136 666 403
3 78 666 136
3 403 667 226
3 78 667 403
3 405 668 235
3 404 668 405
3 405 669 109
3 235 669 405
3 406 670 404
3 100 670 406
3 406 671 109
3 404 671 406
3 215 214 73
3 215 672 407
3 70 672 215
3 407 673 190
3 70 673 407
3 24 674 145
3 408 674 24
3 408 675 115
3 24 675 408
3 409 1011 38
3 70 1011 409
3 38 1012 409
3 190 1012 38
3 411 676 410
3 247 676 411
3 411 677 241
3 410 677 411
3 412 678 88
3 247 678 412
3 412 679 410
3 88 679 412
3 414 680 47
3 413 680 414
3 48 681 47
3 414 681 48
3 415 682 413
3 76 682 415
3 415 683 48
3 413 683 415
3 70 1013 33
3 213 1013 70
3 416 1014 684
3 417 1014 416
3 684 1015 109
3 417 1015 684
3 685 1016 417
3 100 1016 685
3 417 1017 685
3 416 1017 417
3 686 1018 418
3 109 1018 686
3 686 1019 416
3 418 1019 686
3 687 1020 418
3 230 1020 687
3 687 1021 109
3 418 1021 687
3 63 157 240
3 213 215 72
3 688 1022 182
3 139 1022 688
3 688 1023 165
3 182 1023 688
3 689 1024 182
3 165 1024 689
3 689 1025 181
3 182 1025 689
3 213 72 238
3 419 1026 67
3 99 1026 419
3 67 1027 419
3 190 1027 67
3 207 690 149
3 209 690 207
3 175 1028 176
3 225 1028 175
3 691 1029 139
3 182 1029 691
3 691 1030 23
3 139 1030 691
3 421 692 420
3 23 692 421
3 421 693 172
3 420 693 421
3 422 694 139
3 23 694 422
3 422 695 420
3 139 695 422
3 423 1031 91
3 424 1031 423
3 424 1032 131
3 423 1032 424
3 425 1033 91
3 423 1033 425
3 139 1034 91
3 425 1034 139
3 211 63 240
3 426 696 176
3 230 696 426
3 226 697 176
3 426 697 226
3 427 1035 698
3 428 1035 427
3 698 1036 45
3 428 1036 698
3 699 1037 428
3 124 1037 699
3 428 1038 699
3 427 1038 428
3 700 1039 429
3 45 1039 700
3 700 1040 427
3 429 1040 700
3 701 1041 429
3 188 1041 701
3 701 1042 45
3 429 1042 701
3 20 21 14
3 61 241 60
3 189 159 11
3 61 60 88
3 702 1043 188
3 430 1043 702
3 100 1044 188
3 702 1044 100
3 703 1045 430
3 159 1045 703
3 703 1046 100
3 430 1046 703
3 433 1047 432
3 133 1047 433
3 433 1048 112
3 432 1048 433
3 434 1049 133
3 432 1049 434
3 434 1050 431
3 133 1050 434
3 435 1051 431
3 436 1051 435
3 436 1052 127
3 435 1052 436
3 437 1053 431
3 435 1053 437
3 437 1054 133
3 431 1054 437
3 230 1055 86
3 704 1055 230
3 704 1056 109
3 230 1056 704
3 705 1057 3
3 438 1057 705
3 26 1058 3
3 705 1058 26
3 706 1059 438
3 148 1059 706
3 706 1060 26
3 438 1060 706
3 240 1061 142
3 131 1061 240
3 144 1062 145
3 56 1062 144
3 148 1063 149
3 207 1063 148
3 149 1064 236
3 38 1064 149
3 35 33 238
3 707 1065 192
3 178 1065 707
3 707 1066 228
3 192 1066 707
3 138 99 137
3 439 708 225
3 226 708 439
3 439 709 136
3 225 709 439
3 441 710 440
3 78 710 441
3 441 711 230
3 440 711 441
3 442 712 78
3 440 712 442
3 442 713 100
3 78 713 442
3 239 34 35
3 204 1067 97
3 167 1067 204
3 443 714 113
3 230 714 443
3 113 715 443
3 176 715 113
3 445 716 444
3 70 716 445
3 445 717 38
3 444 717 445
3 446 718 444
3 35 718 446
3 446 719 70
3 444 719 446
3 448 720 447
3 169 720 448
3 448 721 205
3 447 721 448
3 449 722 447
3 236 722 449
3 449 723 169
3 447 723 449
3 450 1068 205
3 168 1068 450
3 205 1069 450
3 98 1069 205
3 724 1070 452
3 451 1070 724
3 724 1071 140
3 452 1071 724
3 725 1072 452
3 71 1072 725
3 725 1073 451
3 452 1073 725
3 726 1074 453
3 451 1074 726
3 726 1075 58
3 453 1075 726
3 727 1076 453
3 140 1076 727
3 727 1077 451
3 453 1077 727
3 202 728 51
3 12 728 202
3 126 729 12
3 51 729 126
3 126 1078 51
3 65 1078 126
3 12 1079 210
3 202 1079 12
3 12 730 126
3 9 730 12
3 125 731 9
3 126 731 125
3 125 1080 126
3 65 1080 125
3 9 1081 210
3 12 1081 9
3 9 732 125
3 77 732 9
3 94 733 77
3 125 733 94
3 94 1082 125
3 65 1082 94
3 9 1083 77
3 210 1083 9
3 77 734 94
3 96 734 77
3 199 735 96
3 94 735 199
3 94 1084 65
3 199 1084 94
3 77 1085 96
3 210 1085 77
3 96 736 199
3 64 736 96
3 83 737 64
3 199 737 83
3 199 1086 65
3 83 1086 199
3 96 1087 64
3 210 1087 96
3 64 738 83
3 244 738 64
3 5 739 244
3 83 739 5
3 5 1088 83
3 65 1088 5
3 244 1089 210
3 64 1089 244
3 244 740 5
3 242 740 244
3 10 741 242
3 5 741 10
3 10 1090 5
3 65 1090 10
3 242 1091 210
3 244 1091 242
3 242 742 10
3 195 742 242
3 49 743 195
3 10 743 49
3 10 1092 65
3 49 1092 10
3 195 1093 210
3 242 1093 195
3 195 744 49
3 185 744 195
3 194 745 185
3 49 745 194
3 49 1094 65
3 194 1094 49
3 195 1095 185
3 210 1095 195
3 185 746 194
3 202 746 185
3 51 747 202
3 194 747 51
3 194 1096 65
3 51 1096 194
3 185 1097 202
3 210 1097 185
3 229 748 87
3 186 748 229
3 46 749 186
3 87 749 46
3 87 750 18
3 46 750 87
3 229 751 186
3 203 751 229
3 186 752 46
3 132 752 186
3 217 753 132
3 46 753 217
3 46 754 18
3 217 754 46
3 186 755 132
3 203 755 186
3 132 756 217
3 152 756 132
3 246 757 152
3 217 757 246
3 246 758 217
3 18 758 246
3 152 759 203
3 132 759 152
3 152 760 246
3 166 760 152
3 28 761 166
3 246 761 28
3 28 762 246
3 18 762 28
3 166 763 203
3 152 763 166
3 166 764 28
3 162 764 166
3 221 765 162
3 28 765 221
3 221 766 28
3 18 766 221
3 162 767 203
3 166 767 162
3 162 768 221
3 224 768 162
3 105 769 224
3 221 769 105
3 221 770 18
3 105 770 221
3 162 771 224
3 203 771 162
3 224 772 105
3 19 772 224
3 92 773 19
3 105 773 92
3 105 774 18
3 92 774 105
3 224 775 19
3 203 775 224
3 19 776 92
3 249 776 19
3 147 777 249
3 92 777 147
3 92 778 18
3 147 778 92
3 249 779 203
3 19 779 249
3 249 780 147
3 233 780 249
3 121 781 233
3 147 781 121
3 121 782 147
3 18 782 121
3 233 783 203
3 249 783 233
3 233 784 121
3 229 784 233
3 87 785 229
3 121 785 87
3 87 786 121
3 18 786 87
3 229 787 203
3 233 787 229
3 454 1098 25
3 36 1098 454
3 25 1099 454
3 90 1099 25
3 455 1100 102
3 90 1100 455
3 102 1101 455
3 36 1101 102
3 36 1102 788
3 102 1102 36
3 788 1103 84
3 102 1103 788
3 789 1104 90
3 223 1104 789
3 25 1105 90
3 789 1105 25
3 456 1106 90
3 102 1106 456
3 90 1107 456
3 171 1107 90
3 457 1108 22
3 171 1108 457
3 22 1109 457
3 102 1109 22
3 102 1110 790
3 22 1110 102
3 790 1111 84
3 22 1111 790
3 791 1112 171
3 223 1112 791
3 90 1113 171
3 791 1113 90
3 458 1114 171
3 22 1114 458
3 171 1115 458
3 41 1115 171
3 459 1116 153
3 41 1116 459
3 153 1117 459
3 22 1117 153
3 22 1118 792
3 153 1118 22
3 792 1119 84
3 153 1119 792
3 793 1120 41
3 223 1120 793
3 171 1121 41
3 793 1121 171
3 460 1122 41
3 153 1122 460
3 41 1123 460
3 234 1123 41
3 461 1124 106
3 234 1124 461
3 106 1125 461
3 153 1125 106
3 794 1126 153
3 84 1126 794
3 106 1127 153
3 794 1127 106
3 234 1128 795
3 41 1128 234
3 795 1129 223
3 41 1129 795
3 462 1130 234
3 106 1130 462
3 234 1131 462
3 6 1131 234
3 463 1132 123
3 6 1132 463
3 123 1133 463
3 106 1133 123
3 796 1134 106
3 84 1134 796
3 123 1135 106
3 796 1135 123
3 6 1136 797
3 234 1136 6
3 797 1137 223
3 234 1137 797
3 464 1138 6
3 123 1138 464
3 212 1139 6
3 464 1139 212
3 465 1140 222
3 212 1140 465
3 123 1141 222
3 465 1141 123
3 123 1142 798
3 222 1142 123
3 798 1143 84
3 222 1143 798
3 799 1144 212
3 223 1144 799
3 6 1145 212
3 799 1145 6
3 466 1146 212
3 222 1146 466
3 17 1147 212
3 466 1147 17
3 467 1148 134
3 17 1148 467
3 222 1149 134
3 467 1149 222
3 222 1150 800
3 134 1150 222
3 800 1151 84
3 134 1151 800
3 801 1152 17
3 223 1152 801
3 212 1153 17
3 801 1153 212
3 468 1154 17
3 134 1154 468
3 154 1155 17
3 468 1155 154
3 469 1156 1
3 154 1156 469
3 134 1157 1
3 469 1157 134
3 802 1158 134
3 84 1158 802
3 1 1159 134
3 802 1159 1
3 154 1160 803
3 17 1160 154
3 803 1161 223
3 17 1161 803
3 470 1162 154
3 1 1162 470
3 50 1163 154
3 470 1163 50
3 471 1164 53
3 50 1164 471
3 1 1165 53
3 471 1165 1
3 804 1166 1
3 84 1166 804
3 53 1167 1
3 804 1167 53
3 50 1168 805
3 154 1168 50
3 805 1169 223
3 154 1169 805
3 472 1170 50
3 53 1170 472
3 25 1171 50
3 472 1171 25
3 473 1172 36
3 25 1172 473
3 53 1173 36
3 473 1173 53
3 806 1174 53
3 84 1174 806
3 36 1175 53
3 806 1175 36
3 25 1176 807
3 50 1176 25
3 807 1177 223
3 50 1177 807
3 474 1178 79
3 163 1178 474
3 196 1179 79
3 474 1179 196
3 475 1180 219
3 196 1180 475
3 163 1181 219
3 475 1181 163
3 219 808 163
3 143 808 219
3 196 809 0
3 79 809 196
3 476 1182 196
3 219 1182 476
3 82 1183 196
3 476 1183 82
3 477 1184 158
3 82 1184 477
3 219 1185 158
3 477 1185 219
3 158 810 219
3 143 810 158
3 82 811 0
3 196 811 82
3 478 1186 82
3 158 1186 478
3 184 1187 82
3 478 1187 184
3 479 1188 248
3 184 1188 479
3 158 1189 248
3 479 1189 158
3 248 812 158
3 143 812 248
3 82 813 184
3 0 813 82
3 480 1190 184
3 248 1190 480
3 218 1191 184
3 480 1191 218
3 481 1192 37
3 218 1192 481
3 248 1193 37
3 481 1193 248
3 248 814 143
3 37 814 248
3 184 815 218
3 0 815 184
3 482 1194 218
3 37 1194 482
3 32 1195 218
3 482 1195 32
3 483 1196 108
3 32 1196 483
3 37 1197 108
3 483 1197 37
3 37 816 143
3 108 816 37
3 218 817 32
3 0 817 218
3 484 1198 32
3 108 1198 484
3 32 1199 484
3 179 1199 32
3 485 1200 44
3 179 1200 485
3 44 1201 485
3 108 1201 44
3 44 818 108
3 143 818 44
3 179 819 0
3 32 819 179
3 486 1202 179
3 44 1202 486
3 179 1203 486
3 29 1203 179
3 487 1204 111
3 29 1204 487
3 111 1205 487
3 44 1205 111
3 111 820 44
3 143 820 111
3 29 821 0
3 179 821 29
3 488 1206 29
3 111 1206 488
3 29 1207 488
3 193 1207 29
3 489 1208 2
3 193 1208 489
3 2 1209 489
3 111 1209 2
3 111 822 143
3 2 822 111
3 193 823 0
3 29 823 193
3 490 1210 193
3 2 1210 490
3 193 1211 490
3 151 1211 193
3 491 1212 227
3 151 1212 491
3 227 1213 491
3 2 1213 227
3 2 824 143
3 227 824 2
3 193 825 151
3 0 825 193
3 492 1214 151
3 227 1214 492
3 151 1215 492
3 79 1215 151
3 493 1216 163
3 79 1216 493
3 163 1217 493
3 227 1217 163
3 227 826 143
3 163 826 227
3 151 827 79
3 0 827 151
3 59 110 7
3 198 129 220
3 170 66 40
3 75 30 74
3 231 52 117
3 200 103 170
3 42 237 122
3 120 208 59
3 43 155 15
3 220 80 197
3 74 101 107
3 156 114 135
3 117 130 118
3 93 116 156
3 122 69 104
3 68 180 43
3 58 1218 236
3 140 1218 58
3 828 1219 178
3 192 1219 828
3 828 1220 177
3 178 1220 828
3 55 98 138
3 160 1221 161
3 144 1221 160
3 829 1222 211
3 235 1222 829
3 829 1223 109
3 211 1223 829
3 830 1224 494
3 72 1224 830
3 830 1225 238
3 494 1225 830
3 831 1226 73
3 72 1226 831
3 831 1227 494
3 73 1227 831
3 832 1228 495
3 54 1228 832
3 832 1229 137
3 495 1229 832
3 833 1230 54
3 495 1230 833
3 833 1231 55
3 54 1231 833
3 174 1232 148
3 150 1232 174
3 834 1233 228
3 95 1233 834
3 834 1234 192
3 228 1234 834
3 835 1235 47
3 48 1235 835
3 835 1236 177
3 47 1236 835
3 62 11 81
3 73 34 239
3 39 1237 148
3 172 1237 39
3 39 1238 150
3 209 1238 39
3 167 137 97
3 836 1239 128
3 127 1239 836
3 836 1240 165
3 128 1240 836
3 100 1241 837
3 188 1241 100
3 837 1242 496
3 188 1242 837
3 838 1243 496
3 235 1243 838
3 838 1244 188
3 496 1244 838
3 839 1245 164
3 181 1245 839
3 839 1246 165
3 164 1246 839
3 213 238 33
3 38 1247 209
3 149 1247 38
3 226 1248 225
3 176 1248 226
3 181 840 23
3 182 840 181
3 211 240 142
3 13 1249 14
3 20 1249 13
3 189 11 183
3 89 1250 88
3 61 1250 89
3 189 1251 159
3 841 1251 189
3 841 1252 188
3 189 1252 841
3 236 38 58