OFF

6 8 0
-0.306771 -0.099607 -0.175465
-0.323011 -0.186667 -0.184419
-0.383160 -0.062925 -0.204982
-0.314891 -0.143137 -0.179942
-0.344966 -0.081266 -0.190223
-0.353085 -0.124796 -0.194700
3 1 0 3
3 1 2 0
3 2 4 0
3 1 5 2
3 4 5 0
3 4 2 5
3 3 5 1
3 3 0 5
