OFF

330 656 0
-0.433174 0.275897 0.218636
-0.437102 0.278752 0.218631
-0.439527 0.282955 0.218622
-0.440034 0.287783 0.218613
-0.438534 0.292399 0.218603
-0.435285 0.296007 0.218596
-0.430851 0.297980 0.218592
-0.425994 0.297979 0.218591
-0.421561 0.296004 0.218595
-0.418314 0.292396 0.218601
-0.416815 0.287779 0.218611
-0.417324 0.282951 0.218620
-0.419750 0.278749 0.218629
-0.423679 0.275896 0.218635
-0.391199 0.290338 0.153186
-0.419999 0.325911 0.052350
-0.454420 0.288729 -0.064557
-0.447859 0.268527 -0.064517
-0.444508 0.295584 0.088989
-0.420895 0.269321 0.075192
-0.458051 0.276839 0.167066
-0.422200 0.271984 -0.047712
-0.411620 0.309213 -0.034394
-0.428439 0.250225 0.139426
-0.439076 0.262144 -0.064505
-0.455375 0.277505 0.063261
-0.442232 0.273887 0.089032
-0.392450 0.290179 0.139343
-0.430984 0.298359 0.119190
-0.411909 0.296020 0.181598
-0.409459 0.288478 0.181613
-0.397097 0.304486 0.139314
-0.447475 0.312600 0.129233
-0.452531 0.264425 -0.010384
-0.436761 0.324922 -0.143926
-0.456507 0.302309 -0.010459
-0.410120 0.311652 0.166992
-0.433083 0.308016 0.022251
-0.415316 0.304201 0.004636
-0.433876 0.311536 -0.064604
-0.428447 0.261361 0.043741
-0.417528 0.301313 0.088975
-0.391641 0.274235 0.037418
-0.425881 0.298358 0.119189
-0.415137 0.293715 -0.047756
-0.409981 0.288211 0.075153
-0.419323 0.278154 0.119229
-0.438553 0.263511 0.043738
-0.397616 0.276364 0.129300
-0.409976 0.269579 0.043723
-0.393856 0.305809 -0.143892
-0.396206 0.289765 0.129274
-0.417216 0.301915 0.181587
-0.453156 0.288813 0.043689
-0.435988 0.269351 0.089040
-0.450657 0.288472 0.004671
-0.439055 0.292498 0.119202
-0.405839 0.299047 -0.064582
-0.416926 0.260378 0.063291
-0.404810 0.278529 0.043705
-0.414566 0.305421 0.106587
-0.446896 0.288218 0.075157
-0.422494 0.314057 -0.034403
-0.443154 0.253353 0.139421
-0.400368 0.302579 0.129248
-0.440099 0.282574 0.119222
-0.396006 0.305145 0.153157
-0.420147 0.324919 -0.143927
-0.428454 0.270657 -0.047709
-0.407398 0.267298 0.063276
-0.392826 0.274854 0.153217
-0.449728 0.266906 -0.034306
-0.423800 0.307979 0.004630
-0.406000 0.279043 0.106639
-0.450432 0.316722 0.153139
-0.460674 0.289498 -0.010433
-0.432294 0.304455 0.088970
-0.423270 0.310519 0.043643
-0.394024 0.275215 0.139373
-0.466926 0.290251 0.037394
-0.421706 0.317798 -0.010493
-0.446914 0.269586 0.043727
-0.406917 0.298635 0.043665
-0.442603 0.273729 0.181646
-0.434396 0.314059 -0.034402
-0.413724 0.253348 0.139418
-0.428451 0.271300 -0.021730
-0.447784 0.297304 0.004653
-0.468787 0.290476 0.052426
-0.437534 0.265732 0.004715
-0.417812 0.292494 0.119200
-0.393302 0.306509 0.052387
-0.455398 0.302035 0.167015
-0.449489 0.267306 0.063281
-0.452077 0.278537 0.043709
-0.409397 0.312314 -0.010484
-0.411947 0.249165 0.052503
-0.401456 0.302026 0.167010
-0.420904 0.321791 0.139282
-0.468198 0.290021 -0.143853
-0.450874 0.279051 0.106643
-0.436188 0.269065 0.181655
-0.449963 0.298643 0.043669
-0.465249 0.274248 0.037425
-0.418339 0.263507 0.043736
-0.408002 0.298129 0.106601
-0.413831 0.281276 -0.047731
-0.415646 0.293469 -0.021776
-0.428441 0.267745 0.089043
-0.443796 0.307121 -0.064595
-0.441249 0.293474 -0.021773
-0.405288 0.265614 0.167083
-0.417028 0.275740 -0.047720
-0.434465 0.272578 -0.021732
-0.452963 0.300416 0.063215
-0.459762 0.304497 0.139321
-0.451898 0.288807 0.106624
-0.441617 0.256783 0.129344
-0.428448 0.245660 0.052512
-0.422438 0.272576 -0.021733
-0.414391 0.281511 -0.021752
-0.389959 0.290238 0.037386
-0.439636 0.301919 0.181589
-0.456258 0.261384 0.153250
-0.388722 0.290007 -0.143861
-0.410789 0.280566 0.089015
-0.439963 0.260382 0.063293
-0.415275 0.256499 -0.010372
-0.407162 0.315670 0.139293
-0.444190 0.250850 0.037470
-0.424460 0.305141 0.181581
-0.455676 0.277214 -0.034326
-0.419363 0.265764 0.022334
-0.433084 0.307980 0.004631
-0.422548 0.313952 0.063185
-0.423449 0.275157 0.119235
-0.464040 0.274867 0.153224
-0.459268 0.276096 -0.010406
-0.437549 0.278157 0.119231
-0.399979 0.289042 -0.034355
-0.404372 0.264416 -0.010389
-0.438035 0.264785 0.106670
-0.445045 0.271228 0.022326
-0.424575 0.304454 0.088969
-0.398773 0.259096 -0.143798
-0.411849 0.271222 0.022323
-0.428448 0.263835 0.022339
-0.453285 0.277933 -0.064535
-0.437485 0.298466 -0.047763
-0.428453 0.253700 -0.010365
-0.440099 0.259905 -0.034293
-0.442508 0.281516 -0.021749
-0.428435 0.255314 0.167106
-0.446089 0.280544 0.075172
-0.439344 0.301289 0.075130
-0.407205 0.279263 0.022306
-0.462844 0.275227 0.139379
-0.443045 0.306320 0.043653
-0.444510 0.295556 0.075142
-0.419759 0.298038 -0.021784
-0.417466 0.276189 -0.021741
-0.421948 0.316922 0.166982
-0.428438 0.248993 0.153272
-0.446732 0.311658 0.166995
-0.413211 0.252226 0.153264
-0.442234 0.273859 0.075185
-0.444719 0.249339 -0.143774
-0.465663 0.290351 0.153193
-0.452517 0.264704 0.129329
-0.456493 0.302588 0.129254
-0.411790 0.309159 0.063193
-0.397457 0.289709 0.167034
-0.431520 0.300540 -0.021788
-0.412363 0.295578 0.088986
-0.414647 0.273882 0.089029
-0.434707 0.271986 -0.047711
-0.400613 0.261374 0.153244
-0.414258 0.273724 0.181643
-0.441568 0.304240 0.022260
-0.402484 0.288719 -0.064562
-0.435178 0.317801 -0.010492
-0.444945 0.296026 0.181602
-0.434323 0.313954 0.063186
-0.417530 0.301285 0.075128
-0.437134 0.298041 -0.021783
-0.420676 0.269062 0.181653
-0.432390 0.305143 0.181582
-0.445272 0.309219 -0.034391
-0.436870 0.325914 0.052352
-0.415768 0.258003 0.167099
-0.400275 0.289206 0.063232
-0.420893 0.269349 0.089039
-0.406232 0.288499 0.022288
-0.431645 0.301068 -0.047769
-0.407179 0.266898 -0.034310
-0.441762 0.293719 -0.047753
-0.433424 0.275159 0.119236
-0.447397 0.288485 0.181617
-0.449686 0.279271 0.022310
-0.405692 0.317503 0.037333
-0.419414 0.298463 -0.047765
-0.449693 0.315677 0.139297
-0.435990 0.269324 0.075194
-0.467027 0.273701 0.052459
-0.423021 0.311534 -0.064605
-0.443073 0.281281 -0.047728
-0.412215 0.249333 -0.143777
-0.466464 0.273497 -0.143820
-0.428445 0.257932 0.063297
-0.409102 0.297333 0.022270
-0.404970 0.318158 -0.143916
-0.447489 0.312321 -0.010480
-0.428440 0.262746 0.106674
-0.460660 0.289777 0.129280
-0.394927 0.305542 0.037356
-0.399691 0.260301 0.037447
-0.409980 0.288239 0.089000
-0.403913 0.300408 0.063210
-0.432295 0.304427 0.075123
-0.445083 0.309165 0.063197
-0.388094 0.290462 0.052418
-0.441102 0.258008 0.167102
-0.420640 0.323050 0.153123
-0.421692 0.318077 0.129220
-0.416810 0.259901 -0.034295
-0.413103 0.307116 -0.064598
-0.397630 0.276085 -0.010413
-0.456920 0.289052 -0.034349
-0.403728 0.288804 0.043684
-0.436209 0.323053 0.153125
-0.396220 0.289486 -0.010439
-0.451941 0.318166 -0.143911
-0.446895 0.288245 0.089004
-0.409383 0.312593 0.129229
-0.404972 0.288799 0.106619
-0.419365 0.265729 0.004714
-0.436481 0.324053 0.037323
-0.464413 0.290192 0.139350
-0.451183 0.317511 0.037338
-0.400382 0.302300 -0.010465
-0.435948 0.321794 0.139284
-0.460849 0.305157 0.153163
-0.445047 0.271193 0.004705
-0.410906 0.270548 0.106656
-0.411851 0.271187 0.004702
-0.410292 0.280591 0.181629
-0.401509 0.277496 0.063255
-0.428450 0.263800 0.004718
-0.428468 0.245883 -0.143769
-0.428442 0.267717 0.075196
-0.446567 0.280597 0.181633
-0.453238 0.300373 -0.034372
-0.445971 0.270554 0.106660
-0.463573 0.306521 0.052394
-0.458159 0.259106 -0.143792
-0.433606 0.310521 0.043644
-0.415315 0.304236 0.022257
-0.452281 0.319055 0.052367
-0.403623 0.277924 -0.064540
-0.463059 0.305821 -0.143885
-0.420391 0.324050 0.037321
-0.407207 0.279228 0.004685
-0.428458 0.259885 -0.064502
-0.416236 0.287643 0.119209
-0.428455 0.257428 -0.034289
-0.413162 0.287632 -0.047744
-0.417839 0.262140 -0.064507
-0.455325 0.262199 0.139405
-0.413832 0.306315 0.043650
-0.433337 0.309415 0.106581
-0.443149 0.287629 -0.021761
-0.428427 0.274888 0.218637
-0.401227 0.277204 -0.034331
-0.415261 0.256778 0.129341
-0.440633 0.287648 0.119212
-0.458596 0.259090 0.052488
-0.410791 0.280538 0.075169
-0.450655 0.288507 0.022292
-0.439435 0.276193 -0.021739
-0.459254 0.276375 0.129307
-0.443664 0.252232 0.153267
-0.441570 0.304205 0.004639
-0.404358 0.264695 0.129324
-0.389860 0.273688 0.052452
-0.428432 0.267415 0.181657
-0.403656 0.300364 -0.034377
-0.390462 0.273484 -0.143828
-0.442299 0.305426 0.106590
-0.456605 0.289216 0.063238
-0.423798 0.308014 0.022250
-0.457204 0.260311 0.037452
-0.424576 0.304426 0.075122
-0.398295 0.259079 0.052482
-0.406234 0.288464 0.004667
-0.441631 0.256504 -0.010369
-0.428450 0.247501 0.037475
-0.428437 0.274098 0.119238
-0.423527 0.309414 0.106580
-0.449687 0.279236 0.004690
-0.428439 0.253979 0.129348
-0.404590 0.319047 0.052363
-0.421225 0.296283 0.119193
-0.447783 0.297340 0.022274
-0.434901 0.316924 0.166984
-0.437532 0.265767 0.022336
-0.398812 0.276828 0.167060
-0.409104 0.297298 0.004650
-0.443740 0.287638 -0.047741
-0.409052 0.268520 -0.064521
-0.412708 0.250845 0.037467
-0.451062 0.299055 -0.064578
-0.439877 0.275744 -0.047718
-0.435640 0.296286 0.119194
-0.451579 0.265622 0.167088
-0.401549 0.262190 0.139399
-0.413747 0.287624 -0.021764
-0.425372 0.300539 -0.021789
-0.412365 0.295551 0.075139
-0.435164 0.318080 0.129221
-0.448865 0.298137 0.106605
-0.425252 0.301067 -0.047770
-0.416771 0.282570 0.119220
-0.461952 0.305554 0.037362
-0.414648 0.273854 0.075183
-0.459402 0.289720 0.167040
-0.446088 0.280572 0.089019
-0.439342 0.301317 0.088977
-0.418844 0.264782 0.106669
-0.406420 0.316714 0.153134
-0.444948 0.249171 0.052506
3 1 0 2
3 0 271 2
3 271 3 2
3 271 4 3
3 271 5 4
3 271 6 5
3 271 7 6
3 271 8 7
3 271 9 8
3 271 10 9
3 271 11 10
3 271 12 11
3 271 13 12
3 286 50 124
3 286 144 50
3 144 206 50
3 206 248 50
3 248 210 50
3 248 67 210
3 248 34 67
3 248 231 34
3 248 259 231
3 248 166 259
3 166 254 259
3 254 207 259
3 207 99 259
3 248 206 266
3 262 248 266
3 262 266 21
3 68 262 21
3 68 21 224
3 264 68 224
3 264 224 119
3 86 264 119
3 86 119 127
3 149 86 127
3 149 127 235
3 247 149 235
3 247 235 132
3 146 247 132
3 146 132 309
3 295 146 309
3 295 309 104
3 40 295 104
3 40 104 96
3 118 40 96
3 118 96 58
3 208 118 58
3 208 58 19
3 249 208 19
3 249 19 191
3 108 249 191
3 108 191 327
3 212 108 327
3 212 327 135
3 296 212 135
3 296 135 273
3 299 296 273
3 299 273 85
3 23 299 85
3 23 85 164
3 162 23 164
3 162 164 189
3 152 162 189
3 152 189 185
3 284 152 185
3 284 185 13
3 271 284 13
3 206 144 308
3 266 206 308
3 266 308 112
3 21 266 112
3 21 112 194
3 224 21 194
3 224 194 160
3 119 224 160
3 119 160 140
3 127 119 140
3 127 140 244
3 235 127 244
3 235 244 145
3 132 235 145
3 132 145 215
3 309 132 215
3 309 215 49
3 104 309 49
3 104 49 292
3 96 104 292
3 96 292 69
3 58 96 69
3 58 69 323
3 19 58 323
3 19 323 174
3 191 19 174
3 191 174 243
3 327 191 243
3 327 243 46
3 135 327 46
3 135 46 282
3 273 135 282
3 273 282 314
3 85 273 314
3 85 314 176
3 164 85 176
3 164 176 111
3 189 164 111
3 189 111 177
3 185 189 177
3 185 177 12
3 13 185 12
3 144 286 258
3 308 144 258
3 308 258 106
3 112 308 106
3 112 106 272
3 194 112 272
3 194 272 120
3 160 194 120
3 160 120 226
3 140 160 226
3 140 226 261
3 244 140 261
3 244 261 155
3 145 244 155
3 145 155 42
3 215 145 42
3 215 42 59
3 49 215 59
3 49 59 283
3 292 49 283
3 292 283 246
3 69 292 246
3 69 246 276
3 323 69 276
3 323 276 125
3 174 323 125
3 174 125 73
3 243 174 73
3 243 73 321
3 46 243 321
3 46 321 48
3 282 46 48
3 282 48 78
3 314 282 78
3 314 78 70
3 176 314 70
3 176 70 305
3 111 176 305
3 111 305 245
3 177 111 245
3 177 245 11
3 12 177 11
3 286 124 179
3 258 286 179
3 258 179 265
3 106 258 265
3 106 265 139
3 272 106 139
3 272 139 315
3 120 272 315
3 120 315 230
3 226 120 230
3 226 230 293
3 261 226 293
3 261 293 192
3 155 261 192
3 155 192 121
3 42 155 121
3 42 121 228
3 59 42 228
3 59 228 220
3 283 59 220
3 283 220 190
3 246 283 190
3 246 190 45
3 276 246 45
3 276 45 216
3 125 276 216
3 125 216 234
3 73 125 234
3 73 234 263
3 321 73 263
3 321 263 51
3 48 321 51
3 48 51 27
3 78 48 27
3 78 27 14
3 70 78 14
3 70 14 171
3 305 70 171
3 305 171 30
3 245 305 30
3 245 30 10
3 11 245 10
3 124 50 57
3 179 124 57
3 179 57 44
3 265 179 44
3 265 44 285
3 139 265 285
3 139 285 107
3 315 139 107
3 315 107 239
3 230 315 239
3 230 239 306
3 293 230 306
3 293 306 209
3 192 293 209
3 192 209 214
3 121 192 214
3 121 214 82
3 228 121 82
3 228 82 91
3 220 228 91
3 220 91 217
3 190 220 217
3 190 217 317
3 45 190 317
3 45 317 173
3 216 45 173
3 216 173 105
3 234 216 105
3 234 105 90
3 263 234 90
3 263 90 64
3 51 263 64
3 51 64 31
3 27 51 31
3 27 31 66
3 14 27 66
3 14 66 97
3 171 14 97
3 171 97 29
3 30 171 29
3 30 29 9
3 10 30 9
3 50 210 225
3 57 50 225
3 57 225 200
3 44 57 200
3 44 200 22
3 285 44 22
3 285 22 159
3 107 285 159
3 107 159 95
3 239 107 95
3 239 95 38
3 306 239 38
3 306 38 256
3 209 306 256
3 209 256 199
3 214 209 199
3 214 199 268
3 82 214 268
3 82 268 300
3 91 82 300
3 91 300 170
3 217 91 170
3 217 170 183
3 317 217 183
3 317 183 41
3 173 317 41
3 173 41 60
3 105 173 60
3 105 60 301
3 90 105 301
3 90 301 233
3 64 90 233
3 64 233 128
3 31 64 128
3 31 128 328
3 66 31 328
3 66 328 36
3 97 66 36
3 97 36 52
3 29 97 52
3 29 52 8
3 9 29 8
3 210 67 204
3 225 210 204
3 225 204 320
3 200 225 320
3 200 320 62
3 22 200 62
3 22 62 316
3 159 22 316
3 159 316 80
3 95 159 80
3 95 80 72
3 38 95 72
3 38 72 289
3 256 38 289
3 256 289 260
3 199 256 260
3 199 260 77
3 268 199 77
3 268 77 15
3 300 268 15
3 300 15 134
3 170 300 134
3 170 134 291
3 183 170 291
3 183 291 143
3 41 183 143
3 41 143 297
3 60 41 297
3 60 297 43
3 301 60 43
3 301 43 223
3 233 301 223
3 233 223 98
3 128 233 98
3 128 98 222
3 328 128 222
3 328 222 161
3 36 328 161
3 36 161 130
3 52 36 130
3 52 130 7
3 8 52 7
3 67 34 39
3 204 67 39
3 204 39 193
3 320 204 193
3 320 193 84
3 62 320 84
3 62 84 172
3 316 62 172
3 316 172 180
3 80 316 180
3 80 180 133
3 72 80 133
3 72 133 37
3 289 72 37
3 289 37 236
3 260 289 236
3 260 236 255
3 77 260 255
3 77 255 188
3 15 77 188
3 15 188 182
3 134 15 182
3 134 182 218
3 291 134 218
3 291 218 76
3 143 291 76
3 143 76 269
3 297 143 269
3 297 269 28
3 43 297 28
3 43 28 318
3 223 43 318
3 223 318 240
3 98 223 240
3 98 240 229
3 222 98 229
3 222 229 303
3 161 222 303
3 161 303 186
3 130 161 186
3 130 186 6
3 7 130 6
3 34 231 109
3 39 34 109
3 39 109 148
3 193 39 148
3 193 148 187
3 84 193 187
3 84 187 184
3 172 84 184
3 172 184 211
3 180 172 211
3 180 211 281
3 133 180 281
3 133 281 178
3 37 133 178
3 37 178 238
3 236 37 238
3 236 238 157
3 255 236 157
3 255 157 257
3 188 255 257
3 188 257 219
3 182 188 219
3 182 219 154
3 218 182 154
3 218 154 326
3 76 218 326
3 76 326 287
3 269 76 287
3 269 287 312
3 28 269 312
3 28 312 32
3 318 28 32
3 318 32 201
3 240 318 201
3 240 201 74
3 229 240 74
3 229 74 163
3 303 229 163
3 303 163 122
3 186 303 122
3 186 122 5
3 6 186 5
3 231 259 310
3 109 231 310
3 109 310 195
3 148 109 195
3 148 195 251
3 187 148 251
3 187 251 110
3 184 187 110
3 184 110 35
3 211 184 35
3 211 35 87
3 281 211 87
3 281 87 302
3 178 281 302
3 178 302 322
3 238 178 322
3 238 322 102
3 157 238 102
3 157 102 253
3 257 157 253
3 257 253 114
3 219 257 114
3 219 114 158
3 154 219 158
3 154 158 18
3 326 154 18
3 326 18 319
3 287 326 319
3 287 319 56
3 312 287 56
3 312 56 169
3 32 312 169
3 32 169 115
3 201 32 115
3 201 115 241
3 74 201 241
3 74 241 92
3 163 74 92
3 163 92 181
3 122 163 181
3 122 181 4
3 5 122 4
3 259 99 16
3 310 259 16
3 310 16 307
3 195 310 307
3 195 307 227
3 251 195 227
3 251 227 270
3 110 251 270
3 110 270 75
3 35 110 75
3 35 75 55
3 87 35 55
3 87 55 277
3 302 87 277
3 302 277 79
3 322 302 79
3 322 79 53
3 102 322 53
3 102 53 88
3 253 102 88
3 253 88 288
3 114 253 288
3 114 288 61
3 158 114 61
3 158 61 232
3 18 158 232
3 18 232 116
3 319 18 116
3 319 116 274
3 56 319 274
3 56 274 213
3 169 56 213
3 169 213 237
3 115 169 237
3 115 237 167
3 241 115 167
3 241 167 324
3 92 241 324
3 92 324 197
3 181 92 197
3 181 197 3
3 4 181 3
3 99 207 147
3 16 99 147
3 16 147 205
3 307 16 205
3 307 205 131
3 227 307 131
3 227 131 151
3 270 227 151
3 270 151 137
3 75 270 137
3 75 137 298
3 55 75 298
3 55 298 198
3 277 55 198
3 277 198 103
3 79 277 103
3 79 103 94
3 53 79 94
3 53 94 203
3 88 53 203
3 88 203 25
3 288 88 25
3 288 25 153
3 61 288 153
3 61 153 325
3 232 61 325
3 232 325 100
3 116 232 100
3 116 100 65
3 274 116 65
3 274 65 279
3 213 274 279
3 213 279 156
3 237 213 156
3 237 156 136
3 167 237 136
3 167 136 20
3 324 167 20
3 324 20 250
3 197 324 250
3 197 250 2
3 3 197 2
3 207 254 17
3 147 207 17
3 147 17 311
3 205 147 311
3 205 311 71
3 131 205 71
3 131 71 278
3 151 131 278
3 151 278 33
3 137 151 33
3 137 33 242
3 298 137 242
3 298 242 142
3 198 298 142
3 198 142 290
3 103 198 290
3 103 290 81
3 94 103 81
3 94 81 275
3 203 94 275
3 203 275 93
3 25 203 93
3 25 93 165
3 153 25 165
3 153 165 26
3 325 153 26
3 325 26 252
3 100 325 252
3 100 252 138
3 65 100 138
3 65 138 168
3 279 65 168
3 279 168 267
3 156 279 267
3 156 267 123
3 136 156 123
3 136 123 313
3 20 136 313
3 20 313 83
3 250 20 83
3 250 83 1
3 2 250 1
3 254 166 24
3 17 254 24
3 17 24 175
3 311 17 175
3 311 175 150
3 71 311 150
3 71 150 113
3 278 71 113
3 278 113 294
3 33 278 294
3 33 294 89
3 242 33 89
3 242 89 304
3 142 242 304
3 142 304 129
3 290 142 129
3 290 129 47
3 81 290 47
3 81 47 329
3 275 81 329
3 275 329 126
3 93 275 126
3 93 126 202
3 165 93 202
3 165 202 54
3 26 165 54
3 26 54 141
3 252 26 141
3 252 141 196
3 138 252 196
3 138 196 117
3 168 138 117
3 168 117 63
3 267 168 63
3 267 63 280
3 123 267 280
3 123 280 221
3 313 123 221
3 313 221 101
3 83 313 101
3 83 101 0
3 1 83 0
3 166 248 262
3 24 166 262
3 24 262 68
3 175 24 68
3 175 68 264
3 150 175 264
3 150 264 86
3 113 150 86
3 113 86 149
3 294 113 149
3 294 149 247
3 89 294 247
3 89 247 146
3 304 89 146
3 304 146 295
3 129 304 295
3 129 295 40
3 47 129 40
3 47 40 118
3 329 47 118
3 329 118 208
3 126 329 208
3 126 208 249
3 202 126 249
3 202 249 108
3 54 202 108
3 54 108 212
3 141 54 212
3 141 212 296
3 196 141 296
3 196 296 299
3 117 196 299
3 117 299 23
3 63 117 23
3 63 23 162
3 280 63 162
3 280 162 152
3 221 280 152
3 221 152 284
3 101 221 284
3 101 284 271
3 0 101 271
