OFF
1253 1394 0
0.1125193812 -0.0619506087 0.0551271677
0.1221621611 -0.0149663900 0.0374869734
-0.4825847621 0.4052680511 -0.2644237203
-0.2025132682 0.3743512064 -0.1936725749
-0.1159843521 0.1129025850 -0.0550102359
-0.0926432503 -0.1703606701 -0.2736271392
-0.1548807959 -0.1634903225 -0.2893494734
0.1029560984 -0.0425959969 0.1014414207
0.1096694387 -0.0449895476 0.1069599620
0.3897409325 -0.0759063924 0.1777111074
0.1193767697 0.0044374814 0.0569921726
0.3391036446 -0.0445299122 0.1306934367
0.4013419011 -0.0514003383 0.1464159505
-0.1009595556 0.0617303121 -0.1392875343
-0.0853999153 0.0600126972 -0.1353568866
-0.0623022596 0.0829829727 -0.2699590626
0.1176314546 -0.0390433759 0.0449008080
-0.1157611184 -0.0132793760 -0.0140583943
-0.0920602043 0.3185387957 -0.0622957996
-0.1542977498 0.3254091434 -0.0780181338
0.1203824512 0.0072090344 0.0873617782
0.4004539450 -0.0237078103 0.1581129236
-0.1443500556 -0.1485933760 -0.0594316211
-0.1287904153 -0.1503109909 -0.0555009734
0.3026836714 -0.1932961872 0.4749527550
0.2573908088 -0.1882963481 0.4635109554
-0.0622303423 0.1422456558 -0.2443471352
0.1197613667 -0.0184214708 0.0454808210
-0.1136312064 0.0073425291 -0.0134783812
-0.2149293589 -0.0058222127 0.0172532128
-0.4831618498 -0.0817414178 -0.4749527550
-0.2030903559 -0.1126582626 -0.4042016097
0.1125882031 -0.0039077274 0.0802183191
-0.1208043699 0.0218562725 0.0212591168
0.3990589373 0.2762357082 0.2986236048
0.4044207530 0.2839478033 0.2807686558
0.3537659730 0.2812355586 0.2871817795
0.3591277888 0.2889476536 0.2693268305
0.1057962634 -0.0150977868 0.1022146752
-0.0574918864 0.0710809522 -0.2424315755
-0.0730744092 0.0761519974 -0.2541195864
-0.0735218021 0.0718406130 -0.2441449161
-0.0602081710 0.0657521660 -0.2300971456
0.1202953396 -0.0664946271 0.0554995773
0.4003668335 -0.0974114719 0.1262507227
-0.2133214682 -0.3439259324 0.1282382773
-0.2755590138 -0.3370555847 0.1125159431
-0.1137884642 -0.1046374554 -0.1612031493
-0.0982288239 -0.1063550704 -0.1572725016
-0.1529824987 -0.2571430191 -0.0726937558
-0.2152200442 -0.2502726714 -0.0884160900
0.1193225549 -0.0424647617 0.0367114362
0.1310094777 -0.0142895994 0.0358997543
0.4110809716 -0.0452064442 0.1066508997
-0.4932685802 0.2886824858 -0.2730769361
-0.2131970863 0.2577656410 -0.2023257908
-0.2127384222 0.1449735335 0.3395696169
-0.2749759678 0.1518438812 0.3238472827
0.1278543298 -0.0448424235 0.0350385680
0.4079258236 -0.0757592683 0.1057897134
0.1053566117 -0.0391422858 0.0934480873
0.3364116174 -0.0576459466 0.1356184975
0.3417737131 -0.0499334489 0.1177626162
0.3986498738 -0.0645163728 0.1513410113
0.4040119695 -0.0568038750 0.1334851300
-0.1280359614 -0.0133782858 0.0344888850
0.1125977537 0.0043827431 0.0838032836
-0.1524070120 0.2317455739 0.1386627566
-0.2146445576 0.2386159215 0.1229404224
-0.1745555625 0.1037571514 0.1704103618
-0.1589959223 0.1020395365 0.1743410095
-0.5000000000 -0.0948243042 -0.4140151647
-0.2199285061 -0.1257411490 -0.3432640193
0.1074868037 -0.0185199780 0.0940271681
-0.1259057693 0.0072440220 0.0350679658
0.5000000000 0.0904945146 -0.1821212044
0.4547070358 0.0954943649 -0.1935630297
-0.0923514049 0.0741252437 -0.1679469353
-0.1545889505 0.0809955914 -0.1836692695
-0.3158677178 0.1683952769 -0.3041402037
-0.0925053090 0.1437033759 -0.2476335559
-0.0830601432 0.1415979650 -0.2427890560
-0.0570424640 0.1363519057 -0.2307248103
-0.0758982464 0.1388539763 -0.2364610834
0.3982410903 -0.4052680511 0.0040574855
0.3529481261 -0.4002682008 -0.0073843398
0.1125292129 -0.0536587686 0.0587116179
-0.1208633601 -0.0278947686 -0.0002475844
0.1057406486 -0.0620020434 0.0819386004
0.1128251455 -0.0144368851 0.1078188657
0.3928966393 -0.0453537298 0.1785700110
-0.1039140566 0.1115678879 -0.0519584686
-0.1161625144 -0.0346993588 -0.1188127412
0.4036029062 -0.3975558594 -0.0137974217
0.3583099419 -0.3925560091 -0.0252392470
-0.0759031374 0.0672619461 -0.2335439868
0.4999780703 0.0719759506 -0.1901266394
0.4546851061 0.0769758009 -0.2015684647
0.1176723252 -0.0038668751 0.0601104520
-0.1157202479 0.0218971249 0.0011512497
-0.4767317298 0.0182375954 -0.4567178232
-0.1966602359 -0.0126792493 -0.3859666778
-0.1440006906 0.1477034072 0.0686612095
-0.1284410503 0.1459857922 0.0725918572
-0.2130302390 -0.0994882059 0.2338998633
-0.2752677845 -0.0926178582 0.2181775290
-0.0734167509 0.0874379421 -0.2802368275
-0.3116217207 0.1152972371 -0.3440298361
-0.0864233608 0.0903535829 -0.2869458482
-0.0758307365 0.1265237520 -0.2079300314
-0.4994492816 0.3698751588 -0.2131307752
-0.2193777878 0.3389583141 -0.1423796298
0.1279144423 0.0072694968 0.0575724837
0.4079859362 -0.0236473480 0.1283236290
-0.0733451696 0.1467001420 -0.2546237814
-0.3115498034 0.1745599202 -0.3184179087
-0.0863507919 0.1496156304 -0.2613324523
0.3390816858 -0.0630494834 0.1226876769
0.4013199423 -0.0699199095 0.1384101907
-0.4897604430 0.1518577789 -0.3467537284
-0.4726025207 0.1765366442 -0.4038899382
-0.2096889492 0.1209409342 -0.2760025830
-0.1925310269 0.1456197994 -0.3331387928
-0.1040914843 -0.0360355378 -0.1157602031
-0.4936053103 0.0044560124 -0.3959452969
-0.2135338165 -0.0264608324 -0.3251941515
0.1127636319 -0.0665517858 0.0852891936
0.3928351257 -0.0974686306 0.1560403390
-0.1873875359 -0.0626024751 0.1485104366
-0.1718278956 -0.0643200901 0.1524410843
-0.3159396620 0.1091335205 -0.3297516198
-0.0925772531 0.0844416195 -0.2732449720
-0.0831320873 0.0823362086 -0.2684004721
-0.0571144082 0.0770901492 -0.2563362264
-0.0759696306 0.0795930252 -0.2620743641
-0.1134435788 0.1916528845 -0.0330954015
-0.0978839385 0.1899352696 -0.0291647538
0.3026617126 -0.2118157585 0.4669469952
0.2573688500 -0.2068159194 0.4555051956
-0.1749063274 -0.1925416453 0.0423221929
-0.1593466871 -0.1942592602 0.0462528406
-0.4763700279 0.3234775581 -0.3247658370
-0.1962985340 0.2925607133 -0.2540146916
0.1074456531 -0.0536968815 0.0788184564
-0.1259469199 -0.0279328816 0.0198592541
-0.0574184711 0.1303416790 -0.2168177816
-0.0730020094 0.1354128363 -0.2285060491
-0.0601354912 0.1250134076 -0.2044845406
-0.0734498580 0.1311023694 -0.2185335000
-0.3509812749 0.3721131826 -0.2034016751
-0.3509812749 0.3721131826 -0.2034016751
-0.3515451780 -0.1037412834 -0.4091083872
-0.3515451780 -0.1037412834 -0.4091083872
-0.4830652355 0.2376676685 -0.3357597827
-0.4831039155 0.0904963283 -0.3999176175
-0.2028640566 0.2016927202 -0.2677322918
-0.2031745925 0.0541308424 -0.3309846304
-0.3344505274 0.2345486787 -0.3289523149
-0.4054102776 0.2790131184 -0.3268590760
-0.4035265240 0.2055426615 -0.3664211266
-0.4744862743 0.2500071011 -0.3643278876
-0.3363342810 0.3080191357 -0.2893902643
-0.2653745307 0.2635546960 -0.2914835033
-0.4054102776 0.2790131184 -0.3268590760
-0.3344505274 0.2345486787 -0.3289523149
-0.2634907771 0.1900842391 -0.3310455539
-0.2653745307 0.2635546960 -0.2914835033
-0.1944147805 0.2190902564 -0.2935767422
-0.3325667738 0.1610782218 -0.3685143655
-0.4035265240 0.2055426615 -0.3664211266
-0.2634907771 0.1900842391 -0.3310455539
-0.3346313783 0.0819286974 -0.3949283080
-0.4036169495 0.1292326708 -0.3994091231
-0.4056815540 0.0500831464 -0.4258230656
-0.4746671252 0.0973871198 -0.4303038807
-0.3325667738 0.1610782218 -0.3685143655
-0.2635812026 0.1137742484 -0.3640335504
-0.4036169495 0.1292326708 -0.3994091231
-0.3346313783 0.0819286974 -0.3949283080
-0.2656458071 0.0346247241 -0.3904474929
-0.2635812026 0.1137742484 -0.3640335504
-0.1945956314 0.0664702750 -0.3595527353
-0.3366959828 0.0027791731 -0.4213422505
-0.4056815540 0.0500831464 -0.4258230656
-0.2656458071 0.0346247241 -0.3904474929
-0.3399110429 -0.0472103336 -0.4304597164
-0.2715006994 -0.0799342981 -0.4173306630
-0.3431261029 -0.0971998402 -0.4395771823
-0.3399110429 -0.0472103336 -0.4304597164
-0.4083213863 -0.0144863691 -0.4435887698
-0.3366959828 0.0027791731 -0.4213422505
-0.3394416481 0.3489143822 -0.2592192060
-0.4079058380 0.3361959701 -0.2919925215
-0.3425490152 0.3898096287 -0.2290481476
-0.3394416481 0.3489143822 -0.2592192060
-0.2678700911 0.3207375478 -0.2566169488
-0.3363342810 0.3080191357 -0.2893902643
-0.3514787647 0.2048117100 -0.2745397596
-0.2823379255 0.2312886755 -0.2384327752
-0.2805838569 0.1628763221 -0.2752711713
-0.2114430178 0.1893532876 -0.2391641869
-0.3532328333 0.2732240634 -0.2377013635
-0.4223736724 0.2467470979 -0.2738083479
-0.2823379255 0.2312886755 -0.2384327752
-0.3514787647 0.2048117100 -0.2745397596
-0.4206196039 0.1783347445 -0.3106467440
-0.4223736724 0.2467470979 -0.2738083479
-0.4915145116 0.2202701324 -0.3099153323
-0.3497246961 0.1363993566 -0.3113781557
-0.2805838569 0.1628763221 -0.2752711713
-0.4206196039 0.1783347445 -0.3106467440
-0.3516471297 0.0626984733 -0.3359739400
-0.2806680395 0.0918197037 -0.3059882615
-0.2825904731 0.0181188204 -0.3305840457
-0.2116113828 0.0472400509 -0.3005983673
-0.3497246961 0.1363993566 -0.3113781557
-0.4207037864 0.1072781261 -0.3413638342
-0.2806680395 0.0918197037 -0.3059882615
-0.3516471297 0.0626984733 -0.3359739400
-0.4226262200 0.0335772428 -0.3659596184
-0.4207037864 0.1072781261 -0.3413638342
-0.4916828767 0.0781568957 -0.3713495126
-0.3535695634 -0.0110024100 -0.3605697242
-0.2825904731 0.0181188204 -0.3305840457
-0.4226262200 0.0335772428 -0.3659596184
-0.3567669082 -0.0606425683 -0.3696046581
-0.4283834541 -0.0777334363 -0.3918099114
-0.3599642531 -0.1102827266 -0.3786395920
-0.3567669082 -0.0606425683 -0.3696046581
-0.2851503623 -0.0435517004 -0.3473994048
-0.3535695634 -0.0110024100 -0.3605697242
-0.3563231840 0.3138203999 -0.2077282830
-0.2878504859 0.3263893570 -0.1750539564
-0.3594135347 0.3544167364 -0.1777552025
-0.3563231840 0.3138203999 -0.2077282830
-0.4247958821 0.3012514429 -0.2404026096
-0.3532328333 0.2732240634 -0.2377013635
-0.1989862563 0.1324564338 -0.3026811442
-0.1989862563 0.1324564338 -0.3026811442
-0.2042224855 0.1264184482 -0.2886925878
-0.2042224855 0.1264184482 -0.2886925878
-0.0820611138 0.0886600269 -0.1410278071
-0.1040027705 0.0377661750 -0.0838593358
-0.0821498277 0.0148583141 -0.1729286743
-0.0959966254 0.0459121966 -0.1633713863
-0.1160734332 0.0391016131 -0.0869114886
-0.0959075443 0.1197131685 -0.1314701337
0.3208936580 -0.1189130497 0.3028230959
0.3208936580 -0.1189130497 0.3028230959
0.3520127863 -0.1223482628 0.3106843528
0.3611177796 -0.0851566940 0.2246195232
0.4280244684 0.0220470133 -0.0235735396
0.4280244684 0.0220470133 -0.0235735396
0.3969053402 0.0254822264 -0.0314347965
0.3835640565 -0.0112414494 0.0535599486
0.4195298781 0.0044632336 -0.0337194812
0.4195298781 0.0044632336 -0.0337194812
0.4506490063 0.0010280205 -0.0258582243
0.3793057820 -0.0292931249 0.0444840979
0.3293443961 -0.1383679145 0.2969576932
0.3293443961 -0.1383679145 0.2969576932
0.2982252679 -0.1349327014 0.2890964363
0.3342130410 -0.1007086989 0.2098226851
0.3673263539 -0.2314569989 0.0698379915
0.3673263539 -0.2314569989 0.0698379915
0.3984454821 -0.2348922120 0.0776992484
0.3518689856 -0.1445514728 0.1027282445
0.3762079234 0.1083595929 0.2192613954
0.3762079234 0.1083595929 0.2192613954
0.3450887952 0.1117948060 0.2114001385
0.3563097704 0.0253568231 0.1774399465
0.3730972330 0.1170071772 0.1992656360
0.3730972330 0.1170071772 0.1992656360
0.4042163613 0.1135719641 0.2071268929
0.3574354731 0.0335368642 0.1585141261
0.3811609557 -0.2246799421 0.0541229415
0.3811609557 -0.2246799421 0.0541229415
0.3500418275 -0.2212447290 0.0462616846
0.3614673344 -0.1373066955 0.0859427788
-0.1059300151 -0.0495062706 -0.0853754414
-0.0918143696 -0.0231711866 -0.1463146941
-0.0995155608 0.0336776132 -0.0744176339
-0.1068020932 0.1059161972 -0.0140067521
-0.1005600816 0.0409549110 -0.0671028185
-0.0916419269 0.1249739834 -0.0822608202
-0.1093441542 0.1058957711 -0.0039528185
-0.1424508458 0.0546417792 0.1047044877
-0.1435159418 0.0443306253 0.1044149473
-0.1654119090 0.0188597232 0.1633910469
-0.1499319285 -0.0388491880 0.0934649847
-0.1426468035 -0.1110960709 0.0330560473
-0.1488874078 -0.0461264858 0.0861501692
-0.1655872914 -0.1292896751 0.0993469624
-0.1401050236 -0.1110770144 0.0230026281
-0.1069949711 -0.0598172232 -0.0856654480
-0.0968014030 -0.0543151790 -0.2064573368
-0.0922058046 0.1963320197 -0.1151213674
-0.0921330045 0.2574354077 -0.0887085835
-0.1028974918 0.1328890641 -0.1005211684
-0.1222336082 0.2751421848 0.0381834785
-0.1331171494 0.2114227960 0.0534223440
-0.1180304474 0.2331211015 0.0031827049
-0.1180304474 0.2331211015 0.0031827049
-0.1825727171 0.1883595537 0.2391161867
-0.1936469924 0.1243653424 0.2549899894
-0.1634812873 0.1677513626 0.1545365592
-0.1634812873 0.1677513626 0.1545365592
-0.2000629791 0.0411855292 0.2440400267
-0.2128843306 0.0227426638 0.2867347401
-0.2065466090 -0.0291513384 0.2389699450
-0.2000629791 0.0411855292 0.2440400267
-0.1809715492 0.0205773381 0.1594603992
-0.1936469924 0.1243653424 0.2549899894
-0.2131758536 -0.2217070691 0.1810690703
-0.1941138978 -0.2682337888 0.0852802351
-0.1939682832 -0.1460149256 0.1381110281
-0.1939682832 -0.1460149256 0.1381110281
-0.1788357619 -0.2462596542 0.0344033281
-0.1831519835 -0.3005344757 0.0277722608
-0.1615929087 -0.1974265151 -0.0125141465
-0.1788357619 -0.2462596542 0.0344033281
-0.1228128745 -0.2137518446 -0.1731604475
-0.1032158572 -0.1374990628 -0.2174151442
-0.1333854814 -0.1808902373 -0.1169484525
-0.1333854814 -0.1808902373 -0.1169484525
-0.1236161004 -0.0446825394 -0.2286482043
-0.1236161004 -0.0446825394 -0.2286482043
-0.1233245774 0.1997671936 -0.1229825345
-0.1233245774 0.1997671936 -0.1229825345
-0.1533523809 0.2785773586 0.0303223114
-0.1533523809 0.2785773586 0.0303223114
-0.2136914899 0.1917947275 0.2312550196
-0.2136914899 0.1917947275 0.2312550196
-0.2440031034 0.0261778376 0.2788735730
-0.2440031034 0.0261778376 0.2788735730
-0.2442946264 -0.2182718953 0.1732079032
-0.2442946264 -0.2182718953 0.1732079032
-0.2142707562 -0.2970993019 0.0199110936
-0.2142707562 -0.2970993019 0.0199110936
-0.1539316473 -0.2103166708 -0.1810216146
-0.1539316473 -0.2103166708 -0.1810216146
-0.1849050774 -0.0846562676 -0.1360481303
-0.1847591547 0.0375866894 -0.0832080284
-0.1697470139 -0.0018303381 -0.1598586999
-0.1999172181 -0.0452392401 -0.0593974588
-0.1547348732 -0.0412473655 -0.2365093715
-0.1698929366 -0.1240732950 -0.2126988019
-0.1697470139 -0.0018303381 -0.1598586999
-0.1846135544 0.1597934654 -0.0303824605
-0.1544433502 0.2032023674 -0.1308437017
-0.1696012524 0.1203945284 -0.1070258650
-0.1694556521 0.2426013044 -0.0542002972
-0.1847591547 0.0375866894 -0.0832080284
-0.1997714566 0.0769856264 -0.0065646239
-0.1696012524 0.1203945284 -0.1070258650
-0.1846135544 0.1597934654 -0.0303824605
-0.2147869582 0.1163968544 0.0700968176
-0.1996290560 0.1992046935 0.0462789809
-0.1997714566 0.0769856264 -0.0065646239
-0.1844711537 0.2820125325 0.0224611443
-0.1694556521 0.2426013044 -0.0542002972
-0.1996290560 0.1992046935 0.0462789809
-0.2449526633 0.0730108343 0.1705502477
-0.2448102627 0.1952299013 0.2233938525
-0.2297986104 0.1558133779 0.1467453350
-0.2599643155 0.1124273577 0.2471987652
-0.2147869582 0.1163968544 0.0700968176
-0.2299410111 0.0335943108 0.0939017303
-0.2297986104 0.1558133779 0.1467453350
-0.2449526633 0.0730108343 0.1705502477
-0.2450985717 -0.0492200354 0.1177153709
-0.2601102239 -0.0098035120 0.1943638884
-0.2299410111 0.0335943108 0.0939017303
-0.2751218761 0.0296130115 0.2710124059
-0.2599643155 0.1124273577 0.2471987652
-0.2601102239 -0.0098035120 0.1943638884
-0.2452441863 -0.1714388987 0.0648845779
-0.2754133991 -0.2148367215 0.1653467361
-0.2602559854 -0.1320283785 0.1415310535
-0.2604016001 -0.2542472417 0.0887002605
-0.2450985717 -0.0492200354 0.1177153709
-0.2300867726 -0.0886305557 0.0410688954
-0.2602559854 -0.1320283785 0.1415310535
-0.2452441863 -0.1714388987 0.0648845779
-0.2150747016 -0.1280474420 -0.0355814386
-0.2302321153 -0.2108557851 -0.0117657560
-0.2300867726 -0.0886305557 0.0410688954
-0.2453895290 -0.2936641281 0.0120499265
-0.2604016001 -0.2542472417 0.0887002605
-0.2302321153 -0.2108557851 -0.0117657560
-0.1849050774 -0.0846562676 -0.1360481303
-0.1850504200 -0.2068814969 -0.1888827817
-0.2000625608 -0.1674644695 -0.1122321102
-0.1698929366 -0.1240732950 -0.2126988019
-0.2150747016 -0.1280474420 -0.0355814386
-0.1999172181 -0.0452392401 -0.0593974588
-0.2000625608 -0.1674644695 -0.1122321102
-0.2767472716 0.3732321945 -0.1985371250
-0.3425490152 0.3898096287 -0.2290481476
-0.4252152783 0.3709941707 -0.2082662251
-0.3594135347 0.3544167364 -0.1777552025
-0.2857368421 -0.1147412162 -0.3761862032
-0.3599642531 -0.1102827266 -0.3786395920
-0.4173535139 -0.0927413506 -0.4420305711
-0.3431261029 -0.0971998402 -0.4395771823
-0.4830652355 0.2376676685 -0.3357597827
-0.4831039155 0.0904963283 -0.3999176175
-0.4883658649 -0.0382933544 -0.4353664939
-0.4883658649 -0.0382933544 -0.4353664939
-0.4879266711 0.3469752685 -0.2687503282
-0.4879266711 0.3469752685 -0.2687503282
-0.2028640566 0.2016927202 -0.2677322918
-0.2031745925 0.0541308424 -0.3309846304
-0.2083120862 -0.0695595475 -0.3646978806
-0.2083120862 -0.0695595475 -0.3646978806
-0.2078381609 0.3157595137 -0.1981971607
-0.2078381609 0.3157595137 -0.1981971607
-0.4390063992 0.2277748813 -0.3653745071
-0.3689885257 0.2200456701 -0.3476867207
-0.4399482760 0.2645101098 -0.3455934818
-0.4390063992 0.2277748813 -0.3653745071
-0.3008544058 0.2857869158 -0.2904368838
-0.2663164075 0.3002899245 -0.2717024780
-0.4063521544 0.3157483469 -0.3070780507
-0.3699304025 0.2567808986 -0.3279056954
-0.2298946556 0.2413224762 -0.2925301228
-0.2999125290 0.2490516874 -0.3102179091
-0.2289527788 0.2045872477 -0.3123111481
-0.2298946556 0.2413224762 -0.2925301228
-0.3680466489 0.1833104416 -0.3674677460
-0.4025846473 0.1688074330 -0.3862021519
-0.2625489003 0.1533490106 -0.3508265792
-0.2989706523 0.2123164589 -0.3299989344
-0.4401743396 0.0737351331 -0.4280634731
-0.3701564662 0.0660059219 -0.4103756868
-0.4391420374 0.1133098953 -0.4148565019
-0.4401743396 0.0737351331 -0.4280634731
-0.2980739882 0.1374262351 -0.3662739580
-0.2625489003 0.1533490106 -0.3508265792
-0.4025846473 0.1688074330 -0.3862021519
-0.3691241639 0.1055806841 -0.3971687156
-0.2290884170 0.0901222617 -0.3617931429
-0.2991062905 0.0978514729 -0.3794809292
-0.2311530215 0.0109727374 -0.3882070854
-0.2290884170 0.0901222617 -0.3617931429
-0.3711887684 0.0264311597 -0.4235826581
-0.4067138563 0.0105083843 -0.4390300368
-0.2666781094 -0.0049500381 -0.4036544642
-0.3011708950 0.0187019486 -0.4058948717
-0.2682856394 -0.0299447915 -0.4082131971
-0.2340804677 -0.0463067737 -0.4016486704
-0.4115364463 -0.0644758757 -0.4527062357
-0.2715006994 -0.0799342981 -0.4173306630
-0.4115364463 -0.0644758757 -0.4527062357
-0.4457416181 -0.0481138935 -0.4592707624
-0.2682856394 -0.0299447915 -0.4082131971
-0.4083213863 -0.0144863691 -0.4435887698
-0.4452453000 0.3707320106 -0.2782081209
-0.4110132051 0.3770912167 -0.2618214631
-0.2709774582 0.3616327943 -0.2264458904
-0.4110132051 0.3770912167 -0.2618214631
-0.2709774582 0.3616327943 -0.2264458904
-0.2351916797 0.3475443771 -0.2251447618
-0.4079058380 0.3361959701 -0.2919925215
-0.2678700911 0.3207375478 -0.2566169488
-0.2460134373 0.1761148048 -0.2572176791
-0.3160313108 0.1838440160 -0.2749054655
-0.2468904716 0.2103209816 -0.2387984810
-0.2460134373 0.1761148048 -0.2572176791
-0.3869262186 0.2257794039 -0.2741740537
-0.4232507067 0.2809532746 -0.2553891498
-0.2832149598 0.2654948522 -0.2200135771
-0.3169083451 0.2180501927 -0.2564862674
-0.4569440920 0.2335086151 -0.2918618401
-0.3869262186 0.2257794039 -0.2741740537
-0.4560670577 0.1993024384 -0.3102810381
-0.4569440920 0.2335086151 -0.2918618401
-0.3160313108 0.1838440160 -0.2749054655
-0.2797068226 0.1286701454 -0.2936903694
-0.4197425696 0.1441285678 -0.3290659421
-0.3860491843 0.1915732272 -0.2925932518
-0.2471009280 0.0326794357 -0.3155912065
-0.3171188014 0.0404086469 -0.3332789929
-0.2451784943 0.1063803189 -0.2909954223
-0.2471009280 0.0326794357 -0.3155912065
-0.3852142412 0.1218387413 -0.3263709950
-0.4197425696 0.1441285678 -0.3290659421
-0.2797068226 0.1286701454 -0.2936903694
-0.3151963678 0.1141095301 -0.3086832086
-0.4561933315 0.0927175109 -0.3563566734
-0.3871366749 0.0481378580 -0.3509667792
-0.4571545483 0.0558670692 -0.3686545655
-0.4561933315 0.0927175109 -0.3563566734
-0.3180800182 0.0035582052 -0.3455768850
-0.2835516899 -0.0187316212 -0.3428819379
-0.4235874368 -0.0032731988 -0.3782575105
-0.3871366749 0.0481378580 -0.3509667792
-0.4251861093 -0.0280932780 -0.3827749775
-0.4609943822 -0.0366387119 -0.3938776041
-0.2883477072 -0.0931918586 -0.3564343387
-0.4283834541 -0.0777334363 -0.3918099114
-0.2883477072 -0.0931918586 -0.3564343387
-0.2525394342 -0.0846464247 -0.3453317121
-0.4251861093 -0.0280932780 -0.3827749775
-0.2851503623 -0.0435517004 -0.3473994048
-0.2847601352 0.2857930205 -0.2050270369
-0.2505237861 0.2920774990 -0.1886898736
-0.4278862328 0.3418477794 -0.2104295291
-0.2878504859 0.3263893570 -0.1750539564
-0.4278862328 0.3418477794 -0.2104295291
-0.4621225818 0.3355633008 -0.2267666924
-0.2847601352 0.2857930205 -0.2050270369
-0.4247958821 0.3012514429 -0.2404026096
-0.1426685241 0.1410360321 -0.2820067982
-0.1990225408 0.1028254100 -0.3154878421
-0.2552680299 0.1535081770 -0.3105495264
-0.1989502977 0.1620877753 -0.2898751805
-0.1483998693 0.1054300338 -0.2809687799
-0.2041865134 0.1560493264 -0.2758868798
-0.2600451017 0.1474068626 -0.2964163958
-0.2042584576 0.0967875700 -0.3014982959
-0.0930762991 0.0263122446 -0.1283940051
-0.0929875852 0.1001139574 -0.0964931379
-0.0711346424 0.0772060965 -0.1855624763
-0.0930762991 0.0263122446 -0.1283940051
-0.0820611138 0.0886600269 -0.1410278071
-0.1059904888 0.0794073908 -0.1091908111
-0.1060795699 0.0056064189 -0.1410920638
-0.0859136810 0.0862179743 -0.1856507089
-0.1059904888 0.0794073908 -0.1091908111
-0.0959966254 0.0459121966 -0.1633713863
0.3968943754 0.0162229444 -0.0354375140
0.3968943754 0.0162229444 -0.0354375140
0.2982362473 -0.1256729158 0.2930993162
0.2982362473 -0.1256729158 0.2930993162
0.4506599711 0.0102873025 -0.0218555068
0.4506599711 0.0102873025 -0.0218555068
0.3520018069 -0.1316080484 0.3066814729
0.3520018069 -0.1316080484 0.3066814729
0.2982472267 -0.1164131301 0.2971021961
0.3117886647 -0.1561046185 0.3888879254
0.3611177796 -0.0851566940 0.2246195232
0.3117886647 -0.1561046185 0.3888879254
0.3501107121 -0.0648433031 0.1776564800
0.3299986513 -0.0817214809 0.2167582663
0.4506709505 0.0195470881 -0.0178526269
0.4413657521 0.0587706891 -0.1085682846
0.3835640565 -0.0112414494 0.0535599486
0.4413657521 0.0587706891 -0.1085682846
0.3924529788 -0.0313208939 0.0999879495
0.4146831847 -0.0146766625 0.0614212055
0.3968833960 0.0069631588 -0.0394403939
0.4597539742 0.0382195921 -0.1119230603
0.4104249102 -0.0327283380 0.0523453548
0.4597539742 0.0382195921 -0.1119230603
0.4104249102 -0.0327283380 0.0523453548
0.3903128621 -0.0496065172 0.0914471443
0.3519908274 -0.1408678340 0.3026785930
0.2933566230 -0.1725919169 0.3762314444
0.3342130410 -0.1007086989 0.2098226851
0.2933566230 -0.1725919169 0.3762314444
0.3677664916 -0.0853143042 0.1741164379
0.3653321692 -0.1041439120 0.2176839420
0.3477697031 0.1156508535 0.2024726640
0.3477697031 0.1156508535 0.2024726640
0.3473609196 -0.2251008249 0.0551891382
0.3473609196 -0.2251008249 0.0551891382
0.4015354534 0.1097159166 0.2160543674
0.4015354534 0.1097159166 0.2160543674
0.4011263900 -0.2310361161 0.0687717948
0.4011263900 -0.2310361161 0.0687717948
0.3446798717 -0.2289570737 0.0641170789
0.3827837221 -0.3183625250 0.0369477385
0.3829881138 -0.1479866858 0.1105895014
0.3827837221 -0.3183625250 0.0369477385
0.3829881138 -0.1479866858 0.1105895014
0.3752594297 -0.1045339228 0.1270346279
0.3988544055 0.1058596677 0.2249823081
0.3649869482 0.1947975757 0.2532215875
0.3563097704 0.0253568231 0.1774399465
0.3649869482 0.1947975757 0.2532215875
0.3774798221 -0.0195797748 0.1643904789
0.3874288986 0.0219216100 0.1853012034
0.3504507509 0.1195071024 0.1935447233
0.3887589930 0.2004774902 0.2400171459
0.3885546013 0.0301016511 0.1663753830
0.3887589930 0.2004774902 0.2400171459
0.3885546013 0.0301016511 0.1663753830
0.3807237213 -0.0116335054 0.1459996280
0.4038074378 -0.2271798672 0.0598438541
0.3697354488 -0.3086179756 0.0144418472
0.3614673344 -0.1373066955 0.0859427788
0.3697354488 -0.3086179756 0.0144418472
0.3827396520 -0.0970552853 0.1097139544
0.3925864626 -0.1407419085 0.0938040357
0.2565652327 -0.0819816289 0.1057699581
0.2565652327 -0.0819816289 0.1057699581
0.2512522822 -0.0712290891 0.1315001505
0.2512522822 -0.0712290891 0.1315001505
0.2512830390 -0.0451716387 0.1427649865
0.2512830390 -0.0451716387 0.1427649865
0.2566395452 -0.0190723477 0.1329658946
0.2566395452 -0.0190723477 0.1329658946
0.2641841937 -0.0082191568 0.1078427036
0.2641841937 -0.0082191568 0.1078427036
0.2694977070 -0.0189684737 0.0821116917
0.2694977070 -0.0189684737 0.0821116917
0.2694676507 -0.0450244338 0.0708447338
0.2694676507 -0.0450244338 0.0708447338
0.2641105816 -0.0711269477 0.0806446453
0.2641105816 -0.0711269477 0.0806446453
-0.0961010042 0.0829644472 -0.0746818193
-0.1112611705 0.0639066610 -0.0064277512
-0.1023430158 0.1479257334 -0.0215857529
-0.0961010042 0.0829644472 -0.0746818193
-0.1131624944 0.1679605309 0.0217135517
-0.1246227101 0.0839210324 0.0469254870
-0.1271734098 0.0766149071 0.0538299115
-0.1437184863 0.1240126643 0.1234664333
-0.1572373496 -0.0877080805 0.0927485658
-0.1342968617 -0.0695144762 0.0264576507
-0.1509967453 -0.1526776655 0.0396544440
-0.1572373496 -0.0877080805 0.0927485658
-0.1440685512 -0.1722851256 -0.0046240664
-0.1248268877 -0.0891028798 -0.0278742789
-0.1222757668 -0.0817951835 -0.0347796839
-0.1135096196 -0.1283330307 -0.1063867375
-0.0968014030 -0.0543151790 -0.2064573368
-0.1073740099 -0.0214535717 -0.1502453418
-0.0947223266 -0.1123379246 -0.2400422380
-0.1373203101 0.2534438793 0.0884231175
-0.1482038513 0.1897244905 0.1036619830
-0.1071469062 0.2968404903 -0.0120561605
-0.1331171494 0.2114227960 0.0534223440
-0.1287221347 0.1696781458 0.0177829040
-0.1027518915 0.2550958401 -0.0476956006
-0.1785641398 0.1460583525 0.2047632743
-0.1976555697 0.1666665436 0.2893429018
-0.1674898646 0.2100525638 0.1888894717
-0.1785641398 0.1460583525 0.2047632743
-0.1592781265 0.1257302793 0.1195357857
-0.1482038513 0.1897244905 0.1036619830
-0.2065466090 -0.0291513384 0.2389699450
-0.2064007007 0.0930795313 0.2918048218
-0.1969670725 -0.0458769067 0.1937401908
-0.1937252575 -0.0107084730 0.1962752317
-0.1873092708 0.0724713403 0.2072251943
-0.1937252575 -0.0107084730 0.1962752317
-0.2064007007 0.0930795313 0.2918048218
-0.1873092708 0.0724713403 0.2072251943
-0.1940410905 -0.2071243572 0.1116956316
-0.2132486609 -0.2828165008 0.1546536738
-0.2131030463 -0.1605976375 0.2074844668
-0.1940410905 -0.2071243572 0.1116956316
-0.1811469317 -0.1275720602 0.0954163148
-0.2034992611 -0.1227515657 0.1860054457
-0.1680672411 -0.2788387474 -0.0224607475
-0.1960786151 -0.2950927933 0.0813208027
-0.1659091303 -0.2517013366 -0.0191452138
-0.1486662771 -0.2028681976 -0.0660626884
-0.1615929087 -0.1974265151 -0.0125141465
-0.1941138978 -0.2682337888 0.0852802351
-0.1183006693 -0.1591946500 -0.1671817984
-0.1077280624 -0.1920562574 -0.2233937933
-0.1378976866 -0.2354474319 -0.1229271016
-0.1183006693 -0.1591946500 -0.1671817984
-0.1290692599 -0.1266154157 -0.1103173852
-0.1486662771 -0.2028681976 -0.0660626884
-0.1547348732 -0.0412473655 -0.2365093715
-0.1079837527 0.0147213522 -0.1982975698
-0.0924973276 -0.0481177132 -0.2207870372
-0.1392484481 -0.1040864309 -0.2589988389
-0.1544433502 0.2032023674 -0.1308437017
-0.1076923908 0.2591529947 -0.0926391671
-0.0922058046 0.1963320197 -0.1151213674
-0.1389567639 0.1403813925 -0.1533259020
-0.1844711537 0.2820125325 0.0224611443
-0.1528796965 0.2551614663 0.0844925340
-0.1222336082 0.2751421848 0.0381834785
-0.1538250654 0.3019932510 -0.0238479112
-0.2448102627 0.1952299013 0.2233938525
-0.2132149561 0.1683841305 0.2854123183
-0.1825727171 0.1883595537 0.2391161867
-0.2141680237 0.2152053245 0.1770977210
-0.2751218761 0.0296130115 0.2710124059
-0.2285166712 -0.0366551841 0.2563867181
-0.2128843306 0.0227426638 0.2867347401
-0.2594895356 0.0890108594 0.3013604278
-0.2754133991 -0.2148367215 0.1653467361
-0.2288080473 -0.2810989138 0.1507230902
-0.2131758536 -0.2217070691 0.1810690703
-0.2597812054 -0.1554448768 0.1956927161
-0.2453895290 -0.2936641281 0.0120499265
-0.1836266275 -0.2771211605 -0.0263913311
-0.1831519835 -0.3005344757 0.0277722608
-0.2449148850 -0.3170774433 0.0662135184
-0.1850504200 -0.2068814969 -0.1888827817
-0.1232874488 -0.1903386705 -0.2273243769
-0.1228128745 -0.2137518446 -0.1731604475
-0.1845758458 -0.2302946711 -0.1347188523
-0.1848321160 -0.0235347891 -0.1096280793
-0.1696740526 0.0592911404 -0.1334386489
-0.1998442568 0.0158822384 -0.0329774078
-0.1848321160 -0.0235347891 -0.1096280793
-0.1698199753 -0.0629518165 -0.1862787509
-0.1548078345 -0.1023688440 -0.2629294224
-0.1546619118 0.0198741129 -0.2100893205
-0.1698199753 -0.0629518165 -0.1862787509
-0.1695284523 0.1814979164 -0.0806130811
-0.1545161503 0.1420989794 -0.1572564856
-0.1543705500 0.2643057554 -0.1044309177
-0.1695284523 0.1814979164 -0.0806130811
-0.1846863545 0.0986900774 -0.0567952444
-0.1998442568 0.0158822384 -0.0329774078
-0.1696740526 0.0592911404 -0.1334386489
-0.1846863545 0.0986900774 -0.0567952444
-0.1997002563 0.1380951599 0.0198571785
-0.2147157579 0.1775063880 0.0965186200
-0.2148581585 0.0552873209 0.0436750152
-0.1997002563 0.1380951599 0.0198571785
-0.1845423540 0.2209029989 -0.0039606581
-0.1693844518 0.3037108379 -0.0277784948
-0.1995578556 0.2603142270 0.0727007833
-0.1845423540 0.2209029989 -0.0039606581
-0.2448814630 0.1341203678 0.1969720501
-0.2297274101 0.2169229114 0.1731671374
-0.2598931152 0.1735368913 0.2736205676
-0.2448814630 0.1341203678 0.1969720501
-0.2298698108 0.0947038443 0.1203235327
-0.2148581585 0.0552873209 0.0436750152
-0.2147157579 0.1775063880 0.0965186200
-0.2298698108 0.0947038443 0.1203235327
-0.2450256175 0.0118953994 0.1441328093
-0.2601831781 -0.0709189468 0.1679464500
-0.2300139653 -0.0275211240 0.0674842919
-0.2450256175 0.0118953994 0.1441328093
-0.2600372697 0.0513119229 0.2207813268
-0.2750489220 0.0907284463 0.2974298443
-0.2751948303 -0.0315024234 0.2445949675
-0.2600372697 0.0513119229 0.2207813268
-0.2603287927 -0.1931378101 0.1151156570
-0.2753405918 -0.1537272898 0.1917621326
-0.2754862065 -0.2759461531 0.1389313396
-0.2603287927 -0.1931378101 0.1151156570
-0.2451713790 -0.1103294671 0.0912999744
-0.2300139653 -0.0275211240 0.0674842919
-0.2601831781 -0.0709189468 0.1679464500
-0.2451713790 -0.1103294671 0.0912999744
-0.2301594439 -0.1497431704 0.0146515697
-0.2151473729 -0.1891600567 -0.0619987643
-0.2150020302 -0.0669348273 -0.0091641129
-0.2301594439 -0.1497431704 0.0146515697
-0.2453168577 -0.2325515134 0.0384672522
-0.2604742714 -0.3153598564 0.0622829348
-0.2303047866 -0.2719683998 -0.0381830817
-0.2453168577 -0.2325515134 0.0384672522
-0.1849777487 -0.1457688823 -0.1624654560
-0.2001352321 -0.2285770842 -0.1386494359
-0.1699656080 -0.1851859097 -0.2391161276
-0.1849777487 -0.1457688823 -0.1624654560
-0.1999898895 -0.1063518548 -0.0858147845
-0.2150020302 -0.0669348273 -0.0091641129
-0.2151473729 -0.1891600567 -0.0619987643
-0.1999898895 -0.1063518548 -0.0858147845
-0.2851795313 0.3555357483 -0.1728906524
-0.2480625297 0.3560952543 -0.1704583774
-0.4167830185 0.3886906169 -0.2339126977
-0.2767472716 0.3732321945 -0.1985371250
-0.4167830185 0.3886906169 -0.2339126977
-0.4539000202 0.3881311109 -0.2363449727
-0.2851795313 0.3555357483 -0.1728906524
-0.4252152783 0.3709941707 -0.2082662251
-0.2773177670 -0.1081997730 -0.4066549984
-0.2444135990 -0.1136997394 -0.3901939064
-0.4257725890 -0.0992827938 -0.4115617759
-0.2857368421 -0.1147412162 -0.3761862032
-0.4257725890 -0.0992827938 -0.4115617759
-0.4586767569 -0.0937828274 -0.4280228679
-0.2773177670 -0.1081997730 -0.4066549984
-0.4173535139 -0.0927413506 -0.4420305711
-0.4915145116 0.2202701324 -0.3099153323
-0.4797176317 0.2805726133 -0.3302628098
-0.4744862743 0.2500071011 -0.3643278876
-0.4778338781 0.2071021563 -0.3698248605
-0.4916828767 0.0781568957 -0.3713495126
-0.4778532181 0.1335164862 -0.4019037779
-0.4746671252 0.0973871198 -0.4303038807
-0.4799178226 0.0543669619 -0.4283177204
-0.4799467898 -0.0317519112 -0.4658352891
-0.4915809249 -0.0882828610 -0.4444839598
-0.4794773950 0.3643728046 -0.2945947786
-0.4848193040 0.3060800219 -0.2989213866
-0.1944147805 0.2190902564 -0.2935767422
-0.1995812953 0.2471267168 -0.2608734917
-0.2114430178 0.1893532876 -0.2391641869
-0.1976975417 0.1736562598 -0.3004355423
-0.1945956314 0.0664702750 -0.3595527353
-0.1978528097 0.0998753209 -0.3320617116
-0.2116113828 0.0472400509 -0.3005983673
-0.1999174142 0.0207257965 -0.3584756541
-0.1998752959 -0.0626687560 -0.3950841437
-0.2050970262 -0.0195700409 -0.3555804147
-0.1994059011 0.3334559598 -0.2238436333
-0.2109455280 0.3566547602 -0.1680261024
-0.2340804677 -0.0463067737 -0.4016486704
-0.3040983411 -0.0385775625 -0.4193364568
-0.1998752959 -0.0626687560 -0.3950841437
-0.2372955277 -0.0962962804 -0.4107661363
-0.3773312746 -0.0808378580 -0.4461417090
-0.4131439763 -0.0894706290 -0.4572649687
-0.2731082294 -0.1049290514 -0.4218893960
-0.3057058711 -0.0635723158 -0.4238951897
-0.4457416181 -0.0481138935 -0.4592707624
-0.3757237446 -0.0558431046 -0.4415829761
-0.4799467898 -0.0317519112 -0.4658352891
-0.4425265580 0.0018756132 -0.4501532965
-0.3024908111 -0.0135828092 -0.4147777238
-0.2666781094 -0.0049500381 -0.4036544642
-0.4067138563 0.0105083843 -0.4390300368
-0.3741162146 -0.0308483513 -0.4370242431
-0.4421379329 0.3298367641 -0.3083791792
-0.4794773950 0.3643728046 -0.2945947786
-0.3736737430 0.3425551762 -0.2756058637
-0.4452453000 0.3707320106 -0.2782081209
-0.3067632367 0.3757212115 -0.2277470190
-0.2725311417 0.3820804176 -0.2113603613
-0.4125668886 0.3975388399 -0.2467359339
-0.3752274266 0.3630027994 -0.2605203345
-0.2351916797 0.3475443771 -0.2251447618
-0.3036558696 0.3348259650 -0.2579180774
-0.1994059011 0.3334559598 -0.2238436333
-0.2320843125 0.3066491305 -0.2553158202
-0.3736737430 0.3425551762 -0.2756058637
-0.4063521544 0.3157483469 -0.3070780507
-0.2663164075 0.3002899245 -0.2717024780
-0.3036558696 0.3348259650 -0.2579180774
-0.4609943822 -0.0366387119 -0.3938776041
-0.3909765087 -0.0443679231 -0.3761898178
-0.4968026552 -0.0451841459 -0.4049802308
-0.4641917271 -0.0862788702 -0.4029125380
-0.3241559801 -0.1017372926 -0.3675369653
-0.2899463796 -0.1180119378 -0.3609518056
-0.4299821265 -0.1025535154 -0.3963273783
-0.3925751812 -0.0691880023 -0.3807072847
-0.2525394342 -0.0846464247 -0.3453317121
-0.3225573077 -0.0769172135 -0.3630194984
-0.2167311613 -0.0761009907 -0.3342290854
-0.2493420894 -0.0350062664 -0.3362967782
-0.3893778363 -0.0195478440 -0.3716723508
-0.4235874368 -0.0032731988 -0.3782575105
-0.2835516899 -0.0187316212 -0.3428819379
-0.3209586353 -0.0520971343 -0.3585020314
-0.2505237861 0.2920774990 -0.1886898736
-0.3205416596 0.2998067102 -0.2063776599
-0.2162874370 0.2983619775 -0.1723527103
-0.2536141368 0.3326738355 -0.1587167931
-0.3936498837 0.3481322579 -0.1940923658
-0.4294314081 0.3621459476 -0.1954429889
-0.2893956612 0.3466875252 -0.1600674162
-0.3220868349 0.3201048785 -0.1913911197
-0.4621225818 0.3355633008 -0.2267666924
-0.3921047084 0.3278340897 -0.2090789060
-0.4963589309 0.3292788223 -0.2431038557
-0.4590322311 0.2949669643 -0.2567397729
-0.3189964842 0.2795085419 -0.2213642002
-0.2832149598 0.2654948522 -0.2200135771
-0.4232507067 0.2809532746 -0.2553891498
-0.3905595330 0.3075359214 -0.2240654463
-0.2011815114 0.0997435517 -0.3083487340
-0.2011815114 0.0997435517 -0.3083487340
-0.1145459425 0.1156948075 -0.2844763232
-0.1427048086 0.1114050083 -0.2948134962
-0.2553039885 0.1238768354 -0.3233554901
-0.1427048086 0.1114050083 -0.2948134962
-0.2553039885 0.1238768354 -0.3233554901
-0.2834448753 0.1344027071 -0.3272896812
-0.1426685241 0.1410360321 -0.2820067982
-0.2552680299 0.1535081770 -0.3105495264
-0.1989502977 0.1620877753 -0.2898751805
-0.2020275562 0.1591316481 -0.2830257323
-0.1204525892 0.1245667049 -0.2643011679
-0.1483638973 0.1350609120 -0.2681630719
-0.2600451017 0.1474068626 -0.2964163958
-0.1483638973 0.1350609120 -0.2681630719
-0.2879923818 0.1282701915 -0.3130840078
-0.2600810737 0.1177759844 -0.3092221038
-0.1483998693 0.1054300338 -0.2809687799
-0.2600810737 0.1177759844 -0.3092221038
-0.0711346424 0.0772060965 -0.1855624763
-0.0820247739 0.1182906477 -0.1282215046
-0.0859136810 0.0862179743 -0.1856507089
-0.0960328259 0.0162812936 -0.1761783640
0.3969053402 0.0254822264 -0.0314347965
0.4257897407 0.0465993726 -0.1185029893
0.3968833960 0.0069631588 -0.0394403939
0.3679990100 -0.0141534839 0.0476279614
0.2982252679 -0.1349327014 0.2890964363
0.2778135280 -0.1569846319 0.3783051358
0.2982472267 -0.1164131301 0.2971021961
0.3186589666 -0.0943611996 0.2078934966
0.4506490063 0.0010280205 -0.0258582243
0.4753190207 0.0411316266 -0.1059910731
0.4506709505 0.0195470881 -0.0178526269
0.4260009361 -0.0205565179 0.0622802218
0.3520127863 -0.1223482628 0.3106843528
0.3273427391 -0.1624521178 0.3908171140
0.3519908274 -0.1408678340 0.3026785930
0.3766608746 -0.1007639790 0.2225458318
0.2891422334 -0.1536046989 0.3831670256
0.3299986513 -0.0817214809 0.2167582663
0.2891422334 -0.1536046989 0.3831670256
0.2845897368 -0.1722004833 0.4261994404
0.4640122342 0.0562707639 -0.1028473720
0.4146831847 -0.0146766625 0.0614212055
0.4640122342 0.0562707639 -0.1028473720
0.4706828760 0.0746326018 -0.1453447445
0.4371074921 0.0407195173 -0.1176439730
0.3793057820 -0.0292931249 0.0444840979
0.4371074921 0.0407195173 -0.1176439730
0.4572195402 0.0575976965 -0.1567457625
0.3160030544 -0.1750918365 0.3819523442
0.3653321692 -0.1041439120 0.2176839420
0.3160030544 -0.1750918365 0.3819523442
0.2980091678 -0.1922038377 0.4215892198
0.3450887952 0.1117948060 0.2114001385
0.3534487459 0.2022992535 0.2358997473
0.3504507509 0.1195071024 0.1935447233
0.3420906602 0.0290024534 0.1690455808
0.3500418275 -0.2212447290 0.0462616846
0.3501545229 -0.3126845128 0.0239023992
0.3446798717 -0.2289570737 0.0641170789
0.3445673163 -0.1375171369 0.0864758772
0.4042163613 0.1135719641 0.2071268929
0.4029781032 0.1968318599 0.2484115116
0.3988544055 0.1058596677 0.2249823081
0.4000926636 0.0225997719 0.1836976893
0.3984454821 -0.2348922120 0.0776992484
0.3996837402 -0.3181520836 0.0364146401
0.4038074378 -0.2271798672 0.0598438541
0.4025691798 -0.1439199956 0.1011284624
0.3601372400 -0.3158625999 0.0312268259
0.3518689856 -0.1445514728 0.1027282445
0.3601372400 -0.3158625999 0.0312268259
0.3678659241 -0.3593153629 0.0147816993
0.3876334304 0.1922976506 0.2589425001
0.3874288986 0.0219216100 0.1853012034
0.3876334304 0.1922976506 0.2589425001
0.3820229428 0.2355166420 0.2759225961
0.3661125109 0.2029774154 0.2342962332
0.3574354731 0.0335368642 0.1585141261
0.3661125109 0.2029774154 0.2342962332
0.3739433909 0.2447125719 0.2546719882
0.3923819310 -0.3111179007 0.0201627599
0.3925864626 -0.1407419085 0.0938040357
0.3923819310 -0.3111179007 0.0201627599
0.3866691775 -0.3530869175 0.0003222127
0.1884302862 -0.0742381280 0.0806347677
0.2603310866 -0.0819530495 0.0908751500
0.3247001792 -0.0897251297 0.1309051486
0.2527993788 -0.0820102082 0.1206647663
0.1820079571 -0.0688904375 0.1083946720
0.2527993788 -0.0820102082 0.1206647663
0.3204966074 -0.0735677407 0.1546056289
0.2497051856 -0.0604479700 0.1423355347
0.1804762388 -0.0450805932 0.1248624743
0.2497051856 -0.0604479700 0.1423355347
0.3220898392 -0.0452626843 0.1606674988
0.2528608924 -0.0298953075 0.1431944383
0.1847323453 -0.0167546164 0.1203923801
0.2528608924 -0.0298953075 0.1431944383
0.3285467451 -0.0213900790 0.1455394091
0.2604181981 -0.0082493879 0.1227373509
0.1922833224 -0.0005050612 0.0976022409
0.2604181981 -0.0082493879 0.1227373509
0.3360850649 -0.0159332524 0.1180831663
0.2679501892 -0.0081889256 0.0929480563
0.1987060746 -0.0058494885 0.0698420877
0.2679501892 -0.0081889256 0.0929480563
0.3402893393 -0.0320874589 0.0943812957
0.2710452247 -0.0297480218 0.0712753270
0.2002385642 -0.0296570166 0.0533722441
0.2710452247 -0.0297480218 0.0712753270
0.3386967372 -0.0603918511 0.0883172236
0.2678900767 -0.0603008459 0.0704141407
0.1959824557 -0.0579846856 0.0578416067
0.2678900767 -0.0603008459 0.0704141407
0.3322387076 -0.0842692098 0.1034476840
0.2603310866 -0.0819530495 0.0908751500
0.0020001241 -0.0158504234 0.0157112134
0.0020001241 -0.0158504234 0.0157112134
0.0020205594 0.0017378270 0.0233160354
0.0020205594 0.0017378270 0.0233160354
-0.0015660224 0.0089946987 0.0406847844
-0.0015660224 0.0089946987 0.0406847844
-0.0066587831 0.0016681473 0.0576431424
-0.0066587831 0.0016681473 0.0576431424
-0.0102745788 -0.0159491319 0.0642580266
-0.0102745788 -0.0159491319 0.0642580266
-0.0102951541 -0.0335375837 0.0566536707
-0.0102951541 -0.0335375837 0.0566536707
-0.0067088535 -0.0407958251 0.0392854360
-0.0067088535 -0.0407958251 0.0392854360
-0.0016159527 -0.0334690723 0.0223266118
-0.0016159527 -0.0334690723 0.0223266118
-0.0956649652 0.0052532133 -0.1103661640
-0.1020794195 -0.0779306705 -0.1213239715
-0.1097806107 -0.0210818708 -0.0494269113
-0.0956649652 0.0052532133 -0.1103661640
-0.1188926022 0.1259407816 0.0343195193
-0.1036140463 0.1479155203 -0.0165587862
-0.1150742620 0.0638760218 0.0086531491
-0.1188926022 0.1259407816 0.0343195193
-0.1093441542 0.1058957711 -0.0039528185
-0.1354459480 0.1003137857 0.0886481724
-0.1341783076 0.0309429006 0.0698862267
-0.1507233840 0.0783406578 0.1395227486
-0.1354459480 0.1003137857 0.0886481724
-0.1576719187 -0.0099947324 0.1284280158
-0.1512559320 0.0731850809 0.1393779784
-0.1357759516 0.0154761697 0.0694519162
-0.1576719187 -0.0099947324 0.1284280158
-0.1344477194 -0.1306940027 -0.0162491726
-0.1497258554 -0.1526681373 0.0346277344
-0.1304841918 -0.0694858915 0.0113775219
-0.1344477194 -0.1306940027 -0.0162491726
-0.1401050236 -0.1110770144 0.0230026281
-0.1178926932 -0.1050641071 -0.0705832107
-0.1113780448 -0.0365482996 -0.0498619211
-0.1026118975 -0.0830861468 -0.1214689748
-0.1178926932 -0.1050641071 -0.0705832107
-0.0924973276 -0.0481177132 -0.2207870372
-0.0945764039 0.0099050324 -0.1872021360
-0.1105812370 -0.0630455136 -0.1557242455
-0.0988804793 0.0037075666 -0.1728724355
-0.1042553954 -0.1084876900 -0.2006226936
-0.1032158572 -0.1374990628 -0.2174151442
-0.1027518915 0.2550958401 -0.0476956006
-0.1027882916 0.2245441461 -0.0609019925
-0.0922786048 0.1352286317 -0.1415341514
-0.1081705353 0.1622709743 -0.0668082850
-0.1028974918 0.1328890641 -0.1005211684
-0.1905172642 0.0308814336 0.2017502130
-0.1777635559 0.0621672448 0.1649353805
-0.1841795426 -0.0210125685 0.1539854179
-0.1905172642 0.0308814336 0.2017502130
-0.1968549857 0.0827754358 0.2495150081
-0.2031927073 0.1346694380 0.2972798031
-0.1841012775 0.1140612469 0.2127001756
-0.1968549857 0.0827754358 0.2495150081
-0.2036448757 -0.2449704290 0.1331746527
-0.1845101126 -0.2303877170 0.0638012140
-0.2037176830 -0.3060798606 0.1067592562
-0.2036448757 -0.2449704290 0.1331746527
-0.2035720684 -0.1838609974 0.1595900492
-0.2034992611 -0.1227515657 0.1860054457
-0.1844373053 -0.1692782854 0.0902166105
-0.2035720684 -0.1838609974 0.1595900492
-0.1906779096 -0.1043087004 0.1433107323
-0.1844373053 -0.1692782854 0.0902166105
-0.1906779096 -0.1043087004 0.1433107323
-0.2002088875 -0.0810453405 0.1912051499
-0.1391025254 0.0181565260 -0.2061587369
-0.1392484481 -0.1040864309 -0.2589988389
-0.1391025254 0.0181565260 -0.2061587369
-0.1312863516 0.0478584718 -0.1909834197
-0.1081296754 -0.1075216047 -0.2511376718
-0.1079837527 0.0147213522 -0.1982975698
-0.1081296754 -0.1075216047 -0.2511376718
-0.1159458492 -0.1372235505 -0.2663129890
-0.1388111636 0.2625881685 -0.1005003342
-0.1389567639 0.1403813925 -0.1533259020
-0.1388111636 0.2625881685 -0.1005003342
-0.1309950703 0.2922810690 -0.0853286504
-0.1078379912 0.1369462186 -0.1454647349
-0.1076923908 0.2591529947 -0.0926391671
-0.1078379912 0.1369462186 -0.1454647349
-0.1156540844 0.1072533181 -0.1606364187
-0.1839984693 0.2585966401 0.0766313669
-0.1538250654 0.3019932510 -0.0238479112
-0.1839984693 0.2585966401 0.0766313669
-0.1837621270 0.2468886939 0.1037164782
-0.1227062926 0.2985580772 -0.0159867441
-0.1528796965 0.2551614663 0.0844925340
-0.1227062926 0.2985580772 -0.0159867441
-0.1229426349 0.3102660234 -0.0430718554
-0.2443337288 0.1718193043 0.2775511511
-0.2141680237 0.2152053245 0.1770977210
-0.2443337288 0.1718193043 0.2775511511
-0.2440954619 0.1601140058 0.3046298005
-0.1830492510 0.2117701507 0.1849588881
-0.2132149561 0.1683841305 0.2854123183
-0.1830492510 0.2117701507 0.1849588881
-0.1832875179 0.2234754492 0.1578802388
-0.2596354439 -0.0332200103 0.2485255510
-0.2594895356 0.0890108594 0.3013604278
-0.2596354439 -0.0332200103 0.2485255510
-0.2518922278 -0.0646365212 0.2372821236
-0.2283707628 0.0855756856 0.3092215949
-0.2285166712 -0.0366551841 0.2563867181
-0.2283707628 0.0855756856 0.3092215949
-0.2361139789 0.1169921964 0.3204650223
-0.2599268201 -0.2776637400 0.1428619231
-0.2597812054 -0.1554448768 0.1956927161
-0.2599268201 -0.2776637400 0.1428619231
-0.2521835305 -0.3090772493 0.1316195166
-0.2286624327 -0.1588800506 0.2035538832
-0.2288080473 -0.2810989138 0.1507230902
-0.2286624327 -0.1588800506 0.2035538832
-0.2364057222 -0.1274665413 0.2147962897
-0.2147454002 -0.2736859867 -0.0342524982
-0.2449148850 -0.3170774433 0.0662135184
-0.2147454002 -0.2736859867 -0.0342524982
-0.1994233359 -0.2636969160 -0.0574037105
-0.2137961122 -0.3205126171 0.0740746855
-0.1836266275 -0.2771211605 -0.0263913311
-0.2137961122 -0.3205126171 0.0740746855
-0.2291181766 -0.3305016878 0.0972258978
-0.1544062216 -0.1869034966 -0.2351855440
-0.1845758458 -0.2302946711 -0.1347188523
-0.1544062216 -0.1869034966 -0.2351855440
-0.1390841223 -0.1769144965 -0.2583369251
-0.1534570730 -0.2337298449 -0.1268576852
-0.1232874488 -0.1903386705 -0.2273243769
-0.1534570730 -0.2337298449 -0.1268576852
-0.1687791722 -0.2437188451 -0.1037063040
-0.1772530843 0.0178781756 -0.1215333641
-0.1773260456 -0.0432433028 -0.1479534151
-0.1621679822 0.0395826266 -0.1717639847
-0.1772530843 0.0178781756 -0.1215333641
-0.1923381864 -0.0038262754 -0.0713027436
-0.2074232885 -0.0255307264 -0.0210721230
-0.1924111477 -0.0649477538 -0.0977227945
-0.1923381864 -0.0038262754 -0.0713027436
-0.1623139049 -0.0826603303 -0.2246040867
-0.1773990070 -0.1043647813 -0.1743734661
-0.1623868662 -0.1437818087 -0.2510241376
-0.1623139049 -0.0826603303 -0.2246040867
-0.1622409435 -0.0215388518 -0.1981840357
-0.1621679822 0.0395826266 -0.1717639847
-0.1773260456 -0.0432433028 -0.1479534151
-0.1622409435 -0.0215388518 -0.1981840357
-0.1620223013 0.1617984479 -0.1189347833
-0.1771074034 0.1400939969 -0.0687041628
-0.1620951014 0.1006950599 -0.1453475673
-0.1620223013 0.1617984479 -0.1189347833
-0.1619495011 0.2229018359 -0.0925219994
-0.1618767010 0.2840052239 -0.0661092155
-0.1770346032 0.2011973849 -0.0422913788
-0.1619495011 0.2229018359 -0.0925219994
-0.1922653056 0.0572861579 -0.0448863261
-0.1921925055 0.1183895459 -0.0184735422
-0.2073504077 0.0355817069 0.0053442945
-0.1922653056 0.0572861579 -0.0448863261
-0.1771802035 0.0789906089 -0.0951169467
-0.1620951014 0.1006950599 -0.1453475673
-0.1771074034 0.1400939969 -0.0687041628
-0.1771802035 0.0789906089 -0.0951169467
-0.2072080071 0.1578007740 0.0581878993
-0.1921213052 0.1794990794 0.0079482602
-0.2071368068 0.2189103075 0.0846097016
-0.2072080071 0.1578007740 0.0581878993
-0.2072792074 0.0966912404 0.0317660969
-0.2073504077 0.0355817069 0.0053442945
-0.1921925055 0.1183895459 -0.0184735422
-0.2072792074 0.0966912404 0.0317660969
-0.1769634029 0.2623069184 -0.0158695764
-0.1770346032 0.2011973849 -0.0422913788
-0.1618767010 0.2840052239 -0.0661092155
-0.1769634029 0.2623069184 -0.0158695764
-0.1920501048 0.2406086130 0.0343700626
-0.2071368068 0.2189103075 0.0846097016
-0.1921213052 0.1794990794 0.0079482602
-0.1920501048 0.2406086130 0.0343700626
-0.2373044366 0.1755216396 0.1850695938
-0.2373756369 0.1144121061 0.1586477914
-0.2222215840 0.1972146497 0.1348428787
-0.2373044366 0.1755216396 0.1850695938
-0.2523872891 0.1538286295 0.2352963089
-0.2674701417 0.1321356194 0.2855230239
-0.2524584894 0.0927190960 0.2088745065
-0.2523872891 0.1538286295 0.2352963089
-0.2223639847 0.0749955826 0.0819992739
-0.2374468372 0.0533025725 0.1322259890
-0.2224351850 0.0138860491 0.0555774715
-0.2223639847 0.0749955826 0.0819992739
-0.2222927843 0.1361051162 0.1084210763
-0.2222215840 0.1972146497 0.1348428787
-0.2373756369 0.1144121061 0.1586477914
-0.2222927843 0.1361051162 0.1084210763
-0.2526043978 -0.0295117737 0.1560396297
-0.2525314436 0.0316036611 0.1824570681
-0.2676890042 -0.0512106851 0.2062707087
-0.2526043978 -0.0295117737 0.1560396297
-0.2375197914 -0.0078128623 0.1058085506
-0.2224351850 0.0138860491 0.0555774715
-0.2374468372 0.0533025725 0.1322259890
-0.2375197914 -0.0078128623 0.1058085506
-0.2675430958 0.0710201846 0.2591055855
-0.2524584894 0.0927190960 0.2088745065
-0.2674701417 0.1321356194 0.2855230239
-0.2675430958 0.0710201846 0.2591055855
-0.2676160500 0.0099047497 0.2326881471
-0.2676890042 -0.0512106851 0.2062707087
-0.2525314436 0.0316036611 0.1824570681
-0.2676160500 0.0099047497 0.2326881471
-0.2678346923 -0.1734325500 0.1534388948
-0.2527500859 -0.1517336386 0.1032078157
-0.2677618850 -0.1123231183 0.1798542913
-0.2678346923 -0.1734325500 0.1534388948
-0.2679074996 -0.2345419816 0.1270234983
-0.2679803069 -0.2956514132 0.1006081018
-0.2528228932 -0.2128430702 0.0767924192
-0.2679074996 -0.2345419816 0.1270234983
-0.2375926721 -0.0689252956 0.0793921331
-0.2376654795 -0.1300347272 0.0529767366
-0.2225080657 -0.0472263842 0.0291610541
-0.2375926721 -0.0689252956 0.0793921331
-0.2526772786 -0.0906242069 0.1296232122
-0.2677618850 -0.1123231183 0.1798542913
-0.2527500859 -0.1517336386 0.1032078157
-0.2526772786 -0.0906242069 0.1296232122
-0.2226534084 -0.1694516136 -0.0236735973
-0.2377381508 -0.1911473419 0.0265594109
-0.2227260798 -0.2305642283 -0.0500909230
-0.2226534084 -0.1694516136 -0.0236735973
-0.2225807371 -0.1083389989 0.0027437284
-0.2225080657 -0.0472263842 0.0291610541
-0.2376654795 -0.1300347272 0.0529767366
-0.2225807371 -0.1083389989 0.0027437284
-0.2528955645 -0.2739556849 0.0503750935
-0.2528228932 -0.2128430702 0.0767924192
-0.2679803069 -0.2956514132 0.1006081018
-0.2528955645 -0.2739556849 0.0503750935
-0.2378108221 -0.2522599566 0.0001420852
-0.2227260798 -0.2305642283 -0.0500909230
-0.2377381508 -0.1911473419 0.0265594109
-0.2378108221 -0.2522599566 0.0001420852
-0.1925564904 -0.1871729832 -0.1505574459
-0.1924838191 -0.1260603685 -0.1241401202
-0.2076413025 -0.2088685705 -0.1003241001
-0.1925564904 -0.1871729832 -0.1505574459
-0.1774716783 -0.1654773960 -0.2007907918
-0.1623868662 -0.1437818087 -0.2510241376
-0.1773990070 -0.1043647813 -0.1743734661
-0.1774716783 -0.1654773960 -0.2007907918
-0.2074959598 -0.0866433411 -0.0474894487
-0.1924111477 -0.0649477538 -0.0977227945
-0.2074232885 -0.0255307264 -0.0210721230
-0.2074959598 -0.0866433411 -0.0474894487
-0.2075686312 -0.1477559558 -0.0739067744
-0.2076413025 -0.2088685705 -0.1003241001
-0.1924838191 -0.1260603685 -0.1241401202
-0.2075686312 -0.1477559558 -0.0739067744
3 397 764 111
3 149 764 397
3 3 765 111
3 397 765 3
3 398 766 149
3 2 766 398
3 398 767 3
3 149 767 398
3 399 768 2
3 150 768 399
3 110 769 2
3 399 769 110
3 400 770 150
3 111 770 400
3 400 771 110
3 150 771 400
3 401 772 31
3 151 772 401
3 72 773 31
3 401 773 72
3 402 774 151
3 71 774 402
3 402 775 72
3 151 775 402
3 403 776 71
3 152 776 403
3 30 777 71
3 403 777 30
3 404 778 152
3 31 778 404
3 404 779 30
3 152 779 404
3 405 780 54
3 119 780 405
3 54 781 405
3 141 781 54
3 153 782 120
3 141 782 153
3 119 783 120
3 153 783 119
3 406 784 119
3 124 784 406
3 119 785 406
3 120 785 119
3 154 786 100
3 120 786 154
3 124 787 100
3 154 787 124
3 407 788 30
3 100 788 407
3 407 789 71
3 30 789 407
3 124 408 71
3 100 408 124
3 110 409 54
3 2 409 110
3 410 790 141
3 2 790 410
3 410 791 54
3 141 791 410
3 155 792 142
3 122 792 155
3 55 793 142
3 155 793 55
3 411 794 121
3 55 794 411
3 121 795 411
3 122 795 121
3 156 796 122
3 101 796 156
3 121 797 122
3 156 797 121
3 412 798 125
3 121 798 412
3 125 799 412
3 101 799 125
3 72 413 125
3 31 413 72
3 414 800 101
3 31 800 414
3 414 801 125
3 101 801 414
3 415 802 3
3 142 802 415
3 415 803 111
3 3 803 415
3 55 416 111
3 142 416 55
3 159 417 158
3 120 417 159
3 158 418 159
3 157 418 158
3 141 419 160
3 158 419 141
3 160 420 120
3 158 420 160
3 157 421 162
3 161 421 157
3 162 422 142
3 161 422 162
3 163 423 161
3 141 423 163
3 161 424 163
3 157 424 161
3 166 425 165
3 142 425 166
3 165 426 166
3 164 426 165
3 122 427 167
3 165 427 122
3 167 428 142
3 165 428 167
3 164 429 169
3 168 429 164
3 169 430 120
3 168 430 169
3 170 431 168
3 122 431 170
3 168 432 170
3 164 432 168
3 173 433 172
3 100 433 173
3 172 434 173
3 171 434 172
3 120 435 174
3 172 435 120
3 174 436 100
3 172 436 174
3 171 437 176
3 175 437 171
3 176 438 122
3 175 438 176
3 177 439 175
3 120 439 177
3 175 440 177
3 171 440 175
3 180 441 179
3 122 441 180
3 179 442 180
3 178 442 179
3 181 443 179
3 101 443 181
3 181 444 122
3 179 444 181
3 178 445 183
3 182 445 178
3 183 446 100
3 182 446 183
3 184 447 182
3 101 447 184
3 178 448 182
3 184 448 178
3 449 804 186
3 101 804 449
3 186 805 449
3 185 805 186
3 450 806 31
3 101 806 450
3 450 807 186
3 31 807 450
3 185 808 451
3 187 808 185
3 451 809 30
3 187 809 451
3 452 810 187
3 31 810 452
3 187 811 452
3 185 811 187
3 453 812 189
3 30 812 453
3 189 813 453
3 188 813 189
3 454 814 100
3 30 814 454
3 454 815 189
3 100 815 454
3 188 816 455
3 190 816 188
3 455 817 101
3 190 817 455
3 456 818 190
3 100 818 456
3 190 819 456
3 188 819 190
3 457 820 141
3 192 820 457
3 457 821 2
3 141 821 457
3 458 822 192
3 191 822 458
3 458 823 2
3 192 823 458
3 191 824 459
3 193 824 191
3 459 825 3
3 193 825 459
3 460 826 193
3 2 826 460
3 193 827 460
3 191 827 193
3 461 828 195
3 3 828 461
3 461 829 194
3 195 829 461
3 462 830 142
3 3 830 462
3 462 831 195
3 142 831 462
3 196 832 194
3 463 832 196
3 463 833 141
3 196 833 463
3 464 834 196
3 142 834 464
3 196 835 464
3 194 835 196
3 199 465 198
3 121 465 199
3 198 466 199
3 197 466 198
3 55 467 200
3 198 467 55
3 200 468 121
3 198 468 200
3 201 469 197
3 202 469 201
3 202 470 54
3 201 470 202
3 203 471 201
3 55 471 203
3 201 472 203
3 197 472 201
3 206 473 205
3 54 473 206
3 205 474 206
3 204 474 205
3 119 475 207
3 205 475 119
3 207 476 54
3 205 476 207
3 208 477 204
3 209 477 208
3 209 478 121
3 208 478 209
3 210 479 208
3 119 479 210
3 208 480 210
3 204 480 208
3 213 481 212
3 125 481 213
3 212 482 213
3 211 482 212
3 214 483 212
3 121 483 214
3 214 484 125
3 212 484 214
3 211 485 216
3 215 485 211
3 216 486 119
3 215 486 216
3 217 487 215
3 121 487 217
3 211 488 215
3 217 488 211
3 220 489 219
3 119 489 220
3 220 490 218
3 219 490 220
3 124 491 221
3 219 491 124
3 221 492 119
3 219 492 221
3 218 493 223
3 222 493 218
3 223 494 125
3 222 494 223
3 224 495 222
3 124 495 224
3 222 496 224
3 218 496 222
3 497 836 226
3 124 836 497
3 226 837 497
3 225 837 226
3 498 838 71
3 124 838 498
3 498 839 226
3 71 839 498
3 225 840 499
3 227 840 225
3 499 841 72
3 227 841 499
3 500 842 227
3 71 842 500
3 227 843 500
3 225 843 227
3 501 844 229
3 72 844 501
3 229 845 501
3 228 845 229
3 502 846 125
3 72 846 502
3 502 847 229
3 125 847 502
3 228 848 503
3 230 848 228
3 503 849 124
3 230 849 503
3 504 850 230
3 125 850 504
3 230 851 504
3 228 851 230
3 505 852 232
3 55 852 505
3 232 853 505
3 231 853 232
3 506 854 111
3 55 854 506
3 506 855 232
3 111 855 506
3 231 856 507
3 233 856 231
3 507 857 110
3 233 857 507
3 508 858 233
3 111 858 508
3 233 859 508
3 231 859 233
3 509 860 235
3 110 860 509
3 235 861 509
3 234 861 235
3 510 862 54
3 110 862 510
3 510 863 235
3 54 863 510
3 234 864 511
3 236 864 234
3 511 865 55
3 236 865 511
3 512 866 236
3 54 866 512
3 236 867 512
3 234 867 236
3 115 107 130
3 79 115 130
3 116 108 131
3 80 116 131
3 131 868 108
3 130 868 131
3 107 869 130
3 108 869 107
3 116 870 513
3 108 870 116
3 513 871 237
3 108 871 513
3 514 872 237
3 107 872 514
3 514 873 108
3 237 873 514
3 515 874 107
3 238 874 515
3 115 875 107
3 515 875 115
3 516 876 238
3 116 876 516
3 516 877 115
3 238 877 516
3 80 878 115
3 116 878 80
3 79 879 115
3 80 879 79
3 131 880 517
3 80 880 131
3 517 881 239
3 80 881 517
3 518 882 239
3 79 882 518
3 518 883 80
3 239 883 518
3 79 884 519
3 130 884 79
3 519 885 240
3 130 885 519
3 520 886 240
3 131 886 520
3 520 887 130
3 240 887 520
3 114 106 132
3 81 114 132
3 106 132 131
3 108 106 131
3 114 106 108
3 116 114 108
3 81 114 116
3 80 81 116
3 132 81 80
3 131 132 80
3 26 15 134
3 83 26 134
3 15 134 132
3 106 15 132
3 26 15 106
3 114 26 106
3 83 26 114
3 81 83 114
3 134 83 81
3 132 134 81
3 82 133 40
3 146 82 40
3 133 40 134
3 15 133 134
3 82 133 15
3 26 82 15
3 146 82 26
3 83 146 26
3 40 146 83
3 134 40 83
3 145 39 41
3 148 145 41
3 39 41 40
3 133 39 40
3 145 39 133
3 82 145 133
3 148 145 82
3 146 148 82
3 41 148 146
3 40 41 146
3 147 42 95
3 109 147 95
3 42 95 41
3 39 42 41
3 147 42 39
3 145 147 39
3 109 147 145
3 148 109 145
3 95 109 148
3 41 95 148
3 91 123 92
3 4 91 92
3 123 92 95
3 42 123 95
3 242 521 241
3 123 521 242
3 242 522 91
3 241 522 242
3 243 523 241
3 42 523 243
3 243 524 123
3 241 524 243
3 147 888 42
3 525 888 147
3 525 889 91
3 147 889 525
3 4 91 147
3 109 4 147
3 245 526 244
3 4 526 245
3 245 527 92
3 244 527 245
3 246 528 244
3 109 528 246
3 246 529 4
3 244 529 246
3 95 890 109
3 530 890 95
3 530 891 92
3 95 891 530
3 137 24 25
3 138 137 25
3 531 892 76
3 11 892 531
3 76 893 531
3 97 893 76
3 532 894 117
3 97 894 532
3 117 895 532
3 11 895 117
3 533 896 138
3 117 896 533
3 138 897 533
3 25 897 138
3 534 898 11
3 25 898 534
3 11 899 534
3 117 899 11
3 535 900 96
3 118 900 535
3 75 901 96
3 535 901 75
3 536 902 12
3 75 902 536
3 118 903 12
3 536 903 118
3 537 904 24
3 12 904 537
3 137 905 24
3 537 905 137
3 538 906 118
3 137 906 538
3 12 907 118
3 538 907 12
3 539 908 247
3 25 908 539
3 539 909 11
3 247 909 539
3 540 910 25
3 247 910 540
3 24 911 25
3 540 911 24
3 249 541 248
3 12 541 249
3 249 542 24
3 248 542 249
3 12 543 250
3 11 543 12
3 250 544 248
3 11 544 250
3 545 912 251
3 75 912 545
3 545 913 12
3 251 913 545
3 546 914 75
3 251 914 546
3 76 915 75
3 546 915 76
3 253 547 252
3 11 547 253
3 253 548 76
3 252 548 253
3 11 549 254
3 12 549 11
3 254 550 252
3 12 550 254
3 551 916 255
3 97 916 551
3 551 917 117
3 255 917 551
3 552 918 97
3 255 918 552
3 96 919 97
3 552 919 96
3 257 553 256
3 118 553 257
3 257 554 96
3 256 554 257
3 258 555 118
3 256 555 258
3 117 556 118
3 258 556 117
3 557 920 259
3 137 920 557
3 557 921 118
3 259 921 557
3 558 922 137
3 259 922 558
3 138 923 137
3 558 923 138
3 261 559 260
3 117 559 261
3 261 560 138
3 260 560 261
3 117 561 262
3 118 561 117
3 262 562 260
3 118 562 262
3 93 84 85
3 94 93 85
3 34 35 37
3 36 34 37
3 563 924 36
3 61 924 563
3 36 925 563
3 37 925 36
3 564 926 62
3 37 926 564
3 62 927 564
3 61 927 62
3 565 928 94
3 62 928 565
3 94 929 565
3 85 929 94
3 566 930 61
3 85 930 566
3 61 931 566
3 62 931 61
3 567 932 35
3 64 932 567
3 34 933 35
3 567 933 34
3 568 934 63
3 34 934 568
3 64 935 63
3 568 935 64
3 569 936 84
3 63 936 569
3 93 937 84
3 569 937 93
3 570 938 64
3 93 938 570
3 63 939 64
3 570 939 63
3 571 940 263
3 85 940 571
3 571 941 61
3 263 941 571
3 572 942 85
3 263 942 572
3 84 943 85
3 572 943 84
3 265 573 264
3 63 573 265
3 265 574 84
3 264 574 265
3 266 575 63
3 264 575 266
3 61 576 63
3 266 576 61
3 577 944 267
3 34 944 577
3 577 945 63
3 267 945 577
3 578 946 34
3 267 946 578
3 36 947 34
3 578 947 36
3 269 579 268
3 61 579 269
3 269 580 36
3 268 580 269
3 61 581 270
3 63 581 61
3 270 582 268
3 63 582 270
3 583 948 271
3 37 948 583
3 583 949 62
3 271 949 583
3 584 950 37
3 271 950 584
3 35 951 37
3 584 951 35
3 273 585 272
3 64 585 273
3 273 586 35
3 272 586 273
3 274 587 64
3 272 587 274
3 62 588 64
3 274 588 62
3 589 952 275
3 93 952 589
3 589 953 64
3 275 953 589
3 590 954 93
3 275 954 590
3 94 955 93
3 590 955 94
3 277 591 276
3 62 591 277
3 277 592 94
3 276 592 277
3 62 593 278
3 64 593 62
3 278 594 276
3 64 594 278
3 9 127 44
3 90 9 44
3 21 90 44
3 113 21 44
3 53 113 44
3 59 53 44
3 126 956 595
3 43 956 126
3 595 957 44
3 43 957 595
3 44 958 596
3 127 958 44
3 596 959 126
3 127 959 596
3 8 960 597
3 126 960 8
3 597 961 127
3 126 961 597
3 127 962 598
3 9 962 127
3 598 963 8
3 9 963 598
3 89 964 599
3 8 964 89
3 599 965 9
3 8 965 599
3 9 966 600
3 90 966 9
3 600 967 89
3 90 967 600
3 20 968 601
3 89 968 20
3 601 969 90
3 89 969 601
3 90 970 602
3 21 970 90
3 602 971 20
3 21 971 602
3 112 972 603
3 20 972 112
3 603 973 21
3 20 973 603
3 21 974 604
3 113 974 21
3 604 975 112
3 113 975 604
3 52 976 605
3 112 976 52
3 605 977 113
3 112 977 605
3 113 978 606
3 53 978 113
3 606 979 52
3 53 979 606
3 58 980 607
3 52 980 58
3 607 981 53
3 52 981 607
3 53 982 608
3 59 982 53
3 608 983 58
3 59 983 608
3 43 984 609
3 58 984 43
3 609 985 59
3 58 985 609
3 59 986 610
3 44 986 59
3 610 987 43
3 44 987 610
3 51 1 52
3 58 51 52
3 1 10 112
3 52 1 112
3 10 66 20
3 112 10 20
3 66 38 89
3 20 66 89
3 38 7 8
3 89 38 8
3 7 88 126
3 8 7 126
3 88 0 43
3 126 88 43
3 0 51 58
3 43 0 58
3 16 27 1
3 51 16 1
3 27 98 10
3 1 27 10
3 98 32 66
3 10 98 66
3 32 73 38
3 66 32 38
3 73 60 7
3 38 73 7
3 60 143 88
3 7 60 88
3 143 86 0
3 88 143 0
3 86 16 51
3 0 86 51
3 28 988 17
3 27 988 28
3 16 989 27
3 17 989 16
3 99 990 28
3 98 990 99
3 27 991 98
3 28 991 27
3 33 992 99
3 32 992 33
3 98 993 32
3 99 993 98
3 74 994 33
3 73 994 74
3 32 995 73
3 33 995 32
3 65 996 74
3 60 996 65
3 73 997 60
3 74 997 73
3 144 998 65
3 143 998 144
3 60 999 143
3 65 999 60
3 87 1000 144
3 86 1000 87
3 143 1001 86
3 144 1001 143
3 17 1002 87
3 16 1002 17
3 86 1003 16
3 87 1003 86
3 96 97 76
3 75 96 76
3 280 1004 279
3 14 1004 280
3 280 1005 48
3 279 1005 280
3 281 1006 279
3 28 1006 281
3 281 1007 14
3 279 1007 281
3 17 48 28
3 283 611 282
3 14 611 283
3 283 612 99
3 282 612 283
3 284 613 282
3 136 613 284
3 284 614 14
3 282 614 284
3 28 14 99
3 615 1008 285
3 103 1008 615
3 615 1009 136
3 285 1009 615
3 616 1010 285
3 33 1010 616
3 616 1011 103
3 285 1011 616
3 99 1012 33
3 136 1012 99
3 617 1013 286
3 103 1013 617
3 617 1014 74
3 286 1014 617
3 618 1015 286
3 70 1015 618
3 618 1016 103
3 286 1016 618
3 33 103 74
3 288 1017 287
3 129 1017 288
3 288 1018 70
3 287 1018 288
3 289 1019 287
3 65 1019 289
3 289 1020 129
3 287 1020 289
3 74 70 65
3 291 619 290
3 129 619 291
3 291 620 144
3 290 620 291
3 292 621 290
3 140 621 292
3 292 622 129
3 290 622 292
3 65 129 144
3 623 1021 293
3 23 1021 623
3 623 1022 140
3 293 1022 623
3 624 1023 293
3 87 1023 624
3 624 1024 23
3 293 1024 624
3 144 1025 87
3 140 1025 144
3 625 1026 294
3 23 1026 625
3 625 1027 17
3 294 1027 625
3 626 1028 294
3 48 1028 626
3 626 1029 23
3 294 1029 626
3 87 23 17
3 47 13 14
3 48 47 14
3 13 135 136
3 14 13 136
3 135 102 103
3 136 135 103
3 102 69 70
3 103 102 70
3 69 128 129
3 70 69 129
3 128 139 140
3 129 128 140
3 139 22 23
3 140 139 23
3 22 47 48
3 23 22 48
3 627 1030 77
3 5 1030 627
3 13 1031 77
3 627 1031 13
3 295 1032 47
3 628 1032 295
3 628 1033 13
3 295 1033 628
3 295 1034 629
3 47 1034 295
3 629 1035 5
3 47 1035 629
3 297 1036 135
3 18 1036 297
3 296 1037 135
3 297 1037 296
3 298 1038 296
3 77 1038 298
3 296 1039 298
3 135 1039 296
3 13 1040 135
3 77 1040 13
3 300 630 67
3 299 630 300
3 300 631 102
3 67 631 300
3 301 632 299
3 18 632 301
3 301 633 102
3 299 633 301
3 302 634 135
3 102 634 302
3 302 635 18
3 135 635 302
3 304 636 303
3 69 636 304
3 304 637 56
3 303 637 304
3 305 638 303
3 67 638 305
3 305 639 69
3 303 639 305
3 306 640 102
3 69 640 306
3 306 641 67
3 102 641 306
3 308 642 307
3 104 642 308
3 308 643 56
3 307 643 308
3 104 644 309
3 128 644 104
3 309 645 307
3 128 645 309
3 646 1041 311
3 310 1041 646
3 646 1042 69
3 311 1042 646
3 647 1043 311
3 128 1043 647
3 647 1044 310
3 311 1044 647
3 648 1045 312
3 310 1045 648
3 648 1046 56
3 312 1046 648
3 649 1047 312
3 69 1047 649
3 649 1048 310
3 312 1048 649
3 650 1049 314
3 313 1049 650
3 650 1050 139
3 314 1050 650
3 651 1051 314
3 45 1051 651
3 651 1052 313
3 314 1052 651
3 652 1053 315
3 313 1053 652
3 652 1054 104
3 315 1054 652
3 653 1055 315
3 139 1055 653
3 653 1056 313
3 315 1056 653
3 654 1057 316
3 128 1057 654
3 654 1058 139
3 316 1058 654
3 655 1059 128
3 316 1059 655
3 655 1060 104
3 128 1060 655
3 317 656 49
3 318 656 317
3 318 657 45
3 317 657 318
3 319 658 49
3 317 658 319
3 319 659 22
3 49 659 319
3 139 660 22
3 320 660 139
3 320 661 45
3 139 661 320
3 322 662 321
3 47 662 322
3 322 663 5
3 321 663 322
3 323 664 321
3 49 664 323
3 323 665 47
3 321 665 323
3 324 666 22
3 47 666 324
3 324 667 49
3 22 667 324
3 668 1061 325
3 78 1061 668
3 668 1062 6
3 325 1062 668
3 669 1063 78
3 325 1063 669
3 77 1064 78
3 669 1064 77
3 670 1065 326
3 5 1065 670
3 670 1066 77
3 326 1066 670
3 671 1067 5
3 326 1067 671
3 6 1068 5
3 671 1068 6
3 672 1069 327
3 19 1069 672
3 672 1070 78
3 327 1070 672
3 673 1071 19
3 327 1071 673
3 18 1072 19
3 673 1072 18
3 674 1073 328
3 77 1073 674
3 674 1074 18
3 328 1074 674
3 675 1075 77
3 328 1075 675
3 78 1076 77
3 675 1076 78
3 676 1077 329
3 68 1077 676
3 676 1078 19
3 329 1078 676
3 677 1079 68
3 329 1079 677
3 67 1080 68
3 677 1080 67
3 678 1081 330
3 18 1081 678
3 678 1082 67
3 330 1082 678
3 679 1083 18
3 330 1083 679
3 19 1084 18
3 679 1084 19
3 680 1085 331
3 57 1085 680
3 680 1086 68
3 331 1086 680
3 681 1087 57
3 331 1087 681
3 56 1088 57
3 681 1088 56
3 682 1089 332
3 67 1089 682
3 682 1090 56
3 332 1090 682
3 683 1091 67
3 332 1091 683
3 68 1092 67
3 683 1092 68
3 684 1093 333
3 105 1093 684
3 684 1094 57
3 333 1094 684
3 685 1095 105
3 333 1095 685
3 104 1096 105
3 685 1096 104
3 686 1097 334
3 56 1097 686
3 686 1098 104
3 334 1098 686
3 687 1099 56
3 334 1099 687
3 57 1100 56
3 687 1100 57
3 688 1101 335
3 46 1101 688
3 688 1102 105
3 335 1102 688
3 689 1103 46
3 335 1103 689
3 45 1104 46
3 689 1104 45
3 690 1105 336
3 104 1105 690
3 690 1106 45
3 336 1106 690
3 691 1107 104
3 336 1107 691
3 105 1108 104
3 691 1108 105
3 692 1109 337
3 50 1109 692
3 692 1110 46
3 337 1110 692
3 693 1111 50
3 337 1111 693
3 49 1112 50
3 693 1112 49
3 694 1113 338
3 45 1113 694
3 694 1114 49
3 338 1114 694
3 695 1115 45
3 338 1115 695
3 46 1116 45
3 695 1116 46
3 696 1117 339
3 6 1117 696
3 696 1118 50
3 339 1118 696
3 697 1119 6
3 339 1119 697
3 5 1120 6
3 697 1120 5
3 698 1121 340
3 49 1121 698
3 698 1122 5
3 340 1122 698
3 699 1123 49
3 340 1123 699
3 50 1124 49
3 699 1124 50
3 700 1125 343
3 342 1125 700
3 700 1126 341
3 343 1126 700
3 701 1127 343
3 78 1127 701
3 701 1128 342
3 343 1128 701
3 702 1129 344
3 342 1129 702
3 702 1130 29
3 344 1130 702
3 703 1131 344
3 341 1131 703
3 703 1132 342
3 344 1132 703
3 704 1133 346
3 345 1133 704
3 704 1134 341
3 346 1134 704
3 705 1135 346
3 6 1135 705
3 705 1136 345
3 346 1136 705
3 706 1137 347
3 345 1137 706
3 706 1138 78
3 347 1138 706
3 707 1139 347
3 341 1139 707
3 707 1140 345
3 347 1140 707
3 708 1141 350
3 349 1141 708
3 708 1142 348
3 350 1142 708
3 709 1143 350
3 78 1143 709
3 709 1144 349
3 350 1144 709
3 710 1145 351
3 349 1145 710
3 710 1146 19
3 351 1146 710
3 711 1147 351
3 348 1147 711
3 711 1148 349
3 351 1148 711
3 712 1149 353
3 352 1149 712
3 712 1150 348
3 353 1150 712
3 713 1151 353
3 29 1151 713
3 713 1152 352
3 353 1152 713
3 714 1153 354
3 352 1153 714
3 714 1154 78
3 354 1154 714
3 715 1155 354
3 348 1155 715
3 715 1156 352
3 354 1156 715
3 716 1157 357
3 356 1157 716
3 716 1158 355
3 357 1158 716
3 717 1159 357
3 68 1159 717
3 717 1160 356
3 357 1160 717
3 718 1161 358
3 356 1161 718
3 718 1162 29
3 358 1162 718
3 719 1163 358
3 355 1163 719
3 719 1164 356
3 358 1164 719
3 720 1165 360
3 359 1165 720
3 720 1166 355
3 360 1166 720
3 721 1167 360
3 19 1167 721
3 721 1168 359
3 360 1168 721
3 722 1169 361
3 359 1169 722
3 722 1170 68
3 361 1170 722
3 723 1171 361
3 355 1171 723
3 723 1172 359
3 361 1172 723
3 724 1173 364
3 363 1173 724
3 724 1174 362
3 364 1174 724
3 725 1175 364
3 68 1175 725
3 725 1176 363
3 364 1176 725
3 726 1177 365
3 363 1177 726
3 726 1178 57
3 365 1178 726
3 727 1179 365
3 362 1179 727
3 727 1180 363
3 365 1180 727
3 728 1181 367
3 366 1181 728
3 728 1182 362
3 367 1182 728
3 729 1183 367
3 29 1183 729
3 729 1184 366
3 367 1184 729
3 730 1185 368
3 366 1185 730
3 730 1186 68
3 368 1186 730
3 731 1187 368
3 362 1187 731
3 731 1188 366
3 368 1188 731
3 732 1189 371
3 370 1189 732
3 732 1190 369
3 371 1190 732
3 733 1191 371
3 105 1191 733
3 733 1192 370
3 371 1192 733
3 734 1193 372
3 370 1193 734
3 734 1194 29
3 372 1194 734
3 735 1195 372
3 369 1195 735
3 735 1196 370
3 372 1196 735
3 736 1197 374
3 373 1197 736
3 736 1198 369
3 374 1198 736
3 737 1199 374
3 57 1199 737
3 737 1200 373
3 374 1200 737
3 738 1201 375
3 373 1201 738
3 738 1202 105
3 375 1202 738
3 739 1203 375
3 369 1203 739
3 739 1204 373
3 375 1204 739
3 740 1205 378
3 377 1205 740
3 740 1206 376
3 378 1206 740
3 741 1207 378
3 105 1207 741
3 741 1208 377
3 378 1208 741
3 742 1209 379
3 377 1209 742
3 742 1210 46
3 379 1210 742
3 743 1211 379
3 376 1211 743
3 743 1212 377
3 379 1212 743
3 744 1213 381
3 380 1213 744
3 744 1214 376
3 381 1214 744
3 745 1215 381
3 29 1215 745
3 745 1216 380
3 381 1216 745
3 746 1217 382
3 380 1217 746
3 746 1218 105
3 382 1218 746
3 747 1219 382
3 376 1219 747
3 747 1220 380
3 382 1220 747
3 748 1221 385
3 384 1221 748
3 748 1222 383
3 385 1222 748
3 749 1223 385
3 50 1223 749
3 749 1224 384
3 385 1224 749
3 750 1225 386
3 384 1225 750
3 750 1226 29
3 386 1226 750
3 751 1227 386
3 383 1227 751
3 751 1228 384
3 386 1228 751
3 752 1229 388
3 387 1229 752
3 752 1230 383
3 388 1230 752
3 753 1231 388
3 46 1231 753
3 753 1232 387
3 388 1232 753
3 754 1233 389
3 387 1233 754
3 754 1234 50
3 389 1234 754
3 755 1235 389
3 383 1235 755
3 755 1236 387
3 389 1236 755
3 756 1237 392
3 391 1237 756
3 756 1238 390
3 392 1238 756
3 757 1239 392
3 50 1239 757
3 757 1240 391
3 392 1240 757
3 758 1241 393
3 391 1241 758
3 758 1242 6
3 393 1242 758
3 759 1243 393
3 390 1243 759
3 759 1244 391
3 393 1244 759
3 760 1245 395
3 394 1245 760
3 760 1246 390
3 395 1246 760
3 761 1247 395
3 29 1247 761
3 761 1248 394
3 395 1248 761
3 762 1249 396
3 394 1249 762
3 762 1250 50
3 396 1250 762
3 763 1251 396
3 390 1251 763
3 763 1252 394
3 396 1252 763