OFF

190 376 0
-0.061378 0.048919 0.068915
-0.098043 -0.047804 0.151270
-0.181694 0.170390 0.241384
-0.189389 -0.167612 0.237259
-0.031303 -0.143822 -0.016974
-0.134707 -0.144527 0.233625
-0.128118 0.144937 0.237159
-0.063496 -0.171361 -0.061933
-0.162071 -0.170772 0.249398
-0.170639 -0.167864 0.251851
-0.138181 0.150135 0.250529
-0.133350 0.153044 0.243701
-0.162893 0.168102 0.254728
-0.190024 -0.171695 0.241363
-0.170698 -0.170511 0.250828
-0.140595 -0.153145 0.240628
-0.025736 0.161630 -0.031122
-0.044613 -0.169914 -0.052338
-0.063257 -0.175099 -0.047756
-0.139003 -0.148075 0.240906
-0.031949 0.166390 -0.044637
-0.149230 0.166926 0.252010
-0.165076 0.177585 0.244039
-0.048916 -0.174426 -0.039272
-0.034788 0.173892 -0.034860
-0.161221 0.172321 0.253375
-0.044641 -0.165650 -0.054393
-0.055746 0.175705 -0.057330
-0.145963 -0.155803 0.245608
-0.166597 0.176206 0.247630
-0.180421 0.170270 0.248904
-0.141248 0.161095 0.248835
-0.155571 0.165894 0.254986
-0.169116 0.169958 0.253318
-0.059770 0.171222 -0.054096
-0.174489 0.177922 0.240157
-0.055779 -0.175307 -0.044670
-0.031608 -0.152162 -0.019686
-0.177198 -0.172091 0.249858
-0.055884 0.177581 -0.052476
-0.146652 0.173347 0.241548
-0.188416 -0.171779 0.245231
-0.187353 -0.174731 0.242457
-0.154846 0.176773 0.241163
-0.028725 0.157181 -0.045388
-0.023810 0.153747 -0.021770
-0.174617 -0.176117 0.243330
-0.162132 -0.171928 0.248119
-0.022430 0.150924 -0.029992
-0.139445 0.168040 0.241303
-0.040903 0.177550 -0.034975
-0.145349 0.167337 0.248897
-0.048747 -0.173525 -0.043989
-0.169325 -0.173111 0.249742
-0.154296 0.169340 0.253467
-0.040749 0.176972 -0.039754
-0.163102 0.163799 0.255933
-0.189982 -0.169718 0.239274
-0.027865 0.169355 -0.035739
-0.042764 -0.170640 -0.038743
-0.044671 0.177038 -0.047850
-0.169727 0.166053 0.254536
-0.177487 0.162072 0.251852
-0.029268 0.167744 -0.038713
-0.053565 0.171134 -0.058531
-0.156625 -0.172177 0.242440
-0.067466 -0.166781 -0.058222
-0.162488 -0.164418 0.251874
-0.025661 0.160888 -0.024658
-0.037895 -0.159309 -0.049781
-0.151336 -0.168219 0.245803
-0.049520 -0.163274 -0.059033
-0.049389 0.162945 -0.058590
-0.041840 -0.169402 -0.043287
-0.043737 -0.161367 -0.055310
-0.042436 0.170822 -0.053689
-0.031518 -0.151609 -0.041844
-0.133713 0.161214 0.240444
-0.136606 0.160038 0.244209
-0.056716 -0.158878 -0.062519
-0.160109 -0.172215 0.245583
-0.141861 0.167858 0.245482
-0.184997 -0.167841 0.247825
-0.057133 0.175249 -0.057374
-0.163468 0.178085 0.240174
-0.170009 0.161864 0.254937
-0.182192 0.172472 0.243451
-0.177809 0.176750 0.243007
-0.024713 0.145642 -0.013440
-0.024560 0.154035 -0.038114
-0.161901 0.159283 0.257083
-0.145425 0.153211 0.254800
-0.184823 -0.175586 0.241386
-0.036295 -0.165605 -0.037881
-0.146106 0.159325 0.255195
-0.030752 0.161848 -0.045456
-0.022483 0.148061 -0.021576
-0.058904 -0.163012 -0.062986
-0.043160 0.174904 -0.051657
-0.026395 0.161946 -0.019638
-0.177519 -0.168049 0.250910
-0.050131 -0.167180 -0.057815
-0.029180 -0.146142 -0.025167
-0.035818 -0.154384 -0.049192
-0.144723 -0.159903 0.242327
-0.025110 0.158833 -0.038125
-0.181283 0.174852 0.246903
-0.036256 -0.166224 -0.033010
-0.034815 0.174109 -0.029486
-0.033722 -0.159877 -0.023566
-0.169276 -0.164707 0.253129
-0.153514 0.156330 0.257036
-0.037498 -0.166438 -0.028348
-0.186876 -0.169880 0.246746
-0.148619 -0.167196 0.240952
-0.034643 0.160150 -0.051320
-0.065012 -0.170843 -0.061599
-0.132279 0.147312 0.244511
-0.037067 0.173722 -0.047471
-0.052650 -0.173428 -0.052128
-0.149198 -0.161276 0.246386
-0.047717 0.178874 -0.040347
-0.129849 0.153335 0.239031
-0.033061 -0.158638 -0.028251
-0.026983 0.163369 -0.038282
-0.032011 -0.157690 -0.042725
-0.054171 -0.174807 -0.048536
-0.033929 0.173017 -0.039388
-0.066459 -0.168876 -0.060079
-0.023899 0.155532 -0.029291
-0.152905 0.171500 0.248897
-0.046130 0.178396 -0.044225
-0.157469 -0.167571 0.249440
-0.160733 -0.160760 0.253165
-0.030898 -0.153685 -0.033162
-0.063873 -0.173348 -0.056759
-0.029866 0.168787 -0.024256
-0.036829 -0.165071 -0.042814
-0.163119 -0.167579 0.250806
-0.153158 -0.160008 0.250770
-0.175409 -0.175847 0.245270
-0.152474 -0.156477 0.251020
-0.033137 -0.159564 -0.034824
-0.058668 0.173314 -0.055902
-0.189512 -0.173408 0.243383
-0.041862 -0.156934 -0.055191
-0.030782 -0.151799 -0.025461
-0.170945 0.178293 0.237088
-0.155167 0.161358 0.256086
-0.158093 0.175958 0.244610
-0.042003 0.166924 -0.055002
-0.050947 -0.171273 -0.056111
-0.061259 -0.166868 -0.062656
-0.169560 -0.174208 0.247819
-0.036406 0.164602 -0.051119
-0.160159 0.174551 0.248538
-0.168277 -0.174857 0.245655
-0.154893 -0.168891 0.249377
-0.055194 0.179082 -0.043432
-0.063586 -0.174621 -0.052421
-0.145063 -0.152150 0.246839
-0.029254 -0.148798 -0.033651
-0.137273 -0.152883 0.236390
-0.039488 0.175746 -0.043880
-0.165494 -0.175221 0.243252
-0.041910 0.162737 -0.055505
-0.028114 0.169393 -0.030131
-0.176136 -0.175043 0.247084
-0.182144 0.174397 0.245588
-0.176745 -0.173763 0.248650
-0.033925 -0.162919 -0.043441
-0.042681 -0.171401 -0.033704
-0.055542 0.178733 -0.048108
-0.049237 -0.159085 -0.059433
-0.051387 0.167186 -0.058955
-0.138770 0.155085 0.249119
-0.037189 0.168987 -0.049908
-0.155044 -0.163435 0.250107
-0.039173 -0.163796 -0.049373
-0.032182 0.171061 -0.042411
-0.142019 -0.160615 0.238888
-0.024638 0.154052 -0.015949
-0.147717 0.164651 0.254457
-0.182095 -0.175909 0.240245
-0.179169 0.166314 0.250722
-0.177462 -0.170142 0.250629
-0.039503 -0.167269 -0.047465
-0.150300 0.172690 0.245048
-0.168300 0.174053 0.251614
-0.047375 -0.172097 -0.048204
3 66 2 3
3 66 34 2
3 0 6 88
3 0 4 1
3 5 1 4
3 0 88 4
3 1 5 6
3 6 0 1
3 20 118 176
3 98 176 118
3 176 98 75
3 95 44 105
3 44 95 115
3 95 154 115
3 154 165 115
3 165 154 150
3 20 179 118
3 179 20 63
3 20 124 63
3 124 58 63
3 58 124 16
3 150 176 75
3 176 150 154
3 20 176 154
3 95 20 154
3 20 95 124
3 95 105 124
3 105 16 124
3 16 105 129
3 16 166 58
3 166 16 68
3 16 129 68
3 129 45 68
3 45 129 96
3 44 89 105
3 89 48 105
3 48 129 105
3 129 48 96
3 179 127 118
3 98 163 60
3 163 131 60
3 131 163 55
3 98 118 163
3 118 127 163
3 127 55 163
3 55 127 24
3 179 63 127
3 63 58 127
3 58 24 127
3 24 58 166
3 94 175 91
3 10 160 141
3 160 10 117
3 141 91 10
3 91 175 10
3 175 117 10
3 117 175 11
3 78 11 175
3 11 78 77
3 21 32 54
3 32 21 182
3 12 54 32
3 54 12 25
3 33 25 12
3 25 33 188
3 141 133 91
3 133 111 91
3 111 94 91
3 94 111 148
3 133 110 111
3 110 90 111
3 90 148 111
3 148 90 56
3 28 19 15
3 49 77 78
3 77 49 136
3 19 162 15
3 162 19 5
3 19 6 5
3 88 6 181
3 122 181 6
3 181 122 99
3 99 77 136
3 77 99 122
3 11 77 122
3 6 11 122
3 11 6 117
3 6 19 117
3 19 160 117
3 160 19 28
3 141 160 28
3 139 141 28
3 141 139 133
3 139 67 133
3 67 110 133
3 110 67 9
3 167 140 92
3 140 183 92
3 183 140 46
3 153 167 53
3 167 153 140
3 153 156 140
3 156 46 140
3 46 156 164
3 153 53 8
3 47 153 8
3 153 47 156
3 47 80 156
3 80 164 156
3 164 80 65
3 47 157 80
3 157 70 80
3 70 65 80
3 65 70 114
3 104 114 70
3 114 104 180
3 162 180 15
3 180 104 15
3 104 28 15
3 28 104 120
3 139 28 120
3 177 139 120
3 139 177 67
3 177 138 67
3 138 9 67
3 9 138 14
3 42 167 92
3 167 42 169
3 53 167 169
3 38 53 169
3 53 38 14
3 38 185 14
3 185 9 14
3 9 185 100
3 100 110 9
3 110 100 90
3 100 85 90
3 85 56 90
3 56 85 61
3 130 155 149
3 21 54 130
3 54 25 130
3 25 155 130
3 155 25 188
3 188 29 155
3 29 22 155
3 22 149 155
3 149 22 84
3 134 161 125
3 161 134 102
3 178 137 170
3 137 178 186
3 125 69 170
3 69 178 170
3 178 69 74
3 125 161 76
3 103 125 76
3 125 103 69
3 103 145 69
3 145 74 69
3 74 145 173
3 37 146 109
3 146 123 109
3 123 112 109
3 112 123 107
3 171 112 107
3 59 171 107
3 171 59 23
3 59 52 23
3 52 36 23
3 36 52 126
3 75 98 27
3 64 75 27
3 75 64 150
3 64 174 150
3 174 165 150
3 165 174 72
3 101 7 151
3 7 101 152
3 26 151 17
3 151 26 101
3 26 71 101
3 71 152 101
3 152 71 97
3 17 186 178
3 26 17 178
3 74 26 178
3 26 74 71
3 74 173 71
3 173 97 71
3 97 173 79
3 97 79 174
3 79 72 174
3 72 79 173
3 165 72 173
3 145 165 173
3 165 145 115
3 145 103 115
3 103 44 115
3 44 103 76
3 89 44 76
3 161 89 76
3 89 161 48
3 161 102 48
3 102 96 48
3 96 102 4
3 37 4 102
3 146 37 102
3 134 146 102
3 146 134 123
3 134 142 123
3 142 107 123
3 107 142 93
3 59 107 93
3 73 59 93
3 59 73 52
3 73 189 52
3 189 126 52
3 126 189 119
3 134 125 142
3 125 170 142
3 170 93 142
3 93 170 137
3 73 93 137
3 186 73 137
3 73 186 189
3 186 17 189
3 17 119 189
3 119 17 151
3 70 120 104
3 120 70 157
3 177 120 157
3 132 177 157
3 177 132 138
3 132 8 138
3 8 14 138
3 14 8 53
3 157 8 132
3 8 157 47
3 7 64 27
3 64 7 152
3 97 64 152
3 64 97 174
3 128 143 34
3 143 2 34
3 2 143 86
3 78 175 31
3 81 78 31
3 78 81 49
3 81 40 49
3 40 136 49
3 136 40 108
3 81 31 51
3 187 81 51
3 81 187 40
3 187 43 40
3 43 108 40
3 108 43 50
3 182 175 94
3 175 182 31
3 182 21 31
3 21 51 31
3 51 21 130
3 187 51 130
3 149 187 130
3 187 149 43
3 149 84 43
3 84 50 43
3 50 84 121
3 119 151 7
3 135 119 7
3 119 135 126
3 135 159 126
3 159 36 126
3 36 159 18
3 55 121 131
3 121 55 50
3 55 24 50
3 24 108 50
3 108 24 166
3 136 108 166
3 68 136 166
3 136 68 99
3 68 45 99
3 45 181 99
3 181 45 96
3 88 181 96
3 4 88 96
3 4 37 5
3 37 162 5
3 162 37 109
3 180 162 109
3 112 180 109
3 180 112 114
3 112 171 114
3 171 65 114
3 65 171 23
3 164 65 23
3 36 164 23
3 164 36 46
3 36 18 46
3 18 183 46
3 183 18 159
3 92 183 159
3 135 92 159
3 92 135 42
3 135 7 42
3 7 144 42
3 144 7 13
3 116 13 7
3 13 116 128
3 3 57 66
3 128 57 13
3 57 128 66
3 128 34 66
3 57 3 2
3 86 57 2
3 57 86 13
3 86 168 13
3 168 144 13
3 144 168 106
3 30 144 106
3 144 30 41
3 184 41 30
3 41 184 113
3 62 113 184
3 113 62 82
3 169 42 144
3 41 169 144
3 169 41 38
3 41 113 38
3 113 185 38
3 185 113 82
3 100 185 82
3 62 100 82
3 100 62 85
3 62 184 85
3 184 61 85
3 61 184 30
3 94 148 182
3 148 32 182
3 32 148 56
3 12 32 56
3 61 12 56
3 12 61 33
3 61 30 33
3 30 188 33
3 188 30 106
3 83 7 27
3 7 83 116
3 116 143 128
3 143 116 83
3 168 27 106
3 27 168 83
3 83 86 143
3 86 83 168
3 39 106 27
3 106 39 87
3 172 87 39
3 87 172 35
3 158 35 172
3 35 158 147
3 106 29 188
3 29 106 87
3 22 29 87
3 35 22 87
3 22 35 84
3 35 147 84
3 147 121 84
3 121 147 158
3 131 121 158
3 172 131 158
3 131 172 60
3 172 39 60
3 39 98 60
3 98 39 27
