OFF

247 490 0
-0.486350 -0.349958 -0.097738
-0.486400 -0.343662 -0.097080
0.499742 -0.353308 -0.084388
-0.490887 -0.318251 -0.094343
0.499402 -0.309847 -0.090149
0.499873 -0.370652 -0.060486
0.495142 -0.317894 0.082557
-0.490327 -0.392058 -0.003740
-0.486600 -0.318475 -0.086037
-0.485995 -0.396826 -0.034999
-0.490844 -0.328240 0.075698
-0.486257 -0.361992 -0.094165
0.499615 -0.336875 -0.092917
0.499648 -0.345612 0.078021
-0.486525 -0.327708 -0.095083
-0.490859 -0.326202 0.072427
0.499697 -0.347328 -0.092637
-0.486374 -0.351415 0.074304
-0.486354 -0.353979 0.072445
-0.486643 -0.317133 0.073386
-0.486623 -0.319695 0.071527
-0.486602 -0.322257 0.069668
0.499420 -0.316463 0.073386
0.499379 -0.311341 0.077103
-0.490314 -0.392918 -0.034054
0.499428 -0.313058 -0.093555
-0.486679 -0.312614 0.074786
0.499950 -0.381219 -0.032909
-0.490744 -0.341080 0.079103
-0.486594 -0.318832 -0.098364
0.499364 -0.309420 0.077987
-0.490921 -0.318637 0.081555
-0.490877 -0.319678 -0.089885
0.499968 -0.384288 -0.003536
-0.490862 -0.321659 -0.089153
0.499656 -0.342120 -0.093465
0.499451 -0.320470 0.075902
-0.490713 -0.345137 0.083803
0.495191 -0.323785 0.068906
0.499436 -0.318432 0.072632
-0.486507 -0.334377 0.069992
-0.486476 -0.338736 0.086893
0.495371 -0.342256 -0.097535
-0.490762 -0.334554 -0.083211
0.495650 -0.380293 -0.003638
0.495102 -0.307972 -0.098453
0.499387 -0.307849 -0.094383
0.495609 -0.375819 0.024498
-0.486579 -0.325213 0.068535
-0.490982 -0.310867 0.082886
0.499981 -0.385148 -0.033849
-0.486422 -0.345313 0.075765
0.499551 -0.333310 0.079307
-0.486691 -0.311029 0.074847
-0.490339 -0.391294 0.026576
0.495253 -0.327747 -0.079101
-0.486632 -0.318475 0.072540
0.499408 -0.310482 -0.094139
0.499375 -0.310867 0.081760
0.499418 -0.311908 -0.089681
-0.486428 -0.344988 0.087887
0.495420 -0.348507 -0.096541
-0.486696 -0.310704 0.086969
0.495151 -0.314224 -0.097459
-0.490754 -0.339930 0.082976
0.495133 -0.312261 -0.085285
-0.486579 -0.325596 0.082355
0.499434 -0.313890 -0.088948
-0.490746 -0.336523 -0.083965
-0.490672 -0.350383 0.083256
0.499582 -0.337368 0.084008
0.495233 -0.329134 0.072188
0.495174 -0.317200 -0.096359
0.499534 -0.326785 -0.083006
0.495745 -0.392415 -0.003314
-0.490961 -0.313509 0.082784
0.495066 -0.307989 0.074252
-0.490941 -0.316113 0.082338
0.499313 -0.303098 0.083090
0.495343 -0.343581 0.087431
0.495074 -0.309298 0.086513
-0.490964 -0.313088 0.078766
0.499956 -0.383525 0.026780
-0.490795 -0.330372 -0.083323
0.495276 -0.330702 -0.080234
0.495297 -0.333264 -0.082093
0.495317 -0.335826 -0.083952
-0.490295 -0.396096 -0.003632
0.495276 -0.330704 -0.080234
0.495317 -0.335828 -0.083952
0.495632 -0.377331 -0.031973
0.499541 -0.332161 0.083180
0.495200 -0.325251 0.084517
0.499590 -0.333876 -0.087478
0.499549 -0.328754 -0.083761
0.499623 -0.342613 0.083460
-0.490730 -0.338357 -0.090456
-0.490469 -0.375394 0.052398
0.495274 -0.334484 0.075471
-0.486529 -0.331487 0.068703
-0.490774 -0.337226 0.077384
0.495643 -0.377797 -0.064355
0.499334 -0.305739 0.082988
-0.486071 -0.387996 -0.003841
-0.490369 -0.387421 0.025426
0.499355 -0.308343 0.082542
-0.486112 -0.383522 0.024295
0.499332 -0.305319 0.078970
-0.490848 -0.323306 -0.092843
-0.490843 -0.328300 0.072208
-0.486468 -0.335450 -0.079304
-0.490561 -0.359913 -0.090693
0.500000 -0.388327 -0.003428
0.495144 -0.313665 -0.084545
0.495502 -0.359207 -0.089976
-0.490633 -0.355306 0.081368
-0.486301 -0.356209 -0.096744
-0.486570 -0.321926 -0.097662
0.495233 -0.324923 -0.090894
-0.490902 -0.320899 0.075772
-0.486588 -0.319963 -0.085487
0.495274 -0.330047 -0.094612
0.499386 -0.307741 -0.090344
-0.490810 -0.328446 -0.084182
-0.490802 -0.329293 -0.089230
0.499826 -0.367624 0.052602
0.499565 -0.330587 -0.090252
-0.490830 -0.325644 -0.091611
-0.486488 -0.336836 0.071986
0.495512 -0.364218 0.050517
0.499521 -0.329457 0.077588
0.495699 -0.387444 0.027949
-0.486547 -0.324902 -0.096562
0.495216 -0.322595 -0.093048
-0.490620 -0.356796 0.075338
-0.485976 -0.400117 -0.003516
-0.490902 -0.321037 0.080451
0.499926 -0.379652 0.025630
-0.486655 -0.315692 0.074049
0.499621 -0.337816 -0.088988
-0.486378 -0.351284 0.087229
-0.490799 -0.333949 0.074727
-0.486647 -0.317001 0.086311
-0.490868 -0.325220 0.077758
-0.490733 -0.338231 -0.085204
0.499447 -0.315537 -0.092639
0.495167 -0.320658 0.068409
-0.490889 -0.322525 0.074421
0.499452 -0.320531 0.072412
0.499734 -0.352144 -0.090489
0.495323 -0.340758 0.075639
-0.486444 -0.338404 -0.080436
0.495390 -0.349494 0.085166
0.495054 -0.306474 0.074721
0.495121 -0.315210 0.084248
-0.486424 -0.340967 -0.082295
0.495431 -0.354618 0.081448
0.499662 -0.347537 0.081572
0.495162 -0.320334 0.080530
-0.486444 -0.338406 -0.080436
0.499394 -0.313130 0.075976
-0.486089 -0.385033 -0.032175
-0.486521 -0.332954 0.084314
0.495252 -0.331594 0.074182
0.499465 -0.317874 -0.091407
-0.486447 -0.342186 0.075269
-0.490812 -0.332310 0.073398
-0.486078 -0.385500 -0.064558
0.499394 -0.313268 0.080655
0.499675 -0.349026 0.075543
0.495098 -0.312329 0.085575
-0.490679 -0.349441 0.079326
0.495592 -0.374552 0.056859
0.495050 -0.306172 0.087049
0.499496 -0.326179 0.074931
0.499427 -0.317451 0.077962
-0.490778 -0.332456 -0.082991
0.499563 -0.330461 -0.085000
0.499407 -0.314756 0.074625
0.495121 -0.310773 -0.085835
0.495725 -0.389124 -0.034797
-0.490947 -0.315172 0.078409
0.495464 -0.354289 -0.093963
-0.490809 -0.332810 0.078958
-0.486577 -0.321367 -0.084748
0.495196 -0.320005 -0.094881
-0.486219 -0.366909 -0.090178
0.495347 -0.343713 0.074506
-0.486488 -0.332625 -0.091096
0.495367 -0.346276 0.072647
-0.490530 -0.364010 -0.087372
-0.486447 -0.337749 -0.094814
0.495078 -0.309431 0.073588
0.495098 -0.311992 0.071729
0.495119 -0.314555 0.069870
-0.490847 -0.323530 -0.088167
-0.490443 -0.378837 0.054512
0.499484 -0.324541 0.073602
-0.490712 -0.345246 0.079764
-0.486022 -0.395146 0.027746
-0.486493 -0.332301 -0.078975
-0.486208 -0.371920 0.050315
-0.486505 -0.330298 -0.093251
0.495042 -0.304912 0.074989
0.495321 -0.335959 -0.096877
0.499617 -0.341672 0.079531
0.495127 -0.311130 -0.098161
-0.490775 -0.332723 -0.086581
-0.490394 -0.381973 -0.062616
-0.490599 -0.359575 0.078271
-0.490827 -0.330385 0.072539
-0.490980 -0.310975 0.078847
-0.486554 -0.328360 0.068206
0.499348 -0.307402 0.078613
0.499486 -0.325040 0.079162
-0.486398 -0.348460 0.075437
-0.486331 -0.357196 0.084964
-0.486667 -0.314176 0.074519
-0.486290 -0.362320 0.081245
-0.490647 -0.353381 0.077817
-0.486600 -0.322912 0.084046
-0.486559 -0.328036 0.080327
0.495214 -0.326674 0.070195
0.495245 -0.331034 0.087095
0.499766 -0.356240 -0.087168
0.499448 -0.315761 -0.087963
0.499853 -0.371068 0.054716
-0.486469 -0.339296 0.073979
0.499584 -0.337476 0.079969
0.495142 -0.317510 0.068738
-0.490875 -0.324233 0.073182
-0.490916 -0.319111 0.076899
0.495298 -0.337611 0.075968
0.495030 -0.303327 0.075050
-0.490867 -0.320827 -0.093759
-0.486623 -0.320031 0.085372
-0.490345 -0.388989 -0.033113
0.495089 -0.310773 0.072742
0.499901 -0.374204 -0.062412
-0.486129 -0.382254 0.056657
0.499697 -0.351806 0.078475
0.499469 -0.322615 0.072744
-0.486671 -0.313874 0.086847
0.495293 -0.337286 0.088090
0.499315 -0.303206 0.079051
0.495025 -0.303002 0.087172
-0.490931 -0.317190 0.077783
3 190 208 111
3 208 1 111
3 208 86 1
3 208 89 86
3 1 0 111
3 208 5 89
3 86 155 1
3 155 96 1
3 0 116 111
3 5 2 89
3 2 16 89
3 2 149 16
3 16 139 89
3 16 35 139
3 96 191 1
3 208 161 5
3 208 236 161
3 208 24 236
3 2 224 149
3 155 144 96
3 83 200 123
3 200 184 123
3 200 55 184
3 55 113 184
3 55 73 113
3 73 225 113
3 73 164 225
3 73 118 164
3 118 133 164
3 73 126 118
3 126 121 118
3 3 32 29
3 32 8 29
3 8 179 29
3 179 122 29
3 122 45 29
3 179 4 122
3 179 59 4
3 3 234 32
3 161 90 5
3 90 27 5
3 184 195 123
3 195 124 123
3 124 207 123
3 46 45 122
3 244 245 78
3 244 233 245
3 233 62 245
3 233 53 62
3 53 49 62
3 53 211 49
3 89 85 86
3 88 84 55
3 88 85 84
3 151 159 110
3 155 159 151
3 86 85 155
3 85 88 159
3 155 85 159
3 88 55 110
3 159 88 110
3 110 55 200
3 113 65 120
3 184 113 120
3 65 179 8
3 120 65 8
3 233 203 26
3 53 233 26
3 203 153 217
3 26 203 217
3 153 76 138
3 217 153 138
3 76 192 19
3 138 76 19
3 192 237 56
3 19 192 56
3 237 193 20
3 56 237 20
3 193 194 21
3 20 193 21
3 194 229 48
3 21 194 48
3 229 146 212
3 48 229 212
3 146 38 99
3 212 146 99
3 38 222 40
3 99 38 40
3 222 71 128
3 40 222 128
3 71 163 227
3 128 71 227
3 163 98 165
3 227 163 165
3 98 232 51
3 165 98 51
3 232 150 215
3 51 232 215
3 150 187 17
3 215 150 17
3 187 189 18
3 17 187 18
3 189 129 201
3 18 189 201
3 129 47 106
3 201 129 106
3 47 44 103
3 106 47 103
3 44 90 161
3 103 44 161
3 156 152 216
3 218 156 216
3 152 79 140
3 216 152 140
3 79 243 60
3 140 79 60
3 243 223 41
3 60 243 41
3 223 92 162
3 41 223 162
3 92 158 221
3 162 92 221
3 118 121 191
3 188 118 191
3 121 204 1
3 191 121 1
3 204 42 0
3 1 204 0
3 42 61 116
3 0 42 116
3 61 182 11
3 116 61 11
3 182 114 186
3 11 182 186
3 107 244 78
3 102 107 78
3 213 107 102
3 105 213 102
3 30 213 105
3 58 30 105
3 23 30 58
3 168 23 58
3 160 23 168
3 178 160 168
3 175 178 168
3 22 178 175
3 39 22 175
3 36 39 175
3 148 39 36
3 241 148 36
3 197 241 36
3 174 197 36
3 214 174 36
3 130 174 214
3 52 130 214
3 91 52 214
3 228 52 91
3 70 228 91
3 205 228 70
3 95 205 70
3 13 205 95
3 157 13 95
3 169 13 157
3 240 169 157
3 125 169 240
3 226 125 240
3 137 125 226
3 82 137 226
3 33 137 82
3 112 33 82
3 27 33 112
3 50 27 112
3 5 27 50
3 238 5 50
3 2 5 238
3 224 2 238
3 12 139 35
3 93 139 12
3 126 93 12
3 177 93 126
3 94 177 126
3 73 94 126
3 67 225 164
3 145 67 164
3 59 67 145
3 25 59 145
3 4 59 25
3 57 4 25
3 122 4 57
3 46 122 57
3 82 226 172
3 131 82 172
3 226 240 156
3 172 226 156
3 240 157 152
3 156 240 152
3 157 95 79
3 152 157 79
3 95 70 243
3 79 95 243
3 70 91 223
3 243 70 223
3 91 214 92
3 223 91 92
3 214 36 158
3 92 214 158
3 36 175 6
3 158 36 6
3 175 168 154
3 6 175 154
3 168 58 170
3 154 168 170
3 58 105 80
3 170 58 80
3 105 102 173
3 80 105 173
3 102 78 245
3 173 102 245
3 244 107 203
3 233 244 203
3 107 213 153
3 203 107 153
3 213 30 76
3 153 213 76
3 30 23 192
3 76 30 192
3 23 160 237
3 192 23 237
3 160 178 193
3 237 160 193
3 178 22 194
3 193 178 194
3 22 39 229
3 194 22 229
3 39 148 146
3 229 39 146
3 148 241 38
3 146 148 38
3 241 197 222
3 38 241 222
3 197 174 71
3 222 197 71
3 174 130 163
3 71 174 163
3 130 52 98
3 163 130 98
3 52 228 232
3 98 52 232
3 228 205 150
3 232 228 150
3 205 13 187
3 150 205 187
3 13 169 189
3 187 13 189
3 169 125 129
3 189 169 129
3 125 137 47
3 129 125 47
3 137 33 44
3 47 137 44
3 33 27 90
3 44 33 90
3 139 93 89
3 93 177 85
3 89 93 85
3 177 94 84
3 85 177 84
3 94 73 55
3 84 94 55
3 225 67 65
3 113 225 65
3 67 59 179
3 65 67 179
3 46 57 206
3 45 46 206
3 57 25 63
3 206 57 63
3 25 145 72
3 63 25 72
3 145 164 185
3 72 145 185
3 185 164 133
3 126 12 204
3 121 126 204
3 12 35 42
3 204 12 42
3 35 16 61
3 42 35 61
3 16 149 182
3 61 16 182
3 149 224 114
3 182 149 114
3 224 238 101
3 114 224 101
3 238 50 180
3 101 238 180
3 50 112 74
3 180 50 74
3 112 82 131
3 74 112 131
3 158 6 66
3 221 158 66
3 6 154 220
3 66 6 220
3 154 170 235
3 220 154 235
3 170 80 142
3 235 170 142
3 80 173 242
3 142 80 242
3 173 245 62
3 242 173 62
3 45 206 29
3 206 63 117
3 29 206 117
3 63 72 132
3 117 63 132
3 72 185 14
3 132 72 14
3 185 133 202
3 14 185 202
3 133 118 188
3 202 133 188
3 199 239 196
3 54 199 196
3 239 218 209
3 196 239 209
3 218 216 115
3 209 218 115
3 216 140 69
3 115 216 69
3 140 60 37
3 69 140 37
3 60 41 64
3 37 60 64
3 41 162 183
3 64 41 183
3 162 221 10
3 183 162 10
3 221 66 143
3 10 221 143
3 66 220 136
3 143 66 136
3 220 235 31
3 136 220 31
3 235 142 77
3 31 235 77
3 142 242 75
3 77 142 75
3 242 62 49
3 75 242 49
3 53 26 81
3 211 53 81
3 26 217 181
3 81 26 181
3 217 138 246
3 181 217 246
3 138 19 231
3 246 138 231
3 19 56 119
3 231 19 119
3 56 20 147
3 119 56 147
3 20 21 230
3 147 20 230
3 21 48 15
3 230 21 15
3 48 212 109
3 15 48 109
3 212 99 210
3 109 212 210
3 99 40 166
3 210 99 166
3 40 128 141
3 166 40 141
3 128 227 100
3 141 128 100
3 227 165 28
3 100 227 28
3 165 51 198
3 28 165 198
3 51 215 171
3 198 51 171
3 215 17 219
3 171 215 219
3 17 18 134
3 219 17 134
3 18 201 97
3 134 18 97
3 201 106 104
3 97 201 104
3 106 103 7
3 104 106 7
3 103 161 236
3 7 103 236
3 155 151 68
3 144 155 68
3 151 110 43
3 68 151 43
3 110 200 176
3 43 110 176
3 176 200 83
3 184 120 34
3 195 184 34
3 120 8 32
3 34 120 32
3 29 117 234
3 3 29 234
3 117 132 108
3 234 117 108
3 132 14 127
3 108 132 127
3 14 202 124
3 127 14 124
3 202 188 207
3 124 202 207
3 188 191 96
3 207 188 96
3 116 11 111
3 11 186 190
3 111 11 190
3 186 167 208
3 190 186 208
3 167 9 24
3 208 167 24
3 9 135 87
3 24 9 87
3 135 199 54
3 87 135 54
3 81 49 211
3 75 49 81
3 181 75 81
3 77 75 181
3 246 77 181
3 31 77 246
3 231 31 246
3 136 31 231
3 119 136 231
3 147 136 119
3 143 136 147
3 230 143 147
3 15 143 230
3 10 143 15
3 109 10 15
3 210 10 109
3 166 10 210
3 141 10 166
3 183 10 141
3 100 183 141
3 28 183 100
3 64 183 28
3 198 64 28
3 37 64 198
3 171 37 198
3 69 37 171
3 219 69 171
3 115 69 219
3 134 115 219
3 209 115 134
3 97 209 134
3 196 209 97
3 104 196 97
3 54 196 104
3 7 54 104
3 87 54 7
3 236 87 7
3 24 87 236
3 68 96 144
3 43 96 68
3 207 96 43
3 176 207 43
3 83 207 176
3 123 207 83
3 127 124 195
3 34 127 195
3 108 127 34
3 32 108 34
3 234 108 32
3 131 172 239
3 199 131 239
3 172 156 218
3 239 172 218
3 114 101 167
3 186 114 167
3 101 180 9
3 167 101 9
3 180 74 135
3 9 180 135
3 74 131 199
3 135 74 199
