OFF

13 22 0
0.393213 -0.143469 -0.166476
0.428610 -0.000241 -0.166684
0.452167 -0.047983 -0.166616
0.462656 -0.095725 -0.166548
0.497378 -0.000241 -0.166687
0.497377 -0.143467 -0.166481
0.445295 -0.143468 -0.166478
0.432275 -0.036048 -0.166633
0.458315 -0.107661 -0.166531
0.445295 -0.000241 -0.166685
0.471336 -0.071854 -0.166583
0.484357 -0.036047 -0.166635
0.497377 -0.071854 -0.166584
3 0 7 1
3 7 9 1
3 9 4 1
3 1 2 0
3 0 8 7
3 8 10 7
3 2 3 0
3 5 6 3
3 3 2 12
3 11 10 4
3 12 2 4
3 6 0 3
3 1 4 2
3 5 3 12
3 11 9 10
3 11 4 9
3 12 10 5
3 12 4 10
3 8 5 10
3 7 10 9
3 6 8 0
3 6 5 8
