OFF

435 866 0
-0.003623 -0.110879 -0.017650
-0.016388 -0.097095 -0.000552
-0.017370 -0.090676 0.000294
0.019377 -0.082343 0.001020
0.009109 -0.082698 0.001382
0.012040 -0.074022 -0.009255
0.010358 -0.061055 -0.006564
-0.014440 -0.063079 -0.001038
-0.000855 0.021918 0.019293
-0.004144 0.085428 0.020776
-0.004942 0.085913 0.019437
-0.008169 0.086084 0.018613
0.003361 -0.041753 0.019492
-0.010005 0.085956 0.018853
0.018854 -0.126556 0.008986
-0.000440 -0.174218 -0.003474
0.007340 -0.181766 -0.002921
0.013908 -0.077168 0.016457
-0.006374 0.086150 0.018856
-0.004943 -0.132806 -0.001807
0.011182 -0.052237 0.014896
-0.006313 -0.161342 0.001943
0.001615 -0.053440 0.020367
-0.017958 -0.084589 0.001100
0.006792 -0.151308 -0.001867
-0.009436 0.022222 0.013249
0.012859 -0.117704 -0.003029
-0.003461 -0.117411 0.018996
0.019689 -0.141105 -0.001426
-0.016197 -0.064194 0.007049
-0.018094 -0.085248 0.006265
-0.010632 -0.122802 0.014127
-0.011661 -0.028864 0.007193
-0.004385 -0.087020 0.020418
-0.011110 0.053358 0.017936
-0.003136 -0.142247 -0.002049
0.000492 -0.017576 0.019100
0.019497 -0.115201 0.009329
0.004575 -0.181779 -0.003993
-0.015309 -0.113820 0.004477
-0.009270 -0.152366 -0.000296
0.002335 -0.114391 0.020272
0.019569 -0.141341 0.000395
0.010463 -0.040552 0.012990
-0.013714 -0.133648 0.001145
0.005691 -0.016301 0.011201
0.010698 -0.040221 0.010464
0.006177 -0.181888 -0.002451
0.000676 -0.078510 0.021479
0.015189 -0.164903 -0.001472
-0.011000 -0.017208 0.011314
0.006085 -0.064671 0.020270
-0.002496 -0.144246 0.014056
-0.004447 -0.114798 0.017773
0.014692 -0.110230 -0.014088
-0.003435 -0.129009 0.017075
-0.009567 -0.002714 0.013645
-0.006843 0.022672 0.010787
-0.010742 -0.114463 0.015295
0.003728 -0.134785 0.017547
0.000394 0.022401 0.015997
-0.007682 -0.117438 0.017425
-0.008158 -0.003044 0.016858
-0.009531 -0.110636 0.016766
0.015762 -0.062472 0.006954
-0.008893 -0.017845 0.017249
0.018688 -0.083995 0.010024
-0.009116 -0.053746 0.018241
-0.013696 -0.041380 0.009303
-0.015728 -0.110903 0.004882
0.011008 -0.039904 0.008088
0.012373 -0.121861 0.016425
-0.001426 -0.132613 -0.001842
0.001234 -0.002541 0.016850
0.000297 -0.015667 0.003891
-0.002155 -0.109722 0.000332
0.003269 -0.129050 0.018346
-0.008381 0.022484 0.011625
-0.015946 -0.092213 0.011174
-0.005757 -0.017907 0.019068
-0.003581 0.084917 0.023169
0.020880 -0.117513 -0.003044
-0.009779 0.084219 0.027019
0.008013 -0.041173 0.016866
0.001183 -0.089647 0.000959
0.008454 -0.132089 -0.001808
-0.012357 -0.128238 0.009088
0.006116 -0.181497 -0.005575
-0.000368 -0.174280 -0.002953
-0.015157 -0.076274 -0.002936
0.012532 -0.158689 -0.011085
-0.003781 -0.092832 0.020290
0.014864 -0.141295 -0.001962
-0.002104 -0.110521 0.019949
-0.005941 -0.153319 0.008663
-0.001228 -0.001406 0.006821
-0.014369 -0.127201 0.002864
0.006710 -0.098238 0.020182
0.007719 -0.181606 -0.004033
0.003477 -0.132343 -0.001900
-0.015147 -0.098414 0.012319
0.014462 -0.164331 -0.006313
0.002151 -0.151559 -0.001843
0.005346 -0.166524 0.007194
-0.017679 -0.091251 0.003771
-0.015014 -0.110520 0.009730
0.007381 -0.124950 -0.002912
-0.003391 -0.083406 0.001691
-0.009748 -0.002559 0.012342
0.006915 -0.110037 0.019937
-0.007989 -0.109923 -0.000551
0.020242 -0.125774 0.005275
0.004537 -0.181795 -0.003882
0.005458 -0.016538 0.012982
0.009529 -0.113754 0.018269
0.007793 -0.181621 -0.003883
-0.000693 -0.118274 -0.003312
0.011794 -0.173928 -0.001533
-0.005969 -0.039404 -0.003067
0.001275 -0.164356 -0.011700
0.001608 -0.096237 0.000279
-0.016491 -0.078090 0.010880
0.004611 -0.181810 -0.003732
0.004652 -0.181700 -0.004588
0.019518 -0.110799 -0.006583
-0.009825 0.021780 0.016591
0.002415 -0.110248 0.020645
0.015240 -0.152177 0.008600
0.005141 -0.082942 0.001636
0.020885 -0.118546 0.001358
0.010325 -0.174273 0.000570
-0.009261 -0.152546 -0.003605
0.004161 -0.144022 0.015097
-0.001264 -0.125414 -0.002896
0.004012 -0.141861 -0.002082
0.019772 -0.140885 -0.003136
-0.013803 -0.041240 0.008149
0.021318 -0.112684 0.002478
0.000472 0.022481 0.015403
-0.010529 -0.017611 0.014703
0.006751 -0.109239 0.000281
-0.008391 -0.016288 0.005135
0.005466 -0.181911 -0.002570
-0.011570 -0.098660 0.015779
0.020903 -0.115453 -0.001349
0.018356 -0.150673 -0.002000
-0.002838 0.022885 0.010793
-0.011814 -0.142587 -0.003037
0.002673 -0.001977 0.013000
0.019255 -0.141799 0.003886
-0.004717 -0.165875 -0.002211
0.020245 -0.110581 0.008103
0.011795 -0.173623 -0.003005
-0.003849 0.084710 0.024691
-0.005869 -0.001658 0.006845
-0.006327 -0.110596 0.018749
0.014158 -0.109360 0.016692
0.009465 -0.166215 0.006496
0.021106 -0.131317 -0.002561
0.000354 0.022338 0.016480
0.000531 -0.142084 -0.001786
-0.001233 0.022870 0.011592
0.002226 -0.109442 -0.000029
0.017990 -0.075810 0.007430
0.010236 -0.128508 0.017010
0.005758 -0.174844 0.002216
-0.012162 -0.065218 0.016871
-0.001202 -0.153443 0.011652
0.002789 -0.001882 0.012294
0.007683 -0.181528 -0.004665
0.010461 -0.151051 -0.002346
0.016119 -0.142802 0.010506
0.015617 -0.159096 -0.006552
0.015919 -0.062267 0.005394
0.019741 -0.083216 0.006198
0.011972 -0.131896 -0.001844
0.002937 -0.038921 -0.003118
0.006624 -0.092271 0.020256
-0.009602 -0.002636 0.013013
-0.014110 -0.133213 -0.002466
0.005630 -0.172770 -0.009535
-0.002733 -0.015792 0.003598
0.006327 -0.073939 -0.012329
-0.002654 -0.017797 0.019512
-0.005872 -0.061581 -0.009271
-0.006632 -0.160875 -0.001890
0.005636 -0.089429 0.001120
-0.014256 -0.086392 0.014108
-0.015451 -0.113602 0.002691
-0.000293 -0.061211 -0.009842
0.015103 -0.165218 0.000981
-0.010820 -0.017410 0.012989
0.015735 -0.090979 0.014831
0.018438 -0.150452 -0.003709
-0.014683 -0.116640 0.005294
-0.007820 -0.001881 0.007790
-0.005802 -0.015980 0.003787
0.005265 -0.016760 0.014654
0.015000 -0.097228 0.015699
0.019444 -0.112414 0.004280
0.000869 -0.083056 0.001679
0.005500 -0.016428 0.012128
-0.004783 0.022803 0.010623
-0.010661 -0.042179 0.016920
0.019841 -0.089676 0.007196
-0.018431 -0.084688 0.003577
-0.008713 -0.115349 -0.014725
-0.015228 -0.120499 0.001517
0.004945 -0.181900 -0.002874
-0.011928 -0.117364 0.014092
0.007753 -0.181684 -0.003401
0.017995 -0.108874 0.013522
-0.015346 -0.119466 -0.002923
0.018633 -0.090354 0.011108
0.018185 -0.075588 0.005759
0.000713 -0.001418 0.007735
0.006655 -0.086421 0.020354
0.003114 -0.125182 -0.002885
0.004584 -0.015936 0.007843
-0.003752 -0.135034 0.016350
0.006852 -0.181834 -0.002592
-0.015069 -0.126637 -0.000958
0.011160 -0.141474 -0.002115
0.015489 -0.131703 -0.001879
-0.008751 0.021493 0.019317
0.020873 -0.131554 -0.000779
0.013692 -0.160745 0.005696
0.009827 -0.161270 0.008218
0.007466 -0.113381 -0.017766
0.016165 -0.074591 -0.003000
-0.007832 -0.144097 0.010615
0.001471 -0.173141 -0.008354
0.018147 -0.151317 0.003017
0.007717 -0.181653 -0.003661
0.001194 -0.166661 0.006516
-0.005295 -0.151933 -0.002037
-0.012289 0.164088 0.033787
0.003606 -0.017184 0.017312
-0.010044 0.021918 0.015399
0.016570 -0.159619 -0.002006
0.020753 -0.131790 0.001041
0.002014 -0.001608 0.009795
-0.017322 -0.077284 0.004141
-0.009517 -0.111708 -0.013587
0.008672 -0.115399 0.018624
-0.001440 -0.151690 -0.002330
-0.013226 -0.041829 0.013063
-0.008232 -0.096698 -0.000239
0.004474 -0.151363 -0.002412
0.019565 -0.108662 0.009665
-0.013812 -0.127595 0.005272
-0.006916 -0.142459 -0.001979
0.020156 -0.089218 0.003704
0.004594 -0.153258 0.012646
-0.014181 -0.121647 0.007269
0.010549 -0.152821 0.011708
-0.009337 -0.152163 -0.001933
-0.009796 -0.039867 -0.001027
0.012556 -0.108819 -0.000584
-0.006416 -0.161108 0.000047
-0.001092 -0.002831 0.018163
0.011030 -0.134240 0.016327
-0.009273 -0.002868 0.014987
-0.011209 -0.143443 0.003997
0.017602 -0.076252 0.010772
0.013851 -0.061567 -0.001023
-0.003122 -0.089895 0.001098
0.005442 -0.181551 -0.005433
0.002674 -0.118099 -0.003274
0.008892 -0.122343 0.017822
-0.006317 -0.078738 0.020324
0.007049 -0.052922 0.018568
0.016524 -0.159870 -0.000036
0.018267 -0.075368 0.004050
-0.003951 -0.165319 -0.006292
-0.006317 -0.125701 -0.002766
0.002915 -0.117573 0.020137
-0.007835 -0.090084 0.000600
0.000283 -0.161791 0.008300
-0.009022 -0.152771 0.003015
-0.006301 -0.065331 0.020244
-0.007312 -0.118788 -0.002991
-0.013328 -0.110558 0.013586
0.002403 -0.002231 0.014893
0.015697 -0.126996 0.014922
0.020474 -0.132279 0.004794
0.021175 -0.125035 -0.001124
-0.003598 -0.161674 0.005728
0.002874 -0.015687 0.005147
-0.001501 -0.164698 -0.010170
0.005245 -0.164065 -0.012326
0.006023 -0.096035 0.000551
-0.012074 -0.126128 -0.002770
-0.013103 -0.053465 0.014330
0.001382 -0.092638 0.020942
-0.011633 -0.142789 -0.001362
-0.000154 0.022725 0.013202
0.016319 -0.084747 0.014035
-0.015100 -0.114241 0.007900
0.012689 -0.050812 0.004241
0.001730 -0.098586 0.020833
-0.007394 0.054379 0.014738
0.018974 -0.120493 0.010281
0.009059 -0.163932 -0.011763
0.018239 -0.124502 -0.002807
-0.000295 -0.174342 -0.002432
0.011834 -0.173560 -0.003488
0.006783 -0.038960 -0.001179
-0.009972 0.021856 0.015920
-0.014245 -0.112516 -0.006345
0.016603 -0.159744 -0.001001
-0.009957 -0.086897 0.018029
0.001195 -0.174758 0.000544
0.018421 -0.096614 0.012280
0.010790 -0.143531 0.014018
0.010854 -0.040063 0.009276
0.008166 -0.110242 -0.017706
0.019373 -0.084182 0.003280
0.010203 -0.089116 0.000575
-0.003503 0.084996 0.022575
-0.002737 -0.159503 -0.011104
-0.013098 -0.122216 0.010337
-0.001836 0.053954 0.018090
0.015293 -0.063088 0.011633
0.004610 -0.181857 -0.003360
-0.015586 -0.113501 0.000890
-0.013515 -0.041534 0.010606
-0.002996 -0.096519 0.000562
0.016998 -0.133427 0.012414
0.009172 -0.158629 -0.012980
-0.003792 -0.053715 0.020251
0.006648 -0.049988 -0.004841
0.007567 -0.078000 0.020365
-0.002563 -0.113923 -0.017728
0.016575 -0.121332 0.014018
0.001039 -0.086808 0.021035
-0.008461 -0.132998 -0.001771
-0.008408 -0.128817 0.014396
-0.003170 -0.098762 0.020147
-0.005676 -0.160238 -0.006527
0.008268 -0.174662 0.001834
-0.003620 0.084854 0.023652
-0.002090 -0.166569 0.004398
0.020490 -0.111565 0.000841
-0.010891 -0.017301 0.012097
0.006827 -0.181474 -0.005455
-0.014221 -0.117020 0.009441
0.019896 -0.114782 0.005228
-0.013855 -0.133430 -0.000641
0.000527 -0.159094 -0.012964
-0.004649 -0.166078 -0.000574
-0.004609 -0.165968 -0.001430
0.017838 -0.113651 -0.007443
0.003484 -0.029469 0.018402
-0.001552 -0.039108 -0.003539
0.015605 -0.062678 0.008514
0.016366 -0.160122 0.001896
-0.011492 -0.143007 0.000425
0.012469 -0.124694 -0.002782
0.015147 -0.165013 -0.000617
-0.017357 -0.091671 0.007232
-0.009265 0.052856 0.023168
-0.003549 -0.001508 0.006647
-0.006070 -0.042273 0.019611
-0.016415 -0.064008 0.005484
-0.009685 -0.134860 0.012454
0.019904 -0.096152 0.008303
0.010962 -0.109667 0.018717
0.003161 -0.122825 0.019209
0.003253 -0.174933 0.001854
-0.001283 -0.042098 0.020259
0.006192 -0.117906 -0.003311
-0.015980 -0.064380 0.008612
0.009853 -0.172695 -0.008336
0.016163 -0.113075 0.015703
-0.015355 -0.116146 -0.000804
0.007529 -0.141715 -0.001746
0.005168 -0.060983 -0.009335
-0.015545 -0.064752 0.011740
-0.006623 0.021468 0.020418
-0.014121 -0.052159 0.003556
0.011433 -0.097766 0.018448
-0.013356 -0.134098 0.004867
0.002596 -0.002057 0.013593
-0.004716 0.021534 0.020700
-0.016963 -0.077688 0.007492
-0.005732 -0.003082 0.018186
-0.008973 -0.092853 0.018262
0.011428 -0.173149 -0.005969
-0.003339 -0.002995 0.018510
0.012086 -0.085715 0.018012
-0.007432 -0.083588 0.001423
0.018311 -0.150877 -0.000401
0.021102 -0.125170 0.002749
-0.017142 -0.077486 0.005816
-0.004470 -0.166280 0.001100
-0.016658 -0.098109 0.008309
-0.013266 -0.115169 -0.007659
-0.016789 -0.085909 0.010154
0.011896 -0.163981 -0.010171
0.017262 -0.115796 0.014041
-0.011454 0.085565 0.019439
-0.010087 -0.016729 0.007904
-0.006562 -0.160984 -0.000996
0.008135 -0.172681 -0.009173
-0.002896 -0.122981 0.017878
0.014390 -0.150870 -0.002117
-0.009680 0.021656 0.017634
0.005033 -0.161633 0.009058
-0.008988 -0.002191 0.009748
-0.000256 -0.174585 -0.001442
0.004992 -0.181602 -0.005215
0.019912 -0.119810 0.007161
0.007275 -0.181469 -0.005301
-0.012152 0.085002 0.020762
0.015229 -0.164793 -0.002326
-0.000131 -0.065126 0.021241
0.000013 -0.173767 -0.005909
0.000200 0.022180 0.017668
0.012731 -0.165759 0.004264
0.009459 -0.039356 0.003089
-0.014387 -0.110223 -0.000881
-0.007990 -0.098811 0.018495
0.011755 -0.173686 -0.002522
-0.017014 -0.097611 0.004215
0.011901 -0.063922 0.016802
-0.006541 -0.123449 0.017198
0.013171 -0.113393 -0.014305
0.013087 -0.116333 0.017467
0.003121 -0.172952 -0.009153
0.011722 -0.091733 0.018156
-0.012662 -0.078599 0.016536
-0.007834 -0.050724 -0.005149
-0.012321 -0.040519 0.003072
-0.012969 -0.092527 0.014924
3 137 249 343
3 249 258 343
3 249 366 258
3 366 252 258
3 252 3 258
3 258 124 343
3 3 318 258
3 318 291 258
3 3 4 318
3 318 186 291
3 82 414 236
3 414 401 236
3 236 153 82
3 153 8 82
3 8 384 82
3 82 34 414
3 82 224 34
3 224 407 34
3 407 125 34
3 125 308 34
3 308 238 34
3 384 379 82
3 34 25 414
3 333 228 0
3 228 316 0
3 316 162 0
3 162 75 0
3 333 268 228
3 268 371 228
3 110 1 421
3 110 247 1
3 247 2 1
3 247 23 2
3 247 277 23
3 1 424 421
3 229 4 3
3 229 5 4
3 5 182 4
3 182 128 4
3 182 200 128
3 182 107 200
3 182 391 107
3 182 89 391
3 182 184 89
3 182 189 184
3 184 7 89
3 229 6 5
3 229 265 6
3 184 432 7
3 432 257 7
3 257 433 7
3 265 307 6
3 265 420 307
3 401 13 236
3 13 11 236
3 11 18 236
3 18 10 236
3 8 260 384
3 260 389 384
3 10 9 236
3 9 319 236
3 236 341 153
3 319 80 236
3 349 339 320
3 349 102 339
3 349 248 102
3 349 329 248
3 329 90 248
3 90 172 248
3 172 24 248
3 102 245 339
3 172 170 24
3 245 235 339
3 349 290 329
3 290 303 329
3 135 92 193
3 135 158 92
3 158 223 92
3 416 12 22
3 353 12 237
3 50 32 433
3 9 322 138
3 202 13 301
3 224 82 361
3 208 142 47
3 38 112 122
3 233 122 47
3 123 87 267
3 87 122 233
3 87 233 169
3 345 87 169
3 233 115 98
3 411 123 267
3 87 123 122
3 98 169 233
3 413 345 169
3 47 16 233
3 47 122 208
3 324 208 122
3 38 122 123
3 233 16 210
3 220 16 47
3 20 425 43
3 271 51 83
3 166 363 67
3 331 6 176
3 380 7 136
3 173 420 299
3 184 257 432
3 293 378 203
3 330 280 370
3 80 341 236
3 361 379 224
3 361 82 379
3 34 238 25
3 25 77 414
3 77 401 414
3 77 57 401
3 57 13 401
3 301 57 202
3 301 13 57
3 202 11 13
3 202 146 11
3 146 18 11
3 146 161 18
3 161 10 18
3 161 296 10
3 296 9 10
3 322 296 138
3 322 9 296
3 138 319 9
3 138 60 319
3 60 80 319
3 60 159 80
3 159 341 80
3 159 418 341
3 418 153 341
3 418 8 153
3 389 386 384
3 386 379 384
3 386 62 379
3 62 224 379
3 62 262 224
3 262 407 224
3 262 56 407
3 56 125 407
3 56 178 125
3 178 308 125
3 178 108 308
3 108 238 308
3 108 409 238
3 409 25 238
3 409 195 25
3 195 77 25
3 195 154 77
3 154 57 77
3 154 362 57
3 362 202 57
3 362 95 202
3 95 146 202
3 95 215 146
3 215 161 146
3 215 241 161
3 241 296 161
3 241 168 296
3 168 138 296
3 168 148 138
3 148 60 138
3 148 383 60
3 383 159 60
3 383 283 159
3 283 418 159
3 283 73 418
3 73 8 418
3 73 260 8
3 183 79 389
3 79 386 389
3 79 65 386
3 65 62 386
3 65 139 62
3 139 262 62
3 139 191 262
3 191 56 262
3 191 344 56
3 344 178 56
3 344 50 178
3 50 108 178
3 50 402 108
3 402 409 108
3 402 141 409
3 141 195 409
3 141 196 195
3 196 154 195
3 196 181 154
3 181 362 154
3 181 74 362
3 74 95 362
3 74 288 95
3 288 215 95
3 288 218 215
3 218 241 215
3 218 45 241
3 45 168 241
3 45 201 168
3 201 148 168
3 201 113 148
3 113 383 148
3 113 197 383
3 197 283 383
3 197 237 283
3 237 73 283
3 237 36 73
3 36 260 73
3 36 183 260
3 183 389 260
3 370 363 183
3 363 79 183
3 363 203 79
3 203 65 79
3 203 246 65
3 246 139 65
3 246 326 139
3 326 191 139
3 326 68 191
3 68 344 191
3 68 136 344
3 136 50 344
3 32 136 433
3 32 50 136
3 433 402 50
3 433 257 402
3 257 141 402
3 257 118 141
3 118 196 141
3 118 354 196
3 354 181 196
3 354 176 181
3 176 74 181
3 176 307 74
3 307 288 74
3 307 420 288
3 420 218 288
3 420 70 218
3 70 45 218
3 70 315 45
3 315 201 45
3 315 46 201
3 46 113 201
3 46 43 113
3 43 197 113
3 43 83 197
3 83 237 197
3 353 83 12
3 353 237 83
3 12 36 237
3 12 370 36
3 370 183 36
3 330 416 280
3 330 370 416
3 280 363 370
3 67 280 166
3 67 363 280
3 166 203 363
3 293 166 378
3 293 203 166
3 378 246 203
3 378 372 246
3 372 326 246
3 372 29 326
3 29 68 326
3 29 364 68
3 364 136 68
3 380 364 7
3 380 136 364
3 7 433 136
3 184 118 257
3 184 189 118
3 189 354 118
3 189 377 354
3 377 176 354
3 331 377 6
3 331 176 377
3 6 307 176
3 299 265 173
3 299 420 265
3 173 70 420
3 173 64 70
3 64 315 70
3 64 355 315
3 355 46 315
3 355 323 46
3 323 43 46
3 20 323 425
3 20 43 323
3 425 83 43
3 271 425 51
3 271 83 425
3 51 12 83
3 22 51 416
3 22 12 51
3 416 370 12
3 48 270 416
3 270 280 416
3 270 431 280
3 431 166 280
3 431 121 166
3 121 378 166
3 121 385 378
3 385 372 378
3 385 394 372
3 394 29 372
3 394 242 29
3 242 364 29
3 242 89 364
3 89 7 364
3 182 377 189
3 182 5 377
3 5 6 377
3 229 273 265
3 273 173 265
3 273 214 173
3 214 64 173
3 214 163 64
3 163 355 64
3 163 264 355
3 264 323 355
3 264 17 323
3 17 425 323
3 17 332 425
3 332 51 425
3 332 48 51
3 48 416 51
3 335 33 48
3 33 270 48
3 33 311 270
3 311 431 270
3 311 187 431
3 187 121 431
3 187 398 121
3 398 385 121
3 398 30 385
3 30 394 385
3 30 205 394
3 205 242 394
3 205 23 242
3 23 89 242
3 23 391 89
3 3 317 229
3 317 273 229
3 317 174 273
3 174 214 273
3 174 66 214
3 66 163 214
3 66 297 163
3 297 264 163
3 297 390 264
3 390 17 264
3 390 216 17
3 216 332 17
3 216 335 332
3 335 48 332
3 294 91 335
3 91 33 335
3 91 387 33
3 387 311 33
3 387 434 311
3 434 187 311
3 434 78 187
3 78 398 187
3 78 360 398
3 360 30 398
3 360 104 30
3 104 205 30
3 104 2 205
3 2 23 205
3 277 391 23
3 277 266 391
3 266 107 391
3 266 84 107
3 84 200 107
3 84 186 200
3 186 128 200
3 186 318 128
3 318 4 128
3 252 317 3
3 252 204 317
3 204 174 317
3 204 213 174
3 213 66 174
3 213 192 66
3 192 297 66
3 192 430 297
3 430 390 297
3 430 177 390
3 177 216 390
3 177 294 216
3 294 335 216
3 300 338 294
3 338 91 294
3 338 422 91
3 422 387 91
3 422 143 387
3 143 434 387
3 143 100 434
3 100 78 434
3 100 396 78
3 396 360 78
3 396 424 360
3 424 104 360
3 424 1 104
3 1 2 104
3 247 327 277
3 327 266 277
3 327 120 266
3 120 84 266
3 120 291 84
3 291 186 84
3 366 204 252
3 366 313 204
3 313 213 204
3 313 198 213
3 198 192 213
3 198 381 192
3 381 430 192
3 381 97 430
3 97 177 430
3 97 300 177
3 300 294 177
3 126 93 300
3 93 338 300
3 93 155 338
3 155 422 338
3 155 63 422
3 63 143 422
3 63 282 143
3 282 100 143
3 282 105 100
3 105 396 100
3 105 69 396
3 69 424 396
3 69 421 424
3 110 75 247
3 75 327 247
3 75 162 327
3 162 120 327
3 162 140 120
3 140 291 120
3 140 258 291
3 249 211 366
3 211 313 366
3 211 156 313
3 156 198 313
3 156 367 198
3 367 381 198
3 367 109 381
3 109 97 381
3 109 126 97
3 126 300 97
3 41 53 126
3 53 93 126
3 53 58 93
3 58 155 93
3 58 298 155
3 298 63 155
3 298 39 63
3 39 282 63
3 39 188 282
3 188 105 282
3 188 325 105
3 325 69 105
3 325 309 69
3 309 421 69
3 309 243 421
3 243 110 421
3 243 0 110
3 0 75 110
3 316 140 162
3 316 54 140
3 54 258 140
3 54 124 258
3 137 199 249
3 199 211 249
3 199 151 211
3 151 156 211
3 151 374 156
3 374 367 156
3 374 114 367
3 114 109 367
3 114 41 109
3 41 126 109
3 276 27 41
3 27 53 41
3 27 61 53
3 61 58 53
3 61 209 58
3 209 298 58
3 209 346 298
3 346 39 298
3 346 194 39
3 194 188 39
3 194 375 188
3 375 325 188
3 375 397 325
3 397 309 325
3 397 206 309
3 206 243 309
3 206 333 243
3 333 0 243
3 228 427 316
3 427 54 316
3 427 352 54
3 352 124 54
3 352 144 124
3 144 343 124
3 144 347 343
3 347 137 343
3 347 37 137
3 37 199 137
3 37 400 199
3 400 151 199
3 400 428 151
3 428 374 151
3 428 244 374
3 244 114 374
3 244 276 114
3 276 41 114
3 368 405 276
3 405 27 276
3 405 426 27
3 426 61 27
3 426 31 61
3 31 209 61
3 31 321 209
3 321 346 209
3 321 254 346
3 254 194 346
3 254 207 194
3 207 375 194
3 207 212 375
3 212 397 375
3 212 281 397
3 281 206 397
3 281 116 206
3 116 333 206
3 116 268 333
3 371 26 228
3 26 427 228
3 26 81 427
3 81 352 427
3 81 129 352
3 129 144 352
3 129 412 144
3 412 347 144
3 412 302 347
3 302 37 347
3 302 334 37
3 334 400 37
3 334 71 400
3 71 428 400
3 71 269 428
3 269 244 428
3 269 368 244
3 368 276 244
3 76 55 368
3 55 405 368
3 55 337 405
3 337 426 405
3 337 86 426
3 86 31 426
3 86 250 31
3 250 321 31
3 250 96 321
3 96 254 321
3 96 221 254
3 221 207 254
3 221 292 207
3 292 212 207
3 292 275 212
3 275 281 212
3 275 133 281
3 133 116 281
3 133 217 116
3 217 268 116
3 217 106 268
3 106 371 268
3 106 358 371
3 358 26 371
3 358 304 26
3 304 81 26
3 304 286 81
3 286 129 81
3 286 393 129
3 393 412 129
3 393 111 412
3 111 302 412
3 111 14 302
3 14 334 302
3 14 284 334
3 284 71 334
3 284 164 71
3 164 269 71
3 164 76 269
3 76 368 269
3 59 219 76
3 219 55 76
3 219 365 55
3 365 337 55
3 365 382 337
3 382 86 337
3 382 44 86
3 44 250 86
3 44 348 250
3 348 96 250
3 348 179 96
3 179 221 96
3 179 336 221
3 336 292 221
3 336 19 292
3 19 275 292
3 19 72 275
3 72 133 275
3 72 99 133
3 99 217 133
3 99 85 217
3 85 106 217
3 85 175 106
3 175 358 106
3 175 223 358
3 223 304 358
3 223 158 304
3 158 286 304
3 158 225 286
3 225 393 286
3 225 240 393
3 240 111 393
3 240 285 111
3 285 14 111
3 285 328 14
3 328 284 14
3 328 261 284
3 261 164 284
3 261 59 164
3 59 76 164
3 132 52 59
3 52 219 59
3 52 230 219
3 230 365 219
3 230 263 365
3 263 382 365
3 263 357 382
3 357 44 382
3 357 295 44
3 295 348 44
3 295 147 348
3 147 179 348
3 147 251 179
3 251 336 179
3 251 35 336
3 35 19 336
3 35 160 19
3 160 72 19
3 160 134 72
3 134 99 72
3 134 376 99
3 376 85 99
3 376 222 85
3 222 175 85
3 222 92 175
3 92 223 175
3 135 28 158
3 28 225 158
3 28 42 225
3 42 240 225
3 42 149 240
3 149 285 240
3 149 171 285
3 171 328 285
3 171 314 328
3 314 261 328
3 314 132 261
3 132 59 261
3 253 167 132
3 167 52 132
3 167 94 52
3 94 230 52
3 94 279 230
3 279 263 230
3 279 40 263
3 40 357 263
3 40 256 357
3 256 295 357
3 256 131 295
3 131 147 295
3 131 235 147
3 235 251 147
3 235 245 251
3 245 35 251
3 245 102 35
3 102 160 35
3 102 248 160
3 248 134 160
3 248 24 134
3 24 376 134
3 24 170 376
3 170 222 376
3 170 406 222
3 406 92 222
3 406 193 92
3 193 145 135
3 145 28 135
3 145 392 28
3 392 42 28
3 392 232 42
3 232 149 42
3 232 127 149
3 127 171 149
3 127 255 171
3 255 314 171
3 255 253 314
3 253 132 314
3 408 278 253
3 278 167 253
3 278 287 167
3 287 94 167
3 287 21 94
3 21 279 94
3 21 259 279
3 259 40 279
3 259 403 40
3 403 256 40
3 403 185 256
3 185 131 256
3 185 339 131
3 339 235 131
3 172 406 170
3 172 239 406
3 239 193 406
3 239 310 193
3 310 145 193
3 310 272 145
3 272 392 145
3 272 356 392
3 356 232 392
3 356 226 232
3 226 127 232
3 226 227 127
3 227 255 127
3 227 408 255
3 408 253 255
3 103 234 408
3 234 278 408
3 234 342 278
3 342 287 278
3 342 395 287
3 395 21 287
3 395 350 21
3 350 259 21
3 350 351 259
3 351 403 259
3 351 150 403
3 150 185 403
3 150 274 185
3 274 339 185
3 274 289 339
3 289 320 339
3 289 119 320
3 119 349 320
3 119 290 349
3 303 399 329
3 399 90 329
3 399 101 90
3 101 172 90
3 101 415 172
3 415 239 172
3 415 49 239
3 49 310 239
3 49 359 310
3 359 272 310
3 359 190 272
3 190 356 272
3 190 419 356
3 419 226 356
3 419 157 226
3 157 227 226
3 157 103 227
3 103 408 227
3 165 369 103
3 369 234 103
3 369 312 234
3 312 342 234
3 312 410 342
3 410 395 342
3 410 305 395
3 305 350 395
3 305 88 350
3 88 351 350
3 88 15 351
3 15 150 351
3 15 417 150
3 417 274 150
3 417 231 274
3 231 289 274
3 231 429 289
3 429 119 289
3 429 180 119
3 180 290 119
3 180 404 290
3 404 303 290
3 404 373 303
3 373 399 303
3 373 388 399
3 388 101 399
3 388 306 101
3 306 415 101
3 306 152 415
3 152 49 415
3 152 423 49
3 423 359 49
3 423 117 359
3 117 190 359
3 117 130 190
3 130 419 190
3 130 340 419
3 340 157 419
3 340 165 157
3 165 103 157
3 47 142 165
3 142 369 165
3 142 208 369
3 208 312 369
3 208 324 312
3 324 410 312
3 324 122 410
3 122 305 410
3 122 112 305
3 112 88 305
3 112 38 88
3 38 15 88
3 38 123 15
3 123 417 15
3 123 411 417
3 411 231 417
3 411 267 231
3 267 429 231
3 267 87 429
3 87 180 429
3 87 345 180
3 345 404 180
3 345 413 404
3 413 373 404
3 413 169 373
3 169 388 373
3 169 98 388
3 98 306 388
3 98 115 306
3 115 152 306
3 115 233 152
3 233 423 152
3 233 210 423
3 210 117 423
3 210 16 117
3 16 130 117
3 16 220 130
3 220 340 130
3 220 47 340
3 47 165 340
