OFF

327 650 0
-0.016598 0.268947 0.000003
0.389611 0.044690 -0.000019
0.430326 0.058819 -0.000008
0.087526 0.242373 0.000000
0.087526 0.242373 -0.000013
0.102559 0.136506 0.000001
0.102559 0.136506 -0.000012
0.115098 0.235337 -0.000001
0.115098 0.235337 -0.000013
0.091707 0.018953 0.000003
0.091707 0.018953 -0.000010
0.237857 0.062920 -0.000002
0.237857 0.062920 -0.000015
-0.121846 0.009062 0.000010
-0.121846 0.009062 -0.000003
0.141269 0.182883 -0.000001
0.141269 0.182883 -0.000013
0.110226 0.051419 0.000002
0.110226 0.051419 -0.000011
-0.044426 0.101817 0.000006
-0.044426 0.101817 -0.000007
0.148936 0.097797 0.000000
0.148936 0.097797 -0.000013
-0.121659 0.244968 0.000006
0.032993 0.194571 0.000002
0.032993 0.194571 -0.000010
0.261939 0.033659 -0.000002
0.261939 0.033659 -0.000015
-0.035965 0.007923 0.000007
-0.035965 0.007923 -0.000006
0.187646 0.144173 -0.000002
0.187646 0.144173 -0.000014
-0.036759 0.016730 -0.000006
-0.036759 0.016730 0.000007
0.040661 0.109484 0.000003
0.040661 0.109484 -0.000009
-0.113991 0.159881 0.000007
-0.113991 0.159881 -0.000005
0.195313 0.059087 -0.000001
0.195313 0.059087 -0.000013
-0.075282 0.206258 0.000005
-0.075282 0.206258 -0.000007
0.006958 0.245512 -0.000010
0.006958 0.245512 0.000002
0.118080 0.202238 -0.000000
0.118080 0.202238 -0.000013
0.246794 0.201727 -0.000004
0.246794 0.201727 -0.000017
-0.106324 0.074795 0.000008
-0.106324 0.074795 -0.000004
-0.058212 0.254798 -0.000008
0.048328 0.024397 0.000004
0.048328 0.024397 -0.000008
0.176822 0.026306 0.000000
0.176822 0.026306 -0.000012
-0.168025 0.176457 0.000009
-0.168025 0.176457 -0.000004
-0.067614 0.121171 0.000006
-0.067614 0.121171 -0.000006
-0.151936 -0.002096 0.000011
-0.151936 -0.002096 -0.000002
0.125748 0.117151 0.000001
0.125748 0.117151 -0.000012
0.299756 0.089943 -0.000004
0.299756 0.089943 -0.000017
0.292089 0.175029 -0.000018
0.292089 0.175029 -0.000005
0.203167 0.209905 -0.000003
0.203167 0.209905 -0.000016
-0.059947 0.036085 0.000007
-0.059947 0.036085 -0.000005
0.347054 0.041013 -0.000005
0.347054 0.041013 -0.000018
0.049150 0.015277 0.000004
0.049150 0.015277 -0.000008
-0.160358 0.091370 0.000010
-0.160358 0.091370 -0.000003
0.133415 0.032064 -0.000011
0.133415 0.032064 0.000001
0.419270 0.122157 -0.000008
0.210834 0.124818 -0.000002
0.210834 0.124818 -0.000015
-0.098470 0.225613 0.000006
0.363060 0.127814 -0.000007
0.095317 0.216871 0.000000
0.095317 0.216871 -0.000013
0.381745 0.132843 -0.000020
0.378648 0.168076 -0.000020
0.378648 0.168076 -0.000008
-0.152691 0.006283 0.000011
-0.152691 0.006283 -0.000002
-0.083135 0.055440 0.000008
-0.083135 0.055440 -0.000005
-0.090803 0.140526 0.000007
-0.090803 0.140526 -0.000006
0.218502 0.039732 -0.000001
0.218502 0.039732 -0.000014
-0.078522 0.004246 0.000008
-0.078522 0.004246 -0.000004
0.276568 0.109298 -0.000004
0.276568 0.109298 -0.000017
0.270119 0.180860 -0.000005
0.270119 0.180860 -0.000017
0.315277 0.155674 -0.000006
0.315277 0.155674 -0.000018
0.134265 0.022630 0.000002
0.134265 0.022630 -0.000011
0.322945 0.070588 -0.000005
0.322945 0.070588 -0.000017
0.361654 0.116965 -0.000019
0.358557 0.152198 -0.000020
-0.150686 0.156574 0.000008
-0.150686 0.156574 -0.000004
-0.009551 0.190737 0.000004
-0.009551 0.190737 -0.000009
0.253379 0.128652 -0.000003
0.253379 0.128652 -0.000016
-0.143019 0.071488 0.000009
-0.143019 0.071488 -0.000003
0.378489 0.168118 -0.000008
-0.016598 0.268947 -0.000010
0.358478 0.152219 -0.000007
-0.001883 0.105650 0.000005
-0.001883 0.105650 -0.000008
0.261047 0.043565 -0.000003
0.261047 0.043565 -0.000015
0.219380 0.029983 -0.000001
0.219380 0.029983 -0.000014
0.075536 0.198404 0.000001
0.075536 0.198404 -0.000012
0.138538 0.213186 -0.000001
0.138538 0.213186 -0.000014
0.027301 0.257744 0.000002
0.027301 0.257744 -0.000011
0.338466 0.136320 -0.000019
0.338466 0.136320 -0.000006
0.005784 0.020563 0.000006
0.005784 0.020563 -0.000007
0.083204 0.113317 0.000002
0.083204 0.113317 -0.000011
-0.032739 0.210092 0.000004
-0.032739 0.210092 -0.000009
0.346134 0.051233 -0.000018
0.346134 0.051233 -0.000005
0.160623 0.206072 -0.000002
0.160623 0.206072 -0.000014
0.090871 0.028231 0.000003
0.090871 0.028231 -0.000010
-0.025072 0.125005 -0.000008
-0.025072 0.125005 0.000005
0.013638 0.171382 0.000003
0.013638 0.171382 -0.000009
-0.141014 0.221779 0.000007
0.168290 0.120985 -0.000001
0.168290 0.120985 -0.000013
0.052348 0.217759 0.000001
0.052348 0.217759 -0.000011
-0.017404 0.039918 0.000006
-0.017404 0.039918 -0.000007
0.393271 0.119814 -0.000020
0.021306 0.086296 0.000004
0.021306 0.086296 -0.000008
-0.133347 0.136692 0.000008
-0.133347 0.136692 -0.000004
-0.125679 0.051606 0.000009
-0.125679 0.051606 -0.000004
0.175958 0.035898 0.000000
0.175958 0.035898 -0.000013
0.060015 0.132672 -0.000010
0.060015 0.132672 0.000002
-0.055927 0.229446 0.000005
-0.055927 0.229446 -0.000008
0.234024 0.105464 -0.000015
0.234024 0.105464 -0.000003
0.098725 0.179049 0.000001
0.098725 0.179049 -0.000012
0.067683 0.047586 0.000003
0.067683 0.047586 -0.000009
0.106392 0.093963 0.000001
0.106392 0.093963 -0.000011
-0.038547 0.274549 -0.000009
-0.040593 0.059274 0.000006
-0.040593 0.059274 -0.000006
-0.048260 0.144359 0.000005
-0.048260 0.144359 -0.000007
0.145102 0.140339 -0.000000
0.145102 0.140339 -0.000013
0.183812 0.186716 -0.000002
0.183812 0.186716 -0.000015
0.029160 0.237114 0.000002
0.029160 0.237114 -0.000011
0.370083 0.139169 -0.000007
0.152769 0.055253 0.000001
0.152769 0.055253 -0.000012
-0.117825 0.202424 0.000007
-0.117825 0.202424 -0.000006
0.191479 0.101630 -0.000001
0.191479 0.101630 -0.000014
-0.079115 0.248801 0.000005
0.036827 0.152027 0.000003
0.036827 0.152027 -0.000010
0.044494 0.066941 0.000004
0.044494 0.066941 -0.000009
-0.110158 0.117338 0.000008
-0.110158 0.117338 -0.000005
-0.071448 0.163715 0.000006
-0.071448 0.163715 -0.000007
-0.102491 0.032251 0.000009
-0.102491 0.032251 -0.000004
-0.063781 0.078628 0.000007
-0.063781 0.078628 -0.000006
-0.171859 0.219000 0.000008
0.121914 0.159694 0.000000
0.121914 0.159694 -0.000013
0.426229 0.114293 -0.000021
0.158996 0.224134 -0.000002
0.158996 0.224134 -0.000015
0.129581 0.074608 0.000001
0.129581 0.074608 -0.000012
0.295922 0.132486 -0.000005
0.295922 0.132486 -0.000017
-0.156524 0.048827 0.000010
-0.156524 0.048827 -0.000003
-0.164192 0.133913 0.000009
-0.164192 0.133913 -0.000004
0.202894 0.212930 -0.000003
0.202894 0.212930 -0.000016
0.412758 0.078681 -0.000008
0.303590 0.047399 -0.000004
0.303590 0.047399 -0.000017
0.214668 0.082276 -0.000002
0.214668 0.082276 -0.000014
-0.094636 0.183070 0.000006
-0.094636 0.183070 -0.000006
0.207001 0.167361 -0.000015
0.207001 0.167361 -0.000003
0.290692 0.190525 -0.000005
0.290692 0.190525 -0.000018
0.334591 0.179321 -0.000007
0.334591 0.179321 -0.000019
-0.086969 0.097983 0.000007
-0.086969 0.097983 -0.000005
0.388676 0.055066 -0.000007
0.272734 0.151840 -0.000004
0.272734 0.151840 -0.000017
0.389570 0.098036 -0.000007
0.401699 0.142018 -0.000021
0.280401 0.066754 -0.000003
0.280401 0.066754 -0.000016
0.401699 0.142018 -0.000008
0.319111 0.113131 -0.000018
0.319111 0.113131 -0.000005
-0.079302 0.012896 0.000008
-0.079302 0.012896 -0.000004
-0.154520 0.199118 0.000008
-0.154520 0.199118 -0.000005
0.365488 0.074421 -0.000006
0.365488 0.074421 -0.000019
-0.013384 0.233280 0.000003
-0.013384 0.233280 -0.000009
0.257213 0.086109 -0.000003
0.257213 0.086109 -0.000016
0.249546 0.171195 -0.000004
0.249546 0.171195 -0.000017
-0.146852 0.114031 0.000009
-0.146852 0.114031 -0.000004
0.211724 0.210676 -0.000003
0.211724 0.210676 -0.000016
-0.139185 0.028945 0.000010
-0.139185 0.028945 -0.000003
-0.005717 0.148193 0.000004
-0.005717 0.148193 -0.000009
0.001950 0.063107 -0.000008
0.001950 0.063107 0.000005
0.071703 0.240947 0.000001
0.071703 0.240947 -0.000012
0.334633 0.178862 -0.000019
0.342300 0.093777 -0.000006
0.342300 0.093777 -0.000018
0.334633 0.178862 -0.000007
0.304496 0.037337 -0.000004
0.304496 0.037337 -0.000016
0.226898 0.184544 -0.000003
0.226898 0.184544 -0.000016
0.079370 0.155860 0.000001
0.079370 0.155860 -0.000011
0.087037 0.070775 0.000002
0.087037 0.070775 -0.000010
-0.036675 0.274071 0.000003
0.006592 0.011600 0.000006
0.006592 0.011600 -0.000007
-0.036263 0.249197 -0.000009
-0.028905 0.167548 0.000005
-0.028905 0.167548 -0.000008
0.009805 0.213925 0.000003
0.009805 0.213925 -0.000010
-0.121080 0.000570 -0.000003
-0.121080 0.000570 0.000010
0.335926 0.178979 -0.000007
0.335926 0.178979 -0.000019
-0.021238 0.082462 0.000005
-0.021238 0.082462 -0.000007
-0.137180 0.179236 0.000008
-0.137180 0.179236 -0.000005
0.164457 0.163528 -0.000014
0.172124 0.078442 -0.000000
0.172124 0.078442 -0.000013
0.164457 0.163528 -0.000001
-0.059761 0.271990 0.000004
0.017472 0.128838 0.000004
0.017472 0.128838 -0.000009
0.056182 0.175216 0.000002
0.056182 0.175216 -0.000011
0.389611 0.044690 -0.000006
-0.129513 0.094149 0.000009
-0.129513 0.094149 -0.000004
0.071199 0.246540 0.000000
0.071199 0.246540 -0.000012
0.025139 0.043752 0.000005
0.025139 0.043752 -0.000008
0.387653 0.119308 -0.000007
0.063849 0.090129 0.000003
0.063849 0.090129 -0.000010
-0.052093 0.186903 -0.000008
-0.052093 0.186903 0.000005
0.230190 0.148007 -0.000003
0.230190 0.148007 -0.000016
3 0 258 288
3 258 170 288
3 308 23 180
3 23 211 180
3 180 288 308
3 180 120 288
3 120 0 288
3 211 50 180
3 23 152 211
3 211 195 50
3 195 41 50
3 41 171 50
3 308 198 23
3 211 255 195
3 211 56 255
3 195 233 41
3 198 82 23
3 255 303 195
3 50 291 180
3 214 1 2
3 1 313 2
3 214 257 1
3 257 72 1
3 257 142 72
3 2 79 214
3 2 227 79
3 214 159 257
3 159 109 257
3 159 86 109
3 79 249 214
3 109 278 257
3 313 242 2
3 227 245 79
3 245 320 79
3 159 246 86
3 135 320 83
3 135 121 119
3 42 259 133
3 132 258 43
3 215 44 130
3 131 45 216
3 236 262 101
3 102 263 237
3 159 214 246
3 86 246 87
3 88 249 119
3 227 2 242
3 89 13 59
3 297 59 13
3 90 60 14
3 296 14 60
3 254 55 211
3 254 302 55
3 254 152 302
3 254 211 152
3 255 56 303
3 264 75 223
3 264 314 75
3 264 162 314
3 264 223 162
3 265 76 315
3 265 224 76
3 265 163 224
3 265 315 163
3 111 302 162
3 111 55 302
3 111 223 55
3 111 162 223
3 112 303 56
3 112 163 303
3 112 224 163
3 112 56 224
3 268 89 221
3 268 13 89
3 268 164 13
3 268 221 164
3 269 90 14
3 269 222 90
3 269 165 222
3 269 14 165
3 117 314 164
3 117 75 314
3 117 221 75
3 117 164 221
3 118 315 76
3 118 165 315
3 118 222 165
3 118 76 222
3 238 66 236
3 279 66 238
3 239 65 276
3 237 65 239
3 280 143 71
3 228 143 280
3 281 142 229
3 72 142 281
3 103 219 66
3 103 135 219
3 103 279 135
3 103 66 279
3 104 220 134
3 104 65 220
3 104 276 65
3 104 134 276
3 107 228 63
3 107 143 228
3 107 277 143
3 107 63 277
3 108 229 142
3 108 64 229
3 108 278 64
3 108 142 278
3 251 135 277
3 251 219 135
3 251 63 219
3 251 277 63
3 250 134 220
3 250 278 134
3 250 64 278
3 250 220 64
3 143 242 71
3 313 71 242
3 298 135 279
3 121 298 119
3 121 135 298
3 191 119 249
3 191 135 119
3 110 299 134
3 110 87 299
3 276 134 299
3 279 238 298
3 299 239 276
3 79 320 249
3 191 320 135
3 191 249 320
3 83 277 135
3 83 320 277
3 245 277 320
3 109 86 134
3 110 86 87
3 110 134 86
3 109 134 278
3 256 143 277
3 256 242 143
3 256 245 242
3 256 277 245
3 227 242 245
3 257 278 142
3 266 235 67
3 282 266 46
3 282 235 266
3 282 262 235
3 282 46 262
3 283 267 234
3 283 47 267
3 68 234 267
3 283 263 47
3 283 234 263
3 67 225 266
3 267 226 68
3 126 124 26
3 95 124 126
3 127 125 96
3 27 125 127
3 325 80 235
3 325 115 80
3 325 262 115
3 325 235 262
3 326 81 116
3 326 234 81
3 326 263 234
3 326 116 263
3 11 95 230
3 11 124 95
3 11 260 124
3 11 230 260
3 12 96 125
3 12 231 96
3 12 261 231
3 12 125 261
3 173 115 260
3 173 80 115
3 173 230 80
3 173 260 230
3 172 116 81
3 172 261 116
3 172 231 261
3 172 81 231
3 124 228 26
3 280 26 228
3 125 27 229
3 281 229 27
3 101 46 236
3 101 262 46
3 66 262 236
3 237 263 65
3 102 47 263
3 102 237 47
3 243 115 262
3 243 219 115
3 243 66 219
3 243 262 66
3 244 116 220
3 244 263 116
3 244 65 263
3 244 220 65
3 247 124 260
3 247 228 124
3 247 63 228
3 247 260 63
3 248 125 229
3 248 261 125
3 248 64 261
3 248 229 64
3 99 219 63
3 99 115 219
3 99 260 115
3 99 63 260
3 100 220 116
3 100 64 220
3 100 261 64
3 100 116 261
3 130 7 215
3 130 44 7
3 144 44 215
3 216 45 145
3 131 8 45
3 131 216 8
3 105 166 53
3 78 166 105
3 106 167 77
3 54 167 106
3 15 144 307
3 15 44 144
3 15 212 44
3 15 307 212
3 16 145 45
3 16 304 145
3 16 213 304
3 16 45 213
3 185 61 212
3 185 153 61
3 185 307 153
3 185 212 307
3 186 62 154
3 186 213 62
3 186 304 213
3 186 154 304
3 192 78 217
3 192 166 78
3 192 305 166
3 192 217 305
3 193 77 167
3 193 218 77
3 193 306 218
3 193 167 306
3 21 153 305
3 21 61 153
3 21 217 61
3 21 305 217
3 22 154 62
3 22 306 154
3 22 218 306
3 22 62 218
3 166 95 53
3 126 53 95
3 167 54 96
3 127 96 54
3 225 144 215
3 67 144 225
3 226 145 68
3 216 145 226
3 187 67 235
3 187 144 67
3 187 307 144
3 187 235 307
3 188 68 145
3 188 234 68
3 188 304 234
3 188 145 304
3 30 153 307
3 30 80 153
3 30 235 80
3 30 307 235
3 31 154 81
3 31 304 154
3 31 234 304
3 31 81 234
3 38 166 305
3 38 95 166
3 38 230 95
3 38 305 230
3 39 167 96
3 39 306 167
3 39 231 306
3 39 96 231
3 196 80 230
3 196 153 80
3 196 305 153
3 196 230 305
3 197 81 154
3 197 231 81
3 197 306 231
3 197 154 306
3 316 189 132
3 274 189 316
3 317 190 275
3 133 190 317
3 73 146 9
3 51 146 73
3 74 147 52
3 10 147 74
3 155 24 189
3 155 128 24
3 155 274 128
3 155 189 274
3 156 25 129
3 156 190 25
3 156 275 190
3 156 129 275
3 169 34 199
3 169 138 34
3 169 284 138
3 169 199 284
3 168 35 139
3 168 200 35
3 168 285 200
3 168 139 285
3 311 128 284
3 311 24 128
3 311 199 24
3 311 284 199
3 312 129 25
3 312 285 129
3 312 200 285
3 312 25 200
3 176 51 201
3 176 146 51
3 176 286 146
3 176 201 286
3 177 52 147
3 177 202 52
3 177 287 202
3 177 147 287
3 321 138 286
3 321 34 138
3 321 201 34
3 321 286 201
3 322 139 35
3 322 287 139
3 322 202 287
3 322 35 202
3 146 78 9
3 105 9 78
3 147 10 77
3 106 77 10
3 3 128 274
3 84 3 7
3 84 128 3
3 84 44 128
3 84 7 44
3 85 4 129
3 85 8 4
3 275 129 4
3 85 45 8
3 85 129 45
3 274 316 3
3 4 317 275
3 174 44 212
3 174 128 44
3 174 284 128
3 174 212 284
3 175 45 129
3 175 213 45
3 175 285 213
3 175 129 285
3 5 138 284
3 5 61 138
3 5 212 61
3 5 284 212
3 6 139 62
3 6 285 139
3 6 213 285
3 6 62 213
3 17 146 286
3 17 78 146
3 17 217 78
3 17 286 217
3 18 147 77
3 18 287 147
3 18 218 287
3 18 77 218
3 178 61 217
3 178 138 61
3 178 286 138
3 178 217 286
3 179 62 139
3 179 218 62
3 179 287 218
3 179 139 287
3 288 170 308
3 50 171 291
3 180 291 120
3 291 259 120
3 291 171 259
3 28 136 289
3 33 136 28
3 29 137 32
3 290 137 29
3 140 324 170
3 140 113 324
3 140 258 113
3 140 170 258
3 141 323 114
3 141 171 323
3 141 259 171
3 141 114 259
3 149 19 183
3 149 122 19
3 149 270 122
3 149 183 270
3 148 20 123
3 148 184 20
3 148 271 184
3 148 123 271
3 292 113 270
3 292 324 113
3 292 183 324
3 292 270 183
3 293 114 323
3 293 271 114
3 293 184 271
3 293 323 184
3 157 33 181
3 157 136 33
3 157 273 136
3 157 181 273
3 158 32 137
3 158 182 32
3 158 272 182
3 158 137 272
3 300 122 273
3 300 19 122
3 300 181 19
3 300 273 181
3 301 123 20
3 301 272 123
3 301 182 272
3 301 20 182
3 136 51 289
3 73 289 51
3 137 290 52
3 74 52 290
3 43 0 132
3 43 258 0
3 189 258 132
3 133 259 190
3 42 120 259
3 42 133 120
3 294 113 258
3 294 24 113
3 294 189 24
3 294 258 189
3 295 114 25
3 295 259 114
3 295 190 259
3 295 25 190
3 309 122 270
3 309 34 122
3 309 199 34
3 309 270 199
3 310 123 35
3 310 271 123
3 310 200 271
3 310 35 200
3 150 24 199
3 150 113 24
3 150 270 113
3 150 199 270
3 151 25 114
3 151 200 25
3 151 271 200
3 151 114 271
3 318 136 273
3 318 51 136
3 318 201 51
3 318 273 201
3 319 137 52
3 319 272 137
3 319 202 272
3 319 52 202
3 160 34 201
3 160 122 34
3 160 273 122
3 160 201 273
3 161 35 123
3 161 202 35
3 161 272 202
3 161 123 272
3 297 252 97
3 13 252 297
3 296 253 14
3 98 253 296
3 23 82 152
3 194 302 152
3 194 232 302
3 194 82 232
3 194 152 82
3 195 303 233
3 203 314 162
3 203 240 314
3 203 93 240
3 203 162 93
3 204 315 241
3 204 163 315
3 204 94 163
3 204 241 94
3 36 232 93
3 36 302 232
3 36 162 302
3 36 93 162
3 37 233 303
3 37 94 233
3 37 163 94
3 37 303 163
3 207 13 164
3 207 252 13
3 207 91 252
3 207 164 91
3 208 14 253
3 208 165 14
3 208 92 165
3 208 253 92
3 48 240 91
3 48 314 240
3 48 164 314
3 48 91 164
3 49 241 315
3 49 92 241
3 49 165 92
3 49 315 165
3 252 33 97
3 28 97 33
3 253 98 32
3 29 32 98
3 198 308 170
3 198 170 82
3 40 232 82
3 40 324 232
3 40 170 324
3 40 82 170
3 41 233 323
3 41 323 171
3 57 240 93
3 57 19 240
3 57 183 19
3 57 93 183
3 58 241 20
3 58 94 241
3 58 184 94
3 58 20 184
3 205 324 183
3 205 232 324
3 205 93 232
3 205 183 93
3 206 323 233
3 206 184 323
3 206 94 184
3 206 233 94
3 69 252 91
3 69 33 252
3 69 181 33
3 69 91 181
3 70 253 32
3 70 92 253
3 70 182 92
3 70 32 182
3 209 19 181
3 209 240 19
3 209 91 240
3 209 181 91
3 210 20 241
3 210 182 20
3 210 92 182
3 210 241 92
3 98 97 29
3 28 29 97
3 296 297 98
3 97 98 297
3 133 132 120
3 0 120 132
3 290 289 74
3 73 74 289
3 29 28 290
3 289 290 28
3 4 3 317
3 316 317 3
3 8 7 4
3 3 4 7
3 10 9 106
3 105 106 9
3 74 73 10
3 9 10 73
3 317 316 133
3 132 133 316
3 226 225 216
3 215 216 225
3 54 53 127
3 126 127 53
3 106 105 54
3 53 54 105
3 216 215 8
3 7 8 215
3 237 236 47
3 46 47 236
3 27 26 281
3 280 281 26
3 127 126 27
3 26 27 126
3 267 266 226
3 225 226 266
3 47 46 267
3 266 267 46
3 299 298 239
3 238 239 298
3 87 119 299
3 298 299 119
3 72 71 1
3 313 1 71
3 281 280 72
3 71 72 280
3 239 238 237
3 236 237 238
3 76 75 222
3 221 222 75
3 222 221 90
3 89 90 221
3 56 55 224
3 223 224 55
3 224 223 76
3 75 76 223
3 55 56 211
3 90 89 60
3 59 60 89
3 60 59 296
3 297 296 59
3 246 249 87
3 88 87 249
3 119 87 88
3 214 249 246
