OFF

1430 2860 0
-0.379952 -0.250089 0.062208
-0.245066 -0.276070 0.062885
-0.084996 -0.249246 -0.059831
-0.400023 -0.254718 -0.058894
-0.247688 -0.287701 -0.031081
0.001269 -0.161560 0.034759
0.054371 -0.182381 -0.059471
-0.043594 -0.179693 -0.060004
0.265208 -0.235759 0.004986
-0.390554 -0.200887 0.068889
-0.035994 0.014670 0.020113
0.423419 -0.345424 0.001849
-0.315666 -0.123051 0.062254
-0.380436 -0.134333 0.077114
0.419302 -0.329530 0.028772
0.494218 -0.313717 -0.035685
-0.066056 0.010225 -0.051596
-0.499159 -0.212870 0.001660
-0.238892 0.352488 0.054318
-0.127411 0.020054 -0.060346
0.490688 -0.336123 -0.011814
-0.285873 -0.241418 -0.059695
-0.043374 0.025072 -0.004204
-0.043366 0.025092 0.005952
-0.104499 -0.246289 0.063060
0.420521 -0.343637 0.012363
0.049608 0.016442 0.020035
-0.295759 0.329991 -0.059000
-0.252877 0.329173 0.059402
-0.244352 0.376375 -0.016762
0.048707 0.014415 0.017846
-0.101197 0.001804 0.058234
-0.050913 -0.246706 0.063086
0.156851 -0.192343 -0.059252
-0.316180 -0.216364 -0.059723
-0.062523 -0.002730 0.053756
-0.103050 -0.097480 -0.060126
0.091064 -0.019949 -0.015863
-0.279058 0.322841 0.060414
0.494277 -0.313519 0.027634
-0.448581 -0.095951 0.031663
-0.150200 0.197104 0.034312
-0.475200 -0.243380 -0.059330
-0.217367 -0.285191 -0.059000
-0.081559 0.020407 -0.051605
-0.445082 -0.215889 0.077329
-0.242396 0.372716 -0.035031
-0.175524 0.332751 0.061936
-0.381240 0.347549 0.000431
-0.418511 -0.101425 -0.059192
-0.377154 -0.113887 0.077070
-0.427825 -0.246020 0.077377
-0.286262 0.390049 -0.059249
-0.293844 -0.019859 0.062743
0.182730 -0.220844 0.001160
-0.325668 0.347010 0.062021
0.048681 0.014347 -0.015901
0.075745 -0.156309 0.053963
-0.457044 -0.237951 -0.058885
0.484398 -0.347801 -0.019085
-0.315758 -0.123298 -0.059390
-0.122708 -0.300759 0.034244
-0.445122 -0.216869 -0.076599
-0.071345 0.015111 -0.051602
-0.065866 0.009816 -0.051595
-0.447905 -0.096503 0.069513
-0.062546 -0.004366 -0.050424
0.030753 -0.172417 -0.059197
-0.352619 -0.158058 0.071832
-0.347213 -0.118618 0.077057
-0.062126 -0.157479 0.061969
0.428805 -0.269263 -0.018250
0.022687 0.024406 0.020040
0.088231 -0.292936 0.035864
0.115794 -0.296724 0.035613
-0.305564 -0.077405 -0.060013
-0.045601 0.026989 -0.018319
0.157028 -0.187940 0.034184
-0.100989 -0.005907 -0.058584
0.096420 -0.138159 0.026359
-0.492019 -0.184293 0.077300
-0.360112 -0.205701 0.077244
-0.062487 -0.003654 0.053757
-0.342326 0.368695 0.000358
0.186565 -0.232416 -0.026557
0.182728 -0.220819 0.001334
-0.376189 -0.230899 -0.066531
0.043423 -0.261613 0.062979
-0.476923 -0.239795 -0.059552
-0.347110 -0.127979 -0.061278
-0.225848 0.077840 0.062493
0.488681 -0.348833 -0.008286
-0.097695 -0.012617 0.058296
-0.458657 -0.240905 0.062751
-0.301837 0.045803 -0.060267
-0.211919 0.352781 0.061923
-0.424860 -0.164417 -0.065451
-0.150251 0.196966 -0.033188
0.102136 -0.124626 0.018088
-0.042025 -0.170100 0.062923
0.183601 -0.222483 -0.009788
0.484429 -0.347718 0.021601
0.493115 -0.292790 0.036375
0.002965 -0.168026 -0.059185
-0.306352 0.344921 0.056803
-0.306716 -0.140947 0.083800
0.096389 -0.138249 -0.023859
-0.496563 -0.239530 -0.036142
-0.417902 -0.169448 0.083942
0.054057 0.026445 0.017817
0.475664 -0.351684 -0.002206
0.090983 -0.164686 0.053969
-0.043894 0.024767 -0.018556
0.185526 -0.239051 -0.005431
-0.078459 -0.092457 0.035787
-0.261181 0.324483 -0.057678
0.086188 -0.163279 -0.051358
-0.418399 -0.101165 0.069502
-0.097229 -0.282563 -0.032611
-0.319892 -0.045146 0.034383
-0.304123 0.374231 -0.019403
-0.086502 0.017759 -0.052498
0.483771 -0.351796 -0.009263
0.175099 -0.305086 0.012615
-0.244326 0.376444 0.017298
0.043423 -0.261613 0.063045
-0.078861 0.018049 -0.058649
-0.427458 -0.157139 0.083924
-0.483159 -0.231097 -0.063438
-0.245181 0.378167 0.060276
0.160722 -0.287799 -0.059938
-0.456947 -0.237689 0.069812
-0.316910 -0.017507 -0.033287
-0.238899 0.352041 0.060324
-0.325273 -0.015508 0.001127
0.102111 -0.124695 -0.015658
-0.210222 -0.006981 0.062653
-0.470361 -0.211554 0.077339
0.495708 -0.304290 -0.034449
-0.100656 0.003464 -0.055795
0.184453 -0.245806 -0.017220
-0.084892 -0.020449 0.060965
-0.313597 -0.149650 0.063022
0.181527 -0.264257 -0.041486
0.022963 -0.231764 -0.062877
-0.259399 0.389356 -0.059268
0.054032 0.026376 -0.015929
-0.065182 -0.011522 -0.038626
0.421161 -0.339497 -0.019995
0.425211 -0.386151 -0.001374
-0.306109 -0.135359 0.062838
-0.352624 -0.158063 0.069571
-0.167101 0.192312 -0.060667
-0.499356 -0.208562 -0.059049
-0.495406 -0.236830 0.061795
0.053131 0.024350 -0.018118
0.433375 -0.262293 0.012188
-0.412646 -0.170233 -0.065448
-0.323489 0.050469 0.035156
0.183324 -0.253116 0.042844
-0.293069 -0.240770 -0.084109
-0.475108 -0.243132 0.062736
0.185536 -0.239023 0.008200
-0.035771 0.014326 -0.017455
0.184482 -0.245731 0.020019
0.464988 -0.392424 0.004361
-0.453824 -0.133347 0.068800
0.499797 -0.278490 -0.008438
-0.238763 0.360302 -0.050420
-0.419970 -0.142847 0.083890
-0.385182 -0.164792 -0.071660
-0.499115 -0.211258 -0.028604
-0.306398 -0.137971 0.062993
0.497147 -0.295371 0.033065
0.431667 -0.273151 0.031322
-0.385070 -0.164489 0.077179
0.050775 -0.190269 -0.062165
0.429632 -0.264083 0.001162
-0.420838 -0.097637 0.001366
0.114166 -0.129977 0.018090
0.075047 -0.179155 0.061910
-0.426949 -0.151812 -0.065475
0.183237 -0.222419 -0.009790
-0.348807 -0.128340 -0.074331
-0.000123 -0.173507 0.062245
-0.051141 -0.141816 -0.034020
-0.241587 0.343015 -0.056191
-0.163412 -0.295698 0.063329
-0.422748 -0.167182 -0.080544
-0.042590 0.022973 -0.020939
-0.071388 -0.017615 -0.041177
0.123464 -0.208901 -0.060071
0.099950 -0.013435 0.020058
-0.464294 -0.249965 0.001709
-0.042887 0.023514 0.022098
0.100099 -0.164561 0.031848
-0.316905 0.121167 -0.060409
-0.241431 0.343482 0.057101
0.424471 -0.345032 -0.003238
-0.352719 -0.158326 -0.059813
-0.077995 -0.020394 -0.048154
-0.062766 0.003396 0.053743
-0.123666 0.006540 -0.060322
-0.306350 0.344928 0.060390
0.177992 -0.286711 -0.011678
-0.307573 -0.129929 0.083778
-0.268098 0.392198 0.060265
-0.460577 -0.243846 -0.058870
0.058494 -0.186249 -0.060133
0.118221 -0.280570 -0.059921
-0.424320 -0.146793 -0.065487
0.186558 -0.232444 -0.033415
-0.074926 -0.019095 0.049014
-0.000215 -0.173755 -0.059461
-0.354040 -0.178236 0.063111
-0.294315 0.385674 -0.059234
-0.092354 0.015240 0.055733
0.114141 -0.130045 -0.015657
0.094751 -0.136719 -0.020814
-0.032673 0.018567 0.020093
-0.065976 0.010440 0.053731
0.177390 -0.290701 0.054624
0.181581 -0.264106 0.027771
0.073521 0.001704 -0.018087
0.423598 -0.302374 0.040092
0.495762 -0.304145 0.036767
-0.101232 0.001901 -0.055984
-0.101202 0.001982 0.060932
-0.150855 -0.262243 -0.059754
-0.458762 -0.241059 -0.059036
0.417506 -0.340825 0.001327
-0.246284 0.335436 0.060364
-0.025894 -0.154949 0.035365
-0.328291 -0.070788 0.035546
-0.478366 -0.097893 0.077114
-0.212707 -0.133945 -0.059091
-0.036011 0.014597 -0.018034
0.023061 -0.231502 0.065863
0.125476 -0.182405 0.036005
-0.260879 0.324802 0.058816
-0.269895 0.322605 0.060408
-0.112458 -0.295095 0.034979
-0.081479 0.020621 0.053722
-0.450444 -0.111895 -0.074287
-0.078855 0.018063 -0.051602
-0.125358 -0.289232 0.062095
0.425265 -0.384812 0.005410
-0.407559 -0.220387 0.068942
-0.189166 -0.289770 0.062145
0.095271 -0.135854 0.001096
0.090873 -0.276013 0.062973
-0.420846 -0.116118 0.077107
-0.077337 -0.020389 -0.058572
-0.399372 -0.247514 -0.066479
0.024395 0.035220 0.017822
-0.177369 -0.281014 0.062118
-0.499537 -0.231497 -0.058866
-0.205248 -0.054448 0.062746
-0.477153 -0.250435 -0.030633
-0.277260 0.392436 0.060271
0.423540 -0.302532 -0.037602
-0.098647 0.008919 -0.058616
-0.308295 0.361873 0.046017
-0.357422 -0.129765 0.077087
0.082000 -0.202296 -0.060053
-0.269898 0.322599 0.057094
-0.458327 -0.161554 -0.065432
-0.462812 -0.189989 -0.065370
-0.365808 0.233482 -0.033296
-0.260984 0.324746 0.060397
-0.462735 -0.189507 -0.074120
-0.176335 0.049421 0.062513
0.420286 -0.345095 0.001333
-0.065198 -0.011563 -0.058599
-0.245219 0.378065 0.009910
0.101471 -0.142995 0.041804
-0.163435 -0.015019 0.062634
-0.369198 -0.106797 0.001346
0.047056 -0.258971 0.062971
-0.210982 -0.276268 0.062134
0.024369 0.035152 -0.015925
0.110646 -0.070773 0.017972
-0.335528 0.362979 0.037209
-0.376143 -0.230914 -0.074101
-0.318904 -0.151652 -0.080654
0.071742 -0.147506 0.001095
0.169462 -0.230598 0.062821
0.424479 -0.344987 0.006078
0.428693 -0.292005 0.042396
-0.463242 -0.252310 0.034455
-0.321018 -0.122526 0.083774
-0.308564 0.354147 -0.052145
-0.432414 -0.256503 0.035203
-0.098644 0.008926 -0.055140
-0.497075 -0.241415 -0.029402
-0.085388 -0.172955 0.062896
0.495302 -0.306893 -0.024146
0.184779 -0.227066 -0.020131
-0.408806 -0.169471 -0.065453
-0.006295 0.033822 0.020042
0.126964 -0.180680 0.001120
-0.213775 0.016748 0.062608
-0.295646 0.330217 0.060158
-0.246374 0.335196 -0.057804
0.022334 -0.232033 0.065046
-0.271132 0.308779 -0.060825
-0.378603 -0.122822 0.068722
0.418333 -0.335644 0.020740
-0.311037 -0.125898 -0.059459
0.101410 -0.143160 -0.039298
0.047056 -0.258971 0.063037
-0.318364 0.016397 0.034736
0.496295 -0.300614 -0.021530
-0.306501 0.344953 -0.055636
-0.035837 0.026648 -0.018055
0.086267 -0.163065 0.053969
-0.399275 -0.247253 0.062217
-0.298862 -0.049015 -0.060076
0.466251 -0.391291 0.004374
0.493174 -0.320355 -0.024117
0.110621 -0.070842 -0.015774
-0.214310 -0.281405 -0.059598
-0.077255 -0.020169 0.049868
-0.419862 -0.100743 -0.028914
-0.162467 -0.302708 -0.031604
-0.037209 0.016038 -0.020123
-0.239027 0.362148 -0.049644
-0.298539 -0.230703 -0.084125
0.497099 -0.295501 -0.030786
-0.310945 -0.125650 0.062357
-0.291261 -0.248158 -0.059456
-0.061196 -0.116669 0.001133
-0.033965 0.012009 0.020693
-0.038484 -0.167709 -0.060097
-0.380551 -0.134641 -0.074294
0.493062 -0.292934 -0.034095
-0.241589 0.343009 -0.059187
0.050049 -0.190799 -0.062981
-0.133329 -0.304135 -0.029895
0.103291 -0.143570 -0.024181
0.072740 -0.273411 -0.059901
-0.089128 -0.131009 -0.060068
-0.347873 -0.127879 0.072117
-0.341916 -0.092329 0.033485
-0.040207 -0.168775 0.064965
-0.069593 -0.068915 0.001042
-0.203921 -0.078435 -0.060088
-0.073446 0.016069 -0.051602
-0.062218 -0.157726 -0.059157
-0.347174 -0.127988 -0.059740
-0.477516 -0.092117 -0.066733
-0.268410 -0.101728 0.062890
-0.313581 -0.149608 0.083823
-0.097177 -0.282424 0.035606
0.495340 -0.306789 0.026723
0.492220 -0.326530 0.024135
-0.326563 0.020719 0.001054
-0.254294 -0.051370 -0.060105
0.045241 -0.260288 0.065087
0.423412 -0.344999 0.004993
-0.302064 0.336633 -0.057988
-0.301974 0.336874 0.060403
-0.308257 0.363001 0.060355
-0.300961 0.379362 -0.059216
0.120728 -0.100043 -0.017916
-0.065971 0.010454 0.060888
-0.309470 -0.146300 -0.080672
-0.365757 0.233620 0.034597
0.468604 -0.350570 0.006266
-0.377269 -0.114195 -0.074338
0.094024 -0.177836 -0.035002
0.027841 -0.165859 -0.032887
0.493213 -0.320252 0.026752
-0.409868 -0.140192 0.068781
-0.086507 0.017746 -0.058643
0.178965 -0.218745 -0.060195
-0.171596 0.027466 0.062554
-0.149744 0.295827 0.038632
-0.092072 -0.017803 0.060966
-0.282721 0.143935 -0.060481
-0.097781 -0.012849 -0.056018
0.427836 -0.275378 -0.026282
-0.168906 0.294348 0.062009
-0.412533 -0.169929 0.083939
-0.279147 0.322602 -0.057116
-0.297354 0.013123 0.062678
0.186399 -0.233689 0.054502
-0.240895 0.369870 -0.059242
-0.261073 0.324506 -0.057699
0.073265 -0.151523 0.030882
-0.325137 0.161810 0.062397
-0.414886 -0.141441 -0.065505
-0.347903 -0.128147 -0.067033
-0.043747 0.024847 0.041573
-0.269654 0.322658 0.057141
0.475677 -0.351640 0.004995
-0.129077 0.083484 -0.032013
0.175691 -0.198713 0.032659
-0.208283 0.369281 -0.037037
-0.426836 -0.151508 0.083913
0.496039 -0.274160 -0.009431
0.431622 -0.273274 -0.028966
-0.109677 -0.068057 0.062701
-0.306237 0.369877 -0.034610
-0.426104 -0.162861 -0.080550
-0.369640 -0.161428 0.077161
-0.347327 -0.118926 -0.074351
-0.422635 -0.166879 0.068844
-0.105295 -0.269156 -0.058254
0.154945 -0.213545 0.062797
-0.477419 -0.091855 0.061960
-0.042913 0.023430 -0.020050
-0.160107 -0.035147 0.062673
-0.192217 -0.296693 0.034266
-0.306093 -0.135316 0.083788
-0.109227 0.029369 0.035887
-0.238753 0.360960 -0.059226
-0.157319 -0.291977 -0.061498
-0.006527 0.036018 0.017844
-0.492134 -0.184601 -0.074108
-0.079234 0.018259 0.053725
-0.043809 0.024682 -0.039529
-0.052233 -0.244885 0.065129
-0.301908 0.336801 0.059125
-0.360227 -0.206009 -0.074164
-0.375231 -0.108272 -0.063079
0.489882 -0.313039 -0.039503
0.050146 -0.190537 0.065759
-0.053826 -0.015510 0.000921
-0.318415 0.016260 -0.032623
-0.081778 0.017947 -0.051600
0.055852 -0.182616 -0.060138
-0.492548 -0.187517 0.031885
-0.240880 0.369912 -0.038856
-0.306224 0.344684 0.056871
-0.354029 -0.178207 0.077183
0.045146 -0.260542 -0.059906
-0.092305 -0.017906 -0.055481
0.074955 -0.179402 -0.059216
-0.143779 0.085251 0.062415
-0.424207 -0.146489 0.083900
-0.078776 0.018277 0.053725
-0.208514 -0.107790 0.062857
0.490197 -0.339337 0.027302
-0.477104 -0.250303 0.034071
-0.330247 0.088601 -0.033081
0.483787 -0.351754 0.011797
0.090661 -0.133347 -0.018205
0.488492 -0.350054 0.001258
0.174846 -0.306749 0.035716
-0.062855 0.003263 -0.058631
-0.092075 -0.017810 0.057748
-0.238842 0.361902 0.050663
-0.187670 0.105933 -0.060476
0.165093 -0.260699 -0.059997
-0.006553 0.035950 -0.015903
0.424259 -0.384655 0.004392
-0.206668 -0.030711 0.062699
0.052952 -0.163181 -0.033390
0.474453 -0.351313 0.006267
-0.144347 -0.118160 -0.060053
-0.456941 -0.237674 0.077382
-0.496117 -0.236449 -0.057617
-0.338825 0.127097 -0.033221
-0.427939 -0.246327 -0.074052
-0.480281 -0.237377 0.077399
-0.070299 -0.016940 0.060947
-0.293050 -0.240720 -0.059677
-0.069444 -0.016039 0.040928
0.112820 -0.070614 -0.017970
-0.093367 0.014773 0.055966
-0.223075 -0.152679 -0.059923
-0.127382 -0.265867 0.063117
-0.293050 -0.240720 -0.059675
-0.390691 -0.201387 -0.065402
-0.093703 -0.016616 -0.055702
-0.208227 0.369433 0.037547
-0.103843 0.030918 0.000865
-0.127318 0.020304 0.062535
-0.005406 0.025053 -0.018075
-0.387957 0.316841 0.000498
0.182606 -0.257481 -0.024010
0.104218 -0.044039 0.017923
-0.041243 0.021229 -0.020913
0.184940 -0.227094 -0.020130
-0.347255 0.135336 0.000837
-0.052328 -0.245139 -0.059864
-0.303060 0.375972 -0.013508
-0.498984 -0.211111 0.031906
-0.156105 -0.061147 -0.060160
0.104131 -0.125599 -0.017852
0.093013 -0.204259 -0.060057
0.105547 -0.144063 0.007767
0.423415 -0.345140 0.003945
-0.376086 -0.230622 0.069736
0.183599 -0.251202 -0.021394
-0.101204 0.001977 0.058227
-0.388791 -0.104913 -0.030546
-0.470676 -0.213561 -0.065316
-0.102957 -0.097230 0.062756
-0.385184 -0.164797 -0.074229
0.180478 -0.270943 -0.023981
-0.125449 -0.289479 -0.059031
0.171580 -0.204932 0.061699
0.112096 -0.098679 -0.017912
0.095125 -0.136096 -0.005713
-0.499191 -0.230816 -0.066438
-0.318888 -0.151610 -0.059852
-0.430199 -0.248972 0.062175
0.489944 -0.312873 0.041869
0.420563 -0.321571 0.034928
-0.189257 -0.290016 -0.058982
-0.458219 -0.161264 0.077228
0.474438 -0.351363 -0.003478
-0.177461 -0.281260 -0.059008
0.115523 -0.185551 0.061892
-0.078448 0.028551 0.000850
-0.315650 -0.123007 0.083770
0.104193 -0.044108 -0.015824
-0.308584 0.353595 -0.059158
-0.308579 0.353609 -0.052391
0.422258 -0.332700 0.031450
0.121511 -0.069698 -0.017978
-0.238903 0.352029 0.054494
0.105268 -0.144538 -0.018081
-0.376158 -0.107841 0.069293
-0.043870 0.024843 0.020602
-0.286171 0.390292 0.060282
-0.419798 -0.100504 0.031662
-0.373910 0.238940 0.000646
-0.394851 -0.105060 0.001362
-0.100919 -0.006050 -0.056398
0.053159 0.024427 0.020017
0.095182 -0.136002 -0.003085
-0.489991 -0.247028 -0.029604
0.182644 -0.257377 0.026859
-0.073366 0.016283 0.053725
-0.097568 -0.012733 0.058275
-0.499271 -0.208318 0.062257
-0.279059 0.322836 0.058253
-0.245375 -0.280064 0.062168
-0.305471 -0.077155 0.062868
0.179524 -0.277118 0.024271
-0.077329 -0.020367 -0.047693
-0.247638 -0.287568 0.034323
0.095136 -0.136068 0.007907
-0.477372 -0.091479 0.031689
-0.112508 -0.295231 -0.031911
0.106256 -0.043319 -0.018021
-0.100832 -0.005816 0.058653
0.180517 -0.214280 0.001148
0.180517 -0.270840 0.026888
-0.086780 0.017810 0.054700
0.114415 -0.040184 -0.018033
0.088290 -0.130489 0.001091
-0.232045 -0.250130 -0.059718
-0.211074 -0.276515 -0.058993
-0.100899 -0.005664 0.060948
-0.062850 0.003277 -0.051584
-0.432465 -0.256639 -0.031807
-0.037183 0.016120 0.022194
-0.492594 -0.187640 -0.028678
0.027892 -0.165721 0.035217
-0.301744 0.046053 0.062615
-0.043501 -0.179443 0.062878
-0.478481 -0.098201 -0.074294
-0.214217 -0.281156 0.062764
0.179795 -0.275224 -0.040001
-0.346418 0.165993 -0.033273
0.079018 0.008499 -0.018105
-0.453925 -0.133620 -0.065492
-0.045572 0.027068 0.020063
0.464984 -0.392436 -0.001391
-0.420960 -0.116426 -0.074300
-0.256058 0.002572 -0.060214
-0.084978 -0.020681 -0.052982
-0.386421 -0.173036 -0.065463
-0.084896 -0.020461 0.055247
-0.494995 -0.241262 0.001714
-0.309454 -0.146258 -0.059870
-0.053649 -0.243323 -0.059932
0.429433 -0.265370 0.011219
-0.238985 0.351809 -0.053586
-0.038391 -0.167460 0.062257
-0.038391 -0.167460 0.062259
-0.399367 -0.247499 -0.058909
-0.150962 -0.286778 -0.061683
0.155851 -0.187289 0.001112
-0.330195 0.088740 0.034917
0.160815 -0.287549 0.062943
-0.280191 -0.123021 0.062064
0.103323 -0.143479 0.026692
-0.049586 -0.135394 0.001162
-0.357536 -0.130073 -0.074321
0.486765 -0.332979 0.036462
-0.335584 0.362829 -0.036480
0.073550 0.001782 0.020047
0.164804 -0.198680 -0.059914
0.043698 -0.235409 0.065037
-0.357979 0.300576 -0.060743
-0.078770 0.018292 0.060882
-0.053649 -0.243323 -0.059867
-0.308376 0.353318 0.053577
-0.305747 0.371546 -0.059197
0.141968 -0.310625 0.001373
-0.352726 -0.158345 -0.068957
-0.038483 -0.167708 -0.059440
-0.038483 -0.167708 -0.059441
-0.096754 -0.013486 0.058143
0.027931 -0.164003 0.001161
-0.295753 0.329983 -0.059120
-0.448851 -0.102557 0.077101
-0.041215 0.021315 0.022968
-0.167008 0.192562 0.062215
-0.321345 -0.214836 -0.059722
-0.414773 -0.141137 0.083882
-0.259309 0.389599 0.060263
-0.081699 0.018162 0.053728
-0.355603 0.331717 -0.060808
-0.040301 -0.169029 -0.059510
-0.040301 -0.169029 -0.059512
-0.316858 -0.017367 0.035535
-0.067053 -0.013452 0.039021
0.043073 -0.234942 -0.062886
-0.427872 -0.246292 -0.066461
-0.418026 -0.169782 -0.080542
-0.234971 0.269753 0.062109
-0.306840 -0.141281 -0.080684
0.145652 -0.284934 -0.059933
-0.063262 0.004171 -0.051586
-0.067783 -0.093658 0.001091
0.425186 -0.313969 -0.039912
-0.319943 -0.045281 -0.032017
0.022340 0.022216 0.017850
-0.251583 0.384569 -0.059264
0.494237 -0.313626 -0.025029
0.080728 -0.160531 -0.051360
-0.067273 -0.120306 -0.032822
-0.093454 0.014540 -0.058631
-0.298520 -0.230654 -0.059707
-0.425991 -0.162557 0.068838
-0.380548 -0.134633 -0.070169
0.123557 -0.208651 0.062811
-0.427583 -0.157474 -0.080560
-0.450336 -0.111604 0.068753
-0.324463 -0.103119 -0.059947
-0.306428 -0.222397 -0.084136
-0.240821 0.370071 0.039472
-0.316812 0.121417 0.062473
-0.098559 0.009154 0.057330
-0.399269 -0.247237 0.069788
-0.352626 -0.158076 0.063068
-0.380044 -0.250335 -0.058918
-0.123573 0.006790 0.062560
-0.040209 -0.168781 0.062335
-0.040209 -0.168781 0.062337
0.420512 -0.321707 -0.032356
-0.338774 0.127236 0.034914
0.429418 -0.265410 -0.008889
0.433594 -0.260879 0.001151
0.497826 -0.291021 0.014420
-0.295753 0.329984 -0.059002
-0.072219 0.015617 -0.051602
-0.043890 0.024768 -0.018405
-0.407602 -0.221190 -0.065349
0.181592 -0.264082 0.044330
0.118314 -0.280320 0.062961
0.022314 0.022147 -0.015897
-0.028612 -0.162775 0.061955
0.105176 -0.144656 0.023764
0.094849 -0.136557 -0.018169
0.104744 -0.145013 0.041806
-0.294225 0.385917 0.060297
-0.376132 -0.230885 -0.059648
-0.390547 -0.200870 0.077257
-0.462627 -0.189216 0.068920
-0.293326 -0.240212 -0.059691
-0.305681 0.371726 0.028921
-0.243857 0.375448 -0.021386
-0.150762 -0.261993 0.063127
-0.306492 -0.138232 -0.059889
-0.157700 0.342922 -0.031963
-0.477510 -0.092102 -0.059166
-0.372594 0.341882 0.033448
0.087602 -0.181139 0.061904
-0.420095 -0.143182 -0.080595
0.029508 -0.186635 0.064949
-0.062831 0.002826 -0.051583
0.143067 -0.301727 -0.033098
0.420504 -0.343682 -0.009704
-0.287963 0.325216 -0.058705
-0.096552 0.011326 0.056813
-0.245234 0.378026 -0.009380
0.174355 -0.198871 0.001122
0.490282 -0.338709 -0.005459
0.432718 -0.266478 0.022478
-0.035808 0.026726 0.020079
0.491337 -0.332002 -0.017277
0.095553 -0.165725 -0.051360
-0.422381 -0.167019 0.068845
0.104682 -0.145178 -0.039296
0.027404 -0.177857 0.062226
-0.142278 0.201216 0.000547
-0.500000 -0.234591 0.001705
-0.309260 0.083504 -0.060338
-0.308335 0.362789 -0.043679
0.156978 -0.188074 -0.031958
-0.082098 -0.040270 0.037371
0.186607 -0.232303 0.029264
0.043171 -0.234680 0.065854
0.500000 -0.277230 0.001101
-0.077247 -0.020146 0.060959
0.498295 -0.287947 -0.024943
-0.307698 -0.130264 -0.080706
-0.062468 -0.004156 0.052595
0.491365 -0.331926 0.019962
-0.344001 0.230149 -0.060610
-0.078432 0.017907 -0.051602
-0.036479 0.014867 0.041587
-0.071681 0.015403 -0.058649
0.427877 -0.275266 0.028655
0.496055 -0.274117 0.011630
-0.266697 0.064720 -0.060332
-0.378705 -0.123095 -0.065570
0.466246 -0.391302 -0.001409
-0.097783 -0.012854 -0.058572
0.491393 -0.331784 0.033144
-0.064329 -0.015120 0.030880
0.175082 -0.305131 -0.009595
0.183630 -0.222439 0.012461
-0.043104 -0.176591 -0.059863
0.082093 -0.202046 0.062829
-0.303039 0.376029 0.014135
0.164896 -0.198431 0.062170
-0.098556 0.009162 0.060916
-0.286368 -0.141378 -0.059898
0.490293 -0.338681 0.008172
0.027311 -0.178105 -0.059466
-0.327185 -0.213164 -0.084139
-0.369755 -0.161736 -0.074247
0.421971 -0.312461 -0.036257
0.112117 -0.129151 -0.017850
0.175776 -0.300830 0.022955
-0.007715 -0.253532 0.063002
-0.380443 -0.134350 0.068746
-0.354149 -0.178521 -0.066654
-0.253021 0.328881 -0.059150
-0.167115 0.004613 -0.060285
-0.033995 0.011928 -0.018905
-0.346367 0.166132 0.034819
-0.477413 -0.091840 0.069528
-0.065122 -0.011361 0.040630
-0.392754 -0.136794 0.068761
-0.152116 -0.086622 -0.060111
-0.076596 -0.019865 0.049626
-0.036540 0.014702 -0.039514
0.120757 -0.099965 0.020218
-0.065107 -0.011320 0.060932
-0.327871 -0.153393 -0.059842
-0.492128 -0.184585 -0.066537
-0.062770 0.003491 0.053743
-0.360221 -0.205993 -0.066594
0.428835 -0.269184 0.020597
0.125423 -0.182547 -0.033755
-0.067222 -0.120168 0.035111
-0.035754 0.014396 0.019533
-0.354144 -0.178515 -0.074225
0.105317 -0.144456 -0.015857
0.186318 -0.234140 0.031698
0.052062 -0.159712 0.001135
-0.157651 0.343053 0.032504
-0.096636 0.011099 -0.054634
0.171488 -0.205179 -0.059427
-0.091880 -0.017881 0.057714
0.179058 -0.218496 0.062511
0.422212 -0.332823 -0.028838
-0.251936 -0.025624 -0.060159
-0.298769 -0.048765 0.062805
-0.489286 -0.241079 0.062273
-0.271039 0.309029 0.062057
-0.130789 -0.302078 0.001563
-0.445088 -0.215906 0.068961
-0.086355 -0.019919 0.056751
0.115432 -0.185798 -0.059234
-0.427836 -0.246051 0.062237
0.105151 -0.144733 -0.021251
-0.409970 -0.140465 -0.065511
-0.457056 -0.237982 -0.074026
0.425110 -0.292599 -0.036300
-0.064713 -0.010248 0.042477
-0.263161 0.279959 0.062110
-0.310928 -0.125607 0.083772
-0.287937 0.325199 -0.059116
0.105343 -0.144387 0.018070
-0.080083 0.026456 0.030918
0.095566 -0.137348 0.024475
0.072833 -0.273161 0.062981
-0.089035 -0.130759 0.062813
-0.078511 -0.092598 -0.033594
-0.245467 -0.280310 -0.058959
-0.305724 0.371609 -0.028273
-0.447919 -0.096517 0.061949
-0.191451 -0.256186 -0.059736
-0.203828 -0.078185 0.062793
-0.499915 -0.208225 0.077355
-0.360216 -0.205979 -0.059710
-0.136080 -0.145793 0.062002
-0.278890 0.322832 0.058201
-0.308269 0.362968 0.044502
-0.154090 -0.162409 -0.059955
-0.252932 0.329122 0.059407
-0.241499 0.343252 0.060344
0.099440 -0.140505 0.026739
-0.046608 0.029605 0.000867
0.468563 -0.350615 -0.003470
0.181541 -0.264214 -0.024893
-0.157223 -0.291721 0.064621
-0.254201 -0.051120 0.062776
0.433358 -0.262338 -0.009879
-0.101290 0.001744 -0.056004
-0.321143 -0.122860 -0.080711
-0.492031 -0.184324 0.062160
-0.453817 -0.133330 0.077167
-0.063182 0.004385 0.053742
0.486711 -0.333122 -0.034009
0.475650 -0.351750 0.004145
0.495397 -0.278194 -0.019235
-0.430291 -0.249218 -0.058813
-0.386313 -0.172746 0.077196
-0.422736 -0.167152 -0.065447
0.474592 -0.351349 0.006122
-0.241706 0.342820 -0.056230
-0.109280 0.029227 -0.034143
0.080808 -0.160317 0.053968
-0.247343 0.380274 0.000263
-0.071676 0.015418 -0.051602
0.186610 -0.232304 0.035775
-0.306825 -0.141239 -0.059883
0.058400 -0.176525 0.061917
0.185130 -0.241609 0.014556
0.183262 -0.253285 -0.040048
-0.458333 -0.161572 -0.074180
-0.282628 0.144185 0.062401
-0.279292 0.322647 -0.057143
-0.376260 -0.108117 -0.066623
-0.300870 0.379605 0.060315
-0.120446 -0.007322 -0.060296
0.024022 0.032961 -0.018114
-0.137783 -0.298088 0.062123
0.492730 -0.323140 -0.034409
-0.235329 0.127500 0.062399
0.112849 -0.070537 0.020165
0.186272 -0.234263 -0.028984
-0.308471 0.357736 -0.050501
-0.280283 -0.123267 -0.059062
-0.141275 0.295329 0.000355
-0.070375 -0.017144 -0.039585
0.092853 -0.018652 -0.018061
-0.499478 -0.208434 0.069665
0.167077 -0.192658 -0.031474
-0.086416 0.017989 0.060888
0.181680 -0.263251 -0.056733
-0.427769 -0.246015 0.069807
0.424255 -0.384667 -0.001391
-0.038391 -0.167459 0.062915
-0.105204 -0.268913 0.061205
-0.163506 -0.295949 -0.060181
-0.005377 0.025131 0.020059
-0.072139 0.015832 0.053725
0.423420 -0.345493 0.001329
-0.476955 -0.088751 0.001391
-0.417913 -0.169478 0.068846
-0.270229 0.322373 -0.055914
-0.070314 -0.016979 0.041620
-0.338945 0.096107 0.000910
-0.085295 -0.020564 -0.053302
-0.344715 -0.156737 -0.059822
-0.072027 0.015790 0.053725
-0.256152 -0.076210 -0.060053
0.057171 -0.184437 -0.062182
-0.240805 0.370113 0.060289
0.056782 -0.197080 -0.060044
0.495428 -0.278111 0.021451
-0.313706 -0.149942 -0.080661
-0.427470 -0.157170 0.068828
-0.100993 -0.005761 -0.056393
-0.352615 -0.158047 0.077141
0.070775 -0.200395 -0.060048
0.107532 -0.146273 -0.018061
-0.324261 -0.123439 -0.059475
-0.470368 -0.211571 0.068972
0.178641 -0.282589 -0.017141
0.104160 -0.125521 0.020283
0.177586 -0.289297 -0.005323
-0.324169 -0.123192 0.062307
-0.062552 -0.004382 -0.058616
0.182722 -0.220818 0.001334
0.045239 -0.260292 0.062975
0.112124 -0.098601 0.020222
-0.005147 0.022925 0.017869
0.081387 -0.180157 0.061907
-0.426405 -0.150694 0.068814
-0.300993 0.379357 0.000305
-0.093167 0.014681 -0.053742
0.095633 -0.165511 0.053967
0.175643 -0.198841 -0.030419
-0.444821 -0.216985 -0.065329
-0.183256 -0.286182 -0.059754
0.177310 -0.290918 -0.051966
0.094079 -0.177689 0.037280
0.178669 -0.282514 0.020098
-0.238662 0.361203 0.060306
-0.346533 -0.112815 -0.066779
-0.308499 0.353824 0.053382
-0.149802 0.295671 -0.037911
-0.219905 0.047045 -0.060331
-0.241501 0.343245 0.057173
-0.086104 0.017773 -0.052421
0.491345 -0.331914 -0.030707
0.022238 -0.232292 -0.062058
-0.407553 -0.220370 0.077309
0.105678 -0.143853 0.001105
-0.412658 -0.170263 -0.080545
-0.385076 -0.164507 0.068811
0.423641 -0.323966 0.038205
0.121540 -0.069620 0.020156
-0.187577 0.106183 0.062406
-0.084514 -0.020446 0.054978
0.165186 -0.260449 0.062885
-0.419982 -0.142878 0.068794
-0.114930 -0.038986 -0.060236
-0.219641 -0.291358 0.035103
-0.036604 0.028787 0.017881
-0.051006 -0.246956 -0.059926
0.167326 -0.215814 -0.060090
-0.144254 -0.117910 0.062829
0.177597 -0.289269 0.008308
-0.480344 -0.237103 -0.068817
-0.005172 0.022857 -0.015877
-0.487514 -0.245708 0.001718
-0.062764 0.003506 0.060900
-0.426960 -0.151842 -0.080572
-0.273414 0.098121 -0.060395
-0.247829 -0.284170 0.001615
0.492784 -0.322995 0.036808
-0.161870 -0.300527 0.001583
0.086839 -0.301913 0.001397
-0.375087 -0.108017 0.065824
-0.097849 -0.012701 -0.056027
-0.222982 -0.152429 0.062959
-0.117466 -0.023176 -0.060266
-0.043401 0.025076 0.006936
-0.040303 -0.169034 -0.062139
0.088178 -0.293076 -0.033109
-0.306218 -0.135651 -0.080696
-0.062962 0.003908 0.053742
-0.433155 -0.254743 0.001695
0.106285 -0.043242 0.020114
-0.028704 -0.163022 -0.059171
0.073220 -0.151644 -0.028678
0.174863 -0.306552 0.001513
-0.150099 0.348445 0.000254
-0.051006 -0.246956 -0.059861
-0.193143 -0.292812 0.001591
-0.220496 -0.288549 0.001603
0.114444 -0.040107 0.020101
0.465241 -0.391146 -0.002428
-0.448966 -0.102865 -0.074307
0.093106 -0.204009 0.062825
-0.086439 -0.020146 -0.054462
-0.036629 0.028718 -0.015866
-0.129027 0.083618 0.033566
0.087510 -0.181386 -0.059222
0.483563 -0.353144 0.001270
-0.156012 -0.060897 0.062722
-0.052235 -0.244889 0.063018
-0.306410 -0.222347 -0.059718
-0.424331 -0.146824 -0.080584
0.079047 0.008577 0.020029
0.066600 -0.178081 -0.059213
0.045145 -0.260546 -0.062018
-0.272649 0.322667 0.056280
-0.279148 0.322598 -0.059117
-0.104592 -0.246539 -0.059821
0.497807 -0.291075 -0.011911
0.157887 -0.303888 -0.032977
-0.318795 -0.151360 0.063029
-0.287937 0.325200 -0.058704
0.184982 -0.227008 0.022818
0.498367 -0.287563 0.001247
0.450196 -0.348231 0.006262
0.423418 -0.345426 0.000810
-0.378597 -0.122804 0.077089
-0.038434 0.016842 0.041585
0.050872 -0.190010 0.064939
0.488240 -0.323437 -0.038094
-0.175617 0.332502 -0.060946
-0.031880 0.016498 0.017903
0.183254 -0.222374 0.012463
-0.399264 -0.247222 0.077358
-0.420852 -0.116135 0.068740
-0.295663 0.330226 0.060159
-0.293937 -0.020109 -0.060139
0.421193 -0.339410 0.022635
-0.042118 -0.170351 -0.060089
-0.352723 -0.158336 -0.064640
-0.100988 -0.005903 -0.056401
-0.246286 0.335433 0.058849
-0.308494 0.353838 0.060373
0.496329 -0.300521 0.024079
0.183252 -0.212708 0.034910
-0.259646 0.030131 -0.060267
-0.325761 0.346760 -0.060861
0.488696 -0.348794 0.010796
-0.034274 -0.168111 0.062258
0.182737 -0.220821 0.001334
0.422028 -0.312309 0.038789
0.178239 -0.285285 0.038626
0.101739 -0.012138 0.017860
0.105297 -0.144460 0.020294
-0.122758 -0.300892 -0.031137
-0.390662 -0.201178 -0.074151
0.043330 -0.261863 -0.059967
-0.038495 0.016677 -0.039517
-0.031906 0.016429 -0.015844
0.097899 -0.174938 0.001131
-0.101072 -0.001333 0.058369
-0.347984 -0.128167 -0.069391
-0.100901 -0.005669 0.058655
-0.052330 -0.245143 -0.061975
-0.062746 -0.004910 -0.049528
0.090690 -0.133269 0.020395
0.475560 -0.352126 0.001278
-0.260985 0.324743 0.058808
0.104120 -0.144015 0.025795
0.491527 -0.302635 -0.038139
-0.499265 -0.230146 0.077399
-0.096840 -0.013718 -0.055864
0.426907 -0.303074 -0.041388
0.173511 -0.315105 0.001359
-0.272733 0.322441 -0.055178
-0.499316 -0.209253 -0.077298
-0.083615 -0.067879 0.034826
-0.034366 -0.168358 -0.059443
0.094776 -0.136645 0.023312
-0.407637 -0.221210 -0.075306
0.418303 -0.335723 -0.018107
-0.071596 0.015632 0.053725
-0.499329 -0.230669 0.069829
0.043330 -0.261863 -0.059902
-0.315774 -0.123342 -0.080714
0.101713 -0.012206 -0.015887
-0.225941 0.077590 -0.060389
-0.255965 0.002822 0.062668
0.183201 -0.212845 -0.032624
0.049579 0.016364 -0.018099
-0.399932 -0.254472 0.062233
0.053004 -0.163041 0.035671
0.178183 -0.285436 -0.035693
-0.375381 0.306679 -0.036715
-0.489378 -0.241325 -0.058853
-0.212012 0.352531 -0.060959
-0.307682 -0.130221 -0.059614
-0.100570 0.003696 0.058010
-0.427541 -0.157553 -0.065463
-0.287847 0.325441 0.059865
0.093004 -0.135496 0.041795
-0.309361 -0.146008 0.063011
-0.245272 0.377924 -0.059255
-0.327166 -0.213114 -0.059721
0.058380 -0.197446 -0.060045
-0.308394 0.357943 0.051449
-0.035725 0.014352 -0.016193
0.499811 -0.278451 0.010645
0.425167 -0.292446 0.038746
0.123740 -0.069393 0.017960
-0.426092 -0.162830 -0.065453
-0.269983 0.322369 -0.055986
-0.422623 -0.166848 0.083941
-0.375325 0.306831 0.037732
-0.347792 -0.127867 0.069757
-0.238989 0.351798 -0.059207
-0.450438 -0.111878 -0.065539
-0.357886 0.300826 0.062139
-0.239105 0.351404 -0.053705
-0.246224 0.335534 0.058828
-0.083667 -0.068016 -0.032726
-0.448011 -0.096763 -0.059180
-0.388742 -0.104721 0.033278
-0.086421 0.017977 0.054633
-0.053556 -0.243073 0.063015
-0.084982 -0.020692 -0.058566
-0.043011 -0.176342 0.062724
0.419261 -0.329642 -0.026165
0.116508 -0.039317 0.017904
0.092943 -0.135661 -0.039307
0.165698 -0.191916 0.001114
-0.045909 -0.179073 0.062879
-0.210315 -0.007231 -0.060228
0.184936 -0.242904 0.038535
-0.136172 -0.146039 -0.059124
0.186319 -0.233906 -0.052089
-0.448008 -0.096780 -0.066746
0.492185 -0.326623 -0.021474
-0.313690 -0.149900 -0.059860
-0.305657 0.371790 0.060335
0.485401 -0.341431 -0.027525
-0.448638 -0.096135 -0.028895
-0.355510 0.331967 0.062074
0.123714 -0.069461 -0.015787
-0.295663 0.330226 0.060412
-0.424758 -0.164144 0.068841
-0.253021 0.328883 -0.058319
-0.470526 -0.213503 -0.076881
-0.492122 -0.184570 -0.058967
0.145745 -0.284684 0.062949
-0.246449 0.335123 -0.057810
-0.031381 0.009187 0.000897
-0.053556 -0.243073 0.063080
0.022658 0.024329 -0.018095
0.430294 -0.281859 0.038115
0.485445 -0.341314 0.030014
-0.036258 0.014983 0.020569
0.116482 -0.039386 -0.015843
0.490147 -0.339581 0.001359
0.424647 -0.345030 -0.003417
0.058309 -0.176771 -0.059209
0.083458 -0.217612 -0.060023
-0.093364 0.014783 0.060900
-0.137874 -0.298335 -0.059004
-0.499623 -0.208701 -0.066520
0.184880 -0.243055 -0.035784
-0.251492 0.384812 0.060267
-0.476145 -0.248673 0.001715
-0.080129 0.026333 -0.029206
0.490708 -0.336070 0.014517
-0.422482 -0.167292 -0.065447
-0.306440 0.344685 -0.059141
-0.074998 -0.019290 -0.046855
0.099412 -0.140600 -0.024234
-0.268189 0.391954 -0.059267
0.425249 -0.313802 0.042443
0.112145 -0.129074 0.020284
-0.066663 0.010786 -0.051597
-0.036445 0.015107 -0.018782
-0.457050 -0.237966 -0.066455
-0.150866 -0.286521 0.064775
0.425215 -0.386139 0.004379
-0.429297 -0.246279 -0.059119
-0.427928 -0.246296 -0.058911
-0.306438 0.344692 -0.055734
0.115742 -0.296864 -0.032883
-0.307344 -0.131448 -0.059664
0.494274 -0.313567 0.038044
-0.346412 -0.112541 0.069449
-0.412544 -0.169960 0.068843
-0.064374 -0.015242 -0.029023
-0.352623 -0.158067 0.067628
0.426626 -0.283200 0.034846
-0.376039 -0.230635 0.063234
-0.101292 0.001739 -0.058599
0.185111 -0.241663 -0.011775
-0.065869 0.009823 -0.051595
-0.354133 -0.178486 -0.059771
-0.346750 -0.112504 0.061903
-0.414897 -0.141472 -0.080602
-0.399750 -0.251342 -0.059509
-0.246375 0.335193 -0.059168
0.423585 -0.324116 -0.035631
-0.354046 -0.178244 0.069614
-0.352728 -0.158341 -0.066696
-0.351153 -0.092628 0.001303
0.185671 -0.238151 0.001383
-0.453932 -0.133638 -0.074240
0.081295 -0.180403 -0.059219
-0.492025 -0.184308 0.069730
-0.380544 -0.134623 -0.065545
-0.360118 -0.205716 0.069673
-0.426847 -0.151539 0.068816
-0.269986 0.322362 -0.059124
-0.238951 0.362352 0.050457
-0.392855 -0.137067 -0.065531
-0.092437 0.015018 -0.053577
-0.042563 0.023059 0.022990
-0.309167 0.083754 0.062544
0.156943 -0.192096 0.061874
-0.041977 0.022105 0.041577
0.183633 -0.251109 0.024215
-0.318779 -0.151318 0.083830
-0.064477 -0.042691 0.000985
-0.312525 -0.148898 -0.059863
0.175744 -0.300917 -0.019953
-0.341960 -0.092501 -0.030857
-0.343908 0.230399 0.062272
-0.481273 -0.238159 0.060565
-0.219692 -0.291495 -0.031888
-0.277351 0.392193 -0.059260
0.090780 -0.276263 -0.059909
-0.418420 -0.101178 0.061935
-0.133282 -0.304007 0.033031
-0.424218 -0.146520 0.068804
-0.306202 -0.135608 -0.059799
0.499243 -0.282070 0.019543
-0.321035 -0.122570 0.062260
-0.266604 0.064970 0.062550
-0.092160 -0.018040 -0.055458
0.043602 -0.235667 -0.062067
-0.071591 0.015647 0.060882
0.104158 -0.161217 0.001098
-0.463291 -0.252443 -0.031029
0.098475 -0.141020 0.041802
-0.098637 0.008941 0.057356
-0.035700 0.014422 0.017974
-0.261074 0.324503 -0.059135
0.046963 -0.259221 -0.059976
-0.205341 -0.054698 -0.060135
-0.042118 -0.170349 -0.059581
-0.042118 -0.170349 -0.059579
-0.456953 -0.237704 0.062242
-0.286275 -0.141128 0.062984
-0.217275 -0.284945 0.062186
0.099922 -0.013512 -0.018076
-0.253077 0.328851 -0.058315
-0.042038 0.021940 -0.039525
0.425259 -0.384828 -0.002411
-0.097693 -0.012611 0.060959
-0.167022 0.004863 0.062597
-0.307590 -0.129972 0.062551
0.080437 0.010292 0.017830
-0.352730 -0.158355 -0.074267
-0.245159 -0.276319 -0.059692
-0.152023 -0.086372 0.062771
0.428631 -0.292172 -0.039959
0.030845 -0.172171 0.061929
-0.162417 -0.302573 0.034779
-0.480894 -0.237519 0.070094
0.143119 -0.301587 0.035806
-0.176428 0.049171 -0.060369
-0.355331 -0.105337 0.033460
-0.252931 0.329124 0.060382
0.417720 -0.339496 0.011379
-0.496502 -0.239373 0.039566
-0.163528 -0.015269 -0.060247
-0.101159 -0.001566 -0.056133
-0.355405 0.172984 0.000766
0.156508 -0.312610 0.001366
-0.327778 -0.153143 0.063040
-0.043861 0.024847 0.020156
0.098414 -0.141185 -0.039299
-0.312418 -0.148636 0.063019
-0.253269 0.203849 0.062257
0.489277 -0.345139 0.019679
0.046963 -0.259221 -0.059910
-0.040133 0.019219 0.041581
0.094878 -0.136478 0.020366
0.167127 -0.192526 0.033703
-0.207732 0.376348 0.000241
-0.032702 0.018490 -0.018041
0.474580 -0.351400 -0.003333
-0.476990 -0.239812 0.063582
-0.328343 -0.070927 -0.033063
-0.321127 -0.122817 -0.059419
-0.301975 0.336872 0.059114
0.494382 -0.284598 -0.027647
-0.093451 0.014550 -0.053807
0.169369 -0.230848 -0.060061
-0.062603 -0.002944 -0.051572
-0.085481 -0.173205 -0.059985
0.024051 0.033038 0.020021
0.092882 -0.018574 0.020074
0.080412 0.010223 -0.015916
-0.238669 0.361184 0.050993
-0.348693 -0.128032 0.077077
0.003056 -0.167779 0.061941
-0.213868 0.016499 -0.060274
0.104092 -0.144103 -0.023281
0.448919 -0.348117 -0.003447
0.423406 -0.345038 -0.002152
0.432686 -0.266565 -0.020152
-0.484130 -0.237217 -0.070315
0.494425 -0.284481 0.029892
-0.244685 -0.271768 -0.058977
-0.458225 -0.161281 0.068860
-0.309346 -0.145965 0.083812
-0.066082 -0.012494 -0.037882
0.095828 -0.137994 0.041798
-0.131418 -0.294422 -0.059435
-0.183163 -0.285933 0.062892
-0.040195 0.019054 -0.039520
-0.191358 -0.255936 0.063145
-0.489943 -0.246901 0.033048
0.029939 -0.187621 -0.062972
0.179489 -0.277211 -0.021338
0.490158 -0.339443 -0.024833
-0.153997 -0.162159 0.062926
-0.323541 0.050330 -0.033174
0.075666 -0.156523 -0.051364
-0.360123 -0.205729 0.063171
0.114422 -0.306158 0.001385
0.176847 -0.294076 0.031827
0.424655 -0.344986 0.006256
-0.242343 0.372860 0.035579
0.181767 -0.263015 0.059272
-0.347042 -0.127731 0.062787
-0.496968 -0.241249 0.032806
-0.287847 0.325442 0.060415
-0.324409 -0.102982 0.062935
-0.418015 -0.169751 -0.065445
0.179858 -0.275055 0.042891
0.029412 -0.186893 -0.062156
0.184811 -0.226979 0.022820
0.122941 -0.100315 0.018023
0.177451 -0.290169 0.001495
0.426575 -0.283337 -0.032439
-0.425979 -0.162526 0.083934
0.095767 -0.138159 -0.039304
0.496263 -0.272769 0.001097
-0.408704 -0.169198 0.068839
0.498334 -0.287841 0.027191
-0.418501 -0.101443 -0.066761
-0.427571 -0.157443 -0.065463
-0.042025 -0.170101 0.062413
-0.302065 0.336631 -0.059128
-0.268503 -0.101978 -0.059991
0.417705 -0.339537 -0.008730
-0.308347 0.362758 -0.059177
-0.062567 -0.003868 -0.051570
0.178012 -0.286658 0.014653
-0.042025 -0.170101 0.062415
-0.066061 0.010211 -0.058643
-0.306732 -0.140989 0.062999
-0.429223 -0.246106 0.062628
-0.378711 -0.123112 -0.074319
-0.426506 -0.150968 -0.065477
-0.092163 -0.018047 -0.058566
-0.450330 -0.111587 0.077121
-0.302106 0.336712 -0.057966
-0.051088 -0.141673 0.036373
0.488299 -0.323277 0.040506
-0.120353 -0.007072 0.062585
0.426972 -0.302900 0.043872
-0.006323 0.033745 -0.018092
-0.311053 -0.125941 -0.080712
0.122916 -0.100384 -0.015724
-0.399378 -0.247530 -0.074050
0.090903 -0.164900 -0.051358
-0.171689 0.027216 -0.060328
-0.168999 0.294098 -0.060872
-0.385178 -0.164780 -0.065480
-0.066583 0.011001 0.053731
-0.420083 -0.143151 -0.065498
-0.344622 -0.156487 0.063059
-0.331441 0.056731 0.000984
-0.025946 -0.155089 -0.032997
-0.206769 0.192339 0.062245
-0.325230 0.161560 -0.060485
0.499215 -0.282145 -0.017321
-0.306184 0.370019 0.035265
-0.240551 0.368533 -0.040774
0.072156 0.000058 0.017857
-0.297447 0.012873 -0.060203
0.070868 -0.200145 0.062834
-0.093617 -0.016385 0.057989
-0.098491 0.009092 -0.055102
-0.448888 -0.093143 0.001378
0.498222 -0.288463 -0.005567
-0.460485 -0.243600 0.062256
0.430239 -0.282009 -0.035722
-0.131326 -0.294174 0.062528
-0.065790 0.010037 0.053732
0.100052 -0.164686 -0.029633
-0.462620 -0.189199 0.077288
0.107561 -0.146195 0.020278
-0.307251 -0.131199 0.062609
-0.084903 -0.248996 0.063051
-0.109770 -0.068307 -0.060180
-0.299776 0.215420 0.062269
-0.067111 -0.013607 -0.037032
0.109937 -0.098260 0.018029
0.154852 -0.213795 -0.060084
-0.477420 -0.091610 -0.028896
0.069829 -0.289882 -0.032989
-0.160200 -0.035397 -0.060209
-0.493066 -0.190712 0.001610
0.176801 -0.294200 -0.028855
0.030036 -0.187359 0.065768
-0.499379 -0.230454 -0.074009
0.491586 -0.302475 0.040461
-0.372644 0.341748 -0.032578
-0.062462 -0.004139 0.060915
-0.124309 0.079963 0.000780
0.497149 -0.295218 -0.017356
-0.219812 0.047295 0.062550
0.072130 -0.000011 -0.015889
-0.376028 -0.230606 0.077306
0.489249 -0.345214 -0.017186
-0.346972 -0.127714 0.064318
-0.212616 -0.133699 0.062035
0.095542 -0.137430 -0.021979
0.001218 -0.161696 -0.032406
-0.143872 0.085001 -0.060466
-0.192266 -0.296826 -0.031069
-0.208607 -0.108040 -0.060024
-0.238746 0.360978 -0.050169
-0.114837 -0.038736 0.062646
-0.414784 -0.141168 0.068786
0.498232 -0.288436 0.008064
-0.338542 -0.071519 0.001251
0.497178 -0.295143 0.019882
0.109911 -0.098329 -0.015718
0.465247 -0.391130 0.005393
0.157939 -0.303748 0.035672
0.167419 -0.215564 0.062792
0.174794 -0.306889 -0.033035
-0.399657 -0.251093 0.062835
0.110418 -0.147495 0.001109
-0.206761 -0.030961 -0.060183
-0.328622 -0.044457 0.001188
-0.070390 -0.017183 -0.058584
-0.287805 0.325428 0.059858
-0.273321 0.098371 0.062487
-0.082153 -0.040418 -0.035385
-0.117373 -0.022926 0.062615
-0.499446 -0.231250 0.062261
-0.355195 -0.105539 -0.030755
-0.420954 -0.116408 -0.065552
0.091090 -0.019880 0.017884
-0.050913 -0.246706 0.063020
-0.127475 -0.266117 -0.059764
-0.346842 -0.112750 -0.059223
3 738 1069 646
3 1069 327 646
3 1069 160 327
3 1069 330 160
3 646 34 738
3 646 976 34
3 1069 805 330
3 805 673 330
3 673 652 330
3 652 799 330
3 652 4 799
3 652 943 4
3 652 544 943
3 652 0 544
3 0 540 544
3 0 1159 540
3 1159 1297 540
3 652 3 0
3 3 1056 0
3 3 292 1056
3 3 956 292
3 3 559 956
3 1297 214 540
3 3 827 559
3 292 508 1056
3 214 1 540
3 799 1230 330
3 1069 1163 805
3 1230 1281 330
3 652 1166 3
3 1056 1414 0
3 330 467 160
3 214 566 1
3 214 279 566
3 214 1289 279
3 214 949 1289
3 1281 21 330
3 949 1294 1289
3 1294 679 1289
3 1294 295 679
3 796 73 278
3 73 946 278
3 946 1381 278
3 1381 1252 278
3 1381 340 1252
3 1252 897 278
3 1252 436 897
3 436 87 897
3 436 1049 87
3 1049 743 87
3 1049 1427 743
3 1049 962 1427
3 962 118 1427
3 962 408 118
3 118 353 1427
3 353 865 1427
3 865 1374 1427
3 962 2 408
3 340 881 1252
3 340 1070 881
3 340 887 1070
3 340 1127 887
3 340 1197 1127
3 1127 264 887
3 118 241 353
3 278 1361 796
3 1361 731 796
3 731 968 796
3 968 642 796
3 118 547 241
3 547 780 241
3 780 61 241
3 547 1020 780
3 184 598 994
3 184 278 598
3 994 686 184
3 278 310 598
3 310 358 598
3 686 864 184
3 686 344 864
3 184 701 278
3 701 1233 278
3 1233 838 278
3 838 1361 278
3 838 180 1361
3 838 57 180
3 57 833 180
3 592 1353 232
3 1353 1399 232
3 1399 5 232
3 1399 609 5
3 6 208 881
3 6 431 208
3 431 879 208
3 881 1070 6
3 1070 979 6
3 730 1217 7
3 1217 348 7
3 348 1267 7
3 1267 471 7
3 350 1380 682
3 350 1087 1380
3 1087 1107 1380
3 682 1114 350
3 682 410 1114
3 473 676 467
3 467 330 473
3 177 85 8
3 1015 177 8
3 85 729 998
3 729 581 998
3 1015 8 85
3 100 54 182
3 658 100 182
3 998 896 85
3 896 1015 85
3 896 54 1015
3 484 71 297
3 297 84 484
3 1328 1092 1321
3 1014 584 583
3 654 584 655
3 1321 654 655
3 1321 655 1328
3 584 654 583
3 1217 730 1216
3 606 607 1043
3 620 607 619
3 620 619 1217
3 1216 620 1217
3 606 619 607
3 1310 762 988
3 988 708 1310
3 352 1188 1283
3 615 1283 1188
3 383 615 1188
3 169 615 383
3 440 169 383
3 399 440 383
3 127 399 383
3 1314 127 383
3 1078 1314 383
3 108 1078 383
3 290 1283 615
3 105 1283 290
3 414 105 290
3 205 414 290
3 791 205 290
3 517 791 290
3 922 284 1165
3 366 1165 284
3 883 366 284
3 685 922 1165
3 977 922 685
3 941 922 977
3 643 922 941
3 404 922 643
3 188 922 404
3 625 922 188
3 820 1165 366
3 627 820 366
3 954 820 627
3 713 820 954
3 1342 820 713
3 1050 820 1342
3 641 723 1176
3 641 1332 723
3 334 1332 641
3 170 576 500
3 1348 576 170
3 13 306 992
3 744 306 13
3 175 828 923
3 1027 392 406
3 912 406 392
3 1027 406 183
3 89 1429 912
3 349 1429 89
3 89 912 392
3 1229 766 605
3 605 745 1170
3 766 745 605
3 1005 1163 199
3 1005 745 1163
3 1170 745 1005
3 1272 69 342
3 342 69 1080
3 1154 1080 69
3 1396 1164 1303
3 1154 1164 1396
3 1080 1154 1396
3 68 435 886
3 68 1169 435
3 151 1169 68
3 651 214 1157
3 1157 1169 151
3 214 1169 1157
3 183 406 593
3 1332 593 406
3 593 1332 334
3 786 1425 1082
3 1181 1425 786
3 1176 723 1181
3 1425 1181 723
3 157 267 298
3 1307 267 157
3 1136 267 1307
3 266 267 1136
3 576 298 267
3 210 1082 1333
3 1350 1082 210
3 391 1082 1350
3 786 1082 391
3 1076 266 96
3 1064 266 1076
3 298 576 1348
3 829 266 1136
3 96 266 829
3 739 766 1229
3 500 766 739
3 1320 570 1064
3 181 570 1320
3 1333 570 181
3 266 1064 570
3 1082 570 1333
3 1272 263 69
3 992 69 263
3 373 1000 752
3 644 1000 373
3 744 752 306
3 1000 306 752
3 13 992 263
3 884 166 1178
3 901 1178 166
3 675 166 884
3 644 901 166
3 405 828 175
3 405 435 828
3 886 435 405
3 1200 644 929
3 901 644 1200
3 1405 929 644
3 373 1405 644
3 640 675 884
3 1111 675 640
3 407 675 1111
3 699 675 407
3 1155 675 871
3 1317 675 1155
3 699 871 675
3 923 675 1317
3 758 876 471
3 199 1163 876
3 60 854 1261
3 308 854 60
3 1062 854 308
3 1152 854 1062
3 1429 1261 854
3 889 1261 1429
3 735 854 1152
3 1201 735 1152
3 680 735 1201
3 889 1429 349
3 1104 471 1190
3 507 471 1104
3 758 471 507
3 837 471 680
3 579 471 837
3 1190 471 579
3 735 680 471
3 1303 1164 894
3 150 1219 172
3 1373 1219 150
3 12 590 329
3 1203 590 12
3 1227 329 590
3 1373 1227 590
3 1164 590 1203
3 894 1164 1203
3 1219 1373 590
3 142 949 986
3 1249 949 142
3 1246 986 949
3 1330 949 1067
3 172 949 1330
3 1249 1067 949
3 1219 949 172
3 651 1351 214
3 1246 214 1351
3 949 214 1246
3 791 517 329
3 12 329 517
3 308 1050 1342
3 60 1050 308
3 205 791 1227
3 329 1227 791
3 1062 1342 713
3 308 1342 1062
3 1373 205 1227
3 150 205 1373
3 414 205 150
3 1152 713 1201
3 1062 713 1152
3 954 1201 713
3 172 414 150
3 1330 414 172
3 105 414 1330
3 680 954 837
3 1201 954 680
3 627 837 954
3 1330 1067 105
3 1283 105 1067
3 579 837 366
3 627 366 837
3 1067 1249 1283
3 142 1283 1249
3 352 1283 142
3 1104 1190 883
3 579 883 1190
3 366 883 579
3 142 986 352
3 1188 352 986
3 507 1104 284
3 883 284 1104
3 405 1188 886
3 175 1188 405
3 68 886 1188
3 151 68 1188
3 1157 151 1188
3 383 1188 175
3 923 383 175
3 1351 1157 1188
3 1317 383 923
3 1155 383 1317
3 651 1157 1351
3 1246 1351 1188
3 986 1246 1188
3 739 284 500
3 1229 284 739
3 605 284 1229
3 1170 284 605
3 1005 284 1170
3 922 500 284
3 170 500 922
3 298 170 922
3 876 284 1005
3 157 298 922
3 1348 170 298
3 199 876 1005
3 758 284 876
3 507 284 758
3 1155 871 383
3 108 383 871
3 1307 157 625
3 922 625 157
3 871 699 108
3 407 108 699
3 1078 108 407
3 829 1136 188
3 1307 188 1136
3 625 188 1307
3 407 1111 1078
3 640 1078 1111
3 1314 1078 640
3 1076 96 404
3 829 404 96
3 188 404 829
3 640 884 1314
3 127 1314 884
3 1320 1064 643
3 1076 643 1064
3 404 643 1076
3 884 1178 127
3 399 127 1178
3 181 1320 941
3 643 941 1320
3 1178 901 399
3 1200 399 901
3 440 399 1200
3 210 1333 977
3 181 977 1333
3 941 977 181
3 1200 929 440
3 169 440 929
3 1350 210 685
3 977 685 210
3 929 1405 169
3 615 169 1405
3 391 1350 1165
3 685 1165 1350
3 1396 290 1080
3 1303 290 1396
3 342 1080 290
3 1272 342 290
3 263 1272 290
3 13 263 290
3 615 13 290
3 752 13 615
3 894 290 1303
3 1203 290 894
3 744 13 752
3 373 752 615
3 1405 373 615
3 89 820 349
3 392 820 89
3 1027 820 392
3 183 820 1027
3 593 820 183
3 334 820 593
3 1165 820 334
3 1181 1165 334
3 889 349 820
3 1261 889 820
3 641 1181 334
3 1176 1181 641
3 786 1165 1181
3 391 1165 786
3 1203 517 290
3 12 517 1203
3 820 1050 1261
3 60 1261 1050
3 898 851 756
3 892 898 756
3 925 756 851
3 957 925 851
3 965 925 957
3 1269 965 957
3 192 965 1269
3 596 192 1269
3 978 192 596
3 26 978 596
3 532 978 26
3 72 532 26
3 1268 532 72
3 867 1268 72
3 299 1268 867
3 219 299 867
3 696 299 219
3 1142 892 756
3 490 364 504
3 469 504 364
3 522 469 364
3 548 469 522
3 553 548 522
3 857 548 553
3 1221 857 553
3 223 857 1221
3 569 223 1221
3 1055 223 569
3 155 1055 569
3 1119 1055 155
3 847 1119 155
3 479 1119 847
3 1341 479 847
3 1257 479 1341
3 314 1257 1341
3 741 364 490
3 1024 997 938
3 899 938 997
3 938 899 667
3 633 667 899
3 667 633 56
3 30 56 633
3 56 30 1393
3 1359 1393 30
3 1393 1359 37
3 1426 37 1359
3 37 1426 518
3 482 518 1426
3 518 482 320
3 281 320 482
3 320 281 1409
3 1378 1409 281
3 1409 1378 135
3 98 135 1378
3 217 179 1343
3 1311 1343 179
3 1343 1311 1109
3 1075 1109 1311
3 1109 1075 1123
3 1094 1123 1075
3 1123 1094 1051
3 1018 1051 1094
3 1051 1018 1270
3 1228 1270 1018
3 1270 1228 146
3 109 146 1228
3 146 109 280
3 254 280 109
3 280 254 455
3 418 455 254
3 455 418 970
3 932 970 418
3 696 418 299
3 932 418 696
3 299 418 1268
3 254 1268 418
3 1268 109 532
3 254 109 1268
3 532 109 978
3 1228 978 109
3 978 1018 192
3 1228 1018 978
3 192 1018 965
3 1094 965 1018
3 965 1075 925
3 1094 1075 965
3 925 1311 756
3 1075 1311 925
3 756 1311 1142
3 179 1142 1311
3 892 98 898
3 1378 898 98
3 898 281 851
3 1378 281 898
3 851 482 957
3 281 482 851
3 957 482 1269
3 1426 1269 482
3 1269 1359 596
3 1426 1359 1269
3 596 1359 26
3 30 26 1359
3 26 633 72
3 30 633 26
3 72 633 867
3 899 867 633
3 867 997 219
3 899 997 867
3 1257 1024 479
3 938 479 1024
3 479 667 1119
3 938 667 479
3 1119 667 1055
3 56 1055 667
3 1055 1393 223
3 56 1393 1055
3 223 1393 857
3 37 857 1393
3 857 518 548
3 37 518 857
3 548 518 469
3 320 469 518
3 469 320 504
3 1409 504 320
3 504 135 490
3 1409 135 504
3 741 1343 364
3 217 1343 741
3 364 1343 522
3 1109 522 1343
3 522 1109 553
3 1123 553 1109
3 553 1051 1221
3 1123 1051 553
3 1221 1051 569
3 1270 569 1051
3 569 146 155
3 1270 146 569
3 155 146 847
3 280 847 146
3 847 455 1341
3 280 455 847
3 1341 455 314
3 970 314 455
3 1275 1248 888
3 339 1248 1275
3 785 1275 888
3 1139 1248 339
3 106 1248 1139
3 218 1248 106
3 1398 218 106
3 447 1248 218
3 670 447 218
3 524 785 888
3 670 505 447
3 554 447 505
3 524 888 767
3 767 1415 921
3 888 1415 767
3 533 554 505
3 249 554 533
3 793 492 1372
3 1415 1372 492
3 921 1415 492
3 545 554 249
3 1254 1031 545
3 554 545 1031
3 793 1372 1019
3 1034 1210 591
3 669 1210 1034
3 1372 1210 669
3 812 591 1210
3 79 812 1210
3 1044 79 1210
3 795 79 1044
3 1031 1044 1210
3 1254 1044 1031
3 1019 1372 669
3 112 76 411
3 663 76 112
3 189 411 76
3 1288 189 76
3 483 189 1288
3 325 483 1288
3 748 325 1288
3 1144 325 748
3 663 22 76
3 813 76 22
3 163 748 1072
3 236 748 163
3 1144 748 236
3 748 332 1212
3 1072 748 1212
3 23 813 22
3 951 813 23
3 571 813 951
3 1247 571 951
3 10 332 1122
3 765 332 10
3 1212 332 765
3 1183 1253 571
3 612 1253 1183
3 194 1183 571
3 560 1253 612
3 332 1253 560
3 1122 332 560
3 526 194 571
3 1247 526 571
3 560 612 219
3 696 219 612
3 1183 696 612
3 79 892 812
3 1142 812 892
3 812 1142 591
3 325 1257 483
3 314 483 1257
3 483 314 189
3 106 1139 490
3 741 490 1139
3 339 741 1139
3 1072 1024 163
3 1212 1024 1072
3 1212 997 1024
3 765 997 1212
3 505 135 533
3 670 135 505
3 218 135 670
3 98 533 135
3 249 98 545
3 533 98 249
3 1254 545 98
3 1044 1254 98
3 767 217 524
3 921 217 767
3 492 217 921
3 785 524 217
3 1019 179 793
3 669 179 1019
3 492 793 179
3 217 492 179
3 23 970 951
3 22 970 23
3 663 970 22
3 112 970 663
3 932 951 970
3 1247 932 526
3 951 932 1247
3 194 696 1183
3 194 932 696
3 526 932 194
3 591 1142 1034
3 179 1034 1142
3 1034 179 669
3 795 892 79
3 1044 98 795
3 892 795 98
3 1122 219 10
3 560 219 1122
3 997 10 219
3 10 997 765
3 1144 1257 325
3 236 1257 1144
3 1024 1257 236
3 163 1024 236
3 106 490 1398
3 218 1398 135
3 490 135 1398
3 339 1275 741
3 217 741 1275
3 785 217 1275
3 189 314 411
3 411 970 112
3 314 970 411
3 165 572 1147
3 149 1147 572
3 149 1224 863
3 246 1147 456
3 572 724 966
3 1410 318 165
3 456 1147 863
3 149 863 1147
3 1410 1147 246
3 165 1147 1410
3 572 966 149
3 1224 149 966
3 165 318 572
3 724 572 318
3 830 446 395
3 459 446 830
3 825 395 446
3 368 446 459
3 990 446 368
3 1032 825 446
3 973 1032 446
3 869 272 11
3 287 25 1300
3 359 25 287
3 493 25 359
3 990 1300 25
3 446 990 25
3 272 25 493
3 11 272 493
3 1125 689 198
3 1276 689 1125
3 122 689 1276
3 1277 198 689
3 272 1277 689
3 991 1277 272
3 513 122 814
3 1258 122 513
3 1276 814 122
3 110 122 1258
3 1032 122 110
3 973 122 1032
3 991 272 869
3 493 456 863
3 359 456 493
3 869 863 991
3 11 863 869
3 493 863 11
3 1277 991 863
3 990 246 1300
3 368 246 990
3 368 1410 246
3 459 1410 368
3 814 966 513
3 1224 966 814
3 1276 1224 814
3 1125 1224 1276
3 825 318 395
3 724 318 825
3 1032 724 825
3 110 724 1032
3 287 456 359
3 287 1300 456
3 246 456 1300
3 1277 863 198
3 198 863 1125
3 1224 1125 863
3 1258 513 724
3 966 724 513
3 1258 724 110
3 830 318 459
3 1410 459 318
3 395 318 830
3 1385 427 237
3 709 237 427
3 304 344 686
3 358 344 304
3 598 358 304
3 422 344 358
3 144 623 1291
3 337 1291 623
3 1309 952 919
3 980 919 952
3 879 952 1309
3 1206 919 980
3 879 1206 980
3 176 1206 879
3 176 879 1309
3 1029 980 952
3 237 304 1385
3 686 1385 304
3 1385 994 427
3 686 994 1385
3 427 994 709
3 598 709 994
3 709 598 237
3 304 237 598
3 1291 1309 144
3 919 144 1309
3 144 1206 623
3 919 1206 144
3 623 1206 337
3 176 337 1206
3 337 176 1291
3 1309 1291 176
3 99 422 1118
3 344 422 99
3 580 1029 1004
3 952 1004 1029
3 333 952 431
3 879 431 952
3 32 422 125
3 358 125 422
3 1022 980 933
3 1029 933 980
3 208 980 1214
3 879 980 208
3 737 6 67
3 1126 67 6
3 213 737 103
3 67 103 737
3 2 7 983
3 619 348 1217
3 606 348 619
3 958 348 606
3 1043 958 606
3 958 213 103
3 1043 213 958
3 701 1273 1233
3 184 1273 701
3 583 654 70
3 1321 70 654
3 1097 70 1321
3 1092 1097 1321
3 668 583 70
3 1014 583 668
3 295 70 1097
3 1097 564 295
3 564 1097 1092
3 1273 184 668
3 1014 668 184
3 24 564 1374
3 24 295 564
3 679 295 24
3 486 2 962
3 601 2 486
3 7 2 601
3 1126 6 979
3 975 1374 1090
3 1427 1374 975
3 564 1090 1374
3 1004 7 580
3 730 7 1004
3 601 580 7
3 1216 730 1004
3 99 1118 564
3 1092 99 564
3 1090 564 1118
3 1328 99 1092
3 1014 184 864
3 584 1014 864
3 737 431 6
3 213 431 737
3 333 431 213
3 1043 333 213
3 607 333 1043
3 962 1049 933
3 1022 933 1049
3 743 125 87
3 32 125 743
3 1427 32 743
3 208 1214 1252
3 881 208 1252
3 601 486 580
3 1029 580 486
3 1118 975 1090
3 422 975 1118
3 1328 655 99
3 344 99 655
3 1004 620 1216
3 952 620 1004
3 607 620 333
3 952 333 620
3 864 655 584
3 344 655 864
3 1049 436 1022
3 980 1022 436
3 125 897 87
3 358 897 125
3 1427 975 32
3 422 32 975
3 933 486 962
3 1029 486 933
3 278 897 310
3 358 310 897
3 1214 436 1252
3 980 436 1214
3 288 1387 1340
3 509 1340 1387
3 1120 102 288
3 1387 288 102
3 174 1280 1120
3 102 1120 1280
3 695 1280 174
3 882 1280 695
3 156 882 695
3 721 882 156
3 659 721 156
3 1316 721 659
3 818 400 659
3 1316 659 400
3 1278 826 818
3 400 818 826
3 401 1263 1278
3 826 1278 1263
3 1367 1263 401
3 335 1263 1367
3 1232 335 1367
3 1035 335 1232
3 1038 1035 1232
3 426 1035 1038
3 631 995 1038
3 426 1038 995
3 1168 824 631
3 995 631 824
3 775 1106 1168
3 824 1168 1106
3 148 1106 775
3 59 1106 148
3 689 59 148
3 122 59 689
3 1003 101 25
3 446 25 101
3 521 1121 1003
3 101 1003 1121
3 924 1121 521
3 594 1121 924
3 1141 594 924
3 1338 594 1141
3 1340 1338 1141
3 509 1338 1340
3 1074 288 224
3 1340 224 288
3 1153 509 225
3 1387 225 509
3 1158 1120 1074
3 288 1074 1120
3 225 1387 173
3 102 173 1387
3 720 1120 1158
3 174 1120 720
3 173 1280 1318
3 102 1280 173
3 762 174 720
3 695 174 762
3 1318 882 1202
3 1280 882 1318
3 581 695 762
3 156 695 581
3 1202 721 1073
3 882 721 1202
3 177 156 581
3 659 156 177
3 1073 1316 710
3 721 1316 1073
3 658 659 177
3 818 659 658
3 710 1316 167
3 400 167 1316
3 71 818 658
3 1278 818 71
3 167 400 1356
3 826 1356 400
3 381 1278 71
3 401 1278 381
3 1356 1263 712
3 826 1263 1356
3 1313 401 381
3 1367 401 1313
3 712 335 328
3 1263 335 712
3 788 1367 1313
3 1232 1367 788
3 328 1035 138
3 335 1035 328
3 260 1232 788
3 1038 1232 260
3 138 426 15
3 1035 426 138
3 740 1038 260
3 631 1038 740
3 15 426 849
3 995 849 426
3 656 631 740
3 1168 631 656
3 849 995 918
3 824 918 995
3 1093 775 656
3 1168 656 775
3 918 824 1293
3 1106 1293 824
3 1046 148 1093
3 775 1093 148
3 1293 1106 1395
3 59 1395 1106
3 1324 689 1046
3 148 1046 689
3 1395 122 91
3 59 122 1395
3 230 272 1324
3 689 1324 272
3 91 973 448
3 122 973 91
3 1240 25 230
3 272 230 25
3 448 973 1013
3 446 1013 973
3 307 1003 1240
3 25 1240 1003
3 1013 446 1251
3 101 1251 446
3 14 521 307
3 1003 307 521
3 1251 101 443
3 1121 443 101
3 510 924 14
3 521 14 924
3 443 1121 726
3 594 726 1121
3 1016 1141 510
3 924 510 1141
3 726 1338 944
3 594 1338 726
3 224 1340 1016
3 1141 1016 1340
3 944 509 1153
3 1338 509 944
3 296 312 328
3 1391 328 312
3 138 296 328
3 635 296 138
3 15 635 138
3 319 635 15
3 849 319 15
3 1103 319 849
3 918 1103 849
3 697 1103 918
3 1293 697 918
3 20 697 1293
3 1395 20 1293
3 694 20 1395
3 91 694 1395
3 1124 694 91
3 448 1124 91
3 736 1124 448
3 712 328 1391
3 984 712 1391
3 1013 736 448
3 1135 736 1013
3 1356 712 984
3 1365 1356 984
3 1251 1135 1013
3 715 1135 1251
3 167 1356 1365
3 989 167 1365
3 443 715 1251
3 355 715 443
3 710 167 989
3 1406 710 989
3 726 355 443
3 372 355 726
3 1073 710 1406
3 660 1073 1406
3 944 372 726
3 39 372 944
3 1202 1073 660
3 1408 1202 660
3 1153 39 944
3 354 39 1153
3 1318 1202 1408
3 1009 1318 1408
3 225 354 1153
3 1009 354 225
3 173 1318 1009
3 173 1009 225
3 449 960 1413
3 728 1413 960
3 123 960 449
3 742 123 449
3 1299 742 449
3 1017 1299 449
3 1308 1017 449
3 1191 1413 728
3 1384 1413 1191
3 1058 1413 1384
3 567 1413 1058
3 1302 1308 449
3 665 1308 1302
3 159 665 1302
3 1099 159 1302
3 836 1099 1302
3 861 1413 567
3 143 861 567
3 840 861 143
3 1131 861 840
3 211 861 1131
3 852 211 1131
3 768 1099 836
3 1039 449 1413
3 908 1413 861
3 221 1302 449
3 84 211 852
3 708 768 836
3 1101 861 211
3 386 836 1302
3 535 1187 222
3 164 222 1187
3 551 222 164
3 839 551 164
3 162 551 839
3 1172 551 162
3 113 551 1172
3 1161 551 113
3 140 551 1161
3 495 551 140
3 481 551 495
3 815 551 481
3 501 551 815
3 542 551 501
3 910 542 501
3 1327 910 501
3 1292 1327 501
3 891 1327 1292
3 204 1327 891
3 936 1327 204
3 893 936 204
3 1312 936 893
3 54 896 550
3 998 550 896
3 1010 550 998
3 1310 1010 998
3 708 1010 1310
3 836 1010 708
3 182 1054 297
3 550 1054 182
3 54 550 182
3 84 297 1054
3 211 84 1054
3 224 665 1074
3 159 1074 665
3 1074 159 1158
3 1099 1158 159
3 1158 1099 720
3 768 720 1099
3 708 762 768
3 988 762 708
3 720 768 762
3 1310 998 581
3 762 1310 581
3 581 729 177
3 85 177 729
3 54 100 1015
3 177 1015 100
3 658 177 100
3 71 658 297
3 182 297 658
3 852 71 84
3 484 84 71
3 381 71 852
3 381 1131 1313
3 852 1131 381
3 1313 840 788
3 1131 840 1313
3 788 143 260
3 840 143 788
3 260 143 740
3 567 740 143
3 740 567 656
3 1058 656 567
3 656 1058 1093
3 1384 1093 1058
3 1093 1191 1046
3 1384 1191 1093
3 1046 728 1324
3 1191 728 1046
3 1324 960 230
3 728 960 1324
3 230 960 1240
3 123 1240 960
3 123 742 307
3 1240 123 307
3 307 742 14
3 1299 14 742
3 14 1017 510
3 1299 1017 14
3 510 1308 1016
3 1017 1308 510
3 1016 665 224
3 1308 665 1016
3 222 551 39
3 372 39 551
3 551 542 372
3 355 372 542
3 542 910 355
3 715 355 910
3 910 1327 715
3 1135 715 1327
3 1327 936 1135
3 736 1135 936
3 936 1312 736
3 1124 736 1312
3 1312 893 1124
3 694 1124 893
3 893 204 694
3 20 694 204
3 204 891 20
3 697 20 891
3 891 1292 697
3 1103 697 1292
3 1292 501 1103
3 319 1103 501
3 501 815 319
3 635 319 815
3 815 481 635
3 296 635 481
3 481 495 296
3 312 296 495
3 495 140 312
3 1391 312 140
3 140 1161 1391
3 984 1391 1161
3 1161 113 984
3 1365 984 113
3 113 1172 1365
3 989 1365 1172
3 1172 162 989
3 1406 989 162
3 162 839 1406
3 660 1406 839
3 839 164 660
3 1408 660 164
3 164 1187 1408
3 1009 1408 1187
3 1187 535 1009
3 354 1009 535
3 535 222 354
3 39 354 222
3 111 900 315
3 180 315 900
3 111 1210 275
3 315 1210 111
3 111 275 904
3 671 904 275
3 111 684 900
3 904 684 111
3 833 57 1285
3 1066 1285 57
3 833 1210 315
3 1285 1210 833
3 315 180 833
3 636 438 116
3 979 438 636
3 636 1248 1315
3 116 1248 636
3 636 1315 1296
3 1095 1296 1315
3 636 1296 979
3 1126 979 1296
3 1345 698 309
3 700 309 698
3 1345 1248 116
3 309 1248 1345
3 1345 116 1174
3 438 1174 116
3 1345 972 698
3 1174 972 1345
3 928 1115 286
3 589 1115 928
3 928 386 1302
3 286 386 928
3 928 1302 589
3 221 589 1302
3 409 286 666
3 1115 666 286
3 409 250 642
3 666 250 409
3 642 1185 409
3 515 1185 642
3 642 968 515
3 684 515 968
3 1412 774 286
3 386 286 774
3 286 409 1412
3 1412 409 733
3 1185 733 409
3 1412 503 774
3 733 503 1412
3 491 454 191
3 191 454 1379
3 191 33 783
3 1379 33 191
3 191 783 491
3 972 491 783
3 628 454 209
3 454 1197 209
3 454 1101 1265
3 861 1101 454
3 454 628 130
3 454 130 861
3 908 861 130
3 934 597 1379
3 33 1379 597
3 934 454 1265
3 1379 454 934
3 934 1265 375
3 1101 375 1265
3 934 772 597
3 375 772 934
3 642 250 796
3 731 1361 900
3 180 900 1361
3 731 684 968
3 900 684 731
3 1070 887 979
3 438 979 887
3 1197 454 1127
3 264 1174 887
3 438 887 1174
3 264 1127 491
3 454 491 1127
3 264 972 1174
3 491 972 264
3 1219 590 949
3 1397 949 590
3 1294 1397 806
3 949 1397 1294
3 735 471 854
3 235 854 471
3 1163 471 876
3 809 235 471
3 1100 235 809
3 809 471 1267
3 9 675 923
3 828 81 674
3 435 81 828
3 512 234 822
3 1282 166 675
3 512 80 234
3 1371 80 512
3 1335 611 251
3 50 251 611
3 1335 822 234
3 1335 234 611
3 251 50 992
3 50 69 992
3 243 565 1173
3 243 573 967
3 369 967 573
3 967 565 243
3 1173 565 841
3 841 419 270
3 565 419 841
3 576 267 474
3 500 424 766
3 1021 424 500
3 1332 369 573
3 1332 406 369
3 816 187 1287
3 248 1287 187
3 816 255 1146
3 1287 255 816
3 816 1146 1368
3 245 1368 1146
3 816 848 187
3 1368 848 816
3 566 279 1287
3 255 1287 279
3 566 248 1220
3 1287 248 566
3 566 1220 1
3 540 1 1220
3 1289 255 279
3 679 255 1289
3 472 245 1146
3 865 245 472
3 472 1146 679
3 255 679 1146
3 472 679 24
3 802 555 556
3 1281 556 555
3 802 514 228
3 556 514 802
3 802 228 471
3 983 471 228
3 471 555 802
3 321 511 907
3 43 511 321
3 321 907 556
3 514 556 907
3 321 1281 1230
3 556 1281 321
3 321 1230 43
3 799 43 1230
3 417 1286 586
3 502 586 1286
3 417 514 907
3 586 514 417
3 417 907 866
3 511 866 907
3 417 1129 1286
3 866 1129 417
3 1428 983 228
3 1428 228 586
3 514 586 228
3 1428 502 408
3 586 502 1428
3 316 0 1414
3 585 1166 652
3 21 555 471
3 1331 508 93
3 1366 93 508
3 1331 1218 784
3 93 1218 1331
3 1331 784 1414
3 316 1414 784
3 1331 1056 508
3 1414 1056 1331
3 1259 154 1194
3 1423 1194 154
3 1259 1218 93
3 1194 1218 1259
3 1259 1366 161
3 93 1366 1259
3 1259 778 154
3 161 778 1259
3 890 675 781
3 137 461 465
3 45 461 137
3 137 1036 804
3 465 1036 137
3 137 80 1371
3 804 80 137
3 920 999 51
3 1394 999 920
3 920 51 45
3 461 45 51
3 247 675 9
3 781 675 247
3 920 674 1394
3 81 1394 674
3 1113 1386 1279
3 1041 1386 1113
3 1113 787 62
3 1279 787 1113
3 498 906 267
3 1113 419 1041
3 270 419 1113
3 88 207 229
3 42 207 88
3 88 58 128
3 229 58 88
3 88 128 462
3 256 462 128
3 88 1060 42
3 462 1060 88
3 1148 1166 1149
3 585 1149 1166
3 1148 58 229
3 1149 58 1148
3 1148 229 827
3 207 827 229
3 1148 3 1166
3 827 3 1148
3 664 267 906
3 474 267 664
3 1045 62 464
3 787 464 62
3 1045 1344 283
3 464 1344 1045
3 1045 283 1021
3 424 1021 283
3 294 462 107
3 256 107 462
3 294 703 578
3 107 703 294
3 294 578 534
3 939 534 578
3 294 534 462
3 1060 462 534
3 171 1383 17
3 561 1383 171
3 171 703 107
3 17 703 171
3 171 256 153
3 107 256 171
3 171 153 561
3 1114 561 153
3 488 1423 1241
3 538 1423 488
3 488 703 17
3 1241 703 488
3 488 1383 432
3 17 1383 488
3 488 432 538
3 821 538 432
3 1304 1290 578
3 939 578 1290
3 1304 703 1241
3 578 703 1304
3 1304 1241 154
3 1423 154 1241
3 1304 154 1290
3 778 1290 154
3 559 207 1209
3 827 207 559
3 559 1209 956
3 193 956 1209
3 258 939 1133
3 534 939 258
3 258 193 1209
3 1133 193 258
3 258 1209 42
3 207 42 1209
3 258 1060 534
3 42 1060 258
3 444 161 289
3 1366 289 161
3 444 193 1133
3 289 193 444
3 444 939 1290
3 1133 939 444
3 444 778 161
3 1290 778 444
3 292 956 289
3 193 289 956
3 292 1366 508
3 289 1366 292
3 324 511 1401
3 866 511 324
3 324 1401 945
3 963 945 1401
3 324 945 338
3 780 338 945
3 324 1129 866
3 338 1129 324
3 1195 4 964
3 943 964 4
3 1195 963 1401
3 964 963 1195
3 1195 1401 43
3 511 43 1401
3 1195 799 4
3 43 799 1195
3 931 1220 413
3 248 413 1220
3 413 963 931
3 964 931 963
3 931 964 544
3 943 544 964
3 931 540 1220
3 544 540 931
3 1234 1199 945
3 780 945 1199
3 1234 945 413
3 963 413 945
3 1234 248 187
3 413 248 1234
3 1234 848 1199
3 187 848 1234
3 118 502 547
3 408 502 118
3 338 780 1020
3 1020 547 1286
3 502 1286 547
3 1020 1286 338
3 1129 338 1286
3 61 1368 241
3 245 241 1368
3 61 780 1199
3 61 1199 1368
3 848 1368 1199
3 353 245 865
3 241 245 353
3 1383 561 410
3 561 1114 410
3 410 1380 546
3 870 546 1380
3 410 682 1380
3 1383 410 432
3 410 821 432
3 234 821 410
3 1107 1087 323
3 49 323 1087
3 1107 178 1364
3 323 178 1107
3 1107 1364 1380
3 870 1380 1364
3 497 277 530
3 1424 277 497
3 497 530 323
3 178 323 530
3 497 49 425
3 323 49 497
3 497 425 1424
3 1429 1424 425
3 1088 1198 528
3 947 1198 1088
3 1088 528 530
3 178 530 528
3 1088 277 1238
3 530 277 1088
3 1088 1238 947
3 1164 947 1238
3 40 546 1364
3 870 1364 546
3 40 178 528
3 1364 178 40
3 40 528 801
3 1198 801 528
3 40 410 546
3 801 410 40
3 1353 958 1399
3 103 1399 958
3 1353 592 185
3 1353 185 958
3 348 958 185
3 371 769 609
3 458 769 371
3 371 609 1399
3 371 103 67
3 1399 103 371
3 371 67 458
3 1126 458 67
3 562 1273 5
3 1233 1273 562
3 562 5 609
3 609 769 562
3 1057 562 769
3 562 1057 1233
3 838 1233 1057
3 1337 592 232
3 232 5 668
3 1273 668 5
3 232 668 1337
3 70 1337 668
3 1381 946 953
3 1381 953 340
3 1197 340 953
3 250 73 796
3 985 130 688
3 628 688 130
3 985 604 1245
3 688 604 985
3 985 1039 1413
3 1245 1039 985
3 985 908 130
3 1413 908 985
3 1151 946 1298
3 953 946 1151
3 1151 1298 688
3 604 688 1298
3 1151 688 209
3 628 209 688
3 1151 209 953
3 1197 953 209
3 74 666 1236
3 1115 1236 666
3 74 1236 1298
3 604 1298 1236
3 74 946 73
3 1298 946 74
3 74 73 666
3 250 666 73
3 1411 1039 1245
3 449 1039 1411
3 1411 604 1236
3 1245 604 1411
3 1411 1236 589
3 1115 589 1236
3 1411 221 449
3 589 221 1411
3 1054 1101 211
3 375 1101 1054
3 1054 550 905
3 693 905 550
3 1054 772 375
3 905 772 1054
3 1010 397 550
3 693 550 397
3 1010 386 774
3 836 386 1010
3 1010 503 397
3 774 503 1010
3 763 33 706
3 783 33 763
3 763 706 300
3 587 300 706
3 763 1025 370
3 300 1025 763
3 763 370 783
3 972 783 370
3 859 905 1096
3 693 1096 905
3 859 1096 706
3 587 706 1096
3 859 33 597
3 706 33 859
3 859 772 905
3 597 772 859
3 1255 733 77
3 1185 77 733
3 1255 77 1096
3 587 1096 77
3 1255 1096 397
3 693 397 1096
3 1255 503 733
3 397 503 1255
3 238 1025 300
3 909 1025 238
3 238 300 77
3 587 77 300
3 238 1185 515
3 77 1185 238
3 238 515 909
3 684 909 515
3 1086 36 798
3 1375 36 1086
3 1086 630 345
3 798 630 1086
3 345 1189 1086
3 1421 1086 1189
3 1086 1421 1375
3 930 1375 1421
3 637 592 331
3 185 592 637
3 637 331 798
3 630 798 331
3 637 798 341
3 36 341 798
3 637 348 185
3 341 348 637
3 764 797 114
3 499 114 797
3 764 114 331
3 630 331 114
3 764 592 1337
3 331 592 764
3 764 70 797
3 1337 70 764
3 707 1189 1042
3 345 1042 1189
3 1042 630 114
3 345 630 1042
3 1042 114 402
3 499 402 114
3 1042 402 707
3 1404 707 402
3 595 83 1388
3 48 1388 83
3 595 618 1012
3 1388 618 595
3 398 681 1256
3 961 1256 681
3 398 996 681
3 1061 996 398
3 476 1256 770
3 961 770 1256
3 476 47 95
3 770 47 476
3 282 683 83
3 48 83 683
3 282 1108 683
3 55 1108 282
3 959 1095 447
3 1296 1095 959
3 959 447 285
3 554 285 447
3 959 769 458
3 285 769 959
3 959 458 1296
3 1126 1296 458
3 389 769 285
3 1057 769 389
3 389 285 1031
3 554 1031 285
3 389 1066 57
3 1031 1066 389
3 389 57 1057
3 838 1057 57
3 1370 1025 1208
3 370 1025 1370
3 1370 1208 888
3 1415 888 1208
3 1370 700 698
3 888 700 1370
3 1370 698 370
3 972 370 698
3 195 671 1372
3 904 671 195
3 195 1372 1208
3 1415 1208 1372
3 195 1025 909
3 1208 1025 195
3 195 909 904
3 684 904 909
3 1156 1189 428
3 1421 1189 1156
3 428 1117 1156
3 748 1156 1117
3 748 755 1156
3 727 718 332
3 727 1117 428
3 332 1117 727
3 727 1189 707
3 428 1189 727
3 1134 421 76
3 44 421 1134
3 76 813 516
3 1134 76 516
3 1134 477 832
3 516 477 1134
3 1134 832 44
3 19 44 832
3 794 477 516
3 415 477 794
3 516 813 571
3 794 516 571
3 794 393 242
3 571 393 794
3 794 242 415
3 478 415 242
3 1169 1297 1177
3 214 1297 1169
3 1169 81 435
3 1177 81 1169
3 821 234 1175
3 80 1175 234
3 65 750 801
3 410 801 750
3 65 1198 117
3 801 1198 65
3 65 117 611
3 50 611 117
3 65 234 750
3 611 234 65
3 750 234 410
3 525 1198 947
3 117 1198 525
3 525 947 1154
3 1164 1154 947
3 525 1154 50
3 69 50 1154
3 525 50 117
3 1102 49 1087
3 1319 49 1102
3 1102 1087 350
3 1102 565 967
3 350 565 1102
3 1102 967 1319
3 369 1319 967
3 1114 759 350
3 350 759 565
3 419 565 759
3 745 805 1163
3 761 805 745
3 745 424 761
3 766 424 745
3 844 912 425
3 1429 425 912
3 844 49 1319
3 425 49 844
3 844 1319 369
3 844 369 912
3 406 912 369
3 1235 1218 1194
3 131 1218 1235
3 1235 1423 1048
3 1194 1423 1235
3 1235 1036 465
3 1048 1036 1235
3 1235 465 131
3 461 131 465
3 858 1048 538
3 1423 538 1048
3 858 538 1175
3 821 1175 538
3 858 1175 804
3 80 804 1175
3 858 1036 1048
3 804 1036 858
3 494 1177 1159
3 1297 1159 1177
3 494 1159 650
3 316 650 1159
3 494 999 1394
3 650 999 494
3 494 1394 1177
3 81 1177 1394
3 862 316 784
3 650 316 862
3 862 784 131
3 1218 131 784
3 862 131 51
3 461 51 131
3 862 999 650
3 51 999 862
3 1130 759 153
3 1114 153 759
3 1130 153 506
3 256 506 153
3 1130 1386 1041
3 506 1386 1130
3 1130 419 759
3 1041 419 1130
3 937 506 128
3 256 128 506
3 937 58 1145
3 128 58 937
3 937 787 1279
3 1145 787 937
3 937 1279 506
3 1386 506 1279
3 624 1145 1149
3 58 1149 1145
3 624 585 253
3 1149 585 624
3 624 1344 464
3 253 1344 624
3 624 464 1145
3 787 1145 464
3 86 253 673
3 585 673 253
3 86 673 761
3 805 761 673
3 86 761 283
3 424 283 761
3 86 1344 253
3 283 1344 86
3 674 9 828
3 923 828 9
3 822 166 512
3 1282 512 166
3 512 1282 1371
3 675 1371 1282
3 1335 644 822
3 166 822 644
3 251 1000 1335
3 644 1335 1000
3 992 306 251
3 1000 251 306
3 243 1082 573
3 1425 573 1082
3 1173 570 243
3 1082 243 570
3 270 266 841
3 267 266 270
3 841 266 1173
3 570 1173 266
3 500 576 1021
3 474 1021 576
3 573 1425 1332
3 723 1332 1425
3 137 890 45
3 781 45 890
3 1371 675 137
3 890 137 675
3 920 247 674
3 9 674 247
3 45 781 920
3 247 920 781
3 1113 498 270
3 267 270 498
3 62 498 1113
3 906 498 62
3 1045 906 62
3 664 906 1045
3 1021 664 1045
3 474 664 1021
3 993 1253 332
3 1023 748 1288
3 1186 571 1253
3 393 571 1186
3 1117 332 748
3 1223 1288 76
3 421 1223 76
3 718 993 332
3 755 748 1023
3 1285 1031 1210
3 1315 1248 447
3 275 1210 1372
3 309 888 1248
3 1066 1031 1285
3 1095 1315 447
3 671 275 1372
3 700 888 309
3 471 983 7
3 1294 806 295
3 70 295 806
3 809 1267 1100
3 348 1100 1267
3 472 24 865
3 1374 865 24
3 1428 408 983
3 2 983 408
3 614 738 34
3 1069 738 614
3 976 646 639
3 327 639 646
3 676 160 467
3 639 160 676
3 327 160 639
3 316 1159 0
3 585 652 673
3 614 1163 1069
3 471 1163 614
3 614 34 471
3 976 471 34
3 639 471 976
3 21 471 639
3 676 21 639
3 473 21 676
3 330 21 473
3 555 21 1281
3 1419 38 539
3 1305 38 1419
3 384 982 843
3 987 982 792
3 843 982 987
3 1065 1305 1419
3 302 1305 1065
3 1110 1305 302
3 987 792 690
3 661 690 610
3 792 610 690
3 1001 1110 302
3 1001 361 1110
3 423 361 1001
3 661 610 27
3 27 1322 360
3 610 1322 27
3 1262 361 423
3 1262 203 361
3 434 203 1262
3 360 1322 1336
3 1336 1137 1150
3 1322 1137 1336
3 104 203 434
3 104 1008 203
3 602 1008 104
3 1150 1137 313
3 313 519 520
3 1137 519 313
3 913 1008 602
3 1071 362 913
3 262 362 1071
3 1008 913 362
3 520 519 291
3 853 1325 705
3 291 1325 853
3 519 1325 291
3 808 362 262
3 808 1105 362
3 1357 1105 808
3 403 603 800
3 705 603 403
3 1325 603 705
3 677 1105 1357
3 732 845 677
3 1105 677 845
3 800 603 120
3 902 363 845
3 487 363 902
3 120 363 487
3 732 902 845
3 603 363 120
3 834 634 692
3 129 634 834
3 274 129 834
3 1068 692 634
3 124 129 274
3 1301 129 124
3 647 129 1301
3 880 129 647
3 29 1068 678
3 692 1068 29
3 46 1068 433
3 678 1068 46
3 387 433 1068
3 1180 880 647
3 452 880 1180
3 911 880 452
3 433 387 1358
3 326 387 1403
3 1358 387 326
3 416 1403 387
3 1271 911 452
3 18 911 1271
3 133 911 18
3 1403 416 168
3 582 416 1081
3 168 416 582
3 523 133 18
3 197 133 523
3 811 133 197
3 582 1081 1084
3 186 1081 336
3 1084 1081 186
3 916 811 197
3 1085 811 916
3 231 811 1085
3 186 336 831
3 303 336 1167
3 831 336 303
3 1007 231 1085
3 28 231 1007
3 1239 231 28
3 303 1167 1116
3 1112 1167 746
3 1116 1167 1112
3 810 1239 28
3 810 269 1239
3 239 269 810
3 1112 746 1222
3 1222 1213 388
3 746 1213 1222
3 1033 269 239
3 1033 240 269
3 394 240 1033
3 388 1213 115
3 115 1179 1077
3 1213 1179 115
3 265 240 394
3 807 38 981
3 240 981 38
3 265 981 240
3 1077 1179 872
3 384 1040 982
3 1179 982 1040
3 872 1179 1040
3 539 38 807
3 782 141 577
3 378 141 782
3 773 378 782
3 575 1091 875
3 969 1091 1334
3 875 1091 969
3 1205 969 1334
3 451 378 773
3 608 1225 1362
3 537 1225 608
3 378 1362 1225
3 451 1362 378
3 1205 1334 437
3 380 1037 725
3 475 725 1037
3 1334 725 475
3 437 1334 475
3 92 1225 537
3 1225 549 557
3 92 549 1225
3 380 725 948
3 1006 531 78
3 725 78 531
3 948 725 531
3 1028 557 549
3 1028 1026 557
3 227 557 1026
3 31 227 1026
3 1006 78 885
3 1243 1160 819
3 78 1160 1243
3 885 78 1243
3 496 227 31
3 496 1063 227
3 734 227 1063
3 1211 734 1063
3 819 1160 226
3 139 261 293
3 1160 261 139
3 226 1160 139
3 649 734 1211
3 649 691 734
3 1128 734 691
3 470 1128 691
3 293 261 1363
3 1363 261 771
3 638 771 261
3 1264 771 638
3 470 216 1128
3 860 1128 216
3 552 860 216
3 1264 638 903
3 903 638 1182
3 374 1182 638
3 121 1182 374
3 1089 860 552
3 617 600 1089
3 420 600 617
3 860 1089 600
3 121 374 917
3 430 126 244
3 917 126 430
3 374 126 917
3 441 600 420
3 868 600 536
3 877 600 868
3 441 536 600
3 1207 600 877
3 244 126 717
3 662 719 835
3 347 719 662
3 717 719 347
3 126 719 717
3 1047 1207 877
3 1349 1207 1047
3 365 1207 1349
3 835 719 63
3 1143 1329 16
3 63 1329 1143
3 719 1329 63
3 220 365 1349
3 823 365 1369
3 955 365 823
3 220 1369 365
3 940 365 955
3 1162 1329 64
3 16 1329 1162
3 629 450 558
3 64 450 629
3 1329 450 64
3 760 940 955
3 82 1389 35
3 201 35 1389
3 760 201 1389
3 940 760 1389
3 558 450 687
3 1326 895 66
3 1266 895 1326
3 687 895 1266
3 450 895 687
3 714 1389 82
3 714 757 1389
3 789 757 714
3 66 895 1030
3 1030 273 147
3 895 273 1030
3 751 757 789
3 622 468 751
3 757 751 468
3 466 757 468
3 147 273 1284
3 1377 1284 856
3 273 856 1284
3 1418 856 273
3 873 466 468
3 212 466 873
3 754 466 212
3 711 466 754
3 856 1418 190
3 1138 1418 543
3 190 1418 1138
3 252 543 1418
3 322 711 754
3 927 711 322
3 141 711 927
3 543 252 200
3 575 252 1091
3 200 252 575
3 577 141 927
3 549 1339 1028
3 1026 1028 1339
3 537 1422 92
3 608 1422 537
3 549 92 1422
3 1339 549 1422
3 760 993 201
3 955 993 760
3 823 993 955
3 1253 993 823
3 1369 1253 823
3 201 993 35
3 35 718 82
3 993 718 35
3 1362 1422 608
3 451 1404 1362
3 773 1404 451
3 782 1404 773
3 1422 1362 1404
3 868 393 1186
3 536 393 868
3 441 242 536
3 420 242 441
3 617 242 420
3 393 536 242
3 877 1186 1047
3 868 1186 877
3 1349 1047 1186
3 1349 1186 220
3 1369 220 1186
3 1253 1369 1186
3 649 653 691
3 1211 653 649
3 1063 653 1211
3 1339 653 1063
3 496 1339 1063
3 31 1339 496
3 1026 1339 31
3 1089 552 242
3 216 242 552
3 617 1089 242
3 478 242 216
3 470 478 216
3 691 478 470
3 653 478 691
3 226 846 819
3 139 846 226
3 1243 819 846
3 1363 202 293
3 771 202 1363
3 139 293 202
3 846 139 202
3 835 1223 662
3 63 1223 835
3 1143 1223 63
3 16 1223 1143
3 1162 1223 16
3 1288 1223 1162
3 244 717 44
3 347 44 717
3 430 244 44
3 421 44 347
3 662 421 347
3 1223 421 662
3 903 19 1264
3 1182 19 903
3 771 1264 19
3 202 771 19
3 121 44 1182
3 917 44 121
3 430 44 917
3 19 1182 44
3 687 1023 558
3 1266 1023 687
3 1266 755 1023
3 1326 755 1266
3 64 1288 1162
3 629 1288 64
3 558 1023 629
3 1288 629 1023
3 380 950 1037
3 948 950 380
3 531 950 948
3 846 950 531
3 1006 846 531
3 885 846 1006
3 1243 846 885
3 1037 950 475
3 437 930 1205
3 475 930 437
3 969 1205 930
3 950 930 475
3 705 595 853
3 403 595 705
3 1012 853 595
3 690 1012 987
3 661 1012 690
3 27 1012 661
3 360 1012 27
3 1336 1012 360
3 305 987 1012
3 843 987 305
3 384 843 305
3 1150 1012 1336
3 313 1012 1150
3 520 1012 313
3 291 1012 520
3 853 1012 291
3 1040 384 305
3 487 83 595
3 902 83 487
3 120 595 800
3 487 595 120
3 403 800 595
3 678 398 29
3 46 398 678
3 1256 29 398
3 692 1256 834
3 29 1256 692
3 433 398 46
3 1358 398 433
3 326 398 1358
3 1061 398 326
3 1116 305 303
3 1112 305 1116
3 1222 305 1112
3 388 305 1222
3 115 305 388
3 1061 303 305
3 831 303 1061
3 186 831 1061
3 1084 186 1061
3 582 1084 1061
3 1077 305 115
3 872 305 1077
3 168 582 1061
3 1403 168 1061
3 326 1403 1061
3 1040 305 872
3 1301 476 647
3 1180 647 476
3 95 1180 476
3 28 95 810
3 1007 95 28
3 1085 95 1007
3 779 810 95
3 239 810 779
3 1033 239 779
3 916 95 1085
3 197 95 916
3 523 95 197
3 18 95 523
3 1271 95 18
3 452 95 1271
3 1180 95 452
3 394 1033 779
3 265 394 779
3 981 265 779
3 274 1256 124
3 834 1256 274
3 1301 124 476
3 1256 476 124
3 677 282 732
3 1357 282 677
3 732 83 902
3 282 83 732
3 808 282 1357
3 262 282 808
3 1071 282 262
3 55 282 1071
3 302 779 1001
3 1065 779 302
3 1419 779 1065
3 55 1001 779
3 423 1001 55
3 1262 423 55
3 539 779 1419
3 807 779 539
3 434 1262 55
3 104 434 55
3 602 104 55
3 913 602 55
3 1071 913 55
3 981 779 807
3 1284 755 147
3 1377 755 1284
3 1030 147 755
3 66 1030 755
3 1326 66 755
3 1156 755 1377
3 190 1421 856
3 1138 1421 190
3 1156 856 1421
3 1377 856 1156
3 575 1421 200
3 875 1421 575
3 543 200 1421
3 969 1421 875
3 1138 543 1421
3 930 1421 969
3 82 718 714
3 789 714 718
3 751 789 718
3 622 751 718
3 727 622 718
3 468 727 873
3 622 727 468
3 707 873 727
3 212 873 707
3 927 707 577
3 322 707 927
3 754 707 322
3 212 707 754
3 782 577 707
3 1404 782 707
3 557 734 1225
3 227 734 557
3 1128 1225 734
3 860 1225 1128
3 378 1225 860
3 141 378 860
3 711 141 860
3 466 711 860
3 757 466 860
3 1389 757 860
3 940 1389 860
3 600 940 860
3 1207 940 600
3 365 940 1207
3 1160 78 261
3 725 261 78
3 638 261 725
3 374 638 725
3 1334 374 725
3 1091 374 1334
3 252 374 1091
3 1418 374 252
3 273 374 1418
3 895 374 273
3 450 374 895
3 126 374 450
3 719 126 450
3 1329 719 450
3 672 527 845
3 259 845 527
3 1105 845 259
3 362 1105 259
3 206 362 259
3 1008 362 206
3 203 1008 206
3 361 203 206
3 1110 361 206
3 1305 1110 206
3 38 1305 206
3 240 38 206
3 269 240 206
3 1239 269 206
3 231 1239 206
3 811 231 206
3 133 811 206
3 911 133 206
3 880 911 206
3 129 880 206
3 1132 129 206
3 616 1132 206
3 634 1132 145
3 616 145 1132
3 145 616 1140
3 206 1140 616
3 1140 206 1196
3 259 1196 206
3 1196 259 52
3 527 52 259
3 52 527 215
3 672 215 527
3 215 672 363
3 845 363 672
3 52 363 1196
3 215 363 52
3 603 1196 363
3 1325 1196 603
3 1140 1196 1325
3 519 1140 1325
3 1137 1140 519
3 1322 1140 1137
3 610 1140 1322
3 792 1140 610
3 982 1140 792
3 1179 1140 982
3 1213 1140 1179
3 746 1140 1213
3 1167 1140 746
3 336 1140 1167
3 1081 1140 336
3 416 1140 1081
3 387 1140 416
3 1068 1140 387
3 634 1140 1068
3 145 1140 634
3 1132 634 129
3 926 90 850
3 271 90 926
3 926 850 1354
3 1250 1354 850
3 926 613 439
3 1354 613 926
3 926 439 271
3 478 271 439
3 842 390 1376
3 1193 1376 390
3 842 1250 850
3 1376 1250 842
3 842 850 1420
3 90 1420 850
3 842 648 390
3 1420 648 842
3 1108 779 790
3 55 779 1108
3 1108 790 1376
3 1250 1376 790
3 1108 1193 1083
3 1376 1193 1108
3 95 613 1354
3 382 613 95
3 790 779 95
3 95 47 382
3 305 716 1355
3 599 716 305
3 305 618 599
3 1012 618 305
3 379 942 996
3 1052 996 942
3 379 305 1355
3 996 305 379
3 379 196 942
3 1355 196 379
3 453 152 996
3 1400 152 453
3 453 1052 1237
3 996 1052 453
3 453 1237 1400
3 19 1400 1237
3 1061 305 996
3 996 152 1347
3 276 457 136
3 412 457 276
3 276 136 1226
3 301 1226 136
3 276 1339 1422
3 1226 1339 276
3 276 1422 412
3 1404 412 1422
3 1053 385 563
3 1053 301 136
3 563 301 1053
3 136 457 53
3 1053 136 53
3 1053 53 385
3 1204 90 1392
3 1420 90 1204
3 1204 1392 563
3 301 563 1392
3 1204 563 1184
3 1204 1184 1420
3 648 1420 1184
3 376 653 1226
3 1339 1226 653
3 376 301 1392
3 1226 301 376
3 376 1392 271
3 90 271 1392
3 376 478 653
3 271 478 376
3 722 94 1011
3 704 94 722
3 722 1011 915
3 1274 915 1011
3 722 1052 942
3 915 1052 722
3 722 942 704
3 196 704 942
3 574 776 1098
3 1416 1098 776
3 574 1274 1011
3 1098 1274 574
3 574 1011 1360
3 94 1360 1011
3 574 1002 776
3 1360 1002 574
3 1242 846 747
3 950 846 1242
3 1242 747 1098
3 1274 1098 747
3 1242 1416 1382
3 1098 1416 1242
3 1242 1382 950
3 930 950 1382
3 1346 1237 915
3 1052 915 1237
3 1346 1274 747
3 915 1274 1346
3 1346 747 202
3 846 202 747
3 1346 19 1237
3 202 19 1346
3 935 1397 442
3 806 1397 935
3 935 442 1231
3 803 1231 442
3 935 499 797
3 1231 499 935
3 935 797 806
3 70 806 797
3 351 541 442
3 1306 541 351
3 351 1397 590
3 442 1397 351
3 351 590 1306
3 1164 1306 590
3 817 457 257
3 53 457 817
3 817 257 442
3 803 442 257
3 817 442 777
3 541 777 442
3 777 53 817
3 974 402 1231
3 499 1231 402
3 974 803 257
3 1231 803 974
3 974 257 412
3 457 412 257
3 974 1404 402
3 412 1404 974
3 357 317 878
3 75 878 317
3 357 878 1215
3 346 1215 878
3 357 1416 776
3 1215 1416 357
3 357 1002 317
3 776 1002 357
3 1323 235 1402
3 854 235 1323
3 1323 1402 878
3 346 878 1402
3 1323 75 645
3 878 75 1323
3 1323 645 854
3 1429 854 645
3 460 36 753
3 341 36 460
3 460 753 1402
3 346 1402 753
3 460 235 1100
3 1402 235 460
3 460 1100 341
3 348 341 1100
3 489 1382 1215
3 1416 1215 1382
3 489 346 753
3 1215 346 489
3 489 753 1375
3 36 1375 753
3 489 930 1382
3 1375 930 489
3 1192 75 1260
3 645 75 1192
3 1192 1407 1171
3 1260 1407 1192
3 1192 1171 1424
3 277 1424 1171
3 1192 1429 645
3 1424 1429 1192
3 632 134 1417
3 132 134 632
3 632 1417 1260
3 1407 1260 1417
3 632 1260 317
3 75 317 1260
3 632 317 132
3 1002 132 317
3 119 777 233
3 541 233 777
3 119 233 1417
3 1407 1417 233
3 119 134 621
3 1417 134 119
3 119 621 777
3 53 777 621
3 343 1238 1171
3 277 1171 1238
3 343 1407 233
3 1171 1407 343
3 343 541 1306
3 233 541 343
3 343 1164 1238
3 1306 1164 343
3 429 94 1295
3 1360 94 429
3 429 1295 356
3 1352 356 1295
3 429 134 132
3 356 134 429
3 429 1002 1360
3 132 1002 429
3 445 463 874
3 485 874 463
3 445 1352 1295
3 874 1352 445
3 445 1295 704
3 94 704 1295
3 445 196 463
3 704 196 445
3 588 1184 158
3 563 158 1184
3 588 1352 874
3 158 1352 588
3 588 874 657
3 485 657 874
3 588 648 1184
3 657 648 588
3 311 134 356
3 621 134 311
3 311 356 158
3 1352 158 356
3 311 563 385
3 158 563 311
3 311 53 621
3 385 53 311
3 568 716 268
3 1355 716 568
3 568 268 1244
3 529 1244 268
3 568 485 463
3 1244 485 568
3 568 463 1355
3 196 1355 463
3 1059 1388 480
3 48 480 1388
3 1059 529 268
3 480 529 1059
3 1059 268 599
3 716 599 268
3 1059 618 1388
3 599 618 1059
3 1079 1083 367
3 1193 367 1083
3 1079 529 480
3 367 529 1079
3 1079 480 683
3 48 683 480
3 1079 1108 1083
3 683 1108 1079
3 749 485 1244
3 657 485 749
3 749 1244 367
3 529 367 1244
3 749 1193 390
3 367 1193 749
3 749 390 657
3 648 657 390
3 914 1347 97
3 152 97 1347
3 914 702 855
3 97 702 914
3 914 855 681
3 961 681 855
3 914 996 1347
3 681 996 914
3 396 832 1390
3 477 1390 832
3 396 1390 97
3 702 97 1390
3 396 152 1400
3 97 152 396
3 396 1400 832
3 19 832 1400
3 971 613 41
3 439 613 971
3 971 41 1390
3 702 1390 41
3 971 1390 415
3 477 415 1390
3 971 415 439
3 478 439 415
3 377 770 855
3 961 855 770
3 377 702 41
3 855 702 377
3 377 41 382
3 613 382 41
3 377 47 770
3 382 47 377
3 95 626 790
3 1250 790 626
3 95 1354 626
3 1250 626 1354
