OFF

89 174 0
0.436645 -0.015237 0.056488
0.452031 -0.048072 0.003933
0.379495 0.027367 -0.013987
0.432064 0.070307 -0.016564
0.473101 0.054507 0.002120
0.379042 -0.027335 -0.013108
0.367071 0.004382 0.055153
0.401303 0.009968 0.062444
0.385247 0.028572 -0.037672
0.429496 -0.026865 0.051635
0.452583 0.062407 -0.007222
0.423713 -0.035435 0.022364
0.448896 0.001912 -0.056448
0.378944 0.004046 0.053020
0.395984 0.004207 0.059176
0.408758 -0.056991 -0.003629
0.398820 0.004285 0.065454
0.389015 0.009843 0.055475
0.379415 0.002529 -0.053814
0.428176 0.003925 0.058184
0.423685 -0.025373 0.051912
0.393324 0.031331 0.042738
0.369022 0.016272 0.050660
0.401362 0.036703 0.000198
0.430918 -0.068096 -0.014341
0.392871 -0.023383 0.043617
0.435915 0.021559 -0.049470
0.371293 -0.016323 0.043309
0.467382 0.001921 -0.046327
0.395856 -0.030579 0.001275
0.412099 0.013469 0.055691
0.424966 0.020542 0.047816
0.389515 -0.002916 0.055906
0.418064 0.000244 0.056788
0.400441 0.012264 0.055745
0.454416 -0.041794 0.031660
0.387690 0.004302 0.060828
0.413825 0.030604 0.051949
0.422933 0.041206 -0.042491
0.382291 0.011343 0.056673
0.434034 -0.036687 -0.048148
0.434372 -0.042311 0.039860
0.446711 -0.051927 -0.023136
0.461799 0.044148 0.023805
0.381372 -0.026191 -0.035832
0.394441 0.037800 0.007148
0.426612 -0.058159 0.023790
0.384739 0.002425 -0.057547
0.383702 -0.025047 -0.058555
0.394433 0.061377 -0.032929
0.418126 0.007726 0.056667
0.412469 -0.046255 -0.039599
0.379327 0.031697 0.023491
0.430002 0.034467 0.050626
0.424002 0.034388 0.050962
0.450498 0.033789 0.045490
0.400306 -0.004028 0.056007
0.371632 0.024623 0.042651
0.463131 0.040118 -0.033150
0.416335 0.004070 0.061122
0.390904 -0.055823 -0.031049
0.387816 0.016931 0.053469
0.369320 -0.020848 0.018090
0.424219 -0.013877 0.049306
0.368824 -0.007677 0.051045
0.390998 0.029777 -0.061357
0.386055 -0.000006 0.058606
0.425459 0.040135 0.010868
0.440194 0.034091 0.037831
0.447598 0.055212 -0.024857
0.436961 0.022880 0.055875
0.355996 0.004054 0.029003
0.401208 -0.001533 0.062628
0.379120 -0.017508 0.046801
0.439058 -0.027126 0.035289
0.393871 -0.031009 0.008253
0.435169 0.049468 0.001489
0.379479 0.025790 0.046105
0.411758 -0.006593 0.055754
0.413383 -0.022713 0.052805
0.369728 0.028368 0.017300
0.385807 0.008751 0.059309
0.382246 -0.003684 0.053896
0.414364 0.002148 -0.059555
0.404336 0.004283 0.068174
0.427548 0.051575 -0.005410
0.408868 -0.030867 -0.053352
0.387356 -0.009180 0.053889
0.378865 -0.024135 0.024388
3 55 0 70
3 55 74 0
3 55 35 74
3 55 4 35
3 70 68 55
3 4 58 35
3 58 28 35
3 28 1 35
3 28 42 1
3 28 40 42
3 28 12 40
3 42 24 1
3 71 62 80
3 62 2 80
3 62 5 2
3 5 18 2
3 65 8 2
3 48 5 44
3 55 43 4
3 69 58 3
3 10 4 3
3 51 40 60
3 74 9 0
3 75 88 25
3 66 36 32
3 36 66 13
3 81 39 17
3 81 13 39
3 50 59 7
3 33 56 72
3 6 82 64
3 81 17 36
3 36 17 14
3 32 36 14
3 66 32 82
3 54 31 37
3 54 53 31
3 30 31 50
3 30 37 31
3 19 63 33
3 79 78 63
3 79 63 20
3 78 33 63
3 11 46 29
3 79 11 75
3 45 67 37
3 52 45 21
3 67 45 23
3 70 0 19
3 9 63 0
3 19 31 70
3 36 13 81
3 6 39 13
3 79 20 11
3 54 67 53
3 79 25 87
3 61 37 34
3 82 73 64
3 66 82 13
3 19 50 31
3 30 34 37
3 56 33 78
3 72 84 59
3 9 20 63
3 74 35 11
3 11 35 41
3 5 48 18
3 18 48 47
3 29 60 5
3 44 60 48
3 44 5 60
3 41 24 46
3 41 46 11
3 87 32 14
3 72 56 14
3 16 84 72
3 6 64 71
3 6 13 82
3 16 72 14
3 33 72 59
3 59 19 33
3 83 47 48
3 35 1 41
3 51 24 40
3 51 60 24
3 42 40 24
3 40 12 83
3 73 87 25
3 73 25 88
3 27 73 88
3 79 87 56
3 64 27 71
3 75 62 88
3 32 87 82
3 82 87 73
3 87 14 56
3 27 64 73
3 5 62 75
3 56 78 79
3 15 29 46
3 15 60 29
3 15 24 60
3 15 46 24
3 86 60 40
3 86 48 60
3 41 1 24
3 20 9 11
3 79 75 25
3 9 74 11
3 75 29 5
3 11 29 75
3 88 62 27
3 0 63 19
3 86 83 48
3 86 40 83
3 62 71 27
3 10 58 4
3 10 3 58
3 55 68 67
3 55 67 76
3 2 18 65
3 65 18 47
3 49 23 2
3 8 49 2
3 8 65 49
3 3 76 85
3 85 76 67
3 17 61 14
3 34 7 14
3 7 59 84
3 22 6 71
3 22 39 6
3 7 16 14
3 16 7 84
3 19 59 50
3 47 83 65
3 43 76 4
3 43 55 76
3 38 3 49
3 69 38 58
3 69 3 38
3 26 58 38
3 26 12 58
3 26 83 12
3 26 38 83
3 61 77 21
3 45 37 21
3 28 58 12
3 21 77 52
3 77 57 52
3 57 22 71
3 80 45 52
3 39 61 17
3 61 39 77
3 22 77 39
3 14 61 34
3 50 7 34
3 61 21 37
3 22 57 77
3 80 2 45
3 53 68 70
3 50 34 30
3 23 49 85
3 85 49 3
3 65 38 49
3 4 76 3
3 37 67 54
3 68 53 67
3 23 45 2
3 67 23 85
3 80 52 57
3 70 31 53
3 38 65 83
3 71 80 57
