OFF
1147 1322 0
-0.3498425666 0.0116224329 -0.0190683231
-0.0128083399 -0.0759134242 0.0231378581
-0.1596838994 -0.0678082722 -0.0011285228
-0.1516672906 0.0653719769 -0.0445120967
-0.2819154418 0.0377037261 -0.0062284907
-0.4558727532 -0.1978355721 -0.0951075944
-0.1487460155 -0.0117705665 -0.0644372885
-0.4022359111 0.0154901580 -0.0434431404
0.1306384942 0.0645136080 -0.0100594405
0.2204663058 0.0106554171 0.0021310931
-0.3948389352 0.0014355056 -0.0879545391
-0.3997445334 0.0610428954 -0.0567896062
-0.0030737835 -0.0654706227 -0.0344952032
0.1859178221 0.0306348410 0.0623417803
0.2650194784 0.0058931131 0.0767891122
-0.3419241073 -0.0648230529 -0.0687297665
-0.1512099800 -0.0650775485 -0.0515065464
-0.4763187913 0.1934181447 -0.0736269109
-0.4364194338 0.0795690112 -0.0805085763
-0.2788218867 -0.0667816946 -0.0280711109
-0.2808294396 -0.0560123849 -0.0157650193
-0.0008925649 -0.0177343735 -0.0459200476
0.1309557165 -0.0262535838 -0.0149263580
0.1310951692 -0.0659352915 -0.0170540200
-0.3392002213 -0.0639445481 -0.0849227164
0.4062263798 0.0188496226 0.0491289179
-0.4021208310 -0.0173496837 -0.0452040014
-0.3499625223 0.0458311558 -0.0172341878
0.0968123534 0.0692150392 0.0536197644
0.1599425038 -0.0293145739 0.0440546175
-0.3026019272 -0.3152437702 -0.0794010532
-0.2206711413 0.0423834171 0.0043272588
-0.3417763156 0.0658213405 -0.0653337676
-0.3389663466 -0.0008544071 -0.0842465119
-0.3429835178 -0.0651636030 -0.0624325080
0.4085308958 -0.0114590545 0.0344219311
-0.3389827965 0.0037061998 -0.0840019973
0.2263678052 -0.0173751696 0.0901999355
-0.4757136890 0.1936130127 -0.0772253617
-0.1614587394 -0.0154114210 0.0111544923
-0.3374275186 -0.0510450753 -0.0950576512
0.2683982057 -0.0309186701 0.0554628737
-0.4475656251 -0.0835457001 0.0688037073
-0.3952047234 0.0625066466 -0.0837777695
-0.2203538468 -0.0479278794 -0.0005151770
0.1542896310 0.0058509446 0.0788708483
0.4084659500 0.0067855417 0.0354000676
-0.2265933068 0.3152435202 -0.0259439739
-0.1628149470 0.0042433596 0.0198766853
-0.3496969883 -0.0298840270 -0.0212944567
-0.0148797253 0.0613204847 0.0399703103
-0.1617558634 0.0694262691 0.0157029944
-0.1612474026 -0.0756187411 0.0079258901
-0.1601418016 0.0626406137 0.0058654303
0.2761710872 0.0099435918 0.0105126751
-0.0147128683 0.0134286442 0.0374015482
0.2732847554 0.0249955210 0.0281908332
-0.4219939955 0.0688212928 0.0952803421
0.2129668182 -0.0324020062 0.0453847423
0.1669646072 0.0204377844 0.0038664790
0.2127652774 0.0250688270 0.0484659101
-0.0145904607 -0.0212359390 0.0355432000
-0.3939555189 0.0519491432 -0.0915615545
-0.0144230250 -0.0691284119 0.0329753729
-0.1615451685 0.0092195741 0.0124743518
-0.3469212529 0.0641639889 -0.0347470551
-0.4480978166 0.0683405510 0.0769476530
-0.0133167821 0.0691303178 0.0309149534
-0.0146081159 -0.0162181856 0.0358120261
-0.3961126792 0.0622133889 -0.0783801225
-0.1488355236 0.0137715325 -0.0630677101
-0.1627607497 -0.0112645031 0.0190450186
-0.2792798016 0.0636671900 -0.0210769789
0.1307766816 0.0248318824 -0.0121871922
0.4011145013 -0.0133927313 0.0785277636
-0.3464639360 -0.0662855358 -0.0417415942
-0.3377544356 0.0205414049 -0.0907682159
-0.3396581614 0.0665043335 -0.0779282265
-0.4131960576 -0.0870070579 0.0929511526
-0.3013639260 0.0581030601 -0.0552434320
0.2650962195 -0.0160001123 0.0756149067
0.1096285325 0.0651249820 -0.0228374363
0.0973275501 -0.0776553520 0.0457446762
-0.3993158354 -0.0611965087 -0.0633438507
0.4010528835 0.0039397479 0.0794564604
-0.4020087730 -0.0492784150 -0.0469159487
0.1876902569 0.0607534615 0.0638089503
-0.4297869386 0.0057607537 -0.0258759547
0.2682094129 0.0229032874 0.0583489371
-0.3511110950 0.0061903475 -0.0116911869
0.4063817682 -0.0249373784 0.0467815364
0.1597470570 0.0263315035 0.0470377612
-0.3495982605 0.0500582510 -0.0192629083
-0.1554469365 -0.0664429100 -0.0263175793
0.1100852075 -0.0653239176 -0.0298320158
-0.5000000000 0.1828001182 -0.0818967024
-0.3510502438 -0.0111416352 -0.0126199338
-0.2816164259 -0.0475904601 -0.0108021496
0.4031241149 0.0178499689 0.0675714308
0.1565970849 -0.0258260672 0.0640900050
-0.2787963148 -0.0740794373 -0.0284623934
-0.1961820886 0.3152998919 -0.0250000880
-0.4749692747 -0.1915439235 -0.0942679726
-0.3434408098 0.0652846541 -0.0554380673
0.1671174219 -0.0233493145 0.0015186449
-0.2259121748 0.3154629901 -0.0299922013
-0.2243804535 -0.3160207194 -0.0597914584
0.1861547182 -0.0368702234 0.0587220745
0.2095350355 -0.0257450903 0.0660413347
-0.3936023560 -0.0488516410 -0.0969664238
0.1599583305 -0.0338758239 0.0438100536
-0.3473895597 -0.0615610416 -0.0360749422
0.1097716083 0.0240743765 -0.0250386412
-0.4137459044 0.0698969465 0.1013639245
-0.4297327413 -0.0097471090 -0.0267076214
-0.3009583948 -0.0577503540 -0.0614554464
-0.4987273276 -0.1802685967 -0.1013639245
-0.1481442495 0.0541777727 -0.0658634369
0.5000000000 -0.0035589864 0.0636888754
-0.3478097181 0.0583977457 -0.0296428454
0.1687465989 -0.0127783926 -0.0078390542
-0.3498924985 0.0257620432 -0.0183104184
0.1564496779 0.0161368961 0.0663404008
-0.3938544242 0.0232140497 -0.0931022927
-0.3377983680 0.0547747291 -0.0893837678
0.2093882705 0.0162172478 0.0682917708
0.2262874068 0.0054310625 0.0914226655
0.0969883350 0.0190419502 0.0509297002
-0.4023473273 0.0474182642 -0.0417311528
-0.3937046501 -0.0196606707 -0.0954012041
-0.4214532581 -0.0853455743 0.0870141593
-0.1616791223 0.0475330437 0.0145287888
-0.3947760254 -0.0597327575 -0.0903320140
-0.4743641724 -0.1913490555 -0.0978664233
-0.0010204310 0.0187543396 -0.0439635453
-0.0162679075 0.0033388203 0.0463346276
-0.4212939054 -0.0875770030 0.0859921003
0.2205497449 -0.0130631936 0.0008594405
-0.3492341279 -0.0539361703 -0.0248390762
0.1099415148 -0.0242739545 -0.0276309496
-0.3496269644 -0.0499531397 -0.0223706873
0.0968416332 0.0610042956 0.0531792417
-0.1477727768 -0.0516413886 -0.0715372710
-0.0025146341 0.0127938543 -0.0352610147
-0.3993787515 -0.0000282463 -0.0609662863
-0.1939685935 -0.3159649728 -0.0588475322
-0.3956839812 -0.0600260152 -0.0849343670
0.2734771869 -0.0297381748 0.0252562544
-0.2236993216 -0.3158012495 -0.0638396858
-0.0162130684 -0.0121696676 0.0455030012
-0.0024251137 -0.0127495137 -0.0366305126
0.1543693875 -0.0169546623 0.0776480780
0.0972982703 -0.0694446083 0.0461851989
-0.0132912228 0.0618325736 0.0305238498
-0.1601674242 0.0699383507 0.0062574286
-0.1596589634 -0.0751066595 -0.0015196757
0.2184146217 -0.0306462634 0.0129986546
-0.1559048767 0.0640059716 -0.0193230895
0.2182130175 0.0268245625 0.0160807171
0.2762508501 -0.0128620144 0.0092898153
0.4032795656 -0.0259369678 0.0652240542
-0.0007555768 -0.0569602224 -0.0480233177
0.1597628836 0.0217702535 0.0467931972
-0.1613247856 -0.0537248906 0.0091000553
-0.0146945897 0.0084115340 0.0371327713
-0.4572671398 0.1998970369 -0.0737818008
-0.3048150372 0.3160207194 -0.0455535848
-0.0011580610 0.0579808137 -0.0418603155
-0.0128345857 -0.0686163303 0.0235298071
0.1686637953 0.0109395922 -0.0065672718
0.1881469758 -0.0696967034 0.0568140040
-0.3376228870 -0.0168603119 -0.0927736005
-0.2793054242 0.0709649269 -0.0206849806
-0.4358695743 -0.0773349918 -0.0889215271
-0.3497469834 -0.0157444240 -0.0205356574
-0.2812070067 0.0516302617 -0.0099929016
0.0971515686 -0.0274822630 0.0484347404
-0.0035304585 0.0649782769 -0.0275006237
-0.4218504694 0.0711511141 0.0945028470
0.1595513462 -0.0479751436 0.0209438230
0.1592334693 0.0427926719 0.0258108791
-0.3167749522 -0.0674674686 0.0462179878
-0.3470127486 -0.0715097214 0.0385930667
-0.2685643995 -0.0576976740 0.0228514054
-0.3985962948 -0.0667494199 0.0232165100
-0.3985962948 -0.0667494199 0.0232165100
-0.4003025339 -0.0580139175 -0.0118497193
-0.4247871991 -0.0664120576 0.0109438793
-0.3515348420 -0.0664680172 0.0381060048
-0.3165756339 -0.0570292386 0.0136519276
-0.3855401113 -0.0676493570 0.0323217360
-0.4120988984 0.0592846891 0.0263858471
-0.4120988984 0.0592846891 0.0263858471
-0.3857243649 0.0606046825 0.0376199694
-0.3808485794 0.0546714701 0.0035614694
-0.3172085228 0.0561401818 0.0528455916
-0.3478306731 0.0538003363 0.0475677169
-0.2689398320 0.0492617994 0.0285864252
-0.3515287380 0.0613906879 0.0422549727
-0.3163678724 0.0565104748 0.0161310356
-0.3857243649 0.0606046825 0.0376199694
-0.3212608053 0.0567672656 0.0494150529
-0.2709659733 0.0495753413 0.0268711559
-0.3515287380 0.0613906879 0.0422549727
-0.4121706614 0.0581197785 0.0267745947
-0.4121706614 0.0581197785 0.0267745947
-0.3810665919 0.0519754672 0.0047702034
-0.3859782589 0.0573262243 0.0390230772
-0.3519547187 0.0532625095 0.0445259257
-0.3859782589 0.0573262243 0.0390230772
-0.3169350802 0.0454831178 0.0191487175
-0.3983998765 -0.0687409352 0.0219823155
-0.4247871991 -0.0664120576 0.0109438793
-0.4002043248 -0.0590096751 -0.0124668166
-0.3983998765 -0.0687409352 0.0219823155
-0.3209035524 -0.0666367268 0.0432494911
-0.2706286996 -0.0572823031 0.0213671571
-0.3515348420 -0.0664680172 0.0381060048
-0.3510616725 -0.0717946940 0.0351135405
-0.3852640167 -0.0707565867 0.0305765120
-0.3159455560 -0.0639035394 0.0096742606
-0.3793155329 0.1290000485 -0.0645126164
-0.4208881578 0.1243107294 -0.0736152350
-0.4208881578 0.1243107294 -0.0736152350
-0.3813322367 0.0950660350 -0.0694745013
-0.4682097169 0.1311845647 -0.0812026394
-0.4208554227 -0.1227160999 -0.0818982162
-0.4208554227 -0.1227160999 -0.0818982162
-0.3819194703 -0.0939398515 -0.0721653621
-0.4672984510 -0.1288017942 -0.0951427258
-0.3793155329 0.1290000485 -0.0645126164
-0.3784155740 -0.1277929630 -0.0782815204
-0.3784155740 -0.1277929630 -0.0782815204
-0.4081441399 -0.1280860542 -0.0832980949
-0.4551168734 -0.1343420236 -0.0933939752
-0.3888968408 -0.0710790223 -0.0788256468
-0.4098798006 0.1293513994 -0.0645324891
-0.4563691125 0.1364935780 -0.0770677436
-0.3899301218 0.0724268327 -0.0679733218
-0.2512478182 -0.1949403434 -0.0461510396
-0.2769248727 -0.2550920568 -0.0627760464
-0.2374735699 -0.2553707964 -0.0549953627
-0.2503120971 -0.2854466531 -0.0633078661
-0.2906991210 -0.1946616038 -0.0539317233
-0.2650220665 -0.1345098904 -0.0373067165
-0.2769248727 -0.2550920568 -0.0627760464
-0.1916791425 -0.1954539545 -0.0326796807
-0.2512478182 -0.1949403434 -0.0461510396
-0.2352377286 -0.1347666959 -0.0305710371
-0.2134584355 -0.1651103252 -0.0316253589
-0.2650220665 -0.1345098904 -0.0373067165
-0.2076892320 -0.2556276020 -0.0482596833
-0.2374735699 -0.2553707964 -0.0549953627
-0.2294685251 -0.2252839727 -0.0472053614
-0.2352377286 -0.1347666959 -0.0305710371
-0.2192276391 -0.0745930484 -0.0149910346
-0.1974483460 -0.1049366777 -0.0160453564
-0.2570170217 -0.1044230666 -0.0295167153
-0.1756690529 -0.1352803070 -0.0170996782
-0.2134584355 -0.1651103252 -0.0316253589
-0.1974483460 -0.1049366777 -0.0160453564
-0.1196144784 0.1922966539 0.0004613761
-0.1727633266 0.2538798220 -0.0147654126
-0.1047494353 0.1922151049 0.0029574327
-0.1196144784 0.1922966539 0.0004613761
-0.0664656303 0.1307134859 0.0156881647
-0.0867421031 0.0695343342 0.0185861910
-0.1133165272 0.1003259183 0.0109727967
-0.0398912062 0.0999219018 0.0233015591
-0.1398909513 0.1311175023 0.0033594023
-0.0930400544 0.1615050699 0.0080747704
-0.1133165272 0.1003259183 0.0109727967
-0.1930397995 0.1927006704 -0.0118673863
-0.1727633266 0.2538798220 -0.0147654126
-0.1461889025 0.2230882380 -0.0071520183
-0.2094759871 0.2540818302 -0.0209297938
-0.1398909513 0.1311175023 0.0033594023
-0.1766036118 0.1313195105 -0.0028049789
-0.1664653754 0.1619090863 -0.0042539920
-0.1185943967 -0.1959670718 -0.0183268001
-0.0657013683 -0.1359402480 0.0024055290
-0.0870278713 -0.0757660827 0.0155318741
-0.1134743855 -0.1057794946 0.0051657095
-0.0392548541 -0.1059268361 0.0127716936
-0.1399208997 -0.1357929065 -0.0052004550
-0.0921478825 -0.1659536599 -0.0079606356
-0.1134743855 -0.1057794946 0.0051657095
-0.1928139281 -0.1958197303 -0.0259327842
-0.1714874251 -0.2559938956 -0.0390591293
-0.1450409109 -0.2259804837 -0.0286929647
-0.2085971908 -0.2559202248 -0.0428621213
-0.1399208997 -0.1357929065 -0.0052004550
-0.1770306653 -0.1357192357 -0.0090034470
-0.1663674139 -0.1658063184 -0.0155666196
-0.2319246649 -0.1954312557 -0.0357375815
-0.1965860338 -0.1355249984 -0.0139058457
-0.2200218587 -0.0748490892 -0.0102682517
-0.2376911743 -0.1048022179 -0.0211841196
-0.1789167182 -0.1055718698 -0.0029899778
-0.2553604898 -0.1347553465 -0.0320999875
-0.2142553493 -0.1654781271 -0.0248217136
-0.2376911743 -0.1048022179 -0.0211841196
-0.2906991210 -0.1946616038 -0.0539317233
-0.2672632961 -0.2553375130 -0.0575693174
-0.2495939805 -0.2253843843 -0.0466534494
-0.2966505241 -0.2549526870 -0.0666663882
-0.2553604898 -0.1347553465 -0.0320999875
-0.2847477179 -0.1343705206 -0.0411970584
-0.2730298054 -0.1647084751 -0.0430158554
-0.2526087995 0.1932139585 -0.0253385909
-0.2920602307 0.1934928231 -0.0331192827
-0.2787119183 0.2546173389 -0.0354460879
-0.2659571118 0.1320894427 -0.0230117858
-0.2787119183 0.2546173389 -0.0354460879
-0.2523120466 0.2850401645 -0.0327191446
-0.2392604871 0.2543384743 -0.0276653961
-0.2332854503 0.1927234942 -0.0149252952
-0.1941745851 0.1923348946 -0.0051204898
-0.2103839459 0.2537892074 -0.0155322318
-0.1975206569 0.1310748817 0.0003888496
-0.2690502438 0.2543721068 -0.0302394400
-0.2299393785 0.2539835072 -0.0204346345
-0.2657041720 0.3156321198 -0.0357487793
-0.2332854503 0.1927234942 -0.0149252952
-0.2920602307 0.1934928231 -0.0331192827
-0.2562954372 0.1318442106 -0.0178051379
-0.2741778340 0.1626685169 -0.0254622103
-0.2856828274 0.1322288750 -0.0269021316
-0.2690502438 0.2543721068 -0.0302394400
-0.2984376339 0.2547567713 -0.0393364337
-0.2511678470 0.2235478005 -0.0225823676
-0.1975206569 0.1310748817 0.0003888496
-0.2562954372 0.1318442106 -0.0178051379
-0.2384130405 0.1010199043 -0.0101480655
-0.2154030536 0.1618991880 -0.0072682228
-0.2205306438 0.0701955980 -0.0024909931
-0.1796382601 0.1002505754 0.0080459220
-0.2384130405 0.1010199043 -0.0101480655
-0.1930397995 0.1927006704 -0.0118673863
-0.2361726118 0.1318327986 -0.0162761835
-0.1766036118 0.1313195105 -0.0028049789
-0.1981700180 0.1008855747 -0.0050093774
-0.2146062057 0.1622667345 -0.0140717849
-0.2197364242 0.0704516388 -0.0072137760
-0.2577390180 0.1013988628 -0.0184805820
-0.1981700180 0.1008855747 -0.0050093774
-0.2526087995 0.1932139585 -0.0253385909
-0.2094759871 0.2540818302 -0.0209297938
-0.2310423933 0.2236478944 -0.0231341924
-0.2392604871 0.2543384743 -0.0276653961
-0.2361726118 0.1318327986 -0.0162761835
-0.2659571118 0.1320894427 -0.0230117858
-0.2146062057 0.1622667345 -0.0140717849
-0.2319246649 -0.1954312557 -0.0357375815
-0.2672632961 -0.2553375130 -0.0575693174
-0.2634911904 -0.3156322448 -0.0695962558
-0.2281525592 -0.2557259875 -0.0477645200
-0.1928139281 -0.1958197303 -0.0259327842
-0.1965860338 -0.1355249984 -0.0139058457
-0.2085971908 -0.2559202248 -0.0428621213
-0.1185943967 -0.1959670718 -0.0183268001
-0.1714874251 -0.2559938956 -0.0390591293
-0.1033884667 -0.1959391985 -0.0178548371
-0.1941745851 0.1923348946 -0.0051204898
-0.1789689760 0.1923630805 -0.0046485468
-0.2103839459 0.2537892074 -0.0155322318
-0.1047494353 0.1922151049 0.0029574327
-0.1789689760 0.1923630805 -0.0046485468
-0.1332526494 0.1308206870 0.0093302135
-0.1561108127 0.1615918838 0.0023408333
-0.1703624197 0.1308946748 0.0055272238
-0.1504657620 0.2537574984 -0.0110213277
-0.1875755323 0.2538314862 -0.0148243174
-0.1276075987 0.2229863016 -0.0040319475
-0.0590331087 0.1306727113 0.0169361931
-0.1332526494 0.1308206870 0.0093302135
-0.1103944861 0.1000494902 0.0163195937
-0.0818912720 0.1614439081 0.0099468129
-0.0875363228 0.0692782934 0.0233089739
-0.0361749454 0.0999015145 0.0239255732
-0.1103944861 0.1000494902 0.0163195937
-0.1916791425 -0.1954539545 -0.0326796807
-0.1768137784 -0.1955358162 -0.0301836040
-0.2076892320 -0.2556276020 -0.0482596833
-0.1033884667 -0.1959391985 -0.0178548371
-0.1768137784 -0.1955358162 -0.0301836040
-0.1315237150 -0.1355229290 -0.0096872564
-0.1541687467 -0.1655293726 -0.0199354302
-0.1682363709 -0.1353212379 -0.0158516398
-0.1486785301 -0.2559520856 -0.0383511846
-0.1853911859 -0.2557503945 -0.0445155681
-0.1260334984 -0.2259456421 -0.0281030109
-0.0580984033 -0.1359263113 0.0026415105
-0.1315237150 -0.1355229290 -0.0096872564
-0.1088786833 -0.1055164854 0.0005609174
-0.0807434350 -0.1659327549 -0.0076066633
-0.0862336516 -0.0755100419 0.0108090912
-0.0354533716 -0.1059198678 0.0128896843
-0.1088786833 -0.1055164854 0.0005609174
0.3373899869 -0.0279280242 0.0511222050
0.0471122434 -0.0674576155 0.0058449979
0.0471122434 -0.0674576155 0.0058449979
0.0535057120 -0.0653972701 -0.0321636095
0.1036917389 -0.0673842630 0.0081765916
0.0413539048 -0.0453402737 0.0408641995
0.0413539048 -0.0453402737 0.0408641995
0.0795328828 -0.0258050987 -0.0010549970
0.1426492722 -0.0485894832 0.0526243722
0.0726671940 -0.0227663798 0.0399333218
-0.0879576231 -0.0374804148 0.0223216276
-0.0878739053 -0.0614266513 0.0210377141
-0.0511903241 -0.0533044134 0.0276485003
-0.0879576231 -0.0374804148 0.0223216276
-0.0754232801 -0.0585560056 -0.0530162371
-0.0792603600 -0.0659567663 -0.0304063913
-0.0845980498 0.0629192726 0.0056003802
-0.0797176676 0.0644921242 -0.0234118566
-0.0845980498 0.0629192726 0.0056003802
-0.0465044452 0.0631623489 0.0035559966
-0.0756303187 0.0005110094 -0.0498491113
-0.0756303187 0.0005110094 -0.0498491113
0.1591643755 0.0626335347 0.0268747549
0.0793633130 0.0225429215 0.0015371079
0.0410543048 0.0401812175 0.0454500052
0.0410543048 0.0401812175 0.0454500052
0.0481686548 0.0634787778 0.0038432068
0.0417752052 0.0614184346 0.0418515457
0.1032350829 0.0630646388 0.0151709027
0.0481686548 0.0634787778 0.0038432068
0.0831193408 -0.0009049607 -0.0215988922
0.0831193408 -0.0009049607 -0.0215988922
0.3382044352 0.0214227450 0.0478811320
-0.0743326709 -0.0346878810 -0.0587286593
-0.2473235789 -0.0651937291 -0.0556201479
-0.2426978319 -0.0342508503 -0.0821554357
-0.2307528638 0.0603718369 -0.0246890009
-0.2429493426 0.0373595888 -0.0783158264
-0.1958924331 0.0255655606 -0.0706917682
-0.2432949796 0.0171564687 -0.0769179630
-0.2439012055 0.0603410531 -0.0718958317
-0.0745823403 0.0364660561 -0.0549134911
-0.0745823403 0.0364660561 -0.0549134911
-0.2477815191 0.0652551526 -0.0486256580
-0.2429493426 0.0373595888 -0.0783158264
-0.2303211471 -0.0627793131 -0.0312919846
-0.2426978319 -0.0342508503 -0.0821554357
-0.2431844513 -0.0143154392 -0.0786054445
-0.1957219237 -0.0230107084 -0.0732963621
-0.2434864990 -0.0577929684 -0.0782299937
-0.0743326709 -0.0346878810 -0.0587286593
0.0690507400 -0.0068079210 0.0619913528
0.0786241248 0.0172820539 0.0057660913
0.1191935042 0.0195261537 0.0262796443
0.0822249865 0.0166158193 -0.0156972678
0.0543040508 0.0419396608 -0.0334004908
0.0543040508 0.0419396608 -0.0334004908
0.1413797277 0.0458195683 0.0577605110
0.0725341470 0.0150908937 0.0419629843
-0.0882124469 0.0352700294 0.0262223310
-0.0882124469 0.0352700294 0.0262223310
-0.0881290184 0.0113241092 0.0249379500
-0.0515460861 0.0482952571 0.0330963207
-0.0764126758 0.0616763953 -0.0431862061
-0.2439009351 0.0064585627 -0.0736571110
-0.2556938676 0.0104210035 -0.0032969856
-0.0797176676 0.0644921242 -0.0234118566
-0.0841407611 -0.0675296202 -0.0013938861
-0.2556028614 -0.0155779225 -0.0046905825
-0.0792603600 -0.0659567663 -0.0304063913
-0.0460474729 -0.0672865483 -0.0034382921
-0.0841407611 -0.0675296202 -0.0013938861
0.1596210725 -0.0678159975 0.0198799920
0.0545929690 -0.0406170885 -0.0378271337
0.0545929690 -0.0406170885 -0.0378271337
0.0787586951 -0.0210320438 0.0037120525
0.0823461541 -0.0180494141 -0.0175559338
0.1193505995 -0.0251733088 0.0238833350
0.1592334693 0.0427926719 0.0258108791
0.1595513462 -0.0479751436 0.0209438230
-0.3139210941 -0.0637610532 0.0114140237
-0.3649855049 -0.0772372633 0.0695845702
-0.2988021959 -0.0617399268 0.0152264842
-0.2505916432 -0.0519701321 -0.0081400982
-0.4100247764 -0.0760474971 0.0551153346
-0.3855401113 -0.0676493570 0.0323217360
-0.3156216952 -0.0487717999 -0.0165864185
-0.3505809032 -0.0582105784 0.0078676588
-0.3864940501 -0.0759067958 0.0625600821
-0.3675835379 -0.0588012483 0.0049755243
-0.4252225719 0.0578794076 0.0176082501
-0.4169746839 0.0652179016 0.0604443471
-0.3808485794 0.0546714701 0.0035614694
-0.4169746839 0.0652179016 0.0604443471
-0.3759727939 0.0487382576 -0.0304970305
-0.4072231128 0.0533514767 -0.0076726528
-0.3148730575 0.0457520312 0.0206696131
-0.3654772136 0.0630185642 0.0771047580
-0.2995619823 0.0469219540 0.0233085505
-0.2512932915 0.0400435716 -0.0009506159
-0.3154026336 0.0508442564 -0.0146279049
-0.3505634993 0.0557244695 0.0114960322
-0.3866896037 0.0662709010 0.0683789099
-0.3676613127 0.0553314668 0.0091785305
-0.3212608053 0.0567672656 0.0494150529
-0.2509390740 0.0470068394 -0.0028328214
-0.3012339060 0.0541987637 0.0197110757
-0.3715556374 0.0639591898 0.0719589500
-0.3163678724 0.0565104748 0.0161310356
-0.4170823284 0.0634705356 0.0610274684
-0.4252225719 0.0578794076 0.0176082501
-0.4072589943 0.0527690213 -0.0074782791
-0.3761549248 0.0466247100 -0.0294826703
-0.4170823284 0.0634705356 0.0610274684
-0.3810665919 0.0519754672 0.0047702034
-0.3679703906 0.0515786901 0.0108944447
-0.3869743571 0.0610419011 0.0699031339
-0.3509586205 0.0495468327 0.0136458690
-0.3159389821 0.0417674410 -0.0117313392
-0.3852640167 -0.0707565867 0.0305765120
-0.4098468910 -0.0781589691 0.0539872079
-0.3209035524 -0.0666367268 0.0432494911
-0.2509851363 -0.0477591697 -0.0056586633
-0.3012599892 -0.0571135935 0.0162236707
-0.3711784053 -0.0759911506 0.0651318252
-0.3165756339 -0.0570292386 0.0136519276
-0.3672490723 -0.0623463785 0.0028687179
-0.3861777889 -0.0796858485 0.0605528204
-0.3501479002 -0.0628654321 0.0051372321
-0.3150317837 -0.0549742776 -0.0203020478
-0.4098798006 0.1293513994 -0.0645324891
-0.4003539748 0.1325908455 -0.0646099340
-0.3403397294 0.0935515543 -0.0598780242
-0.4604440789 0.1535554238 -0.0777559687
-0.4087450023 0.1297171766 -0.0712795646
-0.3890978747 0.0726951759 -0.0729211719
-0.4088758352 0.0873175231 -0.0749915388
-0.4604440789 0.1535554238 -0.0777559687
-0.4523145753 0.1053767880 -0.0808556078
-0.4597913752 -0.1514923483 -0.0916310703
-0.4089763963 -0.1283537633 -0.0783502403
-0.3894265461 -0.0712492974 -0.0756770175
-0.4088945223 -0.0856374216 -0.0805434446
-0.4597913752 -0.1514923483 -0.0916310703
-0.4515840127 -0.1030683930 -0.0920321264
-0.3403397294 0.0935515543 -0.0598780242
-0.3995217277 0.1328591887 -0.0695577842
-0.3396869844 -0.0927716585 -0.0698684834
-0.3994281355 -0.1314995876 -0.0787700512
-0.4089763963 -0.1283537633 -0.0783502403
-0.4087450023 0.1297171766 -0.0712795646
-0.4081441399 -0.1280860542 -0.0832980949
-0.3988984303 -0.1313293125 -0.0819186805
-0.3396869844 -0.0927716585 -0.0698684834
-0.4672984510 -0.1288017942 -0.0951427258
-0.4454932239 -0.1058385077 -0.0911577512
-0.4412541561 -0.1597175549 -0.0905822591
-0.3750341236 -0.0964545536 -0.0760139307
-0.3985204904 -0.0995825383 -0.0810618709
-0.4682097169 0.1311845647 -0.0812026394
-0.4463942731 0.1080312946 -0.0787881600
-0.4430992959 0.1613847721 -0.0690797000
-0.3766603052 0.0973180268 -0.0599852782
-0.3999049612 0.1008891160 -0.0662529054
-0.2200605502 -0.0639021640 -0.0096811691
-0.2503120971 -0.2854466531 -0.0633078661
-0.2640863454 -0.2250162001 -0.0544635430
-0.2631506244 -0.3155225099 -0.0716203695
-0.2897633999 -0.2851679135 -0.0710885498
-0.2778605937 -0.1645857471 -0.0456192199
-0.2847477179 -0.1343705206 -0.0411970584
-0.2966505241 -0.2549526870 -0.0666663882
-0.2640863454 -0.2250162001 -0.0544635430
-0.0766038667 0.1001239100 0.0171371779
-0.1234547637 0.0697363425 0.0124218098
-0.0500294426 0.0693323260 0.0247505722
-0.0766038667 0.1001239100 0.0171371779
-0.1031782908 0.1309154941 0.0095237835
-0.1297527149 0.1617070781 0.0019103892
-0.1500291878 0.1005279265 0.0048084155
-0.1031782908 0.1309154941 0.0095237835
-0.1563271390 0.1924986622 -0.0057030051
-0.1829015630 0.2232902462 -0.0133163995
-0.1993377507 0.2846714060 -0.0223788069
-0.1829015630 0.2232902462 -0.0133163995
-0.1664653754 0.1619090863 -0.0042539920
-0.1500291878 0.1005279265 0.0048084155
-0.1563271390 0.1924986622 -0.0057030051
-0.1297527149 0.1617070781 0.0019103892
-0.0763646198 -0.1058531653 0.0089687015
-0.1241376369 -0.0756924119 0.0117288821
-0.0499181056 -0.0758397534 0.0193348661
-0.0763646198 -0.1058531653 0.0089687015
-0.1028111340 -0.1358665772 -0.0013974630
-0.1292576482 -0.1658799891 -0.0117636276
-0.1505841511 -0.1057058238 0.0013627175
-0.1028111340 -0.1358665772 -0.0013974630
-0.1557041624 -0.1958934010 -0.0221297921
-0.1821506766 -0.2259068129 -0.0324959567
-0.1979339393 -0.2860073075 -0.0494252938
-0.1821506766 -0.2259068129 -0.0324959567
-0.1663674139 -0.1658063184 -0.0155666196
-0.1505841511 -0.1057058238 0.0013627175
-0.1557041624 -0.1958934010 -0.0221297921
-0.1292576482 -0.1658799891 -0.0117636276
-0.2656603589 0.2239156487 -0.0303923394
-0.2984376339 0.2547567713 -0.0393364337
-0.2856828274 0.1322288750 -0.0269021316
-0.2790086712 0.1627911329 -0.0280655342
-0.2917634778 0.2853190292 -0.0404998363
-0.2653636060 0.3157418547 -0.0377728930
-0.2656603589 0.2239156487 -0.0303923394
-0.2523120466 0.2850401645 -0.0327191446
-0.2299393785 0.2539835072 -0.0204346345
-0.2218346981 0.2232563508 -0.0152287635
-0.1779652243 0.1308805819 0.0052912523
-0.2154030536 0.1618991880 -0.0072682228
-0.2478217753 0.2848078135 -0.0280917069
-0.2511678470 0.2235478005 -0.0225823676
-0.2869326405 0.2851964131 -0.0378965124
-0.2478217753 0.2848078135 -0.0280917069
-0.0882794238 0.0544267642 0.0272495495
-0.2458218748 -0.2856791162 -0.0586803879
-0.2849326116 -0.2852906416 -0.0684851853
-0.2495939805 -0.2253843843 -0.0466534494
-0.2458218748 -0.2856791162 -0.0586803879
-0.2142553493 -0.1654781271 -0.0248217136
-0.1770306653 -0.1357192357 -0.0090034470
-0.2202609279 -0.2256757403 -0.0392998514
-0.2281525592 -0.2557259875 -0.0477645200
-0.0878739053 -0.0614266513 0.0210377141
-0.2204794619 0.0556001168 -0.0032740950
-0.1190010424 0.1615178959 0.0061438231
-0.1418592057 0.1922890927 -0.0008455571
-0.1475042564 0.1001234780 0.0125166040
-0.1561108127 0.1615918838 0.0023408333
-0.1647173690 0.2230602895 -0.0078349373
-0.1733239253 0.2845286952 -0.0180107079
-0.1647173690 0.2230602895 -0.0078349373
-0.1418592057 0.1922890927 -0.0008455571
-0.0961428791 0.1307466991 0.0131332033
-0.1475042564 0.1001234780 0.0125166040
-0.1190010424 0.1615178959 0.0061438231
-0.0961428791 0.1307466991 0.0131332033
-0.0732847157 0.0999755024 0.0201225835
-0.0504265524 0.0692043056 0.0271119637
-0.1246460931 0.0693522813 0.0195059841
-0.0732847157 0.0999755024 0.0201225835
-0.1174560909 -0.1657310637 -0.0137710467
-0.1401011226 -0.1957375073 -0.0240192205
-0.1455913392 -0.1053147943 -0.0056034660
-0.1541687467 -0.1655293726 -0.0199354302
-0.1627461542 -0.2257439509 -0.0342673943
-0.1713235618 -0.2859585292 -0.0485993584
-0.1627461542 -0.2257439509 -0.0342673943
-0.1401011226 -0.1957375073 -0.0240192205
-0.0948110592 -0.1357246202 -0.0035228729
-0.1455913392 -0.1053147943 -0.0056034660
-0.1174560909 -0.1657310637 -0.0137710467
-0.0948110592 -0.1357246202 -0.0035228729
-0.0721660275 -0.1057181766 0.0067253009
-0.0495209958 -0.0757117330 0.0169734747
-0.1229463075 -0.0753083507 0.0046447077
-0.0721660275 -0.1057181766 0.0067253009
0.3373899869 -0.0279280242 0.0511222050
0.3028940963 -0.0294233471 0.0532925394
0.3399294775 -0.0273377766 0.0360188954
0.0422318423 -0.0690304693 0.0348575030
0.0220192300 -0.0664641191 -0.0143251027
0.0785987255 -0.0663907665 -0.0119935090
0.0220192300 -0.0664641191 -0.0143251027
0.0722052569 -0.0684511119 0.0260150984
0.0785987255 -0.0663907665 -0.0119935090
0.0693260876 -0.0573924410 0.0435246992
0.0412805540 -0.0243591010 0.0419889702
0.0134654399 -0.0572343428 0.0369197862
0.0414376227 -0.0692865101 0.0395802859
0.1197456066 -0.0298404613 0.0213775283
0.0545244750 -0.0210041640 -0.0367754986
0.1426492722 -0.0485894832 0.0526243722
-0.0880246000 -0.0183236800 0.0233488461
-0.1247081813 -0.0264459179 0.0167380600
-0.0754232801 -0.0585560056 -0.0530162371
-0.1909062931 -0.0316696502 0.0053196576
-0.2438561810 -0.0063124868 -0.0743419002
-0.2439091601 0.0087388661 -0.0735348537
-0.0465044452 0.0631623489 0.0035559966
-0.1178112722 0.0642490479 -0.0213674730
-0.0084108407 0.0634054252 0.0015116130
-0.0416240631 0.0647352005 -0.0254562402
0.1137400637 0.0627589518 0.0215599006
0.1422659451 0.0608788785 0.0584940960
0.0543755886 0.0214143580 -0.0345010933
0.1195551850 0.0244372125 0.0242874345
0.0689479690 0.0505927565 0.0493146234
0.0409809540 0.0611623901 0.0465747760
0.0131707183 0.0268049308 0.0414257767
0.0411377334 0.0162352972 0.0441656242
0.0725051440 0.0622415367 0.0285112242
0.0174387160 0.0626556757 0.0171835283
0.0788985937 0.0643018799 -0.0094971147
0.0725051440 0.0622415367 0.0285112242
0.0530490370 0.0650516294 -0.0251690300
0.0174387160 0.0626556757 0.0171835283
0.0403023534 0.0059444468 -0.0284299534
0.0830745806 0.0118667232 -0.0209141432
0.1258915681 0.0050173157 -0.0140830820
0.0831607426 -0.0127639531 -0.0222347834
0.3423509915 -0.0007577313 0.0224673031
0.3423509915 -0.0007577313 0.0224673031
0.3382044352 0.0214227450 0.0478811320
0.3032069240 0.0221630162 0.0531150345
0.3356667639 0.0203766281 0.0629601839
-0.2513337086 -0.0664859376 -0.0317805154
0.3341878926 -0.0209685400 0.0704194805
0.1891785627 -0.0299804187 0.0285266361
-0.1115393432 -0.0232292238 -0.0615829739
-0.0748192902 -0.0147524700 -0.0551786680
-0.2452051006 -0.0645110483 -0.0682146314
-0.2013852577 -0.0658183195 -0.0409688636
-0.2434864990 -0.0577929684 -0.0782299937
-0.2426001477 -0.0513432320 -0.0832974611
-0.2901603595 -0.0255555811 -0.0874645181
-0.3131005272 0.0639155894 -0.0279120170
-0.1955467961 0.0457686808 -0.0720896316
-0.1720183413 0.0398716667 -0.0682776025
-0.2903518891 0.0289504969 -0.0845420211
-0.1958924331 0.0255655606 -0.0706917682
-0.2456627260 0.0659381552 -0.0612201616
-0.1977842480 0.0628565150 -0.0582039642
-0.2477815191 0.0652551526 -0.0486256580
-0.0746511552 0.0560792932 -0.0538618762
-0.0378702006 0.0472234349 -0.0483869033
0.0700908852 0.0097378582 0.0563375142
0.3340717966 0.0118715410 0.0721802715
-0.2307528638 0.0603718369 -0.0246890009
0.3340717966 0.0118715410 0.0721802715
0.1889879506 0.0242974080 0.0314369572
-0.0749279773 0.0162629360 -0.0535156277
-0.1117089320 0.0251187943 -0.0589906006
-0.2018431979 0.0646305621 -0.0339743737
-0.2456627260 0.0659381552 -0.0612201616
-0.2439012055 0.0603410531 -0.0718958317
-0.2903518891 0.0289504969 -0.0845420211
-0.2429713088 0.0544762509 -0.0776236023
-0.2513337086 -0.0664859376 -0.0317805154
-0.1957219237 -0.0230107084 -0.0732963621
-0.2901603595 -0.0255555811 -0.0874645181
-0.1717473503 -0.0373260485 -0.0724168165
-0.1952353044 -0.0429461194 -0.0768463533
-0.1973482395 -0.0614352584 -0.0648682701
-0.2452051006 -0.0645110483 -0.0682146314
-0.2473235789 -0.0651937291 -0.0556201479
-0.0375441238 -0.0458240517 -0.0533759885
-0.0742641768 -0.0543008055 -0.0597802944
0.0701920082 -0.0189978674 0.0547965031
0.3341878926 -0.0209685400 0.0704194805
0.3411987335 0.0143966072 0.0298207965
0.3411987335 0.0143966072 0.0298207965
0.3330745515 -0.0060301822 0.0775356835
0.3330745515 -0.0060301822 0.0775356835
0.0690507400 -0.0068079210 0.0619913528
0.1116701855 -0.0004784882 0.0704311005
0.0690108617 0.0045948824 0.0626027379
0.0822249865 0.0166158193 -0.0156972678
0.0819662916 0.0535323214 -0.0281189635
0.0543755886 0.0214143580 -0.0345010933
0.0266418099 0.0303470002 -0.0386820181
0.0542352358 0.0615528978 -0.0323488759
0.1413797277 0.0458195683 0.0577605110
-0.0882794238 0.0544267642 0.0272495495
-0.1248788077 0.0222448018 0.0193483414
-0.0895140077 -0.0039631540 0.0326898432
-0.0895140077 -0.0039631540 0.0326898432
-0.0764126758 0.0616763953 -0.0431862061
-0.1911081549 0.0258014956 0.0084008053
-0.2569359224 -0.0025370778 0.0036769159
-0.2569359224 -0.0025370778 0.0036769159
-0.1963234753 -0.0026560019 -0.0690471997
-0.2438561810 -0.0063124868 -0.0743419002
-0.2217303052 0.0234616501 0.0031229306
-0.3027682171 0.0110217182 -0.0111826544
-0.2217303052 0.0234616501 0.0031229306
-0.2850504151 -0.0318361517 -0.0105254172
-0.2850504151 -0.0318361517 -0.0105254172
-0.2085308004 -0.0154946718 0.0032319549
-0.0411670717 -0.0657136945 -0.0324507973
-0.0079541846 -0.0670434765 -0.0054826981
-0.1173536483 -0.0661998382 -0.0283619853
-0.0460474729 -0.0672865483 -0.0034382921
0.1427226231 -0.0695706559 0.0514996015
0.1141967198 -0.0676899499 0.0145655894
0.0823390883 -0.0529705030 -0.0338295747
0.0546648154 -0.0611420700 -0.0389276668
0.0268502020 -0.0291757310 -0.0418735906
0.0545244750 -0.0210041640 -0.0367754986
0.0823461541 -0.0180494141 -0.0175559338
0.3410040413 -0.0205986147 0.0298390927
0.3410040413 -0.0205986147 0.0298390927
-0.3978567116 -0.0344695429 -0.0711585764
-0.3980957150 0.0337196506 -0.0675023474
0.1596210725 -0.0678159975 0.0198799920
0.1452535314 -0.0371143637 0.0030087325
0.1734618631 0.0517730667 0.0448099147
0.1583472519 0.0277333617 0.0250772941
0.1450050755 0.0338122771 0.0068118434
0.1591643755 0.0626335347 0.0268747549
0.1585552174 -0.0315619036 0.0218978582
0.1738491610 -0.0588359235 0.0388789135
0.1902885189 0.0056410036 0.0851467569
0.1903283971 -0.0057617999 0.0845353718
0.1903283971 -0.0057617999 0.0845353718
0.1903685963 -0.0171649159 0.0839240068
0.4505572506 -0.0084758588 0.0711083195
0.4531908841 -0.0142481824 0.0552352059
0.4542329750 0.0016132777 0.0495444715
0.4515620574 0.0071454912 0.0656301531
0.4505264418 0.0001903808 0.0715726679
0.4531131899 0.0076453181 0.0564088966
0.4505264418 0.0001903808 0.0715726679
0.4516397828 -0.0147479771 0.0644564648
-0.3510616725 -0.0717946940 0.0351135405
-0.3741116296 -0.0583512798 0.0004229113
-0.3758178687 -0.0496157774 -0.0346433180
-0.4230809599 -0.0751475600 0.0460101086
-0.4003025339 -0.0580139175 -0.0118497193
-0.3519547187 0.0532625095 0.0445259257
-0.4002043248 -0.0590096751 -0.0124668166
-0.4229827508 -0.0761433176 0.0453930114
-0.3756214505 -0.0516072927 -0.0358775124
-0.3738170022 -0.0613385527 -0.0014283803
-0.4003539748 0.1325908455 -0.0646099340
-0.4430992959 0.1613847721 -0.0690797000
-0.3894265461 -0.0712492974 -0.0756770175
-0.4419728355 -0.1599488434 -0.0863091064
-0.3994281355 -0.1314995876 -0.0787700512
-0.4422293456 0.1616650947 -0.0742524631
-0.3995217277 0.1328591887 -0.0695577842
-0.3899301218 0.0724268327 -0.0679733218
-0.3988984303 -0.1313293125 -0.0819186805
-0.4412541561 -0.1597175549 -0.0905822591
-0.4551168734 -0.1343420236 -0.0933939752
-0.4708313117 -0.1600754249 -0.0965045745
-0.4220068571 -0.1027105230 -0.0861098110
-0.4316305066 -0.1312140389 -0.0883460351
-0.4647405229 -0.1628455396 -0.0956301993
-0.4316305066 -0.1312140389 -0.0883460351
-0.3985204904 -0.0995825383 -0.0810618709
-0.3654104741 -0.0679510376 -0.0737777067
-0.4220068571 -0.1027105230 -0.0861098110
-0.4123832076 -0.0742070070 -0.0838735870
-0.4563691125 0.1364935780 -0.0770677436
-0.4722642541 0.1623013547 -0.0774147751
-0.4231496172 0.1044602053 -0.0725205327
-0.4331244566 0.1329224887 -0.0708001164
-0.4663439519 0.1649558613 -0.0753473273
-0.4331244566 0.1329224887 -0.0708001164
-0.3999049612 0.1008891160 -0.0662529054
-0.3666854658 0.0688557434 -0.0617056945
-0.4231496172 0.1044602053 -0.0725205327
-0.4131747778 0.0759979220 -0.0742409491
-0.2200218587 -0.0748490892 -0.0102682517
-0.1906539764 -0.0697604526 -0.0008776395
0.0414522626 -0.0733918820 0.0393600245
-0.2214634803 -0.1951971490 -0.0394153602
-0.2432427734 -0.1648535197 -0.0383610383
-0.2570170217 -0.1044230666 -0.0295167153
-0.2432427734 -0.1648535197 -0.0383610383
-0.2294685251 -0.2252839727 -0.0472053614
-0.2156942768 -0.2857144257 -0.0560496845
-0.2214634803 -0.1951971490 -0.0394153602
-0.1996841872 -0.2255407783 -0.0404696820
-0.2272326838 -0.1046798722 -0.0227810358
-0.1894433012 -0.0748498540 -0.0082553551
-0.2490119769 -0.0743362429 -0.0217267140
-0.2272326838 -0.1046798722 -0.0227810358
-0.2054533908 -0.1350235015 -0.0238353577
-0.1836740977 -0.1653671308 -0.0248896795
-0.1676640081 -0.1051934833 -0.0093096770
-0.2054533908 -0.1350235015 -0.0238353577
-0.1993377507 0.2846714060 -0.0223788069
-0.1578982835 0.2537982729 -0.0122693560
-0.0664656303 0.1307134859 0.0156881647
-0.1504657620 0.2537574984 -0.0110213277
-0.0870278713 -0.0757660827 0.0155318741
-0.2083039462 -0.1051870438 -0.0120870487
-0.2494090867 -0.0744642633 -0.0193653225
-0.1906346306 -0.0752339152 -0.0011711808
-0.2083039462 -0.1051870438 -0.0120870487
-0.2259732618 -0.1351401725 -0.0230029166
-0.2436425774 -0.1650933011 -0.0339187845
-0.2670784023 -0.1044173919 -0.0302811905
-0.2259732618 -0.1351401725 -0.0230029166
-0.2613118929 -0.1950464297 -0.0448346524
-0.2789812085 -0.2249995584 -0.0557505203
-0.2849326116 -0.2852906416 -0.0684851853
-0.2789812085 -0.2249995584 -0.0557505203
-0.2730298054 -0.1647084751 -0.0430158554
-0.2670784023 -0.1044173919 -0.0302811905
-0.2613118929 -0.1950464297 -0.0448346524
-0.2436425774 -0.1650933011 -0.0339187845
-0.0883177944 0.0653733769 0.0278366523
-0.1250176436 0.0619265167 0.0214762720
-0.0875363228 0.0692782934 0.0233089739
-0.2447904438 0.1622838524 -0.0163652165
-0.2626728405 0.1931081587 -0.0240222889
-0.2678004307 0.1014045687 -0.0192450592
-0.2741778340 0.1626685169 -0.0254622103
-0.2805552372 0.2239324650 -0.0316793613
-0.2869326405 0.2851964131 -0.0378965124
-0.2805552372 0.2239324650 -0.0316793613
-0.2626728405 0.1931081587 -0.0240222889
-0.2269080470 0.1314595461 -0.0087081442
-0.2678004307 0.1014045687 -0.0192450592
-0.2447904438 0.1622838524 -0.0163652165
-0.2269080470 0.1314595461 -0.0087081442
-0.2090256503 0.1006352398 -0.0010510718
-0.1911432536 0.0698109335 0.0066060006
-0.2499180340 0.0705802624 -0.0115879868
-0.2090256503 0.1006352398 -0.0010510718
-0.2063881118 0.1315761546 -0.0095405812
-0.1683855180 0.1006289306 0.0017262249
-0.1848217057 0.1620100905 -0.0073361826
-0.2063881118 0.1315761546 -0.0095405812
-0.2279545180 0.1011422187 -0.0117449797
-0.2495209242 0.0707082828 -0.0139493783
-0.1899519242 0.0701949947 -0.0004781737
-0.2279545180 0.1011422187 -0.0117449797
-0.2012578933 0.2233912503 -0.0163985901
-0.2228242995 0.1929573144 -0.0186029886
-0.2176940810 0.2847724101 -0.0254609975
-0.2310423933 0.2236478944 -0.0231341924
-0.2443907056 0.1625233786 -0.0208073872
-0.2577390180 0.1013988628 -0.0184805820
-0.2443907056 0.1625233786 -0.0208073872
-0.2228242995 0.1929573144 -0.0186029886
-0.1979339393 -0.2860073075 -0.0494252938
-0.1562814951 -0.2559660223 -0.0385871662
-0.0657013683 -0.1359402480 0.0024055290
-0.1486785301 -0.2559520856 -0.0383511846
-0.1245606540 -0.0685226962 0.0144818021
-0.0878352138 -0.0723735765 0.0204506315
-0.1911176627 0.0625131930 0.0062144497
-0.2205178325 0.0665467295 -0.0026869922
0.0409663140 0.0652677620 0.0467950373
-0.1875755323 0.2538314862 -0.0148243174
-0.1779652243 0.1308805819 0.0052912523
-0.1951783368 0.2538173933 -0.0150602889
-0.2184886264 0.2845163638 -0.0207381028
-0.1853911859 -0.2557503945 -0.0445155681
-0.1756690529 -0.1352803070 -0.0170996782
-0.1928238680 -0.2557094636 -0.0457636065
-0.2156942768 -0.2857144257 -0.0560496845
0.0171388288 -0.0680369729 0.0146874025
0.0722052569 -0.0684511119 0.0260150984
0.0171388288 -0.0680369729 0.0146874025
-0.0079541846 -0.0670434765 -0.0054826981
0.0133817221 -0.0332881063 0.0382036997
-0.0145067428 -0.0451821755 0.0342592864
0.0693260876 -0.0573924410 0.0435246992
0.0134654399 -0.0572343428 0.0369197862
0.1349499226 -0.0290748892 0.0080895520
0.1148435607 -0.0270572079 -0.0031267106
0.0393201589 -0.0217697361 -0.0234875223
0.0822329949 -0.0226390592 -0.0322032241
0.1653981240 -0.0591430933 0.0547191881
0.1416531434 -0.0321762432 0.0535784075
0.1199737713 -0.0590170458 0.0494047856
0.1427226231 -0.0695706559 0.0514996015
0.1163048489 -0.0260404768 0.0419939697
0.0709944845 -0.0210221264 0.0499510155
-0.0511903241 -0.0533044134 0.0276485003
-0.1246412044 -0.0456026527 0.0157108415
-0.0328903924 -0.0372701762 0.0315958501
-0.0512740419 -0.0293581769 0.0289324138
-0.1247081813 -0.0264459179 0.0167380600
-0.0512740419 -0.0293581769 0.0289324138
-0.1430164835 -0.0400854042 0.0129190576
-0.1246412044 -0.0456026527 0.0157108415
-0.0748192902 -0.0147524700 -0.0551786680
-0.0771418817 -0.0652740856 -0.0430008748
-0.1133166301 -0.0618167771 -0.0522613918
-0.2431844513 -0.0143154392 -0.0786054445
-0.2907395340 -0.0115863994 -0.0835577503
-0.3156567071 -0.0387372435 -0.0160483032
-0.3758738977 -0.0336514117 -0.0337873443
-0.1173536483 -0.0661998382 -0.0283619853
-0.0771418817 -0.0652740856 -0.0430008748
-0.1202514633 0.0634626221 -0.0068613546
-0.0867165122 0.0622365937 0.0181946400
-0.2204794619 0.0556001168 -0.0032740950
-0.3904185912 -0.0026904408 -0.0192479443
-0.3159039701 0.0317328846 -0.0122694545
-0.2908317979 0.0146401355 -0.0821515348
-0.2432949796 0.0171564687 -0.0769179630
-0.2563287568 0.0079328962 0.0004041811
-0.2563287568 0.0079328962 0.0004041811
0.0530490370 0.0650516294 -0.0251690300
-0.0755855646 -0.0122600401 -0.0505339005
-0.1122329212 0.0071412709 -0.0564584107
-0.0756750789 0.0132826934 -0.0491643624
-0.0390724764 0.0066524318 -0.0425550630
-0.0889065380 0.0062791972 0.0294044897
-0.0889065380 0.0062791972 0.0294044897
0.1032350829 0.0630646388 0.0151709027
0.1280030044 0.0618189152 0.0400269983
0.1449014348 0.0635735714 0.0084076572
0.1734273162 0.0616934981 0.0453418526
0.1280030044 0.0618189152 0.0400269983
0.0820735985 0.0227443673 -0.0297698672
0.0391714410 0.0206486306 -0.0212132187
0.1146633966 0.0242557945 -0.0003756033
0.1347593326 0.0252029400 0.0109995600
0.0130872897 0.0507508511 0.0427101577
-0.0147962968 0.0373745644 0.0386859292
0.0690213199 0.0296115838 0.0481898527
0.0131707183 0.0268049308 0.0414257767
0.0223190982 0.0642285273 -0.0118287085
0.0788985937 0.0643018799 -0.0094971147
0.0223190982 0.0642285273 -0.0118287085
-0.0084108407 0.0634054252 0.0015116130
0.3423908729 -0.0121605344 0.0218558732
0.3093009208 -0.0068098729 0.0158785592
-0.2971586132 -0.0658247703 -0.0471065117
-0.2303211471 -0.0627793131 -0.0312919846
0.2432220026 -0.0310700905 0.0353204983
0.2473327359 -0.0217541389 0.0111442349
0.2389666206 -0.0283318802 0.0607521042
0.0701920082 -0.0189978674 0.0547965031
0.0795249695 -0.0235244737 -0.0009327150
-0.1110527238 -0.0431646348 -0.0651329651
-0.1296560600 -0.0374353062 -0.0665601224
-0.0376126179 -0.0262111273 -0.0523243534
-0.1115393432 -0.0232292238 -0.0615829739
-0.2913433601 -0.0608687582 -0.0815763550
-0.2426001477 -0.0513432320 -0.0832974611
-0.2900626753 -0.0426479628 -0.0886065435
-0.1952353044 -0.0429461194 -0.0768463533
-0.2900626753 -0.0426479628 -0.0886065435
-0.3137939390 -0.0383003282 -0.0912610846
-0.3655660844 -0.0353528730 -0.0952294277
-0.3897398624 -0.0127457665 -0.0236216394
-0.3109027023 -0.0659726488 -0.0452518094
-0.1954473327 0.0615062253 -0.0094117853
-0.2286344013 0.0610545158 -0.0372832607
-0.3658263961 0.0389943894 -0.0912430302
-0.0378702006 0.0472234349 -0.0483869033
-0.1113632949 0.0453219144 -0.0603884640
-0.0194453158 0.0329888872 -0.0461752243
-0.0378013856 0.0276101979 -0.0494385182
0.0690108617 0.0045948824 0.0626027379
0.1121902581 0.0077944014 0.0676041812
0.1889879506 0.0242974080 0.0314369572
0.3356667639 0.0203766281 0.0629601839
0.2995456375 0.0088823270 0.0744846919
-0.2660583949 0.0592374485 -0.0399662164
-0.2197108016 0.0631539019 -0.0076057743
0.2471920524 0.0183840772 0.0132966961
0.2387988417 0.0195602676 0.0633203540
0.0700908852 0.0097378582 0.0563375142
0.0793712263 0.0202622965 0.0014148260
-0.1117089320 0.0251187943 -0.0589906006
-0.0378013856 0.0276101979 -0.0494385182
-0.1299265907 0.0396482835 -0.0624270187
-0.1113632949 0.0453219144 -0.0603884640
-0.2429713088 0.0544762509 -0.0776236023
-0.2917796835 0.0634226933 -0.0749120291
-0.3140751286 0.0418626130 -0.0869628945
-0.2903738553 0.0460671589 -0.0838497971
-0.1955467961 0.0457686808 -0.0720896316
-0.2903738553 0.0460671589 -0.0838497971
-0.3658263961 0.0389943894 -0.0912430302
-0.3898147526 0.0086915933 -0.0224721389
-0.2282026657 -0.0620966320 -0.0438865129
-0.1950025232 -0.0652937927 -0.0162102537
-0.3655660844 -0.0353528730 -0.0952294277
-0.0376126179 -0.0262111273 -0.0523243534
-0.0192183444 -0.0317792126 -0.0496480180
-0.1110527238 -0.0431646348 -0.0651329651
-0.0375441238 -0.0458240517 -0.0533759885
0.1122806979 -0.0179762648 0.0662222905
0.0690781596 -0.0145621650 0.0615755396
0.1891785627 -0.0299804187 0.0285266361
0.2996420560 -0.0184843262 0.0730171936
0.3358388857 -0.0284278189 0.0603434640
0.2432220026 -0.0310700905 0.0353204983
0.2430250164 0.0250321740 0.0383283717
0.2430250164 0.0250321740 0.0383283717
0.3072417445 0.0196960641 0.0290058148
0.3397555676 0.0219225718 0.0386598755
0.3330361809 0.0049164305 0.0781227863
0.2990470149 -0.0000685346 0.0771623979
0.2483585780 -0.0011032986 0.0057104542
0.0263914163 -0.0017345504 0.0541629902
0.0690781596 -0.0145621650 0.0615755396
0.1430790557 0.0199819691 0.0150730616
0.1227943660 0.0188599192 0.0048162852
0.0380547453 0.0150379541 -0.0147474617
0.1227943660 0.0188599192 0.0048162852
0.0725170944 0.0198800739 0.0422196547
0.1645349923 0.0532865149 0.0607847307
0.1422659451 0.0608788785 0.0584940960
0.1191840313 0.0324307592 0.0543451056
0.1414530786 0.0248383956 0.0566357403
0.0708775441 0.0122742150 0.0517365861
0.1161485153 0.0184305736 0.0443780908
-0.1249457846 0.0414015366 0.0203755599
-0.0515460861 0.0482952571 0.0330963207
-0.1249457846 0.0414015366 0.0203755599
-0.1432789650 0.0348889228 0.0169385651
-0.0514626576 0.0243493368 0.0318119396
-0.1248788077 0.0222448018 0.0193483414
-0.0514626576 0.0243493368 0.0318119396
-0.0331294772 0.0308619506 0.0352489344
-0.0749279773 0.0162629360 -0.0535156277
-0.0746511552 0.0560792932 -0.0538618762
-0.1122784627 0.0579270840 -0.0545248215
-0.3039930831 -0.0068393565 -0.0044715090
-0.2569054968 -0.0112030691 0.0032125424
-0.2098483361 -0.0069007905 0.0113609672
-0.2569630210 0.0052168535 0.0040927492
-0.3761199129 0.0365901537 -0.0300207856
-0.0775988746 0.0651751269 -0.0360063602
-0.1178112722 0.0642490479 -0.0213674730
-0.0862592426 -0.0682123013 0.0112006422
-0.1197938488 -0.0669862651 -0.0138557327
-0.2200733362 -0.0602532926 -0.0094855278
-0.2527021309 -0.0398820155 -0.0055202971
-0.3026749224 -0.0156611733 -0.0126131199
-0.2379783541 -0.0317529009 -0.0026028798
-0.1909062931 -0.0316696502 0.0053196576
-0.2562544916 -0.0132765281 -0.0007327208
-0.2562544916 -0.0132765281 -0.0007327208
0.0535057120 -0.0653972701 -0.0321636095
-0.0886844328 -0.0137413444 0.0274285224
-0.0886844328 -0.0137413444 0.0274285224
0.1036917389 -0.0673842630 0.0081765916
0.1284596714 -0.0686303029 0.0330325955
0.1738840242 -0.0687563505 0.0383469980
0.1453581209 -0.0668756445 0.0014129860
0.1284596714 -0.0686303029 0.0330325955
0.0726839349 -0.0275558814 0.0396766268
0.1229380585 -0.0221906791 0.0026153487
0.0381667907 -0.0168907787 -0.0164592301
0.1229380585 -0.0221906791 0.0026153487
0.1432340107 -0.0242613117 0.0127009900
0.3086274457 -0.0167303145 0.0195644540
0.3423908729 -0.0121605344 0.0218558732
3 129 109 132
3 129 132 146
3 129 146 83
3 129 83 85
3 26 798 85
3 129 798 26
3 129 26 144
3 129 144 10
3 7 128 11
3 7 11 69
3 7 69 43
3 7 43 62
3 123 799 62
3 7 799 123
3 7 123 10
3 7 10 144
3 179 800 23
3 170 800 179
3 23 801 179
3 22 801 23
3 13 802 86
3 477 802 13
3 477 803 73
3 13 803 477
3 8 804 73
3 180 804 8
3 180 805 86
3 8 805 180
3 478 806 107
3 22 806 478
3 107 807 478
3 170 807 107
3 37 108 80
3 125 808 126
3 45 808 125
3 14 126 37
3 14 37 80
3 45 809 126
3 151 809 45
3 37 810 151
3 126 810 37
3 126 14 125
3 108 811 151
3 37 811 108
3 160 812 74
3 118 812 160
3 35 813 90
3 118 813 35
3 35 814 118
3 46 814 35
3 25 815 118
3 98 815 25
3 98 816 118
3 84 816 98
3 46 817 118
3 25 817 46
3 74 818 84
3 118 818 74
3 90 819 160
3 118 819 90
3 42 136 130
3 78 820 20
3 136 820 78
3 181 479 20
3 182 479 181
3 182 480 78
3 181 480 182
3 183 481 20
3 181 481 183
3 183 482 44
3 20 482 183
3 42 483 184
3 130 483 42
3 184 484 140
3 130 484 184
3 186 821 140
3 185 821 186
3 186 822 85
3 140 822 186
3 187 823 185
3 42 823 187
3 187 824 85
3 185 824 187
3 189 485 140
3 97 485 189
3 189 486 188
3 140 486 189
3 190 487 188
3 130 487 190
3 188 488 190
3 140 488 188
3 191 489 66
3 128 489 191
3 66 490 191
3 178 490 66
3 193 491 192
3 92 491 193
3 193 492 178
3 192 492 193
3 194 493 128
3 92 493 194
3 194 494 192
3 128 494 194
3 113 825 4
3 57 825 113
3 195 495 4
3 196 495 195
3 196 496 113
3 195 496 196
3 197 497 4
3 195 497 197
3 197 498 31
3 4 498 197
3 199 499 92
3 175 499 199
3 199 500 198
3 92 500 199
3 200 501 198
3 178 501 200
3 198 502 200
3 92 502 198
3 113 178 57
3 66 57 178
3 113 503 178
3 31 503 113
3 202 504 175
3 31 504 202
3 202 505 201
3 175 505 202
3 203 506 201
3 178 506 203
3 201 507 203
3 175 507 201
3 66 508 57
3 204 508 66
3 204 509 128
3 66 509 204
3 206 510 128
3 205 510 206
3 206 511 27
3 128 511 206
3 207 512 205
3 57 512 207
3 207 513 27
3 205 513 207
3 208 514 27
3 209 514 208
3 209 515 57
3 208 515 209
3 210 516 27
3 208 516 210
3 210 517 4
3 27 517 210
3 212 826 211
3 85 826 212
3 212 827 42
3 211 827 212
3 213 828 138
3 85 828 213
3 213 829 211
3 138 829 213
3 214 518 136
3 138 518 214
3 42 519 136
3 214 519 42
3 78 520 130
3 44 520 78
3 216 521 97
3 44 521 216
3 216 522 215
3 97 522 216
3 217 523 215
3 130 523 217
3 215 524 217
3 97 524 215
3 218 525 138
3 219 525 218
3 219 526 136
3 218 526 219
3 220 527 138
3 218 527 220
3 220 528 20
3 138 528 220
3 78 130 136
3 38 95 17
3 529 830 165
3 103 830 529
3 165 831 529
3 17 831 165
3 221 530 103
3 165 530 221
3 103 531 221
3 79 531 103
3 38 532 95
3 222 532 38
3 222 533 32
3 38 533 222
3 224 534 18
3 32 534 224
3 223 535 18
3 224 535 223
3 225 536 223
3 95 536 225
3 223 537 225
3 18 537 223
3 102 538 116
3 226 538 102
3 226 539 34
3 102 539 226
3 228 540 173
3 34 540 228
3 227 541 173
3 228 541 227
3 229 542 227
3 116 542 229
3 227 543 229
3 173 543 227
3 133 5 102
3 146 832 34
3 173 832 146
3 69 18 32
3 32 544 79
3 230 544 32
3 230 545 165
3 32 545 230
3 34 546 115
3 231 546 34
3 231 547 5
3 34 547 231
3 5 833 102
3 548 833 5
3 548 834 34
3 5 834 548
3 165 835 38
3 549 835 165
3 549 836 32
3 165 836 549
3 69 837 18
3 103 837 69
3 146 15 173
3 133 102 116
3 550 838 5
3 15 838 550
3 5 839 550
3 133 839 5
3 232 551 15
3 5 551 232
3 15 552 232
3 115 552 15
3 553 840 133
3 173 840 553
3 116 841 133
3 553 841 116
3 554 842 233
3 173 842 554
3 554 843 234
3 233 843 554
3 555 844 234
3 133 844 555
3 555 845 233
3 234 845 555
3 556 846 235
3 233 846 556
3 556 847 15
3 235 847 556
3 557 848 173
3 233 848 557
3 557 849 235
3 173 849 557
3 558 850 17
3 18 850 558
3 95 851 17
3 558 851 95
3 559 852 236
3 18 852 559
3 559 853 237
3 236 853 559
3 560 854 237
3 17 854 560
3 560 855 236
3 237 855 560
3 561 856 238
3 236 856 561
3 561 857 103
3 238 857 561
3 562 858 18
3 236 858 562
3 562 859 238
3 18 859 562
3 38 17 165
3 1 155 2
3 1 2 168
3 563 860 52
3 100 860 563
3 163 861 52
3 563 861 163
3 100 163 19
3 1 862 63
3 82 862 1
3 106 30 148
3 241 564 240
3 148 564 241
3 241 565 239
3 240 565 241
3 242 566 30
3 148 566 242
3 242 567 240
3 30 567 242
3 239 568 244
3 243 568 239
3 244 569 100
3 243 569 244
3 245 570 243
3 30 570 245
3 243 571 245
3 239 571 243
3 249 863 247
3 246 863 249
3 249 864 248
3 247 864 249
3 250 865 248
3 100 865 250
3 250 866 247
3 248 866 250
3 252 867 251
3 247 867 252
3 252 868 148
3 251 868 252
3 253 869 246
3 247 869 253
3 253 870 251
3 246 870 253
3 256 871 255
3 254 871 256
3 256 872 155
3 255 872 256
3 257 873 255
3 100 873 257
3 257 874 254
3 255 874 257
3 259 875 258
3 254 875 259
3 259 876 246
3 258 876 259
3 260 877 258
3 155 877 260
3 260 878 254
3 258 878 260
3 101 879 105
3 262 879 101
3 262 880 261
3 101 880 262
3 263 881 261
3 67 881 263
3 261 882 263
3 101 882 261
3 267 572 266
3 265 572 267
3 267 573 154
3 266 573 267
3 268 574 266
3 67 574 268
3 268 575 265
3 266 575 268
3 270 576 269
3 265 576 270
3 270 577 264
3 269 577 270
3 271 578 269
3 154 578 271
3 271 579 265
3 269 579 271
3 274 580 272
3 264 580 274
3 274 581 273
3 272 581 274
3 275 582 273
3 105 582 275
3 275 583 272
3 273 583 275
3 277 584 276
3 272 584 277
3 277 585 154
3 276 585 277
3 278 586 264
3 272 586 278
3 278 587 276
3 264 587 278
3 172 154 53
3 172 53 72
3 105 47 101
3 67 28 141
3 67 141 153
3 63 883 1
3 52 883 63
3 282 588 281
3 280 588 282
3 282 589 52
3 281 589 282
3 283 590 281
3 1 590 283
3 283 591 280
3 281 591 283
3 285 592 284
3 280 592 285
3 285 593 279
3 284 593 285
3 286 594 284
3 52 594 286
3 286 595 280
3 284 595 286
3 289 596 287
3 279 596 289
3 289 597 288
3 287 597 289
3 290 598 288
3 106 598 290
3 290 599 287
3 288 599 290
3 292 600 291
3 287 600 292
3 292 601 52
3 291 601 292
3 293 602 279
3 287 602 293
3 293 603 291
3 279 603 293
3 297 884 296
3 295 884 297
3 297 885 100
3 296 885 297
3 298 886 296
3 52 886 298
3 298 887 295
3 296 887 298
3 300 888 299
3 295 888 300
3 300 889 294
3 299 889 300
3 301 890 299
3 100 890 301
3 301 891 295
3 299 891 301
3 304 892 302
3 294 892 304
3 304 893 303
3 302 893 304
3 305 894 303
3 30 894 305
3 305 895 302
3 303 895 305
3 307 896 306
3 302 896 307
3 307 897 100
3 306 897 307
3 308 898 294
3 302 898 308
3 308 899 306
3 294 899 308
3 310 604 309
3 311 604 310
3 311 605 166
3 310 605 311
3 312 606 310
3 172 606 312
3 309 607 310
3 312 607 309
3 314 608 166
3 313 608 314
3 314 609 105
3 166 609 314
3 315 610 313
3 309 610 315
3 315 611 105
3 313 611 315
3 318 612 316
3 47 612 318
3 317 613 316
3 318 613 317
3 319 614 317
3 51 614 319
3 317 615 319
3 316 615 317
3 321 616 320
3 47 616 321
3 321 617 316
3 320 617 321
3 322 618 320
3 166 618 322
3 322 619 47
3 320 619 322
3 620 900 51
3 50 900 620
3 131 901 51
3 620 901 131
3 50 902 51
3 67 902 50
3 326 903 323
3 325 903 326
3 326 904 324
3 323 904 326
3 327 905 325
3 172 905 327
3 327 906 324
3 325 906 327
3 329 907 328
3 324 907 329
3 329 908 166
3 328 908 329
3 330 909 324
3 328 909 330
3 330 910 323
3 324 910 330
3 333 911 332
3 331 911 333
3 333 912 172
3 332 912 333
3 334 913 332
3 323 913 334
3 334 914 331
3 332 914 334
3 336 915 335
3 331 915 336
3 336 916 51
3 335 916 336
3 337 917 335
3 172 917 337
3 337 918 331
3 335 918 337
3 341 919 340
3 339 919 341
3 341 920 154
3 340 920 341
3 342 921 340
3 338 921 342
3 342 922 339
3 340 922 342
3 344 923 343
3 339 923 344
3 344 924 172
3 343 924 344
3 345 925 343
3 154 925 345
3 345 926 339
3 343 926 345
3 348 927 338
3 347 927 348
3 348 928 346
3 338 928 348
3 349 929 347
3 105 929 349
3 349 930 346
3 347 930 349
3 351 931 350
3 346 931 351
3 351 932 172
3 350 932 351
3 352 933 346
3 350 933 352
3 352 934 338
3 346 934 352
3 355 621 354
3 106 621 355
3 355 622 30
3 354 622 355
3 356 623 354
3 353 623 356
3 356 624 106
3 354 624 356
3 357 625 353
3 358 625 357
3 358 626 52
3 357 626 358
3 357 627 359
3 353 627 357
3 359 628 106
3 353 628 359
3 145 935 106
3 361 935 145
3 361 936 360
3 145 936 361
3 362 937 360
3 1 937 362
3 360 938 362
3 145 938 360
3 163 939 629
3 52 939 163
3 629 940 63
3 52 940 629
3 154 67 153
3 154 153 53
3 51 172 72
3 131 941 630
3 51 941 131
3 630 942 72
3 51 942 630
3 67 943 28
3 50 943 67
3 47 105 166
3 363 944 101
3 364 944 363
3 364 945 51
3 363 945 364
3 365 946 101
3 363 946 365
3 101 947 365
3 47 947 101
3 369 631 366
3 368 631 369
3 369 632 367
3 366 632 369
3 370 633 368
3 51 633 370
3 370 634 367
3 368 634 370
3 372 635 371
3 367 635 372
3 372 636 101
3 371 636 372
3 373 637 367
3 371 637 373
3 373 638 366
3 367 638 373
3 376 639 375
3 374 639 376
3 376 640 51
3 375 640 376
3 377 641 375
3 366 641 377
3 377 642 374
3 375 642 377
3 379 643 378
3 374 643 379
3 379 644 67
3 378 644 379
3 380 645 378
3 51 645 380
3 380 646 374
3 378 646 380
3 381 948 145
3 382 948 381
3 382 949 155
3 381 949 382
3 383 950 145
3 381 950 383
3 145 951 383
3 148 951 145
3 387 647 384
3 386 647 387
3 387 648 385
3 384 648 387
3 388 649 386
3 155 649 388
3 388 650 385
3 386 650 388
3 390 651 389
3 385 651 390
3 390 652 145
3 389 652 390
3 391 653 385
3 389 653 391
3 391 654 384
3 385 654 391
3 394 655 393
3 392 655 394
3 394 656 155
3 393 656 394
3 395 657 393
3 384 657 395
3 395 658 392
3 393 658 395
3 397 659 396
3 392 659 397
3 397 660 1
3 396 660 397
3 398 661 396
3 155 661 398
3 398 662 392
3 396 662 398
3 155 100 19
3 155 19 2
3 148 145 106
3 82 1 168
3 82 168 152
3 160 663 90
3 41 663 160
3 147 664 41
3 399 664 147
3 399 665 90
3 147 665 399
3 151 99 108
3 61 110 29
3 61 29 68
3 666 952 400
3 168 952 666
3 666 953 152
3 400 953 666
3 667 954 168
3 400 954 667
3 667 955 12
3 168 955 667
3 402 668 401
3 94 668 402
3 402 669 12
3 401 669 402
3 403 670 401
3 152 670 403
3 403 671 94
3 401 671 403
3 176 672 152
3 404 672 176
3 404 673 61
3 176 673 404
3 674 956 61
3 405 956 674
3 674 957 63
3 61 957 674
3 675 958 405
3 152 958 675
3 675 959 63
3 405 959 675
3 676 960 139
3 110 960 676
3 406 961 139
3 676 961 406
3 677 962 406
3 21 962 677
3 406 963 677
3 139 963 406
3 107 964 170
3 678 964 107
3 678 965 176
3 107 965 678
3 176 966 407
3 152 966 176
3 407 967 170
3 152 967 407
3 22 23 94
3 22 94 139
3 99 968 29
3 408 968 99
3 408 969 68
3 99 969 408
3 410 970 409
3 63 970 410
3 410 971 163
3 409 971 410
3 63 972 411
3 61 972 63
3 411 973 409
3 61 973 411
3 679 974 412
3 39 974 679
3 679 975 61
3 412 975 679
3 39 976 680
3 163 976 39
3 680 977 412
3 163 977 680
3 150 978 6
3 21 978 150
3 152 63 82
3 413 979 16
3 12 979 413
3 142 980 16
3 413 980 142
3 161 681 142
3 12 681 161
3 163 682 44
3 39 682 163
3 683 981 171
3 6 981 683
3 33 982 171
3 683 982 33
3 140 983 49
3 97 983 140
3 83 75 111
3 85 984 26
3 140 984 85
3 26 140 49
3 146 132 24
3 146 24 15
3 111 75 19
3 111 19 20
3 75 83 146
3 75 146 34
3 16 985 93
3 414 985 16
3 414 986 12
3 16 986 414
3 53 987 157
3 415 987 53
3 415 988 153
3 53 988 415
3 175 31 72
3 31 989 72
3 131 989 31
3 87 114 96
3 89 990 96
3 87 990 89
3 7 0 121
3 11 119 65
3 27 991 4
3 121 991 27
3 114 87 7
3 114 7 26
3 36 992 684
3 76 992 36
3 684 993 70
3 76 993 684
3 89 994 0
3 48 994 89
3 64 995 48
3 0 995 64
3 167 996 81
3 177 996 167
3 164 55 64
3 417 685 416
3 153 685 417
3 417 686 157
3 416 686 417
3 418 687 177
3 153 687 418
3 418 688 416
3 177 688 418
3 419 997 6
3 150 997 419
3 6 998 419
3 70 998 6
3 420 999 143
3 70 999 420
3 150 1000 143
3 420 1000 150
3 48 1001 64
3 135 1001 48
3 164 1002 135
3 64 1002 164
3 8 1003 141
3 81 1003 8
3 127 91 13
3 689 1004 421
3 141 1004 689
3 689 1005 8
3 421 1005 689
3 690 1006 421
3 86 1006 690
3 690 1007 141
3 421 1007 690
3 422 1008 112
3 691 1008 422
3 691 1009 134
3 422 1009 691
3 422 1010 692
3 112 1010 422
3 692 1011 91
3 112 1011 692
3 127 693 423
3 141 693 127
3 423 694 50
3 141 694 423
3 695 1012 50
3 424 1012 695
3 695 1013 55
3 50 1013 695
3 696 1014 424
3 127 1014 696
3 696 1015 55
3 424 1015 696
3 426 697 425
3 141 697 426
3 426 698 153
3 425 698 426
3 427 699 425
3 81 699 427
3 427 700 141
3 425 700 427
3 701 1016 428
3 177 1016 701
3 701 1017 81
3 428 1017 701
3 702 1018 177
3 428 1018 702
3 702 1019 153
3 177 1019 702
3 91 55 164
3 91 164 162
3 150 703 429
3 143 703 150
3 429 704 169
3 143 704 429
3 120 705 169
3 430 705 120
3 430 706 150
3 120 706 430
3 45 125 122
3 46 707 54
3 35 707 46
3 708 1020 159
3 35 1020 708
3 54 1021 159
3 708 1021 54
3 169 9 137
3 169 137 120
3 25 709 98
3 56 709 25
3 56 710 431
3 88 710 56
3 431 711 98
3 88 711 431
3 115 1022 34
3 712 1022 115
3 712 1023 2
3 115 1023 712
3 32 79 77
3 41 1024 147
3 58 1024 41
3 147 1025 159
3 156 1025 147
3 80 1026 41
3 108 1026 80
3 74 713 160
3 80 713 74
3 104 714 29
3 156 714 104
3 58 108 99
3 120 137 156
3 68 1027 149
3 99 1027 68
3 150 1028 21
3 29 1028 150
3 715 1029 142
3 432 1029 715
3 6 1030 142
3 715 1030 6
3 716 1031 432
3 21 1031 716
3 716 1032 6
3 432 1032 716
3 433 717 16
3 24 717 433
3 16 718 433
3 93 718 16
3 40 1033 24
3 719 1033 40
3 719 1034 142
3 40 1034 719
3 720 1035 434
3 40 1035 720
3 720 1036 142
3 434 1036 720
3 721 1037 40
3 434 1037 721
3 171 1038 40
3 721 1038 171
3 171 1039 129
3 40 1039 171
3 132 109 40
3 10 33 171
3 26 1040 114
3 174 1040 26
3 75 1041 19
3 34 1041 75
3 79 722 72
3 65 722 79
3 157 1042 53
3 435 1042 157
3 435 1043 79
3 157 1043 435
3 87 89 0
3 10 123 76
3 43 77 124
3 62 1044 123
3 124 1044 62
3 11 128 92
3 437 723 117
3 436 723 437
3 70 724 117
3 437 724 70
3 438 725 436
3 76 725 438
3 438 726 70
3 436 726 438
3 439 727 3
3 77 727 439
3 117 728 3
3 439 728 117
3 79 729 77
3 157 729 79
3 730 1045 440
3 167 1045 730
3 730 1046 117
3 440 1046 730
3 167 1047 731
3 134 1047 167
3 731 1048 440
3 134 1048 731
3 134 91 162
3 73 13 91
3 732 1049 45
3 135 1049 732
3 122 1050 45
3 732 1050 122
3 169 59 158
3 60 162 122
3 60 1051 162
3 158 1051 60
3 733 1052 88
3 98 1052 733
3 88 1053 733
3 14 1053 88
3 88 60 125
3 54 9 158
3 72 1054 79
3 734 1054 72
3 734 1055 53
3 72 1055 734
3 56 1056 158
3 54 1056 56
3 14 1057 125
3 88 1057 14
3 84 735 14
3 98 735 84
3 59 736 158
3 162 736 59
3 60 122 125
3 169 158 9
3 164 1058 122
3 135 1058 164
3 112 73 91
3 143 1059 162
3 134 1059 143
3 737 1060 441
3 70 1060 737
3 737 1061 134
3 441 1061 737
3 70 1062 738
3 117 1062 70
3 738 1063 441
3 117 1063 738
3 3 739 157
3 442 739 3
3 442 740 77
3 3 740 442
3 741 1064 124
3 117 1064 741
3 124 1065 741
3 77 1065 124
3 76 1066 742
3 124 1066 76
3 742 1067 443
3 124 1067 742
3 743 1068 443
3 117 1068 743
3 743 1069 124
3 443 1069 743
3 11 92 119
3 76 1070 124
3 123 1070 76
3 62 43 124
3 10 76 36
3 7 1071 0
3 87 1071 7
3 79 103 65
3 444 1072 93
3 115 1072 444
3 93 1073 444
3 2 1073 93
3 19 744 2
3 34 744 19
3 114 174 96
3 129 10 171
3 132 40 24
3 109 1074 40
3 129 1074 109
3 446 745 445
3 6 745 446
3 446 746 171
3 445 746 446
3 6 747 447
3 142 747 6
3 447 748 445
3 142 748 447
3 142 749 448
3 16 749 142
3 448 750 24
3 16 750 448
3 115 751 93
3 24 751 115
3 752 1075 21
3 449 1075 752
3 161 1076 21
3 752 1076 161
3 753 1077 449
3 142 1077 753
3 753 1078 161
3 449 1078 753
3 110 21 29
3 99 1079 754
3 151 1079 99
3 754 1080 149
3 151 1080 754
3 104 120 156
3 29 58 99
3 58 1081 156
3 29 1081 58
3 41 1082 80
3 755 1082 41
3 755 1083 160
3 41 1083 755
3 58 41 108
3 137 159 156
3 156 1084 58
3 147 1084 156
3 115 15 24
3 158 1085 56
3 60 1085 158
3 88 1086 60
3 56 1086 88
3 46 756 25
3 54 756 46
3 54 1087 757
3 56 1087 54
3 757 1088 25
3 56 1088 757
3 758 1089 14
3 84 1089 758
3 80 1090 14
3 758 1090 80
3 74 759 80
3 84 759 74
3 9 54 159
3 137 1091 159
3 9 1091 137
3 149 1092 135
3 760 1092 149
3 760 1093 151
3 149 1093 760
3 151 761 450
3 45 761 151
3 450 762 135
3 45 762 450
3 169 763 59
3 143 763 169
3 162 1094 452
3 59 1094 162
3 452 1095 451
3 59 1095 452
3 453 1096 451
3 143 1096 453
3 453 1097 59
3 451 1097 453
3 112 764 81
3 454 764 112
3 454 765 134
3 112 765 454
3 167 766 134
3 455 766 167
3 455 767 81
3 167 767 455
3 127 1098 91
3 55 1098 127
3 13 1099 768
3 86 1099 13
3 768 1100 141
3 86 1100 768
3 141 1101 456
3 127 1101 141
3 456 1102 13
3 127 1102 456
3 8 73 112
3 8 112 81
3 457 1103 122
3 164 1103 457
3 122 1104 457
3 162 1104 122
3 769 1105 458
3 131 1105 769
3 769 1106 50
3 458 1106 769
3 770 1107 131
3 458 1107 770
3 64 1108 131
3 770 1108 64
3 460 1109 459
3 55 1109 460
3 460 1110 64
3 459 1110 460
3 461 1111 55
3 459 1111 461
3 50 1112 55
3 461 1112 50
3 71 771 48
3 149 771 71
3 135 772 149
3 48 772 135
3 143 1113 134
3 70 1113 143
3 141 28 50
3 177 773 3
3 167 773 177
3 462 1114 117
3 167 1114 462
3 3 1115 117
3 462 1115 3
3 131 774 64
3 31 774 131
3 89 1116 775
3 96 1116 89
3 775 1117 71
3 96 1117 775
3 48 1118 71
3 776 1118 48
3 776 1119 89
3 48 1119 776
3 70 777 463
3 6 777 70
3 463 778 33
3 6 778 463
3 70 33 36
3 4 121 0
3 464 779 4
3 64 779 464
3 4 780 464
3 0 780 4
3 31 781 64
3 4 781 31
3 92 175 119
3 7 1120 128
3 121 1120 7
3 128 121 27
3 10 36 33
3 43 69 32
3 43 32 77
3 65 119 175
3 65 175 72
3 11 65 103
3 11 103 69
3 465 1121 3
3 177 1121 465
3 3 1122 465
3 157 1122 3
3 466 1123 2
3 168 1123 466
3 2 1124 466
3 93 1124 2
3 20 19 44
3 44 1125 163
3 19 1125 44
3 26 49 174
3 85 83 111
3 85 111 138
3 138 111 20
3 174 49 97
3 97 782 174
3 44 782 97
3 467 1126 44
3 783 1126 467
3 783 1127 174
3 467 1127 783
3 784 1128 44
3 467 1128 784
3 784 1129 39
3 44 1129 784
3 174 1130 96
3 39 1130 174
3 71 1131 39
3 96 1131 71
3 161 1132 12
3 94 1132 161
3 68 39 61
3 469 785 12
3 468 785 469
3 469 786 168
3 12 786 469
3 470 787 468
3 93 787 470
3 470 788 168
3 468 788 470
3 39 1133 71
3 68 1133 39
3 149 1134 68
3 71 1134 149
3 23 1135 94
3 152 1135 23
3 176 107 110
3 789 1136 471
3 152 1136 789
3 789 1137 170
3 471 1137 789
3 790 1138 471
3 23 1138 790
3 790 1139 152
3 471 1139 790
3 22 139 110
3 22 110 107
3 176 1140 61
3 110 1140 176
3 139 791 472
3 94 791 139
3 472 792 161
3 94 792 472
3 161 793 473
3 21 793 161
3 473 794 139
3 21 794 473
3 475 1141 474
3 104 1141 475
3 475 1142 150
3 474 1142 475
3 476 1143 104
3 474 1143 476
3 29 1144 104
3 476 1144 29
3 120 795 150
3 104 795 120
3 90 796 35
3 147 796 90
3 147 1145 797
3 159 1145 147
3 797 1146 35
3 159 1146 797
3 144 26 7