OFF

75 146 0
0.470154 0.025460 0.040156
0.491750 0.018941 0.029600
0.491835 0.025106 0.019111
0.440791 0.029084 0.044466
0.470730 0.039253 -0.039494
0.411779 0.040503 0.013405
0.406029 0.027340 0.047555
0.403326 0.009740 0.059696
0.491702 0.006273 0.040061
0.491953 -0.020240 0.029924
0.441974 0.015890 -0.056041
0.470239 0.036331 0.027287
0.412050 0.043046 -0.012283
0.403451 -0.013736 0.059433
0.367691 -0.010942 0.054266
0.471222 0.012379 -0.050010
0.408899 0.035474 0.030241
0.470109 0.010251 0.051440
0.390365 0.032579 0.014266
0.388005 0.027036 0.029831
0.412560 -0.039201 -0.040305
0.492542 0.009320 -0.037317
0.470831 -0.044347 0.012150
0.470621 -0.038249 0.028177
0.470521 0.045877 -0.013214
0.390982 -0.036971 -0.008452
0.390611 0.033247 -0.008172
0.378136 -0.012042 0.058751
0.382214 0.018521 0.046247
0.367702 0.005254 0.040900
0.492228 0.026958 -0.027846
0.412814 -0.019312 -0.051663
0.442170 -0.021635 -0.055836
0.441540 -0.046898 0.012928
0.390719 -0.036472 0.015139
0.391146 -0.028863 -0.027043
0.500000 -0.000919 0.003089
0.441850 -0.048717 -0.014185
0.382255 -0.023267 0.045730
0.412515 -0.045625 -0.012175
0.440890 -0.014824 0.056345
0.406519 -0.029249 0.047631
0.440905 0.039423 0.029295
0.388167 -0.032038 0.030041
0.491970 0.032531 -0.007030
0.441067 0.044456 0.012274
0.470230 -0.012825 0.051522
0.470425 -0.027185 0.040677
0.412218 -0.043723 0.013810
0.492669 -0.014246 -0.037456
0.471382 -0.018726 -0.049662
0.492313 -0.034294 -0.006393
0.471116 -0.046824 -0.012452
0.470384 0.041951 0.011633
0.492236 -0.032509 0.010189
0.491996 -0.008362 0.040434
0.441318 -0.040472 0.029874
0.412861 0.013937 -0.051634
0.441610 0.040949 -0.045579
0.377589 0.007565 0.058887
0.491922 0.029687 0.009096
0.391268 0.008146 -0.035625
0.440747 0.011671 0.056651
0.441236 0.046768 -0.014626
0.390935 -0.013482 -0.035355
0.367677 -0.009925 0.041070
0.492088 -0.027440 0.021113
0.412398 0.036321 -0.040456
0.390876 0.024416 -0.027861
0.492636 -0.031029 -0.026596
0.441933 -0.043716 -0.045165
0.409385 -0.038411 0.030260
0.367703 0.005732 0.054387
0.441103 -0.030896 0.044704
0.471150 -0.040475 -0.039664
3 3 7 62
3 62 0 3
3 25 64 35
3 25 61 64
3 25 68 61
3 25 65 68
3 65 29 68
3 29 26 68
3 29 18 26
3 40 73 46
3 40 41 73
3 34 65 25
3 43 65 34
3 27 59 14
3 31 20 64
3 20 35 64
3 20 39 35
3 39 25 35
3 39 48 25
3 48 34 25
3 41 43 71
3 34 48 43
3 13 38 41
3 43 41 38
3 13 7 27
3 7 59 27
3 7 6 59
3 6 28 59
3 16 5 19
3 5 18 19
3 5 12 18
3 12 26 18
3 12 67 26
3 67 68 26
3 67 57 68
3 57 61 68
3 57 31 61
3 31 64 61
3 32 70 31
3 70 20 31
3 70 37 20
3 37 39 20
3 37 33 39
3 33 48 39
3 73 71 56
3 48 56 71
3 40 13 41
3 40 62 13
3 62 7 13
3 3 6 7
3 45 16 42
3 6 42 16
3 45 63 5
3 63 12 5
3 63 58 12
3 58 67 12
3 58 10 67
3 10 57 67
3 10 32 57
3 32 31 57
3 50 74 32
3 74 70 32
3 74 52 70
3 52 37 70
3 52 22 37
3 22 33 37
3 47 56 23
3 33 23 56
3 47 46 73
3 46 17 40
3 17 62 40
3 17 0 62
3 53 42 11
3 3 11 42
3 53 24 45
3 24 63 45
3 24 4 63
3 4 58 63
3 4 15 58
3 15 10 58
3 15 50 10
3 50 32 10
3 49 69 50
3 69 74 50
3 69 51 74
3 51 52 74
3 51 54 52
3 54 22 52
3 9 23 66
3 22 66 23
3 9 55 47
3 55 46 47
3 55 8 46
3 8 17 46
3 8 1 17
3 1 0 17
3 60 11 2
3 0 2 11
3 60 44 53
3 44 24 53
3 44 30 24
3 30 4 24
3 30 21 4
3 21 15 4
3 21 49 15
3 49 50 15
3 21 30 36
3 30 44 36
3 44 60 36
3 2 1 36
3 1 8 36
3 8 55 36
3 55 9 36
3 66 54 36
3 54 51 36
3 51 69 36
3 69 49 36
3 49 21 36
3 38 65 43
3 13 27 38
3 29 72 28
3 14 29 65
3 38 27 14
3 59 28 72
3 14 59 72
3 19 18 29
3 6 19 28
3 28 19 29
3 14 72 29
3 6 16 19
3 45 5 16
3 3 42 6
3 53 45 42
3 0 11 3
3 60 53 11
3 1 2 0
3 60 2 36
3 38 14 65
3 71 43 48
3 73 41 71
3 33 56 48
3 47 73 56
3 22 23 33
3 9 47 23
3 54 66 22
3 9 66 36
