OFF
1361 2670 0
0.4634038430 -0.4660385243 0.0950123927
0.4922776494 0.4931611447 0.3791387384
0.4771504745 0.4737329829 0.2141734372
0.4569711068 0.4481742860 0.1303116821
-0.4813380644 0.4838072910 0.2967095643
0.4955239507 0.4959438268 0.3701966397
0.4553572679 0.4403136878 -0.0350799282
-0.4923646790 -0.4783437059 0.4310576704
0.4939008001 0.4945524831 0.3746676369
-0.4761962814 -0.4747392332 0.2616976816
-0.4899546057 -0.4780080496 0.4271616249
0.4910225912 0.4931027526 0.3786646322
0.4578922369 0.4391112086 0.0465262119
0.4889092843 0.4923682987 0.3810458028
0.4942680566 0.4958854404 0.3697226370
0.4926457418 0.4944940963 0.3741936350
0.4882767289 0.4946988182 0.3807886377
-0.4920131640 0.4941449906 0.3756727196
0.4910793661 -0.4797601660 0.4321788199
0.4944359522 -0.4811313216 0.4197703428
-0.4530873240 0.4449237479 0.0453579765
-0.4543995503 0.4449243406 0.0453566891
-0.4929494506 -0.4833992262 0.4220368177
-0.4888764575 -0.4789113185 0.4299931055
-0.4904008828 0.4927521855 0.3801468911
0.4858451197 0.4744293819 -0.0347867178
0.4931925668 -0.4815472062 0.4194802958
0.4931838182 -0.4811203034 0.4278486477
-0.4818491534 -0.4766568905 0.3456360304
0.4551527559 0.4379178025 -0.0347465832
0.4577682641 0.4405048432 -0.0352976412
-0.4919850702 0.4943935755 0.3812288022
-0.4952117227 0.4971792186 0.3722810833
-0.4935983968 0.4957864183 0.3767553601
0.4545399368 0.4415135239 0.1306491445
-0.4903393575 0.4957981485 0.3795376495
0.4625504996 0.4516656337 0.0479824759
-0.4575093674 0.4382461824 -0.0359201622
-0.4693783565 -0.4722756331 0.1778706868
-0.4911390653 -0.4807557764 0.4287787336
0.4913193410 0.4925594120 0.3808272541
0.4583415818 0.4403423339 0.0464638379
0.4547025259 0.4367116907 -0.0376041771
-0.4923765045 -0.4807656701 0.4206979863
-0.4568738897 0.4405761078 -0.0361765006
-0.4901278268 0.4946354963 0.3806350250
0.4926152527 -0.4784862263 0.4265088006
0.4847270310 -0.4764125100 0.3463372253
-0.4918425971 -0.4781324713 0.4250731794
0.4963660692 0.4968163813 0.3707746466
0.4521151382 0.4481763751 0.1303069232
-0.4942750313 0.4958584511 0.3742767404
-0.4518580033 0.4379407968 0.0457153820
-0.4817107069 0.4843378018 0.2966078689
-0.4926627502 0.4944656459 0.3787509119
-0.4894803301 0.4943147323 0.3775567318
-0.4750312285 -0.4741932904 0.2618090356
-0.4946391123 -0.4826101280 0.4194836143
0.4513501203 0.4391140593 0.0465197988
-0.4746580489 -0.4736555070 0.2618551875
0.4881315904 -0.4785939620 0.4304433295
-0.4910936568 0.4957075752 0.3730832897
-0.4530278970 -0.4455847317 0.4277856462
-0.4556116037 -0.4455835646 0.4277831114
0.4927750599 -0.4789725916 0.4296290422
0.4887671180 -0.4762500058 0.4304620341
-0.4556284296 0.4409157709 -0.0361194062
-0.4923827209 0.4959220175 0.3708699618
-0.4907693949 0.4945292119 0.3753441343
0.4815090601 0.4824402566 0.2978115980
-0.4936264906 0.4955377238 0.3711991786
0.4780754130 -0.4739428257 0.2624970157
-0.4940731396 -0.4795496273 0.4265139712
-0.4625604325 -0.4698119797 0.0940447355
-0.4507706215 0.4393457069 -0.0386049881
-0.4841206797 0.4845311348 0.2963854261
-0.4644284475 0.4505106642 0.0470424168
0.4701781892 0.4590785361 0.1315297423
0.4897385958 -0.4766345036 0.4303373774
0.4926802009 -0.4796060225 0.4298638997
-0.4907862980 0.4963111942 0.3731602283
0.4680686163 -0.4698967716 0.1789696566
0.4902773498 -0.4792681869 0.4259632366
0.4916928695 0.4930896336 0.3807272299
-0.4757548633 0.4702101943 0.2138126413
0.4821147684 -0.4737803106 0.3466220325
-0.4881857526 -0.4772978613 0.4295552526
0.4576798268 -0.4451597308 0.3443853641
0.4575994257 -0.4408729808 0.4284163450
0.4505005532 -0.4408697743 0.4284093804
0.4577602270 -0.4494464275 0.2603554265
0.4505809533 -0.4451564711 0.3443794428
-0.4892144674 -0.4794003569 0.4303286381
-0.4682133035 -0.4717296902 0.1779820409
0.4534124510 0.4402567375 -0.0377862598
0.4559960532 0.4402555705 -0.0377837250
-0.4678401239 -0.4711919069 0.1780281928
0.4932783135 -0.4846620772 0.4208442075
0.4511568180 -0.4397348406 0.4283521117
0.4569434643 -0.4397374544 0.4283577889
-0.4745258440 0.4728189381 0.2135688010
-0.4562803472 0.4408547686 -0.0361650406
-0.4927069828 0.4971002765 0.3686091226
0.4683007887 0.4617498755 0.1313278545
-0.4828752196 0.4848707979 0.2964425206
-0.4935031938 0.4964402609 0.3769247308
0.4928489193 0.4959171141 0.3802036206
0.4714230626 -0.4714730880 0.1786578488
-0.4908032145 -0.4760763675 0.4293784963
0.4888224868 0.4937951170 0.3808277298
-0.4530078633 0.4406367897 -0.0386729947
-0.4557425075 -0.4673483796 0.0102177407
0.4960944893 0.4986997965 0.3712615212
-0.4543184943 -0.4420396847 0.4276035630
0.4927008949 -0.4816010973 0.4278727122
-0.4836660652 -0.4771465564 0.3454730591
0.4514759857 -0.4617324931 0.0924787748
0.4572626320 -0.4617351069 0.0924844520
0.4513956901 -0.4574457964 0.1765087124
0.4571823363 -0.4574484102 0.1765143896
0.4513152899 -0.4531590997 0.2605386499
0.4571019362 -0.4531617134 0.2605443272
0.4512348888 -0.4488723497 0.3445696309
0.4570215350 -0.4488749635 0.3445753081
0.4944720699 0.4973084578 0.3757326234
-0.4904914052 -0.4807507879 0.4256838225
0.4575981310 -0.4434533333 0.4285479777
0.4504993630 -0.4434501269 0.4285410131
0.4577589323 -0.4520267800 0.2604870592
0.4506600598 -0.4520235735 0.2604800946
0.4576785312 -0.4477400301 0.3445180401
0.4505797632 -0.4477368236 0.3445110756
-0.4916752375 0.4944656912 0.3796043436
-0.4764067809 0.4701491920 0.2137670069
-0.4565575812 0.4393482165 -0.0386106603
-0.4511745346 0.4559311090 0.3817944235
0.4566922281 0.4389799197 -0.0350106085
-0.4923996239 0.4977038901 0.3686859568
-0.4847561564 0.4822010518 0.2966407265
-0.4534130711 0.4546419436 0.3818580442
-0.4547242526 0.4546425359 0.3818567578
-0.4616542865 -0.4663837566 0.0942190764
0.4754632549 -0.4713106264 0.2627818230
0.4942367808 -0.4803271203 0.4222034233
-0.4934575456 -0.4799719034 0.4207646268
-0.4915419428 -0.4788711944 0.4292359221
-0.4613943338 -0.4692660906 0.0941550472
0.4509020110 0.4403454856 0.0464565496
-0.4927540130 -0.4825952458 0.4244694506
-0.4610211542 -0.4687283072 0.0942011991
-0.2314057901 0.1938929552 -0.1923349492
0.1992812906 0.1936984171 -0.1919124067
0.4890392825 -0.4795075199 0.4303440319
0.4748276222 -0.4736545507 0.2627637444
0.4570515068 0.4438872763 0.0462817605
-0.4501153279 0.4356297233 -0.0384147934
0.4828440203 0.4811065929 0.2978809123
-0.4835271372 0.4848097956 0.2963968862
0.4914986110 -0.4769667252 0.4311426981
0.4903119218 0.4960891086 0.3820819283
0.4943966933 -0.4808135282 0.4253228302
0.4579726379 0.4348241456 -0.0375047531
0.4547647524 -0.4649573497 0.0112902802
0.4935574909 0.4988718336 0.3731406636
0.4647715491 -0.4690034038 0.0948176394
-0.4839842452 -0.4736127466 0.3455519200
-0.4951165199 0.4978329622 0.3724505637
0.4915549043 0.4957036970 0.3824136891
0.4919343403 0.4974804899 0.3776116608
-0.4850598782 -0.4751589124 0.3454184480
-0.4565859257 -0.4535022965 0.2596873920
-0.4517308974 -0.4535044894 0.2596921552
-0.4566664313 -0.4492155464 0.3437183728
-0.4518114030 -0.4492177394 0.3437231361
-0.4567469362 -0.4449288337 0.4277486233
-0.4518919079 -0.4449310267 0.4277533865
-0.4768481412 -0.4746829031 0.2616471078
0.4916575617 -0.4782883911 0.4301724123
-0.4935200970 0.4982221389 0.3747408301
-0.4543190448 0.4406372776 -0.0386742758
-0.4951334229 0.4996149445 0.3702666577
0.4698403654 0.4628120970 0.1310638240
-0.4900505717 0.4970712174 0.3786204940
0.4943017297 -0.4814469538 0.4255577920
0.4895302643 -0.4806598598 0.4291280603
0.4896689226 0.4957689647 0.3790030994
-0.4569614944 0.4559336186 0.3817887512
-0.4527828250 -0.4513559648 0.1753328470
-0.4528633297 -0.4470692680 0.2593627844
-0.4554480811 -0.4470681005 0.2593602485
-0.4529438353 -0.4427825180 0.3433937652
-0.4555285867 -0.4427813505 0.3433912294
-0.4556080469 -0.4384946382 0.4274214809
-0.4530243401 -0.4384958106 0.4274239114
0.4688109055 -0.4688409419 0.1789416127
0.4893602911 -0.4759740360 0.4304227894
0.4929152238 0.4985516521 0.3700611050
0.4813132732 -0.4754906934 0.3466352892
0.4585094945 0.4394503765 -0.0352180316
-0.4916638976 0.4984640230 0.3741463216
-0.4909768805 -0.4797310247 0.4311297726
-0.4542032302 -0.4662646539 0.0103752477
0.4913601246 -0.4784754349 0.4260312696
0.4881086661 0.4940714209 0.3808847148
0.4912920732 0.4971603084 0.3745321022
0.4546202323 0.4372265142 0.0466192228
0.4584219828 0.4360552709 -0.0375671271
0.4717177658 0.4601406533 0.1312657171
0.4903512153 0.4958403890 0.3765259172
-0.2306021523 -0.2508904822 -0.2099052289
0.2253306576 -0.2510964235 -0.2094579181
0.4521955382 0.4438893653 0.0462770017
0.4887281692 0.4944490452 0.3809969145
-0.4517774979 0.4336537337 -0.0383155829
0.4581191997 -0.4665337193 0.0109774291
-0.4908294151 -0.4812398263 0.4260193551
-0.4572145139 0.4356328256 -0.0384217531
-0.4900026652 -0.4777874846 0.4293931161
-0.4689426429 0.4592218414 0.1306718779
-0.4782419532 -0.4726953123 0.2615914533
0.4908146745 -0.4820114104 0.4244864881
0.4704915846 0.4627505061 0.1310194681
0.4514305213 0.4348269963 -0.0375111662
-0.4923054658 0.4983577385 0.3688554308
-0.4906921398 0.4969649329 0.3733296033
-0.4904547987 -0.4795197902 0.4251452816
-0.4913068178 0.4971306341 0.3790920374
-0.4921053088 -0.4825902205 0.4213752710
-0.4945334704 0.4999162826 0.3701444229
0.4930783071 -0.4838579181 0.4232764524
-0.4504377881 -0.4499606095 0.2595126069
-0.4578775678 -0.4499572490 0.2595053078
-0.4505172489 -0.4456738600 0.3435435887
-0.4579580734 -0.4456704990 0.3435362886
-0.4580375335 -0.4413837867 0.4275665401
-0.4505977538 -0.4413871472 0.4275738392
-0.4760640440 0.4738824454 0.2133017562
-0.4929201438 0.4985234397 0.3746178650
0.4827087778 -0.4735043625 0.3465823713
-0.4608537374 -0.4680948630 0.0942339048
0.4943224230 -0.4834419913 0.4235673349
0.4757354195 -0.4745681458 0.2626637164
0.4848657987 0.4839728307 0.2973401496
-0.4607955884 0.4495659994 0.0474654630
-0.4714240283 -0.4702317122 0.1777644585
-0.4932513139 -0.4839974469 0.4195557165
0.4783536987 -0.4733490171 0.2624920969
-0.4842603739 -0.4768700184 0.3454332754
0.4509824120 0.4360585269 -0.0375744207
-0.4779449818 0.4712127525 0.2135010055
0.4918357298 -0.4774561112 0.4314780582
-0.4695945605 0.4591608390 0.1306262436
-0.4903612865 -0.4801533008 0.4253804282
0.4628680791 0.4481577035 0.0484211726
0.4916296977 0.4976806727 0.3748167884
-0.4555553723 0.4336553358 -0.0383192840
0.4900065478 0.4962892918 0.3792870552
0.4932528483 0.4990720164 0.3703457912
0.4846612867 0.4815769454 0.2976734946
-0.4551104017 -0.4671773760 0.0102744825
0.4690830691 -0.4720984081 0.1788245495
-0.4905621620 0.4935323241 0.3777037784
-0.4884644324 -0.4767037691 0.4295504134
0.4774680549 0.4702248951 0.2146110958
0.4931201400 -0.4788076618 0.4268364860
0.4883486745 -0.4780205678 0.4304067543
0.4960182215 -0.4826544222 0.4210174529
0.4555070416 -0.4639015199 0.0112622364
-0.4622475494 -0.4661072723 0.0941782503
0.4760564274 -0.4710346247 0.2627432044
-0.4540358124 -0.4656312629 0.0104069100
0.4565814328 -0.4654486569 0.0111308738
0.4822503939 0.4813857388 0.2978922564
-0.4880423777 0.4935209892 0.3800266593
0.4751285913 0.4708660148 0.2147142371
0.4918609320 0.4937162951 0.3806310857
-0.4683501462 0.4595005559 0.1306843804
-0.4925907842 -0.4815704573 0.4268212210
-0.4646050595 -0.4677680593 0.0939385082
0.4616952829 -0.4668332255 0.0951255715
0.4942680235 -0.4802159243 0.4250191820
-0.4510940299 0.4516440832 0.2977641890
0.4937580735 0.4994241020 0.3706391180
0.4717020796 -0.4708792796 0.1786529307
-0.4774414041 -0.4744064187 0.2616062817
0.4959232579 -0.4832878478 0.4212524146
0.4748509015 0.4714577795 0.2146576296
-0.4920589663 -0.4789372576 0.4311964121
-0.4920509483 -0.4793642026 0.4228272248
0.4921349236 0.4980327210 0.3751093848
0.4543024167 0.4619190856 0.3823550826
-0.4533325663 0.4503549178 0.2978278097
-0.4546437478 0.4503555101 0.2978265233
0.4635201351 0.4480960589 0.0483757741
0.4825264395 0.4846138460 0.2974432963
-0.4918194529 0.4935917413 0.3781753208
0.4924362033 -0.4838523417 0.4201803803
0.4522759393 0.4396024067 -0.0377539686
0.4571319078 0.4396002133 -0.0377492045
0.4560195358 -0.4431827622 0.3442829205
0.4522423927 -0.4431810561 0.3442792148
0.4561803370 -0.4517562089 0.1762220020
0.4524031940 -0.4517545028 0.1762182963
0.4560999359 -0.4474694589 0.2602529830
0.4523227929 -0.4474677528 0.2602492773
0.4624315555 -0.4696287239 0.0949843401
-0.4816454625 -0.4742401800 0.3457232110
-0.4950450600 0.4963773467 0.3692268726
0.4022536931 0.3881910929 -0.0887523482
-0.4066052983 0.3885564483 -0.0895459112
-0.4955579686 -0.4807916096 0.4219012939
-0.4914849755 -0.4763037019 0.4298575817
-0.4508048704 -0.4530158803 0.1754194207
-0.4508853750 -0.4487291835 0.2594493582
-0.4574277006 -0.4487262283 0.2594429396
-0.4509658806 -0.4444424334 0.3434803390
-0.4575082062 -0.4444394783 0.3434739204
-0.4510453407 -0.4401557212 0.4275105905
-0.4575887111 -0.4401527656 0.4275041709
-0.4934327789 0.4949845469 0.3737011483
-0.4554296254 -0.4636436189 0.0103522989
-0.3543224083 -0.3691424670 -0.0982739715
0.4694048094 -0.4685649405 0.1789029948
-0.4937888139 0.4963178257 0.3687553345
0.4518712466 0.4552583235 0.3826925451
0.4567271107 0.4552561301 0.3826973091
-0.4921754880 0.4949250254 0.3732296113
0.4952176012 0.4956009576 0.3727251669
0.4899495093 -0.4778664243 0.4280918341
-0.4712566115 -0.4695982680 0.1777971642
-0.4566020602 0.4373471271 -0.0357269710
-0.4920697471 -0.4813592223 0.4208367290
0.4845255617 -0.4739956165 0.3464240084
0.4935944506 0.4942096138 0.3771961641
0.4911936253 -0.4774504975 0.4283827165
0.3157939605 -0.3480347940 -0.0603075677
-0.3488716320 -0.3477345696 -0.0609596640
0.4650498347 -0.4684095951 0.0948127205
-0.4897205997 -0.4797213677 0.4306547055
0.4622751851 0.4484369002 0.0484314687
0.4919714045 0.4928182701 0.3816671614
-0.4568809896 0.4516465928 0.2977585168
-0.4542626421 0.4379860802 -0.0356202828
0.4547006332 0.4329394512 -0.0374117422
0.4901094211 -0.4783527897 0.4312120757
-0.4919762349 -0.4819927330 0.4210718756
-0.4539844128 0.4385776470 -0.0356753014
0.4547869368 -0.4427335391 0.3442588230
0.4534754419 -0.4427329467 0.3442575363
0.4547065357 -0.4384467891 0.4282898039
0.4533951452 -0.4384461968 0.4282885173
0.4939320752 0.4947300825 0.3774808450
-0.4891466097 -0.4770877695 0.4293167098
-0.4707590732 0.4596937308 0.1304609005
0.4646853465 0.4486280028 0.0482127114
0.4581477208 -0.4593106217 0.0923616174
0.4505129301 -0.4550205127 0.1763841434
0.4580673216 -0.4550239781 0.1763905116
0.4579869205 -0.4507372282 0.2604214925
0.4504326344 -0.4507338160 0.2604140811
0.4579065194 -0.4464504782 0.3444524735
0.4503522333 -0.4464470660 0.3444450620
0.4929118084 -0.4828330179 0.4256271689
-0.4640644621 -0.4665968850 0.0940163224
0.4949122273 0.4958012451 0.3699302884
0.4923730537 -0.4801992974 0.4300020401
0.4583982167 -0.4659399109 0.0109725109
0.4947416688 -0.4806485930 0.4225303783
0.4899702033 -0.4798614991 0.4261006466
0.4932898081 0.4944099011 0.3744012863
0.4964960836 0.4974412413 0.3710160380
-0.4883668307 0.4942226978 0.3798710840
0.4580206380 0.4588000098 0.3825177612
0.4948729337 0.4960498604 0.3754863048
-0.4898504878 0.4748693657 -0.0357439252
-0.4898588078 0.4939929776 0.3798155722
0.4718850965 0.4607673418 0.1311700939
0.4932497832 0.4946585166 0.3799573020
0.4548750648 0.4385088900 -0.0348021100
-0.4812312028 0.4825326740 0.2968866254
-0.4949092638 -0.4807866216 0.4188063839
0.4551048099 -0.4673115441 0.0085171187
0.4537934194 -0.4673109518 0.0085158321
0.4550244087 -0.4630247941 0.0925480997
0.4537130183 -0.4630242018 0.0925468131
0.4549440086 -0.4587380974 0.1765780372
0.4536326181 -0.4587375051 0.1765767506
-0.4697173342 -0.4685145422 0.1779546713
-0.4505188969 0.4570655213 0.3817371808
0.4958888203 -0.4820568180 0.4207138040
0.4918043837 -0.4775652203 0.4286621930
-0.4936648519 -0.4812036352 0.4185186733
-0.4936728693 -0.4807767274 0.4268871302
0.4923090298 0.4933385971 0.3819511172
0.4814505069 0.4830889757 0.2977313725
0.4910603138 0.4954195270 0.3804700967
-0.4675478833 0.4612030158 0.1305240249
-0.4930999232 -0.4781431713 0.4255482987
-0.4958883584 0.4972505635 0.3698033356
-0.4572465382 -0.4641332316 0.0101903711
0.4650588749 0.4491582297 0.0481127915
0.4575725287 0.4600315405 0.3824545066
0.4900351516 -0.4809812953 0.4294557456
0.4886502572 0.4952283041 0.3806885463
0.4916667619 0.4930184530 0.3788722889
0.4920461986 0.4947952086 0.3740695303
-0.4911006297 0.4961337522 0.3814517849
0.4568075107 0.4509692247 0.2986673822
0.4904230480 0.4934038648 0.3785405274
-0.4505176023 0.4596457695 0.3816055534
-0.4521767439 0.4616231496 0.3815029854
0.4936692441 0.4961865896 0.3695992634
-0.4838488502 0.4813020498 0.2968349611
-0.4815094321 0.4819410028 0.2969416493
-0.4923896945 0.4963482264 0.3792390831
0.4923076380 -0.4832547431 0.4198766279
-0.4956153016 0.4991338371 0.3702907392
0.4505811716 0.4588032659 0.3825104677
-0.4898331765 -0.4796674870 0.4293515146
-0.4781107216 0.4718395383 0.2134040121
-0.4628983644 -0.4660509426 0.0941276775
-0.4502894459 0.4583554899 0.3816715942
-0.4540673202 0.4583571963 0.3816678878
-0.4940030204 0.4977410320 0.3747649106
0.4562575624 -0.4625766848 0.0925264213
0.4561771622 -0.4582899881 0.1765563588
0.4524000192 -0.4582882820 0.1765526531
0.4560967621 -0.4540032913 0.2605862964
0.4523196190 -0.4540015852 0.2605825906
0.4560163609 -0.4497165414 0.3446172773
0.4522392179 -0.4497148353 0.3446135716
-0.4932661875 -0.4786293893 0.4286682204
-0.4615379259 0.4485120986 0.0475436224
-0.4510135244 0.4473570202 0.2137332241
-0.4559568518 0.4550912372 0.3818326869
-0.4576170382 0.4570686232 0.3817302222
0.4543828177 0.4576320226 0.2983241177
-0.4907615573 -0.4789272442 0.4250073225
-0.4532520608 0.4460678548 0.2137968449
-0.4545632423 0.4460684470 0.2137955585
-0.4509667284 -0.4482143605 0.3436727590
-0.4575100987 -0.4482114049 0.3436663394
-0.4510472333 -0.4439276477 0.4277030095
-0.4575906036 -0.4439246921 0.4276965898
0.4782069078 0.4729904071 0.2141872240
-0.4641502186 0.4511015006 0.0469874355
-0.4902286947 -0.4762940449 0.4293825146
-0.4557997983 0.4390496403 -0.0358862831
-0.4931726753 -0.4792629000 0.4289033670
0.4931554655 0.4953124502 0.3801265911
0.4891297635 0.4931904900 0.3807514314
0.4964017661 0.4980951695 0.3711852228
-0.4882716278 0.4948765457 0.3800405591
0.4923752290 0.4959731725 0.3718093319
-0.4618108015 0.4517405069 0.0470951671
0.4947786161 0.4967037939 0.3756555939
0.4510304120 0.4600343912 0.3824480936
0.4907520784 0.4945818287 0.3762803291
-0.4898558152 0.4965179357 0.3811224702
0.4918901304 -0.4806800913 0.4300261046
-0.4930824677 0.4993035788 0.3721747513
0.4880240975 -0.4773069105 0.4304895045
0.4945333366 -0.4846739119 0.4213217916
0.4685491021 -0.4717209001 0.1788780086
-0.4937564021 -0.4843184208 0.4198825153
-0.4896834090 -0.4798305131 0.4278388031
0.4519515421 0.4509713138 0.2986626234
-0.4830152517 -0.4772038763 0.3455247285
-0.4914691419 0.4979107785 0.3766490281
-0.4576157435 0.4596488713 0.3815985948
-0.4639478977 0.4487053784 0.0473201362
-0.4559535736 0.4616247566 0.3814993896
0.4562100250 0.4371752263 -0.0347327956
0.4939945825 -0.4820402287 0.4256959324
0.4708091640 0.4592424715 0.1314581702
0.4898154692 0.4957602160 0.3805248576
0.4920686825 0.4965771060 0.3718863986
-0.4578441499 0.4583587980 0.3816641877
-0.4887847158 0.4924671203 0.3801054448
0.4904455326 0.4951857251 0.3763566654
0.4934260170 -0.4794061516 0.4243560854
-0.4913970081 0.4950565010 0.3795488405
0.4784854343 0.4723984845 0.2142427941
0.4684697014 0.4598835380 0.1315602680
-0.4568004841 0.4473595298 0.2137275519
-0.4892083192 0.4961972089 0.3780449073
-0.4924339263 0.4989828143 0.3690964590
0.4906431080 -0.4760877821 0.4303178856
-0.4931904287 -0.4812579574 0.4269121418
-0.4886681231 -0.4791215655 0.4294624513
-0.4908206004 0.4975900140 0.3735707358
-0.4882938990 -0.4785837720 0.4295088129
-0.4540750872 -0.4511289611 0.1753200286
-0.4541555918 -0.4468422643 0.2593499660
-0.4539151217 -0.4597024075 0.0072591093
-0.4539956273 -0.4554156574 0.0912900901
0.4614745677 0.4501399798 0.0482695459
0.4710852085 0.4624706319 0.1310102534
0.4916567849 -0.4828222266 0.4251496380
0.4758675496 0.4736313692 0.2142893272
-0.1259773090 -0.1360835532 -0.2792578254
0.0934674609 -0.1361826747 -0.2790425305
-0.4947148717 -0.4799826034 0.4212397461
-0.4895458218 0.4967179452 0.3783281954
-0.4911946879 0.4926604160 0.3798822716
0.4813724797 -0.4748372370 0.3466490862
0.4913792761 -0.4788832751 0.4301767584
0.4931780545 0.4970943103 0.3779427292
-0.4748995327 0.4733487721 0.2134681853
0.4904674192 0.4956986513 0.3804810241
0.4530071012 0.4546029663 0.3827270656
0.4555905990 0.4546017993 0.3827296003
0.4686743168 0.4622793721 0.1312279719
0.4948012045 0.4984856860 0.3734723581
-0.4814759744 -0.4761201505 0.3456822355
0.4770174006 -0.4746818915 0.2625588118
-0.4919911085 -0.4766246754 0.4301843795
0.4910881149 -0.4801881495 0.4238097909
-0.4948811352 -0.4804688587 0.4243589374
-0.4504374003 -0.4512700893 0.2595794089
-0.4505179059 -0.4469833393 0.3436103898
-0.4579587304 -0.4469799783 0.3436030897
-0.4580381905 -0.4426932661 0.4276333411
-0.4505984108 -0.4426966266 0.4276406402
0.4581010379 0.4545130001 0.2984878396
0.4905493601 -0.4775544289 0.4281846621
0.4898359809 -0.4801771313 0.4318880957
0.4839907589 -0.4736181082 0.3464774666
-0.4770366299 0.4703136969 0.2136941977
0.4934909652 -0.4805259478 0.4277111844
-0.4504373474 0.4527784951 0.2977069473
-0.4746972118 0.4709526499 0.2138008860
-0.4890565458 0.4956953758 0.3796560568
-0.4531715563 0.4417809493 0.1297669181
-0.4947865782 -0.4811023698 0.4245940850
-0.4900214183 -0.4803195888 0.4281736053
0.4582318034 0.4400414641 -0.0352735584
0.4747201293 -0.4723674992 0.2628099193
-0.4710860786 -0.4714782389 0.1777561898
0.4552452392 -0.4667815314 0.0111975888
-0.4911591484 0.4981106784 0.3738546543
-0.4573379982 0.4401131477 -0.0361533279
0.4919743648 0.4972310395 0.3720556877
0.4576529297 0.4557444775 0.2984235417
-0.4607367088 0.4502146123 0.0473843093
-0.4927714296 0.4995034836 0.3693804829
-0.4912983567 -0.4816699825 0.4235295201
-0.4881264815 -0.4779503597 0.4295408926
0.4898407770 -0.4777981698 0.4303310371
0.4909560925 0.4960048089 0.3822895851
0.4922675433 -0.4829369494 0.4254291145
0.4580271879 0.4376455256 -0.0349412569
0.4956153800 -0.4838811596 0.4213898240
0.4942015571 0.4987875340 0.3733483203
-0.4527863824 -0.4584459346 0.1756945307
-0.4553711338 -0.4584447671 0.1756919949
-0.4528668870 -0.4541592378 0.2597244682
-0.4554516384 -0.4541580703 0.2597219323
-0.4529473926 -0.4498724878 0.3437554490
-0.4555321440 -0.4498713203 0.3437529131
-0.4527058778 -0.4627326314 0.0916645933
-0.4552906292 -0.4627314639 0.0916620574
0.4568879117 0.4466821617 0.2146364172
0.4935116592 -0.4825210226 0.4257199969
0.4925792423 0.4973961899 0.3778193183
-0.4504370976 0.4553587437 0.2975753189
-0.4752911817 -0.4713119998 0.2618731181
-0.4520962392 0.4573361292 0.2974728552
0.4773392443 -0.4711483708 0.2626383006
0.4897001984 0.4959464225 0.3818155824
0.4506614671 0.4545162561 0.2984805460
-0.4502089411 0.4540684641 0.2976413597
0.4816178386 0.4837156110 0.2976347059
0.4913233483 0.4973378035 0.3773453156
-0.4642681536 -0.4690146388 0.0939291951
-0.4948053764 -0.4830974267 0.4226028588
-0.4566635315 -0.4434360994 0.3434235433
-0.4518085032 -0.4434382924 0.3434283066
-0.4567440364 -0.4391493866 0.4274537938
-0.4518890081 -0.4391515849 0.4274584527
-0.4509340647 0.4430700109 0.1297033016
-0.4567199796 0.4430726243 0.1296976251
-0.4932761799 0.4998560307 0.3696729231
-0.4712995460 0.4608510815 0.1302632531
0.4950475459 -0.4812470882 0.4200498733
-0.4904850357 -0.4796111835 0.4293004191
0.4556162952 0.4374543191 -0.0347224950
-0.4935609646 -0.4835144404 0.4223151482
-0.4575365334 0.4527815974 0.2976999877
0.4652269379 0.4497848647 0.0480161256
-0.4540950834 -0.4649776998 0.0104216342
0.4544632177 0.4533450128 0.2142941961
-0.4773095055 0.4735420008 0.2132457478
-0.4576162276 0.4395214765 -0.0360983039
-0.4544837827 0.4417814377 0.1297656360
-0.4879834986 0.4941696286 0.3799460274
0.4834952380 0.4810442205 0.2978376424
-0.4684722120 -0.4688484001 0.1780461243
0.4706868949 -0.4686786862 0.1787980903
0.4580013234 -0.4623076143 0.0082646236
0.4509025554 -0.4623044079 0.0082576591
0.4579209223 -0.4580208644 0.0922956046
0.4508221542 -0.4580176579 0.0922886401
0.4507417541 -0.4537309612 0.1763185776
0.4578406276 -0.4537342209 0.1763244988
0.4506613540 -0.4494442644 0.2603485151
-0.4813085566 -0.4754867596 0.3457138978
0.4952074577 -0.4817334535 0.4231701150
0.4717612861 -0.4702258232 0.1786667277
0.4637135366 -0.4697424696 0.0948794354
0.4891938765 -0.4801715229 0.4287926497
0.4572650653 -0.4568853380 0.0922370486
0.4570238649 -0.4440252477 0.3443268612
0.4513980189 -0.4525960274 0.1762613089
0.4571846661 -0.4525986945 0.1762659427
0.4513176188 -0.4483093307 0.2602912464
0.4571042650 -0.4483119445 0.2602969237
0.4512372176 -0.4440225807 0.3443222274
0.4842636538 -0.4768755747 0.3463604041
0.4511108120 0.4557473814 0.2984181720
0.4558924442 0.4406824794 -0.0351704117
-0.4923291178 -0.4771137511 0.4305191816
-0.4549985812 0.4407520496 -0.0360455909
0.4520319431 0.4466842508 0.2146316584
-0.4575352388 0.4553618456 0.2975683603
-0.4558730689 0.4573377308 0.2974691551
-0.4677146689 0.4618297509 0.1304280792
0.4921708890 -0.4793953602 0.4238785544
-0.4947447137 0.4960342035 0.3717559950
0.4914567776 -0.4820180249 0.4275827177
0.4614162664 -0.4674281305 0.0951294995
-0.4574502286 -0.4665510387 0.0101022003
0.4951124941 -0.4823668791 0.4234050767
0.4903410286 -0.4815797851 0.4269753450
-0.4931313879 0.4946414032 0.3762302718
0.4543005240 0.4581467417 0.3825475229
0.4581814390 0.4502260414 0.2144568693
-0.4936060562 -0.4784641448 0.4258750965
0.4927096430 -0.4820290435 0.4195044136
-0.4918788483 -0.4776235661 0.4292452863
0.4883031139 -0.4767130702 0.4304852123
0.4515563863 -0.4660202865 0.0084478471
0.4573430326 -0.4660229003 0.0084535243
-0.4888408963 -0.4776813637 0.4294546168
-0.4964960836 -0.4823082908 0.4200503848
-0.4577636451 0.4540717722 0.2976339532
0.3161270171 0.3157668899 -0.0941703768
-0.3485385754 0.3160671143 -0.0948224732
-0.4915180619 0.4932485976 0.3807044443
0.4580001332 -0.4648879669 0.0083962564
0.4509012607 -0.4648847604 0.0083892918
0.4579197321 -0.4606012169 0.0924272374
0.4508208596 -0.4605980104 0.0924202727
0.4578393319 -0.4563145202 0.1764571749
0.4507404594 -0.4563113137 0.1764502103
-0.4848630176 0.4834765035 0.2964636228
-0.4918555645 0.4937693339 0.3809877324
0.4914660744 0.4924654542 0.3813738718
0.4640352769 -0.4662090020 0.0949578807
-0.4744906316 -0.4730231595 0.2618869031
-0.4947510165 -0.4798713716 0.4240555430
0.4947123750 0.4952481735 0.3724325035
-0.4887463393 -0.4783148749 0.4296897644
0.4570620231 -0.4672727854 0.0110392259
-0.4964015267 -0.4829418019 0.4202855324
0.4776114089 -0.4744058902 0.2625201939
-0.4916363667 -0.4821590209 0.4238650527
0.4018483822 -0.4196178424 -0.0475432334
-0.4070106093 -0.4192524869 -0.0483367964
0.4930892251 0.4938567926 0.3769027703
-0.4845847883 0.4840680703 0.2964086042
-0.4822453702 0.4847070234 0.2965152925
0.4850348147 0.4821064420 0.2975736119
0.4902110162 0.4924070674 0.3808998699
0.4934564809 0.4951897872 0.3719585008
0.4918341669 0.4937984058 0.3764287684
0.4951331881 -0.4843619538 0.4214138892
-0.4511721014 0.4607807736 0.3815470254
-0.4912070238 0.4934486067 0.3779101706
0.4903828615 -0.4765295288 0.4305353786
-0.4929133045 -0.4835094518 0.4192202372
0.4530873967 0.4503159565 0.2986971440
0.4556709989 0.4503147895 0.2986996787
0.4938890714 -0.4847778434 0.4211237371
-0.4767159620 0.4738206084 0.2132561644
-0.4565064664 -0.4577900362 0.1756575068
-0.4516503933 -0.4577922296 0.1756622710
-0.4514904279 -0.4663656760 0.0076013517
-0.4563454561 -0.4663634830 0.0075965885
-0.4564259617 -0.4620767330 0.0916275693
-0.4515698887 -0.4620789264 0.0916323336
0.4816507643 -0.4742433751 0.3466452107
0.4891387448 -0.4769454184 0.4302452265
-0.4928203497 0.4948414123 0.3734359981
-0.4927912111 0.4950899967 0.3789920817
-0.4680873124 0.4623603149 0.1303274273
-0.4960178637 0.4978756398 0.3700443628
0.4616427343 0.4507666680 0.0481739236
0.4507418682 0.4502292975 0.2144495757
-0.4944045370 0.4964827969 0.3745178049
-0.4501284356 0.4497815054 0.2136103895
-0.4904370458 -0.4775257762 0.4271365600
0.4831573108 0.4847777282 0.2973706806
0.4530105535 0.4616917884 0.3823654403
0.4555940512 0.4616906214 0.3823679749
-0.4508535602 0.4387831054 0.0456733748
-0.4553675770 -0.4513558407 0.1753303643
-0.4526218153 -0.4599304550 0.0072719819
-0.4552065668 -0.4599292875 0.0072694460
-0.4527023209 -0.4556437050 0.0913029628
-0.4552870724 -0.4556425375 0.0913004269
-0.4548363620 -0.4639211999 0.0103921348
-0.4758844446 -0.4710355154 0.2618322920
0.4715945867 -0.4695922281 0.1786991056
0.4573830320 -0.4637393175 0.0111176705
-0.4520190119 0.4465155468 0.2137751876
-0.4676727076 -0.4705595061 0.1780609517
-0.4559119961 -0.4654673125 0.0102597063
-0.4916804136 -0.4771087258 0.4274250020
0.4584574222 -0.4652864013 0.0109873513
-0.4687472959 -0.4721056724 0.1779274808
0.4823869325 -0.4770388734 0.3465039791
0.4709590585 -0.4719361525 0.1786810270
0.4926464941 -0.4783760365 0.4293253429
-0.4530910519 0.4374939395 0.0457369966
-0.4544032781 0.4374945322 0.0457357092
0.4955552256 0.4961206905 0.3730097807
-0.4950811723 0.4965548722 0.3720400199
-0.4934688911 0.4951620671 0.3765141913
0.4718265444 0.4614160076 0.1310888251
0.4850060475 -0.4758197450 0.3463323604
-0.4910782991 -0.4793346779 0.4292600104
0.4548165126 0.4391575559 -0.0348833789
-0.4906022653 -0.4780119947 0.4302564827
-0.4886731451 0.4936183479 0.3797941837
-0.4939430214 -0.4789531837 0.4262106301
0.4644263186 0.4514881551 0.0478562844
-0.4534093431 0.4620718510 0.3814789144
0.4939309043 -0.4797275871 0.4246837707
-0.4917103862 -0.4769901490 0.4292774713
0.4891594388 -0.4789404931 0.4282540390
0.4577333297 0.4514574677 0.2143936201
-0.4913372067 -0.4764523603 0.4293237276
-0.4902864711 0.4950111535 0.3753200112
-0.4611906428 -0.4668472401 0.0942431647
0.4749991463 -0.4717736908 0.2628050011
-0.4704972852 0.4625536479 0.1301049844
0.4921017753 -0.4819120123 0.4277805621
-0.4931888618 0.4966184387 0.3686332413
-0.4569590611 0.4607832832 0.3815413532
-0.4915765806 0.4952256335 0.3731074128
-0.4944336756 0.4962341082 0.3689617266
-0.4621314688 0.4482327074 0.0475321996
0.4569683117 0.4423951519 0.1306064957
-0.4899632540 0.4938327907 0.3775808548
-0.4503555473 0.4510716802 0.2135443551
-0.4520157338 0.4530490661 0.2134418903
-0.4557936081 0.4530507726 0.2134381839
0.4643074405 -0.4694664682 0.0948408175
-0.0018435887 -0.0340817233 -0.4321788199
-0.0164475639 -0.0318374234 -0.3883281728
0.4838085290 0.4847161904 0.2973273681
0.4937916866 -0.4812362965 0.4195723416
-0.4503562392 -0.4542483502 0.1754827237
-0.4577970637 -0.4542449892 0.1754754236
-0.4501962737 -0.4628217965 0.0074218044
-0.4576360534 -0.4628184360 0.0074145053
-0.4502767794 -0.4585350465 0.0914527852
-0.4577165590 -0.4585316860 0.0914454861
0.4620161582 0.4512968949 0.0480740036
0.4890644752 -0.4795739186 0.4284890008
-0.4690665197 -0.4685719153 0.1780052973
0.4853562084 -0.5000000000 0.0149222796
-0.4903393987 -0.4995592858 0.0139650350
0.4907849993 0.4921906838 0.3809189905
-0.4576831396 0.4497848135 0.2136029830
-0.4928659179 -0.4798564521 0.4290421097
0.4919625575 -0.4834207217 0.4226691329
-0.4952199592 -0.4803036146 0.4215658146
-0.4619293719 -0.4696420190 0.0941015295
-0.4899801571 0.4956147730 0.3753969488
-0.4566394752 0.4387856145 0.0456677036
-0.4692518241 0.4628932578 0.1301610355
-0.4609024485 0.4508413980 0.0472873159
0.4545435132 0.4490580031 0.1302642744
-0.4845192823 -0.4739887283 0.3454973589
-0.4543727178 -0.4643836400 0.0104161699
0.4683469014 -0.4693040063 0.1789647909
-0.4645457880 -0.4684205790 0.0939237308
-0.2303736890 0.2044504382 -0.2331337369
0.2255591208 0.2042444969 -0.2326864260
0.4575707404 0.4562591965 0.3826469470
0.4923438909 0.4946174901 0.3823616873
0.4892243878 -0.4800603266 0.4316084077
-0.4780518420 0.4724881511 0.2133228585
-0.4848924609 -0.4745265648 0.3454501636
-0.4963649194 -0.4817108468 0.4197461567
-0.4922929719 -0.4772228960 0.4277032783
-0.4926970530 0.4957438450 0.3791615557
-0.4893782581 0.4921876971 0.3800933960
-0.4547205247 0.4620723442 0.3814777377
-0.4711327619 0.4602235649 0.1303602848
-0.4918997971 0.4964038548 0.3708458441
-0.4943103789 0.4971366453 0.3746872789
0.4511912130 0.4514603184 0.2143872070
-0.4627833864 0.4481717051 0.0474865652
-0.4541593768 -0.4543861174 0.2597348039
-0.4542398824 -0.4500993674 0.3437657848
-0.4543203874 -0.4458126546 0.4277960352
-0.4901721534 -0.4759064388 0.4294346643
0.4576551956 -0.4669967837 0.0110006073
0.4907602737 -0.4787863496 0.4259391188
0.4920373444 0.4952214236 0.3824387540
0.4761851299 0.4701232814 0.2147269859
0.4952829135 0.4980041486 0.3734974893
0.4521123431 0.4423972410 0.1306017369
0.4920043904 -0.4783704653 0.4262291665
0.4912910104 -0.4809931304 0.4299333306
0.4582907238 -0.4646528594 0.0110186858
-0.4574547333 0.4510747825 0.2135373955
-0.4905275513 -0.4806405623 0.4285004031
0.4936604950 0.4966127673 0.3779677568
0.4580199808 0.4574903218 0.3825845729
-0.4881492388 0.4947964409 0.3798495557
0.4582618390 0.4459390317 0.1304269477
-0.4699037427 0.4628323087 0.1301164445
-0.4915934838 0.4970075115 0.3709235121
-0.4932953613 -0.4789481951 0.4231157190
-0.4777013574 -0.4715251281 0.2616703641
-0.4577289078 -0.4659569784 0.0100967350
-0.4573029083 0.4435802212 -0.0341165611
-0.4733223076 0.4435874571 -0.0341322775
0.4513354287 0.4431697962 -0.0332251056
-0.4927831858 -0.4829119648 0.4189168428
-0.4521800225 0.4550888009 0.3818364296
0.4749596801 0.4727331338 0.2144807376
0.4884456405 0.4928316779 0.3810217198
0.4631814751 0.4518287855 0.0479098976
0.4946406464 0.4976839672 0.3704179306
0.4896700899 -0.4796780186 0.4302891019
-0.4780745370 -0.4720629115 0.2616242122
0.4510286238 0.4562620472 0.3826405339
-0.4900301762 0.4921267214 0.3800482833
0.4881679504 0.4934234638 0.3809655297
-0.4898849541 0.4962686156 0.3755663195
0.4907809677 -0.4807814244 0.4239479313
0.4943689614 0.4995675241 0.3709055301
-0.4833531836 -0.4734428391 0.3456076706
0.4563411368 -0.4603306458 0.0081621802
0.4525638893 -0.4603289396 0.0081584744
0.4562607356 -0.4560438958 0.0921931611
0.4524835926 -0.4560421897 0.0921894554
0.4937225728 -0.4837529432 0.4234744537
-0.4959226608 0.4985293834 0.3702138432
0.4923664792 0.4963993875 0.3801785557
0.4927459160 0.4981761431 0.3753757970
0.4768370795 0.4700617433 0.2146836741
-0.2316216030 -0.2362350100 -0.1703926409
0.1990654778 -0.2364295481 -0.1699700984
-0.4573471965 -0.4530139685 0.1754130554
-0.4571872310 -0.4615874149 0.0073521361
-0.4506438607 -0.4615903705 0.0073585557
-0.4507243663 -0.4573036205 0.0913895365
-0.4572666919 -0.4573006653 0.0913831179
0.4911234967 0.4967847990 0.3798467949
0.4955524331 -0.4815685183 0.4203776630
-0.4510915966 0.4564937478 0.2975167909
-0.4927139560 0.4975257177 0.3769775506
0.4531677977 0.4460288935 0.2146661790
0.4557513999 0.4460277266 0.2146687137
-0.4943272827 0.4989185606 0.3725041086
0.4830184714 -0.4772083078 0.3464494140
0.4904804982 0.4964646179 0.3767672356
-0.4944798209 -0.4816959220 0.4247328278
0.4567522245 -0.4635677435 0.0111731733
-0.4892444307 0.4963747962 0.3808572145
-0.4708834324 -0.4690615280 0.1778433694
0.4550429330 -0.4643645844 0.0112854145
0.4505805145 0.4574935778 0.3825772794
-0.4923834773 -0.4803376821 0.4290671213
-0.4553202932 0.4372443550 -0.0356085648
0.4508222682 0.4459422877 0.1304196542
-0.4950137282 -0.4843291208 0.4203576346
0.4921036481 0.4978559989 0.3722969688
-0.4500489759 0.4454944961 0.1295804671
0.4638334246 0.4517672474 0.0478665858
-0.4908577574 0.4977676391 0.3763837725
0.4906861086 -0.4814148553 0.4241827888
0.4755922350 0.4704025313 0.2147383254
0.4852020420 0.4827330773 0.2974769452
0.4530908490 0.4574047786 0.2983355186
0.4556744522 0.4574035584 0.2983370100
-0.4507730548 0.4344960423 -0.0383575901
-0.4502773823 0.4442044227 0.1296460599
0.4546239132 0.4447710977 0.0462343475
0.4885053148 -0.4791310447 0.4303977528
0.4899852170 0.4938939100 0.3807578980
0.4895397441 0.4951447357 0.3787617811
-0.4530115912 0.4332068769 -0.0382939693
-0.4543227727 0.4332074692 -0.0382952557
-0.4939068748 -0.4790623659 0.4233939963
-0.4624406495 0.4519049586 0.0470213146
0.4681920102 0.4604746255 0.1315047413
-0.4765363034 -0.4709792385 0.2617806748
0.1139217449 0.0872491823 -0.3325412333
-0.1183872305 0.0873541145 -0.3327691492
0.4551084334 -0.4598814226 0.0081380826
0.4537970429 -0.4598808303 0.0081367960
0.4550280322 -0.4555946727 0.0921690635
0.4537166418 -0.4555940803 0.0921677769
0.4549476331 -0.4513080292 0.1761979576
0.4536362426 -0.4513074368 0.1761966710
0.4548673364 -0.4470212792 0.2602289387
0.4535558415 -0.4470206868 0.2602276520
0.4908459159 -0.4819012206 0.4273030304
-0.4533288384 0.4577848306 0.2974487843
-0.4546400199 0.4577854228 0.2974474979
-0.4914982808 0.4976613541 0.3710928828
0.4578137297 0.4471704579 0.1303636985
0.4783759248 0.4711239652 0.2144196429
0.4936259185 -0.4802113593 0.4219237892
0.4582281214 -0.4635984150 0.0083306897
0.4544508739 -0.4635967089 0.0083269839
0.4506737309 -0.4635950028 0.0083232782
0.4505933297 -0.4593082528 0.0923542591
-0.4825660384 0.4811993815 0.2969533630
-0.4643215873 0.4492352657 0.0472205638
-0.4568785563 0.4564962574 0.2975111187
-0.4905006770 0.4964342182 0.3813288623
0.4763662265 -0.4747386233 0.2626092038
-0.4921414542 -0.4824800321 0.4241911211
-0.4937273295 0.4992198614 0.3723811434
-0.4559722108 0.4371833526 -0.0356541991
0.4923818025 -0.4806272809 0.4216330111
0.4570487117 0.4381081422 0.0465765741
0.4780023963 0.4705936339 0.2145195681
-0.4921140035 0.4978270558 0.3768553159
-0.4502760877 0.4467846709 0.1295144326
-0.4519352293 0.4487620563 0.1294119689
-0.4557131037 0.4487637628 0.1294082624
0.4888580788 0.4950731749 0.3812383431
-0.4924700386 0.4991603399 0.3719096064
-0.4576026352 0.4454978037 0.1295730616
-0.4939796269 -0.4801820946 0.4267490646
0.4549838443 0.4397841912 -0.0349800455
0.4518740418 0.4610374576 0.3823977314
0.4567299058 0.4610352642 0.3824024955
0.4818529655 -0.4766613655 0.3465574382
-0.4565600145 0.4344985519 -0.0383632623
-0.4915765262 -0.4794195309 0.4312214770
-0.4915685082 -0.4798464760 0.4228522897
0.4814799731 -0.4761232451 0.3466028580
-0.4573755235 0.4442075245 0.1296391013
0.1138053378 -0.1447571674 -0.3207057907
-0.1185036376 -0.1446522352 -0.3209337066
-0.4910356463 -0.4772132395 0.4272282122
-0.4903321137 -0.4798365818 0.4309330360
-0.4896874391 0.4958599643 0.3795828240
0.4924412734 0.4983763260 0.3725809246
-0.4744189829 0.4715434863 0.2137459046
-0.4547267507 0.4375230158 -0.0355971047
0.4511090238 0.4519751418 0.2986106070
0.4576510359 0.4519721868 0.2986170253
0.4908181228 0.4969849822 0.3770519218
0.4891949722 0.4955936385 0.3815229190
0.4568612437 0.4371128006 -0.0347771089
0.4948054513 -0.4829601540 0.4235432172
-0.4897570658 0.4928359034 0.3799404979
0.4697146084 -0.4722689391 0.1787689942
0.4924026011 -0.4826223610 0.4196417194
0.4511544892 -0.4445846095 0.4285995152
0.4569411354 -0.4445872233 0.4286051924
0.4919642956 -0.4780526663 0.4317817575
0.4512716130 0.4471733086 0.1303572855
-0.4915673317 0.4931902443 0.3797815526
-0.4913693470 0.4942287085 0.3754663265
0.4521927431 0.4381102312 0.0465718153
-0.4573742289 0.4467877727 0.1295074740
0.4542987358 0.4543745021 0.3827399579
-0.4813678275 -0.4748331964 0.3457286220
0.4879648920 -0.4779593501 0.4304751325
0.4581003808 0.4532033121 0.2985546513
0.4752014519 -0.4741916813 0.2627172287
0.4583422389 0.4416520219 0.0463970262
-0.4960947686 -0.4835353914 0.4204235448
0.4929464986 0.4987284115 0.3728742514
0.4918694366 -0.4786860972 0.4320166149
-0.4571356787 0.4377163483 -0.0358195465
0.4894673168 -0.4783482620 0.4281159526
0.4563379630 -0.4668644782 0.0084954936
0.4525607155 -0.4668627720 0.0084917877
0.4524803143 -0.4625760221 0.0925227687
-0.4939984250 -0.4821771515 0.4247578384
0.4557548522 0.4531166530 0.2143070831
0.4841269452 0.4812082067 0.2977650223
-0.4520995178 0.4508017751 0.2978061951
-0.4558763474 0.4508034811 0.2978024897
-0.4501958330 0.4399175167 0.0456161342
-0.4819735407 0.4814780427 0.2969648221
-0.4508067634 -0.4567888502 0.1756118929
-0.4573490890 -0.4567858951 0.1756054743
-0.4508872680 -0.4525021534 0.2596418304
-0.4574295936 -0.4524991983 0.2596354118
-0.4506457532 -0.4653622970 0.0075509747
-0.4571880788 -0.4653593419 0.0075445560
-0.4507262588 -0.4610755470 0.0915819555
-0.4572685844 -0.4610725919 0.0915755369
0.4924675492 -0.4837421519 0.4229969228
-0.4910122672 0.4928953196 0.3804120423
0.4883831126 -0.4792505542 0.4309453118
0.4918023790 0.4943642572 0.3805503758
0.4630622591 -0.4697992545 0.0949287839
-0.4955218225 -0.4809018352 0.4190847133
-0.4942389198 0.4956809681 0.3714644278
0.4903213675 -0.4796223090 0.4302391805
-0.4577662451 -0.4798775469 0.0129921989
-0.4737845995 -0.4798703116 0.0129764834
0.4508728233 -0.4802879723 0.0138836551
-0.1258673475 0.0830763347 -0.2904379258
0.0935774224 0.0829772132 -0.2902226308
-0.4926255932 0.4942881252 0.3759378699
-0.4832179561 0.4811382748 0.2969077340
0.4747916167 0.4721057685 0.2145774407
0.4915239575 0.4949560435 0.3804941850
-0.4929826737 0.4956214470 0.3709928898
-0.4891560686 0.4931372410 0.3798182642
-0.4510121359 0.4522066852 0.2134858250
0.4944060256 0.4949053043 0.3749610307
-0.4927980594 -0.4775439072 0.4280293467
0.4918988792 -0.4811080748 0.4216570756
-0.4745488578 -0.4723695968 0.2619016283
-0.4956880868 -0.4813880533 0.4222046350
0.4584007159 0.4381750222 -0.0350411395
-0.4847240176 -0.4764065349 0.3454091871
-0.4545764093 -0.4668013938 0.0103290426
0.4927829802 0.4935139233 0.3794312976
0.4532481977 0.4417418838 0.1306362574
0.4558317999 0.4417407168 0.1306387922
0.4681761092 -0.4711838231 0.1789234817
0.4960291762 0.4962966480 0.3704900335
0.4906467452 -0.4810970566 0.4297353805
-0.4518547248 0.4444751508 0.0453820421
0.4819913667 0.4842451075 0.2975348232
0.4695269704 0.4591408575 0.1315740610
0.4506609145 0.4532065681 0.2985473578
0.4509026681 0.4416552780 0.0463897326
-0.4499684715 0.4412074863 0.0455505456
-0.4926505940 -0.4790527089 0.4229189292
-0.4919470621 -0.4816760139 0.4266244834
0.4531712500 0.4531177157 0.2143045537
-0.4955945746 -0.4820215639 0.4224397816
0.4947436509 0.4954257357 0.3752449812
-0.4889280762 -0.4762402856 0.4295263251
-0.4771663197 -0.4711481031 0.2617248720
-0.4572950190 0.4399206191 0.0456091746
-0.4702254547 0.4593246140 0.1305534707
-0.4931834566 -0.4816859081 0.4185437371
0.4564107445 -0.4673295171 0.0110896179
0.4931206048 0.4940343920 0.3797159785
0.4917167671 -0.4776359462 0.4301868886
-0.4700302157 -0.4722182595 0.1778200598
0.4941625118 -0.4829545825 0.4204470400
0.4547043142 0.4404840347 -0.0377966174
0.4836697494 -0.4771526195 0.3463990753
0.4577314370 0.4476852281 0.2145860550
0.4817867502 0.4818492223 0.2978681681
0.4565233155 0.4408463616 -0.0352430274
-0.4532483329 0.4534977675 0.2134178194
-0.4545605592 0.4534983602 0.2134165320
0.4621593915 -0.4663701611 0.0951023935
-0.4677309328 -0.4699059967 0.1780746335
-0.4779050478 -0.4739429352 0.2615821934
0.4578940252 0.4428834482 0.0463337769
0.4746609243 -0.4730199654 0.2627950257
0.4941013830 0.4951055915 0.3721661529
0.4844022594 0.4844362098 0.2973160667
0.4618967522 -0.4692522590 0.0950378515
-0.4676078073 0.4605551339 0.1306051403
0.4615237598 -0.4687141386 0.0950832714
0.4935859282 -0.4798935604 0.4274763802
-0.4891729717 0.4949191190 0.3776343635
0.4924382082 0.4939628262 0.3821924354
-0.4567980509 0.4522091943 0.2134801538
0.4956845087 0.4967455508 0.3732511714
-0.4843824677 0.4816712177 0.2967413422
-0.4539244888 0.4392255289 -0.0357564168
0.4891845987 0.4955970375 0.3805969143
0.4522731441 0.4338232726 -0.0374591550
0.4571290082 0.4338210792 -0.0374543910
0.4940613581 0.4953542071 0.3777221686
-0.4572937244 0.4425008672 0.0454775472
-0.4501955832 0.4424976611 0.0454845111
-0.4556325992 0.4444767529 0.0453783410
-0.4896290490 -0.4766055387 0.4292908102
0.4887194993 -0.4797398973 0.4312815059
0.4850652530 -0.4751662354 0.3463472008
-0.4632112460 -0.4697546599 0.0939930660
-0.4956133727 -0.4840166208 0.4204485554
-0.4503579410 -0.4555578291 0.1755495237
-0.4577977207 -0.4555544686 0.1755422246
-0.4578782253 -0.4512677718 0.2595721620
-0.4501969308 -0.4641312759 0.0074886054
-0.4576367105 -0.4641279154 0.0074813063
-0.4502763916 -0.4598445263 0.0915195873
-0.4577172161 -0.4598411654 0.0915122872
-0.4908734615 -0.4761884878 0.4295792512
-0.4821091062 -0.4737766966 0.3456991227
-0.4575221307 0.4412107938 0.0455431401
-0.4703483947 -0.4686845029 0.1778978772
-0.4943689609 -0.4844336345 0.4201608448
0.4641510050 0.4482592640 0.0483042391
0.4519544418 0.4567504478 0.2983678099
0.4568103068 0.4567482012 0.2983715305
-0.4556358774 0.4379431293 0.0457116436
-0.4503568423 0.4484907016 0.2136760197
0.4571745347 0.4407847706 -0.0352873832
-0.4931360693 -0.4780329457 0.4283648792
0.4548722463 -0.4662444544 0.0112430619
0.4511894248 0.4476880788 0.2145796421
-0.4918909117 0.4950481542 0.3813982389
-0.4644873271 0.4498620514 0.0471235705
0.4900039101 -0.4810914851 0.4266392033
-0.4678860377 0.4599635160 0.1306612076
-0.4609130079 -0.4674423965 0.0942476388
0.4680094108 -0.4705502812 0.1789548162
0.4689333451 0.4594200545 0.1315843563
0.4715488522 0.4620071484 0.1310343417
0.4924783376 0.4937141062 0.3766364252
0.4928576691 0.4954908991 0.3718343968
0.4908551870 0.4923227625 0.3811074223
-0.4919067706 0.4968301680 0.3792149600
0.4912346230 0.4940995553 0.3763053940
0.4513520130 0.4428862989 0.0463273639
0.4896114723 0.4927082169 0.3807764956
-0.4931958347 0.4970446103 0.3770016322
0.4929809220 -0.4803152852 0.4217258384
0.4911770757 -0.4764642520 0.4302642690
0.4784129036 -0.4726965508 0.2625069905
-0.4563933210 -0.4672910597 0.0101660713
-0.4892021154 -0.4794975530 0.4294077869
0.4703658855 -0.4722131975 0.1787196989
-0.4915835536 0.4956518105 0.3814759079
0.4909152720 -0.4793463396 0.4301999366
0.4882537114 -0.4786529499 0.4306416628
0.4911517929 -0.4824997104 0.4248226297
-0.4948091614 0.4984374532 0.3725281901
0.4559121999 0.4374538114 0.0466088653
-0.4526253727 -0.4670204248 0.0076336657
-0.4552101241 -0.4670192573 0.0076311298
-0.4944130078 -0.4793833393 0.4237207941
-0.4896478478 -0.4786005583 0.4273003144
-0.4635304697 -0.4662209028 0.0940708825
0.4543791357 0.4500874923 0.2987100364
0.4915500683 -0.4770023830 0.4302186404
0.4581807818 0.4489162491 0.2145236863
-0.4884011335 0.4955008916 0.3802816235
0.4584225354 0.4373649589 -0.0376339389
0.4713442367 0.4596112100 0.1313666432
0.4905835020 0.4942063194 0.3815950218
0.4613570614 -0.4680805967 0.0951146059
-0.4565035666 -0.4520105891 0.1753626773
-0.4516474935 -0.4520127826 0.1753674415
-0.4565840712 -0.4477238923 0.2593926147
-0.4517279982 -0.4477260858 0.2593973790
-0.4514875281 -0.4605862289 0.0073065222
-0.4563425563 -0.4605840359 0.0073017590
-0.4515680337 -0.4562994789 0.0913375031
-0.4564230619 -0.4562972859 0.0913327398
0.4532516500 0.4488308102 0.1302746268
0.4558352522 0.4488296432 0.1302771615
0.4559391351 -0.4388949688 0.4283138482
0.4521619921 -0.4388932627 0.4283101425
-0.4918195773 -0.4782760592 0.4292310306
-0.4942655417 -0.4808921782 0.4186096462
-0.4557958419 0.4465164180 0.2137715248
-0.4574560283 0.4484938040 0.2136690601
-0.4895543356 -0.4792340690 0.4275354610
-0.4941606199 0.4981166887 0.3694498978
-0.4924443623 -0.4830782523 0.4217100189
0.3493046036 -0.3694592465 -0.0975837036
0.4899412348 0.4938861379 0.3785154632
0.4618116458 0.4489002793 0.0484073858
0.4785439868 0.4717505490 0.2143240257
-0.4890788135 0.4955729674 0.3778038375
0.4931868040 0.4966688629 0.3695741985
0.4955901910 0.4973994844 0.3734204606
-0.4751613204 0.4704895855 0.2138240641
0.4915636541 0.4952774820 0.3740444653
0.4939670404 0.4960081406 0.3778914577
-0.4567115010 -0.4637572499 0.0102449322
-0.4895202947 -0.4759637804 0.4294859174
0.4848985546 -0.4745326935 0.3463785353
-0.4938886087 0.5000000000 0.3699380308
0.4923093756 -0.4778877365 0.4289892013
0.4615339561 0.4494920440 0.0483507784
-0.4811712789 0.4831804516 0.2968055153
-0.4577871340 -0.4653034157 0.0101114602
-0.4823841902 -0.4770339688 0.3455804791
0.4515588197 -0.4611705176 0.0082004437
0.4573454659 -0.4611731314 0.0082061209
0.4514784185 -0.4568837676 0.0922314246
-0.4706234796 -0.4719417219 0.1777802771
-0.4922752820 0.4986071571 0.3744114728
0.4904802466 -0.4800721617 0.4320859926
0.4579744262 0.4385964896 -0.0376971934
-0.4777736141 0.4730790407 0.2132689205
-0.4906630009 0.4972143573 0.3788857486
0.4896339570 0.4944900718 0.3785925292
0.4692093906 0.4626480573 0.1311354015
-0.4509316315 0.4479196754 0.1294559035
0.4928802581 0.4972727593 0.3696505348
0.4533285977 0.4374548740 0.0466063358
0.4912571076 0.4958814155 0.3741215320
-0.4754341960 0.4737179938 0.2133756088
-0.4501150777 0.4382107024 -0.0385464591
-0.4517752641 0.4401880883 -0.0386489238
0.4934572584 -0.4792959618 0.4271726277
-0.4900144595 0.4968935928 0.3758074564
0.4627525650 -0.4660942126 0.0950627314
0.4547055469 -0.4656108593 0.0112754398
-0.4775712932 0.4706829185 0.2136016213
0.4507412110 0.4489195051 0.2145163928
0.4900123005 -0.4759172780 0.4303729199
-0.4912439974 -0.4784449708 0.4249822576
0.4557792067 -0.4671579959 0.0111440765
-0.4539170147 -0.4634753774 0.0074515815
0.4509830691 0.4373682150 -0.0376412324
-0.4748275380 -0.4717754833 0.2618972064
-0.4850016520 -0.4758124751 0.3454037228
-0.4498879660 0.4369204232 -0.0384804193
-0.4536647956 0.4369221292 -0.0384841247
-0.4916277861 0.4982864357 0.3713340143
-0.4924873645 -0.4780279576 0.4252699692
-0.4917838326 -0.4806512627 0.4289755234
-0.4612761372 0.4513712320 0.0471867002
0.4568907069 0.4524612958 0.2143416036
-0.4917341167 0.4938169527 0.3796850852
0.4916254383 -0.4829323791 0.4223338260
0.4578262242 -0.4421627381 0.4284823579
0.4540489767 -0.4421610319 0.4284786521
0.4502718337 -0.4421593258 0.4284749463
0.4578118370 0.4433982184 0.1305561335
-0.4644376422 -0.4671335717 0.0939711607
-0.4827023701 -0.4735001590 0.3456593400
0.3496571833 0.3332532768 -0.1334314887
-0.3539698281 0.3335710998 -0.1341218097
0.4782462052 -0.4720630090 0.2625383250
-0.4903519628 0.4974143664 0.3760914749
-0.4634132344 0.4483361568 0.0474127127
0.4778732128 -0.4715248886 0.2625837448
0.4651090407 -0.4677571821 0.0948265707
0.4585680467 0.4388017107 -0.0351367627
-0.4755662662 -0.4745703154 0.2617545278
-0.4638045099 -0.4694781223 0.0939532834
-0.4887386368 0.4960215608 0.3805656474
0.4939896295 0.4977900008 0.3757075958
0.4851434888 0.4833817964 0.2973967197
-0.4531678285 0.4492107577 0.1293878980
-0.4544800548 0.4492113504 0.1293866105
-0.4610738173 0.4489751630 0.0475204443
0.4514324140 0.4385993402 -0.0377036064
0.4956126757 0.4991813392 0.3712364942
-0.4960269108 -0.4812228092 0.4194115122
-0.4912627956 -0.4804400277 0.4229910314
-0.4567175464 0.4479221845 0.1294502323
0.4561009460 -0.4636244752 0.0112235652
0.4681334581 0.4611232914 0.1314234724
-0.4942057314 -0.4834088832 0.4225118848
0.4547029122 -0.4458769106 0.4286688401
0.4533915217 -0.4458763182 0.4286675535
0.4548637134 -0.4544503573 0.2606079216
0.4535522185 -0.4544497649 0.2606066349
0.4547833123 -0.4501636073 0.3446389026
0.4534718174 -0.4501630149 0.3446376159
0.4833600553 -0.4734475776 0.3465330227
-0.4680085683 -0.4693118836 0.1780702127
-0.4636861100 0.4515645650 0.0469642574
0.4898752404 -0.4804938865 0.4263354508
-0.4781826833 -0.4733488222 0.2615777725
-0.4572132189 0.4382138042 -0.0385534177
0.4927733219 -0.4843406470 0.4205164177
-0.4555520937 0.4401896899 -0.0386526239
-0.4885229274 0.4953262697 0.3797488356
-0.4574426700 0.4369237313 -0.0384878258
-0.4911682386 -0.4810735388 0.4232261790
-0.4906610694 0.4922912002 0.3799749514
0.4520347383 0.4524633848 0.2143368448
-0.4576197172 -0.4646699715 0.0101441659
-0.4519385078 0.4422278066 0.1297453034
0.4712208625 -0.4690551508 0.1787445780
-0.4569865849 -0.4670145222 0.0101262886
0.4753332081 0.4732626304 0.2143808549
-0.4919652887 0.4988070624 0.3716172034
0.4512697203 0.4434010691 0.1305497204
-0.4883206072 0.4929301847 0.3800822667
0.4927859405 0.4979266928 0.3698198239
0.4911627899 0.4965353491 0.3742908211
0.4917676674 0.4967004994 0.3800544517
-0.4913355476 -0.4815597564 0.4263460997
-0.4576761516 0.4388735946 -0.0360171886
0.4950131322 0.4994832191 0.3711130826
0.4915622894 -0.4792793721 0.4321547554
0.4915710387 -0.4797063122 0.4237856732
0.4933899822 0.4980918435 0.3755834537
0.4767077060 -0.4709778930 0.2626928124
0.4559359613 -0.4454288012 0.4286471616
0.4521588183 -0.4454270951 0.4286434559
0.4928151547 -0.4792903906 0.4240764513
-0.4713647583 -0.4708852221 0.1777507777
0.4905117733 0.4966421130 0.3795804490
-0.4743601033 0.4721920991 0.2136647510
0.4777433685 0.4734537862 0.2141631411
0.4534089987 0.4331679154 -0.0374246345
0.4559926009 0.4331667484 -0.0374220997
0.4513274017 0.4271715063 -0.0324089777
0.4544595367 0.4458004293 0.2146790714
-0.4941023129 -0.4798673897 0.4209614166
-0.4933987803 -0.4824907321 0.4246662404
0.4582611818 0.4446292393 0.1304937647
0.4950787873 -0.4811368930 0.4228665200
0.4909936194 -0.4766452950 0.4308149082
0.4649423413 -0.4671235870 0.0948589486
-0.4928589451 -0.4802844402 0.4206729746
0.4895021788 0.4920890701 0.3810348807
0.4645693489 -0.4665854666 0.0949043685
0.4533320500 0.4445438005 0.0462447052
0.4559156522 0.4445426335 0.0462472399
-0.4630925675 0.4518432258 0.0469757174
-0.4557163822 0.4422294087 0.1297416023
0.4764985240 0.4737945742 0.2142177923
0.4915917320 -0.4817013497 0.4217952161
-0.4540912744 0.4398522640 -0.0358523624
-0.4849229415 0.4828286216 0.2965447382
0.4574928465 0.4372767869 -0.0348497292
-0.4560804389 -0.4635862990 0.0103006295
-0.4544639179 0.4403829323 -0.0359530197
0.4700560879 -0.4685082088 0.1788526029
-0.4909328995 0.4955194611 0.3795256677
-0.4712396231 0.4614990167 0.1301831811
0.4651683844 0.4504328534 0.0479359374
-0.4540788727 -0.4586738576 0.1757049197
-0.4539189073 -0.4672473040 0.0076440004
-0.4539983681 -0.4629605544 0.0916749823
0.4579169996 -0.4641157821 0.0110641582
0.4914968730 -0.4823347806 0.4220300735
-0.4508511270 0.4436326656 0.0454259821
-0.4566370419 0.4436352791 0.0454203056
-0.4939375288 0.4953378244 0.3739935513
-0.4952878172 -0.4826151161 0.4225785243
-0.4928777433 -0.4822794971 0.4186817484
-0.4709613938 0.4620905834 0.1301281625
0.4886565523 -0.4774272560 0.4302693450
-0.4923242022 0.4939449815 0.3784669934
-0.4924592359 -0.4777101947 0.4308225228
0.4901541290 0.4920275001 0.3809909428
-0.4955498099 0.4967306242 0.3695192755
0.4648899623 0.4510246716 0.0478803727
-0.4542360969 -0.4425544709 0.3433808936
-0.4543166018 -0.4382677582 0.4274111441
0.4508216110 0.4446324954 0.1304864712
-0.4686219757 0.4627295365 0.1302348508
3 344 1320 158
3 344 679 1320
3 344 78 679
3 344 692 78
3 344 1351 692
3 344 265 1351
3 344 1143 265
3 344 1009 1143
3 344 1094 1009
3 344 793 1094
3 344 526 793
3 344 1203 526
3 344 18 1203
3 344 1301 18
3 344 986 1301
3 344 972 986
3 344 250 972
3 344 158 250
3 158 390 1193
3 158 1320 390
3 1320 334 390
3 1320 679 334
3 679 525 334
3 679 78 525
3 78 328 525
3 78 692 328
3 692 988 328
3 692 1351 988
3 1351 740 988
3 1351 265 740
3 265 770 740
3 265 1143 770
3 1143 610 770
3 1143 1009 610
3 1009 184 610
3 1009 1094 184
3 1094 402 184
3 1094 793 402
3 793 1040 402
3 793 526 1040
3 526 817 1040
3 526 1203 817
3 1203 459 817
3 1203 18 459
3 18 365 459
3 18 1301 365
3 1301 79 365
3 1301 986 79
3 986 64 79
3 986 972 64
3 972 723 64
3 972 250 723
3 250 1193 723
3 250 158 1193
3 1193 46 264
3 1193 390 46
3 390 816 46
3 390 334 816
3 334 202 816
3 334 525 202
3 525 811 202
3 525 328 811
3 328 82 811
3 328 988 82
3 988 368 82
3 988 740 368
3 740 1277 368
3 740 770 1277
3 770 1121 1277
3 770 610 1121
3 610 633 1121
3 610 184 633
3 184 914 633
3 184 402 914
3 402 629 914
3 402 1040 629
3 1040 747 629
3 1040 817 747
3 817 114 747
3 817 459 114
3 459 27 114
3 459 365 27
3 365 529 27
3 365 79 529
3 79 1079 529
3 79 64 1079
3 64 1216 1079
3 64 723 1216
3 723 264 1216
3 723 1193 264
3 264 480 738
3 264 46 480
3 46 1307 480
3 46 816 1307
3 816 627 1307
3 816 202 627
3 202 1302 627
3 202 811 1302
3 811 517 1302
3 811 82 517
3 82 845 517
3 82 368 845
3 368 887 845
3 368 1277 887
3 1277 220 887
3 1277 1121 220
3 1121 1144 220
3 1121 633 1144
3 633 498 1144
3 633 914 498
3 914 550 498
3 914 629 550
3 629 362 550
3 629 747 362
3 747 563 362
3 747 114 563
3 114 473 563
3 114 27 473
3 27 183 473
3 27 529 183
3 529 160 183
3 529 1079 160
3 1079 280 160
3 1079 1216 280
3 1216 738 280
3 1216 264 738
3 738 143 367
3 738 480 143
3 480 920 143
3 480 1307 920
3 1307 1135 920
3 1307 627 1135
3 627 933 1135
3 627 1302 933
3 1302 1029 933
3 1302 517 1029
3 517 1330 1029
3 517 845 1330
3 845 1344 1330
3 845 887 1344
3 887 1237 1344
3 887 220 1237
3 220 777 1237
3 220 1144 777
3 1144 1007 777
3 1144 498 1007
3 498 229 1007
3 498 550 229
3 550 852 229
3 550 362 852
3 362 240 852
3 362 563 240
3 563 966 240
3 563 473 966
3 473 632 966
3 473 183 632
3 183 607 632
3 183 160 607
3 160 1319 607
3 160 280 1319
3 280 367 1319
3 280 738 367
3 367 584 865
3 367 143 584
3 143 19 584
3 143 920 19
3 920 762 19
3 920 1135 762
3 1135 26 762
3 1135 933 26
3 933 638 26
3 933 1029 638
3 1029 969 638
3 1029 1330 969
3 1330 415 969
3 1330 1344 415
3 1344 296 415
3 1344 1237 296
3 1237 1280 296
3 1237 777 1280
3 777 97 1280
3 777 1007 97
3 1007 683 97
3 1007 229 683
3 229 462 683
3 229 852 462
3 852 676 462
3 852 240 676
3 240 552 676
3 240 966 552
3 966 285 552
3 966 632 285
3 632 266 285
3 632 607 266
3 607 389 266
3 607 1319 389
3 1319 865 389
3 1319 367 865
3 1061 865 584
3 1061 584 19
3 1061 19 762
3 1061 762 26
3 1061 26 638
3 1061 638 969
3 1061 969 415
3 1061 415 296
3 1061 296 1280
3 1061 1280 97
3 1061 97 683
3 1061 683 462
3 1061 462 676
3 1061 676 552
3 1061 552 285
3 1061 285 266
3 1061 266 389
3 1061 389 865
3 548 487 1136
3 548 1222 487
3 548 195 1222
3 548 65 195
3 548 640 65
3 548 461 640
3 548 980 461
3 548 60 980
3 548 895 60
3 548 152 895
3 548 839 152
3 548 1014 839
3 548 1142 1014
3 548 506 1142
3 548 177 506
3 548 1059 177
3 548 1153 1059
3 548 1136 1153
3 1136 527 332
3 1136 487 527
3 487 1274 527
3 487 1222 1274
3 1222 238 1274
3 1222 195 238
3 195 85 238
3 195 65 85
3 65 691 85
3 65 640 691
3 640 505 691
3 640 461 505
3 461 197 505
3 461 980 197
3 980 951 197
3 980 60 951
3 60 947 951
3 60 895 947
3 895 721 947
3 895 152 721
3 152 871 721
3 152 839 871
3 839 1063 871
3 839 1014 1063
3 1014 618 1063
3 1014 1142 618
3 1142 47 618
3 1142 506 47
3 506 730 47
3 506 177 730
3 177 1095 730
3 177 1059 1095
3 1059 1191 1095
3 1059 1153 1191
3 1153 332 1191
3 1153 1136 332
3 332 568 1249
3 332 527 568
3 527 1304 568
3 527 1274 1304
3 1274 269 1304
3 1274 238 269
3 238 142 269
3 238 85 142
3 85 745 142
3 85 691 745
3 691 537 745
3 691 505 537
3 505 1073 537
3 505 197 1073
3 197 153 1073
3 197 951 153
3 951 982 153
3 951 947 982
3 947 241 982
3 947 721 241
3 721 929 241
3 721 871 929
3 871 515 929
3 871 1063 515
3 1063 665 515
3 1063 618 665
3 618 71 665
3 618 47 71
3 47 246 71
3 47 730 246
3 730 1137 246
3 730 1095 1137
3 1095 1246 1137
3 1095 1191 1246
3 1191 1249 1246
3 1191 332 1249
3 1249 598 1289
3 1249 568 598
3 568 1336 598
3 568 1304 1336
3 1304 322 1336
3 1304 269 322
3 269 194 322
3 269 142 194
3 142 787 194
3 142 745 787
3 745 81 787
3 745 537 81
3 537 1124 81
3 537 1073 1124
3 1073 1038 1124
3 1073 153 1038
3 153 463 1038
3 153 982 463
3 982 260 463
3 982 241 260
3 241 968 260
3 241 929 968
3 929 1140 968
3 929 515 1140
3 515 722 1140
3 515 665 722
3 665 107 722
3 665 71 107
3 71 283 107
3 71 246 283
3 246 608 283
3 246 1137 608
3 1137 713 608
3 1137 1246 713
3 1246 1289 713
3 1246 1249 1289
3 1289 658 1324
3 1289 598 658
3 598 0 658
3 598 1336 0
3 1336 1218 0
3 1336 322 1218
3 322 1069 1218
3 322 194 1069
3 194 279 1069
3 194 787 279
3 787 630 279
3 787 81 630
3 81 1159 630
3 81 1124 1159
3 1124 1078 1159
3 1124 1038 1078
3 1038 1076 1078
3 1038 463 1076
3 463 305 1076
3 463 260 305
3 260 1011 305
3 260 968 1011
3 968 609 1011
3 968 1140 609
3 1140 758 609
3 1140 722 758
3 722 164 758
3 722 107 164
3 107 337 164
3 107 283 337
3 283 1250 337
3 283 608 1250
3 608 1321 1250
3 608 713 1321
3 713 1324 1321
3 713 1289 1324
3 1324 714 1343
3 1324 658 714
3 658 874 714
3 658 0 874
3 0 1265 874
3 0 1218 1265
3 1218 267 1265
3 1218 1069 267
3 1069 877 267
3 1069 279 877
3 279 162 877
3 279 630 162
3 630 1219 162
3 630 1159 1219
3 1159 1117 1219
3 1159 1078 1117
3 1078 539 1117
3 1078 1076 539
3 1076 1224 539
3 1076 305 1224
3 305 1057 1224
3 305 1011 1057
3 1011 663 1057
3 1011 609 663
3 609 810 663
3 609 758 810
3 758 214 810
3 758 164 214
3 164 366 214
3 164 337 366
3 337 719 366
3 337 1250 719
3 1250 818 719
3 1250 1321 818
3 1321 1343 818
3 1321 1324 1343
3 271 1343 714
3 271 714 874
3 271 874 1265
3 271 1265 267
3 271 267 877
3 271 877 162
3 271 162 1219
3 271 1219 1117
3 271 1117 539
3 271 539 1224
3 271 1224 1057
3 271 1057 663
3 271 663 810
3 271 810 214
3 271 214 366
3 271 366 719
3 271 719 818
3 271 818 1343
3 1239 88 1238
3 1239 99 88
3 1239 1170 99
3 1239 349 1170
3 1239 350 349
3 1239 1171 350
3 1239 98 1171
3 1239 89 98
3 1239 1240 89
3 1239 127 1240
3 1239 970 127
3 1239 1306 970
3 1239 1269 1306
3 1239 1268 1269
3 1239 1305 1268
3 1239 971 1305
3 1239 126 971
3 1239 1238 126
3 1238 87 360
3 1238 88 87
3 88 612 87
3 88 99 612
3 99 299 612
3 99 1170 299
3 1170 347 299
3 1170 349 347
3 349 348 347
3 349 350 348
3 350 300 348
3 350 1171 300
3 1171 617 300
3 1171 98 617
3 98 91 617
3 98 89 91
3 89 361 91
3 89 1240 361
3 1240 131 361
3 1240 127 131
3 127 122 131
3 127 970 122
3 970 430 122
3 970 1306 430
3 1306 1273 430
3 1306 1269 1273
3 1269 1272 1273
3 1269 1268 1272
3 1268 429 1272
3 1268 1305 429
3 1305 123 429
3 1305 971 123
3 971 130 123
3 971 126 130
3 126 360 130
3 126 1238 360
3 360 90 358
3 360 87 90
3 87 616 90
3 87 612 616
3 612 303 616
3 612 299 303
3 299 912 303
3 299 347 912
3 347 913 912
3 347 348 913
3 348 304 913
3 348 300 304
3 300 615 304
3 300 617 615
3 617 605 615
3 617 91 605
3 91 359 605
3 91 361 359
3 361 129 359
3 361 131 129
3 131 120 129
3 131 122 120
3 122 428 120
3 122 430 428
3 430 1271 428
3 430 1273 1271
3 1273 1270 1271
3 1273 1272 1270
3 1272 427 1270
3 1272 429 427
3 429 121 427
3 429 123 121
3 123 128 121
3 123 130 128
3 130 358 128
3 130 360 358
3 358 604 357
3 358 90 604
3 90 614 604
3 90 616 614
3 616 301 614
3 616 303 301
3 303 910 301
3 303 912 910
3 912 911 910
3 912 913 911
3 913 302 911
3 913 304 302
3 304 613 302
3 304 615 613
3 615 603 613
3 615 605 603
3 605 356 603
3 605 359 356
3 359 654 356
3 359 129 654
3 129 118 654
3 129 120 118
3 120 426 118
3 120 428 426
3 428 386 426
3 428 1271 386
3 1271 385 386
3 1271 1270 385
3 1270 425 385
3 1270 427 425
3 427 119 425
3 427 121 119
3 121 653 119
3 121 128 653
3 128 357 653
3 128 358 357
3 357 601 355
3 357 604 601
3 604 611 601
3 604 614 611
3 614 850 611
3 614 301 850
3 301 908 850
3 301 910 908
3 910 909 908
3 910 911 909
3 911 851 909
3 911 302 851
3 302 1200 851
3 302 613 1200
3 613 602 1200
3 613 603 602
3 603 924 602
3 603 356 924
3 356 652 924
3 356 654 652
3 654 116 652
3 654 118 116
3 118 991 116
3 118 426 991
3 426 384 991
3 426 386 384
3 386 383 384
3 386 385 383
3 385 424 383
3 385 425 424
3 425 117 424
3 425 119 117
3 119 651 117
3 119 653 651
3 653 355 651
3 653 357 355
3 355 599 921
3 355 601 599
3 601 1199 599
3 601 611 1199
3 611 848 1199
3 611 850 848
3 850 906 848
3 850 908 906
3 908 907 906
3 908 909 907
3 909 849 907
3 909 851 849
3 851 1198 849
3 851 1200 1198
3 1200 600 1198
3 1200 602 600
3 602 923 600
3 602 924 923
3 924 650 923
3 924 652 650
3 652 641 650
3 652 116 641
3 116 990 641
3 116 991 990
3 991 382 990
3 991 384 382
3 384 381 382
3 384 383 381
3 383 989 381
3 383 424 989
3 424 642 989
3 424 117 642
3 117 649 642
3 117 651 649
3 651 921 649
3 651 355 921
3 922 921 599
3 922 599 1199
3 922 1199 848
3 922 848 906
3 922 906 907
3 922 907 849
3 922 849 1198
3 922 1198 600
3 922 600 923
3 922 923 650
3 922 650 641
3 922 641 990
3 922 990 382
3 922 382 381
3 922 381 989
3 922 989 642
3 922 642 649
3 922 649 921
3 733 23 92
3 733 662 23
3 733 643 662
3 733 352 643
3 733 1093 352
3 733 446 1093
3 733 1105 446
3 733 311 1105
3 733 516 311
3 733 621 516
3 733 1353 621
3 733 7 1353
3 733 287 7
3 733 949 287
3 733 200 949
3 733 956 200
3 733 338 956
3 733 92 338
3 92 465 535
3 92 23 465
3 23 1176 465
3 23 662 1176
3 662 1150 1176
3 662 643 1150
3 643 10 1150
3 643 352 10
3 352 701 10
3 352 1093 701
3 1093 955 701
3 1093 446 955
3 446 718 955
3 446 1105 718
3 1105 797 718
3 1105 311 797
3 311 1028 797
3 311 516 1028
3 516 1116 1028
3 516 621 1116
3 621 431 1116
3 621 1353 431
3 1353 448 431
3 1353 7 448
3 7 776 448
3 7 287 776
3 287 879 776
3 287 949 879
3 949 1233 879
3 949 200 1233
3 200 39 1233
3 200 956 39
3 956 820 39
3 956 338 820
3 338 535 820
3 338 92 535
3 535 125 215
3 535 465 125
3 465 252 125
3 465 1176 252
3 1176 225 252
3 1176 1150 225
3 1150 437 225
3 1150 10 437
3 10 1223 437
3 10 701 1223
3 701 48 1223
3 701 955 48
3 955 1232 48
3 955 718 1232
3 718 397 1232
3 718 797 397
3 797 637 397
3 797 1028 637
3 1028 735 637
3 1028 1116 735
3 1116 72 735
3 1116 431 72
3 431 943 72
3 431 448 943
3 448 392 943
3 448 776 392
3 776 488 392
3 776 879 488
3 879 277 488
3 879 1233 277
3 1233 1048 277
3 1233 39 1048
3 39 1298 1048
3 39 820 1298
3 820 215 1298
3 820 535 215
3 215 546 666
3 215 125 546
3 125 1284 546
3 125 252 1284
3 252 1263 1284
3 252 225 1263
3 225 950 1263
3 225 437 950
3 437 288 950
3 437 1223 288
3 1223 1047 288
3 1223 48 1047
3 48 827 1047
3 48 1232 827
3 1232 900 827
3 1232 397 900
3 397 1149 900
3 397 637 1149
3 637 660 1149
3 637 735 660
3 735 518 660
3 735 72 518
3 72 534 518
3 72 943 534
3 943 873 534
3 943 392 873
3 392 992 873
3 392 488 992
3 488 1317 992
3 488 277 1317
3 277 148 1317
3 277 1048 148
3 1048 930 148
3 1048 1298 930
3 1298 666 930
3 1298 215 666
3 666 227 1178
3 666 546 227
3 546 345 227
3 546 1284 345
3 1284 331 345
3 1284 1263 331
3 1263 43 331
3 1263 950 43
3 950 1322 43
3 950 288 1322
3 288 144 1322
3 288 1047 144
3 1047 1316 144
3 1047 827 1316
3 827 502 1316
3 827 900 502
3 900 778 502
3 900 1149 778
3 1149 310 778
3 1149 660 310
3 660 1031 310
3 660 518 1031
3 518 1050 1031
3 518 534 1050
3 534 1348 1050
3 534 873 1348
3 873 575 1348
3 873 992 575
3 992 1267 575
3 992 1317 1267
3 1317 587 1267
3 1317 148 587
3 148 22 587
3 148 930 22
3 930 1178 22
3 930 666 1178
3 1178 680 245
3 1178 227 680
3 227 833 680
3 227 345 833
3 345 1349 833
3 345 331 1349
3 331 1056 1349
3 331 43 1056
3 43 391 1056
3 43 1322 391
3 1322 1173 391
3 1322 144 1173
3 144 380 1173
3 144 1316 380
3 1316 1012 380
3 1316 502 1012
3 502 1262 1012
3 502 778 1262
3 778 796 1262
3 778 310 796
3 310 644 796
3 310 1031 644
3 1031 664 644
3 1031 1050 664
3 1050 984 664
3 1050 1348 984
3 1348 1097 984
3 1348 575 1097
3 575 882 1097
3 575 1267 882
3 1267 1109 882
3 1267 587 1109
3 587 464 1109
3 587 22 464
3 22 245 464
3 22 1178 245
3 57 245 680
3 57 680 833
3 57 833 1349
3 57 1349 1056
3 57 1056 391
3 57 391 1173
3 57 1173 380
3 57 380 1012
3 57 1012 1262
3 57 1262 796
3 57 796 644
3 57 644 664
3 57 664 984
3 57 984 1097
3 57 1097 882
3 57 882 1109
3 57 1109 464
3 57 464 245
3 217 491 489
3 217 547 491
3 217 86 547
3 217 262 86
3 217 1052 262
3 217 1190 1052
3 217 809 1190
3 217 108 809
3 217 742 108
3 217 739 742
3 217 639 739
3 217 1172 639
3 217 145 1172
3 217 731 145
3 217 585 731
3 217 418 585
3 217 1139 418
3 217 489 1139
3 489 514 28
3 489 491 514
3 491 606 514
3 491 547 606
3 547 979 606
3 547 86 979
3 86 306 979
3 86 262 306
3 262 1106 306
3 262 1052 1106
3 1052 1243 1106
3 1052 1190 1243
3 1190 847 1243
3 1190 809 847
3 809 165 847
3 809 108 165
3 108 785 165
3 108 742 785
3 742 795 785
3 742 739 795
3 739 169 795
3 739 639 169
3 639 1228 169
3 639 1172 1228
3 1172 1033 1228
3 1172 145 1033
3 145 247 1033
3 145 731 247
3 731 115 247
3 731 585 115
3 585 467 115
3 585 418 467
3 418 1197 467
3 418 1139 1197
3 1139 28 1197
3 1139 489 28
3 28 59 56
3 28 514 59
3 514 659 59
3 514 606 659
3 606 1030 659
3 606 979 1030
3 979 1227 1030
3 979 306 1227
3 306 566 1227
3 306 1106 566
3 1106 712 566
3 1106 1243 712
3 1243 903 712
3 1243 847 903
3 847 1053 903
3 847 165 1053
3 165 828 1053
3 165 785 828
3 785 840 828
3 785 795 840
3 795 219 840
3 795 169 219
3 169 1278 219
3 169 1228 1278
3 1228 1071 1278
3 1228 1033 1071
3 1033 284 1071
3 1033 247 284
3 247 176 284
3 247 115 176
3 115 9 176
3 115 467 9
3 467 1252 9
3 467 1197 1252
3 1197 56 1252
3 1197 28 56
3 56 96 93
3 56 59 96
3 59 716 96
3 59 659 716
3 659 1070 716
3 659 1030 1070
3 1030 1275 1070
3 1030 1227 1275
3 1227 597 1275
3 1227 566 597
3 566 771 597
3 566 712 771
3 712 387 771
3 712 903 387
3 903 1108 387
3 903 1053 1108
3 1053 876 1108
3 1053 828 876
3 828 329 876
3 828 840 329
3 840 244 329
3 840 219 244
3 219 1308 244
3 219 1278 1308
3 1278 538 1308
3 1278 1071 538
3 1071 1201 538
3 1071 284 1201
3 284 1060 1201
3 284 176 1060
3 176 38 1060
3 176 9 38
3 9 720 38
3 9 1252 720
3 1252 93 720
3 1252 56 93
3 93 149 146
3 93 96 149
3 96 239 149
3 96 716 239
3 716 1123 239
3 716 1070 1123
3 1070 744 1123
3 1070 1275 744
3 1275 141 744
3 1275 597 141
3 597 268 141
3 597 771 268
3 771 420 268
3 771 387 420
3 387 1151 420
3 387 1108 1151
3 1108 363 1151
3 1108 876 363
3 876 1242 363
3 876 329 1242
3 329 278 1242
3 329 244 278
3 244 788 278
3 244 1308 788
3 1308 574 788
3 1308 538 574
3 538 1253 574
3 538 1201 1253
3 1201 1096 1253
3 1201 1060 1096
3 1060 73 1096
3 1060 38 73
3 38 779 73
3 38 720 779
3 720 146 779
3 720 93 146
3 146 201 1034
3 146 149 201
3 149 270 201
3 149 239 270
3 239 590 270
3 239 1123 590
3 1123 786 590
3 1123 744 786
3 744 711 786
3 744 141 711
3 141 320 711
3 141 268 320
3 268 1334 320
3 268 420 1334
3 420 1189 1334
3 420 1151 1189
3 1151 399 1189
3 1151 363 399
3 363 1287 399
3 363 1242 1287
3 1242 1196 1287
3 1242 278 1196
3 278 829 1196
3 278 788 829
3 788 631 829
3 788 574 631
3 574 1290 631
3 574 1253 1290
3 1253 1138 1290
3 1253 1096 1138
3 1096 111 1138
3 1096 73 111
3 73 259 111
3 73 779 259
3 779 1034 259
3 779 146 1034
3 717 1034 201
3 717 201 270
3 717 270 590
3 717 590 786
3 717 786 711
3 717 711 320
3 717 320 1334
3 717 1334 1189
3 717 1189 399
3 717 399 1287
3 717 1287 1196
3 717 1196 829
3 717 829 631
3 717 631 1290
3 717 1290 1138
3 717 1138 111
3 717 111 259
3 717 259 1034
3 113 62 808
3 113 175 62
3 113 442 175
3 113 523 442
3 113 235 523
3 113 317 235
3 113 579 317
3 113 193 579
3 113 1358 193
3 113 192 1358
3 113 578 192
3 113 318 578
3 113 234 318
3 113 522 234
3 113 443 522
3 113 174 443
3 113 63 174
3 113 808 63
3 808 558 807
3 808 62 558
3 62 173 558
3 62 175 173
3 175 440 173
3 175 442 440
3 442 520 440
3 442 523 520
3 523 232 520
3 523 235 232
3 235 315 232
3 235 317 315
3 317 577 315
3 317 579 577
3 579 190 577
3 579 193 190
3 193 1357 190
3 193 1358 1357
3 1358 191 1357
3 1358 192 191
3 192 576 191
3 192 578 576
3 578 316 576
3 578 318 316
3 318 233 316
3 318 234 233
3 234 521 233
3 234 522 521
3 522 441 521
3 522 443 441
3 443 172 441
3 443 174 172
3 174 559 172
3 174 63 559
3 63 807 559
3 63 808 807
3 807 556 806
3 807 558 556
3 558 171 556
3 558 173 171
3 173 1001 171
3 173 440 1001
3 440 519 1001
3 440 520 519
3 520 230 519
3 520 232 230
3 232 313 230
3 232 315 313
3 315 1163 313
3 315 577 1163
3 577 188 1163
3 577 190 188
3 190 493 188
3 190 1357 493
3 1357 189 493
3 1357 191 189
3 191 1162 189
3 191 576 1162
3 576 314 1162
3 576 316 314
3 316 231 314
3 316 233 231
3 233 1100 231
3 233 521 1100
3 521 1002 1100
3 521 441 1002
3 441 170 1002
3 441 172 170
3 172 557 170
3 172 559 557
3 559 806 557
3 559 807 806
3 806 554 1340
3 806 556 554
3 556 686 554
3 556 171 686
3 171 999 686
3 171 1001 999
3 1001 1098 999
3 1001 519 1098
3 519 763 1098
3 519 230 763
3 230 312 763
3 230 313 312
3 313 1161 312
3 313 1163 1161
3 1163 187 1161
3 1163 188 187
3 188 492 187
3 188 493 492
3 493 706 492
3 493 189 706
3 189 1160 706
3 189 1162 1160
3 1162 859 1160
3 1162 314 859
3 314 764 859
3 314 231 764
3 231 1099 764
3 231 1100 1099
3 1100 1000 1099
3 1100 1002 1000
3 1002 685 1000
3 1002 170 685
3 170 555 685
3 170 557 555
3 557 1340 555
3 557 806 1340
3 1340 560 1342
3 1340 554 560
3 554 690 560
3 554 686 690
3 686 1005 690
3 686 999 1005
3 999 1103 1005
3 999 1098 1103
3 1098 767 1103
3 1098 763 767
3 763 862 767
3 763 312 862
3 312 1166 862
3 312 1161 1166
3 1161 709 1166
3 1161 187 709
3 187 495 709
3 187 492 495
3 492 710 495
3 492 706 710
3 706 1167 710
3 706 1160 1167
3 1160 863 1167
3 1160 859 863
3 859 768 863
3 859 764 768
3 764 1104 768
3 764 1099 1104
3 1099 1006 1104
3 1099 1000 1006
3 1000 689 1006
3 1000 685 689
3 685 561 689
3 685 555 561
3 555 1342 561
3 555 1340 1342
3 1342 1147 1341
3 1342 560 1147
3 560 687 1147
3 560 690 687
3 690 1003 687
3 690 1005 1003
3 1005 1101 1003
3 1005 1103 1101
3 1103 765 1101
3 1103 767 765
3 767 861 765
3 767 862 861
3 862 1164 861
3 862 1166 1164
3 1166 707 1164
3 1166 709 707
3 709 494 707
3 709 495 494
3 495 708 494
3 495 710 708
3 710 1165 708
3 710 1167 1165
3 1167 860 1165
3 1167 863 860
3 863 766 860
3 863 768 766
3 768 1102 766
3 768 1104 1102
3 1104 1004 1102
3 1104 1006 1004
3 1006 688 1004
3 1006 689 688
3 689 1148 688
3 689 561 1148
3 561 1341 1148
3 561 1342 1341
3 1225 1341 1147
3 1225 1147 687
3 1225 687 1003
3 1225 1003 1101
3 1225 1101 765
3 1225 765 861
3 1225 861 1164
3 1225 1164 707
3 1225 707 494
3 1225 494 708
3 1225 708 1165
3 1225 1165 860
3 1225 860 766
3 1225 766 1102
3 1225 1102 1004
3 1225 1004 688
3 1225 688 1148
3 1225 1148 1341
3 45 1008 648
3 45 24 1008
3 45 967 24
3 45 1025 967
3 45 734 1025
3 45 371 734
3 45 452 371
3 45 1155 452
3 45 1254 1155
3 45 875 1254
3 45 458 875
3 45 928 458
3 45 406 928
3 45 1141 406
3 45 1119 1141
3 45 31 1119
3 45 656 31
3 45 648 656
3 648 295 1352
3 648 1008 295
3 1008 678 295
3 1008 24 678
3 24 261 678
3 24 967 261
3 967 754 261
3 967 1025 754
3 1025 55 754
3 1025 734 55
3 734 1080 55
3 734 371 1080
3 371 1183 1080
3 371 452 1183
3 452 485 1183
3 452 1155 485
3 1155 503 485
3 1155 1254 503
3 1254 182 503
3 1254 875 182
3 875 1206 182
3 875 458 1206
3 458 226 1206
3 458 928 226
3 928 1130 226
3 928 406 1130
3 406 414 1130
3 406 1141 414
3 1141 798 414
3 1141 1119 798
3 1119 694 798
3 1119 31 694
3 31 54 694
3 31 656 54
3 656 1352 54
3 656 648 1352
3 1352 1020 634
3 1352 295 1020
3 295 17 1020
3 295 678 17
3 678 975 17
3 678 261 975
3 261 68 975
3 261 754 68
3 754 743 68
3 754 55 743
3 55 780 743
3 55 1080 780
3 1080 844 780
3 1080 1183 844
3 1183 1217 844
3 1183 485 1217
3 485 1247 1217
3 485 503 1247
3 503 886 1247
3 503 182 886
3 182 468 886
3 182 1206 468
3 1206 936 468
3 1206 226 936
3 226 867 936
3 226 1130 867
3 1130 1134 867
3 1130 414 1134
3 414 105 1134
3 414 798 105
3 798 33 105
3 798 694 33
3 694 728 33
3 694 54 728
3 54 634 728
3 54 1352 634
3 634 319 1347
3 634 1020 319
3 1020 693 319
3 1020 17 693
3 17 326 693
3 17 975 326
3 975 750 326
3 975 68 750
3 68 61 750
3 68 743 61
3 743 80 61
3 743 780 80
3 780 224 80
3 780 844 224
3 844 490 224
3 844 1217 490
3 1217 540 490
3 1217 1247 540
3 1247 199 540
3 1247 886 199
3 886 1202 199
3 886 468 1202
3 468 237 1202
3 468 936 237
3 936 178 237
3 936 867 178
3 867 423 178
3 867 1134 423
3 1134 803 423
3 1134 105 803
3 105 699 803
3 105 33 699
3 33 51 699
3 33 728 51
3 728 1347 51
3 728 634 1347
3 1347 1013 628
3 1347 319 1013
3 319 70 1013
3 319 693 70
3 693 1024 70
3 693 326 1024
3 326 67 1024
3 326 750 67
3 750 802 67
3 750 61 802
3 61 826 802
3 61 80 826
3 80 917 826
3 80 224 917
3 224 1231 917
3 224 490 1231
3 490 1292 1231
3 490 540 1292
3 540 941 1292
3 540 199 941
3 199 460 941
3 199 1202 460
3 1202 931 460
3 1202 237 931
3 237 870 931
3 237 178 870
3 178 1145 870
3 178 423 1145
3 423 166 1145
3 423 803 166
3 803 32 166
3 803 699 32
3 699 727 32
3 699 51 727
3 51 628 727
3 51 1347 628
3 628 307 1355
3 628 1013 307
3 1013 751 307
3 1013 70 751
3 70 323 751
3 70 1024 323
3 1024 748 323
3 1024 67 748
3 67 102 748
3 67 802 102
3 802 137 102
3 802 826 137
3 826 223 137
3 826 917 223
3 917 486 223
3 917 1231 486
3 1231 545 486
3 1231 1292 545
3 1292 582 545
3 1292 941 582
3 941 1192 582
3 941 460 1192
3 460 228 1192
3 460 931 228
3 931 180 228
3 931 870 180
3 870 416 180
3 870 1145 416
3 1145 853 416
3 1145 166 853
3 166 696 853
3 166 32 696
3 32 398 696
3 32 727 398
3 727 1355 398
3 727 628 1355
3 1177 1355 307
3 1177 307 751
3 1177 751 323
3 1177 323 748
3 1177 748 102
3 1177 102 137
3 1177 137 223
3 1177 223 486
3 1177 486 545
3 1177 545 582
3 1177 582 1192
3 1177 1192 228
3 1177 228 180
3 1177 180 416
3 1177 416 853
3 1177 853 696
3 1177 696 398
3 1177 398 1355
3 375 1285 504
3 375 842 1285
3 375 799 842
3 375 478 799
3 375 1294 478
3 375 273 1294
3 375 595 273
3 375 823 595
3 375 1282 823
3 375 532 1282
3 375 957 532
3 375 35 957
3 375 1337 35
3 375 481 1337
3 375 132 481
3 375 1236 132
3 375 974 1236
3 375 504 974
3 504 412 1084
3 504 1285 412
3 1285 1021 412
3 1285 842 1021
3 842 925 1021
3 842 799 925
3 799 998 925
3 799 478 998
3 478 413 998
3 478 1294 413
3 1294 379 413
3 1294 273 379
3 273 1195 379
3 273 595 1195
3 595 4 1195
3 595 823 4
3 823 53 4
3 823 1282 53
3 1282 671 53
3 1282 532 671
3 532 104 671
3 532 957 104
3 957 157 104
3 957 35 157
3 35 75 157
3 35 1337 75
3 1337 670 75
3 1337 481 670
3 481 655 670
3 481 132 655
3 132 1332 655
3 132 1236 1332
3 1236 138 1332
3 1236 974 138
3 974 1084 138
3 974 504 1084
3 1084 528 1220
3 1084 412 528
3 412 133 528
3 412 1021 133
3 1021 84 133
3 1021 925 84
3 925 1186 84
3 925 998 1186
3 998 531 1186
3 998 413 531
3 413 959 531
3 413 379 959
3 379 1310 959
3 379 1195 1310
3 1195 100 1310
3 1195 4 100
3 4 508 100
3 4 53 508
3 53 1213 508
3 53 671 1213
3 671 236 1213
3 671 104 236
3 104 684 236
3 104 157 684
3 157 592 684
3 157 75 592
3 75 1205 592
3 75 670 1205
3 670 794 1205
3 670 655 794
3 655 419 794
3 655 1332 419
3 1332 249 419
3 1332 138 249
3 138 1220 249
3 138 1084 1220
3 1220 1055 353
3 1220 528 1055
3 528 251 1055
3 528 133 251
3 133 218 251
3 133 84 218
3 84 276 218
3 84 1186 276
3 1186 1122 276
3 1186 531 1122
3 531 1077 1122
3 531 959 1077
3 959 396 1077
3 959 1310 396
3 1310 626 396
3 1310 100 626
3 100 695 626
3 100 508 695
3 508 1360 695
3 508 1213 1360
3 1213 782 1360
3 1213 236 782
3 236 825 782
3 236 684 825
3 684 746 825
3 684 592 746
3 592 1350 746
3 592 1205 1350
3 1205 1338 1350
3 1205 794 1338
3 794 583 1338
3 794 419 583
3 419 801 583
3 419 249 801
3 249 353 801
3 249 1220 353
3 353 1248 470
3 353 1055 1248
3 1055 805 1248
3 1055 251 805
3 251 752 805
3 251 218 752
3 218 432 752
3 218 276 432
3 276 1259 432
3 276 1122 1259
3 1122 243 1259
3 1122 1077 243
3 1077 544 243
3 1077 396 544
3 396 783 544
3 396 626 783
3 626 1234 783
3 626 695 1234
3 695 454 1234
3 695 1360 454
3 1360 901 454
3 1360 782 901
3 782 1327 901
3 782 825 1327
3 825 1276 1327
3 825 746 1276
3 746 445 1276
3 746 1350 445
3 1350 76 445
3 1350 1338 76
3 1338 1120 76
3 1338 583 1120
3 583 926 1120
3 583 801 926
3 801 470 926
3 801 353 470
3 470 330 987
3 470 1248 330
3 1248 932 330
3 1248 805 932
3 805 880 932
3 805 752 880
3 752 960 880
3 752 432 960
3 432 342 960
3 432 1259 342
3 1259 346 342
3 1259 243 346
3 243 1085 346
3 243 544 1085
3 544 1331 1085
3 544 783 1331
3 783 1335 1331
3 783 1234 1335
3 1234 622 1335
3 1234 454 622
3 454 66 622
3 454 901 66
3 901 101 66
3 901 1327 101
3 1327 44 101
3 1327 1276 44
3 1276 541 44
3 1276 445 541
3 445 593 541
3 445 76 593
3 76 1299 593
3 76 1120 1299
3 1120 37 1299
3 1120 926 37
3 926 987 37
3 926 470 987
3 447 987 330
3 447 330 932
3 447 932 880
3 447 880 960
3 447 960 342
3 447 342 346
3 447 346 1085
3 447 1085 1331
3 447 1331 1335
3 447 1335 622
3 447 622 66
3 447 66 101
3 447 101 44
3 447 44 541
3 447 541 593
3 447 593 1299
3 447 1299 37
3 447 37 987
3 422 435 477
3 422 186 435
3 422 434 186
3 422 140 434
3 422 139 140
3 422 834 139
3 422 135 834
3 422 388 135
3 422 421 388
3 422 409 421
3 422 677 409
3 422 410 677
3 422 737 410
3 422 800 737
3 422 471 800
3 422 749 471
3 422 469 749
3 422 477 469
3 477 588 645
3 477 435 588
3 435 341 588
3 435 186 341
3 186 996 341
3 186 434 996
3 434 292 996
3 434 140 292
3 140 291 292
3 140 139 291
3 139 995 291
3 139 834 995
3 834 281 995
3 834 135 281
3 135 530 281
3 135 388 530
3 388 571 530
3 388 421 571
3 421 565 571
3 421 409 565
3 409 866 565
3 409 677 866
3 677 567 866
3 677 410 567
3 410 915 567
3 410 737 915
3 737 916 915
3 737 800 916
3 800 625 916
3 800 471 625
3 471 927 625
3 471 749 927
3 749 624 927
3 749 469 624
3 469 645 624
3 469 477 645
3 645 1175 775
3 645 588 1175
3 588 484 1175
3 588 341 484
3 341 1174 484
3 341 996 1174
3 996 439 1174
3 996 292 439
3 292 438 439
3 292 291 438
3 291 715 438
3 291 995 715
3 995 433 715
3 995 281 433
3 281 1114 433
3 281 530 1114
3 530 700 1114
3 530 571 700
3 571 755 700
3 571 565 755
3 565 1026 755
3 565 866 1026
3 866 756 1026
3 866 567 756
3 567 1067 756
3 567 915 1067
3 915 1068 1067
3 915 916 1068
3 916 757 1068
3 916 625 757
3 625 1082 757
3 625 927 1082
3 927 819 1082
3 927 624 819
3 624 775 819
3 624 645 775
3 775 952 942
3 775 1175 952
3 1175 581 952
3 1175 484 581
3 484 1328 581
3 484 1174 1328
3 1174 594 1328
3 1174 439 594
3 439 533 594
3 439 438 533
3 438 1288 533
3 438 715 1288
3 715 580 1288
3 715 433 580
3 433 893 580
3 433 1114 893
3 1114 884 893
3 1114 700 884
3 700 937 884
3 700 755 937
3 755 1209 937
3 755 1026 1209
3 1026 938 1209
3 1026 756 938
3 756 1257 938
3 756 1067 1257
3 1067 1258 1257
3 1067 1068 1258
3 1068 939 1258
3 1068 757 939
3 757 1264 939
3 757 1082 1264
3 1082 977 1264
3 1082 819 977
3 819 942 977
3 819 775 942
3 942 1054 1107
3 942 952 1054
3 952 781 1054
3 952 581 781
3 581 1113 781
3 581 1328 1113
3 1328 725 1113
3 1328 594 725
3 594 724 725
3 594 533 724
3 533 52 724
3 533 1288 52
3 1288 705 52
3 1288 580 705
3 580 997 705
3 580 893 997
3 893 1046 997
3 893 884 1046
3 884 1091 1046
3 884 937 1091
3 937 1345 1091
3 937 1209 1345
3 1209 1041 1345
3 1209 938 1041
3 938 20 1041
3 938 1257 20
3 1257 21 20
3 1257 1258 21
3 1258 1092 21
3 1258 939 1092
3 939 1346 1092
3 939 1264 1346
3 1264 1090 1346
3 1264 977 1090
3 977 1107 1090
3 977 942 1107
3 1107 216 1283
3 1107 1054 216
3 1054 948 216
3 1054 781 948
3 781 255 948
3 781 1113 255
3 1113 899 255
3 1113 725 899
3 725 898 899
3 725 724 898
3 724 213 898
3 724 52 213
3 52 892 213
3 52 705 892
3 705 155 892
3 705 997 155
3 997 1229 155
3 997 1046 1229
3 1046 1214 1229
3 1046 1091 1214
3 1091 74 1214
3 1091 1345 74
3 1345 1215 74
3 1345 1041 1215
3 1041 110 1215
3 1041 20 110
3 20 179 110
3 20 21 179
3 21 1281 179
3 21 1092 1281
3 1092 134 1281
3 1092 1346 134
3 1346 1279 134
3 1346 1090 1279
3 1090 1283 1279
3 1090 1107 1283
3 1230 1283 216
3 1230 216 948
3 1230 948 255
3 1230 255 899
3 1230 899 898
3 1230 898 213
3 1230 213 892
3 1230 892 155
3 1230 155 1229
3 1230 1229 1214
3 1230 1214 74
3 1230 74 1215
3 1230 1215 110
3 1230 110 179
3 1230 179 1281
3 1230 1281 134
3 1230 134 1279
3 1230 1279 1283
3 1158 940 964
3 1158 212 940
3 1158 109 212
3 1158 450 109
3 1158 1133 450
3 1158 673 1133
3 1158 1129 673
3 1158 657 1129
3 1158 340 657
3 1158 393 340
3 1158 1081 393
3 1158 792 1081
3 1158 812 792
3 1158 167 812
3 1158 549 167
3 1158 159 549
3 1158 569 159
3 1158 964 569
3 964 185 256
3 964 940 185
3 940 897 185
3 940 212 897
3 212 1207 897
3 212 109 1207
3 109 1180 1207
3 109 450 1180
3 450 408 1180
3 450 1133 408
3 1133 11 408
3 1133 673 11
3 673 404 11
3 673 1129 404
3 1129 1 404
3 1129 657 1
3 657 1035 1
3 657 340 1035
3 340 1058 1035
3 340 393 1058
3 393 377 1058
3 393 1081 377
3 1081 449 377
3 1081 792 449
3 792 106 449
3 792 812 106
3 812 854 106
3 812 167 854
3 167 1297 854
3 167 549 1297
3 549 864 1297
3 549 159 864
3 159 1309 864
3 159 569 1309
3 569 256 1309
3 569 964 256
3 256 872 963
3 256 185 872
3 185 208 872
3 185 897 208
3 897 479 208
3 897 1207 479
3 1207 457 479
3 1207 1180 457
3 1180 1131 457
3 1180 408 1131
3 408 675 1131
3 408 11 675
3 11 1127 675
3 11 404 1127
3 404 669 1127
3 404 1 669
3 1 333 669
3 1 1035 333
3 1035 351 333
3 1035 1058 351
3 1058 1089 351
3 1058 377 1089
3 377 1188 1089
3 377 449 1188
3 449 821 1188
3 449 106 821
3 106 507 821
3 106 854 507
3 854 564 507
3 854 1297 564
3 1297 168 564
3 1297 864 168
3 864 573 168
3 864 1309 573
3 1309 963 573
3 1309 256 963
3 963 204 254
3 963 872 204
3 872 1296 204
3 872 208 1296
3 208 1212 1296
3 208 479 1212
3 479 1187 1212
3 479 457 1187
3 457 405 1187
3 457 1131 405
3 1131 15 405
3 1131 675 15
3 675 369 15
3 675 1127 369
3 1127 8 369
3 1127 669 8
3 669 1027 8
3 669 333 1027
3 333 1051 1027
3 333 351 1051
3 351 373 1051
3 351 1089 373
3 1089 455 373
3 1089 1188 455
3 1188 124 455
3 1188 821 124
3 821 1255 124
3 821 507 1255
3 507 1303 1255
3 507 564 1303
3 564 855 1303
3 564 168 855
3 168 289 855
3 168 573 289
3 573 254 289
3 573 963 254
3 254 883 958
3 254 204 883
3 204 542 883
3 204 1296 542
3 1296 476 542
3 1296 1212 476
3 1212 453 476
3 1212 1187 453
3 1187 1128 453
3 1187 405 1128
3 405 674 1128
3 405 15 674
3 15 1074 674
3 15 369 1074
3 369 661 1074
3 369 8 661
3 8 327 661
3 8 1027 327
3 1027 726 327
3 1027 1051 726
3 1051 1083 726
3 1051 373 1083
3 373 1185 1083
3 373 455 1185
3 455 814 1185
3 455 124 814
3 124 513 814
3 124 1255 513
3 1255 553 513
3 1255 1303 553
3 1303 163 553
3 1303 855 163
3 855 985 163
3 855 289 985
3 289 958 985
3 289 254 958
3 958 196 257
3 958 883 196
3 883 1295 196
3 883 542 1295
3 542 1210 1295
3 542 476 1210
3 476 1184 1210
3 476 453 1184
3 453 411 1184
3 453 1128 411
3 1128 14 411
3 1128 674 14
3 674 364 14
3 674 1074 364
3 1074 5 364
3 1074 661 5
3 661 1039 5
3 661 327 1039
3 327 49 1039
3 327 726 49
3 726 370 49
3 726 1083 370
3 1083 451 370
3 1083 1185 451
3 1185 112 451
3 1185 814 112
3 814 1261 112
3 814 513 1261
3 513 1300 1261
3 513 553 1300
3 553 846 1300
3 553 163 846
3 163 282 846
3 163 985 282
3 985 257 282
3 985 958 257
3 838 257 196
3 838 196 1295
3 838 1295 1210
3 838 1210 1184
3 838 1184 411
3 838 411 14
3 838 14 364
3 838 364 5
3 838 5 1039
3 838 1039 49
3 838 49 370
3 838 370 451
3 838 451 112
3 838 112 1261
3 838 1261 1300
3 838 1300 846
3 838 846 282
3 838 282 257
3 896 16 403
3 896 203 16
3 896 843 203
3 896 836 843
3 896 13 836
3 896 1323 13
3 896 1354 1323
3 896 774 1354
3 896 40 774
3 896 83 40
3 896 275 83
3 896 1010 275
3 896 1023 1010
3 896 395 1023
3 896 509 395
3 896 475 509
3 896 1086 475
3 896 403 1086
3 403 572 1042
3 403 16 572
3 16 394 572
3 16 203 394
3 203 69 394
3 203 843 69
3 843 1065 69
3 843 836 1065
3 836 272 1065
3 836 13 272
3 13 156 272
3 13 1323 156
3 1323 596 156
3 1323 1354 596
3 1354 994 596
3 1354 774 994
3 774 258 994
3 774 40 258
3 40 672 258
3 40 83 672
3 83 889 672
3 83 275 889
3 275 1256 889
3 275 1010 1256
3 1010 242 1256
3 1010 1023 242
3 1023 1075 242
3 1023 395 1075
3 395 761 1075
3 395 509 761
3 509 702 761
3 509 475 702
3 475 294 702
3 475 1086 294
3 1086 1042 294
3 1086 403 1042
3 1042 835 1291
3 1042 572 835
3 572 1022 835
3 572 394 1022
3 394 286 1022
3 394 69 286
3 69 274 286
3 69 1065 274
3 1065 888 274
3 1065 272 888
3 272 813 888
3 272 156 813
3 156 856 813
3 156 596 856
3 596 263 856
3 596 994 263
3 994 935 263
3 994 258 935
3 258 919 935
3 258 672 919
3 672 1182 919
3 672 889 1182
3 889 482 1182
3 889 1256 482
3 1256 444 482
3 1256 242 444
3 242 1311 444
3 242 1075 1311
3 1075 2 1311
3 1075 761 2
3 761 1329 2
3 761 702 1329
3 702 499 1329
3 702 294 499
3 294 1291 499
3 294 1042 1291
3 1291 103 512
3 1291 835 103
3 835 1266 103
3 835 1022 1266
3 1022 902 1266
3 1022 286 902
3 286 483 902
3 286 274 483
3 274 1125 483
3 274 888 1125
3 888 1043 1125
3 888 813 1043
3 813 77 1043
3 813 856 77
3 856 474 77
3 856 263 474
3 263 1157 474
3 263 935 1157
3 935 207 1157
3 935 919 207
3 919 376 207
3 919 1182 376
3 1182 729 376
3 1182 482 729
3 482 1126 729
3 482 444 1126
3 444 497 1126
3 444 1311 497
3 1311 221 497
3 1311 2 221
3 2 181 221
3 2 1329 181
3 1329 1208 181
3 1329 499 1208
3 499 512 1208
3 499 1291 512
3 512 697 769
3 512 103 697
3 103 496 697
3 103 1266 496
3 1266 1194 496
3 1266 902 1194
3 902 1181 1194
3 902 483 1181
3 483 339 1181
3 483 1125 339
3 1125 253 339
3 1125 1043 253
3 1043 293 253
3 1043 77 293
3 77 1110 293
3 77 474 1110
3 474 354 1110
3 474 1157 354
3 1157 400 354
3 1157 207 400
3 207 589 400
3 207 376 589
3 376 1339 589
3 376 729 1339
3 729 1356 1339
3 729 1126 1356
3 1126 736 1356
3 1126 497 736
3 497 885 736
3 497 221 885
3 221 837 885
3 221 181 837
3 181 36 837
3 181 1208 36
3 1208 769 36
3 1208 512 769
3 769 944 6
3 769 697 944
3 697 732 944
3 697 496 732
3 496 378 732
3 496 1194 378
3 1194 29 378
3 1194 1181 29
3 1181 586 29
3 1181 339 586
3 339 472 586
3 339 253 472
3 253 965 472
3 253 293 965
3 293 1333 965
3 293 1110 1333
3 1110 551 1333
3 1110 354 551
3 354 1032 551
3 354 400 1032
3 400 1251 1032
3 400 589 1251
3 589 198 1251
3 589 1339 198
3 1339 536 198
3 1339 1356 536
3 1356 30 536
3 1356 736 30
3 736 1115 30
3 736 885 1115
3 885 1066 1115
3 885 837 1066
3 837 620 1066
3 837 36 620
3 36 6 620
3 36 769 6
3 136 6 944
3 136 944 732
3 136 732 378
3 136 378 29
3 136 29 586
3 136 586 472
3 136 472 965
3 136 965 1333
3 136 1333 551
3 136 551 1032
3 136 1032 1251
3 136 1251 198
3 136 198 536
3 136 536 30
3 136 30 1115
3 136 1115 1066
3 136 1066 620
3 136 620 6
3 635 703 290
3 635 945 703
3 635 456 945
3 635 417 456
3 635 878 417
3 635 841 878
3 635 324 841
3 635 510 324
3 635 978 510
3 635 511 978
3 635 325 511
3 635 791 325
3 635 822 791
3 635 372 822
3 635 401 372
3 635 946 401
3 635 704 946
3 635 290 704
3 290 890 436
3 290 703 890
3 703 1111 890
3 703 945 1111
3 945 619 1111
3 945 456 619
3 456 570 619
3 456 417 570
3 417 1044 570
3 417 878 1044
3 878 961 1044
3 878 841 961
3 841 466 961
3 841 324 466
3 324 681 466
3 324 510 681
3 510 1152 681
3 510 978 1152
3 978 682 1152
3 978 511 682
3 511 407 682
3 511 325 407
3 325 962 407
3 325 791 962
3 791 981 962
3 791 822 981
3 822 524 981
3 822 372 524
3 372 543 524
3 372 401 543
3 401 1112 543
3 401 946 1112
3 946 891 1112
3 946 704 891
3 704 436 891
3 704 290 436
3 436 1049 591
3 436 890 1049
3 890 1286 1049
3 890 1111 1286
3 1111 804 1286
3 1111 619 804
3 619 698 804
3 619 570 698
3 570 1221 698
3 570 1044 1221
3 1044 1118 1221
3 1044 961 1118
3 961 623 1118
3 961 466 623
3 466 868 623
3 466 681 868
3 681 1315 868
3 681 1152 1315
3 1152 869 1315
3 1152 682 869
3 682 562 869
3 682 407 562
3 407 1064 562
3 407 962 1064
3 962 1154 1064
3 962 981 1154
3 981 636 1154
3 981 524 636
3 524 741 636
3 524 543 741
3 543 1235 741
3 543 1112 1235
3 1112 993 1235
3 1112 891 993
3 891 591 993
3 891 436 591
3 591 1168 784
3 591 1049 1168
3 1049 50 1168
3 1049 1286 50
3 1286 973 50
3 1286 804 973
3 804 881 973
3 804 698 881
3 698 1359 881
3 698 1221 1359
3 1221 1293 1359
3 1221 1118 1293
3 1118 815 1293
3 1118 623 815
3 623 1036 815
3 623 868 1036
3 868 34 1036
3 868 1315 34
3 1315 1037 34
3 1315 869 1037
3 869 753 1037
3 869 562 753
3 562 1241 753
3 562 1064 1241
3 1064 1318 1241
3 1064 1154 1318
3 1154 824 1318
3 1154 636 824
3 636 918 824
3 636 741 918
3 741 3 918
3 741 1235 3
3 1235 1169 3
3 1235 993 1169
3 993 784 1169
3 993 591 784
3 784 1325 894
3 784 1168 1325
3 1168 211 1325
3 1168 50 211
3 50 1132 211
3 50 973 1132
3 973 1045 1132
3 973 881 1045
3 881 147 1045
3 881 1359 147
3 1359 58 147
3 1359 1293 58
3 1293 976 58
3 1293 815 976
3 815 1211 976
3 815 1036 1211
3 1036 205 1211
3 1036 34 205
3 34 1146 205
3 34 1037 1146
3 1037 934 1146
3 1037 753 934
3 753 12 934
3 753 1241 12
3 1241 41 12
3 1241 1318 41
3 1318 983 41
3 1318 824 983
3 824 1072 983
3 824 918 1072
3 918 154 1072
3 918 3 154
3 3 1326 154
3 3 1169 1326
3 1169 894 1326
3 1169 784 894
3 894 94 1062
3 894 1325 94
3 1325 297 94
3 1325 211 297
3 211 1260 297
3 211 1132 1260
3 1132 1226 1260
3 1132 1045 1226
3 1045 248 1226
3 1045 147 248
3 147 222 248
3 147 58 222
3 58 1087 222
3 58 976 1087
3 976 1312 1087
3 976 1211 1312
3 1211 343 1312
3 1211 205 343
3 205 1313 343
3 205 1146 1313
3 1146 1088 1313
3 1146 934 1088
3 934 161 1088
3 934 12 161
3 12 206 161
3 12 41 206
3 41 1156 206
3 41 983 1156
3 983 1204 1156
3 983 1072 1204
3 1072 298 1204
3 1072 154 298
3 154 95 298
3 154 1326 95
3 1326 1062 95
3 1326 894 1062
3 42 1062 94
3 42 94 297
3 42 297 1260
3 42 1260 1226
3 42 1226 248
3 42 248 222
3 42 222 1087
3 42 1087 1312
3 42 1312 343
3 42 343 1313
3 42 1313 1088
3 42 1088 161
3 42 161 206
3 42 206 1156
3 42 1156 1204
3 42 1204 298
3 42 298 95
3 42 95 1062
3 1314 25 772
3 772 1017 1314
3 832 25 1314
3 831 374 830
3 772 25 667
3 308 667 25
3 308 1245 1244
3 1245 308 309
3 374 773 309
3 668 309 773
3 773 772 668
3 667 668 772
3 1179 790 210
3 1179 1244 790
3 1244 789 790
3 1244 1245 789
3 1245 209 789
3 1245 321 209
3 321 210 209
3 321 1179 210
3 210 904 953
3 210 790 904
3 790 905 904
3 790 789 905
3 789 954 905
3 789 209 954
3 209 953 954
3 209 210 953
3 953 904 759
3 904 905 759
3 905 954 759
3 954 953 759
3 25 374 309
3 309 308 25
3 667 1179 321
3 321 668 667
3 308 1244 667
3 1179 667 1244
3 321 1245 668
3 1245 309 668
3 772 773 1017
3 1017 773 1015
3 374 25 832
3 830 374 832
3 773 374 831
3 1016 773 831
3 1016 1015 773
3 335 858 151
3 335 151 646
3 646 151 150
3 646 150 647
3 647 150 857
3 647 857 336
3 336 857 858
3 336 858 335
3 858 501 1019
3 858 1019 151
3 151 1019 1018
3 151 1018 150
3 150 1018 500
3 150 500 857
3 857 500 501
3 857 501 858
3 501 760 1019
3 1019 760 1018
3 1018 760 500
3 500 760 501
3 1314 335 646
3 335 1314 1017
3 336 1015 1016
3 1017 1015 335
3 336 335 1015
3 1314 646 832
3 830 646 647
3 646 830 832
3 830 647 831
3 1016 831 336
3 647 336 831