OFF
1618 2253 0
0.1078886286 0.0048776133 0.0900509302
0.1072934846 -0.0368743430 0.0482380276
-0.0147448520 0.1423431680 -0.3500792636
0.0697188052 0.0888844105 -0.0303829537
0.0689968204 0.0885677086 0.0469610619
-0.1007552894 0.0886284836 -0.0319753297
-0.1014772742 0.0883117817 0.0453686859
0.1686478052 -0.0594878188 -0.0925357930
0.1525491328 -0.0595119872 -0.0926861686
0.0159723481 0.0076103739 -0.4718685446
0.0070245063 0.0036853621 0.4866862971
-0.0385285189 0.0075285536 -0.4723776300
-0.0474763608 0.0036035418 0.4861772117
-0.0529486573 -0.0665048769 0.4268179895
-0.0451025796 -0.0630631589 -0.4137082463
0.0138161927 -0.0664046451 0.4274416312
0.0216622705 -0.0629629272 -0.4130846047
-0.0205209188 0.0238825954 -0.4721425688
-0.0294687607 0.0199575836 0.4864122728
-0.0020844674 0.0239102734 -0.4719703564
-0.0110323093 0.0199852616 0.4865844852
0.0566325773 -0.0419550550 0.3824767088
0.0636299130 -0.0388856417 -0.3671263889
-0.0949908345 -0.0421826821 0.3810604145
-0.0879934988 -0.0391132687 -0.3685426832
-0.0748548725 0.0538014415 0.3816414061
-0.0678575368 0.0568708549 -0.3679616917
0.0362011970 0.0539681662 0.3826787662
0.0431985327 0.0570375796 -0.3669243316
0.1469382761 0.0071528021 0.0347084071
0.1472541488 0.0072913611 0.0008699403
-0.0150223107 0.1131036577 -0.3156761557
0.1094931872 0.0172400201 -0.0273536132
0.1094931773 0.0172400158 -0.0273525619
0.0008776476 0.0555653512 0.4278202862
0.0087237254 0.0590070692 -0.4127059496
-0.0403856875 0.0555034040 0.4274348508
-0.0325396097 0.0589451219 -0.4130913850
0.1075717368 -0.0204879992 0.0926179455
-0.0140208238 0.0799863709 -0.4175691434
0.0114476651 -0.1007796435 0.3271165487
0.0174239448 -0.0981581210 -0.3131039627
-0.0486032719 -0.1008697959 0.3265556208
-0.0426269922 -0.0982482734 -0.3136648906
0.0214055471 0.1118165790 0.1230124975
0.0235537284 0.1127588885 -0.1071155704
-0.0553849645 0.1117012960 0.1222952075
-0.0532367832 0.1126436055 -0.1078328605
-0.0595881602 0.0203841899 0.4622302414
-0.0510865304 0.0241134688 -0.4485232714
0.0195321402 0.0205029705 0.4629692936
0.0280337700 0.0242322494 -0.4477842191
-0.1247407227 0.0149704172 0.2637400582
-0.1199326398 0.0170795048 -0.2513351088
0.0883971036 0.0152903938 0.2657309505
0.0932051865 0.0173994814 -0.2493442164
0.1355129293 -0.0191340604 -0.0531831776
0.1341920859 -0.0197134544 0.0883147274
-0.0140883026 0.0692695825 -0.4086227031
0.1083709385 0.0203612341 0.0470493220
0.1095530507 0.0139242787 -0.0405686427
0.1075405715 -0.0375373331 -0.0015096536
-0.1294827478 0.0186869568 -0.1824951003
-0.1330042282 0.0171422433 0.1947502911
0.1014625079 0.0190336671 -0.1803378711
0.0979410275 0.0174889535 0.1969075203
-0.0140523182 0.0749845698 -0.4133935798
-0.0646245422 -0.0285234369 0.4619829652
0.0247180220 -0.0283893100 0.4628175023
0.0448956501 0.0970710952 -0.1805463656
0.0413741696 0.0955263816 0.1966990258
-0.0731560939 0.0968938681 -0.1816490714
-0.0766775744 0.0953491546 0.1955963200
0.0967779849 -0.0577107042 0.1230219118
0.0989261662 -0.0567683947 -0.1071061562
-0.1302353317 -0.0580515116 0.1209014103
-0.1280871504 -0.0571092020 -0.1092266576
0.1079880691 -0.0148537579 0.0959264791
0.0814619811 -0.0520572274 0.2653904436
0.0862700640 -0.0499481398 -0.2496847234
-0.1175982856 -0.0523560698 0.2635310479
-0.1127902027 -0.0502469821 -0.2515441191
0.1347906395 0.0207665156 0.0177297652
-0.0296028330 -0.1313367482 0.1215407042
-0.0274546518 -0.1303944386 -0.1085873637
-0.0036282112 -0.1312977533 0.1217833297
-0.0014800299 -0.1303554438 -0.1083447382
0.1069468536 -0.0389173846 0.0172254625
0.1604334009 0.0519172687 -0.0928576172
-0.0519644772 0.0964939202 0.2647532199
-0.0471563943 0.0986030078 -0.2503219471
0.0153702038 0.0965950075 0.2653821843
0.0201782867 0.0987040951 -0.2496929827
0.0456283583 0.0057420603 0.4280340093
0.0534744360 0.0091837783 -0.4124922265
-0.0849827977 0.0055459782 0.4268139877
-0.0771367200 0.0089876962 -0.4137122481
0.0342965636 0.0312275208 0.4280325859
0.0421426414 0.0346692388 -0.4124936499
-0.0737305702 0.0310653434 0.4270235187
-0.0658844924 0.0345070614 -0.4135027171
-0.0147936807 -0.0959275408 -0.3065569382
-0.0104289470 -0.0911036233 0.3816494587
-0.0034316114 -0.0880342099 -0.3679536390
-0.0277783038 -0.0911296693 0.3814874006
-0.0207809682 -0.0880602559 -0.3681156971
-0.0910199913 -0.0037578493 -0.4180777552
-0.1623037005 -0.0040933575 -0.3627453454
0.0631038742 -0.0033355827 -0.4634198211
0.1355538789 -0.0033308755 -0.4372404666
0.1399234072 -0.0034190316 -0.4139869584
0.1122700321 -0.0031352237 -0.4939744707
-0.1592206548 -0.0041174692 -0.3556729985
-0.1118814179 -0.0034713712 -0.4961572962
0.1173142216 -0.0037945650 -0.3304820138
-0.1283867181 -0.0034884140 -0.4982074137
0.0635049309 -0.0034230085 -0.4418424605
-0.1616782111 -0.0036539871 -0.4701889993
-0.1125296426 -0.0042438138 -0.3070938571
0.0965466642 -0.0038892377 -0.3151147948
0.1220247673 -0.0031858398 -0.4778894824
-0.1687054964 -0.0040432786 -0.3774337288
0.1259660337 -0.0037042023 -0.3493637896
0.0639634462 -0.0035229170 -0.4171841804
-0.1036501745 -0.0035113061 -0.4832648098
0.1305603185 -0.0032301228 -0.4638165487
-0.1719694512 -0.0038724001 -0.4205435232
-0.1304468500 -0.0042151540 -0.3208772747
0.0727857614 -0.0032612923 -0.4779740559
-0.0959642128 -0.0037481479 -0.4223206275
-0.0853685356 -0.0037689283 -0.4132304319
-0.1428283418 -0.0035033307 -0.5000000000
-0.1509237987 -0.0041823960 -0.3366308046
0.0783749497 -0.0039720809 -0.3016674277
0.0977971475 -0.0031637153 -0.4924519710
-0.0950454603 -0.0036461713 -0.4469661479
-0.0980433671 -0.0039905405 -0.3637001673
-0.0959112688 -0.0037423886 -0.4237121249
-0.1528823825 -0.0035836847 -0.4841001480
0.1358536888 -0.0036009156 -0.3709467183
0.1291795254 -0.0036706336 -0.3563783728
0.0639375400 -0.0035172757 -0.4185765195
0.0812562440 -0.0031962837 -0.4907105337
0.0649489676 -0.0037607112 -0.3585344626
-0.1702283976 -0.0039635360 -0.3975513499
0.1377528128 -0.0035160399 -0.3910313232
-0.0942416714 -0.0035569368 -0.4685322542
-0.1671678592 -0.0037704779 -0.4437108395
0.0589408857 -0.0035475795 -0.4130348270
0.0532009778 -0.0035757600 -0.4082939090
0.0479811549 -0.0570754404 0.3823340365
0.0549784905 -0.0540060270 -0.3672690612
-0.0862929001 -0.0572770214 0.3810798003
-0.0792955645 -0.0542076081 -0.3685232974
-0.0909129906 -0.0891713706 0.2636293994
-0.0861049077 -0.0870622829 -0.2514457676
0.0548901546 -0.0889524813 0.2649913273
0.0596982375 -0.0868433937 -0.2500838396
0.1604684491 0.0291495095 -0.0929505176
-0.0677978424 -0.0187523933 0.4619933530
-0.0592962126 -0.0150231144 -0.4487601598
0.0278622763 -0.0186087820 0.4628869015
0.0363639061 -0.0148795031 -0.4478666113
-0.0133731070 0.1278894002 -0.4946103848
0.1075569942 -0.0216100265 0.0905944287
-0.0149088005 0.1337903074 -0.3311529075
0.1071012663 -0.0381392582 0.0291156855
0.0835996121 0.0665225709 0.1234075956
0.0857477933 0.0674648804 -0.1067204724
-0.0130272004 -0.0962703075 -0.4956149257
0.0241793722 -0.1281980540 -0.0316969431
0.0234573874 -0.1285147560 0.0456470725
-0.0545487751 -0.1283162459 -0.0324323323
-0.0552707599 -0.1286329479 0.0449116833
0.1079149597 0.0032297660 0.0929674607
-0.0131596767 -0.0879708859 -0.4827663650
0.0361917864 0.0873109666 0.2655385324
0.0409998693 0.0894200542 -0.2495366346
-0.0727573803 0.0871474050 0.2645208526
-0.0679492974 0.0892564926 -0.2505543144
0.1083662911 -0.0026618025 0.0963626603
-0.1320247637 -0.0059981978 -0.1826199080
-0.1355462442 -0.0075429113 0.1946254834
0.1040801961 -0.0056437415 -0.1804144827
0.1005587157 -0.0071884550 0.1968309087
0.0471080659 -0.0082139482 0.4279906760
0.0549541437 -0.0047722303 -0.4125355598
0.0185700875 -0.0045860351 -0.4718942362
0.0096222456 -0.0085110469 0.4866606054
-0.0410886965 -0.0046755987 -0.4724515011
-0.0500365383 -0.0086006106 0.4861033405
-0.1022174861 -0.0082526168 0.3811318898
-0.0952201504 -0.0051832034 -0.3684712079
0.0784427038 -0.0077582167 0.3281228252
0.0844189835 -0.0051366942 -0.3120976862
0.0908126318 -0.0074843056 0.2656602429
0.0956207147 -0.0053752180 -0.2494149241
-0.0864205828 -0.0084144102 0.4267434025
-0.0785745050 -0.0049726922 -0.4137828333
-0.0688828006 -0.0085313745 0.4620250774
-0.0603811708 -0.0048020956 -0.4487284354
0.1109318090 -0.0061062582 -0.0644773269
0.1086815166 -0.0067756834 0.0987344986
-0.1270859118 -0.0078114292 0.2636248813
-0.1427573245 -0.0066262103 -0.0327574481
-0.1434793093 -0.0069429122 0.0445865675
-0.1158843909 -0.0080499533 0.3263076414
-0.1099081112 -0.0054284308 -0.3139128700
0.0637547332 -0.0080034484 0.3826822144
0.0707520689 -0.0049340350 -0.3669208833
0.1074414940 -0.0068779488 0.1233295984
0.1095896752 -0.0059356393 -0.1067984695
-0.0203337411 -0.0086115899 0.5000000000
-0.0111316555 -0.0045750529 -0.4857912013
0.0289147101 -0.0083845544 0.4629385910
0.0374163399 -0.0046552755 -0.4478149217
-0.1410551878 -0.0072510084 0.1210084237
-0.1389070065 -0.0063086988 -0.1091196442
-0.1222788803 -0.0057023432 -0.2514502955
-0.0014505543 -0.1238590844 -0.1818836413
-0.0049720347 -0.1254037979 0.1953617501
-0.0261299145 -0.1238961346 -0.1821141680
-0.0296513949 -0.1254408482 0.1951312234
-0.0137896397 0.0793986581 -0.4422244318
-0.0145705172 0.0812781488 -0.3589285446
0.0838257043 -0.0803497151 0.1228083055
0.0859738856 -0.0794074056 -0.1073197625
-0.1172132007 -0.0806515280 0.1209304276
-0.1150650194 -0.0797092184 -0.1091976404
-0.0135376400 0.1377290210 -0.4785774924
-0.0250199015 -0.0573655905 0.4622345630
-0.0165182717 -0.0536363116 -0.4485189498
-0.0147965864 -0.0573502426 0.4623300576
-0.0062949566 -0.0536209637 -0.4484234552
0.1106236613 -0.0025971160 -0.0624218148
-0.0129840682 -0.1127858084 -0.4975781248
0.0226815211 -0.1186630629 -0.1816370989
0.0191600407 -0.1202077764 0.1956082925
-0.0502789270 -0.1187725959 -0.1823186128
-0.0538004074 -0.1203173095 0.1949267786
0.1686230230 -0.0433889996 -0.0924701042
0.1525243506 -0.0434131680 -0.0926204798
0.0546395003 0.0738756354 0.2656557228
0.0478301473 0.0410209562 0.3827343040
0.0548274829 0.0440903696 -0.3668687937
-0.0864439077 0.0408193752 0.3814800677
-0.0794465721 0.0438887886 -0.3681230300
-0.1185439645 0.0687011019 -0.0322229791
-0.1192659493 0.0683844000 0.0451210365
0.0875687495 0.0690105319 -0.0302977074
0.0868467647 0.0686938299 0.0470463082
-0.0642528430 -0.0582716042 0.4267461810
-0.0564067652 -0.0548298862 -0.4137800548
0.0250949779 -0.0581374694 0.4275807672
0.0329410556 -0.0546957514 -0.4129454686
-0.0836244795 -0.0806087106 0.3263116710
-0.0776481998 -0.0779871881 -0.3139088404
0.0464063320 -0.0804134998 0.3275262717
0.0523826117 -0.0777919773 -0.3126942397
0.0344180533 -0.0476937018 0.4277105598
0.0422641311 -0.0442519839 -0.4128156760
-0.0736090805 -0.0478558793 0.4267014926
-0.0657630027 -0.0444141613 -0.4138247432
0.0456713322 -0.0221743351 0.4279201006
0.0535174100 -0.0187326171 -0.4126061352
-0.0849398238 -0.0223704172 0.4267000791
-0.0770937460 -0.0189286992 -0.4138261567
0.1092379667 -0.0300565399 -0.0405613605
0.0966215327 0.0439225542 0.1234366109
0.0987697140 0.0448648637 -0.1066914571
-0.1303917838 0.0435817468 0.1213161094
-0.1282436026 0.0445240564 -0.1088119585
-0.0296926763 0.1012890933 0.2649807558
-0.0248845934 0.1033981810 -0.2500944111
-0.0069162573 0.1013232868 0.2651935074
-0.0021081744 0.1034323744 -0.2498816596
-0.0806055933 -0.0357112837 0.4266859108
-0.0727595155 -0.0322695658 -0.4138403250
0.0413781950 -0.0355281537 0.4278253453
0.0492242727 -0.0320864357 -0.4127008905
-0.0444981862 0.0340885589 0.4624272176
-0.0359965564 0.0378178377 -0.4483262952
0.0044000435 0.0341619681 0.4628839695
0.0129016733 0.0378912470 -0.4478695433
0.1100836828 0.0035486001 -0.0588215017
0.1348801302 -0.0373677586 0.0174925571
-0.1004306177 0.0091000741 0.3812196241
-0.0934332821 0.0121694875 -0.3683834736
0.0619144485 0.0093437972 0.3827360680
0.0689117841 0.0124132106 -0.3668670297
-0.0287272950 -0.1050866189 0.3267238908
-0.0227510152 -0.1024650964 -0.3134966206
-0.0084152374 -0.1050561251 0.3269136230
-0.0024389577 -0.1024346026 -0.3133068884
-0.0594991793 -0.0374188978 0.4619943846
-0.0509975495 -0.0336896189 -0.4487591282
0.0196211211 -0.0373001172 0.4627334369
0.0281227509 -0.0335708383 -0.4480200759
-0.0018140228 0.1122545118 -0.1809202156
-0.0053355032 0.1107097982 0.1963251758
-0.0264933830 0.1122174615 -0.1811507422
-0.0300148634 0.1106727480 0.1960946492
-0.0140545416 -0.1524705618 -0.3765989246
0.1098058339 0.0088458979 -0.0497273360
0.1175069481 -0.0323142441 0.0798829345
0.1186742617 -0.0318021966 -0.0451677892
0.0010742220 -0.0721317609 0.4272992375
0.0089202997 -0.0686900429 -0.4132269983
-0.0401891132 -0.0721937081 0.4269138021
-0.0323430354 -0.0687519901 -0.4136124337
0.1354786838 0.0031122114 -0.0530924050
0.1341578404 0.0025328174 0.0884054999
-0.0141610048 0.1559619432 -0.4147726732
-0.1137304487 -0.0283595400 0.3262445858
-0.1077541690 -0.0257380175 -0.3139759256
0.0763512998 -0.0280741768 0.3280201144
0.0823275795 -0.0254526543 -0.3122003970
0.1097029150 -0.0199429491 -0.0584523005
-0.0265318072 -0.0750908071 0.4270294265
-0.0186857294 -0.0716490892 -0.4134968094
-0.0125741014 -0.0750698529 0.4271598036
-0.0047280236 -0.0716281349 -0.4133664323
-0.0142011575 -0.1459926286 -0.3619438870
-0.0138642732 -0.1541000168 -0.3967065010
0.1076980392 -0.0331204038 0.0640057995
0.1469860100 -0.0238557189 0.0345818815
0.1473018827 -0.0237171599 0.0007434147
0.1074412712 -0.0355024093 0.0539996129
0.0565280816 0.0259266169 0.3827536897
0.0635254173 0.0289960302 -0.3668494080
-0.0950953302 0.0256989898 0.3813373954
-0.0880979945 0.0287684032 -0.3682657023
-0.0133110616 -0.0784861560 -0.4680840242
-0.0143724479 0.1539112426 -0.3918067497
-0.0262131998 0.0213233820 -0.4722061840
-0.0351610417 0.0173983701 0.4863486576
-0.1383805932 0.0187296555 0.1211397738
-0.1362324119 0.0196719651 -0.1089882941
0.0036156665 0.0213681630 -0.4719275565
-0.0053321754 0.0174431512 0.4866272852
0.1046863980 0.0190945637 0.1234102305
0.1068345793 0.0200368732 -0.1067178374
0.1091130962 -0.0333054987 -0.0279542190
-0.0290264508 0.0892486911 0.3275168466
-0.0230501711 0.0918702136 -0.3127036648
-0.0087143933 0.0892791849 0.3277065788
-0.0027381135 0.0919007074 -0.3125139326
0.0126803054 0.0281320709 0.4629365727
0.0211819352 0.0318613498 -0.4478169401
-0.0527598452 0.0280338278 0.4623253049
-0.0442582154 0.0317631067 -0.4484282079
-0.0838480201 0.0646059606 0.3269041975
-0.0778717403 0.0672274831 -0.3133163139
0.0461827914 0.0648011714 0.3281187981
0.0521590712 0.0674226939 -0.3121017133
-0.0531276582 0.0497762882 0.4272924572
-0.0452815804 0.0532180062 -0.4132337786
0.0136371918 0.0498765200 0.4279160988
0.0214832696 0.0533182380 -0.4126101370
-0.0080945589 -0.0344560522 -0.4722654526
-0.0170424008 -0.0383810641 0.4862893890
-0.0143311596 -0.0344654150 -0.4723237078
-0.0232790015 -0.0383904269 0.4862311338
0.0179086504 0.0016498069 -0.4718748766
0.0089608085 -0.0022752050 0.4866799651
-0.0404464611 0.0015622003 -0.4724199640
-0.0493943030 -0.0023628115 0.4861348777
0.1079799332 0.0225357048 0.0174867391
-0.0135873462 0.0788845442 -0.4637986235
-0.0293572341 -0.1166182860 0.2640916178
-0.0245491512 -0.1145091984 -0.2509835492
-0.0065808151 -0.1165840925 0.2643043693
-0.0017727322 -0.1144750049 -0.2507707976
0.0179278505 -0.0108227827 -0.4719257691
0.0089800086 -0.0147477946 0.4866290725
-0.0404272611 -0.0109103893 -0.4724708565
-0.0493751029 -0.0148354011 0.4860839851
-0.0137276276 -0.0799211942 -0.4232573149
0.1083560591 0.0204446908 0.0459160613
-0.0081863997 0.0252048342 -0.4720220154
-0.0171342415 0.0212798223 0.4865328262
-0.0144230004 0.0251954714 -0.4720802706
-0.0233708422 0.0212704595 0.4864745710
0.1093663428 0.0181062505 -0.0237626501
-0.0106844497 0.0748740247 0.3823267053
-0.0036871140 0.0779434380 -0.3672763924
-0.0280338065 0.0748479787 0.3821646473
-0.0210364708 0.0779173920 -0.3674384504
0.1092895758 -0.0326944401 -0.0305114027
0.1084349795 0.0216041984 0.0032189906
-0.0139372838 0.1514708378 -0.4380016349
0.1073313236 -0.0369830399 0.0468048089
-0.0351665418 0.0382828877 0.4625315005
-0.0266649120 0.0420121666 -0.4482220123
-0.0049455224 0.0383282575 0.4628137910
0.0035561074 0.0420575364 -0.4479397218
0.0127928045 -0.0449487037 0.4626383777
0.0212944343 -0.0412194248 -0.4481151351
-0.0526473462 -0.0450469468 0.4620271099
-0.0441457164 -0.0413176679 -0.4487264029
-0.0261332258 -0.0306287439 -0.4724181667
-0.0350810676 -0.0345537557 0.4861366749
-0.1383006191 -0.0332224703 0.1209277910
-0.1361524379 -0.0322801608 -0.1092002769
0.0036956405 -0.0305839628 -0.4721395392
-0.0052522013 -0.0345089747 0.4864153024
0.1047663721 -0.0328575622 0.1231982477
0.1069145534 -0.0319152526 -0.1069298202
-0.1183121634 -0.0818797372 -0.0328374013
-0.1190341482 -0.0821964391 0.0445066142
0.0878005506 -0.0815703072 -0.0309121297
0.0870785658 -0.0818870092 0.0464318859
0.0452121565 -0.1085353859 -0.1813853117
0.0416906761 -0.1100800994 0.1958600797
-0.0728395875 -0.1087126129 -0.1824880175
-0.0763610679 -0.1102573264 0.1947573739
-0.0145574562 0.1521172760 -0.3717120908
-0.0137873974 -0.0749996166 -0.4176495769
-0.0267373657 0.0584425474 0.4275742891
-0.0188912880 0.0618842654 -0.4129519467
-0.0127796600 0.0584635016 0.4277046662
-0.0049335822 0.0619052196 -0.4128215697
0.1604509258 0.0405328634 -0.0929040695
0.1601005374 0.0403791639 -0.0553680358
0.1490676576 0.0405157740 -0.0930103991
0.1718344042 0.0405499530 -0.0927977379
0.1684879744 0.0485954087 -0.0927960321
0.1523893020 0.0485712403 -0.0929464076
-0.1137929885 0.0122670581 0.3264103565
-0.1078167088 0.0148885807 -0.3138101549
0.0762887600 0.0125524214 0.3281858851
0.0822650397 0.0151739439 -0.3120346263
0.1174338801 0.0151516186 0.0800766118
0.1186011937 0.0156636661 -0.0449741119
-0.1003772030 -0.0255988110 0.3810780406
-0.0933798673 -0.0225293976 -0.3685250571
0.0619678632 -0.0253550879 0.3825944844
0.0689651989 -0.0222856745 -0.3670086133
0.1094767530 -0.0248636428 -0.0497485736
0.1075894723 -0.0341284194 0.0597727765
-0.0443670843 -0.0510768440 0.4620797131
-0.0358654545 -0.0473475651 -0.4486737997
0.0045311454 -0.0510034347 0.4625364650
0.0130327752 -0.0472741559 -0.4482170478
0.1473936408 0.0037122986 -0.0134883507
0.1468099840 0.0034562749 0.0490370111
-0.0806896621 0.0189008481 0.4269087473
-0.0728435843 0.0223425661 -0.4136174885
0.0412941262 0.0190839782 0.4280481818
0.0491402039 0.0225256962 -0.4124780540
0.0223339374 0.1071316023 -0.1807157780
0.0188124570 0.1055868888 0.1965296134
-0.0506265107 0.1070220693 -0.1813972919
-0.0541479911 0.1054773557 0.1958480995
0.1100505713 0.0039251064 -0.0586015674
-0.0146839539 0.1455198558 -0.3571093538
0.0238043097 0.1154471442 -0.0307027858
0.0230823249 0.1151304422 0.0466412298
-0.0549238376 0.1153289523 -0.0314381750
-0.0556458224 0.1150122504 0.0459058406
0.0939484487 -0.0539418530 -0.1807068269
0.0904269683 -0.0554865665 0.1965385645
-0.1217439447 -0.0542656646 -0.1827215811
-0.1252654251 -0.0558103781 0.1945238103
-0.0644064450 0.0415101638 0.4271533254
-0.0565603672 0.0449518818 -0.4133729104
0.0249413758 0.0416442987 0.4279879116
0.0327874536 0.0450860167 -0.4125383242
-0.0142855443 -0.0817384944 -0.3632366673
-0.0516436952 -0.1118900066 0.2639029409
-0.0468356123 -0.1097809190 -0.2511722261
0.0156909858 -0.1117889194 0.2645319053
0.0204990687 -0.1096798318 -0.2505432617
0.1083252914 0.0202152949 0.0487852944
0.0412919714 -0.1003331062 -0.2503108936
-0.0676571952 -0.1004966679 -0.2513285734
0.0087353903 -0.0268912811 -0.4720773741
-0.0002124515 -0.0308162930 0.4864774675
-0.0311843211 -0.0269512112 -0.4724502588
-0.0401321630 -0.0308762231 0.4861045828
-0.0251704543 0.0404353667 0.4626336249
-0.0166688245 0.0441646456 -0.4481198878
-0.0149471392 0.0404507146 0.4627291196
-0.0064455094 0.0441799935 -0.4480243932
0.1346031685 -0.0352745876 0.0468066713
0.1351502781 -0.0350345955 -0.0118034961
0.1010804984 -0.0583595852 -0.0306931237
0.1003585136 -0.0586762871 0.0466508919
-0.1316642458 -0.0587089969 -0.0328671617
-0.1323862306 -0.0590256989 0.0444768539
-0.0134372030 -0.1512806526 -0.4428802399
-0.1174392946 0.0662218094 0.1215297220
-0.1152911133 0.0671641190 -0.1085983460
0.1475112585 -0.0145373132 -0.0231470017
0.1467486733 -0.0148718247 0.0585464123
0.1353724926 -0.0286319103 -0.0366220291
0.1343615647 -0.0290753585 0.0716755732
-0.0354185780 0.0129636426 -0.4723263444
-0.0443664199 0.0090386307 0.4862284972
0.0128467397 0.0130361017 -0.4718755044
0.0038988978 0.0091110898 0.4866793372
-0.0931008543 0.0822769656 -0.1818951023
-0.0966223347 0.0807322521 0.1953502891
0.0648842687 0.0825141433 -0.1804193841
0.0613627883 0.0809694298 0.1968260073
0.0364838884 -0.1024420887 0.2647642738
-0.0724652783 -0.1026056504 0.2637465941
0.1181057394 -0.0418897289 0.0173174567
0.0701043059 -0.0719097684 0.2652031323
0.0749123888 -0.0698006807 -0.2498720347
-0.1061795418 -0.0721744173 0.2635564881
-0.1013714589 -0.0700653297 -0.2515186789
-0.0133585844 0.0968936654 -0.4911834760
0.1183222097 0.0228217910 -0.0162575299
0.1176904644 0.0225446730 0.0514194036
-0.0136468071 -0.1559619432 -0.4196883893
0.1605859728 -0.0514504935 -0.0925781374
0.1602355844 -0.0516041930 -0.0550421037
0.1492027046 -0.0514675829 -0.0926844670
0.1719694512 -0.0514334039 -0.0924718058
-0.0140077703 0.0799531693 -0.4189612778
0.1082027311 0.0212970892 0.0343342913
0.1188364291 -0.0208355577 -0.0642914139
0.1173112587 -0.0215045807 0.0990954141
-0.0678293170 0.0016939061 0.4620767810
-0.0593276872 0.0054231850 -0.4486767318
0.0278308016 0.0018375174 0.4629703296
0.0363324314 0.0055667963 -0.4477831832
0.0111615835 0.0850624670 0.3278748492
0.0171378632 0.0876839895 -0.3123456622
-0.0488893535 0.0849723146 0.3273139214
-0.0429130738 0.0875938371 -0.3129065900
-0.0129463393 -0.1272369426 -0.4992946626
-0.0911636465 0.0736577975 0.2642937991
-0.0863555636 0.0757668851 -0.2507813679
0.0594475816 0.0759857744 -0.2494194399
-0.1095859991 0.0638098163 -0.1821246043
-0.1131074795 0.0622651028 0.1951207871
0.0814272444 0.0640965780 -0.1803403748
0.0779057640 0.0625518645 0.1969050166
0.1074423801 -0.0303941870 0.0747509362
0.0699812536 0.0319684008 0.3282065092
0.0759575334 0.0345899233 -0.3120140022
-0.1075463396 0.0317018847 0.3265482474
-0.1015700599 0.0343234072 -0.3136722640
-0.0135115008 -0.0791766148 -0.4465147476
0.0481503382 0.1045913121 -0.0305199740
0.0474283534 0.1042746102 0.0468240416
-0.0792352798 0.1044000724 -0.0317098662
-0.0799572646 0.1040833705 0.0456341494
0.0664746868 -0.0997860723 0.1225667522
0.0686228681 -0.0988437627 -0.1075613158
-0.0998024237 -0.1000356984 0.1210135796
-0.0976542424 -0.0990933889 -0.1091144883
-0.0299853791 0.1171698476 0.1225546977
-0.0278371978 0.1181121572 -0.1075733702
-0.0040107572 0.1172088425 0.1227973232
-0.0018625760 0.1181511520 -0.1073307447
-0.0144618082 -0.1344761510 -0.3358904862
0.1470942460 0.0084995153 0.0177943860
0.0813247937 0.0370613860 0.2657540786
0.0861328766 0.0391704736 -0.2493210884
-0.1177354730 0.0367625436 0.2638946829
-0.1129273901 0.0388716312 -0.2511804841
0.0454839617 -0.1151701660 0.1223078161
0.0476321429 -0.1142278564 -0.1078202519
-0.0787644318 -0.1153566958 0.1211472282
-0.0766162505 -0.1144143863 -0.1089808397
-0.0646861141 0.0114744325 0.4621461704
-0.0561844843 0.0152037114 -0.4486073424
0.0246564500 0.0116085595 0.4629807075
0.0331580798 0.0153378384 -0.4477728053
-0.0284909370 -0.1338446473 -0.0322117269
-0.0292129218 -0.1341613493 0.0451322887
-0.0018602736 -0.1338046676 -0.0319629734
-0.0025822584 -0.1341213696 0.0453810422
-0.1294067617 -0.0306745544 -0.1826965124
-0.1329282421 -0.0322192680 0.1945488790
0.1015384940 -0.0303278442 -0.1805392833
0.0980170136 -0.0318725578 0.1967061081
-0.0133663239 0.1134250071 -0.4930118324
-0.1399323569 -0.0332536328 -0.0328401096
-0.1406543417 -0.0335703347 0.0445039060
0.1092634694 -0.0328826040 -0.0297574755
0.1092705158 -0.0328795130 -0.0305123385
0.1074993671 -0.0260334194 0.0826162986
-0.0447537070 -0.0875281800 0.3813436871
-0.0377563714 -0.0844587666 -0.3682594106
0.0065342383 -0.0874511831 0.3818227610
0.0135315739 -0.0843817698 -0.3677803367
-0.1246705955 -0.0305850775 0.2635541759
-0.1198625126 -0.0284759899 -0.2515209911
0.0884672308 -0.0302651010 0.2655450683
0.0932753137 -0.0281560134 -0.2495300987
0.0217713742 -0.1258292017 0.1220428199
0.0239195555 -0.1248868921 -0.1080852480
-0.0550191374 -0.1259444847 0.1213255299
-0.0528709561 -0.1250021751 -0.1088025380
0.1077543388 0.0133138200 0.0751220813
0.1093269957 -0.0281194011 -0.0439876859
-0.0671723660 -0.0925898136 0.3264161877
-0.0611960863 -0.0899682911 -0.3138043237
0.0299911813 -0.0924439453 0.3273237796
0.0359674611 -0.0898224228 -0.3128967318
-0.1400143492 0.0200095711 -0.0326227772
-0.1407363340 0.0196928692 0.0447212384
0.1090418831 0.0203193664 -0.0145858663
0.1091885235 0.0203836909 -0.0302950060
-0.0561229107 -0.0247952094 -0.4487705519
0.0332196534 -0.0246610825 -0.4479360148
0.1471459128 -0.0250638731 0.0176574357
-0.0746639515 -0.0702231800 0.3811353424
-0.0676666158 -0.0671537666 -0.3684677553
0.0363921180 -0.0700564553 0.3821727025
0.0433894537 -0.0669870419 -0.3674303952
-0.0449980426 0.0711952215 0.3819913339
-0.0380007070 0.0742646349 -0.3676117639
0.0062899027 0.0712722183 0.3824704078
0.0132872383 0.0743416317 -0.3671326899
0.0701036012 -0.0475100563 0.3278822094
0.0760798809 -0.0448885338 -0.3123383020
-0.1074239921 -0.0477765724 0.3262239476
-0.1014477124 -0.0451550499 -0.3139965638
-0.0204330919 -0.0331708543 -0.4723753668
-0.0293809337 -0.0370958661 0.4861794748
-0.0019966405 -0.0331431763 -0.4722031543
-0.0109444823 -0.0370681881 0.4863516873
-0.0151216236 0.0950029744 -0.3021349172
-0.1093711812 -0.0757385163 -0.1826940101
-0.1128926616 -0.0772832298 0.1945513813
0.0816420623 -0.0754517546 -0.1809097806
0.0781205819 -0.0769964682 0.1963356108
-0.0136815908 0.1463372494 -0.4645501499
0.1187968848 0.0048529512 -0.0641865958
0.1172717143 0.0041839282 0.0992002322
0.0160099083 -0.0167891360 -0.4719681031
0.0070620664 -0.0207141479 0.4865867386
-0.0384909588 -0.0168709563 -0.4724771885
-0.0474388006 -0.0207959682 0.4860776531
0.0700118750 -0.1014973735 -0.0311597777
0.0692898902 -0.1018140754 0.0461842379
-0.1004622196 -0.1017533004 -0.0327521537
-0.1011842044 -0.1020700023 0.0445918619
0.1089788988 0.0204886406 -0.0138360770
0.1092895742 -0.0326933887 -0.0305113984
-0.0608351519 0.0640766781 0.3818143504
-0.0538378163 0.0671460915 -0.3677887473
0.0221499064 0.0642012607 0.3825895029
0.0291472420 0.0672706741 -0.3670135948
0.0451508428 0.1012279490 0.1231907958
0.0472990241 0.1021702586 -0.1069372722
-0.0790975507 0.1010414192 0.1220302079
-0.0769493694 0.1019837287 -0.1080978600
0.1101820552 -0.0142618104 -0.0617177079
0.1184176791 -0.0391963024 -0.0165105854
0.1177859338 -0.0394734204 0.0511663482
-0.0146388115 -0.1139168312 -0.3202454364
-0.0353642974 -0.0222977339 -0.4724702231
-0.0443121392 -0.0262227457 0.4860846185
0.0129010203 -0.0222252748 -0.4720193831
0.0039531785 -0.0261502867 0.4865354585
0.0699060515 0.0568786821 0.2657286341
0.0747141344 0.0589877697 -0.2493465329
-0.1063777962 0.0566140332 0.2640819899
-0.1015697133 0.0587231208 -0.2509931771
0.1685127582 0.0324955381 -0.0928617251
0.1524140858 0.0324713697 -0.0930121007
0.1180024041 0.0252380994 0.0175913616
0.0484918667 -0.1172698034 -0.0314252446
0.0477698819 -0.1175865054 0.0459187710
-0.0788937513 -0.1174610431 -0.0326151369
-0.0796157361 -0.1177777450 0.0447288787
-0.0130803770 -0.1372067963 -0.4833427049
0.1474914855 -0.0016925331 -0.0230945905
0.1467289003 -0.0020270446 0.0585988235
0.1009200971 0.0458390545 -0.0302679569
0.1001981123 0.0455223526 0.0470760586
-0.1318246471 0.0454896428 -0.0324419949
-0.1325466319 0.0451729409 0.0449020207
0.1353092148 0.0124741198 -0.0364543021
0.1342982869 0.0120306716 0.0718433001
0.0086667634 0.0176895790 -0.4718954686
-0.0002810784 0.0137645671 0.4866593730
-0.0312529480 0.0176296489 -0.4722683534
-0.0402007899 0.0137046370 0.4862864882
-0.0138409180 -0.0693228389 -0.4128322178
0.1345204916 0.0184333525 0.0470258184
0.1350676012 0.0186733446 -0.0115843489
-0.0972396826 -0.0654498384 0.3262466482
-0.0912634029 -0.0628283159 -0.3139738632
0.0599748017 -0.0652138177 0.3277151680
0.0659510815 -0.0625922952 -0.3125053434
-0.0142717471 -0.1428736184 -0.3548881082
0.0937997976 0.0426237260 -0.1803128057
0.0902783172 0.0410790124 0.1969325857
-0.1218925958 0.0422999143 -0.1823275599
-0.1254140762 0.0407552008 0.1949178315
-0.0134653484 0.0884900364 -0.4784030695
0.1080368069 0.0165300279 0.0628706156
-0.0288831399 0.1209351469 -0.0311721366
-0.0296051247 0.1206184450 0.0461718790
-0.0022524764 0.1209751266 -0.0309233831
-0.0029744612 0.1206584247 0.0464206325
-0.0928292571 -0.0941558729 -0.1826150097
-0.0963507376 -0.0957005864 0.1946303817
0.0651558658 -0.0939186952 -0.1811392915
0.0616343854 -0.0954634087 0.1961060999
0.0661888344 0.0859071619 0.1233244453
0.0683370156 0.0868494715 -0.1068036227
-0.1000882761 0.0856575358 0.1217712727
-0.0979400948 0.0865998453 -0.1083567952
0.1467073714 -0.0084626891 0.0619379631
0.1475327857 -0.0081006173 -0.0264861370
0.1516165920 -0.0082749028 0.0177679144
0.1355502243 -0.0079865279 -0.0589674759
0.1341205536 -0.0086136594 0.0941887512
0.1172286566 -0.0086873608 0.1058785114
0.1188794950 -0.0079632130 -0.0709707402
0.1107102275 -0.0079988589 -0.0653167393
0.1084443434 -0.0086750774 0.0995541016
0.1092790626 -0.0321572546 -0.0325564752
0.1083446254 0.0200357176 0.0495133947
-0.0674328694 0.0766364061 0.3271066896
-0.0614565897 0.0792579286 -0.3131138218
0.0297306779 0.0767822744 0.3280142815
0.0357069577 0.0794037970 -0.3122062299
0.1079292413 -0.0366340070 -0.0137727529
0.1474301748 -0.0200206327 -0.0135851894
0.1468465180 -0.0202766565 0.0489401725
0.1095976524 0.0165278131 -0.0303069757
-0.0974164905 0.0494066990 0.3267153029
-0.0914402107 0.0520282215 -0.3135052085
0.0597979939 0.0496427198 0.3281838227
0.0657742736 0.0522642423 -0.3120366887
0.1605684495 -0.0400671396 -0.0925316893
0.1606034977 -0.0628348988 -0.0926245897
-0.0606126607 -0.0804563797 0.3812246052
-0.0536153250 -0.0773869663 -0.3683784925
0.0223723976 -0.0803317970 0.3819997577
0.0293697333 -0.0772623837 -0.3676033400
-0.0131976483 -0.1459305579 -0.4693859778
-0.0137405605 -0.0799657948 -0.4218656030
0.1078401294 0.0079329073 0.0846438127
-0.0350225681 -0.0552441863 0.4621498774
-0.0265209383 -0.0515149074 -0.4486036354
-0.0048015487 -0.0551988165 0.4624321680
0.0037000811 -0.0514695376 -0.4483213448
0.0765398242 -0.0151933446 -0.3395606402
0.0725225399 -0.0335871042 -0.3396734576
0.0647904972 -0.0507389684 -0.3398158661
0.0536805511 -0.0658990021 -0.3399816505
0.0396784574 -0.0784047324 -0.3401635635
0.0888471486 -0.0166463538 -0.2808138925
0.0842988217 -0.0377003970 -0.2809425602
0.0754961348 -0.0573446073 -0.2811051683
0.0628246595 -0.0747178444 -0.2812945915
0.0468372916 -0.0890625417 -0.2815025666
0.0766653838 0.0036382582 -0.3394823580
0.0233968391 -0.0877102523 -0.3403536514
0.0888471486 -0.0166463538 -0.2808138925
0.0842988217 -0.0377003970 -0.2809425602
0.0754961348 -0.0573446073 -0.2811051683
0.0628246595 -0.0747178444 -0.2812945915
0.0468372916 -0.0890625417 -0.2815025666
0.0282332649 -0.0997511273 -0.2817199968
0.0889428772 0.0048993630 -0.2807247752
0.0728952285 0.0220849871 -0.3394420172
0.0282332649 -0.0997511273 -0.2817199968
0.0055463081 -0.0934081862 -0.3405436125
0.0985796043 -0.0178515311 -0.2149771037
0.0936118812 -0.0410489332 -0.2151184628
0.0839560631 -0.0626999472 -0.2152972520
0.0700341273 -0.0818596880 -0.2155056631
0.0524551970 -0.0976893898 -0.2157345757
0.0319867463 -0.1094980846 -0.2159739962
0.0889428772 0.0048993630 -0.2807247752
0.0845813599 0.0259947023 -0.2806791093
0.0653925081 0.0393401465 -0.3394413980
0.0078256063 -0.1063165629 -0.2819373802
0.0078256063 -0.1063165629 -0.2819373802
-0.0130913133 -0.0952496532 -0.3407251298
0.0985796043 -0.0178515311 -0.2149771037
0.0936118812 -0.0410489332 -0.2151184628
0.0839560631 -0.0626999472 -0.2152972520
0.0700341273 -0.0818596880 -0.2155056631
0.0524551970 -0.0976893898 -0.2157345757
0.0319867463 -0.1094980846 -0.2159739962
0.0095242572 -0.1167694581 -0.2162134515
0.0986426913 0.0058778699 -0.2148793496
0.0845813599 0.0259947023 -0.2806791093
0.0759535751 0.0457173579 -0.2806788886
0.0544864032 0.0546509109 -0.3394805101
0.0095242572 -0.1167694581 -0.2162134515
-0.0134940544 -0.1084719005 -0.2821452188
-0.0134940544 -0.1084719005 -0.2821452188
-0.0317039802 -0.0931542647 -0.3408902938
0.1054973748 -0.0187794970 -0.1436721515
0.1002323301 -0.0435481194 -0.1438227197
0.0899611671 -0.0666746293 -0.1440132947
0.0751324652 -0.0871477587 -0.1442355482
0.0563940044 -0.1040732758 -0.1444797717
0.0345658560 -0.1167111390 -0.1447352799
0.0106007456 -0.1245092533 -0.1449909186
0.0986426913 0.0058778699 -0.2148793496
0.0937976922 0.0291020703 -0.2148294797
0.0759535751 0.0457173579 -0.2806788886
0.0634366028 0.0632052318 -0.2807241231
0.0406531566 0.0673466840 -0.3395576540
-0.0139513233 -0.1191855698 -0.2164424828
-0.0139513233 -0.1191855698 -0.2164424828
-0.0347933138 -0.1061230077 -0.2823344234
-0.0347933138 -0.1061230077 -0.2823344234
-0.0494762288 -0.0872135289 -0.3410318672
0.1054973748 -0.0187794970 -0.1436721515
0.1002323301 -0.0435481194 -0.1438227197
0.0899611671 -0.0666746293 -0.1440132947
0.0751324652 -0.0871477587 -0.1442355482
0.0563940044 -0.1040732758 -0.1444797717
0.0345658560 -0.1167111390 -0.1447352799
0.0106007456 -0.1245092533 -0.1449909186
-0.0144526030 -0.1271267615 -0.1452355025
0.1055260916 0.0065490139 -0.1435681703
0.0937976922 0.0291020703 -0.2148294797
0.0842569660 0.0508057479 -0.2148296693
0.0634366028 0.0632052318 -0.2807241231
0.0475772696 0.0776947857 -0.2808128349
0.0244970980 0.0768727143 -0.3396694599
-0.0144526030 -0.1271267615 -0.1452355025
-0.0374140391 -0.1166408971 -0.2166510810
-0.0374140391 -0.1166408971 -0.2166510810
-0.0551420937 -0.0993724706 -0.2824967320
-0.0551420937 -0.0993724706 -0.2824967320
-0.0656317624 -0.0776870772 -0.3411436664
0.1094138210 -0.0179960896 -0.0736799150
0.1039975259 -0.0451374189 -0.0688114720
0.0933633584 -0.0691693509 -0.0690091429
0.0779928803 -0.0904523895 -0.0692397701
0.0585573674 -0.1080567831 -0.0694932802
0.0359057576 -0.1212129552 -0.0697585975
0.0110296410 -0.1293457799 -0.0700241107
-0.0149854835 -0.1321000456 -0.0702782326
0.1055260916 0.0065490139 -0.1435681703
0.1003171885 0.0313302996 -0.1435153216
0.0842569660 0.0508057479 -0.2148296693
0.0704374130 0.0700411762 -0.2148799073
0.0475772696 0.0776947857 -0.2808128349
0.0290688663 0.0885520219 -0.2809411484
0.0067253746 0.0828137138 -0.3398110273
-0.0395004353 -0.1244491549 -0.1454583530
-0.0395004353 -0.1244491549 -0.1454583530
-0.0598375999 -0.1092467660 -0.2168301218
-0.0598375999 -0.1092467660 -0.2168301218
-0.0736504970 -0.0885152870 -0.2826250457
-0.0736504970 -0.0885152870 -0.2826250457
-0.0794650094 -0.0649910413 -0.3412208093
0.1039975259 -0.0451374189 -0.0688114720
0.1080925346 -0.0323973828 -0.0687210793
0.1066340209 -0.0390084660 -0.0496619052
0.0933633584 -0.0691693509 -0.0690091429
0.1000033323 -0.0575639899 -0.0688996399
0.0972219284 -0.0637644681 -0.0498511333
0.0779928803 -0.0904523895 -0.0692397701
0.0868872181 -0.0804888564 -0.0691159461
0.0828967154 -0.0860113484 -0.0500759499
0.0585573674 -0.1080567831 -0.0694932802
0.0693173715 -0.1001705681 -0.0693605467
0.0642846212 -0.1047770783 -0.0503265290
0.0359057576 -0.1212129552 -0.0697585975
0.0480620048 -0.1157488299 -0.0696227483
0.0421988122 -0.1192413793 -0.0505919211
0.0110296410 -0.1293457799 -0.0700241107
0.0240494638 -0.1265424731 -0.0698910955
0.0176045066 -0.1287719170 -0.0508605269
-0.0149854835 -0.1321000456 -0.0702782326
-0.0016701517 -0.1320800557 -0.0701538558
-0.0084228785 -0.1329523566 -0.0511206030
-0.0410017134 -0.1293553423 -0.0705098480
-0.0279727944 -0.1321195430 -0.0703995453
-0.0347463252 -0.1315999948 -0.0513607875
0.1087291203 0.0087198786 -0.0845698261
0.1003171885 0.0313302996 -0.1435153216
0.0900984792 0.0544807209 -0.1435159159
0.0704374130 0.0700411762 -0.2148799073
0.0529420690 0.0859670988 -0.2149780093
0.0290688663 0.0885520219 -0.2809411484
0.0087200866 0.0953024012 -0.2811034576
-0.0118872922 0.0849090497 -0.3399761915
-0.0410017134 -0.1293553423 -0.0705098480
-0.0634475887 -0.1165934911 -0.1456497263
-0.0634475887 -0.1165934911 -0.1456497263
-0.0802432262 -0.0973262704 -0.2169717915
-0.0802432262 -0.0973262704 -0.2169717915
-0.0895098294 -0.0740262589 -0.2827137596
-0.0895098294 -0.0740262589 -0.2827137596
-0.0903716384 -0.0496813290 -0.3412599306
0.1048145147 -0.0457779001 0.0080692767
0.1007195060 -0.0585179362 0.0079788841
0.1070425153 -0.0393287066 -0.0112215309
0.0940795321 -0.0701232972 0.0078693811
0.0874395582 -0.0817286582 0.0077598781
0.0975800152 -0.0642414412 -0.0114118713
0.0785452204 -0.0916921913 0.0076360541
0.0696508826 -0.1016557245 0.0075122301
0.0742785477 -0.0965947824 -0.0117618618
0.0588908785 -0.1095419394 0.0073794966
0.0481308743 -0.1174281544 0.0072467632
0.0644513768 -0.1055196565 -0.0118901405
0.0359746271 -0.1228922797 0.0071109139
0.0238183798 -0.1283564050 0.0069750647
0.0300769996 -0.1255451669 -0.0122930146
0.0107985569 -0.1311597118 0.0068420495
-0.0022212660 -0.1339630186 0.0067090344
0.0044691417 -0.1324821897 -0.0125604619
-0.0155365977 -0.1339830084 0.0065846576
-0.0288519294 -0.1340029983 0.0064602809
-0.0086984356 -0.1338938380 -0.0126891579
-0.0418808485 -0.1312387976 0.0063499782
-0.0549097675 -0.1284745969 0.0062396755
-0.0351858927 -0.1325417225 -0.0129308744
0.1039791188 0.0326242773 -0.0684932316
0.0900984792 0.0544807209 -0.1435159159
0.0753160310 0.0749895119 -0.1435699282
0.0529420690 0.0859670988 -0.2149780093
0.0325369684 0.0978875951 -0.2151196742
0.0087200866 0.0953024012 -0.2811034576
-0.0125791728 0.0976512940 -0.2812926622
-0.0305254390 0.0830674242 -0.3401577143
-0.0658823537 -0.1212316091 -0.0707088375
-0.0537098656 -0.1266592105 -0.0706174352
-0.0602155644 -0.1247739275 -0.0515705849
-0.0658823537 -0.1212316091 -0.0707088375
-0.0852469149 -0.1039030009 -0.1458012529
-0.0852469149 -0.1039030009 -0.1458012529
-0.0977380444 -0.0814003996 -0.2170698888
-0.0977380444 -0.0814003996 -0.2170698888
-0.1020268028 -0.0565376490 -0.2827589911
-0.1020268028 -0.0565376490 -0.2827589911
-0.0978738339 -0.0324256431 -0.3412593044
0.0940795321 -0.0701232972 0.0078693811
0.1007195060 -0.0585179362 0.0079788841
0.0972190228 -0.0643997922 0.0272601365
0.0785452204 -0.0916921913 0.0076360541
0.0874395582 -0.0817286582 0.0077598781
0.0739175553 -0.0967531334 0.0269101460
0.0588908785 -0.1095419394 0.0073794966
0.0696508826 -0.1016557245 0.0075122301
0.0533303802 -0.1135642224 0.0266491338
0.0359746271 -0.1228922797 0.0071109139
0.0481308743 -0.1174281544 0.0072467632
0.0297160072 -0.1257035178 0.0263789932
0.0107985569 -0.1311597118 0.0068420495
0.0238183798 -0.1283564050 0.0069750647
0.0041081493 -0.1326405407 0.0261115459
-0.0155365977 -0.1339830084 0.0065846576
-0.0022212660 -0.1339630186 0.0067090344
-0.0223747597 -0.1340721789 0.0258584731
-0.0418808485 -0.1312387976 0.0063499782
-0.0288519294 -0.1340029983 0.0064602809
-0.0485758042 -0.1299358727 0.0256308307
-0.0670822556 -0.1230469955 0.0061482732
-0.0549097675 -0.1284745969 0.0062396755
-0.0733489959 -0.1204123703 0.0254385759
0.1039791188 0.0326242773 -0.0684932316
0.0998449055 0.0453519591 -0.0684797070
0.1024496079 0.0392316659 -0.0493805943
0.1080115514 0.0202102821 -0.0685064217
0.0933339452 0.0566519675 -0.0684942147
0.0753160310 0.0749895119 -0.1435699282
0.0566163328 0.0919602833 -0.1436749942
0.0325369684 0.0978875951 -0.2151196742
0.0101128815 0.1052819884 -0.2152987188
-0.0125791728 0.0976512940 -0.2812926622
-0.0338988336 0.0954960090 -0.2815005006
-0.0483754450 0.0773699643 -0.3403476687
-0.0670822556 -0.1230469955 0.0061482732
-0.0792547437 -0.1176193941 0.0060568709
-0.0729880035 -0.1202540193 -0.0132334319
-0.0885392350 -0.1080838433 -0.0708664967
-0.0777550009 -0.1159377147 -0.0707979883
-0.0837164932 -0.1127724432 -0.0517408168
-0.0885392350 -0.1080838433 -0.0708664967
-0.1039471383 -0.0869325456 -0.1459063251
-0.1039471383 -0.0869325456 -0.1459063251
-0.1115577018 -0.0621654971 -0.2171201300
-0.1115577018 -0.0621654971 -0.2171201300
-0.1106551125 -0.0368155199 -0.2827587774
-0.1106551125 -0.0368155199 -0.2827587774
-0.1016439892 -0.0139789142 -0.3412189636
0.0920921089 -0.0695130011 0.0847295987
0.0854521350 -0.0811183621 0.0846200957
0.0895853374 -0.0757000051 0.0655807423
0.0767766263 -0.0908365407 0.0844993190
0.0678822885 -0.1008000739 0.0843754950
0.0730332583 -0.0963253081 0.0653417785
0.0573869260 -0.1084921207 0.0842460270
0.0466269218 -0.1163783357 0.0841132935
0.0525784040 -0.1130393130 0.0650823990
0.0347706281 -0.1217078535 0.0839807955
0.0226143808 -0.1271719788 0.0838449462
0.0291140077 -0.1251113048 0.0648139340
0.0099145881 -0.1299062547 0.0837152011
-0.0031052348 -0.1327095615 0.0835821860
0.0036661649 -0.1320138121 0.0645481216
-0.0160925457 -0.1327290589 0.0834608732
-0.0294078774 -0.1327490487 0.0833364964
-0.0226527337 -0.1334452041 0.0642965809
-0.0421160296 -0.1300529170 0.0832289093
-0.0551449486 -0.1272887163 0.0831186066
-0.0486933947 -0.1293429324 0.0640702963
-0.0670175958 -0.1219948218 0.0830294557
-0.0791900839 -0.1165672204 0.0829380535
-0.0733166660 -0.1198862834 0.0638791672
0.1044500152 0.0341873796 -0.0063906089
0.0933339452 0.0566519675 -0.0684942147
0.0866582714 0.0682377062 -0.0685090899
0.0904513474 0.0628312497 -0.0493959610
0.0779528826 0.0779300017 -0.0685506650
0.0566163328 0.0919602833 -0.1436749942
0.0348164807 0.1046509304 -0.1438265251
0.0101128815 0.1052819884 -0.2152987188
-0.0133493081 0.1078263464 -0.2155073134
-0.0338988336 0.0954960090 -0.2815005006
-0.0543064920 0.0889304682 -0.2817178844
-0.0646570633 0.0680643918 -0.3405377567
-0.0900389778 -0.1097655227 0.0059883625
-0.0792547437 -0.1176193941 0.0060568709
-0.0848273570 -0.1137716339 0.0253586206
-0.0900389778 -0.1097655227 0.0059883625
-0.1008232120 -0.1019116514 0.0059198541
-0.0844663646 -0.1136132829 -0.0133133872
-0.1079832029 -0.0904865630 -0.0709759448
-0.0990582310 -0.1004233446 -0.0709333210
-0.1042227112 -0.0961199317 -0.0518640493
-0.1079832029 -0.0904865630 -0.0709759448
-0.1187291658 -0.0664238591 -0.1459603339
-0.1187291658 -0.0664238591 -0.1459603339
-0.1210984822 -0.0404607683 -0.2171203158
-0.1210984822 -0.0404607683 -0.2171203158
-0.1150165246 -0.0157201803 -0.2827131105
-0.1150165246 -0.0157201803 -0.2827131105
-0.1015184296 0.0048526886 -0.3411406814
0.0920921089 -0.0695130011 0.0847295987
0.0767766263 -0.0908365407 0.0844993190
0.0573869260 -0.1084921207 0.0842460270
0.0347706281 -0.1217078535 0.0839807955
0.0099145881 -0.1299062547 0.0837152011
-0.0160925457 -0.1327290589 0.0834608732
-0.0421160296 -0.1300529170 0.0832289093
-0.0670175958 -0.1219948218 0.0830294557
-0.0897090799 -0.1089067217 0.0828712292
0.0938834309 0.0572664422 0.0083891756
0.1005591047 0.0456807036 0.0084040508
0.0907260902 0.0631384871 -0.0109542659
0.0779528826 0.0779300017 -0.0685506650
0.0690279104 0.0878669410 -0.0685932882
0.0738358439 0.0834072061 -0.0494668094
0.0585089146 0.0955273346 -0.0686601129
0.0348164807 0.1046509304 -0.1438265251
0.0108698528 0.1125067001 -0.1440178930
-0.0133493081 0.1078263464 -0.2155073134
-0.0368248887 0.1054102347 -0.2157363447
-0.0543064920 0.0889304682 -0.2817178844
-0.0729105189 0.0782419878 -0.2819353141
-0.0786591562 0.0555581358 -0.3407196719
-0.0897090799 -0.1089067217 0.0828712292
-0.1004933140 -0.1010528504 0.0828027207
-0.0954466421 -0.1054883620 0.0637315455
-0.1097481839 -0.0919748698 0.0058772303
-0.1008232120 -0.1019116514 0.0059198541
-0.1143911660 -0.0870856544 0.0251919223
-0.1097481839 -0.0919748698 0.0058772303
-0.1186731558 -0.0820380882 0.0058346064
-0.1051052017 -0.0968640851 -0.0134374617
-0.1233646326 -0.0692091077 -0.0710324010
-0.1166885914 -0.0807944778 -0.0710175209
-0.1208383980 -0.0755444224 -0.0519349012
-0.1233646326 -0.0692091077 -0.0710324010
-0.1289481913 -0.0432729127 -0.1459609290
-0.1289481913 -0.0432729127 -0.1459609290
-0.1259436382 -0.0172370938 -0.2170704495
-0.1259436382 -0.0172370938 -0.2170704495
-0.1149203755 0.0058255370 -0.2826239894
-0.1149203755 0.0058255370 -0.2826239894
-0.0975016710 0.0232464473 -0.3410278688
0.0874492834 -0.0673535862 0.1596787613
0.0985682492 -0.0581934957 0.0848364018
0.0727300449 -0.0879065619 0.1594572027
0.0540826814 -0.1049330858 0.1592134159
0.0323220012 -0.1176889712 0.1589580543
0.0083996697 -0.1256164998 0.1587022850
-0.0166398031 -0.1283693008 0.1584572766
-0.0417016202 -0.1258270288 0.1582337414
-0.0656901026 -0.1181009055 0.1580414519
-0.0875575847 -0.1055286411 0.1578888049
0.0938834309 0.0572664422 0.0083891756
0.0872077571 0.0688521809 0.0083743004
0.0903650978 0.0629801361 0.0277177419
0.1046455178 0.0331001443 0.0083906825
0.1005591047 0.0456807036 0.0084040508
0.1065082282 0.0267306892 0.0277200023
0.0782827849 0.0787891202 0.0083316773
0.0872077571 0.0688521809 0.0083743004
0.0740007950 0.0838367654 -0.0110256382
0.0585089146 0.0955273346 -0.0686601129
0.0477246811 0.1033807854 -0.0687286231
0.0533296264 0.1000593233 -0.0495900435
0.0358520333 0.1086751003 -0.0688177722
0.0108698528 0.1125067001 -0.1440178930
-0.0141779795 0.1151843068 -0.1442407435
-0.0368248887 0.1054102347 -0.2157363447
-0.0592879041 0.0981392809 -0.2159758031
-0.0729105189 0.0782419878 -0.2819353141
-0.0888978872 0.0638975533 -0.2821432882
-0.0897691026 0.0403983124 -0.3408854554
-0.1091987025 -0.0913607652 0.0827611447
-0.1091987025 -0.0913607652 0.0827611447
-0.1181236745 -0.0814239835 0.0827185209
-0.1141164254 -0.0867786021 0.0636338795
-0.1253491970 -0.0704527180 0.0058197263
-0.1186731558 -0.0820380882 0.0058346064
-0.1221916726 -0.0763245786 0.0251631703
-0.1253491970 -0.0704527180 0.0058197263
-0.1320252382 -0.0588673479 0.0058048461
-0.1218306802 -0.0761662276 -0.0135088375
-0.1340097536 -0.0451814174 -0.0710333836
-0.1298756981 -0.0579090995 -0.0710469096
-0.1328369997 -0.0519452072 -0.0519502726
-0.1340097536 -0.0451814174 -0.0710333836
-0.1341568841 -0.0184916266 -0.1459080783
-0.1341568841 -0.0184916266 -0.1459080783
-0.1258808140 0.0064923068 -0.2169726979
-0.1258808140 0.0064923068 -0.2169726979
-0.1103720494 0.0268801060 -0.2824953195
-0.1103720494 0.0268801060 -0.2824953195
0.0874492834 -0.0673535862 0.1596787613
0.0727300449 -0.0879065619 0.1594572027
0.0540826814 -0.1049330858 0.1592134159
0.0323220012 -0.1176889712 0.1589580543
0.0083996697 -0.1256164998 0.1587022850
-0.0166398031 -0.1283693008 0.1584572766
-0.0417016202 -0.1258270288 0.1582337414
-0.0656901026 -0.1181009055 0.1580414519
-0.0875575847 -0.1055286411 0.1578888049
-0.1063475426 -0.0886594641 0.1577824805
0.0917341487 0.0563081921 0.0852414595
0.0984098225 0.0447224534 0.0852563348
0.0959661305 0.0509152723 0.0661587591
0.0782827849 0.0787891202 0.0083316773
0.0693578128 0.0887260596 0.0082890541
0.0736398027 0.0836784144 0.0276463696
0.0585735793 0.0965795103 0.0082205440
0.0693578128 0.0887260596 0.0082890541
0.0641461922 0.0927319604 -0.0110812049
0.0358520333 0.1086751003 -0.0688177722
0.0236790190 0.1141030163 -0.0689091781
0.0298281715 0.1120611222 -0.0497602790
0.0109708669 0.1167991481 -0.0690167653
-0.0141779795 0.1151843068 -0.1442407435
-0.0392318543 0.1125671132 -0.1444853311
-0.0592879041 0.0981392809 -0.2159758031
-0.0797558288 0.0863303766 -0.2162152196
-0.0888978872 0.0638975533 -0.2821432882
-0.1015698866 0.0465232640 -0.2823327206
-0.1063475426 -0.0886594641 0.1577824805
-0.1246347399 -0.0701239753 0.0827040123
-0.1246347399 -0.0701239753 0.0827040123
-0.1313107811 -0.0585386052 0.0826891321
-0.1285104853 -0.0645748371 0.0635904331
-0.1361592937 -0.0461396658 0.0058183722
-0.1320252382 -0.0588673479 0.0058048461
-0.1384068177 -0.0398550003 0.0251611391
-0.1361592937 -0.0461396658 0.0058183722
-0.1402933493 -0.0334119838 0.0058318982
-0.1380458253 -0.0396966493 -0.0135108687
-0.1394548812 -0.0194531855 -0.0709788625
-0.1380423974 -0.0327668968 -0.0710201933
-0.1396936190 -0.0263534092 -0.0519094861
-0.1394548812 -0.0194531855 -0.0709788625
-0.1341285878 0.0068368837 -0.1458041011
-0.1341285878 0.0068368837 -0.1458041011
-0.1209126178 0.0296897096 -0.2168313343
-0.1209126178 0.0296897096 -0.2168313343
-0.1015698866 0.0465232640 -0.2823327206
0.0802656371 -0.0636981674 0.2308708484
0.0975966702 -0.0441720643 0.1598684061
0.0665053682 -0.0829744747 0.2306634691
0.1021837286 -0.0459195618 0.0913973441
0.0490591369 -0.0989527487 0.2304351869
0.0286908310 -0.1109345094 0.2301959925
0.0062896128 -0.1183959345 0.2299563309
-0.0171646344 -0.1210110419 0.2297266839
-0.0406475451 -0.1186654274 0.2295170822
-0.0631328428 -0.1114614799 0.2293366863
-0.0836370292 -0.0997143485 0.2291933867
-0.1012651397 -0.0839375018 0.2290934349
0.0917341487 0.0563081921 0.0852414595
0.1024422552 0.0323084581 0.0852431446
0.1024422552 0.0323084581 0.0852431446
0.0762982162 0.0775451397 0.0851843287
0.0852231884 0.0676082004 0.0852269519
0.0815724905 0.0731194848 0.0661153185
0.0585735793 0.0965795103 0.0082205440
0.0477893458 0.1044329611 0.0081520338
0.0637851998 0.0925736095 0.0275908029
0.0356163316 0.1098608772 0.0080606279
0.0477893458 0.1044329611 0.0081520338
0.0297103206 0.1126540107 -0.0113210789
0.0109708669 0.1167991481 -0.0690167653
-0.0020575262 0.1195631393 -0.0691270639
0.0043591952 0.1188871374 -0.0499700742
-0.0150448371 0.1195436419 -0.0692483767
-0.0392318543 0.1125671132 -0.1444853311
-0.0631964386 0.1047687368 -0.1447409659
-0.0797558288 0.0863303766 -0.2162152196
-0.0973352838 0.0705000432 -0.2164441397
-0.1212393129 -0.0682309530 0.1577271189
-0.1212393129 -0.0682309530 0.1577271189
-0.1353434249 -0.0461240846 0.0827023225
-0.1353434249 -0.0461240846 0.0827023225
-0.1394774804 -0.0333964025 0.0827158485
-0.1379988833 -0.0398472097 0.0636031142
-0.1417058331 -0.0200982725 0.0058732289
-0.1402933493 -0.0334119838 0.0058318982
-0.1425925712 -0.0135205924 0.0252298982
-0.1417058331 -0.0200982725 0.0058732289
-0.1431183169 -0.0067845613 0.0059145597
-0.1408190950 -0.0266759527 -0.0134834404
-0.1394606778 0.0068504361 -0.0708712107
-0.1408321655 -0.0064674546 -0.0709385462
-0.1411090011 0.0001121129 -0.0518143294
-0.1394606778 0.0068504361 -0.0708712107
-0.1288631752 0.0316055066 -0.1456535294
-0.1288631752 0.0316055066 -0.1456535294
-0.1112566946 0.0513407238 -0.2166525442
-0.1112566946 0.0513407238 -0.2166525442
0.0802656371 -0.0636981674 0.2308708484
0.0665053682 -0.0829744747 0.2306634691
0.0975966702 -0.0441720643 0.1598684061
0.0490591369 -0.0989527487 0.2304351869
0.0286908310 -0.1109345094 0.2301959925
0.0062896128 -0.1183959345 0.2299563309
-0.0171646344 -0.1210110419 0.2297266839
-0.0406475451 -0.1186654274 0.2295170822
-0.0631328428 -0.1114614799 0.2293366863
-0.0836370292 -0.0997143485 0.2291933867
-0.1012651397 -0.0839375018 0.2290934349
-0.1152454736 -0.0648196498 0.2290412146
0.0869389646 0.0538007917 0.1601700906
0.0972812801 0.0307057538 0.1601720656
0.0762982162 0.0775451397 0.0851843287
0.0568085939 0.0950908860 0.0850742434
0.0675928274 0.0872374353 0.0851427536
0.0629027071 0.0918292973 0.0660176527
0.0356163316 0.1098608772 0.0080606279
0.0234433173 0.1152887932 0.0079692220
0.0293493282 0.1124956597 0.0273509289
0.0104149242 0.1180527844 0.0078589234
0.0234433173 0.1152887932 0.0079692220
0.0040812239 0.1195139555 -0.0115322299
-0.0150448371 0.1195436419 -0.0692483767
-0.0283601688 0.1195236521 -0.0693727534
-0.0219639885 0.1202393944 -0.0502102566
-0.0410599615 0.1167893762 -0.0695024985
-0.0631964386 0.1047687368 -0.1447409659
-0.0850251118 0.0921303472 -0.1449964811
-0.0973352838 0.0705000432 -0.2164441397
-0.1152454736 -0.0648196498 0.2290412146
-0.1315817869 -0.0451353898 0.1577251446
-0.1315817869 -0.0451353898 0.1577251446
-0.1408547647 -0.0204106716 0.0827561648
-0.1408547647 -0.0204106716 0.0827561648
-0.1422672485 -0.0070969603 0.0827974956
-0.1421670370 -0.0136767919 0.0636713662
-0.1417468292 0.0065333294 0.0059818951
-0.1431183169 -0.0067845613 0.0059145597
-0.1412415816 0.0131130993 0.0253515668
-0.1417468292 0.0065333294 0.0059818951
-0.1403753416 0.0198512202 0.0060492306
-0.1408805892 0.0132714503 -0.0133204410
-0.1340285295 0.0325808039 -0.0707151445
-0.1381233805 0.0198407681 -0.0708055357
-0.1370214393 0.0262951875 -0.0516689609
-0.1340285295 0.0325808039 -0.0707151445
-0.1185918545 0.0547320167 -0.1454629529
-0.1185918545 0.0547320167 -0.1454629529
0.0707183914 -0.0586355225 0.2965528058
0.0897394973 -0.0419648926 0.2310482759
0.0582553189 -0.0761616341 0.2963647020
0.1027292538 -0.0193752533 0.1600178533
0.0424406680 -0.0906982133 0.2961575535
0.0239657767 -0.1016108661 0.2959404113
0.0036378742 -0.1084225222 0.2957227642
-0.0176540550 -0.1108353557 0.2955141301
-0.0389802530 -0.1087440409 0.2953236193
-0.0594080306 -0.1022399101 0.2951595643
-0.0780448789 -0.0916071805 0.2950291325
-0.0940763366 -0.0773106045 0.2949380238
-0.1068017670 -0.0599754948 0.2948902179
0.0869389646 0.0538007917 0.1601700906
0.0972812801 0.0307057538 0.1601720656
0.1026225569 0.0059530543 0.1601205696
0.0720472992 0.0742295132 0.1601147309
0.0568085939 0.0950908860 0.0850742434
0.0341165838 0.1081791956 0.0849160128
0.0462895981 0.1027512796 0.0850074187
0.0407724686 0.1062269029 0.0658700272
0.0104149242 0.1180527844 0.0078589234
-0.0026134688 0.1208167756 0.0077486247
0.0037202315 0.1193556045 0.0271397779
-0.0159288005 0.1207967858 0.0076242480
-0.0026134688 0.1208167756 0.0077486247
-0.0224059702 0.1208659663 -0.0117739443
-0.0410599615 0.1167893762 -0.0695024985
-0.0540803104 0.1139862789 -0.0696355177
-0.0479918996 0.1160591643 -0.0504703368
-0.0659366035 0.1086563405 -0.0697680175
-0.0850251118 0.0921303472 -0.1449964811
-0.1037630469 0.0752048308 -0.1452406998
-0.1249680103 -0.0431977278 0.2290389931
-0.1249680103 -0.0431977278 0.2290389931
-0.1369234316 -0.0203826908 0.1577766372
-0.1369234316 -0.0203826908 0.1577766372
-0.1409299512 0.0058933716 0.0828631706
-0.1409299512 0.0058933716 0.0828631706
-0.1395584636 0.0192112624 0.0829305061
-0.1408331426 0.0127931204 0.0637922045
-0.1362804905 0.0325912560 0.0061396217
-0.1403753416 0.0198512202 0.0060492306
-0.1385084122 0.0261420626 0.0254304301
-0.1362804905 0.0325912560 0.0061396217
-0.1321856395 0.0453312918 0.0062300129
-0.1381474198 0.0263004136 -0.0132415777
-0.1233937835 0.0566125792 -0.0705174688
-0.1300341248 0.0450068496 -0.0706269767
-0.1276092153 0.0510511110 -0.0514797318
-0.1233937835 0.0566125792 -0.0705174688
-0.1037630469 0.0752048308 -0.1452406998
0.0707183914 -0.0586355225 0.2965528058
0.0582553189 -0.0761616341 0.2963647020
0.0897394973 -0.0419648926 0.2310482759
0.0424406680 -0.0906982133 0.2961575535
0.1027292538 -0.0193752533 0.1600178533
0.0239657767 -0.1016108661 0.2959404113
0.0036378742 -0.1084225222 0.2957227642
-0.0176540550 -0.1108353557 0.2955141301
-0.0389802530 -0.1087440409 0.2953236193
-0.0594080306 -0.1022399101 0.2951595643
-0.0780448789 -0.0916071805 0.2950291325
-0.0940763366 -0.0773106045 0.2949380238
-0.1068017670 -0.0599754948 0.2948902179
-0.1156643672 -0.0403578049 0.2948878169
0.0796152788 0.0498066252 0.2313295476
0.0893377104 0.0281847031 0.2313317681
0.0943768296 0.0050023240 0.2312838816
0.1026225569 0.0059530543 0.1601205696
0.0720472992 0.0742295132 0.1601147309
0.0532568155 0.0910986894 0.1600084015
0.0341165838 0.1081791956 0.0849160128
0.0092155429 0.1162375018 0.0847165650
0.0222439360 0.1134735106 0.0848268637
0.0161489339 0.1156839720 0.0656788974
-0.0159288005 0.1207967858 0.0076242480
-0.0292441323 0.1207767959 0.0074998712
-0.0094516309 0.1207276052 0.0270224402
-0.0422644811 0.1179736986 0.0073668520
-0.0292441323 0.1207767959 0.0074998712
-0.0485941594 0.1166513255 -0.0120356615
-0.0659366035 0.1086563405 -0.0697680175
-0.0780923246 0.1031919006 -0.0699038631
-0.0725859417 0.1065282065 -0.0507389419
-0.0885876873 0.0954999589 -0.0700333307
-0.1156643672 -0.0403578049 0.2948878169
-0.1300070770 -0.0200153486 0.2290868801
-0.1300070770 -0.0200153486 0.2290868801
-0.1370297080 0.0049456175 0.1578793574
-0.1370297080 0.0049456175 0.1578793574
-0.1355640589 0.0316373080 0.0830186739
-0.1355640589 0.0316373080 0.0830186739
-0.1314692079 0.0443773439 0.0831090651
-0.1340553454 0.0384051244 0.0639603473
-0.1255452982 0.0569370214 0.0063395208
-0.1321856395 0.0453312918 0.0062300129
-0.1224056238 0.0626607107 0.0257302787
-0.1255452982 0.0569370214 0.0063395208
-0.1189049569 0.0685427509 0.0064490287
-0.1220446314 0.0628190617 -0.0129417291
-0.1080232014 0.0778963013 -0.0702868379
-0.1169175389 0.0679326105 -0.0704106625
-0.1132835829 0.0732987016 -0.0512549085
-0.1080232014 0.0778963013 -0.0702868379
0.0590423780 -0.0522927483 0.3551081230
0.0792854160 -0.0388875786 0.2967136388
0.0481834599 -0.0676351365 0.3549439352
0.0945129733 -0.0187267780 0.2311879885
0.0343893648 -0.0803726484 0.3547630147
0.0182627098 -0.0899475642 0.3545732703
0.0005093590 -0.0959416334 0.3543830037
-0.0180967706 -0.0980928972 0.3542005118
-0.0367405010 -0.0963073994 0.3540337889
-0.0546079663 -0.0906630878 0.3538901130
-0.0709181588 -0.0814064968 0.3537757650
-0.0849586898 -0.0689428660 0.3536957357
-0.0961152586 -0.0538162602 0.3536535314
-0.1039005975 -0.0366876917 0.3536509941
0.0796152788 0.0498066252 0.2313295476
0.0893377104 0.0281847031 0.2313317681
0.0943768296 0.0050023240 0.2312838816
0.0945129733 -0.0187267780 0.2311879885
0.1076408117 0.0005274792 0.1039867056
0.0656344199 0.0689240559 0.2312773207
0.0532568155 0.0910986894 0.1600084015
0.0313898584 0.1036714803 0.1598557616
0.0092155429 0.1162375018 0.0847165650
-0.0168079410 0.1189136437 0.0844846011
-0.0034926092 0.1189336336 0.0846089779
-0.0098912011 0.1197860342 0.0654526168
-0.0422644811 0.1179736986 0.0073668520
-0.0552848300 0.1151706013 0.0072338328
-0.0489551518 0.1164929745 0.0266363463
-0.0674405511 0.1097061614 0.0070979872
-0.0552848300 0.1151706013 0.0072338328
-0.0733379155 0.1070531169 -0.0123059395
-0.0885876873 0.0954999589 -0.0700333307
-0.0993476921 0.0876141645 -0.0701660625
-0.0946714884 0.0920642212 -0.0510043302
-0.1202774932 -0.0193175154 0.2949309087
-0.1202774932 -0.0193175154 0.2949309087
-0.1301434834 0.0037137530 0.2291827708
-0.1301434834 0.0037137530 0.2291827708
-0.1318973347 0.0297424282 0.1580288026
-0.1318973347 0.0297424282 0.1580288026
-0.1249929632 0.0556973752 0.0832158713
-0.1249929632 0.0556973752 0.0832158713
-0.1183526219 0.0673031047 0.0833253793
-0.1221294563 0.0620408876 0.0641684539
-0.1100106194 0.0785064418 0.0065728534
-0.1189049569 0.0685427509 0.0064490287
-0.1057439468 0.0834091117 0.0259707696
-0.1100106194 0.0785064418 0.0065728534
-0.1011162818 0.0884701326 0.0066966781
-0.1142772919 0.0736037718 -0.0128250628
0.0792854160 -0.0388875786 0.2967136388
0.0699436526 0.0444235415 0.2969675716
0.0788067768 0.0248069037 0.2969699818
0.0834199037 0.0037660885 0.2969268879
0.0835819658 -0.0177792412 0.2968401786
0.0656344199 0.0689240559 0.2312773207
0.0480068350 0.0847010085 0.2311773743
0.0313898584 0.1036714803 0.1598557616
0.0074008499 0.1113978656 0.1596634683
-0.0168079410 0.1189136437 0.0844846011
-0.0428156007 0.1160910490 0.0842302691
-0.0297952519 0.1188941463 0.0843632884
-0.0362103627 0.1183547470 0.0652010741
-0.0674405511 0.1097061614 0.0070979872
-0.0795962722 0.1042417215 0.0069621416
-0.0736989079 0.1068947659 0.0263660683
-0.0903562770 0.0963559270 0.0068294098
-0.0795962722 0.1042417215 0.0069621416
-0.0847957784 0.1003779997 -0.0124402282
-0.1079739674 -0.0183060784 0.3536882378
-0.1204394502 0.0022278145 0.2950176189
-0.1204394502 0.0022278145 0.2950176189
-0.1253698506 0.0269523935 0.2293224870
-0.1253698506 0.0269523935 0.2293224870
-0.1217496317 0.0529234248 0.1582184483
-0.1217496317 0.0529234248 0.1582184483
-0.1096771127 0.0770209679 0.0834461546
-0.1096771127 0.0770209679 0.0834461546
-0.1007827752 0.0869846587 0.0835699793
-0.1055771935 0.0826663748 0.0644074202
-0.0903562770 0.0963559270 0.0068294098
-0.1011162818 0.0884701326 0.0066966781
-0.0851567708 0.1002196488 0.0262317796
0.0664919385 -0.0350146159 0.3552484116
0.0699436526 0.0444235415 0.2969675716
0.0788067768 0.0248069037 0.2969699818
0.0834199037 0.0037660885 0.2969268879
0.0835819658 -0.0177792412 0.2968401786
0.0572187471 0.0617591776 0.2969197727
0.0480068350 0.0847010085 0.2311773743
0.0275021217 0.0964489277 0.2310340729
0.0074008499 0.1113978656 0.1596634683
-0.0176604411 0.1139398229 0.1594399368
-0.0428156007 0.1160910490 0.0842302691
-0.0676711146 0.1078923332 0.0839646784
-0.0555153934 0.1133567732 0.0841005240
-0.0616584685 0.1114522918 0.0649352595
-0.1081575043 0.0005250604 0.3537636328
-0.1161435312 0.0233361510 0.2951441528
-0.1161435312 0.0233361510 0.2951441528
-0.1158959362 0.0486846170 0.2294999107
-0.1158959362 0.0486846170 0.2294999107
-0.1070308146 0.0734770308 0.1584400055
-0.1070308146 0.0734770308 0.1584400055
-0.0902874124 0.0946766004 0.0836994469
-0.0902874124 0.0946766004 0.0836994469
-0.0795274076 0.1025623948 0.0838321786
-0.0851223385 0.0993799855 0.0646667981
0.0581630378 0.0377846683 0.3554687562
0.0659478510 0.0206560990 0.3554712886
0.0700217466 0.0022744865 0.3554340497
0.0702052835 -0.0165566523 0.3553586548
0.0572187471 0.0617591776 0.2969197727
0.0411872889 0.0760560690 0.2968286653
0.0275021217 0.0964489277 0.2310340729
0.0050173503 0.1036524029 0.2308536801
-0.0176604411 0.1139398229 0.1594399368
-0.0426999139 0.1111870220 0.1591949283
-0.0676711146 0.1078923332 0.0839646784
-0.1044441593 0.0189830240 0.3538738760
-0.1075759817 0.0430846213 0.2953049929
-0.1075759817 0.0430846213 0.2953049929
-0.1021355630 0.0679614502 0.2297072931
-0.1021355630 0.0679614502 0.2297072931
-0.0883829252 0.0905033452 0.1586837963
-0.0883829252 0.0905033452 0.1586837963
0.0470064693 0.0529110638 0.3554265511
0.0411872889 0.0760560690 0.2968286653
0.0225504409 0.0866886410 0.2966982329
0.0050173503 0.1036524029 0.2308536801
-0.0184655604 0.1059980174 0.2306440783
-0.0426999139 0.1111870220 0.1591949283
-0.0666227709 0.1032593875 0.1589391537
-0.0969951237 0.0362606299 0.3540141576
-0.0951129081 0.0606099969 0.2954930937
-0.0951129081 0.0606099969 0.2954930937
-0.0846898575 0.0839398285 0.2299355709
-0.0846898575 0.0839398285 0.2299355709
-0.0666227709 0.1032593875 0.1589391537
0.0329659375 0.0653752203 0.3553465238
0.0225504409 0.0866886410 0.2966982329
0.0021226631 0.0931928769 0.2965341783
-0.0184655604 0.1059980174 0.2306440783
-0.0419203337 0.1033832245 0.2304144277
-0.0861356815 0.0516040703 0.3541783545
-0.0792982580 0.0751471018 0.2957002444
-0.0792982580 0.0751471018 0.2957002444
-0.0643210258 0.0959215374 0.2301747700
-0.0643210258 0.0959215374 0.2301747700
0.0166557449 0.0746318639 0.3552321761
0.0021226631 0.0931928769 0.2965341783
-0.0192035348 0.0952841391 0.2963436673
-0.0419203337 0.1033832245 0.2304144277
-0.0723415860 0.0643413193 0.3543592740
-0.0608233669 0.0860598598 0.2959173870
-0.0608233669 0.0860598598 0.2959173870
-0.0012122453 0.0802757016 0.3550884933
-0.0192035348 0.0952841391 0.2963436673
-0.0404954640 0.0928713056 0.2961350332
-0.0562154560 0.0739158138 0.3545490117
-0.0404954640 0.0928713056 0.2961350332
-0.0198554503 0.0820613579 0.3549217759
-0.0384615800 0.0799101466 0.3547392843
0.0777437749 -0.0037184086 -0.3640748109
0.0881275536 -0.0036710722 -0.3717584204
0.0871452196 -0.0038038232 -0.3395948029
0.0906388339 -0.0036587410 -0.3738330971
0.0748738210 -0.0037324989 -0.3617043519
0.0716619586 -0.0038663960 -0.3301009452
0.0965585327 -0.0035939546 -0.3874774462
0.0996793099 -0.0035119620 -0.4063945894
0.1168254182 -0.0033823155 -0.4316993446
0.0996793099 -0.0035119620 -0.4063945894
0.0901651745 -0.0034026620 -0.4367709026
0.1263395535 -0.0034916155 -0.4013230314
0.1073112828 -0.0032730154 -0.4620756578
0.0901651745 -0.0034026620 -0.4367709026
0.0806510392 -0.0032933619 -0.4671472157
0.1168254182 -0.0033823155 -0.4316993446
-0.0142131044 -0.0944582239 -0.3689475066
-0.0141246028 -0.1047378838 -0.3767700315
-0.0144259580 -0.1041875275 -0.3445964715
-0.0141011843 -0.1072209729 -0.3788780446
-0.0142398648 -0.0916198351 -0.3665388271
-0.0145396125 -0.0888330176 -0.3348968028
-0.0139643926 -0.1129569114 -0.3926006009
-0.0137830212 -0.1158235883 -0.4115568361
-0.0135193049 -0.1326281851 -0.4370885247
-0.0137830212 -0.1158235883 -0.4115568361
-0.0135154029 -0.1059024000 -0.4418016361
-0.0137869233 -0.1425493735 -0.4068437247
-0.0132516866 -0.1227069967 -0.4673333247
-0.0135154029 -0.1059024000 -0.4418016361
-0.0132477845 -0.0959812116 -0.4720464362
-0.0135193049 -0.1326281851 -0.4370885247
-0.0145373144 0.0940441138 -0.3645348677
-0.0144805594 0.1043874386 -0.3722732437
-0.0147798125 0.1035738858 -0.3401055117
-0.0144648122 0.1068883392 -0.3743610255
-0.0145553066 0.0911866201 -0.3621494294
-0.0148460704 0.0881405616 -0.3305317309
-0.0143458621 0.1127365126 -0.3880353158
-0.0141735480 0.1157579670 -0.4069682613
-0.0139618901 0.1327711415 -0.4323619616
-0.0141735480 0.1157579670 -0.4069682613
-0.0138757649 0.1060848998 -0.4372931967
-0.0142596731 0.1424442087 -0.4020370262
-0.0136641070 0.1230980743 -0.4626868970
-0.0138757649 0.1060848998 -0.4372931967
-0.0135779818 0.0964118326 -0.4676181321
-0.0139618901 0.1327711415 -0.4323619616
-0.1107334206 -0.0039865017 -0.3694775149
-0.1205901353 -0.0041008279 -0.3451773948
-0.1209718950 -0.0039701226 -0.3773542799
-0.1234440058 -0.0039652719 -0.3794757160
-0.1079076928 -0.0039920412 -0.3670538533
-0.1052865049 -0.0041171771 -0.3353970122
-0.1291074847 -0.0039178731 -0.3932287352
-0.1318754783 -0.0038447250 -0.4121999383
-0.1485461072 -0.0037658463 -0.4378205712
-0.1384664126 -0.0036271301 -0.4680139925
-0.1117160892 -0.0035672926 -0.4725867808
-0.1217957838 -0.0037060088 -0.4423933596
-0.1318754783 -0.0038447250 -0.4121999383
-0.1586258018 -0.0039045624 -0.4076271500
-0.1217957838 -0.0037060088 -0.4423933596
-0.1485461072 -0.0037658463 -0.4378205712
3 493 712 713
3 712 673 713
3 727 493 713
3 712 493 714
3 673 444 713
3 673 712 310
3 326 727 713
3 493 727 56
3 712 714 310
3 493 56 714
3 444 30 713
3 444 673 679
3 673 310 679
3 610 326 713
3 727 326 495
3 727 495 56
3 310 714 633
3 714 56 717
3 30 559 713
3 30 444 687
3 444 679 687
3 679 310 433
3 325 610 713
3 326 610 485
3 326 485 495
3 56 495 522
3 310 633 433
3 714 717 633
3 56 522 717
3 559 29 713
3 559 30 82
3 30 687 82
3 687 679 513
3 679 433 513
3 728 325 713
3 610 325 285
3 610 285 485
3 495 485 305
3 495 305 522
3 633 60 433
3 717 284 633
3 522 718 717
3 29 445 713
3 29 559 686
3 559 82 686
3 82 687 667
3 687 513 667
3 433 606 513
3 494 728 713
3 325 728 484
3 325 484 285
3 485 285 654
3 485 654 305
3 305 317 522
3 433 60 729
3 633 303 60
3 284 454 633
3 717 234 284
3 717 718 201
3 522 653 718
3 445 674 713
3 445 29 680
3 29 686 680
3 686 82 514
3 82 667 514
3 513 367 667
3 606 643 513
3 433 383 606
3 711 494 713
3 728 494 496
3 728 496 484
3 285 484 507
3 285 507 654
3 654 388 305
3 522 317 653
3 305 438 317
3 32 433 729
3 633 454 303
3 234 717 201
3 674 711 713
3 674 445 311
3 445 680 311
3 680 686 432
3 686 514 432
3 667 59 514
3 667 367 521
3 513 389 367
3 513 643 389
3 433 32 383
3 494 711 57
3 494 57 496
3 484 496 655
3 484 655 507
3 507 726 654
3 305 388 720
3 654 583 388
3 438 305 599
3 711 674 715
3 674 311 715
3 311 680 634
3 680 432 634
3 514 598 432
3 59 473 514
3 667 378 59
3 667 521 378
3 711 715 57
3 496 57 304
3 496 304 655
3 655 87 507
3 654 726 342
3 507 61 726
3 720 267 305
3 654 342 583
3 305 267 599
3 715 311 716
3 311 634 716
3 432 0 634
3 432 598 742
3 514 698 598
3 514 473 721
3 57 715 523
3 57 523 304
3 304 327 655
3 507 87 61
3 655 166 87
3 715 716 523
3 634 202 716
3 0 174 634
3 432 742 0
3 698 514 721
3 523 540 304
3 327 1 655
3 304 439 327
3 166 655 391
3 716 38 523
3 202 719 716
3 634 180 202
3 634 174 180
3 304 540 324
3 523 585 540
3 655 1 391
3 439 304 324
3 523 38 164
3 716 77 38
3 716 719 77
3 585 523 164
3 187 373 213
3 162 373 187
3 363 187 213
3 373 635 213
3 215 162 187
3 162 609 373
3 215 187 363
3 9 363 213
3 609 635 373
3 635 659 213
3 264 162 215
3 279 609 162
3 527 215 363
3 527 363 9
3 499 9 213
3 609 297 635
3 297 659 635
3 659 476 213
3 186 264 215
3 264 279 162
3 279 260 609
3 186 215 527
3 571 527 9
3 571 9 499
3 681 499 213
3 260 297 609
3 297 397 659
3 397 476 659
3 476 404 213
3 437 264 186
3 22 279 264
3 151 260 279
3 94 186 527
3 94 527 571
3 51 571 499
3 51 499 681
3 338 681 213
3 260 254 297
3 254 397 297
3 397 443 476
3 443 404 476
3 404 625 213
3 209 437 186
3 437 22 264
3 22 151 279
3 151 614 260
3 209 186 94
3 449 94 571
3 449 571 51
3 348 51 681
3 348 681 338
3 19 338 213
3 614 254 260
3 254 16 397
3 16 443 397
3 443 746 404
3 746 625 404
3 625 359 213
3 316 437 209
3 620 22 437
3 691 151 22
3 258 614 151
3 289 209 94
3 289 94 449
3 98 449 51
3 98 51 348
3 283 348 338
3 283 338 19
3 379 19 213
3 614 739 254
3 739 16 254
3 16 307 443
3 307 746 443
3 746 233 625
3 233 359 625
3 359 361 213
3 194 747 209
3 316 747 194
3 316 748 437
3 620 748 316
3 620 749 22
3 691 749 620
3 691 750 151
3 258 750 691
3 258 751 614
3 603 751 258
3 194 209 289
3 329 289 449
3 329 449 98
3 467 98 348
3 467 348 283
3 395 283 19
3 395 19 379
3 381 379 213
3 603 739 614
3 739 589 16
3 589 307 16
3 307 321 746
3 321 233 746
3 233 231 359
3 231 361 359
3 361 623 213
3 316 752 593
3 194 752 316
3 620 753 79
3 316 753 620
3 691 754 509
3 620 754 691
3 258 755 157
3 691 755 258
3 603 756 474
3 258 756 603
3 431 757 289
3 194 757 431
3 431 289 329
3 244 329 98
3 244 98 467
3 358 467 283
3 358 283 395
3 483 395 379
3 483 379 381
3 17 381 213
3 603 758 739
3 41 758 603
3 41 589 739
3 589 103 307
3 103 321 307
3 321 319 233
3 319 231 233
3 231 744 361
3 744 623 361
3 623 400 213
3 196 759 194
3 593 759 196
3 593 760 316
3 79 760 593
3 79 761 620
3 509 761 79
3 509 762 691
3 157 762 509
3 157 763 258
3 474 763 157
3 474 764 603
3 472 764 474
3 194 765 196
3 431 765 194
3 542 766 329
3 431 766 542
3 542 329 244
3 28 244 467
3 28 467 358
3 35 358 395
3 35 395 483
3 481 483 381
3 481 381 17
3 334 17 213
3 41 767 472
3 603 767 41
3 41 768 589
3 293 768 41
3 293 103 589
3 103 105 321
3 105 319 321
3 319 309 231
3 309 744 231
3 744 441 623
3 441 400 623
3 400 478 213
3 593 769 578
3 196 769 593
3 79 770 460
3 593 770 79
3 509 771 630
3 79 771 509
3 157 772 705
3 509 772 157
3 474 773 412
3 157 773 474
3 472 774 236
3 474 774 472
3 55 775 431
3 196 775 55
3 431 776 55
3 542 776 431
3 733 777 244
3 542 777 733
3 733 244 28
3 648 28 358
3 648 358 35
3 421 35 483
3 421 483 481
3 393 481 17
3 393 17 334
3 683 334 213
3 472 778 41
3 372 778 472
3 293 779 372
3 41 779 293
3 293 780 103
3 291 780 293
3 291 105 103
3 105 587 319
3 587 309 319
3 309 14 744
3 14 441 744
3 441 399 400
3 399 478 400
3 478 657 213
3 183 781 196
3 578 781 183
3 578 782 593
3 460 782 578
3 460 783 79
3 630 783 460
3 630 784 509
3 705 784 630
3 705 785 157
3 412 785 705
3 412 786 474
3 236 786 412
3 236 787 472
3 219 787 236
3 196 788 183
3 55 788 196
3 561 789 542
3 55 789 561
3 542 790 561
3 733 790 542
3 354 791 28
3 733 791 354
3 354 28 648
3 618 648 35
3 618 35 421
3 419 421 481
3 419 481 393
3 281 393 334
3 281 334 683
3 497 683 213
3 372 792 219
3 472 792 372
3 372 793 293
3 370 793 372
3 291 794 370
3 293 794 291
3 291 795 105
3 43 795 291
3 43 587 105
3 587 737 309
3 737 14 309
3 14 252 441
3 252 399 441
3 399 295 478
3 295 657 478
3 657 637 213
3 578 796 407
3 183 796 578
3 460 797 74
3 578 797 460
3 630 798 226
3 460 798 630
3 705 799 551
3 630 799 705
3 412 800 565
3 705 800 412
3 236 801 595
3 412 801 236
3 219 802 86
3 236 802 219
3 64 803 55
3 183 803 64
3 55 804 64
3 561 804 55
3 662 805 733
3 561 805 662
3 733 806 662
3 354 806 733
3 725 807 648
3 354 807 725
3 725 648 618
3 385 618 421
3 385 421 419
3 37 419 393
3 37 393 281
3 350 281 683
3 350 683 497
3 11 497 213
3 219 808 372
3 221 808 219
3 370 809 221
3 372 809 370
3 370 810 291
3 470 810 370
3 43 811 470
3 291 811 43
3 43 812 587
3 601 812 43
3 601 737 587
3 737 612 14
3 612 252 14
3 252 262 399
3 262 295 399
3 295 608 657
3 608 637 657
3 637 375 213
3 211 813 183
3 407 813 211
3 407 814 578
3 74 814 407
3 74 815 460
3 226 815 74
3 226 816 630
3 551 816 226
3 551 817 705
3 565 817 551
3 565 818 412
3 595 818 565
3 595 819 236
3 86 819 595
3 86 820 219
3 84 820 86
3 183 821 211
3 64 821 183
3 693 822 561
3 64 822 693
3 561 823 693
3 662 823 561
3 535 824 354
3 662 824 535
3 354 825 535
3 725 825 354
3 529 826 618
3 725 826 529
3 529 618 385
3 387 385 419
3 387 419 37
3 356 37 281
3 356 281 350
3 49 350 497
3 49 497 11
3 365 11 213
3 221 827 84
3 219 827 221
3 221 828 370
3 238 828 221
3 470 829 238
3 370 829 470
3 470 830 43
3 475 830 470
3 601 831 475
3 43 831 601
3 601 832 737
3 256 832 601
3 256 612 737
3 612 153 252
3 153 262 252
3 262 277 295
3 277 608 295
3 608 160 637
3 160 375 637
3 375 189 213
3 407 833 267
3 211 833 407
3 74 834 486
3 407 834 74
3 226 835 410
3 74 835 226
3 551 836 639
3 226 836 551
3 565 837 668
3 551 837 565
3 595 838 170
3 565 838 595
3 86 839 574
3 595 839 86
3 84 840 572
3 86 840 84
3 341 841 64
3 211 841 341
3 64 842 341
3 693 842 64
3 538 843 662
3 693 843 538
3 662 844 538
3 535 844 662
3 177 845 725
3 535 845 177
3 725 846 177
3 529 846 725
3 346 847 385
3 529 847 346
3 346 385 387
3 616 387 37
3 616 37 356
3 465 356 350
3 465 350 49
3 569 49 11
3 569 11 365
3 189 365 213
3 84 848 221
3 597 848 84
3 238 849 597
3 221 849 238
3 238 850 470
3 414 850 238
3 475 851 414
3 470 851 475
3 475 852 601
3 155 852 475
3 256 853 155
3 601 853 256
3 256 854 612
3 689 854 256
3 689 153 612
3 153 24 262
3 24 277 262
3 277 266 608
3 266 160 608
3 160 200 375
3 200 189 375
3 211 599 267
3 407 267 720
3 855 856 584
3 407 856 855
3 486 857 584
3 855 857 486
3 858 859 486
3 74 859 858
3 410 860 486
3 858 860 410
3 861 862 410
3 226 862 861
3 639 863 410
3 861 863 639
3 864 865 639
3 551 865 864
3 668 866 639
3 864 866 668
3 867 868 668
3 565 868 867
3 170 869 668
3 867 869 170
3 870 871 170
3 595 871 870
3 574 872 170
3 870 872 574
3 873 874 574
3 86 874 873
3 572 875 574
3 873 875 572
3 876 877 572
3 84 877 876
3 172 878 572
3 876 878 172
3 211 879 234
3 341 879 211
3 269 880 693
3 341 880 269
3 693 881 269
3 538 881 693
3 503 882 535
3 538 882 503
3 535 883 503
3 177 883 535
3 92 884 529
3 177 884 92
3 529 885 92
3 346 885 529
3 344 886 387
3 346 886 344
3 344 387 616
3 646 616 356
3 646 356 465
3 100 465 49
3 100 49 569
3 525 569 365
3 525 365 189
3 597 887 172
3 84 887 597
3 597 888 238
3 567 888 597
3 414 889 567
3 238 889 414
3 414 890 475
3 703 890 414
3 155 891 703
3 475 891 155
3 155 892 256
3 511 892 155
3 689 893 511
3 256 893 689
3 689 894 153
3 622 894 689
3 622 24 153
3 24 435 277
3 435 266 277
3 266 198 160
3 198 200 160
3 200 525 189
3 438 599 211
3 720 584 407
3 895 896 486
3 487 896 895
3 486 897 895
3 584 897 486
3 898 899 410
3 411 899 898
3 410 900 898
3 486 900 410
3 901 902 639
3 640 902 901
3 410 903 639
3 901 903 410
3 904 905 668
3 669 905 904
3 668 906 904
3 639 906 668
3 907 908 170
3 171 908 907
3 668 909 170
3 907 909 668
3 910 911 574
3 575 911 910
3 170 912 574
3 910 912 170
3 913 914 572
3 573 914 913
3 572 915 913
3 574 915 572
3 916 917 172
3 173 917 916
3 172 918 916
3 572 918 172
3 341 284 234
3 211 234 201
3 341 919 607
3 269 919 341
3 168 920 538
3 269 920 168
3 538 921 168
3 503 921 538
3 69 922 177
3 503 922 69
3 177 923 69
3 92 923 177
3 275 924 346
3 92 924 275
3 346 925 275
3 344 925 346
3 531 926 616
3 344 926 531
3 531 616 646
3 26 646 465
3 26 465 100
3 447 100 569
3 447 569 525
3 927 928 172
3 597 928 927
3 670 929 172
3 927 929 670
3 567 930 670
3 597 930 567
3 567 931 414
3 553 931 567
3 703 932 553
3 414 932 703
3 703 933 155
3 628 933 703
3 511 934 628
3 155 934 511
3 511 935 689
3 81 935 511
3 622 936 81
3 689 936 622
3 622 937 24
3 314 937 622
3 314 435 24
3 435 192 266
3 192 198 266
3 198 96 200
3 96 525 200
3 211 317 438
3 584 720 644
3 487 584 583
3 938 939 487
3 486 939 938
3 411 940 487
3 938 940 411
3 941 942 411
3 410 942 941
3 411 943 941
3 640 943 411
3 944 945 640
3 639 945 944
3 640 946 944
3 669 946 640
3 947 948 669
3 668 948 947
3 669 949 947
3 171 949 669
3 950 951 171
3 170 951 950
3 171 952 950
3 575 952 171
3 953 954 575
3 574 954 953
3 575 955 953
3 573 955 575
3 956 957 573
3 572 957 956
3 573 958 956
3 173 958 573
3 959 960 173
3 172 960 959
3 173 961 959
3 671 961 173
3 454 284 341
3 718 211 201
3 962 963 675
3 269 963 962
3 607 964 675
3 962 964 607
3 454 965 607
3 341 965 454
3 269 966 675
3 168 966 269
3 708 967 503
3 168 967 708
3 503 968 708
3 69 968 503
3 450 969 92
3 69 969 450
3 92 970 450
3 275 970 92
3 273 971 344
3 275 971 273
3 344 972 273
3 531 972 344
3 723 973 646
3 531 973 723
3 723 646 26
3 246 26 100
3 246 100 447
3 96 447 525
3 974 975 670
3 671 975 974
3 172 976 670
3 974 976 172
3 977 978 670
3 567 978 977
3 641 979 670
3 977 979 641
3 553 980 641
3 567 980 553
3 553 981 703
3 228 981 553
3 628 982 228
3 703 982 628
3 628 983 511
3 462 983 628
3 81 984 462
3 511 984 81
3 81 985 622
3 591 985 81
3 314 986 591
3 622 986 314
3 314 987 435
3 207 987 314
3 207 192 435
3 192 287 198
3 287 96 198
3 211 653 317
3 644 583 584
3 583 342 487
3 988 989 411
3 225 989 988
3 487 990 411
3 988 990 487
3 991 992 640
3 550 992 991
3 411 993 640
3 991 993 411
3 994 995 669
3 564 995 994
3 640 996 669
3 994 996 640
3 997 998 171
3 594 998 997
3 669 999 171
3 997 999 669
3 1000 1001 575
3 85 1001 1000
3 171 1002 575
3 1000 1002 171
3 1003 1004 573
3 83 1004 1003
3 575 1005 573
3 1003 1005 575
3 1006 1007 173
3 596 1007 1006
3 573 1008 173
3 1006 1008 573
3 1009 1010 671
3 566 1010 1009
3 173 1011 671
3 1009 1011 173
3 211 718 653
3 607 1012 367
3 675 1012 607
3 607 60 454
3 1013 1014 249
3 168 1014 1013
3 675 1015 249
3 1013 1015 675
3 168 1016 249
3 708 1016 168
3 650 1017 69
3 708 1017 650
3 69 1018 650
3 450 1018 69
3 298 1019 275
3 450 1019 298
3 275 1020 298
3 273 1020 275
3 90 1021 531
3 273 1021 90
3 531 1022 90
3 723 1022 531
3 352 1023 26
3 723 1023 352
3 352 26 246
3 331 246 447
3 331 447 96
3 1024 1025 671
3 670 1025 1024
3 642 1026 671
3 1024 1026 642
3 1027 1028 641
3 642 1028 1027
3 641 1029 1027
3 670 1029 641
3 1030 1031 641
3 553 1031 1030
3 408 1032 641
3 1030 1032 408
3 228 1033 408
3 553 1033 228
3 228 1034 628
3 76 1034 228
3 462 1035 76
3 628 1035 462
3 462 1036 81
3 576 1036 462
3 591 1037 576
3 81 1037 591
3 591 1038 314
3 218 1038 591
3 207 1039 218
3 314 1039 207
3 207 1040 192
3 429 1040 207
3 429 287 192
3 287 331 96
3 342 726 487
3 73 1041 487
3 225 1041 73
3 225 1042 411
3 550 1042 225
3 550 1043 640
3 564 1043 550
3 564 1044 669
3 594 1044 564
3 594 1045 171
3 85 1045 594
3 85 1046 575
3 83 1046 85
3 83 1047 573
3 596 1047 83
3 596 1048 173
3 566 1048 596
3 566 1049 671
3 552 1049 566
3 521 367 675
3 367 389 607
3 60 607 729
3 60 303 454
3 1050 1051 675
3 676 1051 1050
3 675 1052 1050
3 249 1052 675
3 1053 1054 3
3 708 1054 1053
3 249 1055 3
3 1053 1055 249
3 708 1056 3
3 650 1056 708
3 45 1057 450
3 650 1057 45
3 450 1058 45
3 298 1058 450
3 300 1059 273
3 298 1059 300
3 273 1060 300
3 90 1060 273
3 179 1061 723
3 90 1061 179
3 723 1062 179
3 352 1062 723
3 731 1063 246
3 352 1063 731
3 731 246 331
3 1064 1065 642
3 552 1065 1064
3 671 1066 642
3 1064 1066 671
3 1067 1068 642
3 641 1068 1067
3 642 1069 1067
3 409 1069 642
3 1070 1071 408
3 409 1071 1070
3 408 1072 1070
3 641 1072 408
3 1073 1074 408
3 228 1074 1073
3 488 1075 408
3 1073 1075 488
3 76 1076 488
3 228 1076 76
3 76 1077 462
3 403 1077 76
3 576 1078 403
3 462 1078 576
3 576 1079 591
3 181 1079 576
3 218 1080 181
3 591 1080 218
3 218 1081 207
3 53 1081 218
3 429 1082 53
3 207 1082 429
3 429 1083 287
3 544 1083 429
3 544 331 287
3 487 726 87
3 225 1084 631
3 73 1084 225
3 327 1085 487
3 73 1085 327
3 550 1086 706
3 225 1086 550
3 564 1087 413
3 550 1087 564
3 594 1088 237
3 564 1088 594
3 85 1089 220
3 594 1089 85
3 83 1090 222
3 85 1090 83
3 596 1091 239
3 83 1091 596
3 566 1092 415
3 596 1092 566
3 552 1093 704
3 566 1093 552
3 675 378 521
3 389 643 607
3 729 607 33
3 1094 1095 250
3 249 1095 1094
3 676 1096 250
3 1094 1096 676
3 1097 1098 676
3 675 1098 1097
3 676 1099 1097
3 59 1099 676
3 1100 1101 249
3 250 1101 1100
3 249 1102 1100
3 3 1102 249
3 1103 1104 546
3 650 1104 1103
3 3 1105 546
3 1103 1105 3
3 650 1106 546
3 45 1106 650
3 557 1107 298
3 45 1107 557
3 298 1108 557
3 300 1108 298
3 452 1109 90
3 300 1109 452
3 90 1110 452
3 179 1110 90
3 534 1111 352
3 179 1111 534
3 352 1112 534
3 731 1112 352
3 544 1113 331
3 731 1113 544
3 552 1114 642
3 227 1114 552
3 1115 1116 409
3 227 1116 1115
3 642 1117 409
3 1115 1117 642
3 1118 1119 409
3 408 1119 1118
3 489 1120 409
3 1118 1120 489
3 1121 1122 488
3 489 1122 1121
3 488 1123 1121
3 408 1123 488
3 1124 1125 488
3 76 1125 1124
3 581 1126 488
3 1124 1126 581
3 403 1127 581
3 76 1127 403
3 403 1128 576
3 217 1128 403
3 181 1129 217
3 576 1129 181
3 181 1130 218
3 62 1130 181
3 53 1131 62
3 218 1131 53
3 53 1132 429
3 563 1132 53
3 544 1133 563
3 429 1133 544
3 87 726 61
3 87 166 487
3 461 1134 73
3 631 1134 461
3 631 1135 225
3 706 1135 631
3 327 439 73
3 487 1 327
3 706 1136 550
3 413 1136 706
3 413 1137 564
3 237 1137 413
3 237 1138 594
3 220 1138 237
3 220 1139 85
3 222 1139 220
3 222 1140 83
3 239 1140 222
3 239 1141 596
3 415 1141 239
3 415 1142 566
3 704 1142 415
3 704 1143 552
3 629 1143 704
3 59 378 675
3 607 643 606
3 607 383 33
3 1144 1145 676
3 268 1145 1144
3 250 1146 676
3 1144 1146 250
3 59 676 473
3 1147 1148 4
3 3 1148 1147
3 250 1149 4
3 1147 1149 250
3 1150 1151 3
3 4 1151 1150
3 546 1152 3
3 1150 1152 546
3 1153 1154 456
3 45 1154 1153
3 546 1155 456
3 1153 1155 546
3 45 1156 456
3 557 1156 45
3 555 1157 300
3 557 1157 555
3 300 1158 555
3 452 1158 300
3 71 1159 179
3 452 1159 71
3 179 1160 71
3 534 1160 179
3 664 1161 731
3 534 1161 664
3 731 1162 664
3 544 1162 731
3 227 1163 629
3 552 1163 227
3 227 1164 409
3 75 1164 227
3 1165 1166 489
3 75 1166 1165
3 409 1167 489
3 1165 1167 409
3 1168 1169 489
3 488 1169 1168
3 489 1170 1168
3 582 1170 489
3 1171 1172 581
3 582 1172 1171
3 488 1173 581
3 1171 1173 488
3 1174 1175 581
3 403 1175 1174
3 204 1176 581
3 1174 1176 204
3 217 1177 204
3 403 1177 217
3 217 1178 181
3 337 1178 217
3 62 1179 337
3 181 1179 62
3 62 1180 53
3 695 1180 62
3 563 1181 695
3 53 1181 563
3 563 1182 544
3 664 1182 563
3 487 166 391
3 631 1183 508
3 461 1183 631
3 73 1184 461
3 406 1184 73
3 706 1185 156
3 631 1185 706
3 406 1186 439
3 73 1186 406
3 391 1 487
3 413 1187 505
3 706 1187 413
3 237 1188 471
3 413 1188 237
3 220 1189 371
3 237 1189 220
3 222 1190 369
3 220 1190 222
3 239 1191 469
3 222 1191 239
3 415 1192 506
3 239 1192 415
3 704 1193 154
3 415 1193 704
3 629 1194 510
3 704 1194 629
3 606 383 607
3 167 1195 250
3 268 1195 167
3 268 1196 676
3 340 1196 268
3 473 1197 340
3 676 1197 473
3 1198 1199 250
3 167 1199 1198
3 4 1200 250
3 1198 1200 4
3 1201 1202 547
3 546 1202 1201
3 547 1203 1201
3 4 1203 547
3 1204 1205 546
3 547 1205 1204
3 546 1206 1204
3 456 1206 546
3 1207 1208 701
3 557 1208 1207
3 456 1209 701
3 1207 1209 456
3 557 1210 701
3 555 1210 557
3 47 1211 452
3 555 1211 47
3 452 1212 47
3 71 1212 452
3 501 1213 534
3 71 1213 501
3 534 1214 501
3 664 1214 534
3 629 1215 227
3 463 1215 629
3 75 1216 463
3 227 1216 75
3 75 1217 489
3 402 1217 75
3 1218 1219 582
3 402 1219 1218
3 489 1220 582
3 1218 1220 489
3 1221 1222 582
3 581 1222 1221
3 582 1223 1221
3 205 1223 582
3 1224 1225 204
3 205 1225 1224
3 204 1226 1224
3 581 1226 204
3 1227 1228 204
3 217 1228 1227
3 604 1229 204
3 1227 1229 604
3 337 1230 604
3 217 1230 337
3 337 1231 62
3 271 1231 337
3 695 1232 271
3 62 1232 695
3 695 1233 563
3 536 1233 695
3 664 1234 536
3 563 1234 664
3 78 1235 461
3 508 1235 78
3 508 1236 631
3 156 1236 508
3 579 1237 406
3 461 1237 579
3 156 1238 706
3 505 1238 156
3 439 324 406
3 505 1239 413
3 471 1239 505
3 471 1240 237
3 371 1240 471
3 371 1241 220
3 369 1241 371
3 369 1242 222
3 469 1242 369
3 469 1243 239
3 506 1243 469
3 506 1244 415
3 154 1244 506
3 154 1245 704
3 510 1245 154
3 510 1246 629
3 80 1246 510
3 268 1247 694
3 167 1247 268
3 340 1248 65
3 268 1248 340
3 340 721 473
3 707 1249 4
3 167 1249 707
3 1250 1251 4
3 707 1251 1250
3 547 1252 4
3 1250 1252 547
3 1253 1254 457
3 456 1254 1253
3 547 1255 457
3 1253 1255 547
3 1256 1257 456
3 457 1257 1256
3 456 1258 1256
3 701 1258 456
3 1259 1260 699
3 555 1260 1259
3 701 1261 699
3 1259 1261 701
3 555 1262 699
3 47 1262 555
3 652 1263 71
3 47 1263 652
3 71 1264 652
3 501 1264 71
3 536 1265 664
3 501 1265 536
3 463 1266 80
3 629 1266 463
3 463 1267 75
3 577 1267 463
3 402 1268 577
3 75 1268 402
3 402 1269 582
3 216 1269 402
3 1270 1271 205
3 216 1271 1270
3 582 1272 205
3 1270 1272 582
3 1273 1274 205
3 204 1274 1273
3 205 1275 1273
3 605 1275 205
3 1276 1277 604
3 605 1277 1276
3 204 1278 604
3 1276 1278 204
3 1279 1280 604
3 337 1280 1279
3 677 1281 604
3 1279 1281 677
3 271 1282 677
3 337 1282 271
3 271 1283 695
3 492 1283 271
3 536 1284 492
3 695 1284 536
3 508 1285 690
3 78 1285 508
3 461 1286 78
3 579 1286 461
3 156 1287 257
3 508 1287 156
3 406 1288 579
3 210 1288 406
3 505 1289 602
3 156 1289 505
3 406 324 540
3 471 1290 40
3 505 1290 471
3 371 1291 292
3 471 1291 371
3 369 1292 290
3 371 1292 369
3 469 1293 42
3 369 1293 469
3 506 1294 600
3 469 1294 506
3 154 1295 255
3 506 1295 154
3 510 1296 688
3 154 1296 510
3 80 1297 621
3 510 1297 80
3 539 1298 167
3 694 1298 539
3 694 1299 268
3 65 1299 694
3 65 1300 340
3 184 1300 65
3 698 721 340
3 167 1301 539
3 707 1301 167
3 649 1302 547
3 707 1302 649
3 1303 1304 547
3 649 1304 1303
3 457 1305 547
3 1303 1305 457
3 1306 1307 702
3 701 1307 1306
3 457 1308 702
3 1306 1308 457
3 1309 1310 701
3 702 1310 1309
3 701 1311 1309
3 699 1311 701
3 1312 1313 458
3 47 1313 1312
3 699 1314 458
3 1312 1314 699
3 47 1315 458
3 652 1315 47
3 710 1316 501
3 652 1316 710
3 501 1317 710
3 536 1317 501
3 80 1318 463
3 590 1318 80
3 577 1319 590
3 463 1319 577
3 577 1320 402
3 182 1320 577
3 216 1321 182
3 402 1321 216
3 216 1322 205
3 336 1322 216
3 1323 1324 605
3 336 1324 1323
3 205 1325 605
3 1323 1325 205
3 1326 1327 605
3 604 1327 1326
3 678 1328 605
3 1326 1328 678
3 1329 1330 677
3 678 1330 1329
3 677 1331 1329
3 604 1331 677
3 1332 1333 677
3 271 1333 1332
3 247 1334 677
3 1332 1334 247
3 492 1335 247
3 271 1335 492
3 492 1336 536
3 710 1336 492
3 619 1337 78
3 690 1337 619
3 690 1338 508
3 257 1338 690
3 592 1339 579
3 78 1339 592
3 257 1340 156
3 602 1340 257
3 406 38 210
3 184 1341 210
3 579 1341 184
3 602 1342 505
3 40 1342 602
3 164 406 540
3 40 1343 471
3 292 1343 40
3 292 1344 371
3 290 1344 292
3 290 1345 369
3 42 1345 290
3 42 1346 469
3 600 1346 42
3 600 1347 506
3 255 1347 600
3 255 1348 154
3 688 1348 255
3 688 1349 510
3 621 1349 688
3 621 1350 80
3 313 1350 621
3 694 1351 560
3 539 1351 694
3 65 1352 54
3 694 1352 65
3 184 1353 195
3 65 1353 184
3 210 1354 184
3 340 1354 210
3 340 598 698
3 504 1355 707
3 539 1355 504
3 707 1356 504
3 649 1356 707
3 44 1357 457
3 649 1357 44
3 1358 1359 457
3 44 1359 1358
3 702 1360 457
3 1358 1360 702
3 1361 1362 700
3 699 1362 1361
3 700 1363 1361
3 702 1363 700
3 1364 1365 699
3 700 1365 1364
3 699 1366 1364
3 458 1366 699
3 1367 1368 548
3 652 1368 1367
3 458 1369 548
3 1367 1369 458
3 652 1370 548
3 710 1370 652
3 590 1371 313
3 80 1371 590
3 590 1372 577
3 203 1372 590
3 182 1373 203
3 577 1373 182
3 182 1374 216
3 63 1374 182
3 336 1375 63
3 216 1375 336
3 336 1376 605
3 270 1376 336
3 1377 1378 678
3 270 1378 1377
3 605 1379 678
3 1377 1379 605
3 1380 1381 678
3 677 1381 1380
3 678 1382 1380
3 248 1382 678
3 1383 1384 247
3 248 1384 1383
3 677 1385 247
3 1383 1385 677
3 1386 1387 247
3 492 1387 1386
3 5 1388 247
3 1386 1388 5
3 710 1389 5
3 492 1389 710
3 690 1390 150
3 619 1390 690
3 78 1391 619
3 592 1391 78
3 257 1392 613
3 690 1392 257
3 579 1393 592
3 184 1393 579
3 602 1394 738
3 257 1394 602
3 38 77 210
3 164 38 406
3 40 1395 588
3 602 1395 40
3 540 585 164
3 292 1396 102
3 40 1396 292
3 290 1397 104
3 292 1397 290
3 42 1398 586
3 290 1398 42
3 600 1399 736
3 42 1399 600
3 255 1400 611
3 600 1400 255
3 688 1401 152
3 255 1401 688
3 621 1402 23
3 688 1402 621
3 313 1403 434
3 621 1403 313
3 661 1404 539
3 560 1404 661
3 560 1405 694
3 54 1405 560
3 54 1406 65
3 195 1406 54
3 195 1407 184
3 592 1407 195
3 340 1408 742
3 210 1408 340
3 742 598 340
3 539 1409 661
3 504 1409 539
3 70 1410 649
3 504 1410 70
3 649 1411 70
3 44 1411 649
3 556 1412 702
3 44 1412 556
3 1413 1414 702
3 556 1414 1413
3 700 1415 702
3 1413 1415 700
3 1416 1417 459
3 458 1417 1416
3 700 1418 459
3 1416 1418 700
3 1419 1420 458
3 459 1420 1419
3 458 1421 1419
3 548 1421 458
3 1422 1423 5
3 710 1423 1422
3 548 1424 5
3 1422 1424 548
3 313 1425 590
3 206 1425 313
3 203 1426 206
3 590 1426 203
3 203 1427 182
3 52 1427 203
3 63 1428 52
3 182 1428 63
3 63 1429 336
3 696 1429 63
3 270 1430 696
3 336 1430 270
3 270 1431 678
3 491 1431 270
3 1432 1433 248
3 491 1433 1432
3 678 1434 248
3 1432 1434 678
3 1435 1436 248
3 247 1436 1435
3 248 1437 1435
3 6 1437 248
3 1438 1439 5
3 6 1439 1438
3 5 1440 1438
3 247 1440 5
3 21 150 619
3 150 613 690
3 315 1441 592
3 619 1441 315
3 613 738 257
3 738 588 602
3 210 77 719
3 588 102 40
3 102 104 292
3 104 586 290
3 586 736 42
3 736 611 600
3 611 152 255
3 152 23 688
3 23 434 621
3 434 191 313
3 560 1442 541
3 661 1442 560
3 54 1443 430
3 560 1443 54
3 195 1444 193
3 54 1444 195
3 592 1445 315
3 195 1445 592
3 0 742 210
3 242 1446 504
3 661 1446 242
3 504 1447 242
3 70 1447 504
3 451 1448 44
3 70 1448 451
3 44 1449 451
3 556 1449 44
3 554 1450 700
3 556 1450 554
3 1451 1452 700
3 554 1452 1451
3 459 1453 700
3 1451 1453 459
3 1454 1455 549
3 548 1455 1454
3 459 1456 549
3 1454 1456 459
3 1457 1458 548
3 549 1458 1457
3 5 1459 548
3 1457 1459 5
3 206 1460 191
3 313 1460 206
3 206 1461 203
3 428 1461 206
3 52 1462 428
3 203 1462 52
3 52 1463 63
3 562 1463 52
3 696 1464 562
3 63 1464 696
3 696 1465 270
3 537 1465 696
3 491 1466 537
3 270 1466 491
3 491 1467 248
3 709 1467 491
3 1468 1469 6
3 709 1469 1468
3 248 1470 6
3 1468 1470 248
3 1471 1472 6
3 5 1472 1471
3 6 1473 1471
3 549 1473 6
3 259 150 21
3 619 1474 21
3 315 1474 619
3 253 613 150
3 15 738 613
3 306 588 738
3 719 202 210
3 320 102 588
3 318 104 102
3 308 586 104
3 13 736 586
3 251 611 736
3 261 152 611
3 276 23 152
3 265 434 23
3 197 191 434
3 732 1475 661
3 541 1475 732
3 541 1476 560
3 430 1476 541
3 430 1477 54
3 193 1477 430
3 193 1478 195
3 315 1478 193
3 0 210 174
3 661 1479 732
3 242 1479 661
3 176 1480 70
3 242 1480 176
3 70 1481 176
3 451 1481 70
3 299 1482 556
3 451 1482 299
3 556 1483 299
3 554 1483 556
3 46 1484 459
3 554 1484 46
3 1485 1486 459
3 46 1486 1485
3 549 1487 459
3 1485 1487 549
3 191 286 206
3 428 1488 286
3 206 1488 428
3 428 1489 52
3 543 1489 428
3 562 1490 543
3 52 1490 562
3 562 1491 696
3 663 1491 562
3 537 1492 663
3 696 1492 537
3 537 1493 491
3 502 1493 537
3 709 1494 502
3 491 1494 709
3 709 1495 6
3 651 1495 709
3 1496 1497 549
3 651 1497 1496
3 6 1498 549
3 1496 1498 6
3 278 259 21
3 259 253 150
3 436 21 315
3 253 15 613
3 15 306 738
3 306 320 588
3 210 202 180
3 320 318 102
3 318 308 104
3 308 13 586
3 13 251 736
3 251 261 611
3 261 276 152
3 276 265 23
3 265 197 434
3 197 95 191
3 541 1499 328
3 732 1499 541
3 430 1500 288
3 541 1500 430
3 193 1501 208
3 430 1501 193
3 315 1502 436
3 193 1502 315
3 180 174 210
3 353 1503 242
3 732 1503 353
3 242 1504 353
3 176 1504 242
3 91 1505 451
3 176 1505 91
3 451 1506 91
3 299 1506 451
3 301 1507 554
3 299 1507 301
3 554 1508 301
3 46 1508 554
3 651 1509 549
3 46 1509 651
3 95 286 191
3 286 330 428
3 543 1510 330
3 428 1510 543
3 543 1511 562
3 730 1511 543
3 663 1512 730
3 562 1512 663
3 663 1513 537
3 533 1513 663
3 502 1514 533
3 537 1514 502
3 502 1515 709
3 72 1515 502
3 651 1516 72
3 709 1516 651
3 296 259 278
3 278 21 436
3 396 253 259
3 442 15 253
3 745 306 15
3 232 320 306
3 230 318 320
3 743 308 318
3 440 13 308
3 398 251 13
3 294 261 251
3 67 276 261
3 159 265 276
3 199 197 265
3 524 95 197
3 243 328 732
3 328 288 541
3 288 208 430
3 208 436 193
3 732 1517 243
3 353 1517 732
3 724 1518 176
3 353 1518 724
3 176 1519 724
3 91 1519 176
3 274 1520 299
3 91 1520 274
3 299 1521 274
3 301 1521 299
3 453 1522 46
3 301 1522 453
3 46 1523 453
3 651 1523 46
3 95 446 286
3 446 330 286
3 330 245 543
3 730 1524 245
3 543 1524 730
3 730 1525 663
3 351 1525 730
3 533 1526 351
3 663 1526 533
3 533 1527 502
3 178 1527 533
3 72 1528 178
3 502 1528 72
3 72 1529 651
3 453 1529 72
3 68 296 278
3 296 396 259
3 263 278 436
3 396 442 253
3 442 745 15
3 745 232 306
3 232 230 320
3 230 743 318
3 743 440 308
3 440 398 13
3 398 294 251
3 294 67 261
3 67 159 276
3 159 199 265
3 199 524 197
3 524 568 95
3 448 328 243
3 93 288 328
3 185 208 288
3 263 436 208
3 27 243 353
3 353 1530 27
3 724 1530 353
3 528 1531 91
3 724 1531 528
3 91 1532 528
3 274 1532 91
3 272 1533 301
3 274 1533 272
3 301 1534 272
3 453 1534 301
3 568 446 95
3 446 99 330
3 99 245 330
3 245 25 730
3 351 1535 25
3 730 1535 351
3 351 1536 533
3 722 1536 351
3 178 1537 722
3 533 1537 178
3 178 1538 72
3 89 1538 178
3 453 1539 89
3 72 1539 453
3 660 296 68
3 68 278 263
3 477 396 296
3 405 442 396
3 626 745 442
3 360 232 745
3 362 230 232
3 624 743 230
3 401 440 743
3 479 398 440
3 658 294 398
3 638 67 294
3 376 159 67
3 190 199 159
3 366 524 199
3 12 568 524
3 97 448 243
3 448 93 328
3 93 185 288
3 185 263 208
3 97 243 27
3 647 27 724
3 724 1540 647
3 528 1540 724
3 345 1541 274
3 528 1541 345
3 274 1542 345
3 272 1542 274
3 89 1543 453
3 272 1543 89
3 568 48 446
3 48 99 446
3 99 464 245
3 464 25 245
3 25 645 351
3 722 1544 645
3 351 1544 722
3 722 1545 178
3 530 1545 722
3 89 1546 530
3 178 1546 89
3 636 660 68
3 660 477 296
3 161 68 263
3 477 405 396
3 405 626 442
3 626 360 745
3 360 362 232
3 362 624 230
3 624 401 743
3 401 479 440
3 479 658 398
3 658 638 294
3 638 376 67
3 376 190 159
3 190 366 199
3 366 12 524
3 12 498 568
3 570 448 97
3 526 93 448
3 214 185 93
3 161 263 185
3 466 97 27
3 466 27 647
3 617 647 528
3 528 1547 617
3 345 1547 528
3 343 1548 272
3 345 1548 343
3 272 1549 343
3 89 1549 272
3 498 48 568
3 48 349 99
3 349 464 99
3 464 355 25
3 355 645 25
3 645 615 722
3 530 1550 615
3 722 1550 530
3 530 1551 89
3 343 1551 530
3 212 660 636
3 636 68 161
3 212 477 660
3 212 405 477
3 212 626 405
3 212 360 626
3 212 362 360
3 212 624 362
3 212 401 624
3 212 479 401
3 212 658 479
3 212 638 658
3 212 376 638
3 212 190 376
3 212 366 190
3 212 12 366
3 212 498 12
3 50 570 97
3 570 526 448
3 526 214 93
3 214 161 185
3 50 97 466
3 357 466 647
3 357 647 617
3 384 617 345
3 345 1552 384
3 343 1552 345
3 498 684 48
3 684 349 48
3 349 280 464
3 280 355 464
3 355 36 645
3 36 615 645
3 615 386 530
3 343 1553 386
3 530 1553 343
3 212 636 374
3 374 636 161
3 212 684 498
3 10 570 50
3 364 526 570
3 188 214 526
3 374 161 214
3 347 50 466
3 347 466 357
3 34 357 617
3 34 617 384
3 386 384 343
3 684 335 349
3 335 280 349
3 280 392 355
3 392 36 355
3 36 418 615
3 418 386 615
3 212 374 188
3 212 335 684
3 500 10 50
3 10 364 570
3 364 188 526
3 188 374 214
3 500 50 347
3 282 347 357
3 282 357 34
3 420 34 384
3 420 384 386
3 335 18 280
3 18 392 280
3 392 480 36
3 480 418 36
3 418 420 386
3 212 188 364
3 212 18 335
3 212 10 500
3 212 364 10
3 682 500 347
3 682 347 282
3 394 282 34
3 394 34 420
3 18 382 392
3 382 480 392
3 480 482 418
3 482 420 418
3 212 382 18
3 212 500 682
3 339 682 282
3 339 282 394
3 482 394 420
3 382 380 480
3 380 482 480
3 212 380 382
3 212 682 339
3 20 339 394
3 20 394 482
3 380 20 482
3 212 20 380
3 212 339 20
3 123 114 148
3 1554 1555 114
3 148 1555 1554
3 114 1556 1554
3 119 1556 114
3 122 1557 123
3 114 1557 122
3 119 149 148
3 123 140 122
3 143 1558 119
3 149 1558 143
3 123 141 140
3 119 1559 143
3 133 1559 119
3 139 1560 141
3 140 1560 139
3 141 1561 139
3 116 1561 141
3 1563 1564 1562
3 116 1564 1563
3 1563 1565 139
3 1562 1565 1563
3 1566 1567 116
3 1562 1567 1566
3 1566 1568 134
3 116 1568 1566
3 116 142 134
3 111 1569 134
3 139 1569 111
3 116 128 142
3 111 145 139
3 116 108 128
3 111 110 145
3 111 109 110
3 111 120 109
3 109 120 125
3 8 518 516
3 735 8 516
3 7 735 516
3 519 7 516
3 240 519 516
3 734 240 516
3 241 734 516
3 518 241 516
3 518 8 517
3 8 735 517
3 735 7 517
3 7 519 517
3 519 240 517
3 240 734 517
3 734 241 517
3 241 518 517
3 666 424 422
3 158 666 422
3 665 158 422
3 425 665 422
3 426 425 422
3 88 426 422
3 427 88 422
3 424 427 422
3 424 666 423
3 666 158 423
3 158 665 423
3 665 425 423
3 425 426 423
3 426 88 423
3 88 427 423
3 427 424 423
3 741 558 417
3 1570 1571 558
3 417 1571 1570
3 558 1572 1570
3 656 1572 558
3 692 1573 741
3 558 1573 692
3 656 685 417
3 741 322 692
3 468 1574 656
3 685 1574 468
3 741 377 322
3 656 1575 468
3 101 1575 656
3 302 1576 377
3 322 1576 302
3 377 1577 302
3 545 1577 377
3 1579 1580 1578
3 545 1580 1579
3 1579 1581 302
3 1578 1581 1579
3 1582 1583 545
3 1578 1583 1582
3 1582 1584 235
3 545 1584 1582
3 545 169 235
3 532 1585 235
3 302 1585 532
3 545 175 169
3 532 323 302
3 545 332 175
3 532 515 323
3 532 490 515
3 532 672 490
3 490 672 740
3 39 165 66
3 1586 1587 165
3 66 1587 1586
3 165 1588 1586
3 31 1588 165
3 2 1589 39
3 165 1589 2
3 31 58 66
3 39 455 2
3 224 1590 31
3 58 1590 224
3 39 520 455
3 31 1591 224
3 627 1591 31
3 416 1592 520
3 455 1592 416
3 520 1593 416
3 223 1593 520
3 1595 1596 1594
3 223 1596 1595
3 1595 1597 416
3 1594 1597 1595
3 1598 1599 223
3 1594 1599 1598
3 1598 1600 580
3 223 1600 1598
3 223 512 580
3 163 1601 580
3 416 1601 163
3 223 697 512
3 163 333 416
3 223 368 697
3 163 312 333
3 163 390 312
3 163 229 390
3 390 229 632
3 106 132 129
3 132 1603 127
3 1602 1603 132
3 1602 1604 106
3 132 1604 1602
3 112 1605 132
3 129 1605 112
3 106 130 127
3 112 107 129
3 136 1606 130
3 127 1606 136
3 107 137 129
3 127 1607 118
3 136 1607 127
3 121 1608 107
3 137 1608 121
3 137 1609 135
3 121 1609 137
3 1611 1612 135
3 115 1612 1611
3 1611 1613 1610
3 135 1613 1611
3 1614 1615 1610
3 121 1615 1614
3 1614 1616 135
3 1610 1616 1614
3 115 113 135
3 131 1617 121
3 115 1617 131
3 113 124 135
3 121 144 131
3 124 146 135
3 144 126 131
3 126 147 131
3 147 138 131
3 117 138 147