OFF
1611 2118 0
-0.1511797957 -0.0109040892 0.0037695752
-0.1511760102 -0.0109038894 0.0177473944
-0.2218318013 -0.0565602585 0.0859252691
-0.2295103484 0.0197610993 0.0859262576
0.4530684433 0.0382638680 -0.0102808444
0.4530709493 0.0382640002 -0.0010273277
0.4507528452 0.0612798881 -0.0102805463
0.4507553512 0.0612800203 -0.0010270296
-0.0785156417 0.4998387190 -0.0649770298
-0.0785162865 0.4998386849 -0.0673581626
0.0217678294 -0.4969345812 -0.0649899400
0.0217671846 -0.4969346152 -0.0673710728
-0.0833272104 0.4993546757 -0.0680264806
-0.0833262031 0.4993547288 -0.0643071468
0.0169562607 -0.4974186245 -0.0680393908
0.0169572679 -0.4974185713 -0.0643200571
0.2590752146 -0.1772558781 -0.0753868619
0.2177157776 0.2338386125 -0.0753815374
0.2473261445 -0.1784380428 -0.0666616298
0.2473214203 -0.1784382922 -0.0841056951
0.2059667075 0.2326564478 -0.0666563053
0.2059619834 0.2326561985 -0.0841003706
0.2355693979 -0.1796206127 -0.0862822130
0.2355753029 -0.1796203010 -0.0644776586
0.1942099609 0.2314738780 -0.0862768885
0.1942158660 0.2314741896 -0.0644723341
-0.4129563057 0.0734195907 0.0071758023
-0.3909127320 -0.1456837715 0.0071729644
0.2238173751 -0.1808029332 -0.0884597854
0.2238244614 -0.1808025591 -0.0622936874
0.1824579382 0.2302915574 -0.0884544609
0.1824650244 0.2302919315 -0.0622883629
0.2120657953 -0.1819852303 -0.0890017790
0.2120731766 -0.1819848407 -0.0617463496
0.1707063584 0.2291092603 -0.0889964545
0.1707137396 0.2291096499 -0.0617410251
-0.1222509587 -0.0079936318 0.0051589539
-0.1222479301 -0.0079934719 0.0163422638
0.1885704599 -0.1843494116 -0.0611947579
0.1885627834 -0.1843498168 -0.0895405732
0.1472110229 0.2267450790 -0.0611894334
0.1472033464 0.2267446738 -0.0895352487
-0.4560431415 0.0690847057 0.0071875329
-0.4339995678 -0.1500186565 0.0071846951
-0.0485165098 0.0177310166 -0.0367547710
-0.0448699917 -0.0185137591 -0.0367552404
0.1076375997 0.0529649356 -0.0331931738
0.1149504816 -0.0197218719 -0.0331941152
0.1078603346 0.0507510496 -0.0331932025
0.1151732164 -0.0219357579 -0.0331941439
0.3465418391 0.0211139773 -0.0775445939
0.3437557349 0.0489583293 -0.0214821582
0.3422696633 0.0635965559 -0.0705071528
0.3429102836 0.0573500494 -0.0258024664
0.3456876784 0.0295917319 -0.0820620984
0.3472573648 0.0141235664 -0.0326100291
0.3476578150 0.0100647103 -0.0616402881
0.3476705837 0.0099926026 -0.0413869509
0.3478101632 0.0085770355 -0.0518110163
0.3447588650 0.0389916667 -0.0200017246
0.3447416362 0.0389907573 -0.0836195201
0.3416903380 0.0694053884 -0.0518102284
0.3418355636 0.0679901194 -0.0413861997
0.3418373624 0.0679174326 -0.0616395388
0.3422535363 0.0638594064 -0.0326093849
0.3437964377 0.0483898271 -0.0820618549
0.3466043044 0.0206331180 -0.0258029419
0.3472207111 0.0143853335 -0.0705077902
0.3457611932 0.0290249617 -0.0214824164
0.3429447238 0.0568677109 -0.0775441308
-0.3455000913 -0.0286378228 0.0137550898
-0.3449665922 -0.0339501504 0.0102139032
-0.3447340191 -0.0362573949 0.0118505067
-0.3456634722 -0.0270146602 0.0134703873
-0.3451282806 -0.0323437755 0.0099418548
-0.3448455957 -0.0351451890 0.0130273786
-0.3457988291 -0.0256769259 0.0106421503
-0.3458764497 -0.0249004659 0.0124696640
-0.3447615372 -0.0359856524 0.0111945914
-0.3453202167 -0.0304362675 0.0098490807
-0.3453191326 -0.0304362102 0.0138520835
-0.3458781673 -0.0248868440 0.0111947352
-0.3447625642 -0.0359719941 0.0124695206
-0.3448411747 -0.0351955863 0.0106420270
-0.3457931161 -0.0257272551 0.0130275006
-0.3455121024 -0.0285287568 0.0099419042
-0.3449749997 -0.0338577712 0.0134702986
-0.3459053301 -0.0246150828 0.0118506575
-0.3456736435 -0.0269223741 0.0102139942
-0.3451382264 -0.0322346005 0.0137550432
0.0929749776 -0.0654645484 -0.0083427386
0.0772133717 0.0911988358 -0.0083407095
0.0772106802 0.0913959426 0.0546115736
0.0899513965 -0.0355452683 -0.0577777481
0.0878434431 -0.0141215946 0.1164772687
0.0801226241 0.0625835912 0.1030506976
0.0876375900 -0.0125850584 -0.0718206510
0.0933888190 -0.0694952728 0.0222091050
0.0918937621 -0.0544735707 0.0818886297
0.0917905020 -0.0537659716 -0.0359048852
0.0851292243 0.0128689937 0.1210804387
0.0850756730 0.0128661671 -0.0766595678
0.0783829186 0.0794994709 -0.0359031591
0.0783434595 0.0802104376 0.0818903741
0.0768160782 0.0952304335 0.0222112386
0.0825163771 0.0383175309 -0.0718199917
0.0901260587 -0.0368461193 0.1030494098
0.0824125126 0.0398594504 0.1164779678
0.0802101768 0.0612781423 -0.0577764941
0.0930117661 -0.0656598555 0.0546095394
-0.0933209859 -0.0050831144 0.0107422057
0.2560154957 0.0768524769 -0.0768143382
0.2646987645 -0.0092877865 -0.0148870183
0.2590931192 0.0464940852 0.0088522699
0.2577862861 0.0591597905 -0.1107430740
0.2646346458 -0.0088692481 -0.0957316402
0.2621779920 0.0154820959 -0.1203820605
0.2560154791 0.0769695596 -0.0336091135
0.2577385911 0.0599325560 -0.0003631096
0.2655812503 -0.0181701467 -0.0558472582
0.2606629175 0.0305322760 -0.1237036408
0.2606996712 0.0305342160 0.0120103860
0.2557813384 0.0792366387 -0.0558459966
0.2636540492 0.0011355222 -0.0003638711
0.2653591540 -0.0159024319 -0.0336103164
0.2591496423 0.0455825511 -0.1203816707
0.2567063401 0.0699345998 -0.0957306195
0.2635465687 0.0019051321 -0.1107438156
0.2623045126 0.0145742564 0.0088518565
0.2566860096 0.0703554495 -0.0148859868
0.2653357359 -0.0157865844 -0.0768155380
-0.0769127330 0.5000000000 -0.0661680327
0.0233707381 -0.4967733002 -0.0661809429
0.4419577607 0.0413191517 -0.0456247337
0.4416495072 0.0443597116 -0.0542507646
0.4406104270 0.0547284677 -0.0391887523
0.4405088189 0.0557304451 -0.0421308831
0.4407699148 0.0531494016 -0.0369078205
0.4409834260 0.0509761662 -0.0557649866
0.4406134261 0.0546642828 -0.0518916434
0.4419205550 0.0416800415 -0.0489201409
0.4414615243 0.0462790311 -0.0354589827
0.4409750966 0.0511139063 -0.0354589201
0.4412126699 0.0486961710 -0.0562870093
0.4412184447 0.0486964758 -0.0349633215
0.4405087749 0.0557125111 -0.0489199592
0.4418142943 0.0427281848 -0.0518917980
0.4414421965 0.0464161907 -0.0557650456
0.4416659213 0.0442434944 -0.0369079358
0.4419241882 0.0416623015 -0.0421310653
0.4418241737 0.0426643631 -0.0391889086
0.4407769354 0.0530326886 -0.0542506522
0.4404733542 0.0560734950 -0.0456245426
0.2083152115 0.0403523703 -0.0971523094
0.2052061555 0.0713852341 -0.0490294025
0.2065901151 0.0578649870 0.0380694779
0.2051624653 0.0719662363 0.0051967402
0.2058911861 0.0645197905 -0.0699239849
0.2146998778 -0.0229154844 -0.0258688870
0.2069624733 0.0538267991 -0.0865055817
0.2057026646 0.0666489882 0.0244471496
0.2098574834 0.0254185997 0.0490837479
0.2098168868 0.0254164569 -0.1008201645
0.2139989578 -0.0158124931 0.0244460816
0.2126790534 -0.0029934760 -0.0865063176
0.2049744924 0.0737505410 -0.0258676350
0.2137593217 -0.0136859934 -0.0699249978
0.2118721147 0.0053865645 0.0463149206
0.2078412469 0.0454516050 0.0463154395
0.2145287304 -0.0211302915 0.0051955344
0.2131188857 -0.0070281025 0.0380686374
0.2144556695 -0.0205508396 -0.0490305933
0.2113205487 0.0104806484 -0.0971526963
-0.0817239590 0.4995159748 -0.0679520453
-0.0817229920 0.4995160258 -0.0643814006
0.0185595121 -0.4972573254 -0.0679649555
0.0185604790 -0.4972572743 -0.0643943108
0.1148239640 0.0537812094 -0.0331951316
0.1150652777 0.0513826580 -0.0331951627
0.1221368459 -0.0189055982 -0.0331960731
0.1223781596 -0.0213041495 -0.0331961042
-0.0865347418 0.4990319730 -0.0680994245
-0.0865336943 0.4990320282 -0.0642314018
0.0137487292 -0.4977413272 -0.0681123348
0.0137497768 -0.4977412719 -0.0642443121
-0.4053524995 0.0741845953 0.0071737321
-0.3833089258 -0.1449187669 0.0071708943
0.1172271600 0.0539763567 -0.0331957853
0.1245400418 -0.0187104508 -0.0331967267
0.1174591843 0.0516701381 -0.0331958151
0.1247720661 -0.0210166695 -0.0331967566
-0.1497094849 -0.0493041688 0.0859056334
-0.1573880320 0.0270171890 0.0859066219
-0.1367160153 -0.0094489193 0.0040450883
-0.1367123812 -0.0094487275 0.0174640057
-0.0961561866 0.4980639757 -0.0679481160
-0.0961552197 0.4980640267 -0.0643774713
0.0041272844 -0.4987093245 -0.0679610263
0.0041282514 -0.4987092734 -0.0643903815
0.1196489348 0.0539868387 -0.0331964413
0.1269618166 -0.0186999688 -0.0331973827
0.1198345120 0.0521422835 -0.0331964652
0.1271473938 -0.0205445240 -0.0331974066
-0.4357666749 0.0711246827 0.0071820125
-0.4137231012 -0.1479786795 0.0071791747
0.4189289745 0.0360613589 -0.0601677985
0.4174811516 0.0505180680 -0.0357815630
0.4166782246 0.0584447533 -0.0557564020
0.4166168450 0.0590680688 -0.0508675844
0.4171275718 0.0540266793 -0.0379306534
0.4171408696 0.0538248583 -0.0636675595
0.4174969535 0.0502794609 -0.0659148128
0.4189450580 0.0359525079 -0.0413169891
0.4191176300 0.0342254046 -0.0456827732
0.4178920716 0.0463500646 -0.0666899445
0.4179006414 0.0463505169 -0.0350455537
0.4166778915 0.0584753251 -0.0456824592
0.4168528281 0.0567483466 -0.0413167198
0.4182876095 0.0424206904 -0.0659149145
0.4186449105 0.0388753572 -0.0636677532
0.4186721484 0.0386742720 -0.0379308522
0.4191758680 0.0336325126 -0.0508679139
0.4191118405 0.0342556884 -0.0557567153
0.4183197326 0.0421829447 -0.0357816709
0.4168587014 0.0566389567 -0.0601675320
-0.0117001113 0.0234447537 -0.0539906017
-0.0076533038 -0.0167787213 -0.0539911226
-0.0056820379 -0.0359491586 0.1023491928
-0.0043707218 -0.0493192382 -0.0218810503
-0.0042857261 -0.0498790736 0.0834308170
-0.0162017124 0.0684161698 0.0300772573
-0.0074853671 -0.0179923783 0.1143542156
-0.0135219758 0.0415872565 -0.0414351109
-0.0158891115 0.0653874422 0.0590440471
-0.0096778790 0.0033329544 -0.0583165517
-0.0096300023 0.0033354814 0.1184694859
-0.0034030804 -0.0587181783 0.0590424397
-0.0158887306 0.0652313509 0.0027616784
-0.0058246388 -0.0349208651 -0.0414361018
-0.0117768663 0.0246632235 0.1143547680
-0.0034340513 -0.0585626468 0.0027600750
-0.0031061689 -0.0617477340 0.0300755714
-0.0149932563 0.0565490347 0.0834321955
-0.0149653011 0.0559861886 -0.0218796863
-0.0135866978 0.0426196606 0.1023502104
0.1520146837 0.0379062142 -0.0471458883
0.1520202821 0.0379065097 -0.0264739010
0.1556612019 0.0016614385 -0.0471463577
0.1556668002 0.0016617340 -0.0264743705
0.4493959894 0.0510449888 -0.0036153909
0.4497000067 0.0480231919 -0.0036154301
0.4491668271 0.0533038922 -0.0105879260
0.4496810698 0.0481086865 -0.0415775199
0.4499823248 0.0451489773 -0.0287797601
0.4500066887 0.0449234798 -0.0226202426
0.4491644071 0.0532636818 -0.0343359831
0.4498273197 0.0467504310 -0.0063224297
0.4491023175 0.0539302069 -0.0160873014
0.4492658186 0.0522437623 -0.0387460484
0.4495374531 0.0495335337 -0.0425529433
0.4495482494 0.0495341036 -0.0026874225
0.4498111495 0.0468234140 -0.0387461186
0.4499869233 0.0451376172 -0.0160874152
0.4499149497 0.0458036206 -0.0343360797
0.4492672102 0.0523176722 -0.0063223576
0.4490790138 0.0541441575 -0.0226201232
0.4491000414 0.0539184839 -0.0287796465
0.4493943647 0.0509584089 -0.0415774830
0.4499253924 0.0457640891 -0.0105880237
0.1294531565 -0.0193809327 -0.0331980477
0.1221402746 0.0533058748 -0.0331971062
-0.0801198415 0.4996773196 -0.0646792150
-0.0801206474 0.4996772771 -0.0676551038
0.0201636296 -0.4970959805 -0.0646921252
0.0201628237 -0.4970960231 -0.0676680140
-0.1077845284 -0.0065383220 0.0152194678
-0.1077869510 -0.0065384498 0.0062738743
-0.1717085752 -0.0478747326 0.0859115707
-0.1793871222 0.0284466252 0.0859125592
-0.1709829451 -0.0550871743 0.0859114773
-0.1786614922 0.0212341834 0.0859124658
0.3637219027 0.0483467949 -0.0778280322
0.3630278347 0.0553742018 -0.0302769925
0.3621846309 0.0637196291 -0.0434490413
0.3664371810 0.0214712365 -0.0360320117
0.3625246294 0.0602735894 -0.0680618586
0.3652638780 0.0331588002 -0.0266264910
0.3620705610 0.0648295939 -0.0522585857
0.3667507044 0.0182885559 -0.0605678447
0.3630539933 0.0549958520 -0.0740094864
0.3644632218 0.0409748506 -0.0791441834
0.3644777835 0.0409756192 -0.0253746605
0.3658752313 0.0269539960 -0.0740098496
0.3621858008 0.0636616765 -0.0605672570
0.3668704446 0.0171208760 -0.0522592037
0.3636910109 0.0487924025 -0.0266262886
0.3664078165 0.0216764287 -0.0680623585
0.3625126137 0.0604796973 -0.0360315065
0.3667611462 0.0182310926 -0.0434496305
0.3659250769 0.0265768965 -0.0302773654
0.3652052536 0.0336029440 -0.0778282232
-0.4104213539 0.0736746274 0.0071751121
-0.3883777802 -0.1454287348 0.0071722743
0.1662648533 0.0358744458 -0.0684723533
0.1712679977 -0.0138139640 -0.0534585729
0.1736761376 -0.0374495452 0.0574991698
0.1721367303 -0.0221010843 0.0750280073
0.1745013254 -0.0458307320 -0.0087162571
0.1701491685 -0.0023154999 0.0861512543
0.1746498403 -0.0471888679 0.0349023249
0.1731724645 -0.0326851976 -0.0319062960
0.1749784687 -0.0505279175 0.0080633924
0.1677858335 0.0211853213 0.0899643239
0.1677414733 0.0211829799 -0.0738369470
0.1605488384 0.0928962188 0.0080652500
0.1623331936 0.0750523561 -0.0319049006
0.1608920037 0.0895579365 0.0349040961
0.1654204334 0.0446860336 0.0861518631
0.1610168932 0.0881985536 -0.0087145211
0.1634268469 0.0644712999 0.0750291286
0.1618779456 0.0798192597 0.0575006886
0.1642259868 0.0561805064 -0.0534576663
0.1692209989 0.0064916674 -0.0684727339
-0.1572010312 -0.0472556214 0.0859076330
-0.1648795782 0.0290657364 0.0859086215
-0.1566428217 -0.0528039763 0.0859075611
-0.1643213687 0.0235173814 0.0859085496
-0.1089846997 0.4967733002 -0.0661593009
-0.0087012286 -0.5000000000 -0.0661722111
0.1934713916 0.0768918716 -0.0152296105
0.2030302105 -0.0182429276 -0.0611905029
0.1969001294 0.0430141904 0.0595844487
0.1954651822 0.0572500697 0.0496585360
0.2037876062 -0.0257121204 -0.0393934270
0.2018550593 -0.0066092566 -0.0784888922
0.1937074663 0.0746206754 0.0125899639
0.2003770400 0.0080515460 -0.0895950314
0.1971071655 0.0405526510 -0.0895946104
0.1987834177 0.0243042792 0.0629619772
0.1987410661 0.0243020438 -0.0934227714
0.2038320856 -0.0260135570 0.0125886605
0.1956351618 0.0552137712 -0.0784880914
0.1943848867 0.0679446953 0.0337564401
0.1937237904 0.0743177526 -0.0393921314
0.2031662353 -0.0193380210 0.0337553096
0.2020944474 -0.0086418916 0.0496576825
0.2006648765 0.0055942715 0.0595839640
0.1944693800 0.0668479367 -0.0611894008
0.2040530923 -0.0282855486 -0.0152309728
0.1320407562 0.0441880565 0.1062869676
0.1321444252 0.0426840998 -0.0687004800
0.1269699395 0.0942758306 -0.0097093019
0.1395664488 -0.0306477628 0.0938076178
0.1265819842 0.0982087694 0.0186840183
0.1411920663 -0.0471551253 -0.0353246570
0.1412913825 -0.0478460556 0.0741425912
0.1423824628 -0.0587595118 0.0487919268
0.1298943261 0.0650844055 -0.0556493041
0.1346911928 0.0178554655 0.1105640185
0.1346414268 0.0178528387 -0.0731983798
0.1393980323 -0.0293782263 -0.0556505275
0.1269664654 0.0944686768 0.0487939114
0.1280712764 0.0835559454 0.0741442931
0.1281113015 0.0828618855 -0.0353229730
0.1427506355 -0.0625004652 0.0186819368
0.1298068614 0.0663582148 0.0938088743
0.1423473014 -0.0585683380 -0.0097112815
0.1371408644 -0.0069782937 -0.0687011232
0.1373393126 -0.0084772478 0.1062862854
-0.4154902082 0.0731646596 0.0071764921
-0.3934466346 -0.1459387026 0.0071736543
0.1180534365 -0.1914436428 -0.0884309907
0.1180605227 -0.1914432688 -0.0622648927
0.0766939995 0.2196508478 -0.0884256661
0.0767010858 0.2196512218 -0.0622595682
0.0503187425 -0.0711619308 0.0264937562
0.0499538929 -0.0674492818 0.0583498396
0.0396945826 0.0346883246 0.1191785614
0.0357558443 0.0737456134 0.0851722088
0.0374780150 0.0566842996 0.1059768461
0.0375621828 0.0554198095 -0.0521473691
0.0346616358 0.0843814902 -0.0035425680
0.0471608591 -0.0395588841 0.1059755995
0.0397943425 0.0331957645 -0.0659556966
0.0487714650 -0.0559372977 -0.0306437441
0.0422716394 0.0085596574 -0.0707130087
0.0423242907 0.0085624365 0.1237036408
0.0357935171 0.0730577581 -0.0306420733
0.0447515128 -0.0160763136 -0.0659563348
0.0499180242 -0.0672602550 -0.0035445321
0.0469911514 -0.0382999639 -0.0521485830
0.0488718667 -0.0566218419 0.0851705203
0.0346592913 0.0845722865 0.0583518086
0.0449515477 -0.0175635810 0.1191778846
0.0342771873 0.0882840247 0.0264958214
0.2298245471 0.0117577558 0.0282535344
0.2327686647 -0.0177522343 -0.0629353776
0.2243629165 0.0659755668 0.0029855453
0.2243806747 0.0655661842 -0.0830695290
0.2234825485 0.0746080495 -0.0406139609
0.2327924150 -0.0178638450 -0.0169440829
0.2253864052 0.0558443741 0.0184437960
0.2296983044 0.0126402946 -0.1093090752
0.2254299571 0.0550935407 -0.0990489853
0.2282647301 0.0272707441 0.0316155828
0.2282256080 0.0272686792 -0.1128436764
0.2310287305 -0.0005557880 -0.0990497061
0.2267548262 0.0418971648 -0.1093086963
0.2311359205 -0.0013032623 0.0184430558
0.2237107439 0.0724039451 -0.0169429138
0.2330077893 -0.0200686262 -0.0406151872
0.2320866678 -0.0110279746 -0.0830705211
0.2321510364 -0.0114348970 0.0029845426
0.2237095837 0.0722910195 -0.0629342114
0.2267030921 0.0427836363 0.0282539363
-0.0762677262 0.0399363210 0.0796522905
-0.0666915656 -0.0553673868 0.0349699103
-0.0769897035 0.0470571873 0.0592289486
-0.0669558585 -0.0528023341 0.0120950393
-0.0677108283 -0.0453541094 -0.0085399429
-0.0751344550 0.0287149785 0.0954949039
-0.0750835648 0.0278833124 -0.0249148189
-0.0769898004 0.0469306054 0.0120963310
-0.0736762498 0.0142482693 0.1055477792
-0.0703556716 -0.0191383068 -0.0354301647
-0.0719867340 -0.0029360709 -0.0390522716
-0.0719466406 -0.0029339546 0.1089936612
-0.0736158344 0.0132662686 -0.0354297450
-0.0702188980 -0.0201162771 0.1055473341
-0.0688822460 -0.0337550500 -0.0249156172
-0.0762461128 0.0394828400 -0.0085388440
-0.0687661379 -0.0345832737 0.0954940840
-0.0669305324 -0.0529265193 0.0592276536
-0.0772418090 0.0494973613 0.0349712685
-0.0676414476 -0.0458050691 0.0796511799
-0.1644831433 -0.0472887563 0.0859096056
-0.1637854870 -0.0542231508 0.0859095158
-0.1721617959 0.0290336507 0.0859105941
-0.1714641396 0.0220992562 0.0859105043
0.1297324293 0.0356644722 -0.0497234249
0.1297394270 0.0356648416 -0.0238842318
0.1333789474 -0.0005803034 -0.0497238944
0.1333859451 -0.0005799341 -0.0238847013
0.1054686933 -0.0217939642 -0.0331915178
0.0981558114 0.0508928434 -0.0331905763
0.1631560211 0.0390270963 -0.0450809845
0.1631604997 0.0390273327 -0.0285438165
0.1668025393 0.0027823206 -0.0450814539
0.1668070178 0.0027825570 -0.0285442860
0.2929758898 -0.0088542686 -0.0798042842
0.2931995278 -0.0110269694 -0.0612677520
0.2914427543 0.0065673050 -0.0122212493
0.2851123040 0.0692610421 -0.0965249835
0.2872864688 0.0479009871 -0.0040744557
0.2923950316 -0.0029326527 -0.0250602973
0.2873390291 0.0470694092 -0.1183171709
0.2913457084 0.0072678485 -0.1097970693
0.2844823006 0.0756716040 -0.0416091015
0.2887505192 0.0333565308 -0.0012822438
0.2887180290 0.0333548159 -0.1212531651
0.2929968951 -0.0089596954 -0.0416101977
0.2860965549 0.0594421107 -0.1097963936
0.2900986191 0.0196403064 -0.1183175262
0.2850931281 0.0696450344 -0.0250593572
0.2902130572 0.0188119945 -0.0040748324
0.2923371475 -0.0025507034 -0.0965259136
0.2842690208 0.0777383160 -0.0612666024
0.2860523594 0.0601454438 -0.0122205554
0.2844826187 0.0755650853 -0.0798031908
0.4559490872 0.0488503259 -0.0216011212
0.4558861615 0.0494735598 -0.0224215389
0.4556835057 0.0515155173 -0.0122041536
0.4560031278 0.0483352681 -0.0134411607
0.4555930271 0.0524020534 -0.0169273902
0.4560316796 0.0480372100 -0.0187127691
0.4556350710 0.0519749662 -0.0203229882
0.4560332036 0.0480320164 -0.0150345622
0.4558933634 0.0494317477 -0.0114196090
0.4558165199 0.0501650017 -0.0227041444
0.4558196487 0.0501651668 -0.0111506938
0.4557457884 0.0508985783 -0.0114195900
0.4556039903 0.0522982062 -0.0150345069
0.4559992584 0.0483551052 -0.0203230350
0.4556035220 0.0522929074 -0.0187127140
0.4560431415 0.0479281151 -0.0169274481
0.4556349291 0.0519950000 -0.0134411133
0.4559552212 0.0488147862 -0.0122041886
0.4557470313 0.0508564516 -0.0224215210
0.4556845500 0.0514797089 -0.0216010871
-0.2668935543 -0.0225458350 0.0040805298
-0.2668899202 -0.0225456432 0.0174994472
0.4116397136 0.0340958019 -0.0102695652
0.4116422196 0.0340959342 -0.0010160485
0.4093241154 0.0571118220 -0.0102692671
0.4093266214 0.0571119543 -0.0010157504
0.1184310803 0.0540508472 -0.0331961124
0.1257439622 -0.0186359603 -0.0331970538
0.1186538152 0.0518369613 -0.0331961410
0.1259666970 -0.0208498463 -0.0331970825
-0.1926481378 -0.0569870665 0.0859173718
-0.2003267904 0.0193353405 0.0859183603
-0.1933179259 -0.0503296701 0.0859174580
-0.2009965785 0.0259927369 0.0859184465
0.1283281962 -0.0202402511 -0.0331977307
0.1210152088 0.0524476057 -0.0331967893
0.1281796711 -0.0187639773 -0.0331977116
0.1208666837 0.0539238794 -0.0331967702
0.3976370855 0.0336719555 -0.0354268980
0.3949007550 0.0608438583 -0.0450386036
0.3979903218 0.0300863252 -0.0630008424
0.3955367405 0.0544620919 -0.0673409797
0.3960253693 0.0495977984 -0.0701271157
0.3948173091 0.0616558743 -0.0514680736
0.3980117474 0.0299366187 -0.0396260921
0.3949015944 0.0608017103 -0.0575305880
0.3960027644 0.0499235954 -0.0327618856
0.3965783221 0.0442052774 -0.0318487351
0.3965676955 0.0442047165 -0.0710878641
0.3971533852 0.0384869333 -0.0327620337
0.3982411395 0.0276081102 -0.0575310180
0.3951406844 0.0584737137 -0.0396257225
0.3983287085 0.0267541195 -0.0514685256
0.3971105420 0.0388116620 -0.0701272554
0.3976006799 0.0339474482 -0.0673412454
0.3951494494 0.0583233390 -0.0630004767
0.3982487451 0.0275663194 -0.0450390346
0.3955176207 0.0547384969 -0.0354266251
-0.1150100325 -0.0072649426 -0.0097667529
-0.1150108236 -0.0072649844 -0.0126878060
-0.1150027318 -0.0072645573 0.0171912985
-0.1150106211 -0.0072649737 -0.0119401429
-0.1150079615 -0.0072648333 -0.0021192881
-0.1150053238 -0.0072646941 0.0076203678
-0.1150025390 -0.0072645471 0.0179031075
-0.1150066815 -0.0072647657 0.0026071235
-0.1150041812 -0.0072646338 0.0118395496
-0.1150091161 -0.0072648942 -0.0063827603
-0.1150032944 -0.0072645870 0.0151138709
-0.1530924430 -0.0518861159 0.0859065865
-0.1607709900 0.0244352418 0.0859075750
-0.1535389684 -0.0474478517 0.0859066440
-0.1612175154 0.0288735061 0.0859076325
0.4520815673 0.0535296729 -0.0387626473
0.4520812260 0.0535380933 -0.0369045621
0.4521369781 0.0529767144 -0.0395756985
0.4523326136 0.0510293190 -0.0406344736
0.4528459715 0.0459342732 -0.0378611210
0.4527750889 0.0466435813 -0.0361000436
0.4525746662 0.0486234230 -0.0406345048
0.4522234696 0.0521152832 -0.0402200286
0.4525834541 0.0485511052 -0.0350802867
0.4522185263 0.0521772559 -0.0354756891
0.4526914421 0.0474766828 -0.0354757500
0.4523267284 0.0511028448 -0.0350802536
0.4524535483 0.0498268936 -0.0407779056
0.4524551281 0.0498269769 -0.0349442355
0.4526839291 0.0475385199 -0.0402200879
0.4521345414 0.0530103396 -0.0360999612
0.4520627049 0.0537195973 -0.0378610201
0.4527707696 0.0466771071 -0.0395757801
0.4528279684 0.0461158045 -0.0369046583
0.4528266207 0.0461241719 -0.0387627432
-0.1730694433 0.0120927781 0.0021301048
-0.1680497805 -0.0378004471 0.0021294586
-0.1676054787 -0.0421808144 0.0153574489
-0.1723859251 0.0052705017 -0.0083678478
-0.1715229903 -0.0033249282 -0.0151085265
-0.1680077631 -0.0380650955 0.0586634331
-0.1724142130 0.0057605486 0.0688197749
-0.1735057873 0.0165474019 0.0455718116
-0.1695231426 -0.0229579719 0.0752638578
-0.1674497101 -0.0436894048 0.0300206943
-0.1705392076 -0.0128527575 0.0774731274
-0.1705649092 -0.0128541141 -0.0174307290
-0.1736544068 0.0179825331 0.0300214931
-0.1715564692 -0.0027476063 0.0752641195
-0.1675899070 -0.0422538290 0.0455710500
-0.1686688893 -0.0314663111 0.0688192927
-0.1730808400 0.0123590427 0.0586640862
-0.1696055704 -0.0223832337 -0.0151087734
-0.1687389847 -0.0309784709 -0.0083683173
-0.1735065803 0.0164735235 0.0153582086
0.0406063502 0.0266976595 -0.0491824393
0.0406130680 0.0266980140 -0.0243766873
0.0442528683 -0.0095471162 -0.0491829087
0.0442595861 -0.0095467616 -0.0243771568
-0.2603981995 -0.0421559778 0.0235900002
-0.2640621296 -0.0056927213 0.0403722918
-0.2643382448 -0.0029690168 0.0327016626
-0.2617479086 -0.0286687315 0.0500989957
-0.2643381833 -0.0030175346 0.0149981819
-0.2611919885 -0.0342045496 0.0463228565
-0.2607880307 -0.0383254542 0.0072469157
-0.2630472497 -0.0158971501 -0.0028530996
-0.2636088232 -0.0103046708 0.0010961945
-0.2624239605 -0.0220960502 -0.0042135259
-0.2624089012 -0.0220952554 0.0513934132
-0.2612362219 -0.0338872779 0.0010958891
-0.2640536828 -0.0058663186 0.0072473361
-0.2617999344 -0.0282949115 -0.0028532601
-0.2636285602 -0.0099861061 0.0463231701
-0.2604993321 -0.0411740166 0.0149976877
-0.2630705948 -0.0155218163 0.0500991660
-0.2604896818 -0.0412220283 0.0327011672
-0.2607616422 -0.0384981045 0.0403718669
-0.2644346620 -0.0020353278 0.0235905198
0.0240444730 -0.2009018761 -0.0753228735
-0.0173149640 0.2101926145 -0.0753175490
0.3215007265 0.0000767892 -0.0732424032
0.3215181252 -0.0000140607 -0.0429087966
0.3210014777 0.0051567576 -0.0297639905
0.3201027631 0.0139074651 -0.0970630433
0.3216921906 -0.0017864419 -0.0585211631
0.3209530656 0.0054843568 -0.0865231068
0.3155602188 0.0592680534 -0.0195670215
0.3166188531 0.0487632046 -0.0130976049
0.3190331754 0.0245203810 -0.1038298365
0.3178488823 0.0362854203 -0.1061612539
0.3178746864 0.0362867823 -0.0108790315
0.3166658521 0.0480505263 -0.1038295317
0.3191293179 0.0238102965 -0.0130979281
0.3201844480 0.0133052627 -0.0195676168
0.3147553360 0.0670870452 -0.0865223090
0.3140313779 0.0743586444 -0.0585201769
0.3155999296 0.0586636355 -0.0970624636
0.3147376665 0.0674162671 -0.0297631841
0.3142138994 0.0725867096 -0.0429078563
0.3142148684 0.0724949925 -0.0732414652
0.1074580122 0.0334231439 -0.0233614450
0.1074507346 0.0334227598 -0.0502340793
0.1111045303 -0.0028216317 -0.0233619144
0.1110972527 -0.0028220159 -0.0502345487
-0.1801083299 -0.0138145307 0.0034980002
-0.1801043931 -0.0138143229 0.0180347213
0.1408733466 0.0367853321 -0.0492097375
0.1408800644 0.0367856867 -0.0244039855
0.1445198647 0.0005405565 -0.0492102069
0.1445265826 0.0005409111 -0.0244044550
-0.4205601118 0.0726545862 0.0071778724
-0.3985165381 -0.1464487760 0.0071750346
-0.1601932004 -0.0537218367 0.0859085357
-0.1678718530 0.0226005703 0.0859095243
-0.1608629884 -0.0470644403 0.0859086220
-0.1685416410 0.0292579667 0.0859096105
-0.4078874513 0.0739295586 0.0071744223
-0.3858438776 -0.1451738036 0.0071715844
0.1742990378 0.0401480670 -0.0368154337
0.1779455559 0.0039032913 -0.0368159031
-0.3826045224 -0.0341873833 0.0108209646
0.1960074077 0.1369933397 -0.0560984855
0.1901305106 0.1364021327 -0.0604579021
0.2068615927 0.1854159761 -0.0657400114
0.1845590023 0.1358416474 -0.0645906776
0.1731123223 0.1346900461 -0.0667113884
0.1616656424 0.1335384448 -0.0688320992
0.1502193938 0.1323868663 -0.0693599397
0.1384678879 0.1312045730 -0.0696293368
0.1604628761 0.1807480633 -0.0791781971
0.1273270405 0.1300837168 -0.0698846640
0.0920723671 0.1265368038 -0.0693298727
0.1020105200 0.1748672823 -0.0791551651
0.1146687803 0.1524754996 -0.0745199145
0.0843831833 0.1730938258 -0.0788777694
0.1173888876 0.0817532383 -0.0600593716
0.0997615508 0.0799797818 -0.0597819760
0.1047306273 0.1041450211 -0.0646946222
0.1020105200 0.1748672823 -0.0791551651
0.1119486730 0.2231977608 -0.0889804574
0.1246069332 0.2008059781 -0.0843452069
0.0893522598 0.1972590651 -0.0837904156
0.1372651935 0.1784141953 -0.0797099563
0.1146687803 0.1524754996 -0.0745199145
0.1246069332 0.2008059781 -0.0843452069
0.0586501749 0.1231742536 -0.0688040527
0.0116456931 0.1184451370 -0.0622499942
0.0206676054 0.1666834341 -0.0720608009
0.0396588902 0.1449288439 -0.0704324268
-0.0028346354 0.1643188758 -0.0687837716
0.0496282625 0.0749359566 -0.0589932460
0.0261260217 0.0725713982 -0.0557162167
0.0306369778 0.0966905468 -0.0606216201
0.0206676054 0.1666834341 -0.0720608009
0.0296895178 0.2149217312 -0.0818716076
0.0486808025 0.1931671410 -0.0802432335
0.0016763207 0.1884380243 -0.0736891749
0.0676720872 0.1714125507 -0.0786148594
0.0396588902 0.1449288439 -0.0704324268
0.0486808025 0.1931671410 -0.0802432335
0.0140922880 0.1186911192 -0.0495071696
0.0453966869 0.1691711705 -0.0558833689
0.0296930609 0.2149219182 -0.0687885586
0.0140408614 0.1896818925 -0.0656004589
0.0610488863 0.1944111962 -0.0590714685
-0.0016113380 0.1644418669 -0.0624123593
0.0297444874 0.1439311449 -0.0526952692
0.0140408614 0.1896818925 -0.0656004589
-0.0329157369 0.1139618156 -0.0560361600
-0.0172121109 0.0682110679 -0.0431309703
-0.0015599115 0.0934510936 -0.0463190699
-0.0407161233 0.0658464161 -0.0463954655
-0.0016113380 0.1644418669 -0.0624123593
-0.0251153504 0.1620772151 -0.0656768545
-0.0172635374 0.1392018412 -0.0592242596
0.0939120455 0.1267215465 -0.0427830604
0.1205615342 0.1767333128 -0.0519862469
0.1119560544 0.2231981504 -0.0617245008
0.0986313100 0.1981922673 -0.0571229075
0.1338862786 0.2017391959 -0.0565878401
0.0853065656 0.1731863842 -0.0525213143
0.1072367898 0.1517274297 -0.0473846536
0.0986313100 0.1981922673 -0.0571229075
0.0586570769 0.1231746179 -0.0433181277
0.0672625567 0.0767097803 -0.0335798738
0.0805873011 0.1017156634 -0.0381814671
0.0496350725 0.0749363160 -0.0338474075
0.0676790813 0.1714129199 -0.0527888479
0.0807955634 0.1490672332 -0.0477859542
0.0853065656 0.1731863842 -0.0525213143
0.1390858759 0.1312663969 -0.0425512350
0.1548998078 0.1801880234 -0.0521461301
0.1273345176 0.1300841115 -0.0422754392
0.1561022257 0.1329783865 -0.0430862974
0.1675479652 0.1341299382 -0.0444381598
0.1789934948 0.1352814788 -0.0465651032
0.1904381387 0.1364329726 -0.0519626769
0.2040769581 0.1851357925 -0.0636721072
0.1845636036 0.1358418902 -0.0476000609
0.1845590023 0.1358416474 -0.0645906776
0.1901305106 0.1364021327 -0.0604579021
0.1738575117 0.0874343718 -0.0548358310
0.1731123223 0.1346900461 -0.0667113884
0.1616656424 0.1335384448 -0.0688320992
0.1502193938 0.1323868663 -0.0693599397
0.1273270405 0.1300837168 -0.0698846640
0.1384678879 0.1312045730 -0.0696293368
0.1173888876 0.0817532383 -0.0600593716
0.0586501749 0.1231742536 -0.0688040527
0.0920723671 0.1265368038 -0.0693298727
0.0830504547 0.0782985067 -0.0595190660
0.0708503148 0.1007363802 -0.0641615594
0.0997615508 0.0799797818 -0.0597819760
0.0676720872 0.1714125507 -0.0786148594
0.0843831833 0.1730938258 -0.0788777694
0.0798722271 0.1489746773 -0.0739723661
0.0830504547 0.0782985067 -0.0595190660
0.0618284025 0.0524980831 -0.0543507526
0.0952505947 0.0558606333 -0.0548765726
0.0740285424 0.0300602096 -0.0497082593
0.0496282625 0.0749359566 -0.0589932460
0.0708503148 0.1007363802 -0.0641615594
0.0618284025 0.0524980831 -0.0543507526
-0.0329157369 0.1139618156 -0.0560361600
0.0116456931 0.1184451370 -0.0622499942
0.0038453067 0.0703297375 -0.0526092996
-0.0145352151 0.0921457765 -0.0543227298
0.0261260217 0.0725713982 -0.0557162167
-0.0251153504 0.1620772151 -0.0656768545
-0.0028346354 0.1643188758 -0.0687837716
-0.0067348287 0.1402611760 -0.0639634243
0.0038453067 0.0703297375 -0.0526092996
-0.0039550798 0.0222143380 -0.0429686051
-0.0223356016 0.0440303771 -0.0446820353
0.0222258284 0.0485136985 -0.0508958695
-0.0407161233 0.0658464161 -0.0463954655
-0.0145352151 0.0921457765 -0.0543227298
-0.0223356016 0.0440303771 -0.0446820353
0.0140922880 0.1186911192 -0.0495071696
-0.0172121109 0.0682110679 -0.0431309703
-0.0039517209 0.0222145153 -0.0305657291
0.0117004786 0.0474545410 -0.0337538288
-0.0328643103 0.0429710423 -0.0399428706
0.0273526780 0.0726945666 -0.0369419284
-0.0015599115 0.0934510936 -0.0463190699
0.0117004786 0.0474545410 -0.0337538288
0.0586570769 0.1231746179 -0.0433181277
0.0453966869 0.1691711705 -0.0558833689
0.0297444874 0.1439311449 -0.0526952692
0.0676790813 0.1714129199 -0.0527888479
0.0496350725 0.0749363160 -0.0338474075
0.0318636802 0.0968137176 -0.0416772885
0.0273526780 0.0726945666 -0.0369419284
0.0939120455 0.1267215465 -0.0427830604
0.0672625567 0.0767097803 -0.0335798738
0.0740355401 0.0300605790 -0.0238690661
0.0873602845 0.0550664621 -0.0284706594
0.0539378124 0.0517038972 -0.0289782806
0.1006850288 0.0800723452 -0.0330722527
0.0805873011 0.1017156634 -0.0381814671
0.0873602845 0.0550664621 -0.0284706594
0.1273345176 0.1300841115 -0.0422754392
0.1205615342 0.1767333128 -0.0519862469
0.1072367898 0.1517274297 -0.0473846536
0.1372727703 0.1784145953 -0.0517324363
0.1173962649 0.0817536277 -0.0328184421
0.1056541552 0.1042375871 -0.0378007512
0.1006850288 0.0800723452 -0.0330722527
0.1390858759 0.1312663969 -0.0425512350
0.1232719440 0.0823447704 -0.0329563400
0.1502265833 0.1323872458 -0.0428126285
0.1561022257 0.1329783865 -0.0430862974
0.1675479652 0.1341299382 -0.0444381598
0.1789934948 0.1352814788 -0.0465651032
0.1904381387 0.1364329726 -0.0519626769
0.1767993192 0.0877301526 -0.0402532467
0.1960074077 0.1369933397 -0.0560984855
0.2185103853 -0.0866762934 -0.0561013825
0.2126334881 -0.0872675004 -0.0604607991
0.2387927999 -0.1319660858 -0.0657441222
0.2070619798 -0.0878279858 -0.0645935745
0.1956152999 -0.0889795871 -0.0667142854
0.1841686199 -0.0901311883 -0.0688349962
0.1727223714 -0.0912827669 -0.0693628367
0.1609708654 -0.0924650601 -0.0696322338
0.1923940834 -0.1366339986 -0.0791823078
0.1498300180 -0.0935859163 -0.0698875609
0.1145753446 -0.0971328293 -0.0693327697
0.1339417273 -0.1425147796 -0.0791592758
0.1418858727 -0.1180503479 -0.0745234184
0.1163143905 -0.1442882361 -0.0788818802
0.1304636354 -0.0482039661 -0.0600610548
0.1128362987 -0.0499774226 -0.0597836592
0.1225194900 -0.0726683977 -0.0646969123
0.1339417273 -0.1425147796 -0.0791592758
0.1533081099 -0.1878967298 -0.0889857819
0.1612522553 -0.1634322982 -0.0843499245
0.1259975819 -0.1669792112 -0.0837951332
0.1691964007 -0.1389678666 -0.0797140671
0.1418858727 -0.1180503479 -0.0745234184
0.1612522553 -0.1634322982 -0.0843499245
0.0811531524 -0.1004953795 -0.0688069497
0.0341486706 -0.1052244961 -0.0622528911
0.0525988127 -0.1506986278 -0.0720649116
0.0668759825 -0.1255970037 -0.0704359307
0.0290965718 -0.1530631861 -0.0687878823
0.0627030104 -0.0550212479 -0.0589949292
0.0392007695 -0.0573858062 -0.0557178999
0.0484258405 -0.0801228720 -0.0606239102
0.0525988127 -0.1506986278 -0.0720649116
0.0710489547 -0.1961727594 -0.0818769321
0.0853261246 -0.1710711353 -0.0802479511
0.0383216428 -0.1758002519 -0.0736938926
0.0996032944 -0.1459695112 -0.0786189702
0.0668759825 -0.1255970037 -0.0704359307
0.0853261246 -0.1710711353 -0.0802479511
0.0365952655 -0.1049785139 -0.0495100665
0.0773278941 -0.1482108913 -0.0558874796
0.0710524978 -0.1961725724 -0.0687938831
0.0506861835 -0.1745563837 -0.0656051766
0.0976942084 -0.1698270801 -0.0590761861
0.0303198693 -0.1529401950 -0.0624164700
0.0569615798 -0.1265947026 -0.0526987731
0.0506861835 -0.1745563837 -0.0656051766
-0.0104127593 -0.1097078176 -0.0560390570
-0.0041373631 -0.0617461365 -0.0431326535
0.0162289512 -0.0833623252 -0.0463213600
-0.0276413755 -0.0641107883 -0.0463971487
0.0303198693 -0.1529401950 -0.0624164700
0.0068158568 -0.1553048468 -0.0656809653
0.0099535550 -0.1313240063 -0.0592277635
0.1164150230 -0.0969480866 -0.0427859573
0.1524927415 -0.1406487491 -0.0519903576
0.1533154913 -0.1878963402 -0.0617298253
0.1352766321 -0.1660460089 -0.0571276251
0.1705316007 -0.1624990804 -0.0565925578
0.1172377729 -0.1441956777 -0.0525254250
0.1344538822 -0.1187984179 -0.0473881575
0.1352766321 -0.1660460089 -0.0571276251
0.0811600544 -0.1004950152 -0.0433210247
0.0803373046 -0.0532474241 -0.0335815571
0.0983761638 -0.0750977554 -0.0381837572
0.0627098203 -0.0550208884 -0.0338490907
0.0996102886 -0.1459691420 -0.0527929587
0.1080126558 -0.1214586143 -0.0477894580
0.1172377729 -0.1441956777 -0.0525254250
0.1615888534 -0.0924032362 -0.0425541320
0.1868310150 -0.1371940385 -0.0521502408
0.1498374951 -0.0935855217 -0.0422783362
0.1786052032 -0.0906912466 -0.0430891943
0.1900509427 -0.0895396950 -0.0444410568
0.2014964723 -0.0883881544 -0.0465680001
0.2129411162 -0.0872366606 -0.0519655739
0.2360081654 -0.1322462694 -0.0636762179
0.2070665812 -0.0878277429 -0.0476029579
0.2070619798 -0.0878279858 -0.0645935745
0.2126334881 -0.0872675004 -0.0604607991
0.1869322595 -0.0425228326 -0.0548375142
0.1956152999 -0.0889795871 -0.0667142854
0.1841686199 -0.0901311883 -0.0688349962
0.1727223714 -0.0912827669 -0.0693628367
0.1498300180 -0.0935859163 -0.0698875609
0.1609708654 -0.0924650601 -0.0696322338
0.1304636354 -0.0482039661 -0.0600610548
0.0811531524 -0.1004953795 -0.0688069497
0.1145753446 -0.0971328293 -0.0693327697
0.0961252026 -0.0516586977 -0.0595207492
0.0886391775 -0.0760770386 -0.0641638494
0.1128362987 -0.0499774226 -0.0597836592
0.0996032944 -0.1459695112 -0.0786189702
0.1163143905 -0.1442882361 -0.0788818802
0.1070893195 -0.1215511702 -0.0739758699
0.0961252026 -0.0516586977 -0.0595207492
0.0701890354 -0.0306029069 -0.0543518290
0.1036112276 -0.0272403568 -0.0548776490
0.0776750605 -0.0061845660 -0.0497087287
0.0627030104 -0.0550212479 -0.0589949292
0.0886391775 -0.0760770386 -0.0641638494
0.0701890354 -0.0306029069 -0.0543518290
-0.0104127593 -0.1097078176 -0.0560390570
0.0341486706 -0.1052244961 -0.0622528911
0.0169200545 -0.0596274669 -0.0526109828
0.0032536476 -0.0846676422 -0.0543250199
0.0392007695 -0.0573858062 -0.0557178999
0.0068158568 -0.1553048468 -0.0656809653
0.0290965718 -0.1530631861 -0.0687878823
0.0204822637 -0.1302646715 -0.0639669282
0.0169200545 -0.0596274669 -0.0526109828
-0.0003085617 -0.0140304376 -0.0429690746
-0.0139749686 -0.0390706130 -0.0446831116
0.0305864614 -0.0345872915 -0.0508969458
-0.0276413755 -0.0641107883 -0.0463971487
0.0032536476 -0.0846676422 -0.0543250199
-0.0139749686 -0.0390706130 -0.0446831116
0.0365952655 -0.1049785139 -0.0495100665
-0.0041373631 -0.0617461365 -0.0431326535
-0.0003052028 -0.0140302603 -0.0305661986
0.0200611115 -0.0356464491 -0.0337549051
-0.0245036774 -0.0401299478 -0.0399439469
0.0404274258 -0.0572626378 -0.0369436117
0.0162289512 -0.0833623252 -0.0463213600
0.0200611115 -0.0356464491 -0.0337549051
0.0811600544 -0.1004950152 -0.0433210247
0.0773278941 -0.1482108913 -0.0558874796
0.0569615798 -0.1265947026 -0.0526987731
0.0996102886 -0.1459691420 -0.0527929587
0.0627098203 -0.0550208884 -0.0338490907
0.0496525429 -0.0799997012 -0.0416795786
0.0404274258 -0.0572626378 -0.0369436117
0.1164150230 -0.0969480866 -0.0427859573
0.0803373046 -0.0532474241 -0.0335815571
0.0776820582 -0.0061841967 -0.0238695356
0.0957209174 -0.0280345279 -0.0284717357
0.0622984454 -0.0313970929 -0.0289793569
0.1137597767 -0.0498848592 -0.0330739359
0.0983761638 -0.0750977554 -0.0381837572
0.0957209174 -0.0280345279 -0.0284717357
0.1498374951 -0.0935855217 -0.0422783362
0.1524927415 -0.1406487491 -0.0519903576
0.1344538822 -0.1187984179 -0.0473881575
0.1692039775 -0.1389674666 -0.0517365470
0.1304710127 -0.0482035767 -0.0328201253
0.1234430179 -0.0725758317 -0.0378030413
0.1137597767 -0.0498848592 -0.0330739359
0.1615888534 -0.0924032362 -0.0425541320
0.1363466919 -0.0476124340 -0.0329580232
0.1727295608 -0.0912823874 -0.0428155254
0.1786052032 -0.0906912466 -0.0430891943
0.1900509427 -0.0895396950 -0.0444410568
0.2014964723 -0.0883881544 -0.0465680001
0.2129411162 -0.0872366606 -0.0519655739
0.1898740670 -0.0422270518 -0.0402549299
0.2185103853 -0.0866762934 -0.0561013825
0.0255235799 0.3624043248 -0.0787416824
-0.0353163034 0.4302341502 -0.0733448992
0.0303343023 0.3628883234 -0.0788173366
-0.0161453501 0.3582120740 -0.0772924835
-0.0625650249 0.4274926871 -0.0717258922
-0.0097310936 0.3588574118 -0.0781868911
-0.0631498318 0.3534829573 -0.0707384250
-0.0567350918 0.3541283206 -0.0698475102
-0.0860672657 0.4251281287 -0.0684488629
-0.0097270669 0.3588576243 -0.0633185197
-0.0049163043 0.3593416250 -0.0632454850
-0.0529411433 0.4284608255 -0.0638479955
0.0695997456 0.3668386487 -0.0713698500
0.1436577616 0.3003386306 -0.0733756937
0.0637228484 0.3662474417 -0.0757292666
0.0629206680 0.3661667378 -0.0758777372
0.1344413257 0.2994114681 -0.0799890539
0.0570446568 0.3655755775 -0.0769659962
0.0562430010 0.3654949264 -0.0771144669
0.1252264809 0.2984844022 -0.0816956777
0.0503669896 0.3649037661 -0.0782032531
0.0495653639 0.3648231166 -0.0782404707
0.1160116510 0.2975573370 -0.0833474658
0.0436895740 0.3642319680 -0.0785114675
0.0420858083 0.3640706166 -0.0785479395
0.1063960833 0.2965899385 -0.0837721970
0.1385512209 0.2628495994 -0.0863843257
0.0946445773 0.2954076452 -0.0840415941
0.0303343023 0.3628883234 -0.0788173366
-0.0222244668 0.4315512948 -0.0733236820
0.0887688244 0.2948164986 -0.0841762926
0.0255235799 0.3624043248 -0.0787416824
0.0863634632 0.2945744993 -0.0841384655
0.1167834048 0.2606595866 -0.0868368571
0.1119486730 0.2231977608 -0.0889804574
0.0967387022 0.2401552172 -0.0876312616
0.1319933756 0.2437021302 -0.0881860529
0.0815287313 0.2571126736 -0.0862820658
0.1015734340 0.2776170429 -0.0854876613
0.0967387022 0.2401552172 -0.0876312616
0.0511087897 0.2910275863 -0.0835836743
0.0559435215 0.3284894120 -0.0814400739
0.0711534923 0.3115319557 -0.0827892697
0.0383161848 0.3267159555 -0.0811626783
0.0639013946 0.2553392171 -0.0860046702
0.0751324289 0.2749568582 -0.0850715679
0.0815287313 0.2571126736 -0.0862820658
-0.0097310936 0.3588574118 -0.0781868911
-0.0353163034 0.4302341502 -0.0733448992
-0.0048963617 0.3963192375 -0.0760432908
0.0103136091 0.3793617811 -0.0773924866
-0.0225236985 0.3945457810 -0.0757658951
-0.0529436401 0.4284606937 -0.0730675036
-0.0657362450 0.4641490630 -0.0706465076
-0.0313373668 0.3936590527 -0.0756271973
0.0334814530 0.2892541298 -0.0833062786
0.0118751797 0.3240557708 -0.0807465849
0.0010720431 0.3414565913 -0.0794667380
0.0295025164 0.3258292273 -0.0810239805
0.0511087897 0.2910275863 -0.0835836743
0.0550877263 0.2544524888 -0.0858659724
0.0383161848 0.3267159555 -0.0811626783
-0.0161453501 0.3582120740 -0.0772924835
0.0302743247 0.2889314609 -0.0828590748
0.0296895178 0.2149217312 -0.0818716076
0.0064796804 0.2495620377 -0.0790883119
0.0299819213 0.2519265960 -0.0823653412
0.0061872769 0.2125571729 -0.0785945783
0.0534841621 0.2542911544 -0.0856423705
0.0531917587 0.2172862895 -0.0851486369
0.0299819213 0.2519265960 -0.0823653412
-0.0167301570 0.2842023443 -0.0763050163
0.0070644873 0.3235717674 -0.0800757792
0.0067720839 0.2865669026 -0.0795820456
-0.0164377535 0.3212072091 -0.0767987499
0.0064796804 0.2495620377 -0.0790883119
-0.0170225605 0.2471974794 -0.0758112827
0.0067720839 0.2865669026 -0.0795820456
-0.0631498318 0.3534829573 -0.0707384250
-0.0625650249 0.4274926871 -0.0717258922
-0.0393551875 0.3928523805 -0.0745091879
-0.0396475909 0.3558475157 -0.0740154543
-0.0628574283 0.3904878222 -0.0712321586
-0.0860672657 0.4251281287 -0.0684488629
-0.0857748623 0.4621329936 -0.0689425966
-0.0746085488 0.3893055430 -0.0695936440
-0.0402323979 0.2818377859 -0.0730279870
-0.0281888740 0.3200249300 -0.0751602353
-0.0516911149 0.3176603716 -0.0718832060
-0.0456693529 0.3367539437 -0.0729493301
-0.0167301570 0.2842023443 -0.0763050163
-0.0287736809 0.2460152002 -0.0741727680
-0.0281888740 0.3200249300 -0.0751602353
-0.0097270669 0.3588576243 -0.0633185197
-0.0567350918 0.3541283206 -0.0698475102
-0.0135210155 0.2845251194 -0.0693180344
-0.0351280536 0.3193267200 -0.0695827723
-0.0116240412 0.3216913718 -0.0663182771
-0.0332310794 0.3564929725 -0.0665830149
-0.0370250279 0.2821604676 -0.0725825296
-0.0154179897 0.2473588670 -0.0723177917
-0.0351280536 0.3193267200 -0.0695827723
-0.0529411433 0.4284608255 -0.0638479955
-0.0764451557 0.4260961737 -0.0671124907
-0.0548381176 0.3912945731 -0.0668477528
-0.0745481815 0.4632624261 -0.0641127334
-0.0313341051 0.3936592249 -0.0635832576
-0.0548381176 0.3912945731 -0.0668477528
-0.0332310794 0.3564929725 -0.0665830149
0.0334870094 0.2892544231 -0.0627890439
-0.0135210155 0.2845251194 -0.0693180344
0.0080860227 0.2497235188 -0.0690532965
0.0099829970 0.2868897712 -0.0660535392
-0.0154179897 0.2473588670 -0.0723177917
0.0118799712 0.3240560237 -0.0630537818
-0.0116240412 0.3216913718 -0.0663182771
0.0099829970 0.2868897712 -0.0660535392
0.0296930609 0.2149219182 -0.0687885586
0.0550940476 0.2544528225 -0.0625243060
0.0315900351 0.2520881706 -0.0657888013
0.0531970733 0.2172865700 -0.0655240634
0.0080860227 0.2497235188 -0.0690532965
0.0061890485 0.2125572664 -0.0720530538
0.0315900351 0.2520881706 -0.0657888013
0.0303386643 0.3628885536 -0.0627104176
-0.0049163043 0.3593416250 -0.0632454850
0.0358923907 0.2894964234 -0.0627525266
0.0535198750 0.2912698877 -0.0624849929
0.0419292697 0.3270792207 -0.0625977052
0.0562967383 0.2545738226 -0.0625060474
0.0154880432 0.3244190242 -0.0629990058
0.0331155275 0.3261924885 -0.0627314721
0.0229133538 0.3436537889 -0.0628547117
-0.0280975150 0.4309602909 -0.0634709097
-0.0457249993 0.4291868266 -0.0637384434
-0.0253206518 0.3942642258 -0.0634919642
-0.0573156047 0.4649961596 -0.0638511558
0.0011205747 0.3969244223 -0.0630906637
-0.0165069096 0.3951509580 -0.0633581974
0.0157296195 0.3799064880 -0.0629005406
0.0887748436 0.2948168163 -0.0619499255
0.0535198750 0.2912698877 -0.0624849929
0.0827379647 0.2572340191 -0.0621047468
0.0681289199 0.2742519534 -0.0622948699
0.0651104804 0.2554605548 -0.0623722805
0.0595567540 0.3288526850 -0.0623301716
0.0419292697 0.3270792207 -0.0625977052
0.0741657988 0.3118347507 -0.0621400485
0.1179929333 0.2607809477 -0.0615696795
0.0827379647 0.2572340191 -0.0621047468
0.0973470095 0.2402160848 -0.0619146238
0.1033838885 0.2777988820 -0.0617598025
0.1119560544 0.2231981504 -0.0617245008
0.1326019781 0.2437630134 -0.0613795564
0.0973470095 0.2402160848 -0.0619146238
0.0436937682 0.3642321894 -0.0630240860
0.0319424099 0.3630499039 -0.0627482901
0.0895767164 0.2948974915 -0.0619688618
-0.0198162175 0.4317934591 -0.0636656164
0.1072037539 0.2966709196 -0.0623825556
0.0954523956 0.2954886342 -0.0621067597
0.1389587468 0.2628902848 -0.0620617903
0.0503710162 0.3649039786 -0.0633348817
0.0444953738 0.3643128379 -0.0630612128
0.1164180203 0.2975979551 -0.0628116223
0.0570480123 0.3655757546 -0.0645757746
0.0511725915 0.3649846255 -0.0634837890
0.1256319391 0.2985249721 -0.0645240543
0.0637255329 0.3662475834 -0.0658166675
0.0578501122 0.3656564543 -0.0647246819
0.1348461202 0.2994520156 -0.0662364864
0.0704015223 0.3669193062 -0.0707747850
0.0645269873 0.3663282239 -0.0664121690
0.1440586500 0.3003789594 -0.0730781612
0.0963450339 -0.3415295706 -0.0787507997
0.0502361592 -0.4201194475 -0.0733559130
0.1011557563 -0.3410455720 -0.0788264540
0.0546761040 -0.3457218214 -0.0773016009
0.0229874377 -0.4228609107 -0.0717369060
0.0610903605 -0.3450764836 -0.0781960085
0.0076716222 -0.3504509380 -0.0707475423
0.0140863622 -0.3498055748 -0.0698566275
-0.0005148032 -0.4252254690 -0.0684598767
0.0610943871 -0.3450762711 -0.0633276371
0.0659051497 -0.3445922703 -0.0632546024
0.0326113192 -0.4218927723 -0.0638590093
0.1404211996 -0.3370952467 -0.0713789674
0.1997482071 -0.2571755624 -0.0733829146
0.1345443025 -0.3376864537 -0.0757383840
0.1337421220 -0.3377671576 -0.0758868546
0.1905317712 -0.2581027249 -0.0799962749
0.1278661108 -0.3383583179 -0.0769751135
0.1270644550 -0.3384389690 -0.0771235843
0.1813169264 -0.2590297908 -0.0817028986
0.1211884436 -0.3390301293 -0.0782123705
0.1203868179 -0.3391107788 -0.0782495881
0.1721020965 -0.2599568560 -0.0833546868
0.1145110280 -0.3397019274 -0.0785205849
0.1129072623 -0.3398632788 -0.0785570569
0.1624865288 -0.2609242545 -0.0837794179
0.1872761621 -0.2214547424 -0.0863905985
0.1507350228 -0.2621065478 -0.0840488150
0.1011557563 -0.3410455720 -0.0788264540
0.0633279958 -0.4188023030 -0.0733346958
0.1448592698 -0.2626976944 -0.0841835136
0.0963450339 -0.3415295706 -0.0787507997
0.1424539086 -0.2629396937 -0.0841456864
0.1655083460 -0.2236447552 -0.0868431298
0.1533081099 -0.1878967298 -0.0889857819
0.1417808912 -0.2075441990 -0.0876370602
0.1770355647 -0.2039972860 -0.0881918515
0.1302536726 -0.2271916683 -0.0862883386
0.1539811273 -0.2432922245 -0.0854944081
0.1417808912 -0.2075441990 -0.0876370602
0.1071992352 -0.2664866067 -0.0835908952
0.1193994713 -0.3022346322 -0.0814482431
0.1309266900 -0.2825871629 -0.0827969648
0.1017721346 -0.3040080887 -0.0811708475
0.1126263358 -0.2289651248 -0.0860109429
0.1275401222 -0.2459524092 -0.0850783147
0.1302536726 -0.2271916683 -0.0862883386
0.0610903605 -0.3450764836 -0.0781960085
0.0502361592 -0.4201194475 -0.0733559130
0.0732905965 -0.3808245091 -0.0760533564
0.0848178152 -0.3611770399 -0.0774020780
0.0556632598 -0.3825979656 -0.0757759607
0.0326088225 -0.4218929041 -0.0730785174
0.0271817218 -0.4594143860 -0.0706584696
0.0468495915 -0.3834846938 -0.0756372629
0.0895718985 -0.2682600632 -0.0833134996
0.0753311295 -0.3066682734 -0.0807547540
0.0682107450 -0.3258723785 -0.0794753812
0.0929584662 -0.3048948169 -0.0810321496
0.1071992352 -0.2664866067 -0.0835908952
0.1038126675 -0.2298518530 -0.0858722451
0.1017721346 -0.3040080887 -0.0811708475
0.0546761040 -0.3457218214 -0.0773016009
0.0863647702 -0.2685827321 -0.0828662958
0.0710489547 -0.1961727594 -0.0818769321
0.0552046216 -0.2347423041 -0.0790945847
0.0787068625 -0.2323777458 -0.0823716139
0.0475467139 -0.1985373178 -0.0785999028
0.1022091034 -0.2300131875 -0.0856486432
0.0945511956 -0.1938082011 -0.0851539614
0.0787068625 -0.2323777458 -0.0823716139
0.0393602885 -0.2733118487 -0.0763122372
0.0705204371 -0.3071522768 -0.0800839483
0.0628625293 -0.2709472904 -0.0795892665
0.0470181962 -0.3095168351 -0.0768069191
0.0552046216 -0.2347423041 -0.0790945847
0.0317023807 -0.2371068624 -0.0758175554
0.0628625293 -0.2709472904 -0.0795892665
0.0076716222 -0.3504509380 -0.0707475423
0.0229874377 -0.4228609107 -0.0717369060
0.0388317708 -0.3842913661 -0.0745192535
0.0311738631 -0.3480863797 -0.0740245716
0.0153295299 -0.3866559244 -0.0712422242
-0.0005148032 -0.4252254690 -0.0684598767
0.0071431046 -0.4614304554 -0.0689545586
0.0035784095 -0.3878382035 -0.0696037095
0.0158580476 -0.2756764071 -0.0730352079
0.0352670758 -0.3106991142 -0.0751684044
0.0117648349 -0.3130636726 -0.0718913751
0.0214693490 -0.3305750261 -0.0729579734
0.0393602885 -0.2733118487 -0.0763122372
0.0199512603 -0.2382891416 -0.0741790407
0.0352670758 -0.3106991142 -0.0751684044
0.0610943871 -0.3450762711 -0.0633276371
0.0140863622 -0.3498055748 -0.0698566275
0.0425694300 -0.2729890736 -0.0693252553
0.0283278961 -0.3113973242 -0.0695909414
0.0518319085 -0.3090326724 -0.0663264462
0.0375903746 -0.3474409229 -0.0665921323
0.0190654176 -0.2753537254 -0.0725897505
0.0333069515 -0.2369454748 -0.0723240644
0.0283278961 -0.3113973242 -0.0695909414
0.0326113192 -0.4218927723 -0.0638590093
0.0091073068 -0.4242574241 -0.0671235045
0.0233488407 -0.3858491735 -0.0668578184
0.0183697853 -0.4603010228 -0.0641246954
0.0468528532 -0.3834845217 -0.0635933232
0.0233488407 -0.3858491735 -0.0668578184
0.0375903746 -0.3474409229 -0.0665921323
0.0895774549 -0.2682597699 -0.0627962649
0.0425694300 -0.2729890736 -0.0693252553
0.0568109639 -0.2345808230 -0.0690595692
0.0660734425 -0.2706244218 -0.0660607601
0.0333069515 -0.2369454748 -0.0723240644
0.0753359210 -0.3066680205 -0.0630619510
0.0518319085 -0.3090326724 -0.0663264462
0.0660734425 -0.2706244218 -0.0660607601
0.0710524978 -0.1961725724 -0.0687938831
0.1038189888 -0.2298515194 -0.0625305788
0.0803149764 -0.2322161712 -0.0657950740
0.0945565103 -0.1938079206 -0.0655293879
0.0568109639 -0.2345808230 -0.0690595692
0.0475484854 -0.1985372243 -0.0720583783
0.0803149764 -0.2322161712 -0.0657950740
0.1011601183 -0.3410453418 -0.0627195350
0.0659051497 -0.3445922703 -0.0632546024
0.0919828362 -0.2680177696 -0.0627597475
0.1096103205 -0.2662443053 -0.0624922138
0.1053852194 -0.3036448235 -0.0626058744
0.1050216795 -0.2297305192 -0.0625123201
0.0789439930 -0.3063050200 -0.0630071749
0.0965714773 -0.3045315557 -0.0627396412
0.0900520557 -0.3236751809 -0.0628633550
0.0574549476 -0.4193933068 -0.0634819235
0.0398274633 -0.4211667711 -0.0637494572
0.0528663065 -0.3828795207 -0.0635020298
0.0356023622 -0.4585672894 -0.0638631178
0.0793075329 -0.3802193243 -0.0631007292
0.0616800487 -0.3819927886 -0.0633682629
0.0902338256 -0.3606323330 -0.0629101321
0.1448652891 -0.2626973767 -0.0619571464
0.1096103205 -0.2662443053 -0.0624922138
0.1314629059 -0.2270703227 -0.0621110195
0.1205366132 -0.2466573140 -0.0623016167
0.1138354216 -0.2288437870 -0.0623785532
0.1230127037 -0.3018713592 -0.0623383407
0.1053852194 -0.3036448235 -0.0626058744
0.1339389964 -0.2822843679 -0.0621477436
0.1667178745 -0.2235233941 -0.0615759522
0.1314629059 -0.2270703227 -0.0621110195
0.1423891986 -0.2074833315 -0.0619204224
0.1557915818 -0.2431103854 -0.0617665493
0.1533154913 -0.1878963402 -0.0617298253
0.1776441672 -0.2039364029 -0.0613853550
0.1423891986 -0.2074833315 -0.0619204224
0.1145152223 -0.3397017060 -0.0630332034
0.1027638639 -0.3408839915 -0.0627574075
0.1456671619 -0.2626167015 -0.0619760827
0.0657362451 -0.4185601387 -0.0636766302
0.1632941994 -0.2608432734 -0.0623897765
0.1515428411 -0.2620255588 -0.0621139806
0.1876836880 -0.2214140570 -0.0620680631
0.1211924702 -0.3390299167 -0.0633439991
0.1153168278 -0.3396210575 -0.0630703302
0.1725084658 -0.2599162379 -0.0628188433
0.1278694663 -0.3383581408 -0.0645848919
0.1219940455 -0.3389492698 -0.0634929063
0.1817223846 -0.2589892209 -0.0645312753
0.1345469870 -0.3376863120 -0.0658257849
0.1286715662 -0.3382774411 -0.0647337993
0.1909365657 -0.2580621774 -0.0662437074
0.1412229763 -0.3370145891 -0.0707839024
0.1353484413 -0.3376056715 -0.0664212864
0.2001490955 -0.2571352336 -0.0730853821
-0.3079375024 0.0286550760 0.0053400063
-0.3614683479 0.0232694354 0.0056340313
-0.4193238320 0.0174486612 0.0090042488
-0.3513282975 0.0242895197 0.0123407298
-0.2506042186 0.0344232221 0.0089583140
-0.2591041524 0.0335680888 0.0067244932
-0.2676036322 0.0327129795 0.0061673781
-0.2761031118 0.0318578702 0.0056107902
-0.2858699537 0.0308752485 0.0054737238
-0.2185248747 0.0099855796 0.0046216495
-0.3003342209 0.0294200278 0.0053379363
-0.3079375024 0.0286550760 0.0053400063
-0.2440229162 0.0074202727 0.0044190032
-0.2235009421 -0.0181801828 0.0037892650
-0.2759802093 0.0180376743 0.0048795048
-0.3513301146 0.0242894238 0.0056312712
-0.3718520886 0.0498898793 0.0062610094
-0.3091118344 0.0008717944 0.0048559005
-0.3614683479 0.0232694354 0.0056340313
-0.3247490383 -0.0283666092 0.0074507472
-0.3431086931 -0.0025485869 0.0065423893
-0.3536767804 -0.0312769963 0.0091358559
-0.3720364352 -0.0054589740 0.0082274980
-0.3141809511 0.0003618002 0.0048572806
-0.2958212963 -0.0254562221 0.0057656385
-0.3431086931 -0.0025485869 0.0065423893
-0.4193238320 0.0174486612 0.0090042488
-0.4087557447 0.0461770705 0.0064107821
-0.3903960899 0.0203590483 0.0073191400
-0.4376834867 0.0432666835 0.0080958908
-0.4009641772 -0.0083693611 0.0099126067
-0.3903960899 0.0203590483 0.0073191400
-0.3720364352 -0.0054589740 0.0082274980
-0.3513282975 0.0242895197 0.0123407298
-0.4091855987 0.0184686497 0.0090014886
-0.3669664100 -0.0049489318 0.0115808472
-0.3802569481 0.0213790847 0.0106711092
-0.3958950605 -0.0078593668 0.0099112266
-0.3935474862 0.0477071012 0.0097613712
-0.4224761368 0.0447966662 0.0080917505
-0.3802569481 0.0213790847 0.0106711092
-0.3247472213 -0.0283665133 0.0141602059
-0.3091091089 0.0008719383 0.0149200885
-0.3380377594 -0.0020384968 0.0132504679
-0.2958185708 -0.0254560782 0.0158298265
-0.3669664100 -0.0049489318 0.0115808472
-0.3536758719 -0.0312769483 0.0124905853
-0.3380377594 -0.0020384968 0.0132504679
-0.3003322525 0.0294201317 0.0126062969
-0.3437250160 0.0250544715 0.0123386598
-0.3053074681 0.0012544142 0.0149190535
-0.3604461821 0.0510373589 0.0098920847
-0.2402183228 0.0078029044 0.0153205091
-0.2702752876 0.0186115180 0.0139634030
-0.2234971567 -0.0181799830 0.0177670842
-0.2833331092 0.0311303851 0.0124619433
-0.2977973007 0.0296751684 0.0126056067
-0.2172545597 0.0101132478 0.0151046688
-0.2748343435 0.0319854316 0.0123199040
-0.2663346420 0.0328405777 0.0117586880
-0.2578359899 0.0336956183 0.0111969450
-0.2493367427 0.0345507404 0.0089579689
-0.2969157156 -0.0808966051 0.0053385874
-0.3504465611 -0.0862822457 0.0056326124
-0.4083020451 -0.0921030199 0.0090028298
-0.3403065107 -0.0852621614 0.0123393109
-0.2395824318 -0.0751284590 0.0089568951
-0.2480823656 -0.0759835923 0.0067230743
-0.2565818453 -0.0768387016 0.0061659592
-0.2650813249 -0.0776938109 0.0056093713
-0.2748481669 -0.0786764326 0.0054723049
-0.2130139813 -0.0447902609 0.0046209400
-0.2893124340 -0.0801316533 0.0053365174
-0.2969157156 -0.0808966051 0.0053385874
-0.2385120227 -0.0473555679 0.0044182938
-0.2235009421 -0.0181801828 0.0037892650
-0.2677138691 -0.0641260865 0.0048784406
-0.3403083277 -0.0852622573 0.0056298522
-0.3553194084 -0.1144376423 0.0062588811
-0.3036009410 -0.0539040461 0.0048551910
-0.3504465611 -0.0862822457 0.0056326124
-0.3247490383 -0.0283666092 0.0074507472
-0.3375977997 -0.0573244275 0.0065416798
-0.3536767804 -0.0312769963 0.0091358559
-0.3665255417 -0.0602348145 0.0082267885
-0.3086700577 -0.0544140404 0.0048565711
-0.2958212963 -0.0254562221 0.0057656385
-0.3375977997 -0.0573244275 0.0065416798
-0.4083020451 -0.0921030199 0.0090028298
-0.3922230644 -0.1181504511 0.0064086537
-0.3793743031 -0.0891926328 0.0073177211
-0.4211508065 -0.1210608382 0.0080937624
-0.3954532838 -0.0631452016 0.0099118972
-0.3793743031 -0.0891926328 0.0073177211
-0.3665255417 -0.0602348145 0.0082267885
-0.3403065107 -0.0852621614 0.0123393109
-0.3981638118 -0.0910830314 0.0090000697
-0.3614555166 -0.0597247724 0.0115801378
-0.3692351613 -0.0881725964 0.0106696903
-0.3903841671 -0.0626352074 0.0099105171
-0.3770148059 -0.1166204205 0.0097592428
-0.4059434565 -0.1195308555 0.0080896222
-0.3692351613 -0.0881725964 0.0106696903
-0.3247472213 -0.0283665133 0.0141602059
-0.3035982154 -0.0539039023 0.0149193791
-0.3325268660 -0.0568143373 0.0132497584
-0.2958185708 -0.0254560782 0.0158298265
-0.3614555166 -0.0597247724 0.0115801378
-0.3536758719 -0.0312769483 0.0124905853
-0.3325268660 -0.0568143373 0.0132497584
-0.2893104656 -0.0801315494 0.0126048779
-0.3327032292 -0.0844972096 0.0123372409
-0.2997965747 -0.0535214264 0.0149183440
-0.3439135019 -0.1132901627 0.0098899563
-0.2347074294 -0.0469729361 0.0153197996
-0.2620089475 -0.0635522428 0.0139623388
-0.2234971567 -0.0181799830 0.0177670842
-0.2723113224 -0.0784212960 0.0124605244
-0.2867755138 -0.0798765127 0.0126041878
-0.2117436663 -0.0446625927 0.0151039594
-0.2638125566 -0.0775662495 0.0123184851
-0.2553128551 -0.0767111034 0.0117572691
-0.2468142030 -0.0758560628 0.0111955261
-0.2383149559 -0.0750009407 0.0089565500
0.1018976779 0.0947038026 0.0051716544
0.1026764291 0.0868876507 -0.0228062305
0.1041607391 0.0720700139 -0.0465497335
0.1062053516 0.0517009682 -0.0637346479
0.1086100491 0.0277751334 -0.0726800239
0.1111395084 0.0026338902 -0.0725095154
0.1135461305 -0.0212617810 -0.0632394357
0.1155942672 -0.0415720990 -0.0457777064
0.1170835220 -0.0563098369 -0.0218336978
0.1178680602 -0.0640318054 0.0062489118
0.1178812008 -0.0640801603 0.0366457381
0.1171381125 -0.0566165412 0.0653402782
0.1157087206 -0.0423460875 0.0885960005
0.1137049459 -0.0223846787 0.1051424432
0.1112342685 0.0021958730 0.1136833621
0.1085518527 0.0288574579 0.1135209931
0.1060816902 0.0533858238 0.1046688326
0.1040751604 0.0732843262 0.0878496242
0.1026409783 0.0874759440 0.0643779333
0.1018912718 0.0948495552 0.0355025750
0.0557388570 0.0898059619 0.0093343353
0.0565034444 0.0821282970 -0.0194913914
0.0708542631 -0.0605131133 -0.0197247086
0.0716468600 -0.0683132396 0.0090755088
0.0716713560 -0.0684722773 0.0402794723
0.0557439338 0.0898399837 0.0405536975
0.0091942284 0.0767576878 0.0146287499
0.0098481674 0.0701838394 -0.0127111272
0.0111357706 0.0573225073 -0.0360385921
0.0213102148 -0.0438096010 -0.0370148166
0.0226687068 -0.0572499723 -0.0139418345
0.0234059276 -0.0645039945 0.0132655197
0.0234578310 -0.0649400546 0.0427680980
0.0228340834 -0.0586641777 0.0708903283
0.0099333664 0.0695665278 0.0721081280
0.0092287894 0.0764942281 0.0442145330
-0.0465957564 0.0576733876 0.0210867942
-0.0460674217 0.0523570955 -0.0028885828
-0.0450244329 0.0419347505 -0.0233972526
-0.0367677336 -0.0401374873 -0.0249880223
-0.0356632902 -0.0510607861 -0.0048930055
-0.0350628085 -0.0569650168 0.0188649926
-0.0350183507 -0.0573371266 0.0446516125
-0.0355222640 -0.0522616237 0.0693468098
-0.0459914799 0.0518031110 0.0713305720
-0.0465654603 0.0574424018 0.0470076578
-0.1253741947 0.0329854424 0.0251647386
-0.1250296218 0.0295116917 0.0071132179
-0.1243160190 0.0223766709 -0.0084533459
-0.1184660133 -0.0357777486 -0.0113930793
-0.1176581535 -0.0437674619 0.0034087530
-0.1172027843 -0.0482458694 0.0210578668
-0.1171407363 -0.0488106079 0.0402704801
-0.1174691477 -0.0454958074 0.0589455434
-0.1248867568 0.0282418614 0.0626120510
-0.1253220551 0.0325198602 0.0446252209
0.1018976779 0.0947038026 0.0051716544
0.1026764291 0.0868876507 -0.0228062305
0.1041607391 0.0720700139 -0.0465497335
0.1062053516 0.0517009682 -0.0637346479
0.1086100491 0.0277751334 -0.0726800239
0.1111395084 0.0026338902 -0.0725095154
0.1135461305 -0.0212617810 -0.0632394357
0.1155942672 -0.0415720990 -0.0457777064
0.1170835220 -0.0563098369 -0.0218336978
0.1178680602 -0.0640318054 0.0062489118
0.1178812008 -0.0640801603 0.0366457381
0.1171381125 -0.0566165412 0.0653402782
0.1157087206 -0.0423460875 0.0885960005
0.1137049459 -0.0223846787 0.1051424432
0.1112342685 0.0021958730 0.1136833621
0.1085518527 0.0288574579 0.1135209931
0.1060816902 0.0533858238 0.1046688326
0.1040751604 0.0732843262 0.0878496242
0.1026409783 0.0874759440 0.0643779333
0.1018912718 0.0948495552 0.0355025750
0.0557388570 0.0898059619 0.0093343353
0.0565034444 0.0821282970 -0.0194913914
0.0708542631 -0.0605131133 -0.0197247086
0.0716468600 -0.0683132396 0.0090755088
0.0716713560 -0.0684722773 0.0402794723
0.0709418164 -0.0611408487 0.0698900298
0.0565013754 0.0823913621 0.0701210914
0.0557439338 0.0898399837 0.0405536975
0.0091942284 0.0767576878 0.0146287499
0.0098481674 0.0701838394 -0.0127111272
0.0111357706 0.0573225073 -0.0360385921
0.0129310358 0.0394322816 -0.0530689854
0.0150582318 0.0182643594 -0.0621361241
0.0173091678 -0.0041095319 -0.0623520657
0.0194634370 -0.0254985894 -0.0536962183
0.0213102148 -0.0438096010 -0.0370148166
0.0226687068 -0.0572499723 -0.0139418345
0.0234059276 -0.0645039945 0.0132655197
0.0234578310 -0.0649400546 0.0427680980
0.0228340834 -0.0586641777 0.0708903283
0.0215949144 -0.0462855003 0.0937598565
0.0198377460 -0.0287756312 0.1101649076
0.0176607727 -0.0071140498 0.1188236852
0.0152737122 0.0166128300 0.1190292044
0.0130539424 0.0386539926 0.1107643859
0.0112423794 0.0566166672 0.0947045208
0.0099333664 0.0695665278 0.0721081280
0.0092287894 0.0764942281 0.0442145330
-0.0465957564 0.0576733876 0.0210867942
-0.0460674217 0.0523570955 -0.0028885828
-0.0450244329 0.0419347505 -0.0233972526
-0.0435689051 0.0274267625 -0.0384324279
-0.0418434226 0.0102543414 -0.0465214366
-0.0400167753 -0.0079026762 -0.0468733582
-0.0382677749 -0.0252668856 -0.0394533699
-0.0367677336 -0.0401374873 -0.0249880223
-0.0356632902 -0.0510607861 -0.0048930055
-0.0350628085 -0.0569650168 0.0188649926
-0.0350183507 -0.0573371266 0.0446516125
-0.0355222640 -0.0522616237 0.0693468098
-0.0365259320 -0.0422311737 0.0894624505
-0.0379504679 -0.0280327179 0.1039482635
-0.0397160039 -0.0104631665 0.1116739384
-0.0416531261 0.0087918754 0.1120086326
-0.0434556606 0.0266891010 0.1049248360
-0.0449272120 0.0412779908 0.0910012504
-0.0459914799 0.0518031110 0.0713305720
-0.0465654603 0.0574424018 0.0470076578
-0.1253741947 0.0329854424 0.0251647386
-0.1250296218 0.0295116917 0.0071132179
-0.1243160190 0.0223766709 -0.0084533459
-0.1233032776 0.0122791921 -0.0200116727
-0.1220903718 0.0002060772 -0.0264302370
-0.1207961522 -0.0126596523 -0.0270805225
-0.1195473281 -0.0250583888 -0.0218992410
-0.1184660133 -0.0357777486 -0.0113930793
-0.1176581535 -0.0437674619 0.0034087530
-0.1172027843 -0.0482458694 0.0210578668
-0.1171407363 -0.0488106079 0.0402704801
-0.1178246053 -0.0419350823 0.0691573065
-0.1187175136 -0.0330247924 0.0821566884
-0.1198710203 -0.0215371245 0.0904055960
-0.1203790528 -0.0164845173 0.0915102308
-0.1217515549 -0.0028407805 0.0921288904
-0.1230452314 0.0100044090 0.0871837771
-0.1241076475 0.0205370106 0.0770794951
-0.1248867568 0.0282418614 0.0626120510
-0.1253220551 0.0325198602 0.0446252209
-0.2189962951 0.0074824992 0.0225098375
-0.2187801316 0.0053036025 0.0113027724
-0.2142745563 -0.0394872319 0.0085635731
-0.2139239548 -0.0429226913 0.0268053473
-0.2140397944 -0.0417379286 0.0391361086
-0.2143847027 -0.0382816000 0.0495176500
-0.2187095424 0.0046950130 0.0456828744
-0.2189702246 0.0072560370 0.0345811657
-0.0569857334 -0.0029046044 0.0263660333
-0.0428401631 0.0013176327 0.0263621421
-0.0320354877 0.0025451015 0.0263591985
-0.1180790445 -0.0245060187 0.0561398001
-0.0618379949 -0.0028337076 0.0263673464
-0.0475810572 0.0002815866 0.0263634408
-0.1418348981 -0.0296969830 0.0561463077
-0.0569857334 -0.0029046044 0.0263660333
-0.1394087673 -0.0297324315 0.0561456512
-0.0423939016 -0.0031180085 0.0263620847
-0.0387914300 -0.0028022043 0.0263611045
-0.1157197839 -0.0298946354 0.0561392381
-0.0279588337 -0.0018522582 0.0263581573
-0.0430230484 0.0031354325 0.0263621656
-0.0430230484 0.0031354325 0.0263621656
-0.0322183203 0.0043623766 0.0263592220
-0.1220098134 0.0145640847 0.0561403061
-0.0620208275 -0.0010164324 0.0263673699
-0.0477639426 0.0020993863 0.0263634644
-0.1457655880 0.0093723334 0.0561468138
-0.0571685660 -0.0010873293 0.0263660569
-0.1433394572 0.0093368850 0.0561461572
-0.0425767870 -0.0013002087 0.0263621082
-0.0389743154 -0.0009844045 0.0263611281
-0.1196505529 0.0091754680 0.0561397442
-0.0281416663 -0.0000349830 0.0263581808
3 649 650 21
3 646 650 649
3 21 651 649
3 17 651 21
3 24 652 445
3 21 652 24
3 30 653 245
3 24 653 30
3 34 654 634
3 30 654 34
3 655 656 41
3 439 656 655
3 41 657 655
3 34 657 41
3 659 661 658
3 660 661 659
3 660 662 373
3 659 662 660
3 663 664 659
3 629 664 663
3 658 665 659
3 663 665 658
3 667 668 666
3 41 668 667
3 667 669 373
3 666 669 667
3 670 671 666
3 658 671 670
3 670 672 41
3 666 672 670
3 674 676 673
3 675 676 674
3 675 677 607
3 674 677 675
3 678 679 674
3 582 679 678
3 673 680 674
3 678 680 673
3 682 683 681
3 373 683 682
3 682 684 607
3 681 684 682
3 685 686 681
3 673 686 685
3 685 687 373
3 681 687 685
3 690 691 689
3 607 691 690
3 690 692 374
3 689 692 690
3 693 694 689
3 688 694 693
3 693 695 607
3 689 695 693
3 696 698 688
3 697 698 696
3 697 699 44
3 696 699 697
3 700 701 696
3 607 701 700
3 688 702 696
3 700 702 688
3 705 706 704
3 374 706 705
3 705 707 40
3 704 707 705
3 708 709 704
3 703 709 708
3 708 710 374
3 704 710 708
3 711 713 703
3 712 713 711
3 712 714 583
3 711 714 712
3 711 716 715
3 703 716 711
3 715 717 374
3 703 717 715
3 40 719 35
3 718 719 40
3 718 720 628
3 40 720 718
3 35 721 31
3 440 721 35
3 31 722 25
3 635 722 31
3 25 723 20
3 246 723 25
3 20 725 17
3 724 725 20
3 724 726 446
3 20 726 724
3 727 728 646
3 21 728 727
3 646 729 727
3 445 729 646
3 445 730 24
3 245 730 445
3 245 731 30
3 634 731 245
3 634 732 34
3 439 732 634
3 733 734 439
3 41 734 733
3 439 735 733
3 629 735 439
3 737 739 736
3 738 739 737
3 738 740 629
3 737 740 738
3 741 742 737
3 373 742 741
3 736 743 737
3 741 743 736
3 745 746 629
3 744 746 745
3 745 747 582
3 629 747 745
3 748 749 744
3 736 749 748
3 748 750 582
3 744 750 748
3 752 754 751
3 753 754 752
3 753 755 582
3 752 755 753
3 756 757 752
3 607 757 756
3 751 758 752
3 756 758 751
3 760 761 759
3 44 761 760
3 760 762 582
3 759 762 760
3 763 764 759
3 751 764 763
3 763 765 44
3 759 765 763
3 768 769 767
3 583 769 768
3 768 770 44
3 767 770 768
3 771 772 767
3 766 772 771
3 771 773 583
3 767 773 771
3 774 776 766
3 775 776 774
3 775 777 374
3 774 777 775
3 774 779 778
3 766 779 774
3 778 780 583
3 766 780 778
3 783 784 782
3 628 784 783
3 783 785 583
3 782 785 783
3 786 787 782
3 781 787 786
3 786 788 628
3 782 788 786
3 789 791 781
3 790 791 789
3 790 792 40
3 789 792 790
3 789 794 793
3 781 794 789
3 793 795 628
3 781 795 793
3 440 797 628
3 796 797 440
3 796 798 35
3 440 798 796
3 635 799 440
3 31 799 635
3 246 800 635
3 25 800 246
3 446 801 246
3 20 801 446
3 646 803 446
3 802 803 646
3 802 804 17
3 646 804 802
3 805 806 19
3 647 806 805
3 19 807 805
3 16 807 19
3 22 808 447
3 19 808 22
3 28 809 247
3 22 809 28
3 32 810 636
3 28 810 32
3 811 812 39
3 441 812 811
3 39 813 811
3 32 813 39
3 815 817 814
3 816 817 815
3 816 818 371
3 815 818 816
3 819 820 815
3 631 820 819
3 814 821 815
3 819 821 814
3 823 824 822
3 39 824 823
3 823 825 371
3 822 825 823
3 826 827 822
3 814 827 826
3 826 828 39
3 822 828 826
3 830 832 829
3 831 832 830
3 831 833 606
3 830 833 831
3 834 835 830
3 584 835 834
3 829 836 830
3 834 836 829
3 838 839 837
3 371 839 838
3 838 840 606
3 837 840 838
3 841 842 837
3 829 842 841
3 841 843 371
3 837 843 841
3 846 847 845
3 606 847 846
3 846 848 372
3 845 848 846
3 849 850 845
3 844 850 849
3 849 851 606
3 845 851 849
3 852 854 844
3 853 854 852
3 853 855 45
3 852 855 853
3 856 857 852
3 606 857 856
3 844 858 852
3 856 858 844
3 861 862 860
3 372 862 861
3 861 863 38
3 860 863 861
3 864 865 860
3 859 865 864
3 864 866 372
3 860 866 864
3 867 869 859
3 868 869 867
3 868 870 585
3 867 870 868
3 867 872 871
3 859 872 867
3 871 873 372
3 859 873 871
3 38 875 33
3 874 875 38
3 874 876 630
3 38 876 874
3 33 877 29
3 442 877 33
3 29 878 23
3 637 878 29
3 23 879 18
3 248 879 23
3 18 881 16
3 880 881 18
3 880 882 448
3 18 882 880
3 883 884 647
3 19 884 883
3 647 885 883
3 447 885 647
3 447 886 22
3 247 886 447
3 247 887 28
3 636 887 247
3 636 888 32
3 441 888 636
3 889 890 441
3 39 890 889
3 441 891 889
3 631 891 441
3 893 895 892
3 894 895 893
3 894 896 631
3 893 896 894
3 897 898 893
3 371 898 897
3 892 899 893
3 897 899 892
3 901 902 631
3 900 902 901
3 901 903 584
3 631 903 901
3 904 905 900
3 892 905 904
3 904 906 584
3 900 906 904
3 908 910 907
3 909 910 908
3 909 911 584
3 908 911 909
3 912 913 908
3 606 913 912
3 907 914 908
3 912 914 907
3 916 917 915
3 45 917 916
3 916 918 584
3 915 918 916
3 919 920 915
3 907 920 919
3 919 921 45
3 915 921 919
3 924 925 923
3 585 925 924
3 924 926 45
3 923 926 924
3 927 928 923
3 922 928 927
3 927 929 585
3 923 929 927
3 930 932 922
3 931 932 930
3 931 933 372
3 930 933 931
3 930 935 934
3 922 935 930
3 934 936 585
3 922 936 934
3 939 940 938
3 630 940 939
3 939 941 585
3 938 941 939
3 942 943 938
3 937 943 942
3 942 944 630
3 938 944 942
3 945 947 937
3 946 947 945
3 946 948 38
3 945 948 946
3 945 950 949
3 937 950 945
3 949 951 630
3 937 951 949
3 442 953 630
3 952 953 442
3 952 954 33
3 442 954 952
3 637 955 442
3 29 955 637
3 248 956 637
3 23 956 248
3 448 957 248
3 18 957 448
3 647 959 448
3 958 959 647
3 958 960 16
3 647 960 958
3 17 9 131
3 21 272 9
3 24 173 272
3 30 12 173
3 34 181 12
3 181 962 195
3 961 962 181
3 961 963 41
3 181 963 961
3 195 965 327
3 964 965 195
3 964 966 373
3 195 966 964
3 967 968 196
3 607 968 967
3 196 969 967
3 327 969 196
3 970 971 182
3 374 971 970
3 182 972 970
3 196 972 182
3 40 13 182
3 35 174 13
3 31 271 174
3 25 8 271
3 20 131 8
3 21 974 17
3 973 974 21
3 973 975 9
3 21 975 973
3 24 977 21
3 976 977 24
3 976 978 272
3 24 978 976
3 30 980 24
3 979 980 30
3 979 981 173
3 30 981 979
3 34 983 30
3 982 983 34
3 982 984 12
3 34 984 982
3 41 987 34
3 986 987 41
3 986 988 985
3 41 988 986
3 989 990 985
3 181 990 989
3 985 991 989
3 41 991 985
3 995 996 994
3 373 996 995
3 995 997 41
3 994 997 995
3 998 999 994
3 993 999 998
3 998 1000 373
3 994 1000 998
3 1001 1003 993
3 1002 1003 1001
3 1002 1004 992
3 1001 1004 1002
3 1001 1006 1005
3 993 1006 1001
3 1005 1007 373
3 993 1007 1005
3 1008 1011 992
3 1010 1011 1008
3 1010 1012 1009
3 1008 1012 1010
3 1013 1014 1009
3 195 1014 1013
3 1009 1015 1013
3 1008 1015 1009
3 992 1018 1008
3 1017 1018 992
3 1017 1019 1016
3 992 1019 1017
3 1020 1021 1016
3 373 1021 1020
3 1016 1022 1020
3 992 1022 1016
3 1026 1027 1025
3 1024 1027 1026
3 1026 1028 607
3 1025 1028 1026
3 1029 1030 1025
3 373 1030 1029
3 1029 1031 1024
3 1025 1031 1029
3 1033 1034 1032
3 1024 1034 1033
3 1033 1035 1023
3 1032 1035 1033
3 1036 1037 1032
3 607 1037 1036
3 1036 1038 1024
3 1032 1038 1036
3 1041 1042 1039
3 1023 1042 1041
3 1041 1043 1040
3 1039 1043 1041
3 1044 1045 1040
3 327 1045 1044
3 1040 1046 1044
3 1039 1046 1040
3 1048 1049 1039
3 1047 1049 1048
3 1023 1050 1039
3 1048 1050 1023
3 1051 1052 1047
3 607 1052 1051
3 1051 1053 1023
3 1047 1053 1051
3 1057 1058 1054
3 1056 1058 1057
3 1057 1059 1055
3 1054 1059 1057
3 1060 1061 1056
3 607 1061 1060
3 1060 1062 1055
3 1056 1062 1060
3 1064 1065 1063
3 1055 1065 1064
3 1064 1066 196
3 1063 1066 1064
3 1067 1068 1055
3 1063 1068 1067
3 1067 1069 1054
3 1055 1069 1067
3 1072 1073 1071
3 1070 1073 1072
3 1072 1074 607
3 1071 1074 1072
3 1075 1076 1071
3 1054 1076 1075
3 1075 1077 1070
3 1071 1077 1075
3 1079 1080 1078
3 1070 1080 1079
3 1079 1081 374
3 1078 1081 1079
3 1082 1083 1078
3 607 1083 1082
3 1082 1084 1070
3 1078 1084 1082
3 1087 1089 1085
3 1088 1089 1087
3 1088 1090 374
3 1087 1090 1088
3 1091 1092 1085
3 1087 1092 1091
3 1086 1093 1085
3 1091 1093 1086
3 1094 1096 1086
3 1095 1096 1094
3 1095 1097 182
3 1094 1097 1095
3 1098 1099 1086
3 1094 1099 1098
3 1086 1100 1098
3 1085 1100 1086
3 1101 1104 1103
3 1102 1104 1101
3 1103 1105 374
3 1102 1105 1103
3 1106 1107 1102
3 1085 1107 1106
3 1102 1108 1106
3 1101 1108 1102
3 1110 1111 1109
3 374 1111 1110
3 1110 1112 1101
3 1109 1112 1110
3 1113 1114 1109
3 40 1114 1113
3 1113 1115 374
3 1109 1115 1113
3 1116 1118 40
3 1117 1118 1116
3 1117 1119 13
3 1116 1119 1117
3 1120 1121 40
3 1116 1121 1120
3 40 1122 1120
3 35 1122 40
3 1123 1124 35
3 174 1124 1123
3 35 1125 1123
3 31 1125 35
3 1126 1127 31
3 271 1127 1126
3 31 1128 1126
3 25 1128 31
3 1129 1130 25
3 8 1130 1129
3 25 1131 1129
3 20 1131 25
3 1132 1133 20
3 131 1133 1132
3 20 1134 1132
3 17 1134 20
3 16 11 132
3 19 274 11
3 22 175 274
3 28 14 175
3 32 183 14
3 183 1136 197
3 1135 1136 183
3 1135 1137 39
3 183 1137 1135
3 197 1139 328
3 1138 1139 197
3 1138 1140 371
3 197 1140 1138
3 1141 1142 198
3 606 1142 1141
3 198 1143 1141
3 328 1143 198
3 1144 1145 184
3 372 1145 1144
3 184 1146 1144
3 198 1146 184
3 38 15 184
3 33 176 15
3 29 273 176
3 23 10 273
3 18 132 10
3 19 1148 16
3 1147 1148 19
3 1147 1149 11
3 19 1149 1147
3 22 1151 19
3 1150 1151 22
3 1150 1152 274
3 22 1152 1150
3 28 1154 22
3 1153 1154 28
3 1153 1155 175
3 28 1155 1153
3 32 1157 28
3 1156 1157 32
3 1156 1158 14
3 32 1158 1156
3 39 1161 32
3 1160 1161 39
3 1160 1162 1159
3 39 1162 1160
3 1163 1164 1159
3 183 1164 1163
3 1159 1165 1163
3 39 1165 1159
3 1169 1170 1168
3 371 1170 1169
3 1169 1171 39
3 1168 1171 1169
3 1172 1173 1168
3 1167 1173 1172
3 1172 1174 371
3 1168 1174 1172
3 1175 1177 1167
3 1176 1177 1175
3 1176 1178 1166
3 1175 1178 1176
3 1175 1180 1179
3 1167 1180 1175
3 1179 1181 371
3 1167 1181 1179
3 1182 1185 1166
3 1184 1185 1182
3 1184 1186 1183
3 1182 1186 1184
3 1187 1188 1183
3 197 1188 1187
3 1183 1189 1187
3 1182 1189 1183
3 1166 1192 1182
3 1191 1192 1166
3 1191 1193 1190
3 1166 1193 1191
3 1194 1195 1190
3 371 1195 1194
3 1190 1196 1194
3 1166 1196 1190
3 1200 1201 1199
3 1198 1201 1200
3 1200 1202 606
3 1199 1202 1200
3 1203 1204 1199
3 371 1204 1203
3 1203 1205 1198
3 1199 1205 1203
3 1207 1208 1206
3 1198 1208 1207
3 1207 1209 1197
3 1206 1209 1207
3 1210 1211 1206
3 606 1211 1210
3 1210 1212 1198
3 1206 1212 1210
3 1215 1216 1213
3 1197 1216 1215
3 1215 1217 1214
3 1213 1217 1215
3 1218 1219 1214
3 328 1219 1218
3 1214 1220 1218
3 1213 1220 1214
3 1222 1223 1213
3 1221 1223 1222
3 1197 1224 1213
3 1222 1224 1197
3 1225 1226 1221
3 606 1226 1225
3 1225 1227 1197
3 1221 1227 1225
3 1231 1232 1228
3 1230 1232 1231
3 1231 1233 1229
3 1228 1233 1231
3 1234 1235 1230
3 606 1235 1234
3 1234 1236 1229
3 1230 1236 1234
3 1238 1239 1237
3 1229 1239 1238
3 1238 1240 198
3 1237 1240 1238
3 1241 1242 1229
3 1237 1242 1241
3 1241 1243 1228
3 1229 1243 1241
3 1246 1247 1245
3 1244 1247 1246
3 1246 1248 606
3 1245 1248 1246
3 1249 1250 1245
3 1228 1250 1249
3 1249 1251 1244
3 1245 1251 1249
3 1253 1254 1252
3 1244 1254 1253
3 1253 1255 372
3 1252 1255 1253
3 1256 1257 1252
3 606 1257 1256
3 1256 1258 1244
3 1252 1258 1256
3 1261 1263 1259
3 1262 1263 1261
3 1262 1264 372
3 1261 1264 1262
3 1265 1266 1259
3 1261 1266 1265
3 1260 1267 1259
3 1265 1267 1260
3 1268 1270 1260
3 1269 1270 1268
3 1269 1271 184
3 1268 1271 1269
3 1272 1273 1260
3 1268 1273 1272
3 1260 1274 1272
3 1259 1274 1260
3 1275 1278 1277
3 1276 1278 1275
3 1277 1279 372
3 1276 1279 1277
3 1280 1281 1276
3 1259 1281 1280
3 1276 1282 1280
3 1275 1282 1276
3 1284 1285 1283
3 372 1285 1284
3 1284 1286 1275
3 1283 1286 1284
3 1287 1288 1283
3 38 1288 1287
3 1287 1289 372
3 1283 1289 1287
3 1290 1292 38
3 1291 1292 1290
3 1291 1293 15
3 1290 1293 1291
3 1294 1295 38
3 1290 1295 1294
3 38 1296 1294
3 33 1296 38
3 1297 1298 33
3 176 1298 1297
3 33 1299 1297
3 29 1299 33
3 1300 1301 29
3 273 1301 1300
3 29 1302 1300
3 23 1302 29
3 1303 1304 23
3 10 1304 1303
3 23 1305 1303
3 18 1305 23
3 1306 1307 18
3 132 1307 1306
3 18 1308 1306
3 16 1308 18
3 110 644 185
3 276 301 644
3 36 26 301
3 193 369 26
3 0 638 369
3 638 1309 203
3 632 1309 638
3 203 1310 42
3 489 1310 203
3 203 1311 648
3 42 1311 203
3 638 1312 490
3 203 1312 638
3 633 369 638
3 1 26 369
3 194 301 26
3 37 644 301
3 275 185 644
3 276 1313 110
3 644 1313 276
3 36 1314 276
3 301 1314 36
3 193 1315 36
3 26 1315 193
3 0 1316 193
3 369 1316 0
3 632 1318 0
3 1317 1318 632
3 1317 1319 638
3 632 1319 1317
3 1321 1322 489
3 632 1322 1321
3 489 1323 1321
3 1320 1323 489
3 1324 1325 1320
3 203 1325 1324
3 1320 1326 1324
3 489 1326 1320
3 1329 1330 648
3 1328 1330 1329
3 1329 1331 1327
3 648 1331 1329
3 1332 1333 1328
3 489 1333 1332
3 1332 1334 1327
3 1328 1334 1332
3 1336 1337 1335
3 1327 1337 1336
3 1336 1338 42
3 1335 1338 1336
3 1339 1340 1327
3 1335 1340 1339
3 1339 1341 648
3 1327 1341 1339
3 1344 1345 1343
3 1342 1345 1344
3 1344 1346 648
3 1343 1346 1344
3 1347 1348 1343
3 203 1348 1347
3 1347 1349 1342
3 1343 1349 1347
3 1351 1352 1350
3 1342 1352 1351
3 1351 1353 490
3 1350 1353 1351
3 1354 1355 1350
3 648 1355 1354
3 1354 1356 1342
3 1350 1356 1354
3 1357 1359 490
3 1358 1359 1357
3 1358 1360 638
3 1357 1360 1358
3 490 1362 1357
3 1361 1362 490
3 1361 1363 633
3 490 1363 1361
3 1364 1365 633
3 369 1365 1364
3 633 1366 1364
3 1 1366 633
3 1 1367 26
3 194 1367 1
3 194 1368 301
3 37 1368 194
3 37 1369 644
3 275 1369 37
3 275 1370 185
3 110 1370 275
3 110 645 186
3 276 302 645
3 36 27 302
3 193 370 27
3 0 639 370
3 639 1371 204
3 632 1371 639
3 204 1372 43
3 489 1372 204
3 204 1373 648
3 43 1373 204
3 639 1374 490
3 204 1374 639
3 633 370 639
3 1 27 370
3 194 302 27
3 37 645 302
3 275 186 645
3 276 1375 110
3 645 1375 276
3 36 1376 276
3 302 1376 36
3 193 1377 36
3 27 1377 193
3 0 1378 193
3 370 1378 0
3 632 1380 0
3 1379 1380 632
3 1379 1381 639
3 632 1381 1379
3 1383 1384 489
3 632 1384 1383
3 489 1385 1383
3 1382 1385 489
3 1386 1387 1382
3 204 1387 1386
3 1382 1388 1386
3 489 1388 1382
3 1391 1392 648
3 1390 1392 1391
3 1391 1393 1389
3 648 1393 1391
3 1394 1395 1390
3 489 1395 1394
3 1394 1396 1389
3 1390 1396 1394
3 1398 1399 1397
3 1389 1399 1398
3 1398 1400 43
3 1397 1400 1398
3 1401 1402 1389
3 1397 1402 1401
3 1401 1403 648
3 1389 1403 1401
3 1406 1407 1405
3 1404 1407 1406
3 1406 1408 648
3 1405 1408 1406
3 1409 1410 1405
3 204 1410 1409
3 1409 1411 1404
3 1405 1411 1409
3 1413 1414 1412
3 1404 1414 1413
3 1413 1415 490
3 1412 1415 1413
3 1416 1417 1412
3 648 1417 1416
3 1416 1418 1404
3 1412 1418 1416
3 1419 1421 490
3 1420 1421 1419
3 1420 1422 639
3 1419 1422 1420
3 490 1424 1419
3 1423 1424 490
3 1423 1425 633
3 490 1425 1423
3 1426 1427 633
3 370 1427 1426
3 633 1428 1426
3 1 1428 633
3 1 1429 27
3 194 1429 1
3 194 1430 302
3 37 1430 194
3 37 1431 645
3 275 1431 37
3 275 1432 186
3 110 1432 275
3 473 266 265
3 483 255 266
3 475 258 255
3 488 267 258
3 487 259 267
3 478 252 259
3 470 261 252
3 469 263 261
3 482 253 263
3 474 254 253
3 484 262 254
3 476 268 262
3 472 256 268
3 486 250 256
3 477 260 250
3 479 249 260
3 480 264 249
3 471 251 264
3 485 257 251
3 481 265 257
3 265 542 558
3 266 544 542
3 255 549 544
3 258 545 549
3 267 554 545
3 259 548 554
3 252 556 548
3 261 559 556
3 263 561 559
3 253 546 561
3 254 560 546
3 262 547 560
3 268 552 547
3 256 550 552
3 250 555 550
3 260 553 555
3 249 551 553
3 264 557 551
3 251 543 557
3 257 558 543
3 558 145 152
3 542 139 145
3 544 151 139
3 549 138 151
3 545 143 138
3 554 147 143
3 548 134 147
3 556 146 134
3 559 140 146
3 561 133 140
3 546 149 133
3 560 150 149
3 547 148 150
3 552 141 148
3 550 144 141
3 555 142 144
3 553 137 142
3 551 135 137
3 557 136 135
3 543 152 136
3 152 207 208
3 145 224 207
3 139 210 224
3 151 211 210
3 138 214 211
3 143 218 214
3 147 219 218
3 134 205 219
3 146 222 205
3 140 221 222
3 133 213 221
3 149 212 213
3 150 220 212
3 148 223 220
3 141 215 223
3 144 206 215
3 142 209 206
3 137 217 209
3 135 216 217
3 136 208 216
3 208 514 512
3 207 524 514
3 224 510 524
3 210 511 510
3 211 517 511
3 214 522 517
3 218 523 522
3 219 509 523
3 205 519 509
3 222 521 519
3 221 525 521
3 213 513 525
3 212 507 513
3 220 518 507
3 223 516 518
3 215 515 516
3 206 526 515
3 209 520 526
3 217 508 520
3 216 512 508
3 512 293 287
3 514 285 293
3 524 289 285
3 510 281 289
3 511 290 281
3 517 300 290
3 522 292 300
3 523 296 292
3 509 288 296
3 519 294 288
3 521 298 294
3 525 284 298
3 513 299 284
3 507 286 299
3 518 291 286
3 516 295 291
3 515 282 295
3 526 297 282
3 520 283 297
3 508 287 283
3 287 63 61
3 293 52 63
3 285 69 52
3 289 65 69
3 281 60 65
3 290 54 60
3 300 50 54
3 292 67 50
3 296 56 67
3 288 58 56
3 294 57 58
3 298 55 57
3 284 66 55
3 299 68 66
3 286 59 68
3 291 51 59
3 295 53 51
3 282 64 53
3 297 62 64
3 283 61 62
3 61 627 623
3 63 622 627
3 52 624 622
3 69 619 624
3 65 617 619
3 60 616 617
3 54 611 616
3 50 613 611
3 67 608 613
3 56 612 608
3 58 609 612
3 57 610 609
3 55 621 610
3 66 620 621
3 68 618 620
3 59 615 618
3 51 614 615
3 53 625 614
3 64 626 625
3 62 623 626
3 623 468 466
3 627 452 468
3 622 461 452
3 624 455 461
3 619 459 455
3 617 462 459
3 616 456 462
3 611 465 456
3 613 449 465
3 608 450 449
3 612 460 450
3 609 454 460
3 610 451 454
3 621 464 451
3 620 458 464
3 618 453 458
3 615 467 453
3 614 463 467
3 625 457 463
3 626 466 457
3 466 111 122
3 468 126 111
3 452 114 126
3 461 125 114
3 455 120 125
3 459 116 120
3 462 127 116
3 456 115 127
3 465 130 115
3 449 119 130
3 450 124 119
3 460 112 124
3 454 123 112
3 451 128 123
3 464 121 128
3 458 113 121
3 453 118 113
3 467 129 118
3 463 117 129
3 457 122 117
3 122 413 399
3 111 398 413
3 126 403 398
3 114 407 403
3 125 405 407
3 120 402 405
3 116 406 402
3 127 411 406
3 115 396 411
3 130 410 396
3 119 400 410
3 124 412 400
3 112 408 412
3 123 395 408
3 128 404 395
3 121 414 404
3 113 401 414
3 118 397 401
3 129 409 397
3 117 399 409
3 399 154 165
3 413 157 154
3 398 159 157
3 403 153 159
3 407 162 153
3 405 172 162
3 402 164 172
3 406 166 164
3 411 171 166
3 396 158 171
3 410 169 158
3 400 163 169
3 412 170 163
3 408 167 170
3 395 161 167
3 404 168 161
3 414 155 168
3 401 160 155
3 397 156 160
3 409 165 156
3 165 343 329
3 154 347 343
3 157 341 347
3 159 337 341
3 153 339 337
3 162 336 339
3 172 334 336
3 164 330 334
3 166 333 330
3 171 348 333
3 158 340 348
3 169 344 340
3 163 345 344
3 170 346 345
3 167 338 346
3 161 331 338
3 168 332 331
3 155 342 332
3 160 335 342
3 156 329 335
3 329 318 314
3 343 315 318
3 347 321 315
3 341 303 321
3 337 313 303
3 339 322 313
3 336 304 322
3 334 310 304
3 330 307 310
3 333 311 307
3 348 309 311
3 340 305 309
3 344 306 305
3 345 308 306
3 346 312 308
3 338 317 312
3 331 319 317
3 332 320 319
3 342 316 320
3 335 314 316
3 314 351 353
3 318 363 351
3 315 357 363
3 321 350 357
3 303 359 350
3 313 367 359
3 322 360 367
3 304 354 360
3 310 366 354
3 307 364 366
3 311 356 364
3 309 355 356
3 305 352 355
3 306 368 352
3 308 358 368
3 312 349 358
3 317 365 349
3 319 362 365
3 320 361 362
3 316 353 361
3 104 1433 91
3 353 1433 104
3 91 1434 102
3 351 1434 91
3 102 1435 108
3 363 1435 102
3 108 1436 105
3 357 1436 108
3 105 1437 101
3 350 1437 105
3 101 1438 96
3 359 1438 101
3 96 1439 93
3 367 1439 96
3 93 1440 99
3 360 1440 93
3 99 1441 90
3 354 1441 99
3 90 1442 97
3 366 1442 90
3 97 1443 109
3 364 1443 97
3 109 1444 98
3 356 1444 109
3 98 1445 106
3 355 1445 98
3 106 1446 94
3 352 1446 106
3 94 1447 100
3 368 1447 94
3 100 1448 107
3 358 1448 100
3 107 1449 95
3 349 1449 107
3 95 1450 103
3 365 1450 95
3 103 1451 92
3 362 1451 103
3 92 1452 104
3 361 1452 92
3 394 1453 381
3 104 1453 394
3 381 1454 387
3 91 1454 381
3 102 380 387
3 108 383 380
3 105 385 383
3 101 388 385
3 96 390 388
3 93 384 390
3 384 1455 389
3 99 1455 384
3 389 1456 375
3 90 1456 389
3 375 1457 376
3 97 1457 375
3 109 391 376
3 98 382 391
3 106 393 382
3 94 386 393
3 100 377 386
3 107 379 377
3 95 378 379
3 103 392 378
3 392 1458 394
3 92 1458 392
3 230 1459 237
3 394 1459 230
3 237 1460 243
3 381 1460 237
3 243 1461 232
3 387 1461 243
3 380 225 232
3 383 234 225
3 385 226 234
3 388 238 226
3 238 1462 228
3 390 1462 238
3 228 1463 240
3 384 1463 228
3 240 1464 241
3 389 1464 240
3 241 1465 236
3 375 1465 241
3 236 1466 229
3 376 1466 236
3 391 227 229
3 382 231 227
3 393 235 231
3 386 239 235
3 377 244 239
3 379 242 244
3 242 1467 233
3 378 1467 242
3 233 1468 230
3 392 1468 233
3 433 1469 422
3 230 1469 433
3 422 1470 430
3 237 1470 422
3 430 1471 421
3 243 1471 430
3 232 427 421
3 225 425 427
3 234 424 425
3 226 429 424
3 429 1472 419
3 238 1472 429
3 419 1473 418
3 228 1473 419
3 418 1474 416
3 240 1474 418
3 416 1475 432
3 241 1475 416
3 432 1476 434
3 236 1476 432
3 229 431 434
3 227 428 431
3 231 426 428
3 235 423 426
3 239 420 423
3 244 415 420
3 415 1477 417
3 242 1477 415
3 417 1478 433
3 233 1478 417
3 574 1479 581
3 433 1479 574
3 581 1480 562
3 422 1480 581
3 562 1481 565
3 430 1481 562
3 421 566 565
3 427 573 566
3 425 579 573
3 424 580 579
3 580 1482 563
3 429 1482 580
3 563 1483 564
3 419 1483 563
3 564 1484 571
3 418 1484 564
3 571 1485 576
3 416 1485 571
3 576 1486 567
3 432 1486 576
3 434 577 567
3 431 570 577
3 428 572 570
3 426 575 572
3 423 568 575
3 420 578 568
3 578 1487 569
3 415 1487 578
3 569 1488 574
3 417 1488 569
3 574 590 605
3 581 598 590
3 562 594 598
3 565 593 594
3 566 595 593
3 573 599 595
3 579 597 599
3 580 592 597
3 563 601 592
3 564 586 601
3 571 603 586
3 576 604 603
3 567 591 604
3 577 589 591
3 570 596 589
3 572 602 596
3 575 600 602
3 568 587 600
3 578 588 587
3 569 605 588
3 605 77 87
3 590 84 77
3 598 73 84
3 594 70 73
3 593 80 70
3 595 89 80
3 599 86 89
3 597 75 86
3 592 82 75
3 601 72 82
3 586 78 72
3 603 83 78
3 604 71 83
3 591 74 71
3 589 79 74
3 596 85 79
3 602 88 85
3 600 76 88
3 587 81 76
3 588 87 81
3 87 531 534
3 77 536 531
3 84 527 536
3 73 530 527
3 70 528 530
3 80 530 528
3 89 527 530
3 86 536 527
3 75 531 536
3 82 534 531
3 72 532 534
3 78 535 532
3 83 537 535
3 71 529 537
3 74 533 529
3 79 529 533
3 85 537 529
3 88 535 537
3 76 532 535
3 81 534 532
3 473 483 266
3 483 475 255
3 475 488 258
3 488 487 267
3 487 478 259
3 478 470 252
3 470 469 261
3 469 482 263
3 482 474 253
3 474 484 254
3 484 476 262
3 476 472 268
3 472 486 256
3 486 477 250
3 477 479 260
3 479 480 249
3 480 471 264
3 471 485 251
3 485 481 257
3 481 473 265
3 265 266 542
3 266 255 544
3 255 258 549
3 258 267 545
3 267 259 554
3 259 252 548
3 252 261 556
3 261 263 559
3 263 253 561
3 253 254 546
3 254 262 560
3 262 268 547
3 268 256 552
3 256 250 550
3 250 260 555
3 260 249 553
3 249 264 551
3 264 251 557
3 251 257 543
3 257 265 558
3 558 542 145
3 542 544 139
3 544 549 151
3 549 545 138
3 545 554 143
3 554 548 147
3 548 556 134
3 556 559 146
3 559 561 140
3 561 546 133
3 546 560 149
3 560 547 150
3 547 552 148
3 552 550 141
3 550 555 144
3 555 553 142
3 553 551 137
3 551 557 135
3 557 543 136
3 543 558 152
3 152 145 207
3 145 139 224
3 139 151 210
3 151 138 211
3 138 143 214
3 143 147 218
3 147 134 219
3 134 146 205
3 146 140 222
3 140 133 221
3 133 149 213
3 149 150 212
3 150 148 220
3 148 141 223
3 141 144 215
3 144 142 206
3 142 137 209
3 137 135 217
3 135 136 216
3 136 152 208
3 208 207 514
3 207 224 524
3 224 210 510
3 210 211 511
3 211 214 517
3 214 218 522
3 218 219 523
3 219 205 509
3 205 222 519
3 222 221 521
3 221 213 525
3 213 212 513
3 212 220 507
3 220 223 518
3 223 215 516
3 215 206 515
3 206 209 526
3 209 217 520
3 217 216 508
3 216 208 512
3 512 514 293
3 514 524 285
3 524 510 289
3 510 511 281
3 511 517 290
3 517 522 300
3 522 523 292
3 523 509 296
3 509 519 288
3 519 521 294
3 521 525 298
3 525 513 284
3 513 507 299
3 507 518 286
3 518 516 291
3 516 515 295
3 515 526 282
3 526 520 297
3 520 508 283
3 508 512 287
3 287 293 63
3 293 285 52
3 285 289 69
3 289 281 65
3 281 290 60
3 290 300 54
3 300 292 50
3 292 296 67
3 296 288 56
3 288 294 58
3 294 298 57
3 298 284 55
3 284 299 66
3 299 286 68
3 286 291 59
3 291 295 51
3 295 282 53
3 282 297 64
3 297 283 62
3 283 287 61
3 61 63 627
3 63 52 622
3 52 69 624
3 69 65 619
3 65 60 617
3 60 54 616
3 54 50 611
3 50 67 613
3 67 56 608
3 56 58 612
3 58 57 609
3 57 55 610
3 55 66 621
3 66 68 620
3 68 59 618
3 59 51 615
3 51 53 614
3 53 64 625
3 64 62 626
3 62 61 623
3 623 627 468
3 627 622 452
3 622 624 461
3 624 619 455
3 619 617 459
3 617 616 462
3 616 611 456
3 611 613 465
3 613 608 449
3 608 612 450
3 612 609 460
3 609 610 454
3 610 621 451
3 621 620 464
3 620 618 458
3 618 615 453
3 615 614 467
3 614 625 463
3 625 626 457
3 626 623 466
3 466 468 111
3 468 452 126
3 452 461 114
3 461 455 125
3 455 459 120
3 459 462 116
3 462 456 127
3 456 465 115
3 465 449 130
3 449 450 119
3 450 460 124
3 460 454 112
3 454 451 123
3 451 464 128
3 464 458 121
3 458 453 113
3 453 467 118
3 467 463 129
3 463 457 117
3 457 466 122
3 122 111 413
3 111 126 398
3 126 114 403
3 114 125 407
3 125 120 405
3 120 116 402
3 116 127 406
3 127 115 411
3 115 130 396
3 130 119 410
3 119 124 400
3 124 112 412
3 112 123 408
3 123 128 395
3 128 121 404
3 121 113 414
3 113 118 401
3 118 129 397
3 129 117 409
3 117 122 399
3 399 413 154
3 413 398 157
3 398 403 159
3 403 407 153
3 407 405 162
3 405 402 172
3 402 406 164
3 406 411 166
3 411 396 171
3 396 410 158
3 410 400 169
3 400 412 163
3 412 408 170
3 408 395 167
3 395 404 161
3 404 414 168
3 414 401 155
3 401 397 160
3 397 409 156
3 409 399 165
3 165 154 343
3 154 157 347
3 157 159 341
3 159 153 337
3 153 162 339
3 162 172 336
3 172 164 334
3 164 166 330
3 166 171 333
3 171 158 348
3 158 169 340
3 169 163 344
3 163 170 345
3 170 167 346
3 167 161 338
3 161 168 331
3 168 155 332
3 155 160 342
3 160 156 335
3 156 165 329
3 329 343 318
3 343 347 315
3 347 341 321
3 341 337 303
3 337 339 313
3 339 336 322
3 336 334 304
3 334 330 310
3 330 333 307
3 333 348 311
3 348 340 309
3 340 344 305
3 344 345 306
3 345 346 308
3 346 338 312
3 338 331 317
3 331 332 319
3 332 342 320
3 342 335 316
3 335 329 314
3 314 318 351
3 318 315 363
3 315 321 357
3 321 303 350
3 303 313 359
3 313 322 367
3 322 304 360
3 304 310 354
3 310 307 366
3 307 311 364
3 311 309 356
3 309 305 355
3 305 306 352
3 306 308 368
3 308 312 358
3 312 317 349
3 317 319 365
3 319 320 362
3 320 316 361
3 316 314 353
3 351 1489 353
3 91 1489 351
3 363 1490 351
3 102 1490 363
3 357 1491 363
3 108 1491 357
3 350 1492 357
3 105 1492 350
3 359 1493 350
3 101 1493 359
3 367 1494 359
3 96 1494 367
3 360 1495 367
3 93 1495 360
3 354 1496 360
3 99 1496 354
3 366 1497 354
3 90 1497 366
3 364 1498 366
3 97 1498 364
3 356 1499 364
3 109 1499 356
3 355 1500 356
3 98 1500 355
3 352 1501 355
3 106 1501 352
3 368 1502 352
3 94 1502 368
3 358 1503 368
3 100 1503 358
3 349 1504 358
3 107 1504 349
3 365 1505 349
3 95 1505 365
3 362 1506 365
3 103 1506 362
3 361 1507 362
3 92 1507 361
3 353 1508 361
3 104 1508 353
3 91 1509 104
3 381 1509 91
3 102 1510 91
3 387 1510 102
3 102 108 380
3 108 105 383
3 105 101 385
3 101 96 388
3 96 93 390
3 93 99 384
3 90 1511 99
3 389 1511 90
3 97 1512 90
3 375 1512 97
3 109 1513 97
3 376 1513 109
3 98 1514 109
3 391 1514 98
3 98 106 382
3 106 94 393
3 94 100 386
3 100 107 377
3 107 95 379
3 95 103 378
3 92 1515 103
3 392 1515 92
3 104 1516 92
3 394 1516 104
3 381 1517 394
3 237 1517 381
3 387 1518 381
3 243 1518 387
3 380 1519 387
3 232 1519 380
3 383 1520 380
3 225 1520 383
3 385 1521 383
3 234 1521 385
3 388 1522 385
3 226 1522 388
3 390 1523 388
3 238 1523 390
3 384 1524 390
3 228 1524 384
3 389 1525 384
3 240 1525 389
3 375 1526 389
3 241 1526 375
3 376 1527 375
3 236 1527 376
3 391 1528 376
3 229 1528 391
3 382 1529 391
3 227 1529 382
3 393 1530 382
3 231 1530 393
3 386 1531 393
3 235 1531 386
3 377 1532 386
3 239 1532 377
3 379 1533 377
3 244 1533 379
3 378 1534 379
3 242 1534 378
3 392 1535 378
3 233 1535 392
3 394 1536 392
3 230 1536 394
3 237 1537 230
3 422 1537 237
3 243 1538 237
3 430 1538 243
3 232 1539 243
3 421 1539 232
3 225 1540 232
3 427 1540 225
3 234 1541 225
3 425 1541 234
3 226 1542 234
3 424 1542 226
3 238 1543 226
3 429 1543 238
3 228 1544 238
3 419 1544 228
3 240 1545 228
3 418 1545 240
3 241 1546 240
3 416 1546 241
3 236 1547 241
3 432 1547 236
3 229 1548 236
3 434 1548 229
3 227 1549 229
3 431 1549 227
3 231 1550 227
3 428 1550 231
3 235 1551 231
3 426 1551 235
3 239 1552 235
3 423 1552 239
3 244 1553 239
3 420 1553 244
3 242 1554 244
3 415 1554 242
3 233 1555 242
3 417 1555 233
3 230 1556 233
3 433 1556 230
3 422 1557 433
3 581 1557 422
3 430 1558 422
3 562 1558 430
3 421 1559 430
3 565 1559 421
3 427 1560 421
3 566 1560 427
3 425 1561 427
3 573 1561 425
3 424 1562 425
3 579 1562 424
3 429 1563 424
3 580 1563 429
3 419 1564 429
3 563 1564 419
3 418 1565 419
3 564 1565 418
3 416 1566 418
3 571 1566 416
3 432 1567 416
3 576 1567 432
3 432 1568 567
3 434 1568 432
3 434 1569 577
3 431 1569 434
3 431 1570 570
3 428 1570 431
3 426 1571 428
3 572 1571 426
3 423 1572 426
3 575 1572 423
3 420 1573 423
3 568 1573 420
3 415 1574 420
3 578 1574 415
3 417 1575 415
3 569 1575 417
3 433 1576 417
3 574 1576 433
3 581 1577 574
3 590 1577 581
3 562 1578 581
3 598 1578 562
3 562 565 594
3 565 566 593
3 566 573 595
3 573 579 599
3 579 580 597
3 580 563 592
3 564 1579 563
3 601 1579 564
3 564 1580 586
3 571 1580 564
3 571 1581 603
3 576 1581 571
3 576 1582 604
3 567 1582 576
3 567 577 591
3 577 570 589
3 570 572 596
3 572 575 602
3 575 568 600
3 568 578 587
3 569 1583 578
3 588 1583 569
3 574 1584 569
3 605 1584 574
3 605 590 77
3 590 598 84
3 598 594 73
3 594 593 70
3 593 595 80
3 595 599 89
3 599 597 86
3 597 592 75
3 592 601 82
3 601 586 72
3 586 603 78
3 603 604 83
3 604 591 71
3 591 589 74
3 589 596 79
3 596 602 85
3 602 600 88
3 600 587 76
3 587 588 81
3 588 605 87
3 87 77 531
3 77 84 536
3 84 73 527
3 73 70 530
3 70 80 528
3 80 89 530
3 89 86 527
3 86 75 536
3 75 82 531
3 82 72 534
3 72 78 532
3 78 83 535
3 83 71 537
3 71 74 529
3 74 79 533
3 79 85 529
3 85 88 537
3 88 76 535
3 76 81 532
3 81 87 534
3 191 506 270
3 540 199 506
3 323 495 199
3 642 187 495
3 435 177 187
3 277 46 177
3 501 444 46
3 444 1585 48
3 2 1585 444
3 499 178 48
3 279 189 178
3 436 497 189
3 640 201 497
3 325 504 201
3 538 270 504
3 191 540 506
3 540 323 199
3 323 642 495
3 642 435 187
3 435 277 177
3 1586 1587 277
3 46 1587 1586
3 277 1588 1586
3 501 1588 277
3 1589 1590 501
3 444 1590 1589
3 501 1591 1589
3 2 1591 501
3 499 1593 2
3 1592 1593 499
3 1592 1594 48
3 499 1594 1592
3 279 1596 499
3 1595 1596 279
3 1595 1597 178
3 279 1597 1595
3 279 436 189
3 436 640 497
3 640 325 201
3 325 538 504
3 538 191 270
3 192 505 269
3 541 200 505
3 324 496 200
3 643 188 496
3 437 179 188
3 278 47 179
3 443 1598 502
3 47 1598 443
3 3 49 443
3 500 180 49
3 280 190 180
3 438 498 190
3 641 202 498
3 326 503 202
3 539 269 503
3 192 541 505
3 541 324 200
3 324 643 496
3 643 437 188
3 437 278 179
3 1599 1600 278
3 47 1600 1599
3 278 1601 1599
3 502 1601 278
3 1602 1603 502
3 443 1603 1602
3 502 1604 1602
3 3 1604 502
3 500 1606 3
3 1605 1606 500
3 1605 1607 49
3 500 1607 1605
3 280 1609 500
3 1608 1609 280
3 1608 1610 180
3 280 1610 1608
3 280 438 190
3 438 641 498
3 641 326 202
3 326 539 503
3 539 192 269
3 5 7 492
3 492 7 494
3 5 491 4
3 5 492 491
3 5 4 7
3 7 4 6
3 7 6 493
3 7 493 494
3 492 493 491
3 492 494 493
3 491 6 4
3 491 493 6