OFF

214 424 0
-0.134473 0.127507 0.103660
0.149484 0.092371 0.076097
0.061452 0.191362 0.150859
0.138234 0.005135 0.012854
0.140612 0.020956 0.026810
0.113382 0.186425 0.147213
0.096461 0.188424 0.148679
-0.085020 0.189298 0.148380
-0.133040 0.150729 0.119938
-0.123769 0.169273 0.135752
-0.103516 0.187543 0.148133
-0.136076 0.127918 0.103927
-0.115537 0.187313 0.147935
0.151002 0.054878 0.049009
-0.134531 0.128018 0.102989
-0.131761 0.161903 0.128106
-0.128948 0.173361 0.136597
-0.122519 0.183362 0.144009
-0.114202 0.186768 0.146528
0.060746 0.190684 0.149027
0.091284 0.021911 0.032914
0.121083 0.029440 0.037024
-0.110827 0.212816 0.127046
0.152356 0.054266 0.049082
0.144161 0.012040 0.016604
0.135317 0.006965 0.014473
-0.134362 0.179168 0.135414
0.117573 0.158807 0.132767
0.138680 0.021491 0.028230
-0.051540 0.216250 0.129567
-0.121976 0.154913 0.127428
-0.050852 0.203089 0.144831
0.154834 0.174514 0.131843
-0.111140 0.209101 0.132622
-0.119828 0.180898 0.143436
-0.083059 0.129377 0.113117
-0.077975 0.150153 0.128396
-0.129994 0.173811 0.137276
0.008023 0.204315 0.145708
-0.137600 0.093566 0.078330
0.126178 0.184908 0.145046
-0.119954 0.216118 0.116136
-0.103221 0.187962 0.147043
0.064292 0.215712 0.129118
-0.130388 0.198183 0.135407
0.099592 0.146209 0.125339
-0.134123 0.128089 0.102685
0.081073 0.026262 0.036634
-0.134115 0.162676 0.129497
-0.104389 0.188619 0.148238
-0.051427 0.208081 0.140195
-0.124636 0.156819 0.127605
0.062838 0.196865 0.148848
0.149917 0.055327 0.049000
0.008029 0.199000 0.150050
0.148506 0.019094 0.020565
0.106801 0.010468 0.022293
-0.138278 0.193408 0.121004
0.008018 0.209319 0.141083
-0.107947 0.194442 0.146722
-0.108554 0.156037 0.130259
-0.127900 0.092333 0.079811
-0.115845 0.177174 0.142688
0.133259 0.199822 0.136506
-0.131366 0.161881 0.127728
0.147354 0.019099 0.021835
0.120236 0.211627 0.126068
0.153414 0.190015 0.129232
-0.073290 0.028080 0.038045
-0.089914 0.165443 0.137911
0.137567 0.014242 0.021836
0.130824 0.191169 0.144196
-0.136990 0.128212 0.104003
0.008042 0.192346 0.150281
0.152052 0.054457 0.048996
-0.097494 0.162576 0.135793
0.140499 0.003702 0.011616
-0.125232 0.070763 0.064987
0.150588 0.181555 0.137062
-0.113858 0.186679 0.146097
-0.048301 0.191877 0.150620
0.149807 0.017337 0.021494
-0.124779 0.184517 0.145725
-0.103536 0.188056 0.147476
-0.122188 0.211445 0.126035
-0.087244 0.032048 0.040788
-0.051696 0.212545 0.135149
0.145898 0.205283 0.121355
0.008037 0.193751 0.152510
-0.119346 0.165562 0.135322
-0.127602 0.061787 0.057177
0.145258 0.195659 0.133419
-0.133283 0.162175 0.129313
-0.110263 0.203159 0.139082
0.142805 0.012168 0.018119
-0.130001 0.160511 0.128168
0.127077 0.185446 0.145789
-0.128923 0.172852 0.137256
0.097975 0.036575 0.044268
0.011495 0.156687 0.133076
-0.128562 0.173308 0.136195
0.008032 0.197648 0.150384
-0.119034 0.193104 0.145735
0.008014 0.217486 0.130457
-0.122531 0.207725 0.131608
-0.109918 0.104203 0.092195
-0.107143 0.193106 0.147090
0.125846 0.184823 0.144620
-0.047715 0.191178 0.149403
0.114548 0.187486 0.147966
-0.043944 0.182264 0.147659
0.141661 0.185803 0.141576
-0.111681 0.184232 0.145903
-0.126473 0.158243 0.127582
0.129977 0.189857 0.144581
-0.137284 0.167257 0.126588
-0.050518 0.220839 0.119611
-0.045011 0.184725 0.148248
0.146827 0.009896 0.016181
0.131631 0.008492 0.017578
0.149513 0.055602 0.048849
-0.105417 0.189269 0.149194
0.024378 0.165340 0.138414
-0.136278 0.166113 0.127092
-0.037577 0.169916 0.141034
-0.127233 0.171833 0.136555
0.063328 0.220309 0.119170
-0.128593 0.159716 0.127784
-0.132829 0.162267 0.128719
0.146264 0.201547 0.126916
0.015215 0.021185 0.032564
-0.139851 0.131764 0.100688
-0.090305 0.143907 0.123396
0.144483 0.011197 0.017344
0.113138 0.186858 0.146170
-0.115135 0.187319 0.147281
0.142591 0.187090 0.141168
-0.113358 0.174858 0.142210
0.139196 0.121725 0.103226
0.009046 0.025365 0.035999
-0.134721 0.094127 0.077518
-0.099316 0.183412 0.146220
0.122336 0.150885 0.127027
0.107045 0.141834 0.121972
0.118312 0.216297 0.116170
0.008014 0.222052 0.120487
-0.118153 0.191776 0.146112
0.139670 0.004189 0.012120
0.134176 0.205739 0.130027
-0.135133 0.093963 0.077748
-0.131047 0.207819 0.123353
0.117547 0.193283 0.145768
-0.127681 0.189565 0.143117
0.045273 0.025137 0.035815
0.148771 0.018027 0.021710
-0.121696 0.202288 0.137610
0.133841 0.209463 0.124458
0.077554 0.149787 0.128175
-0.131413 0.204089 0.128918
0.123000 0.069411 0.066603
0.061181 0.192106 0.148807
0.089771 0.154872 0.131446
-0.133374 0.177938 0.135861
-0.121954 0.167687 0.135659
-0.125845 0.170916 0.136083
-0.123516 0.183889 0.144743
-0.108788 0.217465 0.117131
-0.135624 0.128124 0.103410
-0.101008 0.185278 0.146716
-0.091935 0.095574 0.087730
0.061788 0.192056 0.151233
0.116958 0.022251 0.031704
-0.126738 0.188261 0.143513
-0.047171 0.189506 0.149625
-0.104753 0.188613 0.148894
-0.116317 0.187980 0.148287
0.120535 0.207910 0.131642
0.136634 0.006182 0.013685
-0.047872 0.191286 0.149841
0.154480 0.195860 0.122698
-0.050089 0.197794 0.149181
0.119718 0.201978 0.138107
0.141427 0.012888 0.018861
0.151449 0.054437 0.049351
0.008015 0.213786 0.136042
0.064443 0.212006 0.134699
-0.076747 0.154442 0.131397
-0.048817 0.192550 0.151599
-0.100534 0.031448 0.039290
-0.103189 0.176787 0.144133
-0.030979 0.025708 0.036269
-0.122153 0.183283 0.143584
0.064036 0.206049 0.141139
-0.046602 0.188430 0.149029
0.129162 0.009555 0.019604
-0.047862 0.190752 0.150492
-0.121759 0.032387 0.037131
0.135677 0.014876 0.023331
0.115126 0.188115 0.148201
-0.123945 0.183873 0.145389
0.149225 0.017470 0.021958
-0.049685 0.196444 0.149525
0.105244 0.035430 0.043117
-0.117586 0.178900 0.142883
-0.131256 0.174327 0.138132
0.140068 0.055783 0.053849
-0.102139 0.186342 0.147297
-0.105255 0.178731 0.144861
0.133353 0.007856 0.016024
0.116792 0.191958 0.146140
-0.134474 0.062012 0.053754
-0.114184 0.186259 0.147185
-0.124595 0.123396 0.104066
-0.137203 0.187581 0.127550
3 196 208 210
3 208 3 210
3 3 147 210
3 147 76 210
3 76 24 210
3 24 55 210
3 55 140 210
3 55 131 140
3 55 144 131
3 55 87 144
3 55 179 87
3 144 126 131
3 126 145 131
3 145 116 131
3 116 166 131
3 166 41 131
3 55 120 179
3 120 1 179
3 1 32 179
3 1 138 32
3 138 111 32
3 138 96 111
3 138 198 96
3 111 78 32
3 41 57 131
3 41 150 57
3 196 56 208
3 196 68 56
3 131 46 140
3 196 188 68
3 138 142 198
3 68 130 56
3 142 27 198
3 96 40 111
3 40 107 111
3 87 156 144
3 56 119 208
3 56 194 119
3 27 109 198
3 27 5 109
3 27 2 5
3 27 88 2
3 27 187 88
3 27 122 187
3 2 6 5
3 27 161 122
3 188 85 68
3 210 90 196
3 210 39 90
3 122 195 187
3 122 173 195
3 122 193 173
3 122 117 193
3 122 110 117
3 1 23 138
3 130 20 56
3 111 136 78
3 1 74 23
3 1 13 74
3 1 53 13
3 41 84 150
3 23 183 138
3 122 124 110
3 183 205 138
3 39 61 90
3 39 212 61
3 39 0 212
3 39 11 0
3 0 30 212
3 0 51 30
3 0 113 51
3 0 127 113
3 0 95 127
3 90 77 196
3 183 28 205
3 196 105 188
3 107 114 111
3 117 141 193
3 141 168 193
3 32 67 179
3 57 115 131
3 57 213 115
3 213 26 115
3 150 158 57
3 200 182 4
3 182 70 4
3 200 94 182
3 200 133 94
3 11 95 0
3 11 92 95
3 92 125 95
3 92 97 125
3 119 70 208
3 177 3 25
3 200 4 28
3 88 170 2
3 109 6 2
3 5 6 109
3 182 208 70
3 208 25 3
3 28 183 200
3 197 4 70
3 25 208 182
3 203 62 9
3 203 9 164
3 163 113 127
3 127 9 163
3 39 72 11
3 173 206 195
3 199 82 175
3 12 199 175
3 174 10 211
3 211 12 174
3 206 10 195
3 81 13 154
3 13 53 154
3 178 80 7
3 42 7 83
3 46 15 8
3 128 8 15
3 178 7 42
3 80 83 7
3 18 79 49
3 16 100 17
3 79 83 49
3 17 191 135
3 191 18 135
3 15 64 16
3 16 17 165
3 14 167 149
3 14 46 8
3 149 140 14
3 14 8 128
3 16 37 15
3 31 38 180
3 38 54 180
3 190 47 139
3 47 153 139
3 99 157 36
3 36 157 45
3 35 36 45
3 35 45 98
3 35 98 85
3 85 98 47
3 85 47 68
3 68 47 190
3 144 156 66
3 126 144 66
3 126 66 43
3 145 126 43
3 145 43 103
3 116 145 103
3 116 103 29
3 166 116 29
3 166 29 22
3 41 166 22
3 41 22 84
3 87 179 129
3 156 87 129
3 156 129 148
3 66 156 148
3 66 148 176
3 43 66 176
3 43 176 185
3 103 43 185
3 103 185 184
3 29 103 184
3 29 184 86
3 22 29 86
3 22 86 33
3 84 22 33
3 84 33 104
3 150 84 104
3 150 104 158
3 129 179 67
3 129 67 91
3 148 129 91
3 148 91 63
3 176 148 63
3 176 63 181
3 185 176 181
3 185 181 192
3 184 185 192
3 184 192 58
3 86 184 58
3 86 58 50
3 33 86 50
3 33 50 93
3 104 33 93
3 104 93 155
3 158 104 155
3 158 155 44
3 57 158 44
3 57 44 213
3 58 192 38
3 50 58 38
3 50 38 31
3 93 50 31
3 67 32 78
3 91 67 78
3 91 78 136
3 63 91 136
3 63 136 71
3 181 63 71
3 181 71 151
3 192 181 151
3 192 151 52
3 38 192 52
3 38 52 54
3 93 31 180
3 93 180 59
3 155 93 59
3 155 59 102
3 44 155 102
3 44 102 152
3 213 44 152
3 213 152 26
3 71 136 111
3 71 111 114
3 151 71 114
3 151 114 209
3 52 151 209
3 54 52 101
3 180 54 101
3 180 101 201
3 59 180 201
3 59 201 106
3 102 59 106
3 102 106 146
3 152 102 146
3 152 146 172
3 26 152 172
3 26 172 162
3 115 26 162
3 115 162 123
3 131 115 123
3 52 209 160
3 101 52 160
3 131 123 46
3 209 114 107
3 209 107 134
3 160 209 134
3 101 160 73
3 201 101 73
3 201 73 108
3 106 201 108
3 106 108 42
3 146 106 42
3 146 42 79
3 172 146 79
3 172 79 191
3 162 172 191
3 162 191 100
3 123 162 100
3 123 100 64
3 46 123 64
3 55 24 65
3 120 55 65
3 160 134 19
3 73 160 19
3 120 65 53
3 1 120 53
3 134 107 40
3 108 73 178
3 42 108 178
3 79 42 83
3 191 79 18
3 100 191 17
3 64 100 16
3 46 64 15
3 140 46 14
3 210 140 149
3 24 76 118
3 65 24 118
3 65 118 154
3 53 65 154
3 134 40 96
3 134 96 198
3 19 134 198
3 19 198 170
3 73 19 170
3 73 170 88
3 178 73 88
3 178 88 80
3 83 80 49
3 18 49 135
3 17 135 165
3 16 165 37
3 15 37 128
3 14 128 167
3 149 167 39
3 210 149 39
3 154 118 81
3 13 81 74
3 80 88 187
3 49 80 187
3 49 187 121
3 135 49 121
3 135 121 175
3 165 135 175
3 165 175 82
3 37 165 82
3 37 82 204
3 128 37 204
3 128 204 48
3 167 128 48
3 167 48 72
3 39 167 72
3 74 81 23
3 118 76 147
3 81 118 200
3 23 81 200
3 23 200 183
3 170 198 109
3 170 109 2
3 121 187 195
3 121 195 174
3 175 121 174
3 175 174 12
3 204 82 199
3 48 204 92
3 72 48 92
3 72 92 11
3 118 147 3
3 118 3 133
3 200 118 133
3 174 195 10
3 199 12 211
3 204 199 97
3 92 204 97
3 133 3 177
3 133 177 94
3 211 10 206
3 211 206 112
3 199 211 112
3 199 112 34
3 97 199 34
3 97 34 125
3 94 177 25
3 94 25 182
3 206 173 193
3 206 193 168
3 112 206 168
3 125 34 164
3 95 125 164
3 95 164 127
3 112 168 141
3 112 141 207
3 34 112 207
3 34 207 203
3 164 34 203
3 127 164 9
3 203 207 62
3 9 62 163
3 113 163 51
3 70 119 194
3 70 194 197
3 4 197 28
3 141 117 110
3 141 110 207
3 62 207 137
3 163 62 137
3 163 137 89
3 51 163 89
3 51 89 30
3 61 212 77
3 90 61 77
3 207 110 189
3 137 207 189
3 197 194 171
3 28 197 171
3 28 171 21
3 205 28 21
3 205 21 159
3 138 205 159
3 138 159 142
3 189 110 124
3 189 124 69
3 137 189 69
3 137 69 75
3 89 137 75
3 89 75 60
3 30 89 60
3 212 30 60
3 212 60 105
3 77 212 105
3 196 77 105
3 194 56 171
3 60 75 132
3 105 60 132
3 171 56 20
3 21 171 202
3 159 21 202
3 142 159 202
3 142 202 143
3 27 142 143
3 27 143 45
3 161 27 45
3 122 161 99
3 124 122 99
3 124 99 186
3 69 124 186
3 75 69 186
3 75 186 36
3 132 75 36
3 105 132 169
3 188 105 169
3 188 169 85
3 171 20 202
3 143 202 98
3 143 98 45
3 161 45 157
3 99 161 157
3 186 99 36
3 132 36 35
3 169 132 35
3 85 169 35
3 130 68 190
3 130 190 139
3 130 139 153
3 20 130 153
3 20 153 47
3 202 20 47
3 202 47 98
