OFF

396 788 0
0.395247 -0.135706 -0.061306
0.470054 -0.094399 -0.079520
0.413207 0.090487 -0.059293
0.456497 0.093550 -0.080373
0.467356 -0.077935 -0.083655
0.487247 0.028088 -0.077926
0.494802 0.030057 -0.085821
0.401805 0.112367 -0.073821
0.411325 0.117695 -0.070845
0.456469 0.090076 -0.074971
0.490268 0.009723 -0.077942
0.442440 -0.119387 -0.068322
0.410819 -0.134081 -0.063537
0.458120 0.093566 -0.079556
0.395210 -0.105552 -0.049788
0.497175 -0.038051 -0.083986
0.400750 -0.128758 -0.068395
0.465516 -0.103104 -0.076169
0.454014 0.096995 -0.077290
0.483702 0.045000 -0.087243
0.499518 -0.001286 -0.086110
0.462351 -0.106232 -0.076003
0.412168 -0.134113 -0.064887
0.462062 0.089960 -0.079766
0.465039 0.086832 -0.080296
0.420772 0.115506 -0.071589
0.442611 -0.044477 -0.086496
0.491292 0.042507 -0.084592
0.426798 -0.128737 -0.065909
0.458117 -0.109902 -0.075521
0.491912 -0.046244 -0.085642
0.427274 -0.128816 -0.069400
0.491735 -0.055206 -0.084029
0.462564 -0.106221 -0.075506
0.442156 0.103149 -0.073246
0.457385 0.089923 -0.081714
0.471637 -0.094737 -0.078791
0.499338 -0.018963 -0.085680
0.486905 0.053401 -0.083952
0.408917 -0.134121 -0.065415
0.475938 0.073017 -0.082181
0.457657 0.093558 -0.079938
0.412278 0.117701 -0.070513
0.437842 0.108179 -0.075767
0.437266 0.103029 -0.078862
0.463232 -0.099891 -0.078957
0.457833 -0.106259 -0.077476
0.464702 -0.103124 -0.077147
0.450701 -0.116528 -0.073336
0.448896 0.100110 -0.078784
0.395477 0.090622 -0.054341
0.420772 -0.131933 -0.066084
0.407926 -0.134840 -0.063887
0.461852 0.089949 -0.080256
0.481193 -0.079862 -0.081194
0.491700 0.009485 -0.088439
0.446121 0.103049 -0.077412
0.497675 -0.001753 -0.087206
0.407547 -0.134845 -0.064137
0.473774 -0.092962 -0.078056
0.478382 0.069274 -0.082590
0.488410 0.049239 -0.084909
0.442299 0.105747 -0.076140
0.486551 -0.053106 -0.085775
0.482558 -0.061358 -0.075270
0.399637 0.119330 -0.067919
0.486856 -0.069839 -0.081939
0.450292 -0.116535 -0.073675
0.467523 -0.099871 -0.077833
0.473273 0.044995 -0.088101
0.476309 -0.089343 -0.078647
0.426840 0.089964 -0.081709
0.497644 -0.028469 -0.085905
0.450074 0.089919 -0.082315
0.472556 0.069227 -0.085017
0.461563 0.089989 -0.078522
0.478098 -0.085581 -0.077655
0.406703 0.117697 -0.071029
0.450491 0.100133 -0.077664
0.430408 0.090343 -0.064662
0.494600 0.023269 -0.087073
0.461361 0.089941 -0.080662
0.450696 -0.113353 -0.075550
0.446434 0.103060 -0.076913
0.494925 0.027957 -0.083275
0.487343 -0.044308 -0.076324
0.416105 0.116708 -0.071628
0.480351 -0.026225 -0.088595
0.460790 -0.106249 -0.076823
0.495678 0.027914 -0.085151
0.488751 -0.063639 -0.083195
0.433373 0.110371 -0.075094
0.493141 -0.046666 -0.085195
0.458586 -0.109894 -0.075133
0.475206 0.071489 -0.083803
0.484283 -0.071890 -0.082652
0.421259 -0.128674 -0.063432
0.473183 -0.092928 -0.076588
0.499674 -0.010540 -0.085938
0.495140 0.025582 -0.086562
0.442151 0.105739 -0.076485
0.428634 0.112318 -0.074405
0.488994 0.039483 -0.086870
0.402678 0.117708 -0.070810
0.403057 -0.135348 -0.063251
0.485233 -0.071882 -0.082248
0.475802 -0.077729 -0.073953
0.410855 0.090017 -0.080309
0.467823 -0.099818 -0.075448
0.496188 -0.037621 -0.085386
0.454270 0.096960 -0.078826
0.498251 -0.026116 -0.082684
0.491585 0.030460 -0.087269
0.472861 -0.085664 -0.081659
0.496564 -0.028478 -0.086364
0.467923 0.083566 -0.080803
0.498200 0.009588 -0.083469
0.480692 -0.069876 -0.083951
0.482796 0.059869 -0.084645
0.484952 -0.073902 -0.081450
0.468371 -0.099850 -0.076816
0.467150 0.061446 -0.086676
0.485986 0.047952 -0.086362
0.425317 -0.130496 -0.067520
0.459347 0.076604 -0.084730
0.395544 0.112670 -0.060732
0.454439 -0.113294 -0.072689
0.473130 0.076639 -0.082320
0.402553 -0.128510 -0.057262
0.482914 -0.077895 -0.080935
0.410955 0.117733 -0.069174
0.446772 -0.119476 -0.072035
0.499247 -0.008287 -0.083263
0.420258 0.115485 -0.072570
0.469909 0.080149 -0.082299
0.480434 0.065418 -0.083600
0.489660 0.045095 -0.082688
0.499605 -0.019843 -0.084879
0.452906 0.096946 -0.079544
0.429438 -0.128782 -0.067747
0.487765 -0.063647 -0.083614
0.496313 -0.014537 -0.087363
0.395628 0.090080 -0.078444
0.446386 -0.119454 -0.071071
0.438073 -0.124651 -0.070645
0.487566 0.047119 -0.086028
0.420855 -0.131948 -0.066741
0.441990 -0.122199 -0.071812
0.480705 0.065432 -0.082972
0.441376 -0.077376 -0.060334
0.447996 -0.043905 -0.060760
0.446457 -0.119487 -0.072540
0.404169 0.117803 -0.066505
0.498569 -0.018976 -0.086316
0.453835 0.096952 -0.079185
0.412107 0.112538 -0.065592
0.432541 0.110366 -0.075389
0.477618 0.027852 -0.088992
0.498049 0.014096 -0.086145
0.441709 0.105733 -0.076811
0.497447 -0.019433 -0.086763
0.486614 0.053387 -0.084625
0.446050 0.103082 -0.075961
0.456905 -0.106105 -0.070657
0.442610 0.027920 -0.088077
0.478119 0.069260 -0.083201
0.436624 0.061505 -0.085878
0.467378 0.083597 -0.079448
0.482623 0.061486 -0.083970
0.402840 -0.134108 -0.065228
0.433998 -0.126848 -0.069394
0.492435 0.000452 -0.088421
0.490267 -0.061539 -0.082837
0.450318 0.100124 -0.078069
0.477014 -0.077931 -0.082861
0.489583 -0.064029 -0.081881
0.409343 0.117694 -0.071026
0.441312 0.062002 -0.063482
0.442858 0.103032 -0.078402
0.494053 0.033952 -0.084957
0.486455 -0.069785 -0.079543
0.479336 -0.079485 -0.081997
0.408086 -0.134050 -0.062315
0.427186 0.112313 -0.074722
0.435309 -0.124666 -0.071484
0.454458 0.096969 -0.078392
0.445346 -0.119497 -0.073064
0.395485 -0.044302 -0.081568
0.495471 -0.044499 -0.084305
0.498986 0.000556 -0.083412
0.495123 -0.037630 -0.085839
0.497299 0.018686 -0.086090
0.492627 -0.055603 -0.082680
0.437782 0.108206 -0.074554
0.473376 0.076652 -0.081746
0.484684 0.057472 -0.084312
0.403585 -0.135340 -0.062848
0.500000 -0.010961 -0.085155
0.411199 -0.134120 -0.065229
0.425253 0.114034 -0.072943
0.445027 0.103039 -0.077929
0.416585 -0.133148 -0.065691
0.482392 0.045218 -0.077624
0.493334 -0.039933 -0.086112
0.438102 0.108188 -0.075351
0.470703 0.080171 -0.081287
0.450316 0.096936 -0.080117
0.399346 -0.135630 -0.062194
0.453316 -0.113344 -0.074971
0.490718 -0.055214 -0.084462
0.498070 0.007699 -0.086801
0.407727 0.118460 -0.069801
0.403514 -0.134007 -0.060695
0.470463 0.080159 -0.081841
0.412241 0.117711 -0.070069
0.424639 0.114024 -0.073417
0.490441 0.018645 -0.088329
0.490510 -0.035354 -0.087150
0.464757 -0.101184 -0.078145
0.495994 0.003162 -0.087682
0.498113 -0.030734 -0.085162
0.436661 -0.077876 -0.082854
0.467081 0.083545 -0.081810
0.495128 -0.047058 -0.083374
0.488631 0.027858 -0.088085
0.429319 0.112346 -0.073090
0.473404 -0.061582 -0.085784
0.480752 -0.081808 -0.080395
0.499258 0.006822 -0.085401
0.498702 -0.026178 -0.085386
0.493593 0.021420 -0.087532
0.467173 -0.092826 -0.072400
0.447986 0.028491 -0.062395
0.475793 -0.087511 -0.080404
0.449911 0.100117 -0.078404
0.473568 0.075175 -0.082983
0.450244 -0.007730 -0.061464
0.458318 0.093576 -0.079093
0.481023 -0.081794 -0.079764
0.492676 -0.008391 -0.088285
0.473881 0.071857 -0.084093
0.438015 -0.124624 -0.069416
0.495070 0.012238 -0.087670
0.496857 0.018747 -0.083425
0.490311 -0.025981 -0.077151
0.465292 -0.103115 -0.076687
0.476052 -0.089356 -0.079245
0.496501 -0.039904 -0.084622
0.412433 -0.128591 -0.060290
0.482900 0.061500 -0.083326
0.428743 -0.128811 -0.069080
0.419179 0.115481 -0.072807
0.454258 -0.113337 -0.074607
0.483194 -0.077881 -0.080287
0.476651 -0.087504 -0.080039
0.464235 0.086811 -0.081262
0.475683 0.073004 -0.082774
0.496726 0.023307 -0.085259
0.429342 0.112324 -0.074081
0.418098 0.112318 -0.075036
0.483253 -0.071491 -0.083080
0.403824 0.119007 -0.068572
0.456944 -0.109911 -0.075960
0.420840 0.115491 -0.072249
0.480478 0.053350 -0.086629
0.497809 -0.010562 -0.087040
0.490073 0.045038 -0.085163
0.490562 0.038635 -0.086510
0.395583 0.028094 -0.083159
0.423490 -0.128818 -0.069711
0.464818 0.086821 -0.080807
0.435112 0.108164 -0.076595
0.486420 0.036477 -0.087728
0.419156 -0.131958 -0.067318
0.467693 0.083555 -0.081336
0.482534 -0.077843 -0.078643
0.459632 -0.093011 -0.081064
0.426936 -0.106217 -0.077472
0.492561 0.036574 -0.083032
0.480286 -0.079870 -0.081580
0.477757 0.069309 -0.081038
0.432703 -0.126864 -0.070164
0.493025 0.030035 -0.086871
0.478727 -0.085617 -0.079216
0.482641 0.055812 -0.085763
0.486653 0.051716 -0.085301
0.421247 0.112453 -0.068832
0.468141 -0.099862 -0.077355
0.395609 0.117734 -0.070050
0.454699 -0.113329 -0.074244
0.424693 -0.130506 -0.068001
0.468894 0.079081 -0.083101
0.433546 -0.126858 -0.069865
0.429698 -0.128797 -0.068391
0.408102 0.118465 -0.069552
0.499888 -0.002159 -0.085329
0.492989 0.036516 -0.085585
0.440962 -0.122206 -0.072176
0.498908 -0.010115 -0.086586
0.468257 -0.093006 -0.080355
0.495846 0.016369 -0.087199
0.410764 -0.106164 -0.076055
0.489548 -0.054796 -0.084906
0.498675 -0.028895 -0.084491
0.492454 -0.017211 -0.088035
0.438338 -0.124642 -0.070222
0.477690 -0.044545 -0.087412
0.426716 0.112391 -0.071276
0.442588 -0.122185 -0.071132
0.491233 -0.008150 -0.077679
0.486661 -0.063237 -0.084051
0.418070 -0.128811 -0.069718
0.491770 -0.057320 -0.083245
0.484037 0.055410 -0.085422
0.395571 0.117871 -0.063970
0.487147 -0.069824 -0.081261
0.416051 -0.133155 -0.066064
0.467903 0.076608 -0.084026
0.491742 -0.026220 -0.087658
0.471127 -0.096467 -0.077446
0.496842 0.016837 -0.086737
0.485237 -0.073888 -0.080787
0.493754 -0.050928 -0.083802
0.482242 0.061537 -0.081690
0.403299 0.119000 -0.068948
0.476756 0.061450 -0.085886
0.436925 0.108170 -0.076200
0.403532 -0.135346 -0.063116
0.433820 0.110381 -0.074629
0.470886 -0.096479 -0.078005
0.475548 0.061651 -0.077026
0.401873 0.112622 -0.062480
0.429575 0.112332 -0.073726
0.478412 0.064213 -0.084972
0.442439 -0.122193 -0.071482
0.462057 -0.106192 -0.074247
0.413145 -0.105689 -0.054798
0.412121 -0.134103 -0.064445
0.472791 0.076685 -0.080289
0.430546 -0.105834 -0.060229
0.449264 -0.116543 -0.074061
0.462832 0.083525 -0.082922
0.443151 -0.119505 -0.073543
0.423449 0.112311 -0.075029
0.494612 -0.032595 -0.086570
0.458788 -0.109884 -0.074665
0.440693 0.105726 -0.077171
0.496399 -0.005743 -0.087579
0.480317 0.009480 -0.089375
0.491599 0.040794 -0.085389
0.492764 0.034783 -0.086250
0.486215 0.053441 -0.082241
0.473525 -0.092975 -0.078635
0.496934 -0.035252 -0.082238
0.499008 -0.017107 -0.083024
0.497380 -0.035313 -0.084908
0.463764 0.085494 -0.082057
0.410352 0.112338 -0.074624
0.488629 -0.065715 -0.082400
0.461854 -0.106241 -0.076412
0.492713 -0.053009 -0.081067
0.450437 -0.106263 -0.078085
0.470830 -0.094743 -0.079134
0.494295 -0.046228 -0.084784
0.474926 -0.087145 -0.080808
0.478461 -0.085631 -0.079831
0.498747 -0.001299 -0.086747
0.481177 -0.008396 -0.089231
0.488729 -0.044539 -0.086505
0.495035 -0.044439 -0.081684
0.437491 -0.119508 -0.074008
0.460221 0.089933 -0.081095
0.429486 -0.128804 -0.068730
0.444633 -0.008325 -0.088276
0.454886 -0.113320 -0.073804
0.479990 0.063433 -0.084695
0.484969 0.057486 -0.083653
0.395364 -0.106100 -0.074169
0.450877 -0.116519 -0.072926
0.497032 0.007237 -0.087261
0.416642 0.116715 -0.071256
0.437146 -0.124660 -0.071083
0.408256 0.117764 -0.067968
0.420252 -0.131955 -0.067079
0.495729 -0.023493 -0.087029
0.496404 0.023291 -0.086006
0.470433 0.078383 -0.082887
0.498883 0.007259 -0.086167
0.488707 0.049254 -0.084222
0.490130 0.042904 -0.085860
0.483873 -0.061577 -0.084923
0.409807 -0.128790 -0.069268
0.466826 0.076787 -0.076135
0.489851 -0.061482 -0.080352
0.478426 0.067713 -0.083871
0.498074 0.015949 -0.085366
3 125 288 314
3 125 50 288
3 50 142 288
3 50 268 142
3 50 187 268
3 50 14 187
3 14 377 187
3 14 0 377
3 0 16 377
3 14 128 0
3 50 236 14
3 50 232 236
3 236 150 14
3 142 7 288
3 50 177 232
3 50 2 177
3 150 149 14
3 149 336 14
3 288 65 314
3 0 169 16
3 128 212 0
3 65 261 314
3 261 152 314
3 288 103 65
3 103 324 65
3 268 107 142
3 377 301 187
3 261 382 152
3 169 391 16
3 103 77 324
3 261 130 382
3 77 176 324
3 21 359 29
3 93 21 29
3 33 21 93
3 345 33 93
3 345 93 289
3 374 345 289
3 93 29 252
3 289 93 252
3 335 345 126
3 33 345 335
3 374 126 345
3 126 378 143
3 374 378 126
3 131 143 378
3 289 252 67
3 48 289 67
3 374 289 48
3 378 374 48
3 378 48 151
3 131 378 151
3 48 67 151
3 163 126 11
3 335 126 163
3 143 11 126
3 11 241 28
3 143 241 11
3 139 28 241
3 334 151 147
3 131 151 334
3 308 131 334
3 308 334 144
3 305 308 144
3 334 147 144
3 143 308 241
3 131 308 143
3 305 241 308
3 241 170 139
3 305 170 241
3 293 139 170
3 170 144 292
3 305 144 170
3 293 170 372
3 170 292 372
3 96 339 11
3 163 11 339
3 248 339 96
3 28 96 11
3 96 28 12
3 182 96 12
3 248 96 182
3 212 248 182
3 212 182 0
3 182 12 0
3 123 372 290
3 293 372 123
3 123 290 146
3 139 123 51
3 293 123 139
3 146 51 123
3 51 201 337
3 146 201 51
3 22 337 201
3 201 146 316
3 201 316 22
3 28 51 12
3 139 51 28
3 337 12 51
3 12 196 0
3 337 196 12
3 52 22 58
3 52 58 327
3 337 52 196
3 22 52 337
3 327 196 52
3 196 207 0
3 327 207 196
3 322 188 363
3 223 188 322
3 192 223 322
3 322 363 32
3 369 223 360
3 192 360 223
3 360 192 393
3 175 393 192
3 312 322 32
3 192 322 312
3 192 312 172
3 175 192 172
3 312 32 90
3 172 312 90
3 85 360 64
3 369 360 85
3 393 64 360
3 64 180 106
3 393 180 64
3 275 106 180
3 358 172 90
3 175 172 358
3 175 358 66
3 315 175 66
3 358 90 105
3 66 358 105
3 393 175 180
3 315 180 175
3 180 321 275
3 315 321 180
3 253 275 321
3 119 66 105
3 315 66 119
3 321 315 119
3 321 119 129
3 253 321 129
3 119 105 54
3 129 119 54
3 150 64 149
3 85 64 150
3 106 149 64
3 149 231 339
3 106 231 149
3 163 339 231
3 227 129 54
3 253 129 227
3 238 253 227
3 238 227 365
3 283 238 365
3 227 54 254
3 365 227 254
3 275 238 76
3 253 238 275
3 283 76 238
3 76 70 97
3 283 70 76
3 59 97 70
3 246 365 254
3 283 365 246
3 70 283 246
3 70 246 352
3 59 70 352
3 246 254 36
3 352 246 36
3 106 76 231
3 275 76 106
3 97 231 76
3 231 108 163
3 97 108 231
3 335 163 108
3 329 352 36
3 59 352 329
3 319 59 329
3 319 329 287
3 120 319 287
3 329 36 68
3 287 329 68
3 97 319 108
3 59 319 97
3 120 108 319
3 108 17 335
3 120 17 108
3 33 335 17
3 287 68 47
3 245 287 47
3 120 287 245
3 17 120 245
3 17 245 21
3 33 17 21
3 245 47 359
3 21 245 359
3 385 6 99
3 89 6 385
3 257 89 385
3 257 385 191
3 395 257 191
3 385 99 320
3 191 385 320
3 84 257 243
3 89 257 84
3 395 243 257
3 243 395 116
3 228 116 395
3 158 191 320
3 395 191 158
3 395 158 387
3 228 395 387
3 158 320 210
3 387 158 210
3 5 243 10
3 84 243 5
3 116 10 243
3 10 189 309
3 116 189 10
3 132 309 189
3 228 387 20
3 295 228 20
3 387 210 366
3 20 387 366
3 116 228 189
3 295 189 228
3 189 295 132
3 197 132 295
3 295 20 98
3 197 295 98
3 20 366 298
3 98 20 298
3 232 10 236
3 5 10 232
3 309 236 10
3 236 244 150
3 309 244 236
3 85 150 244
3 197 98 37
3 137 197 37
3 98 298 153
3 37 98 153
3 132 197 354
3 137 354 197
3 354 137 111
3 303 111 137
3 137 37 229
3 303 137 229
3 37 153 72
3 229 37 72
3 309 354 244
3 132 354 309
3 111 244 354
3 244 353 85
3 111 353 244
3 369 85 353
3 220 229 72
3 303 229 220
3 303 220 355
3 15 303 355
3 220 72 109
3 355 220 109
3 111 303 353
3 15 353 303
3 353 15 369
3 223 369 15
3 247 355 109
3 15 355 247
3 15 247 188
3 223 15 188
3 247 109 363
3 188 247 363
3 53 81 255
3 270 53 255
3 23 53 270
3 24 23 270
3 24 270 274
3 115 24 274
3 270 255 222
3 274 270 222
3 75 24 167
3 23 24 75
3 115 167 24
3 167 205 338
3 115 205 167
3 194 338 205
3 274 222 134
3 213 274 134
3 115 274 213
3 205 115 213
3 205 213 127
3 194 205 127
3 213 134 235
3 127 213 235
3 9 167 392
3 75 167 9
3 338 392 167
3 392 280 330
3 338 280 392
3 323 330 280
3 256 127 235
3 194 127 256
3 40 194 256
3 40 256 165
3 60 40 165
3 256 235 394
3 165 256 394
3 338 40 280
3 194 40 338
3 60 280 40
3 280 148 323
3 60 148 280
3 249 323 148
3 135 165 394
3 60 165 135
3 148 60 135
3 148 135 168
3 249 148 168
3 135 394 118
3 168 135 118
3 79 392 177
3 9 392 79
3 330 177 392
3 177 202 232
3 330 202 177
3 5 232 202
3 195 168 118
3 249 168 195
3 376 249 195
3 376 195 161
3 38 376 161
3 195 118 285
3 161 195 285
3 323 376 351
3 249 376 323
3 38 351 376
3 351 388 136
3 38 388 351
3 27 136 388
3 61 161 285
3 38 161 61
3 388 38 61
3 388 61 266
3 27 388 266
3 61 285 389
3 266 61 389
3 330 351 202
3 323 351 330
3 136 202 351
3 202 278 5
3 136 278 202
3 84 5 278
3 349 266 389
3 27 266 349
3 27 349 296
3 179 27 296
3 349 389 350
3 296 349 350
3 136 27 278
3 179 278 27
3 278 179 84
3 89 84 179
3 6 296 350
3 179 296 6
3 89 179 6
3 6 350 99
3 261 294 214
3 42 214 294
3 294 261 211
3 294 211 42
3 214 130 261
3 130 25 307
3 214 25 130
3 225 307 25
3 380 42 86
3 380 86 263
3 214 380 25
3 42 380 214
3 263 25 380
3 25 199 225
3 263 199 25
3 332 225 199
3 199 263 215
3 332 199 258
3 199 215 258
3 152 382 286
3 155 152 286
3 382 130 307
3 286 382 307
3 34 79 286
3 155 286 79
3 9 79 34
3 307 34 286
3 328 258 91
3 332 258 328
3 204 328 43
3 328 91 43
3 225 328 193
3 332 328 225
3 204 193 328
3 193 62 162
3 204 62 193
3 83 162 62
3 100 43 159
3 204 43 100
3 62 204 100
3 62 100 56
3 83 62 56
3 100 159 56
3 307 193 34
3 225 193 307
3 162 34 193
3 34 18 9
3 162 18 34
3 75 9 18
3 173 56 234
3 83 56 173
3 78 83 173
3 78 173 110
3 185 78 110
3 173 234 154
3 110 173 154
3 162 78 18
3 83 78 162
3 185 18 78
3 18 237 75
3 185 237 18
3 23 75 237
3 110 154 41
3 13 110 41
3 185 110 13
3 237 185 13
3 237 13 53
3 23 237 53
3 13 41 81
3 53 13 81
3 339 248 336
3 128 336 248
3 336 128 14
3 128 248 212
3 339 336 149
3 79 177 2
3 314 152 155
3 331 314 155
3 125 314 331
3 50 331 2
3 125 331 50
3 2 155 79
3 331 155 2
3 377 16 301
3 301 391 277
3 16 391 301
3 221 187 301
3 26 187 221
3 277 221 301
3 187 373 268
3 26 373 187
3 164 268 373
3 107 268 166
3 164 166 268
3 71 107 166
3 103 288 7
3 357 103 7
3 71 357 107
3 7 107 357
3 107 7 142
3 370 277 311
3 391 311 277
3 361 277 370
3 269 370 311
3 370 82 361
3 342 82 370
3 46 361 82
3 82 262 46
3 208 262 82
3 88 46 262
3 359 88 262
3 29 359 262
3 29 262 208
3 252 29 208
3 252 208 340
3 67 252 340
3 67 340 186
3 151 67 186
3 342 340 82
3 186 340 342
3 208 82 340
3 184 297 342
3 381 297 184
3 186 342 297
3 147 186 297
3 151 186 147
3 144 147 381
3 147 297 381
3 292 381 281
3 144 381 292
3 372 292 250
3 292 281 250
3 31 281 184
3 250 281 31
3 381 184 281
3 269 184 370
3 31 184 269
3 342 370 184
3 39 273 269
3 198 273 39
3 31 269 273
3 273 290 31
3 383 290 273
3 250 31 290
3 372 250 290
3 146 290 383
3 146 383 316
3 22 316 198
3 198 316 273
3 383 273 316
3 104 58 198
3 327 58 104
3 22 198 58
3 0 207 104
3 327 104 207
3 0 104 39
3 198 39 104
3 311 391 169
3 39 311 169
3 269 311 39
3 39 169 0
3 221 226 26
3 4 226 221
3 306 26 226
3 226 63 306
3 390 63 226
3 368 306 63
3 63 30 368
3 302 30 63
3 363 92 209
3 32 363 209
3 92 30 302
3 209 92 302
3 32 209 140
3 90 32 140
3 209 302 310
3 140 209 310
3 390 302 63
3 310 302 390
3 117 310 390
3 260 310 117
3 90 140 95
3 105 90 95
3 140 310 260
3 95 140 260
3 105 95 279
3 54 105 279
3 95 260 181
3 279 95 181
3 174 260 117
3 181 260 174
3 4 117 226
3 174 117 4
3 390 226 117
3 276 113 4
3 299 113 276
3 174 4 113
3 113 181 174
3 364 181 113
3 54 279 233
3 254 54 233
3 279 181 364
3 233 279 364
3 254 233 362
3 36 254 362
3 233 364 1
3 362 233 1
3 299 364 113
3 1 364 299
3 45 1 299
3 218 1 45
3 36 362 68
3 362 1 218
3 68 362 218
3 47 68 218
3 359 47 88
3 47 218 88
3 46 218 45
3 88 218 46
3 361 45 276
3 46 45 361
3 299 276 45
3 277 276 221
3 361 276 277
3 4 221 276
3 373 348 164
3 367 348 373
3 157 164 348
3 348 216 157
3 55 216 348
3 224 157 216
3 216 230 224
3 112 224 230
3 282 112 230
3 80 282 230
3 99 282 80
3 99 80 300
3 320 99 300
3 300 80 230
3 300 230 242
3 320 300 379
3 210 320 379
3 379 300 242
3 55 242 216
3 230 216 242
3 171 219 55
3 242 55 219
3 379 242 219
3 210 379 57
3 366 210 57
3 57 379 219
3 57 219 347
3 366 57 265
3 298 366 265
3 265 57 347
3 239 347 171
3 219 171 347
3 367 171 348
3 239 171 367
3 55 348 171
3 87 304 367
3 318 304 87
3 239 367 304
3 304 141 239
3 347 239 141
3 265 347 141
3 298 265 160
3 153 298 160
3 160 265 141
3 160 141 384
3 153 160 114
3 72 153 114
3 114 160 384
3 318 384 304
3 141 304 384
3 217 344 318
3 384 318 344
3 114 384 344
3 72 114 190
3 109 72 190
3 190 114 344
3 190 344 203
3 109 190 92
3 363 109 92
3 190 203 30
3 92 190 30
3 368 203 217
3 30 203 368
3 344 217 203
3 306 217 87
3 368 217 306
3 318 87 217
3 26 87 373
3 306 87 26
3 367 373 87
3 166 124 71
3 121 124 166
3 73 71 124
3 124 341 73
3 317 341 124
3 35 73 341
3 341 356 35
3 371 35 356
3 255 371 356
3 81 371 255
3 222 255 356
3 222 356 291
3 386 222 291
3 134 222 386
3 235 134 386
3 317 291 341
3 356 341 291
3 74 240 317
3 291 317 240
3 386 291 240
3 94 386 240
3 235 386 94
3 394 235 94
3 94 240 333
3 375 94 333
3 394 94 375
3 118 394 375
3 325 333 74
3 240 74 333
3 121 74 124
3 325 74 121
3 317 124 74
3 69 264 121
3 19 264 69
3 325 121 264
3 264 284 325
3 333 325 284
3 375 333 284
3 313 375 284
3 118 375 313
3 285 118 313
3 313 284 122
3 145 313 122
3 285 313 145
3 389 285 145
3 19 122 264
3 284 264 122
3 272 102 19
3 122 19 102
3 145 122 102
3 267 145 102
3 389 145 267
3 350 389 267
3 267 102 112
3 282 267 112
3 350 267 282
3 99 350 282
3 224 112 272
3 102 272 112
3 157 272 69
3 224 272 157
3 19 69 272
3 164 69 166
3 157 69 164
3 121 166 69
3 176 77 259
3 343 176 259
3 77 103 357
3 259 77 357
3 8 324 176
3 261 65 324
3 261 324 211
3 42 211 8
3 8 211 324
3 251 86 8
3 133 86 251
3 42 8 86
3 263 86 133
3 263 133 215
3 258 215 101
3 183 215 251
3 101 215 183
3 133 251 215
3 343 251 176
3 183 251 343
3 8 176 251
3 44 271 343
3 178 271 44
3 183 343 271
3 271 156 183
3 326 156 271
3 101 183 156
3 91 101 156
3 258 101 91
3 43 91 326
3 91 156 326
3 159 326 346
3 43 326 159
3 56 159 200
3 159 346 200
3 178 346 271
3 200 346 178
3 326 271 346
3 206 49 178
3 138 49 206
3 200 178 49
3 56 200 49
3 234 56 49
3 234 49 138
3 154 234 138
3 154 138 3
3 41 154 3
3 41 3 371
3 81 41 371
3 35 3 206
3 371 3 35
3 138 206 3
3 73 206 44
3 35 206 73
3 178 44 206
3 259 71 44
3 73 44 71
3 357 71 259
3 343 259 44
