OFF

66 128 0
-0.193377 0.193450 -0.215724
-0.222641 -0.222546 -0.214984
-0.193367 0.193424 -0.230320
-0.222630 -0.222573 -0.229580
-0.222560 0.193429 -0.230341
-0.222583 0.054761 -0.230087
-0.120448 -0.120388 -0.215098
-0.156945 -0.156873 -0.215058
-0.120407 0.120455 -0.215538
-0.156892 0.156953 -0.215631
-0.120444 -0.156906 -0.229628
-0.156929 -0.120409 -0.229720
-0.120471 -0.259055 -0.214845
-0.120390 0.156920 -0.230201
-0.156888 0.120434 -0.230160
-0.193401 0.054783 -0.215470
-0.208032 -0.207980 -0.229597
-0.207985 0.069356 -0.230103
-0.193419 -0.054691 -0.215270
-0.193443 -0.193358 -0.215017
-0.193396 0.083976 -0.215524
-0.083888 0.222598 -0.230295
-0.083898 0.222625 -0.215699
-0.083903 0.193432 -0.215646
-0.193390 0.054756 -0.230066
-0.083927 0.054764 -0.215392
-0.222607 -0.083907 -0.229834
-0.083959 -0.193404 -0.229535
-0.193424 -0.083885 -0.215217
-0.083950 -0.083903 -0.215139
-0.193437 -0.222578 -0.229560
-0.193448 -0.222551 -0.214964
-0.083982 -0.332071 -0.229281
-0.083993 -0.332045 -0.214685
-0.083974 -0.222570 -0.214886
-0.083893 0.193405 -0.230242
-0.083922 0.083957 -0.215446
-0.083916 0.054738 -0.229988
-0.083964 -0.222597 -0.229481
-0.083945 -0.054709 -0.215192
-0.083940 -0.083930 -0.229735
-0.083911 0.083931 -0.230042
-0.083935 -0.054736 -0.229788
-0.208042 -0.207953 -0.215001
-0.193409 -0.054717 -0.229866
-0.193385 0.083949 -0.230120
-0.208008 -0.069312 -0.229850
-0.193414 -0.083911 -0.229813
-0.193432 -0.193385 -0.229613
-0.138708 -0.207964 -0.214951
-0.208054 -0.277286 -0.214874
-0.138698 -0.207991 -0.229547
-0.208043 -0.277313 -0.229470
-0.138685 -0.069297 -0.215205
-0.208030 -0.138619 -0.215127
-0.138674 -0.069324 -0.229801
-0.208020 -0.138646 -0.229723
-0.138661 0.069370 -0.215458
-0.208006 0.000048 -0.215381
-0.138651 0.069343 -0.230054
-0.207996 0.000022 -0.229977
-0.083969 -0.193377 -0.214939
-0.138638 0.208038 -0.215711
-0.207983 0.138716 -0.215634
-0.138627 0.208011 -0.230307
-0.207972 0.138689 -0.230230
3 32 52 33
3 52 50 33
3 52 1 50
3 52 3 1
3 3 26 1
3 26 4 1
3 4 63 1
3 4 0 63
3 4 62 0
3 4 22 62
3 4 21 22
3 26 5 4
3 63 58 1
3 4 64 21
3 58 54 1
3 63 15 58
3 63 20 15
3 58 18 54
3 18 28 54
3 4 2 64
3 32 38 52
3 3 56 26
3 26 60 5
3 5 65 4
3 5 17 65
3 3 16 56
3 54 43 1
3 26 46 60
3 46 44 60
3 54 19 43
3 16 48 56
3 17 45 65
3 38 30 52
3 50 12 33
3 50 31 12
3 6 29 61
3 19 28 7
3 19 7 61
3 29 6 28
3 6 61 7
3 28 6 7
3 8 23 36
3 8 20 9
3 0 9 20
3 8 36 20
3 9 0 23
3 23 8 9
3 10 27 40
3 47 48 11
3 47 11 40
3 27 10 48
3 10 40 11
3 48 10 11
3 34 12 31
3 33 12 34
3 13 41 35
3 13 2 14
3 45 14 2
3 13 35 2
3 14 45 41
3 41 13 14
3 33 34 38
3 32 33 38
3 61 29 40
3 27 61 40
3 36 23 35
3 41 36 35
3 62 22 23
3 62 23 0
3 57 36 25
3 57 20 36
3 57 15 20
3 57 25 15
3 49 61 34
3 49 19 61
3 49 31 19
3 49 34 31
3 43 19 31
3 53 39 29
3 53 18 39
3 53 28 18
3 53 29 28
3 23 22 21
3 35 23 21
3 15 25 37
3 24 15 37
3 25 36 41
3 37 25 41
3 34 61 27
3 38 34 27
3 39 18 44
3 42 39 44
3 29 39 42
3 40 29 42
3 64 35 21
3 64 2 35
3 59 41 45
3 59 37 41
3 59 24 37
3 59 45 24
3 17 24 45
3 51 27 48
3 51 38 27
3 51 30 38
3 51 48 30
3 16 30 48
3 55 42 44
3 55 40 42
3 55 47 40
3 55 44 47
3 46 47 44
3 58 15 18
3 50 1 31
3 43 31 1
3 18 15 24
3 44 18 24
3 24 17 5
3 60 24 5
3 60 44 24
3 52 30 3
3 16 3 30
3 63 0 20
3 54 28 19
3 65 2 4
3 65 45 2
3 47 46 26
3 56 47 26
3 56 48 47
