OFF
1458 1955 0
0.2029608285 -0.0381818304 -0.0380737129
0.2009574103 -0.0379087157 0.0524545759
0.4912588017 0.0319835801 0.0641535645
0.4935049087 0.0316773809 -0.0373410826
0.3387269585 0.0271868414 0.0523477504
0.3405994838 0.0269315706 -0.0322658977
0.4452147232 -0.0358315445 -0.0299344715
0.4433345174 -0.0355752266 0.0550262332
0.2892100426 0.0408496279 0.0746995892
0.2921216584 0.0404527036 -0.0568673517
0.1288785719 -0.1248929219 0.0058351478
0.0528207016 0.1350420802 0.0314608516
0.0540635216 0.1348726536 -0.0246983524
0.3712496271 0.0338441257 0.0645605319
0.3736314764 0.0335194215 -0.0430678942
0.3396082173 -0.0462369317 0.0102613607
0.1265761205 0.0669367767 0.1157935041
0.1314683937 0.0662698405 -0.1052732429
0.4403772454 -0.0140004903 0.0638481407
0.4426534941 -0.0143107985 -0.0390085198
-0.4851946095 -0.1353972689 -0.0693597269
-0.4879213140 -0.1350255526 0.0538516437
0.1001485187 -0.1316498651 0.0651729732
0.1028007621 -0.1320114306 -0.0546737313
0.2274121689 -0.0736312227 0.0383942085
0.3759697879 -0.0737328169 0.0416821396
0.0942876533 -0.0322698239 0.1137433301
0.0991075887 -0.0329268986 -0.1040546892
-0.4742075909 -0.0121967217 0.0399394419
-0.4720933977 -0.0124849378 -0.0555944300
-0.4818827086 -0.0757928138 0.0273908982
-0.4803245950 -0.0760052227 -0.0430154495
-0.4999188912 -0.0348986097 0.1100336662
-0.4946816699 -0.0356125707 -0.1266202193
0.4478447284 -0.0567765901 0.0126884641
0.1300356973 -0.1140123269 -0.0461107087
0.1277380083 -0.1136990959 0.0577147744
0.2117078557 0.0840794655 0.0243247392
0.2124726073 0.0839752112 -0.0102320287
0.4849780878 0.0556837624 0.0244637876
0.4854776894 0.0556156546 0.0018883350
0.1551301236 0.0840417766 0.0647298435
0.1577377461 0.0836862941 -0.0531005777
0.0604932435 -0.0462306389 0.1564904792
0.0672354741 -0.0471497693 -0.1481701357
-0.4627754724 -0.1296272614 -0.0072440503
-0.4810412106 -0.1296147700 -0.0076483142
-0.3141631688 -0.0519420646 -0.1629438384
-0.3211862167 -0.0509846519 0.1544060452
-0.0056201796 -0.0521530683 -0.1561150531
-0.0126432275 -0.0511956556 0.1612348304
0.1840276406 0.0117837702 -0.0820167407
0.1801054682 0.0123184580 0.0952141411
0.4097561222 -0.0500604351 -0.0115859640
0.4087204659 -0.0499192499 0.0352121495
0.3737897086 0.0089154142 -0.0509774966
0.3710545115 0.0092882883 0.0726176284
0.4406114456 -0.0335131356 0.0526634179
0.4423900883 -0.0337556080 -0.0277079617
-0.4704867915 -0.0214999710 0.0032644846
-0.4699999289 -0.0215663422 -0.0187353365
0.4447786801 -0.0497483339 -0.0106628833
0.4437496138 -0.0496080470 0.0358374535
-0.4945233500 0.0158340444 -0.1321838825
-0.5000000000 0.0165806454 0.1152890456
0.3135477644 0.0280956264 -0.0348643807
0.3115869253 0.0283629366 0.0537398936
0.1537525480 -0.0661014129 0.0062082482
0.4911129592 -0.0154213306 0.0692783543
0.4935795720 -0.0157575901 -0.0421802762
-0.4639619235 -0.1179814088 0.0467228695
-0.4615717673 -0.1183072454 -0.0612809230
-0.4822276618 -0.1179689174 0.0463186055
-0.4798375055 -0.1182947539 -0.0616851869
0.4992084635 -0.0405965929 -0.0053999649
0.4983601549 -0.0404809478 0.0329324848
0.1805494454 -0.0567012710 0.0730214002
0.1834801811 -0.0571008018 -0.0594095123
0.4473146809 -0.0515732450 0.0367982203
0.4483824977 -0.0517188144 -0.0114531269
0.2277572242 0.0825387843 0.0276291983
0.3763148432 0.0824371901 0.0309171294
-0.4896771704 -0.0431891565 0.1360236525
-0.4833013305 -0.0440583390 -0.1520808965
-0.4865677997 -0.1483083956 -0.0077142225
-0.2172089514 -0.1581401961 0.0042212970
-0.4811847597 -0.1579596706 -0.0016211112
0.4986343762 0.0486516070 0.0232965458
0.4990680325 0.0485924891 0.0037009564
0.2297181253 0.0463821784 -0.0620868248
0.3782757443 0.0462805841 -0.0587988937
0.4846620569 -0.0470165582 0.0355695650
0.4856395412 -0.0471498131 -0.0085999357
0.0953042592 0.0956552050 0.0717631011
0.0982831429 0.0952491105 -0.0628434681
-0.4984766451 -0.1103350786 0.0425381645
-0.4962368265 -0.1106404205 -0.0586723365
0.0985498241 -0.0740998901 -0.0801255885
0.0947835350 -0.0735864530 0.0900614081
0.1553247025 0.0097453872 -0.0624823459
0.1522945384 0.0101584725 0.0744414288
0.4427223217 0.0080491331 -0.0414274338
0.4403420039 0.0083736284 0.0661317907
0.4418164187 0.0554306515 0.0009677645
0.4413188127 0.0554984873 0.0234530454
0.2890209898 -0.0205979971 0.0813428257
0.2922184767 -0.0210338925 -0.0631417491
0.4937625987 -0.0410240597 0.0136571166
-0.4599121870 -0.0382433076 -0.1337913413
-0.4655010344 -0.0374814114 0.1187514436
-0.4781779252 -0.0382308162 -0.1341956052
-0.4837667726 -0.0374689199 0.1183471797
0.4940275231 0.0450890083 0.0043479381
0.4936269322 0.0451436186 0.0224494018
0.1549017563 -0.0434723610 -0.0450168751
0.1526375504 -0.0431636945 0.0572956092
0.4432292072 0.0312953435 0.0618506772
0.4454203674 0.0309966349 -0.0371610999
0.0990787520 -0.0954836333 0.1146254283
0.1039245829 -0.0961442383 -0.1043427273
0.3403100211 0.0420716559 -0.0187193740
0.3390390781 0.0422449165 0.0387106232
0.3391716751 -0.0419515110 0.0301179333
0.3400511232 -0.0420714012 -0.0096216158
0.1547414632 0.0583394686 -0.0346284980
0.1529505689 0.0585836112 0.0462964945
0.4422641417 0.0462213456 -0.0195461355
0.4408573403 0.0464131270 0.0440228833
-0.4702451149 -0.0238719042 -0.0077284090
0.0619153141 0.1327126223 0.0977666780
0.0660821895 0.1321445756 -0.0905215727
0.2019439951 -0.0582035991 0.0072509125
0.0508052859 0.0707205186 0.1205353011
0.0559820033 0.0700148058 -0.1133845964
0.2494625586 0.0580769795 0.0197207991
0.2499832292 0.0580059994 -0.0038067000
-0.4890211824 -0.0978430548 0.1046955796
-0.4840391915 -0.0985222216 -0.1204252283
0.0966382405 -0.1117371737 0.0050819700
0.4104019340 0.0312021147 -0.0382545450
0.4081967122 0.0315027402 0.0613926287
0.2905803421 -0.0733182060 0.0092580606
0.1226015236 -0.0811012948 -0.0317405178
0.1209512445 -0.0808763215 0.0428305086
-0.3140857871 0.0511956546 -0.1632532821
-0.3211088350 0.0521530674 0.1540966015
-0.0055427980 0.0509846510 -0.1564244968
-0.0125658459 0.0519420637 0.1609253868
0.1023616431 0.1468406578 -0.0262168534
0.1010059365 0.1470254737 0.0350433482
0.0563259678 0.0165393734 -0.1305781880
0.0503811598 0.0173497957 0.1380493579
-0.4993800655 -0.0797925057 0.0843008795
-0.4952877556 -0.0803503874 -0.1006179867
0.4946460156 0.0241814171 -0.0242432531
0.4929772198 0.0244089146 0.0511644837
0.3132446136 0.0439518603 -0.0206772636
0.3119137815 0.0441332851 0.0394589360
0.0988073790 0.0768569730 0.1322119753
0.1044544819 0.0760871352 -0.1229631970
0.1296553104 0.1275650875 -0.0214592618
0.1284807793 0.1277252047 0.0316141795
0.3399055155 0.0503940169 -0.0001855618
0.3394559646 0.0504553016 0.0201282564
0.4994581872 0.0405668178 -0.0141752762
0.4982322596 0.0407339417 0.0412206131
-0.4850750764 -0.0375137615 -0.1321778586
-0.4905678182 -0.0367649668 0.1160222107
0.4471536808 0.0506571814 0.0472314763
0.4486968279 0.0504468128 -0.0224985830
-0.4649260252 -0.0853873589 0.0912907179
-0.4605589774 -0.0859826941 -0.1060427076
-0.4831917634 -0.0853748675 0.0908864539
-0.4788247156 -0.0859702026 -0.1064469715
-0.4878891224 -0.1273258740 -0.0078067659
-0.4821176042 0.0733805574 0.0426134466
-0.4798659515 0.0730736022 -0.0591317941
0.2138649250 0.0111551447 -0.0753907876
0.2102065754 0.0116538670 0.0899187538
0.4928405303 0.0072050541 0.0568088994
0.4947568645 0.0069438111 -0.0297843342
-0.4856460214 0.1512887446 -0.0401053630
-0.4870398751 0.1514787609 0.0228785878
0.4410040664 -0.0467887524 0.0345135456
0.4419776060 -0.0469214696 -0.0094777086
-0.4988142980 0.1041008021 0.0644201216
-0.4955774806 0.1036595450 -0.0818416764
0.4414873291 -0.0515294599 0.0125319429
0.4450815985 0.0487131808 -0.0213071769
0.4435944887 0.0489159101 0.0458907325
0.1223282884 0.0924102126 -0.0140336539
0.1214847366 0.0925252093 0.0240838515
0.4928689028 -0.0108079631 0.0549703674
0.4947014711 -0.0110577868 -0.0278377477
0.4488349688 -0.0372787792 -0.0314508115
0.4468839449 -0.0370128071 0.0567099434
0.2507868495 0.0308355230 -0.0409559841
0.2486183361 0.0311311443 0.0570324480
0.3404237583 -0.0301765859 -0.0260907380
0.3388169632 -0.0299575406 0.0465153821
0.3133637284 -0.0317070008 -0.0283969882
0.3116811728 -0.0314776274 0.0476325146
0.4851472755 -0.0517795586 0.0134989051
-0.4793530542 0.0462490294 -0.0831347395
-0.4826706209 0.0467012947 0.0667758708
0.1233008313 -0.0587843093 -0.0626475572
0.1202855409 -0.0583732516 0.0736041231
0.1262584831 -0.0363118855 0.1269549253
0.1316310407 -0.0370442961 -0.1158143904
-0.4700805208 0.0296275489 -0.0135121292
-0.4703293818 0.0296614747 -0.0022668675
0.2136532367 0.0440630249 -0.0648093090
0.2104675837 0.0444973071 0.0791405261
-0.4843919368 0.1254908782 -0.0975654277
-0.4883324055 0.1260280601 0.0804922037
-0.4906528589 0.0172279240 0.1215329121
-0.4849090471 0.0164449024 -0.1380122370
0.1307121018 0.1058270335 -0.0698796449
0.1273916115 0.1062796973 0.0801630775
0.4476598604 0.0606248424 0.0246689026
0.4482057072 0.0605504302 0.0000037709
0.2295048722 -0.0501354117 -0.0554337832
0.3780624912 -0.0502370060 -0.0521458522
0.4080160512 0.0087678736 0.0688528972
0.4105484236 0.0084226494 -0.0455772085
0.4840327115 -0.0140978916 0.0650222515
0.4863181489 -0.0144094525 -0.0382496187
0.1828005102 -0.0787932382 -0.0293704232
0.1811964531 -0.0785745661 0.0431119728
-0.2170888895 0.0018836251 0.0037411782
-0.4810646978 0.0020641506 -0.0021012300
0.4467746982 0.0323745459 0.0637900146
0.4490483017 0.0320645983 -0.0389471159
0.1523393741 -0.0183266393 0.0715354685
0.1552371371 -0.0187216751 -0.0594055123
0.2131607497 0.0698212580 -0.0417615105
0.2109986175 0.0701160094 0.0559385815
0.2299577013 -0.0029580013 -0.0744360846
0.3785153203 -0.0030595956 -0.0711481535
0.1268112078 -0.0823645832 0.1005583381
0.1310093294 -0.0829368896 -0.0891418352
0.2028190043 0.0519031791 -0.0288821614
0.2012343687 0.0521192035 0.0427226324
0.3125097499 -0.0485204418 0.0096685526
-0.2136845661 0.0508738946 -0.1485616043
-0.2204190095 0.0517919635 0.1557471309
-0.4776603744 0.0510544201 -0.1544040126
-0.4843948178 0.0519724890 0.1499047226
0.4913667056 -0.0365644915 0.0571600993
0.4932941544 -0.0368272498 -0.0299353702
0.1801635474 -0.0245489545 0.0914507920
0.1839142506 -0.0250602668 -0.0780319210
0.3136780482 0.0078419588 -0.0413767777
0.3114262796 0.0081489297 0.0603737056
0.2504516330 0.0483690807 -0.0252682266
0.2489797913 0.0485697286 0.0412397638
0.3729339281 -0.0542516744 -0.0142628263
0.3718153414 -0.0540991837 0.0362826592
0.4080535368 -0.0150382627 0.0664236054
0.4104752502 -0.0153684013 -0.0430061596
0.1201167169 0.0488634632 0.0845455695
0.1236305183 0.0483844464 -0.0742322834
0.0608918855 0.0833378881 0.1424823157
0.0670313225 0.0825009331 -0.1349399162
0.3734079652 -0.0391212741 -0.0352135887
0.3713640796 -0.0388426426 0.0571433002
0.0532416110 -0.1322633149 0.0041835149
0.0520347252 -0.1204185372 0.0590798740
0.0544660450 -0.1207499854 -0.0507839739
0.3114596176 -0.0130197744 0.0582133097
0.3136129556 -0.0133133269 -0.0390893973
0.2896953768 0.0642635359 0.0534943483
0.2916715768 0.0639941317 -0.0358040391
0.4987812391 -0.0446153212 0.0137790150
0.2024962299 -0.0530114420 -0.0175401149
0.2013996868 -0.0528619564 0.0320092868
0.4923158801 -0.0560885977 0.0136705484
-0.4728708671 0.0522935104 -0.0184646628
-0.4733330640 0.0523565191 0.0024205930
0.1585869643 0.0129320752 -0.0936567998
0.1541749011 0.0135335470 0.1057107336
0.2265716596 -0.0409743071 0.0773797643
0.3751292786 -0.0410759014 0.0806676953
-0.4696274247 0.0059283790 -0.0347165185
-0.4708179433 0.0060906757 0.0190793457
0.4980179792 -0.0289134799 0.0487503338
0.4995679250 -0.0291247753 -0.0212869386
0.0637812958 -0.1573926698 0.0044925740
0.4442604261 -0.0546220705 0.0126026425
0.2032575446 -0.0162809058 -0.0508034315
0.2006936149 -0.0159313797 0.0650526468
0.2484775297 -0.0146340156 0.0619803610
0.2508589613 -0.0149586628 -0.0456291919
0.1048297026 0.0177522088 -0.1417191809
0.0983447119 0.0186362711 0.1513175556
0.0623500111 -0.1433450851 0.0695959451
0.0652333878 -0.1437381597 -0.0606949600
0.2119668546 -0.0804149329 0.0075397307
0.2285325607 -0.0771309131 -0.0123362588
0.3770901797 -0.0772325074 -0.0090483278
-0.4860145904 0.1085550305 -0.0852146729
-0.4894093330 0.1090178167 0.0681832791
0.1543766499 -0.0602320412 -0.0218090061
0.1531373801 -0.0600630985 0.0341897760
0.4466270515 -0.0156101456 0.0689784065
0.4491239222 -0.0159505299 -0.0438474800
-0.4857107162 -0.0844334005 -0.1049077119
-0.4900027158 -0.0838482963 0.0890345201
0.1237473816 -0.0258214186 -0.0818053807
0.1198885440 -0.0252953650 0.0925635951
0.0516682204 0.1123501226 0.0828319077
0.0551817201 0.1118711469 -0.0759323146
0.4978098678 0.0294542557 0.0599568843
0.4998635686 0.0291742862 -0.0328435240
0.1230873216 0.0767969480 -0.0488112624
0.1207024326 0.0771220665 0.0589545184
-0.4608681630 0.1103808952 -0.0860053957
-0.4643222842 0.1108517762 0.0700756914
-0.4791339013 0.1103933866 -0.0864096597
-0.4825880224 0.1108642676 0.0696714275
-0.4867061022 -0.1162023239 -0.0609151101
-0.4890551877 -0.1158820863 0.0452328210
0.2127203614 -0.0733297276 -0.0262868198
0.2112241557 -0.0731257582 0.0413221053
0.4839973064 0.0083675013 0.0673161129
0.4863872538 0.0080416932 -0.0406782430
-0.4893001501 0.0793391358 0.1227748738
-0.4834944304 0.0785476747 -0.1395676980
-0.3197049480 0.1354114874 0.0932378048
-0.3153644570 0.1348197726 -0.1028956018
-0.0111619589 0.1352004837 0.1000665901
-0.0068214679 0.1346087689 -0.0960668165
0.2893499797 -0.0480079430 0.0656312258
0.2918484514 -0.0483485456 -0.0472670078
0.4859272628 0.0463672882 -0.0187103779
0.4845147069 0.0465598540 0.0451186713
0.1559854690 0.1008830362 0.0266034051
0.1569078210 0.1007572971 -0.0150748376
0.1525106936 0.0373629927 0.0655155516
0.1551493860 0.0370032745 -0.0537188235
0.4995460580 0.0457792753 -0.0179844559
0.4981522043 0.0459692916 0.0449994948
-0.4831086505 0.0185740180 -0.1588514127
-0.4897758307 0.0194829173 0.1424179039
-0.3199075371 -0.1346083517 0.0940479442
-0.3155670462 -0.1352000664 -0.1020854624
-0.0113645480 -0.1348193553 0.1008767295
-0.0070240570 -0.1354110701 -0.0952566771
0.2133543361 -0.0530952883 -0.0543062813
0.2106206704 -0.0527226230 0.0692196421
0.0647560694 0.1594224675 -0.0297610174
0.0632820929 0.1596234065 0.0368434358
0.4999318379 -0.0141943814 -0.0372681706
0.4976765423 -0.0138869296 0.0646416861
-0.4706832403 -0.0148610949 0.0123457087
-0.4697935593 -0.0149823801 -0.0278562330
0.2102607548 -0.0227345269 0.0864082093
0.2137591721 -0.0232114465 -0.0716744820
0.2288776160 0.0790390939 -0.0231012691
0.3774352350 0.0789374996 -0.0198133380
0.3128210920 0.0526627988 -0.0012722497
0.3123503096 0.0527269779 0.0200009545
0.3723705920 -0.0595482543 0.0110265607
-0.3175107982 0.1669872021 -0.0049241556
-0.0089678091 0.1667761984 0.0019046297
-0.4702248170 0.0031820565 -0.0078095789
0.4978138973 -0.0119106980 0.0584966796
0.4997974761 -0.0121811081 -0.0311351338
0.0942130295 0.0151095515 0.1185790207
0.0992532967 0.0144224401 -0.1091751182
0.3385735616 0.0078812193 0.0586821061
0.3407238600 0.0075880812 -0.0384832462
0.0504691827 -0.0385325219 0.1323455262
0.0561541125 -0.0393075165 -0.1245389259
-0.4698565564 0.0250207842 -0.0237737912
-0.4705602124 0.0251167097 0.0080222518
0.5000000000 0.0079590129 -0.0396633975
0.4976416330 0.0082805158 0.0669039373
-0.4792427572 -0.0238107944 -0.0902830438
-0.4828860290 -0.0233141276 0.0743451762
0.1541714739 0.0700638578 -0.0085125687
0.1535380328 0.0701502113 0.0201106854
0.1584594694 -0.0285145915 -0.0891769007
0.1542401975 -0.0279394018 0.1014789887
-0.3177612125 -0.1667761984 -0.0039227667
-0.0092182234 -0.1669872021 0.0029060186
-0.4696618305 -0.0052563078 -0.0335075716
-0.4708003493 -0.0051010999 0.0179385833
0.1572065841 -0.0889602609 -0.0344358731
0.1554021387 -0.0887142710 0.0471014489
0.1317934684 0.0157327788 -0.1215225469
0.1261752890 0.0164986737 0.1323456586
-0.4655875411 0.0174556650 0.1243575585
-0.4597432915 0.0166589512 -0.1397260629
-0.4838532793 0.0174681564 0.1239532945
-0.4780090297 0.0166714426 -0.1401303269
-0.4791326424 0.0119774740 -0.0941525044
-0.4829424225 0.0124968400 0.0779997131
0.1198288363 0.0126368756 0.0964334244
0.1238640067 0.0120867835 -0.0859034878
0.2501517975 -0.0490764963 -0.0147318329
0.2491333585 -0.0489376582 0.0312882867
0.4921332417 0.0598923568 0.0255063591
0.4926725218 0.0598188398 0.0011379555
0.0989616365 0.0597598786 -0.0945962319
0.0945726356 0.0603582065 0.1037291882
0.3716466696 0.0530001080 0.0472129842
0.3732632568 0.0527797278 -0.0258356068
-0.4739900550 -0.0303204852 0.0295505719
-0.4723380587 -0.0305456926 -0.0450980442
0.0976763591 -0.1019773335 -0.0415214664
0.0956149778 -0.1016963170 0.0516259985
0.1579712041 -0.0645575797 -0.0682294511
0.1546742888 -0.0641081297 0.0807479859
-0.4724550262 0.0437378033 -0.0375178402
-0.4737616799 0.0439159320 0.0215258128
-0.4731765394 -0.0470549753 -0.0077233413
-0.4696962722 0.0166373180 -0.0312749059
-0.4707330423 0.0167786551 0.0155735360
0.4930574314 -0.0265185109 0.0459666899
0.4944894090 -0.0267137244 -0.0187399615
0.2006539064 0.0092732073 0.0676255839
0.2033350850 0.0089076973 -0.0535286116
0.4943880388 0.0376757239 -0.0121702030
0.4932553906 0.0378301315 0.0390106791
0.0664552114 -0.1047429529 -0.1146953353
0.0611869387 -0.1040247589 0.1233616652
0.2899015464 -0.0666565780 0.0401337270
0.2912689941 -0.0668429944 -0.0216570202
0.2505833945 -0.0353017475 -0.0338069219
0.2487225174 -0.0350480646 0.0502803745
-0.4740826108 0.0284342646 0.0355479687
-0.4721573896 0.0281718100 -0.0514468439
-0.2137587680 -0.0480257623 -0.1482648761
-0.2204932114 -0.0471076935 0.1560438591
-0.4777345763 -0.0478452369 -0.1541072844
-0.4844690197 -0.0469271680 0.1502014508
0.4440822947 0.0585200193 0.0241470942
0.4446083022 0.0584483116 0.0003784380
-0.4736253372 -0.0426493613 0.0126906827
-0.4727212002 -0.0427726172 -0.0281644803
0.2903436114 0.0770280554 0.0245997666
0.2910426034 0.0769327658 -0.0069855260
0.4917922578 -0.0509511586 0.0374879656
0.4928471268 -0.0510949630 -0.0101783135
0.1809546008 0.0749976780 0.0587847685
0.1832727324 0.0746816601 -0.0459644512
-0.4870950359 0.1307786857 -0.0357105299
-0.4882957642 0.1309423743 0.0185466783
-0.4742403367 0.0085859165 0.0420611524
-0.4720294532 0.0082845191 -0.0578418576
-0.4805825220 0.0878146042 -0.0262997163
-0.4813790397 0.0879231890 0.0096924607
0.4860536864 -0.0339327834 -0.0269037387
0.4842678505 -0.0336893304 0.0537926788
0.4987763959 -0.0510704742 0.0137983824
0.3129735487 -0.0441595225 -0.0111523859
0.3120526122 -0.0440339764 0.0304618978
0.4090552232 0.0589039362 0.0234494538
0.4095846881 0.0588317572 -0.0004754303
0.4982976025 -0.0463733798 0.0355767033
0.4992621390 -0.0465048697 -0.0080077293
0.4085643071 0.0492373186 0.0453316841
0.4100610233 0.0490332797 -0.0223003081
0.0973350666 0.1147524042 -0.0194041837
0.0962814042 0.1148960441 0.0282075728
0.0997487226 0.1222694518 0.0910827308
0.1035814699 0.1217469549 -0.0821073012
0.4991024486 0.0549041105 0.0023409642
0.4986094138 0.0549713232 0.0246196888
-0.4796643491 -0.0549331687 -0.0721960373
-0.4825112262 -0.0545450699 0.0564455627
0.2889714938 0.0108308877 0.0845503153
0.2923151416 0.0103750669 -0.0665388193
0.0554962619 -0.0878698094 -0.0963159898
0.0510540431 -0.0872642266 0.1044141863
0.1562978472 -0.0975042643 0.0063593157
0.4933735574 -0.0372055698 0.0313530445
0.4941573129 -0.0373124148 -0.0040624525
0.4083026752 -0.0357969079 0.0545254342
0.4101950166 -0.0360548802 -0.0309836408
0.4092345504 -0.0549641367 0.0118285414
0.2263320659 0.0083669238 0.0897298597
0.3748896849 0.0082653295 0.0930177907
-0.4948402128 0.0650987525 -0.1163449260
-0.4996092761 0.0657488922 0.0991543417
0.3386053889 -0.0123317555 0.0566195006
0.3406617117 -0.0126120825 -0.0362993893
0.4430496749 0.0087040186 0.0692643802
0.4455659671 0.0083609866 -0.0444391085
0.2267849135 0.0555443317 0.0707267195
0.3753425325 0.0554427374 0.0740146506
0.4998574170 0.0073040251 -0.0332413520
0.4977831808 0.0075867941 0.0604869870
0.4465884252 0.0089335039 0.0714820274
0.4491993890 0.0085775659 -0.0464993791
-0.2169688281 0.1619069219 0.0032610610
-0.4809446363 0.1620874474 -0.0025813473
0.3727487550 0.0633616721 -0.0022620533
0.3721769200 0.0634396272 0.0235774087
0.4454931870 -0.0152769823 -0.0418811012
0.4430869737 -0.0149489568 0.0668482597
-0.4966076479 0.1248498141 -0.0346411742
-0.4977525477 0.1250058918 0.0170933208
0.4996708406 -0.0334601620 -0.0260709044
0.4979085798 -0.0332199228 0.0535602277
0.2484406500 0.0087734664 0.0643699566
0.2509309539 0.0084339772 -0.0481592018
0.4997374239 0.0259630518 -0.0272431874
0.4979311686 0.0262092884 0.0543759182
-0.4619674850 0.1329935286 -0.0356363433
-0.4631892591 0.1331600862 0.0195718629
-0.4802332233 0.1330060200 -0.0360406072
-0.4814549974 0.1331725776 0.0191675989
0.0674392544 0.0190808065 -0.1553310114
0.0603888886 0.0200419434 0.1632532821
0.4916332103 0.0500465757 0.0477949037
0.4931576551 0.0498387567 -0.0210900571
0.2031799219 0.0330246091 -0.0457727285
0.2008452228 0.0333428856 0.0597251268
0.3737106272 -0.0167806334 -0.0481983681
0.3710949994 -0.0164240595 0.0699937888
0.1583317223 0.0526195146 -0.0808979667
0.1544896587 0.0531432815 0.0927130418
0.2023146724 0.0622760601 -0.0057745715
0.2017541609 0.0623524715 0.0195532180
0.1819926898 -0.0863881336 0.0068944140
-0.4811092793 -0.0833840577 -0.0077892940
-0.2151049633 -0.1278618129 -0.0899069990
-0.2192670795 -0.1272944150 0.0981662025
-0.4790807716 -0.1276812875 -0.0957494073
-0.4832428878 -0.1271138895 0.0923237942
0.1825349516 0.0898560110 -0.0121606482
0.1817149749 0.0899677938 0.0248915717
0.1014650824 -0.1445700051 0.0052878428
0.4862489465 0.0295404180 -0.0337648533
0.4841678420 0.0298241233 0.0602738444
0.1046422506 -0.0431701491 -0.1351320433
0.0984407109 -0.0423247280 0.1450964187
-0.2149106997 0.1310614555 -0.0906838454
-0.2190728159 0.1316288534 0.0973893561
-0.4788865079 0.1312419809 -0.0965262536
-0.4830486242 0.1318093789 0.0915469478
0.1217704245 -0.0889164267 0.0055693049
0.4425845524 0.0294607280 -0.0345410442
0.4405118477 0.0297432882 0.0591180932
-0.4973648090 -0.1212480859 -0.0080348018
0.1803853058 0.0475308330 0.0836583543
0.1838006766 0.0470652346 -0.0706717224
0.2496388957 -0.0538995678 0.0082934301
-0.4651706173 0.0699242901 0.1071410517
-0.4600813900 0.0692305043 -0.1228254417
-0.4834363556 0.0699367815 0.1067367878
-0.4783471282 0.0692429957 -0.1232297057
-0.4852414188 0.0681125950 -0.1213982951
-0.4902430354 0.0687944374 0.1046093420
0.4910747599 0.0088254296 0.0717535074
0.4936541665 0.0084737936 -0.0448019266
-0.3481448615 -0.1429107418 -0.0457640551
-0.3491968555 -0.1580499333 0.0013000929
-0.2826769064 -0.1505254689 -0.0207713790
-0.4146648106 -0.1504352062 -0.0236925832
-0.2816249124 -0.1353862773 -0.0678355270
-0.2826769064 -0.1505254689 -0.0207713790
-0.2494169319 -0.1467632367 -0.0318071150
-0.3481448615 -0.1429107418 -0.0457640551
-0.3470928674 -0.1277715502 -0.0928282031
-0.4136128165 -0.1352960146 -0.0707567312
-0.2816249124 -0.1353862773 -0.0678355270
-0.4146648106 -0.1504352062 -0.0236925832
-0.4136128165 -0.1352960146 -0.0707567312
-0.4468727911 -0.1390582468 -0.0597209952
-0.4811247287 -0.0779477600 -0.0018611706
-0.4801027502 -0.1028145237 -0.0488052889
-0.4800727347 -0.0628085684 -0.0489253186
-0.2171489205 -0.0781282855 0.0039812376
-0.2160969264 -0.0629890939 -0.0430829104
-0.2161269419 -0.1029950492 -0.0429628807
-0.3464197698 -0.0878535249 -0.1220071417
-0.3470928674 -0.1277715502 -0.0928282031
-0.2807623666 -0.1078576689 -0.1059570703
-0.4127502707 -0.1077674062 -0.1088782745
-0.2800892689 -0.0679396436 -0.1351360089
-0.2807623666 -0.1078576689 -0.1059570703
-0.2475971161 -0.0979007283 -0.1125215039
-0.3464197698 -0.0878535249 -0.1220071417
-0.3457466722 -0.0479354996 -0.1511860802
-0.4120771731 -0.0678493809 -0.1380572130
-0.2800892689 -0.0679396436 -0.1351360089
-0.4127502707 -0.1077674062 -0.1088782745
-0.4120771731 -0.0678493809 -0.1380572130
-0.4452424235 -0.0778063215 -0.1314927794
-0.4793996371 -0.0228905431 -0.0781042572
-0.4800727347 -0.0628085684 -0.0489253186
-0.4792402043 -0.0752859153 -0.0869268322
-0.2154238288 -0.0230710686 -0.0722618489
-0.2152643960 -0.0754664408 -0.0810844240
-0.2160969264 -0.0629890939 -0.0430829104
-0.3457095712 0.0015143289 -0.1513344443
-0.3457466722 -0.0479354996 -0.1511860802
-0.2797341696 -0.0232557167 -0.1497996602
-0.4117220738 -0.0231654540 -0.1527208644
-0.2796970687 0.0261941118 -0.1499480243
-0.2797341696 -0.0232557167 -0.1497996602
-0.2467279183 -0.0109158253 -0.1491064502
-0.3457095712 0.0015143289 -0.1513344443
-0.3456724702 0.0509641574 -0.1514828085
-0.4116849728 0.0262843745 -0.1528692285
-0.2796970687 0.0261941118 -0.1499480243
-0.4117220738 -0.0231654540 -0.1527208644
-0.4116849728 0.0262843745 -0.1528692285
-0.4446912241 0.0139444830 -0.1535624385
-0.4793996371 -0.0228905431 -0.0781042572
-0.4785300057 0.0140819385 -0.1162541349
-0.4793625361 0.0265592853 -0.0782526213
-0.2154238288 -0.0230710686 -0.0722618489
-0.2153867278 0.0263787599 -0.0724102130
-0.2145541974 0.0139014130 -0.1104117266
-0.3462855370 0.0910579378 -0.1225439290
-0.3456724702 0.0509641574 -0.1514828085
-0.2799850516 0.0709659162 -0.1355527666
-0.4119729557 0.0710561789 -0.1384739708
-0.2805981183 0.1110596966 -0.1066138872
-0.2799850516 0.0709659162 -0.1355527666
-0.2471413422 0.0809667956 -0.1275877457
-0.3462855370 0.0910579378 -0.1225439290
-0.3468986038 0.1311517182 -0.0936050495
-0.4125860225 0.1111499594 -0.1095350913
-0.2805981183 0.1110596966 -0.1066138872
-0.4119729557 0.0710561789 -0.1384739708
-0.4125860225 0.1111499594 -0.1095350913
-0.4454297318 0.1011490799 -0.1175001122
-0.4793625361 0.0265592853 -0.0782526213
-0.4791245220 0.0789006331 -0.0873894375
-0.4799756029 0.0666530658 -0.0493137418
-0.2153867278 0.0263787599 -0.0724102130
-0.2159997946 0.0664725403 -0.0434713336
-0.2151487137 0.0787201077 -0.0815470292
-0.3479276680 0.1465744514 -0.0466325963
-0.3468986038 0.1311517182 -0.0936050495
-0.2814191838 0.1388179534 -0.0686582208
-0.4134070880 0.1389082162 -0.0715794250
-0.2824482480 0.1542406867 -0.0216857676
-0.2814191838 0.1388179534 -0.0686582208
-0.2486794739 0.1426510711 -0.0561848065
-0.3479276680 0.1465744514 -0.0466325963
-0.3489567322 0.1619971846 0.0003398569
-0.4144361522 0.1543309494 -0.0246069718
-0.2824482480 0.1542406867 -0.0216857676
-0.4134070880 0.1389082162 -0.0715794250
-0.4144361522 0.1543309494 -0.0246069718
-0.4471758622 0.1504978318 -0.0370803861
-0.4799756029 0.0666530658 -0.0493137418
-0.4804601196 0.1143702566 -0.0259475445
-0.4810046671 0.0820757990 -0.0023412886
-0.2159997946 0.0664725403 -0.0434713336
-0.2170288588 0.0818952735 0.0035011196
-0.2164843113 0.1141897311 -0.0201051363
-0.3500087261 0.1468581504 0.0474040044
-0.3489567322 0.1619971846 0.0003398569
-0.2834887771 0.1543825362 0.0253325327
-0.4154766812 0.1544727989 0.0224113286
-0.2845407710 0.1392435019 0.0723966803
-0.2834887771 0.1543825362 0.0253325327
-0.2507547995 0.1505752119 0.0378288706
-0.3500087261 0.1468581504 0.0474040044
-0.3510607200 0.1317191162 0.0944681519
-0.4165286752 0.1393337646 0.0694754761
-0.2845407710 0.1392435019 0.0723966803
-0.4154766812 0.1544727989 0.0224113286
-0.4165286752 0.1393337646 0.0694754761
-0.4492626527 0.1431410889 0.0569791382
-0.4820566610 0.0669367647 0.0447228589
-0.4810046671 0.0820757990 -0.0023412886
-0.4815006487 0.1145121061 0.0210707558
-0.2180808527 0.0667562393 0.0505652672
-0.2175248404 0.1143315806 0.0269131641
-0.2170288588 0.0818952735 0.0035011196
-0.3517338168 0.0918006712 0.1236470393
-0.3510607200 0.1317191162 0.0944681519
-0.2854033164 0.1117147623 0.1105181977
-0.4173912205 0.1118050250 0.1075969936
-0.2860764132 0.0717963174 0.1396970851
-0.2854033164 0.1117147623 0.1105181977
-0.2525746145 0.1017125854 0.1185432206
-0.3517338168 0.0918006712 0.1236470393
-0.3524069136 0.0518822262 0.1528259267
-0.4180643173 0.0718865801 0.1367758810
-0.2860764132 0.0717963174 0.1396970851
-0.4173912205 0.1118050250 0.1075969936
-0.4180643173 0.0718865801 0.1367758810
-0.4508930191 0.0818887570 0.1287508581
-0.4827297578 0.0270183198 0.0739017463
-0.4820566610 0.0669367647 0.0447228589
-0.4828891910 0.0794138493 0.0827243470
-0.2187539495 0.0268377943 0.0797441546
-0.2189133827 0.0792333239 0.0885667553
-0.2180808527 0.0667562393 0.0505652672
-0.3524440146 0.0024323978 0.1529742908
-0.3524069136 0.0518822262 0.1528259267
-0.2864315120 0.0271121806 0.1543607109
-0.4184194162 0.0272024434 0.1514395067
-0.2864686130 -0.0223376479 0.1545090750
-0.2864315120 0.0271121806 0.1543607109
-0.2534438112 0.0147271578 0.1551281029
-0.3524440146 0.0024323978 0.1529742908
-0.3524811156 -0.0470174307 0.1531226550
-0.4184565171 -0.0222473851 0.1515878708
-0.2864686130 -0.0223376479 0.1545090750
-0.4184194162 0.0272024434 0.1514395067
-0.4184565171 -0.0222473851 0.1515878708
-0.4514442179 -0.0098623623 0.1508204788
-0.4827668587 -0.0224315087 0.0740501104
-0.4827297578 0.0270183198 0.0739017463
-0.4835808383 0.0147704901 0.1119774165
-0.2187910505 -0.0226120342 0.0798925187
-0.2196050300 0.0145899647 0.1178198248
-0.2187539495 0.0268377943 0.0797441546
-0.3518680496 -0.0871107915 0.1241838266
-0.3524811156 -0.0470174307 0.1531226550
-0.2861806305 -0.0671092425 0.1401138429
-0.4181685347 -0.0670189797 0.1371926387
-0.2855675646 -0.1072026032 0.1111750146
-0.2861806305 -0.0671092425 0.1401138429
-0.2530303880 -0.0771551483 0.1336094368
-0.3518680496 -0.0871107915 0.1241838266
-0.3512549837 -0.1272041522 0.0952449983
-0.4175554687 -0.1071123405 0.1082538104
-0.2855675646 -0.1072026032 0.1111750146
-0.4181685347 -0.0670189797 0.1371926387
-0.4175554687 -0.1071123405 0.1082538104
-0.4507057112 -0.0970664346 0.1147582165
-0.4827668587 -0.0224315087 0.0740501104
-0.4830048733 -0.0747726991 0.0831869523
-0.4821537928 -0.0625248695 0.0451112821
-0.2187910505 -0.0226120342 0.0798925187
-0.2181779845 -0.0627053949 0.0509536904
-0.2190290650 -0.0749532246 0.0890293606
-0.3502259196 -0.1426270428 0.0482725456
-0.3512549837 -0.1272041522 0.0952449983
-0.2847464996 -0.1349607289 0.0732193740
-0.4167344037 -0.1348704661 0.0702981699
-0.2837174355 -0.1503836194 0.0262469213
-0.2847464996 -0.1349607289 0.0732193740
-0.2514922575 -0.1388390172 0.0622065619
-0.3502259196 -0.1426270428 0.0482725456
-0.3491968555 -0.1580499333 0.0013000929
-0.4157053396 -0.1502933567 0.0233257172
-0.2837174355 -0.1503836194 0.0262469213
-0.4167344037 -0.1348704661 0.0702981699
-0.4157053396 -0.1502933567 0.0233257172
-0.4489595817 -0.1464150684 0.0343385293
-0.4811247287 -0.0779477600 -0.0018611706
-0.4821537928 -0.0625248695 0.0451112821
-0.4821838083 -0.1025308248 0.0452313118
-0.2171489205 -0.0781282855 0.0039812376
-0.2182080000 -0.1027113502 0.0510737200
-0.2181779845 -0.0627053949 0.0509536904
-0.2121088943 -0.1458267403 0.0309408613
-0.3493383470 -0.1470675679 0.0116133194
-0.4186298305 -0.1410465603 0.0327324815
-0.3500151042 -0.1404261464 0.0423962525
-0.2127856515 -0.1391853188 0.0617237944
-0.0748794416 -0.1445859127 0.0502684032
-0.3500151042 -0.1404261464 0.0423962525
-0.2121088943 -0.1458267403 0.0309408613
-0.0741637993 -0.1516097051 0.0177167177
-0.0748794416 -0.1445859127 0.0502684032
-0.0059068941 -0.1474773951 0.0436563314
-0.1431363468 -0.1487182227 0.0243287895
-0.0059068941 -0.1474773951 0.0436563314
0.0289372008 -0.1524350324 0.0240744527
-0.0051912518 -0.1545011874 0.0111046458
-0.2113932520 -0.1528505327 -0.0016108242
-0.3493383470 -0.1470675679 0.0116133194
-0.2803657995 -0.1499590503 0.0050012476
-0.3489805258 -0.1505794641 -0.0046625234
-0.0741637993 -0.1516097051 0.0177167177
-0.0738059781 -0.1551216012 0.0014408749
-0.1431363468 -0.1487182227 0.0243287895
-0.2053601563 -0.1251223618 0.0254531922
-0.0766627155 -0.1227704495 0.0422665331
-0.0760592726 -0.1286928383 0.0148183536
-0.0117105523 -0.1275168822 0.0232250240
-0.2059635992 -0.1191999730 0.0529013717
-0.3346610399 -0.1215518853 0.0360880308
-0.0766627155 -0.1227704495 0.0422665331
-0.2053601563 -0.1251223618 0.0254531922
-0.3346610399 -0.1215518853 0.0360880308
-0.3987182561 -0.1255895734 0.0144219903
-0.3340678143 -0.1273748116 0.0091045709
-0.2047669307 -0.1309452882 -0.0015302677
-0.0760592726 -0.1286928383 0.0148183536
-0.3340678143 -0.1273748116 0.0091045709
-0.2133671877 -0.1195251557 0.0886066545
-0.3506442508 -0.1272753541 0.0712291491
-0.4198327166 -0.1125592044 0.0879623644
-0.3511941850 -0.1086841052 0.0966511171
-0.2139171218 -0.1009339068 0.1140286224
-0.0760901245 -0.1117749573 0.1059841598
-0.3511941850 -0.1086841052 0.0966511171
-0.2133671877 -0.1195251557 0.0886066545
-0.0755085883 -0.1314351204 0.0791012998
-0.0760901245 -0.1117749573 0.1059841598
-0.0071608248 -0.1177299397 0.1012314825
-0.1444378880 -0.1254801381 0.0838539771
-0.0071608248 -0.1177299397 0.1012314825
0.0275945932 -0.1305375124 0.0854137138
-0.0065792886 -0.1373901028 0.0743486224
-0.2127856515 -0.1391853188 0.0617237944
-0.3506442508 -0.1272753541 0.0712291491
-0.2817149512 -0.1332303365 0.0664764717
-0.3503534827 -0.1371054357 0.0577877191
-0.0755085883 -0.1314351204 0.0791012998
-0.0752178202 -0.1412652020 0.0656598697
-0.1444378880 -0.1254801381 0.0838539771
-0.2064456500 -0.1029029481 0.0751852959
-0.0776958035 -0.0950835873 0.0897997411
-0.0772054624 -0.1116607426 0.0671325849
-0.0128305391 -0.1077510623 0.0744398075
-0.2069359911 -0.0863257928 0.0978524521
-0.3356858376 -0.0941451535 0.0832380069
-0.0776958035 -0.0950835873 0.0897997411
-0.2064456500 -0.1029029481 0.0751852959
-0.3356858376 -0.0941451535 0.0832380069
-0.3998238805 -0.1060632811 0.0649804382
-0.3352037867 -0.1104421784 0.0609540827
-0.2059635992 -0.1191999730 0.0529013717
-0.0772054624 -0.1116607426 0.0671325849
-0.3352037867 -0.1104421784 0.0609540827
-0.2142639694 -0.0720368468 0.1305930294
-0.3516425759 -0.0849399508 0.1176443045
-0.4206598732 -0.0640645537 0.1268339785
-0.3519705699 -0.0576130017 0.1333083410
-0.2145919634 -0.0447098977 0.1462570659
-0.0768853629 -0.0591337428 0.1435417543
-0.3519705699 -0.0576130017 0.1333083410
-0.2142639694 -0.0720368468 0.1305930294
-0.0765385154 -0.0880308029 0.1269773473
-0.0768853629 -0.0591337428 0.1435417543
-0.0080226359 -0.0671307209 0.1417339133
-0.1454012424 -0.0800338248 0.1287851884
-0.0080226359 -0.0671307209 0.1417339133
0.0265821514 -0.0855777399 0.1325477892
-0.0076757883 -0.0960277809 0.1251695063
-0.2139171218 -0.1009339068 0.1140286224
-0.3516425759 -0.0849399508 0.1176443045
-0.2827798489 -0.0929369288 0.1158364635
-0.3514691521 -0.0993884808 0.1093621010
-0.0765385154 -0.0880308029 0.1269773473
-0.0763650916 -0.1024793329 0.1186951438
-0.1454012424 -0.0800338248 0.1287851884
-0.2072234957 -0.0623728190 0.1115828149
-0.0783771565 -0.0504526704 0.1219641706
-0.0780847263 -0.0748185228 0.1079985006
-0.0136615567 -0.0688584485 0.1131891784
-0.2075159258 -0.0380069666 0.1255484849
-0.3363622650 -0.0499271152 0.1151671293
-0.0783771565 -0.0504526704 0.1219641706
-0.2072234957 -0.0623728190 0.1115828149
-0.3363622650 -0.0499271152 0.1151671293
-0.4006441451 -0.0676572370 0.1032289236
-0.3360747604 -0.0738800890 0.1014367664
-0.2069359911 -0.0863257928 0.0978524521
-0.0780847263 -0.0748185228 0.1079985006
-0.3360747604 -0.0738800890 0.1014367664
-0.2146441409 -0.0115736066 0.1496384673
-0.3521606557 -0.0273813816 0.1428310599
-0.4209682432 -0.0039492322 0.1426244819
-0.3522099858 0.0039546553 0.1460281856
-0.2146934710 0.0197624303 0.1528355930
-0.0771276261 0.0042341684 0.1564458747
-0.3522099858 0.0039546553 0.1460281856
-0.2146441409 -0.0115736066 0.1496384673
-0.0770754487 -0.0289021227 0.1530644732
-0.0771276261 0.0042341684 0.1564458747
-0.0083432800 -0.0044300897 0.1581588776
-0.1458597948 -0.0202378647 0.1513514703
-0.0083432800 -0.0044300897 0.1581588776
0.0260749818 -0.0253303643 0.1573246784
-0.0082911026 -0.0375663808 0.1547774762
-0.2145919634 -0.0447098977 0.1462570659
-0.3521606557 -0.0273813816 0.1428310599
-0.2833763096 -0.0360456396 0.1445440629
-0.3521345669 -0.0439495271 0.1411403592
-0.0770754487 -0.0289021227 0.1530644732
-0.0770493600 -0.0454702683 0.1513737725
-0.1458597948 -0.0202378647 0.1513514703
-0.2075591792 -0.0105384284 0.1283515423
-0.0785890097 0.0034056836 0.1332004501
-0.0785449982 -0.0245354752 0.1303485342
-0.0140599135 -0.0175634191 0.1327729881
-0.2076031907 0.0174027304 0.1312034582
-0.3365733601 0.0034586183 0.1263545504
-0.0785890097 0.0034056836 0.1332004501
-0.2075591792 -0.0105384284 0.1283515423
-0.3365733601 0.0034586183 0.1263545504
-0.4010371973 -0.0170113965 0.1225529970
-0.3365301068 -0.0240099199 0.1235514930
-0.2075159258 -0.0380069666 0.1255484849
-0.0785449982 -0.0245354752 0.1303485342
-0.3365301068 -0.0240099199 0.1235514930
-0.2144419726 0.0514104027 0.1424501098
-0.3521089016 0.0354466600 0.1424340068
-0.4207045259 0.0573928979 0.1326044403
-0.3518710613 0.0653747693 0.1326124918
-0.2142041323 0.0813385120 0.1326285947
-0.0767750436 0.0673741454 0.1424662127
-0.3518710613 0.0653747693 0.1326124918
-0.2144419726 0.0514104027 0.1424501098
-0.0770265420 0.0357261730 0.1528516959
-0.0767750436 0.0673741454 0.1424662127
-0.0080673283 0.0595320306 0.1476670058
-0.1457342573 0.0435682879 0.1476509028
-0.0080673283 0.0595320306 0.1476670058
0.0261607802 0.0397869870 0.1554601439
-0.0083188267 0.0278840582 0.1580524890
-0.2146934710 0.0197624303 0.1528355930
-0.3521089016 0.0354466600 0.1424340068
-0.2834011863 0.0276045451 0.1476347999
-0.3522346509 0.0196226738 0.1476267484
-0.0770265420 0.0357261730 0.1528516959
-0.0771522912 0.0199021868 0.1580444375
-0.1457342573 0.0435682879 0.1476509028
-0.2073947288 0.0436370429 0.1225952048
-0.0782947214 0.0571787807 0.1215652530
-0.0785067845 0.0304934193 0.1303222814
-0.0139567808 0.0372642882 0.1298073055
-0.2071826657 0.0703224043 0.1138381764
-0.3362826731 0.0567806665 0.1148681283
-0.0782947214 0.0571787807 0.1215652530
-0.2073947288 0.0436370429 0.1225952048
-0.3362826731 0.0567806665 0.1148681283
-0.4009351071 0.0371181657 0.1196128434
-0.3364911349 0.0305463539 0.1234763816
-0.2076031907 0.0174027304 0.1312034582
-0.0785067845 0.0304934193 0.1303222814
-0.3364911349 0.0305463539 0.1234763816
-0.2136924180 0.1060258791 0.1102707759
-0.3514962840 0.0926825075 0.1165228249
-0.4199143448 0.1093552838 0.0985075143
-0.3510124117 0.1160269696 0.0953814898
-0.2132085457 0.1293703412 0.0891294408
-0.0758885519 0.1193692507 0.1040187270
-0.3510124117 0.1160269696 0.0953814898
-0.2136924180 0.1060258791 0.1102707759
-0.0764002662 0.0946818836 0.1263765458
-0.0758885519 0.1193692507 0.1040187270
-0.0072424761 0.1136972530 0.1120716119
-0.1450463421 0.1003538813 0.1183236608
-0.0072424761 0.1136972530 0.1120716119
0.0268247047 0.0985175705 0.1272769638
-0.0077541904 0.0890098859 0.1344294307
-0.2142041323 0.0813385120 0.1326285947
-0.3514962840 0.0926825075 0.1165228249
-0.2828502082 0.0870105097 0.1245757098
-0.3517521412 0.0803388239 0.1277017343
-0.0764002662 0.0946818836 0.1263765458
-0.0766561234 0.0823382001 0.1375554552
-0.1450463421 0.1003538813 0.1183236608
-0.2067584991 0.0907861474 0.0953054963
-0.0775451394 0.1015681350 0.0890687020
-0.0779766066 0.0807533330 0.1079203987
-0.0133699267 0.0861443268 0.1048020016
-0.2063270319 0.1116009494 0.0764537996
-0.3355403917 0.1008189618 0.0826905939
-0.0775451394 0.1015681350 0.0890687020
-0.2067584991 0.0907861474 0.0953054963
-0.3355403917 0.1008189618 0.0826905939
-0.4003555045 0.0853716259 0.0949158228
-0.3359645582 0.0803552187 0.1012232740
-0.2071826657 0.0703224043 0.1138381764
-0.0779766066 0.0807533330 0.1079203987
-0.3359645582 0.0803552187 0.1012232740
-0.2125251563 0.1428257333 0.0586678197
-0.3504287809 0.1344268967 0.0695800117
-0.4187343280 0.1429528288 0.0462292997
-0.3497825157 0.1471522471 0.0407732038
-0.2118788911 0.1555510837 0.0298610118
-0.0746215317 0.1512245699 0.0477556278
-0.3497825157 0.1471522471 0.0407732038
-0.2125251563 0.1428257333 0.0586678197
-0.0753049211 0.1377691778 0.0782172489
-0.0746215317 0.1512245699 0.0477556278
-0.0060114141 0.1486962921 0.0575303423
-0.1439150387 0.1402974556 0.0684425343
-0.0060114141 0.1486962921 0.0575303423
0.0279519500 0.1407044572 0.0776485102
-0.0066948035 0.1352409001 0.0879919635
-0.2132085457 0.1293703412 0.0891294408
-0.3504287809 0.1344268967 0.0695800117
-0.2818186633 0.1318986190 0.0793547263
-0.3507704756 0.1276992007 0.0848108223
-0.0753049211 0.1377691778 0.0782172489
-0.0756466158 0.1310414818 0.0934480594
-0.1439150387 0.1402974556 0.0684425343
-0.2057605194 0.1227551044 0.0512018853
-0.0764699089 0.1288985923 0.0413313684
-0.0770461495 0.1175526135 0.0670168965
-0.0124008443 0.1206243575 0.0620816381
-0.2051842788 0.1341010832 0.0255163572
-0.3344748893 0.1279575953 0.0353868741
-0.0764699089 0.1288985923 0.0413313684
-0.2057605194 0.1227551044 0.0512018853
-0.3344748893 0.1279575953 0.0353868741
-0.3993985867 0.1194046857 0.0527312828
-0.3350414018 0.1168034403 0.0606387884
-0.2063270319 0.1116009494 0.0764537996
-0.0770461495 0.1175526135 0.0670168965
-0.3350414018 0.1168034403 0.0606387884
-0.2111419028 0.1554506142 -0.0034412148
-0.3490908889 0.1534646875 0.0097186865
-0.4173684552 0.1523767161 -0.0151933382
-0.3483939621 0.1533696794 -0.0217732889
-0.2104449760 0.1553556061 -0.0349331902
-0.0731929167 0.1574365409 -0.0166011161
-0.3483939621 0.1533696794 -0.0217732889
-0.2111419028 0.1554506142 -0.0034412148
-0.0739299049 0.1575370103 0.0167011105
-0.0731929167 0.1574365409 -0.0166011161
-0.0045869178 0.1584797389 -0.0065299534
-0.1425359039 0.1564938123 0.0066299479
-0.0045869178 0.1584797389 -0.0065299534
0.0293475876 0.1590515727 0.0151567412
-0.0053239060 0.1585802084 0.0267722732
-0.2118788911 0.1555510837 0.0298610118
-0.3490908889 0.1534646875 0.0097186865
-0.2804848900 0.1545078856 0.0197898491
-0.3494593831 0.1535149223 0.0263697998
-0.0739299049 0.1575370103 0.0167011105
-0.0742983991 0.1575872451 0.0333522238
-0.1425359039 0.1564938123 0.0066299479
-0.2045733917 0.1340178044 -0.0020877458
-0.0752549351 0.1344452290 -0.0133930491
-0.0758763451 0.1345299423 0.0146865529
-0.0112171167 0.1347436546 0.0090339012
-0.2039519817 0.1339330911 -0.0301673478
-0.3332704384 0.1335056665 -0.0188620445
-0.0752549351 0.1344452290 -0.0133930491
-0.2045733917 0.1340178044 -0.0020877458
-0.3332704384 0.1335056665 -0.0188620445
-0.3982298488 0.1333328764 0.0003549092
-0.3338813254 0.1335889453 0.0087420585
-0.2051842788 0.1341010832 0.0255163572
-0.0758763451 0.1345299423 0.0146865529
-0.3338813254 0.1335889453 0.0087420585
-0.2097819159 0.1417166601 -0.0653134678
-0.3477139687 0.1465027024 -0.0527094154
-0.4160529527 0.1359967903 -0.0751374215
-0.3470869264 0.1336037691 -0.0814394478
-0.2091548737 0.1288177269 -0.0940435002
-0.0718498632 0.1369306178 -0.0779175202
-0.3470869264 0.1336037691 -0.0814394478
-0.2097819159 0.1417166601 -0.0653134678
-0.0725129233 0.1505695638 -0.0475372426
-0.0718498632 0.1369306178 -0.0779175202
-0.0032153669 0.1413570697 -0.0690294076
-0.1411474196 0.1461431120 -0.0564253552
-0.0032153669 0.1413570697 -0.0690294076
0.0307703513 0.1503897686 -0.0493952125
-0.0038784269 0.1549960157 -0.0386491300
-0.2104449760 0.1553556061 -0.0349331902
-0.3477139687 0.1465027024 -0.0527094154
-0.2790794723 0.1509291542 -0.0438213028
-0.3480454987 0.1533221754 -0.0375192766
-0.0725129233 0.1505695638 -0.0475372426
-0.0728444533 0.1573890368 -0.0323471038
-0.1411474196 0.1461431120 -0.0564253552
-0.2034023207 0.1226267744 -0.0553518741
-0.0741103003 0.1172489606 -0.0656420944
-0.0746693996 0.1287497140 -0.0400251133
-0.0100233894 0.1260608071 -0.0451702234
-0.2028432214 0.1111260211 -0.0809688552
-0.3321352419 0.1165038348 -0.0706786349
-0.0741103003 0.1172489606 -0.0656420944
-0.2034023207 0.1226267744 -0.0553518741
-0.3321352419 0.1165038348 -0.0706786349
-0.3970513634 0.1247486817 -0.0531574891
-0.3326849029 0.1278101515 -0.0454941087
-0.2039519817 0.1339330911 -0.0301673478
-0.0746693996 0.1287497140 -0.0400251133
-0.3326849029 0.1278101515 -0.0454941087
-0.2086803072 0.1039959056 -0.1162526719
-0.3465361220 0.1147433919 -0.1069090498
-0.4150152762 0.0966455333 -0.1232383739
-0.3460873688 0.0912717901 -0.1279101850
-0.2082315540 0.0805243039 -0.1372538071
-0.0708244923 0.0932484194 -0.1255962941
-0.3460873688 0.0912717901 -0.1279101850
-0.2086803072 0.1039959056 -0.1162526719
-0.0712990588 0.1180702406 -0.1033871223
-0.0708244923 0.0932484194 -0.1255962941
-0.0021338682 0.1002855869 -0.1191635193
-0.1399896830 0.1110330731 -0.1098198971
-0.0021338682 0.1002855869 -0.1191635193
0.0319741607 0.1162150812 -0.1048425460
-0.0026084347 0.1251074081 -0.0969543475
-0.2091548737 0.1288177269 -0.0940435002
-0.3465361220 0.1147433919 -0.1069090498
-0.2778454978 0.1217805594 -0.1004762750
-0.3467734052 0.1271543025 -0.0958044639
-0.0712990588 0.1180702406 -0.1033871223
-0.0715363421 0.1304811512 -0.0922825364
-0.1399896830 0.1110330731 -0.1098198971
-0.2024498349 0.0905508256 -0.0993788782
-0.0732339158 0.0802828157 -0.1063817373
-0.0736340574 0.1012109862 -0.0876555964
-0.0090260978 0.0960769813 -0.0911570260
-0.2020496934 0.0696226550 -0.1181050191
-0.3312656125 0.0798906649 -0.1111021600
-0.0732339158 0.0802828157 -0.1063817373
-0.2024498349 0.0905508256 -0.0993788782
-0.3312656125 0.0798906649 -0.1111021600
-0.3960668877 0.0951357801 -0.0985537778
-0.3316589990 0.1004658604 -0.0926921370
-0.2028432214 0.1111260211 -0.0809688552
-0.0736340574 0.1012109862 -0.0876555964
-0.3316589990 0.1004658604 -0.0926921370
-0.2080275880 0.0488142406 -0.1474493547
-0.3457610092 0.0636809576 -0.1435085264
-0.4144348299 0.0411274878 -0.1511799695
-0.3455681193 0.0336941293 -0.1531503837
-0.2078346981 0.0188274123 -0.1570912121
-0.0702941668 0.0339475236 -0.1513901831
-0.3455681193 0.0336941293 -0.1531503837
-0.2080275880 0.0488142406 -0.1474493547
-0.0704981328 0.0656575869 -0.1411946355
-0.0702941668 0.0339475236 -0.1513901831
-0.0015294392 0.0423691967 -0.1482628235
-0.1392628604 0.0572359137 -0.1443219951
-0.0015294392 0.0423691967 -0.1482628235
0.0327509417 0.0624350649 -0.1416013698
-0.0017334051 0.0740792600 -0.1380672758
-0.2082315540 0.0805243039 -0.1372538071
-0.3457610092 0.0636809576 -0.1435085264
-0.2769962816 0.0721026308 -0.1403811667
-0.3458629922 0.0795359893 -0.1384107526
-0.0704981328 0.0656575869 -0.1411946355
-0.0706001157 0.0815126185 -0.1360968616
-0.1392628604 0.0572359137 -0.1443219951
-0.2018806441 0.0433368785 -0.1265553297
-0.0727773382 0.0299381260 -0.1285667589
-0.0729493204 0.0566758421 -0.1199699631
-0.0083976675 0.0499764659 -0.1209756776
-0.2017086619 0.0165991623 -0.1351521255
-0.3308119678 0.0299979149 -0.1331406963
-0.0727773382 0.0299381260 -0.1285667589
-0.2018806441 0.0433368785 -0.1265553297
-0.3308119678 0.0299979149 -0.1331406963
-0.3954466789 0.0496142096 -0.1279830690
-0.3309810171 0.0562836914 -0.1246903857
-0.2020496934 0.0696226550 -0.1181050191
-0.0729493204 0.0566758421 -0.1199699631
-0.3309810171 0.0562836914 -0.1246903857
-0.2079365882 -0.0142878757 -0.1535107742
-0.3455226194 0.0021430712 -0.1561810935
-0.4144119750 -0.0209576339 -0.1541309950
-0.3456189594 -0.0291731073 -0.1527958353
-0.2080329282 -0.0456040542 -0.1501255161
-0.0703505570 -0.0307188225 -0.1508404549
-0.3456189594 -0.0291731073 -0.1527958353
-0.2079365882 -0.0142878757 -0.1535107742
-0.0702486669 0.0023964654 -0.1544208928
-0.0703505570 -0.0307188225 -0.1508404549
-0.0015065964 -0.0223766520 -0.1512955143
-0.1390926276 -0.0059457051 -0.1539658335
-0.0015065964 -0.0223766520 -0.1512955143
0.0329663290 -0.0016479227 -0.1533132628
-0.0014047062 0.0107386360 -0.1548759521
-0.2078346981 0.0188274123 -0.1570912121
-0.3455226194 0.0021430712 -0.1561810935
-0.2766786587 0.0104852417 -0.1566361528
-0.3454716743 0.0187007151 -0.1579713124
-0.0702486669 0.0023964654 -0.1544208928
-0.0701977218 0.0189541094 -0.1562111118
-0.1390926276 -0.0059457051 -0.1539658335
-0.2017931096 -0.0108519671 -0.1321847647
-0.0728194985 -0.0250797418 -0.1283618453
-0.0727335709 0.0028437032 -0.1313814763
-0.0082467654 -0.0042701842 -0.1294700166
-0.2018790372 -0.0387754120 -0.1291651336
-0.3308526483 -0.0245476373 -0.1329880530
-0.0728194985 -0.0250797418 -0.1283618453
-0.2017931096 -0.0108519671 -0.1321847647
-0.3308526483 -0.0245476373 -0.1329880530
-0.3952979699 -0.0039443430 -0.1363570580
-0.3307682006 0.0029034921 -0.1359554138
-0.2017086619 0.0165991623 -0.1351521255
-0.0727335709 0.0028437032 -0.1313814763
-0.3307682006 0.0029034921 -0.1359554138
-0.2084230596 -0.0744006460 -0.1333881159
-0.3458621951 -0.0592294925 -0.1427345062
-0.4149506933 -0.0788758571 -0.1315798672
-0.3462311256 -0.0864614338 -0.1269066721
-0.2087919901 -0.1016325873 -0.1175602818
-0.0709839241 -0.0895717995 -0.1240417256
-0.3462311256 -0.0864614338 -0.1269066721
-0.2084230596 -0.0744006460 -0.1333881159
-0.0705937927 -0.0607752077 -0.1407791258
-0.0709839241 -0.0895717995 -0.1240417256
-0.0020692907 -0.0827590803 -0.1277372306
-0.1395084261 -0.0675879268 -0.1370836208
-0.0020692907 -0.0827590803 -0.1277372306
0.0325830917 -0.0649544248 -0.1379536831
-0.0016791593 -0.0539624885 -0.1444746307
-0.2080329282 -0.0456040542 -0.1501255161
-0.3458621951 -0.0592294925 -0.1427345062
-0.2769475616 -0.0524167733 -0.1464300111
-0.3456671294 -0.0448311966 -0.1511032063
-0.0705937927 -0.0607752077 -0.1407791258
-0.0703987270 -0.0463769118 -0.1491478259
-0.1395084261 -0.0675879268 -0.1370836208
-0.2022024324 -0.0626451053 -0.1152908167
-0.0733530853 -0.0752574573 -0.1058034032
-0.0730241599 -0.0509763109 -0.1199148713
-0.0085994864 -0.0572824869 -0.1151711646
-0.2025313577 -0.0869262517 -0.1011793487
-0.3313807049 -0.0743138997 -0.1106667622
-0.0733530853 -0.0752574573 -0.1058034032
-0.2022024324 -0.0626451053 -0.1152908167
-0.3313807049 -0.0743138997 -0.1106667622
-0.3956464459 -0.0562786036 -0.1222290517
-0.3310573097 -0.0504442064 -0.1245410790
-0.2018790372 -0.0387754120 -0.1291651336
-0.0730241599 -0.0509763109 -0.1199148713
-0.3310573097 -0.0504442064 -0.1245410790
-0.2094029019 -0.1211301907 -0.0905600942
-0.3467210467 -0.1098262061 -0.1054926612
-0.4159578281 -0.1226117375 -0.0874261941
-0.3472987557 -0.1282637298 -0.0799599105
-0.2099806109 -0.1395677143 -0.0650273435
-0.0720847570 -0.1324341752 -0.0756275271
-0.3472987557 -0.1282637298 -0.0799599105
-0.2094029019 -0.1211301907 -0.0905600942
-0.0714738452 -0.1129365718 -0.1026277147
-0.0720847570 -0.1324341752 -0.0756275271
-0.0031202287 -0.1283373657 -0.0816613374
-0.1404383736 -0.1170333812 -0.0965939044
-0.0031202287 -0.1283373657 -0.0816613374
0.0316674913 -0.1165401593 -0.0981783364
-0.0025093169 -0.1088397624 -0.1086615250
-0.2087919901 -0.1016325873 -0.1175602818
-0.3467210467 -0.1098262061 -0.1054926612
-0.2777565184 -0.1057293967 -0.1115264715
-0.3464155908 -0.1000774045 -0.1189927550
-0.0714738452 -0.1129365718 -0.1026277147
-0.0711683893 -0.1031877701 -0.1161278086
-0.1404383736 -0.1170333812 -0.0965939044
-0.2030377527 -0.1030885274 -0.0787984564
-0.0742858538 -0.1119192564 -0.0647912151
-0.0737707454 -0.0954791684 -0.0875572231
-0.0093947959 -0.0998945329 -0.0805536025
-0.2035528611 -0.1195286154 -0.0560324484
-0.3323047600 -0.1106978864 -0.0700396897
-0.0742858538 -0.1119192564 -0.0647912151
-0.2030377527 -0.1030885274 -0.0787984564
-0.3323047600 -0.1106978864 -0.0700396897
-0.3964318687 -0.0983402902 -0.0880411986
-0.3317983650 -0.0945356107 -0.0924205820
-0.2025313577 -0.0869262517 -0.1011793487
-0.0737707454 -0.0954791684 -0.0875572231
-0.3317983650 -0.0945356107 -0.0924205820
-0.2107066569 -0.1463949693 -0.0324335764
-0.3479506332 -0.1408961191 -0.0508966517
-0.4172592165 -0.1446022573 -0.0293054371
-0.3486372283 -0.1473516824 -0.0200738995
-0.2113932520 -0.1528505327 -0.0016108242
-0.0734626806 -0.1518938196 -0.0139705012
-0.3486372283 -0.1473516824 -0.0200738995
-0.2107066569 -0.1463949693 -0.0324335764
-0.0727366345 -0.1450665645 -0.0465642682
-0.0734626806 -0.1518938196 -0.0139705012
-0.0044776694 -0.1512296172 -0.0210358471
-0.1417216457 -0.1457307669 -0.0394989223
-0.0044776694 -0.1512296172 -0.0210358471
0.0303778592 -0.1474838884 -0.0408654036
-0.0037516234 -0.1444023621 -0.0536296141
-0.2099806109 -0.1395677143 -0.0650273435
-0.3479506332 -0.1408961191 -0.0508966517
-0.2789656220 -0.1402319167 -0.0579619976
-0.3475876102 -0.1374824916 -0.0671935352
-0.0727366345 -0.1450665645 -0.0465642682
-0.0723736115 -0.1416529370 -0.0628611517
-0.1417216457 -0.1457307669 -0.0394989223
-0.2041547137 -0.1251886234 -0.0290140121
-0.0754565513 -0.1287259691 -0.0124152486
-0.0748443343 -0.1229693044 -0.0398989930
-0.0104952531 -0.1247379773 -0.0315996112
-0.2047669307 -0.1309452882 -0.0015302677
-0.3334650930 -0.1274079424 -0.0181290312
-0.0754565513 -0.1287259691 -0.0124152486
-0.2041547137 -0.1251886234 -0.0290140121
-0.3334650930 -0.1274079424 -0.0181290312
-0.3975184301 -0.1228575939 -0.0397049771
-0.3328632405 -0.1217479344 -0.0451474675
-0.2035528611 -0.1195286154 -0.0560324484
-0.0748443343 -0.1229693044 -0.0398989930
-0.3328632405 -0.1217479344 -0.0451474675
0.3022511743 -0.0754318650 0.0146729404
0.3022511743 -0.0754318650 0.0146729404
0.3032975259 -0.0636839595 -0.0322410555
0.3032975259 -0.0636839595 -0.0322410555
0.3040100962 -0.0265975036 -0.0632909684
0.3040100962 -0.0265975036 -0.0632909684
0.3041167228 0.0216612914 -0.0666174891
0.3041167228 0.0216612914 -0.0666174891
0.3035766801 0.0626598390 -0.0409500814
0.3035766801 0.0626598390 -0.0409500814
0.3025962296 0.0807381420 0.0039079301
0.3025962296 0.0807381420 0.0039079301
0.3015498784 0.0689907609 0.0508219245
0.3015498784 0.0689907609 0.0508219245
0.3008372992 0.0319048306 0.0818722551
0.3008372992 0.0319048306 0.0818722551
0.3007306722 -0.0163544888 0.0851987775
0.3007306722 -0.0163544888 0.0851987775
0.3012707238 -0.0573535620 0.0595309519
0.3012707238 -0.0573535620 0.0595309519
-0.1623926348 -0.1510936343 -0.0495897219
-0.1634897180 -0.1668817003 -0.0005083741
-0.0858054291 -0.1590404182 -0.0233418517
-0.2400769236 -0.1589349164 -0.0267562443
-0.0847083459 -0.1432523522 -0.0724231995
-0.0858054291 -0.1590404182 -0.0233418517
-0.0469632846 -0.1551197772 -0.0347585905
-0.1623926348 -0.1510936343 -0.0495897219
-0.1612955516 -0.1353055683 -0.0986710698
-0.2389798405 -0.1431468504 -0.0758375922
-0.0847083459 -0.1432523522 -0.0724231995
-0.2400769236 -0.1589349164 -0.0267562443
-0.2389798405 -0.1431468504 -0.0758375922
-0.2778219849 -0.1470674914 -0.0644208534
-0.1605936129 -0.0936765674 -0.1291002578
-0.1612955516 -0.1353055683 -0.0986710698
-0.0838088350 -0.1145438188 -0.1121784674
-0.2380803295 -0.1144383169 -0.1155928601
-0.0831068963 -0.0729148178 -0.1426076554
-0.0838088350 -0.1145438188 -0.1121784674
-0.0450654766 -0.1041629440 -0.1189321663
-0.1605936129 -0.0936765674 -0.1291002578
-0.1598916742 -0.0520475665 -0.1595294458
-0.2373783908 -0.0728093160 -0.1460220481
-0.0831068963 -0.0729148178 -0.1426076554
-0.2373783908 -0.0728093160 -0.1460220481
-0.2764727185 -0.1040046912 -0.1240537552
-0.2380803295 -0.1144383169 -0.1155928601
-0.1598529834 -0.0004787068 -0.1596841676
-0.1598916742 -0.0520475665 -0.1595294458
-0.0827365815 -0.0263158876 -0.1578996104
-0.2370080761 -0.0262103857 -0.1613140030
-0.0826978907 0.0252529721 -0.1580543322
-0.0827365815 -0.0263158876 -0.1578996104
-0.0441590352 -0.0134500481 -0.1570846926
-0.1598529834 -0.0004787068 -0.1596841676
-0.1598142926 0.0510901528 -0.1598388894
-0.2369693852 0.0253584739 -0.1614687248
-0.0826978907 0.0252529721 -0.1580543322
-0.2369693852 0.0253584739 -0.1614687248
-0.2755662770 -0.0132917954 -0.1622062816
-0.2370080761 -0.0262103857 -0.1613140030
-0.1604536275 0.0929022118 -0.1296600493
-0.1598142926 0.0510901528 -0.1598388894
-0.0829982128 0.0719434314 -0.1430422730
-0.2372697073 0.0720489332 -0.1464566657
-0.0836375477 0.1137554904 -0.1128634329
-0.0829982128 0.0719434314 -0.1430422730
-0.0445901729 0.0823700707 -0.1346439648
-0.1604536275 0.0929022118 -0.1296600493
-0.1610929625 0.1347142708 -0.0994812091
-0.2379090423 0.1138609922 -0.1162778255
-0.0836375477 0.1137554904 -0.1128634329
-0.2372697073 0.0720489332 -0.1464566657
-0.2379090423 0.1138609922 -0.1162778255
-0.2763170822 0.1034343529 -0.1246761337
-0.1621661331 0.1507979855 -0.0504954861
-0.1610929625 0.1347142708 -0.0994812091
-0.0844938005 0.1427033772 -0.0732811513
-0.2387652951 0.1428088791 -0.0766955439
-0.0855669711 0.1587870920 -0.0242954282
-0.0844938005 0.1427033772 -0.0732811513
-0.0461942195 0.1466979305 -0.0601811223
-0.1621661331 0.1507979855 -0.0504954861
-0.1632393037 0.1668817003 -0.0015097630
-0.2398384656 0.1588925938 -0.0277098208
-0.0855669711 0.1587870920 -0.0242954282
-0.2398384656 0.1588925938 -0.0277098208
-0.2776014613 0.1468561832 -0.0653027113
-0.2387652951 0.1428088791 -0.0766955439
-0.1643363786 0.1510938429 0.0475712172
-0.1632393037 0.1668817003 -0.0015097630
-0.0866520938 0.1589350207 0.0247379235
-0.2409235884 0.1590405225 0.0213235308
-0.0877491687 0.1431471633 0.0738189037
-0.0866520938 0.1589350207 0.0247379235
-0.0483584889 0.1549616809 0.0378617667
-0.1643363786 0.1510938429 0.0475712172
-0.1654334535 0.1353059856 0.0966521975
-0.2420206633 0.1432526652 0.0704045110
-0.0877491687 0.1431471633 0.0738189037
-0.2420206633 0.1432526652 0.0704045110
-0.2797657308 0.1551199336 0.0327401777
-0.2409235884 0.1590405225 0.0213235308
-0.1661353970 0.0936767756 0.1270815958
-0.1654334535 0.1353059856 0.0966521975
-0.0886486779 0.1144386296 0.1135740930
-0.2429201725 0.1145441315 0.1101597003
-0.0893506214 0.0728094196 0.1440034913
-0.0886486779 0.1144386296 0.1135740930
-0.0502562902 0.1040049517 0.1220350407
-0.1661353970 0.0936767756 0.1270815958
-0.1668373405 0.0520475655 0.1575109941
-0.2436221160 0.0729149215 0.1405890987
-0.0893506214 0.0728094196 0.1440034913
-0.2429201725 0.1145441315 0.1101597003
-0.2436221160 0.0729149215 0.1405890987
-0.2820145038 0.0833485994 0.1321281509
-0.1668760313 0.0004787059 0.1576657160
-0.1668373405 0.0520475655 0.1575109941
-0.0897209386 0.0262103848 0.1592955514
-0.2439924332 0.0263158866 0.1558811587
-0.0897596294 -0.0253584749 0.1594502732
-0.0897209386 0.0262103848 0.1592955514
-0.0511627377 0.0132917944 0.1601878300
-0.1668760313 0.0004787059 0.1576657160
-0.1669147221 -0.0510901538 0.1578204378
-0.2440311240 -0.0252529730 0.1560358806
-0.0897596294 -0.0253584749 0.1594502732
-0.2439924332 0.0263158866 0.1558811587
-0.2440311240 -0.0252529730 0.1560358806
-0.2825893249 -0.0123343826 0.1551436020
-0.1662753823 -0.0929020036 0.1276413873
-0.1669147221 -0.0510901538 0.1578204378
-0.0894593049 -0.0720488296 0.1444381089
-0.2437307995 -0.0719433278 0.1410237162
-0.0894593049 -0.0720488296 0.1444381089
-0.0504119265 -0.1034340925 0.1226574192
-0.0888199652 -0.1138606795 0.1142590584
-0.1662753823 -0.0929020036 0.1276413873
-0.1656360426 -0.1347138535 0.0974623369
-0.2430914597 -0.1137551776 0.1108446658
-0.0888199652 -0.1138606795 0.1142590584
-0.2437307995 -0.0719433278 0.1410237162
-0.2430914597 -0.1137551776 0.1108446658
-0.2818191683 -0.1032758397 0.1175358302
-0.1645628803 -0.1507977769 0.0484769814
-0.1656360426 -0.1347138535 0.0974623369
-0.0879637141 -0.1428085661 0.0746768554
-0.2422352087 -0.1427030643 0.0712624628
-0.0879637141 -0.1428085661 0.0746768554
-0.0485909688 -0.1548978841 0.0387914370
-0.0868905518 -0.1588924895 0.0256915000
-0.1645628803 -0.1507977769 0.0484769814
-0.1634897180 -0.1668817003 -0.0005083741
-0.2411620464 -0.1587869877 0.0222771073
-0.0868905518 -0.1588924895 0.0256915000
-0.2422352087 -0.1427030643 0.0712624628
-0.2411620464 -0.1587869877 0.0222771073
-0.2799982106 -0.1547396314 0.0336698480
3 559 560 558
3 85 560 559
3 559 561 86
3 558 561 559
3 562 563 85
3 558 563 562
3 528 564 85
3 562 564 528
3 566 567 565
3 530 567 566
3 566 568 528
3 565 568 566
3 569 570 530
3 565 570 569
3 86 571 530
3 569 571 86
3 86 573 572
3 530 573 86
3 572 574 230
3 530 574 572
3 575 576 528
3 229 576 575
3 85 577 528
3 575 577 85
3 579 580 578
3 528 580 579
3 579 581 530
3 578 581 579
3 582 583 528
3 578 583 582
3 433 584 528
3 582 584 433
3 586 587 585
3 435 587 586
3 586 588 433
3 585 588 586
3 589 590 435
3 585 590 589
3 530 591 435
3 589 591 530
3 592 593 530
3 230 593 592
3 435 594 530
3 592 594 435
3 433 596 595
3 528 596 433
3 595 597 229
3 528 597 595
3 599 600 598
3 433 600 599
3 599 601 435
3 598 601 599
3 602 603 433
3 598 603 602
3 244 604 433
3 602 604 244
3 606 607 605
3 246 607 606
3 606 608 244
3 605 608 606
3 609 610 246
3 605 610 609
3 435 611 246
3 609 611 435
3 435 613 612
3 246 613 435
3 612 614 230
3 246 614 612
3 615 616 244
3 229 616 615
3 433 617 244
3 615 617 433
3 619 620 618
3 244 620 619
3 619 621 246
3 618 621 619
3 622 623 244
3 618 623 622
3 539 624 244
3 622 624 539
3 626 627 625
3 541 627 626
3 626 628 539
3 625 628 626
3 629 630 541
3 625 630 629
3 246 631 541
3 629 631 246
3 246 633 632
3 541 633 246
3 632 634 230
3 541 634 632
3 635 636 539
3 229 636 635
3 244 637 539
3 635 637 244
3 639 640 638
3 539 640 639
3 639 641 541
3 638 641 639
3 642 643 539
3 638 643 642
3 496 644 539
3 642 644 496
3 646 647 645
3 497 647 646
3 646 648 496
3 645 648 646
3 649 650 497
3 645 650 649
3 541 651 497
3 649 651 541
3 541 653 652
3 497 653 541
3 652 654 230
3 497 654 652
3 655 656 496
3 229 656 655
3 539 657 496
3 655 657 539
3 659 660 658
3 496 660 659
3 659 661 497
3 658 661 659
3 662 663 496
3 658 663 662
3 540 664 496
3 662 664 540
3 666 667 665
3 542 667 666
3 666 668 540
3 665 668 666
3 669 670 542
3 665 670 669
3 497 671 542
3 669 671 497
3 672 673 497
3 230 673 672
3 542 674 497
3 672 674 542
3 540 676 675
3 496 676 540
3 675 677 229
3 496 677 675
3 679 680 678
3 540 680 679
3 679 681 542
3 678 681 679
3 682 683 540
3 678 683 682
3 245 684 540
3 682 684 245
3 686 687 685
3 247 687 686
3 686 688 245
3 685 688 686
3 689 690 247
3 685 690 689
3 542 691 247
3 689 691 542
3 692 693 542
3 230 693 692
3 247 694 542
3 692 694 247
3 245 696 695
3 540 696 245
3 695 697 229
3 540 697 695
3 699 700 698
3 245 700 699
3 699 701 247
3 698 701 699
3 702 703 245
3 698 703 702
3 434 704 245
3 702 704 434
3 706 707 705
3 436 707 706
3 706 708 434
3 705 708 706
3 709 710 436
3 705 710 709
3 247 711 436
3 709 711 247
3 712 713 247
3 230 713 712
3 436 714 247
3 712 714 436
3 434 716 715
3 245 716 434
3 715 717 229
3 245 717 715
3 719 720 718
3 434 720 719
3 719 721 436
3 718 721 719
3 722 723 434
3 718 723 722
3 529 724 434
3 722 724 529
3 726 727 725
3 531 727 726
3 726 728 529
3 725 728 726
3 729 730 531
3 725 730 729
3 436 731 531
3 729 731 436
3 436 733 732
3 531 733 436
3 732 734 230
3 531 734 732
3 735 736 529
3 229 736 735
3 434 737 529
3 735 737 434
3 739 740 738
3 529 740 739
3 739 741 531
3 738 741 739
3 742 743 529
3 738 743 742
3 85 744 529
3 742 744 85
3 746 747 745
3 86 747 746
3 746 748 85
3 745 748 746
3 749 750 86
3 745 750 749
3 531 751 86
3 749 751 531
3 752 753 531
3 230 753 752
3 86 754 531
3 752 754 86
3 85 756 755
3 529 756 85
3 755 757 229
3 529 757 755
3 365 59 128
3 128 59 439
3 128 439 416
3 416 439 30
3 416 30 527
3 527 30 95
3 527 95 546
3 546 95 21
3 546 21 84
3 84 760 759
3 21 760 84
3 759 761 758
3 21 761 759
3 762 763 758
3 295 763 762
3 762 764 21
3 758 764 762
3 767 768 766
3 295 768 767
3 767 769 765
3 766 769 767
3 295 771 770
3 287 771 295
3 770 772 766
3 287 772 770
3 765 775 774
3 773 775 765
3 774 776 84
3 773 776 774
3 777 778 773
3 287 778 777
3 773 779 777
3 765 779 773
3 287 295 22
3 287 22 534
3 534 22 36
3 534 36 10
3 10 36 389
3 10 389 476
3 476 389 228
3 476 228 526
3 526 228 323
3 526 323 297
3 297 323 427
3 297 427 141
3 141 427 257
3 141 257 362
3 362 257 54
3 362 54 481
3 481 54 183
3 481 183 187
3 187 183 62
3 187 62 288
3 288 62 78
3 288 78 34
3 34 78 91
3 34 91 202
3 202 91 443
3 202 443 276
3 276 443 460
3 276 460 455
3 455 460 75
3 455 75 273
3 273 75 477
3 273 477 107
3 107 477 122
3 107 122 15
3 15 122 457
3 15 457 243
3 243 457 401
3 243 401 549
3 549 401 275
3 549 275 131
3 131 275 303
3 131 303 67
3 67 303 143
3 67 143 543
3 543 143 411
3 543 411 138
3 138 411 267
3 138 267 266
3 781 782 266
3 780 782 781
3 267 783 266
3 781 783 267
3 784 785 780
3 70 785 784
3 784 786 267
3 780 786 784
3 70 789 788
3 45 789 70
3 788 790 787
3 45 790 788
3 791 792 787
3 266 792 791
3 791 793 45
3 787 793 791
3 45 70 72
3 45 72 46
3 46 72 321
3 46 321 174
3 365 354 59
3 59 354 408
3 59 408 439
3 439 408 471
3 439 471 30
3 30 471 152
3 30 152 95
3 95 152 136
3 95 136 21
3 21 796 795
3 136 796 21
3 795 797 794
3 136 797 795
3 798 799 794
3 426 799 798
3 798 800 136
3 794 800 798
3 803 804 802
3 426 804 803
3 803 805 801
3 802 805 803
3 426 807 806
3 295 807 426
3 806 808 802
3 295 808 806
3 801 811 810
3 809 811 801
3 810 812 21
3 809 812 810
3 813 814 809
3 295 814 813
3 809 815 813
3 801 815 809
3 295 426 118
3 295 118 22
3 22 118 239
3 22 239 36
3 36 239 413
3 36 413 389
3 389 413 76
3 389 76 228
3 228 76 349
3 228 349 323
3 323 349 332
3 323 332 427
3 427 332 265
3 427 265 257
3 257 265 479
3 257 479 54
3 54 479 57
3 54 57 183
3 183 57 7
3 183 7 62
3 62 7 195
3 62 195 78
3 78 195 454
3 78 454 91
3 91 454 248
3 91 248 443
3 443 248 505
3 443 505 460
3 460 505 285
3 460 285 75
3 75 285 419
3 75 419 477
3 477 419 199
3 477 199 122
3 122 199 201
3 122 201 457
3 457 201 430
3 457 430 401
3 401 430 1
3 401 1 275
3 275 1 115
3 275 115 303
3 303 115 206
3 303 206 143
3 143 206 98
3 143 98 411
3 411 98 475
3 411 475 267
3 817 818 267
3 816 818 817
3 475 819 267
3 817 819 475
3 820 821 816
3 170 821 820
3 820 822 475
3 816 822 820
3 170 825 824
3 70 825 170
3 824 826 823
3 70 826 824
3 827 828 823
3 267 828 827
3 827 829 70
3 823 829 827
3 70 170 172
3 70 172 72
3 72 172 307
3 72 307 321
3 365 387 354
3 354 387 28
3 354 28 408
3 408 28 379
3 408 379 471
3 471 379 32
3 471 32 152
3 152 32 82
3 152 82 136
3 136 832 831
3 82 832 136
3 831 833 830
3 82 833 831
3 834 835 830
3 43 835 834
3 834 836 82
3 830 836 834
3 839 840 838
3 43 840 839
3 839 841 837
3 838 841 839
3 43 843 842
3 426 843 43
3 842 844 838
3 426 844 842
3 837 847 846
3 845 847 837
3 846 848 136
3 845 848 846
3 849 850 845
3 426 850 849
3 845 851 849
3 837 851 845
3 426 43 538
3 426 538 118
3 118 538 207
3 118 207 239
3 239 207 383
3 239 383 413
3 413 383 250
3 413 250 76
3 76 250 356
3 76 356 349
3 349 356 105
3 349 105 332
3 332 105 521
3 332 521 265
3 265 521 258
3 265 258 479
3 479 258 18
3 479 18 57
3 57 18 501
3 57 501 7
3 7 501 304
3 7 304 195
3 195 304 225
3 195 225 454
3 454 225 68
3 454 68 248
3 248 68 353
3 248 353 505
3 505 353 366
3 505 366 285
3 285 366 192
3 285 192 419
3 419 192 486
3 419 486 199
3 199 486 269
3 199 269 201
3 201 269 291
3 201 291 430
3 430 291 290
3 430 290 1
3 1 290 233
3 1 233 115
3 115 233 309
3 115 309 206
3 206 309 26
3 206 26 98
3 98 26 372
3 98 372 475
3 853 854 475
3 852 854 853
3 372 855 475
3 853 855 372
3 856 857 852
3 109 857 856
3 856 858 372
3 852 858 856
3 109 861 860
3 170 861 109
3 860 862 859
3 170 862 860
3 863 864 859
3 475 864 863
3 863 865 170
3 859 865 863
3 170 109 111
3 170 111 172
3 172 111 167
3 172 167 307
3 365 284 387
3 387 284 449
3 387 449 28
3 28 449 397
3 28 397 379
3 379 397 64
3 379 64 32
3 32 64 343
3 32 343 82
3 82 868 867
3 343 868 82
3 867 869 866
3 343 869 867
3 870 871 866
3 515 871 870
3 870 872 343
3 866 872 870
3 875 876 874
3 515 876 875
3 875 877 873
3 874 877 875
3 515 879 878
3 43 879 515
3 878 880 874
3 43 880 878
3 873 883 882
3 881 883 873
3 882 884 82
3 881 884 882
3 885 886 881
3 43 886 885
3 881 887 885
3 873 887 881
3 43 515 294
3 43 294 538
3 538 294 391
3 538 391 207
3 207 391 280
3 207 280 383
3 383 280 52
3 383 52 250
3 250 52 178
3 250 178 356
3 356 178 472
3 356 472 105
3 105 472 56
3 105 56 521
3 521 56 223
3 521 223 258
3 258 223 102
3 258 102 18
3 18 102 488
3 18 488 501
3 501 488 494
3 501 494 304
3 304 494 324
3 304 324 225
3 225 324 556
3 225 556 68
3 68 556 377
3 68 377 353
3 353 377 493
3 353 493 366
3 366 493 179
3 366 179 192
3 192 179 370
3 192 370 486
3 486 370 253
3 486 253 269
3 269 253 506
3 269 506 291
3 291 506 421
3 291 421 290
3 290 421 100
3 290 100 233
3 233 100 398
3 233 398 309
3 309 398 368
3 309 368 26
3 26 368 151
3 26 151 372
3 889 890 372
3 888 890 889
3 151 891 372
3 889 891 151
3 892 893 888
3 392 893 892
3 892 894 151
3 888 894 892
3 392 897 896
3 109 897 392
3 896 898 895
3 109 898 896
3 899 900 895
3 372 900 899
3 899 901 109
3 895 901 899
3 109 392 394
3 109 394 111
3 111 394 215
3 111 215 167
3 365 418 284
3 284 418 431
3 284 431 449
3 449 431 204
3 449 204 397
3 397 204 485
3 397 485 64
3 64 485 326
3 64 326 343
3 343 904 903
3 326 904 343
3 903 905 902
3 326 905 903
3 906 907 902
3 262 907 906
3 906 908 326
3 902 908 906
3 911 912 910
3 262 912 911
3 911 913 909
3 910 913 911
3 262 915 914
3 515 915 262
3 914 916 910
3 515 916 914
3 909 919 918
3 917 919 909
3 918 920 343
3 917 920 918
3 921 922 917
3 515 922 921
3 917 923 921
3 909 923 917
3 515 262 158
3 515 158 294
3 294 158 16
3 294 16 391
3 391 16 523
3 391 523 280
3 280 523 547
3 280 547 52
3 52 547 212
3 52 212 178
3 178 212 8
3 178 8 472
3 472 8 13
3 472 13 56
3 56 13 140
3 56 140 223
3 223 140 545
3 223 545 102
3 102 545 116
3 102 116 488
3 488 116 231
3 488 231 494
3 494 231 536
3 494 536 324
3 324 536 2
3 324 2 556
3 556 2 312
3 556 312 377
3 377 312 509
3 377 509 493
3 493 509 155
3 493 155 179
3 179 155 4
3 179 4 370
3 370 4 66
3 370 66 253
3 253 66 197
3 253 197 506
3 506 197 519
3 506 519 421
3 421 519 338
3 421 338 100
3 100 338 260
3 100 260 398
3 398 260 405
3 398 405 368
3 368 405 132
3 368 132 151
3 925 926 151
3 924 926 925
3 132 927 151
3 925 927 132
3 928 929 924
3 550 929 928
3 928 930 132
3 924 930 928
3 550 933 932
3 392 933 550
3 932 934 931
3 392 934 932
3 935 936 931
3 151 936 935
3 935 937 392
3 931 937 935
3 392 550 552
3 392 552 394
3 394 552 555
3 394 555 215
3 365 375 418
3 418 375 415
3 418 415 431
3 431 415 175
3 431 175 204
3 204 175 185
3 204 185 485
3 485 185 214
3 485 214 326
3 326 940 939
3 214 940 326
3 939 941 938
3 214 941 939
3 942 943 938
3 129 943 942
3 942 944 214
3 938 944 942
3 947 948 946
3 129 948 947
3 947 949 945
3 946 949 947
3 129 951 950
3 262 951 129
3 950 952 946
3 262 952 950
3 945 955 954
3 953 955 945
3 954 956 326
3 953 956 954
3 957 958 953
3 262 958 957
3 953 959 957
3 945 959 953
3 262 129 466
3 262 466 158
3 158 466 218
3 158 218 16
3 16 218 41
3 16 41 523
3 523 41 445
3 523 445 547
3 547 445 236
3 547 236 212
3 212 236 271
3 212 271 8
3 8 271 406
3 8 406 13
3 13 406 462
3 13 462 140
3 140 462 127
3 140 127 545
3 545 127 189
3 545 189 116
3 116 189 168
3 116 168 231
3 231 168 335
3 231 335 536
3 536 335 516
3 536 516 2
3 2 516 341
3 2 341 312
3 312 341 165
3 312 165 509
3 509 165 424
3 509 424 155
3 155 424 121
3 155 121 4
3 4 121 157
3 4 157 66
3 66 157 255
3 66 255 197
3 197 255 242
3 197 242 519
3 519 242 125
3 519 125 338
3 338 125 315
3 338 315 260
3 260 315 93
3 260 93 405
3 405 93 310
3 405 310 132
3 961 962 132
3 960 962 961
3 310 963 132
3 961 963 310
3 964 965 960
3 317 965 964
3 964 966 310
3 960 966 964
3 317 969 968
3 550 969 317
3 968 970 967
3 550 970 968
3 971 972 967
3 132 972 971
3 971 973 550
3 967 973 971
3 550 317 319
3 550 319 552
3 552 319 301
3 552 301 555
3 365 210 375
3 375 210 278
3 375 278 415
3 415 278 452
3 415 452 175
3 175 452 503
3 175 503 185
3 185 503 182
3 185 182 214
3 214 976 975
3 182 976 214
3 975 977 974
3 182 977 975
3 978 979 974
3 351 979 978
3 978 980 182
3 974 980 978
3 983 984 982
3 351 984 983
3 983 985 981
3 982 985 983
3 351 987 986
3 129 987 351
3 986 988 982
3 129 988 986
3 981 991 990
3 989 991 981
3 990 992 214
3 989 992 990
3 993 994 989
3 129 994 993
3 989 995 993
3 981 995 989
3 129 351 149
3 129 149 466
3 466 149 161
3 466 161 218
3 218 161 336
3 218 336 41
3 41 336 533
3 41 533 445
3 445 533 37
3 445 37 236
3 236 37 441
3 236 441 271
3 271 441 499
3 271 499 406
3 406 499 458
3 406 458 462
3 462 458 104
3 462 104 127
3 127 104 437
3 127 437 189
3 189 437 219
3 189 219 168
3 168 219 39
3 168 39 335
3 335 39 402
3 335 402 516
3 516 402 469
3 516 469 341
3 341 469 87
3 341 87 165
3 165 87 113
3 165 113 424
3 424 113 163
3 424 163 121
3 121 163 361
3 121 361 157
3 157 361 134
3 157 134 255
3 255 134 525
3 255 525 242
3 242 525 381
3 242 381 125
3 125 381 191
3 125 191 315
3 315 191 465
3 315 465 93
3 93 465 11
3 93 11 310
3 997 998 310
3 996 998 997
3 11 999 310
3 997 999 11
3 1000 1001 996
3 511 1001 1000
3 1000 1002 11
3 996 1002 1000
3 511 1005 1004
3 317 1005 511
3 1004 1006 1003
3 317 1006 1004
3 1007 1008 1003
3 310 1008 1007
3 1007 1009 317
3 1003 1009 1007
3 317 511 513
3 317 513 319
3 319 513 448
3 319 448 301
3 365 209 210
3 210 209 277
3 210 277 278
3 278 277 451
3 278 451 452
3 452 451 502
3 452 502 503
3 503 502 181
3 503 181 182
3 182 1012 1011
3 181 1012 182
3 1011 1013 1010
3 181 1013 1011
3 1014 1015 1010
3 350 1015 1014
3 1014 1016 181
3 1010 1016 1014
3 1019 1020 1018
3 350 1020 1019
3 1019 1021 1017
3 1018 1021 1019
3 350 1023 1022
3 351 1023 350
3 1022 1024 1018
3 351 1024 1022
3 1017 1027 1026
3 1025 1027 1017
3 1026 1028 182
3 1025 1028 1026
3 1029 1030 1025
3 351 1030 1029
3 1025 1031 1029
3 1017 1031 1025
3 351 350 148
3 351 148 149
3 149 148 160
3 149 160 161
3 161 160 337
3 161 337 336
3 336 337 532
3 336 532 533
3 533 532 38
3 533 38 37
3 37 38 442
3 37 442 441
3 441 442 498
3 441 498 499
3 499 498 459
3 499 459 458
3 458 459 103
3 458 103 104
3 104 103 438
3 104 438 437
3 437 438 220
3 437 220 219
3 219 220 40
3 219 40 39
3 39 40 403
3 39 403 402
3 402 403 468
3 402 468 469
3 469 468 88
3 469 88 87
3 87 88 112
3 87 112 113
3 113 112 162
3 113 162 163
3 163 162 360
3 163 360 361
3 361 360 135
3 361 135 134
3 134 135 524
3 134 524 525
3 525 524 380
3 525 380 381
3 381 380 190
3 381 190 191
3 191 190 464
3 191 464 465
3 465 464 12
3 465 12 11
3 1033 1034 11
3 1032 1034 1033
3 12 1035 11
3 1033 1035 12
3 1036 1037 1032
3 510 1037 1036
3 1036 1038 12
3 1032 1038 1036
3 510 1041 1040
3 511 1041 510
3 1040 1042 1039
3 511 1042 1040
3 1043 1044 1039
3 11 1044 1043
3 1043 1045 511
3 1039 1045 1043
3 511 510 512
3 511 512 513
3 513 512 447
3 513 447 448
3 365 374 209
3 209 374 414
3 209 414 277
3 277 414 176
3 277 176 451
3 451 176 186
3 451 186 502
3 502 186 213
3 502 213 181
3 181 1048 1047
3 213 1048 181
3 1047 1049 1046
3 213 1049 1047
3 1050 1051 1046
3 130 1051 1050
3 1050 1052 213
3 1046 1052 1050
3 1055 1056 1054
3 130 1056 1055
3 1055 1057 1053
3 1054 1057 1055
3 130 1059 1058
3 350 1059 130
3 1058 1060 1054
3 350 1060 1058
3 1053 1063 1062
3 1061 1063 1053
3 1062 1064 181
3 1061 1064 1062
3 1065 1066 1061
3 350 1066 1065
3 1061 1067 1065
3 1053 1067 1061
3 350 130 467
3 350 467 148
3 148 467 217
3 148 217 160
3 160 217 42
3 160 42 337
3 337 42 446
3 337 446 532
3 532 446 235
3 532 235 38
3 38 235 272
3 38 272 442
3 442 272 407
3 442 407 498
3 498 407 463
3 498 463 459
3 459 463 126
3 459 126 103
3 103 126 188
3 103 188 438
3 438 188 169
3 438 169 220
3 220 169 334
3 220 334 40
3 40 334 517
3 40 517 403
3 403 517 340
3 403 340 468
3 468 340 164
3 468 164 88
3 88 164 423
3 88 423 112
3 112 423 120
3 112 120 162
3 162 120 156
3 162 156 360
3 360 156 254
3 360 254 135
3 135 254 241
3 135 241 524
3 524 241 124
3 524 124 380
3 380 124 314
3 380 314 190
3 190 314 94
3 190 94 464
3 464 94 311
3 464 311 12
3 1069 1070 12
3 1068 1070 1069
3 311 1071 12
3 1069 1071 311
3 1072 1073 1068
3 316 1073 1072
3 1072 1074 311
3 1068 1074 1072
3 316 1077 1076
3 510 1077 316
3 1076 1078 1075
3 510 1078 1076
3 1079 1080 1075
3 12 1080 1079
3 1079 1081 510
3 1075 1081 1079
3 510 316 318
3 510 318 512
3 512 318 300
3 512 300 447
3 365 417 374
3 374 417 432
3 374 432 414
3 414 432 203
3 414 203 176
3 176 203 484
3 176 484 186
3 186 484 327
3 186 327 213
3 213 1084 1083
3 327 1084 213
3 1083 1085 1082
3 327 1085 1083
3 1086 1087 1082
3 263 1087 1086
3 1086 1088 327
3 1082 1088 1086
3 1091 1092 1090
3 263 1092 1091
3 1091 1093 1089
3 1090 1093 1091
3 263 1095 1094
3 130 1095 263
3 1094 1096 1090
3 130 1096 1094
3 1089 1099 1098
3 1097 1099 1089
3 1098 1100 213
3 1097 1100 1098
3 1101 1102 1097
3 130 1102 1101
3 1097 1103 1101
3 1089 1103 1097
3 130 263 159
3 130 159 467
3 467 159 17
3 467 17 217
3 217 17 522
3 217 522 42
3 42 522 548
3 42 548 446
3 446 548 211
3 446 211 235
3 235 211 9
3 235 9 272
3 272 9 14
3 272 14 407
3 407 14 139
3 407 139 463
3 463 139 544
3 463 544 126
3 126 544 117
3 126 117 188
3 188 117 232
3 188 232 169
3 169 232 535
3 169 535 334
3 334 535 3
3 334 3 517
3 517 3 313
3 517 313 340
3 340 313 508
3 340 508 164
3 164 508 154
3 164 154 423
3 423 154 5
3 423 5 120
3 120 5 65
3 120 65 156
3 156 65 196
3 156 196 254
3 254 196 518
3 254 518 241
3 241 518 339
3 241 339 124
3 124 339 261
3 124 261 314
3 314 261 404
3 314 404 94
3 94 404 133
3 94 133 311
3 1105 1106 311
3 1104 1106 1105
3 133 1107 311
3 1105 1107 133
3 1108 1109 1104
3 551 1109 1108
3 1108 1110 133
3 1104 1110 1108
3 551 1113 1112
3 316 1113 551
3 1112 1114 1111
3 316 1114 1112
3 1115 1116 1111
3 311 1116 1115
3 1115 1117 316
3 1111 1117 1115
3 316 551 553
3 316 553 318
3 318 553 554
3 318 554 300
3 365 283 417
3 417 283 450
3 417 450 432
3 432 450 396
3 432 396 203
3 203 396 63
3 203 63 484
3 484 63 342
3 484 342 327
3 327 1120 1119
3 342 1120 327
3 1119 1121 1118
3 342 1121 1119
3 1122 1123 1118
3 514 1123 1122
3 1122 1124 342
3 1118 1124 1122
3 1127 1128 1126
3 514 1128 1127
3 1127 1129 1125
3 1126 1129 1127
3 514 1131 1130
3 263 1131 514
3 1130 1132 1126
3 263 1132 1130
3 1125 1135 1134
3 1133 1135 1125
3 1134 1136 327
3 1133 1136 1134
3 1137 1138 1133
3 263 1138 1137
3 1133 1139 1137
3 1125 1139 1133
3 263 514 293
3 263 293 159
3 159 293 390
3 159 390 17
3 17 390 279
3 17 279 522
3 522 279 51
3 522 51 548
3 548 51 177
3 548 177 211
3 211 177 473
3 211 473 9
3 9 473 55
3 9 55 14
3 14 55 224
3 14 224 139
3 139 224 101
3 139 101 544
3 544 101 489
3 544 489 117
3 117 489 495
3 117 495 232
3 232 495 325
3 232 325 535
3 535 325 557
3 535 557 3
3 3 557 376
3 3 376 313
3 313 376 492
3 313 492 508
3 508 492 180
3 508 180 154
3 154 180 371
3 154 371 5
3 5 371 252
3 5 252 65
3 65 252 507
3 65 507 196
3 196 507 422
3 196 422 518
3 518 422 99
3 518 99 339
3 339 99 399
3 339 399 261
3 261 399 369
3 261 369 404
3 404 369 150
3 404 150 133
3 1141 1142 133
3 1140 1142 1141
3 150 1143 133
3 1141 1143 150
3 1144 1145 1140
3 393 1145 1144
3 1144 1146 150
3 1140 1146 1144
3 393 1149 1148
3 551 1149 393
3 1148 1150 1147
3 551 1150 1148
3 1151 1152 1147
3 133 1152 1151
3 1151 1153 551
3 1147 1153 1151
3 551 393 395
3 551 395 553
3 553 395 216
3 553 216 554
3 365 386 283
3 283 386 29
3 283 29 450
3 450 29 378
3 450 378 396
3 396 378 33
3 396 33 63
3 63 33 83
3 63 83 342
3 342 1156 1155
3 83 1156 342
3 1155 1157 1154
3 83 1157 1155
3 1158 1159 1154
3 44 1159 1158
3 1158 1160 83
3 1154 1160 1158
3 1163 1164 1162
3 44 1164 1163
3 1163 1165 1161
3 1162 1165 1163
3 44 1167 1166
3 514 1167 44
3 1166 1168 1162
3 514 1168 1166
3 1161 1171 1170
3 1169 1171 1161
3 1170 1172 342
3 1169 1172 1170
3 1173 1174 1169
3 514 1174 1173
3 1169 1175 1173
3 1161 1175 1169
3 514 44 537
3 514 537 293
3 293 537 208
3 293 208 390
3 390 208 382
3 390 382 279
3 279 382 251
3 279 251 51
3 51 251 357
3 51 357 177
3 177 357 106
3 177 106 473
3 473 106 520
3 473 520 55
3 55 520 259
3 55 259 224
3 224 259 19
3 224 19 101
3 101 19 500
3 101 500 489
3 489 500 305
3 489 305 495
3 495 305 226
3 495 226 325
3 325 226 69
3 325 69 557
3 557 69 352
3 557 352 376
3 376 352 367
3 376 367 492
3 492 367 193
3 492 193 180
3 180 193 487
3 180 487 371
3 371 487 270
3 371 270 252
3 252 270 292
3 252 292 507
3 507 292 289
3 507 289 422
3 422 289 234
3 422 234 99
3 99 234 308
3 99 308 399
3 399 308 27
3 399 27 369
3 369 27 373
3 369 373 150
3 1177 1178 150
3 1176 1178 1177
3 373 1179 150
3 1177 1179 373
3 1180 1181 1176
3 108 1181 1180
3 1180 1182 373
3 1176 1182 1180
3 108 1185 1184
3 393 1185 108
3 1184 1186 1183
3 393 1186 1184
3 1187 1188 1183
3 150 1188 1187
3 1187 1189 393
3 1183 1189 1187
3 393 108 110
3 393 110 395
3 395 110 166
3 395 166 216
3 365 355 386
3 386 355 409
3 386 409 29
3 29 409 470
3 29 470 378
3 378 470 153
3 378 153 33
3 33 153 137
3 33 137 83
3 83 1192 1191
3 137 1192 83
3 1191 1193 1190
3 137 1193 1191
3 1194 1195 1190
3 425 1195 1194
3 1194 1196 137
3 1190 1196 1194
3 1199 1200 1198
3 425 1200 1199
3 1199 1201 1197
3 1198 1201 1199
3 425 1203 1202
3 44 1203 425
3 1202 1204 1198
3 44 1204 1202
3 1197 1207 1206
3 1205 1207 1197
3 1206 1208 83
3 1205 1208 1206
3 1209 1210 1205
3 44 1210 1209
3 1205 1211 1209
3 1197 1211 1205
3 44 425 119
3 44 119 537
3 537 119 240
3 537 240 208
3 208 240 412
3 208 412 382
3 382 412 77
3 382 77 251
3 251 77 348
3 251 348 357
3 357 348 333
3 357 333 106
3 106 333 264
3 106 264 520
3 520 264 480
3 520 480 259
3 259 480 58
3 259 58 19
3 19 58 6
3 19 6 500
3 500 6 194
3 500 194 305
3 305 194 453
3 305 453 226
3 226 453 249
3 226 249 69
3 69 249 504
3 69 504 352
3 352 504 286
3 352 286 367
3 367 286 420
3 367 420 193
3 193 420 198
3 193 198 487
3 487 198 200
3 487 200 270
3 270 200 429
3 270 429 292
3 292 429 0
3 292 0 289
3 289 0 114
3 289 114 234
3 234 114 205
3 234 205 308
3 308 205 97
3 308 97 27
3 27 97 474
3 27 474 373
3 1213 1214 373
3 1212 1214 1213
3 474 1215 373
3 1213 1215 474
3 1216 1217 1212
3 171 1217 1216
3 1216 1218 474
3 1212 1218 1216
3 171 1221 1220
3 108 1221 171
3 1220 1222 1219
3 108 1222 1220
3 1223 1224 1219
3 373 1224 1223
3 1223 1225 108
3 1219 1225 1223
3 108 171 173
3 108 173 110
3 110 173 306
3 110 306 166
3 365 60 355
3 355 60 440
3 355 440 409
3 409 440 31
3 409 31 470
3 470 31 96
3 470 96 153
3 153 96 20
3 153 20 137
3 137 1228 1227
3 20 1228 137
3 1227 1229 1226
3 20 1229 1227
3 1230 1231 1226
3 296 1231 1230
3 1230 1232 20
3 1226 1232 1230
3 1235 1236 1234
3 296 1236 1235
3 1235 1237 1233
3 1234 1237 1235
3 296 1239 1238
3 425 1239 296
3 1238 1240 1234
3 425 1240 1238
3 1233 1243 1242
3 1241 1243 1233
3 1242 1244 137
3 1241 1244 1242
3 1245 1246 1241
3 425 1246 1245
3 1241 1247 1245
3 1233 1247 1241
3 425 296 23
3 425 23 119
3 119 23 35
3 119 35 240
3 240 35 388
3 240 388 412
3 412 388 227
3 412 227 77
3 77 227 322
3 77 322 348
3 348 322 428
3 348 428 333
3 333 428 256
3 333 256 264
3 264 256 53
3 264 53 480
3 480 53 184
3 480 184 58
3 58 184 61
3 58 61 6
3 6 61 79
3 6 79 194
3 194 79 92
3 194 92 453
3 453 92 444
3 453 444 249
3 249 444 461
3 249 461 504
3 504 461 74
3 504 74 286
3 286 74 478
3 286 478 420
3 420 478 123
3 420 123 198
3 198 123 456
3 198 456 200
3 200 456 400
3 200 400 429
3 429 400 274
3 429 274 0
3 0 274 302
3 0 302 114
3 114 302 142
3 114 142 205
3 205 142 410
3 205 410 97
3 97 410 268
3 97 268 474
3 1249 1250 474
3 1248 1250 1249
3 268 1251 474
3 1249 1251 268
3 1252 1253 1248
3 71 1253 1252
3 1252 1254 268
3 1248 1254 1252
3 71 1257 1256
3 171 1257 71
3 1256 1258 1255
3 171 1258 1256
3 1259 1260 1255
3 474 1260 1259
3 1259 1261 171
3 1255 1261 1259
3 171 71 73
3 171 73 173
3 173 73 320
3 173 320 306
3 365 128 60
3 60 128 416
3 60 416 440
3 440 416 527
3 440 527 31
3 31 527 546
3 31 546 96
3 96 546 84
3 96 84 20
3 20 1264 1263
3 84 1264 20
3 1263 1265 1262
3 84 1265 1263
3 1266 1267 1262
3 287 1267 1266
3 1266 1268 84
3 1262 1268 1266
3 1271 1272 1270
3 287 1272 1271
3 1271 1273 1269
3 1270 1273 1271
3 287 1275 1274
3 296 1275 287
3 1274 1276 1270
3 296 1276 1274
3 1269 1279 1278
3 1277 1279 1269
3 1278 1280 20
3 1277 1280 1278
3 1281 1282 1277
3 296 1282 1281
3 1277 1283 1281
3 1269 1283 1277
3 296 287 534
3 296 534 23
3 23 534 10
3 23 10 35
3 35 10 476
3 35 476 388
3 388 476 526
3 388 526 227
3 227 526 297
3 227 297 322
3 322 297 141
3 322 141 428
3 428 141 362
3 428 362 256
3 256 362 481
3 256 481 53
3 53 481 187
3 53 187 184
3 184 187 288
3 184 288 61
3 61 288 34
3 61 34 79
3 79 34 202
3 79 202 92
3 92 202 276
3 92 276 444
3 444 276 455
3 444 455 461
3 461 455 273
3 461 273 74
3 74 273 107
3 74 107 478
3 478 107 15
3 478 15 123
3 123 15 243
3 123 243 456
3 456 243 549
3 456 549 400
3 400 549 131
3 400 131 274
3 274 131 67
3 274 67 302
3 302 67 543
3 302 543 142
3 142 543 138
3 142 138 410
3 410 138 266
3 410 266 268
3 1285 1286 268
3 1284 1286 1285
3 266 1287 268
3 1285 1287 266
3 1288 1289 1284
3 45 1289 1288
3 1288 1290 266
3 1284 1290 1288
3 45 1293 1292
3 71 1293 45
3 1292 1294 1291
3 71 1294 1292
3 1295 1296 1291
3 268 1296 1295
3 1295 1297 71
3 1291 1297 1295
3 71 45 46
3 71 46 73
3 73 46 174
3 73 174 320
3 25 1298 24
3 299 1298 25
3 298 1299 299
3 24 1299 298
3 299 1300 298
3 222 1300 299
3 221 1301 222
3 298 1301 221
3 222 1302 221
3 238 1302 222
3 237 1303 238
3 221 1303 237
3 238 1304 237
3 90 1304 238
3 89 1305 90
3 237 1305 89
3 90 1306 89
3 359 1306 90
3 358 1307 359
3 89 1307 358
3 359 1308 358
3 81 1308 359
3 80 1309 81
3 358 1309 80
3 81 1310 80
3 491 1310 81
3 490 1311 491
3 80 1311 490
3 491 1312 490
3 483 1312 491
3 482 1313 483
3 490 1313 482
3 483 1314 482
3 282 1314 483
3 281 1315 282
3 482 1315 281
3 282 1316 281
3 25 1316 282
3 24 1317 25
3 281 1317 24
3 1319 1320 1318
3 385 1320 1319
3 1319 1321 384
3 1318 1321 1319
3 1322 1323 385
3 1318 1323 1322
3 347 1324 385
3 1322 1324 347
3 1326 1327 1325
3 345 1327 1326
3 1326 1328 347
3 1325 1328 1326
3 1329 1330 345
3 1325 1330 1329
3 384 1331 345
3 1329 1331 384
3 1333 1334 1332
3 347 1334 1333
3 1333 1335 345
3 1332 1335 1333
3 1336 1337 347
3 1332 1337 1336
3 49 1338 347
3 1336 1338 49
3 1340 1341 1339
3 47 1341 1340
3 1340 1342 49
3 1339 1342 1340
3 47 1344 1343
3 345 1344 47
3 1343 1345 1339
3 345 1345 1343
3 1347 1348 1346
3 49 1348 1347
3 1347 1349 47
3 1346 1349 1347
3 1350 1351 49
3 1346 1351 1350
3 146 1352 49
3 1350 1352 146
3 1354 1355 1353
3 144 1355 1354
3 1354 1356 146
3 1353 1356 1354
3 144 1358 1357
3 47 1358 144
3 1357 1359 1353
3 47 1359 1357
3 1361 1362 1360
3 146 1362 1361
3 1361 1363 144
3 1360 1363 1361
3 1364 1365 146
3 1360 1365 1364
3 331 1366 146
3 1364 1366 331
3 1368 1369 1367
3 329 1369 1368
3 1368 1370 331
3 1367 1370 1368
3 1371 1372 329
3 1367 1372 1371
3 144 1373 329
3 1371 1373 144
3 1375 1376 1374
3 331 1376 1375
3 1375 1377 329
3 1374 1377 1375
3 1378 1379 331
3 1374 1379 1378
3 364 1380 331
3 1378 1380 364
3 1382 1383 1381
3 363 1383 1382
3 1382 1384 364
3 1381 1384 1382
3 363 1386 1385
3 329 1386 363
3 1385 1387 1381
3 329 1387 1385
3 1389 1390 1388
3 364 1390 1389
3 1389 1391 363
3 1388 1391 1389
3 1392 1393 364
3 1388 1393 1392
3 330 1394 364
3 1392 1394 330
3 1396 1397 1395
3 328 1397 1396
3 1396 1398 330
3 1395 1398 1396
3 328 1400 1399
3 363 1400 328
3 1399 1401 1395
3 363 1401 1399
3 1403 1404 1402
3 330 1404 1403
3 1403 1405 328
3 1402 1405 1403
3 1406 1407 330
3 1402 1407 1406
3 147 1408 330
3 1406 1408 147
3 1410 1411 1409
3 145 1411 1410
3 1410 1412 147
3 1409 1412 1410
3 1413 1414 145
3 1409 1414 1413
3 328 1415 145
3 1413 1415 328
3 1417 1418 1416
3 147 1418 1417
3 1417 1419 145
3 1416 1419 1417
3 1420 1421 147
3 1416 1421 1420
3 50 1422 147
3 1420 1422 50
3 1424 1425 1423
3 48 1425 1424
3 1424 1426 50
3 1423 1426 1424
3 1427 1428 48
3 1423 1428 1427
3 145 1429 48
3 1427 1429 145
3 1431 1432 1430
3 50 1432 1431
3 1431 1433 48
3 1430 1433 1431
3 50 1435 1434
3 346 1435 50
3 1434 1436 1430
3 346 1436 1434
3 1438 1439 1437
3 344 1439 1438
3 1438 1440 346
3 1437 1440 1438
3 1441 1442 344
3 1437 1442 1441
3 48 1443 344
3 1441 1443 48
3 1445 1446 1444
3 346 1446 1445
3 1445 1447 344
3 1444 1447 1445
3 346 1449 1448
3 385 1449 346
3 1448 1450 1444
3 385 1450 1448
3 1452 1453 1451
3 384 1453 1452
3 1452 1454 385
3 1451 1454 1452
3 1455 1456 384
3 1451 1456 1455
3 344 1457 384
3 1455 1457 344