OFF

376 748 0
-0.402695 -0.178935 0.045897
-0.069298 -0.257024 -0.255907
-0.051522 -0.187155 -0.297751
-0.124180 0.055752 -0.347389
-0.196347 0.045996 -0.271271
-0.185121 0.007352 -0.262827
-0.153667 -0.052315 -0.263719
-0.131356 0.019423 -0.321961
-0.163814 0.037446 -0.299046
-0.184318 0.073740 -0.297150
-0.152791 -0.076855 -0.252189
-0.058847 -0.206554 -0.281084
-0.300824 -0.023950 -0.132879
-0.273115 0.015674 -0.180226
-0.303497 0.342283 -0.315225
-0.428423 0.085378 -0.062225
-0.350867 -0.009848 -0.090636
-0.286956 -0.022727 -0.147177
-0.059505 -0.140764 -0.312595
-0.257834 -0.019623 -0.177473
-0.186382 -0.060226 -0.227451
-0.239820 -0.003393 -0.203441
-0.204072 0.073120 -0.277350
-0.172346 -0.079404 -0.231610
-0.174270 -0.030048 -0.254641
-0.347452 0.004125 -0.101061
-0.170498 0.005184 -0.276157
-0.117665 -0.098295 -0.276010
-0.239295 -0.023183 -0.193963
-0.342602 -0.023187 -0.092050
-0.150800 -0.007636 -0.289114
-0.178712 0.031613 -0.281404
-0.211353 0.056492 -0.261770
-0.141412 -0.037506 -0.283287
-0.192773 0.026338 -0.264868
-0.296112 0.220299 -0.260895
-0.199521 0.089066 -0.289894
-0.133679 -0.012122 -0.303736
-0.244326 0.079821 -0.241025
-0.263950 0.090696 -0.227160
-0.334976 -0.036813 -0.092689
-0.322497 -0.066442 -0.090037
-0.425244 0.061917 -0.053513
-0.324710 -0.081929 -0.080032
-0.215862 -0.102176 -0.177182
-0.357525 0.020648 -0.099470
-0.254410 -0.227681 -0.075762
-0.372305 -0.040845 -0.053833
-0.339794 -0.009348 -0.101810
-0.269489 -0.067412 -0.141838
-0.176825 -0.154696 -0.189163
-0.387744 0.035529 -0.077176
-0.302763 -0.003861 -0.141112
-0.255559 -0.002867 -0.188180
-0.350947 0.035208 -0.113313
-0.304593 0.045706 -0.164342
-0.329965 0.143322 -0.188619
-0.177095 0.102251 -0.318677
-0.376063 0.112148 -0.127397
-0.381118 0.274189 -0.204259
-0.416904 0.070935 -0.066293
-0.219681 0.132917 -0.292157
-0.287271 0.329024 -0.324535
-0.148080 0.043834 -0.317794
-0.272039 0.297537 -0.323655
-0.242344 0.105302 -0.255850
-0.121831 -0.144016 -0.248808
-0.125933 -0.191896 -0.220579
-0.184915 0.055159 -0.287176
-0.199753 -0.040215 -0.224368
-0.266128 -0.046241 -0.155847
-0.364569 -0.014110 -0.074967
-0.425513 0.040525 -0.042447
-0.365262 -0.029647 -0.066436
-0.375806 -0.001125 -0.070441
-0.141530 -0.163536 -0.219517
-0.160274 -0.024130 -0.271437
-0.082225 -0.225913 -0.246667
-0.215815 -0.061861 -0.197590
-0.187002 -0.121731 -0.195774
-0.268498 0.064962 -0.209675
-0.293805 0.073209 -0.188877
-0.239871 -0.110267 -0.149410
-0.363619 -0.056300 -0.054596
-0.323463 -0.110747 -0.066708
-0.315548 -0.098036 -0.080936
-0.411574 0.097045 -0.084738
-0.223705 -0.229447 -0.105159
-0.075872 -0.135739 -0.298478
-0.393542 0.056463 -0.082029
-0.383991 0.069516 -0.098043
-0.170443 -0.056549 -0.245032
-0.289159 0.014639 -0.163876
-0.385577 0.313745 -0.219840
-0.244110 -0.039418 -0.181014
-0.340850 -0.079385 -0.065397
-0.127770 -0.111195 -0.259527
-0.311647 0.310506 -0.291134
-0.281101 0.275508 -0.303589
-0.400847 0.031649 -0.062292
-0.366088 0.069542 -0.115718
-0.221363 0.039182 -0.243152
-0.394759 0.093181 -0.099374
-0.336930 -0.051520 -0.083334
-0.398878 0.012015 -0.054318
-0.218175 0.005049 -0.229057
-0.391506 -0.024874 -0.042960
-0.372176 0.019660 -0.084519
-0.389406 -0.004889 -0.055125
-0.414985 0.043565 -0.054364
-0.157645 -0.097750 -0.236846
-0.235114 -0.204678 -0.106415
-0.245686 0.019954 -0.209446
-0.222771 0.106173 -0.275600
-0.094943 -0.107424 -0.293814
-0.087158 -0.180437 -0.264921
-0.094954 -0.153397 -0.270736
-0.158446 0.013344 -0.292167
-0.047421 -0.164800 -0.313546
-0.073070 -0.161213 -0.288681
-0.202362 0.193047 -0.339610
-0.238270 0.128319 -0.271497
-0.181328 0.238976 -0.383554
-0.272605 0.189169 -0.268359
-0.270367 0.322571 -0.337948
-0.389071 0.153118 -0.135262
-0.321343 0.169708 -0.210452
-0.260983 0.112450 -0.241074
-0.389222 0.127998 -0.122422
-0.337074 -0.066896 -0.075428
-0.242826 -0.137501 -0.132740
-0.429159 0.051303 -0.044292
-0.267653 -0.156033 -0.098889
-0.177789 -0.264502 -0.132748
-0.277998 -0.166200 -0.083550
-0.265019 -0.190664 -0.083997
-0.406642 -0.086179 0.002938
-0.334881 -0.144889 -0.038197
-0.191653 -0.252279 -0.125246
-0.254674 -0.180497 -0.099336
-0.400571 -0.008089 -0.042496
-0.430615 -0.020551 -0.006561
-0.244216 0.051877 -0.227021
-0.331213 -0.022774 -0.103493
-0.235901 -0.187167 -0.114484
-0.361850 -0.043409 -0.062851
-0.286500 -0.110447 -0.103322
-0.310583 -0.146261 -0.061476
-0.393045 -0.044400 -0.031579
-0.323914 -0.048070 -0.097918
-0.239152 -0.230866 -0.089204
-0.283917 -0.080096 -0.121199
-0.106911 -0.218148 -0.226084
-0.386745 0.015555 -0.068075
-0.273834 -0.016584 -0.163224
-0.419107 0.169423 -0.113869
-0.374163 -0.056995 -0.043844
-0.340037 0.046884 -0.129973
-0.168519 0.076997 -0.314381
-0.404140 0.078357 -0.082633
-0.350430 0.078437 -0.135657
-0.432385 0.160697 -0.096363
-0.425112 0.239217 -0.143194
-0.418970 0.271569 -0.165593
-0.410925 0.204294 -0.139551
-0.429439 0.121577 -0.079506
-0.323256 0.338003 -0.293567
-0.377823 0.089970 -0.114459
-0.172287 0.187177 -0.366312
-0.339046 0.245887 -0.231467
-0.223983 0.287887 -0.366183
-0.244829 0.308124 -0.355842
-0.214074 0.255233 -0.359464
-0.267381 -0.134361 -0.110103
-0.119802 -0.251252 -0.196647
-0.274628 0.035249 -0.188621
-0.099324 -0.124250 -0.280994
-0.302070 -0.050783 -0.118097
-0.349632 0.201221 -0.198463
-0.363697 0.291553 -0.230215
-0.400901 0.297440 -0.196486
-0.291480 0.304676 -0.308085
-0.226337 0.227231 -0.333225
-0.297552 0.256483 -0.277751
-0.188951 -0.083914 -0.212952
-0.371654 0.153297 -0.152533
-0.202264 0.115065 -0.300321
-0.416711 0.136401 -0.099550
-0.353978 0.335476 -0.261983
-0.378164 0.186093 -0.162676
-0.359771 0.003204 -0.088445
-0.413265 -0.058802 -0.004357
-0.240280 -0.074404 -0.167121
-0.428268 0.101561 -0.070551
-0.294102 -0.201946 -0.049606
-0.075938 -0.205369 -0.263550
-0.191514 -0.189316 -0.157187
-0.293895 -0.167631 -0.067145
-0.353034 -0.023401 -0.081652
-0.222630 -0.215717 -0.113154
-0.262768 -0.212483 -0.075196
-0.406476 0.050812 -0.066417
-0.349662 -0.102151 -0.045204
-0.315629 -0.201175 -0.028758
-0.330555 -0.094529 -0.067903
-0.158420 -0.182810 -0.193120
-0.309589 -0.115216 -0.078138
-0.368495 -0.088103 -0.033721
-0.342791 0.018520 -0.112929
-0.374860 0.135989 -0.140628
-0.343232 0.126245 -0.166905
-0.267856 0.226139 -0.291718
-0.434452 0.187803 -0.108015
-0.192093 -0.009466 -0.247455
-0.293529 0.169579 -0.237825
-0.153702 -0.133068 -0.222898
-0.231117 0.197807 -0.313648
-0.286651 0.107761 -0.213385
-0.182346 0.162813 -0.344085
-0.403777 0.169863 -0.129213
-0.359225 0.135187 -0.155648
-0.402313 0.111215 -0.101031
-0.306502 -0.084362 -0.096766
-0.211747 -0.194246 -0.134735
-0.391619 -0.112844 0.001588
-0.261311 -0.239693 -0.062887
-0.411490 -0.030714 -0.020298
-0.435085 -0.182709 0.079757
-0.386743 -0.080354 -0.019634
-0.422259 -0.124379 0.037638
-0.309485 -0.177498 -0.046780
-0.246812 -0.211150 -0.091608
-0.209332 -0.241756 -0.113118
-0.380903 -0.022133 -0.054804
-0.330245 -0.122497 -0.054084
-0.328399 -0.008474 -0.113493
-0.260980 -0.108188 -0.129637
-0.144440 -0.225492 -0.185353
-0.179079 -0.233559 -0.147106
-0.292019 -0.138789 -0.083564
-0.329964 0.023815 -0.128258
-0.227780 0.075136 -0.254981
-0.370011 0.040220 -0.097037
-0.409320 0.028579 -0.052384
-0.351961 0.154841 -0.172739
-0.404210 0.154304 -0.120925
-0.318179 0.215245 -0.236574
-0.361144 0.118475 -0.145310
-0.218215 -0.027265 -0.212696
-0.193622 0.218521 -0.361097
-0.254271 0.265364 -0.324931
-0.320205 0.288840 -0.271750
-0.378755 0.233575 -0.186076
-0.284270 -0.047737 -0.137195
-0.112467 -0.174729 -0.242533
-0.130284 -0.076267 -0.274689
-0.112308 0.026557 -0.344353
-0.117275 0.041163 -0.346833
-0.138063 0.081395 -0.346644
-0.160501 0.114691 -0.341329
-0.181347 0.134928 -0.330987
-0.199503 0.147169 -0.319258
-0.211128 0.153161 -0.310819
-0.218511 0.155367 -0.304654
-0.230504 0.157153 -0.293725
-0.247048 0.158993 -0.278327
-0.268518 0.154454 -0.254855
-0.293888 0.139038 -0.222045
-0.307117 0.123791 -0.201292
-0.311750 0.116041 -0.192807
-0.316590 0.105417 -0.182667
-0.320135 0.076617 -0.164624
-0.321135 0.046441 -0.148400
-0.319955 0.034424 -0.143492
-0.319017 0.025251 -0.139782
-0.317984 0.015349 -0.135800
-0.316610 -0.000235 -0.129284
-0.315439 -0.020251 -0.120330
-0.218354 -0.148209 -0.151473
-0.249145 -0.156104 -0.117109
-0.252494 -0.157781 -0.112959
-0.256341 -0.157954 -0.109074
-0.349802 -0.039595 -0.076657
-0.349123 -0.053576 -0.070269
-0.261795 -0.173205 -0.095995
-0.268064 -0.174237 -0.089292
-0.354845 -0.068498 -0.057092
-0.354920 -0.076730 -0.052859
-0.271993 -0.183533 -0.080722
-0.280180 -0.186606 -0.071091
-0.363822 -0.107227 -0.028670
-0.364914 -0.134672 -0.013728
-0.369472 -0.165969 0.006573
-0.204872 -0.289283 -0.093524
-0.446336 0.274630 -0.140142
-0.179584 -0.282884 -0.121698
-0.210345 -0.292085 -0.099065
-0.137687 0.150893 -0.394492
-0.439608 0.295844 -0.157493
-0.450245 0.209445 -0.103364
-0.454804 0.181301 -0.097021
-0.442396 0.109832 -0.060793
-0.194329 0.281814 -0.392365
-0.443609 0.143685 -0.076694
-0.349598 0.365343 -0.281379
-0.451817 0.271824 -0.145696
-0.156198 -0.277907 -0.147276
-0.283300 0.350401 -0.351611
-0.437301 0.303695 -0.176105
-0.431818 0.306501 -0.170561
-0.447866 0.107030 -0.066344
-0.147110 0.197515 -0.396378
-0.441569 0.076002 -0.044520
-0.443758 0.014196 -0.023516
-0.445580 0.080831 -0.055374
-0.445091 0.293039 -0.163035
-0.256867 0.342525 -0.361339
-0.441563 -0.065338 0.026860
-0.060146 -0.032952 -0.365748
-0.446707 0.173392 -0.088639
-0.140891 0.180196 -0.393755
-0.440097 0.083637 -0.049830
-0.455715 0.206643 -0.108916
-0.355079 0.362537 -0.286934
-0.425707 0.319095 -0.182949
-0.199799 0.279013 -0.397917
-0.439925 0.034336 -0.025098
-0.438061 0.041694 -0.030664
-0.156034 0.216594 -0.397201
-0.152683 0.204886 -0.394599
-0.167740 -0.278425 -0.135623
-0.161187 -0.279074 -0.141770
-0.451987 0.153783 -0.085892
-0.156615 -0.276844 -0.159762
-0.466641 -0.177292 0.108152
-0.185054 -0.285686 -0.127250
-0.152580 0.194713 -0.401930
-0.132207 0.153699 -0.388937
-0.299964 0.359824 -0.327573
-0.305438 0.357023 -0.333115
-0.452187 0.170586 -0.094194
-0.192017 -0.284324 -0.121067
-0.151141 -0.274043 -0.154222
-0.262337 0.339723 -0.366891
-0.431187 0.316289 -0.188504
-0.442067 -0.047938 0.018578
-0.447034 -0.068139 0.021308
-0.392132 0.352243 -0.232820
-0.445395 0.031534 -0.030650
-0.223348 0.316483 -0.381255
-0.447548 -0.050744 0.013024
-0.173211 -0.281227 -0.141175
-0.470903 -0.217096 0.132457
-0.455742 -0.141830 0.079482
-0.191143 -0.286075 -0.108687
-0.449079 0.140884 -0.082246
-0.443534 0.038893 -0.036204
-0.196616 -0.288876 -0.114228
-0.161667 -0.280709 -0.152828
-0.166659 -0.281875 -0.147311
-0.277817 0.353206 -0.346067
-0.449334 0.184103 -0.091469
-0.447038 0.073201 -0.050071
-0.186548 -0.281523 -0.115516
-0.327721 0.365859 -0.303235
-0.446518 0.156585 -0.080342
-0.065616 -0.035753 -0.371300
-0.333195 0.363057 -0.308776
-0.146361 0.177395 -0.399306
-0.297216 0.357699 -0.341563
-0.161513 0.213789 -0.402756
-0.397604 0.349442 -0.238361
-0.228821 0.313682 -0.386795
-0.438287 0.016998 -0.017964
-0.158152 0.202085 -0.400151
-0.291743 0.360500 -0.336023
3 352 293 334
3 352 296 293
3 293 227 334
3 293 225 227
3 225 0 227
3 225 203 0
3 203 292 0
3 225 194 203
3 203 230 292
3 230 137 292
3 137 291 292
3 2 366 118
3 2 297 366
3 2 368 297
3 2 336 368
3 2 374 336
3 2 370 374
3 2 325 370
3 2 372 325
3 2 343 372
3 2 307 343
3 2 369 307
3 2 339 369
3 2 367 339
3 2 323 367
3 2 371 323
3 2 344 371
3 2 308 344
3 2 315 308
3 2 305 315
3 2 322 305
3 2 300 322
3 2 340 300
3 2 1 340
3 1 332 340
3 1 355 332
3 1 310 355
3 1 314 310
3 1 333 314
3 333 358 314
3 358 359 314
3 359 351 314
3 351 362 314
3 351 356 362
3 351 348 356
3 351 313 348
3 351 350 313
3 351 346 350
3 351 334 346
3 351 352 334
3 351 341 352
3 341 357 352
3 357 296 352
3 2 11 1
3 366 318 118
3 334 317 346
3 334 353 317
3 318 18 118
3 11 77 1
3 11 195 77
3 318 88 18
3 318 114 88
3 77 152 1
3 152 174 1
3 174 342 1
3 318 255 114
3 293 150 225
3 293 232 150
3 293 363 232
3 256 3 257
3 3 63 257
3 57 259 260
3 213 34 105
3 21 28 248
3 76 30 26
3 37 117 30
3 68 9 22
3 30 76 33
3 258 337 259
3 101 241 142
3 4 31 68
3 30 117 26
3 57 9 158
3 94 19 70
3 44 78 192
3 17 52 12
3 70 17 253
3 160 157 272
3 252 178 169
3 169 251 179
3 42 15 312
3 128 58 209
3 51 153 107
3 48 25 16
3 273 274 272
3 91 69 20
3 88 176 116
3 34 31 4
3 272 274 55
3 192 78 94
3 23 184 110
3 268 270 217
3 31 34 5
3 63 258 158
3 218 260 259
3 50 278 196
3 91 20 23
3 82 192 49
3 255 37 33
3 54 240 157
3 282 40 29
3 22 9 36
3 24 69 91
3 237 152 67
3 158 8 63
3 101 105 34
3 248 213 105
3 106 47 233
3 282 29 198
3 37 318 256
3 8 68 31
3 256 257 7
3 24 26 213
3 38 241 65
3 117 31 26
3 65 121 127
3 216 264 262
3 185 125 209
3 22 36 113
3 311 328 320
3 6 76 24
3 24 213 69
3 32 101 34
3 276 274 240
3 269 270 268
3 61 261 263
3 253 49 70
3 107 74 190
3 290 137 234
3 74 233 71
3 100 157 160
3 15 60 86
3 207 287 156
3 286 287 95
3 295 330 133
3 82 130 278
3 54 45 208
3 221 165 86
3 282 145 283
3 287 286 83
3 103 149 40
3 41 129 43
3 281 280 132
3 202 95 287
3 232 138 238
3 138 363 133
3 160 210 247
3 240 54 208
3 92 154 13
3 92 13 175
3 69 213 248
3 144 199 223
3 55 81 271
3 92 55 274
3 48 143 235
3 107 242 51
3 244 56 126
3 189 244 178
3 113 36 186
3 30 33 37
3 210 270 56
3 25 190 16
3 183 251 169
3 121 264 265
3 72 326 373
3 15 86 193
3 261 186 260
3 142 112 101
3 375 338 360
3 169 178 246
3 32 34 4
3 264 61 263
3 214 246 126
3 98 97 251
3 271 272 55
3 160 271 210
3 75 215 50
3 37 7 117
3 237 196 238
3 79 50 215
3 154 53 13
3 186 261 61
3 21 105 112
3 154 70 19
3 235 143 277
3 53 28 21
3 148 156 47
3 74 108 233
3 16 190 71
3 15 301 321
3 204 202 234
3 45 54 242
3 242 89 51
3 103 40 282
3 116 115 119
3 27 255 96
3 255 10 96
3 236 130 82
3 196 278 223
3 130 279 278
3 19 94 28
3 70 49 192
3 132 280 279
3 113 241 22
3 265 266 121
3 53 19 28
3 65 241 113
3 82 44 192
3 87 232 199
3 40 143 29
3 72 243 109
3 83 286 283
3 224 290 228
3 177 41 222
3 177 151 253
3 185 209 220
3 319 212 361
3 132 134 285
3 238 133 342
3 33 76 6
3 159 90 102
3 15 193 301
3 319 365 161
3 327 326 72
3 5 213 26
3 91 6 24
3 81 175 80
3 52 154 92
3 309 180 324
3 163 309 298
3 8 158 68
3 69 248 78
3 204 85 43
3 151 222 146
3 10 23 110
3 27 114 255
3 171 124 64
3 324 93 347
3 251 188 179
3 217 267 268
3 242 100 90
3 226 191 148
3 274 273 275
3 210 244 220
3 112 142 80
3 34 213 5
3 157 273 272
3 187 155 161
3 154 19 53
3 84 234 206
3 198 71 73
3 131 42 312
3 78 184 20
3 39 217 80
3 191 228 148
3 109 131 72
3 107 153 74
3 208 235 240
3 373 243 72
3 153 51 99
3 327 131 312
3 242 90 89
3 33 6 255
3 50 205 75
3 231 46 150
3 111 87 199
3 32 241 101
3 4 22 32
3 52 274 276
3 80 217 81
3 31 117 8
3 67 254 75
3 110 215 96
3 119 11 2
3 11 115 195
3 328 168 320
3 256 7 37
3 115 116 254
3 115 254 195
3 116 176 66
3 123 265 216
3 57 186 36
3 261 262 263
3 211 123 216
3 124 171 316
3 211 182 250
3 57 260 186
3 210 271 270
3 168 249 120
3 337 258 256
3 178 244 126
3 93 180 59
3 120 216 262
3 219 185 189
3 277 177 12
3 298 294 163
3 155 219 212
3 86 165 193
3 207 228 290
3 345 191 141
3 99 109 243
3 223 199 232
3 111 139 231
3 135 285 288
3 239 134 132
3 194 197 230
3 85 84 206
3 229 136 317
3 228 207 156
3 136 229 224
3 236 146 173
3 46 200 225
3 363 138 232
3 290 234 202
3 159 102 86
3 29 16 198
3 141 226 140
3 100 167 90
3 276 12 52
3 112 13 53
3 222 206 146
3 253 12 177
3 148 47 106
3 190 74 71
3 194 289 197
3 129 95 43
3 239 147 197
3 139 281 284
3 202 287 207
3 177 277 149
3 70 192 94
3 176 88 114
3 139 285 135
3 276 235 277
3 17 70 154
3 173 279 130
3 187 303 165
3 29 143 48
3 91 10 6
3 173 132 279
3 109 42 131
3 58 221 167
3 197 147 230
3 73 47 145
3 228 136 224
3 157 240 273
3 329 328 311
3 22 4 68
3 155 212 161
3 233 47 73
3 246 214 35
3 108 74 153
3 188 93 179
3 161 303 187
3 187 128 245
3 219 125 185
3 162 299 164
3 268 126 56
3 212 319 161
3 245 219 155
3 301 165 303
3 212 299 361
3 170 171 250
3 170 172 302
3 187 245 155
3 100 54 157
3 182 120 249
3 170 302 349
3 164 252 162
3 62 64 124
3 14 97 181
3 62 14 181
3 218 337 168
3 218 262 261
3 181 64 62
3 360 62 124
3 200 231 135
3 291 137 290
3 281 139 279
3 27 176 114
3 246 178 126
3 43 222 41
3 152 237 174
3 21 248 105
3 234 137 147
3 268 56 269
3 265 123 266
3 347 93 188
3 166 14 364
3 189 252 164
3 62 338 14
3 59 169 179
3 180 163 59
3 171 170 349
3 35 211 183
3 122 172 249
3 163 162 252
3 151 236 49
3 241 32 22
3 65 127 38
3 187 165 221
3 127 266 267
3 121 65 113
3 108 104 140
3 163 294 162
3 249 328 122
3 316 171 349
3 304 188 166
3 214 126 267
3 271 160 272
3 164 219 189
3 73 282 198
3 106 108 140
3 44 184 78
3 194 230 203
3 25 48 235
3 153 99 104
3 206 234 147
3 223 278 279
3 151 177 222
3 29 48 16
3 106 140 226
3 284 285 139
3 191 345 317
3 90 159 89
3 99 243 104
3 41 149 103
3 228 156 148
3 239 173 146
3 184 79 110
3 85 206 222
3 202 204 95
3 278 44 82
3 46 225 150
3 206 239 146
3 215 75 66
3 202 207 290
3 239 132 173
3 60 89 159
3 45 25 208
3 240 235 276
3 264 216 265
3 163 180 309
3 221 128 187
3 337 320 168
3 211 250 98
3 59 252 169
3 212 164 299
3 20 69 78
3 142 38 80
3 121 61 264
3 217 39 127
3 96 66 176
3 152 254 67
3 263 262 264
3 181 98 64
3 37 255 318
3 9 57 36
3 158 9 68
3 216 182 211
3 172 170 250
3 159 86 60
3 193 165 301
3 218 168 120
3 209 58 247
3 226 148 106
3 283 286 129
3 108 106 233
3 278 79 44
3 237 67 205
3 353 334 227
3 0 353 227
3 177 149 41
3 206 147 239
3 131 327 72
3 73 145 282
3 285 134 288
3 226 141 191
3 342 133 330
3 144 223 279
3 132 284 281
3 229 0 292
3 194 225 200
3 353 229 317
3 291 224 292
3 136 191 317
3 109 201 42
3 277 12 276
3 73 71 233
3 66 96 215
3 200 289 194
3 221 58 128
3 63 7 257
3 205 67 75
3 253 17 12
3 204 43 95
3 174 237 342
3 231 200 46
3 279 139 144
3 175 112 80
3 209 247 220
3 275 273 240
3 186 61 113
3 0 229 353
3 105 101 112
3 153 104 108
3 83 156 287
3 221 86 102
3 249 172 182
3 125 219 245
3 252 189 178
3 260 218 261
3 312 15 321
3 247 210 220
3 244 185 220
3 151 146 236
3 84 204 234
3 120 262 218
3 267 266 214
3 97 98 181
3 61 121 113
3 247 58 160
3 304 166 364
3 169 246 35
3 97 166 251
3 270 271 81
3 99 201 109
3 44 79 184
3 120 182 216
3 99 51 201
3 184 23 20
3 119 2 118
3 238 342 237
3 195 152 77
3 88 116 119
3 115 11 119
3 75 254 66
3 176 27 96
3 249 168 328
3 119 18 88
3 232 238 223
3 266 123 214
3 364 14 338
3 238 138 133
3 10 255 6
3 237 205 196
3 39 38 127
3 127 121 266
3 244 210 56
3 347 188 304
3 124 316 360
3 256 258 3
3 63 8 117
3 360 338 62
3 158 258 259
3 172 250 182
3 268 267 126
3 337 218 259
3 183 98 251
3 209 125 128
3 84 85 204
3 122 302 172
3 160 167 100
3 169 35 183
3 294 299 162
3 13 112 175
3 212 219 164
3 163 252 59
3 125 245 128
3 270 269 56
3 167 160 58
3 365 303 161
3 90 167 102
3 35 123 211
3 158 259 57
3 42 201 60
3 217 127 267
3 275 240 274
3 190 45 107
3 142 241 38
3 189 185 244
3 129 41 103
3 21 112 53
3 43 85 222
3 277 143 149
3 81 217 270
3 242 54 100
3 51 89 201
3 63 3 258
3 66 254 116
3 285 284 132
3 195 254 152
3 130 236 173
3 45 190 25
3 55 175 81
3 137 230 147
3 140 243 373
3 283 103 282
3 17 154 52
3 111 231 150
3 231 139 135
3 76 26 24
3 25 235 208
3 232 87 150
3 140 104 243
3 373 345 141
3 289 200 135
3 238 196 223
3 229 292 224
3 363 293 354
3 135 288 289
3 281 279 280
3 306 330 331
3 143 40 149
3 82 49 236
3 144 139 111
3 278 50 79
3 133 363 295
3 306 342 330
3 136 228 191
3 119 118 18
3 94 78 248
3 50 196 205
3 123 35 214
3 98 183 211
3 28 94 248
3 5 26 31
3 98 250 64
3 10 91 23
3 122 328 302
3 14 166 97
3 64 250 171
3 166 188 251
3 59 179 93
3 92 175 55
3 117 7 63
3 39 80 38
3 93 324 180
3 42 60 15
3 221 102 167
3 107 45 242
3 92 274 52
3 16 71 198
3 256 318 337
3 288 134 289
3 79 215 110
3 129 103 283
3 224 291 290
3 83 283 145
3 60 201 89
3 129 286 95
3 83 47 156
3 111 150 87
3 134 197 289
3 253 151 49
3 47 83 145
3 144 111 199
3 373 141 140
3 96 10 110
3 197 134 239
3 333 1 342
3 358 333 306
3 359 358 331
3 351 359 330
3 335 351 295
3 341 335 363
3 357 341 354
3 296 357 293
3 350 346 345
3 313 350 373
3 348 313 326
3 356 348 327
3 362 356 312
3 314 362 321
3 310 314 301
3 355 310 303
3 332 355 365
3 340 332 319
3 300 340 361
3 322 300 299
3 305 322 294
3 315 305 298
3 308 315 309
3 344 308 324
3 371 344 347
3 323 371 304
3 367 323 364
3 339 367 338
3 369 339 375
3 307 369 360
3 343 307 316
3 372 343 349
3 325 372 302
3 370 325 328
3 374 370 329
3 336 374 311
3 368 336 320
3 297 368 337
3 366 297 318
3 333 342 306
3 306 331 358
3 331 330 359
3 330 295 351
3 295 363 335
3 363 354 341
3 354 293 357
3 317 345 346
3 345 373 350
3 373 326 313
3 326 327 348
3 327 312 356
3 312 321 362
3 321 301 314
3 301 303 310
3 303 365 355
3 365 319 332
3 319 361 340
3 361 299 300
3 299 294 322
3 294 298 305
3 298 309 315
3 309 324 308
3 324 347 344
3 347 304 371
3 304 364 323
3 364 338 367
3 338 375 339
3 375 360 369
3 360 316 307
3 316 349 343
3 349 302 372
3 325 302 328
3 328 329 370
3 329 311 374
3 311 320 336
3 320 337 368
3 337 318 297
3 341 351 335
