OFF

8 12 0
0.221967 -0.492071 0.000196
0.215281 -0.496035 -0.050486
0.180150 -0.475633 -0.050496
0.176190 -0.468926 0.000183
0.196152 -0.496784 -0.050489
0.188055 -0.489022 -0.050492
0.228669 -0.488132 -0.050486
0.184095 -0.482315 0.000187
3 4 1 5
3 1 6 5
3 6 2 5
3 6 3 2
3 6 0 3
3 0 7 3
3 0 4 7
3 0 1 4
3 4 5 7
3 1 0 6
3 2 3 7
3 2 7 5
