OFF

311 618 0
0.210257 -0.052874 -0.299931
0.088039 0.166721 -0.189383
0.153599 0.119183 -0.243755
0.426309 -0.025679 -0.193373
0.394960 0.089282 0.271126
0.160528 0.319900 0.183720
0.253001 0.240579 0.053511
0.078477 0.252136 -0.046350
0.229020 0.263723 0.133728
-0.054403 0.314765 -0.005604
0.238725 0.274776 0.132781
0.216265 0.246890 -0.029559
0.193829 0.237125 -0.088045
0.407291 0.170744 0.042489
-0.291407 0.328874 0.079726
-0.092743 0.373242 0.120726
0.361288 0.188851 0.026035
0.422167 0.110809 0.077200
0.438199 0.119215 0.028921
-0.173531 0.277069 -0.009138
-0.041469 0.250410 -0.042529
-0.089528 0.268758 -0.021542
-0.092133 0.239589 -0.065133
-0.253137 0.328876 0.106207
0.289441 0.227261 -0.025784
0.420120 0.031313 0.138899
-0.018183 0.258746 -0.072558
0.423308 0.106784 0.124175
0.305717 0.211442 -0.121163
0.167473 0.333369 0.184919
-0.137554 0.391965 0.169011
-0.018956 0.269672 -0.082221
-0.180823 0.288758 -0.016128
0.026248 0.223539 -0.108275
0.193965 0.171024 -0.228221
0.360263 0.169827 0.196398
0.380398 0.201158 -0.049608
0.105580 0.189343 -0.155074
0.274253 0.347833 0.132606
0.389706 0.065805 -0.210462
0.411346 0.083290 0.179043
0.335171 0.163531 -0.153553
0.364900 0.192902 -0.041328
0.296021 0.297006 0.126056
0.363832 0.008112 -0.253241
0.389891 0.089273 0.224807
0.368338 0.110663 -0.188164
0.463649 -0.000132 -0.139598
0.386714 0.022466 -0.263533
0.418957 -0.000060 0.193379
0.259546 0.322433 0.180468
0.031493 0.266239 -0.068573
0.408494 0.147061 0.109971
0.285445 0.179226 -0.159325
0.296016 0.236779 0.126068
-0.094280 0.319989 0.047908
0.400159 -0.000050 0.234671
0.361280 0.169837 0.246763
0.259379 0.293208 0.182298
-0.240123 0.349905 0.109488
0.480807 0.021083 -0.154386
0.375939 0.170132 0.145095
0.427536 -0.000042 0.286174
0.294569 0.067703 -0.288399
0.185907 0.227534 -0.078122
0.490624 -0.035830 -0.100528
0.287947 0.297005 0.118320
0.368878 0.065288 -0.261638
0.137954 0.216916 -0.141574
0.244613 0.132264 -0.240307
0.444020 0.053232 -0.158421
0.392310 0.026406 -0.258173
0.414871 0.162137 -0.103951
0.159240 0.231975 -0.121183
0.450107 -0.022760 -0.202783
0.424154 -0.000071 0.142773
0.277553 0.155520 -0.208754
0.300168 0.089437 -0.253472
0.264712 0.346441 0.153034
0.244173 0.252155 0.112404
0.210266 0.052587 -0.299953
0.297539 0.186782 -0.172683
0.355024 0.055502 -0.274909
0.377260 0.134368 -0.146421
0.254610 0.262827 0.110508
0.483190 -0.000136 -0.152097
0.229110 0.319008 0.196073
-0.099215 0.333488 0.042680
0.296018 0.271593 0.126061
0.476429 0.100138 -0.044955
0.473744 0.040269 -0.161159
0.345631 0.179233 -0.101660
0.391785 0.138305 0.160287
0.310134 0.296998 0.094978
0.415215 0.074132 0.134187
0.344013 0.040254 -0.285454
0.278890 0.322426 0.154401
0.362914 -0.000147 -0.254119
0.030147 0.255441 -0.059454
0.285832 0.244529 0.116309
0.267224 -0.000145 -0.285011
0.323277 0.020183 -0.274095
0.480866 0.012612 0.051990
0.336226 0.109638 -0.248499
0.431727 0.021588 -0.188195
0.422966 0.171050 -0.008814
0.449183 0.137872 -0.071070
-0.144445 0.299816 0.018723
0.446045 0.013027 0.201654
0.282550 0.065039 -0.270345
0.186082 0.164167 -0.212646
0.287944 0.271592 0.118325
0.366582 -0.015902 -0.250600
0.458366 -0.000143 -0.194877
0.255046 0.137850 -0.257073
0.271171 0.034035 -0.281238
0.152695 0.222512 -0.109942
0.457450 0.008498 -0.195757
0.366585 0.015609 -0.250606
-0.150499 0.312458 0.012919
0.439706 -0.000138 -0.180544
0.238268 0.298929 0.186518
0.334560 -0.000153 -0.294500
0.419349 0.105206 -0.139289
0.172332 0.246320 -0.023780
0.268076 0.271604 0.168999
0.462726 -0.055792 -0.171688
0.446362 0.039184 0.117293
0.322556 0.105195 -0.232027
0.303865 0.322413 0.101518
0.454478 0.038621 -0.148396
0.226912 0.192887 -0.173535
0.282725 -0.035853 -0.299717
0.490546 0.012994 0.062090
0.478798 0.067723 -0.111889
0.473696 -0.000147 -0.211244
0.310132 0.271586 0.094983
0.278887 0.297013 0.154406
-0.084727 0.291065 -0.034651
0.456725 0.124295 0.023543
0.416165 0.027807 -0.235318
0.251472 0.322432 0.172733
0.448871 -0.065576 -0.184959
0.313012 0.093244 -0.270736
0.392306 -0.026706 -0.258162
0.446043 -0.013147 0.201659
0.493940 -0.052842 -0.028134
0.399156 0.026667 -0.219403
0.490630 0.035578 -0.100543
0.178213 0.313529 0.106674
-0.052228 0.302028 0.000943
-0.042997 0.232821 -0.105244
0.454511 -0.016534 -0.198565
0.336943 -0.021372 -0.292210
0.379373 0.008489 -0.270563
0.359141 0.206766 0.026575
0.259547 0.334757 0.180465
0.397925 0.155533 -0.093425
0.438698 0.008121 -0.181512
0.337217 0.199155 0.073794
0.330062 -0.038901 -0.267577
0.342795 0.140013 -0.207607
0.160198 0.124261 -0.260560
0.460358 0.093260 -0.129563
0.406117 -0.068885 -0.225921
0.276814 0.246566 0.136742
0.363831 -0.008406 -0.253238
0.454514 0.016247 -0.198572
0.500000 -0.000111 -0.022343
-0.006120 0.303134 -0.007946
0.490543 -0.013180 0.062095
0.470716 -0.034302 -0.090034
0.239622 0.215233 -0.094009
0.374069 0.085589 0.222037
0.480772 -0.013308 0.051908
0.355015 -0.055804 -0.274886
0.382215 -0.016543 -0.267833
0.125994 0.203703 -0.135518
0.440017 0.115539 0.073859
0.370894 -0.021873 -0.246467
-0.006355 0.315918 -0.014866
0.225553 0.293586 0.152036
0.438240 0.046994 0.092618
0.302061 0.296997 0.087243
0.386710 -0.022768 -0.263524
0.278885 0.271600 0.154412
0.473737 -0.040543 -0.161142
0.376311 0.025394 -0.241290
-0.144027 0.352212 0.090965
0.270816 0.322425 0.146666
0.461262 -0.020462 -0.141879
0.416160 -0.028101 -0.235306
0.344007 -0.040557 -0.285437
0.304537 0.222529 0.035538
0.249773 0.224283 -0.104604
0.380425 0.191712 0.046972
0.383935 0.115361 -0.202791
0.382217 0.016239 -0.267840
0.435944 -0.015894 -0.184144
0.441643 0.089453 -0.117925
0.450111 0.022473 -0.202792
0.082101 0.220227 -0.124924
0.444423 0.026411 -0.208243
0.057143 0.195130 -0.148829
0.435947 0.015617 -0.184151
0.426313 0.025399 -0.193383
0.444011 -0.053499 -0.158399
0.448882 0.065297 -0.184986
0.349365 0.170388 -0.166715
0.320982 -0.000148 -0.276288
0.236538 0.201142 -0.187440
0.399152 -0.026953 -0.219392
0.293670 0.233737 0.160657
0.268233 0.256088 0.093168
0.294558 -0.067999 -0.288371
-0.099889 0.279215 -0.049175
0.121469 0.143017 -0.207192
0.282731 0.035555 -0.299732
0.480803 -0.021356 -0.154378
-0.195311 0.331181 0.061203
0.474572 -0.000122 -0.086350
0.307565 0.233874 0.217415
0.295792 0.322412 0.093783
0.229109 0.304268 0.196076
0.353924 0.062624 -0.244744
0.302059 0.271585 0.087248
0.376309 -0.000145 -0.241285
0.270814 0.297012 0.146671
0.289361 0.162123 -0.224203
0.457448 -0.008783 -0.195754
0.470722 0.034057 -0.090048
0.417013 0.013027 0.192834
0.208289 0.298812 0.223869
0.378362 -0.000152 -0.271529
0.464429 -0.000092 0.054086
-0.081314 0.279281 -0.026917
0.226047 0.234019 -0.039666
0.250892 0.290158 0.173342
-0.041306 0.223357 -0.094702
0.340620 0.053220 -0.257488
0.482974 -0.000094 0.052362
0.261829 0.229004 -0.005383
0.446356 -0.039340 0.117309
0.459348 0.065059 -0.100955
0.251473 0.334756 0.172730
0.364881 0.185773 -0.108162
0.268618 0.234117 0.149705
0.393256 0.140019 -0.159260
0.272785 0.346442 0.160769
0.430717 0.062633 -0.171169
0.270159 0.251271 0.147543
0.426311 -0.000140 -0.193378
0.336947 0.021067 -0.292219
0.218462 0.096048 -0.265352
0.278599 -0.000150 -0.303680
0.279434 0.247586 0.153292
0.430953 0.132285 -0.061775
0.454471 -0.038887 -0.148381
0.237184 0.319008 0.203808
0.296023 0.322418 0.126050
0.411673 0.093094 0.275904
0.243299 0.279105 0.181268
0.431723 -0.021866 -0.188186
0.493949 0.052619 -0.028155
0.309877 0.225980 0.139518
0.291097 0.340079 0.121823
0.368867 -0.065586 -0.261611
0.473792 0.050462 -0.020708
0.320683 0.243657 0.220069
0.254013 0.274659 0.186248
0.165959 0.193970 -0.184897
0.379371 -0.008792 -0.270559
0.397094 0.058451 0.180468
0.456361 0.062675 0.046338
0.141002 0.168872 -0.208802
0.102236 0.227920 -0.090934
0.461266 0.020198 -0.141888
0.313364 0.210953 -0.023355
0.417011 -0.013147 0.192840
0.215316 0.316346 0.224980
0.376307 -0.025685 -0.241280
0.457006 0.096075 -0.036803
0.444418 -0.026700 -0.208233
0.316759 0.213510 0.054188
0.270812 0.271600 0.146676
0.438697 -0.008397 -0.181509
0.282327 0.347834 0.140342
0.323274 -0.020478 -0.274086
0.227794 0.100110 -0.283173
-0.095857 0.267908 -0.040848
0.278635 0.226622 0.157983
0.287949 0.322417 0.118315
0.437148 0.109649 -0.151806
0.479567 -0.000108 -0.015160
0.283023 0.340078 0.114087
0.406129 0.068596 -0.225949
-0.188839 0.370935 0.139249
0.475712 0.065341 0.041751
0.176453 0.198295 -0.154527
0.337884 0.212375 0.102758
0.204298 -0.000144 -0.305656
0.478786 -0.067978 -0.111861
0.293337 0.202932 -0.109895
0.494756 -0.000126 -0.096580
0.370898 0.021582 -0.246476
0.263176 0.271222 0.157034
0.330068 0.038607 -0.267593
0.294095 0.243500 0.060300
0.462735 0.055514 -0.171710
0.432801 0.077307 0.133279
0.376635 0.177078 0.250570
3 177 1 37
3 1 216 37
3 1 2 216
3 1 0 2
3 0 214 2
3 214 100 2
3 177 275 1
3 275 7 1
3 7 238 1
3 7 26 238
3 238 151 1
3 1 300 0
3 1 162 300
3 214 160 100
3 214 266 160
3 266 164 160
3 164 142 160
3 142 280 160
3 142 211 280
3 238 22 151
3 22 19 151
3 19 32 151
3 19 14 32
3 162 80 300
3 100 253 2
3 14 59 32
3 151 203 1
3 151 33 203
3 160 287 100
3 214 175 266
3 100 115 253
3 32 215 151
3 280 179 160
3 59 219 32
3 142 206 211
3 142 301 206
3 214 192 175
3 179 112 160
3 162 288 80
3 115 109 253
3 219 119 32
3 216 110 37
3 301 171 206
3 301 146 171
3 146 242 171
3 242 234 171
3 242 75 234
3 242 56 75
3 56 272 75
3 56 173 272
3 56 62 173
3 62 4 173
3 62 260 4
3 234 293 171
3 272 25 75
3 242 278 56
3 206 3 211
3 171 257 206
3 142 126 301
3 146 174 242
3 126 186 301
3 19 107 14
3 107 55 14
3 296 29 30
3 296 55 29
3 296 23 55
3 23 14 55
3 55 5 29
3 55 169 5
3 169 7 5
3 169 98 7
3 169 26 98
3 55 150 169
3 7 124 5
3 124 8 5
3 124 79 8
3 29 15 30
3 29 149 15
3 149 180 15
3 149 51 180
3 149 11 51
3 11 12 51
3 12 73 51
3 149 84 11
3 84 213 11
3 23 59 14
3 73 201 51
3 180 9 15
3 9 87 15
3 149 10 84
3 124 6 79
3 201 33 51
3 124 236 6
3 236 241 6
3 73 68 201
3 8 261 5
3 213 307 11
3 149 181 10
3 51 31 180
3 87 188 15
3 11 194 12
3 11 24 194
3 24 28 194
3 124 64 236
3 299 61 195
3 61 52 195
3 52 13 195
3 13 105 195
3 52 139 13
3 61 35 52
3 221 290 57
3 290 173 57
3 290 94 173
3 290 17 94
3 290 159 17
3 159 16 17
3 16 18 17
3 16 42 18
3 42 256 18
3 256 281 18
3 290 246 159
3 159 283 16
3 17 273 94
3 238 26 20
3 19 22 289
3 193 42 79
3 64 172 302
3 275 177 7
3 177 298 131
3 22 20 21
3 98 26 7
3 20 22 238
3 107 26 235
3 21 20 289
3 22 21 289
3 26 289 20
3 182 25 273
3 272 173 25
3 138 31 119
3 23 296 59
3 31 151 215
3 247 292 208
3 161 208 103
3 299 195 105
3 27 35 92
3 139 27 178
3 307 24 11
3 24 307 36
3 28 24 36
3 203 33 201
3 274 270 34
3 68 270 1
3 201 68 1
3 274 1 270
3 201 1 203
3 40 309 45
3 41 123 83
3 225 136 54
3 258 279 58
3 99 299 307
3 299 99 54
3 99 307 213
3 35 299 264
3 54 264 299
3 269 232 261
3 125 58 268
3 99 84 165
3 282 191 135
3 202 200 135
3 45 56 231
3 278 49 56
3 127 102 297
3 127 231 102
3 127 309 231
3 127 297 309
3 40 231 309
3 40 45 231
3 145 108 49
3 108 231 49
3 170 174 240
3 102 133 240
3 56 49 231
3 35 264 212
3 54 212 264
3 212 54 255
3 155 105 36
3 155 299 105
3 155 307 299
3 155 36 307
3 226 179 280
3 226 112 179
3 226 166 112
3 44 97 226
3 118 44 226
3 304 118 226
3 262 198 251
3 198 285 251
3 285 120 251
3 251 104 205
3 251 204 104
3 251 158 204
3 226 97 166
3 251 120 158
3 187 304 226
3 226 280 211
3 226 211 147
3 226 147 187
3 205 147 251
3 251 147 211
3 251 211 3
3 279 258 86
3 258 58 50
3 269 246 290
3 246 269 261
3 165 10 250
3 10 165 84
3 274 162 1
3 274 34 162
3 270 210 34
3 270 68 210
3 73 210 68
3 114 288 34
3 34 288 162
3 210 228 34
3 34 228 114
3 72 36 106
3 106 36 105
3 106 105 89
3 89 105 139
3 132 214 0
3 132 0 254
3 254 0 300
3 217 254 80
3 80 254 300
3 217 80 63
3 63 80 288
3 143 63 114
3 114 63 288
3 143 114 103
3 103 114 228
3 163 292 106
3 106 292 72
3 163 106 134
3 134 106 89
3 148 134 263
3 263 134 89
3 148 263 303
3 303 263 168
3 65 303 146
3 146 303 168
3 146 301 65
3 153 192 132
3 132 192 214
3 153 132 122
3 122 132 254
3 252 122 217
3 217 122 254
3 252 217 95
3 95 217 63
3 82 95 143
3 143 95 63
3 82 143 67
3 67 143 103
3 308 207 163
3 163 207 292
3 308 163 90
3 90 163 134
3 60 90 148
3 148 90 134
3 60 148 85
3 85 148 303
3 218 85 65
3 65 85 303
3 218 65 186
3 186 65 301
3 184 144 266
3 184 266 175
3 176 184 175
3 176 175 192
3 271 176 192
3 271 192 153
3 233 271 153
3 233 153 122
3 154 233 252
3 252 233 122
3 197 154 95
3 95 154 252
3 48 197 82
3 82 197 95
3 71 48 67
3 67 48 82
3 200 202 308
3 308 202 207
3 167 200 90
3 90 200 308
3 117 167 60
3 60 167 90
3 113 117 85
3 85 117 60
3 229 113 85
3 229 85 218
3 152 229 218
3 152 218 186
3 74 152 186
3 74 186 126
3 282 74 126
3 282 126 142
3 8 79 246
3 216 2 110
3 298 110 131
3 298 177 110
3 37 110 177
3 116 177 131
3 116 7 177
3 253 69 2
3 2 69 110
3 69 76 131
3 69 131 110
3 157 256 42
3 253 109 69
3 69 109 77
3 77 128 69
3 69 128 76
3 123 199 157
3 157 199 256
3 256 199 281
3 281 199 243
3 243 230 281
3 281 230 267
3 267 230 293
3 293 230 220
3 220 171 293
3 100 287 209
3 209 101 100
3 100 101 115
3 115 101 109
3 109 101 306
3 306 239 109
3 109 239 77
3 77 239 128
3 128 239 224
3 249 70 199
3 249 199 123
3 70 130 199
3 199 130 243
3 243 130 230
3 230 130 276
3 276 47 230
3 230 47 220
3 220 47 171
3 171 47 190
3 190 257 171
3 112 166 160
3 160 166 287
3 166 97 287
3 287 97 209
3 44 101 97
3 97 101 209
3 118 306 44
3 44 306 101
3 304 239 118
3 118 239 306
3 304 187 239
3 239 187 224
3 104 70 205
3 205 70 249
3 104 204 70
3 70 204 130
3 204 158 130
3 130 158 276
3 158 120 276
3 276 120 47
3 285 190 120
3 120 190 47
3 198 257 285
3 285 257 190
3 262 206 198
3 198 206 257
3 262 3 206
3 3 262 251
3 221 57 268
3 268 57 310
3 221 58 269
3 58 221 268
3 57 4 310
3 310 4 260
3 170 133 145
3 145 133 108
3 133 170 240
3 145 49 278
3 145 278 170
3 170 278 174
3 108 133 231
3 231 133 102
3 215 119 31
3 215 32 119
3 138 9 31
3 138 119 9
3 180 31 9
3 87 119 188
3 15 188 30
3 87 9 119
3 296 188 59
3 296 30 188
3 219 188 119
3 219 59 188
3 149 29 181
3 250 10 305
3 305 10 181
3 212 255 268
3 268 255 125
3 310 35 268
3 268 35 212
3 45 35 310
3 45 310 260
3 56 45 260
3 56 260 62
3 151 31 33
3 51 33 31
3 73 12 210
3 194 210 12
3 194 28 210
3 99 213 84
3 61 299 35
3 13 139 105
3 92 45 27
3 92 35 45
3 52 27 139
3 52 35 27
3 178 297 139
3 178 27 297
3 309 27 45
3 309 297 27
3 242 174 278
3 81 208 228
3 81 28 208
3 81 210 28
3 81 228 210
3 245 72 208
3 245 36 72
3 245 28 36
3 245 208 28
3 297 263 139
3 139 263 89
3 263 102 168
3 168 102 240
3 102 263 297
3 146 168 174
3 174 168 240
3 196 103 208
3 161 228 208
3 161 103 228
3 196 208 292
3 247 72 292
3 247 208 72
3 295 67 196
3 196 67 103
3 295 196 207
3 207 196 292
3 140 71 295
3 295 71 67
3 140 295 202
3 202 295 207
3 191 282 164
3 164 282 142
3 191 164 144
3 144 164 266
3 191 144 135
3 135 144 184
3 184 176 135
3 135 176 271
3 154 135 233
3 233 135 271
3 48 135 197
3 197 135 154
3 140 135 71
3 71 135 48
3 140 202 135
3 117 135 167
3 167 135 200
3 229 135 113
3 113 135 117
3 229 152 135
3 135 152 74
3 74 282 135
3 223 121 181
3 181 121 237
3 29 279 223
3 181 29 223
3 169 150 26
3 235 150 107
3 235 26 150
3 289 107 19
3 289 26 107
3 55 107 150
3 261 8 246
3 57 173 4
3 172 131 302
3 172 64 131
3 116 64 7
3 116 131 64
3 124 7 64
3 236 64 302
3 277 302 42
3 277 241 302
3 236 302 241
3 277 193 241
3 277 42 193
3 6 193 79
3 6 241 193
3 283 79 42
3 283 246 79
3 159 246 283
3 16 283 42
3 17 18 273
3 75 25 234
3 182 234 25
3 182 273 234
3 94 25 173
3 94 273 25
3 53 41 302
3 53 76 41
3 53 131 76
3 53 302 131
3 91 41 157
3 91 302 41
3 91 42 302
3 91 157 42
3 18 281 267
3 18 267 273
3 267 293 273
3 273 293 234
3 46 41 128
3 128 41 76
3 46 123 41
3 83 157 41
3 83 123 157
3 39 46 224
3 224 46 128
3 39 249 46
3 46 249 123
3 147 39 187
3 187 39 224
3 147 205 39
3 39 205 249
3 232 5 261
3 58 279 269
3 232 279 29
3 232 29 5
3 305 181 237
3 290 221 269
3 269 279 232
3 86 121 223
3 121 86 237
3 237 86 141
3 284 305 227
3 227 305 237
3 284 250 305
3 111 99 165
3 111 165 250
3 111 250 284
3 99 225 54
3 88 185 255
3 88 255 54
3 185 125 255
3 137 58 125
3 137 125 185
3 86 223 279
3 86 244 141
3 141 189 227
3 141 227 237
3 227 66 284
3 284 66 111
3 99 111 225
3 54 136 88
3 43 137 88
3 88 137 185
3 137 96 58
3 58 96 50
3 50 156 258
3 244 86 156
3 156 86 258
3 244 78 141
3 141 78 189
3 189 291 66
3 189 66 227
3 66 183 111
3 111 183 225
3 183 93 225
3 225 93 136
3 93 43 136
3 136 43 88
3 259 96 43
3 43 96 137
3 248 156 50
3 248 50 96
3 78 244 248
3 248 244 156
3 78 38 291
3 78 291 189
3 291 222 183
3 291 183 66
3 222 129 183
3 183 129 93
3 129 259 93
3 93 259 43
3 286 248 259
3 259 248 96
3 38 78 286
3 286 78 248
3 291 294 222
3 294 291 38
3 294 265 129
3 294 129 222
3 129 265 259
3 259 265 286
3 294 38 265
3 265 38 286
