OFF

151 298 0
0.405168 -0.031513 -0.005732
0.441534 -0.028341 0.034161
0.405437 0.025870 -0.002559
0.408649 -0.025443 -0.019084
0.439168 0.033903 -0.034990
0.422756 0.000309 0.059550
0.394007 0.020848 0.011235
0.441093 -0.000682 0.047139
0.449203 0.038391 -0.009017
0.386153 0.011978 0.034734
0.449078 -0.039659 0.021801
0.434893 -0.038662 0.028055
0.418944 0.042267 -0.009165
0.423460 0.002254 0.049978
0.439706 0.047353 -0.015031
0.494247 -0.029330 0.009929
0.415370 -0.006075 0.053839
0.444091 -0.048171 -0.004311
0.476396 0.010821 -0.048998
0.498722 0.010057 -0.023333
0.425930 0.035853 -0.019766
0.447778 0.000904 0.051473
0.473096 0.023511 -0.043161
0.419950 0.021715 -0.033406
0.481431 0.033300 -0.017507
0.435510 0.002767 0.043843
0.484278 0.003652 0.045125
0.401173 -0.014733 0.049722
0.440077 0.036229 0.010216
0.476288 -0.012097 -0.050265
0.420921 0.028126 0.029181
0.396232 -0.032410 0.020476
0.419131 0.008795 -0.039279
0.410110 -0.030983 0.030434
0.444652 -0.050601 -0.013136
0.415709 0.034108 0.005271
0.388406 -0.014976 0.045327
0.415532 -0.014054 0.050561
0.404509 -0.005864 0.050950
0.390188 -0.022484 0.035183
0.388670 -0.004043 0.019356
0.465283 0.035078 0.000968
0.484189 -0.015426 0.044070
0.487501 -0.001778 -0.036841
0.390352 0.012524 0.037119
0.440505 -0.024094 -0.049154
0.439704 -0.043541 0.005804
0.441045 -0.010937 0.046572
0.396496 0.023955 0.023593
0.419736 -0.024118 -0.035940
0.481278 -0.029537 0.038234
0.440725 0.022955 -0.046552
0.423384 -0.014003 0.049079
0.470821 -0.040775 0.025694
0.420614 -0.037398 0.025557
0.413162 0.014810 0.043096
0.492094 -0.003838 0.028452
0.409811 -0.013458 0.053845
0.494483 0.021142 0.012721
0.412973 -0.025627 0.040860
0.409880 0.001313 0.054661
0.449406 0.030520 0.025682
0.422762 -0.031450 0.039456
0.418525 -0.047207 -0.014113
0.498607 -0.014377 -0.024684
0.391937 -0.031378 0.015570
0.441767 0.038926 -0.019098
0.418108 0.038116 0.001235
0.436194 -0.028635 0.035893
0.481363 0.031765 0.010952
0.384964 0.006636 0.033956
0.441317 -0.010696 -0.053372
0.499304 -0.003313 -0.005925
0.422693 -0.013119 0.058807
0.415359 -0.040658 0.001136
0.394354 -0.005670 0.048307
0.383133 -0.005513 0.046409
0.441414 0.010097 -0.052222
0.404225 0.008903 0.044415
0.404361 -0.012971 0.048602
0.463763 -0.037350 -0.036651
0.500000 0.007750 0.012834
0.425942 0.035622 0.010767
0.385996 -0.021638 0.032875
0.435432 -0.013949 0.042919
0.441384 -0.043004 -0.023629
0.440319 0.028969 0.027742
0.398875 -0.014490 0.048477
0.447712 -0.013054 0.050702
0.445101 0.045289 -0.007833
0.384345 0.004729 0.042948
0.471157 0.030997 0.029663
0.440004 -0.038259 0.024024
0.398957 0.003033 0.049446
0.417023 0.033321 -0.010623
0.384857 -0.016232 0.032691
0.394836 -0.014362 0.045497
0.383541 -0.004893 0.035159
0.448032 -0.044443 -0.000091
0.388597 -0.019658 0.018492
0.419040 -0.010621 -0.040353
0.425379 -0.050043 -0.021165
0.439241 -0.051809 -0.020515
0.423006 0.020661 0.042338
0.438840 -0.036236 -0.038869
0.464565 -0.041200 -0.010769
0.406666 -0.036627 0.001866
0.435210 0.028970 0.031796
0.450140 -0.031749 0.038758
0.406978 0.030101 0.005556
0.401256 0.003115 0.050709
0.388743 0.011571 0.020219
0.472867 -0.025323 -0.045862
0.408867 0.021277 -0.016500
0.393779 -0.027936 0.008537
0.481098 -0.037958 -0.021448
0.392194 0.023511 0.018605
0.388172 -0.005745 0.050178
0.417722 -0.044220 -0.003318
0.410355 0.021309 0.033326
0.450385 0.020778 0.041663
0.448634 0.008505 0.049973
0.409623 -0.006127 0.055278
0.444513 0.041906 0.000671
0.388495 0.003961 0.046375
0.425577 -0.039728 -0.023946
0.448499 -0.020455 0.048372
0.397893 -0.005868 0.051585
0.404428 0.001458 0.049400
0.394918 0.003272 0.046472
0.448417 0.037698 0.004452
0.481502 0.018347 0.040882
0.419315 0.000427 0.059735
0.493486 -0.026831 -0.023765
0.493716 0.022381 -0.021043
0.499888 -0.016084 0.011516
0.416688 -0.038136 -0.014575
0.384251 -0.015322 0.041839
0.419251 -0.013224 0.058980
0.404091 -0.019818 0.042826
0.401265 -0.005970 0.053131
0.436413 0.018131 0.038480
0.481029 -0.039570 0.007007
0.397204 0.011718 0.041035
0.448819 -0.043653 -0.013555
0.415608 0.002214 0.051461
0.397046 -0.022178 0.039161
0.464100 0.034534 -0.032676
0.425574 -0.042866 0.006427
0.425828 0.045800 -0.015864
0.441751 0.017979 0.036723
3 3 100 0
3 100 32 0
3 32 113 0
3 113 2 0
3 2 114 0
3 2 6 114
3 6 40 114
3 6 111 40
3 32 23 113
3 47 1 84
3 1 68 84
3 47 126 1
3 68 52 84
3 25 121 7
3 25 150 121
3 25 141 150
3 25 103 141
3 69 8 41
3 43 18 64
3 42 81 56
3 105 115 98
3 29 18 77
3 132 5 73
3 72 135 81
3 72 64 135
3 43 19 18
3 43 64 19
3 42 26 81
3 7 47 73
3 7 21 88
3 71 77 32
3 21 26 42
3 10 108 53
3 68 11 62
3 122 16 57
3 52 62 59
3 33 31 39
3 146 33 39
3 139 87 27
3 117 75 96
3 15 133 115
3 142 15 115
3 106 74 136
3 3 49 100
3 98 144 34
3 130 28 123
3 14 89 123
3 149 14 123
3 12 149 123
3 67 12 123
3 91 69 58
3 131 91 58
3 58 134 19
3 81 58 19
3 44 143 124
3 143 78 129
3 44 9 48
3 30 109 82
3 145 60 55
3 30 82 107
3 61 86 82
3 28 61 82
3 99 114 40
3 71 29 77
3 26 21 121
3 131 120 91
3 141 103 107
3 122 60 16
3 55 103 145
3 48 119 143
3 44 48 143
3 93 78 110
3 75 117 129
3 134 58 69
3 24 134 69
3 35 109 94
3 8 130 89
3 138 132 73
3 92 1 108
3 144 85 102
3 34 144 102
3 125 85 104
3 144 80 85
3 45 49 104
3 137 83 95
3 87 127 140
3 27 87 140
3 59 33 139
3 0 114 106
3 62 54 33
3 59 62 33
3 62 52 68
3 42 50 126
3 72 19 64
3 72 81 19
3 92 10 46
3 148 92 46
3 92 148 11
3 57 79 38
3 122 57 38
3 148 74 106
3 65 83 31
3 146 96 87
3 36 96 146
3 112 80 115
3 133 112 115
3 125 104 49
3 115 144 98
3 105 142 115
3 105 98 142
3 136 74 63
3 17 118 148
3 46 17 148
3 10 92 108
3 67 123 28
3 123 89 130
3 113 109 2
3 113 94 109
3 134 22 18
3 19 134 18
3 124 129 117
3 90 9 44
3 124 90 44
3 116 109 48
3 13 145 103
3 7 5 25
3 61 91 120
3 29 64 18
3 56 135 42
3 56 81 135
3 145 132 16
3 78 55 60
3 6 2 116
3 143 119 78
3 128 110 78
3 117 76 90
3 124 117 90
3 131 58 81
3 26 131 81
3 66 4 147
3 51 23 32
3 77 51 32
3 66 8 89
3 14 66 89
3 21 7 121
3 108 1 126
3 17 98 34
3 106 3 0
3 3 106 136
3 112 133 64
3 29 112 64
3 36 117 96
3 83 137 36
3 39 83 36
3 106 65 31
3 37 52 59
3 84 52 47
3 53 98 46
3 40 97 95
3 99 40 95
3 108 50 53
3 11 54 62
3 37 57 16
3 106 31 54
3 83 65 99
3 95 83 99
3 38 79 27
3 140 38 27
3 76 137 95
3 97 76 95
3 3 136 125
3 49 3 125
3 80 144 115
3 125 136 63
3 101 125 63
3 85 125 101
3 102 85 101
3 61 120 86
3 13 5 132
3 145 13 132
3 35 94 12
3 67 35 12
3 41 24 69
3 41 8 24
3 130 8 69
3 20 23 4
3 147 22 134
3 24 147 134
3 129 124 143
3 93 129 78
3 9 116 48
3 35 82 109
3 128 60 122
3 38 128 122
3 82 86 107
3 120 131 121
3 5 7 73
3 47 7 88
3 141 107 150
3 30 107 103
3 60 145 16
3 109 30 48
3 70 111 116
3 9 70 116
3 128 38 140
3 110 128 140
3 90 76 97
3 70 90 97
3 94 113 23
3 20 94 23
3 8 147 24
3 94 20 149
3 12 94 149
3 20 66 14
3 149 20 14
3 46 98 17
3 49 45 71
3 100 49 71
3 104 85 80
3 15 50 42
3 135 15 42
3 76 117 36
3 137 76 36
3 27 79 139
3 33 146 139
3 106 114 65
3 139 57 59
3 138 37 16
3 108 126 50
3 88 42 126
3 54 11 148
3 57 37 59
3 54 148 106
3 39 31 83
3 139 146 87
3 39 36 146
3 133 15 135
3 64 133 135
3 142 53 50
3 15 142 50
3 34 102 101
3 17 34 101
3 118 17 101
3 63 118 101
3 118 63 74
3 126 47 88
3 121 150 120
3 82 67 28
3 82 35 67
3 69 91 130
3 51 77 18
3 22 51 18
3 51 22 147
3 4 51 147
3 129 93 127
3 75 129 127
3 6 116 111
3 48 30 119
3 78 60 128
3 13 25 5
3 86 150 107
3 130 91 61
3 28 130 61
3 97 40 111
3 70 97 111
3 100 71 32
3 26 121 131
3 25 13 103
3 138 16 132
3 30 103 55
3 119 30 55
3 109 116 2
3 55 78 119
3 127 93 110
3 140 127 110
3 9 90 70
3 4 23 51
3 8 66 147
3 66 20 4
3 88 21 42
3 150 86 120
3 73 52 37
3 138 73 37
3 74 148 118
3 53 142 98
3 71 45 112
3 29 71 112
3 112 45 104
3 80 112 104
3 87 96 75
3 127 87 75
3 65 114 99
3 33 54 31
3 57 139 79
3 73 47 52
3 1 92 11
3 68 1 11
3 10 53 46
