OFF

528 1052 0
-0.062714 0.361125 -0.224396
0.124201 0.082831 -0.347510
-0.049085 0.363466 -0.316094
-0.146836 0.006473 0.322941
0.053708 -0.157560 -0.263944
0.126993 0.110802 0.056338
-0.057662 0.329618 -0.192456
0.035999 -0.039299 0.132453
-0.030753 -0.271195 0.033223
-0.061558 -0.394304 0.088439
-0.066248 0.496320 -0.049123
-0.055719 0.342591 0.153990
-0.018312 0.310359 0.181474
0.014842 0.163504 0.101633
-0.067573 0.060741 0.331891
0.048545 -0.074862 0.009291
0.063009 -0.031017 0.003951
0.050047 0.001086 -0.161719
0.129691 0.006820 -0.023610
0.118435 -0.007442 -0.332821
0.042684 0.492169 -0.160812
-0.091914 0.198336 -0.000848
-0.059952 0.016059 -0.015085
0.195531 0.082224 -0.200245
-0.081982 -0.226847 0.152275
-0.074766 0.135577 0.087657
-0.058576 -0.331399 -0.296470
-0.074897 -0.263071 -0.264258
-0.108660 0.182373 0.170725
-0.098312 0.142370 0.286996
-0.148582 0.054915 0.365104
0.140130 0.412582 -0.223493
0.138756 0.488141 -0.145209
0.157566 0.427143 -0.143551
0.128602 0.486339 -0.051842
0.038297 0.163308 0.200770
0.124799 0.237454 0.064112
0.132456 0.243516 -0.298439
-0.062044 0.500000 -0.107199
-0.003745 0.032161 0.105125
0.030062 0.012355 -0.014011
0.047160 -0.007230 -0.274344
-0.153495 0.095361 0.312692
0.060815 -0.249084 -0.208546
0.147612 0.000349 -0.167848
0.173932 0.103271 0.001070
-0.093126 0.374823 0.126506
0.119550 0.383122 0.038719
0.001686 -0.170910 -0.366821
0.095301 0.366366 -0.318492
0.053034 0.113028 0.110450
0.118865 0.210750 -0.321512
-0.059401 -0.188392 -0.153403
-0.008757 -0.135695 -0.149595
0.064263 -0.241410 -0.157165
-0.043386 -0.245835 -0.121919
-0.074518 -0.285054 -0.338970
0.143009 -0.003631 -0.253071
-0.127372 -0.220052 -0.199380
-0.174765 0.044545 0.233605
-0.174939 0.037669 0.327808
-0.076719 0.227910 0.218302
-0.119903 0.278714 0.153236
0.122652 0.428849 0.009934
0.168134 0.249497 -0.068870
0.162885 0.238796 -0.238535
0.017484 0.118956 0.105850
0.086785 0.219186 0.108504
-0.053932 -0.135929 -0.250047
-0.050112 -0.014794 -0.275804
-0.040537 -0.081628 -0.274951
-0.058138 -0.114035 0.129973
0.022735 -0.300753 -0.125071
0.133852 0.123954 -0.321510
0.069524 -0.226791 0.103936
-0.065600 0.479790 -0.022754
-0.006188 -0.144126 0.012850
-0.085947 -0.121198 0.066816
-0.127206 0.234840 0.057231
0.130796 0.399974 -0.004213
0.042678 -0.111424 -0.364483
0.038794 -0.140269 -0.363813
0.083095 0.151513 0.108930
-0.036180 -0.214150 -0.363427
0.043159 -0.313862 -0.179042
-0.005197 -0.093280 -0.274409
0.034637 -0.211286 0.156011
0.068644 0.458086 -0.316058
0.115029 0.265101 0.074059
0.025925 -0.046144 -0.259704
-0.086382 0.471060 -0.084278
-0.007913 -0.204284 -0.130729
-0.088461 0.229436 0.002090
-0.030510 -0.148411 -0.350333
0.025987 0.491834 0.004583
0.104274 0.403688 -0.298657
0.050015 -0.246013 -0.235758
-0.133952 0.281089 0.050478
-0.043545 0.003078 -0.181652
-0.030840 -0.080208 0.130380
0.036790 -0.154150 0.007552
-0.054559 -0.059022 0.001532
0.089173 0.473459 -0.229513
0.110405 0.465273 -0.265059
-0.010411 0.477700 0.035902
-0.102784 0.433849 -0.053431
0.107075 0.035429 -0.355437
0.033426 -0.070897 -0.003229
0.154757 0.316291 -0.218836
-0.092298 0.004242 -0.218782
0.141786 0.334975 -0.002974
-0.129830 0.363435 -0.001178
-0.024837 -0.117018 -0.276171
0.060109 -0.139482 -0.282738
0.090476 0.286858 0.108077
-0.060362 -0.159077 -0.211327
-0.104084 0.320710 -0.090577
-0.137943 0.247549 0.094136
-0.043361 -0.143048 0.136548
-0.092777 -0.221617 -0.145814
0.150098 -0.039436 -0.185363
0.108171 0.197728 0.088396
0.053891 -0.140723 0.145793
-0.066547 -0.308226 -0.317720
0.001091 -0.084073 -0.254456
-0.045360 0.383774 0.131551
-0.061634 -0.198936 -0.242964
0.043292 0.480559 -0.214982
-0.057602 0.455087 -0.216840
-0.158392 -0.329230 -0.182208
0.089948 -0.011974 -0.363363
-0.029135 -0.307749 -0.122577
0.182293 0.099367 -0.024238
0.147313 0.453841 -0.119433
-0.065638 -0.082817 0.103172
-0.087892 -0.187330 -0.298760
-0.011581 -0.069045 -0.003766
0.117205 0.458757 -0.025061
-0.039416 -0.388762 -0.157133
-0.087262 -0.264705 -0.315364
-0.161804 0.153696 0.237867
-0.028641 0.127267 0.096753
0.181842 0.076449 -0.256750
-0.066078 0.301408 0.176429
-0.078517 0.024691 0.078940
0.119286 -0.035433 -0.159932
0.085443 -0.174009 0.099085
0.034176 0.454235 -0.315597
0.063788 0.433736 0.063772
0.041757 0.488313 -0.181475
-0.053388 0.496198 -0.176415
0.095043 -0.157163 -0.145775
0.147362 0.368759 -0.047711
-0.041131 0.028426 0.092033
0.151143 0.372359 -0.068468
-0.045324 -0.048211 -0.275377
-0.071088 0.445958 0.054109
-0.050744 -0.303159 -0.249169
-0.080427 0.167043 0.266010
-0.000384 -0.009400 -0.254960
0.108783 0.461098 0.004289
-0.098260 0.194267 0.046848
-0.074769 -0.149489 -0.302063
0.120041 0.298638 0.059935
0.055862 -0.174979 -0.300167
0.070262 -0.097258 0.126602
-0.071843 -0.157437 -0.336960
-0.091243 0.340659 -0.128613
0.090361 0.463263 -0.300673
-0.144117 0.099497 0.322162
-0.087498 0.049401 0.359386
0.022554 -0.062567 -0.370105
0.072385 0.446963 0.035608
0.138939 0.371099 -0.018361
-0.093808 -0.328125 -0.125293
0.031573 -0.176237 0.016691
-0.092044 0.249823 -0.017564
-0.034357 -0.161862 0.029029
0.174488 0.244647 -0.194215
0.099231 0.335094 0.085645
0.105790 -0.182068 -0.189259
-0.003542 -0.046380 0.130788
-0.098311 0.253312 0.185769
0.031481 -0.225349 0.038530
0.078797 -0.113066 -0.327611
0.053932 0.397560 0.101430
-0.071623 -0.017288 0.066605
0.151993 0.277246 -0.249604
0.190385 0.093652 -0.077584
-0.100589 0.116292 0.311967
-0.081018 0.291189 -0.091983
-0.001487 0.419873 -0.321013
0.031389 -0.274461 0.060368
0.090960 -0.071214 -0.152015
-0.010936 -0.370166 -0.187829
0.135335 0.041145 -0.317112
-0.051222 -0.076104 -0.311332
-0.025218 -0.047329 -0.249712
-0.000112 -0.146744 -0.256996
0.095084 -0.005430 -0.263708
0.056446 -0.182288 0.039228
-0.093867 -0.189565 -0.205354
0.157820 0.244112 -0.015669
-0.003340 -0.124922 0.156450
-0.110074 -0.220834 -0.172597
-0.020018 -0.144038 -0.269045
0.037717 -0.269303 0.137181
-0.160801 0.025509 0.278273
-0.067222 -0.021488 0.014643
0.180302 0.247921 -0.156787
0.086634 -0.053794 0.107411
-0.141339 0.010738 0.275107
-0.006978 -0.129224 -0.366126
-0.021096 0.460304 -0.288701
-0.011844 0.497035 -0.116701
0.038652 -0.056080 -0.274106
-0.096337 -0.021124 0.267193
0.061815 0.239595 0.115392
0.041588 0.465921 -0.266187
-0.087464 -0.378397 -0.130175
0.046951 -0.178362 -0.345981
-0.078092 -0.224400 -0.279254
0.161624 0.125516 -0.279818
-0.034554 -0.221582 0.179743
0.055013 0.460249 -0.314192
-0.135695 0.140566 0.187014
0.047445 -0.163537 0.146448
0.145145 -0.082182 -0.194049
-0.051821 -0.128614 -0.163008
-0.027985 -0.215435 -0.247836
0.136626 0.247964 0.031351
-0.027724 0.083422 0.276902
-0.021826 -0.321167 -0.332500
-0.028671 0.269175 0.203913
0.062634 -0.106995 -0.144099
0.046972 0.476461 -0.231139
-0.056373 0.452773 -0.189292
0.070235 -0.202470 0.086546
-0.178021 0.076537 0.300111
-0.174263 0.120400 0.220307
-0.174852 0.041107 0.280707
-0.032608 -0.192175 -0.142677
0.059900 0.206830 0.134436
0.096884 -0.005923 -0.259011
-0.020886 -0.196536 -0.262048
-0.073138 -0.051599 0.076370
-0.017343 -0.004388 0.111337
0.098830 0.000717 -0.164784
-0.181104 0.115404 0.272414
0.103005 -0.010330 0.088220
-0.111029 0.205653 0.202376
-0.019772 -0.291183 -0.123044
-0.057166 -0.095801 -0.181244
-0.107603 -0.197554 0.094051
-0.128183 0.249821 0.146178
-0.145338 0.293989 0.089981
0.008167 -0.222606 -0.253923
-0.057952 0.261667 -0.093388
-0.084387 0.443649 -0.155958
0.181042 0.185645 -0.091084
0.165613 0.243510 -0.214214
0.166949 0.200048 -0.248384
-0.075248 -0.239609 -0.335357
-0.024485 0.455518 0.057695
-0.129763 0.012683 0.225691
-0.125641 0.171741 0.258596
-0.051527 -0.010586 -0.244968
-0.026421 -0.110001 -0.252252
0.085026 -0.211739 -0.173212
0.180696 0.141514 -0.060667
-0.026354 -0.096189 -0.162686
-0.119262 0.190803 0.228084
-0.134105 -0.293474 -0.162664
-0.073448 -0.269615 -0.246584
-0.096316 0.385998 -0.128309
-0.174143 0.086232 0.225053
0.078470 -0.184305 -0.238049
-0.065394 0.414067 -0.173329
0.165037 0.372855 -0.161194
0.087126 -0.029039 -0.289946
0.004010 -0.333885 -0.124137
-0.040990 -0.078810 -0.338584
-0.062512 -0.062989 -0.199481
0.073209 -0.141383 -0.328846
0.187972 0.137155 -0.109813
0.179155 0.123589 -0.233172
0.119563 0.150969 -0.333048
0.000383 0.061318 0.228612
0.053636 -0.216522 0.132329
0.070504 -0.035064 -0.156867
0.174063 0.049299 -0.072676
0.131746 -0.078678 -0.172167
0.174588 0.217571 -0.079977
-0.008890 -0.263180 -0.257186
0.016710 -0.103271 -0.149273
-0.111658 0.408114 -0.003410
-0.123926 -0.325065 -0.232672
-0.124341 0.315245 0.128666
0.194902 0.088665 -0.128542
0.166173 0.046908 -0.104345
-0.057018 0.391196 -0.190874
-0.075977 -0.194165 -0.331744
-0.088260 0.469259 -0.056031
0.020870 0.109339 0.224648
-0.034341 0.419341 0.095352
-0.027580 -0.181703 -0.363361
-0.033445 0.012632 0.269695
-0.015692 -0.245975 0.027596
0.003311 -0.044429 -0.274647
0.044612 0.166816 0.147615
-0.079886 0.016046 0.027754
0.006870 0.075559 0.105487
-0.000887 -0.063764 -0.162363
0.079077 0.394559 -0.326609
-0.050595 0.047029 0.328978
0.057786 -0.118470 0.020942
-0.074415 0.375361 -0.157365
-0.006363 -0.240308 0.172659
-0.059729 0.197518 0.246181
-0.042940 0.490321 0.010522
0.033153 0.192333 0.122706
-0.012545 -0.228168 -0.128732
0.171916 0.253098 -0.089627
-0.076699 -0.187609 -0.180186
-0.060663 -0.354261 -0.126852
-0.030373 -0.101574 0.007191
-0.150734 -0.343839 -0.208325
-0.027229 0.466570 -0.267316
-0.103195 -0.430427 -0.137427
-0.030941 -0.040937 0.117549
0.055026 -0.230930 0.074008
0.042177 -0.070846 -0.148951
-0.101180 0.199826 0.238449
-0.197981 0.070156 0.253192
0.025097 0.118071 0.192721
-0.052729 -0.073257 -0.247508
0.191648 0.129572 -0.186485
0.143981 0.036354 -0.276028
-0.084351 0.275834 -0.065741
0.066313 -0.061699 -0.363923
0.004466 0.151056 0.133037
0.094913 0.493347 -0.001356
-0.027117 -0.161801 -0.241928
0.024580 -0.031339 -0.162041
-0.092330 -0.340608 -0.236993
0.018295 -0.210502 -0.135544
0.171007 0.189375 -0.043751
0.165462 0.285024 -0.078520
0.012604 -0.111597 0.001893
0.058515 0.479212 0.029962
-0.062025 0.443611 -0.243618
0.044945 -0.090011 0.139123
-0.101298 -0.225156 0.125630
0.051714 0.135302 0.108342
0.055108 -0.216455 -0.328149
-0.000308 -0.099691 -0.368893
-0.068834 -0.200765 0.148925
0.009241 -0.028345 -0.008888
0.027560 -0.162734 -0.139540
-0.026026 -0.155167 -0.160992
0.163117 0.251362 -0.045203
-0.033440 -0.115118 -0.337306
0.121328 -0.078407 -0.156812
-0.036606 -0.174222 0.154640
-0.067201 0.319623 -0.225225
0.074475 -0.247965 -0.184151
0.022117 0.465078 0.061281
-0.004379 -0.147679 0.160355
-0.147762 -0.299976 -0.201620
-0.062460 -0.192159 -0.267245
0.029324 0.126802 0.160794
-0.125336 -0.374637 -0.129568
-0.063018 0.112896 0.281949
0.009036 -0.168972 -0.248016
0.016127 -0.003569 0.118789
0.014333 0.494833 -0.025240
0.049136 -0.192836 -0.142357
-0.101390 0.431338 -0.128006
0.155227 0.313350 -0.046656
0.164623 0.280469 -0.206525
-0.096152 -0.236070 -0.243999
-0.012519 0.109731 0.260980
-0.035767 -0.026493 -0.009426
-0.119604 0.191742 0.134508
0.148108 0.063043 -0.288715
-0.029003 -0.267659 -0.347963
0.016329 -0.082111 0.144452
-0.117308 0.398439 -0.050831
0.156057 0.238498 -0.259453
0.028251 0.401256 -0.342434
-0.024170 0.390858 -0.319813
-0.030388 0.428154 -0.297796
-0.047683 -0.062768 -0.172330
0.139496 0.424168 -0.048766
0.079976 -0.175169 -0.149170
-0.010325 -0.273294 -0.123495
0.012262 0.428901 0.098939
0.041187 -0.278402 -0.221006
0.045188 -0.176142 -0.254103
-0.114028 0.344220 -0.044462
-0.054772 0.291441 -0.136193
-0.073790 -0.153330 0.077620
-0.064526 -0.059028 0.022951
0.084372 -0.046795 -0.256798
0.153241 0.416815 -0.183797
-0.062700 0.241713 -0.044513
0.153589 0.056333 -0.006503
-0.109817 -0.257719 -0.143120
-0.103161 0.205123 0.048118
-0.044089 0.148693 0.097338
-0.110749 0.290001 -0.038093
0.176468 0.170728 -0.209593
0.024363 -0.347097 -0.176839
0.019611 -0.168009 -0.272393
-0.032940 0.174419 0.243859
-0.084598 0.472843 -0.111969
-0.060330 0.018000 0.085924
-0.144789 -0.256113 -0.194915
0.105044 0.131158 0.082634
-0.062693 -0.206896 -0.144246
0.079889 0.488834 -0.051163
0.172508 0.318567 -0.178836
-0.121388 0.257933 0.009386
0.019714 -0.132513 -0.268820
-0.060867 -0.070707 -0.234692
0.142302 0.240387 -0.278091
-0.075482 -0.170301 0.115300
0.114055 0.415622 0.038099
-0.082916 -0.052576 0.047285
0.020515 -0.255628 -0.130308
0.043499 -0.271082 -0.141118
0.046189 -0.012842 -0.369545
-0.103133 -0.306340 -0.238760
-0.104272 -0.310348 -0.137849
-0.050696 -0.117810 -0.309822
-0.022216 -0.030343 -0.172008
-0.046234 -0.393235 -0.198818
0.152235 0.089732 -0.301403
-0.067802 -0.005485 -0.219337
0.084940 0.185349 0.108717
-0.167338 0.046644 0.346164
-0.000748 0.485610 -0.208529
-0.130548 0.201110 0.098291
-0.017099 -0.055167 -0.355467
0.069539 -0.195266 0.115707
-0.041022 0.034242 0.319267
-0.059751 -0.155562 -0.269270
0.032401 -0.241848 -0.269018
-0.066568 -0.184847 0.060930
-0.059234 -0.048018 0.107949
-0.081478 -0.129056 -0.217311
-0.035416 -0.396394 -0.172501
0.113395 -0.117920 -0.158971
0.125045 0.350622 0.039338
-0.062280 -0.281613 -0.121018
-0.111980 0.418231 -0.086285
0.051356 -0.237961 -0.137120
0.149780 0.201788 -0.277482
-0.082107 0.410390 0.090307
-0.049987 -0.013003 -0.314239
0.006446 -0.192559 0.163096
-0.076642 0.080134 0.083298
0.053606 -0.279572 0.108787
0.094581 -0.060286 -0.309137
-0.060055 0.433242 -0.277070
0.030144 -0.104931 -0.273867
0.171013 0.161300 -0.258234
-0.093486 0.452793 -0.005642
-0.162535 0.073427 0.215259
-0.039255 0.083869 0.096391
-0.057014 0.468139 0.032315
0.009728 0.455582 -0.307809
-0.025024 -0.203918 0.028313
-0.075236 -0.090113 0.044884
-0.082903 0.473871 -0.142613
0.003251 0.002082 -0.171685
-0.117532 0.041565 0.207345
0.133642 0.363849 0.011173
0.129177 0.042995 -0.298354
-0.142646 0.163027 0.211342
-0.062503 -0.252570 -0.248871
0.110016 0.231564 0.088183
-0.034722 -0.226705 -0.255249
0.052234 -0.082887 -0.264448
-0.074453 0.335138 -0.160534
-0.095194 -0.445691 -0.168162
0.068132 -0.054336 -0.284587
0.153999 0.366553 -0.201316
0.170017 0.052156 -0.046003
-0.059346 -0.216365 0.044241
0.108605 0.287734 -0.321412
-0.037430 0.482466 -0.234390
0.121840 -0.164170 -0.189538
-0.125609 0.310684 0.004104
-0.008579 0.057848 0.257480
0.064386 0.225083 0.154423
-0.007516 0.495134 -0.151310
-0.034780 0.497567 -0.129254
-0.102748 0.289843 0.161199
-0.007527 -0.367930 -0.166986
0.010350 -0.212595 -0.367517
-0.049165 -0.134103 0.018148
0.172470 0.146323 -0.021340
0.144632 0.298850 0.012413
0.020802 -0.107467 0.147786
-0.076150 -0.294020 -0.293866
0.140616 0.364139 -0.242083
-0.113935 -0.272072 -0.240527
-0.065295 0.086818 0.306920
0.062169 0.393477 -0.335513
0.070728 -0.113130 -0.285453
0.156523 0.278731 -0.031162
-0.047813 0.139205 0.266026
-0.108032 0.369471 -0.088431
0.169270 0.039296 -0.226658
0.038515 -0.208575 -0.271488
0.187766 0.176920 -0.172724
0.027400 -0.120816 -0.259200
0.106120 -0.003742 -0.295306
0.143503 0.165078 -0.295510
-0.126999 0.238181 0.130353
0.050760 -0.008215 -0.264951
0.002685 0.136040 0.245057
0.083302 -0.215576 -0.198902
-0.033889 -0.010643 -0.342042
-0.110162 -0.266884 0.134974
-0.049592 -0.382156 -0.130782
0.036488 0.473869 -0.249725
3 128 364 0
3 128 109 364
3 364 6 0
3 364 400 6
3 364 17 400
3 0 236 128
3 109 98 364
3 98 17 364
3 17 257 400
3 17 405 257
3 17 40 405
3 40 22 405
3 22 21 405
3 22 310 21
3 310 144 21
3 144 461 21
3 461 25 21
3 109 438 98
3 128 350 109
3 350 464 109
3 464 2 109
3 2 69 109
3 2 459 69
3 2 524 459
3 2 106 524
3 2 1 106
3 2 286 1
3 2 490 286
3 106 431 524
3 490 51 286
3 2 389 490
3 389 509 490
3 509 49 490
3 106 130 431
3 69 266 109
3 2 390 389
3 509 313 49
3 25 161 21
3 431 443 524
3 431 171 443
3 286 73 1
3 490 37 51
3 390 191 389
3 171 355 443
3 25 442 161
3 431 339 171
3 390 391 191
3 314 170 445
3 170 306 445
3 170 216 306
3 170 3 216
3 170 30 3
3 30 440 3
3 314 14 170
3 3 211 216
3 306 494 445
3 445 231 314
3 180 227 492
3 180 276 227
3 276 4 227
3 4 483 227
3 483 403 227
3 403 57 227
3 483 521 403
3 249 7 210
3 249 374 7
3 249 39 374
3 249 311 39
3 249 50 311
3 249 82 50
3 249 418 82
3 249 5 418
3 7 165 210
3 7 351 165
3 249 406 5
3 249 18 406
3 82 353 50
3 50 66 311
3 351 122 165
3 51 519 286
3 525 8 9
3 525 253 8
3 253 489 8
3 525 352 253
3 8 192 9
3 192 462 9
3 8 307 192
3 462 206 9
3 206 317 9
3 317 223 9
3 206 86 317
3 352 24 253
3 24 356 253
3 206 288 86
3 86 460 317
3 25 28 442
3 25 409 28
3 409 476 28
3 409 264 476
3 409 216 264
3 409 306 216
3 409 287 306
3 409 340 287
3 409 13 340
3 340 370 287
3 17 16 40
3 17 247 16
3 247 44 16
3 476 225 28
3 170 169 30
3 170 189 169
3 44 18 16
3 44 299 18
3 299 290 18
3 18 249 16
3 249 210 16
3 210 15 16
3 21 92 405
3 44 298 299
3 44 23 298
3 23 336 298
3 336 284 298
3 336 516 284
3 516 259 284
3 516 209 259
3 209 322 259
3 209 347 322
3 209 421 347
3 421 278 347
3 278 154 347
3 278 33 154
3 33 133 154
3 133 393 154
3 133 34 393
3 133 32 34
3 32 420 34
3 32 214 420
3 214 38 420
3 38 10 420
3 10 375 420
3 290 488 18
3 406 45 5
3 370 303 287
3 32 20 214
3 32 102 20
3 32 103 102
3 32 31 103
3 32 404 31
3 210 315 15
3 210 146 315
3 210 165 146
3 44 514 23
3 102 149 20
3 45 502 5
3 502 418 5
3 502 121 418
3 502 36 121
3 502 230 36
3 502 346 230
3 346 202 230
3 44 120 514
3 120 57 514
3 120 227 57
3 102 127 149
3 127 441 149
3 441 150 149
3 441 491 150
3 31 95 103
3 31 506 95
3 506 49 95
3 506 490 49
3 506 187 490
3 187 37 490
3 187 425 37
3 10 319 375
3 442 408 161
3 189 42 169
3 165 122 146
3 122 226 146
3 476 468 225
3 468 239 225
3 468 275 239
3 36 481 121
3 287 494 306
3 146 200 315
3 200 100 315
3 491 128 150
3 506 108 187
3 187 388 425
3 406 132 45
3 154 378 347
3 121 82 418
3 170 14 189
3 14 508 189
3 189 29 42
3 29 265 42
3 265 248 42
3 20 496 214
3 38 90 10
3 38 415 90
3 102 235 127
3 40 382 22
3 491 350 128
3 275 333 239
3 216 211 264
3 120 291 227
3 187 65 388
3 375 341 420
3 202 503 230
3 347 64 322
3 481 67 121
3 468 59 275
3 290 188 488
3 42 440 169
3 396 125 185
3 125 12 185
3 12 179 185
3 12 114 179
3 12 495 114
3 12 233 495
3 233 35 495
3 233 414 35
3 233 318 414
3 233 61 318
3 233 143 61
3 143 498 61
3 143 297 498
3 143 46 297
3 46 458 297
3 458 255 297
3 458 111 255
3 458 156 111
3 156 295 111
3 414 522 35
3 179 47 185
3 47 427 185
3 156 467 295
3 111 97 255
3 111 493 97
3 427 148 185
3 125 11 12
3 179 453 47
3 297 62 498
3 396 304 125
3 427 172 148
3 47 63 427
3 493 422 97
3 179 163 453
3 223 525 9
3 223 24 525
3 463 130 19
3 463 184 130
3 26 232 505
3 232 27 505
3 232 293 27
3 232 447 293
3 232 354 447
3 232 500 354
3 232 385 500
3 293 482 27
3 27 139 505
3 27 221 139
3 221 135 139
3 385 83 500
3 83 305 500
3 139 56 505
3 27 369 221
3 69 308 41
3 41 521 69
3 326 296 129
3 296 371 129
3 296 344 371
3 344 485 371
3 344 436 485
3 344 194 436
3 344 412 194
3 344 84 412
3 344 157 84
3 157 397 84
3 371 174 129
3 174 433 129
3 433 272 129
3 157 96 397
3 157 256 96
3 157 480 256
3 480 229 256
3 157 273 480
3 433 407 272
3 256 398 96
3 174 454 433
3 96 43 397
3 273 380 480
3 359 358 53
3 358 294 53
3 358 234 294
3 234 331 294
3 358 151 234
3 224 147 87
3 87 389 224
3 87 509 389
3 147 471 87
3 48 500 305
3 52 119 241
3 53 228 359
3 63 173 79
3 88 481 163
3 61 62 182
3 332 61 265
3 140 271 61
3 110 173 503
3 160 63 341
3 454 131 280
3 238 60 248
3 59 3 207
3 303 370 334
3 60 240 59
3 309 370 242
3 45 346 502
3 67 439 82
3 44 145 193
3 70 465 85
3 521 57 243
3 151 452 291
3 57 41 199
3 69 70 155
3 398 373 342
3 523 180 43
3 268 54 180
3 55 358 91
3 54 72 430
3 395 55 72
3 376 394 345
3 345 55 321
3 444 288 146
3 237 146 330
3 194 412 436
3 499 138 412
3 412 485 451
3 65 261 466
3 262 56 301
3 123 26 56
3 38 496 497
3 64 292 259
3 486 518 279
3 518 437 478
3 384 337 437
3 141 66 25
3 58 119 204
3 119 419 241
3 201 58 115
3 319 302 75
3 302 387 105
3 28 255 520
3 442 28 383
3 231 522 381
3 202 378 511
3 378 393 152
3 153 144 39
3 246 329 39
3 228 282 252
3 4 68 198
3 335 68 266
3 71 245 134
3 71 99 181
3 100 501 76
3 77 402 473
3 361 305 93
3 17 98 475
3 101 310 208
3 327 103 218
3 379 178 108
3 114 320 217
3 257 116 190
3 176 405 422
3 428 416 186
3 504 351 203
3 423 446 205
3 219 526 371
3 236 316 277
3 479 239 250
3 326 417 368
3 432 344 507
3 519 388 457
3 212 281 355
3 281 212 361
3 465 112 423
3 112 465 70
3 283 80 184
3 80 283 81
3 434 70 196
3 70 434 112
3 196 361 434
3 361 196 281
3 423 510 465
3 510 423 113
3 355 81 212
3 81 355 80
3 184 113 283
3 113 184 510
3 83 166 305
3 166 83 301
3 244 369 482
3 369 244 446
3 135 446 162
3 446 135 369
3 162 301 135
3 301 162 166
3 482 515 244
3 515 482 447
3 447 354 515
3 398 68 4
3 68 398 342
3 115 228 450
3 228 115 359
3 450 342 115
3 342 450 68
3 151 358 394
3 4 276 398
3 492 394 180
3 394 492 151
3 273 507 380
3 273 157 507
3 55 407 454
3 407 55 119
3 417 119 58
3 119 417 407
3 58 507 417
3 507 58 380
3 251 55 454
3 251 72 55
3 251 280 72
3 251 454 280
3 84 280 412
3 280 84 72
3 8 489 307
3 24 223 356
3 175 501 100
3 501 175 177
3 367 122 203
3 122 367 226
3 401 71 77
3 71 401 118
3 203 118 367
3 118 203 71
3 100 200 175
3 77 177 401
3 177 77 501
3 443 281 524
3 443 355 281
3 212 305 361
3 93 166 361
3 93 305 166
3 262 83 56
3 262 301 83
3 139 301 56
3 369 27 482
3 205 244 423
3 205 446 244
3 112 446 423
3 215 308 465
3 215 41 308
3 85 308 70
3 85 465 308
3 155 308 69
3 155 70 308
3 159 69 521
3 159 266 69
3 89 483 124
3 89 521 483
3 517 483 4
3 517 124 483
3 197 159 124
3 197 266 159
3 89 159 521
3 89 124 159
3 267 335 124
3 267 68 335
3 197 335 266
3 197 124 335
3 517 198 124
3 517 4 198
3 267 198 68
3 267 124 198
3 373 256 342
3 373 398 256
3 229 342 256
3 126 229 380
3 126 342 229
3 480 380 229
3 432 157 344
3 432 507 157
3 296 507 344
3 296 326 507
3 433 454 407
3 91 241 55
3 91 358 241
3 419 55 241
3 419 119 55
3 241 359 52
3 241 358 359
3 294 331 312
3 343 331 17
3 343 312 331
3 270 53 312
3 270 228 53
3 294 312 53
3 435 392 312
3 435 98 392
3 270 392 228
3 270 312 392
3 343 475 312
3 343 17 475
3 435 475 98
3 435 312 475
3 357 107 136
3 357 40 107
3 348 107 100
3 348 136 107
3 357 382 40
3 357 136 382
3 325 101 136
3 325 501 101
3 382 101 22
3 382 136 101
3 325 348 501
3 325 136 348
3 76 348 100
3 76 501 348
3 472 175 307
3 472 177 175
3 472 489 177
3 472 307 489
3 439 320 82
3 439 67 320
3 217 67 114
3 217 320 67
3 82 320 13
3 374 181 7
3 374 39 181
3 386 181 203
3 386 7 181
3 504 122 351
3 504 203 122
3 386 351 7
3 386 203 351
3 460 367 223
3 460 226 367
3 86 226 460
3 317 460 223
3 470 467 156
3 470 319 467
3 51 37 519
3 425 519 37
3 425 388 519
3 457 466 519
3 457 388 466
3 187 108 65
3 388 65 466
3 261 411 466
3 261 65 411
3 260 65 108
3 260 411 65
3 379 421 178
3 379 108 421
3 260 178 411
3 260 108 178
3 178 516 411
3 178 421 516
3 209 516 421
3 347 378 64
3 322 64 259
3 292 346 259
3 292 64 346
3 360 64 378
3 360 346 64
3 511 503 202
3 511 378 503
3 360 202 346
3 360 378 202
3 230 503 163
3 230 163 36
3 88 114 481
3 88 163 114
3 36 163 481
3 481 114 67
3 121 67 82
3 242 320 114
3 242 370 320
3 340 320 370
3 445 494 231
3 287 303 494
3 494 303 231
3 522 231 303
3 303 35 522
3 396 185 366
3 148 366 185
3 427 63 172
3 148 172 366
3 349 172 341
3 349 366 172
3 160 172 63
3 160 341 172
3 137 63 393
3 137 341 63
3 137 34 341
3 137 393 34
3 133 33 32
3 33 404 32
3 95 168 103
3 95 313 168
3 313 87 168
3 509 87 313
3 389 147 224
3 389 191 147
3 471 147 191
3 390 2 391
3 213 391 464
3 213 464 327
3 87 471 168
3 327 168 213
3 213 168 471
3 285 23 142
3 285 411 23
3 285 466 411
3 285 142 466
3 290 299 188
3 299 298 188
3 470 263 319
3 470 156 263
3 104 263 366
3 104 319 263
3 349 94 366
3 349 341 94
3 104 94 319
3 104 366 94
3 74 330 146
3 74 462 330
3 237 200 146
3 237 330 200
3 330 192 200
3 330 462 192
3 365 43 180
3 365 84 43
3 523 276 180
3 523 43 276
3 96 276 43
3 397 43 84
3 339 184 80
3 339 130 184
3 220 283 354
3 220 81 283
3 220 500 81
3 220 354 500
3 300 0 6
3 300 236 0
3 236 258 150
3 474 150 258
3 254 62 255
3 254 250 62
3 297 255 62
3 498 62 61
3 182 250 61
3 182 62 250
3 250 140 61
3 271 265 61
3 271 140 265
3 140 248 265
3 42 248 440
3 169 440 30
3 484 316 6
3 484 167 316
3 484 400 167
3 484 6 400
3 167 400 116
3 190 400 257
3 190 116 400
3 338 116 257
3 338 410 116
3 338 405 410
3 338 257 405
3 176 410 405
3 176 422 410
3 92 422 405
3 422 92 78
3 408 78 92
3 302 10 90
3 78 408 442
3 277 258 236
3 277 316 258
3 300 316 236
3 300 6 316
3 415 38 474
3 150 474 38
3 240 333 59
3 240 60 333
3 207 60 59
3 207 3 60
3 275 59 333
3 158 265 29
3 225 239 28
3 332 158 61
3 332 265 158
3 318 61 158
3 60 3 440
3 75 467 319
3 75 302 467
3 10 302 319
3 377 258 316
3 274 316 167
3 274 377 316
3 274 455 377
3 274 167 455
3 513 167 116
3 513 455 167
3 513 387 455
3 513 116 387
3 399 116 410
3 399 387 116
3 399 111 387
3 399 410 111
3 493 410 422
3 493 111 410
3 97 422 78
3 97 78 255
3 117 78 442
3 117 255 78
3 391 2 464
3 459 196 69
3 70 69 196
3 434 162 112
3 446 112 162
3 221 369 135
3 236 150 128
3 282 438 450
3 282 98 438
3 392 282 228
3 392 98 282
3 252 450 228
3 252 282 450
3 323 115 58
3 323 359 115
3 52 323 119
3 52 359 323
3 204 323 58
3 204 119 323
3 272 417 129
3 272 407 417
3 328 371 485
3 387 302 455
3 90 455 302
3 310 416 144
3 186 310 428
3 186 416 310
3 245 428 77
3 245 416 428
3 449 245 71
3 449 416 245
3 134 77 71
3 134 245 77
3 426 401 253
3 426 118 401
3 426 356 118
3 426 253 356
3 352 525 24
3 195 1 437
3 195 19 1
3 195 518 19
3 195 437 518
3 384 142 337
3 384 437 142
3 478 337 518
3 478 437 337
3 337 57 518
3 337 142 57
3 514 142 23
3 514 57 142
3 488 188 132
3 488 132 18
3 141 469 66
3 141 25 469
3 311 469 39
3 311 66 469
3 144 416 39
3 153 469 144
3 153 39 469
3 461 469 25
3 461 144 469
3 353 66 50
3 353 13 66
3 353 82 13
3 409 66 13
3 409 25 66
3 438 109 266
3 336 411 516
3 336 23 411
3 295 387 111
3 295 467 387
3 105 467 302
3 105 387 467
3 154 393 378
3 149 150 20
3 214 496 38
3 497 150 38
3 497 496 150
3 496 20 150
3 49 313 95
3 218 168 327
3 218 103 168
3 527 327 491
3 527 103 327
3 350 491 464
3 327 464 491
3 377 415 258
3 474 258 415
3 408 92 21
3 161 408 21
3 286 519 73
3 73 437 1
3 73 519 437
3 222 142 437
3 222 466 142
3 222 519 466
3 222 437 519
3 521 41 57
3 199 518 57
3 199 41 518
3 385 56 83
3 385 232 56
3 301 139 135
3 293 447 482
3 305 212 48
3 48 81 500
3 48 212 81
3 162 434 166
3 361 166 434
3 413 515 113
3 413 244 515
3 413 423 244
3 413 113 423
3 164 354 283
3 164 515 354
3 164 113 515
3 164 283 113
3 215 486 41
3 215 465 486
3 279 41 486
3 279 518 41
3 486 510 518
3 486 465 510
3 171 80 355
3 431 130 339
3 171 339 80
3 196 459 281
3 524 281 459
3 463 518 510
3 463 19 518
3 463 510 184
3 505 56 26
3 123 232 26
3 123 56 232
3 391 213 191
3 471 191 213
3 106 19 130
3 106 1 19
3 406 18 132
3 269 259 346
3 269 188 259
3 269 132 188
3 269 346 132
3 284 188 298
3 284 259 188
3 45 132 346
3 129 417 326
3 368 507 326
3 368 417 507
3 219 328 526
3 219 371 328
3 324 526 280
3 324 371 526
3 174 324 454
3 174 371 324
3 131 324 280
3 131 454 324
3 451 436 412
3 451 485 436
3 138 485 412
3 138 328 485
3 526 138 280
3 526 328 138
3 499 280 138
3 499 412 280
3 183 307 175
3 183 192 307
3 183 200 192
3 183 175 200
3 448 253 401
3 448 489 253
3 448 177 489
3 448 401 177
3 363 223 367
3 363 356 223
3 363 118 356
3 363 367 118
3 74 288 462
3 74 146 288
3 206 462 288
3 86 288 226
3 444 226 288
3 444 146 226
3 96 398 276
3 201 380 58
3 201 115 380
3 126 115 342
3 126 380 115
3 429 456 345
3 429 72 456
3 376 456 394
3 376 345 456
3 395 429 55
3 395 72 429
3 321 429 345
3 321 55 429
3 345 358 55
3 345 394 358
3 365 54 84
3 365 180 54
3 430 84 54
3 430 72 84
3 456 54 394
3 456 72 54
3 268 394 54
3 268 180 394
3 289 331 193
3 289 17 331
3 234 193 331
3 145 247 193
3 145 44 247
3 289 247 17
3 289 193 247
3 362 193 151
3 362 44 193
3 234 151 193
3 243 403 521
3 243 57 403
3 424 450 438
3 424 68 450
3 424 266 68
3 424 438 266
3 362 291 44
3 362 151 291
3 120 44 291
3 227 291 492
3 452 492 291
3 452 151 492
3 99 203 181
3 99 71 203
3 329 181 39
3 329 71 181
3 449 329 416
3 449 71 329
3 246 416 329
3 246 39 416
3 16 15 40
3 107 15 100
3 107 40 15
3 315 100 15
3 208 22 101
3 208 310 22
3 402 101 501
3 402 310 101
3 428 402 77
3 428 310 402
3 473 501 77
3 473 402 501
3 211 3 59
3 264 211 59
3 440 248 60
3 238 333 60
3 238 248 333
3 314 231 14
3 189 508 29
3 372 508 231
3 372 29 508
3 508 14 231
3 468 476 59
3 264 59 476
3 248 140 333
3 239 333 140
3 381 512 231
3 381 522 512
3 372 512 29
3 372 231 512
3 512 158 29
3 512 522 158
3 140 250 239
3 479 28 239
3 479 250 28
3 414 158 522
3 318 158 414
3 334 35 303
3 334 370 35
3 340 13 320
3 11 143 12
3 11 46 143
3 233 12 143
3 125 46 11
3 254 28 250
3 254 255 28
3 383 520 442
3 383 28 520
3 117 520 255
3 117 442 520
3 309 35 370
3 309 242 35
3 495 242 114
3 495 35 242
3 527 235 103
3 527 491 235
3 102 103 235
3 441 127 491
3 235 491 127
3 420 341 34
3 94 375 319
3 94 341 375
3 125 304 46
3 458 304 156
3 458 46 304
3 263 304 366
3 263 156 304
3 396 366 304
3 455 90 377
3 415 377 90
3 506 31 108
3 487 31 404
3 487 108 31
3 487 421 108
3 487 404 421
3 278 404 33
3 278 421 404
3 79 393 63
3 79 173 393
3 152 173 378
3 152 393 173
3 110 378 173
3 110 503 378
3 477 173 63
3 477 503 173
3 453 163 503
3 453 477 47
3 453 503 477
3 47 477 63
3 179 114 163
