OFF

156 308 0
0.045674 -0.080613 -0.007552
0.047502 -0.082746 -0.007577
0.053742 -0.080747 0.019876
0.046484 -0.080109 -0.005837
0.055007 -0.079593 0.019427
0.060603 -0.074858 0.020582
0.055206 -0.075781 0.021886
0.045714 -0.081106 -0.003065
0.049679 -0.079760 0.014821
0.057457 -0.077723 0.021651
0.058916 -0.074812 0.020564
0.045880 -0.081287 -0.000298
0.050179 -0.079691 0.017920
0.048937 -0.080150 0.012644
0.051812 -0.078530 0.020137
0.056512 -0.078529 0.021517
0.053077 -0.077376 0.019688
0.054523 -0.079971 0.019062
0.050163 -0.083058 0.013058
0.048077 -0.083596 0.002194
0.055335 -0.079503 0.021081
0.048446 -0.083597 0.004931
0.053328 -0.077176 0.019844
0.054582 -0.076312 0.021778
0.058673 -0.072641 0.020843
0.046147 -0.081379 0.002455
0.053405 -0.077286 0.021342
0.047099 -0.082341 -0.007120
0.052247 -0.081583 0.015923
0.046342 -0.080041 -0.007468
0.054290 -0.080149 0.018852
0.052550 -0.081606 0.018353
0.050678 -0.082802 0.014675
0.053497 -0.080928 0.019612
0.055514 -0.079186 0.019720
0.051326 -0.082418 0.016208
0.050317 -0.079366 0.016184
0.048748 -0.080585 0.014936
0.051700 -0.078421 0.018378
0.046628 -0.081821 -0.006915
0.046536 -0.079746 -0.008536
0.053584 -0.076969 0.019981
0.049396 -0.080201 0.016469
0.057406 -0.075659 0.020431
0.045651 -0.080833 -0.005846
0.056600 -0.078284 0.020095
0.055527 -0.075506 0.021912
0.054250 -0.080361 0.020351
0.053001 -0.081079 0.017216
0.052064 -0.078341 0.020384
0.050215 -0.082629 0.009787
0.057478 -0.077532 0.020188
0.051700 -0.082178 0.016944
0.048475 -0.080729 0.014138
0.058745 -0.074513 0.020600
0.052320 -0.078144 0.020612
0.051086 -0.082264 0.013126
0.055912 -0.079030 0.021336
0.051071 -0.078862 0.017477
0.048285 -0.080412 0.010048
0.046987 -0.081290 0.007916
0.049056 -0.080408 0.015714
0.049770 -0.079961 0.017206
0.049212 -0.082885 0.004550
0.054762 -0.079786 0.019253
0.049663 -0.082802 0.007175
0.049156 -0.080047 0.013387
0.056209 -0.078783 0.021435
0.045769 -0.080754 -0.007342
0.053981 -0.076813 0.021597
0.055620 -0.079270 0.021217
0.053421 -0.080787 0.017837
0.048413 -0.082325 -0.006098
0.047282 -0.080668 0.004811
0.052594 -0.077754 0.019323
0.046161 -0.081263 -0.006993
0.052832 -0.077568 0.019514
0.048862 -0.082879 0.001909
0.048234 -0.080841 0.013320
0.053690 -0.077052 0.021478
0.051608 -0.081977 0.014560
0.046517 -0.081380 0.005192
0.058354 -0.075920 0.020411
0.054780 -0.079946 0.020753
0.052609 -0.081344 0.016578
0.051491 -0.078570 0.018098
0.046931 -0.080662 0.002170
0.057236 -0.075361 0.020467
0.057497 -0.074421 0.020594
0.055257 -0.079393 0.019583
0.056045 -0.078750 0.019943
0.050621 -0.079389 0.018614
0.060581 -0.075049 0.022045
0.052361 -0.077932 0.019113
0.050679 -0.079127 0.016839
0.052850 -0.077730 0.021014
0.056887 -0.078040 0.020143
0.051568 -0.078712 0.019873
0.051913 -0.081794 0.015250
0.057679 -0.075869 0.020408
0.054115 -0.076533 0.020204
0.048611 -0.082785 -0.000745
0.055549 -0.075315 0.020449
0.054957 -0.075823 0.020404
0.058959 -0.075151 0.020520
0.057179 -0.077790 0.020175
0.053025 -0.081271 0.019026
0.049983 -0.079577 0.015511
0.055249 -0.075573 0.020436
0.056821 -0.078267 0.021580
0.053629 -0.080638 0.018117
0.046681 -0.080567 -0.000484
0.055055 -0.079728 0.020927
0.048463 -0.082600 -0.003415
0.058012 -0.075961 0.020401
0.058652 -0.072832 0.022307
0.054064 -0.080319 0.018625
0.049489 -0.083328 0.010364
0.057285 -0.074691 0.020556
0.054671 -0.076067 0.020356
0.051095 -0.079054 0.019287
0.054891 -0.076050 0.021841
0.051333 -0.082135 0.013851
0.053125 -0.077511 0.021188
0.047580 -0.083051 -0.006107
0.046533 -0.080383 -0.003154
0.058473 -0.074302 0.020624
0.052134 -0.078102 0.018886
0.047559 -0.081111 0.010625
0.055777 -0.078972 0.019840
0.058867 -0.075481 0.020476
0.058140 -0.074211 0.020631
0.049403 -0.079918 0.014113
0.053258 -0.081104 0.019328
0.058654 -0.075751 0.020437
0.054512 -0.080157 0.020561
0.053847 -0.076755 0.020102
0.053993 -0.080558 0.020123
0.056320 -0.078521 0.020028
0.053844 -0.080482 0.018380
0.050404 -0.082946 0.013877
0.057193 -0.075021 0.020511
0.047734 -0.080585 0.007436
0.057137 -0.077998 0.021625
0.047644 -0.083323 -0.003326
0.054280 -0.076566 0.021696
0.051328 -0.078887 0.019589
0.057797 -0.074253 0.020620
0.052582 -0.077940 0.020822
0.047811 -0.083504 -0.000559
0.051914 -0.078265 0.018641
0.048916 -0.083507 0.007655
0.050985 -0.082625 0.015452
0.054390 -0.076305 0.020289
0.052109 -0.081908 0.017659
0.050867 -0.082367 0.012383
3 0 1 40
3 1 72 40
3 1 124 72
3 124 113 72
3 40 29 0
3 124 101 113
3 124 77 101
3 0 68 1
3 68 75 1
3 75 27 1
3 75 39 27
3 99 87 43
3 99 141 87
3 99 118 141
3 99 88 118
3 99 147 88
3 99 131 147
3 99 126 131
3 99 54 126
3 99 10 54
3 99 104 10
3 99 130 104
3 99 134 130
3 99 114 134
3 114 82 134
3 0 29 3
3 44 0 3
3 7 44 3
3 11 7 3
3 51 105 137
3 5 51 137
3 9 5 137
3 143 9 137
3 109 143 137
3 15 109 137
3 67 15 137
3 57 67 137
3 70 57 137
3 20 70 137
3 112 20 137
3 83 112 137
3 135 83 137
3 3 72 113
3 125 113 101
3 111 101 77
3 86 77 63
3 73 63 65
3 142 65 50
3 59 50 155
3 13 155 56
3 66 56 122
3 132 122 80
3 8 80 98
3 107 98 28
3 36 28 84
3 94 84 48
3 58 48 71
3 85 71 110
3 38 110 139
3 150 139 116
3 127 116 30
3 93 30 17
3 74 17 64
3 76 64 4
3 16 4 89
3 22 89 34
3 41 34 129
3 136 129 90
3 100 90 138
3 153 138 45
3 119 45 96
3 103 96 105
3 108 105 51
3 131 126 5
3 24 5 92
3 115 92 9
3 46 9 143
3 6 143 109
3 121 109 15
3 23 15 67
3 145 67 57
3 69 57 70
3 79 70 20
3 26 20 112
3 123 112 83
3 95 83 135
3 148 135 47
3 55 47 137
3 49 137 2
3 14 2 33
3 97 33 133
3 146 133 106
3 120 106 31
3 91 31 154
3 12 154 52
3 62 52 35
3 42 35 152
3 61 152 32
3 37 32 140
3 53 140 18
3 78 18 117
3 128 117 151
3 60 151 21
3 81 21 19
3 25 19 149
3 11 149 144
3 7 144 124
3 102 24 108
3 103 108 24
3 24 115 103
3 119 103 115
3 153 119 115
3 100 153 115
3 136 100 115
3 41 136 115
3 115 46 41
3 22 41 46
3 16 22 46
3 76 16 46
3 74 76 46
3 46 6 74
3 93 74 6
3 6 121 93
3 127 93 121
3 121 23 127
3 150 127 23
3 23 145 150
3 38 150 145
3 145 69 38
3 85 38 69
3 69 79 85
3 58 85 79
3 79 26 58
3 94 58 26
3 26 123 94
3 123 95 94
3 36 94 95
3 95 148 36
3 107 36 148
3 148 55 107
3 55 49 107
3 8 107 49
3 49 14 8
3 14 97 8
3 132 8 97
3 97 146 132
3 146 120 132
3 66 132 120
3 120 91 66
3 13 66 91
3 91 12 13
3 59 13 12
3 12 62 59
3 142 59 62
3 62 42 142
3 42 61 142
3 73 142 61
3 61 37 73
3 37 53 73
3 86 73 53
3 53 78 86
3 78 128 86
3 111 86 128
3 128 60 111
3 125 111 60
3 60 81 125
3 3 125 81
3 81 25 3
3 40 3 29
3 25 11 3
3 92 5 9
3 63 77 124
3 124 144 63
3 65 63 144
3 144 149 65
3 50 65 149
3 149 19 50
3 155 50 19
3 19 21 155
3 56 155 21
3 21 151 56
3 122 56 151
3 151 117 122
3 80 122 117
3 98 80 117
3 28 98 117
3 117 18 28
3 84 28 18
3 48 84 18
3 71 48 18
3 18 140 71
3 110 71 140
3 140 32 110
3 139 110 32
3 32 152 139
3 116 139 152
3 152 35 116
3 30 116 35
3 17 30 35
3 35 52 17
3 64 17 52
3 52 154 64
3 4 64 154
3 89 4 154
3 154 31 89
3 34 89 31
3 31 106 34
3 129 34 106
3 90 129 106
3 138 90 106
3 106 133 138
3 45 138 133
3 133 33 45
3 96 45 33
3 33 2 96
3 105 96 2
3 2 137 105
3 47 135 137
3 3 40 72
3 125 3 113
3 111 125 101
3 86 111 77
3 73 86 63
3 142 73 65
3 59 142 50
3 13 59 155
3 66 13 56
3 132 66 122
3 8 132 80
3 107 8 98
3 36 107 28
3 94 36 84
3 58 94 48
3 85 58 71
3 38 85 110
3 150 38 139
3 127 150 116
3 93 127 30
3 74 93 17
3 76 74 64
3 16 76 4
3 22 16 89
3 41 22 34
3 136 41 129
3 100 136 90
3 153 100 138
3 119 153 45
3 103 119 96
3 108 103 105
3 102 108 51
3 131 24 147
3 88 147 24
3 118 88 24
3 24 102 118
3 141 118 102
3 87 141 102
3 43 87 102
3 99 43 102
3 114 99 102
3 102 51 114
3 82 114 51
3 134 82 51
3 130 134 51
3 51 5 130
3 104 130 5
3 104 5 10
3 54 10 5
3 126 54 5
3 24 131 5
3 115 24 92
3 46 115 9
3 6 46 143
3 121 6 109
3 23 121 15
3 145 23 67
3 69 145 57
3 79 69 70
3 26 79 20
3 123 26 112
3 95 123 83
3 148 95 135
3 55 148 47
3 49 55 137
3 14 49 2
3 97 14 33
3 146 97 133
3 120 146 106
3 91 120 31
3 12 91 154
3 62 12 52
3 42 62 35
3 61 42 152
3 37 61 32
3 53 37 140
3 78 53 18
3 128 78 117
3 60 128 151
3 81 60 21
3 25 81 19
3 11 25 149
3 7 11 144
3 44 7 124
3 0 44 68
3 75 68 44
3 39 75 44
3 27 39 44
3 44 124 27
3 1 27 124
