OFF

174 344 0
0.418341 -0.131412 -0.051162
0.080213 0.008874 -0.095410
0.109757 0.009358 -0.093133
0.178041 0.009984 0.071411
0.260779 -0.043426 0.011745
0.434190 -0.198419 -0.045828
0.464906 -0.122348 0.020589
0.461214 -0.167993 -0.045963
0.389237 -0.225927 0.026677
0.153196 -0.157863 -0.062740
-0.216098 -0.211822 -0.095002
-0.079100 -0.064714 -0.105947
0.025104 -0.026135 0.091025
0.112641 0.006165 0.090319
0.036394 -0.135619 0.093341
0.243594 -0.265616 0.007236
0.412223 -0.233499 -0.031833
0.195251 -0.055397 -0.071022
0.211479 -0.023689 0.066787
0.143305 -0.024436 -0.090748
0.253343 -0.198588 0.032670
0.257984 -0.238439 0.028414
0.083182 0.005585 0.093493
0.022223 -0.022945 -0.092223
0.358346 -0.155157 -0.044962
-0.148511 -0.178567 -0.113289
0.183245 -0.091782 0.059775
0.113377 -0.029418 0.095149
0.256840 -0.237172 -0.044387
0.176287 -0.022839 -0.082265
-0.117975 -0.164600 -0.109353
-0.087439 -0.150632 -0.105418
0.372713 -0.141515 -0.063292
0.205018 -0.197517 -0.053563
0.031196 -0.051760 0.106799
0.335716 -0.201793 -0.045430
0.419676 -0.132891 0.033788
0.000551 -0.125648 -0.094923
0.399783 -0.108523 -0.051179
0.051218 -0.007036 -0.093817
-0.143150 -0.101999 -0.110829
0.197215 -0.119455 0.049100
0.005461 -0.084278 0.102207
0.201856 -0.159306 0.044844
-0.085783 -0.105659 -0.115295
0.439778 -0.149703 -0.048562
-0.265551 -0.143011 -0.074374
-0.180285 -0.139099 -0.106360
0.206498 -0.199157 0.040589
-0.302686 -0.180110 -0.069904
-0.217420 -0.176198 -0.101890
-0.329039 -0.178356 -0.039777
0.084542 -0.066929 -0.107227
0.374446 -0.143435 0.046988
0.412898 -0.234247 0.011121
0.182372 -0.045226 0.075201
-0.020275 -0.116796 0.097616
0.435313 -0.199663 0.025631
0.002207 -0.080674 -0.104800
0.110613 -0.140380 0.085810
0.182150 -0.228070 0.012704
0.178778 -0.025599 0.076241
0.336874 -0.203075 0.028210
0.351332 -0.204315 0.028188
0.353145 -0.107406 -0.034806
0.300573 -0.245315 0.028069
0.252089 -0.197200 -0.047105
0.396268 -0.176788 -0.045395
0.113923 -0.045683 -0.098988
0.089063 -0.168541 0.074941
0.095053 -0.109838 0.100444
0.200267 -0.157545 -0.056282
0.155011 -0.159874 0.052764
-0.182305 -0.195195 -0.104145
0.322878 -0.036160 0.026073
0.073503 -0.137999 0.089575
0.350168 -0.203025 -0.045906
0.051744 -0.060303 -0.103450
0.175722 0.012553 -0.076167
0.293141 -0.194933 -0.044198
0.462268 -0.168982 0.026629
0.087865 -0.070583 0.102523
-0.314247 -0.251636 -0.035914
0.216469 -0.240049 0.015264
-0.287894 -0.253390 -0.066041
0.333577 -0.073298 -0.006319
0.401140 -0.110027 0.035185
-0.117808 -0.124301 -0.117736
0.091744 -0.106227 -0.106742
0.355680 -0.137722 -0.007788
-0.055996 -0.041487 -0.091341
0.062130 -0.103101 0.097932
0.120705 -0.190525 0.018171
0.154139 -0.113319 0.068190
0.416964 -0.154754 -0.054627
0.247338 -0.157227 -0.049823
0.070473 -0.134778 -0.096187
-0.251214 -0.192825 -0.092747
0.197362 -0.057735 0.063281
0.195516 -0.117573 -0.059000
0.080677 -0.031327 0.104603
0.121125 -0.084980 -0.098502
0.054941 -0.063845 0.100011
0.288390 -0.154960 -0.046916
0.388090 -0.224656 -0.046340
0.029206 -0.096363 0.095420
0.153266 -0.066763 0.083616
0.155025 -0.202504 0.020732
0.058945 -0.099601 -0.102964
0.339829 -0.068977 0.035688
0.003470 -0.128881 0.090829
0.054143 -0.010275 0.092259
0.150506 -0.063734 -0.090262
0.242587 -0.117255 -0.052541
-0.023389 -0.113347 -0.100537
0.397408 -0.178051 0.027142
0.200867 0.017157 0.054502
-0.149833 -0.142944 -0.120176
0.329443 -0.152694 -0.044008
0.142739 0.010956 -0.084650
0.382604 -0.087163 0.036582
0.110322 -0.026034 -0.099230
0.146078 -0.027508 0.085695
-0.173602 -0.098154 -0.097012
-0.021733 -0.068374 -0.110413
-0.210738 -0.135253 -0.092543
0.179888 -0.042488 -0.082022
-0.247873 -0.172353 -0.088073
-0.337714 -0.205944 -0.023349
-0.311361 -0.207698 -0.053476
-0.285008 -0.209452 -0.083604
0.283639 -0.114988 -0.049634
0.189344 -0.214482 0.023293
0.026147 -0.092975 -0.099187
0.440972 -0.150936 0.030209
0.293378 -0.258903 0.017479
0.359093 -0.132919 -0.007758
0.418357 -0.156208 0.036808
0.122470 -0.132045 -0.084741
0.354012 -0.108366 0.020334
0.125032 -0.134856 0.076604
0.237836 -0.077283 -0.055259
0.027804 -0.048002 -0.109063
0.145341 0.008074 0.080865
0.299415 -0.244032 -0.045619
-0.055414 -0.131989 -0.102977
0.000245 -0.045659 -0.101318
0.151851 -0.110799 -0.076501
0.317926 -0.047726 0.026524
0.226132 -0.008387 0.031661
0.107596 -0.137283 -0.093673
-0.183627 -0.159571 -0.111033
-0.111125 -0.083357 -0.108388
0.124160 -0.088301 0.092030
0.320222 -0.117826 0.006309
0.302771 -0.090193 0.002071
-0.053758 -0.087016 -0.112854
0.236129 -0.033558 0.039266
0.086326 -0.165835 -0.083119
0.077340 -0.027631 -0.107713
0.181232 -0.089552 -0.068261
0.033349 -0.132273 -0.098701
-0.251996 -0.232606 -0.080522
0.239419 -0.079036 0.045436
0.116971 -0.049045 0.094109
0.285002 -0.116498 0.037066
0.295683 -0.098693 0.020221
0.244060 -0.118887 0.041180
0.278231 -0.071059 0.015983
0.330586 -0.153959 0.028696
0.359503 -0.156438 0.028654
0.289643 -0.156348 0.032811
0.248701 -0.158738 0.036925
0.294285 -0.196199 0.028555
3 74 85 148
3 74 64 85
3 74 120 64
3 120 38 64
3 38 32 64
3 120 6 38
3 74 109 120
3 6 0 38
3 6 45 0
3 6 7 45
3 120 86 6
3 109 53 120
3 86 36 6
3 6 80 7
3 80 57 7
3 57 5 7
3 57 54 5
3 54 16 5
3 54 135 16
3 135 144 16
3 135 15 144
3 15 28 144
3 15 84 28
3 15 82 84
3 15 128 82
3 15 60 128
3 60 92 128
3 92 110 128
3 110 56 128
3 56 51 128
3 56 46 51
3 56 123 46
3 56 90 123
3 56 12 90
3 12 1 90
3 12 111 1
3 111 22 1
3 22 2 1
3 22 13 2
3 13 143 2
3 143 119 2
3 143 3 119
3 3 116 119
3 116 78 119
3 1 39 90
3 39 23 90
3 92 69 110
3 69 14 110
3 56 42 12
3 144 104 16
3 42 34 12
3 84 162 28
3 162 10 28
3 10 73 28
3 73 25 28
3 25 158 28
3 25 161 158
3 25 37 161
3 25 30 37
3 30 31 37
3 116 149 78
3 149 4 78
3 4 141 78
3 4 155 141
3 155 89 141
3 89 118 141
3 46 49 51
3 158 33 28
3 158 9 33
3 90 11 123
3 11 152 123
3 141 17 78
3 17 29 78
3 17 126 29
3 118 131 141
3 152 40 123
3 54 8 135
3 8 65 135
3 155 154 89
3 31 145 37
3 23 146 90
3 123 125 46
3 92 72 69
3 72 59 69
3 72 140 59
3 158 150 9
3 150 138 9
3 145 114 37
3 144 76 104
3 144 35 76
3 8 63 65
3 63 62 65
3 69 75 14
3 161 96 158
3 146 124 90
3 154 169 89
3 62 173 65
3 144 79 35
3 49 129 51
3 155 166 154
3 140 70 59
3 150 88 138
3 65 21 135
3 17 160 126
3 126 19 29
3 35 24 76
3 63 170 62
3 121 19 159
3 98 18 26
3 166 4 168
3 4 18 157
3 27 100 122
3 122 18 61
3 92 132 107
3 132 15 83
3 23 124 146
3 134 36 80
3 7 0 45
3 117 125 47
3 130 50 97
3 74 148 109
3 75 70 14
3 75 69 70
3 59 70 69
3 150 158 88
3 96 88 158
3 96 161 88
3 149 116 18
3 22 100 13
3 119 78 19
3 29 19 78
3 121 2 19
3 121 159 2
3 119 19 2
3 151 125 117
3 151 50 125
3 127 50 130
3 127 125 50
3 47 123 117
3 47 125 123
3 40 117 123
3 111 100 22
3 111 12 100
3 152 11 44
3 156 11 124
3 156 44 11
3 87 40 44
3 87 117 40
3 152 44 40
3 142 23 159
3 142 124 23
3 143 13 122
3 27 13 100
3 27 122 13
3 61 3 122
3 61 18 3
3 143 122 3
3 81 102 70
3 81 100 102
3 91 102 105
3 91 70 102
3 110 14 105
3 91 14 70
3 91 105 14
3 58 142 133
3 58 124 142
3 77 142 159
3 77 133 142
3 37 114 133
3 58 114 124
3 58 133 114
3 145 31 44
3 87 31 117
3 87 44 31
3 156 114 44
3 156 124 114
3 145 44 114
3 162 130 10
3 162 84 130
3 83 21 132
3 83 15 21
3 60 132 92
3 60 15 132
3 54 57 8
3 16 104 5
3 134 6 36
3 134 80 6
3 137 36 53
3 137 80 36
3 94 0 7
3 94 32 0
3 98 163 18
3 98 26 163
3 41 26 72
3 41 163 26
3 101 147 88
3 101 112 147
3 138 147 9
3 138 88 147
3 126 160 112
3 147 160 9
3 147 112 160
3 149 18 4
3 171 165 172
3 171 169 165
3 167 165 163
3 167 172 165
3 20 173 172
3 20 21 173
3 171 173 169
3 171 172 173
3 71 99 95
3 71 9 99
3 113 99 141
3 113 95 99
3 66 33 95
3 66 28 33
3 71 33 9
3 71 95 33
3 63 8 170
3 115 8 57
3 115 170 8
3 67 104 24
3 67 5 104
3 76 24 104
3 86 53 36
3 86 120 53
3 53 136 89
3 139 136 53
3 139 85 136
3 165 166 163
3 165 169 166
3 168 163 166
3 168 4 163
3 109 148 85
3 139 109 85
3 139 53 109
3 64 136 85
3 64 32 136
3 38 0 32
3 137 57 80
3 137 53 57
3 89 136 32
3 94 5 32
3 94 7 5
3 115 53 170
3 115 57 53
3 170 53 89
3 89 32 24
3 67 32 5
3 67 24 32
3 62 170 169
3 169 170 89
3 89 24 118
3 35 118 24
3 135 21 15
3 62 169 173
3 65 173 21
3 144 28 79
3 35 79 118
3 107 72 92
3 107 132 72
3 48 132 21
3 48 72 132
3 43 48 172
3 43 72 48
3 20 48 21
3 20 172 48
3 167 41 172
3 167 163 41
3 43 41 72
3 43 172 41
3 155 4 166
3 154 166 169
3 103 79 95
3 103 118 79
3 66 79 28
3 66 95 79
3 113 131 95
3 113 141 131
3 103 131 118
3 103 95 131
3 84 82 130
3 129 82 128
3 129 130 82
3 49 130 129
3 51 129 128
3 157 163 4
3 157 18 163
3 116 3 18
3 34 100 12
3 153 164 70
3 153 106 164
3 81 164 100
3 81 70 164
3 55 122 106
3 55 18 122
3 164 122 100
3 164 106 122
3 42 56 105
3 110 105 56
3 102 34 105
3 102 100 34
3 42 105 34
3 93 26 106
3 93 72 26
3 55 26 18
3 55 106 26
3 140 93 70
3 140 72 93
3 153 93 106
3 153 70 93
3 99 160 141
3 99 9 160
3 17 141 160
3 68 19 112
3 68 159 19
3 126 112 19
3 52 68 88
3 52 159 68
3 101 68 112
3 101 88 68
3 108 161 133
3 108 88 161
3 37 133 161
3 108 77 88
3 108 133 77
3 52 77 159
3 52 88 77
3 30 117 31
3 25 117 30
3 73 10 50
3 97 10 130
3 97 50 10
3 25 73 117
3 151 73 50
3 151 117 73
3 1 2 159
3 39 159 23
3 39 1 159
3 90 124 11
3 49 46 130
3 127 46 125
3 127 130 46
