OFF

400 796 0
-0.087704 0.233012 -0.059757
-0.060598 -0.264638 -0.051197
-0.072191 -0.289223 -0.057696
-0.235581 -0.097926 -0.072734
-0.158855 -0.053046 -0.074140
-0.100325 -0.046324 -0.072605
-0.172072 0.062136 -0.073985
0.037705 0.029999 -0.055888
0.004583 -0.068522 -0.051143
-0.037160 -0.026114 -0.044130
-0.078903 0.016293 -0.037117
-0.047853 0.067073 -0.044005
-0.471630 0.201518 -0.046889
-0.427157 0.222766 -0.051704
-0.471838 0.129003 -0.045473
-0.184093 0.325525 -0.049406
-0.111321 -0.308661 -0.050257
-0.062190 -0.236812 -0.049827
-0.073661 -0.119483 -0.069542
-0.022380 0.050124 -0.065642
-0.273454 0.133765 -0.070927
-0.312502 -0.242094 -0.041853
-0.205972 0.143333 -0.033638
-0.445148 0.172838 -0.044623
-0.016238 0.147174 -0.051604
-0.378027 -0.126026 -0.037954
-0.281894 -0.007008 -0.030878
-0.103452 0.107896 -0.039550
-0.121313 -0.177398 -0.039027
-0.087542 0.167282 -0.066010
-0.226637 -0.319832 -0.056874
-0.136617 0.171763 -0.069302
-0.086756 -0.272737 -0.050042
-0.415022 -0.094933 -0.057489
-0.156047 0.262512 -0.045695
-0.401372 0.071866 -0.061680
-0.459177 0.094942 -0.052362
-0.247168 -0.193675 -0.069871
-0.376509 0.119316 -0.035349
-0.051842 0.137432 -0.046451
-0.181988 -0.244557 -0.065383
-0.016804 0.117854 -0.050893
-0.001643 -0.070753 -0.061760
-0.145879 -0.213323 -0.039242
-0.116808 -0.295439 -0.060896
-0.186017 0.307702 -0.060087
-0.082066 -0.078480 -0.039800
-0.225336 0.349146 -0.050045
-0.238535 0.168775 -0.034367
-0.258790 -0.109918 -0.032512
-0.176215 -0.196676 -0.068330
-0.173893 -0.136231 -0.034013
-0.314457 0.018435 -0.031607
-0.111035 -0.247558 -0.063842
-0.349071 0.238505 -0.058568
-0.416494 0.202872 -0.044477
-0.303716 0.219657 -0.038851
-0.301460 0.210865 -0.065699
-0.152028 0.296092 -0.049279
-0.431572 0.005006 -0.039216
-0.313577 -0.154093 -0.065900
-0.158758 0.356254 -0.052602
-0.170442 -0.148795 -0.071277
-0.145339 0.055875 -0.034662
-0.047680 -0.087334 -0.067221
-0.105262 -0.199677 -0.066789
-0.205045 0.152764 -0.070872
-0.235341 -0.278013 -0.042528
-0.097684 0.155770 -0.042495
-0.391534 -0.210260 -0.056037
-0.286999 0.274807 -0.059706
-0.099489 -0.151796 -0.069736
-0.134645 -0.037313 -0.034787
-0.366392 -0.045877 -0.034732
-0.231006 0.120607 -0.071678
-0.439877 -0.003371 -0.056430
-0.310725 -0.174230 -0.035637
-0.022361 0.116398 -0.061523
-0.347855 0.149349 -0.035203
-0.225828 -0.200543 -0.037139
-0.146176 -0.340714 -0.050970
-0.379986 -0.114511 -0.061930
-0.093716 -0.103916 -0.072683
-0.223378 -0.000296 -0.029345
-0.241374 -0.145801 -0.071302
-0.347020 0.043877 -0.032335
-0.256967 0.088451 -0.072484
-0.330746 -0.264645 -0.044998
-0.368437 -0.018762 -0.067824
-0.396272 -0.148577 -0.041100
-0.451351 0.072844 -0.043079
-0.398215 0.166640 -0.058995
-0.387840 0.232905 -0.044331
-0.484047 0.027390 -0.049188
-0.065605 -0.123793 -0.042870
-0.309565 0.129619 -0.068984
-0.103846 0.146866 -0.069192
-0.445818 0.242278 -0.047380
-0.164648 -0.100921 -0.072708
-0.016289 -0.047318 -0.047637
-0.485079 0.143343 -0.046607
-0.091916 0.203645 -0.045440
-0.181030 -0.372767 -0.051683
-0.021698 -0.055185 -0.064900
-0.222617 -0.286260 -0.060458
-0.186321 -0.309416 -0.047553
-0.301299 0.339496 -0.052683
-0.255941 0.025147 -0.030073
-0.081497 -0.314675 -0.055509
-0.153246 0.282806 -0.059977
0.018712 -0.125678 -0.058082
-0.162598 0.139607 -0.071623
-0.327390 -0.269111 -0.055785
-0.451937 0.066053 -0.053794
-0.067734 -0.071766 -0.070362
-0.359185 0.262939 -0.044185
-0.188559 0.107450 -0.072429
-0.087897 0.237224 -0.049025
-0.181457 0.051728 -0.032719
-0.018792 0.146527 -0.059606
-0.211998 0.275546 -0.062408
-0.232836 -0.077763 -0.031706
-0.328970 -0.196780 -0.038782
-0.221176 -0.341468 -0.048266
-0.214520 0.075294 -0.073234
-0.288504 0.050590 -0.030801
-0.365281 0.076012 -0.065139
-0.222138 -0.350365 -0.053609
-0.402490 0.087159 -0.037668
-0.038665 0.095982 -0.064704
-0.170764 -0.041460 -0.032844
-0.049144 -0.169107 -0.045941
-0.295318 -0.298537 -0.055660
-0.200171 0.191209 -0.035070
-0.171860 -0.245479 -0.041561
0.004284 -0.023035 -0.062579
-0.414517 -0.171127 -0.044245
0.040743 -0.057706 -0.057881
-0.265351 0.242091 -0.039554
-0.423582 0.252901 -0.049788
-0.381588 0.264495 -0.053194
-0.360591 0.270292 -0.054896
-0.312980 0.242651 -0.062027
-0.277485 -0.149947 -0.069359
-0.073709 -0.205032 -0.046155
-0.330531 0.292972 -0.044039
-0.293078 0.084305 -0.070540
-0.321067 0.076032 -0.031529
-0.261321 -0.310170 -0.044848
-0.041753 -0.039617 -0.068041
-0.080951 0.043416 -0.070207
-0.355442 -0.206114 -0.059495
-0.226298 0.340235 -0.055385
-0.392373 -0.078034 -0.037051
-0.298518 0.306594 -0.056034
-0.419002 -0.024575 -0.059937
-0.120150 0.126449 -0.072374
-0.196151 0.224788 -0.038654
-0.263246 -0.327963 -0.055534
-0.422269 0.154997 -0.041531
-0.309490 0.171783 -0.035906
-0.212668 0.364511 -0.051643
-0.098275 -0.240957 -0.046370
-0.261332 0.275670 -0.043138
-0.343894 -0.110365 -0.065389
-0.251808 -0.232700 -0.039458
-0.146111 0.094293 -0.073179
-0.218597 -0.252688 -0.064043
-0.373001 0.011721 -0.034654
-0.339424 0.342150 -0.049357
-0.119861 -0.337115 -0.054806
-0.153417 -0.303570 -0.059555
-0.139537 0.103751 -0.036093
-0.242295 -0.155230 -0.034068
-0.327193 -0.128916 -0.032567
-0.169550 0.262389 -0.063158
-0.430732 0.192630 -0.053620
-0.409735 0.198427 -0.055323
-0.157398 -0.181543 -0.035570
-0.432578 0.227938 -0.046247
-0.362124 0.170786 -0.062454
-0.353630 0.101475 -0.032258
-0.122841 -0.276882 -0.046585
-0.129346 0.308921 -0.057099
-0.192132 0.258367 -0.042238
-0.323370 -0.235539 -0.059369
-0.038647 0.162256 -0.060585
-0.347214 -0.219331 -0.041928
-0.257312 0.309249 -0.046723
-0.271692 -0.102072 -0.070790
-0.217576 0.047580 -0.030776
-0.395514 -0.139901 -0.058485
-0.393614 0.185031 -0.041385
-0.118151 -0.082625 -0.036343
-0.258920 -0.359423 -0.050298
-0.036318 0.162822 -0.049895
-0.015771 -0.007468 -0.065720
-0.383966 -0.044152 -0.064379
-0.054970 0.075565 -0.067886
-0.206883 -0.045608 -0.030901
-0.188113 0.291946 -0.045822
-0.237979 0.243391 -0.064729
-0.431062 0.044850 -0.057301
-0.291299 -0.264965 -0.059244
-0.403923 0.257971 -0.046101
-0.133769 0.151625 -0.039038
-0.417839 0.117180 -0.058608
-0.250139 0.073023 -0.031504
-0.410618 -0.100584 -0.040197
-0.223517 0.307333 -0.058736
-0.063686 -0.257527 -0.059200
-0.329189 0.080158 -0.068597
0.011757 -0.096794 -0.051931
-0.428471 0.055003 -0.039988
-0.364960 0.215064 -0.041239
-0.004238 -0.116742 -0.050270
-0.261946 0.341008 -0.048703
-0.259227 -0.294391 -0.059118
-0.345437 -0.151467 -0.035712
-0.197841 -0.277636 -0.043881
-0.136779 0.237492 -0.063048
0.010211 0.024682 -0.063399
-0.101689 -0.127939 -0.039413
-0.375269 0.288005 -0.045955
-0.214578 -0.219116 -0.067627
-0.324499 0.274438 -0.058355
-0.306059 -0.315137 -0.046764
-0.175656 0.099604 -0.034150
-0.149398 -0.269998 -0.063139
-0.365459 -0.241882 -0.045073
-0.282702 0.098466 -0.032232
-0.073135 0.064167 -0.040062
-0.128001 0.199499 -0.041984
-0.208805 -0.171235 -0.070574
-0.301239 -0.096761 -0.031761
-0.379716 0.312594 -0.048614
-0.054951 0.141840 -0.063766
-0.143625 -0.222117 -0.066086
-0.216342 -0.123075 -0.033263
-0.271126 0.194216 -0.036609
-0.319351 -0.201968 -0.062954
-0.448249 0.122841 -0.043851
-0.195531 0.230233 -0.065479
-0.443122 0.114274 -0.054665
-0.062442 -0.029021 -0.040187
-0.336306 0.245098 -0.041094
-0.137852 -0.174236 -0.069033
-0.384905 0.026552 -0.064752
-0.277789 -0.264856 -0.041778
-0.307803 -0.106219 -0.068847
-0.154269 -0.086772 -0.034400
-0.304859 -0.339764 -0.049489
-0.398982 -0.020436 -0.036974
-0.025109 -0.095538 -0.046764
-0.132079 -0.126355 -0.071980
-0.123982 0.233079 -0.045568
-0.315265 0.123909 -0.032961
-0.385760 -0.162385 -0.058983
-0.268276 -0.187386 -0.036388
-0.373643 0.202573 -0.058782
-0.183379 -0.213700 -0.037889
-0.266579 0.372767 -0.050683
-0.326032 0.174932 -0.065912
-0.379611 0.069319 -0.034577
-0.148919 -0.334103 -0.056289
-0.333802 -0.071318 -0.032489
-0.148821 -0.309038 -0.048905
0.008534 -0.098215 -0.059921
-0.287279 -0.231393 -0.062828
-0.115022 0.012146 -0.035174
-0.374211 -0.066636 -0.064877
-0.434530 -0.049965 -0.056493
-0.312702 0.034845 -0.070154
-0.067367 0.112041 -0.043007
-0.263960 0.211235 -0.067050
-0.032329 0.092464 -0.047449
-0.085228 -0.173252 -0.042484
-0.203011 -0.123361 -0.072005
-0.135916 -0.356447 -0.052503
-0.119962 0.266658 -0.049152
-0.363682 -0.174018 -0.038858
-0.039325 -0.198500 -0.060315
-0.249498 0.275177 -0.061057
-0.109794 -0.209177 -0.042699
-0.410187 0.023646 -0.060809
-0.302009 -0.058344 -0.070279
-0.255207 -0.260819 -0.062702
-0.045981 -0.074335 -0.043257
-0.399389 0.137157 -0.038440
-0.183676 -0.341091 -0.049618
-0.190027 -0.311701 -0.058215
-0.104008 0.212595 -0.062938
-0.033552 -0.150619 -0.063262
-0.153084 0.217076 -0.066230
-0.126286 -0.078481 -0.073411
-0.199343 0.336107 -0.055865
-0.381748 0.121326 -0.062067
-0.211774 0.095456 -0.032207
0.030566 -0.030244 -0.059720
-0.411042 -0.165292 -0.055040
-0.134360 -0.245102 -0.042913
-0.157681 0.308312 -0.058593
-0.071256 0.121424 -0.066948
-0.061599 0.159916 -0.045952
-0.399494 -0.069543 -0.060934
-0.454452 0.022846 -0.042307
-0.296034 -0.287407 -0.044923
-0.275285 -0.064606 -0.030956
-0.197218 -0.075486 -0.073437
-0.190388 -0.090919 -0.032457
-0.420007 0.283037 -0.047871
-0.223821 -0.309793 -0.046200
-0.378013 0.294631 -0.051277
-0.263798 0.339865 -0.054034
-0.336018 0.306224 -0.054683
-0.370735 0.167190 -0.038294
-0.461594 0.100923 -0.044276
-0.244337 0.120899 -0.032935
-0.221512 0.198077 -0.067800
-0.296216 -0.010469 -0.071710
-0.074343 -0.014175 -0.070284
-0.113542 0.068858 -0.072451
-0.232761 0.216650 -0.037312
-0.151140 0.007999 -0.033231
-0.007570 -0.118470 -0.060941
-0.065152 -0.230813 -0.060509
-0.422247 0.093070 -0.058173
-0.283259 -0.197821 -0.066412
-0.029520 -0.119648 -0.046327
-0.381927 -0.196569 -0.042003
-0.297941 0.267531 -0.041797
-0.307848 -0.039163 -0.031684
0.017349 0.084939 -0.059566
-0.059380 -0.182932 -0.063455
-0.348813 0.030698 -0.068210
-0.424963 -0.052592 -0.039293
-0.006075 0.070540 -0.062461
-0.169854 0.147480 -0.035581
-0.276900 0.146342 -0.033664
-0.053607 -0.135051 -0.066402
-0.385163 0.234359 -0.055110
-0.466417 0.123831 -0.050930
-0.337552 0.206719 -0.062240
-0.405591 0.037162 -0.036897
-0.349668 -0.158239 -0.062442
-0.289941 0.179079 -0.069370
-0.228741 0.250229 -0.040896
-0.342080 0.197224 -0.038148
-0.071237 0.187698 -0.062828
-0.294257 -0.219543 -0.038707
-0.359783 -0.103475 -0.034809
-0.120313 0.192179 -0.066120
-0.209360 -0.245856 -0.040209
-0.063378 0.041683 -0.040561
-0.293922 0.301111 -0.045381
-0.251188 -0.227247 -0.066286
-0.338120 -0.062490 -0.068335
-0.186007 -0.278129 -0.061799
-0.284744 -0.142073 -0.033317
-0.199847 -0.168386 -0.034819
-0.340411 -0.013721 -0.032412
-0.275479 0.243021 -0.063378
-0.460752 0.017833 -0.052923
-0.048361 0.017974 -0.067963
-0.478354 0.172431 -0.046748
-0.087560 0.101007 -0.070130
-0.179065 0.184920 -0.068551
-0.224722 0.283808 -0.044480
0.018931 -0.125065 -0.052720
-0.137774 -0.132084 -0.035956
-0.261018 0.306963 -0.057385
-0.389312 0.002442 -0.064316
-0.434307 0.162494 -0.055537
-0.164086 0.195354 -0.038527
-0.109220 0.060022 -0.036605
-0.425370 0.105000 -0.040760
-0.090980 -0.263126 -0.060702
-0.124173 0.292237 -0.050456
-0.450058 -0.075355 -0.053048
-0.345656 0.125472 -0.065525
-0.355123 0.302783 -0.046326
-0.249331 -0.032451 -0.030150
-0.027625 -0.102902 -0.064081
-0.185528 -0.342234 -0.054949
-0.340772 -0.292374 -0.046839
-0.098527 -0.033166 -0.036730
-0.085207 -0.215245 -0.063649
-0.037624 -0.200887 -0.049612
-0.220703 0.317387 -0.048065
-0.160341 -0.277259 -0.045233
-0.400172 -0.219119 -0.045148
0.020918 0.115067 -0.057650
-0.283090 -0.324967 -0.047169
-0.187259 0.003851 -0.031288
-0.491287 0.056279 -0.047756
-0.298555 0.332870 -0.047361
-0.079434 -0.167364 -0.066596
-0.332326 -0.014615 -0.069767
-0.247493 0.165921 -0.070121
-0.160067 0.228933 -0.042111
3 61 377 183
3 377 117 183
3 117 24 183
3 24 391 183
3 391 0 183
3 391 119 0
3 117 195 24
3 119 186 0
3 186 348 0
3 117 101 195
3 0 109 183
3 0 220 109
3 0 291 220
3 220 175 109
3 61 15 377
3 109 45 183
3 195 41 24
3 119 77 186
3 390 251 384
3 390 69 251
3 390 136 69
3 136 299 69
3 136 378 299
3 136 93 378
3 136 394 93
3 136 335 394
3 136 208 335
3 335 305 394
3 69 112 251
3 384 229 390
3 93 362 378
3 362 271 378
3 362 75 271
3 335 59 305
3 251 226 384
3 378 33 299
3 33 191 299
3 69 151 112
3 151 185 112
3 136 89 208
3 112 132 251
3 75 155 271
3 384 87 229
3 208 153 335
3 33 81 191
3 335 252 59
3 89 25 208
3 151 240 185
3 305 90 394
3 132 158 251
3 24 41 391
3 41 275 391
3 275 11 391
3 11 353 391
3 353 7 391
3 353 10 7
3 10 137 7
3 10 9 137
3 9 99 137
3 99 8 137
3 8 212 137
3 212 368 137
3 368 267 137
3 368 110 267
3 368 1 110
3 1 2 110
3 1 108 2
3 1 278 108
3 368 387 1
3 2 210 110
3 210 281 110
3 278 170 108
3 1 16 278
3 137 298 7
3 7 332 391
3 267 42 137
3 387 17 1
3 377 279 117
3 210 325 281
3 281 292 110
3 368 131 387
3 368 215 131
3 215 328 131
3 101 303 195
3 292 324 110
3 10 244 9
3 391 77 119
3 281 333 292
3 348 291 0
3 101 68 303
3 328 94 131
3 170 44 108
3 10 385 244
3 278 264 170
3 90 316 394
3 316 14 394
3 14 100 394
3 100 341 394
3 341 36 394
3 36 113 394
3 14 23 100
3 5 150 320
3 5 321 150
3 5 6 321
3 5 4 6
3 4 124 6
3 4 308 124
3 308 319 124
3 319 86 124
3 319 272 86
3 272 146 86
3 308 3 319
3 3 285 319
3 3 189 285
3 150 363 320
3 189 249 285
3 272 211 146
3 321 198 150
3 320 149 5
3 183 45 301
3 295 45 161
3 364 100 12
3 310 314 312
3 372 176 13
3 97 12 310
3 312 340 140
3 139 13 310
3 316 90 14
3 58 279 15
3 15 261 47
3 371 284 88
3 197 88 304
3 11 10 353
3 102 16 80
3 32 16 17
3 326 243 35
3 341 113 36
3 39 195 273
3 267 110 42
3 325 44 376
3 8 368 212
3 191 81 299
3 380 235 145
3 392 148 251
3 253 287 215
3 39 41 195
3 39 273 41
3 303 273 195
3 231 11 273
3 231 10 11
3 275 273 11
3 275 41 273
3 205 68 232
3 205 172 68
3 101 232 68
3 373 337 232
3 373 133 337
3 205 337 172
3 205 232 337
3 27 374 273
3 27 172 374
3 231 374 10
3 231 273 374
3 303 68 273
3 27 68 172
3 27 273 68
3 255 399 232
3 255 279 399
3 373 399 133
3 373 232 399
3 101 117 232
3 255 117 279
3 255 232 117
3 34 58 184
3 34 279 58
3 200 58 15
3 200 184 58
3 157 399 184
3 157 133 399
3 34 399 279
3 34 184 399
3 377 15 279
3 236 302 29
3 236 77 302
3 96 302 156
3 96 29 302
3 348 186 29
3 236 186 77
3 236 29 186
3 129 336 198
3 129 77 336
3 19 336 221
3 19 198 336
3 365 302 198
3 365 156 302
3 129 302 77
3 129 198 302
3 351 291 29
3 351 293 291
3 348 29 291
3 96 31 29
3 96 156 31
3 351 31 293
3 351 29 31
3 220 293 175
3 109 175 45
3 220 291 293
3 391 332 77
3 336 332 221
3 336 77 332
3 162 283 300
3 162 17 283
3 43 283 178
3 43 300 283
3 182 32 300
3 182 16 32
3 162 32 17
3 162 300 32
3 144 387 276
3 144 17 387
3 131 276 387
3 28 283 276
3 28 178 283
3 144 283 17
3 144 276 283
3 46 94 287
3 46 193 94
3 328 287 94
3 244 385 287
3 46 385 193
3 46 287 385
3 222 369 276
3 222 193 369
3 28 369 178
3 28 276 369
3 131 94 276
3 222 94 193
3 222 276 94
3 99 287 8
3 99 9 287
3 244 287 9
3 328 215 287
3 253 8 287
3 253 215 8
3 215 368 8
3 1 17 16
3 386 333 325
3 386 65 333
3 281 325 333
3 376 53 325
3 376 44 53
3 386 53 65
3 386 325 53
3 396 71 339
3 396 65 71
3 18 71 82
3 18 339 71
3 292 333 339
3 396 333 65
3 396 339 333
3 103 64 149
3 103 42 64
3 114 64 82
3 114 149 64
3 196 135 149
3 196 221 135
3 103 135 42
3 103 149 135
3 382 324 339
3 382 42 324
3 292 339 324
3 18 64 339
3 18 82 64
3 382 64 42
3 382 339 64
3 324 42 110
3 135 298 42
3 135 221 298
3 137 42 298
3 210 44 325
3 298 221 7
3 332 7 221
3 259 342 180
3 259 340 342
3 262 342 345
3 262 180 342
3 91 177 180
3 91 372 177
3 259 177 340
3 259 180 177
3 54 141 142
3 54 340 141
3 225 141 314
3 225 142 141
3 57 342 142
3 57 345 342
3 54 342 340
3 54 142 342
3 379 296 180
3 379 211 296
3 91 296 372
3 91 180 296
3 262 95 180
3 262 345 95
3 379 95 211
3 379 180 95
3 126 334 35
3 126 211 334
3 247 334 88
3 247 35 334
3 206 296 35
3 206 372 296
3 126 296 211
3 126 35 296
3 75 362 284
3 202 362 113
3 202 284 362
3 371 155 284
3 371 88 155
3 75 284 155
3 326 113 243
3 326 35 113
3 206 243 372
3 206 35 243
3 247 284 35
3 247 88 284
3 202 35 284
3 202 113 35
3 397 334 319
3 397 88 334
3 272 334 211
3 272 319 334
3 146 95 86
3 146 211 95
3 20 95 345
3 20 86 95
3 242 318 201
3 242 293 318
3 274 318 345
3 274 201 318
3 120 175 201
3 120 45 175
3 242 175 293
3 242 201 175
3 366 31 66
3 366 293 31
3 111 31 156
3 111 66 31
3 398 318 66
3 398 345 318
3 366 318 293
3 366 66 318
3 282 70 370
3 282 201 70
3 154 70 314
3 154 370 70
3 209 120 370
3 209 45 120
3 282 120 201
3 282 370 120
3 361 274 142
3 361 201 274
3 57 274 345
3 57 142 274
3 225 70 142
3 225 314 70
3 361 70 201
3 361 142 70
3 124 116 6
3 124 86 116
3 166 116 156
3 166 6 116
3 74 20 66
3 74 86 20
3 398 20 345
3 398 66 20
3 111 116 66
3 111 156 116
3 74 116 86
3 74 66 116
3 320 363 149
3 196 363 221
3 196 149 363
3 114 5 149
3 114 82 5
3 365 321 156
3 365 198 321
3 19 363 198
3 19 221 363
3 150 198 363
3 166 321 6
3 166 156 321
3 294 5 82
3 294 4 5
3 167 104 286
3 167 40 104
3 217 104 158
3 217 286 104
3 355 224 286
3 355 37 224
3 167 224 40
3 167 286 224
3 357 228 290
3 357 40 228
3 171 228 44
3 171 290 228
3 30 104 290
3 30 158 104
3 357 104 40
3 357 290 104
3 246 50 62
3 246 65 50
3 233 50 37
3 233 62 50
3 254 71 62
3 254 82 71
3 246 71 65
3 246 62 71
3 237 53 40
3 237 65 53
3 228 53 44
3 228 40 53
3 224 50 40
3 224 37 50
3 237 50 65
3 237 40 50
3 277 98 62
3 277 3 98
3 254 98 82
3 254 62 98
3 233 84 62
3 233 37 84
3 277 84 3
3 277 62 84
3 294 98 4
3 294 82 98
3 308 98 3
3 308 4 98
3 33 304 81
3 270 304 88
3 270 81 304
3 257 299 81
3 257 69 299
3 271 155 304
3 197 155 88
3 197 304 155
3 33 378 304
3 271 304 378
3 164 344 81
3 164 249 344
3 257 344 69
3 257 81 344
3 270 356 81
3 270 88 356
3 164 356 249
3 164 81 356
3 60 143 240
3 60 249 143
3 327 143 37
3 327 240 143
3 151 344 240
3 151 69 344
3 60 344 249
3 60 240 344
3 203 268 286
3 203 112 268
3 355 268 37
3 355 286 268
3 217 132 286
3 217 158 132
3 203 132 112
3 203 286 132
3 327 268 240
3 327 37 268
3 185 268 112
3 185 240 268
3 84 143 3
3 84 37 143
3 189 143 249
3 189 3 143
3 285 356 319
3 285 249 356
3 397 356 88
3 397 319 356
3 207 230 125
3 207 297 230
3 147 230 181
3 147 125 230
3 107 190 125
3 107 83 190
3 207 190 297
3 207 125 190
3 317 22 338
3 317 297 22
3 48 22 133
3 48 338 22
3 256 230 338
3 256 181 230
3 317 230 297
3 317 338 230
3 56 239 138
3 56 347 239
3 322 239 133
3 322 138 239
3 330 245 138
3 330 145 245
3 56 245 347
3 56 138 245
3 160 78 338
3 160 347 78
3 256 78 181
3 256 338 78
3 48 239 338
3 48 133 239
3 160 239 347
3 160 338 239
3 163 367 188
3 163 138 367
3 388 367 15
3 388 188 367
3 354 330 188
3 354 145 330
3 163 330 138
3 163 188 330
3 346 322 184
3 346 138 322
3 157 322 133
3 157 184 322
3 200 367 184
3 200 15 367
3 346 367 138
3 346 184 367
3 315 192 288
3 315 347 192
3 159 192 23
3 159 288 192
3 38 78 288
3 38 181 78
3 315 78 347
3 315 288 78
3 214 245 92
3 214 347 245
3 115 245 145
3 115 92 245
3 55 192 92
3 55 23 192
3 214 192 347
3 214 92 192
3 63 118 323
3 63 172 118
3 393 118 83
3 393 323 118
3 269 374 323
3 269 10 374
3 63 374 172
3 63 323 374
3 227 337 297
3 227 172 337
3 22 337 133
3 22 297 337
3 190 118 297
3 190 83 118
3 227 118 172
3 227 297 118
3 250 130 309
3 250 193 130
3 199 130 83
3 199 309 130
3 51 369 309
3 51 178 369
3 250 369 193
3 250 309 369
3 72 385 323
3 72 193 385
3 269 385 10
3 269 323 385
3 393 130 323
3 393 83 130
3 72 130 193
3 72 323 130
3 52 26 125
3 52 360 26
3 107 26 83
3 107 125 26
3 147 85 125
3 147 181 85
3 52 85 360
3 52 125 85
3 331 265 307
3 331 360 265
3 234 265 174
3 234 307 265
3 381 26 307
3 381 83 26
3 331 26 360
3 331 307 26
3 73 252 153
3 73 360 252
3 335 153 252
3 350 265 153
3 350 174 265
3 73 265 360
3 73 153 265
3 168 85 343
3 168 360 85
3 263 85 181
3 263 343 85
3 59 252 343
3 168 252 360
3 168 343 252
3 208 25 153
3 350 25 174
3 350 153 25
3 89 136 280
3 329 136 390
3 329 280 136
3 218 25 280
3 218 174 25
3 89 280 25
3 375 128 288
3 375 90 128
3 38 128 181
3 38 288 128
3 159 241 288
3 159 23 241
3 375 241 90
3 375 288 241
3 213 305 343
3 213 90 305
3 59 343 305
3 263 128 343
3 263 181 128
3 213 128 90
3 213 343 128
3 238 49 173
3 238 309 49
3 358 49 174
3 358 173 49
3 359 51 173
3 359 178 51
3 238 51 309
3 238 173 51
3 121 199 307
3 121 309 199
3 381 199 83
3 381 307 199
3 234 49 307
3 234 174 49
3 121 49 309
3 121 307 49
3 258 79 173
3 258 349 79
3 359 79 178
3 359 173 79
3 358 76 173
3 358 174 76
3 258 76 349
3 258 173 76
3 165 248 352
3 165 349 248
3 67 248 148
3 67 352 248
3 260 79 352
3 260 178 79
3 165 79 349
3 165 352 79
3 21 187 87
3 21 349 187
3 229 187 390
3 229 87 187
3 306 248 87
3 306 148 248
3 21 248 349
3 21 87 248
3 122 76 280
3 122 349 76
3 218 76 174
3 218 280 76
3 329 187 280
3 329 390 187
3 122 187 349
3 122 280 187
3 134 389 300
3 134 352 389
3 182 389 16
3 182 300 389
3 43 260 300
3 43 178 260
3 134 260 352
3 134 300 260
3 219 67 105
3 219 352 67
3 311 67 148
3 311 105 67
3 266 389 105
3 266 16 389
3 219 389 352
3 219 105 389
3 241 14 90
3 241 23 14
3 127 194 158
3 127 102 194
3 251 158 194
3 289 80 105
3 289 102 80
3 266 80 16
3 266 105 80
3 311 123 105
3 311 148 123
3 289 123 102
3 289 105 123
3 123 194 102
3 123 148 194
3 226 251 148
3 392 194 148
3 392 251 194
3 384 226 87
3 306 226 148
3 306 87 226
3 235 314 310
3 235 169 314
3 106 169 261
3 106 314 169
3 204 179 92
3 204 310 179
3 55 179 23
3 55 92 179
3 115 223 92
3 115 145 223
3 204 223 310
3 204 92 223
3 380 169 235
3 380 145 169
3 223 235 310
3 223 145 235
3 395 169 145
3 395 261 169
3 216 395 188
3 216 261 395
3 354 395 145
3 354 188 395
3 388 47 188
3 388 15 47
3 216 47 261
3 216 188 47
3 383 127 290
3 383 102 127
3 30 127 158
3 30 290 127
3 171 264 290
3 171 44 264
3 383 264 102
3 383 290 264
3 313 152 370
3 313 261 152
3 209 152 45
3 209 370 152
3 154 106 370
3 154 314 106
3 313 106 261
3 313 370 106
3 243 341 372
3 243 113 341
3 362 93 113
3 394 113 93
3 140 310 312
3 140 340 310
3 141 312 314
3 141 340 312
3 177 13 340
3 177 372 13
3 139 340 13
3 139 310 340
3 97 13 12
3 97 310 13
3 176 12 13
3 176 372 12
3 341 100 372
3 364 372 100
3 364 12 372
3 179 12 23
3 179 310 12
3 100 23 12
3 278 16 102
3 278 102 264
3 170 264 44
3 108 44 2
3 2 44 210
3 161 15 61
3 161 261 15
3 152 161 45
3 152 261 161
3 295 61 45
3 295 161 61
3 301 61 183
3 301 45 61
