OFF

357 710 0
0.451227 0.080425 -0.004468
0.358072 0.060218 -0.016668
-0.094525 0.177368 0.034127
0.105782 0.151998 0.023154
0.094265 0.176745 0.033906
-0.217619 0.120520 0.009386
-0.326185 0.077593 -0.009300
-0.359214 0.062587 -0.015831
0.467841 0.081779 -0.007267
0.325159 0.075441 -0.010061
0.135870 0.138414 0.017258
0.126847 0.139440 0.017702
0.317345 0.102210 0.001572
-0.060723 0.205823 0.049895
0.092785 0.198463 0.043345
0.360338 0.102694 0.005186
-0.359844 0.108928 0.004310
-0.137382 0.180715 0.035569
-0.354066 0.085047 -0.002676
0.094264 0.175505 0.036760
0.433306 0.081330 -0.007472
-0.142620 0.176288 0.037036
-0.143199 0.163280 0.027990
0.353103 0.083952 -0.006354
0.142298 0.160045 0.026661
-0.343567 0.116684 0.007685
0.178263 0.132358 0.014637
0.145495 0.172546 0.035488
-0.122245 0.188107 0.038786
-0.339814 0.114366 0.006679
0.146709 0.170014 0.034387
0.100426 0.172757 0.032175
0.241372 0.130698 0.017325
0.172017 0.154088 0.024080
0.298069 0.104948 0.006149
0.167143 0.133695 0.018608
0.355425 0.092561 -0.002612
0.105152 0.157212 0.025420
0.351588 0.085194 -0.002422
-0.358195 0.110243 0.008274
-0.147010 0.170984 0.034730
-0.100690 0.172181 0.035263
0.271112 0.116565 0.011191
-0.361144 0.106317 0.003174
0.334930 0.107828 0.007411
0.156229 0.136546 0.016452
-0.203392 0.148238 0.021437
-0.092838 0.197836 0.046415
-0.269163 0.099513 0.003634
-0.012349 0.212507 0.052813
-0.048932 0.209329 0.048030
0.023923 0.211378 0.052332
-0.245084 0.110060 0.004833
0.352740 0.088136 -0.001143
-0.356157 0.113804 0.006430
0.028903 0.189122 0.042661
0.122107 0.187300 0.038501
0.350006 0.113464 0.009864
-0.362150 0.102594 0.004948
-0.178859 0.133538 0.015054
-0.143198 0.162040 0.030844
-0.152801 0.158862 0.026068
-0.082572 0.201990 0.044831
-0.256896 0.125345 0.014865
0.256983 0.103424 0.002083
0.100427 0.171516 0.035028
0.339070 0.110884 0.008740
-0.000330 0.192025 0.040522
0.162240 0.155937 0.024881
-0.146844 0.169884 0.030860
-0.369149 0.083529 -0.006732
0.308777 0.102987 0.001907
-0.113006 0.190717 0.043315
0.203213 0.122908 0.013929
0.359053 0.105312 0.006324
0.142831 0.162336 0.027657
-0.416038 0.082444 -0.003824
-0.182369 0.152065 0.026498
0.112175 0.143604 0.019507
0.144062 0.164529 0.028610
-0.103856 0.167385 0.033177
0.103028 0.193752 0.044693
0.048556 0.207767 0.050769
0.381505 0.079416 -0.004926
0.112909 0.189971 0.043052
0.107759 0.147346 0.021132
0.190160 0.127425 0.015889
0.358429 0.082140 -0.007140
-0.178859 0.132298 0.017908
-0.144414 0.164241 0.031800
-0.059496 0.186506 0.038107
-0.217620 0.119279 0.012239
-0.382489 0.081939 -0.004034
0.268314 0.097738 0.003007
0.044207 0.188509 0.039006
0.397461 0.079420 -0.004920
-0.434285 0.084195 -0.006460
-0.162657 0.157010 0.025260
-0.214888 0.143444 0.022742
0.230787 0.112517 0.009420
0.084773 0.180127 0.035374
0.352948 0.113376 0.006434
-0.352529 0.087520 -0.001600
0.142360 0.175346 0.036704
0.360853 0.097569 0.002959
-0.353658 0.091709 -0.003173
-0.241970 0.132295 0.017889
-0.398445 0.083288 -0.006844
-0.286036 0.113237 0.006202
0.216922 0.117845 0.011733
-0.145776 0.174749 0.032974
-0.298861 0.108160 0.003992
0.126846 0.138200 0.020555
-0.231523 0.115284 0.007107
0.324363 0.103424 0.002101
-0.044717 0.188802 0.039109
0.146525 0.167675 0.033371
-0.060722 0.207063 0.047042
0.346533 0.114021 0.010105
-0.354065 0.086287 -0.005529
-0.142619 0.177527 0.034183
-0.192619 0.149804 0.025512
0.146709 0.171254 0.031534
0.145496 0.173787 0.032634
0.241373 0.131939 0.014472
-0.353684 0.114468 0.010112
-0.036814 0.210030 0.051730
0.298069 0.106188 0.003296
0.167143 0.134935 0.015754
-0.073166 0.182527 0.039767
-0.309595 0.103789 0.005482
-0.358194 0.111483 0.005420
-0.024557 0.211538 0.052388
-0.147010 0.172224 0.031877
0.011628 0.212427 0.052785
-0.100689 0.173421 0.032409
0.271113 0.117805 0.008337
-0.071999 0.203341 0.048814
0.467721 0.059724 -0.016853
0.118877 0.139802 0.021249
0.334931 0.109068 0.004557
-0.269163 0.100753 0.000781
-0.092837 0.199076 0.043562
-0.156794 0.136340 0.019670
0.181922 0.150862 0.026073
0.244307 0.107203 0.007115
-0.012348 0.213747 0.049960
0.256244 0.123650 0.014266
0.013833 0.190330 0.043181
0.023924 0.212618 0.049479
0.352741 0.089376 -0.003997
0.028903 0.190363 0.039807
0.214375 0.142026 0.022241
0.350007 0.114704 0.007011
-0.167720 0.134800 0.018998
0.192155 0.148533 0.025063
-0.362149 0.103834 0.002095
0.071863 0.202866 0.048645
0.103566 0.166700 0.032935
0.415056 0.079699 -0.004793
-0.335702 0.110043 0.008193
-0.256895 0.126585 0.012012
-0.145804 0.166420 0.032747
0.072815 0.182046 0.039597
0.339071 0.112124 0.005886
-0.452205 0.083408 -0.003415
0.358071 0.058978 -0.013815
0.330126 0.104699 0.006049
-0.142683 0.159746 0.029847
-0.113005 0.191957 0.040462
0.358511 0.094536 0.001640
0.203214 0.124148 0.011076
0.145734 0.136337 0.019750
-0.227736 0.138547 0.020611
-0.416037 0.083684 -0.006677
-0.085062 0.179448 0.038425
-0.359405 0.083271 -0.003449
-0.182368 0.153305 0.023644
0.359054 0.106553 0.003471
-0.014473 0.190423 0.043214
-0.103855 0.168625 0.030324
-0.347255 0.116313 0.010915
0.103029 0.194992 0.041839
0.059068 0.184875 0.040823
-0.350731 0.115779 0.010682
0.145468 0.165458 0.032407
0.048557 0.209007 0.047916
0.381505 0.080656 -0.007779
0.060479 0.205423 0.049754
0.112910 0.191211 0.040199
0.227186 0.137045 0.020080
0.190161 0.128665 0.013036
-0.318166 0.103069 0.005167
-0.330920 0.106882 0.006820
-0.144413 0.165481 0.028947
-0.103092 0.194432 0.044933
0.368165 0.079854 -0.004739
-0.382488 0.083179 -0.006888
0.268315 0.098978 0.000154
0.152398 0.156614 0.028565
0.397462 0.080660 -0.007773
0.130295 0.182199 0.039679
0.137153 0.178568 0.038102
-0.356322 0.093672 0.001072
-0.214887 0.144684 0.019889
0.230788 0.113757 0.006567
-0.000377 0.212827 0.052956
0.202907 0.145656 0.023816
-0.352528 0.088760 -0.004454
0.142361 0.176586 0.033850
0.360854 0.098810 0.000106
0.342839 0.113177 0.009738
-0.271817 0.118358 0.011824
-0.257798 0.103884 0.005537
-0.241970 0.133535 0.015036
-0.130482 0.183061 0.039983
0.216923 0.119084 0.008879
0.355404 0.110213 0.008453
0.361320 0.100204 0.004104
0.104777 0.161402 0.030633
0.146526 0.168915 0.030518
-0.029490 0.189316 0.042729
-0.359381 0.096907 0.002478
0.036302 0.211028 0.048791
0.346533 0.115261 0.007252
-0.361703 0.099955 0.003802
-0.203872 0.124252 0.014404
0.357426 0.107879 0.007439
-0.172448 0.153985 0.027335
-0.192618 0.151044 0.022659
0.285283 0.110109 0.008389
-0.353683 0.115709 0.007259
-0.036814 0.211270 0.048876
0.082500 0.200204 0.047491
-0.073166 0.183767 0.036913
-0.309594 0.105029 0.002629
0.105781 0.150757 0.026007
-0.325177 0.104329 0.005712
-0.024556 0.212779 0.049536
0.011629 0.213668 0.049932
0.317344 0.100970 0.004425
-0.071998 0.204581 0.045960
0.092784 0.197223 0.046198
-0.359845 0.107687 0.007162
-0.137383 0.179475 0.038423
0.118878 0.141042 0.018396
-0.156793 0.137580 0.016817
0.433305 0.080090 -0.004619
0.181923 0.152101 0.023219
0.244308 0.108443 0.004261
0.353103 0.082711 -0.003501
0.142297 0.158805 0.029515
-0.343568 0.115445 0.010539
0.256245 0.124890 0.011413
0.178262 0.131118 0.017491
0.013834 0.191570 0.040328
-0.122246 0.186866 0.041640
-0.339815 0.113126 0.009532
0.172016 0.152847 0.026933
0.214376 0.143266 0.019388
0.036303 0.209788 0.051644
0.355425 0.091321 0.000242
0.192155 0.149773 0.022210
0.105151 0.155973 0.028274
0.071864 0.204106 0.045792
-0.167719 0.136040 0.016145
0.103567 0.167940 0.030082
-0.361145 0.105077 0.006028
0.415057 0.080939 -0.007647
0.451228 0.081665 -0.007322
-0.335701 0.111283 0.005340
0.156229 0.135306 0.019305
-0.145803 0.167659 0.029893
-0.203393 0.146998 0.024290
0.072816 0.183286 0.036743
-0.452204 0.084648 -0.006268
-0.190785 0.129923 0.013480
-0.048932 0.208089 0.050883
0.330127 0.105939 0.003196
-0.245085 0.108820 0.007686
-0.142682 0.160987 0.026994
0.135869 0.137173 0.020111
-0.356158 0.112563 0.009283
0.358512 0.095776 -0.001213
0.122106 0.186060 0.041355
-0.326185 0.076352 -0.006447
0.145735 0.137577 0.016897
-0.227736 0.139788 0.017757
0.325158 0.074201 -0.007207
-0.085062 0.180688 0.035572
-0.359404 0.084511 -0.006302
-0.152802 0.157622 0.028921
-0.014472 0.191663 0.040361
-0.082573 0.200750 0.047684
0.256983 0.102184 0.004937
-0.347254 0.117553 0.008062
0.059069 0.186115 0.037969
-0.350731 0.117019 0.007829
0.145469 0.166698 0.029554
-0.000331 0.190785 0.043375
0.162240 0.154696 0.027734
-0.146845 0.168644 0.033713
0.227187 0.138286 0.017227
0.060480 0.206663 0.046900
-0.318165 0.104309 0.002313
0.308777 0.101747 0.004760
-0.369150 0.082289 -0.003879
-0.330919 0.108123 0.003968
-0.103092 0.195673 0.042080
-0.094526 0.176128 0.036980
0.368166 0.081094 -0.007592
-0.359214 0.061347 -0.012978
0.152399 0.157854 0.025712
0.142830 0.161096 0.030510
0.130296 0.183439 0.036825
-0.190784 0.128683 0.016333
0.112174 0.142364 0.022361
0.137154 0.179808 0.035249
-0.356322 0.094912 -0.001781
0.144061 0.163288 0.031463
-0.000377 0.214068 0.050102
0.202908 0.146896 0.020963
0.342840 0.114417 0.006884
-0.271816 0.119598 0.008971
-0.257797 0.105124 0.002684
-0.130481 0.184301 0.037130
0.107758 0.146106 0.023986
0.358428 0.080900 -0.004287
-0.059497 0.185266 0.040961
0.355405 0.111454 0.005599
0.360338 0.103934 0.002333
0.361321 0.101444 0.001251
0.044206 0.187269 0.041859
0.104778 0.162643 0.027780
-0.434286 0.082954 -0.003607
-0.162657 0.155770 0.028113
-0.146291 0.138542 0.017238
-0.029489 0.190556 0.039876
0.084772 0.178888 0.038227
0.352947 0.112136 0.009288
-0.359381 0.098147 -0.000376
-0.361703 0.101196 0.000949
0.351588 0.086435 -0.005275
-0.353659 0.090469 -0.000319
-0.203871 0.125492 0.011551
-0.398446 0.082048 -0.003991
0.357427 0.109119 0.004586
-0.172447 0.155225 0.024482
0.285284 0.111350 0.005535
-0.286037 0.111997 0.009056
-0.145777 0.173509 0.035828
-0.298862 0.106920 0.006846
-0.231524 0.114044 0.009960
0.082501 0.201444 0.044638
0.324362 0.102184 0.004955
-0.044718 0.187562 0.041963
-0.325176 0.105569 0.002859
3 80 336 180
3 80 143 336
3 143 246 336
3 8 0 138
3 0 166 138
3 166 1 138
3 166 198 1
3 166 93 198
3 8 269 0
3 198 9 1
3 166 288 93
3 135 175 41
3 135 289 175
3 175 309 41
3 135 2 289
3 236 85 326
3 236 3 85
3 236 37 3
3 236 263 37
3 65 100 31
3 65 338 100
3 65 19 338
3 100 4 31
3 91 344 226
3 91 5 344
3 91 113 5
3 275 7 165
3 7 311 165
3 7 141 311
3 141 48 311
3 48 285 311
3 7 6 141
3 11 139 245
3 11 112 139
3 11 281 112
3 11 10 281
3 10 286 281
3 286 172 281
3 216 73 171
3 216 109 73
3 216 99 109
3 320 234 289
3 2 320 289
3 280 320 2
3 135 280 2
3 276 280 135
3 61 280 276
3 97 61 276
3 347 97 276
3 177 347 276
3 229 177 276
3 46 229 276
3 344 46 276
3 204 46 344
3 5 204 344
3 287 204 5
3 113 287 5
3 214 287 113
3 52 214 113
3 161 214 52
3 324 161 52
3 323 161 324
3 141 323 324
3 108 323 141
3 111 108 141
3 235 111 141
3 304 235 141
3 43 304 141
3 356 304 43
3 90 234 320
3 115 90 320
3 337 115 320
3 292 337 320
3 67 292 320
3 255 67 320
3 151 255 320
3 94 151 320
3 296 94 320
3 274 296 320
3 100 274 320
3 4 100 320
3 24 4 320
3 31 4 24
3 191 31 24
3 312 191 24
3 68 191 312
3 33 191 68
3 248 191 33
3 262 191 248
3 321 191 262
3 171 191 321
3 259 171 321
3 216 171 259
3 302 216 259
3 205 216 302
3 124 205 302
3 249 205 124
3 253 249 124
3 64 249 253
3 136 64 253
3 198 64 136
3 348 198 136
3 127 198 348
3 71 198 127
3 12 198 71
3 330 198 12
3 114 330 12
3 59 276 135
3 26 31 191
3 265 59 135
3 128 31 26
3 146 320 280
3 238 146 280
3 232 238 280
3 50 232 280
3 239 24 320
3 149 24 239
3 223 24 149
3 186 24 223
3 117 50 280
3 303 24 186
3 241 117 280
3 264 24 303
3 62 241 280
3 353 24 264
3 142 62 280
3 14 24 353
3 308 142 280
3 182 24 14
3 307 356 43
3 270 307 43
3 16 270 43
3 29 270 16
3 131 29 16
3 54 29 131
3 231 29 54
3 297 29 231
3 25 29 297
3 295 25 297
3 278 330 114
3 140 330 278
3 178 330 140
3 164 178 140
3 346 178 164
3 329 346 164
3 101 329 164
3 153 101 164
3 322 153 164
3 224 153 322
3 246 265 135
3 180 246 135
3 336 246 180
3 45 31 128
3 266 31 45
3 286 266 45
3 10 266 286
3 333 266 10
3 11 333 10
3 37 333 11
3 245 37 11
3 3 37 245
3 78 3 245
3 85 3 78
3 169 308 280
3 189 24 182
3 56 24 189
3 314 24 56
3 75 24 314
3 317 75 314
3 79 75 317
3 209 79 317
3 298 79 209
3 220 298 209
3 123 220 209
3 122 220 123
3 28 169 280
3 325 28 280
3 22 325 280
3 17 325 22
3 194 17 22
3 120 17 194
3 272 120 194
3 69 120 272
3 110 120 69
3 133 110 69
3 331 198 330
3 210 198 331
3 283 198 210
3 36 198 283
3 150 198 36
3 342 198 150
3 9 198 342
3 156 43 141
3 341 156 141
3 340 341 141
3 318 340 141
3 105 318 141
3 208 105 141
3 6 208 141
3 119 208 6
3 290 119 6
3 7 290 6
3 70 290 7
3 197 70 7
3 107 197 7
3 174 107 7
3 96 174 7
3 275 96 7
3 23 9 342
3 87 9 23
3 1 9 87
3 310 1 87
3 187 1 310
3 200 1 187
3 268 1 200
3 20 1 268
3 269 1 20
3 138 1 269
3 8 138 269
3 85 78 316
3 326 85 316
3 78 245 139
3 316 78 139
3 286 45 271
3 172 286 271
3 45 128 35
3 271 45 35
3 128 26 254
3 35 128 254
3 26 191 86
3 254 26 86
3 191 171 73
3 86 191 73
3 216 205 99
3 205 249 145
3 99 205 145
3 249 64 294
3 145 249 294
3 64 198 93
3 294 64 93
3 269 20 247
3 0 269 247
3 20 268 159
3 247 20 159
3 268 200 95
3 159 268 95
3 200 187 83
3 95 200 83
3 187 310 196
3 83 187 196
3 310 87 327
3 196 310 327
3 87 23 250
3 327 87 250
3 23 342 38
3 250 23 38
3 342 150 53
3 38 342 53
3 150 36 261
3 53 150 261
3 36 283 170
3 261 36 170
3 283 210 104
3 170 283 104
3 210 331 218
3 104 210 218
3 331 330 15
3 218 331 15
3 330 178 74
3 15 330 74
3 178 346 227
3 74 178 227
3 346 329 217
3 227 346 217
3 329 101 339
3 217 329 339
3 101 153 57
3 339 101 57
3 153 224 118
3 57 153 118
3 224 322 211
3 118 224 211
3 322 164 66
3 211 322 66
3 164 140 44
3 66 164 44
3 140 278 167
3 44 140 167
3 278 114 354
3 167 278 354
3 114 12 240
3 354 114 240
3 12 71 305
3 240 12 305
3 71 127 34
3 305 71 34
3 127 348 230
3 34 127 230
3 348 136 42
3 230 348 42
3 136 253 147
3 42 136 147
3 253 124 32
3 147 253 32
3 124 302 190
3 32 124 190
3 302 259 152
3 190 302 152
3 259 321 207
3 152 259 207
3 321 262 155
3 207 321 155
3 262 248 144
3 155 262 144
3 248 33 258
3 144 248 258
3 33 68 300
3 258 33 300
3 68 312 199
3 300 68 199
3 312 24 251
3 199 312 251
3 24 75 313
3 251 24 313
3 75 79 319
3 313 75 319
3 79 298 185
3 319 79 185
3 298 220 116
3 185 298 116
3 220 122 30
3 116 220 30
3 133 69 301
3 40 133 301
3 69 272 162
3 301 69 162
3 272 194 89
3 162 272 89
3 194 22 60
3 89 194 60
3 22 280 168
3 60 22 168
3 280 61 291
3 168 280 291
3 61 97 335
3 291 61 335
3 97 347 228
3 335 97 228
3 347 177 77
3 228 347 77
3 177 229 121
3 77 177 121
3 229 46 273
3 121 229 273
3 46 204 98
3 273 46 98
3 204 287 173
3 98 204 173
3 287 214 106
3 173 287 106
3 214 161 63
3 106 214 63
3 161 323 212
3 63 161 212
3 323 108 349
3 212 323 349
3 108 111 351
3 349 108 351
3 111 235 130
3 351 111 130
3 235 304 192
3 130 235 192
3 304 356 237
3 192 304 237
3 356 307 193
3 237 356 193
3 307 270 160
3 193 307 160
3 270 29 257
3 160 270 257
3 29 25 252
3 257 29 252
3 25 295 181
3 252 25 181
3 295 297 184
3 181 295 184
3 297 231 125
3 184 297 125
3 231 54 282
3 125 231 282
3 54 131 39
3 282 54 39
3 131 16 243
3 39 131 243
3 16 43 267
3 243 16 267
3 43 156 58
3 267 43 58
3 156 341 225
3 58 156 225
3 341 340 222
3 225 341 222
3 340 318 203
3 222 340 203
3 318 105 343
3 203 318 343
3 105 208 102
3 343 105 102
3 208 119 18
3 102 208 18
3 119 290 176
3 18 119 176
3 290 70 306
3 176 290 306
3 70 197 92
3 306 70 92
3 197 107 345
3 92 197 345
3 107 174 76
3 345 107 76
3 174 96 334
3 76 174 334
3 96 275 165
3 334 96 165
3 141 324 213
3 48 141 213
3 324 52 279
3 213 324 279
3 52 113 352
3 279 52 352
3 352 113 91
3 344 276 315
3 226 344 315
3 276 59 88
3 315 276 88
3 59 265 154
3 88 59 154
3 265 246 143
3 154 265 143
3 292 67 299
3 179 292 299
3 67 255 148
3 299 67 148
3 255 151 55
3 148 255 55
3 151 94 332
3 55 151 332
3 94 296 183
3 332 94 183
3 296 274 163
3 183 296 163
3 274 100 338
3 163 274 338
3 31 266 158
3 65 31 158
3 266 333 219
3 158 266 219
3 333 37 263
3 219 333 263
3 180 135 41
3 80 180 41
3 289 234 129
3 175 289 129
3 234 90 328
3 129 234 328
3 90 115 355
3 328 90 355
3 115 337 221
3 355 115 221
3 337 292 179
3 221 337 179
3 122 123 27
3 30 122 27
3 123 209 103
3 27 123 103
3 209 317 202
3 103 209 202
3 317 314 201
3 202 317 201
3 314 56 284
3 201 314 284
3 56 189 84
3 284 56 84
3 189 182 81
3 84 189 81
3 182 14 242
3 81 182 242
3 14 353 233
3 242 14 233
3 353 264 157
3 233 353 157
3 264 303 188
3 157 264 188
3 303 186 82
3 188 303 82
3 186 223 260
3 82 186 260
3 223 149 51
3 260 223 51
3 149 239 134
3 51 149 134
3 239 320 206
3 134 239 206
3 320 146 49
3 206 320 49
3 146 238 132
3 49 146 132
3 238 232 126
3 132 238 126
3 232 50 277
3 126 232 277
3 50 117 13
3 277 50 13
3 117 241 137
3 13 117 137
3 241 62 293
3 137 241 293
3 62 142 47
3 293 62 47
3 142 308 195
3 47 142 195
3 308 169 72
3 195 308 72
3 169 28 256
3 72 169 256
3 28 325 215
3 256 28 215
3 325 17 244
3 215 325 244
3 17 120 21
3 244 17 21
3 120 110 350
3 21 120 350
3 110 133 40
3 350 110 40
3 129 206 175
3 206 309 175
3 206 168 309
3 168 41 309
3 168 315 41
3 168 291 315
3 291 335 315
3 335 228 315
3 228 77 315
3 77 121 315
3 121 273 315
3 273 226 315
3 273 98 226
3 98 91 226
3 98 173 91
3 173 352 91
3 173 106 352
3 106 279 352
3 106 63 279
3 63 213 279
3 63 212 213
3 212 48 213
3 212 349 48
3 349 351 48
3 351 130 48
3 130 192 48
3 192 267 48
3 192 237 267
3 129 328 206
3 328 355 206
3 355 221 206
3 221 179 206
3 179 299 206
3 299 148 206
3 148 55 206
3 55 332 206
3 332 183 206
3 183 163 206
3 163 338 206
3 338 19 206
3 19 251 206
3 19 65 251
3 65 86 251
3 86 199 251
3 86 300 199
3 86 258 300
3 86 144 258
3 86 155 144
3 86 207 155
3 86 73 207
3 73 152 207
3 73 109 152
3 109 190 152
3 109 99 190
3 99 32 190
3 99 145 32
3 145 147 32
3 145 294 147
3 294 42 147
3 294 93 42
3 93 230 42
3 93 34 230
3 93 305 34
3 93 240 305
3 93 15 240
3 15 354 240
3 315 88 41
3 65 254 86
3 88 154 41
3 65 35 254
3 206 49 168
3 49 132 168
3 132 126 168
3 126 277 168
3 251 134 206
3 251 51 134
3 251 260 51
3 251 82 260
3 277 13 168
3 251 188 82
3 13 137 168
3 251 157 188
3 137 293 168
3 251 233 157
3 293 47 168
3 251 242 233
3 47 195 168
3 251 81 242
3 237 193 267
3 193 160 267
3 160 243 267
3 160 257 243
3 257 39 243
3 257 282 39
3 257 125 282
3 257 184 125
3 257 252 184
3 252 181 184
3 15 167 354
3 15 44 167
3 15 74 44
3 74 66 44
3 74 227 66
3 227 217 66
3 217 339 66
3 339 57 66
3 57 211 66
3 57 118 211
3 154 143 41
3 143 80 41
3 65 271 35
3 65 158 271
3 158 172 271
3 158 281 172
3 158 219 281
3 219 112 281
3 219 263 112
3 263 139 112
3 263 236 139
3 236 316 139
3 236 326 316
3 195 72 168
3 251 84 81
3 251 284 84
3 251 201 284
3 251 313 201
3 313 202 201
3 313 319 202
3 319 103 202
3 319 185 103
3 185 116 103
3 116 27 103
3 116 30 27
3 72 256 168
3 256 215 168
3 215 60 168
3 215 244 60
3 244 89 60
3 244 21 89
3 21 162 89
3 21 301 162
3 21 350 301
3 350 40 301
3 93 218 15
3 93 104 218
3 93 170 104
3 93 261 170
3 93 53 261
3 93 38 53
3 93 288 38
3 267 58 48
3 58 225 48
3 225 222 48
3 222 203 48
3 203 343 48
3 343 102 48
3 102 285 48
3 102 18 285
3 18 176 285
3 176 311 285
3 176 306 311
3 306 92 311
3 92 345 311
3 345 76 311
3 76 334 311
3 334 165 311
3 288 250 38
3 288 327 250
3 288 166 327
3 166 196 327
3 166 83 196
3 166 95 83
3 166 159 95
3 166 247 159
3 166 0 247
