OFF

8 12 0
-0.464391 0.264847 0.104772
-0.154847 0.275153 0.099586
-0.232233 0.272577 0.104789
-0.232227 0.288201 0.104789
-0.232235 0.264765 0.093070
-0.000081 0.264682 0.104804
-0.464379 0.296096 0.104773
-0.348309 0.276524 0.104781
3 1 3 4
3 1 5 3
3 3 6 4
3 5 2 3
3 0 4 6
3 0 1 4
3 0 5 1
3 0 7 3
3 7 6 3
3 7 0 6
3 2 0 3
3 2 5 0
