OFF

219 434 0
-0.115015 -0.035710 -0.287395
0.003765 -0.248690 -0.041953
-0.125997 0.107240 0.009985
-0.168673 0.149078 -0.133356
-0.063580 0.144367 -0.081892
0.077230 -0.336695 -0.036260
-0.065970 -0.484710 -0.139953
0.006532 -0.449402 -0.115411
-0.140880 -0.355812 -0.347070
-0.061200 -0.383002 -0.342907
-0.082074 -0.296994 -0.360438
-0.160889 0.065522 -0.244190
-0.194391 0.059039 -0.236108
-0.110207 -0.100730 -0.015312
0.000385 -0.251054 -0.210016
-0.001771 -0.000143 0.278173
0.048126 -0.309675 0.016928
0.002574 -0.170594 -0.131707
-0.052564 0.023523 -0.253387
0.045689 -0.331796 -0.132077
-0.049299 0.008340 -0.188164
-0.005241 -0.121811 -0.115577
-0.102034 -0.419290 -0.236968
-0.036361 0.005163 -0.030012
-0.009591 -0.077072 -0.052636
0.005247 -0.299057 -0.262181
0.036726 -0.417130 -0.260222
-0.053548 0.046304 -0.082341
0.041053 -0.393057 -0.214520
-0.033961 -0.052114 -0.212526
0.065608 -0.391104 -0.119622
-0.018488 -0.163810 -0.226716
0.022197 -0.324076 -0.211991
-0.101919 -0.229301 -0.084093
-0.122562 -0.253322 -0.188928
-0.086621 -0.372309 -0.135393
-0.067761 0.118158 -0.216048
0.036893 -0.286606 -0.028035
-0.108308 -0.261133 -0.136109
-0.073876 -0.422058 -0.122469
0.019675 -0.387811 -0.307378
0.007053 -0.338717 -0.311866
-0.019803 -0.104807 -0.170748
0.060692 -0.346110 -0.095457
0.058549 -0.418637 -0.170968
-0.038693 -0.087542 -0.274649
-0.108816 -0.165865 -0.061795
0.002929 0.061658 0.135901
-0.076758 0.029124 0.075349
-0.028528 -0.115108 0.024321
-0.070146 0.076816 -0.146391
-0.065427 -0.308493 0.003649
-0.089469 -0.411534 -0.178661
-0.129310 -0.179761 -0.157890
-0.071686 -0.392272 -0.089500
-0.133590 -0.331586 -0.297421
-0.018585 -0.046606 0.010597
0.058787 -0.301454 -0.059080
-0.024132 -0.104546 -0.219478
0.045157 -0.361481 -0.163727
0.031217 -0.287797 -0.137046
-0.005537 -0.180824 -0.178226
-0.005693 -0.286422 -0.314297
-0.028234 -0.191565 -0.331644
0.021048 -0.359695 -0.262230
-0.029739 -0.029052 -0.114540
-0.114799 -0.386702 -0.263741
-0.136251 -0.080801 -0.107280
-0.107430 -0.358912 -0.210904
-0.172533 0.015271 -0.180609
-0.080857 -0.328380 -0.076263
-0.017415 -0.203201 -0.067902
0.047723 0.021454 0.297784
-0.060759 0.091147 0.013907
-0.039469 0.014518 0.167482
0.014268 0.026651 0.197089
-0.014549 -0.075406 0.071851
-0.086932 -0.217104 -0.012184
-0.088586 -0.244894 -0.041332
-0.087985 -0.270693 -0.059535
-0.089517 -0.291040 -0.082205
-0.093181 -0.305934 -0.109343
-0.098709 -0.313121 -0.138019
-0.106099 -0.312599 -0.168232
-0.114358 -0.304501 -0.195976
-0.123488 -0.288828 -0.221249
-0.132278 -0.267606 -0.240662
-0.140728 -0.240835 -0.254214
-0.168718 -0.054573 -0.220826
-0.162515 -0.014451 -0.239005
0.019551 -0.155559 -0.053966
0.017897 -0.183349 -0.083115
0.018499 -0.209148 -0.101318
0.015135 -0.236942 -0.137557
0.007775 -0.251576 -0.179802
-0.017005 -0.227283 -0.263032
-0.025795 -0.206061 -0.282445
-0.034246 -0.179290 -0.295997
-0.043936 -0.135337 -0.300908
-0.092079 -0.086327 -0.308998
-0.138628 0.068133 0.002331
-0.092982 -0.003919 -0.284676
-0.049818 0.071886 0.145243
-0.135882 0.044222 -0.005465
-0.107307 0.042733 0.111786
-0.078733 0.041243 0.229037
-0.054976 -0.440027 -0.058539
-0.083223 -0.002096 0.175660
-0.125581 -0.092810 -0.300915
0.032174 -0.433702 -0.300833
-0.155847 0.053186 -0.081034
0.010225 -0.349662 -0.020096
-0.021135 -0.470178 -0.246758
-0.098698 0.050206 0.153469
0.044178 -0.362528 -0.041830
-0.030564 -0.048415 0.356785
-0.054405 0.096047 0.069532
0.078132 -0.375394 -0.063564
-0.103188 0.006867 0.100091
-0.104450 0.021389 -0.273875
0.005804 -0.370036 -0.359071
-0.128204 -0.395969 -0.326742
-0.175813 0.062149 -0.156603
-0.083320 0.065403 0.153326
0.073536 -0.436435 -0.131575
-0.093885 0.078489 -0.260355
-0.147238 0.060659 -0.039351
-0.010050 -0.470961 -0.201438
-0.050529 -0.039452 0.281216
-0.083320 0.135588 -0.246835
-0.068167 0.168527 -0.157603
-0.123153 0.015830 0.024523
-0.085613 0.077483 0.115470
-0.001858 0.093691 0.095264
-0.206763 0.166754 -0.200986
0.001035 -0.471744 -0.156117
-0.046205 -0.187559 -0.352203
-0.070494 -0.030489 0.205648
-0.115919 0.046697 -0.263074
0.059864 0.043016 0.272419
-0.035640 -0.130460 -0.338682
0.055276 0.067176 0.196708
-0.187168 0.078586 -0.190489
-0.090201 0.101643 0.039758
-0.090459 -0.021525 0.130079
-0.130019 0.075606 0.044014
-0.056780 -0.362628 -0.003931
-0.068238 -0.219351 -0.354921
-0.022827 -0.375495 -0.025666
0.018479 -0.410192 -0.338743
0.011127 -0.388361 -0.047400
-0.037800 -0.067844 0.311204
-0.137952 0.014906 -0.265793
-0.115529 -0.436125 -0.306414
0.045080 -0.401227 -0.069134
-0.034830 -0.446668 -0.284668
-0.073875 -0.342846 -0.363235
0.079033 -0.414093 -0.090868
-0.178559 0.086060 -0.148806
-0.088140 -0.483145 -0.230594
-0.015070 -0.284027 -0.376602
0.026361 0.036532 0.280502
-0.149078 -0.309960 -0.344273
-0.121409 0.083080 0.085696
-0.116822 0.129105 -0.238753
-0.101669 0.162044 -0.149521
-0.090272 -0.251142 -0.357640
-0.077055 -0.483927 -0.185273
-0.169949 0.093533 -0.107124
-0.159986 -0.016886 -0.268512
-0.039947 0.111368 0.027635
-0.141375 0.092043 0.010128
-0.069142 -0.136943 -0.330600
-0.004847 0.017969 0.326440
-0.138856 0.097313 -0.241471
0.021774 0.060693 0.204790
-0.058576 -0.079843 -0.317080
0.017187 0.084853 0.129079
-0.161340 0.101007 -0.065441
-0.093205 0.002385 0.137876
-0.048011 -0.022744 -0.303560
0.012599 0.109013 0.053367
-0.171454 0.008423 -0.257711
-0.091175 -0.168734 -0.333319
-0.009434 0.042129 0.250728
-0.055878 -0.401327 -0.031235
-0.070045 -0.054535 -0.306279
-0.056021 0.008369 0.296809
-0.021925 -0.414194 -0.052969
0.012029 -0.427060 -0.074704
-0.201270 0.118934 -0.216578
-0.133136 0.020312 -0.013262
-0.040643 0.023566 0.296666
-0.014022 0.066290 0.175017
-0.075986 0.017332 0.221241
0.045870 -0.457211 -0.262923
-0.060473 -0.462368 -0.099246
-0.153101 0.029275 -0.088830
-0.192661 0.126407 -0.174896
-0.164086 0.124917 -0.057645
-0.016315 0.078370 0.137161
-0.095952 0.026296 0.145672
0.056955 -0.457994 -0.217603
-0.045230 0.047726 0.220955
-0.070948 0.027872 -0.281957
-0.048525 -0.423158 -0.322578
-0.025490 0.126690 -0.014262
-0.006871 -0.329879 -0.379400
-0.184051 0.133881 -0.133213
-0.101834 -0.459635 -0.268504
-0.043292 -0.020023 0.326797
-0.060383 0.084972 -0.268437
-0.030078 0.150850 -0.089974
-0.114112 -0.118118 -0.311717
-0.115917 0.035259 0.070103
0.068040 -0.458777 -0.172282
-0.183826 0.116138 -0.222588
-0.023268 -0.238175 -0.373805
-0.063258 -0.011060 0.251229
3 166 183 162
3 183 213 162
3 213 108 162
3 108 169 162
3 169 88 162
3 169 89 88
3 169 182 89
3 88 87 162
3 162 8 166
3 166 147 183
3 108 0 169
3 88 53 87
3 53 34 87
3 87 55 162
3 147 136 183
3 183 172 213
3 213 99 108
3 169 152 182
3 173 15 115
3 15 74 115
3 74 76 115
3 76 51 115
3 76 49 51
3 49 71 51
3 74 48 76
3 51 151 115
3 51 144 151
3 51 118 144
3 51 214 118
3 144 137 151
3 49 90 71
3 71 1 51
3 1 16 51
3 51 77 214
3 77 13 214
3 137 128 151
3 1 37 16
3 15 75 74
3 13 131 214
3 48 56 76
3 48 23 56
3 51 78 77
3 51 79 78
3 13 191 131
3 191 103 131
3 13 197 191
3 165 212 129
3 212 130 129
3 165 50 212
3 130 164 129
3 130 134 164
3 134 216 164
3 216 174 164
3 216 11 174
3 216 12 11
3 12 182 11
3 12 89 182
3 129 36 165
3 129 211 36
3 130 3 134
3 130 4 3
3 4 199 3
3 4 2 199
3 4 206 2
3 206 143 2
3 206 170 143
3 12 69 89
3 12 142 69
3 142 122 69
3 182 152 11
3 170 116 143
3 142 158 122
3 12 190 142
3 170 181 116
3 122 197 69
3 16 146 51
3 173 72 15
3 173 139 72
3 16 111 146
3 16 5 111
3 115 210 173
3 210 187 173
3 187 192 173
3 139 141 72
3 111 148 146
3 148 185 146
3 173 161 139
3 187 105 192
3 77 46 13
3 74 47 48
3 16 37 5
3 148 150 185
3 196 106 6
3 106 7 6
3 7 135 6
3 106 189 7
3 135 127 6
3 8 10 166
3 8 156 10
3 8 121 156
3 121 153 156
3 153 9 156
3 153 205 9
3 95 31 96
3 95 14 31
3 14 61 31
3 14 94 61
3 95 25 14
3 100 110 126
3 100 163 145
3 193 102 175
3 102 163 132
3 65 23 27
3 98 45 140
3 211 18 36
3 124 44 215
3 93 60 92
3 50 20 27
3 21 65 42
3 93 61 94
3 180 18 211
3 55 121 8
3 85 55 87
3 23 48 73
3 56 49 76
3 42 65 29
3 48 181 73
3 96 62 95
3 217 160 62
3 30 124 157
3 120 40 41
3 24 56 23
3 98 31 58
3 109 26 40
3 24 65 21
3 195 202 26
3 19 43 60
3 37 1 57
3 31 98 97
3 17 21 42
3 94 32 60
3 80 70 81
3 13 46 67
3 46 33 53
3 85 86 34
3 70 146 185
3 209 22 159
3 65 24 23
3 180 45 29
3 71 90 91
3 77 33 46
3 38 34 53
3 153 66 22
3 68 35 52
3 25 95 62
3 207 62 160
3 109 195 26
3 63 96 97
3 26 28 64
3 217 96 63
3 117 5 43
3 19 59 30
3 64 28 32
3 59 44 30
3 88 67 53
3 77 78 33
3 36 20 50
3 29 45 58
3 53 33 38
3 27 23 73
3 41 25 62
3 60 93 94
3 38 81 82
3 35 39 52
3 66 68 22
3 17 92 91
3 35 70 54
3 86 87 34
3 196 39 106
3 82 84 83
3 133 181 200
3 58 31 42
3 26 64 40
3 42 29 58
3 43 30 117
3 5 57 43
3 1 60 57
3 73 212 27
3 42 61 17
3 19 60 59
3 59 60 32
3 20 65 27
3 6 39 196
3 28 26 202
3 41 40 64
3 180 140 45
3 124 30 44
3 21 90 24
3 33 79 80
3 34 84 85
3 209 153 22
3 85 87 86
3 67 69 197
3 70 79 51
3 61 93 17
3 89 69 88
3 185 106 54
3 74 75 47
3 75 15 72
3 47 75 141
3 117 30 157
3 20 29 65
3 40 120 149
3 52 6 167
3 79 70 80
3 55 68 66
3 68 55 85
3 68 85 84
3 88 69 67
3 106 39 54
3 53 67 46
3 121 66 153
3 54 39 35
3 84 82 68
3 81 70 82
3 79 33 78
3 190 12 134
3 55 8 162
3 13 67 197
3 80 81 38
3 52 39 6
3 91 21 17
3 146 70 51
3 1 71 92
3 44 28 202
3 38 33 80
3 1 92 60
3 24 90 49
3 60 43 57
3 41 62 207
3 140 63 97
3 217 63 140
3 42 31 61
3 25 64 32
3 43 19 30
3 181 47 141
3 56 24 49
3 149 109 40
3 217 62 96
3 48 47 181
3 92 17 93
3 98 140 97
3 97 96 31
3 59 32 28
3 41 64 25
3 159 22 167
3 71 91 92
3 35 82 70
3 83 84 34
3 38 83 34
3 167 22 52
3 57 5 37
3 70 185 54
3 55 66 121
3 138 152 125
3 180 29 18
3 72 141 75
3 21 91 90
3 32 94 14
3 83 38 82
3 44 202 215
3 28 44 59
3 120 41 207
3 181 212 73
3 212 50 27
3 50 165 36
3 58 45 98
3 180 186 99
3 25 32 14
3 29 20 18
3 18 20 36
3 35 68 82
3 52 22 68
3 204 0 101
3 144 118 214
3 113 214 104
3 107 137 201
3 145 214 100
3 145 163 214
3 171 100 178
3 171 163 100
3 208 199 178
3 208 134 199
3 171 199 163
3 171 178 199
3 113 105 194
3 113 163 105
3 187 194 105
3 104 163 113
3 104 214 163
3 201 113 194
3 201 214 113
3 198 208 158
3 198 134 208
3 168 208 178
3 168 158 208
3 142 190 158
3 198 190 134
3 198 158 190
3 126 178 100
3 126 110 178
3 103 100 214
3 103 110 100
3 122 158 110
3 168 110 158
3 168 178 110
3 179 144 214
3 179 137 144
3 191 197 110
3 122 110 197
3 191 110 103
3 131 103 214
3 218 137 194
3 218 128 137
3 179 201 137
3 179 214 201
3 107 194 137
3 107 201 194
3 210 115 128
3 151 128 115
3 218 187 128
3 218 194 187
3 210 128 187
3 147 217 136
3 183 136 172
3 147 166 217
3 213 172 99
3 108 99 0
3 169 0 152
3 216 134 12
3 138 11 152
3 138 125 11
3 119 152 0
3 119 125 152
3 129 164 125
3 174 125 164
3 174 11 125
3 186 0 99
3 186 180 0
3 176 99 172
3 176 180 99
3 136 140 172
3 136 217 140
3 176 140 180
3 176 172 140
3 204 211 125
3 204 180 211
3 129 125 211
3 101 180 204
3 101 0 180
3 119 204 125
3 119 0 204
3 160 10 207
3 160 217 10
3 156 207 10
3 166 10 217
3 205 149 9
3 156 9 207
3 120 9 149
3 120 207 9
3 109 155 195
3 109 149 155
3 112 155 159
3 112 195 155
3 209 155 153
3 209 159 155
3 205 155 149
3 205 153 155
3 135 215 127
3 167 127 159
3 167 6 127
3 112 127 195
3 112 159 127
3 202 127 215
3 202 195 127
3 189 157 7
3 135 7 215
3 124 7 157
3 124 215 7
3 114 117 150
3 114 5 117
3 154 117 157
3 154 150 117
3 148 111 150
3 114 111 5
3 114 150 111
3 188 185 150
3 188 106 185
3 154 189 150
3 154 157 189
3 188 189 106
3 188 150 189
3 170 206 181
3 130 212 4
3 206 212 181
3 206 4 212
3 177 141 175
3 177 181 141
3 139 175 141
3 177 200 181
3 177 175 200
3 133 116 181
3 133 200 116
3 132 116 102
3 132 163 116
3 123 102 203
3 123 163 102
3 192 105 203
3 123 105 163
3 123 203 105
3 2 163 199
3 3 199 134
3 143 163 2
3 143 116 163
3 173 192 161
3 184 192 203
3 184 161 192
3 193 203 102
3 193 175 203
3 200 102 116
3 200 175 102
3 139 161 175
3 184 175 161
3 184 203 175
