OFF

276 548 0
-0.431908 0.141456 0.229244
-0.266066 0.313240 -0.117187
-0.379851 -0.108352 0.228937
-0.191214 0.234330 0.125151
-0.204488 0.231800 0.161370
-0.230383 0.144245 0.233544
-0.282814 0.152628 0.275291
-0.451753 0.034224 0.094849
-0.459592 -0.021080 0.135190
-0.339574 0.101840 -0.281564
-0.147643 0.091725 0.223187
-0.053400 0.264276 -0.057186
-0.020950 0.220284 0.071193
0.004899 0.149490 0.090890
-0.065808 0.154886 0.164296
-0.096219 -0.242365 -0.034927
0.157449 -0.131298 -0.095093
0.134752 0.068570 -0.069616
0.048476 -0.129898 -0.079323
0.224619 -0.055732 -0.072862
-0.295124 -0.021461 -0.282603
-0.414342 -0.095611 0.232638
-0.455485 -0.005911 0.213672
-0.465631 -0.066977 0.190023
-0.448645 0.044327 0.164184
-0.452179 0.004917 0.286809
-0.330114 0.158562 -0.257986
-0.381145 -0.214740 0.100401
-0.275960 0.266393 -0.231899
-0.337504 -0.187762 0.228781
-0.184366 -0.078019 -0.232468
-0.102783 0.203829 -0.206878
0.119987 -0.023444 -0.081325
-0.045171 -0.140692 -0.106524
-0.128438 0.158533 -0.217003
-0.098214 0.225853 -0.156721
-0.006011 -0.129198 -0.071437
-0.234332 -0.182741 -0.089337
-0.139917 0.198220 -0.191660
-0.285419 0.209671 -0.255478
-0.169774 -0.221190 -0.205666
-0.181130 -0.224992 0.139079
-0.130614 -0.209696 -0.170579
-0.199972 0.168328 0.200618
-0.265994 -0.216253 -0.045631
-0.091453 -0.198201 -0.135493
-0.259599 0.031073 -0.286797
-0.052293 -0.186706 -0.100407
-0.287245 0.115364 -0.283914
-0.303037 0.212478 -0.244942
-0.057969 0.242252 -0.107343
-0.151821 -0.054246 0.248264
-0.192092 -0.184514 0.182378
-0.171745 0.007005 -0.268423
-0.228347 0.288574 -0.089297
-0.297656 -0.249765 -0.001924
-0.308621 0.281200 -0.159316
-0.074693 0.147975 -0.192398
-0.230643 -0.147406 -0.175471
0.037502 0.146865 -0.072225
-0.339909 -0.261820 0.027714
0.089818 0.130721 -0.067993
-0.403620 -0.219454 -0.057051
-0.389808 -0.255780 0.000078
-0.017723 0.258650 -0.057966
-0.262305 -0.180918 -0.131765
-0.279611 0.077780 -0.288771
-0.372196 -0.110895 -0.239361
-0.330649 -0.073996 -0.278410
-0.371251 -0.167893 0.215114
-0.293967 -0.214430 -0.088058
-0.218022 -0.062382 -0.211426
-0.053985 0.046113 -0.183772
-0.023006 0.004475 -0.139707
-0.250263 0.000591 -0.264992
-0.268326 0.228809 -0.236756
-0.387361 -0.232291 -0.057412
-0.199902 0.287746 -0.032466
-0.172157 -0.243273 -0.155383
-0.194803 0.022362 0.239601
-0.187525 0.269664 0.039017
-0.325629 -0.247942 -0.044351
-0.247516 0.265565 -0.175068
-0.275689 -0.174185 -0.167401
-0.132997 -0.231778 -0.120297
-0.093836 -0.220283 -0.085210
-0.253547 -0.114916 -0.207232
-0.069289 -0.053034 -0.168677
-0.054676 -0.208789 -0.050124
-0.285788 -0.051944 -0.260798
0.007967 0.195612 -0.101497
-0.384913 -0.208801 -0.114902
-0.307351 -0.207697 -0.123695
-0.357291 -0.281454 -0.000644
-0.205401 0.022643 -0.247380
-0.260692 0.191225 -0.241613
-0.401735 -0.222423 0.050601
-0.115571 -0.110542 -0.197646
-0.339013 -0.241209 -0.079988
-0.346104 -0.128221 0.242604
-0.289072 -0.167451 -0.203038
-0.182182 0.107386 0.203647
-0.321313 -0.104478 -0.256604
-0.291240 0.095878 0.299193
-0.354844 -0.257965 -0.058135
-0.240926 -0.029892 -0.243187
-0.186360 -0.038584 0.228724
-0.083519 0.094859 -0.213044
-0.320734 -0.200963 -0.159332
-0.219071 0.264737 -0.118238
-0.161853 -0.168051 -0.226615
-0.186836 -0.220412 -0.155050
-0.225412 0.069350 -0.249354
-0.253058 0.153641 -0.246471
-0.366207 -0.198148 -0.172754
-0.352396 -0.234475 -0.115625
-0.276451 -0.082426 -0.238993
-0.216066 -0.105113 0.186397
-0.342450 -0.211185 0.171425
-0.174540 -0.265355 -0.105100
-0.135380 -0.253860 -0.070014
-0.369218 -0.248097 0.049878
-0.123345 0.277502 -0.005413
-0.334118 -0.194229 -0.194968
-0.349949 -0.210985 -0.173115
-0.177917 -0.099531 0.217848
-0.311976 -0.134961 -0.234799
-0.190627 0.263908 -0.061407
-0.086891 0.269843 0.044033
-0.245424 0.116057 -0.251328
-0.062537 0.220228 -0.157500
-0.000859 0.142496 -0.122144
-0.165872 0.227745 0.081558
0.030119 0.100858 -0.078079
-0.347501 -0.187495 -0.230605
0.082435 0.084714 -0.073848
-0.022292 0.236626 -0.108123
-0.169474 -0.160477 0.206971
-0.092346 0.041744 -0.233691
-0.061367 0.000106 -0.189626
-0.162183 0.263080 -0.004576
-0.176923 -0.287437 -0.054817
-0.226505 0.229502 -0.204170
-0.137763 -0.275942 -0.019731
0.017954 0.253024 -0.058746
-0.125728 0.255421 0.044870
-0.271013 0.289817 -0.174543
-0.111610 0.150714 -0.227524
-0.107649 -0.057403 -0.218596
-0.089077 0.269901 -0.056407
-0.053920 0.245064 0.057613
-0.161228 -0.043326 -0.260966
-0.130779 0.242268 -0.091346
-0.191226 0.107627 -0.211911
-0.089274 0.247761 0.094316
-0.218871 0.191918 -0.209027
-0.153932 -0.114911 -0.247565
-0.203898 -0.219633 -0.104435
-0.198061 0.228674 -0.147340
-0.322223 -0.017246 -0.302312
-0.207505 -0.112713 -0.203970
-0.211237 0.154334 -0.213885
-0.028950 0.198351 -0.136624
-0.073729 0.101746 0.185246
-0.352344 -0.258031 0.056712
-0.200209 -0.184298 -0.190569
-0.418034 -0.188950 -0.099756
-0.045497 0.053034 0.154660
-0.190268 -0.269041 0.038765
-0.169616 0.227845 -0.090509
-0.128111 0.233339 0.095153
0.011296 0.214749 -0.087247
-0.194884 -0.027688 -0.239924
-0.201230 -0.228562 0.082064
-0.120436 0.097598 -0.248171
-0.008242 0.096489 -0.127998
0.022737 0.054851 -0.083934
-0.056303 0.222982 0.107896
-0.206281 -0.241715 -0.054152
-0.265493 0.178907 0.252903
-0.091657 0.225680 0.144599
-0.212192 -0.188083 0.125363
0.075053 0.038707 -0.079702
0.110084 -0.084584 -0.093325
0.127369 0.022563 -0.075471
-0.399328 -0.178297 -0.157608
0.179686 0.006419 -0.071239
-0.280329 -0.167683 0.198722
-0.223154 -0.147605 0.168662
-0.367722 0.149946 -0.242759
-0.099728 -0.004263 -0.239546
0.102962 -0.130598 -0.087208
-0.318480 -0.154381 0.233056
-0.261305 -0.134302 0.202996
-0.340645 0.203861 -0.229716
-0.299457 -0.121000 0.237330
-0.242282 -0.100922 0.207270
-0.328044 -0.131039 0.252360
-0.146010 -0.061772 -0.268515
-0.313567 0.257777 -0.216673
-0.037776 0.145235 -0.157271
-0.220959 -0.218854 -0.053819
-0.280433 -0.087619 0.241604
-0.312633 -0.195340 0.170785
-0.255458 -0.175262 0.140725
-0.093645 0.247877 -0.106564
-0.380621 -0.167644 -0.215459
0.012021 0.195504 0.084773
-0.261410 -0.054238 0.245879
-0.339075 -0.130746 -0.254507
-0.154092 0.113236 -0.227129
-0.318585 -0.074317 0.275938
-0.208664 -0.263797 -0.003869
-0.023332 0.198202 0.121476
-0.135348 0.220244 -0.141503
0.062719 -0.037870 -0.091556
-0.058686 0.200900 0.158179
-0.177050 0.192611 -0.176442
-0.299562 -0.040936 0.280213
-0.376198 -0.191317 0.157757
-0.129263 0.044483 -0.268818
-0.219626 -0.223319 0.039430
0.167352 -0.070158 -0.083093
-0.030454 0.152188 0.127593
-0.192287 -0.131159 -0.211518
-0.309126 -0.017594 0.299517
-0.217270 -0.183519 -0.139953
-0.280538 -0.007555 0.284487
-0.002223 0.103476 0.097008
0.055598 -0.083884 -0.085440
-0.230587 -0.182840 0.082729
-0.287762 -0.202918 0.112789
-0.247704 0.117966 0.255932
-0.265024 0.091687 0.278319
-0.037576 0.106174 0.133710
-0.282345 0.065407 0.300707
-0.330015 -0.214974 0.142427
-0.009344 0.057462 0.103125
-0.107643 0.267097 -0.048798
-0.299666 0.039128 0.323095
0.184348 0.031862 -0.041484
-0.262892 -0.210497 0.054793
-0.046603 0.092120 -0.177918
-0.015624 0.050482 -0.133853
0.015355 0.008844 -0.089788
0.067671 -0.007300 -0.085557
-0.305145 -0.222552 0.084431
-0.162919 0.060121 -0.247776
-0.208978 -0.062622 0.204131
-0.065866 0.201090 -0.171751
-0.030928 -0.048665 -0.118758
0.008233 -0.037170 -0.083671
0.172303 -0.039588 -0.077093
-0.347397 -0.234608 0.114068
-0.138089 -0.008632 -0.289465
-0.136684 0.041382 0.250934
-0.304338 0.096226 -0.302635
-0.238021 -0.218075 -0.003203
-0.228106 -0.015938 0.242740
-0.077210 -0.106173 -0.147727
-0.038049 -0.094679 -0.112641
0.001111 -0.083184 -0.077554
-0.280274 -0.230131 0.026434
-0.212593 0.083303 0.236572
-0.200535 -0.123568 0.193255
-0.229914 0.057024 0.258960
0.206815 0.000787 -0.042295
-0.256791 0.289402 -0.146127
-0.160264 0.006700 0.259141
-0.294879 0.152948 -0.279057
-0.304461 0.009021 -0.304409
-0.123492 -0.163682 -0.176696
-0.247235 0.030745 0.281348
-0.322527 -0.242186 0.056072
-0.084332 -0.152187 -0.141610
-0.357192 0.104647 -0.271029
3 0 22 25
3 0 24 22
3 25 239 0
3 25 225 239
3 25 211 225
3 25 21 211
3 21 2 211
3 239 103 0
3 103 6 0
3 6 179 0
3 179 4 0
3 4 3 0
3 3 80 0
3 80 77 0
3 77 1 0
3 2 197 211
3 2 99 197
3 1 56 0
3 56 199 0
3 199 194 0
3 194 189 0
3 189 7 0
3 80 140 77
3 77 54 1
3 179 43 4
3 3 132 80
3 179 5 43
3 77 127 54
3 99 29 197
3 199 49 194
3 189 8 7
3 189 166 8
3 166 23 8
3 166 96 23
3 96 69 23
3 69 21 23
3 96 219 69
3 7 24 0
3 189 185 166
3 189 206 185
3 189 67 206
3 189 275 67
3 275 159 67
3 159 68 67
3 275 270 159
3 166 63 96
3 166 62 63
3 275 9 270
3 9 256 270
3 69 2 21
3 96 27 219
3 25 23 21
3 256 46 270
3 256 66 46
3 25 22 23
3 62 76 63
3 206 114 185
3 69 99 2
3 63 121 96
3 270 20 159
3 62 91 76
3 275 26 9
3 52 41 137
3 41 88 137
3 88 16 137
3 16 19 137
3 19 266 137
3 266 51 137
3 266 237 51
3 237 167 51
3 167 268 51
3 167 255 268
3 266 240 237
3 41 15 88
3 41 143 15
3 41 168 143
3 88 191 16
3 88 18 191
3 88 36 18
3 240 61 237
3 61 228 237
3 61 13 228
3 61 207 13
3 61 144 207
3 240 17 61
3 168 141 143
3 168 212 141
3 167 163 255
3 163 10 255
3 163 14 10
3 14 216 10
3 216 180 10
3 180 101 10
3 180 132 101
3 144 12 207
3 144 64 12
3 64 11 12
3 11 150 12
3 11 128 150
3 11 122 128
3 11 149 122
3 61 59 144
3 132 43 101
3 132 3 43
3 180 170 132
3 88 47 36
3 3 4 43
3 51 125 137
3 59 171 144
3 149 238 122
3 41 173 168
3 59 90 171
3 47 33 36
3 14 213 216
3 14 223 213
3 255 79 268
3 238 140 122
3 59 131 90
3 122 145 128
3 212 178 141
3 268 106 51
3 167 234 163
3 266 186 240
3 90 136 171
3 149 152 238
3 108 134 123
3 27 121 93
3 8 22 24
3 195 29 192
3 95 28 75
3 8 23 22
3 49 28 26
3 233 239 235
3 273 93 60
3 24 7 8
3 91 114 134
3 34 31 210
3 249 31 162
3 38 31 217
3 32 252 19
3 32 244 245
3 264 125 188
3 248 188 117
3 257 201 157
3 40 157 111
3 151 254 30
3 160 30 58
3 48 66 269
3 102 126 68
3 98 81 115
3 82 1 267
3 236 203 253
3 227 211 218
3 229 18 261
3 229 183 18
3 36 261 18
3 251 215 261
3 251 244 215
3 229 215 183
3 229 261 215
3 191 183 16
3 191 18 183
3 266 19 186
3 240 186 17
3 135 182 133
3 135 17 182
3 176 182 244
3 176 133 182
3 59 61 133
3 135 61 17
3 135 133 61
3 184 186 32
3 184 17 186
3 252 186 19
3 252 32 186
3 245 182 32
3 245 244 182
3 184 182 17
3 184 32 182
3 222 16 183
3 222 19 16
3 215 32 183
3 215 244 32
3 222 32 19
3 222 183 32
3 87 148 139
3 87 259 148
3 190 148 254
3 190 139 148
3 73 250 139
3 73 244 250
3 87 250 259
3 87 139 250
3 97 271 156
3 97 259 271
3 110 271 40
3 110 156 271
3 198 148 156
3 198 254 148
3 97 148 259
3 97 156 148
3 274 33 45
3 274 259 33
3 47 45 33
3 42 271 45
3 42 40 271
3 274 271 259
3 274 45 271
3 260 250 261
3 260 259 250
3 251 250 244
3 251 261 250
3 36 33 261
3 260 33 259
3 260 261 33
3 85 84 45
3 85 15 84
3 42 84 40
3 42 45 84
3 47 88 45
3 85 88 15
3 85 45 88
3 120 143 119
3 120 15 143
3 141 119 143
3 78 84 119
3 78 40 84
3 120 84 15
3 120 119 84
3 167 237 234
3 163 234 14
3 223 13 213
3 223 234 13
3 207 213 13
3 223 14 234
3 228 234 237
3 228 13 234
3 150 154 12
3 150 128 154
3 177 180 213
3 177 154 180
3 216 213 180
3 207 12 213
3 177 12 154
3 177 213 12
3 64 136 11
3 64 144 136
3 50 130 205
3 50 136 130
3 35 130 31
3 35 205 130
3 149 11 205
3 50 11 136
3 50 205 11
3 90 162 136
3 130 162 31
3 130 136 162
3 171 136 144
3 200 57 162
3 200 242 57
3 249 57 31
3 249 162 57
3 90 131 162
3 200 131 242
3 200 162 131
3 107 138 174
3 107 242 138
3 220 138 254
3 220 174 138
3 147 57 174
3 147 31 57
3 107 57 242
3 107 174 57
3 72 243 139
3 72 242 243
3 73 243 244
3 73 139 243
3 190 138 139
3 190 254 138
3 72 138 242
3 72 139 138
3 175 131 133
3 175 242 131
3 59 133 131
3 176 243 133
3 176 244 243
3 175 243 242
3 175 133 243
3 151 172 254
3 151 30 172
3 53 172 94
3 53 254 172
3 160 71 30
3 160 58 71
3 172 71 94
3 172 30 71
3 224 30 156
3 224 58 30
3 198 30 254
3 198 156 30
3 224 110 58
3 224 156 110
3 165 110 40
3 165 58 110
3 165 111 58
3 165 40 111
3 226 111 157
3 226 58 111
3 201 37 157
3 201 257 37
3 226 37 58
3 226 157 37
3 178 157 119
3 178 257 157
3 78 157 40
3 78 119 157
3 212 257 178
3 141 178 119
3 212 168 257
3 221 168 173
3 221 257 168
3 181 230 173
3 181 188 230
3 221 230 257
3 221 173 230
3 181 41 188
3 181 173 41
3 52 188 41
3 52 137 188
3 264 137 125
3 264 188 137
3 106 248 125
3 106 79 248
3 117 125 248
3 117 188 125
3 268 79 106
3 51 106 125
3 255 10 79
3 101 79 10
3 132 170 140
3 145 170 154
3 145 140 170
3 180 154 170
3 122 140 145
3 128 145 154
3 238 152 140
3 169 152 217
3 169 140 152
3 214 152 205
3 214 217 152
3 149 205 152
3 38 214 31
3 38 217 214
3 35 214 205
3 35 31 214
3 34 217 31
3 34 210 217
3 153 210 94
3 153 217 210
3 247 210 174
3 247 94 210
3 147 210 31
3 147 174 210
3 247 220 94
3 247 174 220
3 53 220 254
3 53 94 220
3 74 105 20
3 74 94 105
3 89 105 116
3 89 20 105
3 270 46 20
3 74 46 94
3 74 20 46
3 102 116 126
3 102 68 116
3 209 126 134
3 209 68 126
3 159 20 68
3 89 68 20
3 89 116 68
3 86 100 116
3 86 58 100
3 126 100 134
3 126 116 100
3 105 71 116
3 105 94 71
3 86 71 58
3 86 116 71
3 83 65 108
3 83 58 65
3 92 65 70
3 92 108 65
3 123 100 108
3 123 134 100
3 83 100 58
3 83 108 100
3 98 70 81
3 98 115 70
3 104 81 93
3 104 115 81
3 124 108 115
3 124 134 108
3 92 115 108
3 92 70 115
3 44 55 70
3 44 257 55
3 81 55 93
3 81 70 55
3 65 37 70
3 65 58 37
3 44 37 257
3 44 70 37
3 262 241 273
3 262 257 241
3 246 241 231
3 246 273 241
3 60 55 273
3 60 93 55
3 262 55 257
3 262 273 55
3 236 231 203
3 236 253 231
3 118 203 29
3 118 253 203
3 164 273 253
3 164 93 273
3 246 253 273
3 246 231 253
3 204 187 231
3 204 188 187
3 203 187 29
3 203 231 187
3 241 230 231
3 241 257 230
3 204 230 188
3 204 231 230
3 193 196 195
3 193 188 196
3 202 196 208
3 202 195 196
3 192 187 195
3 192 29 187
3 193 187 188
3 193 195 187
3 218 208 227
3 218 211 208
3 225 227 239
3 225 211 227
3 197 195 211
3 197 29 195
3 202 211 195
3 202 208 211
3 258 272 208
3 258 79 272
3 227 272 239
3 227 208 272
3 196 248 208
3 196 188 248
3 258 248 79
3 258 208 248
3 265 263 233
3 265 79 263
3 232 263 5
3 232 233 263
3 235 272 233
3 235 239 272
3 265 272 79
3 265 233 272
3 179 6 5
3 103 233 6
3 103 239 233
3 232 6 233
3 232 5 6
3 263 101 5
3 263 79 101
3 43 5 101
3 80 132 140
3 77 140 127
3 54 127 109
3 267 109 82
3 267 1 109
3 146 82 28
3 146 1 82
3 54 109 1
3 158 142 109
3 158 217 142
3 82 142 28
3 82 109 142
3 127 169 109
3 127 140 169
3 158 169 217
3 158 109 169
3 155 161 95
3 155 217 161
3 113 161 129
3 113 95 161
3 75 142 95
3 75 28 142
3 155 142 217
3 155 95 142
3 48 129 66
3 48 269 129
3 256 269 66
3 39 95 269
3 39 28 95
3 113 269 95
3 113 129 269
3 112 46 129
3 112 94 46
3 66 129 46
3 161 153 129
3 161 217 153
3 112 153 94
3 112 129 153
3 206 67 134
3 209 67 68
3 209 134 67
3 206 134 114
3 185 114 91
3 62 166 91
3 185 91 166
3 76 91 115
3 124 91 134
3 124 115 91
3 63 76 93
3 104 76 115
3 104 93 76
3 63 93 121
3 96 121 27
3 219 27 253
3 164 27 93
3 164 253 27
3 69 219 29
3 118 219 253
3 118 29 219
3 69 29 99
3 199 56 28
3 146 56 1
3 146 28 56
3 199 28 49
3 194 49 26
3 275 189 26
3 194 26 189
3 9 26 269
3 39 26 28
3 39 269 26
3 256 9 269
