OFF

10 16 0
0.295798 -0.225483 0.136559
0.255044 -0.288368 0.085916
0.196887 -0.240839 0.136304
0.235411 -0.263137 0.111135
0.246343 -0.233161 0.136432
0.217494 -0.210025 0.110402
0.175024 -0.300792 0.085710
0.185955 -0.270815 0.111007
0.217723 -0.311640 0.070203
0.148864 -0.294716 0.044070
3 4 1 0
3 4 5 1
3 4 2 5
3 1 3 0
3 5 8 1
3 5 9 8
3 9 6 8
3 2 9 5
3 2 7 9
3 7 6 9
3 8 6 1
3 3 1 6
3 4 3 2
3 4 0 3
3 7 3 6
3 7 2 3
