OFF
1395 1432 0
-0.4161604639 0.0537645003 -0.0818880172
-0.3574808353 -0.0421706400 -0.0323607571
0.4978143286 0.0330760390 0.0073373645
0.4978492365 0.0330855446 0.0073494848
0.4978115993 0.0330752959 0.0073424177
0.4978486515 0.0330853853 0.0073494849
0.4978532322 0.0330866325 0.0073373577
0.4978127697 0.0330756146 0.0073444385
0.4978551826 0.0330871636 0.0073393784
-0.2777381524 -0.0107131752 0.0054408553
-0.3141411902 0.0060516020 -0.0086034578
0.1024416837 -0.0779788494 0.0130383772
0.1024398642 -0.0779793934 0.0017911845
-0.3520149338 -0.0231394876 -0.0085959190
-0.3224130400 -0.0573498494 0.0016467052
-0.3484919544 0.0295232485 0.0330774227
-0.4972170886 0.0458786840 -0.0299211815
0.4957347199 0.0408935873 0.0073454071
0.4978446926 0.0330895439 0.0073565590
0.4978438139 0.0330893046 0.0073494855
0.4978462526 0.0330899687 0.0073565587
-0.3901382111 0.0315456784 0.0233957119
-0.3395893609 -0.0583834215 -0.0158558683
-0.3200415142 0.1278420747 0.0062514421
-0.2963135869 -0.0574338241 0.0094245746
0.4978181714 0.0330634703 0.0073454487
0.4978180739 0.0330634437 0.0073454488
0.4978155387 0.0330627534 0.0073444387
0.4978179764 0.0330634172 0.0073454488
0.4978178789 0.0330633906 0.0073454488
0.4978177812 0.0330633640 0.0073444383
0.4978177814 0.0330633641 0.0073454488
0.4978176839 0.0330633375 0.0073454488
0.4978175864 0.0330633110 0.0073454489
0.4978174889 0.0330632844 0.0073454489
0.4978173914 0.0330632579 0.0073454489
0.4978170989 0.0330631782 0.0073454489
0.4978164164 0.0330629924 0.0073454491
0.4978163192 0.0330629659 0.0073474701
0.1032938300 -0.0811118850 0.0074147944
-0.3353057029 0.0396878119 0.0042300424
-0.3315092606 -0.0073378771 0.0362279965
0.4978146975 0.0330866128 0.0073454482
0.4978016300 0.0330830544 0.0073323136
0.4978429726 0.0330943121 0.0073414011
0.4978301042 0.0330908081 0.0073535297
0.4978299064 0.0330907541 0.0073363508
-0.2967427503 -0.0579046864 0.0082615474
-0.2851088410 -0.0163962078 0.0341019491
-0.3699962990 -0.0518204596 0.0163017602
-0.2946902422 -0.0561822189 0.0058732508
0.4978543820 0.0330785671 0.0073424106
0.4978192810 0.0330690090 0.0073424167
0.4978514569 0.0330777706 0.0073424111
0.4978189895 0.0330689297 0.0073484799
0.4978113828 0.0330668583 0.0073393865
0.4978558453 0.0330789656 0.0073474630
0.4978506772 0.0330775583 0.0073444323
0.4978553572 0.0330788326 0.0073434209
0.4978177213 0.0330685843 0.0073444380
0.4978200615 0.0330692216 0.0073454482
0.4978549676 0.0330787266 0.0073464526
0.4978173311 0.0330684781 0.0073434276
0.4978471671 0.0330766025 0.0073444329
-0.3440407367 0.0329575361 -0.0148631839
-0.2897279537 -0.0462941670 0.0234214310
-0.2140717052 -0.1661851620 0.0074702502
0.4978232167 0.0330941692 0.0073393833
0.4978121993 0.0330911691 0.0073414063
0.4978118091 0.0330910628 0.0073403958
-0.2942226698 -0.0557385860 0.0105923264
-0.3168258362 0.0504034980 -0.0502996149
0.4978577349 0.0330847167 0.0073444308
0.4978548097 0.0330839202 0.0073434208
0.4978543220 0.0330837874 0.0073424103
0.4978468135 0.0330817427 0.0073373590
0.4978567594 0.0330844511 0.0073413994
0.4978563707 0.0330843452 0.0073494837
0.4978061548 0.0330706713 0.0073373661
-0.2967824445 -0.0577950633 0.0058736673
0.4978509460 0.0331069565 0.0073454413
0.4978346605 0.0331025219 0.0073292757
-0.3335097758 -0.0471511534 -0.0024779848
-0.3546051548 0.0589326511 0.0174772436
-0.3189166107 -0.0124538809 0.0631414573
-0.2986026791 -0.0591139094 0.0065763436
-0.3063364306 -0.0614209100 0.0059127779
0.4978083382 0.0330765025 0.0073424181
0.4977980046 0.0330736887 0.0073525252
0.4977979048 0.0330736615 0.0073383778
0.4978075582 0.0330762901 0.0073424183
0.4978175043 0.0330789985 0.0073474692
0.4978171145 0.0330788923 0.0073484798
0.4978395381 0.0330849983 0.0073363495
-0.2951579509 -0.0565431146 0.0094243445
-0.3764329345 0.0421112535 -0.0184154503
-0.3759564567 0.1393312496 0.0946448821
-0.3119295647 -0.0305207544 0.0331679871
-0.2994643468 -0.0274615406 0.0472745320
-0.3791506317 0.0058942652 0.0042387698
-0.2942205748 -0.0520838707 0.0178750352
0.4978486447 0.0330927147 0.0073444319
0.4978084756 0.0330817766 0.0073565653
0.4978081795 0.0330816959 0.0073343337
0.4978504958 0.0330932187 0.0073353368
-0.2861358998 0.0128136200 0.0330616760
0.4978123757 0.0330639868 0.0073484812
0.4978171532 0.0330652877 0.0073474699
0.4978120823 0.0330639068 0.0073424181
0.4978191028 0.0330658185 0.0073444380
0.4978158857 0.0330649425 0.0073474701
-0.4651343057 0.0705970499 0.0946621278
-0.3179626456 -0.0539187631 -0.0080896217
-0.2984791142 -0.0530372834 -0.0120540918
0.4978361023 0.0330945359 0.0073312969
0.4978358142 0.0330944576 0.0073585813
-0.3308746882 -0.0451202958 -0.0082435800
-0.3439131153 0.1640382191 -0.0299506864
0.4978510227 0.0330797470 0.0073383689
0.4978133883 0.0330694991 0.0073484808
0.4978504398 0.0330795883 0.0073515059
0.4978129008 0.0330693664 0.0073484809
0.4978553135 0.0330809154 0.0073424103
0.4978494633 0.0330793224 0.0073424113
0.4978489760 0.0330791897 0.0073434219
0.4978539495 0.0330805440 0.0073484737
0.4978165069 0.0330703483 0.0073393855
-0.4250814854 0.1014824667 -0.0961151159
-0.3233310016 -0.0458570181 0.0472791816
-0.2174926597 -0.1627577109 0.0119695151
-0.2174941153 -0.1627581461 0.0029717609
0.4978283440 0.0330976601 0.0073585823
-0.2838970838 -0.0417980879 0.0016700381
-0.3025373130 -0.0298246136 -0.0335747937
-0.3656757529 -0.0484916456 0.0330771043
-0.3079151490 -0.0603122040 0.0231397788
-0.2956326630 -0.0179570517 -0.0024855243
0.4978511602 0.0330850211 0.0073535266
0.4978111833 0.0330741353 0.0073484810
0.4978106967 0.0330740028 0.0073545442
-0.3942319957 -0.0092566786 -0.0502842071
-0.3099518785 -0.0477480031 0.0288861796
-0.2929509230 -0.0547576266 0.0065742080
0.5000000000 0.0252297691 0.0073454747
0.4978432981 0.0330881168 0.0073414014
0.4978027358 0.0330770716 0.0073343348
0.4978025444 0.0330770196 0.0073565664
0.4978417385 0.0330876921 0.0073444332
-0.4535501199 0.0249352199 0.0634944995
-0.3133236333 -0.0644798013 0.0012140835
-0.3328862869 -0.0232215010 0.0631443391
0.4978422631 0.0330930716 0.0073414013
0.4978546471 0.0330964438 0.0073484728
0.4978542572 0.0330963376 0.0073494834
0.4978131093 0.0330851329 0.0073383748
0.4978129165 0.0330850805 0.0073525223
0.4978277358 0.0330891158 0.0073454460
-0.2973296326 -0.0581325613 0.0105929448
-0.2956695527 -0.0570773010 0.0012118801
-0.2956687925 -0.0570770738 0.0059108420
-0.2956685390 -0.0570769980 0.0074781732
-0.3376897933 -0.0569233593 0.0341123143
-0.2945943398 -0.0562482587 0.0082611197
-0.2133782054 -0.1595866787 0.0119686961
-0.2133796610 -0.1595871139 0.0029709419
-0.3239686996 0.0448996509 -0.0568484452
0.4978546480 0.0330775922 0.0073454422
0.4978172077 0.0330673972 0.0073505014
0.4978545505 0.0330775656 0.0073454422
0.4978520152 0.0330768753 0.0073444321
0.4978543556 0.0330775126 0.0073464527
0.4978543555 0.0330775125 0.0073454422
0.4978168161 0.0330672905 0.0073403961
0.4978540628 0.0330774328 0.0073444317
0.4978088222 0.0330651138 0.0073484818
0.4978557203 0.0330778842 0.0073444314
0.4978530879 0.0330771674 0.0073454424
0.4978156474 0.0330669723 0.0073484806
0.4978529907 0.0330771409 0.0073474635
0.4978553306 0.0330777781 0.0073464526
0.4978553305 0.0330777780 0.0073454420
0.4978551355 0.0330777249 0.0073454421
0.4978550380 0.0330776984 0.0073454421
0.4978549405 0.0330776718 0.0073454421
0.4978099909 0.0330654320 0.0073403973
0.4978149648 0.0330667864 0.0073484807
0.4978548428 0.0330776452 0.0073444316
0.4978548430 0.0330776453 0.0073454421
0.4978547455 0.0330776187 0.0073454421
0.4978085669 0.0330891327 0.0073555544
0.4978229951 0.0330930615 0.0073414044
-0.3703226715 0.0890808274 0.0961076267
-0.2832254406 -0.0149409792 -0.0158670876
-0.2818217565 0.0161405458 0.0162852195
-0.4109959752 -0.0221840434 0.0361134382
0.4978679097 0.0330623515 0.0073454408
-0.4179746565 0.0523527581 0.0961169098
0.4978154891 0.0330721658 0.0073434277
0.4978054455 0.0330694309 0.0073383768
0.4978451292 0.0330802368 0.0073393804
0.4978522486 0.0330821755 0.0073494844
0.4978193897 0.0330732279 0.0073464586
0.4978541990 0.0330827066 0.0073515052
0.4978487725 0.0331053173 0.0073363470
0.4978485803 0.0331052650 0.0073535260
-0.3450707297 -0.0626094297 0.0054542579
-0.3347577917 0.1164953069 0.0634715611
-0.3411265967 0.1661851620 -0.0191304914
-0.2973081931 0.0654418632 0.0254925774
-0.2973605457 -0.0582404897 0.0071369442
0.4978519925 0.0330873423 0.0073424105
0.4978367832 0.0330832008 0.0073494869
0.4978563812 0.0330885374 0.0073494835
0.4978362955 0.0330830680 0.0073484765
0.4977962214 0.0330721558 0.0073454519
0.4978058745 0.0330747843 0.0073474712
0.4978054843 0.0330746781 0.0073464608
0.4978150383 0.0330772796 0.0073383749
0.4978522851 0.0330874220 0.0073434210
0.4978571608 0.0330887497 0.0073464517
-0.3202839285 -0.0435027409 -0.0335712612
-0.2982693504 -0.0199894420 -0.0082500701
0.4978434508 0.0331091049 0.0073575688
0.4978421834 0.0331087598 0.0073585796
-0.2161185242 -0.1586655316 0.0119690949
-0.2161199798 -0.1586659668 0.0029713407
-0.3000341696 0.0633401951 0.0360918564
-0.2920742999 -0.0504281075 -0.0013537469
-0.3535767728 -0.0243439729 -0.0051790079
0.4977925530 0.0330763935 0.0073403996
0.4978474472 0.0330913412 0.0073414005
0.4977921631 0.0330762873 0.0073414102
0.4978466685 0.0330911292 0.0073494849
-0.2943519889 0.0064862846 -0.0323723125
-0.3870915173 -0.0037524901 -0.0568368911
-0.2930484271 -0.0347164652 -0.0080945809
0.4989326091 0.0291451398 0.0003152044
0.4989348835 0.0291458199 0.0143747006
-0.2985850458 -0.0593248308 0.0125485801
0.4978179061 0.0330644453 0.0073464593
0.4978150780 0.0330636752 0.0073434282
0.4978173204 0.0330642858 0.0073424173
0.4978143956 0.0330634894 0.0073444388
0.4978115682 0.0330627195 0.0073454499
0.4978185888 0.0330646312 0.0073474697
0.4978181983 0.0330645249 0.0073444382
0.4978181984 0.0330645249 0.0073454487
-0.2941127074 -0.0557369358 0.0071362977
-0.2930704183 -0.0548498648 0.0061103988
-0.2976421043 -0.0583737003 0.0103060167
0.4978455355 0.0330960573 0.0073464533
0.4978026320 0.0330843746 0.0073323134
0.4978450481 0.0330959246 0.0073474639
-0.2113224591 -0.1580005380 0.0074694096
-0.3172020491 -0.0345852427 0.0331692387
-0.2168015906 -0.1561599283 0.0074702070
-0.4724258065 0.0649774254 0.0879755919
0.4978566519 0.0330802325 0.0073444312
0.4978482675 0.0330779494 0.0073494853
0.4978107279 0.0330677273 0.0073434287
0.4978105329 0.0330676742 0.0073434287
0.4978129719 0.0330683384 0.0073525231
0.4978478761 0.0330778428 0.0073414011
0.4978526549 0.0330791441 0.0073484740
0.4978149220 0.0330688694 0.0073525227
0.4978428405 0.0331005600 0.0073312956
0.4978273418 0.0330963398 0.0073575720
0.4978431374 0.0331006410 0.0073585798
-0.2909486085 -0.0534384255 0.0055410592
-0.2959707416 -0.0570849440 0.0038059584
-0.3710253378 0.0462795618 -0.0184165267
-0.3125779802 0.0072554427 -0.0051871688
0.0998816059 -0.0685808305 0.0074147403
-0.4547064419 0.0240532747 -0.0465178760
-0.3510943566 0.0239814256 0.0829463267
0.4978097922 0.0330727092 0.0073545444
0.4978071580 0.0330719919 0.0073444396
0.4978090112 0.0330724965 0.0073484814
0.4978488907 0.0330833558 0.0073535271
0.4978461588 0.0330826118 0.0073424117
0.4978458664 0.0330825322 0.0073434223
0.4978084252 0.0330723369 0.0073424183
-0.2195511022 -0.1643435773 0.0074710476
-0.3599213414 0.0171780169 0.0829479827
0.4967998363 0.0369775365 0.0003151706
0.4968021107 0.0369782165 0.0143746668
-0.3928424784 0.0294613711 0.0174838443
0.4978359550 0.0331039217 0.0073292754
-0.3686671197 0.1449502272 0.0879555449
-0.3461806845 -0.0334600817 -0.0427300283
-0.3704210664 0.0126239345 -0.0148579329
0.4978404425 0.0330862919 0.0073353387
0.4978104135 0.0330781150 0.0073464598
0.4978100236 0.0330780088 0.0073474704
-0.3056554941 -0.0022252765 -0.0427380949
0.4978477923 0.0331123817 0.0073413995
0.4978473045 0.0331122489 0.0073393785
-0.2147535815 -0.1636781485 0.0119691165
-0.2147550371 -0.1636785837 0.0029713623
-0.3003893614 -0.0607147827 0.0055429384
0.1007355717 -0.0717133221 0.0130383502
0.1007337522 -0.0717138661 0.0017911574
0.4978400920 0.0330914331 0.0073474649
0.4978396043 0.0330913003 0.0073464545
0.4978514980 0.0330945389 0.0073363471
0.4977965097 0.0330795656 0.0073565673
0.4977955345 0.0330793001 0.0073555569
-0.3721936411 0.0876527168 -0.0818967689
-0.2955847316 -0.0567871253 0.0038058815
0.4978145465 0.0330656252 0.0073403966
0.4978141581 0.0330655194 0.0073505019
0.4978186423 0.0330667405 0.0073444380
0.4978085023 0.0330639793 0.0073464608
0.4978132795 0.0330652801 0.0073434284
0.4978180571 0.0330665811 0.0073434276
0.4978128896 0.0330651740 0.0073444390
-0.3659553131 0.0160625939 0.0330804947
-0.2927506573 -0.0548276997 0.0125474188
0.4978077601 0.0330878657 0.0073565651
-0.3336363276 0.1173677533 -0.0465409646
-0.3573084842 0.0568486501 0.0233896823
-0.5000000000 0.0437323978 -0.0190998779
-0.2885948829 -0.0312844372 0.0016399736
0.4978272241 0.0330502255 0.0073454479
0.4978671025 0.0330610844 0.0073444304
0.4978671027 0.0330610845 0.0073454409
0.4978667127 0.0330609783 0.0073454410
0.4978283941 0.0330505441 0.0073454477
0.4978281014 0.0330504644 0.0073444372
0.4978281016 0.0330504644 0.0073454478
0.4978677851 0.0330612703 0.0073444303
0.4978677852 0.0330612703 0.0073454408
0.4978275164 0.0330503051 0.0073444373
0.4978275166 0.0330503051 0.0073454479
-0.4682839613 0.0135832803 0.0062799394
-0.3346333346 -0.0097459377 0.0362283152
-0.2984843091 -0.0590219816 0.0061114764
-0.3010469648 -0.0408846233 0.0288844071
-0.2939102909 -0.0554974748 0.0103052738
0.4978558284 0.0330821029 0.0073444312
0.4978033725 0.0330678191 0.0073484825
0.4978431533 0.0330786515 0.0073464545
0.4978155596 0.0330711376 0.0073434277
0.4978029824 0.0330677129 0.0073474721
0.4978178016 0.0330717481 0.0073403958
0.4978515391 0.0330809349 0.0073494846
0.4978439338 0.0330788640 0.0073494860
0.4978189730 0.0330720671 0.0073484798
0.4978538773 0.0330815716 0.0073383684
-0.4160692089 0.1084284951 -0.0961169098
-0.4137251153 -0.0242877118 0.0255152452
0.3012199321 -0.0263748122 0.0045683296
0.3016469150 -0.0279410580 0.0073801345
0.2022568810 -0.0537433486 0.0059915620
0.4006099661 -0.0005725215 0.0059569021
0.2018298982 -0.0521771028 0.0031797570
0.2022568810 -0.0537433486 0.0059915620
0.1525618641 -0.0666444939 0.0052972757
0.2998331806 -0.0212843631 0.0010531809
0.3006862366 -0.0244171268 0.0010531944
0.2011365224 -0.0496318783 0.0014221827
0.3993828948 0.0039303884 0.0006841927
0.2002834664 -0.0464991146 0.0014221692
0.2011365224 -0.0496318783 0.0014221827
0.1513616653 -0.0622392540 0.0016066768
0.2983407211 -0.0158016470 0.0038649554
0.2987667942 -0.0173681648 0.0010531640
0.1995372366 -0.0437577566 0.0028280564
0.3975702787 0.0105879447 0.0020900630
0.1991111635 -0.0421912387 0.0056398479
0.1995372366 -0.0437577566 0.0028280564
0.1499224578 -0.0569525524 0.0037155027
0.2982351458 -0.0154098674 0.0101918786
0.2978081629 -0.0138436216 0.0073800737
0.1990583759 -0.0419953489 0.0088033095
0.3969849329 0.0127418599 0.0087686429
0.1994853587 -0.0435615948 0.0116151144
0.1990583759 -0.0419953489 0.0088033095
0.1496834823 -0.0560712126 0.0095149274
0.2996218972 -0.0205003165 0.0137065220
0.2987688412 -0.0173675528 0.0137065085
0.2001787344 -0.0461068193 0.0133724361
0.3982120040 0.0082389500 0.0140405944
0.2010317905 -0.0492395829 0.0133724496
0.2001787344 -0.0461068193 0.0133724361
0.1508836811 -0.0604764525 0.0132053999
0.3011143567 -0.0259830326 0.0108947475
0.3006882836 -0.0244165148 0.0137065389
0.2017780202 -0.0519809410 0.0119665624
0.4000246201 0.0015813936 0.0126347241
0.2022040934 -0.0535474588 0.0091547709
0.2017780202 -0.0519809410 0.0119665624
0.1523228885 -0.0657631541 0.0110965741
-0.0557306035 -0.1223952343 0.0051930783
-0.0553889376 -0.1236485235 0.0074425223
-0.1352428203 -0.1430369090 0.0040822203
-0.0568400578 -0.1183226801 0.0023812626
-0.0561575864 -0.1208289885 0.0023812734
-0.1364800188 -0.1384943235 0.0026763016
-0.0580339192 -0.1139368972 0.0046306822
-0.0576931138 -0.1151899165 0.0023812490
-0.1374177549 -0.1350484128 0.0060504446
-0.0581184591 -0.1136231811 0.0096919176
-0.0584599923 -0.1123703794 0.0074424736
-0.1371184917 -0.1361443563 0.0108305062
-0.0570090049 -0.1176957353 0.0125037333
-0.0576914763 -0.1151894269 0.0125037225
-0.1358812932 -0.1406869419 0.0122364249
-0.0558150107 -0.1220820057 0.0102543137
-0.0561559489 -0.1208284989 0.0125037469
-0.1349433579 -0.1441335838 0.0088622820
-0.3238418632 -0.0401082807 -0.0013425385
-0.3330449295 -0.0222265697 -0.0044735454
-0.3238418632 -0.0401082807 -0.0013425385
-0.3517329979 -0.0048013176 -0.0096657391
-0.3360508635 -0.0074829101 -0.0062523041
-0.3330449295 -0.0222265697 -0.0044735454
-0.3562418990 0.0173141717 -0.0123338772
-0.3333470652 -0.0053987560 -0.0062528423
-0.3333470652 -0.0053987560 -0.0062528423
-0.3521862015 0.0204404029 -0.0123346845
-0.3198547646 -0.0120597689 -0.0044761710
-0.3198547646 -0.0120597689 -0.0044761710
-0.3319477507 0.0104488836 -0.0096696774
-0.3049049913 -0.0255127359 -0.0013463079
-0.3049049913 -0.0255127359 -0.0013463079
-0.3156880424 -0.0338253121 0.0222449313
-0.3313490317 -0.0209210463 0.0206710210
-0.3156880424 -0.0338253121 0.0222449313
-0.3486521724 -0.0024292262 0.0268757578
-0.3434404807 -0.0131795040 0.0158286296
-0.3313490317 -0.0209210463 0.0206710210
-0.3667893459 0.0091830872 0.0196121707
-0.3434404807 -0.0131795040 0.0158286296
-0.3447926143 -0.0142216577 0.0128726958
-0.3688175464 0.0076198567 0.0151782700
-0.3379466910 -0.0260052106 0.0062501586
-0.3379466910 -0.0260052106 0.0062501586
-0.3585486613 -0.0100554727 0.0052444642
-0.3251597615 -0.0411243297 0.0015412697
-0.3251597615 -0.0411243297 0.0015412697
-0.3035861600 -0.0244964080 0.0015369755
-0.3149500213 -0.0082802234 0.0062455811
-0.3035861600 -0.0244964080 0.0015369755
-0.3251278621 0.0157037942 0.0052378118
-0.3245997473 0.0013421962 0.0128691817
-0.3149500213 -0.0082802234 0.0062455811
-0.3396024510 0.0301374236 0.0151732126
-0.3245997473 0.0013421962 0.0128691817
-0.3259514120 0.0003001957 0.0158254010
-0.3416299481 0.0285744229 0.0196075417
-0.3215431471 -0.0133625051 0.0206692712
-0.3215431471 -0.0133625051 0.0206692712
-0.3350175508 0.0080803717 0.0268733470
-0.3130518002 -0.0317930679 0.0222445581
-0.3130518002 -0.0317930679 0.0222445581
-0.3265751940 -0.0496239705 -0.0155744385
-0.3413805350 -0.0304148956 -0.0278125055
-0.3265751940 -0.0496239705 -0.0155744385
-0.3642360261 -0.0170836929 -0.0423246983
-0.3559150083 -0.0016564003 -0.0403380686
-0.3413805350 -0.0304148956 -0.0278125055
-0.3642360261 -0.0170836929 -0.0423246983
-0.3257922805 -0.0293668507 -0.0195630942
-0.3860377361 0.0260540500 -0.0611130429
-0.3709763722 0.0121988248 -0.0507255557
-0.4016259906 0.0250060051 -0.0693624541
-0.3603755190 0.0222025828 -0.0474516179
-0.3559150083 -0.0016564003 -0.0403380686
-0.3860377361 0.0260540500 -0.0611130429
-0.3882679915 0.0379835416 -0.0646698176
-0.3709763722 0.0121988248 -0.0507255557
-0.3280225359 -0.0174373591 -0.0231198689
-0.3257922805 -0.0293668507 -0.0195630942
-0.3441990275 0.0023826119 -0.0352857434
-0.3927285022 0.0618425248 -0.0717833669
-0.3882679915 0.0379835416 -0.0646698176
-0.4022142277 0.0458740210 -0.0732789174
-0.3765520106 0.0420225538 -0.0596174924
-0.4089049938 0.0816624957 -0.0839492414
-0.4125327288 0.0677134980 -0.0829186293
-0.4206209746 0.0776234835 -0.0890015666
-0.3603755190 0.0222025828 -0.0474516179
-0.3882223640 0.0653155390 -0.0717842639
-0.3927285022 0.0618425248 -0.0717833669
-0.4066519247 0.0833990028 -0.0839496899
-0.3558693808 0.0256755970 -0.0474525149
-0.3280225359 -0.0174373591 -0.0231198689
-0.3882223640 0.0653155390 -0.0717842639
-0.3558693808 0.0256755970 -0.0474525149
-0.3859692948 0.0670520461 -0.0717847124
-0.4010192518 0.0877402706 -0.0839508111
-0.3941314250 0.0980406060 -0.0890068394
-0.3866064464 0.0876964937 -0.0829237900
-0.3640315109 0.0566641569 -0.0646746419
-0.3709193378 0.0463638216 -0.0596186136
-0.3681125760 0.0721584369 -0.0732857054
-0.3339315969 0.0152877079 -0.0403424444
-0.3257694667 -0.0157008520 -0.0231203174
-0.3408194237 0.0049873725 -0.0352864161
-0.3148005748 -0.0208947966 -0.0195652822
-0.3530626190 0.0514702123 -0.0611196066
-0.3434971079 0.0333789601 -0.0507310255
-0.3640315109 0.0566641569 -0.0646746419
-0.3339315969 0.0152877079 -0.0403424444
-0.3530626190 0.0514702123 -0.0611196066
-0.3480811703 0.0662761838 -0.0693726071
-0.3434971079 0.0333789601 -0.0507310255
-0.3098191261 -0.0060888251 -0.0278182826
-0.3148005748 -0.0208947966 -0.0195652822
-0.3168939129 0.0194054129 -0.0423333639
-0.3098191261 -0.0060888251 -0.0278182826
-0.3168939129 0.0194054129 -0.0423333639
-0.2950107708 -0.0252955082 -0.0155802162
-0.2950107708 -0.0252955082 -0.0155802162
-0.3330325571 -0.0546032141 0.0193100213
-0.3570572384 -0.0425012473 0.0155290918
-0.3330325571 -0.0546032141 0.0193100213
-0.3853911768 -0.0333944795 0.0205221685
-0.3843366614 -0.0235657512 0.0059114389
-0.3570572384 -0.0425012473 0.0155290918
-0.3853911768 -0.0333944795 0.0205221685
-0.3423630114 -0.0421402670 0.0057271886
-0.4263103113 -0.0049912355 0.0060956892
-0.4053234863 -0.0142784933 0.0060035640
-0.4410045383 -0.0053522158 0.0158975923
-0.4001946807 -0.0084911924 -0.0067784698
-0.3843366614 -0.0235657512 0.0059114389
-0.4263103113 -0.0049912355 0.0060956892
-0.4342393210 0.0025460439 -0.0002492652
-0.4053234863 -0.0142784933 0.0060035640
-0.3502920210 -0.0346029876 -0.0006177657
-0.3423630114 -0.0421402670 0.0057271886
-0.3752433509 -0.0215470900 -0.0036981177
-0.4500973403 0.0176206027 -0.0129391738
-0.4342393210 0.0025460439 -0.0002492652
-0.4512616412 0.0080646621 0.0030153371
-0.4251460105 0.0045647051 -0.0098588218
-0.4750486702 0.0306765003 -0.0160195259
-0.4716663157 0.0221298903 -0.0048697932
-0.4841419807 0.0286578390 -0.0064099692
-0.3988032250 -0.0074180493 -0.0121891216
-0.4001946807 -0.0084911924 -0.0067784698
-0.4494016125 0.0181571742 -0.0156444997
-0.3495962932 -0.0340664160 -0.0033230916
-0.4494016125 0.0181571742 -0.0156444997
-0.4733093505 0.0320179291 -0.0227828406
-0.4480101568 0.0192303174 -0.0210551516
-0.3988032250 -0.0074180493 -0.0121891216
-0.4480101568 0.0192303174 -0.0210551516
-0.4726136227 0.0325545007 -0.0254881666
-0.4759617652 0.0349659794 -0.0382195288
-0.4636600323 0.0283038877 -0.0360030213
-0.4267548335 0.0083176127 -0.0293534988
-0.4234066909 0.0059061340 -0.0166221366
-0.4407306377 0.0161854437 -0.0379356874
-0.3775479017 -0.0183307540 -0.0204874688
-0.3495962932 -0.0340664160 -0.0033230916
-0.3741997591 -0.0207422327 -0.0077561066
-0.3389686315 -0.0395227684 -0.0074722652
-0.4161271718 0.0028612603 -0.0335026724
-0.3968375367 -0.0077347469 -0.0269950706
-0.4267548335 0.0083176127 -0.0293534988
-0.3775479017 -0.0183307540 -0.0204874688
-0.4161271718 0.0028612603 -0.0335026724
-0.4244692188 0.0073982980 -0.0484010415
-0.3968375367 -0.0077347469 -0.0269950706
-0.3473106785 -0.0349857307 -0.0223706344
-0.3389686315 -0.0395227684 -0.0074722652
-0.3707713371 -0.0221212046 -0.0363274207
-0.3473106785 -0.0349857307 -0.0223706344
-0.3707713371 -0.0221212046 -0.0363274207
-0.3232850229 -0.0470874322 -0.0185935450
-0.3232850229 -0.0470874322 -0.0185935450
-0.3087508282 -0.0358893559 0.0378450187
-0.3292531936 -0.0210734069 0.0477482814
-0.3087508282 -0.0358893559 0.0378450187
-0.3445872675 -0.0019476950 0.0653481321
-0.3582798511 -0.0034860363 0.0543327450
-0.3292531936 -0.0210734069 0.0477482814
-0.3445872675 -0.0019476950 0.0653481321
-0.3284324485 -0.0314054335 0.0334406625
-0.3881272538 0.0244333609 0.0752248274
-0.3732035525 0.0104736623 0.0647787862
-0.3889479989 0.0347653875 0.0895324463
-0.3818596757 0.0056361096 0.0536053540
-0.3582798511 -0.0034860363 0.0543327450
-0.3881272538 0.0244333609 0.0752248274
-0.3999171661 0.0289944338 0.0748611319
-0.3732035525 0.0104736623 0.0647787862
-0.3402223608 -0.0268443606 0.0330769670
-0.3284324485 -0.0314054335 0.0334406625
-0.3610410182 -0.0106041255 0.0433411605
-0.4234969907 0.0381165797 0.0741337409
-0.3999171661 0.0289944338 0.0748611319
-0.4089459113 0.0406735960 0.0854890209
-0.4026783332 0.0218763446 0.0638695474
-0.4443156482 0.0543568148 0.0843979343
-0.4311451523 0.0533547865 0.0902574221
-0.4415544811 0.0614749040 0.0953895188
-0.3818596757 0.0056361096 0.0536053540
-0.4271427411 0.0353067675 0.0707904729
-0.4234969907 0.0381165797 0.0741337409
-0.4461385234 0.0529519087 0.0827263004
-0.3855054261 0.0028262973 0.0502620860
-0.3402223608 -0.0268443606 0.0330769670
-0.4271427411 0.0353067675 0.0707904729
-0.3855054261 0.0028262973 0.0502620860
-0.4289656163 0.0339018613 0.0691188390
-0.4506957114 0.0494396434 0.0785472155
-0.4629879632 0.0449563226 0.0757350457
-0.4521229156 0.0371874316 0.0710208575
-0.4195277730 0.0138807586 0.0568782928
-0.4072355212 0.0183640793 0.0596904625
-0.4365389464 0.0194079892 0.0601863962
-0.3760675828 -0.0171948055 0.0380215398
-0.3420452360 -0.0282492667 0.0314053331
-0.3637753311 -0.0127114847 0.0408337095
-0.3373263143 -0.0382598181 0.0252850600
-0.4148088514 0.0038702072 0.0507580197
-0.3954382171 -0.0066622991 0.0443897797
-0.4195277730 0.0138807586 0.0568782928
-0.3760675828 -0.0171948055 0.0380215398
-0.4148088514 0.0038702072 0.0507580197
-0.4322730475 0.0013755882 0.0498039689
-0.3954382171 -0.0066622991 0.0443897797
-0.3547905105 -0.0407544371 0.0243310092
-0.3373263143 -0.0382598181 0.0252850600
-0.3828932428 -0.0314692403 0.0302222237
-0.3547905105 -0.0407544371 0.0243310092
-0.3828932428 -0.0314692403 0.0302222237
-0.3342906724 -0.0555726452 0.0144251702
-0.3342906724 -0.0555726452 0.0144251702
-0.2872862069 -0.0193435769 0.0144163191
-0.2963924135 0.0042562477 0.0243196376
-0.2872862069 -0.0193435769 0.0144163191
-0.2982132916 0.0337982214 0.0302057470
-0.3137542245 0.0308338036 0.0380094899
-0.2963924135 0.0042562477 0.0243196376
-0.2982132916 0.0337982214 0.0302057470
-0.3032524409 -0.0119969481 0.0252784543
-0.3242560081 0.0736645552 0.0507405255
-0.3190051163 0.0522491794 0.0443750077
-0.3173959807 0.0899177510 0.0497817087
-0.3307088885 0.0450612637 0.0502514818
-0.3137542245 0.0308338036 0.0380094899
-0.3242560081 0.0736645552 0.0507405255
-0.3327333401 0.0807782853 0.0568615215
-0.3190051163 0.0522491794 0.0443750077
-0.3117297729 -0.0048832180 0.0313994503
-0.3032524409 -0.0119969481 0.0252784543
-0.3212193307 0.0200890229 0.0408254661
-0.3496880041 0.0950057455 0.0691035134
-0.3327333401 0.0807782853 0.0568615215
-0.3337455659 0.0986367961 0.0601665413
-0.3401984463 0.0700335046 0.0596774976
-0.3591775619 0.1199779863 0.0785295291
-0.3469676768 0.1182366466 0.0710005451
-0.3517124557 0.1307227670 0.0757135530
-0.3307088885 0.0450612637 0.0502514818
-0.3533326726 0.0921962567 0.0724481819
-0.3496880041 0.0950057455 0.0691035134
-0.3609998961 0.1185732419 0.0802018634
-0.3343535570 0.0422517750 0.0535961504
-0.3117297729 -0.0048832180 0.0313994503
-0.3533326726 0.0921962567 0.0724481819
-0.3343535570 0.0422517750 0.0535961504
-0.3551550068 0.0907915123 0.0741205162
-0.3655557318 0.1150613810 0.0843826992
-0.3731395641 0.1142060385 0.0953762544
-0.3679392016 0.1020711042 0.0902451629
-0.3523381142 0.0656663012 0.0748518886
-0.3447542819 0.0665216436 0.0638583333
-0.3613303928 0.0773735643 0.0854797577
-0.3315366644 0.0171265639 0.0543275227
-0.3135521072 -0.0062879624 0.0330717846
-0.3239528321 0.0179819063 0.0433339675
-0.3121436609 -0.0188505679 0.0334374708
-0.3509296679 0.0531036956 0.0752175747
-0.3412331662 0.0351151297 0.0647725487
-0.3523381142 0.0656663012 0.0748518886
-0.3315366644 0.0171265639 0.0543275227
-0.3509296679 0.0531036956 0.0752175747
-0.3607085140 0.0565311265 0.0895269767
-0.3412331662 0.0351151297 0.0647725487
-0.3219225070 -0.0154231371 0.0477468727
-0.3121436609 -0.0188505679 0.0334374708
-0.3365084318 0.0042791443 0.0653465997
-0.3219225070 -0.0154231371 0.0477468727
-0.3365084318 0.0042791443 0.0653465997
-0.3128184721 -0.0390246004 0.0378458789
-0.3128184721 -0.0390246004 0.0378458789
-0.2983020513 -0.0278318510 -0.0185985179
-0.3038872223 -0.0015174637 -0.0223792779
-0.2983020513 -0.0278318510 -0.0185985179
-0.3103565293 0.0244430171 -0.0363394464
-0.3122924681 0.0319646639 -0.0204999527
-0.3038872223 -0.0015174637 -0.0223792779
-0.3103565293 0.0244430171 -0.0363394464
-0.3016205383 -0.0107368808 -0.0074794468
-0.3229643978 0.0746662086 -0.0335204586
-0.3176284329 0.0533154362 -0.0270102057
-0.3252310819 0.0838856256 -0.0484202897
-0.3174308619 0.0552998968 -0.0122048136
-0.3122924681 0.0319646639 -0.0204999527
-0.3229643978 0.0746662086 -0.0335204586
-0.3255335948 0.0863338250 -0.0293728891
-0.3176284329 0.0533154362 -0.0270102057
-0.3041897352 0.0009307357 -0.0033318772
-0.3016205383 -0.0107368808 -0.0074794468
-0.3108102986 0.0281153162 -0.0077683454
-0.3306719886 0.1096690579 -0.0210777500
-0.3255335948 0.0863338250 -0.0293728891
-0.3295849612 0.1018507891 -0.0379569268
-0.3240514253 0.0824844774 -0.0166412818
-0.3372925520 0.1368536385 -0.0255142182
-0.3354644398 0.1271106959 -0.0360275914
-0.3387747215 0.1407029862 -0.0382458255
-0.3160376026 0.0563733683 -0.0067947161
-0.3174308619 0.0552998968 -0.0122048136
-0.3299753590 0.1102057937 -0.0183727013
-0.3034931055 0.0014674714 -0.0006268285
-0.3299753590 0.1102057937 -0.0183727013
-0.3355509778 0.1381954778 -0.0187515963
-0.3285820996 0.1112792651 -0.0129626038
-0.3160376026 0.0563733683 -0.0067947161
-0.3285820996 0.1112792651 -0.0129626038
-0.3348543482 0.1387322136 -0.0160465476
-0.3305840555 0.1470136183 -0.0064395247
-0.3274479312 0.1332871441 -0.0048975528
-0.3180395584 0.0921077215 -0.0002716370
-0.3223098511 0.0838263167 -0.0098786599
-0.3190405363 0.1099748981 0.0029899025
-0.3054950613 0.0372018246 0.0058962506
-0.3034931055 0.0014674714 -0.0006268285
-0.3097653541 0.0289204198 -0.0037107723
-0.2982218349 -0.0081183004 0.0057186549
-0.3127682878 0.0825219496 0.0060738463
-0.3091316746 0.0598618871 0.0059850485
-0.3180395584 0.0921077215 -0.0002716370
-0.3054950613 0.0372018246 0.0058962506
-0.3127682878 0.0825219496 0.0060738463
-0.3086748537 0.0966419689 0.0158720097
-0.3091316746 0.0598618871 0.0059850485
-0.2941284008 0.0060017188 0.0155168183
-0.2982218349 -0.0081183004 0.0057186549
-0.2957182970 0.0357217910 0.0205046979
-0.2941284008 0.0060017188 0.0155168183
-0.2957182970 0.0357217910 0.0205046979
-0.2885422541 -0.0203124027 0.0193013676
-0.2885422541 -0.0203124027 0.0193013676
0.3012199321 -0.0263748122 0.0045683296
0.3006862366 -0.0244171268 0.0010531944
0.4000762706 0.0013851638 0.0024417670
0.2018298982 -0.0521771028 0.0031797570
0.4000762706 0.0013851638 0.0024417670
0.4500381353 0.0133074665 0.0048936208
0.4006099661 -0.0005725215 0.0059569021
0.2998331806 -0.0212843631 0.0010531809
0.2987667942 -0.0173681648 0.0010531640
0.3983165084 0.0078465867 0.0006841758
0.2002834664 -0.0464991146 0.0014221692
0.3983165084 0.0078465867 0.0006841758
0.4486245587 0.0184958633 0.0004996901
0.3993828948 0.0039303884 0.0006841927
0.2983407211 -0.0158016470 0.0038649554
0.2978081629 -0.0138436216 0.0073800737
0.3970377205 0.0125459701 0.0056051813
0.1991111635 -0.0421912387 0.0056398479
0.3970377205 0.0125459701 0.0056051813
0.4469187784 0.0247617533 0.0029601759
0.3975702787 0.0105879447 0.0020900630
0.2982351458 -0.0154098674 0.0101918786
0.2987688412 -0.0173675528 0.0137065085
0.3975186283 0.0107841745 0.0122832727
0.1994853587 -0.0435615948 0.0116151144
0.3975186283 0.0107841745 0.0122832727
0.4466266741 0.0258388809 0.0098143399
0.3969849329 0.0127418599 0.0087686429
0.2996218972 -0.0205003165 0.0137065220
0.3006882836 -0.0244165148 0.0137065389
0.3992783904 0.0043227517 0.0140406113
0.2010317905 -0.0492395829 0.0133724496
0.3992783904 0.0043227517 0.0140406113
0.4480402505 0.0206504841 0.0142076391
0.3982120040 0.0082389500 0.0140405944
0.3011143567 -0.0259830326 0.0108947475
0.3016469150 -0.0279410580 0.0073801345
0.4005571784 -0.0003766318 0.0091201111
0.2022040934 -0.0535474588 0.0091547709
0.4005571784 -0.0003766318 0.0091201111
0.4497460309 0.0143845940 0.0117474059
0.4000246201 0.0015813936 0.0126347241
-0.0557306035 -0.1223952343 0.0051930783
-0.0561575864 -0.1208289885 0.0023812734
0.0233546303 -0.1001873139 0.0034921314
-0.0568400578 -0.1183226801 0.0023812626
-0.0576931138 -0.1151899165 0.0023812490
0.0219468472 -0.0950182731 0.0020862100
-0.0580339192 -0.1139368972 0.0046306822
-0.0584599923 -0.1123703794 0.0074424736
0.0209238434 -0.0912588638 0.0060227112
-0.0581184591 -0.1136231811 0.0096919176
-0.0576914763 -0.1151894269 0.0125037225
0.0213085563 -0.0926682516 0.0113651339
-0.0570090049 -0.1176957353 0.0125037333
-0.0561559489 -0.1208284989 0.0125037469
0.0227163394 -0.0978372923 0.0127710553
-0.0558150107 -0.1220820057 0.0102543137
-0.0553889376 -0.1236485235 0.0074425223
0.0237394096 -0.1015969454 0.0088345540
-0.2565813271 -0.1099175720 0.0052249670
-0.2545241000 -0.1083320559 0.0052245576
-0.2545241000 -0.1083320559 0.0052245576
-0.2545233722 -0.1083318384 0.0097234347
-0.2545233722 -0.1083318384 0.0097234347
-0.2565805993 -0.1099173544 0.0097238441
0.2519518980 -0.0408422033 0.0066858482
0.2024703725 -0.0545264715 0.0073974644
0.4008234575 -0.0013556445 0.0073628046
0.3509149491 -0.0134736668 0.0052626158
0.1525618641 -0.0666444939 0.0052972757
0.2515249151 -0.0392759575 0.0038740433
0.1275008641 -0.0723119436 0.0035442301
0.1521348812 -0.0650782481 0.0024854707
0.2509113795 -0.0370245025 0.0012376886
0.2015630504 -0.0511982601 0.0014221895
0.3998094228 0.0023640065 0.0006841994
0.3496080377 -0.0086769874 0.0008686868
0.1513616653 -0.0622392540 0.0016066768
0.2500583235 -0.0338917389 0.0012376750
0.1260477087 -0.0669765601 0.0016989171
0.1505086093 -0.0591064904 0.0016066633
0.2491520154 -0.0305629607 0.0019406102
0.1997502732 -0.0445410155 0.0014221607
0.3977833152 0.0098046858 0.0006841673
0.3479554999 -0.0026068511 0.0029775092
0.1499224578 -0.0569525524 0.0037155027
0.2487259423 -0.0289964429 0.0047524017
0.1249020319 -0.0627666914 0.0055651215
0.1494963847 -0.0553860346 0.0065272941
0.2484332694 -0.0279194853 0.0080916916
0.1988448844 -0.0412122260 0.0073974070
0.3967714414 0.0135249829 0.0073627404
0.3476100393 -0.0013340037 0.0094802607
0.1496834823 -0.0560712126 0.0095149274
0.2488602523 -0.0294857311 0.0109034965
0.1252095270 -0.0638922674 0.0112766388
0.1501104652 -0.0576374584 0.0123267323
0.2494737878 -0.0317371861 0.0135394723
0.1997522064 -0.0445404375 0.0133724293
0.3977854760 0.0098053318 0.0140405877
0.3489169506 -0.0061306832 0.0138735582
0.1508836811 -0.0604764525 0.0132053999
0.2503268438 -0.0348699497 0.0135394858
0.1266626824 -0.0692276510 0.0131218886
0.1517367371 -0.0636092162 0.0132054134
0.2512331519 -0.0381987279 0.0128365506
0.2015649837 -0.0511976821 0.0133724581
0.3998115836 0.0023646525 0.0140406198
0.3505694884 -0.0122008195 0.0117647358
0.1523228885 -0.0657631541 0.0110965741
0.2516592250 -0.0397652457 0.0100247592
0.1278083593 -0.0734375196 0.0092556842
0.1527489617 -0.0673296719 0.0082847826
-0.1349011544 -0.1442901982 0.0063316643
0.0237816132 -0.1017535597 0.0063039364
-0.1349011544 -0.1442901982 0.0063316643
-0.1746572627 -0.1546110355 0.0057762353
-0.1357975474 -0.1410006319 0.0026763124
0.0227999032 -0.0981510367 0.0020862235
-0.1357975474 -0.1410006319 0.0026763124
-0.1756175279 -0.1510864536 0.0028238320
-0.1370769495 -0.1363014320 0.0038010114
0.0213499165 -0.0928253817 0.0032109198
-0.1370769495 -0.1363014320 0.0038010114
-0.1767688673 -0.1468571898 0.0045108926
-0.1374600249 -0.1348915547 0.0085810623
0.0208815734 -0.0911020058 0.0085533289
-0.1374600249 -0.1348915547 0.0085810623
-0.1769600411 -0.1461521423 0.0091503566
-0.1365637645 -0.1381806335 0.0122364141
0.0218632834 -0.0947045287 0.0127710418
-0.1365637645 -0.1381806335 0.0122364141
-0.1759999087 -0.1496762368 0.0121027599
-0.1352842961 -0.1428800771 0.0111117151
0.0233133365 -0.1000304275 0.0116463455
-0.1352842961 -0.1428800771 0.0111117151
-0.1748484697 -0.1539058662 0.0104156992
-0.3145892841 -0.0521141136 0.0017164286
-0.3145892841 -0.0521141136 0.0017164286
-0.3379283985 -0.0316238842 -0.0049692288
-0.3379283985 -0.0316238842 -0.0049692288
-0.3143568610 -0.0396518217 0.0007186483
-0.3423889637 -0.0135139436 -0.0070696423
-0.3612180001 -0.0052577766 -0.0117269259
-0.3517329979 -0.0048013176 -0.0096657391
-0.3158598280 -0.0322799920 -0.0001707310
-0.3532359650 0.0025705122 -0.0105551185
-0.3663374167 0.0297127126 -0.0153746637
-0.3360508635 -0.0074829101 -0.0062523041
-0.3548899998 0.0183562488 -0.0123341463
-0.3616057697 0.0333599823 -0.0153756056
-0.3386939009 0.0137793900 -0.0105580131
-0.3145079288 -0.0312379149 -0.0001710001
-0.3319477507 0.0104488836 -0.0096696774
-0.3290909634 0.0195045690 -0.0117333209
-0.3259012576 -0.0008054426 -0.0070729242
-0.3077617786 -0.0345684213 0.0007173355
-0.3095230908 -0.0097305670 -0.0049748829
-0.3095230908 -0.0097305670 -0.0049748829
-0.2956507278 -0.0375170628 0.0017126589
-0.2956507278 -0.0375170628 0.0017126589
-0.3043361575 -0.0442127204 0.0207147672
-0.3043361575 -0.0442127204 0.0207147672
-0.3251606885 -0.0217856249 0.0292366233
-0.3251606885 -0.0217856249 0.0292366233
-0.3140458910 -0.0394128663 0.0144662842
-0.3400006020 -0.0116751362 0.0237733894
-0.3502943238 0.0031583281 0.0346544050
-0.3486521724 -0.0024292262 0.0268757578
-0.3200916155 -0.0355420952 0.0120450885
-0.3546978969 0.0014415449 0.0244545621
-0.3784637785 0.0203643828 0.0215039413
-0.3681414795 0.0081409335 0.0166562369
-0.3447926143 -0.0142216577 0.0128726958
-0.3808300124 0.0185406139 0.0163310572
-0.3619716230 -0.0041636962 0.0085557328
-0.3207676823 -0.0360631720 0.0105671216
-0.3585486613 -0.0100554727 0.0052444642
-0.3663637023 -0.0092248538 -0.0004701190
-0.3482476762 -0.0180303416 0.0057473114
-0.3173447206 -0.0419549485 0.0072558530
-0.3393682672 -0.0327341513 -0.0018188691
-0.3393682672 -0.0327341513 -0.0018188691
-0.3138087192 -0.0515124911 0.0000089837
-0.3138087192 -0.0515124911 0.0000089837
-0.2964318451 -0.0381188503 0.0000055248
-0.2964318451 -0.0381188503 0.0000055248
-0.3080820701 -0.0086204826 -0.0018250967
-0.3080820701 -0.0086204826 -0.0018250967
-0.3047721805 -0.0322642411 0.0072533504
-0.3200389417 0.0037117854 0.0057416964
-0.3239418415 0.0234716273 -0.0004785632
-0.3251278621 0.0157037942 0.0052378118
-0.3095970435 -0.0274530313 0.0105651507
-0.3299527251 0.0205150040 0.0085496120
-0.3471038029 0.0445350373 0.0163252281
-0.3409541157 0.0290954231 0.0181294320
-0.3259514120 0.0003001957 0.0158254010
-0.3494692162 0.0427115365 0.0214986120
-0.3372216832 0.0149117221 0.0244514119
-0.3102728759 -0.0279740315 0.0120432603
-0.3350175508 0.0080803717 0.0268733470
-0.3400006075 0.0110926857 0.0346527096
-0.3282803489 -0.0026410667 0.0237713091
-0.3080687434 -0.0348053819 0.0144651954
-0.3222805304 -0.0195654725 0.0292362773
-0.3222805304 -0.0195654725 0.0292362773
-0.3058981944 -0.0454167507 0.0207151792
-0.3058981944 -0.0454167507 0.0207151792
-0.3176294568 -0.0577303613 -0.0073219941
-0.3176294568 -0.0577303613 -0.0073219941
-0.3420280147 -0.0458973052 -0.0239675978
-0.3420280147 -0.0458973052 -0.0239675978
-0.3185250438 -0.0437460983 -0.0133003127
-0.3528082806 -0.0237492942 -0.0350686019
-0.3722861763 -0.0229615650 -0.0445988241
-0.3715032628 -0.0027044452 -0.0485874798
-0.3486477716 -0.0160356480 -0.0340752870
-0.3185250438 -0.0437460983 -0.0133003127
-0.3408536444 -0.0155116255 -0.0299505814
-0.3715032628 -0.0027044452 -0.0485874798
-0.3865646267 0.0111507799 -0.0589749670
-0.4010991000 0.0399092752 -0.0715005300
-0.3943587539 0.0106267575 -0.0630996726
-0.3743217553 0.0300930622 -0.0560607177
-0.4010991000 0.0399092752 -0.0715005300
-0.3732066276 0.0241283164 -0.0542823304
-0.3581452637 0.0102730912 -0.0438948432
-0.3408536444 -0.0155116255 -0.0299505814
-0.3118460443 -0.0372573301 -0.0109539944
-0.3419687721 -0.0095468797 -0.0317289687
-0.3522872733 0.0122925973 -0.0413686807
-0.4044444830 0.0578035126 -0.0768356921
-0.3904982468 0.0499130332 -0.0682265922
-0.3743217553 0.0300930622 -0.0560607177
-0.3846402564 0.0519325393 -0.0657004297
-0.4008167480 0.0717525103 -0.0778663042
-0.4044444830 0.0578035126 -0.0768356921
-0.4169932396 0.0915724812 -0.0900321787
-0.4125327288 0.0677134980 -0.0829186293
-0.4066519247 0.0833990028 -0.0839496899
-0.3742989415 0.0437590609 -0.0596179409
-0.4113605668 0.0959137490 -0.0900332999
-0.4021457864 0.0868720170 -0.0839505869
-0.3419459583 0.0041191190 -0.0352861919
-0.3257694667 -0.0157008520 -0.0231203174
-0.3859692948 0.0670520461 -0.0717847124
-0.3742989415 0.0437590609 -0.0596179409
-0.3866064464 0.0876964937 -0.0829237900
-0.4085442303 0.0980843829 -0.0900338605
-0.3790814679 0.0773523814 -0.0768407406
-0.3934942733 0.0773961583 -0.0778677617
-0.3784443163 0.0567079338 -0.0657016630
-0.3599504458 0.0411698770 -0.0560635784
-0.3750004029 0.0618581015 -0.0682296771
-0.3790814679 0.0773523814 -0.0768407406
-0.3483444023 0.0153314848 -0.0413694655
-0.3298505318 -0.0002065721 -0.0317313809
-0.3107195097 -0.0363890765 -0.0109542187
-0.3243660858 -0.0028035444 -0.0299538633
-0.3449004888 0.0204816525 -0.0438974796
-0.3544659999 0.0385729047 -0.0542860608
-0.3626281300 0.0695614646 -0.0715081878
-0.3599504458 0.0411698770 -0.0560635784
-0.3360249349 0.0555879174 -0.0631105262
-0.3626281300 0.0695614646 -0.0715081878
-0.3385156593 0.0481849316 -0.0589840259
-0.3289501482 0.0300936794 -0.0485954448
-0.3243660858 -0.0028035444 -0.0299538633
-0.3027443394 -0.0315830631 -0.0133032012
-0.3218753615 0.0045994414 -0.0340803635
-0.3289501482 0.0300936794 -0.0485954448
-0.3091603442 0.0256929678 -0.0446103788
-0.3133565195 0.0066582939 -0.0350758232
-0.3027443394 -0.0315830631 -0.0133032012
-0.2946813798 -0.0094046118 -0.0239762643
-0.2946813798 -0.0094046118 -0.0239762643
-0.2894474967 -0.0360091401 -0.0073276038
-0.2894474967 -0.0360091401 -0.0073276038
-0.3190395774 -0.0588190710 0.0198276264
-0.3190395774 -0.0588190710 0.0198276264
-0.3493541550 -0.0515474298 0.0261935628
-0.3493541550 -0.0515474298 0.0261935628
-0.3287232999 -0.0516080150 0.0105360151
-0.3712242076 -0.0379478634 0.0180256301
-0.3897004341 -0.0363896787 0.0292961748
-0.3990308883 -0.0239267315 0.0157133420
-0.3706969499 -0.0330334992 0.0107202653
-0.3287232999 -0.0516080150 0.0105360151
-0.3633498364 -0.0328530091 0.0058193138
-0.3990308883 -0.0239267315 0.0157133420
-0.4200177133 -0.0146394736 0.0158054672
-0.4472971363 0.0042960224 0.0061878143
-0.4273648268 -0.0148199638 0.0207064187
-0.4172170009 -0.0029725743 -0.0035138675
-0.4472971363 0.0042960224 0.0061878143
-0.4132524960 -0.0067412140 -0.0003413903
-0.3922656710 -0.0160284718 -0.0004335154
-0.3633498364 -0.0328530091 0.0058193138
-0.3253406912 -0.0476588851 0.0024625863
-0.3673143412 -0.0290843694 0.0026468366
-0.3877190158 -0.0150191412 -0.0052382937
-0.4591906508 0.0156019415 -0.0033296172
-0.4421683307 0.0100833233 -0.0065942195
-0.4172170009 -0.0029725743 -0.0035138675
-0.4376216754 0.0110926539 -0.0113989978
-0.4625730053 0.0241485515 -0.0144793498
-0.4591906508 0.0156019415 -0.0033296172
-0.4875243351 0.0372044490 -0.0175597019
-0.4716663157 0.0221298903 -0.0048697932
-0.4241024187 0.0053695625 -0.0139168107
-0.4500973403 0.0176206027 -0.0129391738
-0.3502920210 -0.0346029876 -0.0006177657
-0.3748954869 -0.0212788042 -0.0050507807
-0.4747008062 0.0309447860 -0.0173721888
-0.4866546753 0.0378751635 -0.0209413593
-0.4241024187 0.0053695625 -0.0139168107
-0.4733093505 0.0320179291 -0.0227828406
-0.4636600323 0.0283038877 -0.0360030213
-0.4849153556 0.0392165924 -0.0277046741
-0.4513582994 0.0216417960 -0.0337865138
-0.4603118897 0.0258924090 -0.0232716591
-0.4357084238 0.0125682257 -0.0188386441
-0.4127790292 0.0004497817 -0.0207713102
-0.4373824951 0.0137739650 -0.0252043252
-0.4513582994 0.0216417960 -0.0337865138
-0.3865014920 -0.0140801410 -0.0099726141
-0.3635720974 -0.0261985850 -0.0119052802
-0.3249928273 -0.0473905994 0.0011099234
-0.3582582666 -0.0289267612 -0.0139798670
-0.3881755633 -0.0128744017 -0.0163382952
-0.4074651984 -0.0022783945 -0.0228458970
-0.4354168069 0.0134572675 -0.0400102742
-0.4127790292 0.0004497817 -0.0207713102
-0.4093506073 -0.0009291903 -0.0493426243
-0.4354168069 0.0134572675 -0.0400102742
-0.4051795837 -0.0031977091 -0.0418934397
-0.3858899487 -0.0137937163 -0.0353858380
-0.3582582666 -0.0289267612 -0.0139798670
-0.3238500200 -0.0478502567 -0.0084138480
-0.3624292901 -0.0266582423 -0.0214290516
-0.3858899487 -0.0137937163 -0.0353858380
-0.3702063401 -0.0213583801 -0.0465071177
-0.3590410078 -0.0285534676 -0.0293490276
-0.3238500200 -0.0478502567 -0.0084138480
-0.3347328537 -0.0402737570 -0.0306617867
-0.3347328537 -0.0402737570 -0.0306617867
-0.3103366449 -0.0521087618 -0.0140141614
-0.3103366449 -0.0521087618 -0.0140141614
-0.2990246963 -0.0433931857 0.0299115561
-0.2990246963 -0.0433931857 0.0299115561
-0.3138337195 -0.0241716184 0.0504932380
-0.3138337195 -0.0241716184 0.0504932380
-0.3139191197 -0.0401991189 0.0301484308
-0.3369202305 -0.0115105510 0.0565482067
-0.3394189760 0.0023620680 0.0730447200
-0.3591005963 0.0068459903 0.0686403638
-0.3437665224 -0.0122797216 0.0510405132
-0.3139191197 -0.0401991189 0.0301484308
-0.3433561498 -0.0174457349 0.0438867038
-0.3591005963 0.0068459903 0.0686403638
-0.3740242976 0.0208056889 0.0790864051
-0.4030509552 0.0383930595 0.0856708686
-0.3744346702 0.0259717022 0.0862402145
-0.3908884209 0.0173152717 0.0642332429
-0.4030509552 0.0383930595 0.0856708686
-0.3849934648 0.0150347352 0.0644150907
-0.3700697634 0.0010750366 0.0539690495
-0.3433561498 -0.0174457349 0.0438867038
-0.3194037033 -0.0430845957 0.0228127736
-0.3492511060 -0.0151651985 0.0437048560
-0.3714503470 -0.0024840080 0.0484732572
-0.4207358236 0.0452346689 0.0851253254
-0.4117070784 0.0335555068 0.0744974364
-0.3908884209 0.0173152717 0.0642332429
-0.4130876620 0.0299964622 0.0690016441
-0.4339063194 0.0462366973 0.0792658376
-0.4207358236 0.0452346689 0.0851253254
-0.4547249769 0.0624769323 0.0895300311
-0.4311451523 0.0533547865 0.0902574221
-0.4461385234 0.0529519087 0.0827263004
-0.4045012084 0.0204714385 0.0621979135
-0.4592821649 0.0589646670 0.0853509462
-0.4497842738 0.0501420964 0.0793830324
-0.3628638934 -0.0120090317 0.0416695265
-0.3420452360 -0.0282492667 0.0314053331
-0.4289656163 0.0339018613 0.0691188390
-0.4045012084 0.0204714385 0.0621979135
-0.4521229156 0.0371874316 0.0710208575
-0.4615607590 0.0572085344 0.0832614037
-0.4412578681 0.0294185406 0.0663066693
-0.4398306639 0.0416707524 0.0738330272
-0.4181005688 0.0261329703 0.0644046507
-0.4025165996 0.0083535279 0.0535701894
-0.4242466947 0.0238913100 0.0629985659
-0.4412578681 0.0294185406 0.0663066693
-0.3746403786 -0.0049425937 0.0455478978
-0.3590564094 -0.0227220361 0.0347134364
-0.3203151409 -0.0437870488 0.0219769566
-0.3566969486 -0.0277273118 0.0316532999
-0.3807865045 -0.0071842541 0.0441418129
-0.4001571387 0.0033482522 0.0505100528
-0.4341794856 0.0144027135 0.0571262596
-0.4025165996 0.0083535279 0.0535701894
-0.4216345113 -0.0104042276 0.0429587036
-0.4341794856 0.0144027135 0.0571262596
-0.4129024133 -0.0091569181 0.0434357290
-0.3935317790 -0.0196894245 0.0370674890
-0.3566969486 -0.0277273118 0.0316532999
-0.3266877781 -0.0500396339 0.0184397946
-0.3654290467 -0.0289746213 0.0311762745
-0.3935317790 -0.0196894245 0.0370674890
-0.3904961371 -0.0370022515 0.0262075992
-0.3688418766 -0.0361118387 0.0272766164
-0.3266877781 -0.0500396339 0.0184397946
-0.3521434857 -0.0536965524 0.0153634652
-0.3521434857 -0.0536965524 0.0153634652
-0.3218278877 -0.0609671302 0.0090014190
-0.3218278877 -0.0609671302 0.0090014190
-0.2852444049 -0.0327704375 0.0089941370
-0.2852444049 -0.0327704375 0.0089941370
-0.2845539817 -0.0016015156 0.0153507693
-0.2845539817 -0.0016015156 0.0153507693
-0.2945715354 -0.0252857260 0.0184335282
-0.2973028525 0.0190272345 0.0272626923
-0.2909279631 0.0397403705 0.0261885379
-0.3068941971 0.0470869993 0.0370506732
-0.3050733190 0.0175450256 0.0311645637
-0.2945715354 -0.0252857260 0.0184335282
-0.3085033327 0.0094184278 0.0316439721
-0.3068941971 0.0470869993 0.0370506732
-0.3121450889 0.0685023752 0.0434161909
-0.3295068999 0.0950799311 0.0571060433
-0.3087150751 0.0766289730 0.0429367826
-0.3317211143 0.0629197745 0.0535565016
-0.3295068999 0.0950799311 0.0571060433
-0.3274824483 0.0593629095 0.0504960037
-0.3222315565 0.0379475337 0.0441304859
-0.3085033327 0.0094184278 0.0316439721
-0.3022402151 -0.0298554589 0.0219734345
-0.3127419987 0.0129752928 0.0347044701
-0.3259641096 0.0325751433 0.0455384739
-0.3422228979 0.1057505262 0.0662875372
-0.3412106721 0.0878920154 0.0629825174
-0.3317211143 0.0629197745 0.0535565016
-0.3449432252 0.0825196250 0.0643905055
-0.3544327830 0.1074918659 0.0738165212
-0.3422228979 0.1057505262 0.0662875372
-0.3639223408 0.1324641068 0.0832425370
-0.3469676768 0.1182366466 0.0710005451
-0.3609998961 0.1185732419 0.0802018634
-0.3420207805 0.0686287602 0.0613498319
-0.3684781764 0.1289522458 0.0874233727
-0.3646445646 0.1157637532 0.0835465320
-0.3230416650 0.0186842785 0.0424978004
-0.3135521072 -0.0062879624 0.0330717846
-0.3551550068 0.0907915123 0.0741205162
-0.3420207805 0.0686287602 0.0613498319
-0.3679392016 0.1020711042 0.0902451629
-0.3707560942 0.1271963153 0.0895137906
-0.3627388391 0.0899361699 0.0851140715
-0.3603553693 0.1029264466 0.0792516077
-0.3499546444 0.0786565780 0.0689894248
-0.3433458356 0.0539590381 0.0642240195
-0.3537465605 0.0782289067 0.0744862024
-0.3627388391 0.0899361699 0.0851140715
-0.3291531945 0.0301168406 0.0484650590
-0.3225443858 0.0054193007 0.0436996537
-0.3031513822 -0.0305578310 0.0228096017
-0.3218401626 -0.0008620020 0.0438824968
-0.3329451107 0.0296891694 0.0539618366
-0.3426416125 0.0476777353 0.0644068626
-0.3606261697 0.0710922615 0.0856626007
-0.3433458356 0.0539590381 0.0642240195
-0.3559014353 0.0402562761 0.0862366517
-0.3606261697 0.0710922615 0.0856626007
-0.3510120123 0.0385425606 0.0790819507
-0.3413155105 0.0205539947 0.0686369247
-0.3218401626 -0.0008620020 0.0438824968
-0.3073365821 -0.0351254184 0.0301471458
-0.3267295857 0.0008517134 0.0510371977
-0.3413155105 0.0205539947 0.0686369247
-0.3419903217 0.0003799623 0.0730453329
-0.3292154694 -0.0055719964 0.0565467362
-0.3073365821 -0.0351254184 0.0301471458
-0.3228523795 -0.0311230507 0.0504951090
-0.3228523795 -0.0311230507 0.0504951090
-0.3080408295 -0.0503423589 0.0299133002
-0.3080408295 -0.0503423589 0.0299133002
-0.2967429608 -0.0416315196 -0.0140168673
-0.2967429608 -0.0416315196 -0.0140168673
-0.3019787727 -0.0150285638 -0.0306683064
-0.3019787727 -0.0150285638 -0.0306683064
-0.2974179154 -0.0274779446 -0.0084191093
-0.3071218758 0.0114627767 -0.0293593621
-0.3112406652 0.0240891107 -0.0465188549
-0.3145591521 0.0411840809 -0.0353997838
-0.3080898452 0.0152236001 -0.0214396153
-0.2974179154 -0.0274779446 -0.0084191093
-0.3069565032 0.0106138915 -0.0139896997
-0.3145591521 0.0411840809 -0.0353997838
-0.3198951170 0.0625348533 -0.0419100368
-0.3283003627 0.0960169809 -0.0400307116
-0.3210284591 0.0671445618 -0.0493599523
-0.3214822283 0.0708168609 -0.0207888514
-0.3283003627 0.0960169809 -0.0400307116
-0.3201976299 0.0649830527 -0.0228626361
-0.3148616650 0.0436322803 -0.0163523832
-0.3069565032 0.0106138915 -0.0139896997
-0.2975691718 -0.0262538449 0.0011045910
-0.3082411016 0.0164476998 -0.0119159150
-0.3141205802 0.0417076065 -0.0099865795
-0.3321541581 0.1135184056 -0.0338093573
-0.3281027917 0.0980014415 -0.0252253196
-0.3214822283 0.0708168609 -0.0207888514
-0.3273617070 0.0960767676 -0.0188595159
-0.3339822703 0.1232613482 -0.0232959841
-0.3321541581 0.1135184056 -0.0338093573
-0.3406028337 0.1504459288 -0.0277324523
-0.3354644398 0.1271106959 -0.0360275914
-0.3230064808 0.0832895810 -0.0125837087
-0.3306719886 0.1096690579 -0.0210777500
-0.3041897352 0.0009307357 -0.0033318772
-0.3104619837 0.0283836841 -0.0064158210
-0.3369442372 0.1371220064 -0.0241616938
-0.3397320466 0.1511168484 -0.0243511414
-0.3230064808 0.0832895810 -0.0125837087
-0.3355509778 0.1381954778 -0.0187515963
-0.3274479312 0.1332871441 -0.0048975528
-0.3379904724 0.1524586878 -0.0175885195
-0.3243118069 0.1195606699 -0.0033555808
-0.3317182239 0.1250057393 -0.0145045757
-0.3254459754 0.0975527909 -0.0114206318
-0.3170385805 0.0742405449 -0.0035331766
-0.3233108290 0.1016934933 -0.0066171204
-0.3243118069 0.1195606699 -0.0033555808
-0.3129014783 0.0426468940 -0.0052527442
-0.3044940834 0.0193346480 0.0026347111
-0.2972208570 -0.0259854770 0.0024571154
-0.3018584481 0.0145417621 0.0058074528
-0.3107663320 0.0467875964 -0.0004492327
-0.3144029452 0.0694476589 -0.0003604349
-0.3164049010 0.1051820121 0.0061626442
-0.3170385805 0.0742405449 -0.0035331766
-0.3029915234 0.0810419160 0.0206822936
-0.3164049010 0.1051820121 0.0061626442
-0.3050382405 0.0739819064 0.0157832119
-0.3014016272 0.0513218439 0.0156944140
-0.3018584481 0.0145417621 0.0058074528
-0.2925385046 -0.0237183533 0.0105289387
-0.2998117311 0.0216017717 0.0107065345
-0.3014016272 0.0513218439 0.0156944140
-0.2917220465 0.0391277416 0.0292771267
-0.2949233489 0.0208617549 0.0180107581
-0.2925385046 -0.0237183533 0.0105289387
-0.2873390770 -0.0037493913 0.0261815218
-0.2873390770 -0.0037493913 0.0261815218
-0.2880287248 -0.0349173166 0.0198215041
-0.2880287248 -0.0349173166 0.0198215041
0.3506481013 -0.0124948242 0.0035050483
0.3998094228 0.0023640065 0.0006841994
0.2015630504 -0.0511982601 0.0014221895
0.2512580674 -0.0382971148 0.0021164757
0.4495044398 0.0152651518 0.0013784857
0.4744853722 0.0212263032 0.0026044126
0.3506481013 -0.0124948242 0.0035050483
0.4500381353 0.0133074665 0.0048936208
0.3490748445 -0.0067188882 0.0008686783
0.3977833152 0.0098046858 0.0006841673
0.1997502732 -0.0445410155 0.0014221607
0.2495251303 -0.0319336397 0.0012376666
0.4475581724 0.0224120616 0.0004996732
0.4727121975 0.0277366999 0.0004074303
0.3490748445 -0.0067188882 0.0008686783
0.4486245587 0.0184958633 0.0004996901
0.3476892208 -0.0016278384 0.0047350684
0.3967714414 0.0135249829 0.0073627404
0.1988448844 -0.0412122260 0.0073974070
0.2484596632 -0.0280174302 0.0065099608
0.4463862202 0.0267197787 0.0064752942
0.4713267492 0.0328276703 0.0051527915
0.3476892208 -0.0016278384 0.0047350684
0.4469187784 0.0247617533 0.0029601759
0.3478768870 -0.0023128464 0.0112375757
0.3977854760 0.0098053318 0.0140405877
0.1997522064 -0.0445404375 0.0133724293
0.2491271000 -0.0304645738 0.0126608115
0.4471603695 0.0238811955 0.0133289698
0.4717143924 0.0314085487 0.0120945034
0.3478768870 -0.0023128464 0.0112375757
0.4466266741 0.0258388809 0.0098143399
0.3494501438 -0.0080887824 0.0138735667
0.3998115836 0.0023646525 0.0140406198
0.2015649837 -0.0511976821 0.0133724581
0.2508600370 -0.0368280489 0.0135394943
0.4491066369 0.0167342858 0.0142076560
0.4734875670 0.0248981520 0.0142911698
0.3494501438 -0.0080887824 0.0138735667
0.4480402505 0.0206504841 0.0142076391
0.3508357676 -0.0131798322 0.0100074293
0.4008234575 -0.0013556445 0.0073628046
0.2024703725 -0.0545264715 0.0073974644
0.2519255042 -0.0407442584 0.0082674527
0.4502785892 0.0124265687 0.0082327929
0.4748730155 0.0198071816 0.0095464403
0.3508357676 -0.0131798322 0.0100074293
0.4497460309 0.0143845940 0.0117474059
0.0233546303 -0.1001873139 0.0034921314
-0.1352428203 -0.1430369090 0.0040822203
0.0633242302 -0.0906495995 0.0054534629
0.0237816132 -0.1017535597 0.0063039364
0.0219468472 -0.0950182731 0.0020862100
-0.1364800188 -0.1384943235 0.0026763016
0.0621933557 -0.0864988332 0.0019386972
0.0227999032 -0.0981510367 0.0020862235
0.0209238434 -0.0912588638 0.0060227112
-0.1374177549 -0.1350484128 0.0060504446
0.0608287978 -0.0814863650 0.0039069343
0.0213499165 -0.0928253817 0.0032109198
0.0213085563 -0.0926682516 0.0113651339
-0.1371184917 -0.1361443563 0.0108305062
0.0605950811 -0.0806245410 0.0093899371
0.0208815734 -0.0911020058 0.0085533289
0.0227163394 -0.0978372923 0.0127710553
-0.1358812932 -0.1406869419 0.0122364249
0.0617259555 -0.0847753072 0.0129047027
0.0218632834 -0.0947045287 0.0127710418
0.0237394096 -0.1015969454 0.0088345540
-0.1349433579 -0.1441335838 0.0088622820
0.0630905467 -0.0897878974 0.0109364656
0.0233133365 -0.1000304275 0.0116463455
-0.2380662147 -0.1371305747 0.0063480073
-0.2576098206 -0.1107102877 0.0074746104
-0.2360091077 -0.1355451010 0.0040981592
-0.2565813271 -0.1099175720 0.0052249670
-0.2534954990 -0.1075387680 0.0074737914
-0.2329232795 -0.1331662970 0.0063469836
-0.2329229156 -0.1331661882 0.0085964221
-0.2534954990 -0.1075387680 0.0074737914
-0.2565805993 -0.1099173544 0.0097238441
-0.2360080160 -0.1355447746 0.0108464749
-0.2576098206 -0.1107102877 0.0074746104
-0.2380658508 -0.1371304659 0.0085974459
3 351 817 353
3 352 817 351
3 353 818 39
3 352 818 353
3 354 819 352
3 143 819 354
3 352 820 354
3 351 820 352
3 356 821 355
3 39 821 356
3 356 822 351
3 355 822 356
3 39 823 357
3 12 823 39
3 357 824 355
3 12 824 357
3 358 825 360
3 359 825 358
3 360 826 12
3 359 826 360
3 361 827 359
3 236 827 361
3 359 828 361
3 358 828 359
3 363 829 362
3 12 829 363
3 363 830 358
3 362 830 363
3 12 831 364
3 301 831 12
3 364 832 362
3 301 832 364
3 365 833 367
3 366 833 365
3 367 834 301
3 366 834 367
3 368 835 366
3 284 835 368
3 366 836 368
3 365 836 366
3 370 837 369
3 301 837 370
3 370 838 365
3 369 838 370
3 301 839 371
3 272 839 301
3 371 840 369
3 272 840 371
3 372 841 374
3 373 841 372
3 374 842 272
3 373 842 374
3 375 843 373
3 17 843 375
3 373 844 375
3 372 844 373
3 377 845 376
3 272 845 377
3 377 846 372
3 376 846 377
3 272 847 378
3 300 847 272
3 378 848 376
3 300 848 378
3 379 849 381
3 380 849 379
3 381 850 300
3 380 850 381
3 382 851 380
3 285 851 382
3 380 852 382
3 379 852 380
3 384 853 383
3 300 853 384
3 384 854 379
3 383 854 384
3 300 855 385
3 11 855 300
3 385 856 383
3 11 856 385
3 386 857 388
3 387 857 386
3 388 858 11
3 387 858 388
3 389 859 387
3 237 859 389
3 387 860 389
3 386 860 387
3 391 861 390
3 11 861 391
3 391 862 386
3 390 862 391
3 11 863 392
3 39 863 11
3 392 864 390
3 39 864 392
3 143 236 284
3 11 300 272
3 394 865 393
3 66 865 394
3 394 866 39
3 393 866 394
3 395 867 66
3 393 867 395
3 298 868 66
3 395 868 298
3 397 869 396
3 298 869 397
3 397 870 12
3 396 870 397
3 398 871 298
3 396 871 398
3 225 872 298
3 398 872 225
3 400 873 399
3 225 873 400
3 400 874 301
3 399 874 400
3 401 875 225
3 399 875 401
3 255 876 225
3 401 876 255
3 403 877 402
3 255 877 403
3 403 878 272
3 402 878 403
3 404 879 255
3 402 879 404
3 224 880 255
3 404 880 224
3 406 881 405
3 224 881 406
3 406 882 300
3 405 882 406
3 407 883 224
3 405 883 407
3 297 884 224
3 407 884 297
3 409 885 408
3 297 885 409
3 409 886 11
3 408 886 409
3 410 887 297
3 408 887 410
3 66 888 297
3 410 888 66
3 39 12 301
3 297 224 255
3 176 168 187
3 168 57 187
3 57 124 187
3 124 279 187
3 279 144 187
3 144 151 187
3 151 44 187
3 44 230 187
3 230 210 187
3 210 73 187
3 73 339 187
3 339 181 187
3 61 183 166
3 183 125 166
3 125 200 166
3 200 5 166
3 5 19 166
3 19 302 166
3 302 303 166
3 303 147 166
3 147 280 166
3 280 123 166
3 123 53 166
3 53 166 166
3 58 182 182
3 182 122 182
3 122 74 182
3 74 218 182
3 218 101 182
3 101 250 182
3 250 252 182
3 252 232 182
3 232 3 182
3 3 345 182
3 345 263 182
3 263 188 182
3 169 171 186
3 171 262 186
3 262 199 186
3 199 291 186
3 291 114 186
3 114 81 186
3 81 287 186
3 287 265 186
3 265 104 186
3 104 8 186
3 8 76 186
3 76 180 186
3 178 168 173
3 168 258 173
3 258 346 173
3 346 213 173
3 213 156 173
3 156 190 173
3 190 67 173
3 67 46 173
3 46 93 173
3 93 75 173
3 75 118 173
3 118 186 173
3 56 181 170
3 181 202 170
3 202 137 170
3 137 18 170
3 18 115 170
3 115 131 170
3 131 266 170
3 266 45 170
3 45 211 170
3 211 341 170
3 341 63 170
3 63 171 170
3 257 180 179
3 180 72 179
3 72 219 179
3 219 153 179
3 153 204 179
3 204 222 179
3 222 223 179
3 223 267 179
3 267 20 179
3 20 278 179
3 278 120 179
3 120 168 179
3 51 186 175
3 186 348 175
3 348 6 175
3 6 304 175
3 304 203 175
3 203 296 175
3 296 295 175
3 295 80 175
3 80 152 175
3 152 212 175
3 212 77 175
3 77 181 175
3 326 187 187
3 324 187 187
3 330 187 187
3 195 187 187
3 331 187 187
3 325 187 187
3 326 324 330
3 187 187 187
3 37 33 31
3 33 242 31
3 242 315 31
3 315 259 31
3 259 281 31
3 281 90 31
3 90 87 31
3 87 4 31
3 4 342 31
3 342 59 31
3 59 311 31
3 311 26 31
3 239 29 32
3 29 107 32
3 107 177 32
3 177 121 32
3 121 277 32
3 277 215 32
3 215 216 32
3 216 276 32
3 276 260 32
3 260 313 32
3 313 240 32
3 240 32 32
3 245 28 28
3 28 314 28
3 314 62 28
3 62 197 28
3 197 7 28
3 7 292 28
3 292 293 28
3 293 138 28
3 138 119 28
3 119 185 28
3 185 110 28
3 110 32 28
3 27 35 30
3 35 108 30
3 108 184 30
3 184 78 30
3 78 145 30
3 145 43 30
3 43 251 30
3 251 103 30
3 103 2 30
3 2 344 30
3 344 52 30
3 52 25 30
3 38 34 36
3 34 106 36
3 106 174 36
3 174 343 36
3 343 214 36
3 214 231 36
3 231 229 36
3 229 89 36
3 89 198 36
3 198 55 36
3 55 309 36
3 309 30 36
3 244 28 35
3 28 167 35
3 167 264 35
3 264 275 35
3 275 146 35
3 146 305 35
3 305 306 35
3 306 88 35
3 88 340 35
3 340 312 35
3 312 243 35
3 243 35 35
3 109 25 25
3 25 60 25
3 60 201 25
3 201 92 25
3 92 155 25
3 155 189 25
3 189 318 25
3 318 102 25
3 102 139 25
3 139 261 25
3 261 310 25
3 310 33 25
3 241 30 246
3 30 172 246
3 172 126 246
3 126 217 246
3 217 154 246
3 154 69 246
3 69 68 246
3 68 42 246
3 42 91 246
3 91 347 246
3 347 54 246
3 54 26 246
3 323 31 31
3 332 31 31
3 328 31 31
3 327 31 31
3 329 31 31
3 333 31 31
3 323 332 328
3 31 31 31
3 86 209 159
3 209 14 159
3 14 889 159
3 82 889 14
3 411 890 82
3 159 890 411
3 82 891 411
3 13 891 82
3 412 892 13
3 413 892 412
3 413 893 159
3 412 893 413
3 13 894 412
3 414 894 13
3 414 895 290
3 13 895 414
3 415 896 290
3 416 896 415
3 416 897 159
3 415 897 416
3 417 898 290
3 415 898 417
3 290 899 417
3 95 899 290
3 418 900 95
3 159 900 418
3 270 901 95
3 418 901 270
3 64 902 270
3 420 902 64
3 420 903 419
3 64 903 420
3 421 904 419
3 159 904 421
3 419 905 421
3 64 905 419
3 423 906 10
3 64 906 423
3 10 907 423
3 422 907 10
3 424 908 422
3 159 908 424
3 422 909 424
3 10 909 422
3 136 910 10
3 425 910 136
3 425 911 159
3 136 911 425
3 322 912 136
3 159 912 322
3 322 247 159
3 100 94 47
3 94 337 47
3 337 913 47
3 97 913 337
3 426 914 97
3 47 914 426
3 97 915 426
3 335 915 97
3 427 916 335
3 428 916 427
3 428 917 47
3 427 917 428
3 335 918 427
3 429 918 335
3 429 919 316
3 335 919 429
3 430 920 316
3 431 920 430
3 431 921 47
3 430 921 431
3 432 922 316
3 430 922 432
3 316 923 432
3 21 923 316
3 21 924 433
3 286 924 21
3 433 925 47
3 286 925 433
3 99 926 286
3 435 926 99
3 435 927 434
3 99 927 435
3 436 928 434
3 47 928 436
3 434 929 436
3 99 929 434
3 438 930 228
3 99 930 438
3 228 931 438
3 437 931 228
3 439 932 437
3 47 932 439
3 437 933 439
3 228 933 437
3 116 934 228
3 440 934 116
3 440 935 47
3 116 935 440
3 112 936 116
3 47 936 112
3 112 79 47
3 227 50 162
3 50 235 162
3 235 937 162
3 221 937 235
3 441 938 221
3 162 938 441
3 221 939 441
3 271 939 221
3 442 940 271
3 443 940 442
3 443 941 162
3 442 941 443
3 271 942 442
3 444 942 271
3 444 943 40
3 271 943 444
3 445 944 40
3 446 944 445
3 446 945 162
3 445 945 446
3 447 946 40
3 445 946 447
3 40 947 447
3 83 947 40
3 83 948 448
3 320 948 83
3 448 949 162
3 320 949 448
3 15 950 320
3 450 950 15
3 450 951 449
3 15 951 450
3 451 952 449
3 162 952 451
3 449 953 451
3 15 953 449
3 453 954 41
3 15 954 453
3 41 955 453
3 452 955 41
3 454 956 452
3 162 956 454
3 452 957 454
3 41 957 452
3 254 958 41
3 455 958 254
3 455 959 162
3 254 959 455
3 141 960 254
3 162 960 141
3 141 24 162
3 149 336 158
3 336 961 158
3 22 961 336
3 456 962 22
3 158 962 456
3 22 963 456
3 1 963 22
3 457 964 1
3 458 964 457
3 458 965 158
3 457 965 458
3 1 966 457
3 459 966 1
3 459 967 234
3 1 967 459
3 462 968 460
3 234 968 462
3 462 969 461
3 460 969 462
3 463 970 461
3 158 970 463
3 461 971 463
3 460 971 461
3 465 972 234
3 460 972 465
3 465 973 464
3 234 973 465
3 466 974 464
3 0 974 466
3 464 975 466
3 234 975 464
3 469 976 467
3 470 976 469
3 470 977 0
3 469 977 470
3 471 978 467
3 469 978 471
3 471 979 468
3 467 979 471
3 472 980 468
3 473 980 472
3 473 981 158
3 472 981 473
3 474 982 468
3 472 982 474
3 468 983 474
3 467 983 468
3 477 984 475
3 0 984 477
3 477 985 476
3 475 985 477
3 478 986 476
3 467 986 478
3 476 987 478
3 475 987 476
3 480 988 475
3 479 988 480
3 480 989 0
3 475 989 480
3 481 990 479
3 127 990 481
3 481 991 0
3 479 991 481
3 484 992 483
3 127 992 484
3 484 993 482
3 483 993 484
3 127 994 485
3 349 994 127
3 485 995 483
3 349 995 485
3 482 996 487
3 486 996 482
3 487 997 158
3 486 997 487
3 488 998 486
3 349 998 488
3 486 999 488
3 482 999 486
3 492 1000 491
3 307 1000 492
3 492 1001 349
3 491 1001 492
3 493 1002 490
3 307 1002 493
3 493 1003 491
3 490 1003 493
3 494 1004 490
3 495 1004 494
3 495 1005 489
3 494 1005 495
3 496 1006 490
3 494 1006 496
3 496 1007 307
3 490 1007 496
3 497 1008 489
3 499 1008 497
3 499 1009 498
3 497 1009 499
3 500 1010 498
3 158 1010 500
3 498 1011 500
3 497 1011 498
3 502 1012 489
3 497 1012 502
3 502 1013 501
3 489 1013 502
3 503 1014 501
3 307 1014 503
3 501 1015 503
3 489 1015 501
3 505 1016 165
3 506 1016 505
3 506 1017 307
3 505 1017 506
3 507 1018 165
3 505 1018 507
3 507 1019 504
3 165 1019 507
3 508 1020 504
3 509 1020 508
3 509 1021 158
3 508 1021 509
3 510 1022 504
3 508 1022 510
3 510 1023 165
3 504 1023 510
3 512 1024 233
3 165 1024 512
3 233 1025 512
3 511 1025 233
3 513 1026 511
3 158 1026 513
3 511 1027 513
3 233 1027 511
3 192 1028 233
3 514 1028 192
3 514 1029 158
3 192 1029 514
3 248 1030 192
3 158 1030 248
3 135 249 299
3 249 1031 299
3 161 1031 249
3 515 1032 161
3 299 1032 515
3 161 1033 515
3 134 1033 161
3 516 1034 134
3 517 1034 516
3 517 1035 299
3 516 1035 517
3 134 1036 516
3 518 1036 134
3 518 1037 350
3 134 1037 518
3 521 1038 519
3 350 1038 521
3 521 1039 520
3 519 1039 521
3 522 1040 520
3 299 1040 522
3 520 1041 522
3 519 1041 520
3 524 1042 350
3 519 1042 524
3 524 1043 523
3 350 1043 524
3 525 1044 523
3 334 1044 525
3 523 1045 525
3 350 1045 523
3 528 1046 526
3 529 1046 528
3 529 1047 334
3 528 1047 529
3 530 1048 526
3 528 1048 530
3 530 1049 527
3 526 1049 530
3 531 1050 527
3 532 1050 531
3 532 1051 299
3 531 1051 532
3 533 1052 527
3 531 1052 533
3 527 1053 533
3 526 1053 527
3 536 1054 534
3 334 1054 536
3 536 1055 535
3 534 1055 536
3 537 1056 535
3 526 1056 537
3 535 1057 537
3 534 1057 535
3 539 1058 534
3 538 1058 539
3 539 1059 334
3 534 1059 539
3 540 1060 538
3 321 1060 540
3 540 1061 334
3 538 1061 540
3 542 1062 541
3 543 1062 542
3 543 1063 321
3 542 1063 543
3 544 1064 542
3 299 1064 544
3 541 1065 542
3 544 1065 541
3 546 1066 321
3 545 1066 546
3 16 1067 321
3 546 1067 16
3 547 1068 545
3 541 1068 547
3 547 1069 16
3 545 1069 547
3 551 1070 550
3 273 1070 551
3 551 1071 16
3 550 1071 551
3 552 1072 549
3 273 1072 552
3 552 1073 550
3 549 1073 552
3 553 1074 549
3 554 1074 553
3 554 1075 548
3 553 1075 554
3 555 1076 549
3 553 1076 555
3 555 1077 273
3 549 1077 555
3 556 1078 548
3 558 1078 556
3 558 1079 557
3 556 1079 558
3 559 1080 557
3 299 1080 559
3 557 1081 559
3 556 1081 557
3 561 1082 548
3 556 1082 561
3 561 1083 560
3 548 1083 561
3 562 1084 560
3 273 1084 562
3 560 1085 562
3 548 1085 560
3 564 1086 140
3 565 1086 564
3 565 1087 273
3 564 1087 565
3 566 1088 140
3 564 1088 566
3 566 1089 563
3 140 1089 566
3 567 1090 563
3 568 1090 567
3 568 1091 299
3 567 1091 568
3 569 1092 563
3 567 1092 569
3 569 1093 140
3 563 1093 569
3 571 1094 289
3 140 1094 571
3 289 1095 571
3 570 1095 289
3 572 1096 570
3 299 1096 572
3 570 1097 572
3 289 1097 570
3 220 1098 289
3 573 1098 220
3 573 1099 299
3 220 1099 573
3 269 1100 220
3 299 1100 269
3 65 70 238
3 70 1101 238
3 98 1101 70
3 574 1102 98
3 238 1102 574
3 98 1103 574
3 84 1103 98
3 575 1104 84
3 576 1104 575
3 576 1105 238
3 575 1105 576
3 84 1106 575
3 577 1106 84
3 577 1107 283
3 84 1107 577
3 580 1108 578
3 283 1108 580
3 580 1109 579
3 578 1109 580
3 581 1110 579
3 238 1110 581
3 579 1111 581
3 578 1111 579
3 583 1112 283
3 578 1112 583
3 583 1113 582
3 283 1113 583
3 584 1114 582
3 196 1114 584
3 582 1115 584
3 283 1115 582
3 587 1116 585
3 588 1116 587
3 588 1117 196
3 587 1117 588
3 589 1118 585
3 587 1118 589
3 589 1119 586
3 585 1119 589
3 590 1120 586
3 591 1120 590
3 591 1121 238
3 590 1121 591
3 592 1122 586
3 590 1122 592
3 586 1123 592
3 585 1123 586
3 595 1124 593
3 196 1124 595
3 595 1125 594
3 593 1125 595
3 596 1126 594
3 585 1126 596
3 594 1127 596
3 593 1127 594
3 598 1128 593
3 597 1128 598
3 598 1129 196
3 593 1129 598
3 599 1130 597
3 111 1130 599
3 599 1131 196
3 597 1131 599
3 602 1132 601
3 111 1132 602
3 602 1133 600
3 601 1133 602
3 111 1134 603
3 256 1134 111
3 603 1135 601
3 256 1135 603
3 600 1136 605
3 604 1136 600
3 605 1137 238
3 604 1137 605
3 606 1138 604
3 256 1138 606
3 604 1139 606
3 600 1139 604
3 610 1140 609
3 148 1140 610
3 610 1141 256
3 609 1141 610
3 611 1142 608
3 148 1142 611
3 611 1143 609
3 608 1143 611
3 612 1144 608
3 613 1144 612
3 613 1145 607
3 612 1145 613
3 614 1146 608
3 612 1146 614
3 614 1147 148
3 608 1147 614
3 615 1148 607
3 617 1148 615
3 617 1149 616
3 615 1149 617
3 618 1150 616
3 238 1150 618
3 616 1151 618
3 615 1151 616
3 620 1152 607
3 615 1152 620
3 620 1153 619
3 607 1153 620
3 621 1154 619
3 148 1154 621
3 619 1155 621
3 607 1155 619
3 623 1156 194
3 624 1156 623
3 624 1157 148
3 623 1157 624
3 625 1158 194
3 623 1158 625
3 625 1159 622
3 194 1159 625
3 626 1160 622
3 627 1160 626
3 627 1161 238
3 626 1161 627
3 628 1162 622
3 626 1162 628
3 628 1163 194
3 622 1163 628
3 630 1164 49
3 194 1164 630
3 49 1165 630
3 629 1165 49
3 631 1166 629
3 238 1166 631
3 629 1167 631
3 49 1167 629
3 205 1168 49
3 632 1168 205
3 632 1169 238
3 205 1169 632
3 85 1170 205
3 238 1170 85
3 132 142 317
3 142 1171 317
3 9 1171 142
3 633 1172 9
3 317 1172 633
3 9 1173 633
3 193 1173 9
3 634 1174 193
3 635 1174 634
3 635 1175 317
3 634 1175 635
3 193 1176 634
3 636 1176 193
3 636 1177 226
3 193 1177 636
3 639 1178 637
3 226 1178 639
3 639 1179 638
3 637 1179 639
3 640 1180 638
3 317 1180 640
3 638 1181 640
3 637 1181 638
3 642 1182 226
3 637 1182 642
3 642 1183 641
3 226 1183 642
3 643 1184 641
3 206 1184 643
3 641 1185 643
3 226 1185 641
3 646 1186 644
3 647 1186 646
3 647 1187 206
3 646 1187 647
3 648 1188 644
3 646 1188 648
3 648 1189 645
3 644 1189 648
3 649 1190 645
3 650 1190 649
3 650 1191 317
3 649 1191 650
3 651 1192 645
3 649 1192 651
3 645 1193 651
3 644 1193 645
3 654 1194 652
3 206 1194 654
3 654 1195 653
3 652 1195 654
3 655 1196 653
3 644 1196 655
3 653 1197 655
3 652 1197 653
3 657 1198 652
3 656 1198 657
3 657 1199 206
3 652 1199 657
3 658 1200 656
3 288 1200 658
3 658 1201 206
3 656 1201 658
3 661 1202 660
3 288 1202 661
3 661 1203 659
3 660 1203 661
3 288 1204 662
3 96 1204 288
3 662 1205 660
3 96 1205 662
3 659 1206 664
3 663 1206 659
3 664 1207 317
3 663 1207 664
3 665 1208 663
3 96 1208 665
3 663 1209 665
3 659 1209 663
3 669 1210 668
3 191 1210 669
3 669 1211 96
3 668 1211 669
3 670 1212 667
3 191 1212 670
3 670 1213 668
3 667 1213 670
3 671 1214 667
3 672 1214 671
3 672 1215 666
3 671 1215 672
3 673 1216 667
3 671 1216 673
3 673 1217 191
3 667 1217 673
3 674 1218 666
3 676 1218 674
3 676 1219 675
3 674 1219 676
3 677 1220 675
3 317 1220 677
3 675 1221 677
3 674 1221 675
3 679 1222 666
3 674 1222 679
3 679 1223 678
3 666 1223 679
3 680 1224 678
3 191 1224 680
3 678 1225 680
3 666 1225 678
3 682 1226 274
3 683 1226 682
3 683 1227 191
3 682 1227 683
3 684 1228 274
3 682 1228 684
3 684 1229 681
3 274 1229 684
3 685 1230 681
3 686 1230 685
3 686 1231 317
3 685 1231 686
3 687 1232 681
3 685 1232 687
3 687 1233 274
3 681 1233 687
3 689 1234 150
3 274 1234 689
3 150 1235 689
3 688 1235 150
3 690 1236 688
3 317 1236 690
3 688 1237 690
3 150 1237 688
3 128 1238 150
3 691 1238 128
3 691 1239 317
3 128 1239 691
3 157 1240 128
3 317 1240 157
3 113 308 268
3 308 1241 268
3 133 1241 308
3 692 1242 133
3 268 1242 692
3 133 1243 692
3 294 1243 133
3 693 1244 294
3 694 1244 693
3 694 1245 268
3 693 1245 694
3 294 1246 693
3 695 1246 294
3 695 1247 71
3 294 1247 695
3 698 1248 696
3 71 1248 698
3 698 1249 697
3 696 1249 698
3 699 1250 697
3 268 1250 699
3 697 1251 699
3 696 1251 697
3 701 1252 71
3 696 1252 701
3 701 1253 700
3 71 1253 701
3 702 1254 700
3 319 1254 702
3 700 1255 702
3 71 1255 700
3 705 1256 703
3 706 1256 705
3 706 1257 319
3 705 1257 706
3 707 1258 703
3 705 1258 707
3 707 1259 704
3 703 1259 707
3 708 1260 704
3 709 1260 708
3 709 1261 268
3 708 1261 709
3 710 1262 704
3 708 1262 710
3 704 1263 710
3 703 1263 704
3 713 1264 711
3 319 1264 713
3 713 1265 712
3 711 1265 713
3 714 1266 712
3 703 1266 714
3 712 1267 714
3 711 1267 712
3 716 1268 711
3 715 1268 716
3 716 1269 319
3 711 1269 716
3 717 1270 715
3 117 1270 717
3 717 1271 319
3 715 1271 717
3 719 1272 718
3 720 1272 719
3 720 1273 117
3 719 1273 720
3 721 1274 719
3 268 1274 721
3 718 1275 719
3 721 1275 718
3 723 1276 117
3 722 1276 723
3 207 1277 117
3 723 1277 207
3 724 1278 722
3 718 1278 724
3 724 1279 207
3 722 1279 724
3 728 1280 727
3 23 1280 728
3 728 1281 207
3 727 1281 728
3 729 1282 726
3 23 1282 729
3 729 1283 727
3 726 1283 729
3 730 1284 726
3 731 1284 730
3 731 1285 725
3 730 1285 731
3 732 1286 726
3 730 1286 732
3 732 1287 23
3 726 1287 732
3 733 1288 725
3 735 1288 733
3 735 1289 734
3 733 1289 735
3 736 1290 734
3 268 1290 736
3 734 1291 736
3 733 1291 734
3 738 1292 725
3 733 1292 738
3 738 1293 737
3 725 1293 738
3 739 1294 737
3 23 1294 739
3 737 1295 739
3 725 1295 737
3 741 1296 208
3 742 1296 741
3 742 1297 23
3 741 1297 742
3 743 1298 208
3 741 1298 743
3 743 1299 740
3 208 1299 743
3 744 1300 740
3 745 1300 744
3 745 1301 268
3 744 1301 745
3 746 1302 740
3 744 1302 746
3 746 1303 208
3 740 1303 746
3 748 1304 105
3 208 1304 748
3 105 1305 748
3 747 1305 105
3 749 1306 747
3 268 1306 749
3 747 1307 749
3 105 1307 747
3 48 1308 105
3 750 1308 48
3 750 1309 268
3 48 1309 750
3 338 1310 48
3 268 1310 338
3 282 160 160
3 130 160 160
3 164 160 160
3 253 160 160
3 163 160 160
3 129 160 160
3 282 130 164
3 160 160 160
3 752 1311 751
3 753 1311 752
3 753 1312 236
3 752 1312 753
3 754 1313 752
3 12 1313 754
3 751 1314 752
3 754 1314 751
3 756 1315 236
3 755 1315 756
3 143 1316 236
3 756 1316 143
3 757 1317 755
3 751 1317 757
3 757 1318 143
3 755 1318 757
3 759 1319 758
3 760 1319 759
3 760 1320 284
3 759 1320 760
3 761 1321 759
3 301 1321 761
3 758 1322 759
3 761 1322 758
3 763 1323 284
3 762 1323 763
3 236 1324 284
3 763 1324 236
3 764 1325 762
3 758 1325 764
3 764 1326 236
3 762 1326 764
3 766 1327 765
3 767 1327 766
3 767 1328 17
3 766 1328 767
3 768 1329 766
3 272 1329 768
3 765 1330 766
3 768 1330 765
3 770 1331 17
3 769 1331 770
3 284 1332 17
3 770 1332 284
3 771 1333 769
3 765 1333 771
3 771 1334 284
3 769 1334 771
3 773 1335 772
3 774 1335 773
3 774 1336 285
3 773 1336 774
3 775 1337 773
3 300 1337 775
3 772 1338 773
3 775 1338 772
3 777 1339 285
3 776 1339 777
3 17 1340 285
3 777 1340 17
3 778 1341 776
3 772 1341 778
3 778 1342 17
3 776 1342 778
3 780 1343 779
3 781 1343 780
3 781 1344 237
3 780 1344 781
3 782 1345 780
3 11 1345 782
3 779 1346 780
3 782 1346 779
3 784 1347 237
3 783 1347 784
3 285 1348 237
3 784 1348 285
3 785 1349 783
3 779 1349 785
3 785 1350 285
3 783 1350 785
3 787 1351 786
3 788 1351 787
3 788 1352 143
3 787 1352 788
3 789 1353 787
3 39 1353 789
3 786 1354 787
3 789 1354 786
3 791 1355 143
3 790 1355 791
3 237 1356 143
3 791 1356 237
3 792 1357 790
3 786 1357 792
3 792 1358 237
3 790 1358 792
3 143 284 17
3 143 17 285
3 143 285 237
3 11 272 301
3 11 301 12
3 11 12 39
3 794 1359 793
3 12 1359 794
3 794 1360 298
3 793 1360 794
3 12 1361 795
3 39 1361 12
3 795 1362 793
3 39 1362 795
3 797 1363 796
3 301 1363 797
3 797 1364 225
3 796 1364 797
3 301 1365 798
3 12 1365 301
3 798 1366 796
3 12 1366 798
3 800 1367 799
3 272 1367 800
3 800 1368 255
3 799 1368 800
3 272 1369 801
3 301 1369 272
3 801 1370 799
3 301 1370 801
3 803 1371 802
3 300 1371 803
3 803 1372 224
3 802 1372 803
3 300 1373 804
3 272 1373 300
3 804 1374 802
3 272 1374 804
3 806 1375 805
3 11 1375 806
3 806 1376 297
3 805 1376 806
3 11 1377 807
3 300 1377 11
3 807 1378 805
3 300 1378 807
3 809 1379 808
3 39 1379 809
3 809 1380 66
3 808 1380 809
3 39 1381 810
3 11 1381 39
3 810 1382 808
3 11 1382 810
3 39 301 272
3 39 272 300
3 39 300 11
3 297 255 225
3 297 225 298
3 297 298 66
3 326 187 324
3 324 187 330
3 330 187 195
3 195 187 331
3 331 187 325
3 325 187 326
3 326 330 195
3 326 195 331
3 326 331 325
3 187 187 187
3 187 187 187
3 187 187 187
3 323 31 332
3 332 31 328
3 328 31 327
3 327 31 329
3 329 31 333
3 333 31 323
3 323 328 327
3 323 327 329
3 323 329 333
3 31 31 31
3 31 31 31
3 31 31 31
3 130 1383 811
3 282 1383 130
3 811 1384 160
3 282 1384 811
3 164 1385 812
3 130 1385 164
3 812 1386 160
3 130 1386 812
3 813 1387 253
3 160 1387 813
3 164 1388 253
3 813 1388 164
3 163 1389 814
3 253 1389 163
3 814 1390 160
3 253 1390 814
3 815 1391 129
3 160 1391 815
3 163 1392 129
3 815 1392 163
3 816 1393 282
3 160 1393 816
3 129 1394 282
3 816 1394 129
3 282 164 253
3 282 253 163
3 282 163 129
3 160 160 160
3 160 160 160
3 160 160 160