OFF

804 1604 0
-0.417806 0.102297 -0.366025
-0.268692 -0.405228 -0.305835
-0.074152 0.363006 -0.229692
-0.135631 0.341594 -0.254058
-0.236273 -0.269591 -0.294484
-0.264211 -0.325632 -0.305601
-0.199097 -0.303206 -0.279794
-0.241690 -0.026300 -0.264578
-0.213101 -0.303992 -0.253516
0.261864 0.236614 -0.064921
-0.219488 -0.060690 -0.287642
-0.183550 -0.235960 -0.273574
-0.214928 0.076807 -0.285708
-0.195338 -0.125130 -0.278139
0.021718 -0.249570 -0.192300
0.114491 -0.221076 -0.155534
0.166774 -0.180308 -0.134792
0.214358 0.108574 -0.115678
0.198194 0.138749 -0.122051
0.155015 0.190428 -0.139102
0.289936 0.193943 -0.053845
-0.163696 0.040573 -0.265454
-0.166512 0.023473 -0.266585
-0.430532 0.102587 -0.339240
-0.239935 0.423022 -0.295287
-0.292346 0.382151 -0.316080
-0.411267 0.218729 -0.363327
-0.222783 0.043031 -0.288850
-0.451277 0.086638 -0.379294
-0.027021 -0.498485 -0.211833
0.407447 -0.250650 -0.039549
0.469540 0.016273 -0.014711
0.423005 0.217725 -0.032950
0.350856 0.332999 -0.061414
0.194826 0.455196 -0.123089
0.006047 0.498587 -0.197806
-0.436840 -0.187610 -0.342009
-0.372154 -0.308352 -0.316506
-0.102301 -0.490125 -0.209812
-0.038010 -0.499921 -0.184362
0.091225 -0.490358 -0.133175
0.212992 -0.442853 -0.084910
0.268082 -0.405912 -0.063059
0.361340 -0.309238 -0.026038
0.426202 -0.188653 -0.000240
0.446316 -0.122259 0.007787
0.437568 0.153537 0.004581
0.413293 0.218317 -0.004972
0.340939 0.333919 -0.033516
0.294271 0.382489 -0.051952
0.241771 0.423603 -0.072703
0.123471 0.480422 -0.119498
-0.004847 0.499976 -0.170294
-0.251526 0.424199 -0.268052
-0.304084 0.383211 -0.288903
-0.350823 0.334752 -0.307457
-0.447711 0.154603 -0.345994
-0.463466 0.086859 -0.352297
-0.470302 0.017414 -0.355069
-0.045010 -0.464314 -0.218925
-0.361810 -0.308330 -0.342620
-0.282463 0.027964 -0.312498
-0.126372 0.276409 -0.250452
0.104028 0.354272 -0.127315
0.339407 -0.040178 -0.034472
0.276685 -0.365511 -0.091439
0.172693 -0.431671 -0.132683
-0.423004 -0.134372 -0.336480
-0.325248 0.115498 -0.329359
-0.355996 -0.004443 -0.309823
0.281160 -0.007346 -0.057508
-0.067471 -0.110746 -0.195665
0.116928 -0.417108 -0.122928
0.168881 -0.331326 -0.134099
0.382917 0.125845 -0.017087
-0.098020 0.421202 -0.239089
-0.387681 0.224492 -0.322157
-0.226191 0.008406 -0.290232
0.324352 0.115098 -0.040289
0.074691 -0.299366 -0.139544
0.467983 -0.053472 -0.013778
0.203492 0.306429 -0.119796
0.278206 -0.404740 -0.090874
0.032453 -0.181625 -0.156160
-0.395384 -0.062904 -0.357300
-0.194173 0.456918 -0.245309
-0.218839 0.407897 -0.255123
-0.258135 0.159662 -0.270916
-0.405476 0.084443 -0.329334
-0.070372 -0.300847 -0.228816
0.414157 0.122746 -0.004719
-0.132930 0.441978 -0.252895
0.428808 -0.028358 0.000942
-0.066921 -0.366683 -0.227511
0.070062 0.302855 -0.172639
-0.140864 -0.407289 -0.256830
0.211136 0.076659 -0.085159
0.247306 -0.270173 -0.102984
0.328266 0.098153 -0.038755
-0.176079 0.254795 -0.238333
-0.056041 0.371329 -0.190688
0.134748 -0.446475 -0.147723
0.236360 0.187311 -0.106892
-0.252787 0.250229 -0.300538
0.318805 -0.263379 -0.042840
0.075802 -0.461430 -0.171080
-0.126625 -0.140869 -0.219118
0.351281 0.333943 -0.059631
0.022121 0.372562 -0.191558
-0.104735 0.228349 -0.210104
0.133171 0.413159 -0.147544
0.314742 0.327286 -0.075721
0.307013 -0.188132 -0.079263
-0.229483 0.274389 -0.291287
0.097920 0.038220 -0.130029
-0.334886 -0.073598 -0.333353
0.380790 -0.216084 -0.018249
0.390746 0.091954 -0.014018
0.318682 0.163150 -0.074314
0.153654 -0.471186 -0.108435
0.273616 0.070460 -0.060423
-0.164703 -0.470800 -0.234506
-0.351424 0.065090 -0.307947
0.156485 0.048967 -0.106827
0.111417 -0.353444 -0.125051
0.037264 -0.499976 -0.184763
0.310600 0.178237 -0.077501
-0.094118 0.453901 -0.237514
-0.089999 -0.235509 -0.204703
0.306145 0.163683 -0.047454
0.294436 0.208412 -0.083873
-0.164226 0.325280 -0.265397
-0.412572 0.023891 -0.332201
0.238881 -0.349596 -0.074570
0.069179 -0.235702 -0.141667
0.185472 0.390033 -0.126854
0.026942 -0.117961 -0.158283
0.412053 0.163708 -0.037338
0.095079 -0.047327 -0.131235
0.180480 -0.236966 -0.097592
0.291336 -0.050684 -0.085343
-0.074219 0.240256 -0.198009
0.459961 0.016294 0.013320
0.250348 -0.348632 -0.101853
0.317855 -0.361083 -0.043307
0.218965 0.042768 -0.082091
0.101834 0.021275 -0.128495
0.205453 -0.094436 -0.087570
0.336095 0.064262 -0.035686
-0.133143 0.480732 -0.221118
0.216200 0.365486 -0.082884
0.315827 -0.141544 -0.043905
-0.173486 0.390466 -0.269003
-0.087493 0.095639 -0.203401
-0.384335 0.117956 -0.352756
0.453225 0.085756 0.010718
-0.151122 0.111649 -0.228583
-0.245353 -0.391522 -0.266369
-0.135864 -0.447428 -0.223064
-0.159690 0.191496 -0.231901
0.268987 -0.244323 -0.094374
-0.178524 0.317123 -0.271067
-0.286948 0.223517 -0.282266
-0.182745 0.455651 -0.272609
-0.231887 0.287353 -0.260402
0.388997 0.141989 -0.046489
0.223271 -0.441576 -0.112663
0.410722 0.022825 -0.037997
-0.453125 0.086884 -0.378412
0.272571 0.119712 -0.092615
0.340739 0.097804 -0.065641
0.008745 0.373689 -0.165030
0.423634 0.218342 -0.031087
-0.266941 0.251009 -0.274318
-0.456857 -0.121169 -0.349874
-0.303040 0.298938 -0.288568
-0.169822 -0.078341 -0.236166
0.394092 0.184415 -0.012607
0.353582 0.012060 -0.060635
-0.107026 -0.424055 -0.211621
0.351849 -0.040135 -0.061370
-0.318400 -0.360278 -0.325478
-0.309068 -0.275574 -0.323317
-0.185377 -0.312449 -0.274369
0.301896 0.297356 -0.080836
-0.105927 0.455187 -0.210365
0.222490 -0.292524 -0.112833
-0.202081 0.374151 -0.280342
-0.321331 0.164439 -0.295938
0.281831 0.209073 -0.057040
0.336981 -0.234453 -0.035615
-0.045565 -0.310084 -0.187176
-0.322106 -0.123874 -0.328339
-0.015697 -0.187617 -0.175234
0.438452 0.036865 -0.027003
0.194809 0.456485 -0.121480
0.346202 -0.074419 -0.063638
-0.399160 -0.114355 -0.327019
-0.324349 -0.156463 -0.297433
-0.113589 -0.352230 -0.245978
-0.062999 -0.430142 -0.226017
-0.163921 0.435788 -0.233349
0.164102 -0.469828 -0.136121
-0.409154 0.058613 -0.330815
0.304612 0.382513 -0.078067
0.034645 0.113951 -0.155016
-0.002652 -0.374028 -0.202066
-0.439728 0.038014 -0.342942
0.222326 0.187962 -0.080624
-0.313098 0.147768 -0.324517
0.029681 -0.436322 -0.157496
-0.192560 -0.242126 -0.245324
0.061784 -0.369259 -0.176545
-0.272087 -0.244306 -0.276819
0.343378 -0.091561 -0.064772
-0.401612 -0.195524 -0.328066
0.227730 0.364430 -0.110143
0.411272 0.005467 -0.037795
-0.354887 -0.039340 -0.309417
0.210082 -0.303699 -0.117757
-0.352020 0.229658 -0.308030
0.005963 0.373796 -0.197956
0.352699 -0.226602 -0.061207
0.194632 -0.236416 -0.123812
-0.236559 -0.170712 -0.294505
0.383586 -0.123603 -0.017055
0.069026 0.173325 -0.173170
0.406715 -0.063870 -0.039665
-0.241986 0.344528 -0.296173
-0.078712 0.429642 -0.199611
-0.170429 -0.393092 -0.268525
-0.397598 0.118314 -0.326183
-0.283338 -0.015448 -0.312885
0.191343 -0.382906 -0.093427
-0.341462 -0.107542 -0.304164
-0.081231 -0.101477 -0.201105
-0.378429 0.175702 -0.318538
-0.083389 -0.430111 -0.202267
0.391215 0.278862 -0.043868
0.375000 -0.180294 -0.052333
-0.368273 0.199437 -0.314494
0.048971 0.105737 -0.149351
-0.143974 0.404559 -0.257303
0.046401 0.433105 -0.181887
-0.233149 -0.390417 -0.293360
-0.016099 -0.375015 -0.175568
-0.158184 -0.101284 -0.231579
0.237277 -0.358824 -0.107039
0.297951 -0.202554 -0.082865
0.003521 0.123591 -0.167332
0.066778 0.166929 -0.142242
-0.109181 0.069778 -0.212013
-0.123499 -0.287213 -0.218017
0.017537 -0.436296 -0.194130
0.281647 -0.309494 -0.057598
0.169693 -0.322959 -0.101945
0.401068 -0.098154 -0.041933
0.349633 -0.212148 -0.030584
0.233734 -0.171661 -0.076443
0.049754 -0.433912 -0.181369
-0.268738 -0.230738 -0.307304
-0.426498 -0.187587 -0.368124
-0.054735 0.433853 -0.190112
0.162346 -0.011475 -0.104563
-0.045985 0.465715 -0.186617
0.467229 -0.053321 -0.015691
-0.283765 -0.100728 -0.281309
0.084586 0.228121 -0.135133
0.351614 0.206130 -0.029408
-0.307023 0.163903 -0.322096
-0.192424 -0.423592 -0.245439
-0.265789 -0.364857 -0.306262
-0.167472 0.248846 -0.266754
-0.444687 -0.120803 -0.376878
-0.284218 0.304110 -0.312935
0.387121 -0.148104 -0.047503
-0.138226 -0.414393 -0.223968
0.431325 -0.092879 -0.029946
-0.260914 0.328270 -0.303684
0.351903 0.029376 -0.061283
0.100268 0.227310 -0.160747
0.366803 0.197981 -0.055225
-0.063523 -0.179102 -0.194165
0.243203 -0.178506 -0.104524
0.058499 0.431292 -0.145273
0.277459 -0.050709 -0.059014
-0.164185 0.402752 -0.233484
-0.457743 -0.052357 -0.380370
-0.199341 -0.313261 -0.248076
0.148043 -0.263012 -0.110462
0.350639 0.228156 -0.061598
-0.289494 0.079609 -0.283409
-0.018838 -0.374008 -0.208476
-0.193725 -0.154286 -0.245703
-0.458093 0.017389 -0.382058
0.457642 -0.053498 0.012337
-0.010185 0.372601 -0.204352
0.421528 -0.134996 -0.033865
-0.374333 0.150979 -0.348764
0.077815 -0.366855 -0.170195
-0.226068 -0.093915 -0.258454
0.088779 0.360262 -0.133348
-0.066349 0.428405 -0.226541
0.124504 -0.352515 -0.151692
-0.133670 0.414659 -0.221389
-0.396387 -0.249683 -0.357872
0.176119 0.324870 -0.130619
-0.074746 0.174184 -0.198279
-0.153356 -0.469447 -0.261836
0.126393 -0.203065 -0.118980
0.242110 0.384266 -0.072606
0.263768 -0.327182 -0.064694
0.360784 -0.211572 -0.057992
0.341146 0.012166 -0.033735
0.188455 -0.154457 -0.126182
0.067992 -0.090435 -0.142002
0.100107 -0.030729 -0.129228
0.005812 -0.250109 -0.166774
0.037725 -0.498564 -0.186193
0.320856 -0.124946 -0.041898
0.455934 -0.121889 -0.020228
-0.080550 -0.367649 -0.201084
-0.241184 0.424223 -0.294167
-0.380594 -0.172037 -0.319721
-0.133411 0.211990 -0.221476
-0.404469 -0.088853 -0.329098
0.393975 0.125465 -0.044533
0.134526 0.342291 -0.115249
0.113749 0.417347 -0.123407
-0.346467 -0.090931 -0.306130
-0.147166 -0.202735 -0.227310
0.251969 0.422430 -0.100491
0.151699 -0.407640 -0.140974
0.055558 0.303832 -0.146557
0.216879 0.286812 -0.082689
0.130487 -0.108870 -0.117270
0.408034 -0.251359 -0.037703
-0.105202 0.353467 -0.241997
0.035204 -0.308966 -0.155190
0.371012 -0.253048 -0.053980
0.081360 -0.301029 -0.168729
-0.332087 -0.090747 -0.332260
0.336836 0.114701 -0.067170
0.102939 -0.013539 -0.128091
-0.039886 -0.185158 -0.184811
-0.032332 -0.374996 -0.181996
0.113237 0.211692 -0.123802
-0.042459 0.247480 -0.185425
-0.007459 0.374927 -0.171445
-0.024959 0.311203 -0.178435
-0.111886 0.136906 -0.244846
-0.269610 0.372055 -0.275262
0.328336 -0.141215 -0.070775
-0.277779 -0.216294 -0.310871
0.386822 0.222940 -0.047274
-0.038788 -0.308107 -0.216315
0.131045 0.272884 -0.116693
0.244007 -0.390991 -0.104404
-0.117022 0.148691 -0.215045
-0.198931 -0.376750 -0.279797
-0.301073 -0.202349 -0.288258
0.252112 0.423627 -0.098818
0.134002 0.479091 -0.147153
0.064595 -0.367823 -0.143606
0.407364 0.057457 -0.039294
0.155920 -0.332194 -0.107407
-0.356551 0.013006 -0.310026
0.091851 0.054415 -0.132418
0.005410 -0.437508 -0.167109
-0.059281 0.495202 -0.222065
-0.298843 -0.015371 -0.287200
0.022337 0.247401 -0.159765
0.148852 0.334076 -0.109583
-0.261416 0.340406 -0.272046
-0.340484 -0.039301 -0.335537
-0.300415 -0.302304 -0.288091
-0.203066 0.139774 -0.249127
-0.435568 0.154190 -0.373010
0.245439 -0.257906 -0.071888
0.070680 0.493649 -0.172216
-0.058546 0.493805 -0.223390
0.166660 0.395269 -0.102474
-0.156999 -0.338917 -0.231331
-0.338892 0.251642 -0.302810
0.303389 -0.283572 -0.048963
-0.186152 0.391596 -0.242193
0.083746 0.069545 -0.135613
0.133812 0.480447 -0.145613
-0.183059 0.167266 -0.241179
0.339987 -0.022730 -0.034226
0.184467 0.456461 -0.095365
-0.255256 0.263124 -0.269679
0.298413 -0.302181 -0.082776
-0.318885 0.279134 -0.294862
0.102135 0.422772 -0.159825
0.293085 0.035928 -0.084569
-0.336613 -0.255351 -0.302382
0.398870 0.031595 -0.010858
-0.219319 0.109553 -0.255592
-0.096713 0.163027 -0.206989
0.353005 -0.005338 -0.060880
-0.279986 -0.049996 -0.311590
0.274525 0.235874 -0.091732
0.397149 -0.115001 -0.043501
-0.436277 -0.070617 -0.341677
0.070312 0.495046 -0.170746
0.196348 -0.312908 -0.123204
0.143139 -0.086565 -0.112239
0.001949 0.436832 -0.167662
0.363887 -0.180782 -0.024909
0.253513 -0.133673 -0.068574
-0.115880 -0.282973 -0.246820
-0.362182 0.183249 -0.343922
0.190629 0.307369 -0.093065
-0.378853 0.279002 -0.350434
-0.380494 0.279792 -0.349469
-0.372517 -0.252881 -0.316598
0.390030 -0.098409 -0.014480
-0.338953 0.333831 -0.334582
-0.441171 -0.005498 -0.343554
-0.373416 -0.155466 -0.348687
-0.111750 -0.357986 -0.213431
0.332602 0.256974 -0.068714
0.019396 0.119941 -0.161049
-0.437370 0.154627 -0.372109
0.070268 0.366453 -0.172498
-0.014836 -0.436257 -0.206950
-0.329880 0.295797 -0.331025
-0.413070 0.165152 -0.332266
0.189889 0.417650 -0.093254
0.314121 -0.172493 -0.076434
-0.257916 -0.243689 -0.303031
-0.037047 -0.122695 -0.183628
0.380873 0.278837 -0.017753
0.081816 -0.429104 -0.168668
-0.320808 0.257762 -0.327468
-0.213656 -0.442301 -0.284075
0.320094 -0.276331 -0.074166
-0.408421 -0.250412 -0.330814
0.169622 -0.394607 -0.102040
-0.300858 0.285177 -0.319542
-0.340481 0.334776 -0.333572
-0.012683 0.124830 -0.173748
0.289507 0.343391 -0.053875
0.390678 0.278074 -0.045696
0.011334 -0.122754 -0.164468
-0.222053 -0.212283 -0.256975
0.090915 0.162147 -0.164512
0.462824 0.085537 -0.017306
-0.004742 -0.467391 -0.202982
-0.276417 0.120816 -0.278192
0.321368 0.257726 -0.041337
0.014084 0.435575 -0.194682
0.044366 0.177026 -0.151107
-0.034866 -0.371566 -0.214821
0.177504 0.317647 -0.098253
-0.149454 0.342633 -0.227707
-0.211670 -0.377793 -0.253018
0.371683 -0.309212 -0.052153
-0.428415 -0.005483 -0.370327
0.005495 0.500000 -0.196409
-0.154359 -0.470775 -0.260620
-0.282712 0.209107 -0.312427
-0.392800 0.184854 -0.356045
-0.262762 0.236522 -0.304501
-0.317116 -0.140437 -0.326378
0.163998 -0.471160 -0.134549
0.215940 -0.403644 -0.083706
0.139296 -0.345452 -0.145828
-0.089988 0.359404 -0.235966
0.195312 0.378840 -0.091143
0.147547 0.341253 -0.141918
-0.125695 -0.413247 -0.250829
-0.134196 0.348587 -0.221659
-0.413001 0.219350 -0.362398
0.376895 0.174288 -0.051251
-0.123969 -0.446165 -0.250176
0.362753 0.182903 -0.025019
-0.217832 0.286469 -0.286662
-0.065130 0.305793 -0.194348
-0.060015 0.114065 -0.192502
-0.127351 -0.353154 -0.219604
0.069856 0.239257 -0.172780
0.328199 -0.361057 -0.069421
-0.224667 0.187867 -0.289461
-0.215781 0.364964 -0.285776
-0.468084 -0.052380 -0.354256
0.136521 -0.413562 -0.146990
-0.052647 -0.117864 -0.189801
-0.341590 -0.004502 -0.335943
0.209681 -0.293281 -0.086081
-0.319000 -0.261877 -0.327238
0.222332 0.008037 -0.080790
-0.410082 -0.054459 -0.331288
-0.044758 0.120019 -0.186454
0.041154 0.371212 -0.152198
-0.103681 0.360494 -0.209564
0.026920 -0.500000 -0.158649
0.284743 0.304294 -0.055798
-0.352080 -0.056537 -0.308321
0.151280 -0.180651 -0.109103
0.348546 0.064009 -0.062581
0.215510 -0.061239 -0.083556
-0.338886 0.228986 -0.334654
0.338364 -0.108112 -0.066773
0.334576 -0.255446 -0.068411
0.209230 -0.206317 -0.086179
-0.294078 -0.058615 -0.285354
0.395693 -0.064028 -0.012205
-0.296951 0.209771 -0.286241
-0.413149 0.006486 -0.332446
-0.113545 0.416432 -0.245242
0.252937 0.383181 -0.100144
-0.003275 0.186735 -0.169965
0.447211 0.153127 -0.023425
0.267181 -0.231983 -0.063254
-0.236077 -0.060694 -0.262387
-0.186571 0.139213 -0.274420
0.137320 0.096862 -0.114372
-0.354861 0.279451 -0.309108
-0.226372 -0.358266 -0.290646
0.330784 0.130851 -0.069552
-0.166621 0.166627 -0.266494
-0.190498 -0.390621 -0.244646
-0.159494 -0.267267 -0.232253
-0.333515 0.132078 -0.300793
-0.143317 0.190787 -0.257243
-0.026653 -0.250070 -0.179631
-0.353209 -0.202888 -0.340730
-0.337030 0.064835 -0.334072
-0.313204 0.179550 -0.292705
-0.287425 -0.301476 -0.314771
0.094307 0.291196 -0.131224
0.279828 -0.231398 -0.090070
0.026224 0.465846 -0.189847
-0.398414 0.032456 -0.358411
0.098848 -0.221536 -0.129905
0.101099 0.293242 -0.160357
-0.143691 -0.122263 -0.225859
-0.027667 -0.499897 -0.210476
-0.128526 0.117973 -0.251453
0.304319 0.381434 -0.079798
0.261408 0.328579 -0.065016
-0.420035 -0.091854 -0.367089
-0.242745 0.159092 -0.296647
-0.178379 -0.053880 -0.239532
0.404894 -0.156128 -0.008648
0.397693 -0.251386 -0.011588
0.276269 -0.217520 -0.059641
0.264570 0.249605 -0.095662
-0.167939 -0.002539 -0.267174
-0.310140 -0.187864 -0.291835
-0.206711 0.406744 -0.282145
-0.347485 0.082026 -0.306372
-0.342142 0.012898 -0.336145
0.229667 0.285931 -0.109450
-0.002069 0.435594 -0.201079
-0.274016 0.079265 -0.309105
-0.389786 -0.097201 -0.355116
0.077199 -0.161589 -0.138422
0.278425 -0.405887 -0.089174
0.267458 -0.133414 -0.094876
-0.295863 -0.187407 -0.318005
-0.144382 -0.266632 -0.258092
-0.212486 -0.441052 -0.285225
-0.235137 0.360899 -0.261621
-0.030944 -0.435026 -0.213327
0.217881 -0.212315 -0.114583
-0.375077 0.223858 -0.348990
-0.107319 -0.156740 -0.211488
-0.104510 -0.077252 -0.210301
0.221173 -0.026858 -0.081281
-0.064477 -0.370098 -0.194721
0.334806 -0.305260 -0.068367
-0.298919 0.178971 -0.318873
0.155419 -0.266992 -0.139369
-0.069623 0.495178 -0.195950
0.391224 -0.215472 -0.045941
-0.390613 0.143340 -0.323394
0.044377 -0.465751 -0.151704
-0.027055 -0.437468 -0.179965
-0.120682 -0.047067 -0.216677
-0.323823 -0.304467 -0.329187
0.132341 0.347226 -0.147934
0.190404 0.316679 -0.124969
0.055549 -0.101642 -0.146940
0.280056 0.027467 -0.057913
-0.004742 -0.125164 -0.170837
-0.085274 -0.301579 -0.202893
0.152780 -0.062582 -0.108399
-0.146604 0.089197 -0.258640
0.447910 0.153561 -0.021534
0.373529 -0.156799 -0.021069
0.424496 0.122399 -0.032449
-0.383397 -0.122338 -0.352609
-0.240961 0.383775 -0.295730
0.312214 0.147488 -0.045065
-0.074353 0.105885 -0.198188
0.279579 -0.101224 -0.090046
0.218721 0.406232 -0.113672
0.144248 0.405366 -0.111340
0.133859 0.442894 -0.115419
-0.388967 -0.194973 -0.354883
-0.214828 0.375236 -0.253565
0.126893 -0.283264 -0.150681
0.294737 -0.016143 -0.083964
-0.355093 0.198850 -0.341100
-0.218748 0.297600 -0.255189
-0.028877 0.123630 -0.180162
-0.087801 0.364106 -0.203272
-0.183832 0.456942 -0.271424
0.198998 0.109049 -0.089936
0.112550 -0.283948 -0.124537
-0.160851 -0.404858 -0.232919
0.054438 0.370093 -0.178763
0.059970 0.495022 -0.144631
-0.333103 0.081722 -0.332501
-0.316934 -0.359262 -0.326510
0.115071 -0.129062 -0.123394
0.294445 -0.188594 -0.052416
-0.086147 -0.169568 -0.203116
0.310622 -0.322328 -0.046135
0.173022 -0.154729 -0.100469
-0.128372 -0.345131 -0.251825
0.399974 -0.003218 -0.010453
0.075110 0.459507 -0.138669
-0.099178 0.083524 -0.208039
-0.135276 0.131452 -0.222290
0.163583 0.401211 -0.135512
-0.390836 0.279767 -0.323354
-0.161892 -0.431270 -0.265180
-0.117307 0.054667 -0.215246
-0.360221 -0.307459 -0.343604
-0.404061 -0.154698 -0.360822
0.015541 0.310545 -0.162398
0.426047 0.058675 -0.000070
-0.235003 0.195392 -0.261722
-0.207473 0.227310 -0.250790
0.090250 0.423992 -0.132706
0.032442 -0.372644 -0.156343
-0.424845 0.059547 -0.368853
0.053780 -0.244762 -0.179598
-0.279670 0.323167 -0.279291
-0.398736 -0.028356 -0.358595
-0.016300 -0.468714 -0.175735
0.209809 -0.377242 -0.117934
-0.005144 -0.312562 -0.171171
-0.412040 -0.028411 -0.332039
0.161638 -0.432896 -0.105237
-0.223998 -0.442325 -0.257960
-0.098033 -0.357047 -0.239822
-0.315247 0.328959 -0.293374
0.470302 0.016318 -0.012795
-0.094582 -0.422883 -0.238517
-0.211858 -0.125316 -0.252857
0.349160 -0.271846 -0.030827
0.182789 0.139309 -0.096327
-0.122801 0.480756 -0.247233
0.138193 0.276090 -0.145683
-0.091131 -0.488718 -0.237212
0.436544 -0.188627 -0.026355
0.456657 -0.122233 -0.018327
0.327838 -0.360039 -0.071177
0.463567 0.085780 -0.015397
0.061834 -0.431501 -0.144759
-0.348652 -0.270224 -0.338988
0.278627 0.321574 -0.090028
-0.424725 -0.187057 -0.369035
-0.104208 0.294422 -0.209834
0.123284 0.118198 -0.119910
-0.039847 0.372528 -0.184274
0.181283 -0.393514 -0.129245
-0.022347 0.436252 -0.177284
-0.121887 0.479398 -0.248487
0.057029 0.367562 -0.145915
0.401781 0.091671 -0.041473
0.097193 -0.146750 -0.130491
0.101849 -0.488948 -0.160791
0.253906 0.343931 -0.099797
-0.293743 0.383235 -0.315018
-0.270797 -0.092282 -0.307990
-0.198052 0.220508 -0.278891
0.103518 0.003909 -0.127845
-0.423342 0.219325 -0.336284
0.203975 0.226071 -0.119680
0.337779 0.046896 -0.035036
-0.392190 0.084180 -0.355898
-0.183688 -0.028378 -0.241610
0.234567 -0.270867 -0.076205
0.330913 -0.091749 -0.037884
-0.178130 0.326274 -0.239078
0.421004 -0.093144 -0.002209
-0.446516 -0.121145 -0.375989
-0.125686 -0.030456 -0.218643
0.214044 0.373650 -0.115555
-0.076772 -0.462567 -0.199677
-0.366385 -0.203438 -0.314123
0.254397 0.158493 -0.099776
-0.322120 -0.276329 -0.296662
-0.297111 0.036844 -0.286466
0.126251 -0.346361 -0.119170
-0.247399 -0.178317 -0.266980
-0.339607 0.115897 -0.303221
-0.174405 0.065930 -0.237846
-0.020974 -0.125144 -0.177265
0.374891 0.150513 -0.020242
-0.164250 0.089665 -0.233802
0.179253 0.248429 -0.129449
0.009533 -0.311799 -0.197183
-0.225086 -0.026393 -0.289827
-0.337083 -0.232989 -0.334372
0.041751 -0.309415 -0.184422
0.041776 -0.110877 -0.152402
-0.091958 -0.490101 -0.235927
0.191198 -0.125802 -0.093244
0.410117 -0.029330 -0.038285
-0.171822 -0.331799 -0.237195
0.301573 -0.172911 -0.049579
-0.172020 -0.180261 -0.237132
-0.034366 0.433203 -0.213871
-0.367378 -0.171576 -0.346311
0.398814 -0.038114 -0.010945
-0.206764 -0.211804 -0.282745
0.287503 0.070142 -0.086748
0.165058 0.249252 -0.103245
0.312691 0.284436 -0.076573
-0.264013 0.112287 -0.305113
-0.389151 -0.147576 -0.323086
0.261675 0.112074 -0.065112
0.014756 0.467165 -0.162562
-0.288282 0.343131 -0.314507
0.366244 0.242484 -0.023581
0.333744 -0.074559 -0.036747
0.439828 -0.006528 -0.026498
0.341729 0.294986 -0.065064
-0.164588 -0.037087 -0.265879
-0.459961 0.017439 -0.381184
-0.282939 -0.231319 -0.281104
0.054087 0.240102 -0.147199
0.148459 0.073635 -0.109983
0.223334 -0.442826 -0.111025
0.085714 -0.426694 -0.135298
0.105395 -0.423122 -0.159325
-0.051548 0.181943 -0.189086
-0.110472 0.422419 -0.212195
0.218887 -0.364435 -0.082502
-0.058798 -0.245172 -0.192356
0.078863 -0.077474 -0.137684
-0.398078 -0.250388 -0.356928
-0.191626 0.306905 -0.276265
-0.051244 -0.435009 -0.189542
-0.310032 -0.156094 -0.323587
-0.331454 -0.140763 -0.300232
0.008573 -0.186432 -0.165621
0.371200 -0.308338 -0.053957
-0.231504 0.077192 -0.260447
0.244467 0.151496 -0.071890
0.029721 -0.374067 -0.189247
0.104077 -0.453733 -0.128051
-0.157937 -0.330933 -0.263520
0.331154 0.295822 -0.037427
0.034358 0.434355 -0.154830
-0.119647 -0.221272 -0.216430
0.086408 0.458210 -0.166020
0.163999 0.434177 -0.135316
-0.113577 -0.062767 -0.213878
-0.399841 0.006444 -0.359001
-0.141432 0.277312 -0.224591
-0.395006 0.067080 -0.357029
-0.014159 0.465895 -0.205838
0.197238 -0.304488 -0.091019
0.265925 -0.366547 -0.063877
0.301401 0.285266 -0.049219
-0.010071 0.249878 -0.172597
0.020866 0.183671 -0.160407
-0.027571 0.186155 -0.179587
0.101568 -0.490334 -0.159289
0.435878 -0.188095 -0.028232
0.139953 -0.408773 -0.113802
0.016366 -0.375055 -0.162712
0.161242 0.023339 -0.104968
0.268183 -0.093093 -0.062727
0.080202 -0.363030 -0.137421
0.395502 0.066326 -0.012159
0.070474 0.430051 -0.172357
-0.354842 0.030367 -0.309333
-0.354747 -0.226381 -0.309536
-0.239189 -0.359256 -0.263898
0.055478 -0.173290 -0.147035
-0.336284 -0.305328 -0.302298
-0.338734 0.047522 -0.334763
0.037965 -0.245288 -0.154037
0.242450 0.344929 -0.072508
0.087951 -0.063011 -0.134072
-0.093658 -0.090240 -0.206016
-0.252685 -0.140612 -0.300863
0.275164 -0.326281 -0.092005
0.108941 -0.357295 -0.157860
-0.455882 -0.052210 -0.381248
-0.268104 -0.140889 -0.275145
0.159224 -0.037389 -0.105823
-0.192468 0.318094 -0.244764
0.101929 0.359174 -0.159966
0.252936 0.261714 -0.100258
3 0 154 686
3 37 181 789
3 181 375 789
3 181 1 375
3 181 617 1
3 1 157 375
3 1 649 157
3 1 436 649
3 617 271 1
3 271 520 1
3 271 5 520
3 5 6 520
3 5 4 6
3 4 11 6
3 4 722 11
3 722 563 11
3 722 13 563
3 13 411 563
3 13 735 411
3 735 14 411
3 735 550 14
3 550 22 14
3 22 21 14
3 21 590 14
3 590 540 14
3 540 350 14
3 350 226 14
3 226 447 14
3 447 641 14
3 447 15 641
3 447 16 15
3 447 314 16
3 447 17 314
3 17 605 314
3 605 140 314
3 17 395 605
3 14 89 411
3 140 598 314
3 447 18 17
3 350 482 226
3 350 526 482
3 526 62 482
3 62 2 482
3 2 296 482
3 296 94 482
3 296 221 94
3 221 108 94
3 520 244 1
3 62 469 2
3 62 337 469
3 17 723 395
3 14 355 89
3 598 561 314
3 157 787 375
3 447 19 18
3 108 614 94
3 787 8 375
3 8 213 375
3 8 211 213
3 211 446 213
3 2 302 296
3 302 719 296
3 614 425 94
3 62 3 337
3 14 708 355
3 526 272 62
3 561 283 314
3 13 10 735
3 244 564 1
3 787 288 8
3 6 183 520
3 157 457 787
3 520 359 244
3 211 718 446
3 590 517 540
3 355 93 89
3 723 501 395
3 605 180 140
3 598 352 561
3 411 759 563
3 735 709 550
3 302 380 719
3 226 280 447
3 550 77 22
3 540 522 350
3 22 27 21
3 343 138 316
3 343 682 138
3 682 146 138
3 146 793 138
3 146 747 793
3 146 114 747
3 114 367 747
3 367 315 747
3 367 386 315
3 386 241 315
3 241 205 315
3 205 423 315
3 423 249 315
3 249 442 315
3 442 608 315
3 608 494 315
3 494 480 315
3 480 597 315
3 597 585 315
3 597 153 585
3 153 626 585
3 626 712 585
3 626 136 712
3 626 445 136
3 626 251 445
3 251 631 445
3 631 587 445
3 631 704 587
3 631 432 704
3 631 488 432
3 631 71 488
3 631 235 71
3 631 794 235
3 631 570 794
3 631 765 570
3 631 581 765
3 631 693 581
3 386 669 241
3 669 346 241
3 669 656 346
3 656 724 346
3 656 208 724
3 208 334 724
3 208 9 334
3 9 498 334
3 9 48 498
3 631 7 693
3 631 755 7
3 755 699 7
3 755 291 699
3 291 553 699
3 553 122 699
3 699 370 7
3 498 542 334
3 542 49 334
3 272 161 62
3 272 749 161
3 161 131 62
3 140 214 598
3 140 196 214
3 17 169 723
3 169 342 723
3 342 170 723
3 15 340 641
3 15 604 340
3 604 303 340
3 303 797 340
3 447 280 19
3 280 658 19
3 658 707 19
3 658 584 707
3 658 306 584
3 16 575 15
3 16 223 575
3 223 219 575
3 219 406 575
3 13 680 10
3 13 795 680
3 795 465 680
3 465 192 680
3 395 178 605
3 395 279 178
3 561 112 283
3 112 248 283
3 89 199 411
3 199 623 411
3 178 400 605
3 722 224 13
3 722 260 224
3 722 431 260
3 708 292 355
3 708 206 292
3 89 650 199
3 214 504 598
3 604 468 303
3 169 521 342
3 260 353 224
3 584 81 707
3 21 12 590
3 12 517 590
3 12 726 517
3 726 544 517
3 726 269 544
3 726 209 269
3 292 454 355
3 563 6 11
3 269 574 544
3 795 751 465
3 19 684 18
3 684 102 18
3 684 549 102
3 684 803 549
3 549 402 102
3 223 186 219
3 561 430 112
3 563 183 6
3 102 130 18
3 433 20 268
3 433 189 20
3 699 366 370
3 366 69 370
3 699 785 366
3 23 57 88
3 35 534 243
3 35 719 769
3 556 35 296
3 35 452 108
3 511 673 337
3 127 302 673
3 673 75 2
3 673 242 91
3 131 24 187
3 24 552 152
3 595 24 228
3 485 24 749
3 730 25 274
3 25 113 278
3 427 418 435
3 418 464 440
3 574 26 606
3 412 26 209
3 298 463 26
3 568 503 26
3 616 28 686
3 640 28 535
3 768 28 790
3 766 294 489
3 294 643 459
3 543 84 273
3 115 273 558
3 667 751 720
3 528 602 667
3 633 594 667
3 420 192 667
3 665 710 632
3 632 491 353
3 531 582 632
3 182 632 431
3 472 308 650
3 630 230 308
3 308 95 623
3 308 653 476
3 454 29 566
3 206 426 29
3 59 200 29
3 449 29 253
3 105 259 677
3 212 677 434
3 797 202 487
3 101 742 202
3 332 202 468
3 66 202 671
3 357 645 82
3 143 82 186
3 82 247 406
3 796 65 82
3 573 392 754
3 160 754 437
3 30 222 248
3 239 577 30
3 339 505 30
3 430 312 30
3 256 320 196
3 297 275 320
3 320 403 504
3 320 227 277
3 400 31 217
3 279 167 31
3 733 715 31
3 194 31 364
3 593 675 514
3 165 514 521
3 475 137 514
3 326 170 514
3 354 32 290
3 281 32 126
3 402 33 725
3 33 734 422
3 111 33 666
3 184 33 803
3 694 331 306
3 599 331 135
3 331 216 81
3 512 678 331
3 764 34 110
3 34 583 628
3 763 394 379
3 425 379 784
3 58 785 132
3 510 69 58
3 647 58 419
3 58 203 207
3 404 325 486
3 499 486 493
3 67 727 174
3 234 174 197
3 198 36 323
3 215 696 36
3 416 396 438
3 360 438 786
3 213 37 698
3 789 375 37
3 270 613 649
3 382 649 523
3 158 179 121
3 421 121 276
3 38 237 572
3 695 750 38
3 39 580 245
3 644 368 39
3 579 664 497
3 639 497 210
3 40 741 782
3 758 72 40
3 648 439 119
3 700 119 778
3 41 233 255
3 467 745 41
3 42 133 490
3 771 311 42
3 621 384 144
3 378 144 254
3 43 104 548
3 655 190 43
3 116 409 547
3 717 547 257
3 319 44 592
3 546 225 44
3 45 417 732
3 691 508 45
3 263 682 571
3 145 682 780
3 92 624 295
3 389 295 721
3 635 155 397
3 155 685 783
3 90 46 117
3 46 98 74
3 177 47 705
3 47 596 477
3 433 268 731
3 760 48 451
3 48 9 772
3 443 49 498
3 310 50 792
3 50 413 150
3 429 390 470
3 390 372 381
3 600 601 51
3 328 51 63
3 625 615 638
3 615 674 284
3 761 729 52
3 408 52 171
3 264 576 672
3 576 670 262
3 744 149 609
3 149 229 185
3 286 85 473
3 85 304 201
3 86 53 385
3 53 690 603
3 351 54 565
3 54 607 373
3 651 55 642
3 55 391 175
3 519 629 393
3 629 162 383
3 76 683 220
3 683 530 240
3 428 56 236
3 56 525 578
3 88 57 553
3 71 330 569
3 136 791 83
3 123 96 146
3 235 718 106
3 307 109 494
3 739 611 114
3 282 432 128
3 712 134 788
3 407 138 714
3 141 608 743
3 589 316 147
3 388 153 627
3 376 626 156
3 358 159 597
3 176 765 300
3 587 527 193
3 453 738 205
3 267 241 250
3 570 654 246
3 773 249 513
3 706 398 251
3 794 293 538
3 676 315 309
3 753 445 317
3 399 324 480
3 335 793 622
3 343 502 800
3 704 746 344
3 347 442 775
3 656 367 518
3 774 371 423
3 488 762 620
3 747 500 618
3 581 516 545
3 585 536 559
3 755 631 703
3 693 7 687
3 366 785 58
3 132 203 58
3 132 785 203
3 207 57 58
3 207 203 57
3 699 122 785
3 203 122 57
3 203 785 122
3 122 553 57
3 88 231 23
3 88 553 231
3 23 56 57
3 23 231 56
3 291 702 553
3 291 755 702
3 231 702 56
3 231 553 702
3 450 755 398
3 450 525 755
3 702 525 56
3 702 755 525
3 703 398 755
3 703 631 398
3 578 236 56
3 578 525 236
3 428 683 56
3 428 236 683
3 450 188 525
3 450 398 188
3 236 188 683
3 236 525 188
3 87 398 376
3 87 530 398
3 188 530 683
3 188 398 530
3 631 251 398
3 706 376 398
3 706 251 376
3 240 220 683
3 240 530 220
3 76 629 683
3 76 220 629
3 87 509 530
3 87 376 509
3 220 509 629
3 220 530 509
3 636 376 388
3 636 162 376
3 509 162 629
3 509 376 162
3 251 626 376
3 156 388 376
3 156 626 388
3 383 393 629
3 383 162 393
3 519 55 629
3 519 393 55
3 636 173 162
3 636 388 173
3 393 173 55
3 393 162 173
3 637 388 159
3 637 391 388
3 173 391 55
3 173 388 391
3 626 153 388
3 627 159 388
3 627 153 159
3 175 642 55
3 175 391 642
3 651 54 55
3 651 642 54
3 637 164 391
3 637 159 164
3 642 164 54
3 642 391 164
3 99 159 324
3 99 607 159
3 164 607 54
3 164 159 607
3 153 597 159
3 358 324 159
3 358 597 324
3 373 565 54
3 373 607 565
3 351 53 54
3 351 565 53
3 99 801 607
3 99 324 801
3 565 801 53
3 565 607 801
3 767 324 109
3 767 690 324
3 801 690 53
3 801 324 690
3 597 480 324
3 399 109 324
3 399 480 109
3 603 385 53
3 603 690 385
3 86 85 53
3 86 385 85
3 767 456 690
3 767 109 456
3 385 456 85
3 385 690 456
3 668 109 141
3 668 473 109
3 456 473 85
3 456 109 473
3 480 494 109
3 307 141 109
3 307 494 141
3 286 304 85
3 286 473 304
3 201 149 85
3 201 304 149
3 668 496 473
3 668 141 496
3 304 496 149
3 304 473 496
3 479 141 347
3 479 609 141
3 496 609 149
3 496 141 609
3 494 608 141
3 743 347 141
3 743 608 347
3 744 229 149
3 744 609 229
3 185 576 149
3 185 229 576
3 479 100 609
3 479 347 100
3 229 100 576
3 229 609 100
3 349 347 773
3 349 670 347
3 100 670 576
3 100 347 670
3 608 442 347
3 775 773 347
3 775 442 773
3 262 672 576
3 262 670 672
3 264 52 576
3 264 672 52
3 349 348 670
3 349 773 348
3 672 348 52
3 672 670 348
3 634 773 371
3 634 171 773
3 348 171 52
3 348 773 171
3 442 249 773
3 513 371 773
3 513 249 371
3 408 761 52
3 408 171 761
3 729 615 52
3 729 761 615
3 634 495 171
3 634 371 495
3 761 495 615
3 761 171 495
3 333 371 738
3 333 674 371
3 495 674 615
3 495 371 674
3 249 423 371
3 774 738 371
3 774 423 738
3 284 638 615
3 284 674 638
3 625 51 615
3 625 638 51
3 333 301 674
3 333 738 301
3 638 301 51
3 638 674 301
3 532 738 267
3 532 63 738
3 301 63 51
3 301 738 63
3 423 205 738
3 453 267 738
3 453 205 267
3 328 600 51
3 328 63 600
3 601 390 51
3 601 600 390
3 532 327 63
3 532 267 327
3 600 327 390
3 600 63 327
3 356 267 346
3 356 372 267
3 327 372 390
3 327 267 372
3 205 241 267
3 250 346 267
3 250 241 346
3 381 470 390
3 381 372 470
3 429 50 390
3 429 470 50
3 356 455 372
3 356 346 455
3 470 455 50
3 470 372 455
3 724 413 346
3 455 413 50
3 455 346 413
3 150 792 50
3 150 413 792
3 310 49 50
3 310 792 49
3 724 334 413
3 792 334 49
3 792 413 334
3 542 498 49
3 443 48 49
3 443 498 48
3 669 386 656
3 772 451 48
3 772 9 451
3 760 433 48
3 760 451 433
3 208 189 9
3 208 656 189
3 451 189 433
3 451 9 189
3 756 656 611
3 756 20 656
3 189 656 20
3 386 367 656
3 518 611 656
3 518 367 611
3 731 47 433
3 731 268 47
3 756 129 20
3 756 611 129
3 268 129 47
3 268 20 129
3 728 611 96
3 728 596 611
3 129 596 47
3 129 611 596
3 367 114 611
3 739 96 611
3 739 114 96
3 477 705 47
3 477 596 705
3 177 46 47
3 177 705 46
3 728 78 596
3 728 96 78
3 705 78 46
3 705 596 78
3 120 96 145
3 120 98 96
3 78 98 46
3 78 96 98
3 114 146 96
3 123 145 96
3 123 146 145
3 74 117 46
3 74 98 117
3 90 155 46
3 90 117 155
3 120 148 98
3 120 145 148
3 117 148 155
3 117 98 148
3 586 145 492
3 586 685 145
3 148 685 155
3 148 145 685
3 146 682 145
3 780 492 145
3 780 682 492
3 783 397 155
3 783 685 397
3 635 142 155
3 635 397 142
3 586 313 685
3 586 492 313
3 397 313 142
3 397 685 313
3 624 313 389
3 624 142 313
3 70 313 492
3 70 389 313
3 92 142 624
3 92 295 142
3 721 624 389
3 721 295 624
3 263 492 682
3 263 571 492
3 343 571 682
3 64 389 571
3 64 295 389
3 70 571 389
3 70 492 571
3 508 64 732
3 508 295 64
3 285 64 571
3 285 732 64
3 691 295 508
3 691 45 295
3 417 508 732
3 417 45 508
3 800 571 343
3 800 502 571
3 316 502 343
3 689 732 502
3 689 45 732
3 285 502 732
3 285 571 502
3 225 689 319
3 225 45 689
3 781 689 502
3 781 319 689
3 546 45 225
3 546 44 45
3 592 225 319
3 592 44 225
3 589 502 316
3 589 147 502
3 138 147 316
3 151 319 147
3 151 44 319
3 781 147 319
3 781 502 147
3 409 151 717
3 409 44 151
3 410 151 147
3 410 717 151
3 116 44 409
3 116 547 44
3 257 409 717
3 257 547 409
3 407 147 138
3 407 714 147
3 793 714 138
3 619 717 714
3 619 547 717
3 410 714 717
3 410 147 714
3 190 619 548
3 190 547 619
3 258 619 714
3 258 548 619
3 655 547 190
3 655 43 547
3 104 190 548
3 104 43 190
3 335 714 793
3 335 622 714
3 747 622 793
3 515 548 622
3 515 43 548
3 258 622 548
3 258 714 622
3 384 515 378
3 384 43 515
3 506 515 622
3 506 378 515
3 621 43 384
3 621 144 43
3 254 384 378
3 254 144 384
3 618 622 747
3 618 500 622
3 315 500 747
3 688 378 500
3 688 144 378
3 506 500 378
3 506 622 500
3 311 688 490
3 311 144 688
3 139 688 500
3 139 490 688
3 771 144 311
3 771 42 144
3 133 311 490
3 133 42 311
3 676 500 315
3 676 309 500
3 585 309 315
3 770 490 309
3 770 42 490
3 139 309 490
3 139 500 309
3 745 770 255
3 745 42 770
3 289 770 309
3 289 255 770
3 467 42 745
3 467 41 42
3 233 745 255
3 233 41 745
3 559 309 585
3 559 536 309
3 712 536 585
3 365 255 536
3 365 41 255
3 289 536 255
3 289 309 536
3 439 365 700
3 439 41 365
3 612 365 536
3 612 700 365
3 648 41 439
3 648 119 41
3 778 439 700
3 778 119 439
3 788 536 712
3 788 134 536
3 136 134 712
3 124 700 134
3 124 119 700
3 612 134 700
3 612 536 134
3 72 124 782
3 72 119 124
3 79 124 134
3 79 782 124
3 758 119 72
3 758 40 119
3 741 72 782
3 741 40 72
3 83 134 136
3 83 791 134
3 445 791 136
3 363 782 791
3 363 40 782
3 79 791 782
3 79 134 791
3 664 363 639
3 664 40 363
3 338 363 791
3 338 639 363
3 579 40 664
3 579 497 40
3 210 664 639
3 210 497 664
3 753 791 445
3 753 317 791
3 587 317 445
3 779 639 317
3 779 497 639
3 338 317 639
3 338 791 317
3 368 779 245
3 368 497 779
3 646 779 317
3 646 245 779
3 644 497 368
3 644 39 497
3 580 368 245
3 580 39 368
3 193 317 587
3 193 527 317
3 704 527 587
3 345 245 527
3 345 39 245
3 646 527 245
3 646 317 527
3 750 345 572
3 750 39 345
3 191 345 527
3 191 572 345
3 695 39 750
3 695 38 39
3 237 750 572
3 237 38 750
3 344 527 704
3 344 746 527
3 432 746 704
3 321 572 746
3 321 38 572
3 191 746 572
3 191 527 746
3 179 321 421
3 179 38 321
3 588 321 746
3 588 421 321
3 158 38 179
3 158 121 38
3 276 179 421
3 276 121 179
3 282 746 432
3 282 128 746
3 488 128 432
3 481 421 128
3 481 121 421
3 588 128 421
3 588 746 128
3 613 481 382
3 613 121 481
3 252 481 128
3 252 382 481
3 270 121 613
3 270 649 121
3 523 613 382
3 523 649 613
3 620 128 488
3 620 762 128
3 71 762 488
3 716 382 762
3 716 649 382
3 252 762 382
3 252 128 762
3 457 716 288
3 457 649 716
3 524 716 762
3 524 288 716
3 157 649 457
3 787 457 288
3 569 762 71
3 569 330 762
3 235 330 71
3 8 288 330
3 524 330 288
3 524 762 330
3 211 8 330
3 106 330 235
3 106 718 330
3 794 718 235
3 211 330 718
3 698 375 213
3 698 37 375
3 538 718 794
3 538 293 718
3 570 293 794
3 737 213 293
3 737 37 213
3 446 293 213
3 446 718 293
3 396 737 360
3 396 37 737
3 701 737 293
3 701 360 737
3 416 37 396
3 416 438 37
3 786 396 360
3 786 438 396
3 246 293 570
3 246 654 293
3 765 654 570
3 551 360 654
3 551 438 360
3 701 654 360
3 701 293 654
3 696 551 198
3 696 438 551
3 799 551 654
3 799 198 551
3 215 438 696
3 215 36 438
3 323 696 198
3 323 36 696
3 176 654 765
3 176 300 654
3 581 300 765
3 752 198 300
3 752 36 198
3 799 300 198
3 799 654 300
3 727 752 234
3 727 36 752
3 266 752 300
3 266 234 752
3 67 36 727
3 67 174 36
3 197 727 234
3 197 174 727
3 545 300 581
3 545 516 300
3 693 516 581
3 329 234 516
3 329 174 234
3 266 516 234
3 266 300 516
3 325 329 499
3 325 174 329
3 507 329 516
3 507 499 329
3 404 174 325
3 404 486 174
3 493 325 499
3 493 486 325
3 687 516 693
3 687 7 516
3 218 499 7
3 218 486 499
3 507 7 499
3 507 516 7
3 647 218 69
3 647 486 218
3 370 218 7
3 370 69 218
3 419 486 647
3 419 58 486
3 510 647 69
3 510 58 647
3 366 58 69
3 35 405 379
3 460 405 35
3 243 614 108
3 243 379 614
3 534 379 243
3 534 35 379
3 452 243 108
3 452 35 243
3 221 35 108
3 379 387 362
3 405 387 379
3 394 802 425
3 394 362 802
3 94 802 482
3 94 425 802
3 763 362 394
3 763 379 362
3 784 394 425
3 784 379 394
3 614 379 425
3 362 195 34
3 387 195 362
3 537 280 482
3 537 583 280
3 471 583 34
3 471 280 583
3 226 482 280
3 628 110 34
3 628 583 110
3 764 362 34
3 764 110 362
3 537 802 583
3 537 482 802
3 110 802 362
3 110 583 802
3 34 361 331
3 195 361 34
3 584 306 331
3 694 135 331
3 694 306 135
3 599 34 331
3 599 135 34
3 658 471 306
3 658 280 471
3 135 471 34
3 135 306 471
3 331 204 541
3 361 204 331
3 678 555 81
3 678 541 555
3 707 555 19
3 707 81 555
3 512 541 678
3 512 331 541
3 216 678 81
3 216 331 678
3 584 331 81
3 541 107 33
3 204 107 541
3 549 803 33
3 184 666 33
3 184 803 666
3 111 541 33
3 111 666 541
3 684 555 803
3 684 19 555
3 666 555 541
3 666 803 555
3 33 238 444
3 107 238 33
3 422 130 402
3 422 444 130
3 102 402 130
3 734 444 422
3 734 33 444
3 725 422 402
3 725 33 422
3 549 33 402
3 444 172 32
3 238 172 444
3 697 17 18
3 697 126 17
3 118 126 32
3 118 17 126
3 281 290 32
3 281 126 290
3 354 444 32
3 354 290 444
3 697 130 126
3 697 18 130
3 290 130 444
3 290 126 130
3 32 591 514
3 172 591 32
3 342 521 514
3 165 475 514
3 165 521 475
3 137 32 514
3 137 475 32
3 169 118 521
3 169 17 118
3 475 118 32
3 475 521 118
3 514 663 448
3 591 663 514
3 675 501 170
3 675 448 501
3 723 170 501
3 593 448 675
3 593 514 448
3 326 675 170
3 326 514 675
3 342 514 170
3 448 652 31
3 663 652 448
3 178 279 31
3 167 364 31
3 167 279 364
3 194 448 31
3 194 364 448
3 395 501 279
3 364 501 448
3 364 279 501
3 31 80 265
3 652 80 31
3 715 180 400
3 715 265 180
3 605 400 180
3 733 265 715
3 733 31 265
3 217 715 400
3 217 31 715
3 178 31 400
3 265 661 320
3 80 661 265
3 214 196 320
3 256 227 320
3 256 196 227
3 277 265 320
3 277 227 265
3 140 180 196
3 227 180 265
3 227 196 180
3 320 660 777
3 661 660 320
3 275 352 504
3 275 777 352
3 598 504 352
3 297 777 275
3 297 320 777
3 403 275 504
3 403 320 275
3 214 320 504
3 777 336 30
3 660 336 777
3 112 430 30
3 312 239 30
3 312 430 239
3 577 777 30
3 577 239 777
3 561 352 430
3 239 352 777
3 239 430 352
3 30 458 754
3 336 458 30
3 505 533 248
3 505 754 533
3 283 533 314
3 283 248 533
3 339 754 505
3 339 30 754
3 222 505 248
3 222 30 505
3 112 30 248
3 754 483 662
3 458 483 754
3 392 97 160
3 392 662 97
3 567 97 16
3 567 160 97
3 573 662 392
3 573 754 662
3 437 392 160
3 437 754 392
3 533 160 314
3 533 754 160
3 567 314 160
3 567 16 314
3 662 560 82
3 483 560 662
3 219 186 82
3 143 796 82
3 143 186 796
3 65 662 82
3 65 796 662
3 223 97 186
3 223 16 97
3 796 97 662
3 796 186 97
3 82 740 166
3 560 740 82
3 645 73 406
3 645 166 73
3 575 73 15
3 575 406 73
3 357 166 645
3 357 82 166
3 247 645 406
3 247 82 645
3 219 82 406
3 166 466 202
3 740 466 166
3 303 468 202
3 332 671 202
3 332 468 671
3 66 166 202
3 66 671 166
3 604 73 468
3 604 15 73
3 671 73 166
3 671 468 73
3 202 776 677
3 466 776 202
3 742 299 797
3 742 677 299
3 340 299 641
3 340 797 299
3 101 677 742
3 101 202 677
3 487 742 797
3 487 202 742
3 303 202 797
3 677 125 318
3 776 125 677
3 259 757 212
3 259 318 757
3 711 757 14
3 711 212 757
3 105 318 259
3 105 677 318
3 434 259 212
3 434 677 259
3 299 212 641
3 299 677 212
3 711 641 212
3 711 14 641
3 318 539 29
3 125 539 318
3 292 206 29
3 426 253 29
3 426 206 253
3 449 318 29
3 449 253 318
3 708 757 206
3 708 14 757
3 253 757 318
3 253 206 757
3 29 713 659
3 539 713 29
3 200 93 454
3 200 659 93
3 355 454 93
3 59 659 200
3 59 29 659
3 566 200 454
3 566 29 200
3 292 29 454
3 659 461 308
3 713 461 659
3 199 650 308
3 472 653 308
3 472 650 653
3 476 659 308
3 476 653 659
3 89 93 650
3 653 93 659
3 653 650 93
3 308 436 564
3 461 436 308
3 230 759 623
3 230 564 759
3 411 623 759
3 630 564 230
3 630 308 564
3 95 230 623
3 95 308 230
3 199 308 623
3 436 1 564
3 520 183 359
3 244 359 564
3 563 759 183
3 359 759 564
3 359 183 759
3 5 617 4
3 271 617 5
3 617 60 632
3 181 60 617
3 260 431 632
3 182 531 632
3 182 431 531
3 582 617 632
3 582 531 617
3 722 4 431
3 531 4 617
3 531 431 4
3 632 748 305
3 60 748 632
3 710 562 353
3 710 305 562
3 224 562 13
3 224 353 562
3 665 305 710
3 665 632 305
3 491 710 353
3 491 632 710
3 260 632 353
3 305 261 667
3 748 261 305
3 465 751 667
3 720 528 667
3 720 751 528
3 602 305 667
3 602 528 305
3 795 562 751
3 795 13 562
3 528 562 305
3 528 751 562
3 667 692 273
3 261 692 667
3 594 341 192
3 594 273 341
3 680 341 10
3 680 192 341
3 633 273 594
3 633 667 273
3 420 594 192
3 420 667 594
3 465 667 192
3 273 287 798
3 692 287 273
3 84 374 115
3 84 798 374
3 401 374 709
3 401 115 374
3 543 798 84
3 543 273 798
3 558 84 115
3 558 273 84
3 735 10 709
3 341 115 10
3 341 273 115
3 401 10 115
3 401 709 10
3 798 736 294
3 287 736 798
3 232 77 709
3 232 489 77
3 554 489 294
3 554 77 489
3 550 709 77
3 766 643 294
3 766 489 643
3 459 798 294
3 459 643 798
3 232 374 489
3 232 709 374
3 643 374 798
3 643 489 374
3 294 168 28
3 736 168 294
3 61 27 77
3 61 790 27
3 529 790 28
3 529 27 790
3 22 77 27
3 768 535 28
3 768 790 535
3 640 294 28
3 640 535 294
3 61 554 790
3 61 77 554
3 535 554 294
3 535 790 554
3 28 424 377
3 168 424 28
3 154 68 616
3 154 377 68
3 557 68 12
3 557 616 68
3 0 377 154
3 0 28 377
3 686 154 616
3 686 28 0
3 21 27 12
3 529 616 27
3 529 28 616
3 557 27 616
3 557 12 27
3 377 474 26
3 424 474 377
3 269 209 26
3 412 298 26
3 412 209 298
3 463 377 26
3 463 298 377
3 726 68 209
3 726 12 68
3 298 68 377
3 298 209 68
3 26 415 414
3 474 415 26
3 503 462 574
3 503 414 462
3 544 462 517
3 544 574 462
3 568 414 503
3 568 26 414
3 606 503 574
3 606 26 503
3 269 26 574
3 414 441 418
3 415 441 414
3 484 522 517
3 484 464 522
3 103 464 418
3 103 522 464
3 540 517 522
3 440 435 418
3 440 464 435
3 427 414 418
3 427 435 414
3 484 462 464
3 484 517 462
3 435 462 414
3 435 464 462
3 418 679 25
3 441 679 418
3 681 526 522
3 681 113 526
3 478 113 25
3 478 526 113
3 350 522 526
3 278 274 25
3 278 113 274
3 730 418 25
3 730 274 418
3 681 103 113
3 681 522 103
3 274 103 418
3 274 113 103
3 25 322 24
3 679 322 25
3 161 749 24
3 485 228 24
3 485 749 228
3 595 25 24
3 595 228 25
3 272 478 749
3 272 526 478
3 228 478 25
3 228 749 478
3 24 610 163
3 322 610 24
3 152 3 131
3 152 163 3
3 62 131 3
3 552 163 152
3 552 24 163
3 187 152 131
3 187 24 152
3 161 24 131
3 163 657 673
3 610 657 163
3 469 337 673
3 511 242 673
3 511 337 242
3 91 163 673
3 91 242 163
3 242 3 163
3 242 337 3
3 673 369 380
3 657 369 673
3 127 380 302
3 127 673 380
3 75 302 2
3 75 673 302
3 469 673 2
3 380 460 35
3 369 460 380
3 221 296 35
3 556 719 35
3 556 296 719
3 769 380 35
3 769 719 380
3 460 615 405
3 52 615 460
3 405 51 387
3 615 51 405
3 387 390 195
3 51 390 387
3 195 50 361
3 390 50 195
3 361 49 204
3 50 49 361
3 204 48 107
3 49 48 204
3 107 433 238
3 48 433 107
3 238 47 172
3 433 47 238
3 172 46 591
3 47 46 172
3 591 155 663
3 46 155 591
3 663 142 652
3 155 142 663
3 652 295 80
3 142 295 652
3 80 45 661
3 295 45 80
3 661 44 660
3 45 44 661
3 660 547 336
3 44 547 660
3 336 43 458
3 547 43 336
3 458 144 483
3 43 144 458
3 483 42 560
3 144 42 483
3 560 41 740
3 42 41 560
3 740 119 466
3 41 119 740
3 466 40 776
3 119 40 466
3 776 497 125
3 40 497 776
3 125 39 539
3 497 39 125
3 539 38 713
3 39 38 539
3 713 121 461
3 38 121 713
3 461 649 436
3 121 649 461
3 181 37 60
3 60 438 748
3 37 438 60
3 748 36 261
3 438 36 748
3 261 174 692
3 36 174 261
3 692 486 287
3 174 486 692
3 287 58 736
3 486 58 287
3 736 57 168
3 58 57 736
3 168 56 424
3 57 56 168
3 424 683 474
3 56 683 424
3 474 629 415
3 683 629 474
3 415 55 441
3 629 55 415
3 441 54 679
3 55 54 441
3 679 53 322
3 54 53 679
3 322 85 610
3 53 85 322
3 610 149 657
3 85 149 610
3 657 576 369
3 149 576 657
3 369 52 460
3 576 52 369
