OFF

247 490 0
0.438344 0.019540 0.004931
0.443366 0.015683 0.011699
0.438205 0.014572 0.007444
0.447386 0.024094 -0.002972
0.435594 0.022917 0.009505
0.441999 0.020875 -0.001199
0.442852 0.016391 -0.001959
0.441580 0.017437 0.012266
0.443085 0.015781 -0.002437
0.437417 0.017547 0.012415
0.443983 0.021505 -0.002986
0.438106 0.022046 0.003580
0.446871 0.026894 0.001856
0.447550 0.015623 0.007472
0.438766 0.022301 0.002249
0.441928 0.014987 -0.001253
0.446474 0.026471 0.003385
0.438200 0.014577 0.007452
0.446951 0.021920 0.002881
0.443336 0.015672 0.011726
0.447655 0.022342 -0.003779
0.435697 0.023367 0.007946
0.444974 0.024321 -0.004129
0.435907 0.025198 0.003994
0.437543 0.021813 0.004977
0.440136 0.023876 0.013250
0.444132 0.024804 -0.003952
0.446838 0.026662 0.001829
0.448172 0.020788 -0.003267
0.437668 0.016512 0.010660
0.437804 0.016641 0.009157
0.443162 0.026505 0.010838
0.444242 0.016837 -0.003269
0.444365 0.024141 -0.003807
0.440418 0.025193 -0.001610
0.436724 0.021416 0.007925
0.435438 0.023706 0.007937
0.438569 0.014784 0.005914
0.449037 0.017848 0.000680
0.442064 0.025752 0.011966
0.438523 0.014179 0.005812
0.443280 0.023812 -0.003082
0.438375 0.014280 0.006521
0.444964 0.027464 0.008124
0.443871 0.016515 -0.003040
0.445988 0.015382 0.009615
0.440295 0.015500 0.001632
0.444890 0.023593 0.007293
0.447652 0.022470 -0.003047
0.437927 0.015052 0.008947
0.437080 0.021602 0.006430
0.445963 0.021487 0.005697
0.446093 0.024077 0.004556
0.437054 0.019099 0.012941
0.445620 0.019497 -0.003967
0.446657 0.020468 -0.004517
0.446004 0.026254 0.004899
0.436877 0.025733 0.001692
0.439558 0.013983 0.002681
0.442246 0.023488 -0.002229
0.445046 0.021828 -0.003700
0.442417 0.022728 0.010829
0.439227 0.022751 0.013696
0.446892 0.024469 0.001598
0.440508 0.017111 0.012996
0.438859 0.017190 0.004739
0.442179 0.024850 0.011430
0.438191 0.019338 0.013877
0.436345 0.021130 0.010947
0.446774 0.015505 0.008625
0.441337 0.025727 -0.002702
0.446682 0.022305 -0.004496
0.449068 0.017612 0.001245
0.440410 0.022088 0.012672
0.447404 0.023916 -0.003163
0.443580 0.026818 0.010316
0.447566 0.017152 0.005704
0.440492 0.024350 0.013031
0.441163 0.024521 0.012450
0.446600 0.020349 -0.004496
0.445889 0.023597 -0.004408
0.446585 0.027323 0.003539
0.445323 0.021239 0.007009
0.437177 0.018746 0.012854
0.445295 0.016319 0.009578
0.442691 0.025395 -0.003409
0.439417 0.017420 0.003354
0.449030 0.016945 0.002812
0.444368 0.016006 0.010695
0.449068 0.017043 0.002490
0.440006 0.016962 0.013273
0.445792 0.015399 0.009821
0.441565 0.014715 -0.000791
0.436330 0.021063 0.011979
0.447635 0.015666 0.007310
0.438567 0.021534 0.013824
0.442891 0.020389 0.010482
0.448364 0.020137 -0.002675
0.444471 0.018373 0.009361
0.438337 0.020890 0.013924
0.445538 0.023846 0.005957
0.443787 0.020689 0.009412
0.442172 0.015948 0.012442
0.447251 0.024750 -0.001426
0.441913 0.016077 -0.000855
0.442087 0.015985 0.012486
0.444752 0.025751 0.007753
0.445579 0.027548 0.006781
0.440349 0.022865 -0.000179
0.440449 0.024297 0.013050
0.444607 0.017173 -0.003543
0.438936 0.017868 0.013669
0.444392 0.024710 -0.004028
0.446665 0.019179 0.005610
0.441048 0.014485 -0.000081
0.446898 0.016894 0.007072
0.438204 0.014593 0.007445
0.444883 0.027423 0.008287
0.437705 0.015969 0.010629
0.442177 0.025827 0.011866
0.437889 0.019332 0.006360
0.439044 0.015000 0.004424
0.440324 0.016733 0.013198
0.444151 0.023322 0.008557
0.438900 0.019770 0.003554
0.442602 0.017757 0.011412
0.436466 0.020638 0.012374
0.438045 0.016796 0.007658
0.446156 0.027552 0.005198
0.435429 0.024352 0.006495
0.448004 0.019796 0.001291
0.439858 0.019437 0.013017
0.438322 0.018986 0.013795
0.437659 0.016468 0.011337
0.437777 0.025901 0.000355
0.443570 0.018071 0.010438
0.439146 0.017704 0.013606
0.448987 0.018372 -0.000283
0.441100 0.020574 -0.000138
0.447661 0.019616 0.002774
0.448703 0.019370 -0.001880
0.448590 0.016198 0.004999
0.441804 0.025637 -0.002920
0.438599 0.024572 0.000735
0.439620 0.015239 0.002996
0.446020 0.018928 0.006938
0.439467 0.024875 -0.000486
0.447093 0.026323 0.000218
0.445429 0.026014 0.006361
0.438348 0.021035 0.013924
0.435445 0.024407 0.006317
0.436551 0.023780 0.004877
0.449031 0.018107 0.000102
0.443376 0.015664 0.011706
0.438760 0.019112 0.013613
0.447293 0.022100 0.001415
0.444840 0.017496 -0.003705
0.443982 0.025468 0.009068
0.437539 0.019150 0.007826
0.448276 0.016010 0.005876
0.447236 0.025460 -0.001393
0.444067 0.027035 0.009637
0.437447 0.017345 0.012206
0.444543 0.019171 -0.003249
0.439328 0.021760 0.013410
0.438978 0.013960 0.004204
0.445777 0.018682 -0.004199
0.447055 0.026447 0.000441
0.446504 0.021714 0.004316
0.441059 0.015780 0.000346
0.437685 0.016176 0.011021
0.448237 0.019951 -0.000209
0.447126 0.024623 0.000086
0.440918 0.019760 0.012294
0.440460 0.025922 -0.002200
0.441440 0.025524 -0.002620
0.443122 0.025167 0.010298
0.448130 0.017389 0.004267
0.447211 0.019408 0.004220
0.440012 0.025937 -0.001878
0.442879 0.015648 -0.002255
0.439175 0.022649 0.013710
0.442541 0.018535 -0.001443
0.448729 0.019305 -0.001767
0.447643 0.022376 -0.001560
0.445851 0.018768 -0.004225
0.444638 0.015469 0.010851
0.448949 0.017790 0.001240
0.446031 0.027602 0.005568
0.437905 0.015103 0.009041
0.448209 0.020689 -0.003169
0.438548 0.026024 -0.000594
0.440811 0.017944 0.000788
0.448360 0.020075 -0.001708
0.441261 0.023171 -0.001260
0.446696 0.027238 0.002940
0.441932 0.020077 0.011448
0.441441 0.022412 0.011810
0.437821 0.024288 0.002041
0.443857 0.016716 -0.002955
0.447242 0.025311 -0.001678
0.438197 0.014588 0.007494
0.447608 0.022500 -0.003733
0.445286 0.018659 0.008190
0.444111 0.015490 0.011252
0.442498 0.025485 -0.003317
0.446545 0.024286 0.003093
0.440680 0.016596 0.013083
0.447255 0.024801 -0.002248
0.435865 0.022041 0.010928
0.440069 0.017673 0.002035
0.445698 0.023737 -0.004362
0.435509 0.023299 0.008923
0.435898 0.021957 0.011010
0.448750 0.016427 0.004373
0.438809 0.026003 -0.000851
0.443517 0.018850 -0.002408
0.437132 0.024024 0.003424
0.438400 0.016980 0.006180
0.436513 0.020506 0.012420
0.435727 0.024937 0.004712
0.435525 0.023258 0.008992
0.441638 0.018232 -0.000374
0.437168 0.018870 0.010799
0.436211 0.025378 0.003161
0.439513 0.022575 0.000990
0.439544 0.020020 0.002247
0.439081 0.013924 0.003921
0.440281 0.020288 0.001016
0.440169 0.014066 0.001388
0.446149 0.022153 -0.004284
0.436068 0.023561 0.006391
0.448596 0.017603 0.002772
0.436477 0.021258 0.009432
0.446919 0.026717 0.001293
0.437143 0.018772 0.012285
0.440251 0.014108 0.001229
0.446338 0.019708 -0.004347
0.446748 0.022150 -0.004525
0.447521 0.022252 -0.000073
0.436964 0.025777 0.001530
0.443323 0.023032 0.009739
0.444598 0.020972 0.008253
0.441152 0.024912 0.012641
0.446141 0.016616 0.008368
0.442962 0.021187 -0.002153
0.437299 0.018996 0.009309
3 43 188 107
3 43 161 188
3 161 75 188
3 75 23 188
3 23 240 188
3 75 150 23
3 240 191 188
3 154 67 99
3 154 99 149
3 164 181 62
3 154 149 95
3 164 154 95
3 95 181 164
3 62 25 164
3 73 164 25
3 25 109 73
3 78 73 109
3 78 109 77
3 78 77 243
3 243 39 78
3 78 39 119
3 66 78 119
3 119 31 66
3 176 66 31
3 176 31 75
3 161 117 157
3 106 157 117
3 117 43 106
3 75 161 176
3 157 176 161
3 107 188 148
3 43 107 106
3 148 106 107
3 81 195 16
3 148 188 128
3 56 148 128
3 128 81 56
3 56 81 16
3 234 167 63
3 234 63 27
3 195 12 16
3 27 16 12
3 12 234 27
3 160 200 103
3 63 167 147
3 172 63 147
3 147 160 172
3 172 160 103
3 208 3 184
3 48 184 3
3 3 74 48
3 208 184 103
3 200 208 103
3 202 20 48
3 74 202 48
3 48 20 28
3 97 140 193
3 190 97 193
3 190 193 48
3 48 28 190
3 137 152 171
3 137 171 193
3 183 137 193
3 193 140 183
3 187 72 89
3 187 38 72
3 187 152 38
3 171 152 187
3 214 141 177
3 214 177 232
3 232 87 214
3 232 89 87
3 187 89 232
3 94 13 115
3 94 115 76
3 76 159 94
3 159 76 177
3 177 141 159
3 69 45 244
3 69 244 115
3 115 13 69
3 88 186 204
3 186 88 84
3 84 91 186
3 84 45 91
3 244 45 84
3 1 153 19
3 19 102 1
3 1 102 125
3 1 204 153
3 88 204 1
3 207 122 64
3 207 64 7
3 7 105 207
3 7 102 105
3 125 102 7
3 136 111 154
3 136 154 131
3 64 122 90
3 90 136 64
3 64 136 131
3 154 111 132
3 132 67 154
3 154 164 131
3 131 173 64
3 64 173 7
3 164 73 131
3 131 73 173
3 173 196 7
3 7 196 125
3 73 197 173
3 173 197 196
3 73 78 197
3 125 135 1
3 1 135 88
3 196 96 125
3 125 96 135
3 197 61 196
3 196 61 96
3 78 66 197
3 197 66 61
3 135 98 88
3 88 98 84
3 96 101 135
3 135 101 98
3 61 241 96
3 96 241 101
3 66 176 61
3 61 176 241
3 98 203 84
3 84 203 244
3 101 242 98
3 98 242 203
3 241 123 101
3 101 123 242
3 176 157 241
3 241 157 123
3 203 145 244
3 244 145 115
3 242 82 203
3 203 82 145
3 123 47 242
3 242 47 82
3 157 106 123
3 123 106 47
3 145 113 115
3 115 113 76
3 82 51 145
3 145 51 113
3 47 100 82
3 82 100 51
3 106 148 47
3 47 148 100
3 113 178 76
3 76 178 177
3 51 168 113
3 113 168 178
3 100 52 51
3 51 52 168
3 148 56 100
3 100 56 52
3 178 139 177
3 177 139 232
3 168 18 178
3 178 18 139
3 52 206 168
3 168 206 18
3 56 16 52
3 52 16 206
3 139 130 232
3 232 130 187
3 18 155 139
3 139 155 130
3 206 63 18
3 18 63 155
3 16 27 206
3 206 27 63
3 130 171 187
3 155 239 130
3 130 239 171
3 63 172 155
3 155 172 239
3 239 184 171
3 171 184 193
3 172 103 239
3 239 103 184
3 184 48 193
3 219 149 99
3 149 219 126
3 213 62 181
3 149 126 93
3 93 95 149
3 93 213 181
3 181 95 93
3 25 62 109
3 221 77 109
3 221 109 62
3 62 213 209
3 209 221 62
3 77 221 212
3 212 243 77
3 212 36 39
3 39 243 212
3 39 36 129
3 39 129 150
3 150 119 39
3 31 119 150
3 150 75 31
3 43 117 161
3 188 191 215
3 215 128 188
3 215 195 81
3 81 128 215
3 167 234 142
3 70 142 234
3 195 215 174
3 12 195 174
3 174 70 234
3 234 12 174
3 167 142 205
3 167 205 85
3 85 147 167
3 85 200 160
3 160 147 85
3 74 3 208
3 22 74 208
3 200 85 112
3 112 22 208
3 208 200 112
3 20 202 71
3 202 74 71
3 74 22 80
3 80 71 74
3 20 71 238
3 238 28 20
3 140 97 237
3 28 238 55
3 79 237 97
3 97 190 79
3 28 55 79
3 79 190 28
3 156 152 137
3 140 237 185
3 166 156 137
3 137 183 166
3 140 185 166
3 166 183 140
3 152 156 110
3 32 44 89
3 32 89 72
3 32 72 38
3 152 110 32
3 32 38 152
3 15 141 214
3 89 44 8
3 180 15 214
3 180 214 87
3 89 8 180
3 180 87 89
3 141 15 92
3 114 13 94
3 114 94 159
3 141 92 114
3 114 159 141
3 229 58 45
3 45 69 229
3 13 114 229
3 229 69 13
3 40 204 186
3 45 58 227
3 165 40 186
3 165 186 91
3 45 227 165
3 165 91 45
3 2 201 102
3 42 19 153
3 42 2 102
3 102 19 42
3 204 40 42
3 42 153 204
3 122 207 118
3 102 201 49
3 189 118 207
3 189 207 105
3 102 49 189
3 189 105 102
3 122 118 170
3 111 136 162
3 122 170 133
3 133 90 122
3 133 162 136
3 136 90 133
3 53 219 99
3 99 67 53
3 111 162 9
3 9 132 111
3 132 9 83
3 83 53 67
3 67 132 83
3 235 126 219
3 235 219 53
3 68 209 213
3 93 126 235
3 93 235 68
3 68 213 93
3 68 4 209
3 4 68 233
3 221 4 233
3 221 233 21
3 21 212 221
3 21 129 36
3 21 36 212
3 231 220 150
3 220 231 151
3 151 23 220
3 150 129 21
3 150 21 231
3 151 224 23
3 224 151 217
3 217 57 224
3 57 217 198
3 198 240 57
3 198 134 240
3 134 198 143
3 143 191 134
3 146 179 215
3 179 146 34
3 34 174 179
3 215 191 143
3 215 143 146
3 59 205 142
3 175 59 142
3 142 70 175
3 34 70 174
3 175 70 34
3 41 26 85
3 26 41 33
3 33 112 26
3 85 205 59
3 85 59 41
3 60 211 22
3 211 60 230
3 230 80 211
3 33 60 22
3 22 112 33
3 230 238 71
3 230 71 80
3 238 230 55
3 54 185 237
3 54 237 79
3 230 54 79
3 79 55 230
3 163 110 156
3 54 163 156
3 54 156 166
3 166 185 54
3 8 44 199
3 199 44 32
3 32 110 199
3 199 110 163
3 104 92 15
3 6 104 15
3 6 15 180
3 180 8 6
3 6 8 199
3 46 229 236
3 169 46 236
3 236 114 169
3 104 169 114
3 114 92 104
3 227 58 144
3 46 144 58
3 46 58 229
3 42 40 37
3 121 37 40
3 121 40 165
3 165 227 121
3 121 227 144
3 2 116 17
3 201 17 116
3 49 201 127
3 116 127 201
3 116 2 42
3 116 42 37
3 170 118 29
3 30 29 118
3 30 118 189
3 189 49 30
3 30 49 127
3 235 9 162
3 223 235 162
3 133 170 29
3 29 162 133
3 223 162 29
3 235 53 83
3 83 9 235
3 68 235 223
3 246 223 29
3 246 29 30
3 233 68 223
3 233 223 246
3 158 246 30
3 158 30 127
3 35 233 246
3 35 246 158
3 21 233 35
3 218 127 116
3 218 116 37
3 120 158 127
3 120 127 218
3 50 35 158
3 50 158 120
3 231 21 35
3 231 35 50
3 65 218 37
3 65 37 121
3 0 120 218
3 0 218 65
3 24 50 120
3 24 120 0
3 151 231 50
3 151 50 24
3 86 65 121
3 86 121 144
3 124 0 65
3 124 65 86
3 11 24 0
3 11 0 124
3 217 151 24
3 217 24 11
3 210 86 144
3 210 144 46
3 226 124 86
3 226 86 210
3 14 11 124
3 14 124 226
3 198 217 11
3 198 11 14
3 192 210 46
3 192 46 169
3 228 226 210
3 228 210 192
3 225 14 226
3 225 226 228
3 143 198 14
3 143 14 225
3 222 192 169
3 222 169 104
3 138 228 192
3 138 192 222
3 108 225 228
3 108 228 138
3 146 143 225
3 146 225 108
3 182 222 104
3 182 104 6
3 5 138 222
3 5 222 182
3 194 108 138
3 194 138 5
3 34 146 108
3 34 108 194
3 216 182 6
3 216 6 199
3 245 5 182
3 245 182 216
3 59 194 5
3 59 5 245
3 175 34 194
3 175 194 59
3 163 216 199
3 10 245 216
3 10 216 163
3 41 59 245
3 41 245 10
3 60 10 163
3 60 163 54
3 33 41 10
3 33 10 60
3 230 60 54
3 4 221 209
3 150 220 23
3 23 224 57
3 23 57 240
3 240 134 191
3 174 215 179
3 85 26 112
3 22 211 80
3 114 236 229
3 17 201 2
