OFF
1512 1650 0
0.4511614375 0.1197816971 0.1389556650
-0.0011981810 0.0344598691 0.0042650617
0.4502663963 0.1158968774 0.1444225675
0.4534004691 0.1158397462 0.1339329460
-0.0020932222 0.0305750493 0.0097319642
0.0010408506 0.0305179181 -0.0007576573
-0.4989558661 -0.0584495125 -0.1439481802
0.0438754740 0.0439366431 0.0176804836
0.4142407616 0.0866584064 0.0277362739
0.4141036681 0.0866609055 0.0281951204
0.4594766224 0.0951905701 0.0412053042
0.4593395289 0.0951930692 0.0416641507
-0.4957734408 -0.0704232239 -0.1470514536
-0.4980331825 -0.0703820310 -0.1394881847
0.0470578994 0.0319629316 0.0145772102
0.0447981576 0.0320041245 0.0221404791
0.4624109873 0.1128471689 0.1413029204
0.4618340907 0.1128576852 0.1432337712
0.4434816251 0.1092768065 0.1356666808
0.4429047285 0.1092873227 0.1375975316
0.4531064582 0.1084548081 0.1395984866
0.0007468397 0.0231329801 0.0049078833
-0.3945597190 0.1493307476 -0.1137884506
-0.3945048203 0.1493297468 -0.1139721945
-0.4850313396 0.1322664391 -0.1407264810
-0.4849764409 0.1322654384 -0.1409102249
-0.4966864338 -0.0716656220 -0.1431981419
0.0461449063 0.0307205336 0.0184305219
0.4508674265 0.1123967590 0.1446212056
0.4540014994 0.1123396278 0.1341315841
-0.0014921920 0.0270749310 0.0099306023
0.0016418809 0.0270177998 -0.0005590192
-0.4963436226 -0.0630488063 -0.1498079307
-0.5000000000 -0.0629821539 -0.1375701757
0.0464877175 0.0393373493 0.0118207331
0.0428313401 0.0394040016 0.0240584880
0.4503786905 0.1187176886 0.1422585403
0.4523156646 0.1186823794 0.1357755624
-0.0019809280 0.0333958606 0.0075679369
-0.0000439539 0.0333605514 0.0010849591
0.4507381279 0.1080597334 0.1478028115
0.4556257702 0.1079706362 0.1314440605
0.4591124472 0.1201236098 0.1341212406
0.4551582673 0.1201956908 0.1473557293
0.4474137094 0.1179170519 0.1306379278
0.4434595294 0.1179891329 0.1438724165
0.4432624669 0.1090382593 0.1418911839
0.4461353568 0.1089858892 0.1322757317
0.4593646509 0.1120753734 0.1466856280
0.4622375408 0.1120230033 0.1370701758
0.4608081853 0.1102484265 0.1346816753
0.4568540053 0.1103205075 0.1479161640
0.4491094474 0.1080418686 0.1311983625
0.4451552674 0.1081139496 0.1444328511
0.4503856449 0.1193004673 0.1302528018
0.4457372261 0.1193852036 0.1458108811
0.4425374065 0.1184144118 0.1383868382
0.4436347675 0.1183944079 0.1347140130
0.4586395905 0.1214515259 0.1431812823
0.4597369515 0.1214315221 0.1395084571
0.4565361215 0.1204605397 0.1320841134
0.4518877027 0.1205452760 0.1476421926
0.4605195811 0.1178032578 0.1445157150
0.4620299400 0.1177757253 0.1394606018
0.4415902189 0.1142328953 0.1388794753
0.4431005778 0.1142053629 0.1338243622
0.4586000070 0.1072461722 0.1439996862
0.4601103658 0.1072186398 0.1389445731
0.4469012691 0.1050396143 0.1405163734
0.4484116280 0.1050120819 0.1354612603
0.4613629861 0.1189502367 0.1409565602
0.4607860895 0.1189607530 0.1428874110
0.4424336239 0.1153798743 0.1353203205
0.4418567273 0.1153903905 0.1372511713
-0.4976092985 -0.0597320492 -0.1476581972
-0.4998690402 -0.0596908562 -0.1400949284
0.0452220416 0.0426541063 0.0139704666
0.0429622999 0.0426952993 0.0215337354
0.4497832647 0.1041619686 0.1418656153
0.4515587936 0.1041296023 0.1359229883
0.4559337413 0.1053220410 0.1436969268
0.4577092702 0.1052896747 0.1377542998
0.4495047476 0.1240104520 0.1418409035
0.4513716721 0.1239764197 0.1355923788
0.4461853451 0.1135904906 0.1479766191
0.4519310636 0.1134857516 0.1287459200
0.4606651667 0.1159204499 0.1452194580
0.4625320912 0.1158864177 0.1389709333
0.4551546656 0.1140631877 0.1291668495
0.4491132301 0.1141733174 0.1493873021
0.4521339478 0.1141182526 0.1392770758
0.4417358045 0.1123500875 0.1395832183
0.4436027290 0.1123160552 0.1333346936
-0.3621410169 -0.0394605756 -0.1030741984
-0.3620861182 -0.0394615764 -0.1032579423
0.4620856553 0.1159952943 0.1422402083
0.4555394957 0.1152660801 0.1491981077
0.4604271379 0.1151769830 0.1328393567
-0.4526126375 -0.0565248840 -0.1300122288
-0.4525577388 -0.0565258848 -0.1301959727
0.4458583847 0.1125673293 0.1309372267
0.4423073269 0.1126320618 0.1428224808
0.4619605687 0.1156044434 0.1357316708
0.4584095110 0.1156691759 0.1476169249
-0.4978211500 -0.0650575672 -0.1435731611
0.0450101901 0.0373285883 0.0180555027
0.4523358217 0.1147505630 0.1498079307
0.4580815401 0.1146458240 0.1305772316
0.4438407578 0.1130595222 0.1457147949
0.4487284000 0.1129704251 0.1293560439
-0.0002256707 0.0287964246 0.0045864725
0.4421822403 0.1122412109 0.1363139433
0.4528962236 0.1042600854 0.1429617728
0.4547631481 0.1042260531 0.1367132481
0.4547641392 -0.1493307476 0.0411290892
0.4546270457 -0.1493282485 0.0415879357
0.5000000000 -0.1407985838 0.0545981194
0.4998629065 -0.1407960847 0.0550569659
0.4465576151 0.1229466399 0.1407995509
0.4483331440 0.1229142736 0.1348569239
0.4527080916 0.1241067123 0.1426308625
0.4544836205 0.1240743460 0.1366882354
0.4558562677 0.1232244233 0.1430928913
0.4573666266 0.1231968909 0.1380377782
0.4441575298 0.1210178654 0.1396095785
0.4456678887 0.1209903330 0.1345544653
0.4611673179 0.1140311423 0.1447297894
0.4626776768 0.1140036098 0.1396746763
0.4422379557 0.1104607798 0.1390935498
0.4437483146 0.1104332474 0.1340384366
0.4523791826 0.1076910386 0.1309116581
0.4477307638 0.1077757749 0.1464697373
0.4445309441 0.1068049831 0.1390456945
0.4456283051 0.1067849793 0.1353728693
0.4606331282 0.1098420972 0.1438401385
0.4617304892 0.1098220934 0.1401673134
0.4585296591 0.1088511110 0.1327429696
0.4538812403 0.1089358473 0.1483010489
0.4420303549 0.1162135019 0.1414839758
0.4449032448 0.1161611318 0.1318685236
0.4581325389 0.1192506160 0.1462784199
0.4610054288 0.1191982459 0.1366629677
0.4486421255 0.1202658690 0.1471100911
0.4535297677 0.1201767718 0.1307513400
0.4519522311 0.1095541258 0.1427785892
0.4538892052 0.1095188166 0.1362956113
-0.0004073874 0.0242322977 0.0080879859
0.0015295867 0.0241969885 0.0016050080
-0.4956422999 -0.0671329805 -0.1495761464
-0.4992986774 -0.0670663282 -0.1373383914
0.0471890402 0.0352531750 0.0120525174
0.0435326628 0.0353198274 0.0242902724
-0.4235861782 0.0464029318 -0.1219003397
-0.4688219885 0.0378707776 -0.1353693549
-0.4380994079 -0.0050609761 -0.1259562842
-0.4534606982 0.0164049007 -0.1306628195
-0.4308427931 0.0206709778 -0.1239283119
-0.4462040834 0.0421368547 -0.1286348473
-0.4607173130 -0.0093270532 -0.1326907918
-0.4453560227 -0.0307929301 -0.1279842565
-0.4534606982 0.0164049007 -0.1306628195
-0.4543087589 0.0893346855 -0.1313134103
-0.4769266641 0.0850686083 -0.1380479179
-0.4615653737 0.0636027315 -0.1333413826
-0.4696700493 0.1108005623 -0.1360199456
-0.4389474686 0.0678688086 -0.1266068750
-0.4615653737 0.0636027315 -0.1333413826
-0.4462040834 0.0421368547 -0.1286348473
-0.3928635976 0.0034711781 -0.1124872690
-0.4380994079 -0.0050609761 -0.1259562842
-0.4227381175 -0.0265268530 -0.1212497489
-0.4154815027 -0.0007948990 -0.1192217766
-0.4453560227 -0.0307929301 -0.1279842565
-0.4082248879 0.0249370549 -0.1171938043
-0.4308427931 0.0206709778 -0.1239283119
-0.4154815027 -0.0007948990 -0.1192217766
-0.4073768272 -0.0479927298 -0.1165432136
-0.4001202124 -0.0222607759 -0.1145152413
-0.3847589221 -0.0437266527 -0.1098087060
-0.3775023072 -0.0179946988 -0.1077807337
-0.4227381175 -0.0265268530 -0.1212497489
-0.4299947323 -0.0522588069 -0.1232777212
-0.4001202124 -0.0222607759 -0.1145152413
-0.4235861782 0.0464029318 -0.1219003397
-0.3783503680 0.0549350860 -0.1084313245
-0.4090729486 0.0978668397 -0.1178443951
-0.4163295634 0.0721348857 -0.1198723674
-0.4009682731 0.0506690089 -0.1151658321
-0.3937116583 0.0764009628 -0.1131378598
-0.3864550435 0.1021329168 -0.1111098875
-0.4018163338 0.1235987936 -0.1158164228
-0.3937116583 0.0764009628 -0.1131378598
-0.3928635976 0.0034711781 -0.1124872690
-0.3702456924 0.0077372552 -0.1057527614
-0.3856069828 0.0292031320 -0.1104592967
-0.3775023072 -0.0179946988 -0.1077807337
-0.4082248879 0.0249370549 -0.1171938043
-0.3856069828 0.0292031320 -0.1104592967
-0.4009682731 0.0506690089 -0.1151658321
-0.4543087589 0.0893346855 -0.1313134103
-0.4090729486 0.0978668397 -0.1178443951
-0.4244342390 0.1193327165 -0.1225509304
-0.4316908538 0.0936007626 -0.1245789027
-0.4018163338 0.1235987936 -0.1158164228
-0.4163295634 0.0721348857 -0.1198723674
-0.4316908538 0.0936007626 -0.1245789027
-0.4389474686 0.0678688086 -0.1266068750
-0.4397955293 0.1407985934 -0.1272574658
-0.4470521441 0.1150666394 -0.1292854380
-0.4624134344 0.1365325162 -0.1339919734
-0.4696700493 0.1108005623 -0.1360199456
-0.4244342390 0.1193327165 -0.1225509304
-0.4171776242 0.1450646705 -0.1205229582
-0.4470521441 0.1150666394 -0.1292854380
-0.4235312795 0.0464019310 -0.1220840836
-0.4380445091 -0.0050619769 -0.1261400281
-0.3928086989 0.0034701773 -0.1126710129
-0.4000653137 -0.0222617766 -0.1146989852
-0.4154266040 -0.0007958998 -0.1194055205
-0.3774474085 -0.0179956995 -0.1079644776
-0.4081699892 0.0249360542 -0.1173775482
-0.4154266040 -0.0007958998 -0.1194055205
-0.4307878943 0.0206699771 -0.1241120558
-0.4073219285 -0.0479937306 -0.1167269575
-0.4226832188 -0.0265278537 -0.1214334928
-0.4299398336 -0.0522598077 -0.1234614651
-0.4453011240 -0.0307939308 -0.1281680004
-0.4000653137 -0.0222617766 -0.1146989852
-0.3847040233 -0.0437276535 -0.1099924499
-0.4226832188 -0.0265278537 -0.1214334928
-0.4687670898 0.0378697768 -0.1355530988
-0.4542538602 0.0893336847 -0.1314971542
-0.4615104750 0.0636017308 -0.1335251265
-0.4388925699 0.0678678079 -0.1267906189
-0.4461491847 0.0421358539 -0.1288185912
-0.4768717653 0.0850676076 -0.1382316618
-0.4696151505 0.1107995615 -0.1362036895
-0.4615104750 0.0636017308 -0.1335251265
-0.4380445091 -0.0050619769 -0.1261400281
-0.4606624143 -0.0093280540 -0.1328745357
-0.4534057995 0.0164039000 -0.1308465635
-0.4453011240 -0.0307939308 -0.1281680004
-0.4307878943 0.0206699771 -0.1241120558
-0.4534057995 0.0164039000 -0.1308465635
-0.4461491847 0.0421358539 -0.1288185912
-0.4235312795 0.0464019310 -0.1220840836
-0.4090180499 0.0978658389 -0.1180281390
-0.4542538602 0.0893336847 -0.1314971542
-0.4469972454 0.1150656387 -0.1294691819
-0.4316359551 0.0935997618 -0.1247626466
-0.4696151505 0.1107995615 -0.1362036895
-0.4162746647 0.0721338850 -0.1200561113
-0.4388925699 0.0678678079 -0.1267906189
-0.4316359551 0.0935997618 -0.1247626466
-0.4397406306 0.1407975926 -0.1274412097
-0.4243793402 0.1193317158 -0.1227346743
-0.4171227254 0.1450636697 -0.1207067021
-0.4017614351 0.1235977929 -0.1160001667
-0.4469972454 0.1150656387 -0.1294691819
-0.4623585357 0.1365315155 -0.1341757173
-0.4243793402 0.1193317158 -0.1227346743
-0.3782954692 0.0549340852 -0.1086150684
-0.3928086989 0.0034701773 -0.1126710129
-0.4081699892 0.0249360542 -0.1173775482
-0.4009133744 0.0506680081 -0.1153495760
-0.3855520840 0.0292021313 -0.1106430406
-0.3701907937 0.0077362544 -0.1059365053
-0.3774474085 -0.0179956995 -0.1079644776
-0.3855520840 0.0292021313 -0.1106430406
-0.4090180499 0.0978658389 -0.1180281390
-0.3864001448 0.1021319160 -0.1112936314
-0.3936567596 0.0763999621 -0.1133216037
-0.4017614351 0.1235977929 -0.1160001667
-0.4162746647 0.0721338850 -0.1200561113
-0.3936567596 0.0763999621 -0.1133216037
-0.4009133744 0.0506680081 -0.1153495760
-0.2268669122 -0.0078977031 -0.0649888568
-0.2275401960 -0.0072564347 -0.0631338483
-0.0908224353 0.0173782016 -0.0255091951
-0.2268669122 -0.0078977031 -0.0649888568
-0.2261936284 -0.0085389714 -0.0668438653
-0.3629113892 -0.0331736078 -0.1044685185
-0.2255607905 -0.0101973500 -0.0679187321
-0.2261936284 -0.0085389714 -0.0668438653
-0.0895365365 0.0145699996 -0.0280489995
-0.2255607905 -0.0101973500 -0.0679187321
-0.2249279525 -0.0118557285 -0.0689935988
-0.3615850445 -0.0349646996 -0.1077884647
-0.2245772912 -0.0138978156 -0.0688777066
-0.2249279525 -0.0118557285 -0.0689935988
-0.0886941255 0.0106776797 -0.0284125946
-0.2245772912 -0.0138978156 -0.0688777066
-0.2242266299 -0.0159399027 -0.0687618145
-0.3604604569 -0.0384733109 -0.1093428187
-0.2242922003 -0.0175850245 -0.0674994681
-0.2242266299 -0.0159399027 -0.0687618145
-0.0886171505 0.0071889536 -0.0264611289
-0.2242922003 -0.0175850245 -0.0674994681
-0.2243577707 -0.0192301462 -0.0662371217
-0.3599672501 -0.0423590025 -0.1085378072
-0.2248142672 -0.0198513452 -0.0643104658
-0.2243577707 -0.0192301462 -0.0662371217
-0.0893346805 0.0054345942 -0.0229399720
-0.2248142672 -0.0198513452 -0.0643104658
-0.2252707638 -0.0204725442 -0.0623838100
-0.3602938540 -0.0451372846 -0.1056809597
-0.2259441381 -0.0198307487 -0.0605288314
-0.2252707638 -0.0204725442 -0.0623838100
-0.0905729902 0.0060866879 -0.0191941762
-0.2259441381 -0.0198307487 -0.0605288314
-0.2266175124 -0.0191889532 -0.0586738528
-0.3613152860 -0.0457481853 -0.1018634866
-0.2272502599 -0.0175311018 -0.0575989562
-0.2266175124 -0.0191889532 -0.0586738528
-0.0918587986 0.0088943628 -0.0166543419
-0.2272502599 -0.0175311018 -0.0575989562
-0.2278830073 -0.0158732504 -0.0565240595
-0.3626417212 -0.0439565664 -0.0985435704
-0.2282336686 -0.0138311633 -0.0566399517
-0.2278830073 -0.0158732504 -0.0565240595
-0.0927011643 0.0127864192 -0.0162907318
-0.2282336686 -0.0138311633 -0.0566399517
-0.2285843299 -0.0117890762 -0.0567558439
-0.3637661730 -0.0404487457 -0.0969891715
-0.2285188500 -0.0101434273 -0.0580182202
-0.2285843299 -0.0117890762 -0.0567558439
-0.0927782751 0.0162759360 -0.0182422424
-0.2285188500 -0.0101434273 -0.0580182202
-0.2284533702 -0.0084977785 -0.0592805965
-0.3642594250 -0.0365627906 -0.0977941980
-0.2279967831 -0.0078771066 -0.0612072224
-0.2284533702 -0.0084977785 -0.0592805965
-0.0920606545 0.0180297682 -0.0217633694
-0.2279967831 -0.0078771066 -0.0612072224
-0.2275401960 -0.0072564347 -0.0631338483
-0.3639329117 -0.0337839814 -0.1006510754
0.2255587418 0.0765711242 0.0700203120
0.2249816282 0.0771207831 0.0716103633
0.3389372032 0.0976267518 0.1028979372
0.2255587418 0.0765711242 0.0700203120
0.2261358553 0.0760214654 0.0684302608
0.1121802804 0.0555154967 0.0371426869
0.2266782576 0.0746001488 0.0675089525
0.2261358553 0.0760214654 0.0684302608
0.3400393634 0.0952199475 0.1007209492
0.2266782576 0.0746001488 0.0675089525
0.2272206599 0.0731788321 0.0665876443
0.1133171518 0.0539803501 0.0342969558
0.2275211750 0.0714287730 0.0666869634
0.2272206599 0.0731788321 0.0665876443
0.3407613372 0.0918842004 0.1004092737
0.2275211750 0.0714287730 0.0666869634
0.2278216901 0.0696787138 0.0667862824
0.1142810128 0.0509733456 0.0329646530
0.2277655430 0.0682683082 0.0678682960
0.2278216901 0.0696787138 0.0667862824
0.3408273741 0.0888935624 0.1020819537
0.2277655430 0.0682683082 0.0678682960
0.2277093959 0.0668579025 0.0689503097
0.1147037120 0.0476430540 0.0336546384
0.2273180224 0.0663258983 0.0706017473
0.2277093959 0.0668579025 0.0689503097
0.3402122403 0.0873903532 0.1051001170
0.2273180224 0.0663258983 0.0706017473
0.2269266490 0.0657938941 0.0722531850
0.1144238046 0.0452614434 0.0361033777
0.2263495354 0.0663435529 0.0738432362
0.2269266490 0.0657938941 0.0722531850
0.3391508833 0.0879488393 0.1083109127
0.2263495354 0.0663435529 0.0738432362
0.2257724219 0.0668932118 0.0754332875
0.1135481876 0.0447382665 0.0393755598
0.2252300196 0.0683145284 0.0763545957
0.2257724219 0.0668932118 0.0754332875
0.3380487231 0.0903556437 0.1104879007
0.2252300196 0.0683145284 0.0763545957
0.2246876173 0.0697358450 0.0772759040
0.1124113161 0.0462734131 0.0422212908
0.2243871022 0.0714859042 0.0771765849
0.2246876173 0.0697358450 0.0772759040
0.3373267492 0.0936913908 0.1107995762
0.2243871022 0.0714859042 0.0771765849
0.2240865871 0.0732359634 0.0770772659
0.1114474551 0.0492804176 0.0435535936
0.2241427342 0.0746463690 0.0759952522
0.2240865871 0.0732359634 0.0770772659
0.3372607123 0.0966820288 0.1091268962
0.2241427342 0.0746463690 0.0759952522
0.2241988813 0.0760567746 0.0749132386
0.1110247560 0.0526107092 0.0428636082
0.2245902547 0.0765887788 0.0732618010
0.2241988813 0.0760567746 0.0749132386
0.3378758461 0.0981852380 0.1061087330
0.2245902547 0.0765887788 0.0732618010
0.2249816282 0.0771207831 0.0716103633
0.1113046634 0.0549923197 0.0404148690
0.4569832873 -0.0270675896 0.0416260432
0.4343653569 -0.0313336715 0.0348915281
0.4558051665 -0.0881979191 0.0416069894
0.4450852617 -0.0597657953 0.0382492587
0.4563942269 -0.0576327543 0.0416165163
0.4510342745 -0.0434166925 0.0399376510
0.4444962013 -0.0903309600 0.0382397319
0.4552161061 -0.1187630838 0.0415974626
0.4450852617 -0.0597657953 0.0382492587
0.4355434777 0.0297966579 0.0349105818
0.4242345125 0.0276636170 0.0315433243
0.4349544173 -0.0007685068 0.0349010549
0.4248235729 0.0582287817 0.0315528511
0.4349544173 -0.0007685068 0.0349010549
0.4459688523 -0.0139180482 0.0382635491
0.4462633825 0.0013645341 0.0382683125
0.4784230969 -0.0839318372 0.0483415046
0.4558051665 -0.0881979191 0.0416069894
0.4665250713 -0.1166300428 0.0449647201
0.4724740841 -0.1002809400 0.0466531123
0.4552161061 -0.1187630838 0.0415974626
0.4677031921 -0.0554997134 0.0449837739
0.4563942269 -0.0576327543 0.0416165163
0.4617541793 -0.0718488162 0.0432953817
0.4665250713 -0.1166300428 0.0449647201
0.4772449761 -0.1450621666 0.0483224508
0.4831939889 -0.1287130638 0.0500108430
0.4605760585 -0.1329791457 0.0432763279
0.4891430017 -0.1123639610 0.0516992352
0.4724740841 -0.1002809400 0.0466531123
0.4831939889 -0.1287130638 0.0500108430
0.4569832873 -0.0270675896 0.0416260432
0.4796012177 -0.0228015078 0.0483605583
0.4581614081 0.0340627398 0.0416450969
0.4688813129 0.0056306160 0.0450028276
0.4575723477 0.0034975751 0.0416355701
0.4629323001 -0.0107184868 0.0433144354
0.4694703733 0.0361957807 0.0450123545
0.4587504685 0.0646279045 0.0416546238
0.4688813129 0.0056306160 0.0450028276
0.4784230969 -0.0839318372 0.0483415046
0.4897320621 -0.0817987962 0.0517087621
0.4790121573 -0.0533666725 0.0483510314
0.4891430017 -0.1123639610 0.0516992352
0.4677031921 -0.0554997134 0.0449837739
0.4790121573 -0.0533666725 0.0483510314
0.4736522049 -0.0391506106 0.0466721661
0.4581614081 0.0340627398 0.0416450969
0.4361325381 0.0603618226 0.0349201087
0.4587504685 0.0646279045 0.0416546238
0.4477360335 0.0777774459 0.0382921297
0.4471469731 0.0472122812 0.0382826028
0.4367215985 0.0909269873 0.0349296356
0.4251181031 0.0735113641 0.0315576146
0.4477360335 0.0777774459 0.0382921297
0.4355434777 0.0297966579 0.0349105818
0.4575723477 0.0034975751 0.0416355701
0.4465579127 0.0166471165 0.0382730759
0.4462633825 0.0013645341 0.0382683125
0.4361325381 0.0603618226 0.0349201087
0.4248235729 0.0582287817 0.0315528511
0.4471469731 0.0472122812 0.0382826028
0.4571203808 -0.0270700887 0.0411671967
0.4785601904 -0.0839343363 0.0478826580
0.4666621648 -0.1166325419 0.0445058736
0.4892800952 -0.1123664600 0.0512403887
0.4833310824 -0.1287155629 0.0495519965
0.4726111776 -0.1002834391 0.0461942658
0.4773820696 -0.1450646657 0.0478636043
0.4607131520 -0.1329816447 0.0428174814
0.4833310824 -0.1287155629 0.0495519965
0.4559422600 -0.0882004181 0.0411481429
0.4678402856 -0.0555022125 0.0445249273
0.4618912728 -0.0718513153 0.0428365351
0.4565313204 -0.0576352534 0.0411576698
0.4666621648 -0.1166325419 0.0445058736
0.4553531996 -0.1187655829 0.0411386160
0.4726111776 -0.1002834391 0.0461942658
0.4345024504 -0.0313361706 0.0344326815
0.4356805712 0.0297941588 0.0344517353
0.4350915108 -0.0007710059 0.0344422084
0.4464004760 0.0013620351 0.0378094660
0.4461059458 -0.0139205473 0.0378047025
0.4243716060 0.0276611179 0.0310844777
0.4249606664 0.0582262826 0.0310940046
0.4350915108 -0.0007710059 0.0344422084
0.4559422600 -0.0882004181 0.0411481429
0.4446332948 -0.0903334591 0.0377808853
0.4452223552 -0.0597682944 0.0377904122
0.4553531996 -0.1187655829 0.0411386160
0.4452223552 -0.0597682944 0.0377904122
0.4511713680 -0.0434191915 0.0394788044
0.4565313204 -0.0576352534 0.0411576698
0.4571203808 -0.0270700887 0.0411671967
0.4582985016 0.0340602407 0.0411862504
0.4356805712 0.0297941588 0.0344517353
0.4362696316 0.0603593236 0.0344612622
0.4472840666 0.0472097821 0.0378237563
0.4249606664 0.0582262826 0.0310940046
0.4577094412 0.0034950760 0.0411767235
0.4464004760 0.0013620351 0.0378094660
0.4466950062 0.0166446174 0.0378142294
0.4362696316 0.0603593236 0.0344612622
0.4368586920 0.0909244883 0.0344707890
0.4478731270 0.0777749468 0.0378332832
0.4252551966 0.0735088650 0.0310987680
0.4588875620 0.0646254054 0.0411957773
0.4472840666 0.0472097821 0.0378237563
0.4478731270 0.0777749468 0.0378332832
0.4797383112 -0.0228040068 0.0479017118
0.4785601904 -0.0839343363 0.0478826580
0.4791492508 -0.0533691716 0.0478921849
0.4678402856 -0.0555022125 0.0445249273
0.4681348158 -0.0402196301 0.0445296908
0.4898691556 -0.0818012953 0.0512499156
0.4892800952 -0.1123664600 0.0512403887
0.4791492508 -0.0533691716 0.0478921849
0.4582985016 0.0340602407 0.0411862504
0.4696074668 0.0361932816 0.0445535080
0.4690184064 0.0056281169 0.0445439811
0.4588875620 0.0646254054 0.0411957773
0.4577094412 0.0034950760 0.0411767235
0.4690184064 0.0056281169 0.0445439811
0.4687238762 -0.0096544654 0.0445392177
-0.4385234382 0.0314039162 -0.1262815796
-0.4344711005 0.0078050008 -0.1249422981
-0.4611413434 0.0271378391 -0.1330160872
-0.4385234382 0.0314039162 -0.1262815796
-0.4530366678 -0.0200599917 -0.1303375242
-0.4566649752 -0.0329259686 -0.1313515103
-0.4647696508 0.0142718622 -0.1340300733
-0.4570890056 0.0035389237 -0.1316768057
-0.4692460189 0.0743356699 -0.1356946502
-0.4728743263 0.0614696930 -0.1367086364
-0.4809790018 0.1086675237 -0.1393871994
-0.4732983567 0.0979345853 -0.1370339318
-0.4538847286 0.0528697931 -0.1309881149
-0.4579370663 0.0764687085 -0.1323273964
-0.4312668234 0.0571358702 -0.1242536073
-0.4538847286 0.0528697931 -0.1309881149
-0.4304187627 -0.0157939146 -0.1236030166
-0.4078008576 -0.0115278374 -0.1168685090
-0.4376753775 -0.0415258685 -0.1256309888
-0.4304187627 -0.0157939146 -0.1236030166
-0.4231621479 0.0099380394 -0.1215750443
-0.4272144857 0.0335369548 -0.1229143258
-0.4118531953 0.0120710780 -0.1182077905
-0.4231621479 0.0099380394 -0.1215750443
-0.3811306146 -0.0308606757 -0.1087947198
-0.3924395672 -0.0329937143 -0.1121619736
-0.3964919050 -0.0093947989 -0.1135012552
-0.3811306146 -0.0308606757 -0.1087947198
-0.4263664249 -0.0393928299 -0.1222637350
-0.4376753775 -0.0415258685 -0.1256309888
-0.4078008576 -0.0115278374 -0.1168685090
-0.4037485198 -0.0351267528 -0.1155292274
-0.3973399657 0.0635349859 -0.1141518459
-0.4086489183 0.0614019473 -0.1175190997
-0.4127012560 0.0850008627 -0.1188583812
-0.3973399657 0.0635349859 -0.1141518459
-0.3941356887 0.1128658552 -0.1134631552
-0.3905073813 0.1257318322 -0.1124491690
-0.3824027057 0.0785340014 -0.1097706060
-0.3900833509 0.0892669398 -0.1121238736
-0.3779263376 0.0184701936 -0.1081060291
-0.3742980302 0.0313361706 -0.1070920429
-0.3661933547 -0.0158616602 -0.1044134799
-0.3738739998 -0.0051287218 -0.1067667476
-0.3932876279 0.0399360705 -0.1128125644
-0.4005442427 0.0142041165 -0.1148405367
-0.4045965805 0.0378030319 -0.1161798182
-0.3932876279 0.0399360705 -0.1128125644
-0.4280625464 0.1064667395 -0.1235649166
-0.4393714989 0.1043337010 -0.1269321704
-0.4094969790 0.1343317320 -0.1181696905
-0.4167535938 0.1085997781 -0.1201976628
-0.4353191612 0.0807347856 -0.1255928888
-0.4240102086 0.0828678241 -0.1222256350
-0.4312668234 0.0571358702 -0.1242536073
-0.4353191612 0.0807347856 -0.1255928888
-0.4660417418 0.1236665393 -0.1350059595
-0.4434238367 0.1279326164 -0.1282714519
-0.4619894041 0.1000676239 -0.1336666780
-0.4660417418 0.1236665393 -0.1350059595
-0.4208059316 0.1321986935 -0.1215369443
-0.4094969790 0.1343317320 -0.1181696905
-0.4393714989 0.1043337010 -0.1269321704
-0.4434238367 0.1279326164 -0.1282714519
-0.4077459588 -0.0115288382 -0.1170522529
-0.4190549114 -0.0136618767 -0.1204195067
-0.3810757159 -0.0308616765 -0.1089784637
-0.3964370063 -0.0093957996 -0.1136849991
-0.4231072492 0.0099370386 -0.1217587882
-0.4117982966 0.0120700772 -0.1183915344
-0.4271595869 0.0335359540 -0.1230980697
-0.4231072492 0.0099370386 -0.1217587882
-0.4376204788 -0.0415268693 -0.1258147327
-0.4150025736 -0.0372607921 -0.1190802251
-0.4416728165 -0.0179279539 -0.1271540143
-0.4376204788 -0.0415268693 -0.1258147327
-0.3923846685 -0.0329947150 -0.1123457175
-0.3810757159 -0.0308616765 -0.1089784637
-0.4190549114 -0.0136618767 -0.1204195067
-0.4150025736 -0.0372607921 -0.1190802251
-0.4425208773 0.0550018309 -0.1278046050
-0.4465732150 0.0786007463 -0.1291438866
-0.4651387824 0.0507357538 -0.1345391126
-0.4425208773 0.0550018309 -0.1278046050
-0.4732434579 0.0979335846 -0.1372176757
-0.4809241031 0.1086665230 -0.1395709433
-0.4728194276 0.0614686922 -0.1368923803
-0.4691911202 0.0743346692 -0.1358783942
-0.4570341069 0.0035379230 -0.1318605496
-0.4647147521 0.0142708614 -0.1342138173
-0.4566100765 -0.0329269694 -0.1315352542
-0.4529817691 -0.0200609924 -0.1305212681
-0.4497774921 0.0292698769 -0.1298325773
-0.4457251543 0.0056709615 -0.1284932958
-0.4271595869 0.0335359540 -0.1230980697
-0.4497774921 0.0292698769 -0.1298325773
-0.4506255528 0.1021996617 -0.1304831681
-0.4280076476 0.1064657388 -0.1237486605
-0.4659868431 0.1236655385 -0.1351897034
-0.4506255528 0.1021996617 -0.1304831681
-0.4352642625 0.0807337848 -0.1257766328
-0.4312119247 0.0571348694 -0.1244373512
-0.4239553099 0.0828668234 -0.1224093790
-0.4352642625 0.0807337848 -0.1257766328
-0.4094420803 0.1343307313 -0.1183534344
-0.4207510328 0.1321976927 -0.1217206882
-0.4166986951 0.1085987773 -0.1203814067
-0.4094420803 0.1343307313 -0.1183534344
-0.4546778906 0.1257985771 -0.1318224496
-0.4659868431 0.1236655385 -0.1351897034
-0.4280076476 0.1064657388 -0.1237486605
-0.4320599854 0.1300646542 -0.1250879420
-0.3932327292 0.0399350697 -0.1129963083
-0.4045416818 0.0378020312 -0.1163635621
-0.4004893440 0.0142031158 -0.1150242806
-0.3932327292 0.0399350697 -0.1129963083
-0.3738191011 -0.0051297225 -0.1069504915
-0.3661384560 -0.0158626610 -0.1045972238
-0.3742431315 0.0313351698 -0.1072757868
-0.3778714389 0.0184691929 -0.1082897730
-0.3900284522 0.0892659391 -0.1123076176
-0.3823478070 0.0785330006 -0.1099543499
-0.3904524825 0.1257308314 -0.1126329129
-0.3940807899 0.1128648544 -0.1136468991
-0.3972850670 0.0635339851 -0.1143355898
-0.4126463573 0.0849998619 -0.1190421252
-0.4085940196 0.0614009465 -0.1177028436
-0.3972850670 0.0635339851 -0.1143355898
-0.0914957191 0.0180194700 -0.0236541866
-0.3629113892 -0.0331736078 -0.1044685185
-0.0914957191 0.0180194700 -0.0236541866
-0.0234734806 0.0306574223 -0.0039143558
-0.3622381054 -0.0338148761 -0.1063235270
-0.0908224353 0.0173782016 -0.0255091951
-0.3622381054 -0.0338148761 -0.1063235270
-0.4302603438 -0.0464528285 -0.1260633579
-0.0901693744 0.0162283782 -0.0269741328
-0.3615850445 -0.0349646996 -0.1077884647
-0.0901693744 0.0162283782 -0.0269741328
-0.0221572474 0.0286120530 -0.0070392665
-0.3609522065 -0.0366230781 -0.1088633314
-0.0895365365 0.0145699996 -0.0280489995
-0.3609522065 -0.0366230781 -0.1088633314
-0.4289643335 -0.0490067529 -0.1287981977
-0.0890447868 0.0127197668 -0.0285284868
-0.3604604569 -0.0384733109 -0.1093428187
-0.0890447868 0.0127197668 -0.0285284868
-0.0211032040 0.0250075145 -0.0082959308
-0.3601097956 -0.0405153981 -0.1092269265
-0.0886941255 0.0106776797 -0.0284125946
-0.3601097956 -0.0405153981 -0.1092269265
-0.4280513784 -0.0528031457 -0.1294594825
-0.0885515801 0.0088340753 -0.0277234753
-0.3599672501 -0.0423590025 -0.1085378072
-0.0885515801 0.0088340753 -0.0277234753
-0.0207140551 0.0212210643 -0.0072043057
-0.3600328205 -0.0440041242 -0.1072754608
-0.0886171505 0.0071889536 -0.0264611289
-0.3600328205 -0.0440041242 -0.1072754608
-0.4278703454 -0.0563911132 -0.1277946304
-0.0888781839 0.0060557932 -0.0248666278
-0.3602938540 -0.0451372846 -0.1056809597
-0.0888781839 0.0060557932 -0.0248666278
-0.0211383906 0.0186987629 -0.0041813809
-0.3607503505 -0.0457584836 -0.1037543039
-0.0893346805 0.0054345942 -0.0229399720
-0.3607503505 -0.0457584836 -0.1037543039
-0.4284901439 -0.0584014533 -0.1244395508
-0.0898996159 0.0054448924 -0.0210491548
-0.3613152860 -0.0457481853 -0.1018634866
-0.0898996159 0.0054448924 -0.0210491548
-0.0222140420 0.0184036107 -0.0003818271
-0.3619886603 -0.0451063898 -0.1000085081
-0.0905729902 0.0060866879 -0.0191941762
-0.3619886603 -0.0451063898 -0.1000085081
-0.4296742342 -0.0580651082 -0.1206758357
-0.0912260511 0.0072365114 -0.0177292385
-0.3626417212 -0.0439565664 -0.0985435704
-0.0912260511 0.0072365114 -0.0177292385
-0.0235303205 0.0204492437 0.0027430686
-0.3632744686 -0.0422987150 -0.0974686738
-0.0918587986 0.0088943628 -0.0166543419
-0.3632744686 -0.0422987150 -0.0974686738
-0.4309701993 -0.0555114473 -0.1179409809
-0.0923505029 0.0107443320 -0.0161748396
-0.3637661730 -0.0404487457 -0.0969891715
-0.0923505029 0.0107443320 -0.0161748396
-0.0245842508 0.0240531233 0.0039997703
-0.3641168343 -0.0384066586 -0.0971050637
-0.0927011643 0.0127864192 -0.0162907318
-0.3641168343 -0.0384066586 -0.0971050637
-0.4318830865 -0.0517154498 -0.1172796736
-0.0928437550 0.0146302871 -0.0169798661
-0.3642594250 -0.0365627906 -0.0977941980
-0.0928437550 0.0146302871 -0.0169798661
-0.0249734675 0.0278399688 0.0029081228
-0.3641939451 -0.0349171418 -0.0990565743
-0.0927782751 0.0162759360 -0.0182422424
-0.3641939451 -0.0349171418 -0.0990565743
-0.4320642326 -0.0481268234 -0.1189445632
-0.0925172416 0.0174090964 -0.0198367435
-0.3639329117 -0.0337839814 -0.1006510754
-0.0925172416 0.0174090964 -0.0198367435
-0.0245491773 0.0303625338 -0.0001148170
-0.3634763246 -0.0331633095 -0.1025777013
-0.0920606545 0.0180297682 -0.0217633694
-0.3634763246 -0.0331633095 -0.1025777013
-0.4314443889 -0.0461167469 -0.1222996278
0.3383600896 0.0981764107 0.1044879885
0.1121802804 0.0555154967 0.0371426869
0.3383600896 0.0981764107 0.1044879885
0.3950493203 0.1087042245 0.1209268011
0.1127573939 0.0549658378 0.0355526356
0.3389372032 0.0976267518 0.1028979372
0.1127573939 0.0549658378 0.0355526356
0.0560681632 0.0444380240 0.0191138230
0.3394969611 0.0966412641 0.1016422575
0.1133171518 0.0539803501 0.0342969558
0.3394969611 0.0966412641 0.1016422575
0.3961775140 0.1069511634 0.1182482558
0.1138595541 0.0525590334 0.0333756476
0.3400393634 0.0952199475 0.1007209492
0.1138595541 0.0525590334 0.0333756476
0.0571790012 0.0422491341 0.0167696492
0.3404608221 0.0936342596 0.1003099547
0.1142810128 0.0509733456 0.0329646530
0.3404608221 0.0936342596 0.1003099547
0.3970809032 0.1038619733 0.1171711098
0.1145815279 0.0492232864 0.0330639721
0.3407613372 0.0918842004 0.1004092737
0.1145815279 0.0492232864 0.0330639721
0.0579614469 0.0389955727 0.0162028169
0.3408835212 0.0903039680 0.1009999401
0.1147037120 0.0476430540 0.0336546384
0.3408835212 0.0903039680 0.1009999401
0.3974144367 0.1006165951 0.1181067689
0.1146475649 0.0462326483 0.0347366520
0.3408273741 0.0888935624 0.1020819537
0.1146475649 0.0462326483 0.0347366520
0.0581166493 0.0359200213 0.0176298232
0.3406036138 0.0879223574 0.1034486793
0.1144238046 0.0452614434 0.0361033777
0.3406036138 0.0879223574 0.1034486793
0.3970507228 0.0984545849 0.1206978641
0.1140324311 0.0447294392 0.0377548153
0.3402122403 0.0873903532 0.1051001170
0.1140324311 0.0447294392 0.0377548153
0.0575853221 0.0341972117 0.0205056305
0.3397279968 0.0873991805 0.1067208614
0.1135481876 0.0447382665 0.0393755598
0.3397279968 0.0873991805 0.1067208614
0.3961286707 0.0982018237 0.1239546997
0.1129710740 0.0452879253 0.0409656111
0.3391508833 0.0879488393 0.1083109127
0.1129710740 0.0452879253 0.0409656111
0.0565704001 0.0344852821 0.0237317728
0.3385911254 0.0889343271 0.1095665925
0.1124113161 0.0462734131 0.0422212908
0.3385911254 0.0889343271 0.1095665925
0.3950004771 0.0999548847 0.1266332449
0.1118689138 0.0476947297 0.0431425990
0.3380487231 0.0903556437 0.1104879007
0.1118689138 0.0476947297 0.0431425990
0.0554595621 0.0366741720 0.0260759466
0.3376272644 0.0919413316 0.1108988953
0.1114474551 0.0492804176 0.0435535936
0.3376272644 0.0919413316 0.1108988953
0.3940970879 0.1030440749 0.1277103909
0.1111469400 0.0510304768 0.0434542746
0.3373267492 0.0936913908 0.1107995762
0.1111469400 0.0510304768 0.0434542746
0.0546771165 0.0399277335 0.0266427789
0.3372045652 0.0952716232 0.1102089099
0.1110247560 0.0526107092 0.0428636082
0.3372045652 0.0952716232 0.1102089099
0.3937635543 0.1062894531 0.1267747319
0.1110809031 0.0540211148 0.0417815946
0.3372607123 0.0966820288 0.1091268962
0.1110809031 0.0540211148 0.0417815946
0.0545219140 0.0430032849 0.0252157726
0.3374844726 0.0976532337 0.1077601706
0.1113046634 0.0549923197 0.0404148690
0.3374844726 0.0976532337 0.1077601706
0.3941272683 0.1084514633 0.1241836366
0.1116960369 0.0555243240 0.0387634313
0.3378758461 0.0981852380 0.1061087330
0.1116960369 0.0555243240 0.0387634313
0.0550532412 0.0447260944 0.0223399653
0.4510342745 -0.0434166925 0.0399376510
0.4504452141 -0.0739818572 0.0399281241
0.4456743221 -0.0292006306 0.0382587856
0.4397253093 -0.0455497334 0.0365703934
0.4555106363 -0.1034805014 0.0416022260
0.4495616235 -0.1198296042 0.0399138338
0.4394307791 -0.0608323157 0.0365656300
0.4504452141 -0.0739818572 0.0399281241
0.4352489475 0.0145140756 0.0349058184
0.4292999347 -0.0018350273 0.0332174262
0.4191690903 0.0571622612 0.0298692224
0.4301835253 0.0440127198 0.0332317165
0.4346598871 -0.0160510891 0.0348962915
0.4456743221 -0.0292006306 0.0382587856
0.4352489475 0.0145140756 0.0349058184
0.4459688523 -0.0139180482 0.0382635491
0.4671141317 -0.0860648781 0.0449742470
0.4611651189 -0.1024139809 0.0432858548
0.4605760585 -0.1329791457 0.0432763279
0.4555106363 -0.1034805014 0.0416022260
0.4617541793 -0.0718488162 0.0432953817
0.4623432397 -0.0412836515 0.0433049085
0.4671141317 -0.0860648781 0.0449742470
0.4730631445 -0.0697157753 0.0466626392
0.4718850237 -0.1308461047 0.0466435855
0.4885539413 -0.1429291257 0.0516897084
0.4659360109 -0.1471952075 0.0449551932
0.4718850237 -0.1308461047 0.0466435855
0.4778340365 -0.1144970019 0.0483319777
0.4837830493 -0.0981478991 0.0500203699
0.4945029541 -0.1265800229 0.0533781006
0.4778340365 -0.1144970019 0.0483319777
0.4629323001 -0.0107184868 0.0433144354
0.4578668779 0.0187801574 0.0416403335
0.4682922525 -0.0249345487 0.0449933007
0.4742412653 -0.0085854459 0.0466816930
0.4641104209 0.0504118426 0.0433334892
0.4644049511 0.0656944250 0.0433382526
0.4745357955 0.0066971365 0.0466864564
0.4691758431 0.0209131984 0.0450075911
0.4843721097 -0.0675827344 0.0500298968
0.4846666399 -0.0523001520 0.0500346602
0.4947974843 -0.1112974405 0.0533828640
0.4894375319 -0.0970813786 0.0517039987
0.4736522049 -0.0391506106 0.0466721661
0.4787176271 -0.0686492548 0.0483462680
0.4682922525 -0.0249345487 0.0449933007
0.4623432397 -0.0412836515 0.0433049085
0.4474415033 0.0624948636 0.0382873663
0.4590449987 0.0799104869 0.0416593873
0.4584559383 0.0493453222 0.0416498604
0.4474415033 0.0624948636 0.0382873663
0.4364270683 0.0756444050 0.0349248721
0.4254126333 0.0887939464 0.0315623780
0.4480305637 0.0930600283 0.0382968931
0.4364270683 0.0756444050 0.0349248721
0.4578668779 0.0187801574 0.0416403335
0.4468524429 0.0319296989 0.0382778394
0.4572778175 -0.0117850073 0.0416308066
0.4465579127 0.0166471165 0.0382730759
0.4301835253 0.0440127198 0.0332317165
0.4251181031 0.0735113641 0.0315576146
0.4358380079 0.0450792403 0.0349153453
0.4468524429 0.0319296989 0.0382778394
0.4779711300 -0.1144995010 0.0478731312
0.4946400476 -0.1265825219 0.0529192541
0.4839201428 -0.0981503982 0.0495615234
0.4779711300 -0.1144995010 0.0478731312
0.4720221172 -0.1308486038 0.0461847389
0.4660731044 -0.1471977066 0.0444963467
0.4886910348 -0.1429316248 0.0512308618
0.4720221172 -0.1308486038 0.0461847389
0.4732002380 -0.0697182744 0.0462037927
0.4672512252 -0.0860673772 0.0445154005
0.4624803332 -0.0412861506 0.0428460620
0.4618912728 -0.0718513153 0.0428365351
0.4556477298 -0.1034830005 0.0411433795
0.4607131520 -0.1329816447 0.0428174814
0.4613022124 -0.1024164800 0.0428270083
0.4672512252 -0.0860673772 0.0445154005
0.4461059458 -0.0139205473 0.0378047025
0.4353860410 0.0145115765 0.0344469719
0.4458114156 -0.0292031297 0.0377999391
0.4347969806 -0.0160535882 0.0344374450
0.4303206188 0.0440102207 0.0327728700
0.4193061838 0.0571597621 0.0294103758
0.4294370282 -0.0018375263 0.0327585796
0.4353860410 0.0145115765 0.0344469719
0.4505823076 -0.0739843563 0.0394692776
0.4395678726 -0.0608348148 0.0361067834
0.4496987170 -0.1198321033 0.0394549873
0.4556477298 -0.1034830005 0.0411433795
0.4398624028 -0.0455522325 0.0361115469
0.4458114156 -0.0292031297 0.0377999391
0.4505823076 -0.0739843563 0.0394692776
0.4511713680 -0.0434191915 0.0394788044
0.4469895364 0.0319271998 0.0378189929
0.4359751014 0.0450767412 0.0344564987
0.4252551966 0.0735088650 0.0310987680
0.4303206188 0.0440102207 0.0327728700
0.4466950062 0.0166446174 0.0378142294
0.4574149110 -0.0117875064 0.0411719601
0.4469895364 0.0319271998 0.0378189929
0.4580039714 0.0187776584 0.0411814870
0.4365641618 0.0756419059 0.0344660256
0.4481676572 0.0930575292 0.0378380466
0.4255497268 0.0887914473 0.0311035315
0.4365641618 0.0756419059 0.0344660256
0.4475785968 0.0624923645 0.0378285197
0.4585930318 0.0493428231 0.0411910139
0.4591820922 0.0799079878 0.0412005407
0.4475785968 0.0624923645 0.0378285197
0.4681348158 -0.0402196301 0.0445296908
0.4732002380 -0.0697182744 0.0462037927
0.4684293460 -0.0249370478 0.0445344542
0.4794437810 -0.0380865892 0.0478969483
0.4895746254 -0.0970838777 0.0512451522
0.4949345778 -0.1112999396 0.0529240175
0.4848037334 -0.0523026511 0.0495758137
0.4845092032 -0.0675852334 0.0495710503
0.4693129366 0.0209106993 0.0445487445
0.4746728890 0.0066946374 0.0462276099
0.4645420446 0.0656919259 0.0428794061
0.4642475144 0.0504093435 0.0428746426
0.4687238762 -0.0096544654 0.0445392177
0.4636584540 0.0198441788 0.0428651158
0.4684293460 -0.0249370478 0.0445344542
0.4574149110 -0.0117875064 0.0411719601
-0.4421517456 0.0185379393 -0.1272955657
-0.4272144857 0.0335369548 -0.1229143258
-0.4421517456 0.0185379393 -0.1272955657
-0.4457800530 0.0056719623 -0.1283095519
-0.4498323908 0.0292708777 -0.1296488334
-0.4575130360 0.0400038161 -0.1320021011
-0.4348951308 0.0442698932 -0.1252675935
-0.4498323908 0.0292708777 -0.1296488334
-0.4417277153 -0.0179269531 -0.1269702704
-0.4494083604 -0.0071940147 -0.1293235380
-0.4489843301 -0.0436589071 -0.1289982426
-0.4530366678 -0.0200599917 -0.1303375242
-0.4570890056 0.0035389237 -0.1316768057
-0.4611413434 0.0271378391 -0.1330160872
-0.4494083604 -0.0071940147 -0.1293235380
-0.4457800530 0.0056719623 -0.1283095519
-0.4579370663 0.0764687085 -0.1323273964
-0.4656177115 0.0872016469 -0.1346806641
-0.4651936811 0.0507367545 -0.1343553687
-0.4692460189 0.0743356699 -0.1356946502
-0.4732983567 0.0979345853 -0.1370339318
-0.4773506944 0.1215335007 -0.1383732133
-0.4656177115 0.0872016469 -0.1346806641
-0.4619894041 0.1000676239 -0.1336666780
-0.4502564212 0.0657357701 -0.1299741288
-0.4651936811 0.0507367545 -0.1343553687
-0.4502564212 0.0657357701 -0.1299741288
-0.4466281137 0.0786017470 -0.1289601426
-0.4425757760 0.0550028316 -0.1276208611
-0.4348951308 0.0442698932 -0.1252675935
-0.4575130360 0.0400038161 -0.1320021011
-0.4425757760 0.0550028316 -0.1276208611
-0.4191098101 -0.0136608760 -0.1202357628
-0.4267904553 -0.0029279376 -0.1225890304
-0.4041725501 0.0013381395 -0.1158545228
-0.4191098101 -0.0136608760 -0.1202357628
-0.4340470701 -0.0286598915 -0.1246170027
-0.4489843301 -0.0436589071 -0.1289982426
-0.4417277153 -0.0179269531 -0.1269702704
-0.4340470701 -0.0286598915 -0.1246170027
-0.4195338405 0.0228040164 -0.1205610581
-0.4344711005 0.0078050008 -0.1249422981
-0.4195338405 0.0228040164 -0.1205610581
-0.4159055331 0.0356699933 -0.1195470720
-0.4041725501 0.0013381395 -0.1158545228
-0.4005442427 0.0142041165 -0.1148405367
-0.4267904553 -0.0029279376 -0.1225890304
-0.4118531953 0.0120710780 -0.1182077905
-0.3924395672 -0.0329937143 -0.1121619736
-0.3734499695 -0.0415936142 -0.1064414522
-0.4037485198 -0.0351267528 -0.1155292274
-0.3960678746 -0.0458596913 -0.1131759598
-0.3888112598 -0.0201277373 -0.1111479875
-0.3851829524 -0.0072617603 -0.1101340014
-0.3698216621 -0.0287276372 -0.1054274660
-0.3888112598 -0.0201277373 -0.1111479875
-0.4186857798 -0.0501257684 -0.1199104674
-0.4150574724 -0.0372597914 -0.1188964812
-0.4413036849 -0.0543918455 -0.1266449750
-0.4263664249 -0.0393928299 -0.1222637350
-0.4114291650 -0.0243938144 -0.1178824951
-0.3964919050 -0.0093947989 -0.1135012552
-0.4114291650 -0.0243938144 -0.1178824951
-0.4150574724 -0.0372597914 -0.1188964812
-0.4086489183 0.0614019473 -0.1175190997
-0.3896593205 0.0528020474 -0.1117985783
-0.4199578708 0.0592689087 -0.1208863535
-0.4122772257 0.0485359703 -0.1185330859
-0.4050206109 0.0742679243 -0.1165051136
-0.4013923035 0.0871339012 -0.1154911274
-0.3860310131 0.0656680244 -0.1107845921
-0.4050206109 0.0742679243 -0.1165051136
-0.4054446412 0.1107328166 -0.1168304090
-0.3977639961 0.0999998782 -0.1144771413
-0.3981880264 0.1364647706 -0.1148024367
-0.3941356887 0.1128658552 -0.1134631552
-0.3900833509 0.0892669398 -0.1121238736
-0.3860310131 0.0656680244 -0.1107845921
-0.3977639961 0.0999998782 -0.1144771413
-0.4013923035 0.0871339012 -0.1154911274
-0.3892352902 0.0163371551 -0.1114732829
-0.3815546450 0.0056042166 -0.1091200152
-0.3819786754 0.0420691090 -0.1094453106
-0.3779263376 0.0184701936 -0.1081060291
-0.3738739998 -0.0051287218 -0.1067667476
-0.3698216621 -0.0287276372 -0.1054274660
-0.3815546450 0.0056042166 -0.1091200152
-0.3851829524 -0.0072617603 -0.1101340014
-0.3969159353 0.0270700935 -0.1138265505
-0.3819786754 0.0420691090 -0.1094453106
-0.3892352902 0.0163371551 -0.1114732829
-0.3969159353 0.0270700935 -0.1138265505
-0.4122772257 0.0485359703 -0.1185330859
-0.4159055331 0.0356699933 -0.1195470720
-0.3896593205 0.0528020474 -0.1117985783
-0.4045965805 0.0378030319 -0.1161798182
-0.4203819012 0.0957338011 -0.1212116489
-0.4167535938 0.1085997781 -0.1201976628
-0.4429998063 0.0914677240 -0.1279461565
-0.4280625464 0.1064667395 -0.1235649166
-0.4131252864 0.1214657551 -0.1191836766
-0.3981880264 0.1364647706 -0.1148024367
-0.4054446412 0.1107328166 -0.1168304090
-0.4131252864 0.1214657551 -0.1191836766
-0.4240102086 0.0828678241 -0.1222256350
-0.4429998063 0.0914677240 -0.1279461565
-0.4127012560 0.0850008627 -0.1188583812
-0.4203819012 0.0957338011 -0.1212116489
-0.4199578708 0.0592689087 -0.1208863535
-0.4276385160 0.0700018472 -0.1232396212
-0.4466281137 0.0786017470 -0.1289601426
-0.4276385160 0.0700018472 -0.1232396212
-0.4547327893 0.1257995778 -0.1316387057
-0.4737223870 0.1343994777 -0.1373592272
-0.4511044819 0.1386655548 -0.1306247196
-0.4547327893 0.1257995778 -0.1316387057
-0.4506804515 0.1022006624 -0.1302994242
-0.4583610967 0.1129336009 -0.1326526918
-0.4773506944 0.1215335007 -0.1383732133
-0.4583610967 0.1129336009 -0.1326526918
-0.4284865767 0.1429316319 -0.1238902120
-0.4321148841 0.1300656549 -0.1249041981
-0.4058686716 0.1471977090 -0.1171557044
-0.4208059316 0.1321986935 -0.1215369443
-0.4357431915 0.1171996780 -0.1259181842
-0.4506804515 0.1022006624 -0.1302994242
-0.4357431915 0.1171996780 -0.1259181842
-0.4321148841 0.1300656549 -0.1249041981
-0.4041176514 0.0013371388 -0.1160382667
-0.3964370063 -0.0093957996 -0.1136849991
-0.4267355566 -0.0029289383 -0.1227727743
-0.4077459588 -0.0115288382 -0.1170522529
-0.3887563611 -0.0201287381 -0.1113317314
-0.3697667634 -0.0287286379 -0.1056112099
-0.3851280537 -0.0072627611 -0.1103177453
-0.3887563611 -0.0201287381 -0.1113317314
-0.4117982966 0.0120700772 -0.1183915344
-0.4267355566 -0.0029289383 -0.1227727743
-0.4004893440 0.0142031158 -0.1150242806
-0.4041176514 0.0013371388 -0.1160382667
-0.4158506344 0.0356689926 -0.1197308159
-0.4194789418 0.0228030156 -0.1207448020
-0.4344162017 0.0078040001 -0.1251260420
-0.4194789418 0.0228030156 -0.1207448020
-0.4263115262 -0.0393938307 -0.1224474789
-0.4412487862 -0.0543928462 -0.1268287189
-0.4186308810 -0.0501267691 -0.1200942113
-0.4263115262 -0.0393938307 -0.1224474789
-0.4303638640 -0.0157949153 -0.1237867605
-0.4339921714 -0.0286608923 -0.1248007466
-0.4489294314 -0.0436599078 -0.1291819865
-0.4339921714 -0.0286608923 -0.1248007466
-0.3960129759 -0.0458606920 -0.1133597037
-0.4036936211 -0.0351277536 -0.1157129713
-0.3733950708 -0.0415946149 -0.1066251961
-0.3923846685 -0.0329947150 -0.1123457175
-0.4113742662 -0.0243948152 -0.1180662390
-0.4303638640 -0.0157949153 -0.1237867605
-0.4113742662 -0.0243948152 -0.1180662390
-0.4036936211 -0.0351277536 -0.1157129713
-0.4502015224 0.0657347693 -0.1301578727
-0.4312119247 0.0571348694 -0.1244373512
-0.4502015224 0.0657347693 -0.1301578727
-0.4578821676 0.0764677077 -0.1325111404
-0.4538298298 0.0528687923 -0.1311718588
-0.4574581372 0.0400028154 -0.1321858450
-0.4348402321 0.0442688925 -0.1254513374
-0.4538298298 0.0528687923 -0.1311718588
-0.4619345054 0.1000666231 -0.1338504219
-0.4655628128 0.0872006461 -0.1348644080
-0.4772957957 0.1215325000 -0.1385569572
-0.4732434579 0.0979335846 -0.1372176757
-0.4691911202 0.0743346692 -0.1358783942
-0.4651387824 0.0507357538 -0.1345391126
-0.4655628128 0.0872006461 -0.1348644080
-0.4578821676 0.0764677077 -0.1325111404
-0.4457251543 0.0056709615 -0.1284932958
-0.4493534617 -0.0071950154 -0.1295072819
-0.4610864446 0.0271368384 -0.1331998311
-0.4570341069 0.0035379230 -0.1318605496
-0.4529817691 -0.0200609924 -0.1305212681
-0.4489294314 -0.0436599078 -0.1291819865
-0.4493534617 -0.0071950154 -0.1295072819
-0.4416728165 -0.0179279539 -0.1271540143
-0.4420968469 0.0185369385 -0.1274793097
-0.4610864446 0.0271368384 -0.1331998311
-0.4420968469 0.0185369385 -0.1274793097
-0.4344162017 0.0078040001 -0.1251260420
-0.4384685395 0.0314029155 -0.1264653235
-0.4348402321 0.0442688925 -0.1254513374
-0.4574581372 0.0400028154 -0.1321858450
-0.4384685395 0.0314029155 -0.1264653235
-0.4393166002 0.1043327002 -0.1271159143
-0.4429449076 0.0914667233 -0.1281299004
-0.4203270025 0.0957328004 -0.1213953928
-0.4393166002 0.1043327002 -0.1271159143
-0.4583061980 0.1129326001 -0.1328364357
-0.4772957957 0.1215325000 -0.1385569572
-0.4619345054 0.1000666231 -0.1338504219
-0.4583061980 0.1129326001 -0.1328364357
-0.4275836173 0.0700008464 -0.1234233651
-0.4465732150 0.0786007463 -0.1291438866
-0.4275836173 0.0700008464 -0.1234233651
-0.4199029721 0.0592679080 -0.1210700974
-0.4203270025 0.0957328004 -0.1213953928
-0.4126463573 0.0849998619 -0.1190421252
-0.4429449076 0.0914667233 -0.1281299004
-0.4239553099 0.0828668234 -0.1224093790
-0.4207510328 0.1321976927 -0.1217206882
-0.4058137729 0.1471967083 -0.1173394483
-0.4320599854 0.1300646542 -0.1250879420
-0.4284316780 0.1429306312 -0.1240739559
-0.4130703877 0.1214647543 -0.1193674205
-0.4053897425 0.1107318159 -0.1170141529
-0.3981331277 0.1364637698 -0.1149861806
-0.4130703877 0.1214647543 -0.1193674205
-0.4510495832 0.1386645540 -0.1308084635
-0.4433689380 0.1279316156 -0.1284551958
-0.4736674883 0.1343984769 -0.1375429711
-0.4546778906 0.1257985771 -0.1318224496
-0.4356882928 0.1171986772 -0.1261019281
-0.4166986951 0.1085987773 -0.1203814067
-0.4356882928 0.1171986772 -0.1261019281
-0.4433689380 0.1279316156 -0.1284551958
-0.4045416818 0.0378020312 -0.1163635621
-0.3896044218 0.0528010467 -0.1119823222
-0.4158506344 0.0356689926 -0.1197308159
-0.4122223270 0.0485349696 -0.1187168298
-0.3968610366 0.0270690927 -0.1140102944
-0.3891803915 0.0163361543 -0.1116570268
-0.3819237766 0.0420681083 -0.1096290545
-0.3968610366 0.0270690927 -0.1140102944
-0.3851280537 -0.0072627611 -0.1103177453
-0.3814997463 0.0056032159 -0.1093037591
-0.3697667634 -0.0287286379 -0.1056112099
-0.3738191011 -0.0051297225 -0.1069504915
-0.3778714389 0.0184691929 -0.1082897730
-0.3819237766 0.0420681083 -0.1096290545
-0.3814997463 0.0056032159 -0.1093037591
-0.3891803915 0.0163361543 -0.1116570268
-0.4013374047 0.0871329005 -0.1156748714
-0.3977090973 0.0999988775 -0.1146608852
-0.3859761144 0.0656670237 -0.1109683360
-0.3900284522 0.0892659391 -0.1123076176
-0.3940807899 0.1128648544 -0.1136468991
-0.3981331277 0.1364637698 -0.1149861806
-0.3977090973 0.0999988775 -0.1146608852
-0.4053897425 0.1107318159 -0.1170141529
-0.4049657121 0.0742669235 -0.1166888575
-0.3859761144 0.0656670237 -0.1109683360
-0.4013374047 0.0871329005 -0.1156748714
-0.4049657121 0.0742669235 -0.1166888575
-0.4122223270 0.0485349696 -0.1187168298
-0.4199029721 0.0592679080 -0.1210700974
-0.3896044218 0.0528010467 -0.1119823222
-0.4085940196 0.0614009465 -0.1177028436
-0.1595179576 0.0053815177 -0.0433940175
-0.0918323610 0.0183401042 -0.0227266824
-0.3632480311 -0.0328529736 -0.1035410143
-0.2948891507 -0.0205356554 -0.0847286877
-0.0234734806 0.0306574223 -0.0039143558
-0.1591813157 0.0050608835 -0.0443215217
0.0108742805 0.0366557643 0.0050280554
-0.0228001968 0.0300161540 -0.0057693643
-0.2942158669 -0.0211769238 -0.0865836962
-0.3619014635 -0.0341355103 -0.1072510313
-0.0904857934 0.0170575674 -0.0264366994
-0.1588446738 0.0047402493 -0.0452490260
-0.4302603438 -0.0464528285 -0.1260633579
-0.2945525088 -0.0208562896 -0.0856561919
-0.4646081050 -0.0524511705 -0.1350057691
-0.4309336276 -0.0458115601 -0.1242083494
-0.1581815014 0.0038447034 -0.0469089991
-0.0904857934 0.0170575674 -0.0264366994
-0.3619014635 -0.0341355103 -0.1072510313
-0.2935729175 -0.0225810248 -0.0878535984
-0.0221572474 0.0286120530 -0.0070392665
-0.1578650824 0.0030155141 -0.0474464324
0.0121652351 0.0339747011 0.0023907333
-0.0215244095 0.0269536745 -0.0081141332
-0.2929400795 -0.0242394033 -0.0889284651
-0.3606357875 -0.0374522674 -0.1094007648
-0.0892201175 0.0137408104 -0.0285864329
-0.1575486635 0.0021863248 -0.0479838658
-0.4289643335 -0.0490067529 -0.1287981977
-0.2932564985 -0.0234102140 -0.0883910317
-0.4632868160 -0.0543694011 -0.1382281975
-0.4295971715 -0.0473483744 -0.1277233309
-0.1569863697 0.0004320192 -0.0487610428
-0.0892201175 0.0137408104 -0.0285864329
-0.3606357875 -0.0374522674 -0.1094007648
-0.2925188740 -0.0261855633 -0.0891102627
-0.0211032040 0.0250075145 -0.0082959308
-0.1568110390 -0.0005890244 -0.0487030967
0.0130429181 0.0301303448 0.0018782933
-0.0207525427 0.0229654274 -0.0081800386
-0.2921682127 -0.0282276504 -0.0889943705
-0.3599344649 -0.0415364416 -0.1091689804
-0.0885187949 0.0096566361 -0.0283546485
-0.1566357084 -0.0016100680 -0.0486451506
-0.4280513784 -0.0528031457 -0.1294594825
-0.2923435434 -0.0272066068 -0.0890523166
-0.4621975005 -0.0579259760 -0.1396337066
-0.4284020397 -0.0507610586 -0.1295753747
-0.1563891050 -0.0035529137 -0.0482426449
-0.0885187949 0.0096566361 -0.0283546485
-0.3599344649 -0.0415364416 -0.1091689804
-0.2921297252 -0.0299720135 -0.0880186376
-0.0207140551 0.0212210643 -0.0072043057
-0.1564218902 -0.0043754746 -0.0476114717
0.0131719221 0.0265919979 0.0036864522
-0.0207796256 0.0195759426 -0.0059419593
-0.2921952956 -0.0316171352 -0.0867562912
-0.3600656057 -0.0448266851 -0.1066442876
-0.0886499357 0.0063663927 -0.0258299557
-0.1564546754 -0.0051980355 -0.0469802985
-0.4278703454 -0.0563911132 -0.1277946304
-0.2921625104 -0.0307945743 -0.0873874644
-0.4617563227 -0.0617620469 -0.1386853884
-0.4278047750 -0.0547459915 -0.1290569768
-0.1566179773 -0.0065871765 -0.0455518747
-0.0886499357 0.0063663927 -0.0258299557
-0.3600656057 -0.0448266851 -0.1066442876
-0.2925540606 -0.0324943149 -0.0849957128
-0.0211383906 0.0186987629 -0.0041813809
-0.1568462256 -0.0068977760 -0.0445885468
0.0125032579 0.0247096482 0.0071245705
-0.0215948871 0.0180775639 -0.0022547250
-0.2930105572 -0.0331155139 -0.0830690569
-0.3609785988 -0.0460690831 -0.1027909759
-0.0895629288 0.0051239947 -0.0219766440
-0.1570744739 -0.0072083755 -0.0436252189
-0.4284901439 -0.0584014533 -0.1244395508
-0.2927823089 -0.0328049144 -0.0840323848
-0.4621317923 -0.0644123386 -0.1357455022
-0.4280336474 -0.0577802543 -0.1263662066
-0.1575851899 -0.0075138259 -0.0417164824
-0.0895629288 0.0051239947 -0.0219766440
-0.3609785988 -0.0460690831 -0.1027909759
-0.2936297120 -0.0327894670 -0.0811961590
-0.0222140420 0.0184036107 -0.0003818271
-0.1579218770 -0.0071929281 -0.0407889931
0.0112920578 0.0252038676 0.0108793260
-0.0228874163 0.0190454062 0.0014731515
-0.2943030864 -0.0321476715 -0.0793411804
-0.3623253475 -0.0447854921 -0.0990810188
-0.0909096774 0.0064075857 -0.0182666869
-0.1582585642 -0.0068720304 -0.0398615038
-0.4296742342 -0.0580651082 -0.1206758357
-0.2939663992 -0.0324685693 -0.0802686697
-0.4631803340 -0.0648653651 -0.1319369888
-0.4290008599 -0.0587069037 -0.1225308143
-0.1589217818 -0.0059762209 -0.0382015457
-0.0909096774 0.0064075857 -0.0182666869
-0.3623253475 -0.0447854921 -0.0990810188
-0.2949459905 -0.0307438341 -0.0780712633
-0.0235303205 0.0204492437 0.0027430686
-0.1592381555 -0.0051472952 -0.0376640974
0.0100011711 0.0278845355 0.0135166705
-0.0241630679 0.0221070951 0.0038179652
-0.2955787380 -0.0290859827 -0.0769963666
-0.3635908423 -0.0414697893 -0.0969312255
-0.0921751723 0.0097232885 -0.0161168936
-0.1595545292 -0.0043183695 -0.0371266490
-0.4309701993 -0.0555114473 -0.1179409809
-0.2952623642 -0.0299149084 -0.0775338150
-0.4645016909 -0.0629467391 -0.1287145828
-0.4303374518 -0.0571692987 -0.1190158776
-0.1601167551 -0.0025644592 -0.0363494496
-0.0921751723 0.0097232885 -0.0161168936
-0.3635908423 -0.0414697893 -0.0969312255
-0.2959999208 -0.0271399545 -0.0768145616
-0.0245842508 0.0240531233 0.0039997703
-0.1602920858 -0.0015434156 -0.0364073957
0.0091235447 0.0317285624 0.0140291292
-0.0249349121 0.0260952104 0.0038838781
-0.2963505821 -0.0250978674 -0.0769304538
-0.3642921650 -0.0373856150 -0.0971630098
-0.0928764949 0.0138074627 -0.0163486779
-0.1604674164 -0.0005223721 -0.0364653418
-0.4318830865 -0.0517154498 -0.1172796736
-0.2961752515 -0.0261189109 -0.0768725077
-0.4655908819 -0.0593908890 -0.1273090325
-0.4315324252 -0.0537575369 -0.1171637815
-0.1607140425 0.0014206055 -0.0368678550
-0.0928764949 0.0138074627 -0.0163486779
-0.3642921650 -0.0373856150 -0.0971630098
-0.2963891375 -0.0233531090 -0.0779062091
-0.0249734675 0.0278399688 0.0029081228
-0.1606813025 0.0022434299 -0.0374990431
0.0089944162 0.0352676340 0.0122209291
-0.0249079876 0.0294856176 0.0016457465
-0.2963236576 -0.0217074601 -0.0791685854
-0.3641612052 -0.0340943173 -0.0996877624
-0.0927455351 0.0170987604 -0.0188734305
-0.1606485626 0.0030662543 -0.0381302313
-0.4320642326 -0.0481268234 -0.1189445632
-0.2963563976 -0.0225302845 -0.0785373972
-0.4660321163 -0.0555544887 -0.1282573695
-0.4321297125 -0.0497724723 -0.1176821869
-0.1604853059 0.0044556589 -0.0395586700
-0.0927455351 0.0170987604 -0.0188734305
-0.3641612052 -0.0340943173 -0.0996877624
-0.2959648474 -0.0208305440 -0.0809291489
-0.0245491773 0.0303625338 -0.0001148170
-0.1602570123 0.0047659949 -0.0405219830
0.0096631484 0.0371495884 0.0087828333
-0.0240925903 0.0309832057 -0.0020414429
-0.2955082603 -0.0202098721 -0.0828557748
-0.3632480311 -0.0328529736 -0.1035410143
-0.0918323610 0.0183401042 -0.0227266824
-0.1600287188 0.0050763308 -0.0414852959
-0.4314443889 -0.0461167469 -0.1222996278
-0.2957365538 -0.0205202080 -0.0818924619
-0.4656567145 -0.0529038016 -0.1311972781
-0.4319009759 -0.0467374188 -0.1203730019
0.2816708589 0.0876485969 0.0880491759
0.3380715328 0.0984512401 0.1052830142
0.1118917236 0.0557903261 0.0379377125
0.1688695111 0.0660433104 0.0535814995
0.3950493203 0.1087042245 0.1209268011
0.2819594157 0.0873737674 0.0872541503
0.4236824924 0.1136933019 0.1283511818
0.3956264339 0.1081545656 0.1193367498
0.1694466246 0.0654936516 0.0519914482
0.1130459507 0.0546910084 0.0347576099
0.3392257599 0.0973519224 0.1021029116
0.2822479725 0.0870989380 0.0864591246
0.0560681632 0.0444380240 0.0191138230
0.1691580678 0.0657684810 0.0527864738
0.0274349911 0.0394489465 0.0116894423
0.0554910497 0.0449876829 0.0207038743
0.2828164082 0.0863313647 0.0850362591
0.3392257599 0.0973519224 0.1021029116
0.1130459507 0.0546910084 0.0347576099
0.1699977047 0.0642902494 0.0509029542
0.3961775140 0.1069511634 0.1182482558
0.2830876093 0.0856207064 0.0845756050
0.4247889916 0.1113954548 0.1260906009
0.3967199163 0.1055298468 0.1173269476
0.1705401070 0.0628689328 0.0499816459
0.1141307553 0.0518483751 0.0329149935
0.3403105645 0.0945092892 0.1002602951
0.2833588105 0.0849100481 0.0841149509
0.0571790012 0.0422491341 0.0167696492
0.1702689059 0.0635795911 0.0504423001
0.0285675236 0.0378048427 0.0089273042
0.0566365989 0.0436704507 0.0176909575
0.2838407410 0.0834065459 0.0834487995
0.3403105645 0.0945092892 0.1002602951
0.1141307553 0.0518483751 0.0329149935
0.1709010939 0.0612010593 0.0498258082
0.3970809032 0.1038619733 0.1171711098
0.2839909985 0.0825315163 0.0834984590
0.4255412013 0.1081008005 0.1256513469
0.3973814183 0.1021119141 0.1172704289
0.1712016090 0.0594510001 0.0499251272
0.1147317855 0.0483482568 0.0331136316
0.3409115948 0.0910091708 0.1004589332
0.2841412561 0.0816564867 0.0835481185
0.0579614469 0.0389955727 0.0162028169
0.1710513515 0.0603260297 0.0498754677
0.0295011487 0.0347567454 0.0077225798
0.0576609317 0.0407456318 0.0161034978
0.2843526057 0.0799913409 0.0838931112
0.3409115948 0.0910091708 0.1004589332
0.1147317855 0.0483482568 0.0331136316
0.1712346275 0.0579556811 0.0507614672
0.3974144367 0.1006165951 0.1181067689
0.2843245321 0.0792861381 0.0844341180
0.4256518210 0.1050677058 0.1272011901
0.3973582896 0.0992061895 0.1191887825
0.1711784804 0.0565452754 0.0518434809
0.1146194913 0.0455274455 0.0352776589
0.3407993006 0.0881883595 0.1026229605
0.2842964586 0.0785809353 0.0849751249
0.0581166493 0.0359200213 0.0176298232
0.1712065539 0.0572504783 0.0513024740
0.0298792651 0.0314689105 0.0085354020
0.0581727964 0.0373304269 0.0165478096
0.2841565049 0.0773901300 0.0861994945
0.3407993006 0.0881883595 0.1026229605
0.1146194913 0.0455274455 0.0352776589
0.1708709135 0.0557936709 0.0533525625
0.3970507228 0.0984545849 0.1206978641
0.2839608181 0.0771241279 0.0870252133
0.4250785905 0.1034546965 0.1301481754
0.3966593493 0.0979225806 0.1223493018
0.1704795400 0.0552616666 0.0550040001
0.1138367443 0.0444634371 0.0385805341
0.3400165536 0.0871243511 0.1059258358
0.2837651314 0.0768581258 0.0878509321
0.0575853221 0.0341972117 0.0205056305
0.1706752268 0.0555276687 0.0541782813
0.0295574544 0.0291971001 0.0110553193
0.0579766956 0.0347292160 0.0188541928
0.2833273229 0.0765965373 0.0894870232
0.3400165536 0.0871243511 0.1059258358
0.1138367443 0.0444634371 0.0385805341
0.1699488615 0.0555409097 0.0566093980
0.3961286707 0.0982018237 0.1239546997
0.2830387661 0.0768713667 0.0902820488
0.4240404509 0.1038779747 0.1333666444
0.3955515572 0.0987514826 0.1255447509
0.1693717479 0.0560905685 0.0581994493
0.1126825172 0.0455627548 0.0417606367
0.3388623265 0.0882236688 0.1091059383
0.2827502093 0.0771461961 0.0910770745
0.0565704001 0.0344852821 0.0237317728
0.1696603047 0.0558157391 0.0574044236
0.0286586199 0.0288091311 0.0143198281
0.0571475136 0.0339356233 0.0221417215
0.2821817736 0.0779137694 0.0924999400
0.3388623265 0.0882236688 0.1091059383
0.1126825172 0.0455627548 0.0417606367
0.1688206678 0.0572939707 0.0592879433
0.3950004771 0.0999548847 0.1266332449
0.2819105725 0.0786244277 0.0929605941
0.4229339518 0.1061758219 0.1356272253
0.3944580748 0.1013762014 0.1275545532
0.1682782655 0.0587152873 0.0602092515
0.1115977127 0.0484053880 0.0436032531
0.3377775219 0.0910663020 0.1109485548
0.2816393713 0.0793350860 0.0934212482
0.0554595621 0.0366741720 0.0260759466
0.1685494667 0.0580046290 0.0597485974
0.0275260873 0.0304532349 0.0170819662
0.0560019644 0.0352528554 0.0251546383
0.2811574408 0.0808385883 0.0940873996
0.3377775219 0.0910663020 0.1109485548
0.1115977127 0.0484053880 0.0436032531
0.1679172786 0.0603831609 0.0603650893
0.3940970879 0.1030440749 0.1277103909
0.2810071833 0.0817136179 0.0940377401
0.4221817421 0.1094704761 0.1360664792
0.3937965728 0.1047941341 0.1276110719
0.1676167635 0.0621332201 0.0602657702
0.1109966824 0.0519055063 0.0434046150
0.3371764917 0.0945664204 0.1107499167
0.2808569257 0.0825886475 0.0939880806
0.0546771165 0.0399277335 0.0266427789
0.1677670211 0.0612581905 0.0603154297
0.0265924622 0.0335013322 0.0182866906
0.0549776316 0.0381776743 0.0267420980
0.2806455761 0.0842537933 0.0936430879
0.3371764917 0.0945664204 0.1107499167
0.1109966824 0.0519055063 0.0434046150
0.1675837451 0.0636285391 0.0594294302
0.3937635543 0.1062894531 0.1267747319
0.2806736497 0.0849589961 0.0931020811
0.4220711224 0.1125035709 0.1345166361
0.3938197014 0.1076998587 0.1256927182
0.1676398922 0.0650389447 0.0583474166
0.1111089766 0.0547263176 0.0412405878
0.3372887859 0.0973872316 0.1085858894
0.2807017232 0.0856641989 0.0925610742
0.0545219140 0.0430032849 0.0252157726
0.1676118186 0.0643337419 0.0588884234
0.0262143459 0.0367891671 0.0174738684
0.0544657669 0.0415928793 0.0262977862
0.2808416769 0.0868550042 0.0913367046
0.3372887859 0.0973872316 0.1085858894
0.1111089766 0.0547263176 0.0412405878
0.1679474591 0.0657905493 0.0568383350
0.3941272683 0.1084514633 0.1241836366
0.2810373637 0.0871210063 0.0905109858
0.4226443529 0.1141165802 0.1315696508
0.3945186418 0.1089834675 0.1225321990
0.1683388325 0.0663225535 0.0551868973
0.1118917236 0.0557903261 0.0379377125
0.3380715328 0.0984512401 0.1052830142
0.2812330504 0.0873870084 0.0896852670
0.0550532412 0.0447260944 0.0223399653
0.1681431458 0.0660565514 0.0560126161
0.0265361566 0.0390609775 0.0149539511
0.0546618677 0.0441940902 0.0239914030
3 520 936 156
3 155 936 520
3 520 937 152
3 156 937 520
3 521 938 155
3 156 938 521
3 521 939 154
3 155 939 521
3 522 940 157
3 155 940 522
3 522 941 153
3 157 941 522
3 523 942 157
3 152 942 523
3 523 943 155
3 157 943 523
3 524 944 154
3 159 944 524
3 524 945 158
3 154 945 524
3 525 946 159
3 98 946 525
3 525 947 158
3 159 947 525
3 526 948 160
3 158 948 526
3 526 949 153
3 160 949 526
3 527 950 154
3 158 950 527
3 527 951 160
3 154 951 527
3 528 952 161
3 163 952 528
3 528 953 162
3 161 953 528
3 529 954 163
3 153 954 529
3 529 955 162
3 163 955 529
3 530 956 164
3 162 956 530
3 530 957 24
3 164 957 530
3 531 958 161
3 162 958 531
3 531 959 164
3 161 959 531
3 532 960 166
3 165 960 532
3 532 961 153
3 166 961 532
3 533 962 165
3 166 962 533
3 533 963 161
3 165 963 533
3 534 964 167
3 165 964 534
3 534 965 152
3 167 965 534
3 535 966 167
3 153 966 535
3 535 967 165
3 167 967 535
3 536 968 171
3 170 968 536
3 536 969 169
3 171 969 536
3 537 970 171
3 168 970 537
3 537 971 170
3 171 971 537
3 538 972 172
3 170 972 538
3 538 973 98
3 172 973 538
3 539 974 172
3 169 974 539
3 539 975 170
3 172 975 539
3 540 976 174
3 173 976 540
3 540 977 169
3 174 977 540
3 541 978 173
3 174 978 541
3 541 979 152
3 173 979 541
3 542 980 168
3 175 980 542
3 542 981 173
3 168 981 542
3 543 982 175
3 169 982 543
3 543 983 173
3 175 983 543
3 544 984 178
3 177 984 544
3 544 985 93
3 178 985 544
3 545 986 176
3 177 986 545
3 545 987 178
3 176 987 545
3 546 988 179
3 177 988 546
3 546 989 168
3 179 989 546
3 547 990 179
3 93 990 547
3 547 991 177
3 179 991 547
3 548 992 176
3 181 992 548
3 548 993 180
3 176 993 548
3 549 994 181
3 98 994 549
3 549 995 180
3 181 995 549
3 550 996 182
3 180 996 550
3 550 997 168
3 182 997 550
3 551 998 180
3 182 998 551
3 551 999 176
3 180 999 551
3 552 1000 187
3 186 1000 552
3 552 1001 184
3 187 1001 552
3 553 1002 183
3 186 1002 553
3 553 1003 187
3 183 1003 553
3 554 1004 188
3 186 1004 554
3 554 1005 185
3 188 1005 554
3 555 1006 188
3 184 1006 555
3 555 1007 186
3 188 1007 555
3 556 1008 185
3 190 1008 556
3 556 1009 189
3 185 1009 556
3 557 1010 190
3 22 1010 557
3 557 1011 189
3 190 1011 557
3 558 1012 191
3 189 1012 558
3 558 1013 184
3 191 1013 558
3 559 1014 185
3 189 1014 559
3 559 1015 191
3 185 1015 559
3 560 1016 192
3 194 1016 560
3 560 1017 193
3 192 1017 560
3 561 1018 194
3 184 1018 561
3 561 1019 193
3 194 1019 561
3 562 1020 195
3 193 1020 562
3 562 1021 93
3 195 1021 562
3 563 1022 192
3 193 1022 563
3 563 1023 195
3 192 1023 563
3 564 1024 197
3 196 1024 564
3 564 1025 184
3 197 1025 564
3 565 1026 197
3 192 1026 565
3 565 1027 196
3 197 1027 565
3 566 1028 183
3 198 1028 566
3 566 1029 196
3 183 1029 566
3 567 1030 198
3 184 1030 567
3 567 1031 196
3 198 1031 567
3 568 1032 200
3 202 1032 568
3 568 1033 201
3 200 1033 568
3 569 1034 202
3 199 1034 569
3 569 1035 201
3 202 1035 569
3 570 1036 203
3 201 1036 570
3 570 1037 22
3 203 1037 570
3 571 1038 203
3 200 1038 571
3 571 1039 201
3 203 1039 571
3 572 1040 205
3 204 1040 572
3 572 1041 199
3 205 1041 572
3 573 1042 200
3 204 1042 573
3 573 1043 205
3 200 1043 573
3 574 1044 204
3 183 1044 574
3 574 1045 206
3 204 1045 574
3 575 1046 206
3 199 1046 575
3 575 1047 204
3 206 1047 575
3 576 1048 209
3 208 1048 576
3 576 1049 24
3 209 1049 576
3 577 1050 209
3 207 1050 577
3 577 1051 208
3 209 1051 577
3 578 1052 208
3 199 1052 578
3 578 1053 210
3 208 1053 578
3 579 1054 210
3 24 1054 579
3 579 1055 208
3 210 1055 579
3 580 1056 207
3 212 1056 580
3 580 1057 211
3 207 1057 580
3 581 1058 212
3 22 1058 581
3 581 1059 211
3 212 1059 581
3 582 1060 213
3 211 1060 582
3 582 1061 199
3 213 1061 582
3 583 1062 211
3 213 1062 583
3 583 1063 207
3 211 1063 583
3 98 25 99
3 98 24 25
3 98 99 93
3 93 99 94
3 93 94 23
3 93 23 22
3 24 23 25
3 24 22 23
3 584 1064 216
3 218 1064 584
3 584 1065 217
3 216 1065 584
3 585 1066 218
3 215 1066 585
3 585 1067 217
3 218 1067 585
3 586 1068 219
3 217 1068 586
3 586 1069 94
3 219 1069 586
3 587 1070 219
3 216 1070 587
3 587 1071 217
3 219 1071 587
3 588 1072 221
3 220 1072 588
3 588 1073 215
3 221 1073 588
3 589 1074 216
3 220 1074 589
3 589 1075 221
3 216 1075 589
3 590 1076 220
3 214 1076 590
3 590 1077 222
3 220 1077 590
3 591 1078 222
3 215 1078 591
3 591 1079 220
3 222 1079 591
3 592 1080 225
3 224 1080 592
3 592 1081 99
3 225 1081 592
3 593 1082 225
3 223 1082 593
3 593 1083 224
3 225 1083 593
3 594 1084 224
3 215 1084 594
3 594 1085 226
3 224 1085 594
3 595 1086 226
3 99 1086 595
3 595 1087 224
3 226 1087 595
3 596 1088 223
3 228 1088 596
3 596 1089 227
3 223 1089 596
3 597 1090 228
3 94 1090 597
3 597 1091 227
3 228 1091 597
3 598 1092 229
3 227 1092 598
3 598 1093 215
3 229 1093 598
3 599 1094 227
3 229 1094 599
3 599 1095 223
3 227 1095 599
3 600 1096 233
3 232 1096 600
3 600 1097 214
3 233 1097 600
3 601 1098 232
3 233 1098 601
3 601 1099 231
3 232 1099 601
3 602 1100 234
3 232 1100 602
3 602 1101 230
3 234 1101 602
3 603 1102 234
3 214 1102 603
3 603 1103 232
3 234 1103 603
3 604 1104 231
3 236 1104 604
3 604 1105 235
3 231 1105 604
3 605 1106 236
3 25 1106 605
3 605 1107 235
3 236 1107 605
3 606 1108 237
3 235 1108 606
3 606 1109 230
3 237 1109 606
3 607 1110 231
3 235 1110 607
3 607 1111 237
3 231 1111 607
3 608 1112 238
3 240 1112 608
3 608 1113 239
3 238 1113 608
3 609 1114 240
3 230 1114 609
3 609 1115 239
3 240 1115 609
3 610 1116 241
3 239 1116 610
3 610 1117 99
3 241 1117 610
3 611 1118 238
3 239 1118 611
3 611 1119 241
3 238 1119 611
3 612 1120 243
3 242 1120 612
3 612 1121 230
3 243 1121 612
3 613 1122 242
3 243 1122 613
3 613 1123 238
3 242 1123 613
3 614 1124 244
3 242 1124 614
3 614 1125 214
3 244 1125 614
3 615 1126 244
3 230 1126 615
3 615 1127 242
3 244 1127 615
3 616 1128 249
3 248 1128 616
3 616 1129 247
3 249 1129 616
3 617 1130 249
3 246 1130 617
3 617 1131 248
3 249 1131 617
3 618 1132 250
3 248 1132 618
3 618 1133 25
3 250 1133 618
3 619 1134 250
3 247 1134 619
3 619 1135 248
3 250 1135 619
3 620 1136 252
3 251 1136 620
3 620 1137 247
3 252 1137 620
3 621 1138 251
3 252 1138 621
3 621 1139 245
3 251 1139 621
3 622 1140 246
3 253 1140 622
3 622 1141 251
3 246 1141 622
3 623 1142 253
3 247 1142 623
3 623 1143 251
3 253 1143 623
3 624 1144 256
3 255 1144 624
3 624 1145 23
3 256 1145 624
3 625 1146 254
3 255 1146 625
3 625 1147 256
3 254 1147 625
3 626 1148 257
3 255 1148 626
3 626 1149 246
3 257 1149 626
3 627 1150 257
3 23 1150 627
3 627 1151 255
3 257 1151 627
3 628 1152 254
3 259 1152 628
3 628 1153 258
3 254 1153 628
3 629 1154 259
3 25 1154 629
3 629 1155 258
3 259 1155 629
3 630 1156 260
3 258 1156 630
3 630 1157 246
3 260 1157 630
3 631 1158 258
3 260 1158 631
3 631 1159 254
3 258 1159 631
3 632 1160 264
3 263 1160 632
3 632 1161 261
3 264 1161 632
3 633 1162 245
3 263 1162 633
3 633 1163 264
3 245 1163 633
3 634 1164 265
3 263 1164 634
3 634 1165 262
3 265 1165 634
3 635 1166 265
3 261 1166 635
3 635 1167 263
3 265 1167 635
3 636 1168 262
3 267 1168 636
3 636 1169 266
3 262 1169 636
3 637 1170 267
3 94 1170 637
3 637 1171 266
3 267 1171 637
3 638 1172 268
3 266 1172 638
3 638 1173 261
3 268 1173 638
3 639 1174 262
3 266 1174 639
3 639 1175 268
3 262 1175 639
3 640 1176 269
3 271 1176 640
3 640 1177 270
3 269 1177 640
3 641 1178 271
3 261 1178 641
3 641 1179 270
3 271 1179 641
3 642 1180 272
3 270 1180 642
3 642 1181 23
3 272 1181 642
3 643 1182 269
3 270 1182 643
3 643 1183 272
3 269 1183 643
3 644 1184 274
3 273 1184 644
3 644 1185 261
3 274 1185 644
3 645 1186 274
3 269 1186 645
3 645 1187 273
3 274 1187 645
3 646 1188 245
3 275 1188 646
3 646 1189 273
3 245 1189 646
3 647 1190 275
3 261 1190 647
3 647 1191 273
3 275 1191 647
3 276 1192 648
3 277 1192 276
3 648 1193 7
3 277 1193 648
3 649 1194 277
3 6 1194 649
3 277 1195 649
3 276 1195 277
3 650 1196 278
3 7 1196 650
3 278 1197 650
3 276 1197 278
3 7 1198 651
3 76 1198 7
3 651 1199 278
3 76 1199 651
3 279 1200 652
3 280 1200 279
3 652 1201 74
3 280 1201 652
3 653 1202 280
3 76 1202 653
3 280 1203 653
3 279 1203 280
3 654 1204 281
3 74 1204 654
3 281 1205 654
3 279 1205 281
3 74 1206 655
3 6 1206 74
3 655 1207 281
3 6 1207 655
3 104 6 74
3 105 76 7
3 282 1208 656
3 283 1208 282
3 656 1209 76
3 283 1209 656
3 657 1210 283
3 74 1210 657
3 283 1211 657
3 282 1211 283
3 658 1212 284
3 76 1212 658
3 284 1213 658
3 282 1213 284
3 76 1214 659
3 34 1214 76
3 659 1215 284
3 34 1215 659
3 285 1216 660
3 286 1216 285
3 660 1217 32
3 286 1217 660
3 661 1218 286
3 34 1218 661
3 286 1219 661
3 285 1219 286
3 662 1220 287
3 32 1220 662
3 287 1221 662
3 285 1221 287
3 32 1222 663
3 74 1222 32
3 663 1223 287
3 74 1223 663
3 104 74 32
3 105 34 76
3 288 1224 664
3 289 1224 288
3 664 1225 34
3 289 1225 664
3 665 1226 289
3 32 1226 665
3 289 1227 665
3 288 1227 289
3 666 1228 290
3 34 1228 666
3 290 1229 666
3 288 1229 290
3 34 1230 667
3 150 1230 34
3 667 1231 290
3 150 1231 667
3 291 1232 668
3 292 1232 291
3 668 1233 148
3 292 1233 668
3 669 1234 292
3 150 1234 669
3 292 1235 669
3 291 1235 292
3 670 1236 293
3 148 1236 670
3 293 1237 670
3 291 1237 293
3 148 1238 671
3 32 1238 148
3 671 1239 293
3 32 1239 671
3 104 32 148
3 105 150 34
3 294 1240 672
3 295 1240 294
3 672 1241 150
3 295 1241 672
3 673 1242 295
3 148 1242 673
3 295 1243 673
3 294 1243 295
3 674 1244 296
3 150 1244 674
3 296 1245 674
3 294 1245 296
3 150 1246 675
3 14 1246 150
3 675 1247 296
3 14 1247 675
3 297 1248 676
3 298 1248 297
3 676 1249 12
3 298 1249 676
3 677 1250 298
3 14 1250 677
3 298 1251 677
3 297 1251 298
3 678 1252 299
3 12 1252 678
3 299 1253 678
3 297 1253 299
3 12 1254 679
3 148 1254 12
3 679 1255 299
3 148 1255 679
3 104 148 12
3 105 14 150
3 300 1256 680
3 301 1256 300
3 680 1257 14
3 301 1257 680
3 681 1258 301
3 12 1258 681
3 301 1259 681
3 300 1259 301
3 682 1260 302
3 14 1260 682
3 302 1261 682
3 300 1261 302
3 14 1262 683
3 27 1262 14
3 683 1263 302
3 27 1263 683
3 303 1264 684
3 304 1264 303
3 684 1265 26
3 304 1265 684
3 685 1266 304
3 27 1266 685
3 304 1267 685
3 303 1267 304
3 686 1268 305
3 26 1268 686
3 305 1269 686
3 303 1269 305
3 26 1270 687
3 12 1270 26
3 687 1271 305
3 12 1271 687
3 104 12 26
3 105 27 14
3 306 1272 688
3 307 1272 306
3 688 1273 27
3 307 1273 688
3 689 1274 307
3 26 1274 689
3 307 1275 689
3 306 1275 307
3 690 1276 308
3 27 1276 690
3 308 1277 690
3 306 1277 308
3 27 1278 691
3 15 1278 27
3 691 1279 308
3 15 1279 691
3 309 1280 692
3 310 1280 309
3 692 1281 13
3 310 1281 692
3 693 1282 310
3 15 1282 693
3 310 1283 693
3 309 1283 310
3 694 1284 311
3 13 1284 694
3 311 1285 694
3 309 1285 311
3 13 1286 695
3 26 1286 13
3 695 1287 311
3 26 1287 695
3 104 26 13
3 105 15 27
3 312 1288 696
3 313 1288 312
3 696 1289 15
3 313 1289 696
3 697 1290 313
3 13 1290 697
3 313 1291 697
3 312 1291 313
3 698 1292 314
3 15 1292 698
3 314 1293 698
3 312 1293 314
3 15 1294 699
3 151 1294 15
3 699 1295 314
3 151 1295 699
3 315 1296 700
3 316 1296 315
3 700 1297 149
3 316 1297 700
3 701 1298 316
3 151 1298 701
3 316 1299 701
3 315 1299 316
3 702 1300 317
3 149 1300 702
3 317 1301 702
3 315 1301 317
3 149 1302 703
3 13 1302 149
3 703 1303 317
3 13 1303 703
3 104 13 149
3 105 151 15
3 318 1304 704
3 319 1304 318
3 704 1305 151
3 319 1305 704
3 705 1306 319
3 149 1306 705
3 319 1307 705
3 318 1307 319
3 706 1308 320
3 151 1308 706
3 320 1309 706
3 318 1309 320
3 151 1310 707
3 35 1310 151
3 707 1311 320
3 35 1311 707
3 321 1312 708
3 322 1312 321
3 708 1313 33
3 322 1313 708
3 709 1314 322
3 35 1314 709
3 322 1315 709
3 321 1315 322
3 710 1316 323
3 33 1316 710
3 323 1317 710
3 321 1317 323
3 33 1318 711
3 149 1318 33
3 711 1319 323
3 149 1319 711
3 104 149 33
3 105 35 151
3 324 1320 712
3 325 1320 324
3 712 1321 35
3 325 1321 712
3 713 1322 325
3 33 1322 713
3 325 1323 713
3 324 1323 325
3 714 1324 326
3 35 1324 714
3 326 1325 714
3 324 1325 326
3 35 1326 715
3 77 1326 35
3 715 1327 326
3 77 1327 715
3 327 1328 716
3 328 1328 327
3 716 1329 75
3 328 1329 716
3 717 1330 328
3 77 1330 717
3 328 1331 717
3 327 1331 328
3 718 1332 329
3 75 1332 718
3 329 1333 718
3 327 1333 329
3 75 1334 719
3 33 1334 75
3 719 1335 329
3 33 1335 719
3 104 33 75
3 105 77 35
3 330 1336 720
3 331 1336 330
3 720 1337 77
3 331 1337 720
3 721 1338 331
3 75 1338 721
3 331 1339 721
3 330 1339 331
3 722 1340 332
3 77 1340 722
3 332 1341 722
3 330 1341 332
3 77 1342 723
3 7 1342 77
3 723 1343 332
3 7 1343 723
3 333 1344 724
3 334 1344 333
3 724 1345 6
3 334 1345 724
3 725 1346 334
3 7 1346 725
3 334 1347 725
3 333 1347 334
3 726 1348 335
3 6 1348 726
3 335 1349 726
3 333 1349 335
3 6 1350 727
3 75 1350 6
3 727 1351 335
3 75 1351 727
3 104 75 6
3 105 7 77
3 336 1352 728
3 337 1352 336
3 728 1353 0
3 337 1353 728
3 729 1354 337
3 1 1354 729
3 337 1355 729
3 336 1355 337
3 730 1356 338
3 0 1356 730
3 338 1357 730
3 336 1357 338
3 0 1358 731
3 37 1358 0
3 731 1359 338
3 37 1359 731
3 339 1360 732
3 340 1360 339
3 732 1361 39
3 340 1361 732
3 733 1362 340
3 37 1362 733
3 340 1363 733
3 339 1363 340
3 734 1364 341
3 39 1364 734
3 341 1365 734
3 339 1365 341
3 39 1366 735
3 1 1366 39
3 735 1367 341
3 1 1367 735
3 110 1 39
3 90 37 0
3 342 1368 736
3 343 1368 342
3 736 1369 37
3 343 1369 736
3 737 1370 343
3 39 1370 737
3 343 1371 737
3 342 1371 343
3 738 1372 344
3 37 1372 738
3 344 1373 738
3 342 1373 344
3 37 1374 739
3 3 1374 37
3 739 1375 344
3 3 1375 739
3 345 1376 740
3 346 1376 345
3 740 1377 5
3 346 1377 740
3 741 1378 346
3 3 1378 741
3 346 1379 741
3 345 1379 346
3 742 1380 347
3 5 1380 742
3 347 1381 742
3 345 1381 347
3 5 1382 743
3 39 1382 5
3 743 1383 347
3 39 1383 743
3 110 39 5
3 90 3 37
3 348 1384 744
3 349 1384 348
3 744 1385 3
3 349 1385 744
3 745 1386 349
3 5 1386 745
3 349 1387 745
3 348 1387 349
3 746 1388 350
3 3 1388 746
3 350 1389 746
3 348 1389 350
3 3 1390 747
3 29 1390 3
3 747 1391 350
3 29 1391 747
3 351 1392 748
3 352 1392 351
3 748 1393 31
3 352 1393 748
3 749 1394 352
3 29 1394 749
3 352 1395 749
3 351 1395 352
3 750 1396 353
3 31 1396 750
3 353 1397 750
3 351 1397 353
3 31 1398 751
3 5 1398 31
3 751 1399 353
3 5 1399 751
3 110 5 31
3 90 29 3
3 354 1400 752
3 355 1400 354
3 752 1401 29
3 355 1401 752
3 753 1402 355
3 31 1402 753
3 355 1403 753
3 354 1403 355
3 754 1404 356
3 29 1404 754
3 356 1405 754
3 354 1405 356
3 29 1406 755
3 145 1406 29
3 755 1407 356
3 145 1407 755
3 357 1408 756
3 358 1408 357
3 756 1409 147
3 358 1409 756
3 757 1410 358
3 145 1410 757
3 358 1411 757
3 357 1411 358
3 758 1412 359
3 147 1412 758
3 359 1413 758
3 357 1413 359
3 147 1414 759
3 31 1414 147
3 759 1415 359
3 31 1415 759
3 110 31 147
3 90 145 29
3 360 1416 760
3 361 1416 360
3 760 1417 145
3 361 1417 760
3 761 1418 361
3 147 1418 761
3 361 1419 761
3 360 1419 361
3 762 1420 362
3 145 1420 762
3 362 1421 762
3 360 1421 362
3 145 1422 763
3 20 1422 145
3 763 1423 362
3 20 1423 763
3 363 1424 764
3 364 1424 363
3 764 1425 21
3 364 1425 764
3 765 1426 364
3 20 1426 765
3 364 1427 765
3 363 1427 364
3 766 1428 365
3 21 1428 766
3 365 1429 766
3 363 1429 365
3 21 1430 767
3 147 1430 21
3 767 1431 365
3 147 1431 767
3 110 147 21
3 90 20 145
3 366 1432 768
3 367 1432 366
3 768 1433 20
3 367 1433 768
3 769 1434 367
3 21 1434 769
3 367 1435 769
3 366 1435 367
3 770 1436 368
3 20 1436 770
3 368 1437 770
3 366 1437 368
3 20 1438 771
3 144 1438 20
3 771 1439 368
3 144 1439 771
3 369 1440 772
3 370 1440 369
3 772 1441 146
3 370 1441 772
3 773 1442 370
3 144 1442 773
3 370 1443 773
3 369 1443 370
3 774 1444 371
3 146 1444 774
3 371 1445 774
3 369 1445 371
3 146 1446 775
3 21 1446 146
3 775 1447 371
3 21 1447 775
3 110 21 146
3 90 144 20
3 372 1448 776
3 373 1448 372
3 776 1449 144
3 373 1449 776
3 777 1450 373
3 146 1450 777
3 373 1451 777
3 372 1451 373
3 778 1452 374
3 144 1452 778
3 374 1453 778
3 372 1453 374
3 144 1454 779
3 28 1454 144
3 779 1455 374
3 28 1455 779
3 375 1456 780
3 376 1456 375
3 780 1457 30
3 376 1457 780
3 781 1458 376
3 28 1458 781
3 376 1459 781
3 375 1459 376
3 782 1460 377
3 30 1460 782
3 377 1461 782
3 375 1461 377
3 30 1462 783
3 146 1462 30
3 783 1463 377
3 146 1463 783
3 110 146 30
3 90 28 144
3 378 1464 784
3 379 1464 378
3 784 1465 28
3 379 1465 784
3 785 1466 379
3 30 1466 785
3 379 1467 785
3 378 1467 379
3 786 1468 380
3 28 1468 786
3 380 1469 786
3 378 1469 380
3 28 1470 787
3 2 1470 28
3 787 1471 380
3 2 1471 787
3 381 1472 788
3 382 1472 381
3 788 1473 4
3 382 1473 788
3 789 1474 382
3 2 1474 789
3 382 1475 789
3 381 1475 382
3 790 1476 383
3 4 1476 790
3 383 1477 790
3 381 1477 383
3 4 1478 791
3 30 1478 4
3 791 1479 383
3 30 1479 791
3 110 30 4
3 90 2 28
3 384 1480 792
3 385 1480 384
3 792 1481 2
3 385 1481 792
3 793 1482 385
3 4 1482 793
3 385 1483 793
3 384 1483 385
3 794 1484 386
3 2 1484 794
3 386 1485 794
3 384 1485 386
3 2 1486 795
3 36 1486 2
3 795 1487 386
3 36 1487 795
3 387 1488 796
3 388 1488 387
3 796 1489 38
3 388 1489 796
3 797 1490 388
3 36 1490 797
3 388 1491 797
3 387 1491 388
3 798 1492 389
3 38 1492 798
3 389 1493 798
3 387 1493 389
3 38 1494 799
3 4 1494 38
3 799 1495 389
3 4 1495 799
3 110 4 38
3 90 36 2
3 390 1496 800
3 391 1496 390
3 800 1497 36
3 391 1497 800
3 801 1498 391
3 38 1498 801
3 391 1499 801
3 390 1499 391
3 802 1500 392
3 36 1500 802
3 392 1501 802
3 390 1501 392
3 36 1502 803
3 0 1502 36
3 803 1503 392
3 0 1503 803
3 393 1504 804
3 394 1504 393
3 804 1505 1
3 394 1505 804
3 805 1506 394
3 0 1506 805
3 394 1507 805
3 393 1507 394
3 806 1508 395
3 1 1508 806
3 395 1509 806
3 393 1509 395
3 1 1510 807
3 38 1510 1
3 807 1511 395
3 38 1511 807
3 110 38 1
3 90 0 36
3 87 127 95
3 127 16 95
3 16 17 95
3 17 126 95
3 126 86 95
3 86 62 95
3 62 71 95
3 71 70 95
3 70 63 95
3 63 87 95
3 87 102 127
3 102 49 127
3 127 49 16
3 49 135 16
3 16 135 17
3 135 134 17
3 17 134 126
3 134 48 126
3 126 48 86
3 48 103 86
3 86 103 62
3 103 140 62
3 62 140 71
3 140 58 71
3 71 58 70
3 58 59 70
3 70 59 63
3 59 141 63
3 63 141 87
3 141 102 87
3 102 97 49
3 97 50 49
3 49 50 135
3 50 67 135
3 135 67 134
3 67 66 134
3 134 66 48
3 66 51 48
3 48 51 103
3 51 96 103
3 103 96 140
3 96 43 140
3 140 43 58
3 43 122 58
3 58 122 59
3 122 123 59
3 59 123 141
3 123 42 141
3 141 42 102
3 42 97 102
3 97 107 50
3 107 136 50
3 50 136 67
3 136 81 67
3 67 81 66
3 81 80 66
3 66 80 51
3 80 137 51
3 51 137 96
3 137 106 96
3 96 106 43
3 106 61 43
3 43 61 122
3 61 120 122
3 122 120 123
3 120 121 123
3 123 121 42
3 121 60 42
3 42 60 97
3 60 107 97
3 107 88 136
3 88 41 136
3 136 41 81
3 41 113 81
3 81 113 80
3 113 112 80
3 80 112 137
3 112 40 137
3 137 40 106
3 40 89 106
3 106 89 61
3 89 142 61
3 61 142 120
3 142 82 120
3 120 82 121
3 82 83 121
3 121 83 60
3 83 143 60
3 60 143 107
3 143 88 107
3 88 85 41
3 85 130 41
3 41 130 113
3 130 79 113
3 113 79 112
3 79 78 112
3 112 78 40
3 78 131 40
3 40 131 89
3 131 84 89
3 89 84 142
3 84 55 142
3 142 55 82
3 55 118 82
3 82 118 83
3 118 119 83
3 83 119 143
3 119 54 143
3 143 54 88
3 54 85 88
3 85 109 130
3 109 52 130
3 130 52 79
3 52 69 79
3 79 69 78
3 69 68 78
3 78 68 131
3 68 53 131
3 131 53 84
3 53 108 84
3 84 108 55
3 108 45 55
3 55 45 118
3 45 124 118
3 118 124 119
3 124 125 119
3 119 125 54
3 125 44 54
3 54 44 85
3 44 109 85
3 109 100 52
3 100 47 52
3 52 47 69
3 47 133 69
3 69 133 68
3 133 132 68
3 68 132 53
3 132 46 53
3 53 46 108
3 46 101 108
3 108 101 45
3 101 138 45
3 45 138 124
3 138 56 124
3 124 56 125
3 56 57 125
3 125 57 44
3 57 139 44
3 44 139 109
3 139 100 109
3 100 92 47
3 92 129 47
3 47 129 133
3 129 18 133
3 133 18 132
3 18 19 132
3 132 19 46
3 19 128 46
3 46 128 101
3 128 91 101
3 101 91 138
3 91 64 138
3 138 64 56
3 64 73 56
3 56 73 57
3 73 72 57
3 57 72 139
3 72 65 139
3 139 65 100
3 65 92 100
3 92 111 129
3 129 111 18
3 18 111 19
3 111 111 19
3 19 111 128
3 111 111 128
3 128 111 91
3 111 111 91
3 91 111 64
3 111 111 64
3 64 111 73
3 73 111 72
3 111 111 72
3 72 111 65
3 65 111 92
3 111 111 92
3 400 808 399
3 396 808 400
3 400 809 398
3 399 809 400
3 401 810 397
3 396 810 401
3 401 811 399
3 397 811 401
3 402 812 398
3 403 812 402
3 403 813 115
3 402 813 403
3 404 814 402
3 397 814 404
3 402 815 404
3 398 815 402
3 406 816 405
3 407 816 406
3 407 817 397
3 406 817 407
3 408 818 406
3 9 818 408
3 406 819 408
3 405 819 406
3 410 820 397
3 409 820 410
3 410 821 396
3 397 821 410
3 411 822 409
3 405 822 411
3 411 823 396
3 409 823 411
3 415 824 413
3 412 824 415
3 415 825 414
3 413 825 415
3 416 826 414
3 115 826 416
3 414 827 416
3 413 827 414
3 418 828 417
3 413 828 418
3 418 829 396
3 417 829 418
3 419 830 412
3 413 830 419
3 419 831 417
3 412 831 419
3 422 832 421
3 420 832 422
3 422 833 117
3 421 833 422
3 423 834 421
3 115 834 423
3 423 835 420
3 421 835 423
3 425 836 424
3 420 836 425
3 425 837 412
3 424 837 425
3 426 838 424
3 117 838 426
3 426 839 420
3 424 839 426
3 431 840 430
3 427 840 431
3 430 841 431
3 429 841 430
3 432 842 428
3 427 842 432
3 432 843 430
3 428 843 432
3 429 844 434
3 433 844 429
3 434 845 11
3 433 845 434
3 435 846 433
3 428 846 435
3 429 847 433
3 435 847 429
3 436 848 438
3 437 848 436
3 438 849 428
3 437 849 438
3 439 850 437
3 117 850 439
3 436 851 437
3 439 851 436
3 441 852 440
3 428 852 441
3 440 853 441
3 436 853 440
3 442 854 427
3 428 854 442
3 442 855 440
3 427 855 442
3 446 856 445
3 444 856 446
3 446 857 11
3 445 857 446
3 447 858 445
3 443 858 447
3 447 859 444
3 445 859 447
3 449 860 448
3 444 860 449
3 449 861 9
3 448 861 449
3 450 862 448
3 11 862 450
3 450 863 444
3 448 863 450
3 453 864 443
3 452 864 453
3 453 865 451
3 443 865 453
3 454 866 452
3 427 866 454
3 454 867 451
3 452 867 454
3 455 868 451
3 456 868 455
3 456 869 9
3 455 869 456
3 457 870 451
3 455 870 457
3 457 871 443
3 451 871 457
3 115 8 114
3 115 9 8
3 115 114 117
3 117 114 116
3 117 116 10
3 117 10 11
3 9 10 8
3 9 11 10
3 462 872 461
3 460 872 462
3 462 873 116
3 461 873 462
3 463 874 461
3 459 874 463
3 463 875 460
3 461 875 463
3 465 876 464
3 460 876 465
3 465 877 114
3 464 877 465
3 466 878 464
3 116 878 466
3 466 879 460
3 464 879 466
3 469 880 459
3 468 880 469
3 469 881 467
3 459 881 469
3 470 882 468
3 458 882 470
3 470 883 467
3 468 883 470
3 471 884 467
3 472 884 471
3 472 885 114
3 471 885 472
3 473 886 467
3 471 886 473
3 473 887 459
3 467 887 473
3 477 888 476
3 458 888 477
3 477 889 475
3 476 889 477
3 478 890 474
3 458 890 478
3 478 891 476
3 474 891 478
3 479 892 475
3 480 892 479
3 480 893 8
3 479 893 480
3 481 894 479
3 474 894 481
3 479 895 481
3 475 895 479
3 483 896 482
3 484 896 483
3 484 897 474
3 483 897 484
3 485 898 483
3 114 898 485
3 483 899 485
3 482 899 483
3 487 900 474
3 486 900 487
3 487 901 458
3 474 901 487
3 488 902 486
3 482 902 488
3 488 903 458
3 486 903 488
3 493 904 491
3 490 904 493
3 493 905 492
3 491 905 493
3 494 906 492
3 8 906 494
3 492 907 494
3 491 907 492
3 496 908 495
3 491 908 496
3 496 909 489
3 495 909 496
3 497 910 490
3 491 910 497
3 497 911 495
3 490 911 497
3 500 912 499
3 498 912 500
3 500 913 10
3 499 913 500
3 501 914 499
3 8 914 501
3 501 915 498
3 499 915 501
3 503 916 502
3 498 916 503
3 503 917 490
3 502 917 503
3 504 918 502
3 10 918 504
3 504 919 498
3 502 919 504
3 508 920 507
3 489 920 508
3 507 921 508
3 506 921 507
3 509 922 505
3 489 922 509
3 509 923 507
3 505 923 509
3 506 924 511
3 510 924 506
3 511 925 116
3 510 925 511
3 512 926 510
3 505 926 512
3 506 927 510
3 512 927 506
3 513 928 515
3 514 928 513
3 515 929 505
3 514 929 515
3 516 930 514
3 10 930 516
3 513 931 514
3 516 931 513
3 518 932 517
3 505 932 518
3 517 933 518
3 513 933 517
3 519 934 489
3 505 934 519
3 519 935 517
3 489 935 519