OFF

1138 2272 0
0.115591 0.156881 -0.286584
0.131512 0.254926 -0.179647
0.217545 0.420110 0.264732
0.437128 -0.005656 0.179882
0.422402 -0.138746 0.029476
0.433943 -0.018776 0.090087
0.438897 0.044437 0.040573
0.442873 0.150601 0.163312
0.448736 0.129001 0.242541
0.442156 0.087834 -0.140434
0.436697 0.174436 -0.099375
0.432580 -0.014762 -0.139436
0.468477 0.216526 0.244846
0.437971 0.071650 0.133865
0.418279 -0.132967 -0.045347
0.420457 -0.095133 -0.099338
0.441399 0.046288 -0.084391
0.430859 -0.032997 -0.066004
0.441912 0.251152 0.113530
0.442037 0.186046 0.019576
0.447497 0.099444 -0.021483
0.440315 0.022496 -0.020735
0.431222 -0.037782 0.009338
0.429044 -0.075616 0.063329
0.432636 -0.090196 0.127057
0.433276 -0.088826 0.187247
0.440777 0.001580 0.278725
0.177781 0.342926 0.406474
-0.066678 0.131437 0.374913
-0.077271 0.186812 0.330729
-0.070700 0.182036 0.340639
-0.081802 0.177559 0.344974
-0.071014 0.170175 0.353838
-0.084152 0.163723 0.356471
-0.083965 0.152065 0.363708
-0.070505 0.146938 0.368454
-0.080936 0.132123 0.374202
-0.075846 0.112391 0.378802
-0.061277 0.363136 0.171317
-0.073973 0.312412 0.221239
-0.067062 0.322997 0.217603
-0.077945 0.327645 0.213924
-0.067108 0.337150 0.207129
-0.080018 0.340326 0.201302
-0.079357 0.349028 0.190653
-0.065648 0.354688 0.185928
-0.075603 0.361930 0.172196
-0.069631 0.369589 0.153334
-0.425795 0.201429 0.058535
0.065846 0.344388 -0.079190
0.268508 0.221713 -0.239208
-0.182287 0.143840 0.386054
0.182851 -0.148660 0.277801
-0.132029 0.319907 0.259728
-0.342024 -0.292686 -0.290827
0.129037 0.409790 0.275549
0.228035 -0.141414 0.276030
-0.288310 0.216713 0.285414
0.135148 0.225717 0.441123
0.007114 0.210441 0.381218
-0.118712 0.342265 0.215921
0.102879 0.407756 0.269999
0.056358 0.394259 0.375844
-0.112591 0.166529 0.347178
-0.364887 0.233361 -0.158497
-0.121052 0.138181 0.378143
0.328809 0.101276 0.430603
-0.450870 -0.233336 -0.123392
0.198692 -0.025976 0.370935
-0.189906 -0.300009 -0.385812
-0.271793 0.331263 0.124364
0.442588 0.147137 -0.188863
-0.181911 -0.394911 0.036569
0.145813 -0.317467 -0.215541
0.364216 -0.209767 -0.075322
-0.026365 0.085265 0.390019
-0.434481 0.128076 0.126677
-0.096863 0.314030 0.216888
0.219866 0.196402 -0.293584
0.234529 -0.268109 0.252782
0.345367 0.163480 0.447146
-0.395745 -0.327780 -0.072082
-0.052326 0.319648 0.289691
-0.105137 0.155161 0.358124
-0.050716 0.165675 0.356905
-0.046630 0.341235 0.202665
0.245765 0.271544 0.436447
0.068196 0.308723 0.413633
0.088591 0.415219 0.094029
0.211159 0.421377 0.281910
-0.428449 -0.147672 0.180557
0.225052 0.423522 0.248256
-0.474816 -0.124163 -0.028266
0.025457 0.356620 0.284059
-0.226834 -0.047426 0.317378
0.113999 0.390905 0.380403
0.243840 -0.258820 0.225364
0.481080 0.280950 0.309722
0.092488 0.196078 -0.320090
0.041511 0.233944 0.396347
-0.123540 0.398667 0.137259
0.126810 -0.308412 -0.259893
0.169659 0.202802 -0.307027
0.304709 -0.154478 -0.236443
-0.049825 0.148756 0.367577
-0.172915 0.223321 0.358379
0.204590 -0.147376 0.265907
0.028984 0.388515 0.327590
0.110564 0.249499 -0.236425
-0.042555 0.329417 0.394306
-0.098737 0.094416 0.385172
-0.094103 0.291065 0.345143
0.265285 -0.021341 0.365039
0.022938 -0.108656 -0.436591
-0.167667 0.153928 0.384518
-0.387133 0.241922 0.040095
0.171474 -0.282313 0.241359
-0.079444 0.190806 0.320752
0.122727 0.373728 0.408473
0.184492 -0.311439 0.217217
0.192684 -0.068925 0.337982
0.091768 0.224571 -0.251768
-0.487864 0.094149 -0.013740
-0.046671 0.368633 0.156414
0.309968 0.416406 0.162992
0.129185 -0.268259 0.235551
0.269773 0.367249 0.012586
-0.095915 0.305671 0.335938
-0.412444 -0.261692 0.058685
0.002478 0.332973 -0.097580
0.107356 -0.247918 0.247890
0.053404 0.358557 0.431056
-0.153564 0.240687 0.340550
-0.015142 0.371013 0.195750
-0.035338 0.337056 0.239165
-0.462610 -0.009488 -0.209437
-0.376729 0.075825 0.241766
0.147566 0.379016 0.412659
-0.291410 -0.000515 -0.392005
0.352228 -0.240493 -0.003327
-0.078277 0.373235 0.133195
-0.394539 -0.080769 0.221367
-0.496722 -0.011856 0.086029
-0.134935 -0.434581 -0.055921
-0.465759 0.061811 -0.153181
-0.427469 0.043060 0.201407
-0.104151 0.358134 0.169309
0.251057 -0.268228 -0.170455
-0.039042 0.343153 0.311389
-0.131435 -0.287770 -0.398067
0.080996 0.238104 -0.274380
0.229130 -0.186955 0.267768
0.048264 0.299492 0.428897
0.184720 -0.303854 0.207296
0.191962 -0.296038 0.194342
0.064238 -0.369755 -0.221731
-0.458701 0.013763 0.165383
0.064313 0.339882 0.407821
-0.068615 0.192519 0.317990
0.274279 0.427476 0.220323
0.178125 -0.176359 0.237189
-0.059732 0.176478 0.350483
-0.068237 0.293913 0.231618
0.272574 0.395135 0.326381
-0.176299 0.372419 0.185694
0.081782 0.162477 -0.364189
0.140808 -0.066485 -0.385531
-0.030768 -0.363330 0.085379
-0.050885 0.135391 0.372459
-0.046285 0.364541 0.166861
0.198835 -0.279703 0.214874
-0.029831 0.176527 0.364987
-0.415787 0.220640 -0.009808
-0.016670 -0.262080 0.225541
0.069210 0.301196 0.424568
0.214723 0.220888 0.444382
-0.149893 -0.354690 -0.343273
0.023176 -0.339076 -0.315514
0.282330 0.409630 0.293876
0.146258 -0.348760 0.217951
0.176528 0.281612 0.441052
-0.276982 0.093938 0.328350
-0.025830 0.237152 0.359627
-0.323041 -0.060986 -0.384807
-0.210962 0.330506 -0.012997
-0.167636 0.158052 -0.322002
-0.042985 -0.003987 0.362433
-0.378411 -0.293910 -0.251124
0.106931 0.371335 0.406814
0.099244 0.411411 0.252100
0.095993 0.236201 -0.293327
0.217270 -0.300868 0.227726
-0.329866 0.286703 0.099787
0.046631 0.374307 0.299146
0.160069 0.231289 -0.271464
0.247278 -0.185931 0.238983
-0.191662 0.372740 0.133092
-0.069002 0.372094 0.135194
-0.001198 0.124059 -0.346903
-0.030676 0.353875 0.324808
0.322094 -0.206223 -0.157081
0.153137 0.379231 0.413622
-0.061601 0.299436 0.224893
-0.058419 -0.368350 -0.309912
0.021013 0.391423 0.355513
0.059989 0.392058 0.275386
-0.081989 0.095669 0.378171
0.033360 -0.381391 0.180735
0.393298 0.294498 0.452364
0.061686 0.227732 0.415930
-0.408197 0.206633 0.096660
-0.172172 -0.115881 -0.456225
-0.058009 0.207700 0.315536
-0.335874 -0.360222 -0.201066
0.034619 0.141184 0.416229
-0.407060 0.220992 -0.097138
0.387961 0.011964 0.345045
0.060334 -0.055920 -0.423319
0.020665 0.314139 0.422029
-0.381056 -0.338112 -0.116945
-0.045066 -0.427765 -0.087023
-0.128629 0.295360 0.307041
-0.093181 -0.142565 -0.454588
-0.424373 -0.274873 -0.033653
0.304497 -0.255167 -0.073692
0.262713 -0.161438 0.265002
-0.371671 -0.211285 -0.324432
-0.412728 -0.110732 0.200474
0.059231 -0.343435 0.220623
0.055417 -0.315868 0.235343
-0.048079 0.308731 0.251344
-0.102297 0.169690 0.350390
-0.085222 0.190409 0.319825
-0.099509 0.336784 0.200616
-0.092293 0.331146 0.209618
-0.184471 0.295366 -0.135764
-0.369274 0.223778 0.139650
0.073160 -0.257374 0.233405
-0.014648 0.307067 0.397824
-0.051814 0.127183 0.375382
0.356890 0.379892 0.424202
0.060813 -0.362704 0.201863
-0.363148 -0.353153 -0.159433
0.184873 -0.258392 0.180929
-0.100743 0.342614 0.193445
0.089987 0.186785 -0.366064
0.145813 -0.078971 0.337617
-0.057817 0.369675 0.139824
0.003252 0.235386 0.370396
0.462843 0.302882 0.336331
0.242084 -0.261528 0.233690
0.416428 -0.193095 0.155926
-0.066570 0.091448 0.377959
-0.084188 0.344858 -0.021074
-0.327313 -0.221427 0.200425
-0.129848 -0.411394 -0.249146
-0.380067 -0.047342 0.237899
0.173238 0.211814 -0.323807
-0.136481 -0.245696 -0.424935
-0.089832 0.298674 0.223650
-0.003130 0.388561 0.152864
-0.058147 -0.148919 0.303826
-0.059924 0.187667 0.329669
-0.047459 0.096818 0.377303
0.237653 0.304290 0.429920
0.215501 -0.269043 0.252855
0.148698 -0.346854 0.205642
-0.138979 0.186408 0.358376
-0.429734 0.012698 0.202282
-0.162319 0.368709 0.196074
-0.461148 -0.161342 0.108708
-0.256258 0.255364 0.275994
-0.294161 -0.196169 -0.395081
0.025731 -0.320111 0.149729
-0.373368 0.255551 -0.033530
-0.402124 0.138077 0.175376
-0.165470 0.334690 0.259883
0.082991 0.193411 -0.327052
-0.341606 0.275927 0.021381
-0.081661 0.301696 0.224177
-0.040179 0.266524 -0.194244
0.013615 0.366230 0.318252
0.159197 0.018617 0.404189
-0.425323 0.119949 -0.220329
0.214434 -0.241720 0.240592
-0.090851 0.364980 0.165071
-0.294143 -0.388136 0.005688
0.237627 0.241515 -0.243791
0.058906 -0.320534 0.245579
0.081877 0.252768 -0.235820
0.408487 0.224914 0.448560
-0.312998 0.124586 0.299180
0.175489 0.199401 -0.324044
0.125087 -0.369428 -0.121062
-0.216862 -0.222363 -0.423565
0.274143 0.171987 0.456480
-0.094668 0.367873 0.152503
0.071184 -0.246792 0.257458
-0.112238 0.369158 0.182771
-0.055375 0.181374 0.346156
0.214017 0.185634 -0.281174
0.085136 -0.380312 -0.044815
-0.067514 -0.321615 -0.369257
0.408057 0.410396 0.271106
-0.370918 -0.028359 0.247660
0.080871 0.051844 0.414178
-0.043409 -0.391071 -0.262705
0.108880 0.254758 -0.237064
0.049304 0.177061 -0.291175
0.210589 0.410299 0.330333
0.183762 0.293866 0.436537
0.236880 -0.249532 0.257593
-0.425607 -0.173586 -0.276841
0.094260 0.258297 -0.230797
-0.256988 -0.262175 0.188260
-0.293337 0.125431 -0.317068
0.212122 -0.205479 -0.289407
-0.127964 0.262571 0.330699
0.065752 0.393451 0.357755
-0.478824 -0.006467 0.134550
-0.492912 0.056001 0.052303
0.384682 0.133255 0.428539
0.158242 -0.168603 0.275818
0.086188 0.382810 0.381970
0.202422 0.246460 0.446699
0.085779 0.391485 0.282106
0.029423 0.405234 0.408003
0.043536 0.393141 0.429500
-0.117529 0.306161 0.279389
0.292427 0.042161 -0.279562
-0.055761 0.378757 0.093075
-0.005816 0.140918 0.394843
0.206554 -0.151039 0.271423
0.322154 0.049510 0.400187
-0.068387 0.268806 0.339750
0.061587 0.268422 0.413089
-0.192680 -0.435214 -0.170282
-0.058764 0.141742 0.372621
-0.308341 -0.330465 -0.290611
-0.310174 0.065962 0.302026
0.183448 0.413049 0.328126
0.345365 0.418307 0.209453
-0.073850 0.210297 0.311831
0.046769 0.363944 0.296324
-0.044584 0.112985 0.376531
-0.049313 0.218456 0.329897
0.049222 -0.216069 -0.393640
0.180363 -0.006609 -0.345785
-0.059642 0.317201 0.220654
-0.399083 -0.079661 -0.323049
0.041378 0.370671 0.439577
0.273025 0.283359 0.429568
-0.064081 0.192718 0.318676
0.444632 0.324780 0.362794
0.172488 0.213696 -0.311250
0.093210 0.383862 0.357368
-0.340564 -0.250687 -0.328634
0.155567 -0.169162 -0.350296
0.067116 0.254616 -0.209013
0.013523 0.280652 0.392161
0.006557 -0.412677 -0.160610
-0.478394 -0.081486 0.114112
0.216328 -0.295783 0.229651
0.418197 0.391286 0.239395
-0.190627 0.208634 0.373130
0.088615 0.388780 0.302817
-0.037749 0.367143 0.153005
-0.091371 -0.415455 0.005007
-0.376314 0.251823 0.005414
-0.036172 0.203302 0.353521
-0.264114 0.172337 -0.288572
-0.147448 0.317346 0.275548
0.196770 -0.239992 -0.280811
-0.452536 -0.158742 0.140033
-0.050900 0.064951 -0.399099
-0.268392 -0.281972 -0.363875
-0.480068 -0.073157 -0.089613
0.208392 -0.206471 0.266004
0.130174 -0.152079 0.284348
-0.088603 0.116746 0.379583
-0.416027 -0.286900 0.008716
0.173305 0.431284 0.250795
0.238201 0.397759 0.347057
-0.272941 0.306259 -0.084881
0.265445 -0.115663 0.291699
-0.302750 0.307669 0.092505
0.377201 0.368206 0.063439
-0.335830 0.139045 0.267954
0.238995 0.103333 0.442032
0.068673 0.375637 0.293832
0.191228 -0.320143 0.217764
-0.142968 -0.059806 -0.461025
-0.103582 0.163024 0.353258
0.253669 -0.016910 -0.315889
0.421041 -0.083705 -0.186617
-0.251320 -0.086552 0.298964
-0.057164 0.185717 0.339165
-0.051145 0.372842 0.133754
0.109177 -0.290739 0.235202
-0.027238 0.364694 0.346420
0.233619 -0.141270 0.270996
0.160894 -0.350757 -0.060825
0.370814 -0.071605 0.286240
-0.095065 0.384835 0.066692
-0.194664 -0.338836 -0.351270
0.137020 0.270256 0.423872
-0.409307 0.082546 0.205543
-0.055615 0.371985 0.123456
0.074202 0.158867 -0.383269
0.061172 -0.289136 0.247167
0.027790 0.033650 -0.389837
-0.070425 0.199939 0.314211
0.085129 0.343608 0.415880
-0.424411 -0.283211 -0.166281
-0.044815 0.348005 0.195988
-0.142461 -0.386198 -0.298240
0.111924 -0.218519 0.265342
0.077881 0.150818 -0.371486
-0.052963 0.347063 0.199029
0.241481 0.210504 -0.250347
-0.109759 -0.428695 -0.197091
-0.130383 0.207750 -0.276181
0.172686 0.191313 -0.312965
0.010978 0.403446 0.397448
0.041957 -0.356383 -0.266497
-0.209369 -0.417960 -0.223193
0.414002 0.354153 0.395541
0.205295 0.414831 0.113560
0.184395 0.342262 0.425858
0.272874 -0.153626 0.241068
-0.226083 -0.029318 -0.434302
0.388248 0.415088 0.173783
0.028527 0.366940 0.441628
0.218883 -0.270756 0.222077
0.087822 0.210708 -0.334189
0.105202 -0.178707 0.273986
-0.203399 0.350641 0.205618
0.253477 0.218778 0.450554
-0.060333 0.120445 0.377915
-0.097515 0.123654 0.374624
0.152851 0.238040 0.431678
0.042139 0.403186 0.411027
0.240992 0.422708 0.151149
0.277753 -0.265635 -0.123045
0.103563 0.240941 -0.260888
0.234085 -0.306971 -0.069281
0.198237 0.289326 0.436632
0.265824 0.230569 -0.243125
-0.040777 0.128286 0.373060
-0.078023 -0.315698 0.161664
0.283603 0.248173 0.441082
0.234072 0.433378 0.228812
-0.252116 -0.417777 -0.081369
-0.160291 0.285283 0.313287
-0.197634 0.259838 -0.195518
-0.375011 -0.254853 -0.290507
0.408219 0.390872 0.141914
0.066699 0.392882 0.026660
-0.430015 -0.251733 -0.207796
-0.401758 -0.309840 -0.025314
-0.190617 0.245408 0.340805
0.325902 -0.021763 -0.268433
-0.168160 -0.292111 0.180013
-0.037065 0.194119 -0.286552
-0.024444 0.344702 0.294703
-0.342891 0.258857 -0.114295
-0.118489 0.321456 0.246357
0.441284 0.252660 0.397630
0.243150 0.219292 -0.279422
0.026894 -0.265869 -0.381694
-0.045042 0.354046 0.187223
-0.464404 0.100734 0.100226
-0.049325 0.334303 0.210464
0.347470 0.336642 0.451511
0.308804 0.116770 0.438713
0.129926 0.299847 0.416418
-0.025878 0.098560 0.389415
0.018418 -0.306587 -0.352243
0.051375 0.397562 0.374552
0.418510 0.309359 0.406845
-0.474423 -0.086955 -0.172298
-0.326916 -0.332072 0.088774
-0.018165 0.376856 0.165921
-0.431344 0.170570 0.095269
0.082484 -0.281765 0.191088
0.228023 -0.163942 -0.294025
-0.129893 0.275931 0.322154
-0.490329 0.030974 -0.068429
0.313286 0.261962 0.452661
-0.296793 -0.174042 0.233526
-0.101459 0.132741 0.371776
0.346395 -0.207425 -0.123555
0.207471 0.239188 0.443530
0.249273 -0.237319 0.177881
-0.030440 0.371561 0.034604
0.424559 0.354098 0.122465
0.158058 0.378111 0.003495
0.086637 0.237494 -0.306186
-0.487763 0.019148 0.104026
-0.472636 0.026695 -0.145494
-0.071507 0.290638 0.260928
0.097588 -0.250958 0.265588
0.117252 -0.307702 0.129283
-0.078601 0.099980 0.378908
-0.471792 -0.140793 0.003543
-0.450730 -0.200034 -0.037853
0.302465 -0.202803 -0.192447
-0.082134 0.370649 0.147550
-0.477703 -0.103905 -0.057114
-0.475033 0.145727 -0.001466
0.158905 0.376492 0.411250
0.207466 -0.176217 0.243705
0.462690 0.323581 0.214736
0.054631 0.290689 -0.158091
0.082384 0.226735 -0.303566
-0.120631 0.306417 -0.137252
0.069423 0.384838 0.347335
-0.053756 0.293120 0.369307
-0.282234 0.263640 -0.155996
-0.153046 0.164029 0.382977
-0.470522 -0.154237 0.038127
0.008603 0.363657 0.248989
-0.307885 0.300625 0.144738
-0.457082 0.083996 0.119423
0.194402 -0.254680 0.235594
-0.457440 -0.134633 -0.224389
0.346710 0.414585 0.257336
0.266351 -0.238130 0.161706
-0.097164 0.334903 0.208234
0.105460 -0.122415 -0.401982
-0.010979 0.110175 0.398005
-0.445157 0.172864 0.055221
0.113878 0.209150 -0.262613
0.167817 0.168275 0.460396
0.080134 0.372865 0.390598
0.221815 0.418661 0.302010
-0.196197 0.089367 0.370263
-0.355849 -0.131750 0.229706
-0.053669 0.359750 0.181086
0.082707 0.428057 0.161213
0.204000 0.374868 0.008142
0.201389 0.068266 0.427166
0.152928 0.198752 -0.271622
-0.099145 0.157122 0.358382
-0.376183 -0.326889 -0.207613
-0.066144 0.298674 0.224699
-0.221439 0.216778 0.336967
0.422184 -0.005514 0.313988
-0.138707 0.394151 0.129663
-0.239390 -0.354316 -0.320454
-0.087151 0.369840 0.156161
-0.222104 0.268041 0.292536
-0.040872 0.075813 0.378398
0.112628 -0.291557 -0.299816
0.376869 -0.129779 -0.199503
0.192188 -0.203096 0.224299
0.155613 -0.253392 0.236278
-0.348233 -0.075789 0.247489
-0.008667 -0.158965 -0.436411
0.135592 0.426790 0.232988
-0.060133 0.200222 0.316182
0.348763 0.209871 0.453846
-0.073238 0.228777 0.315126
-0.094798 0.342770 0.195259
0.164822 -0.157332 0.258838
0.208114 0.209323 -0.291330
-0.102975 0.109941 0.373295
-0.160593 0.079682 0.391678
-0.151971 -0.327497 -0.374739
0.335241 0.359654 0.017991
0.252023 -0.223366 0.244723
0.401770 -0.026483 -0.218819
-0.000401 0.382885 0.183042
-0.104995 0.026530 0.375010
-0.016918 0.381179 0.140383
0.186490 0.306908 0.428343
0.326452 0.393871 0.089417
0.146915 -0.335943 0.221075
0.258551 0.395797 0.069847
-0.134611 0.344679 -0.010863
0.087643 -0.276100 0.250776
-0.253772 -0.086874 -0.429810
-0.416923 -0.063577 0.204429
0.045193 0.258635 0.388201
-0.276927 -0.142968 -0.416385
0.099368 -0.249261 0.260041
-0.094596 -0.053413 0.332920
-0.108722 0.307705 0.262574
0.092573 -0.375266 -0.174882
-0.125495 0.174448 0.356869
0.197948 -0.273454 0.245426
-0.500000 -0.000474 0.054065
-0.113821 0.151086 0.356606
-0.183128 0.350572 0.246469
0.500000 0.264154 0.285639
-0.076804 0.301489 0.223649
0.197825 0.219422 -0.302065
-0.435877 -0.229958 0.049440
0.080641 -0.308084 0.246274
0.178080 0.237321 0.438812
0.179424 -0.126800 -0.351605
-0.015136 0.370395 0.344057
-0.345294 -0.372317 -0.107739
-0.090310 0.357251 0.177670
0.169322 0.205537 0.452525
-0.095412 0.360313 0.173547
-0.344296 -0.112308 -0.373107
0.049020 0.401317 0.341430
0.052312 -0.330542 0.204374
-0.456667 0.096633 -0.155197
-0.148338 0.364986 0.206458
-0.470030 0.124687 0.049411
-0.378856 -0.172942 0.206631
-0.151827 0.030029 0.364672
-0.485992 0.107941 0.021730
-0.057937 0.093073 0.379607
-0.426162 0.001759 -0.280591
-0.057171 0.311303 0.221195
-0.224157 -0.388755 -0.273831
-0.112726 0.253250 -0.220464
0.179665 0.427155 0.152735
0.098408 0.230110 -0.286892
-0.060840 -0.090443 -0.455361
0.225670 -0.212067 0.207134
0.277178 -0.151585 0.245828
-0.026856 0.310576 0.392260
0.061631 0.239936 -0.226592
-0.261421 0.308615 0.198309
-0.360226 0.265826 -0.024892
-0.080334 -0.435318 -0.143768
-0.026459 0.257100 0.371668
-0.089348 0.208682 0.305515
0.419882 -0.207654 0.070447
-0.381615 0.098449 -0.279394
-0.071505 0.372248 0.141501
-0.113322 0.226622 0.327835
-0.111259 0.127896 0.367299
-0.088948 0.383105 0.138951
0.202771 0.436491 0.222400
-0.046235 0.172064 0.351361
0.092361 0.184983 -0.359937
-0.105550 -0.006737 -0.447249
0.210408 -0.253476 -0.249400
-0.102186 0.180138 0.329558
0.213208 -0.072246 -0.341224
-0.090080 0.317066 0.218824
0.151254 -0.030697 0.370472
0.247098 0.406595 0.314379
-0.446803 0.048037 0.165451
0.420681 0.367287 0.352388
-0.388402 -0.206210 0.173165
0.082927 0.240844 0.414524
0.145870 -0.326889 0.044012
-0.393437 -0.291708 0.066444
0.392503 0.348218 0.043929
-0.410249 0.173176 0.129408
-0.011752 0.083956 0.398838
0.145051 -0.329975 0.210914
0.069150 0.399052 0.252597
-0.009445 0.013251 0.380790
-0.084586 -0.127175 0.314116
0.003962 0.386346 0.052875
0.091137 0.368939 0.405153
-0.424344 -0.214964 0.132085
0.145860 -0.273298 0.187510
-0.332491 0.269144 0.157131
-0.054560 0.367728 0.160668
0.001205 0.385304 0.363978
-0.498149 0.063433 -0.003008
0.272839 0.368523 0.406305
-0.076358 0.295693 0.224865
-0.053400 0.341697 0.327906
0.272431 -0.265285 0.083315
-0.085305 0.308704 0.221223
-0.236038 0.340228 0.032042
0.195552 -0.290670 0.103145
0.177212 0.377203 0.413151
0.221920 0.323152 0.430766
-0.009355 0.385708 0.385575
0.122380 -0.216157 0.251052
0.218789 -0.280599 0.217947
-0.062355 0.082968 0.377356
-0.457220 -0.166660 -0.198779
-0.076302 0.289345 0.225706
0.259905 0.241190 -0.242673
-0.385972 0.201656 -0.186795
0.227680 -0.302521 0.032220
-0.040009 0.275344 0.370211
-0.053049 0.174233 0.351100
0.254384 0.420799 0.264479
0.223072 0.058407 -0.300771
0.025279 -0.176216 0.283304
-0.052640 -0.258032 -0.409294
-0.131936 0.285891 0.314659
0.091015 0.161257 0.434433
-0.098279 0.350174 0.182410
0.200007 0.174677 0.459760
-0.080841 0.140428 -0.339896
0.072652 -0.323691 0.212250
0.319018 0.321382 0.450832
0.156602 0.408472 0.279845
-0.398375 0.235098 0.013197
0.001445 0.324813 0.415434
-0.317610 0.227258 0.235857
0.221751 0.397147 0.366058
0.035703 0.208168 0.407972
-0.366811 0.188996 0.180732
0.173700 0.221430 0.445670
-0.027211 0.350664 0.213993
0.076668 0.395118 0.319567
0.271845 -0.179151 0.264659
0.365104 0.030416 -0.247777
-0.379949 -0.341084 -0.019254
0.330705 -0.015523 0.356651
-0.000830 0.171782 0.391877
0.243007 0.207256 -0.260689
-0.065665 0.372207 0.130315
-0.049235 0.158231 0.362714
-0.001084 0.392192 0.126458
0.005009 0.388520 0.424516
0.054865 0.334591 0.427946
0.436384 0.016923 -0.210955
0.163765 -0.197989 0.251392
-0.342483 0.273661 -0.058500
0.137343 0.251257 -0.209754
-0.255561 0.340744 0.075269
-0.457965 -0.064581 0.164199
0.348203 -0.052883 0.319988
-0.031207 0.288533 0.381111
0.128229 0.241980 -0.210592
0.272662 -0.068993 0.323002
0.002720 0.377869 0.213036
-0.493807 -0.064349 0.015969
0.138060 -0.313139 0.216847
-0.009330 0.347348 0.417994
0.065517 -0.097105 0.327020
-0.064121 0.099453 0.377218
-0.350258 0.179165 0.212333
0.218687 0.259243 0.443286
0.067660 -0.352693 0.185791
0.146364 -0.334449 0.199241
0.131381 -0.213794 -0.346762
-0.085474 0.318546 0.219415
0.495851 0.263074 0.287986
-0.042766 0.335530 0.208198
0.024222 0.247008 0.379300
0.094650 0.420511 0.206225
-0.052002 0.255966 0.344570
0.349191 0.296912 0.455976
0.099652 0.227030 0.429039
-0.138540 0.222179 0.338905
0.253943 -0.125846 -0.296484
0.148625 -0.167482 0.259728
0.463518 0.134271 0.335368
0.203529 0.394518 0.381162
0.254704 0.028404 0.403810
-0.142388 0.374947 0.067416
0.071927 0.370846 0.406718
-0.122011 -0.348510 0.099347
-0.063404 0.373843 0.121411
-0.478864 0.080174 0.078148
0.114508 -0.254412 -0.333578
-0.336987 0.079417 0.282882
-0.153875 0.389627 0.122074
-0.062693 0.186291 0.335686
0.027985 0.360474 0.302770
-0.490791 -0.021489 -0.032538
0.431334 0.160106 0.382997
0.208649 -0.217394 0.232247
0.064112 0.319052 0.422337
-0.471233 0.047076 0.118479
-0.118608 -0.194874 -0.444014
-0.489468 -0.083897 0.065070
-0.124371 -0.240561 0.232848
-0.097440 0.176323 0.341347
0.271078 -0.199498 0.265256
0.442214 0.342457 0.093000
-0.186891 -0.171087 0.267705
-0.262862 0.043056 0.330976
0.232196 0.181082 0.459124
-0.197671 0.326730 -0.075786
0.187040 0.232336 -0.263093
0.417277 0.198468 0.418823
-0.319632 -0.050961 0.276469
0.144503 -0.291545 0.240003
-0.094572 0.114013 0.377366
0.401638 0.109423 0.389230
-0.071822 0.289901 0.241889
-0.277584 -0.413297 -0.138925
-0.479433 -0.006965 -0.133107
0.223131 0.202516 0.450471
-0.259034 -0.371826 0.060402
-0.430562 -0.181644 0.158892
-0.370658 0.133783 0.213600
0.061421 0.387424 0.398051
-0.109354 0.341413 0.189453
0.112972 0.342524 0.422195
-0.436593 0.168776 -0.143117
0.251686 -0.237928 0.266046
-0.023558 0.214896 0.356376
0.169202 -0.173070 0.273662
-0.079105 0.192567 0.314816
0.279464 0.321706 0.427757
-0.034778 0.350171 0.192418
-0.045589 0.352323 0.385022
-0.051953 0.328410 0.216966
0.092231 0.300691 0.414312
0.054461 0.376112 0.286520
-0.006900 -0.399505 -0.022020
0.460886 0.323728 0.162182
0.236789 -0.233033 0.226403
0.217266 0.210745 -0.299580
0.064363 0.386405 0.309463
0.053542 -0.348708 0.065534
0.279014 0.390059 0.364343
0.044510 0.259702 0.399380
-0.050397 0.186764 0.341018
-0.231688 -0.317075 -0.362065
0.202918 0.248134 0.443543
0.374701 0.377964 0.422325
0.074388 -0.170961 -0.402338
0.069360 -0.350666 0.193808
0.126466 0.226960 -0.273677
0.308958 0.380731 0.422399
0.293270 0.214581 0.456630
0.242155 0.220501 -0.273848
-0.095998 0.172859 0.348690
0.073904 0.278079 0.422292
0.434393 0.368867 0.194782
-0.089150 0.186407 0.326283
-0.351258 0.008067 0.260558
-0.405443 0.001086 0.226198
-0.303171 0.307337 0.025022
0.262430 0.197545 0.461025
-0.057311 0.161189 0.362341
0.263183 0.430815 0.245396
-0.024989 0.337272 0.272845
0.141475 0.226412 -0.253570
-0.361178 -0.163968 -0.351789
0.262110 0.382863 0.363666
-0.185432 0.025049 -0.423211
0.027632 0.410812 0.125894
-0.009562 0.380397 0.415664
-0.423694 -0.020632 0.209071
-0.446833 0.132830 -0.151484
0.414507 -0.197207 -0.024644
0.158384 0.208027 -0.291657
0.394349 0.366058 0.408933
-0.309766 0.003018 0.291612
-0.212104 -0.335113 0.119793
0.191029 -0.163681 0.243177
-0.016060 0.383496 0.127007
0.171468 0.439600 0.215990
-0.040057 0.369876 0.137145
-0.024884 0.124470 0.387693
0.403806 0.095115 -0.218721
0.076815 0.115885 0.436114
-0.022769 0.338171 0.250510
-0.450627 0.179552 -0.054031
0.373173 0.155269 -0.203292
0.255935 -0.194004 0.224241
0.247626 0.201640 -0.275146
0.177666 0.424110 0.265225
-0.227856 -0.272020 -0.395880
0.106749 0.015191 -0.375472
0.460646 0.184413 0.340315
-0.054332 0.321377 0.220407
-0.124824 0.306879 0.296235
-0.001547 0.238530 -0.235417
-0.415591 -0.128563 -0.302936
0.114139 -0.278074 0.202015
-0.229251 0.119788 0.357084
0.339148 0.382004 0.426141
-0.078723 0.194316 0.308798
0.131891 0.187385 0.446988
-0.452007 -0.091920 -0.249490
0.042946 -0.069157 0.348613
0.153932 0.345254 0.433859
-0.354187 0.023540 -0.339907
0.085606 0.262162 0.414561
-0.268819 0.174275 0.321118
-0.184610 0.314982 0.278064
-0.066504 0.340599 0.342769
0.311879 0.416232 0.309186
0.076047 0.196313 -0.340585
0.291463 0.373957 0.413716
0.094215 0.386262 0.339730
0.208483 0.288067 0.437590
-0.130678 0.091609 0.406993
0.081850 -0.242767 0.268956
0.138905 0.417868 0.269485
0.053089 0.365337 -0.033209
-0.133889 0.081591 -0.386921
-0.267541 -0.126397 0.266450
-0.193306 -0.170895 -0.444031
-0.187989 0.281247 0.308844
0.163955 0.343001 0.430679
-0.145877 -0.044865 0.334494
-0.086521 0.091038 0.377168
0.274844 0.220445 -0.234648
-0.082829 0.368791 0.157833
-0.346205 -0.045639 0.258884
0.024821 0.393844 0.429621
-0.219549 -0.216856 0.231675
-0.460565 -0.179537 -0.076211
-0.121729 0.244566 0.327737
-0.216449 0.101611 -0.360999
0.010329 0.356128 0.438284
-0.441388 -0.217396 0.004755
-0.470669 0.132343 -0.077085
-0.441644 -0.046031 -0.268597
-0.031289 0.375358 0.116250
-0.034555 0.361880 0.167635
-0.349556 0.216932 0.180103
0.030717 0.339617 0.440345
0.348736 0.406541 0.383225
-0.009677 0.353130 -0.026617
-0.435620 0.201448 -0.036061
0.423111 0.269869 0.427977
-0.498274 0.027819 0.021529
0.054412 0.243814 0.400533
0.256944 0.427851 0.177924
-0.325656 0.074928 -0.333820
-0.068099 0.313099 0.301860
-0.089675 0.183340 0.335749
0.443161 0.365061 0.293056
0.110274 0.238911 -0.195932
0.004144 0.349290 0.271792
0.180577 0.287531 0.438505
0.349775 0.412574 0.344232
-0.046052 -0.209369 0.265260
0.017054 0.081854 0.416060
0.096396 0.390070 0.322058
0.274242 0.412742 0.117108
0.239959 -0.266620 0.242382
0.032212 0.403540 0.384224
-0.440221 -0.046826 0.185714
0.084695 -0.280165 0.257633
0.164439 0.226138 -0.239711
-0.045638 0.360597 0.174610
-0.459490 0.122870 0.086245
0.201121 -0.198013 0.256723
0.050503 -0.271516 0.215661
0.359892 -0.074632 -0.231658
0.230940 0.371111 0.407439
0.297792 -0.270164 0.012335
-0.316711 0.310778 -0.034708
0.261977 0.323172 0.418195
-0.222690 -0.414270 -0.023000
-0.058158 0.296486 0.231885
0.287923 -0.074375 -0.289453
0.040371 0.405769 0.184945
-0.053886 0.106060 0.378002
0.098823 0.216849 -0.323727
-0.305209 -0.245990 -0.366671
-0.408753 0.161676 -0.208510
-0.047885 0.323820 0.221528
0.226757 -0.261295 -0.210996
-0.106670 0.333034 0.205786
0.197445 -0.324466 -0.129648
0.103150 -0.253948 0.209575
-0.092721 0.325135 0.213548
-0.052759 0.116202 0.378241
-0.093817 0.189624 0.316161
0.372288 0.029059 0.367221
-0.353552 -0.260205 0.160670
-0.322619 -0.389639 -0.048797
-0.479885 -0.038571 -0.115400
-0.023706 0.372330 0.406635
-0.125284 0.207049 0.337798
0.172329 -0.174414 0.261031
0.219540 -0.274479 0.206988
-0.406974 0.050442 -0.284640
-0.341143 0.284793 -0.032564
-0.093259 0.317123 0.323701
0.028426 0.287155 0.414908
0.080263 0.254248 -0.262980
0.048281 -0.378169 0.196770
0.287490 -0.192707 -0.230533
-0.304925 0.229824 -0.203043
0.409108 -0.163912 -0.120736
0.255815 0.129407 0.450897
-0.435328 0.087515 0.162889
0.214901 0.377479 0.415049
-0.470446 -0.049847 -0.193408
0.203422 0.340141 0.428752
0.125463 0.232964 0.432498
-0.427346 0.204385 0.026839
0.207201 0.198817 -0.285853
0.291806 0.425459 0.263178
-0.022001 -0.059419 0.341029
-0.074228 0.373098 0.137674
-0.281728 0.267262 0.232386
0.222543 -0.223314 0.266486
-0.416008 -0.240567 0.098683
-0.048968 0.370834 0.138272
0.147031 0.078550 -0.327365
-0.366395 0.245209 0.081714
0.140290 0.397927 0.310299
-0.332862 0.275187 -0.085488
0.202672 0.238387 0.445653
-0.056738 0.197112 0.321259
-0.451090 0.179273 0.018928
-0.393943 0.037615 0.234113
0.133255 -0.215608 0.259688
-0.081006 0.254414 0.320604
-0.375189 -0.281738 0.114218
-0.295194 -0.300505 0.135944
-0.056069 0.333243 0.212741
-0.033751 -0.209471 -0.426552
-0.047458 0.369646 0.146359
-0.021891 -0.406725 -0.212314
0.210153 0.223259 -0.233359
-0.256889 0.049414 -0.381216
-0.056315 0.294972 0.239137
-0.317612 -0.096944 0.257217
0.056632 -0.012044 0.383508
0.387059 0.403294 0.379505
-0.054825 0.302487 0.229407
-0.094713 0.182398 0.333577
0.222761 -0.293250 0.210651
0.425305 0.323219 0.020173
0.339082 0.110172 -0.234998
0.145188 -0.177969 0.266211
0.071147 0.396084 0.342324
0.056732 0.395144 0.400386
0.073587 -0.222229 0.257342
0.183575 -0.159256 0.273435
0.042672 -0.407846 -0.108878
0.173104 -0.325399 -0.174029
0.065257 0.374004 0.378217
0.384489 0.331893 0.447571
-0.410366 -0.308951 -0.120153
-0.000016 -0.122565 0.317426
0.175751 0.106353 0.440416
0.420285 0.090767 0.357610
0.192896 -0.221515 0.215189
-0.095440 0.137883 0.370401
-0.060040 0.371394 0.132025
0.336655 -0.247379 0.073283
0.043981 0.374628 0.273458
0.065615 0.210470 0.418767
0.002311 0.274723 -0.182737
0.219264 0.204100 -0.260390
-0.132608 0.341962 0.227641
0.366871 -0.185565 0.170187
-0.019751 0.155225 0.384474
-0.471852 -0.122436 -0.143960
-0.055644 0.097847 0.378177
-0.042537 0.364266 0.364531
-0.177226 -0.127599 0.300432
-0.174303 -0.439600 -0.112790
-0.071255 0.080416 0.376715
0.424253 0.388028 0.314659
-0.086907 0.284057 0.240344
0.249986 0.366977 0.402978
-0.222400 0.351298 0.154852
-0.269502 -0.323289 -0.326543
-0.481825 0.082249 -0.082154
0.217572 0.234543 -0.249460
0.442386 0.063564 0.344881
0.093780 0.282030 0.417086
0.103677 -0.279733 -0.324270
-0.467758 -0.161034 0.073249
-0.452544 0.033431 -0.220104
0.062018 -0.277705 0.263496
0.074493 0.376652 0.357544
0.060777 0.358377 0.423547
0.091581 0.318991 0.413274
-0.066232 0.052997 0.373196
-0.467832 -0.154409 -0.110945
-0.307917 -0.290785 -0.331615
0.349555 0.417840 0.304129
0.072765 0.319252 0.407128
0.198105 0.378750 0.415834
-0.377262 -0.029214 -0.335194
-0.355623 0.144926 -0.264859
0.039024 0.389133 0.249284
-0.066455 0.331099 0.362608
-0.268201 -0.360742 -0.282443
-0.117834 -0.172150 0.282138
0.095864 0.208672 0.430952
0.154777 0.402549 0.384197
0.144627 0.345493 0.434848
0.331417 0.414348 0.145071
-0.022971 -0.037504 -0.441662
0.063042 0.184948 0.422205
0.329152 -0.116311 -0.238042
0.272192 0.070478 0.430494
-0.295240 -0.393400 -0.193551
-0.331182 0.190975 -0.242577
-0.213673 0.314745 0.245468
-0.076293 0.093773 0.377715
0.118428 0.238947 -0.237826
-0.066908 0.308800 0.369968
-0.089751 0.105504 0.376932
0.165284 0.402228 0.059535
0.133184 -0.187646 0.268063
0.027136 0.265567 0.385549
0.052726 -0.349506 0.216700
0.194788 -0.311497 0.204273
0.079560 0.353200 0.407642
0.258629 -0.167155 0.244875
-0.076198 0.328060 -0.106280
0.049672 0.331868 0.431917
0.395085 0.408607 0.342174
0.259597 0.123965 -0.257964
-0.339382 -0.102523 0.245440
0.073892 0.098212 -0.336991
-0.246561 0.000021 0.324132
-0.302805 -0.367562 -0.243146
-0.039311 0.154635 0.364191
0.411689 -0.102013 0.246946
0.101133 0.247729 -0.263661
-0.210046 0.169360 0.365793
-0.457024 -0.203514 -0.163076
0.083748 -0.300636 0.240518
-0.351319 -0.345383 0.037349
0.319309 0.409892 0.367811
-0.438756 -0.257262 -0.079856
0.268470 -0.189713 0.247645
-0.425109 0.198336 -0.125542
-0.072981 0.089055 0.377266
0.066701 0.406344 0.228063
0.066225 0.254260 0.399992
-0.385905 0.239331 -0.062740
-0.429507 -0.214940 -0.244986
-0.228204 0.219885 -0.249507
-0.145636 0.085643 0.399339
0.145178 0.403323 0.385331
-0.311473 0.288392 -0.080169
-0.439782 0.077086 -0.223995
0.350743 0.256568 0.459521
0.289935 -0.138167 0.255106
0.132081 0.388450 0.338058
-0.103124 0.143275 0.364159
0.174139 -0.291078 0.213168
-0.080115 0.293098 0.286621
3 684 447 287
3 447 50 287
3 50 899 287
3 899 859 287
3 859 1012 287
3 859 724 1012
3 724 729 1012
3 729 938 1012
3 859 71 724
3 71 10 724
3 10 1 724
3 899 861 859
3 861 300 859
3 300 542 859
3 542 532 859
3 300 422 542
3 10 1021 1
3 1021 569 1
3 569 126 1
3 126 540 1
3 540 926 1
3 540 358 926
3 540 513 358
3 540 49 513
3 540 496 49
3 532 1106 859
3 861 78 300
3 1021 654 569
3 422 417 542
3 1106 1022 859
3 532 0 1106
3 0 996 1106
3 996 690 1106
3 654 386 569
3 496 891 49
3 496 457 891
3 10 19 1021
3 49 129 513
3 532 308 0
3 510 575 27
3 510 428 575
3 510 676 428
3 510 1082 676
3 1082 1074 676
3 1082 754 1074
3 1082 340 754
3 340 309 754
3 340 535 309
3 340 89 535
3 340 862 89
3 340 700 862
3 27 896 510
3 862 2 89
3 340 998 700
3 340 1134 998
3 340 1129 1134
3 575 896 27
3 575 310 896
3 207 1099 977
3 207 608 1099
3 608 229 1099
3 229 288 1099
3 228 1116 698
3 698 241 228
3 495 828 456
3 495 512 828
3 794 1025 62
3 318 516 1066
3 318 1066 1030
3 62 318 1030
3 62 1030 794
3 23 24 5
3 19 6 13
3 23 22 4
3 25 251 1112
3 21 22 6
3 8 13 3
3 8 12 7
3 3 13 5
3 18 19 7
3 13 7 19
3 20 6 19
3 21 20 16
3 394 15 11
3 1021 19 18
3 24 251 25
3 11 9 721
3 25 1112 3
3 6 20 21
3 26 3 1112
3 5 22 23
3 18 12 809
3 4 24 23
3 845 4 14
3 9 71 721
3 9 10 71
3 15 394 980
3 21 16 17
3 1021 18 776
3 17 15 14
3 547 26 1112
3 18 7 12
3 3 24 25
3 11 721 394
3 5 13 6
3 12 753 594
3 17 16 11
3 6 22 5
3 9 20 10
3 17 11 15
3 8 3 26
3 845 632 4
3 16 9 11
3 24 4 632
3 980 845 14
3 251 24 632
3 594 809 12
3 18 809 776
3 547 1060 26
3 20 9 16
3 8 1060 753
3 14 4 22
3 20 19 10
3 8 7 13
3 14 22 17
3 753 12 8
3 26 1060 8
3 15 980 14
3 5 24 3
3 21 17 22
3 720 131 1067
3 1073 87 769
3 157 1073 769
3 157 769 720
3 1067 157 720
3 818 324 492
3 310 575 324
3 818 310 324
3 37 503 379
3 503 736 252
3 31 826 924
3 1037 34 36
3 35 32 834
3 924 117 29
3 826 31 33
3 158 29 117
3 32 30 161
3 438 37 28
3 543 33 34
3 35 34 32
3 36 379 1037
3 29 158 764
3 161 30 764
3 28 37 36
3 379 36 37
3 34 33 32
3 337 438 28
3 36 34 35
3 31 29 30
3 764 30 29
3 33 543 826
3 1037 543 34
3 35 834 337
3 117 411 158
3 438 736 37
3 28 36 35
3 32 31 30
3 834 32 161
3 337 28 35
3 503 37 736
3 31 32 33
3 924 29 31
3 44 45 42
3 247 666 47
3 40 39 41
3 545 162 595
3 42 418 1008
3 348 40 1008
3 545 595 39
3 563 44 43
3 418 42 45
3 38 47 666
3 41 39 742
3 43 234 563
3 39 348 545
3 42 41 43
3 234 41 742
3 603 44 563
3 38 46 47
3 47 900 634
3 42 43 44
3 46 603 900
3 47 46 900
3 39 40 348
3 43 41 234
3 45 538 418
3 42 1008 40
3 47 634 247
3 742 39 595
3 42 40 41
3 538 45 38
3 666 538 38
3 44 603 46
3 38 45 46
3 247 634 1038
3 44 46 45
3 1129 340 1082
3 1083 928 180
3 180 928 818
3 1082 201 1129
3 896 877 510
3 896 310 877
3 137 201 1083
3 763 269 164
3 164 269 593
3 610 548 100
3 100 548 403
3 881 276 371
3 371 276 610
3 460 105 364
3 364 105 114
3 567 114 1128
3 519 114 132
3 519 1128 114
3 567 1128 573
3 129 1042 513
3 1042 358 513
3 660 261 1080
3 1080 261 691
3 192 385 522
3 522 385 70
3 762 339 830
3 848 339 778
3 436 627 70
3 522 627 992
3 57 880 291
3 291 880 181
3 196 1056 70
3 70 1056 436
3 1114 871 181
3 181 871 536
3 569 578 126
3 755 112 68
3 68 112 730
3 921 124 341
3 341 124 1084
3 981 474 1088
3 1088 474 66
3 381 852 638
3 852 620 638
3 779 696 790
3 1034 696 981
3 689 835 989
3 989 835 159
3 437 833 779
3 779 833 295
3 713 333 964
3 964 333 66
3 569 576 933
3 933 576 1084
3 933 124 921
3 386 576 569
3 80 321 66
3 321 964 66
3 303 1072 526
3 1072 989 526
3 290 80 561
3 80 824 561
3 1105 929 1072
3 1072 929 1118
3 208 748 473
3 473 748 699
3 426 479 847
3 1017 649 847
3 473 240 1031
3 819 240 1017
3 353 426 649
3 353 649 1053
3 1031 479 208
3 208 479 918
3 97 865 249
3 925 512 249
3 457 496 1096
3 1096 496 540
3 68 646 282
3 282 646 1016
3 951 1123 1077
3 1077 1123 658
3 214 1086 694
3 694 1086 1081
3 365 55 700
3 700 55 890
3 879 986 749
3 749 986 58
3 381 862 890
3 862 700 890
3 440 707 58
3 707 604 58
3 440 599 707
3 599 175 707
3 381 91 2
3 2 91 689
3 604 790 696
3 779 790 437
3 382 535 647
3 178 647 689
3 264 351 86
3 351 450 86
3 802 885 699
3 823 885 1118
3 214 331 714
3 714 331 1046
3 951 572 260
3 260 572 133
3 1124 209 920
3 209 99 920
3 389 343 807
3 343 1040 807
3 365 325 61
3 61 325 205
3 879 651 1124
3 1124 651 209
3 381 559 852
3 852 559 746
3 604 533 874
3 533 694 874
3 746 1123 951
3 1077 658 205
3 209 1041 705
3 705 1086 214
3 583 1124 920
3 583 99 745
3 205 1040 1077
3 1077 1040 927
3 1098 745 630
3 745 99 248
3 765 93 343
3 205 389 807
3 714 59 705
3 705 59 248
3 731 521 857
3 857 521 927
3 132 460 895
3 895 460 546
3 1091 881 895
3 895 881 371
3 132 486 317
3 317 486 111
3 371 221 453
3 693 221 974
3 1005 747 562
3 1005 334 747
3 464 82 836
3 464 923 82
3 334 687 630
3 630 687 728
3 199 148 464
3 464 148 923
3 359 238 702
3 702 238 625
3 281 601 199
3 199 601 399
3 109 702 625
3 728 238 359
3 1049 671 399
3 671 199 399
3 451 835 689
3 989 159 341
3 779 295 981
3 981 295 80
3 451 91 638
3 2 689 535
3 295 833 824
3 824 437 450
3 883 178 989
3 989 178 689
3 488 450 351
3 738 264 86
3 814 839 163
3 163 839 382
3 802 947 1055
3 264 944 947
3 423 719 842
3 719 907 842
3 1049 804 1078
3 1078 804 109
3 2 862 381
3 1000 175 599
3 1000 599 180
3 796 188 118
3 118 188 95
3 384 120 730
3 713 112 755
3 68 730 120
3 384 246 120
3 1096 578 427
3 933 427 578
3 1096 427 620
3 578 540 126
3 933 442 427
3 620 442 921
3 282 755 68
3 713 755 1088
3 282 541 755
3 1088 541 388
3 727 384 730
3 730 112 713
3 1034 388 541
3 1088 388 981
3 897 573 586
3 897 586 660
3 1103 916 253
3 494 916 891
3 494 403 253
3 494 253 916
3 186 990 586
3 660 990 1033
3 546 551 895
3 895 551 1091
3 706 655 236
3 706 236 913
3 406 793 136
3 136 793 387
3 57 271 546
3 271 551 546
3 196 70 725
3 832 725 385
3 181 778 339
3 181 536 778
3 517 109 625
3 517 687 334
3 667 1049 399
3 464 281 199
3 1078 1094 111
3 111 1094 517
3 1078 882 1049
3 1049 882 671
3 345 747 182
3 728 687 517
3 111 517 334
3 625 238 728
3 230 82 500
3 1137 923 974
3 671 148 199
3 974 882 1078
3 260 841 951
3 133 572 731
3 856 931 214
3 856 214 694
3 852 746 539
3 539 746 951
3 856 694 533
3 1081 604 874
3 189 559 381
3 658 1123 189
3 1081 1041 209
3 749 58 1081
3 371 453 895
3 895 453 132
3 184 674 946
3 674 196 725
3 832 674 725
3 164 196 763
3 832 385 278
3 522 70 627
3 593 1091 436
3 1091 627 436
3 522 992 665
3 703 271 57
3 403 756 579
3 184 756 674
3 184 780 579
3 184 579 756
3 522 665 192
3 997 665 236
3 628 278 368
3 997 278 192
3 997 192 665
3 70 385 725
3 1130 946 973
3 832 946 674
3 997 236 210
3 706 913 703
3 1130 973 723
3 628 973 278
3 164 1056 196
3 992 627 1091
3 848 1109 783
3 94 1109 613
3 51 871 1114
3 1109 848 778
3 291 339 762
3 536 1109 778
3 546 880 57
3 114 105 132
3 703 57 387
3 1114 880 546
3 94 613 897
3 573 613 567
3 94 897 1050
3 660 586 990
3 136 387 762
3 291 387 57
3 304 1003 830
3 304 830 901
3 291 762 387
3 136 762 830
3 848 783 901
3 1015 783 395
3 406 275 793
3 737 387 793
3 304 901 557
3 1015 901 783
3 1114 181 880
3 51 1114 364
3 974 127 693
3 693 127 111
3 1133 1045 860
3 960 870 664
3 960 664 484
3 960 484 237
3 484 942 237
3 623 243 664
3 243 623 493
3 623 860 493
3 623 195 860
3 429 1133 860
3 1102 429 860
3 1102 860 195
3 1043 988 715
3 596 846 988
3 98 165 846
3 729 1093 938
3 621 953 98
3 988 102 354
3 822 98 846
3 781 194 596
3 988 354 565
3 1093 108 444
3 50 468 861
3 684 419 715
3 245 884 408
3 150 514 497
3 1012 938 781
3 1012 781 1059
3 50 861 899
3 884 514 277
3 565 354 811
3 102 165 354
3 307 1113 108
3 640 245 257
3 729 307 108
3 724 313 307
3 1113 190 444
3 434 884 245
3 194 846 596
3 78 257 292
3 307 976 1113
3 953 497 434
3 846 102 988
3 190 953 621
3 825 565 468
3 724 1 926
3 257 245 292
3 108 1113 444
3 444 621 822
3 640 98 953
3 884 434 497
3 444 190 621
3 245 408 292
3 150 289 121
3 596 988 1043
3 861 811 78
3 354 640 257
3 497 514 884
3 194 781 938
3 938 837 194
3 287 1059 419
3 724 926 313
3 684 825 447
3 724 307 729
3 468 565 811
3 811 257 78
3 98 640 165
3 447 468 50
3 1113 976 497
3 497 976 150
3 822 621 98
3 194 822 846
3 497 190 1113
3 640 953 245
3 684 715 825
3 953 190 497
3 354 257 811
3 1012 1059 287
3 245 953 434
3 102 846 165
3 165 640 354
3 715 988 565
3 825 715 565
3 419 1043 715
3 417 408 277
3 729 108 1093
3 468 811 861
3 313 976 307
3 532 514 121
3 514 532 277
3 300 292 422
3 313 926 289
3 837 822 194
3 78 292 300
3 684 287 419
3 447 825 468
3 1059 596 1043
3 514 150 121
3 417 277 542
3 1059 781 596
3 150 976 289
3 1093 837 938
3 837 1093 822
3 444 822 1093
3 1059 1043 419
3 292 408 422
3 532 542 277
3 313 289 976
3 358 289 926
3 422 408 417
3 358 121 289
3 884 277 408
3 343 389 193
3 615 736 1048
3 736 952 1048
3 952 438 962
3 438 239 962
3 239 337 168
3 337 104 168
3 104 834 717
3 834 84 717
3 84 161 688
3 161 299 688
3 299 764 396
3 764 262 396
3 560 1001 352
3 1001 262 352
3 1001 816 262
3 262 816 396
3 639 299 816
3 816 299 396
3 639 1111 84
3 84 1111 717
3 834 104 337
3 104 448 168
3 448 239 168
3 337 239 438
3 952 263 1048
3 736 438 952
3 1092 898 206
3 898 1095 206
3 1095 566 785
3 566 439 785
3 439 636 490
3 636 1135 490
3 1135 592 83
3 592 392 83
3 392 63 231
3 63 774 231
3 774 643 1019
3 643 829 1019
3 829 963 232
3 963 801 232
3 411 117 801
3 801 117 232
3 924 829 117
3 117 829 232
3 924 826 774
3 774 826 231
3 543 392 826
3 826 392 231
3 592 1135 636
3 1135 1037 490
3 439 379 785
3 566 636 439
3 379 1095 785
3 566 1095 898
3 1095 503 206
3 503 252 1092
3 1122 1052 898
3 1122 681 1052
3 1122 252 681
3 681 1069 1052
3 631 873 963
3 592 589 63
3 589 643 63
3 636 566 65
3 681 252 615
3 252 736 615
3 411 342 560
3 873 342 411
3 267 589 519
3 267 519 750
3 519 132 750
3 750 132 905
3 132 317 905
3 317 1005 905
3 969 589 267
3 589 592 65
3 589 65 519
3 888 519 65
3 65 110 888
3 573 888 110
3 182 248 799
3 182 799 345
3 630 248 182
3 799 59 714
3 630 182 747
3 334 630 747
3 1005 562 631
3 969 635 963
3 969 643 589
3 635 969 750
3 905 635 750
3 1005 317 111
3 111 334 1005
3 186 573 1069
3 342 873 631
3 1005 635 905
3 750 969 267
3 907 734 968
3 734 109 968
3 1067 1101 157
3 1101 412 157
3 1104 131 720
3 359 815 1098
3 1098 630 359
3 583 745 1098
3 342 562 212
3 131 327 1067
3 720 769 1104
3 757 1101 1067
3 87 806 174
3 87 174 769
3 87 1073 1068
3 806 87 1068
3 827 879 335
3 827 335 152
3 335 975 152
3 975 218 152
3 914 152 218
3 218 702 907
3 705 248 99
3 719 432 907
3 432 914 907
3 968 423 842
3 327 350 432
3 335 879 1124
3 705 99 209
3 728 517 625
3 1068 1073 412
3 432 350 914
3 815 335 1124
3 815 975 335
3 975 815 359
3 218 359 702
3 218 975 359
3 914 218 907
3 734 907 702
3 968 804 1049
3 109 1094 1078
3 1078 127 974
3 350 1104 914
3 734 702 109
3 517 1094 109
3 693 486 453
3 562 342 631
3 111 486 693
3 963 643 969
3 110 566 898
3 432 719 902
3 757 662 1101
3 174 827 152
3 815 583 1098
3 769 174 1104
3 1104 174 152
3 1104 152 914
3 157 412 1073
3 350 131 1104
3 898 1069 110
3 888 1128 519
3 573 1128 888
3 546 460 364
3 51 114 567
3 1005 631 635
3 132 105 460
3 99 583 920
3 248 630 745
3 1067 327 757
3 174 1061 827
3 806 1061 174
3 345 562 747
3 630 728 359
3 815 1124 583
3 432 902 327
3 110 65 566
3 364 114 51
3 573 110 1069
3 592 636 65
3 1069 898 1052
3 662 412 1101
3 1061 879 827
3 693 453 221
3 327 131 350
3 963 635 631
3 1037 1135 543
3 392 543 83
3 1037 439 490
3 503 1092 206
3 252 1122 1092
3 186 1069 552
3 659 186 552
3 476 552 263
3 681 615 552
3 239 344 962
3 1037 379 439
3 503 1095 379
3 1122 898 1092
3 263 615 1048
3 344 952 962
3 344 239 448
3 263 552 615
3 344 263 952
3 476 263 344
3 448 476 344
3 448 104 1111
3 63 392 592
3 63 643 774
3 963 829 643
3 560 158 411
3 1111 104 717
3 345 799 369
3 799 171 369
3 854 448 1046
3 345 1001 212
3 799 714 171
3 171 714 1046
3 342 212 560
3 262 158 352
3 764 299 161
3 764 158 262
3 834 161 84
3 345 212 562
3 171 816 369
3 816 345 369
3 171 1046 1111
3 543 1135 83
3 829 924 1019
3 924 774 1019
3 963 873 801
3 873 411 801
3 1046 448 1111
3 816 171 639
3 345 816 1001
3 1001 560 212
3 299 639 688
3 1111 639 171
3 158 560 352
3 530 331 214
3 530 476 854
3 659 75 656
3 656 75 476
3 476 448 854
3 530 656 476
3 476 75 552
3 552 75 659
3 530 931 656
3 248 59 799
3 1046 331 530
3 854 1046 530
3 530 214 931
3 931 659 656
3 1069 681 552
3 639 84 688
3 397 995 247
3 247 995 1010
3 1010 123 666
3 666 123 169
3 169 939 538
3 538 939 470
3 470 414 418
3 418 414 85
3 85 472 1008
3 1008 472 805
3 805 866 348
3 348 866 617
3 949 202 1018
3 1018 202 617
3 1018 617 956
3 617 866 956
3 744 956 805
3 956 866 805
3 744 85 803
3 85 414 803
3 418 538 470
3 470 939 912
3 912 939 169
3 538 666 169
3 1010 995 853
3 247 1010 666
3 197 991 140
3 140 991 507
3 507 550 296
3 296 550 285
3 285 605 146
3 146 605 695
3 695 244 795
3 795 244 233
3 233 528 958
3 958 528 961
3 961 645 77
3 77 645 673
3 673 279 259
3 259 279 670
3 162 670 595
3 670 279 595
3 742 595 673
3 595 279 673
3 742 961 234
3 961 528 234
3 563 234 233
3 234 528 233
3 795 146 695
3 695 605 603
3 285 550 900
3 296 285 146
3 900 550 507
3 296 140 507
3 507 991 634
3 634 197 1038
3 716 140 759
3 716 759 407
3 716 407 1038
3 407 759 330
3 1054 259 683
3 795 958 60
3 60 958 77
3 146 298 296
3 407 397 1038
3 1038 397 247
3 162 949 787
3 683 162 787
3 1044 610 60
3 1044 53 610
3 610 53 371
3 53 328 371
3 371 328 867
3 867 328 1137
3 466 1044 60
3 60 298 795
3 60 610 298
3 100 298 610
3 298 100 637
3 403 637 100
3 836 857 927
3 836 230 857
3 464 836 927
3 1077 521 731
3 230 836 82
3 1137 500 82
3 1137 1054 500
3 466 259 587
3 466 60 77
3 587 53 466
3 328 53 587
3 1137 974 867
3 974 923 671
3 494 330 403
3 787 1054 683
3 1137 328 587
3 53 1044 466
3 423 968 678
3 678 968 1049
3 794 1030 534
3 534 1030 323
3 478 62 1025
3 281 765 193
3 765 281 464
3 927 93 464
3 230 500 1014
3 1025 794 327
3 62 478 318
3 757 794 534
3 516 318 1024
3 516 355 1066
3 516 1024 886
3 886 355 516
3 709 607 812
3 812 607 107
3 107 607 204
3 935 204 607
3 204 423 667
3 93 1040 343
3 719 423 326
3 326 423 935
3 907 968 842
3 327 326 441
3 709 812 365
3 93 927 1040
3 923 148 671
3 355 323 1066
3 326 935 441
3 193 389 812
3 193 812 107
3 107 281 193
3 204 667 281
3 204 281 107
3 935 423 204
3 678 667 423
3 109 804 968
3 667 601 281
3 111 127 1078
3 441 935 478
3 678 1049 667
3 671 882 974
3 867 221 371
3 500 1054 787
3 974 221 867
3 259 466 77
3 637 140 296
3 326 902 719
3 757 534 662
3 1024 607 709
3 193 765 343
3 318 478 1024
3 478 607 1024
3 478 935 607
3 1030 1066 323
3 441 478 1025
3 140 637 330
3 763 548 269
3 403 548 763
3 593 881 1091
3 610 269 548
3 1137 587 1054
3 593 276 881
3 1040 205 807
3 765 464 93
3 794 757 327
3 1024 709 932
3 886 1024 932
3 923 1137 82
3 399 601 667
3 812 389 365
3 326 327 902
3 637 296 298
3 593 269 276
3 403 330 637
3 795 298 146
3 330 759 140
3 662 534 323
3 932 709 365
3 132 453 486
3 327 441 1025
3 259 1054 587
3 603 563 695
3 233 244 563
3 603 605 285
3 634 991 197
3 1038 197 716
3 494 911 330
3 661 911 494
3 574 853 911
3 407 911 397
3 169 123 366
3 603 285 900
3 634 900 507
3 716 197 140
3 853 995 397
3 366 123 1010
3 366 912 169
3 853 397 911
3 366 1010 853
3 574 366 853
3 912 366 574
3 912 803 470
3 958 795 233
3 958 961 77
3 259 77 673
3 949 162 545
3 803 414 470
3 230 134 857
3 857 134 708
3 482 133 912
3 230 1014 1018
3 857 708 731
3 708 133 731
3 787 949 1014
3 617 202 545
3 348 1008 805
3 348 617 545
3 418 85 1008
3 787 1014 500
3 708 134 956
3 956 134 230
3 708 803 133
3 563 244 695
3 673 645 742
3 742 645 961
3 259 670 683
3 683 670 162
3 133 803 912
3 956 744 708
3 230 1018 956
3 1018 1014 949
3 805 472 744
3 803 708 744
3 545 202 949
3 482 260 133
3 260 482 574
3 661 718 851
3 718 574 851
3 574 482 912
3 260 574 718
3 574 911 851
3 911 661 851
3 260 718 841
3 927 521 1077
3 1077 731 951
3 731 572 951
3 746 189 1123
3 841 718 661
3 330 911 407
3 744 472 85
3 915 1017 240
3 426 847 649
3 1105 649 1017
3 1105 303 1053
3 1053 303 363
3 431 363 303
3 431 456 363
3 431 386 456
3 1055 839 814
3 624 710 225
3 284 524 1036
3 170 680 153
3 1136 153 733
3 698 733 821
3 679 556 130
3 798 79 311
3 153 577 657
3 398 733 698
3 151 798 993
3 710 1120 775
3 768 284 1036
3 993 798 311
3 116 1136 784
3 941 284 768
3 153 119 577
3 154 664 740
3 130 580 585
3 1120 570 775
3 250 1020 191
3 739 740 664
3 79 680 433
3 850 160 564
3 409 288 229
3 800 970 1023
3 524 116 556
3 524 590 116
3 250 96 1020
3 623 664 971
3 284 311 79
3 119 390 577
3 524 284 265
3 657 577 821
3 501 585 937
3 377 993 284
3 970 564 752
3 511 768 555
3 241 179 977
3 250 570 96
3 679 585 501
3 1004 501 889
3 937 580 598
3 332 377 941
3 784 1136 733
3 739 664 870
3 1023 722 1097
3 1100 266 179
3 501 937 1065
3 228 1099 288
3 993 311 284
3 733 153 657
3 598 1116 228
3 362 191 119
3 810 195 623
3 1004 416 1097
3 179 266 977
3 585 580 937
3 798 570 250
3 580 398 1116
3 580 1116 598
3 377 151 993
3 977 266 207
3 409 237 297
3 1136 170 153
3 1020 1100 390
3 577 179 241
3 56 151 332
3 784 556 116
3 556 784 125
3 265 433 590
3 752 160 722
3 1004 889 416
3 79 934 362
3 1004 679 501
3 191 390 119
3 390 1100 179
3 698 821 241
3 1027 800 322
3 934 250 191
3 937 288 1065
3 288 409 1065
3 398 698 1116
3 784 733 398
3 160 850 511
3 710 775 151
3 288 937 598
3 722 1004 1097
3 241 977 228
3 400 225 56
3 79 362 680
3 228 288 598
3 577 390 179
3 225 151 56
3 524 265 590
3 1023 970 752
3 284 79 265
3 977 1099 228
3 160 555 722
3 941 768 511
3 752 722 1023
3 657 821 733
3 1004 722 679
3 1027 322 52
3 564 160 752
3 821 577 241
3 225 710 151
3 555 768 1036
3 680 119 153
3 362 119 680
3 332 151 377
3 433 680 170
3 739 608 207
3 971 664 154
3 679 130 585
3 191 1020 390
3 941 377 284
3 889 501 1065
3 358 626 121
3 1084 124 933
3 620 921 638
3 661 494 891
3 1053 649 1105
3 159 835 451
3 669 1055 814
3 886 1134 355
3 95 355 1134
3 886 998 1134
3 95 323 355
3 1053 925 353
3 1053 363 925
3 353 249 467
3 61 205 189
3 915 929 1105
3 814 883 1118
3 669 885 802
3 1055 944 839
3 814 163 883
3 163 178 883
3 341 303 526
3 921 159 451
3 303 341 431
3 989 341 526
3 1072 883 989
3 1118 883 1072
3 823 1118 915
3 872 823 915
3 620 539 88
3 539 841 88
3 381 638 91
3 852 539 620
3 890 55 61
3 700 932 365
3 539 951 841
3 88 841 661
3 389 325 365
3 363 828 925
3 819 847 1031
3 205 325 389
3 700 998 932
3 704 535 382
3 704 309 535
3 704 754 309
3 61 55 365
3 998 886 932
3 323 95 662
3 662 188 796
3 704 983 754
3 1074 754 983
3 1129 95 1134
3 118 95 1129
3 763 674 756
3 763 196 674
3 436 1056 164
3 610 276 269
3 992 1091 271
3 594 743 809
3 1017 915 1105
3 763 756 403
3 579 253 403
3 703 665 992
3 205 658 189
3 495 386 654
3 832 278 973
3 192 278 385
3 814 1118 885
3 163 382 647
3 535 89 2
3 382 839 944
3 891 129 49
3 1103 129 916
3 97 512 743
3 925 828 512
3 201 1082 510
3 178 163 647
3 512 495 809
3 456 828 363
3 877 1083 201
3 341 159 921
3 431 341 1084
3 933 578 569
3 620 427 442
3 1096 620 88
3 88 457 1096
3 776 495 654
3 1105 1072 303
3 809 495 776
3 451 638 921
3 746 559 189
3 456 386 495
3 891 916 129
3 776 654 1021
3 97 249 512
3 704 382 944
3 535 689 647
3 689 91 451
3 1084 576 386
3 1096 540 578
3 891 457 661
3 1103 253 579
3 184 946 780
3 1118 929 915
3 944 983 704
3 703 913 665
3 512 809 743
3 386 431 1084
3 921 442 933
3 661 457 88
3 832 973 946
3 872 240 473
3 137 118 1129
3 61 189 890
3 381 890 189
3 593 436 164
3 819 1031 240
3 353 479 426
3 1031 847 479
3 208 918 290
3 918 782 290
3 321 290 782
3 321 782 786
3 321 786 964
3 351 947 802
3 960 237 229
3 229 608 960
3 511 555 160
3 154 740 266
3 1026 416 889
3 106 332 511
3 570 195 810
3 125 784 398
3 332 941 511
3 775 798 151
3 1020 971 1100
3 971 154 1100
3 1100 154 266
3 52 332 106
3 722 1036 556
3 400 624 225
3 79 433 265
3 934 191 362
3 590 170 1136
3 229 237 409
3 739 870 608
3 570 1120 195
3 56 332 52
3 429 1102 1120
3 590 1136 116
3 624 429 1120
3 775 570 798
3 409 297 1065
3 130 556 125
3 798 250 934
3 125 398 130
3 580 130 398
3 106 511 1027
3 590 433 170
3 970 1027 564
3 624 400 429
3 800 1097 322
3 624 1120 710
3 96 570 810
3 266 740 207
3 106 1027 52
3 722 556 679
3 960 608 870
3 1027 511 850
3 798 934 79
3 1027 970 800
3 889 1065 297
3 1026 889 297
3 1020 810 971
3 740 739 207
3 524 556 1036
3 96 810 1020
3 555 1036 722
3 195 1120 1102
3 56 52 400
3 810 623 971
3 1026 297 237
3 800 1023 1097
3 1027 850 564
3 400 246 384
3 378 52 322
3 435 1097 416
3 378 246 52
3 246 400 52
3 384 1133 400
3 429 400 1133
3 1133 1112 1045
3 446 324 575
3 446 575 428
3 1074 985 428
3 66 474 80
3 779 981 696
3 659 876 186
3 918 479 353
3 492 1000 818
3 818 1000 180
3 492 175 1000
3 604 1081 58
3 175 790 604
3 669 802 1055
3 806 1068 475
3 796 475 1068
3 405 180 599
3 806 475 405
3 796 1068 412
3 918 353 467
3 918 467 782
3 925 249 353
3 1041 1081 1086
3 1132 748 208
3 802 699 488
3 814 885 669
3 264 947 351
3 802 488 351
3 824 450 488
3 378 322 1097
3 1132 290 561
3 824 833 437
3 290 321 80
3 824 1132 561
3 1132 824 488
3 699 1132 488
3 823 473 699
3 872 473 823
3 1034 305 856
3 856 305 931
3 533 604 696
3 533 1034 856
3 58 986 440
3 440 879 1061
3 705 214 714
3 305 659 931
3 749 651 879
3 782 467 767
3 1017 847 819
3 209 651 749
3 440 1061 405
3 677 264 738
3 677 738 887
3 677 887 985
3 985 887 446
3 446 887 324
3 175 604 707
3 405 1061 806
3 412 662 796
3 95 188 662
3 738 492 324
3 677 985 983
3 1074 983 985
3 985 446 428
3 1083 475 796
3 118 1083 796
3 567 1109 536
3 567 536 51
3 536 871 51
3 1091 551 271
3 992 271 703
3 435 416 1026
3 964 727 713
3 246 68 120
3 865 743 753
3 1031 208 473
3 567 613 1109
3 573 897 613
3 703 387 737
3 475 180 405
3 310 928 877
3 1041 1086 705
3 1097 435 378
3 1112 1133 402
3 547 1112 402
3 216 547 402
3 1035 216 964
3 848 830 339
3 181 339 291
3 818 928 310
3 823 699 885
3 450 437 86
3 738 175 492
3 1055 947 944
3 876 735 1033
3 876 1033 990
3 876 246 735
3 246 378 735
3 97 743 865
3 467 865 767
3 201 510 877
3 738 86 437
3 887 738 324
3 865 753 1035
3 786 782 767
3 137 1129 201
3 1083 180 475
3 676 1074 428
3 80 295 824
3 80 474 981
3 1088 755 541
3 1034 541 282
3 1016 246 876
3 246 646 68
3 282 305 1034
3 305 282 1016
3 1060 216 1035
3 208 290 1132
3 753 1060 1035
3 1034 533 696
3 694 1081 874
3 786 767 1035
3 786 1035 964
3 876 990 186
3 767 865 1035
3 1060 547 216
3 467 249 865
3 727 402 384
3 493 860 527
3 677 944 264
3 738 437 175
3 437 790 175
3 384 402 1133
3 66 333 1088
3 1016 646 246
3 876 659 1016
3 186 586 573
3 94 783 1109
3 699 748 1132
3 944 677 983
3 405 599 440
3 703 737 706
3 216 402 727
3 216 727 964
3 727 730 713
3 594 753 743
3 1088 333 713
3 981 388 1034
3 659 305 1016
3 848 901 830
3 915 240 872
3 1083 877 928
3 137 1083 118
3 749 1081 209
3 440 986 879
3 364 1114 546
3 1110 1079 338
3 338 1079 549
3 242 213 544
3 544 213 1110
3 81 219 1032
3 1032 219 242
3 380 459 223
3 223 459 81
3 994 128 597
3 597 128 380
3 90 792 373
3 373 792 663
3 843 582 936
3 936 582 227
3 1002 172 987
3 172 701 987
3 156 145 268
3 145 831 268
3 611 531 483
3 483 531 48
3 770 648 156
3 156 648 145
3 149 863 69
3 863 817 69
3 176 568 404
3 568 817 404
3 954 375 863
3 863 375 817
3 226 356 954
3 954 356 1071
3 338 1057 1071
3 1071 1057 817
3 187 54 455
3 455 54 1071
3 509 614 122
3 760 320 614
3 319 498 770
3 770 498 760
3 483 940 611
3 471 760 940
3 982 523 76
3 76 523 471
3 591 320 498
3 668 614 320
3 471 523 760
3 471 940 76
3 1103 280 1042
3 1042 280 868
3 1033 261 660
3 773 930 173
3 619 515 235
3 1103 579 780
3 1080 691 930
3 1080 930 773
3 383 780 946
3 780 235 515
3 893 1050 777
3 777 1050 1080
3 274 723 628
3 628 723 973
3 115 368 997
3 115 701 368
3 997 368 278
3 210 236 655
3 655 483 210
3 76 655 706
3 913 236 665
3 1015 395 893
3 660 1050 897
3 256 557 1107
3 1107 557 1015
3 136 830 1003
3 256 831 304
3 136 1003 406
3 145 1003 831
3 982 406 145
3 145 406 1003
3 76 275 982
3 737 793 706
3 626 868 121
3 376 480 967
3 1047 525 480
3 129 1103 1042
3 780 515 1103
3 235 780 383
3 1130 383 946
3 383 1130 518
3 1130 723 999
3 999 723 274
3 628 368 274
3 274 368 701
3 701 115 48
3 48 115 210
3 997 210 115
3 48 210 483
3 483 655 76
3 554 980 394
3 611 509 1002
3 760 614 611
3 701 48 987
3 76 940 483
3 149 568 302
3 817 568 69
3 817 375 1071
3 1071 356 455
3 455 226 1126
3 1126 312 682
3 487 766 967
3 1062 469 477
3 477 692 302
3 302 258 149
3 149 294 863
3 863 294 954
3 954 272 226
3 226 838 312
3 312 869 525
3 525 875 480
3 480 984 967
3 316 372 978
3 372 741 761
3 761 346 469
3 469 1009 692
3 692 771 258
3 258 894 294
3 294 894 272
3 272 584 838
3 838 606 869
3 869 349 875
3 875 910 984
3 984 135 789
3 978 485 316
3 316 357 741
3 741 820 346
3 346 558 1009
3 1009 222 771
3 771 211 894
3 894 211 584
3 584 581 606
3 606 183 349
3 349 1075 910
3 910 616 135
3 135 1064 499
3 487 144 1058
3 103 751 485
3 485 600 357
3 357 529 820
3 820 113 558
3 558 622 222
3 222 391 211
3 211 391 581
3 581 430 183
3 183 138 1075
3 1075 878 616
3 616 972 1064
3 1064 1131 144
3 554 1087 103
3 1087 950 751
3 751 644 600
3 600 166 529
3 529 217 113
3 113 1085 622
3 622 641 391
3 391 641 430
3 430 840 138
3 138 1013 878
3 878 922 972
3 972 633 1131
3 1131 283 609
3 1058 844 909
3 943 461 950
3 950 393 644
3 644 347 166
3 166 864 217
3 217 410 1085
3 1085 374 641
3 641 374 840
3 840 892 1013
3 1013 906 922
3 922 315 633
3 633 1076 283
3 283 955 844
3 571 711 461
3 461 329 393
3 393 690 347
3 347 996 864
3 864 1108 410
3 410 198 374
3 374 198 892
3 892 697 906
3 906 185 315
3 315 370 1076
3 1076 1090 955
3 955 685 797
3 721 855 711
3 711 1022 329
3 329 1106 690
3 996 0 1108
3 1108 308 198
3 198 308 697
3 697 463 185
3 185 421 370
3 370 1127 1090
3 1090 979 685
3 685 64 1121
3 1121 215 858
3 855 859 1022
3 308 121 463
3 463 868 421
3 421 619 1127
3 1127 454 979
3 979 518 64
3 64 465 215
3 215 1125 917
3 868 626 1042
3 868 280 619
3 619 235 454
3 454 235 518
3 465 518 999
3 465 999 1125
3 1125 274 172
3 48 531 1002
3 1002 531 611
3 611 940 760
3 611 614 509
3 122 614 668
3 668 320 919
3 909 797 1121
3 761 1062 372
3 568 149 69
3 1071 375 954
3 455 356 226
3 226 312 1126
3 312 525 682
3 1047 682 525
3 376 1047 480
3 766 376 967
3 766 487 919
3 761 469 1062
3 469 692 477
3 692 258 302
3 258 294 149
3 294 272 954
3 272 838 226
3 838 869 312
3 869 875 525
3 875 984 480
3 984 789 967
3 967 789 487
3 919 487 668
3 316 741 372
3 741 346 761
3 346 1009 469
3 1009 771 692
3 771 894 258
3 894 584 272
3 584 606 838
3 606 349 869
3 349 910 875
3 910 135 984
3 135 499 789
3 789 499 487
3 668 487 1058
3 103 978 554
3 103 485 978
3 485 357 316
3 357 820 741
3 820 558 346
3 558 222 1009
3 222 211 771
3 211 581 584
3 581 183 606
3 183 1075 349
3 1075 616 910
3 616 1064 135
3 1064 144 499
3 499 144 487
3 668 1058 122
3 394 1087 554
3 1087 751 103
3 751 600 485
3 600 529 357
3 529 113 820
3 113 622 558
3 622 391 222
3 391 430 581
3 430 138 183
3 138 878 1075
3 878 972 616
3 972 1131 1064
3 1131 609 144
3 144 609 1058
3 122 1058 909
3 394 943 1087
3 943 950 1087
3 950 644 751
3 644 166 600
3 166 217 529
3 217 1085 113
3 1085 641 622
3 641 840 430
3 840 1013 138
3 1013 922 878
3 922 633 972
3 633 283 1131
3 283 844 609
3 609 844 1058
3 122 909 509
3 394 571 943
3 571 461 943
3 461 393 950
3 393 347 644
3 347 864 166
3 864 410 217
3 410 374 1085
3 374 892 840
3 892 906 1013
3 906 315 922
3 315 1076 633
3 1076 955 283
3 955 797 844
3 909 844 797
3 509 909 858
3 571 394 721
3 721 711 571
3 711 329 461
3 329 690 393
3 690 996 347
3 996 1108 864
3 1108 198 410
3 198 697 892
3 697 185 906
3 185 370 315
3 370 1090 1076
3 1090 685 955
3 685 1121 797
3 1121 858 909
3 509 858 1002
3 855 721 71
3 855 1022 711
3 1022 1106 329
3 0 308 1108
3 308 463 697
3 463 421 185
3 421 1127 370
3 1127 979 1090
3 979 64 685
3 64 215 1121
3 215 917 858
3 1002 858 917
3 71 859 855
3 532 121 308
3 121 868 463
3 868 619 421
3 619 454 1127
3 454 518 979
3 518 465 64
3 465 1125 215
3 1125 172 917
3 1002 917 172
3 358 1042 626
3 619 280 515
3 1103 515 280
3 235 383 518
3 1130 999 518
3 999 274 1125
3 274 701 172
3 48 1002 987
3 484 664 273
3 237 942 173
3 376 508 1070
3 1047 1070 1115
3 1045 1112 251
3 1045 251 527
3 1045 527 860
3 493 527 243
3 435 691 378
3 1033 735 378
3 1033 378 691
3 660 1080 1050
3 395 1050 893
3 395 94 1050
3 94 395 783
3 893 1107 1015
3 1003 304 831
3 557 256 304
3 237 173 1026
3 1015 557 901
3 275 406 982
3 706 793 275
3 706 275 76
3 770 156 319
3 142 591 498
3 831 843 268
3 770 523 982
3 176 302 568
3 817 549 404
3 817 1057 549
3 1071 54 338
3 455 1126 187
3 1126 682 458
3 732 508 766
3 1062 477 177
3 477 302 203
3 302 176 415
3 176 549 618
3 549 1079 618
3 338 187 1110
3 187 458 544
3 458 1115 413
3 1115 1070 67
3 1070 508 904
3 642 978 372
3 372 553 101
3 553 177 424
3 177 203 306
3 203 415 255
3 415 618 425
3 618 1110 425
3 1110 213 1089
3 544 413 242
3 413 67 1032
3 67 904 1119
3 904 92 505
3 978 642 957
3 642 101 73
3 101 424 155
3 424 306 1011
3 306 255 420
3 255 425 336
3 425 1089 336
3 1089 242 788
3 242 219 602
3 1032 1119 81
3 1119 505 223
3 505 504 908
3 732 772 520
3 506 957 147
3 957 73 1029
3 73 155 588
3 155 1011 360
3 1011 420 629
3 420 336 1051
3 336 788 1051
3 788 602 452
3 602 81 966
3 81 459 712
3 223 908 380
3 908 520 597
3 554 506 200
3 200 147 443
3 147 1029 959
3 1029 588 293
3 588 360 1028
3 360 629 220
3 629 1051 143
3 1051 452 143
3 452 966 948
3 966 712 286
3 712 380 1117
3 380 128 653
3 597 1063 994
3 772 361 270
3 491 443 224
3 443 959 445
3 959 293 401
3 293 1028 301
3 1028 220 808
3 220 143 367
3 143 948 367
3 948 286 72
3 286 1117 791
3 1117 653 481
3 653 994 1006
3 994 270 663
3 74 845 980
3 74 224 139
3 224 445 945
3 445 401 686
3 401 301 652
3 301 808 813
3 808 367 167
3 367 72 167
3 72 791 758
3 791 481 849
3 481 1006 1007
3 1006 663 965
3 663 792 650
3 845 139 632
3 139 945 1039
3 945 686 672
3 686 652 675
3 652 813 502
3 813 167 273
3 167 758 273
3 758 849 449
3 849 1007 462
3 1007 965 314
3 965 650 254
3 650 90 612
3 90 726 227
3 632 1039 251
3 1039 672 251
3 672 675 527
3 675 502 243
3 502 273 664
3 273 449 942
3 449 462 173
3 462 314 773
3 314 254 903
3 254 612 489
3 612 227 537
3 227 582 141
3 435 1026 691
3 173 930 691
3 773 903 777
3 903 489 777
3 489 537 893
3 537 141 1107
3 141 843 256
3 145 648 982
3 982 648 770
3 770 760 523
3 142 498 319
3 760 498 320
3 919 320 591
3 361 90 373
3 553 372 1062
3 549 176 404
3 549 1057 338
3 338 54 187
3 187 1126 458
3 458 682 1115
3 1047 1115 682
3 376 1070 1047
3 766 508 376
3 766 919 732
3 553 1062 177
3 177 477 203
3 203 302 415
3 415 176 618
3 618 1079 1110
3 1110 187 544
3 544 458 413
3 413 1115 67
3 67 1070 904
3 904 508 92
3 508 732 92
3 919 591 732
3 642 372 101
3 101 553 424
3 424 177 306
3 306 203 255
3 255 415 425
3 425 1110 1089
3 1089 213 242
3 242 413 1032
3 1032 67 1119
3 1119 904 505
3 505 92 504
3 92 732 504
3 591 772 732
3 506 554 978
3 506 978 957
3 957 642 73
3 73 101 155
3 155 424 1011
3 1011 306 420
3 420 255 336
3 336 1089 788
3 788 242 602
3 602 219 81
3 81 1119 223
3 223 505 908
3 908 504 520
3 504 732 520
3 591 142 772
3 980 554 200
3 200 506 147
3 147 957 1029
3 1029 73 588
3 588 155 360
3 360 1011 629
3 629 420 1051
3 1051 788 452
3 452 602 966
3 966 81 712
3 712 459 380
3 380 908 597
3 597 520 1063
3 520 772 1063
3 142 361 772
3 980 200 491
3 491 200 443
3 443 147 959
3 959 1029 293
3 293 588 1028
3 1028 360 220
3 220 629 143
3 143 452 948
3 948 966 286
3 286 712 1117
3 1117 380 653
3 653 128 994
3 994 1063 270
3 1063 772 270
3 142 319 361
3 980 491 74
3 74 491 224
3 224 443 445
3 445 959 401
3 401 293 301
3 301 1028 808
3 808 220 367
3 367 948 72
3 72 286 791
3 791 1117 481
3 481 653 1006
3 1006 994 663
3 663 270 373
3 361 373 270
3 319 726 361
3 845 74 139
3 139 224 945
3 945 445 686
3 686 401 652
3 652 301 813
3 813 808 167
3 167 72 758
3 758 791 849
3 849 481 1007
3 1007 1006 965
3 965 663 650
3 650 792 90
3 90 361 726
3 319 156 726
3 632 139 1039
3 1039 945 672
3 672 686 675
3 675 652 502
3 502 813 273
3 273 758 449
3 449 849 462
3 462 1007 314
3 314 965 254
3 254 650 612
3 612 90 227
3 227 726 936
3 156 936 726
3 527 251 672
3 527 675 243
3 243 502 664
3 484 273 942
3 942 449 173
3 173 462 773
3 773 314 903
3 903 254 489
3 489 612 537
3 537 227 141
3 141 582 843
3 156 843 936
3 173 691 1026
3 691 261 1033
3 777 1080 773
3 777 489 893
3 893 537 1107
3 1107 141 256
3 256 843 831
3 843 156 268
