OFF
1125 1188 0
-0.2775881228 -0.0014072746 0.0068447353
-0.2743514261 0.0096839617 -0.0041167271
0.4999520481 -0.0136826909 -0.0021232571
-0.2727040716 -0.0045302411 -0.0032253621
-0.5000000000 -0.0013334209 0.0038682114
-0.4996186349 0.0166188192 0.0039182555
-0.2612882806 -0.0046918886 -0.0031884262
-0.2715289879 0.0029538098 -0.0084880715
-0.2848601017 0.0061516417 -0.0077740978
-0.2724967857 -0.0045508315 0.0031101243
-0.2707482238 -0.0049355918 -0.0012470836
-0.2628343486 -0.0038143464 -0.0046204933
-0.2609483241 -0.0047141396 0.0030716722
-0.2864429124 0.0105158219 0.0031991325
-0.3421733451 0.0351841283 -0.0318147125
-0.3436644422 -0.0350072280 -0.0320103794
-0.2843885917 0.0060969725 0.0077153713
-0.3433720317 -0.0191093034 0.0416425682
-0.3425650503 0.0188782463 0.0417484631
-0.2822713085 0.0026054526 -0.0084449157
-0.2701104753 0.0021124380 0.0081343684
-0.3429708585 -0.0001250568 0.0451312392
0.4999865215 -0.0120426395 -0.0015229026
0.4999167688 -0.0153261521 -0.0015320558
-0.4973370710 0.0008755356 0.0071585185
-0.4970440989 0.0146667935 0.0071969633
-0.2707824499 0.0023168813 -0.0083409149
-0.3426119699 0.0165185431 0.0365303659
-0.3433180793 -0.0167205891 0.0364377078
-0.2801242221 -0.0000851804 -0.0077529370
-0.3426803032 0.0121447907 -0.0034092637
-0.2856697864 0.0099179940 0.0042625106
-0.3429137792 0.0001096222 -0.0394898738
-0.2858389974 0.0100347809 -0.0041636077
-0.4971926146 0.0077627718 0.0101850515
-0.2627402959 -0.0037966716 -0.0045771181
-0.2747583571 0.0087101792 0.0058941872
-0.2777872439 -0.0013648179 -0.0068682877
-0.4998792856 0.0039617272 -0.0094824535
-0.4997213187 0.0113978029 -0.0094617245
-0.3439261803 -0.0459028912 0.0171432104
-0.3419779540 0.0458072012 0.0173988633
-0.2738250059 -0.0035444601 0.0045647402
-0.2722025913 -0.0046839438 0.0029189031
-0.2728824252 0.0064086662 0.0072608442
-0.2750021731 0.0101882407 0.0031604679
-0.2826460679 0.0031461262 0.0084120396
-0.2764427907 -0.0026816675 -0.0060705154
-0.2733735626 0.0066563886 -0.0073090603
-0.2743081446 0.0096345460 0.0042534937
-0.2779050704 -0.0013621500 -0.0069274118
-0.2610598921 -0.0047125075 0.0030720225
-0.2699606134 0.0020776524 0.0080646896
-0.2865123631 0.0090587922 -0.0060985367
-0.2830923863 0.0032030898 -0.0085834948
-0.3426627447 0.0130683324 -0.0000594644
-0.2798862424 -0.0001324677 0.0076612379
-0.2719882053 -0.0046056403 0.0028441078
-0.2860838117 0.0090136506 0.0059605466
-0.2685400521 -0.0002984611 -0.0076617156
-0.2605597020 -0.0047771191 -0.0027158606
-0.3436116127 -0.0307863493 0.0278379643
-0.3423068857 0.0306318899 0.0280091751
-0.2857942406 0.0100107486 -0.0041550127
-0.2865486400 0.0114412464 -0.0000609679
-0.2848199136 0.0069645865 -0.0073748731
-0.2646481819 -0.0029066759 0.0058019485
-0.2729036405 0.0058170321 0.0076233956
-0.2650096416 -0.0028678777 -0.0060036362
-0.2867327772 0.0114465269 -0.0000609722
-0.2865290671 0.0105362048 -0.0032296402
-0.2750946906 0.0102086546 -0.0031931519
-0.2732100621 0.0058671562 -0.0076825031
-0.2750680928 0.0087517946 -0.0060319851
-0.2592248130 -0.0050639263 0.0012780951
-0.2857572407 0.0099648667 0.0042795287
-0.2646829128 -0.0029060439 0.0058021374
-0.3435739423 -0.0306314692 -0.0280090693
-0.3422692153 0.0307867700 -0.0278378585
-0.2624282523 -0.0037621155 0.0045186667
-0.2814915255 0.0023752608 0.0081741568
-0.2711898838 0.0028996538 0.0083172952
-0.2796315498 -0.0001371355 0.0076591863
-0.4998920352 0.0039093080 0.0094189733
-0.4997340683 0.0113453838 0.0094397022
-0.2623299077 -0.0037432310 0.0044731017
-0.2605103533 -0.0047728571 0.0027819133
-0.2728396251 0.0063909541 0.0072454557
-0.2845232879 0.0061002520 0.0077164474
-0.2607332319 -0.0048543578 0.0028597466
-0.2863829368 0.0090553035 -0.0060977223
0.4999845813 -0.0120506165 0.0013534632
0.4999148286 -0.0153341291 0.0013443100
-0.3433157820 -0.0188780352 -0.0417486736
-0.3425088005 0.0191095145 -0.0416427788
-0.2863449303 0.0105309229 -0.0032291096
-0.2799747763 -0.0000879375 -0.0077516860
-0.2705051527 -0.0051568230 -0.0001063879
-0.2816382490 0.0024090377 0.0082418350
-0.2660739762 -0.0016515667 0.0067347731
-0.2743982582 0.0097094086 -0.0041259512
-0.2605968240 -0.0047902978 -0.0027286589
-0.2846675309 0.0061469147 -0.0077725073
-0.2706893480 -0.0051542788 -0.0001063998
-0.2706269738 -0.0048772718 -0.0012238929
-0.2749010847 0.0102030659 -0.0031925105
-0.2707488898 -0.0049421989 0.0013169746
-0.3439028807 -0.0458070962 -0.0173987584
-0.3419546545 0.0459029961 -0.0171431054
-0.4999947190 -0.0013117082 -0.0039610067
-0.4996133539 0.0166405319 -0.0039109627
-0.2829671539 0.0032004266 -0.0085824703
-0.2843622517 0.0067307943 0.0073251512
-0.3429099739 0.0001252673 -0.0451312392
-0.2593131174 -0.0051066325 0.0012946537
-0.2706637833 -0.0049013217 0.0013010403
0.4999493042 -0.0136939724 0.0019446648
-0.4973272766 0.0009158044 -0.0073617291
-0.4970343046 0.0147070624 -0.0073232843
-0.2774575836 -0.0014098648 0.0067791327
-0.2707447461 0.0023080296 -0.0083233352
-0.2684324530 -0.0003428903 0.0075696445
-0.2662942956 -0.0016092826 -0.0067547935
-0.2862195534 0.0090172688 0.0059614124
-0.2716615869 0.0029566298 -0.0084892057
-0.4971787633 0.0078197207 -0.0103497123
0.4999639505 -0.0130193491 0.0014346565
0.4999333744 -0.0144586812 0.0014306442
-0.3422163970 0.0350071224 0.0320104838
-0.3437074941 -0.0351842338 0.0318148169
-0.2749312998 0.0087481493 -0.0060311661
-0.2751016995 0.0111093206 -0.0000613250
-0.2742165184 0.0095857966 0.0042358415
-0.3425627511 0.0167209040 -0.0364373918
-0.3432688605 -0.0165182283 -0.0365300499
-0.2752963582 0.0111149298 -0.0000613355
-0.2739212317 -0.0035627549 0.0046092556
-0.2664226422 -0.0016063763 -0.0068192923
-0.3429670535 -0.0001094129 0.0394902948
-0.2825134696 0.0031432073 0.0084108578
-0.2720671548 -0.0046199128 -0.0028027648
-0.3437825710 -0.0400811172 -0.0152238739
-0.3420778834 0.0401647269 -0.0150001789
-0.2742151822 -0.0035935925 -0.0046741888
-0.2846800888 0.0069068346 -0.0073252553
-0.2766817043 -0.0026777467 -0.0060718235
-0.2746152509 0.0087062993 0.0058933257
-0.2761003641 -0.0027204341 0.0058687394
-0.2822388427 0.0025977712 -0.0084295468
0.4999861746 -0.0119990202 0.0005459321
0.4999123531 -0.0154740649 0.0005362450
-0.2862819249 0.0105111403 0.0031984912
-0.2659402791 -0.0016542210 0.0066681198
-0.2681651319 -0.0003478264 0.0075676006
0.5000000000 -0.0113664786 -0.0000828237
0.4999013523 -0.0160101848 -0.0000957686
-0.2730467559 0.0058204902 0.0076245718
-0.2734131544 0.0058722120 -0.0076840997
-0.2639783902 -0.0016774454 0.0000486098
-0.2591605179 -0.0052946327 0.0000418280
-0.2705932093 -0.0051347093 0.0000345599
-0.2705846942 -0.0051303630 0.0000345777
-0.2751699607 0.0110719574 0.0000764186
-0.2749858651 0.0109656041 0.0000762478
-0.2864389607 0.0113049453 0.0000694634
-0.2591509414 -0.0052898877 0.0000418477
-0.3438629934 -0.0434289554 -0.0001210637
-0.3439947904 -0.0496331220 -0.0001383586
-0.3418860464 0.0496331220 0.0001383580
-0.3420178346 0.0434293764 0.0001210643
-0.4969785278 0.0175430716 -0.0000552513
-0.4973928477 -0.0019604733 -0.0001096198
-0.2866136901 0.0114061513 0.0000696263
-0.2652611858 -0.0028637932 -0.0060051630
-0.2686979192 -0.0002956304 -0.0076629721
0.4999870251 -0.0119955233 -0.0007149911
0.4999132036 -0.0154705680 -0.0007246782
-0.2761329924 -0.0027199520 0.0058689293
-0.2590682715 -0.0053179736 -0.0001062781
-0.3426848887 0.0121259377 0.0033888164
-0.2593146204 -0.0051013012 -0.0012106733
-0.2732253993 0.0065947652 -0.0072560792
-0.2723915319 -0.0045523294 0.0031097701
-0.2843194560 0.0067128718 0.0073097621
-0.2720353316 -0.0046084070 -0.0027915536
-0.2591859241 -0.0050393529 -0.0011860991
-0.2592619382 -0.0053152281 -0.0001062958
-0.2727966941 -0.0045289045 -0.0032256314
-0.2613861673 -0.0046905454 -0.0031886991
-0.2743018370 -0.0036098546 -0.0047141867
-0.2748317143 0.0101833576 0.0031599378
0.4999660039 -0.0130109068 -0.0016094956
0.4999354277 -0.0144502389 -0.0016135079
-0.2710488666 0.0028965561 0.0083161186
-0.3438029581 -0.0401649376 0.0150002830
-0.3420982704 0.0400809065 0.0152239780
-0.3072633883 -0.0241651386 0.0005899883
-0.3255331732 -0.0321650381 0.0077951356
-0.3072333707 -0.0225331297 0.0081506616
-0.3078955817 -0.0223852890 0.0089221954
-0.3257535972 -0.0265858191 0.0183800799
-0.3077999090 -0.0176959948 0.0153410361
-0.3087664222 -0.0171745521 0.0162236100
-0.3260422507 -0.0169475706 0.0263306589
-0.3086196555 -0.0101416720 0.0205234817
-0.3103878314 -0.0090652270 0.0216084203
-0.3266774425 -0.0045873199 0.0305493576
-0.3102123186 -0.0007596388 0.0231347138
-0.3123026513 0.0011498124 0.0238660649
-0.3274573106 0.0088341778 0.0301982154
-0.3121251095 0.0094637904 0.0223861004
-0.3133345687 0.0186813421 0.0176671631
-0.3134871108 0.0116246687 0.0219277586
-0.3279732693 0.0175999426 0.0270987645
-0.3132302611 0.0234058504 0.0112745646
-0.3133345687 0.0186813421 0.0176671631
-0.3277685734 0.0270188701 0.0196418698
-0.3143559802 0.0257435289 0.0076468021
-0.3139284160 0.0267320786 -0.0020212717
-0.3133789861 0.0235357807 -0.0111627171
-0.3278241007 0.0271612753 -0.0195002878
-0.3134746520 0.0188468023 -0.0175815569
-0.3134746520 0.0188468023 -0.0175815569
-0.3280187016 0.0177838531 -0.0270094743
-0.3136214199 0.0118138693 -0.0218813235
-0.3125763109 0.0013536967 -0.0239597103
-0.3124007969 0.0096593376 -0.0224334693
-0.3275695310 0.0090373003 -0.0301985510
-0.3105869654 -0.0089401892 -0.0217287308
-0.3104094248 -0.0006262639 -0.0232086428
-0.3267503723 -0.0044152835 -0.0306093023
-0.3088945622 -0.0171125309 -0.0163416290
-0.3087420213 -0.0100559104 -0.0206021193
-0.3260817114 -0.0168153796 -0.0264358394
-0.3079248629 -0.0223505150 -0.0090133193
-0.3078205485 -0.0176256910 -0.0154059170
-0.3257494026 -0.0264909921 -0.0185111943
-0.3073056086 -0.0241822736 -0.0006840737
-0.3072653974 -0.0225083545 -0.0082354787
-0.3255440898 -0.0321316954 -0.0079539738
-0.3016098017 -0.0273485242 0.0005698682
-0.3015754967 -0.0254834088 0.0092106527
-0.3227679910 -0.0366257077 0.0088565393
-0.3022182668 -0.0253378742 0.0099625618
-0.3021089237 -0.0199785455 0.0172983651
-0.3229628804 -0.0302610540 0.0208886894
-0.3030678732 -0.0194731746 0.0181667418
-0.3029001420 -0.0114357094 0.0230806175
-0.3232199525 -0.0192912390 0.0299046550
-0.3046561554 -0.0103817622 0.0241553440
-0.3044555688 -0.0008896389 0.0258996795
-0.3238135070 -0.0052534095 0.0346432916
-0.3065406669 0.0009936906 0.0266328038
-0.3063377628 0.0104953421 0.0249414158
-0.3245528586 0.0099359684 0.0341906335
-0.3075494111 0.0207078943 0.0196356640
-0.3250572307 0.0197930703 0.0306920635
-0.3077237378 0.0126434562 0.0245046536
-0.3074301896 0.0261079337 0.0123298538
-0.3248232933 0.0305575281 0.0221701688
-0.3075494111 0.0207078943 0.0196356640
-0.3085739574 0.0284395793 0.0087376409
-0.3085280036 0.0303525397 0.0001073883
-0.3252300019 0.0390363507 0.0044379995
-0.3081421523 0.0296712653 -0.0019937966
-0.3081764563 0.0278062023 -0.0106345283
-0.3250484034 0.0377871307 -0.0095684510
-0.3075900269 0.0262488807 -0.0121995923
-0.3076993722 0.0208894467 -0.0195353958
-0.3248816860 0.0307165045 -0.0220071524
-0.3076993722 0.0208894467 -0.0195353958
-0.3078670999 0.0128521398 -0.0244494290
-0.3251040864 0.0199994806 -0.0305890873
-0.3068273600 0.0012166485 -0.0267272872
-0.3246680803 0.0101630815 -0.0341850330
-0.3066267733 0.0107087720 -0.0249830570
-0.3048692121 -0.0102422057 -0.0242839830
-0.3238895930 -0.0050584692 -0.0347076111
-0.3046663081 -0.0007405545 -0.0259752658
-0.3032023690 -0.0194019498 -0.0182937488
-0.3232590755 -0.0191399925 -0.0300212112
-0.3030280389 -0.0113373534 -0.0231628959
-0.3022498524 -0.0252986970 -0.0100637086
-0.3229571473 -0.0301529625 -0.0210370440
-0.3021306331 -0.0198987629 -0.0173695191
-0.3016547054 -0.0273672116 -0.0006745159
-0.3227787931 -0.0365871539 -0.0090366372
-0.3016087506 -0.0254541987 -0.0093047158
-0.3863957065 -0.0029203064 -0.0035933191
-0.3883382117 -0.0019947275 -0.0050164151
0.1173277915 -0.0090949726 -0.0037686094
0.1185412101 -0.0095702492 -0.0030762745
-0.0739666972 -0.0059793829 -0.0048868862
0.1185412101 -0.0095702492 -0.0030762745
0.1192653007 -0.0100083487 -0.0023603774
-0.0721465693 -0.0066922978 -0.0038483839
0.1192635182 -0.0100805567 -0.0019566886
-0.3868850337 -0.0008829315 -0.0067161223
-0.3899270309 0.0019368949 -0.0086170697
0.1156976878 -0.0073743500 -0.0046376117
0.1168205661 -0.0080297607 -0.0041841507
-0.0764211822 -0.0038364056 -0.0061496637
0.1168205661 -0.0080297607 -0.0041841507
0.1174628931 -0.0086590583 -0.0038085721
-0.0747368647 -0.0048195217 -0.0054694721
0.1174628931 -0.0086590583 -0.0038085721
-0.3900017539 0.0019382734 -0.0086176953
-0.3914858359 0.0035824085 -0.0090329741
0.1156187542 -0.0073729347 -0.0046382400
0.1145847991 -0.0056829048 -0.0052320860
0.1156270644 -0.0069891607 -0.0048931146
-0.0765354274 -0.0036423956 -0.0062780434
0.3072684236 -0.0096827979 -0.0036776716
-0.0780988254 -0.0016830118 -0.0067865004
-0.0770565601 -0.0029892676 -0.0064475291
-0.1744406377 0.0003169348 -0.0075637077
-0.3921944248 0.0087723588 -0.0086171159
-0.3900729586 0.0055100736 -0.0094660913
0.1133779709 -0.0035718753 -0.0046459993
0.1142185080 -0.0050285485 -0.0050487835
-0.0786552400 -0.0010373694 -0.0067684275
0.3066719874 -0.0082913910 -0.0031277474
-0.0799160456 0.0011476404 -0.0061642512
-0.0790755085 -0.0003090328 -0.0065670354
-0.1765630538 0.0035073983 -0.0069233771
0.1142185080 -0.0050285485 -0.0050487835
-0.3922907102 0.0087747223 -0.0086179112
-0.3909472031 0.0104293520 -0.0075486911
0.1124592143 -0.0016454225 -0.0037774439
0.1133064794 -0.0026931254 -0.0044159814
-0.0813044392 0.0035531860 -0.0049047145
0.1132764248 -0.0035693474 -0.0046467976
0.1132962206 -0.0031772591 -0.0044592779
-0.3929791421 0.0135857274 -0.0035700362
-0.3916896175 0.0126189927 -0.0052761970
0.1125429702 -0.0008962287 -0.0019537508
0.1125276108 -0.0016472451 -0.0037770344
-0.0812018445 0.0035504521 -0.0049041002
0.1128175477 -0.0011793389 -0.0028198149
0.1128177995 -0.0011557808 -0.0024158591
-0.4211468286 0.0143926613 -0.0036601132
-0.4198294155 0.0148439311 -0.0017322575
0.1123518209 -0.0001257744 -0.0000720796
0.1124526547 -0.0005789120 -0.0016379878
-0.0813210180 0.0048148713 -0.0024155699
0.3061759104 -0.0057461265 -0.0000774516
-0.0814722687 0.0054945777 -0.0000667075
-0.0813714349 0.0050414401 -0.0016326158
-0.1783843135 0.0083047538 -0.0000640215
0.1124461672 -0.0008934344 -0.0019540715
-0.4211517618 0.0143723784 0.0036535359
-0.4198317083 0.0148345046 0.0016667826
0.1125772301 -0.0009078313 0.0018529349
0.1125070675 -0.0002004372 -0.0000032880
-0.0812393988 0.0053825834 0.0000364799
-0.1781126319 0.0081740938 0.0000563638
-0.0811623234 0.0049914602 0.0015783249
0.1125841429 -0.0005915605 0.0015385570
0.3062535337 -0.0057834579 -0.0000430558
-0.0811237857 0.0047958986 0.0023492474
-0.3930307736 0.0135673205 0.0035586940
-0.3916318262 0.0118420312 0.0065791879
0.1124920007 -0.0009053898 0.0018532000
0.1126131121 -0.0016702186 0.0036238252
0.1128382183 -0.0012080353 0.0028034784
-0.0810726225 0.0035199803 0.0047590062
0.1128390150 -0.0011822371 0.0023997129
-0.3920613300 0.0087211781 0.0085775368
-0.3907163453 0.0103818830 0.0074561673
0.1126846652 -0.0016721586 0.0036233944
-0.0809652929 0.0035170704 0.0047583600
-0.1777902719 0.0061116848 0.0053258428
-0.0800774799 0.0023593978 0.0054344251
0.1135724781 -0.0028298312 0.0042994594
0.3063346232 -0.0068613875 0.0024884288
-0.0796335735 0.0017805615 0.0057724576
0.1135621627 -0.0033141975 0.0043400561
0.1135301550 -0.0036011585 0.0045290261
-0.3921286781 0.0087228179 0.0085780748
-0.3899193412 0.0054544490 0.0092985455
0.1134585973 -0.0035994294 0.0045296142
-0.0797940793 0.0011105304 0.0060770930
-0.1764204176 0.0034655103 0.0068508324
-0.0788656433 -0.0003498878 0.0064234547
0.1143870333 -0.0050598476 0.0048759759
0.3067112739 -0.0083093893 0.0029821354
-0.0784014252 -0.0010800969 0.0065966355
0.1143870333 -0.0050598476 0.0048759759
-0.3912027524 0.0035262577 0.0089149155
-0.3897617925 0.0018860862 0.0085390798
0.1144502188 -0.0053987082 0.0051303917
0.1149943454 -0.0058081600 0.0050046772
-0.0774831340 -0.0018652538 0.0065346834
0.1158920862 -0.0070208994 0.0047561327
0.1158841212 -0.0074032538 0.0044991224
-0.3898891388 0.0018884201 0.0085401056
-0.3867350317 -0.0009222082 0.0065137239
0.1157504607 -0.0074007858 0.0045001444
-0.0763409962 -0.0038718380 0.0060348944
0.1169296991 -0.0080551239 0.0040827087
0.1176252308 -0.0086823626 0.0036163908
0.1169296991 -0.0080551239 0.0040827087
-0.0745721385 -0.0048533453 0.0054087409
0.1176252308 -0.0086823626 0.0036163908
-0.3880501820 -0.0020269275 0.0048684754
-0.3861957660 -0.0029428752 0.0034889908
0.1176333233 -0.0091204025 0.0035731293
-0.0735074293 -0.0060135392 0.0046875389
0.1187924605 -0.0095386801 0.0029087059
0.1187924605 -0.0095386801 0.0029087059
-0.0717687236 -0.0066409556 0.0036909038
0.1194832523 -0.0100241343 0.0022079911
0.1194820145 -0.0100941023 0.0018039586
-0.3862483928 -0.0029421262 0.0034891679
-0.3840410978 -0.0035573760 -0.0001080098
0.1203252075 -0.0103946465 0.0002149746
0.1195895606 -0.0101642114 0.0016979958
-0.0705718356 -0.0075092846 0.0022788712
0.1202996179 -0.0102903487 0.0009154494
0.1202996179 -0.0102903487 0.0009154494
-0.3839490002 -0.0035586482 -0.0001080038
-0.3863493953 -0.0029209747 -0.0035931844
0.1203577141 -0.0105247688 -0.0006409339
0.1203636398 -0.0102549605 -0.0009553887
0.1196767508 -0.0101238435 -0.0017202694
0.1203636398 -0.0102549605 -0.0009553887
-0.0704414756 -0.0074504813 -0.0022180650
-0.3255631909 -0.0337970470 0.0002344623
-0.3346980833 -0.0377969968 0.0038370359
-0.2889635858 -0.0145332301 0.0009455143
-0.3255331732 -0.0321650381 0.0077951356
-0.3258492699 -0.0312751133 0.0119612392
-0.3347782776 -0.0333753784 0.0166901814
-0.2899418935 -0.0134954646 0.0058831516
-0.3257535972 -0.0265858191 0.0183800799
-0.3261890174 -0.0239804507 0.0220307872
-0.3348269317 -0.0238669600 0.0270843116
-0.2913438269 -0.0103686535 0.0104164328
-0.3260422507 -0.0169475706 0.0263306589
-0.3268529554 -0.0128929081 0.0290230641
-0.3349977609 -0.0106539545 0.0334935327
-0.2939227075 -0.0052375459 0.0141937765
-0.3266774425 -0.0045873199 0.0305493576
-0.3276348524 0.0005201998 0.0316781799
-0.3352121821 0.0043623825 0.0348442551
-0.2969704502 0.0017794251 0.0160539499
-0.3274573106 0.0088341778 0.0301982154
-0.3279732693 0.0175999426 0.0270987645
-0.2988484102 0.0127060682 0.0124961571
-0.3351400775 0.0241159162 0.0275539698
-0.3278207272 0.0246566160 0.0228381691
-0.3281869074 0.0345864526 0.0038839332
-0.3143157623 0.0274177638 0.0000953453
-0.3280031497 0.0334484028 -0.0085107253
-0.3139584404 0.0250997539 -0.0095818933
-0.3278719337 0.0248167861 -0.0227097077
-0.3351439585 0.0242853115 -0.0274236664
-0.2990773704 0.0128768184 -0.0124534061
-0.3280187016 0.0177838531 -0.0270094743
-0.3275695310 0.0090373003 -0.0301985510
-0.2974075768 0.0019757340 -0.0161946286
-0.3352416551 0.0045734613 -0.0348442124
-0.3277450451 0.0007316594 -0.0317247921
-0.3267503723 -0.0044152835 -0.0306093023
-0.2942460179 -0.0051511696 -0.0143280713
-0.3350096164 -0.0104667559 -0.0335696761
-0.3269279129 -0.0127292087 -0.0291293903
-0.3260817114 -0.0168153796 -0.0264358394
-0.2915548722 -0.0103530617 -0.0105079089
-0.3348278268 -0.0237234244 -0.0272224544
-0.3262342523 -0.0238720000 -0.0221753491
-0.3257494026 -0.0264909921 -0.0185111943
-0.2899960088 -0.0134852139 -0.0059080421
-0.3347659868 -0.0332860547 -0.0168675341
-0.3258537170 -0.0312158161 -0.0121185966
-0.3255440898 -0.0321316954 -0.0079539738
-0.2890269162 -0.0145589327 -0.0009655786
-0.3347035416 -0.0377803254 -0.0040375188
-0.3255843010 -0.0338056145 -0.0004025687
-0.3227679910 -0.0366257077 0.0088565393
-0.2804173074 -0.0162062253 0.0009239816
-0.3333813907 -0.0431294148 0.0043590903
-0.3228022961 -0.0384908231 0.0002157548
-0.3229628804 -0.0302610540 0.0208886894
-0.2813643100 -0.0150553656 0.0063722376
-0.3334445304 -0.0380819726 0.0190159499
-0.3230722235 -0.0356203827 0.0135528861
-0.3232199525 -0.0192912390 0.0299046550
-0.2827480627 -0.0116176451 0.0113427042
-0.3334637233 -0.0272377364 0.0308597360
-0.3233876836 -0.0273287042 0.0249907793
-0.3238135070 -0.0052534095 0.0346432916
-0.2852982173 -0.0060179916 0.0154117319
-0.3335927694 -0.0121813565 0.0381429299
-0.3240140936 -0.0147455328 0.0328989561
-0.3245528586 0.0099359684 0.0341906335
-0.2883255711 0.0015530643 0.0173835861
-0.3337618585 0.0049054558 0.0396609364
-0.3247557627 0.0004343169 0.0358820215
-0.3248829041 0.0278575084 0.0258230739
-0.3336368139 0.0274000963 0.0313512737
-0.2902159182 0.0135582802 0.0134482541
-0.3250572307 0.0197930703 0.0306920635
-0.3247040718 0.0359575674 0.0148643585
-0.3334006237 0.0381823646 0.0197845160
-0.2901563074 0.0162582999 0.0097953490
-0.3248232933 0.0305575281 0.0221701688
-0.3252300019 0.0390363507 0.0044379995
-0.2918719590 0.0197557684 0.0044070297
-0.3336039779 0.0424217759 0.0109184314
-0.3252759557 0.0371233903 0.0130682521
-0.3250484034 0.0377871307 -0.0095684510
-0.2912702053 0.0196903369 -0.0030598739
-0.3334672249 0.0437101264 -0.0047150465
-0.3250140994 0.0396521936 -0.0009277193
-0.3248816860 0.0307165045 -0.0220071524
-0.2904077131 0.0164218229 -0.0097278357
-0.3334181702 0.0383097503 -0.0195751289
-0.3247723407 0.0360759384 -0.0146713489
-0.3251040864 0.0199994806 -0.0305890873
-0.2904623857 0.0137421060 -0.0133957375
-0.3336387158 0.0275918045 -0.0312018999
-0.3249363587 0.0280367875 -0.0256750542
-0.3248686670 0.0006709579 -0.0359292632
-0.3337890271 0.0051441744 -0.0396581361
-0.2887860531 0.0017623390 -0.0175253112
-0.3246680803 0.0101630815 -0.0341850330
-0.3240924971 -0.0145601205 -0.0330163283
-0.3336026875 -0.0119682522 -0.0382281424
-0.2856459272 -0.0059242910 -0.0155516377
-0.3238895930 -0.0050584692 -0.0347076111
-0.3234334056 -0.0272045889 -0.0251520641
-0.3334617588 -0.0270736102 -0.0310157953
-0.2829713324 -0.0115993107 -0.0114354335
-0.3232590755 -0.0191399925 -0.0300212112
-0.3230763666 -0.0355528966 -0.0137312335
-0.3334300140 -0.0379800294 -0.0192179012
-0.2814233382 -0.0150444974 -0.0063961838
-0.3229571473 -0.0301529625 -0.0210370440
-0.3228247479 -0.0385001668 -0.0004064373
-0.3333867918 -0.0431101380 -0.0045874979
-0.2804846629 -0.0162342564 -0.0009425946
-0.3227787931 -0.0365871539 -0.0090366372
-0.3883382117 -0.0019947275 -0.0050164151
-0.3295962003 -0.0037246054 -0.0034094752
-0.4441664653 -0.0016532179 -0.0044887109
-0.3870044905 -0.0008809711 -0.0067167763
-0.0721465693 -0.0066922978 -0.0038483839
0.3086222801 -0.0122105624 -0.0026503326
-0.0727532786 -0.0064546595 -0.0041945513
-0.1696139415 -0.0044215881 -0.0054460246
-0.0710604333 -0.0073494471 -0.0027745383
0.3092289894 -0.0124482007 -0.0023041652
-0.0714224786 -0.0071303973 -0.0031324868
-0.1674904589 -0.0052533221 -0.0042344386
0.1192653007 -0.0100083487 -0.0023603774
0.3095883609 -0.0127755624 -0.0013406834
-0.3886510264 0.0004139335 -0.0075567076
-0.3316639122 -0.0017822995 -0.0063933188
-0.3886510264 0.0004139335 -0.0075567076
-0.4449031583 0.0029493110 -0.0090497616
-0.0747368647 -0.0048195217 -0.0054694721
0.3078165578 -0.0109122944 -0.0031255598
-0.0752983039 -0.0044918163 -0.0056962026
-0.1724806172 -0.0020674334 -0.0069056896
-0.0737733742 -0.0057634680 -0.0049061042
0.3083779969 -0.0112399998 -0.0028988293
-0.0740945377 -0.0054488192 -0.0050938935
-0.1705155802 -0.0032144021 -0.0061121328
0.3086991604 -0.0115546486 -0.0027110400
0.1174535636 -0.0090970149 -0.0037678460
-0.3914858359 0.0035824085 -0.0090329741
-0.3350629880 0.0009265465 -0.0081853162
-0.4456825608 0.0037720678 -0.0092577138
-0.3901355748 0.0055114052 -0.0094666036
0.1156270644 -0.0069891607 -0.0048931146
0.3077770910 -0.0109115868 -0.0031258739
0.1141452306 -0.0053630306 -0.0053062314
-0.3909231471 0.0069833177 -0.0090611098
-0.4459578718 0.0100850809 -0.0090394202
-0.3909231471 0.0069833177 -0.0090611098
-0.3365200563 0.0043552501 -0.0090242808
-0.0790755085 -0.0003090328 -0.0065670354
0.0177816340 -0.0030329589 -0.0059086055
0.3070922559 -0.0090197276 -0.0033291395
0.2100249792 -0.0059316332 -0.0038868734
-0.1753022482 0.0013223885 -0.0075275534
0.0167309627 -0.0012121174 -0.0054051253
-0.1757225168 0.0020507251 -0.0073261613
-0.2248865580 0.0046872772 -0.0073029401
0.3070922559 -0.0090197276 -0.0033291395
0.1142115301 -0.0053644406 -0.0053056643
-0.4460060145 0.0100862626 -0.0090398178
-0.3909472031 0.0104293520 -0.0075486911
-0.3917733339 0.0118829273 -0.0067109105
-0.3379036524 0.0082904968 -0.0076613944
-0.0800335416 0.0019816316 -0.0058625209
0.3062228679 -0.0068440310 -0.0026501732
-0.0804571741 0.0025054831 -0.0055432521
-0.1781862660 0.0061524903 -0.0054683498
-0.0800683648 0.0011514323 -0.0061654487
0.1132962206 -0.0031772591 -0.0044592779
0.1133064794 -0.0026931254 -0.0044159814
0.3066311123 -0.0080940829 -0.0030343867
-0.3916896175 0.0126189927 -0.0052761970
-0.4462962480 0.0151131296 -0.0037404994
-0.3390172739 0.0115749578 -0.0042526533
-0.3917086207 0.0118811829 -0.0067105033
0.1128177995 -0.0011557808 -0.0024158591
-0.0811790573 0.0046534186 -0.0025731307
-0.1780665721 0.0061493007 -0.0054676332
-0.0809119077 0.0040183583 -0.0039468807
0.3062570661 -0.0068449423 -0.0026499685
-0.0807669392 0.0042523114 -0.0034682710
0.3064024123 -0.0065756521 -0.0015654251
0.1128175477 -0.0011793389 -0.0028198149
-0.4603800912 0.0155165966 -0.0037855379
-0.4198294155 0.0148439311 -0.0017322575
-0.4198206363 0.0153057020 -0.0000573578
-0.3812548594 0.0134943609 -0.0025707606
-0.0813714349 0.0050414401 -0.0016326158
0.0155658184 0.0021179796 -0.0020267789
0.3062263273 -0.0059726953 -0.0008604058
0.2092638657 -0.0029359504 -0.0000747656
-0.1782330627 0.0076250473 -0.0024128839
0.0154397761 0.0026844017 -0.0000693936
-0.1782834796 0.0078516161 -0.0016299297
-0.2268403359 0.0097098418 -0.0000626785
0.1124526547 -0.0005789120 -0.0016379878
0.3062165962 -0.0064444789 -0.0013345313
-0.4198317083 0.0148345046 0.0016667826
-0.4603851984 0.0154955988 0.0037858957
-0.3812582985 0.0134802211 0.0025277995
-0.4198206363 0.0153057020 -0.0000573578
0.3062817023 -0.0064534258 0.0011994335
0.1125841429 -0.0005915605 0.0015385570
-0.2265492485 0.0095698489 0.0000663058
-0.1780355565 0.0077829705 0.0015982088
0.0156338343 0.0025910731 0.0000165960
-0.1779970189 0.0075874089 0.0023691313
0.2093803006 -0.0029919476 -0.0000231719
0.3062920714 -0.0059790195 0.0007278667
0.0157301786 0.0021021691 0.0019439022
-0.0811623234 0.0049914602 0.0015783249
-0.4463247043 0.0150930699 0.0037384747
-0.3917435057 0.0125913077 0.0051980479
-0.3389256898 0.0104296500 0.0062703002
-0.3917435057 0.0125913077 0.0051980479
-0.0812550862 0.0046414255 0.0025068339
0.1128390150 -0.0011822371 0.0023997129
-0.0807349632 0.0042132553 0.0035284861
0.3062988467 -0.0068604176 0.0024886442
-0.0808475163 0.0039821637 0.0039386594
-0.1779154898 0.0061150798 0.0053265967
0.1128382183 -0.0012080353 0.0028034784
0.3064125948 -0.0065906287 0.0014728225
-0.3907163453 0.0103818830 0.0074561673
-0.4458976991 0.0100332809 0.0090086195
-0.3375524685 0.0082394277 0.0075857693
-0.3915639553 0.0118402221 0.0065787550
0.3067630566 -0.0081667733 0.0028873563
0.1135724781 -0.0028298312 0.0042994594
0.1135621627 -0.0033141975 0.0043400561
-0.0796867428 0.0011079368 0.0060762108
-0.4459313732 0.0100341008 0.0090088885
-0.3908579513 0.0069315119 0.0089507495
-0.3362827045 0.0043002876 0.0088552925
-0.3908579513 0.0069315119 0.0089507495
-0.2247335867 0.0046430003 0.0072377021
-0.1754919816 0.0020050921 0.0071971941
0.0168322590 -0.0012444495 0.0053033536
-0.1750277635 0.0012748830 0.0073703749
0.2100849356 -0.0059544093 0.0037558748
0.3071754919 -0.0090395984 0.0031553162
0.0179928041 -0.0030699723 0.0057363057
-0.0788656433 -0.0003498878 0.0064234547
0.1143797102 -0.0053971593 0.0051309800
0.3071754919 -0.0090395984 0.0031553162
-0.3898530421 0.0054529896 0.0092979546
-0.4455473938 0.0037177829 0.0091669444
-0.3346966711 0.0008744753 0.0080991330
-0.3912027524 0.0035262577 0.0089149155
-0.0782993239 -0.0012510760 0.0067232551
0.1149943454 -0.0058081600 0.0050046772
-0.1737218737 0.0001061993 0.0072996865
-0.0765853932 -0.0030779932 0.0062861389
0.3074718248 -0.0097510662 0.0034746710
-0.0761365229 -0.0036843629 0.0061618667
0.3079087478 -0.0109309675 0.0029648833
0.1158920862 -0.0070208994 0.0047561327
-0.4448905870 0.0028988641 0.0089795394
-0.3886116567 0.0003715339 0.0074098782
-0.3314340120 -0.0018210801 0.0061913266
-0.3886116567 0.0003715339 0.0074098782
-0.1723867246 -0.0021073642 0.0068022695
-0.0751617578 -0.0045261762 0.0056174587
0.3078419175 -0.0109297335 0.0029653943
-0.0745721385 -0.0048533453 0.0054087409
0.1176159579 -0.0091200865 0.0035732237
0.3087793026 -0.0115705219 0.0025235175
-0.1703230573 -0.0032524560 0.0060717570
-0.0738766068 -0.0054805839 0.0049424230
0.3084315367 -0.0112569026 0.0027566765
-0.0735288410 -0.0057942032 0.0047092641
-0.3867187175 -0.0009224493 0.0065136290
-0.4440250910 -0.0016801742 0.0043683434
-0.3292936489 -0.0037476023 0.0032993805
-0.3880501820 -0.0020269275 0.0048684754
-0.1690778056 -0.0044601075 0.0052447437
-0.0723482922 -0.0064318168 0.0040231155
0.3087740760 -0.0122272658 0.0024587197
-0.0717687236 -0.0066409556 0.0036909038
-0.1670493157 -0.0051920933 0.0040820027
-0.0710779318 -0.0071264098 0.0029901890
0.3093536445 -0.0124364046 0.0021265080
-0.0707325359 -0.0073691370 0.0026398317
0.3096971838 -0.0127840836 0.0011701018
0.1194832523 -0.0100241343 0.0022079911
-0.4431241964 -0.0021377736 0.0036786897
-0.3849448167 -0.0032556524 0.0015002523
-0.3273652229 -0.0043558274 -0.0001072048
-0.3849448167 -0.0032556524 0.0015002523
0.1203197071 -0.0106627064 -0.0001010322
0.3101187803 -0.0129343557 0.0003756098
-0.1656525338 -0.0061818212 0.0025693089
-0.0698617784 -0.0076354219 0.0014963248
0.3097509569 -0.0128191382 0.0011171204
-0.0695067497 -0.0076984906 0.0011050515
-0.0695067497 -0.0076984906 0.0011050515
0.1203759176 -0.0103843488 0.0002890365
-0.3850484596 -0.0032453572 -0.0016674909
-0.3272270765 -0.0043577356 -0.0001071958
-0.3850484596 -0.0032453572 -0.0016674909
-0.4431720571 -0.0021163415 -0.0037770956
0.1204165404 -0.0106640792 -0.0001010233
-0.0694141050 -0.0077820609 -0.0009135165
0.3101384217 -0.0128627642 -0.0008400334
0.1203577141 -0.0105247688 -0.0006409339
0.1193124615 -0.0100812283 -0.0019565522
-0.0694111422 -0.0076471567 -0.0010707439
0.3097949772 -0.0127972058 -0.0012224738
-0.0697545867 -0.0075815982 -0.0014531843
-0.1655005888 -0.0061138002 -0.0024669628
-0.3112993017 -0.0001232742 0.0235747406
-0.3126290189 0.0098323346 0.0224712027
-0.3277685734 0.0270188701 0.0196418698
-0.2987962564 0.0150683224 0.0092998579
-0.3349334219 0.0335498883 0.0174329239
-0.3276642657 0.0317433784 0.0132492713
-0.3282271253 0.0329122177 0.0114353900
-0.3351425889 0.0373336796 0.0095539556
-0.3004848351 0.0185748401 0.0038582142
-0.3281869074 0.0345864526 0.0038839332
-0.3141900976 0.0252960234 0.0092112346
-0.3279731253 0.0350807275 -0.0009501037
-0.3350104921 0.0384388896 -0.0041948305
-0.2998837067 0.0183834298 -0.0030924397
-0.3280031497 0.0334484028 -0.0085107253
-0.3141813824 0.0269801496 -0.0015540227
-0.3277284347 0.0318502538 -0.0130814480
-0.3349509920 0.0336630011 -0.0172502334
-0.2990295374 0.0152213077 -0.0092439862
-0.3278241007 0.0271612753 -0.0195002878
-0.3128275687 0.0099619969 -0.0225104433
-0.3114442777 0.0000108424 -0.0236207799
-0.3121888964 -0.0319871159 0.0047132038
-0.3227508385 -0.0356931500 0.0131769315
-0.2804001548 -0.0152736676 0.0052443739
-0.2909964020 -0.0208448170 0.0050673172
-0.3333470856 -0.0412642994 0.0129998748
-0.3439604854 -0.0477680066 0.0085024259
-0.3121888964 -0.0319871159 0.0047132038
-0.3333813907 -0.0431294148 0.0043590903
-0.3125905736 -0.0277994641 0.0154256256
-0.3229082089 -0.0275813896 0.0245565910
-0.2813096385 -0.0123757013 0.0100401392
-0.2917366169 -0.0175169555 0.0118353013
-0.3333351872 -0.0327226439 0.0263517531
-0.3438168372 -0.0405435625 0.0244790136
-0.3125905736 -0.0277994641 0.0154256256
-0.3334445304 -0.0380819726 0.0190159499
-0.3131439128 -0.0193822068 0.0240356984
-0.3231360869 -0.0152725064 0.0323615929
-0.2826641972 -0.0075989125 0.0137996421
-0.2928241024 -0.0115266773 0.0172116608
-0.3332959921 -0.0192002712 0.0357736116
-0.3435397629 -0.0271467686 0.0367286926
-0.3131439128 -0.0193822068 0.0240356984
-0.3334637233 -0.0272377364 0.0308597360
-0.3023279091 -0.0199491867 0.0174432446
-0.3142348312 -0.0078175859 0.0293993178
-0.3237132137 -0.0005073479 0.0355154594
-0.2851979240 -0.0012719300 0.0162838997
-0.2948768931 -0.0034538153 0.0206557057
-0.3333921827 -0.0026892332 0.0398872654
-0.3431714451 -0.0096171801 0.0433869037
-0.3142348312 -0.0078175859 0.0293993178
-0.3335927694 -0.0121813565 0.0381429299
-0.3155467627 0.0054648295 0.0304117187
-0.3244514065 0.0146867942 0.0333449394
-0.2882241190 0.0063038901 0.0165378921
-0.2973316669 0.0060242032 0.0211625009
-0.3335589544 0.0144071073 0.0379695483
-0.3427679544 0.0093765947 0.0434398512
-0.3155467627 0.0054648295 0.0304117187
-0.3337618585 0.0049054558 0.0396609364
-0.3055679952 -0.0002364416 0.0263494199
-0.3336368139 0.0274000963 0.0313512737
-0.3163033209 0.0202504823 0.0251638638
-0.3423907237 0.0269426843 0.0368794735
-0.3338111405 0.0193356583 0.0362202633
-0.2989698280 0.0131008682 0.0189764539
-0.2903030815 0.0095260612 0.0158827489
-0.3251443940 0.0157608512 0.0331265584
-0.3163033209 0.0202504823 0.0251638638
-0.3068774671 0.0108889500 0.0250328792
-0.3334006237 0.0381823646 0.0197845160
-0.3161267415 0.0283327309 0.0172500113
-0.3420971755 0.0404071618 0.0247046736
-0.3335198452 0.0327823252 0.0270903263
-0.2988528593 0.0184830971 0.0147155065
-0.2902159182 0.0135582802 0.0134482541
-0.3248829041 0.0278575084 0.0258230739
-0.3161267415 0.0283327309 0.0172500113
-0.3074301896 0.0261079337 0.0123298538
-0.3169019796 0.0337379650 0.0065878202
-0.3252070250 0.0399928309 0.0001228732
-0.2918489822 0.0207122486 0.0000919034
-0.3001999813 0.0250541541 0.0022572090
-0.3335580242 0.0443347363 0.0022881788
-0.3419320002 0.0477201616 0.0087686107
-0.3169019796 0.0337379650 0.0065878202
-0.3336039779 0.0424217759 0.0109184314
-0.3084048341 0.0279952794 0.0102794005
-0.3165952779 0.0337291980 -0.0057811238
-0.3250655554 0.0368545992 -0.0138888169
-0.2912873573 0.0187578055 -0.0073802397
-0.2997233308 0.0237482696 -0.0068472011
-0.3335015289 0.0418450634 -0.0133557782
-0.3419203504 0.0477680591 -0.0085023737
-0.3165952779 0.0337291980 -0.0057811238
-0.3334672249 0.0437101264 -0.0047150465
-0.3083935656 0.0299180940 -0.0015270763
-0.3162358564 0.0284826926 -0.0171033724
-0.3249363587 0.0280367875 -0.0256750542
-0.2904623857 0.0137421060 -0.0133957375
-0.2990535426 0.0186556348 -0.0146316158
-0.3335275156 0.0329503164 -0.0269109325
-0.3420639998 0.0405435622 -0.0244789090
-0.3162358564 0.0284826926 -0.0171033724
-0.3334181702 0.0383097503 -0.0195751289
-0.3081764563 0.0278062023 -0.0106345283
-0.3164017293 0.0204444637 -0.0250622416
-0.3251879502 0.0159808272 -0.0330461039
-0.2905462496 0.0097234525 -0.0158527541
-0.2991647428 0.0132971229 -0.0189225832
-0.3338064435 0.0195544975 -0.0361159330
-0.3423410728 0.0271468214 -0.0367287456
-0.3164017293 0.0204444637 -0.0250622416
-0.3336387158 0.0275918045 -0.0312018999
-0.3070851937 0.0110330721 -0.0250659922
-0.3337890271 0.0051441744 -0.0396581361
-0.3157477201 0.0056898650 -0.0304561601
-0.3427093872 0.0096173909 -0.0433870090
-0.3335884404 0.0146362980 -0.0379139059
-0.2977064132 0.0062355555 -0.0212541841
-0.2886857597 0.0065084008 -0.0166531961
-0.3245677869 0.0149091433 -0.0333129179
-0.3157477201 0.0056898650 -0.0304561601
-0.3057250130 -0.0000865969 -0.0263964774
-0.3336026875 -0.0119682522 -0.0382281424
-0.3143794026 -0.0076503375 -0.0294957971
-0.3431128780 -0.0093763839 -0.0434399564
-0.3333997835 -0.0024666009 -0.0399194252
-0.2951561176 -0.0033324227 -0.0207634517
-0.2855444752 -0.0011734654 -0.0163972791
-0.3237881410 -0.0003076436 -0.0355532525
-0.3143794026 -0.0076503375 -0.0294957971
-0.3334617588 -0.0270736102 -0.0310157953
-0.3132307223 -0.0192709711 -0.0241574800
-0.3434901121 -0.0269426316 -0.0368795265
-0.3332874288 -0.0190090138 -0.0358849424
-0.2929996857 -0.0114683320 -0.0172991647
-0.2828841674 -0.0075670125 -0.0138700070
-0.3231719105 -0.0151076943 -0.0324557848
-0.3132307223 -0.0192709711 -0.0241574800
-0.3334300140 -0.0379800294 -0.0192179012
-0.3126034998 -0.0277258298 -0.0155503763
-0.3437836615 -0.0404071621 -0.0247045689
-0.3333107947 -0.0325800952 -0.0265237117
-0.2917769856 -0.0174716301 -0.0118828514
-0.2813637285 -0.0123445303 -0.0100490890
-0.3228975376 -0.0274529954 -0.0246899493
-0.3126034998 -0.0277258298 -0.0155503763
-0.3333867918 -0.0431101380 -0.0045874979
-0.3122167492 -0.0319771828 -0.0048555765
-0.3439488356 -0.0477201091 -0.0087685585
-0.3333408369 -0.0411971251 -0.0132176978
-0.2910467067 -0.0208442276 -0.0051236552
-0.2804616855 -0.0152777500 -0.0052576945
-0.3227558157 -0.0356306475 -0.0133517371
-0.3122167492 -0.0319771828 -0.0048555765
-0.3325099580 -0.0023362371 -0.0055441193
-0.4431952128 -0.0021160073 -0.0037771629
-0.3315387054 -0.0027990265 -0.0048325713
-0.3011964472 -0.0041267549 -0.0033175533
-0.4720805921 -0.0014824631 -0.0042248588
-0.4428327441 -0.0005394615 -0.0061890721
-0.3325099580 -0.0023362371 -0.0055441193
-0.4421658836 0.0000174166 -0.0070392527
-0.3343129014 0.0001629980 -0.0076541968
-0.4421061552 0.0000164364 -0.0070389257
-0.3334299050 -0.0004854345 -0.0072339041
-0.3040533515 -0.0022319835 -0.0062319171
-0.4429891515 0.0006648690 -0.0074592184
-0.3349509036 0.0009244787 -0.0081843779
-0.4436271538 0.0014263496 -0.0079893994
-0.4723912220 0.0034555191 -0.0092661076
0.4043172941 -0.0130024437 -0.0021622739
0.3086898309 -0.0119926052 -0.0026703139
-0.0737733742 -0.0057634680 -0.0049061042
0.3086851662 -0.0122115835 -0.0026499509
-0.3372891111 0.0033927492 -0.0088082345
-0.4449405197 0.0029500003 -0.0090500744
-0.3365470701 0.0025706816 -0.0086005950
-0.3075936050 0.0004206830 -0.0079691266
-0.4727809232 0.0038668975 -0.0093700837
-0.4443322996 0.0057010646 -0.0096913432
-0.3372891111 0.0033927492 -0.0088082345
-0.4436571690 0.0066655630 -0.0099081579
0.3077854012 -0.0105278128 -0.0033807486
-0.0765395825 -0.0038342826 -0.0061506061
0.3077854012 -0.0105278128 -0.0033807486
0.4038645695 -0.0122971388 -0.0026245655
-0.0770565601 -0.0029892676 -0.0064475291
0.0195458185 -0.0053157781 -0.0055855790
0.3077895563 -0.0103359258 -0.0035081859
0.2109266113 -0.0076828513 -0.0044548788
-0.1728772397 -0.0016424490 -0.0070552506
0.0182429868 -0.0036829583 -0.0060092932
-0.1733983723 -0.0009893211 -0.0072247363
-0.2226115438 0.0013169080 -0.0079523113
0.1145847991 -0.0056829048 -0.0052320860
-0.0787581781 -0.0012032004 -0.0068977186
-0.4440509552 0.0074015192 -0.0097054111
-0.3384309779 0.0074596367 -0.0081948116
-0.4446865941 0.0082960397 -0.0094834141
-0.4728395953 0.0107414419 -0.0092505724
-0.3377953390 0.0065651162 -0.0084168086
-0.4436258610 0.0066648972 -0.0099079018
-0.3373702448 0.0058284942 -0.0086192993
-0.3097436051 0.0037778384 -0.0088033756
0.4035291299 -0.0110153172 -0.0024693176
0.3070852780 -0.0093556197 -0.0035860203
-0.0786552400 -0.0010373694 -0.0067684275
0.3070817891 -0.0095235657 -0.0037144607
-0.4728636666 0.0107420328 -0.0092507712
-0.4446625074 0.0117408924 -0.0079705977
-0.3385754059 0.0074631820 -0.0081960045
-0.4439907539 0.0125682072 -0.0074359877
-0.3391428485 0.0104708597 -0.0064047236
-0.4439907539 0.0125682072 -0.0074359877
-0.3387297831 0.0097440721 -0.0068236139
-0.3113818770 0.0072210692 -0.0077177461
-0.0804571741 0.0025054831 -0.0055432521
0.0166364689 -0.0003557469 -0.0051392512
0.3066465004 -0.0073678825 -0.0029694420
0.2093410411 -0.0042447267 -0.0032138086
-0.1769153684 0.0045809359 -0.0064261562
0.0155773876 0.0009538818 -0.0043410792
-0.1773390009 0.0051047873 -0.0061068874
-0.2266271794 0.0074521424 -0.0057501674
-0.1767407596 0.0035118221 -0.0069247742
-0.0800485689 0.0015435206 -0.0059779290
0.3066212143 -0.0082901271 -0.0031281466
-0.0800386710 0.0017395648 -0.0058841691
0.3066465004 -0.0073678825 -0.0029694420
-0.0800386710 0.0017395648 -0.0058841691
0.3066413711 -0.0076099493 -0.0029910903
0.4032985581 -0.0105524948 -0.0023219412
-0.4443619610 0.0136630275 -0.0062997407
-0.3396620362 0.0120583251 -0.0033995729
-0.4450067234 0.0141463949 -0.0054466603
-0.4729548009 0.0158768308 -0.0038257311
-0.3127001053 0.0103151306 -0.0051751878
-0.3390362771 0.0108371481 -0.0056869596
-0.4443619610 0.0136630275 -0.0062997407
-0.3390362771 0.0108371481 -0.0056869596
-0.0807668133 0.0042640904 -0.0032662931
0.3062649976 -0.0064458760 -0.0013343709
-0.0809042280 0.0043938665 -0.0030352390
-0.1780400710 0.0074282423 -0.0028828206
-0.2264989360 0.0074487250 -0.0057493996
-0.1777766353 0.0066172069 -0.0045104137
0.0156628832 0.0009516035 -0.0043405673
-0.1776316669 0.0068511600 -0.0040318039
0.2093923385 -0.0042460937 -0.0032135014
0.3064020346 -0.0066109892 -0.0021713587
0.0160253042 0.0015364862 -0.0031440429
-0.0809119077 0.0040183583 -0.0039468807
-0.3146046852 0.0113404977 -0.0033194520
-0.3147065402 0.0117956588 -0.0017351180
0.3062263273 -0.0059726953 -0.0008604058
-0.0813242617 0.0046576101 -0.0025736117
0.3062230836 -0.0061299565 -0.0010184476
0.4031018106 -0.0092200011 -0.0010247612
0.4031339385 -0.0092262230 0.0008726828
0.3062886151 -0.0061371549 0.0008850556
-0.0811272421 0.0046377632 0.0025064363
0.3062920714 -0.0059790195 0.0007278667
-0.4729716696 0.0158559445 0.0038283651
-0.4450374363 0.0141170570 0.0053778287
-0.3397368430 0.0120415712 0.0033789132
-0.4443938023 0.0136290506 0.0061975056
-0.3125726216 0.0097234594 0.0061158563
-0.3390373693 0.0111789265 0.0048891602
-0.4443379626 0.0132544124 0.0068880756
-0.3390932090 0.0115535648 0.0041985902
-0.1781286297 0.0074148331 0.0028336509
-0.0809080720 0.0043645781 0.0030533468
0.3062390876 -0.0064522050 0.0011995661
-0.0807345648 0.0042261544 0.0033266033
-0.0808475163 0.0039821637 0.0039386594
0.0160516276 0.0015026100 0.0031659823
0.3064113998 -0.0066293259 0.0020784708
0.2094559794 -0.0042653181 0.0030562347
-0.1775778305 0.0068083548 0.0040960766
0.0157702448 0.0009248808 0.0041914157
-0.1776903836 0.0065772631 0.0045062500
-0.2263369234 0.0074126295 0.0056103920
-0.4438802221 0.0125243383 0.0073265653
-0.3382249609 0.0074090753 0.0081464540
-0.4445527145 0.0116939858 0.0078872501
-0.4728158837 0.0106893323 0.0092241609
-0.3109705301 0.0071682001 0.0076505703
-0.3384000785 0.0096977668 0.0067083570
-0.4438802221 0.0125243383 0.0073265653
-0.3388238835 0.0104269363 0.0062696508
-0.2262027614 0.0074089921 0.0056095843
-0.1769024590 0.0049540122 0.0060019079
0.0158596862 0.0009224559 0.0041908772
-0.1764585525 0.0043751759 0.0063399404
0.2095096442 -0.0042667731 0.0030559116
0.3067785297 -0.0074402238 0.0028264613
0.0169694523 -0.0005246349 0.0050359585
-0.0800774799 0.0023593978 0.0054344251
0.4033635036 -0.0105930612 0.0021610064
0.3067733720 -0.0076824070 0.0028467597
-0.0796387312 0.0015383783 0.0057927559
0.3067785297 -0.0074402238 0.0028264613
-0.4728327207 0.0106897423 0.0092242954
-0.4446606463 0.0082427948 0.0093815632
-0.3383259830 0.0074115349 0.0081472611
-0.4440252829 0.0073471418 0.0095679005
0.3071645072 -0.0095455659 0.0035378224
-0.0784014252 -0.0010800969 0.0065966355
0.3071681688 -0.0093769100 0.0034103203
0.4035697212 -0.0110294737 0.0022949864
-0.4435228283 0.0066078807 0.0097415031
-0.3368581110 0.0033347325 0.0086628866
-0.4441976835 0.0056445147 0.0095499835
-0.4727197145 0.0038135454 0.0092929588
-0.3071641105 0.0003686699 0.0078791596
-0.3361376310 0.0025146468 0.0084749688
-0.4448269138 0.0028976971 0.0089790265
-0.3368581110 0.0033347325 0.0086628866
-0.2218412435 0.0010919259 0.0076821880
-0.1728241329 -0.0011065401 0.0070511420
0.0187556057 -0.0038367069 0.0057696803
-0.1723752626 -0.0017129098 0.0069268698
0.2112330851 -0.0077796131 0.0042396741
0.3079206952 -0.0103574359 0.0033503988
0.0198777816 -0.0053526312 0.0054589997
-0.0765853932 -0.0030779932 0.0062861389
0.4039210611 -0.0126948244 0.0021977638
0.3079167127 -0.0105486131 0.0032218936
-0.0761405053 -0.0038755401 0.0060333615
0.3079206952 -0.0103574359 0.0033503988
-0.4723913111 0.0034040861 0.0091992564
-0.4436131049 0.0013819778 0.0078493121
-0.3348876906 0.0008779762 0.0081006717
-0.4429743638 0.0006235347 0.0072841984
-0.3037835022 -0.0022705161 0.0060301279
-0.3333106370 -0.0005273380 0.0070874809
-0.4420360513 -0.0000233363 0.0068361212
-0.3342489496 0.0001195331 0.0075355581
0.3087653932 -0.0122271078 0.0024587669
-0.0735288410 -0.0057942032 0.0047092641
0.3087700297 -0.0120082458 0.0024803504
0.4043563385 -0.0130146015 0.0019770809
-0.4420278942 -0.0000234569 0.0068360738
-0.3320752730 -0.0023736808 0.0053686074
-0.4426936265 -0.0005756960 0.0060134970
-0.4720125455 -0.0015067976 0.0041182774
-0.3008425904 -0.0041499659 0.0032045753
-0.3311480650 -0.0028316546 0.0046788651
-0.4430978830 -0.0021381481 0.0036786011
-0.3320752730 -0.0023736808 0.0053686074
-0.4715620982 -0.0017355973 0.0037734506
-0.4418206203 -0.0024512998 0.0016897741
-0.3293725892 -0.0037464789 0.0032996461
-0.4411688322 -0.0026080628 0.0006953163
-0.2990272854 -0.0047550531 -0.0001068023
-0.3282689418 -0.0040541038 0.0015010573
-0.4407169728 -0.0027589247 -0.0001088148
-0.3287208012 -0.0039032419 0.0023051883
0.1194262305 -0.0100932862 0.0018041338
-0.1644099336 -0.0064025615 0.0011998526
-0.0694304500 -0.0077924907 0.0004786387
0.3101059855 -0.0128822068 0.0007258472
-0.0693923001 -0.0078394907 0.0001654323
-0.3288762656 -0.0038877992 -0.0024464265
-0.4406709240 -0.0027595607 -0.0001088118
-0.3283265359 -0.0040444446 -0.0016666830
-0.2988661146 -0.0047572793 -0.0001067918
-0.4412206537 -0.0026029153 -0.0008885554
-0.3295267334 -0.0037256079 -0.0034092733
-0.4418711215 -0.0024407240 -0.0018514021
-0.4715833880 -0.0017140249 -0.0038690512
-0.0693258655 -0.0079910264 -0.0001036507
0.3101295332 -0.0132674768 -0.0003683512
-0.0693552787 -0.0079213712 -0.0003736060
-0.1643000146 -0.0064107069 -0.0010498078
0.1196767508 -0.0101238435 -0.0017202694
-0.0709879096 -0.0073865584 -0.0025724892
3 118 39 125
3 34 84 25
3 4 24 83
3 38 117 109
3 170 110 118
3 25 5 170
3 25 170 118
3 109 171 4
3 38 109 4
3 25 118 125
3 34 25 125
3 38 4 83
3 125 38 83
3 83 34 125
3 151 190 163
3 151 163 131
3 164 151 131
3 131 64 164
3 126 116 127
3 192 2 191
3 176 23 192
3 127 92 150
3 191 22 175
3 149 91 126
3 175 154 149
3 150 155 176
3 127 150 176
3 127 176 192
3 126 127 192
3 126 192 191
3 175 149 126
3 191 175 126
3 115 161 166
3 197 427 166
3 196 427 197
3 194 428 166
3 197 428 194
3 198 429 196
3 115 429 198
3 198 430 194
3 196 430 198
3 57 115 194
3 200 431 194
3 199 431 200
3 61 432 194
3 200 432 61
3 201 433 199
3 57 433 201
3 201 434 61
3 199 434 201
3 203 435 61
3 202 435 203
3 28 436 61
3 203 436 28
3 204 437 202
3 136 437 204
3 204 438 28
3 202 438 204
3 182 57 61
3 136 182 61
3 206 439 28
3 205 439 206
3 138 440 28
3 206 440 138
3 207 441 205
3 119 441 207
3 207 442 138
3 205 442 207
3 177 136 28
3 119 177 28
3 209 443 138
3 208 443 209
3 27 444 138
3 209 444 27
3 210 445 208
3 98 445 210
3 210 446 27
3 208 446 210
3 82 119 138
3 98 743 138
3 82 743 98
3 212 447 211
3 27 447 212
3 212 448 112
3 211 448 212
3 27 449 213
3 62 449 27
3 213 450 211
3 62 450 213
3 27 112 16
3 46 98 27
3 16 744 27
3 46 744 16
3 215 745 214
3 62 745 215
3 215 746 112
3 214 746 215
3 62 747 216
3 195 747 62
3 216 748 214
3 195 748 216
3 123 112 195
3 195 31 123
3 451 749 195
3 217 749 451
3 169 750 195
3 451 750 169
3 452 751 217
3 172 751 452
3 452 752 169
3 217 752 452
3 151 31 195
3 172 753 195
3 151 753 172
3 453 754 169
3 218 754 453
3 142 755 169
3 453 755 142
3 454 756 218
3 33 756 454
3 454 757 142
3 218 757 454
3 169 33 95
3 69 172 169
3 69 758 95
3 169 758 69
3 220 759 142
3 219 759 220
3 78 760 142
3 220 760 78
3 221 761 219
3 144 761 221
3 221 762 78
3 219 762 221
3 53 33 142
3 144 53 142
3 223 455 78
3 222 455 223
3 133 456 78
3 223 456 133
3 224 457 222
3 144 457 224
3 224 458 133
3 222 458 224
3 102 144 133
3 102 763 54
3 133 763 102
3 148 54 133
3 226 459 225
3 133 459 226
3 226 460 148
3 225 460 226
3 133 461 227
3 32 461 133
3 227 462 225
3 32 462 227
3 148 764 96
3 32 764 148
3 50 96 32
3 229 463 228
3 32 463 229
3 229 464 50
3 228 464 229
3 32 465 230
3 134 465 32
3 230 466 228
3 134 466 230
3 145 50 134
3 143 145 134
3 232 467 231
3 134 467 232
3 232 468 143
3 231 468 232
3 134 469 233
3 77 469 134
3 233 470 231
3 77 470 233
3 3 143 77
3 140 3 77
3 235 471 234
3 77 471 235
3 235 472 140
3 234 472 235
3 77 473 236
3 141 473 77
3 236 474 234
3 141 474 236
3 10 140 141
3 238 475 237
3 141 475 238
3 238 476 10
3 237 476 238
3 141 477 239
3 166 477 141
3 239 478 237
3 166 478 239
3 166 161 103
3 103 10 166
3 161 158 10
3 10 103 161
3 167 165 74
3 241 765 240
3 479 765 241
3 479 766 40
3 241 766 479
3 480 767 241
3 74 767 480
3 240 768 241
3 480 768 240
3 481 769 40
3 242 769 481
3 481 770 167
3 40 770 481
3 482 771 242
3 240 771 482
3 482 772 167
3 242 772 482
3 40 74 86
3 244 773 243
3 483 773 244
3 483 774 129
3 244 774 483
3 484 775 244
3 86 775 484
3 243 776 244
3 484 776 243
3 485 777 129
3 245 777 485
3 485 778 40
3 129 778 485
3 486 779 245
3 243 779 486
3 486 780 40
3 245 780 486
3 247 781 246
3 487 781 247
3 487 782 17
3 247 782 487
3 488 783 247
3 79 783 488
3 246 784 247
3 488 784 246
3 489 785 17
3 248 785 489
3 489 786 129
3 17 786 489
3 490 787 248
3 246 787 490
3 490 788 129
3 248 788 490
3 79 789 12
3 129 789 79
3 86 12 129
3 250 790 249
3 491 790 250
3 491 791 21
3 250 791 491
3 492 792 250
3 152 792 492
3 249 793 250
3 492 793 249
3 493 794 21
3 251 794 493
3 493 795 17
3 21 795 493
3 494 796 251
3 249 796 494
3 494 797 17
3 251 797 494
3 76 152 17
3 79 76 17
3 253 798 252
3 495 798 253
3 495 799 18
3 253 799 495
3 496 800 253
3 20 800 496
3 252 801 253
3 496 801 252
3 497 802 18
3 254 802 497
3 497 803 21
3 18 803 497
3 498 804 254
3 252 804 498
3 498 805 21
3 254 805 498
3 20 806 153
3 21 806 20
3 152 153 21
3 499 807 256
3 128 807 499
3 499 808 255
3 256 808 499
3 500 809 18
3 128 809 500
3 500 810 256
3 18 810 500
3 255 811 501
3 257 811 255
3 501 812 44
3 257 812 501
3 502 813 257
3 18 813 502
3 257 814 502
3 255 814 257
3 67 44 18
3 67 815 81
3 18 815 67
3 20 81 18
3 503 816 259
3 41 816 503
3 503 817 258
3 259 817 503
3 504 818 128
3 41 818 504
3 504 819 259
3 128 819 504
3 258 820 505
3 260 820 258
3 505 821 44
3 260 821 505
3 506 822 260
3 128 822 506
3 260 823 506
3 258 823 260
3 36 132 41
3 36 824 44
3 41 824 36
3 262 825 261
3 507 825 262
3 507 826 168
3 262 826 507
3 508 827 262
3 162 827 508
3 261 828 262
3 508 828 261
3 509 829 168
3 263 829 509
3 509 830 41
3 168 830 509
3 510 831 263
3 261 831 510
3 510 832 41
3 263 832 510
3 162 833 190
3 41 833 162
3 132 190 41
3 265 834 264
3 511 834 265
3 511 835 108
3 265 835 511
3 512 836 265
3 100 836 512
3 264 837 265
3 512 837 264
3 513 838 108
3 266 838 513
3 513 839 168
3 108 839 513
3 514 840 266
3 264 840 514
3 514 841 168
3 266 841 514
3 105 100 168
3 135 842 168
3 105 842 135
3 168 162 135
3 268 843 267
3 515 843 268
3 515 844 14
3 268 844 515
3 516 845 268
3 181 845 516
3 267 846 268
3 516 846 267
3 517 847 14
3 269 847 517
3 517 848 108
3 14 848 517
3 518 849 269
3 267 849 518
3 518 850 108
3 269 850 518
3 73 181 108
3 73 851 100
3 108 851 73
3 271 852 270
3 519 852 271
3 519 853 94
3 271 853 519
3 520 854 271
3 181 854 520
3 270 855 271
3 520 855 270
3 521 856 94
3 272 856 521
3 521 857 14
3 94 857 521
3 522 858 272
3 270 858 522
3 522 859 14
3 272 859 522
3 94 181 72
3 124 120 94
3 72 860 94
3 124 860 72
3 523 861 274
3 113 861 523
3 523 862 273
3 274 862 523
3 524 863 94
3 113 863 524
3 524 864 274
3 94 864 524
3 273 865 525
3 275 865 273
3 525 866 120
3 275 866 525
3 526 867 275
3 94 867 526
3 275 868 526
3 273 868 275
3 59 137 113
3 120 869 113
3 59 869 120
3 527 870 277
3 93 870 527
3 527 871 276
3 277 871 527
3 528 872 113
3 93 872 528
3 528 873 277
3 113 873 528
3 276 874 529
3 278 874 276
3 529 875 137
3 278 875 529
3 530 876 278
3 113 876 530
3 278 877 530
3 276 877 278
3 173 35 93
3 137 173 93
3 531 878 280
3 15 878 531
3 531 879 279
3 280 879 531
3 532 880 93
3 15 880 532
3 532 881 280
3 93 881 532
3 279 882 533
3 281 882 279
3 533 883 35
3 281 883 533
3 534 884 281
3 93 884 534
3 281 885 534
3 279 885 281
3 6 101 15
3 35 6 15
3 535 886 283
3 107 886 535
3 535 887 282
3 283 887 535
3 536 888 15
3 107 888 536
3 536 889 283
3 15 889 536
3 282 890 537
3 284 890 282
3 537 891 101
3 284 891 537
3 538 892 284
3 15 892 538
3 284 893 538
3 282 893 284
3 101 180 107
3 539 894 286
3 167 894 539
3 539 895 285
3 286 895 539
3 540 896 107
3 167 896 540
3 540 897 286
3 107 897 540
3 285 898 541
3 287 898 285
3 541 899 180
3 287 899 541
3 542 900 287
3 107 900 542
3 287 901 542
3 285 901 287
3 186 165 167
3 180 186 167
3 145 189 187
3 288 902 145
3 543 902 288
3 543 903 109
3 288 903 543
3 544 904 145
3 288 904 544
3 145 905 544
3 187 905 145
3 117 906 109
3 545 906 117
3 545 907 289
3 117 907 545
3 546 908 289
3 145 908 546
3 289 909 546
3 117 909 289
3 290 547 11
3 291 547 290
3 291 548 23
3 290 548 291
3 292 549 11
3 290 549 292
3 11 550 292
3 173 550 11
3 293 551 188
3 294 551 293
3 294 552 23
3 293 552 294
3 295 553 188
3 293 553 295
3 188 554 295
3 11 554 188
3 296 555 23
3 188 555 296
3 23 556 296
3 176 556 23
3 96 37 47
3 297 910 96
3 557 910 297
3 557 911 117
3 297 911 557
3 558 912 96
3 297 912 558
3 96 913 558
3 47 913 96
3 298 914 117
3 559 914 298
3 559 915 96
3 298 915 559
3 560 916 117
3 298 916 560
3 117 917 560
3 38 917 117
3 299 561 122
3 300 561 299
3 300 562 192
3 299 562 300
3 301 563 122
3 299 563 301
3 122 564 301
3 59 564 122
3 302 565 68
3 303 565 302
3 303 566 192
3 302 566 303
3 304 567 68
3 302 567 304
3 68 568 304
3 122 568 68
3 23 918 192
3 569 918 23
3 569 919 305
3 23 919 569
3 570 920 305
3 68 920 570
3 305 921 570
3 23 921 305
3 54 19 29
3 306 922 54
3 571 922 306
3 571 923 38
3 306 923 571
3 572 924 54
3 306 924 572
3 54 925 572
3 29 925 54
3 125 926 38
3 573 926 125
3 573 927 307
3 125 927 573
3 574 928 307
3 54 928 574
3 307 929 574
3 125 929 307
3 575 930 308
3 2 930 575
3 575 931 174
3 308 931 575
3 576 932 2
3 308 932 576
3 192 933 2
3 576 933 192
3 311 934 309
3 174 934 311
3 309 935 311
3 310 935 309
3 312 936 310
3 2 936 312
3 310 937 312
3 309 937 310
3 313 938 174
3 314 938 313
3 314 939 309
3 313 939 314
3 315 940 174
3 313 940 315
3 174 941 315
3 26 941 174
3 577 942 26
3 2 942 577
3 26 943 577
3 124 943 26
3 316 944 125
3 578 944 316
3 578 945 102
3 316 945 578
3 579 946 125
3 316 946 579
3 125 947 579
3 39 947 125
3 317 948 102
3 580 948 317
3 580 949 125
3 317 949 580
3 581 950 102
3 317 950 581
3 102 951 581
3 111 951 102
3 320 582 318
3 7 582 320
3 318 583 320
3 319 583 318
3 321 584 319
3 191 584 321
3 319 585 321
3 318 585 319
3 322 586 7
3 323 586 322
3 323 587 318
3 322 587 323
3 324 588 7
3 322 588 324
3 7 589 324
3 72 589 7
3 2 952 191
3 590 952 2
3 590 953 325
3 2 953 590
3 591 954 325
3 7 954 591
3 325 955 591
3 2 955 325
3 118 956 39
3 592 956 118
3 592 957 326
3 118 957 592
3 593 958 326
3 8 958 593
3 326 959 593
3 118 959 326
3 53 65 8
3 327 960 53
3 594 960 327
3 594 961 118
3 327 961 594
3 595 962 53
3 327 962 595
3 53 963 595
3 8 963 53
3 596 964 328
3 48 964 596
3 328 965 596
3 329 965 328
3 597 966 329
3 22 966 597
3 329 967 597
3 328 967 329
3 330 968 48
3 598 968 330
3 598 969 328
3 330 969 598
3 599 970 48
3 330 970 599
3 48 971 599
3 73 971 48
3 48 972 157
3 600 972 48
3 600 973 331
3 48 973 600
3 601 974 331
3 191 974 601
3 331 975 601
3 48 975 331
3 332 976 22
3 602 976 332
3 602 977 48
3 332 977 602
3 603 978 22
3 332 978 603
3 22 979 603
3 191 979 22
3 333 980 118
3 604 980 333
3 604 981 95
3 333 981 604
3 605 982 118
3 333 982 605
3 118 983 605
3 110 983 118
3 95 984 606
3 90 984 95
3 606 985 334
3 90 985 606
3 607 986 334
3 118 986 607
3 607 987 90
3 334 987 607
3 95 63 90
3 335 988 1
3 608 988 335
3 608 989 175
3 335 989 608
3 609 990 1
3 335 990 609
3 1 991 609
3 105 991 1
3 1 992 130
3 610 992 1
3 610 993 337
3 1 993 610
3 611 994 337
3 336 994 611
3 337 995 611
3 1 995 337
3 338 996 336
3 612 996 338
3 612 997 22
3 338 997 612
3 336 998 338
3 613 998 336
3 613 999 1
3 336 999 613
3 22 614 175
3 339 614 22
3 339 615 1
3 22 615 339
3 69 1000 30
3 70 1000 69
3 55 1001 30
3 69 1001 55
3 170 616 110
3 340 616 170
3 340 617 30
3 170 617 340
3 341 618 55
3 170 618 341
3 55 619 341
3 30 619 55
3 344 620 342
3 71 620 344
3 342 621 344
3 343 621 342
3 345 622 343
3 154 622 345
3 343 623 345
3 342 623 343
3 346 624 71
3 347 624 346
3 347 625 342
3 346 625 347
3 348 626 71
3 346 626 348
3 71 627 348
3 135 627 71
3 349 1002 154
3 628 1002 349
3 628 1003 71
3 349 1003 628
3 629 1004 154
3 349 1004 629
3 154 1005 629
3 175 1005 154
3 350 630 170
3 179 630 350
3 170 631 350
3 5 631 170
3 55 632 179
3 351 632 55
3 351 633 170
3 55 633 351
3 154 1006 149
3 634 1006 154
3 634 1007 352
3 154 1007 634
3 635 1008 352
3 190 1008 635
3 352 1009 635
3 154 1009 352
3 190 636 163
3 355 636 190
3 355 637 354
3 190 637 355
3 356 638 354
3 353 638 356
3 354 639 356
3 190 639 354
3 357 640 353
3 358 640 357
3 358 641 154
3 357 641 358
3 353 642 357
3 359 642 353
3 359 643 190
3 353 643 359
3 154 131 163
3 25 1010 5
3 644 1010 25
3 644 1011 360
3 25 1011 644
3 645 1012 360
3 13 1012 645
3 360 1013 645
3 25 1013 360
3 123 75 13
3 13 1014 123
3 646 1014 13
3 646 1015 361
3 13 1015 646
3 647 1016 361
3 25 1016 647
3 361 1017 647
3 13 1017 361
3 49 1018 45
3 648 1018 49
3 648 1019 362
3 49 1019 648
3 649 1020 362
3 149 1020 649
3 362 1021 649
3 49 1021 362
3 650 1022 363
3 49 1022 650
3 363 1023 650
3 364 1023 363
3 651 1024 364
3 91 1024 651
3 364 1025 651
3 363 1025 364
3 365 1026 49
3 652 1026 365
3 652 1027 363
3 365 1027 652
3 653 1028 49
3 365 1028 653
3 49 1029 653
3 36 1029 49
3 366 654 91
3 49 654 366
3 91 655 366
3 149 655 91
3 367 1030 25
3 656 1030 367
3 656 1031 16
3 367 1031 656
3 657 1032 25
3 367 1032 657
3 25 1033 657
3 84 1033 25
3 58 1034 16
3 658 1034 58
3 658 1035 368
3 58 1035 658
3 659 1036 368
3 25 1036 659
3 368 1037 659
3 58 1037 368
3 16 183 58
3 87 1038 146
3 371 1038 87
3 371 1039 370
3 87 1039 371
3 372 1040 370
3 369 1040 372
3 370 1041 372
3 87 1041 370
3 373 1042 369
3 374 1042 373
3 374 1043 91
3 373 1043 374
3 369 1044 373
3 375 1044 369
3 375 1045 87
3 369 1045 375
3 91 1046 126
3 660 1046 91
3 660 1047 376
3 91 1047 660
3 661 1048 376
3 87 1048 661
3 376 1049 661
3 91 1049 376
3 377 662 87
3 126 662 377
3 87 663 377
3 67 663 87
3 34 1050 84
3 664 1050 34
3 664 1051 378
3 34 1051 664
3 665 1052 378
3 88 1052 665
3 378 1053 665
3 34 1053 378
3 88 666 46
3 379 666 88
3 379 667 34
3 88 667 379
3 81 668 156
3 382 668 81
3 382 669 381
3 81 669 382
3 383 670 381
3 380 670 383
3 381 671 383
3 81 671 381
3 384 672 380
3 385 672 384
3 385 673 126
3 384 673 385
3 380 674 384
3 386 674 380
3 386 675 81
3 380 675 386
3 387 1054 116
3 676 1054 387
3 676 1055 81
3 387 1055 676
3 677 1056 116
3 387 1056 677
3 116 1057 677
3 126 1057 116
3 388 1058 34
3 678 1058 388
3 678 1059 139
3 388 1059 678
3 679 1060 34
3 388 1060 679
3 34 1061 679
3 83 1061 34
3 139 1062 82
3 680 1062 139
3 680 1063 389
3 139 1063 680
3 681 1064 389
3 83 1064 681
3 389 1065 681
3 139 1065 389
3 82 80 139
3 52 682 193
3 390 682 52
3 390 683 116
3 52 683 390
3 153 1066 52
3 684 1066 153
3 684 1067 392
3 153 1067 684
3 685 1068 392
3 391 1068 685
3 392 1069 685
3 153 1069 392
3 393 1070 391
3 686 1070 393
3 686 1071 116
3 393 1071 686
3 391 1072 393
3 687 1072 391
3 687 1073 153
3 391 1073 687
3 116 1074 127
3 688 1074 116
3 688 1075 394
3 116 1075 688
3 689 1076 394
3 153 1076 689
3 394 1077 689
3 116 1077 394
3 24 1078 83
3 690 1078 24
3 690 1079 395
3 24 1079 690
3 691 1080 395
3 56 1080 691
3 395 1081 691
3 24 1081 395
3 56 1082 177
3 692 1082 56
3 692 1083 396
3 56 1083 692
3 693 1084 396
3 24 1084 693
3 396 1085 693
3 56 1085 396
3 177 0 56
3 99 694 121
3 398 694 99
3 398 695 397
3 99 695 398
3 399 696 397
3 127 696 399
3 397 697 399
3 99 697 397
3 400 1086 92
3 698 1086 400
3 698 1087 76
3 400 1087 698
3 699 1088 92
3 400 1088 699
3 92 1089 699
3 127 1089 92
3 76 700 99
3 402 700 76
3 402 701 401
3 76 701 402
3 403 702 401
3 127 702 403
3 401 703 403
3 76 703 401
3 404 1090 24
3 704 1090 404
3 704 1091 147
3 404 1091 704
3 705 1092 24
3 404 1092 705
3 24 1093 705
3 4 1093 24
3 147 1094 182
3 706 1094 147
3 706 1095 405
3 147 1095 706
3 707 1096 405
3 4 1096 707
3 405 1097 707
3 147 1097 405
3 182 42 147
3 85 708 66
3 407 708 85
3 407 709 406
3 85 709 407
3 408 710 406
3 92 710 408
3 406 711 408
3 85 711 406
3 12 712 85
3 410 712 12
3 410 713 409
3 12 713 410
3 411 714 409
3 92 714 411
3 409 715 411
3 12 715 409
3 92 716 150
3 412 716 92
3 412 717 12
3 92 717 412
3 103 160 106
3 103 106 43
3 171 1098 4
3 718 1098 171
3 718 1099 413
3 171 1099 718
3 719 1100 413
3 9 1100 719
3 413 1101 719
3 171 1101 413
3 103 43 9
3 9 1102 103
3 720 1102 9
3 720 1103 414
3 9 1103 720
3 721 1104 414
3 171 1104 721
3 414 1105 721
3 9 1105 414
3 415 722 155
3 186 722 415
3 155 723 415
3 150 723 155
3 89 1106 51
3 150 1106 89
3 114 724 89
3 417 724 114
3 417 725 416
3 114 725 417
3 418 726 416
3 150 726 418
3 416 727 418
3 114 727 416
3 159 186 150
3 159 1107 114
3 728 1107 159
3 728 1108 419
3 159 1108 728
3 729 1109 419
3 150 1109 729
3 419 1110 729
3 159 1110 419
3 184 104 97
3 3 184 97
3 420 1111 3
3 730 1111 420
3 730 1112 171
3 420 1112 730
3 731 1113 3
3 420 1113 731
3 3 1114 731
3 97 1114 3
3 421 1115 171
3 732 1115 421
3 732 1116 3
3 421 1116 732
3 733 1117 171
3 421 1117 733
3 171 1118 733
3 109 1118 171
3 422 1119 178
3 734 1119 422
3 734 1120 155
3 422 1120 734
3 735 1121 178
3 422 1121 735
3 178 1122 735
3 185 1122 178
3 155 736 176
3 423 736 155
3 423 737 185
3 155 737 423
3 738 1123 60
3 176 1123 738
3 60 1124 738
3 6 1124 60
3 424 739 185
3 425 739 424
3 425 740 176
3 424 740 425
3 426 741 185
3 424 741 426
3 185 742 426
3 60 742 185
3 113 32 133
3 94 113 133
3 94 133 78
3 14 94 78
3 14 78 142
3 108 14 142
3 108 142 169
3 168 108 169
3 41 168 169
3 41 169 195
3 128 41 195
3 128 195 62
3 18 128 62
3 18 62 27
3 21 18 27
3 134 32 113
3 134 113 93
3 77 134 93
3 77 93 15
3 141 77 15
3 141 15 107
3 166 141 107
3 166 107 167
3 166 167 40
3 194 166 40
3 194 40 129
3 61 194 129
3 61 129 17
3 28 61 17
3 28 17 21
3 138 28 21
3 27 138 21