OFF

15 26 0
-0.000013 -0.032143 0.005366
0.032130 0.032143 0.005368
-0.000013 0.032143 0.005366
-0.032156 -0.000000 0.005364
-0.032156 -0.032143 0.005364
-0.032156 0.032143 0.005364
-0.016078 -0.032143 -0.096420
-0.032150 -0.016072 -0.096421
-0.032150 0.016072 -0.096421
0.016053 -0.032143 0.107153
0.016053 0.032143 0.107153
-0.016090 -0.032143 0.107151
-0.016090 0.032143 0.107151
-0.032162 -0.016072 0.107150
-0.032162 0.016072 0.107150
3 6 8 7
3 6 1 8
3 6 9 1
3 9 10 1
3 1 2 8
3 2 5 8
3 6 0 9
3 7 4 6
3 13 14 11
3 14 12 11
3 12 9 11
3 12 10 9
3 11 4 13
3 14 5 12
3 12 5 2
3 10 12 2
3 10 2 1
3 7 8 3
3 13 4 3
3 7 3 4
3 14 13 3
3 8 5 3
3 14 3 5
3 6 4 0
3 11 0 4
3 11 9 0
