OFF
1113 1390 0
-0.2331064653 0.0435684106 0.0938826840
-0.2331066044 0.0406785939 0.0938844768
-0.2121708174 0.0434168988 -0.1487202406
-0.2121709565 0.0405270822 -0.1487184478
0.0819340715 -0.0043116746 0.4993539889
0.0819343785 0.0020658662 0.4993500324
0.1676708091 -0.0049321534 -0.4941659372
0.1676711161 0.0014453875 -0.4941698937
0.1661829286 -0.0193069324 0.0153489053
0.1661817195 -0.0444238793 0.0153644871
0.1657689275 -0.0236360385 0.0201466337
0.1657681355 -0.0400886790 0.0201568404
0.1657220531 -0.0318620749 0.0206903295
0.1680239394 -0.0208329751 -0.0059846894
0.1680228760 -0.0429244845 -0.0059709845
0.1669688420 -0.0188260852 0.0062416860
0.1669675861 -0.0449159966 0.0062578715
0.1669691211 -0.0130283971 0.0062380893
0.1659135522 -0.0208177022 0.0184705421
0.1659124887 -0.0429092116 0.0184842470
0.1682143750 -0.0318801119 -0.0081907719
0.1681682926 -0.0236534028 -0.0076572829
0.1681675007 -0.0401060433 -0.0076470762
0.1677547086 -0.0193183074 -0.0028649295
0.1677534996 -0.0444352543 -0.0028493477
-0.2343432989 -0.0437553971 -0.0232717741
-0.2334691452 -0.0437617233 -0.0334014941
-0.2084868011 0.0420483476 -0.0261966299
0.1438637580 -0.0186032542 0.0042476719
0.1438642947 -0.0074537894 0.0042407551
-0.2148399946 0.0442558268 -0.0267462633
-0.2148402071 0.0398407999 -0.0267435244
0.1306744839 -0.0171029253 0.2649774237
0.1306748918 -0.0086293488 0.2649721669
0.1755368184 -0.0174275950 -0.2548886754
0.1755372263 -0.0089540186 -0.2548939322
0.2733589745 -0.0344306374 0.0125371781
0.2733596394 -0.0206173558 0.0125286087
0.2737098776 -0.0303873272 0.0084706488
0.2737101530 -0.0246657421 0.0084670993
0.2724633129 -0.0275174598 0.0229156995
0.2735692429 -0.0328116358 0.0101004802
0.2735697518 -0.0222393996 0.0100939215
0.2731116620 -0.0200465200 0.0154021428
0.2731109423 -0.0349978835 0.0154114182
0.2726528525 -0.0328050039 0.0207196395
0.2726533614 -0.0222327677 0.0207130808
0.2737592914 -0.0275268388 0.0078978615
0.2725124512 -0.0303786614 0.0223464618
0.2725127267 -0.0246570763 0.0223429123
0.2728629649 -0.0344270477 0.0182849523
0.2728636298 -0.0206137661 0.0182763830
0.2762440335 -0.0275187028 0.0212053543
0.2768990357 -0.0224490996 0.0136148515
0.2768985471 -0.0325977830 0.0136211475
0.2762799417 -0.0296208773 0.0207893799
0.2762801441 -0.0254171545 0.0207867720
0.2770525825 -0.0236408829 0.0118356208
0.2770522086 -0.0314083280 0.0118404395
0.2767178354 -0.0220297986 0.0157145796
0.2767173066 -0.0330145659 0.0157213942
0.2763829334 -0.0236360366 0.0195955343
0.2763825595 -0.0314034817 0.0196003530
0.2771549979 -0.0296272101 0.0106492018
0.2771552003 -0.0254234873 0.0106465939
0.2765365949 -0.0224464766 0.0178148263
0.2765361064 -0.0325951600 0.0178211222
0.2771911085 -0.0275255568 0.0102306194
0.1215063672 -0.0188317459 -0.0064106052
0.1215068137 -0.0095553610 -0.0064163600
0.1200109380 -0.0188209234 0.0109184739
0.1200113845 -0.0095445385 0.0109127191
-0.1849559367 -0.0437551304 -0.0190098454
-0.1840817830 -0.0437614567 -0.0291395654
0.1554158361 -0.0174883084 0.0052438730
0.1554162655 -0.0085686106 0.0052383395
0.0976535793 -0.0183805480 0.0002597819
0.0976540946 -0.0076769946 0.0002531417
0.2522931204 -0.0141279574 0.0189467986
0.2522918312 -0.0409100392 0.0189634134
0.2535957224 -0.0377775205 0.0038536865
0.2535967091 -0.0172793466 0.0038409700
0.2539466533 -0.0275309172 -0.0002135537
0.2516447611 -0.0330610707 0.0264611912
0.2516452951 -0.0219675548 0.0264543091
0.2527496123 -0.0420166894 0.0136587015
0.2527510077 -0.0130279340 0.0136407177
0.2538553249 -0.0330770686 0.0008451101
0.2538558589 -0.0219835527 0.0008382280
0.2515539666 -0.0275136012 0.0275129729
0.2519039109 -0.0377652768 0.0234584492
0.2519048976 -0.0172671029 0.0234457327
0.2532087888 -0.0141345842 0.0083360058
0.2532074996 -0.0409166659 0.0083526206
0.2364734319 -0.0384802666 -0.0018315332
0.2364744860 -0.0165819015 -0.0018451183
0.2363493710 -0.0134468088 -0.0003954778
0.2363480151 -0.0416135462 -0.0003780039
0.2340214370 -0.0275133351 0.0265815732
0.2344263507 -0.0432314991 0.0218904045
0.2344278636 -0.0118011477 0.0218709060
0.2352668165 -0.0437560272 0.0121510934
0.2352683793 -0.0112886799 0.0121309516
0.2361073322 -0.0432436644 0.0024111391
0.2361088452 -0.0118133130 0.0023916406
0.2365137588 -0.0275313721 -0.0022995281
0.2341871807 -0.0134311609 0.0246600490
0.2341858248 -0.0415978984 0.0246775228
0.2340607098 -0.0384628057 0.0261271634
0.2340617639 -0.0165644406 0.0261135782
-0.2461027107 0.0444721298 0.0927605964
-0.2461029368 0.0397757841 0.0927635099
-0.2251670629 0.0443206180 -0.1498423282
-0.2251672889 0.0396242723 -0.1498394147
-0.2778062157 -0.0437587972 -0.0321250253
-0.2778020295 0.0432068392 -0.0321789763
0.0894431455 -0.0011228637 0.5000000000
0.1323106770 -0.0188262723 0.0032508272
0.1323112352 -0.0072307911 0.0032436337
0.1751798831 -0.0017433424 -0.4935199261
-0.1680567544 -0.0437582047 -0.0226540925
0.0781799490 0.0027036421 0.4990256421
0.0781795806 -0.0049493860 0.4990303898
0.1639166866 0.0020831633 -0.4944942840
0.1639163182 -0.0055698648 -0.4944895363
0.1196996959 -0.0181622341 0.2640310056
0.1197002058 -0.0075701585 0.2640244346
0.1645620305 -0.0184869038 -0.2558350935
0.1645625403 -0.0078948283 -0.2558416645
0.2476979812 -0.0201962815 -0.0002263556
0.2476972751 -0.0348650664 -0.0002172555
0.2474879612 -0.0391529312 0.0022085484
0.2474890803 -0.0159053901 0.0021941262
0.2459518859 -0.0417231261 0.0200087978
0.2459532534 -0.0133129638 0.0199911729
0.2453255182 -0.0275134545 0.0272662763
0.2465460447 -0.0425964707 0.0131237209
0.2465474960 -0.0124482196 0.0131050178
0.2477680225 -0.0275311309 -0.0010375377
0.2471402873 -0.0417317265 0.0062375658
0.2471416549 -0.0133215643 0.0062199409
0.2456044605 -0.0391393002 0.0240346124
0.2456055795 -0.0158917592 0.0240201903
0.2453962657 -0.0201796239 0.0264459941
0.2453955595 -0.0348484088 0.0264550942
0.0669161845 -0.0052683449 0.4980586036
0.0669165836 0.0030224793 0.4980534603
0.1526529221 -0.0058888236 -0.4954613225
0.1526533212 0.0024020005 -0.4954664659
-0.2014555487 -0.0437549554 -0.0200080410
-0.2005084736 -0.0437618094 -0.0309827759
-0.2171512866 0.0432071667 -0.0269450635
0.0526553261 -0.0225600171 -0.0177716626
0.0526544288 -0.0412008566 -0.0177600984
0.0503383463 -0.0434184815 0.0090788755
0.0503394587 -0.0203089756 0.0090645390
0.0501965796 -0.0318626986 0.0107209503
0.0509936233 -0.0420145295 0.0014854177
0.0509944606 -0.0246212552 0.0014746274
0.0503954516 -0.0420102005 0.0084170494
0.0503962889 -0.0246169262 0.0084062591
0.0505517311 -0.0445536992 0.0066062371
0.0505529527 -0.0191768472 0.0065904940
0.0514433684 -0.0188267089 -0.0037276931
0.0514421125 -0.0449166203 -0.0037115077
0.0514436475 -0.0130290208 -0.0037312898
0.0523325283 -0.0445665869 -0.0140296947
0.0523337498 -0.0191897349 -0.0140454378
0.0526889014 -0.0318807356 -0.0181601510
0.0525460222 -0.0434344585 -0.0165037397
0.0525471346 -0.0203249526 -0.0165180762
0.0502310522 -0.0225424726 0.0103208976
0.0502301548 -0.0411833120 0.0103324619
0.1611929371 -0.0165962444 0.0057418563
0.1611932806 -0.0094606121 0.0057374295
-0.2265386739 0.0432092154 -0.0243709983
-0.2259589130 0.0432050197 -0.0310892846
0.2575599972 -0.0224269057 0.0016965461
0.2575595059 -0.0326329026 0.0017028776
0.2554415778 -0.0224115747 0.0262448547
0.2554410865 -0.0326175715 0.0262511862
0.2574476621 -0.0275290929 0.0029986084
0.2560612926 -0.0398388364 0.0190646707
0.2560624787 -0.0151992917 0.0190493850
0.2573753500 -0.0317441554 0.0038368262
0.2573757559 -0.0233130917 0.0038315958
0.2576470225 -0.0275305357 0.0006884131
0.2556903323 -0.0180872559 0.0233620090
0.2556894245 -0.0369455927 0.0233737081
0.2565011172 -0.0165065056 0.0139665094
0.2565012289 -0.0141874094 0.0139650707
0.2564999451 -0.0408570685 0.0139816158
0.2565000567 -0.0385379723 0.0139801771
0.2573117494 -0.0180989902 0.0045729784
0.2573108416 -0.0369573269 0.0045846776
0.2553541514 -0.0275139422 0.0272582734
0.2569386953 -0.0398451861 0.0088973015
0.2569398814 -0.0152056415 0.0088820158
0.2571699513 -0.0353163646 0.0062172162
0.2571707012 -0.0197378071 0.0062075517
0.2568635177 -0.0173477317 0.0097670549
0.2568625379 -0.0377020971 0.0097796822
-0.2350322331 0.0432047955 -0.0321546397
-0.2356603675 0.0432093414 -0.0248757990
-0.2409042077 0.0398660861 0.0932120827
-0.2409039903 0.0443818839 0.0932092812
-0.2199685599 0.0397145744 -0.1493908419
-0.2199683425 0.0442303721 -0.1493936434
0.1948019485 -0.0437486643 0.0208798297
0.1948026462 -0.0292543391 0.0208708378
0.1968955493 -0.0437638157 -0.0033808811
0.1968962470 -0.0292694905 -0.0033898729
0.1388354497 -0.0188316523 -0.0049151758
0.1388358962 -0.0095552674 -0.0049209306
0.1373400205 -0.0188208299 0.0124139034
0.1373404670 -0.0095444449 0.0124081486
-0.2466096093 0.0446975778 -0.0294881280
-0.2466098643 0.0393987058 -0.0294848408
0.1361622195 -0.0094766349 0.2654462302
0.1361618931 -0.0162555800 0.2654504357
0.1810245540 -0.0098013046 -0.2544198689
0.1810242277 -0.0165802497 -0.2544156634
-0.2211943135 0.0448079332 -0.0272949601
-0.2211945792 0.0392886248 -0.0272915360
0.0641165010 -0.0275314002 -0.0157216916
0.0641158033 -0.0420258304 -0.0157126997
0.0628703401 -0.0275223817 -0.0012811409
0.0628696424 -0.0420168119 -0.0012721490
-0.1793957371 -0.0437556279 -0.0193802768
-0.1786672456 -0.0437609000 -0.0278220587
0.1087249487 -0.0183741222 0.2630840618
0.1087254790 -0.0073583889 0.2630772279
0.1535872833 -0.0186987920 -0.2567820373
0.1535878136 -0.0076830586 -0.2567888712
-0.2538311944 0.0432090681 -0.0267262319
-0.2532514336 0.0432048723 -0.0334445183
0.1739559744 -0.0399587247 -0.0072930430
0.1739571708 -0.0151043070 -0.0073084620
0.1716398561 -0.0429211098 0.0195463929
0.1716413393 -0.0121084004 0.0195272775
0.1714982747 -0.0275136726 0.0211860783
0.1718532227 -0.0444341136 0.0170739888
0.1718548514 -0.0105983810 0.0170529981
0.1727435984 -0.0449159654 0.0067563179
0.1727452729 -0.0101295219 0.0067347373
0.1736340198 -0.0444470013 -0.0035619429
0.1736356486 -0.0106112686 -0.0035829337
0.1739905965 -0.0275317096 -0.0076950231
0.1738475319 -0.0429370868 -0.0060362223
0.1738490152 -0.0121243774 -0.0060553377
0.1715317004 -0.0399411802 0.0207995172
0.1715328968 -0.0150867625 0.0207840983
-0.2275476079 0.0449181171 -0.0278432924
-0.2275478842 0.0391783723 -0.0278397316
0.2824938970 -0.0275220986 0.0162164603
0.0757997124 -0.0179506422 0.2602424830
0.0758002019 -0.0077822245 0.2602361749
0.1206620470 -0.0182753119 -0.2596236161
0.1206625364 -0.0081068942 -0.2596299243
-0.2234575397 0.0432088824 -0.0246687841
-0.2229743455 0.0432053855 -0.0302680533
0.0856888080 0.0014281954 0.4996744227
0.0856885624 -0.0036738583 0.4996775879
0.1714255456 0.0008077167 -0.4938455034
0.1714253000 -0.0042943370 -0.4938423382
0.1496397810 -0.0183802673 0.0047459800
0.1496402962 -0.0076767140 0.0047393398
0.2805824421 -0.0251983858 0.0150480857
0.2805822183 -0.0298471802 0.0150509696
0.2802722340 -0.0275204864 0.0186429323
0.2803377595 -0.0292999882 0.0178837318
0.2803379308 -0.0257419342 0.0178815245
0.2802893374 -0.0265578274 0.0184446769
0.2802892447 -0.0284834971 0.0184458715
0.2804966243 -0.0250061949 0.0160425326
0.2804963821 -0.0300381288 0.0160456542
0.2807037617 -0.0265608266 0.0136423153
0.2807036690 -0.0284864963 0.0136435099
0.2806550757 -0.0293022846 0.0142066622
0.2806552469 -0.0257442306 0.0142044549
0.2807207725 -0.0275237324 0.0134452544
0.2804107881 -0.0251971435 0.0170372171
0.2804105643 -0.0298459380 0.0170401011
0.0744254964 0.0028630708 0.4987015485
0.0744251127 -0.0051088553 0.4987064941
0.1601622340 0.0022425921 -0.4948183776
0.1601618503 -0.0057293340 -0.4948134321
-0.2616988936 0.0442914977 0.0914148219
-0.2616991023 0.0399562478 0.0914175114
-0.2407632458 0.0441399859 -0.1511881027
-0.2407634545 0.0398047361 -0.1511854132
-0.2357054612 0.0403174840 0.0936604315
-0.2357052873 0.0439305421 0.0936581901
-0.2147698134 0.0401659723 -0.1489424931
-0.2147696395 0.0437790304 -0.1489447345
-0.2261490228 -0.0316791540 -0.0238270197
-0.2261495994 -0.0436579846 -0.0238195884
-0.2260544862 -0.0307308065 -0.0249225720
-0.2260551542 -0.0446075948 -0.0249139632
-0.2254381726 -0.0419466676 -0.0320637312
-0.2254377613 -0.0334007670 -0.0320690328
-0.2254209098 -0.0376737882 -0.0322640402
-0.2258193722 -0.0304237919 -0.0276470997
-0.2258200699 -0.0449181171 -0.0276381079
-0.2262185322 -0.0376680158 -0.0230211674
-0.2262016808 -0.0419411421 -0.0232161748
-0.2262012695 -0.0333952415 -0.0232214764
-0.2255842879 -0.0307342093 -0.0303712444
-0.2255849559 -0.0446109976 -0.0303626357
-0.2254898427 -0.0316839245 -0.0314656192
-0.2254904193 -0.0436627551 -0.0314581879
0.1251870746 -0.0179503755 0.2645044118
0.1251875641 -0.0077819578 0.2644981036
0.1700494092 -0.0182750453 -0.2553616873
0.1700498986 -0.0081066276 -0.2553679955
0.0683227058 -0.0420144359 0.0029808472
0.0683235431 -0.0246211617 0.0029700569
0.0677245341 -0.0420101069 0.0099124788
0.0677253714 -0.0246168327 0.0099016885
-0.1904615355 -0.0437550281 -0.0192721293
-0.1895509211 -0.0437616183 -0.0298243567
-0.2116640589 0.0402816899 -0.0264697110
-0.2116638889 0.0438139213 -0.0264719023
0.2615836032 -0.0319445284 0.0251677801
0.2615840296 -0.0230866578 0.0251622849
0.2632102301 -0.0193437631 0.0063175888
0.2632094422 -0.0357108533 0.0063277425
0.2628868977 -0.0168326457 0.0100642171
0.2628858683 -0.0382172890 0.0100774835
0.2625043426 -0.0390955391 0.0144986708
0.2625054568 -0.0159489789 0.0144843113
0.2635017923 -0.0275294211 0.0029394688
0.2621239310 -0.0168271241 0.0189054986
0.2621229016 -0.0382117673 0.0189187650
0.2618003571 -0.0193335598 0.0226552396
0.2617995693 -0.0357006500 0.0226653933
0.2615079168 -0.0275149913 0.0260445591
0.2634257698 -0.0319578602 0.0038206972
0.2634261962 -0.0230999896 0.0038152021
-0.2383051552 0.0442916240 0.0934336065
-0.2383053639 0.0399563741 0.0934362960
-0.2173695074 0.0441401122 -0.1491693181
-0.2173697160 0.0398048624 -0.1491666286
0.1023815696 -0.0437491633 0.0129043264
0.1023822673 -0.0292548380 0.0128953345
0.1044751705 -0.0437643147 -0.0113563844
0.1044758682 -0.0292699895 -0.0113653763
-0.2199898681 0.0432057519 -0.0294457762
-0.2203763152 0.0432085487 -0.0249676158
0.0443887610 0.0027034596 0.4961095998
0.0443883926 -0.0049495684 0.4961143476
0.1301254986 0.0020829809 -0.4974103263
0.1301251302 -0.0055700472 -0.4974055786
-0.2180171461 0.0446977322 -0.0270207146
-0.2180174011 0.0393988602 -0.0270174273
0.2256781307 -0.0275292645 0.0002570269
0.2256058186 -0.0317443269 0.0010952447
0.2256062245 -0.0233132632 0.0010900143
0.2247315859 -0.0165066771 0.0112249279
0.2247305253 -0.0385381438 0.0112385956
0.2254004199 -0.0353165362 0.0034756346
0.2254011698 -0.0197379786 0.0034659701
0.2250939863 -0.0173479033 0.0070254734
0.2250930065 -0.0377022686 0.0070381006
-0.2289786247 0.0432049158 -0.0314910557
-0.2295825723 0.0432092866 -0.0244924921
0.0318999634 -0.0128666703 0.2564509378
0.0767622980 -0.0131913401 -0.2634151613
-0.2824938970 0.0421237605 0.0896216513
-0.2720260731 0.0420480046 -0.0316798110
-0.2615582491 0.0419722487 -0.1529812733
-0.2305066495 0.0421240412 0.0941079396
-0.2095710017 0.0419725294 -0.1484949850
0.1416494248 -0.0128660778 0.2659218705
0.1865117594 -0.0131907476 -0.2539442286
0.2676021330 -0.0184912791 0.0187113027
0.2676012638 -0.0365483820 0.0187225049
0.2685254608 -0.0206163561 0.0080118844
0.2685247956 -0.0344366707 0.0080204582
0.2671428720 -0.0312562679 0.0240340325
0.2671432320 -0.0237767548 0.0240293925
0.2670785238 -0.0275160443 0.0247794670
0.2679254934 -0.0372946491 0.0149653694
0.2679264342 -0.0177498103 0.0149532444
0.2687734037 -0.0275283102 0.0051391467
0.2687086955 -0.0312675998 0.0058892213
0.2687090556 -0.0237880867 0.0058845812
0.2673271320 -0.0206076838 0.0218981556
0.2673264667 -0.0344279984 0.0219067293
0.2682506637 -0.0184959726 0.0111961089
0.2682497945 -0.0365530754 0.0112073110
-0.1732527082 -0.0437603433 -0.0265045521
-0.1738355375 -0.0437561253 -0.0197507082
0.0323468651 -0.0275315717 -0.0184632822
0.0323461673 -0.0420260019 -0.0184542902
0.0311007041 -0.0275225532 -0.0040227315
0.0311000064 -0.0420169834 -0.0040137395
0.2788753920 -0.0245011143 0.0128163199
0.2788751010 -0.0305470558 0.0128200706
0.2787541417 -0.0235734588 0.0142213142
0.2787537615 -0.0314728508 0.0142262147
0.2782654442 -0.0291556782 0.0198847056
0.2782656017 -0.0258836668 0.0198826757
0.2782370944 -0.0275194143 0.0202131209
0.2786111124 -0.0232470174 0.0158787219
0.2786107008 -0.0317972217 0.0158840262
0.2789847188 -0.0275248249 0.0115496272
0.2789562115 -0.0291606773 0.0118800724
0.2789563690 -0.0258886659 0.0118780425
0.2784680518 -0.0235713883 0.0175365333
0.2784676715 -0.0314707804 0.0175414339
0.2783467122 -0.0244972883 0.0189426775
0.2783464212 -0.0305432298 0.0189464282
0.0143518491 -0.0011232691 0.4935199261
0.1000885867 -0.0017437478 -0.5000000000
0.1515656703 -0.0112525160 0.1358421598
0.1459340862 -0.0090449805 0.1353547982
0.1403019148 -0.0081752842 0.1348682216
0.1346702510 -0.0076234362 0.1343818872
0.1262948869 -0.0074060892 0.1336589915
0.1175101829 -0.0073822390 0.1983681097
0.1317822502 -0.0075119740 0.1341325948
0.1040557185 -0.0075065078 0.1317399043
0.0899279602 -0.0076443661 0.1959880396
0.0993267196 -0.0075013775 0.2295326338
0.0828640810 -0.0077132953 0.2281121072
0.0875634607 -0.0076418010 0.2448844043
0.1063905988 -0.0074324483 0.1974085661
0.0969918394 -0.0075754370 0.1638639719
0.0993267196 -0.0075013775 0.2295326338
0.1205183571 -0.0072945900 0.1331604308
0.1181834769 -0.0073686495 0.0674917690
0.1111195977 -0.0074375786 0.0996158366
0.1264147961 -0.0072626906 0.0682020322
0.1063905988 -0.0074324483 0.1974085661
0.1146219180 -0.0073264894 0.1981188294
0.1134544779 -0.0073635192 0.1652844985
0.0647770290 -0.0102718325 0.1283520398
0.0702886154 -0.0090270285 0.1942941073
0.0483384962 -0.0115692514 0.1924014888
0.0510942894 -0.0109468494 0.2253725226
0.0675328222 -0.0096494305 0.1613230735
0.0510942894 -0.0109468494 0.2253725226
0.0538500826 -0.0103244474 0.2583435563
0.0730444086 -0.0084046265 0.2272651411
0.0867271482 -0.0077296095 0.1302446583
0.0812155618 -0.0089744135 0.0643025908
0.0839713550 -0.0083520115 0.0972736245
0.0921906214 -0.0077033021 0.0652489000
0.0702886154 -0.0090270285 0.1942941073
0.0812636750 -0.0077559170 0.1952404166
0.0675328222 -0.0096494305 0.1613230735
0.0636216799 -0.0154898315 0.1282555966
0.0697106962 -0.0167202368 0.1942490398
0.0508053298 -0.0147934536 0.2253499888
0.0727552043 -0.0173354395 0.2272457614
0.0538498379 -0.0154086562 0.2583467104
0.0477608217 -0.0141782509 0.1923532672
0.0666661881 -0.0161050341 0.1612523182
0.0508053298 -0.0147934536 0.2253499888
0.0416718055 -0.0129478456 0.1263598240
0.0575326637 -0.0142594261 0.0622621534
0.0605771718 -0.0148746288 0.0952588750
0.0465577265 -0.0129884332 0.0613142671
0.0477608217 -0.0141782509 0.1923532672
0.0367858844 -0.0129072579 0.1914053809
0.0447163136 -0.0135630482 0.1593565456
0.1031892640 -0.0183773351 0.1316719219
0.1059571064 -0.0183757287 0.1973779918
0.0908784094 -0.0181631854 0.2288102374
0.1073410276 -0.0183749255 0.2302310268
0.0998016791 -0.0182686538 0.2459471496
0.0894944882 -0.0181639886 0.1959572025
0.1045731852 -0.0183765319 0.1645249568
0.0908784094 -0.0181631854 0.2288102374
0.0867266459 -0.0181655951 0.1302511325
0.1004214217 -0.0183789416 0.0659658519
0.1018053429 -0.0183781383 0.0988188869
0.0921901126 -0.0182730715 0.0652554572
0.0894944882 -0.0181639886 0.1959572025
0.0812631791 -0.0180581186 0.1952468078
0.0881105670 -0.0181647919 0.1631041675
0.1260051865 -0.0184942532 0.1336409164
0.1173650676 -0.0184341877 0.1983624891
0.1205178129 -0.0186001973 0.1331674445
0.1345254163 -0.0182768149 0.1343760419
0.1401571324 -0.0177415963 0.1348617018
0.1457888646 -0.0168719442 0.1353471544
0.1514211810 -0.0147311611 0.1358318634
0.1515656703 -0.0112525160 0.1358421598
0.1459340862 -0.0090449805 0.1353547982
0.1403019148 -0.0081752842 0.1348682216
0.1346702510 -0.0076234362 0.1343818872
0.1262948869 -0.0074060892 0.1336589915
0.1350795908 -0.0074299393 0.0689498733
0.1205183571 -0.0072945900 0.1331604308
0.1040557185 -0.0075065078 0.1317399043
0.1008549065 -0.0075917512 0.0659965230
0.1181834769 -0.0073686495 0.0674917690
0.1165830709 -0.0074112712 0.0346200783
0.1024553125 -0.0075491295 0.0988682136
0.1165830709 -0.0074112712 0.0346200783
0.1071185827 -0.0075441329 0.0174366100
0.0992545005 -0.0076343729 0.0331248324
0.0867271482 -0.0077296095 0.1302446583
0.0899279602 -0.0076443661 0.1959880396
0.0883275542 -0.0076869878 0.1631163489
0.0812636750 -0.0077559170 0.1952404166
0.1008549065 -0.0075917512 0.0659965230
0.0921906214 -0.0077033021 0.0652489000
0.1024553125 -0.0075491295 0.0988682136
0.0647770290 -0.0102718325 0.1283520398
0.0581103382 -0.0116504266 0.0623103750
0.0812155618 -0.0089744135 0.0643025908
0.0778822164 -0.0096637106 0.0312817584
0.0614436836 -0.0109611295 0.0953312074
0.0778822164 -0.0096637106 0.0312817584
0.0745488710 -0.0103530077 -0.0017390740
0.0547769929 -0.0123397237 0.0292895426
0.0416718055 -0.0129478456 0.1263598240
0.0483384962 -0.0115692514 0.1924014888
0.0450051508 -0.0122585485 0.1593806564
0.0367858844 -0.0129072579 0.1914053809
0.0581103382 -0.0116504266 0.0623103750
0.0465577265 -0.0129884332 0.0613142671
0.0614436836 -0.0109611295 0.0953312074
0.0636216799 -0.0154898315 0.1282555966
0.0575326637 -0.0142594261 0.0622621534
0.0775931215 -0.0163199871 0.0312609677
0.0544881556 -0.0136442235 0.0292654318
0.0745486134 -0.0157047844 -0.0017357540
0.0806376296 -0.0169351897 0.0642576893
0.0605771718 -0.0148746288 0.0952588750
0.0775931215 -0.0163199871 0.0312609677
0.0867266459 -0.0181655951 0.1302511325
0.0697106962 -0.0167202368 0.1942490398
0.0666661881 -0.0161050341 0.1612523182
0.0812631791 -0.0180581186 0.1952468078
0.0806376296 -0.0169351897 0.0642576893
0.0921901126 -0.0182730715 0.0652554572
0.0836821377 -0.0175503924 0.0972544109
0.1031892640 -0.0183773351 0.1316719219
0.1177499705 -0.0186018037 0.0674613745
0.1004214217 -0.0183789416 0.0659658519
0.1077017749 -0.0184911759 0.0338605782
0.1104696173 -0.0184895694 0.0995666482
0.1077017749 -0.0184911759 0.0338605782
0.1200062260 -0.0186587241 0.0185557027
0.1250303238 -0.0187140380 0.0353561008
0.1205178129 -0.0186001973 0.1331674445
0.1059571064 -0.0183757287 0.1973779918
0.1132374596 -0.0184879630 0.1652727182
0.1146213808 -0.0184871598 0.1981257531
0.1177499705 -0.0186018037 0.0674613745
0.1264142450 -0.0187132348 0.0682091358
0.1104696173 -0.0184895694 0.0995666482
0.1260051865 -0.0184942532 0.1336409164
0.1349344722 -0.0185487537 0.0689442941
0.1317817270 -0.0183827441 0.1341393388
0.1345254163 -0.0182768149 0.1343760419
0.1401571324 -0.0177415963 0.1348617018
0.1457888646 -0.0168719442 0.1353471544
0.1514211810 -0.0147311611 0.1358318634
0.1739968376 -0.0114148508 -0.1240908898
0.1683652535 -0.0092073154 -0.1245782513
0.1627330821 -0.0083376191 -0.1250648280
0.1571014183 -0.0077857711 -0.1255511624
0.1487260541 -0.0075684240 -0.1262740580
0.1511569339 -0.0076257413 -0.1915314646
0.1542134175 -0.0076743089 -0.1258004547
0.1264868858 -0.0076688427 -0.1281931453
0.1235747111 -0.0078878684 -0.1939115348
0.1385812623 -0.0077854635 -0.2253502030
0.1221186238 -0.0079973813 -0.2267707295
0.1296218994 -0.0079461789 -0.2424900636
0.1400373497 -0.0076759506 -0.1924910082
0.1250307985 -0.0077783556 -0.1610523400
0.1385812623 -0.0077854635 -0.2253502030
0.1429495244 -0.0074569249 -0.1267726187
0.1293990605 -0.0074498169 -0.0624747558
0.1279429732 -0.0075593298 -0.0953339506
0.1376303798 -0.0073438580 -0.0617644925
0.1400373497 -0.0076759506 -0.1924910082
0.1482686690 -0.0075699918 -0.1917807450
0.1414934370 -0.0075664378 -0.1596318135
0.0872081963 -0.0104341673 -0.1315810098
0.1039353664 -0.0092705308 -0.1956054670
0.0819852471 -0.0118127537 -0.1974980855
0.0903488322 -0.0112309354 -0.2295103142
0.0955717813 -0.0098523491 -0.1635932384
0.0903488322 -0.0112309354 -0.2295103142
0.0987124172 -0.0106491171 -0.2615225428
0.1122989514 -0.0086887125 -0.2276176956
0.1091583155 -0.0078919444 -0.1296883913
0.0924311454 -0.0090555810 -0.0656639340
0.1007947305 -0.0084737627 -0.0976761626
0.1034062050 -0.0077844695 -0.0647176248
0.1039353664 -0.0092705308 -0.1956054670
0.1149104260 -0.0079994193 -0.1946591578
0.0955717813 -0.0098523491 -0.1635932384
0.0860528472 -0.0156521663 -0.1316774529
0.1033574471 -0.0169637391 -0.1956505345
0.0900598725 -0.0150775396 -0.2295328479
0.1120097470 -0.0176195255 -0.2276370753
0.0987121725 -0.0157333260 -0.2615193887
0.0814075726 -0.0144217532 -0.1975463071
0.0947051472 -0.0163079527 -0.1636639937
0.0900598725 -0.0150775396 -0.2295328479
0.0641029727 -0.0131101804 -0.1335732256
0.0687482474 -0.0143405936 -0.0677043714
0.0774005473 -0.0149963800 -0.0996909122
0.0577733101 -0.0130696006 -0.0686522577
0.0814075726 -0.0144217532 -0.1975463071
0.0704326354 -0.0131507602 -0.1984941934
0.0727552727 -0.0137659668 -0.1655597663
0.1256204313 -0.0185396700 -0.1282611277
0.1396038573 -0.0186192310 -0.1925215825
0.1301329521 -0.0184472715 -0.2260725993
0.1465955703 -0.0186590115 -0.2246518099
0.1418601177 -0.0185730317 -0.2414273183
0.1231412391 -0.0184074910 -0.1939423719
0.1326121443 -0.0185794505 -0.1603913551
0.1301329521 -0.0184472715 -0.2260725993
0.1091578131 -0.0183279300 -0.1296819171
0.1116370053 -0.0184601090 -0.0640006729
0.1186287183 -0.0184998895 -0.0961309003
0.1034056962 -0.0183542390 -0.0647110676
0.1231412391 -0.0184074910 -0.1939423719
0.1149099301 -0.0183016209 -0.1946527666
0.1161495261 -0.0183677105 -0.1618121445
0.1484363538 -0.0186565881 -0.1262921332
0.1510118185 -0.0186776900 -0.1915370852
0.1429489802 -0.0187625321 -0.1267656051
0.1569565836 -0.0184391498 -0.1255570077
0.1625882997 -0.0179039312 -0.1250713477
0.1682200319 -0.0170342791 -0.1245858952
0.1738523482 -0.0148934960 -0.1241011861
0.1739968376 -0.0114148508 -0.1240908898
0.1683652535 -0.0092073154 -0.1245782513
0.1627330821 -0.0083376191 -0.1250648280
0.1571014183 -0.0077857711 -0.1255511624
0.1487260541 -0.0075684240 -0.1262740580
0.1462951744 -0.0075111067 -0.0610166515
0.1429495244 -0.0074569249 -0.1267726187
0.1264868858 -0.0076688427 -0.1281931453
0.1120704902 -0.0076729186 -0.0639700018
0.1293990605 -0.0074498169 -0.0624747558
0.1221908627 -0.0074518549 -0.0303631841
0.1192786880 -0.0076708807 -0.0960815735
0.1221908627 -0.0074518549 -0.0303631841
0.1099224786 -0.0075644248 -0.0150550212
0.1048622924 -0.0076749566 -0.0318584300
0.1091583155 -0.0078919444 -0.1296883913
0.1235747111 -0.0078878684 -0.1939115348
0.1163665133 -0.0078899064 -0.1617999630
0.1149104260 -0.0079994193 -0.1946591578
0.1120704902 -0.0076729186 -0.0639700018
0.1034062050 -0.0077844695 -0.0647176248
0.1192786880 -0.0076708807 -0.0960815735
0.0872081963 -0.0104341673 -0.1315810098
0.0693259219 -0.0117315941 -0.0676561498
0.0924311454 -0.0090555810 -0.0656639340
0.0834900082 -0.0097042943 -0.0337015040
0.0782670591 -0.0110828807 -0.0996185798
0.0834900082 -0.0097042943 -0.0337015040
0.0745488710 -0.0103530077 -0.0017390740
0.0603847847 -0.0123803074 -0.0356937198
0.0641029727 -0.0131101804 -0.1335732256
0.0819852471 -0.0118127537 -0.1974980855
0.0730441099 -0.0124614671 -0.1655356556
0.0704326354 -0.0131507602 -0.1984941934
0.0693259219 -0.0117315941 -0.0676561498
0.0577733101 -0.0130696006 -0.0686522577
0.0782670591 -0.0110828807 -0.0996185798
0.0860528472 -0.0156521663 -0.1316774529
0.0687482474 -0.0143405936 -0.0677043714
0.0832009133 -0.0163605708 -0.0337222947
0.0600959474 -0.0136848072 -0.0357178306
0.0745486134 -0.0157047844 -0.0017357540
0.0918532133 -0.0170163572 -0.0657088355
0.0774005473 -0.0149963800 -0.0996909122
0.0832009133 -0.0163605708 -0.0337222947
0.1091578131 -0.0183279300 -0.1296819171
0.1033574471 -0.0169637391 -0.1956505345
0.0947051472 -0.0163079527 -0.1636639937
0.1149099301 -0.0183016209 -0.1946527666
0.0918532133 -0.0170163572 -0.0657088355
0.1034056962 -0.0183542390 -0.0647110676
0.1005055132 -0.0176721436 -0.0976953763
0.1256204313 -0.0185396700 -0.1282611277
0.1289655542 -0.0186829711 -0.0625051503
0.1116370053 -0.0184601090 -0.0640006729
0.1133095667 -0.0185317596 -0.0311226842
0.1272929927 -0.0186113206 -0.0953831390
0.1133095667 -0.0185317596 -0.0311226842
0.1228101219 -0.0186790159 -0.0139359285
0.1306381156 -0.0187546217 -0.0296271615
0.1429489802 -0.0187625321 -0.1267656051
0.1396038573 -0.0186192310 -0.1925215825
0.1412764187 -0.0186908816 -0.1596435938
0.1482681317 -0.0187306621 -0.1917738212
0.1289655542 -0.0186829711 -0.0625051503
0.1376298286 -0.0187944022 -0.0617573890
0.1272929927 -0.0186113206 -0.0953831390
0.1484363538 -0.0186565881 -0.1262921332
0.1461500559 -0.0186299211 -0.0610222306
0.1542128942 -0.0185450790 -0.1257937108
0.1569565836 -0.0184391498 -0.1255570077
0.1625882997 -0.0179039312 -0.1250713477
0.1682200319 -0.0170342791 -0.1245858952
0.1738523482 -0.0148934960 -0.1241011861
0.1136691164 -0.0057189412 0.3827981466
0.1090482990 -0.0037053843 0.3823981313
0.1044274204 -0.0029628534 0.3819989045
0.0998065302 -0.0024594435 0.3815998261
0.0933083947 -0.0022738396 0.3810389474
0.0801124891 0.0003743198 0.4395462038
0.0970628511 -0.0023535439 0.3813629915
0.0765571200 -0.0023274646 0.3795934139
0.0604729405 0.0001879975 0.4378515069
0.0636947621 0.0016052384 0.4679524836
0.0717368518 0.0003475073 0.4388234371
0.0878210313 -0.0021679548 0.3805653441
0.0926412995 -0.0048429268 0.3213353209
0.0773688074 0.0004272622 0.4393094022
0.0450760255 -0.0044527468 0.3768780505
0.0297139373 -0.0027880079 0.4351989883
0.0370513492 -0.0000422741 0.4656542941
0.0220328932 -0.0019556385 0.4643594572
0.0257015991 -0.0005827716 0.4795871101
0.0447323932 -0.0008746436 0.4364938252
0.0373949814 -0.0036203773 0.4060385194
0.0370513492 -0.0000422741 0.4656542941
0.0600944814 -0.0025393824 0.3781728873
0.0604381137 -0.0061174856 0.3185571127
0.0527570696 -0.0052851162 0.3477175816
0.0679473417 -0.0051608034 0.3192045311
0.0447323932 -0.0008746436 0.4364938252
0.0522416212 0.0000820386 0.4371412436
0.0524134373 -0.0017070130 0.4073333562
0.0381441780 -0.0089081194 0.3762826427
0.0412662853 -0.0069288439 0.4361984951
0.0278090672 -0.0040260565 0.4648592106
0.0428273390 -0.0059392062 0.4661564213
0.0360987299 -0.0044878125 0.4804867791
0.0262480136 -0.0050156942 0.4349012844
0.0397052317 -0.0079184817 0.4062405689
0.0278090672 -0.0040260565 0.4648592106
0.0231259063 -0.0069949697 0.3749854320
0.0350220707 -0.0108873949 0.3163667902
0.0365831244 -0.0098977571 0.3463247165
0.0275129348 -0.0099308200 0.3157181849
0.0262480136 -0.0050156942 0.4349012844
0.0187388777 -0.0040591194 0.4342526790
0.0246869599 -0.0060053320 0.4049433582
0.0713579485 -0.0116094935 0.3791505433
0.0578731705 -0.0082795310 0.4376324455
0.0691370665 -0.0084389192 0.4386045735
0.0623946775 -0.0067739379 0.4678455245
0.0600940525 -0.0114501053 0.3781784153
0.0735788304 -0.0147800678 0.3196965132
0.0578731705 -0.0082795310 0.4376324455
0.0878205666 -0.0118212335 0.3805713327
0.0915750307 -0.0117414888 0.3808952779
0.0773683756 -0.0085447892 0.4393149682
0.0970624043 -0.0116355447 0.3813687498
0.1016833276 -0.0114498808 0.3817674008
0.1063042777 -0.0107073000 0.3821657063
0.1109252278 -0.0099647191 0.3825640118
0.1136691164 -0.0057189412 0.3827981466
0.1090482990 -0.0037053843 0.3823981313
0.1044274204 -0.0029628534 0.3819989045
0.0998065302 -0.0024594435 0.3815998261
0.0933083947 -0.0022738396 0.3810389474
0.1065043002 -0.0049219991 0.3225316910
0.0878210313 -0.0021679548 0.3805653441
0.0765571200 -0.0023274646 0.3795934139
0.0926412995 -0.0048429268 0.3213353209
0.0842207507 -0.0063125756 0.2907857479
0.1006833892 -0.0061006578 0.2922062744
0.0964731148 -0.0068354822 0.2769314879
0.0761786609 -0.0050548445 0.3199147944
0.0845992098 -0.0035851957 0.3504643674
0.0842207507 -0.0063125756 0.2907857479
0.0600944814 -0.0025393824 0.3781728873
0.0604729405 0.0001879975 0.4378515069
0.0685150303 -0.0010697336 0.4087224604
0.0522416212 0.0000820386 0.4371412436
0.0761786609 -0.0050548445 0.3199147944
0.0679473417 -0.0051608034 0.3192045311
0.0681365712 -0.0037971135 0.3490438409
0.0450760255 -0.0044527468 0.3768780505
0.0384879945 -0.0086597085 0.3166644941
0.0604381137 -0.0061174856 0.3185571127
0.0571440982 -0.0082209665 0.2884503345
0.0417820100 -0.0065562277 0.3467712723
0.0571440982 -0.0082209665 0.2884503345
0.0538500826 -0.0103244474 0.2583435563
0.0351939789 -0.0107631894 0.2865577160
0.0231259063 -0.0069949697 0.3749854320
0.0297139373 -0.0027880079 0.4351989883
0.0264199218 -0.0048914888 0.4050922101
0.0187388777 -0.0040591194 0.4342526790
0.0384879945 -0.0086597085 0.3166644941
0.0275129348 -0.0099308200 0.3157181849
0.0417820100 -0.0065562277 0.3467712723
0.0381441780 -0.0089081194 0.3762826427
0.0569719452 -0.0134293808 0.3182625629
0.0350220707 -0.0108873949 0.3163667902
0.0444359543 -0.0131480255 0.2873567503
0.0475580616 -0.0111687501 0.3472726028
0.0444359543 -0.0131480255 0.2873567503
0.0538498379 -0.0154086562 0.2583467104
0.0663858288 -0.0156900115 0.2892525230
0.0600940525 -0.0114501053 0.3781784153
0.0412662853 -0.0069288439 0.4361984951
0.0506801689 -0.0091894746 0.4071884552
0.0522412226 -0.0081998369 0.4371463814
0.0569719452 -0.0134293808 0.3182625629
0.0679468825 -0.0147003737 0.3192104492
0.0475580616 -0.0111687501 0.3472726028
0.0878205666 -0.0118212335 0.3805713327
0.0713579485 -0.0116094935 0.3791505433
0.0818101395 -0.0148859379 0.3204069079
0.0848153531 -0.0133535857 0.3504891203
0.0735788304 -0.0147800678 0.3196965132
0.0773683756 -0.0085447892 0.4393149682
0.0691370665 -0.0084389192 0.4386045735
0.0743631620 -0.0100771414 0.4092327558
0.0818101395 -0.0148859379 0.3204069079
0.0952675441 -0.0166300300 0.2917454848
0.0788049260 -0.0164182900 0.2903246955
0.0855336283 -0.0172903361 0.2759939839
0.0982727577 -0.0150976779 0.3218276973
0.0848153531 -0.0133535857 0.3504891203
0.0952675441 -0.0166300300 0.2917454848
0.0970624043 -0.0116355447 0.3813687498
0.0915750307 -0.0117414888 0.3808952779
0.1083810501 -0.0148988894 0.3226998777
0.1016833276 -0.0114498808 0.3817674008
0.1063042777 -0.0107073000 0.3821657063
0.1109252278 -0.0099647191 0.3825640118
0.1155462851 -0.0069944707 0.3829609353
0.1789686525 -0.0061915154 -0.3738948660
0.1743478351 -0.0041779586 -0.3742948813
0.1697269564 -0.0034354276 -0.3746941081
0.1651060663 -0.0029320178 -0.3750931866
0.1586079308 -0.0027464139 -0.3756540652
0.1556306260 -0.0001722067 -0.4355602655
0.1623623872 -0.0028261181 -0.3753300211
0.1418566561 -0.0028000389 -0.3770995987
0.1359910773 -0.0003585290 -0.4372549625
0.1443221993 0.0010217358 -0.4663607142
0.1472549886 -0.0001990192 -0.4362830323
0.1531205674 -0.0026405290 -0.3761276685
0.1477222348 -0.0052415487 -0.3169442349
0.1528869443 -0.0001192642 -0.4357970672
0.1103755616 -0.0049253210 -0.3798149621
0.1052320741 -0.0033345344 -0.4399074811
0.1176787864 -0.0006257768 -0.4686589037
0.1026603304 -0.0025391411 -0.4699537405
0.1088836865 -0.0011847623 -0.4843294518
0.1202505301 -0.0014211701 -0.4386126442
0.1078038178 -0.0041299277 -0.4098612216
0.1176787864 -0.0006257768 -0.4686589037
0.1253940175 -0.0030119567 -0.3785201253
0.1155190490 -0.0065161076 -0.3197224432
0.1129473053 -0.0057207143 -0.3497687027
0.1230282770 -0.0055594254 -0.3190750248
0.1202505301 -0.0014211701 -0.4386126442
0.1277597581 -0.0004644879 -0.4379652258
0.1228222738 -0.0022165634 -0.4085663847
0.1034437141 -0.0093806936 -0.3804103699
0.1167844222 -0.0074753704 -0.4389079743
0.1084365044 -0.0046095591 -0.4694539871
0.1234547762 -0.0065227088 -0.4681567764
0.1192808173 -0.0050898031 -0.4834297828
0.1017661504 -0.0055622207 -0.4402051850
0.1101140681 -0.0084280320 -0.4096591721
0.1084365044 -0.0046095591 -0.4694539871
0.0884254423 -0.0074675439 -0.3817075807
0.0901030060 -0.0112860168 -0.3219127656
0.0967733601 -0.0103333552 -0.3511615678
0.0825938702 -0.0103294420 -0.3225613710
0.1017661504 -0.0055622207 -0.4402051850
0.0942570145 -0.0046056459 -0.4408537903
0.0950957964 -0.0065148823 -0.4109563828
0.1366574845 -0.0120820678 -0.3775424693
0.1333913074 -0.0088260575 -0.4374740239
0.1446552033 -0.0089854457 -0.4365018959
0.1430221147 -0.0073574405 -0.4664676732
0.1253935886 -0.0119226796 -0.3785145973
0.1286597657 -0.0151786898 -0.3185830427
0.1333913074 -0.0088260575 -0.4374740239
0.1531201027 -0.0122938078 -0.3761216799
0.1568745668 -0.0122140630 -0.3757977347
0.1528865124 -0.0090913157 -0.4357915012
0.1623619404 -0.0121081189 -0.3753242628
0.1669828637 -0.0119224550 -0.3749256118
0.1716038138 -0.0111798742 -0.3745273063
0.1762247639 -0.0104372934 -0.3741290008
0.1789686525 -0.0061915154 -0.3738948660
0.1743478351 -0.0041779586 -0.3742948813
0.1697269564 -0.0034354276 -0.3746941081
0.1651060663 -0.0029320178 -0.3750931866
0.1586079308 -0.0027464139 -0.3756540652
0.1615852356 -0.0053206211 -0.3157478649
0.1531205674 -0.0026405290 -0.3761276685
0.1418566561 -0.0028000389 -0.3770995987
0.1477222348 -0.0052415487 -0.3169442349
0.1341923856 -0.0066742215 -0.2882870796
0.1506550242 -0.0064623037 -0.2868665531
0.1438900996 -0.0071786401 -0.2725379754
0.1312595963 -0.0054534665 -0.3183647615
0.1447894455 -0.0040207938 -0.3470219168
0.1341923856 -0.0066742215 -0.2882870796
0.1253940175 -0.0030119567 -0.3785201253
0.1359910773 -0.0003585290 -0.4372549625
0.1389238667 -0.0015792839 -0.4071772806
0.1277597581 -0.0004644879 -0.4379652258
0.1312595963 -0.0054534665 -0.3183647615
0.1230282770 -0.0055594254 -0.3190750248
0.1283268069 -0.0042327116 -0.3484424434
0.1103755616 -0.0049253210 -0.3798149621
0.0935689298 -0.0090583305 -0.3216150617
0.1155190490 -0.0065161076 -0.3197224432
0.1071157331 -0.0085826124 -0.2906224930
0.1019722457 -0.0069918258 -0.3507150119
0.1071157331 -0.0085826124 -0.2906224930
0.0987124172 -0.0106491171 -0.2615225428
0.0851656139 -0.0111248353 -0.2925151115
0.0884254423 -0.0074675439 -0.3817075807
0.1052320741 -0.0033345344 -0.4399074811
0.0968287582 -0.0054010392 -0.4108075309
0.0942570145 -0.0046056459 -0.4408537903
0.0935689298 -0.0090583305 -0.3216150617
0.0825938702 -0.0103294420 -0.3225613710
0.1019722457 -0.0069918258 -0.3507150119
0.1034437141 -0.0093806936 -0.3804103699
0.1120528805 -0.0138280028 -0.3200169930
0.0901030060 -0.0112860168 -0.3219127656
0.0944075893 -0.0135096714 -0.2917160772
0.1077482973 -0.0116043482 -0.3502136815
0.0944075893 -0.0135096714 -0.2917160772
0.0987121725 -0.0157333260 -0.2615193887
0.1163574637 -0.0160516573 -0.2898203045
0.1253935886 -0.0119226796 -0.3785145973
0.1167844222 -0.0074753704 -0.4389079743
0.1210890054 -0.0096990250 -0.4087112858
0.1277593594 -0.0087463634 -0.4379600879
0.1120528805 -0.0138280028 -0.3200169930
0.1230278178 -0.0150989957 -0.3190691067
0.1077482973 -0.0116043482 -0.3502136815
0.1531201027 -0.0122938078 -0.3761216799
0.1366574845 -0.0120820678 -0.3775424693
0.1368910748 -0.0152845599 -0.3178726480
0.1450055888 -0.0137891838 -0.3469971639
0.1286597657 -0.0151786898 -0.3185830427
0.1528865124 -0.0090913157 -0.4357915012
0.1446552033 -0.0089854457 -0.4365018959
0.1447719985 -0.0105866917 -0.4066669852
0.1368910748 -0.0152845599 -0.3178726480
0.1452391791 -0.0169916759 -0.2873273426
0.1287765609 -0.0167799359 -0.2887481320
0.1329506130 -0.0176334939 -0.2734754794
0.1533536930 -0.0154962999 -0.3164518586
0.1450055888 -0.0137891838 -0.3469971639
0.1452391791 -0.0169916759 -0.2873273426
0.1623619404 -0.0121081189 -0.3753242628
0.1568745668 -0.0122140630 -0.3757977347
0.1634619854 -0.0152975114 -0.3155796781
0.1669828637 -0.0119224550 -0.3749256118
0.1716038138 -0.0111798742 -0.3745273063
0.1762247639 -0.0104372934 -0.3741290008
0.1808458212 -0.0074670450 -0.3737320773
-0.2446232508 0.0446048074 0.0317857648
-0.2531610722 0.0444481525 0.0616002933
-0.2368251593 0.0446951235 0.0324586520
-0.2645517531 0.0434106691 0.0300667616
-0.2735228250 0.0427672148 0.0598442065
-0.2541542515 0.0444945377 0.0309633469
-0.2668625877 0.0410021262 0.0298688502
-0.2746782423 0.0415629434 0.0597452508
-0.2772599850 0.0420858825 0.0289709202
-0.2463564006 0.0395872450 0.0316393346
-0.2540277514 0.0397717464 0.0615284230
-0.2541544833 0.0396774768 0.0309663353
-0.2446232508 0.0446048074 0.0317857648
-0.2360854293 0.0447614623 0.0019712362
-0.2541542515 0.0444945377 0.0309633469
-0.2645517531 0.0434106691 0.0300667616
-0.2682889131 0.0427293369 -0.0008065247
-0.2772599850 0.0420858825 0.0289709202
-0.2668625877 0.0410021262 0.0298688502
-0.2567362260 0.0402004160 0.0001920047
-0.2541544833 0.0396774768 0.0309663353
-0.2463564006 0.0395872450 0.0316393346
-0.2369521424 0.0393828087 0.0018998015
-0.2368254105 0.0394770782 0.0324618891
-0.2341554269 0.0445290515 -0.0895156976
-0.2374593363 0.0443345187 -0.1203519001
-0.2263573354 0.0446193676 -0.0888428103
-0.2540839292 0.0433349133 -0.0912347007
-0.2578210892 0.0426535810 -0.1221079870
-0.2436864275 0.0444187819 -0.0903381154
-0.2563947638 0.0409263703 -0.0914326121
-0.2589765065 0.0414493095 -0.1222069427
-0.2667921611 0.0420101267 -0.0923305421
-0.2358885766 0.0395114891 -0.0896621278
-0.2383260156 0.0396581126 -0.1204237705
-0.2436866594 0.0396017210 -0.0903351270
-0.2341554269 0.0445290515 -0.0895156976
-0.2308515174 0.0447235843 -0.0586794950
-0.2436864275 0.0444187819 -0.0903381154
-0.2540839292 0.0433349133 -0.0912347007
-0.2630550011 0.0426914589 -0.0614572558
-0.2667921611 0.0420101267 -0.0923305421
-0.2563947638 0.0409263703 -0.0914326121
-0.2515023141 0.0401625381 -0.0604587264
-0.2436866594 0.0396017210 -0.0903351270
-0.2358885766 0.0395114891 -0.0896621278
-0.2317182304 0.0393449307 -0.0587509297
-0.2263575866 0.0394013223 -0.0888395732
0.1079765527 -0.0272022737 0.0155056135
0.1088131485 -0.0190668206 0.0058106061
0.1096512959 -0.0190079100 -0.0039018759
0.1104285970 -0.0277670692 -0.0129087170
0.1104344019 -0.0365404842 -0.0129754351
0.1095978060 -0.0446759373 -0.0032804277
0.1087596586 -0.0447348479 0.0064320543
0.1079823575 -0.0359756888 0.0154388954
-0.0880109763 -0.0347653572 -0.0061501086
-0.0863827919 -0.0301169027 -0.0250178514
-0.0863746356 -0.0369137016 -0.0251119411
-0.0879941887 -0.0394256639 -0.0063443528
0.1079765527 -0.0272022737 0.0155056135
0.1088131485 -0.0190668206 0.0058106061
0.1096512959 -0.0190079100 -0.0039018759
0.1104285970 -0.0277670692 -0.0129087170
0.1104344019 -0.0365404842 -0.0129754351
0.1095978060 -0.0446759373 -0.0032804277
0.1087596586 -0.0447348479 0.0064320543
0.1079823575 -0.0359756888 0.0154388954
-0.0879851087 -0.0279688570 -0.0064502894
-0.0880023450 -0.0326289700 -0.0062502630
-0.0188770282 -0.0252556648 0.0019353041
-0.0876332098 -0.0248003196 -0.0105283029
-0.0180949207 -0.0218135142 -0.0071279980
-0.0871880019 -0.0246252504 -0.0156873964
-0.0866252690 -0.0249619721 -0.0222083411
-0.0870704597 -0.0247804591 -0.0170494688
-0.0175909503 -0.0218943405 -0.0129680171
-0.0863827919 -0.0301169027 -0.0250178514
-0.0168637329 -0.0263384599 -0.0213947570
-0.0863660042 -0.0347772619 -0.0252120956
-0.0863746356 -0.0369137016 -0.0251119411
-0.0168428671 -0.0343972186 -0.0216360461
-0.0863918719 -0.0415737621 -0.0249119148
-0.0867437708 -0.0447423520 -0.0208339013
-0.0176508291 -0.0448294861 -0.0122727045
-0.0871889787 -0.0449173687 -0.0156748078
-0.0877517115 -0.0445806470 -0.0091538631
-0.0873065208 -0.0447621075 -0.0143127354
-0.0181547995 -0.0447486336 -0.0064326854
-0.0880109763 -0.0347653572 -0.0061501086
-0.0879941887 -0.0394256639 -0.0063443528
-0.0188904107 -0.0379743346 0.0020911767
-0.2276433715 -0.0002729437 -0.0233671365
-0.2560726642 -0.0002742789 -0.0277253752
-0.2669373469 0.0214662802 -0.0299521758
-0.2440872467 -0.0002731645 -0.0249990030
-0.2655288247 -0.0002769624 -0.0327847718
-0.2716654271 0.0214649384 -0.0324818740
-0.2778041226 -0.0002759790 -0.0321520008
-0.2433602894 -0.0002784255 -0.0334230062
-0.2130609515 -0.0002728434 -0.0220739641
-0.2276433715 -0.0002729437 -0.0233671365
-0.2145494601 -0.0220139496 -0.0216875888
-0.2440872467 -0.0002731645 -0.0249990030
-0.2560726642 -0.0002742789 -0.0277253752
-0.2669394400 -0.0220165381 -0.0299252003
-0.2452079816 -0.0220148380 -0.0254985747
-0.2560747573 -0.0437570971 -0.0276983997
-0.2778041226 -0.0002759790 -0.0321520008
-0.2669373469 0.0214662802 -0.0299521758
-0.2669394400 -0.0220165381 -0.0299252003
-0.2655288247 -0.0002769624 -0.0327847718
-0.2494989849 -0.0220193429 -0.0330931330
-0.2716675202 -0.0220178798 -0.0324548985
-0.2556376805 -0.0437602603 -0.0327632597
-0.2433602894 -0.0002784255 -0.0334230062
-0.2593901291 0.0214639550 -0.0331146450
-0.2494989849 -0.0220193429 -0.0330931330
-0.2177703533 -0.0002785070 -0.0315687078
-0.2342506891 -0.0002784639 -0.0327780669
-0.2091394135 -0.0220201582 -0.0312757418
-0.2092647729 -0.0002783512 -0.0306577062
0.1496385595 -0.0437564895 0.0047617227
0.1506853599 -0.0437640652 -0.0073686327
0.1722202540 -0.0437525769 0.0128207762
0.1496385595 -0.0437564895 0.0047617227
0.1485917590 -0.0437489138 0.0168920781
0.1270568650 -0.0437604021 -0.0032973309
0.1506857088 -0.0365169026 -0.0073731287
0.1506857088 -0.0365169026 -0.0073731287
0.1485921079 -0.0365017512 0.0168875821
0.1485921079 -0.0365017512 0.0168875821
0.1496392572 -0.0292621643 0.0047527308
0.1732677521 -0.0292658274 0.0006814289
0.1506860576 -0.0292697400 -0.0073776246
0.1496392572 -0.0292621643 0.0047527308
0.1260107622 -0.0292585012 0.0088240327
0.1485924567 -0.0292545886 0.0168830862
3 373 415 218
3 17 415 373
3 218 416 33
3 174 416 218
3 33 417 312
3 75 417 33
3 312 418 126
3 266 418 312
3 126 420 231
3 419 420 126
3 419 421 29
3 126 421 419
3 424 425 256
3 423 425 424
3 231 426 256
3 424 426 231
3 427 428 423
3 422 428 427
3 427 429 231
3 423 429 427
3 430 432 422
3 431 432 430
3 431 433 118
3 430 433 431
3 434 435 430
3 231 435 434
3 422 436 430
3 434 436 422
3 439 440 438
3 366 440 439
3 439 441 437
3 438 441 439
3 442 443 256
3 366 443 442
3 442 444 438
3 256 444 442
3 437 447 446
3 445 447 437
3 446 448 77
3 445 448 446
3 449 450 445
3 256 450 449
3 445 451 449
3 437 451 445
3 454 455 255
3 453 455 454
3 454 456 366
3 255 456 454
3 457 458 453
3 452 458 457
3 457 459 366
3 453 459 457
3 460 462 452
3 461 462 460
3 461 463 165
3 460 463 461
3 464 465 460
3 366 465 464
3 452 466 460
3 464 466 452
3 469 470 230
3 468 470 469
3 255 471 230
3 469 471 255
3 472 473 468
3 467 473 472
3 472 474 255
3 468 474 472
3 475 477 467
3 476 477 475
3 476 478 76
3 475 478 476
3 479 480 475
3 255 480 479
3 467 481 475
3 479 481 467
3 125 483 482
3 230 483 125
3 482 484 117
3 230 484 482
3 125 485 311
3 28 485 125
3 311 486 32
3 265 486 311
3 32 487 219
3 74 487 32
3 219 488 373
3 173 488 219
3 174 489 17
3 218 489 174
3 75 490 174
3 33 490 75
3 266 491 75
3 312 491 266
3 29 492 266
3 126 492 29
3 118 494 29
3 493 494 118
3 493 495 231
3 118 495 493
3 498 499 497
3 118 499 498
3 498 500 496
3 497 500 498
3 118 502 501
3 77 502 118
3 501 503 497
3 77 503 501
3 496 506 505
3 504 506 496
3 505 507 256
3 504 507 505
3 508 509 504
3 77 509 508
3 504 510 508
3 496 510 504
3 513 514 512
3 77 514 513
3 513 515 511
3 512 515 513
3 516 517 165
3 77 517 516
3 516 518 512
3 165 518 516
3 511 521 520
3 519 521 511
3 520 522 366
3 519 522 520
3 523 524 519
3 165 524 523
3 519 525 523
3 511 525 519
3 528 529 165
3 527 529 528
3 528 530 76
3 165 530 528
3 531 532 527
3 526 532 531
3 531 533 76
3 527 533 531
3 534 536 526
3 535 536 534
3 535 537 255
3 534 537 535
3 538 539 534
3 76 539 538
3 526 540 534
3 538 540 526
3 543 544 542
3 76 544 543
3 543 545 541
3 542 545 543
3 76 547 546
3 117 547 76
3 546 548 542
3 117 548 546
3 541 551 550
3 549 551 541
3 550 552 230
3 549 552 550
3 553 554 549
3 117 554 553
3 549 555 553
3 541 555 549
3 117 557 556
3 28 557 117
3 556 558 125
3 28 558 556
3 265 559 28
3 311 559 265
3 74 560 265
3 32 560 74
3 173 561 74
3 219 561 173
3 17 562 173
3 373 562 17
3 374 563 220
3 17 563 374
3 220 564 35
3 174 564 220
3 35 565 314
3 75 565 35
3 314 566 128
3 266 566 314
3 128 568 233
3 567 568 128
3 567 569 29
3 128 569 567
3 572 573 258
3 571 573 572
3 233 574 258
3 572 574 233
3 575 576 571
3 570 576 575
3 575 577 233
3 571 577 575
3 578 580 570
3 579 580 578
3 579 581 118
3 578 581 579
3 582 583 578
3 233 583 582
3 570 584 578
3 582 584 570
3 587 588 586
3 367 588 587
3 587 589 585
3 586 589 587
3 590 591 258
3 367 591 590
3 590 592 586
3 258 592 590
3 585 595 594
3 593 595 585
3 594 596 77
3 593 596 594
3 597 598 593
3 258 598 597
3 593 599 597
3 585 599 593
3 602 603 257
3 601 603 602
3 602 604 367
3 257 604 602
3 605 606 601
3 600 606 605
3 605 607 367
3 601 607 605
3 608 610 600
3 609 610 608
3 609 611 165
3 608 611 609
3 612 613 608
3 367 613 612
3 600 614 608
3 612 614 600
3 617 618 232
3 616 618 617
3 257 619 232
3 617 619 257
3 620 621 616
3 615 621 620
3 620 622 257
3 616 622 620
3 623 625 615
3 624 625 623
3 624 626 76
3 623 626 624
3 627 628 623
3 257 628 627
3 615 629 623
3 627 629 615
3 127 631 630
3 232 631 127
3 630 632 117
3 232 632 630
3 127 633 313
3 28 633 127
3 313 634 34
3 265 634 313
3 34 635 221
3 74 635 34
3 221 636 374
3 173 636 221
3 174 637 17
3 220 637 174
3 75 638 174
3 35 638 75
3 266 639 75
3 314 639 266
3 29 640 266
3 128 640 29
3 118 642 29
3 641 642 118
3 641 643 233
3 118 643 641
3 646 647 645
3 118 647 646
3 646 648 644
3 645 648 646
3 118 650 649
3 77 650 118
3 649 651 645
3 77 651 649
3 644 654 653
3 652 654 644
3 653 655 258
3 652 655 653
3 656 657 652
3 77 657 656
3 652 658 656
3 644 658 652
3 661 662 660
3 77 662 661
3 661 663 659
3 660 663 661
3 664 665 165
3 77 665 664
3 664 666 660
3 165 666 664
3 659 669 668
3 667 669 659
3 668 670 367
3 667 670 668
3 671 672 667
3 165 672 671
3 667 673 671
3 659 673 667
3 676 677 165
3 675 677 676
3 676 678 76
3 165 678 676
3 679 680 675
3 674 680 679
3 679 681 76
3 675 681 679
3 682 684 674
3 683 684 682
3 683 685 257
3 682 685 683
3 686 687 682
3 76 687 686
3 674 688 682
3 686 688 674
3 691 692 690
3 76 692 691
3 691 693 689
3 690 693 691
3 76 695 694
3 117 695 76
3 694 696 690
3 117 696 694
3 689 699 698
3 697 699 689
3 698 700 232
3 697 700 698
3 701 702 697
3 117 702 701
3 697 703 701
3 689 703 697
3 117 705 704
3 28 705 117
3 704 706 127
3 28 706 704
3 265 707 28
3 313 707 265
3 74 708 265
3 34 708 74
3 173 709 74
3 221 709 173
3 17 710 173
3 374 710 17
3 116 711 261
3 373 711 116
3 261 712 5
3 218 712 261
3 5 713 121
3 33 713 5
3 121 714 283
3 312 714 121
3 283 716 146
3 715 716 283
3 715 717 126
3 283 717 715
3 349 720 719
3 146 720 349
3 719 721 718
3 146 721 719
3 722 723 718
3 231 723 722
3 718 724 722
3 146 724 718
3 727 728 413
3 726 728 727
3 349 729 413
3 727 729 349
3 730 731 726
3 725 731 730
3 730 732 349
3 726 732 730
3 733 735 725
3 734 735 733
3 734 736 256
3 733 736 734
3 737 738 733
3 349 738 737
3 725 739 733
3 737 739 725
3 742 743 350
3 741 743 742
3 413 744 350
3 742 744 413
3 745 746 741
3 740 746 745
3 745 747 413
3 741 747 745
3 748 750 740
3 749 750 748
3 749 751 366
3 748 751 749
3 752 753 748
3 413 753 752
3 740 754 748
3 752 754 740
3 756 757 145
3 755 757 756
3 350 758 145
3 756 758 350
3 759 760 755
3 255 760 759
3 759 761 350
3 755 761 759
3 762 763 284
3 230 763 762
3 284 764 762
3 145 764 284
3 122 765 125
3 284 765 122
3 4 766 311
3 122 766 4
3 262 767 32
3 4 767 262
3 116 768 219
3 262 768 116
3 218 769 373
3 261 769 218
3 33 770 218
3 5 770 33
3 312 771 33
3 121 771 312
3 126 772 312
3 283 772 126
3 231 774 126
3 773 774 231
3 773 775 146
3 231 775 773
3 778 779 231
3 777 779 778
3 256 780 231
3 778 780 256
3 781 782 777
3 776 782 781
3 781 783 256
3 777 783 781
3 784 786 776
3 785 786 784
3 785 787 349
3 784 787 785
3 788 789 784
3 256 789 788
3 776 790 784
3 788 790 776
3 793 794 792
3 256 794 793
3 793 795 791
3 792 795 793
3 796 797 366
3 256 797 796
3 796 798 792
3 366 798 796
3 791 801 800
3 799 801 791
3 800 802 413
3 799 802 800
3 803 804 799
3 366 804 803
3 799 805 803
3 791 805 799
3 808 809 807
3 366 809 808
3 808 810 806
3 807 810 808
3 811 812 255
3 366 812 811
3 811 813 807
3 255 813 811
3 806 816 815
3 814 816 806
3 815 817 350
3 814 817 815
3 818 819 814
3 255 819 818
3 814 820 818
3 806 820 814
3 822 824 821
3 823 824 822
3 823 825 255
3 822 825 823
3 826 827 822
3 145 827 826
3 821 828 822
3 826 828 821
3 830 831 255
3 829 831 830
3 230 832 255
3 830 832 230
3 833 834 829
3 821 834 833
3 833 835 230
3 829 835 833
3 836 837 230
3 284 837 836
3 230 838 836
3 125 838 230
3 125 839 122
3 311 839 125
3 311 840 4
3 32 840 311
3 32 841 262
3 219 841 32
3 219 842 116
3 373 842 219
3 119 843 263
3 374 843 119
3 263 844 7
3 220 844 263
3 7 845 123
3 35 845 7
3 123 846 285
3 314 846 123
3 285 848 148
3 847 848 285
3 847 849 128
3 285 849 847
3 351 852 851
3 148 852 351
3 851 853 850
3 148 853 851
3 854 855 850
3 233 855 854
3 850 856 854
3 148 856 850
3 859 860 414
3 858 860 859
3 351 861 414
3 859 861 351
3 862 863 858
3 857 863 862
3 862 864 351
3 858 864 862
3 865 867 857
3 866 867 865
3 866 868 258
3 865 868 866
3 869 870 865
3 351 870 869
3 857 871 865
3 869 871 857
3 874 875 352
3 873 875 874
3 414 876 352
3 874 876 414
3 877 878 873
3 872 878 877
3 877 879 414
3 873 879 877
3 880 882 872
3 881 882 880
3 881 883 367
3 880 883 881
3 884 885 880
3 414 885 884
3 872 886 880
3 884 886 872
3 888 889 147
3 887 889 888
3 352 890 147
3 888 890 352
3 891 892 887
3 257 892 891
3 891 893 352
3 887 893 891
3 894 895 286
3 232 895 894
3 286 896 894
3 147 896 286
3 124 897 127
3 286 897 124
3 6 898 313
3 124 898 6
3 264 899 34
3 6 899 264
3 119 900 221
3 264 900 119
3 220 901 374
3 263 901 220
3 35 902 220
3 7 902 35
3 314 903 35
3 123 903 314
3 128 904 314
3 285 904 128
3 233 906 128
3 905 906 233
3 905 907 148
3 233 907 905
3 910 911 233
3 909 911 910
3 258 912 233
3 910 912 258
3 913 914 909
3 908 914 913
3 913 915 258
3 909 915 913
3 916 918 908
3 917 918 916
3 917 919 351
3 916 919 917
3 920 921 916
3 258 921 920
3 908 922 916
3 920 922 908
3 925 926 924
3 258 926 925
3 925 927 923
3 924 927 925
3 928 929 367
3 258 929 928
3 928 930 924
3 367 930 928
3 923 933 932
3 931 933 923
3 932 934 414
3 931 934 932
3 935 936 931
3 367 936 935
3 931 937 935
3 923 937 931
3 940 941 939
3 367 941 940
3 940 942 938
3 939 942 940
3 943 944 257
3 367 944 943
3 943 945 939
3 257 945 943
3 938 948 947
3 946 948 938
3 947 949 352
3 946 949 947
3 950 951 946
3 257 951 950
3 946 952 950
3 938 952 946
3 954 956 953
3 955 956 954
3 955 957 257
3 954 957 955
3 958 959 954
3 147 959 958
3 953 960 954
3 958 960 953
3 962 963 257
3 961 963 962
3 232 964 257
3 962 964 232
3 965 966 961
3 953 966 965
3 965 967 232
3 961 967 965
3 968 969 232
3 286 969 968
3 232 970 968
3 127 970 232
3 127 971 124
3 313 971 127
3 313 972 6
3 34 972 313
3 34 973 264
3 221 973 34
3 221 974 119
3 374 974 221
3 27 0 371
3 322 292 0
3 30 339 292
3 353 205 339
3 222 110 205
3 110 976 287
3 975 976 110
3 975 977 252
3 110 977 975
3 287 979 368
3 978 979 287
3 978 980 216
3 287 980 978
3 288 982 981
3 368 982 288
3 981 983 369
3 368 983 981
3 111 985 984
3 288 985 111
3 984 986 217
3 288 986 984
3 253 204 111
3 223 340 204
3 354 291 340
3 31 1 291
3 321 371 1
3 27 322 0
3 322 30 292
3 30 353 339
3 353 222 205
3 222 252 110
3 216 988 252
3 987 988 216
3 987 989 287
3 216 989 987
3 216 991 990
3 369 991 216
3 990 992 368
3 369 992 990
3 369 994 993
3 217 994 369
3 993 995 288
3 217 995 993
3 217 997 996
3 253 997 217
3 996 998 111
3 253 998 996
3 253 223 204
3 223 354 340
3 354 31 291
3 31 321 1
3 321 27 371
3 27 2 372
3 322 294 2
3 30 341 294
3 353 207 341
3 222 112 207
3 112 1000 289
3 999 1000 112
3 999 1001 252
3 112 1001 999
3 289 1003 370
3 1002 1003 289
3 1002 1004 216
3 289 1004 1002
3 290 1006 1005
3 370 1006 290
3 1005 1007 369
3 370 1007 1005
3 113 1009 1008
3 290 1009 113
3 1008 1010 217
3 290 1010 1008
3 253 206 113
3 223 342 206
3 354 293 342
3 31 3 293
3 321 372 3
3 27 322 2
3 322 30 294
3 30 353 341
3 353 222 207
3 222 252 112
3 216 1012 252
3 1011 1012 216
3 1011 1013 289
3 216 1013 1011
3 216 1015 1014
3 369 1015 216
3 1014 1016 370
3 369 1016 1014
3 369 1018 1017
3 217 1018 369
3 1017 1019 290
3 217 1019 1017
3 217 1021 1020
3 253 1021 217
3 1020 1022 113
3 253 1022 1020
3 253 223 206
3 223 354 342
3 354 31 293
3 31 321 3
3 321 27 372
3 195 84 89
3 179 91 84
3 187 78 91
3 183 86 78
3 190 92 86
3 197 81 92
3 193 88 81
3 177 82 88
3 186 87 82
3 178 80 87
3 194 93 80
3 196 85 93
3 191 79 85
3 182 90 79
3 188 83 90
3 180 89 83
3 89 143 135
3 84 142 143
3 91 134 142
3 78 137 134
3 86 140 137
3 92 132 140
3 81 129 132
3 88 138 129
3 82 130 138
3 87 131 130
3 80 139 131
3 93 136 139
3 85 133 136
3 79 141 133
3 90 144 141
3 83 135 144
3 135 109 98
3 143 106 109
3 142 100 106
3 134 102 100
3 137 104 102
3 140 96 104
3 132 95 96
3 129 105 95
3 138 94 105
3 130 97 94
3 131 103 97
3 139 101 103
3 136 99 101
3 133 107 99
3 141 108 107
3 144 98 108
3 98 251 240
3 109 239 251
3 106 242 239
3 100 244 242
3 102 246 244
3 104 249 246
3 96 237 249
3 95 247 237
3 105 236 247
3 94 248 236
3 97 245 248
3 103 243 245
3 101 241 243
3 99 238 241
3 107 250 238
3 108 240 250
3 240 10 12
3 251 18 10
3 239 8 18
3 242 15 8
3 244 23 15
3 246 13 23
3 249 21 13
3 237 20 21
3 247 22 20
3 236 14 22
3 248 24 14
3 245 16 24
3 243 9 16
3 241 19 9
3 238 11 19
3 250 12 11
3 156 1023 171
3 12 1023 156
3 10 155 171
3 18 162 155
3 162 1024 163
3 8 1024 162
3 163 1025 167
3 15 1025 163
3 23 170 167
3 13 152 170
3 152 1026 168
3 21 1026 152
3 168 1027 153
3 20 1027 168
3 22 169 153
3 14 166 169
3 166 1028 164
3 24 1028 166
3 164 1029 161
3 16 1029 164
3 9 154 161
3 19 172 154
3 172 1030 156
3 11 1030 172
3 306 1031 156
3 304 1031 306
3 171 295 306
3 155 297 295
3 162 302 297
3 163 307 302
3 167 309 307
3 170 300 309
3 300 1032 301
3 152 1032 300
3 301 1033 299
3 168 1033 301
3 153 310 299
3 169 308 310
3 166 303 308
3 164 298 303
3 161 296 298
3 154 305 296
3 305 1034 304
3 172 1034 305
3 195 179 84
3 179 187 91
3 187 183 78
3 183 190 86
3 190 197 92
3 197 193 81
3 193 177 88
3 177 186 82
3 186 178 87
3 178 194 80
3 194 196 93
3 196 191 85
3 191 182 79
3 182 188 90
3 188 180 83
3 180 195 89
3 89 84 143
3 84 91 142
3 91 78 134
3 78 86 137
3 86 92 140
3 92 81 132
3 81 88 129
3 88 82 138
3 82 87 130
3 87 80 131
3 80 93 139
3 93 85 136
3 85 79 133
3 79 90 141
3 90 83 144
3 83 89 135
3 135 143 109
3 143 142 106
3 142 134 100
3 134 137 102
3 137 140 104
3 140 132 96
3 132 129 95
3 129 138 105
3 138 130 94
3 130 131 97
3 131 139 103
3 139 136 101
3 136 133 99
3 133 141 107
3 141 144 108
3 144 135 98
3 98 109 251
3 109 106 239
3 106 100 242
3 100 102 244
3 102 104 246
3 104 96 249
3 96 95 237
3 95 105 247
3 105 94 236
3 94 97 248
3 97 103 245
3 103 101 243
3 101 99 241
3 99 107 238
3 107 108 250
3 108 98 240
3 240 251 10
3 251 239 18
3 239 242 8
3 242 244 15
3 244 246 23
3 246 249 13
3 249 237 21
3 237 247 20
3 247 236 22
3 236 248 14
3 248 245 24
3 245 243 16
3 243 241 9
3 241 238 19
3 238 250 11
3 250 240 12
3 10 1035 12
3 171 1035 10
3 10 18 155
3 18 8 162
3 15 1036 8
3 163 1036 15
3 23 1037 15
3 167 1037 23
3 23 13 170
3 13 21 152
3 20 1038 21
3 168 1038 20
3 22 1039 20
3 153 1039 22
3 22 14 169
3 14 24 166
3 16 1040 24
3 164 1040 16
3 9 1041 16
3 161 1041 9
3 9 19 154
3 19 11 172
3 12 1042 11
3 156 1042 12
3 1043 1044 156
3 306 1044 1043
3 156 1045 1043
3 171 1045 156
3 171 155 295
3 155 162 297
3 162 1047 1046
3 163 1047 162
3 1046 1048 302
3 163 1048 1046
3 1049 1050 163
3 307 1050 1049
3 167 1051 163
3 1049 1051 167
3 167 170 309
3 170 152 300
3 168 1053 152
3 1052 1053 168
3 1052 1054 301
3 168 1054 1052
3 153 1056 168
3 1055 1056 153
3 1055 1057 299
3 153 1057 1055
3 153 169 310
3 169 166 308
3 166 1059 1058
3 164 1059 166
3 1058 1060 303
3 164 1060 1058
3 1061 1062 164
3 298 1062 1061
3 161 1063 164
3 1061 1063 161
3 161 154 296
3 154 172 305
3 1064 1065 172
3 304 1065 1064
3 156 1066 172
3 1064 1066 156
3 254 272 269
3 254 271 272
3 254 281 271
3 254 274 281
3 254 267 274
3 254 279 267
3 254 276 279
3 254 280 276
3 254 277 280
3 254 278 277
3 254 268 278
3 254 275 268
3 254 282 275
3 254 270 282
3 254 273 270
3 254 269 273
3 269 402 403
3 272 411 402
3 271 409 411
3 281 404 409
3 274 399 404
3 267 397 399
3 279 408 397
3 276 406 408
3 280 407 406
3 277 398 407
3 278 400 398
3 268 405 400
3 275 410 405
3 282 412 410
3 270 401 412
3 273 403 401
3 403 56 52
3 402 61 56
3 411 65 61
3 409 59 65
3 404 53 59
3 399 57 53
3 397 64 57
3 408 67 64
3 406 63 67
3 407 58 63
3 398 54 58
3 400 60 54
3 405 66 60
3 410 62 66
3 412 55 62
3 401 52 55
3 52 49 40
3 56 46 49
3 61 51 46
3 65 43 51
3 59 37 43
3 53 42 37
3 57 39 42
3 64 47 39
3 67 38 47
3 63 41 38
3 58 36 41
3 54 44 36
3 60 50 44
3 66 45 50
3 62 48 45
3 55 40 48
3 40 380 381
3 49 387 380
3 46 375 387
3 51 383 375
3 43 389 383
3 37 377 389
3 42 386 377
3 39 384 386
3 47 385 384
3 38 378 385
3 41 390 378
3 36 382 390
3 44 376 382
3 50 388 376
3 45 379 388
3 48 381 379
3 381 324 336
3 380 334 324
3 387 332 334
3 375 330 332
3 383 327 330
3 389 325 327
3 377 338 325
3 386 331 338
3 384 337 331
3 385 326 337
3 378 328 326
3 390 329 328
3 382 333 329
3 376 335 333
3 388 323 335
3 379 336 323
3 336 179 195
3 324 187 179
3 334 183 187
3 332 190 183
3 330 197 190
3 327 193 197
3 325 177 193
3 338 186 177
3 331 178 186
3 337 194 178
3 326 196 194
3 328 191 196
3 329 182 191
3 333 188 182
3 335 180 188
3 323 195 180
3 269 272 402
3 272 271 411
3 271 281 409
3 281 274 404
3 274 267 399
3 267 279 397
3 279 276 408
3 276 280 406
3 280 277 407
3 277 278 398
3 278 268 400
3 268 275 405
3 275 282 410
3 282 270 412
3 270 273 401
3 273 269 403
3 403 402 56
3 402 411 61
3 411 409 65
3 409 404 59
3 404 399 53
3 399 397 57
3 397 408 64
3 408 406 67
3 406 407 63
3 407 398 58
3 398 400 54
3 400 405 60
3 405 410 66
3 410 412 62
3 412 401 55
3 401 403 52
3 52 56 49
3 56 61 46
3 61 65 51
3 65 59 43
3 59 53 37
3 53 57 42
3 57 64 39
3 64 67 47
3 67 63 38
3 63 58 41
3 58 54 36
3 54 60 44
3 60 66 50
3 66 62 45
3 62 55 48
3 55 52 40
3 40 49 380
3 49 46 387
3 46 51 375
3 51 43 383
3 43 37 389
3 37 42 377
3 42 39 386
3 39 47 384
3 47 38 385
3 38 41 378
3 41 36 390
3 36 44 382
3 44 50 376
3 50 45 388
3 45 48 379
3 48 40 381
3 381 380 324
3 380 387 334
3 387 375 332
3 375 383 330
3 383 389 327
3 389 377 325
3 377 386 338
3 386 384 331
3 384 385 337
3 385 378 326
3 378 390 328
3 390 382 329
3 382 376 333
3 376 388 335
3 388 379 323
3 379 381 336
3 336 324 179
3 324 334 187
3 334 332 183
3 332 330 190
3 330 327 197
3 327 325 193
3 325 338 177
3 338 331 186
3 331 337 178
3 337 326 194
3 326 328 196
3 328 329 191
3 329 333 182
3 333 335 188
3 335 323 180
3 323 336 195
3 189 362 358
3 200 361 362
3 199 357 361
3 185 355 357
3 181 356 355
3 184 360 356
3 198 363 360
3 201 359 363
3 189 200 362
3 200 199 361
3 199 185 357
3 185 181 355
3 181 184 356
3 184 198 360
3 198 201 363
3 201 192 359
3 120 348 151
3 392 259 348
3 228 175 259
3 72 365 175
3 319 203 365
3 203 1067 234
3 149 1067 203
3 234 1069 115
3 1068 1069 234
3 1068 1070 25
3 234 1070 1068
3 235 1072 1071
3 115 1072 235
3 1071 1073 114
3 115 1073 1071
3 202 1074 26
3 235 1074 202
3 150 364 202
3 320 176 364
3 73 260 176
3 229 347 260
3 391 151 347
3 120 392 348
3 392 228 259
3 228 72 175
3 72 319 365
3 149 1075 319
3 203 1075 149
3 25 1077 149
3 1076 1077 25
3 1076 1078 234
3 25 1078 1076
3 1080 1081 25
3 1079 1081 1080
3 1080 1082 114
3 25 1082 1080
3 1083 1084 1079
3 115 1084 1083
3 1083 1085 114
3 1079 1085 1083
3 1087 1088 114
3 1086 1088 1087
3 1087 1089 26
3 114 1089 1087
3 1090 1091 1086
3 235 1091 1090
3 1090 1092 26
3 1086 1092 1090
3 1093 1094 26
3 202 1094 1093
3 26 1095 1093
3 150 1095 26
3 150 1096 364
3 320 1096 150
3 320 73 176
3 73 229 260
3 229 391 347
3 391 120 151
3 315 317 157
3 157 317 159
3 315 158 316
3 315 157 158
3 315 316 317
3 317 316 318
3 317 318 160
3 317 160 159
3 157 160 158
3 157 159 160
3 158 318 316
3 158 160 318
3 225 227 394
3 394 227 396
3 225 393 224
3 225 394 393
3 225 224 227
3 227 224 226
3 227 226 395
3 227 395 396
3 394 395 393
3 394 396 395
3 393 226 224
3 393 395 226
3 1097 1098 210
3 345 1098 1097
3 210 1099 1097
3 208 1099 210
3 1100 1101 343
3 208 1101 1100
3 343 1102 1100
3 345 1102 343
3 211 1103 346
3 210 1103 211
3 345 1104 210
3 346 1104 345
3 210 211 208
3 208 211 209
3 209 1105 208
3 344 1105 209
3 343 1106 344
3 208 1106 343
3 345 344 346
3 345 343 344
3 209 1108 1107
3 211 1108 209
3 1107 1109 346
3 211 1109 1107
3 346 1111 1110
3 344 1111 346
3 1110 1112 209
3 344 1112 1110
3 212 214 68
3 68 214 70
3 212 69 213
3 212 68 69
3 212 213 214
3 214 213 215
3 214 215 71
3 214 71 70
3 68 71 69
3 68 70 71
3 69 215 213
3 69 71 215