OFF

29 54 0
0.413939 -0.210468 0.317254
0.428670 -0.256097 0.295570
0.415335 -0.239156 0.317248
0.423258 -0.263668 0.224473
0.403915 -0.193356 0.295577
0.420621 -0.210143 0.317257
0.427682 -0.235876 0.307351
0.407018 -0.257150 0.295562
0.422017 -0.238831 0.317250
0.416549 -0.264012 0.302879
0.417260 -0.278254 0.249265
0.406030 -0.236929 0.307343
0.417251 -0.278261 0.277987
0.423231 -0.263687 0.302882
0.429244 -0.267763 0.275318
0.405477 -0.225247 0.263637
0.423943 -0.277929 0.249267
0.412735 -0.185604 0.302897
0.426546 -0.212530 0.307356
0.428692 -0.256082 0.231699
0.429252 -0.267758 0.251946
0.423933 -0.277936 0.277989
0.407592 -0.268816 0.275311
0.419417 -0.185279 0.302899
0.404894 -0.213583 0.307349
0.407040 -0.257135 0.231691
0.407600 -0.268811 0.251938
0.416576 -0.263993 0.224471
0.425567 -0.192303 0.295584
3 26 15 25
3 15 4 25
3 28 20 19
3 28 14 20
3 28 1 14
3 28 6 1
3 28 18 6
3 7 12 9
3 12 7 22
3 22 10 12
3 10 22 26
3 26 27 10
3 27 26 25
3 9 21 13
3 21 9 12
3 12 16 21
3 16 12 10
3 10 3 16
3 3 10 27
3 13 14 1
3 14 13 21
3 21 20 14
3 20 21 16
3 16 19 20
3 19 16 3
3 2 7 9
3 7 2 11
3 0 11 2
3 11 0 24
3 17 24 0
3 24 17 4
3 8 9 13
3 9 8 2
3 5 2 8
3 2 5 0
3 23 0 5
3 0 23 17
3 6 13 1
3 13 6 8
3 18 8 6
3 8 18 5
3 28 5 18
3 5 28 23
3 28 17 23
3 17 28 4
3 28 25 4
3 25 28 27
3 28 3 27
3 3 28 19
3 15 26 22
3 7 15 22
3 15 7 11
3 24 15 11
3 15 24 4
