OFF

137 270 0
-0.167861 -0.389726 -0.101569
-0.154854 -0.332722 -0.066991
-0.102496 -0.375780 -0.183645
-0.039921 -0.292385 -0.008681
-0.097156 0.088895 -0.043852
-0.014529 0.076060 -0.027280
0.017726 0.050856 0.058943
-0.067944 0.012048 0.078738
-0.109292 0.110186 0.045927
-0.092843 -0.186196 -0.141134
-0.128386 -0.046696 -0.001997
-0.143185 -0.035418 -0.040428
-0.016594 -0.095603 -0.023857
-0.127483 -0.176253 0.002756
-0.062157 -0.103321 -0.143417
-0.083469 -0.106883 -0.120546
-0.026888 -0.325023 -0.017704
-0.104781 -0.110445 -0.097675
-0.058780 -0.149278 -0.132155
-0.073346 -0.246195 -0.177307
0.012841 -0.075284 0.052590
-0.126093 -0.114008 -0.074804
-0.049377 0.093181 -0.080512
-0.112499 0.047457 -0.042711
-0.101115 -0.284714 -0.013705
-0.029345 -0.128959 -0.055707
-0.006889 -0.111994 0.044704
-0.071531 -0.182634 -0.164005
0.000090 -0.108640 0.020741
-0.126200 -0.314682 -0.150076
-0.007935 -0.050601 0.059862
-0.114155 -0.189759 -0.118263
-0.064097 -0.220933 -0.148357
-0.107110 -0.182136 0.017578
-0.135467 -0.193321 -0.095392
-0.168342 -0.355766 -0.102952
-0.058751 0.013868 -0.101100
-0.168824 -0.321807 -0.104334
-0.154372 -0.366682 -0.065608
-0.155816 -0.264803 -0.069756
-0.155335 -0.298763 -0.068373
-0.042096 -0.162315 -0.087557
-0.156779 -0.196883 -0.072521
-0.108088 -0.062557 0.052265
-0.056662 -0.259231 -0.132709
-0.080063 0.010306 -0.078229
-0.149982 -0.116151 -0.056474
-0.142281 -0.164975 -0.035674
-0.117936 -0.097812 0.026718
-0.087014 -0.279207 -0.173825
-0.049228 -0.297530 -0.117061
-0.133618 -0.281720 -0.012110
-0.134100 -0.247760 -0.013492
0.001598 0.063458 0.015831
-0.136388 0.045314 -0.024381
-0.127784 -0.133067 0.001172
-0.012661 -0.141996 -0.011109
-0.088081 -0.317352 -0.022727
-0.128688 -0.003510 -0.003581
0.004975 0.017500 0.027093
-0.065988 -0.227110 0.009365
-0.066966 -0.107531 0.044051
-0.054847 -0.195670 -0.119406
-0.068126 -0.065445 -0.121687
-0.047413 -0.233969 -0.103758
-0.089438 -0.069008 -0.098816
-0.011153 0.030102 -0.016018
-0.106510 -0.219208 -0.137651
-0.110749 -0.072570 -0.075946
-0.025412 -0.175351 -0.042959
-0.161179 -0.351256 -0.123723
-0.018574 -0.321483 -0.035119
-0.039978 -0.272268 -0.088110
-0.007776 -0.015856 -0.004756
-0.149134 -0.226333 -0.091910
-0.025844 -0.152504 0.035838
-0.030657 0.088661 -0.070392
-0.032544 -0.310567 -0.072462
-0.027280 0.042704 -0.059130
0.004023 -0.155032 0.033489
-0.098541 0.015884 0.076227
-0.075047 -0.349990 -0.031750
0.021659 0.004464 0.071692
-0.052955 -0.259747 0.000342
-0.023904 -0.003254 -0.047868
-0.077500 -0.144758 -0.142275
-0.147936 -0.304402 -0.049158
-0.027938 -0.029718 0.066154
-0.148898 -0.236482 -0.051923
-0.038163 -0.208707 -0.074808
-0.098812 -0.148321 -0.119404
-0.020527 -0.049211 -0.036606
-0.142583 -0.121790 -0.037259
-0.120124 -0.151883 -0.096533
-0.119141 0.074931 0.020381
-0.043408 0.055306 -0.102241
-0.030729 -0.247006 -0.059160
-0.009324 -0.296220 -0.006169
-0.141436 -0.155446 -0.073662
-0.127182 -0.219439 0.004341
-0.064720 0.051743 -0.079370
-0.128085 -0.089882 -0.000412
-0.128989 0.039675 -0.005165
-0.040031 0.009348 -0.090979
-0.098865 -0.248658 -0.157040
-0.008728 -0.188388 0.001640
-0.023294 -0.285305 -0.043512
0.008908 -0.028892 0.039842
-0.127842 0.006019 -0.041569
-0.153534 -0.380706 -0.143112
-0.036655 -0.036609 -0.079717
-0.141489 -0.255783 -0.111298
-0.174846 -0.384268 -0.120241
-0.162801 -0.259345 -0.088427
-0.033278 -0.082567 -0.068456
-0.087038 -0.144833 0.030815
-0.114348 -0.345231 -0.166860
-0.052782 -0.024007 -0.122829
-0.021479 -0.221744 -0.030210
-0.088016 -0.025254 0.065502
-0.003843 -0.062248 0.007992
-0.074094 -0.027570 -0.099958
-0.095406 -0.031132 -0.077087
-0.049406 -0.069965 -0.111567
-0.014044 -0.260042 -0.014562
-0.114148 -0.252077 -0.004682
-0.098842 0.059069 0.074642
-0.046029 -0.115923 -0.100305
-0.045916 -0.189807 0.022601
-0.108690 0.023814 0.049096
-0.046894 -0.070228 0.057288
-0.141018 -0.276081 -0.031325
-0.141980 -0.208161 -0.034090
-0.117635 -0.140998 0.028303
-0.133844 -0.285232 -0.130687
-0.142884 -0.078604 -0.038843
-0.118538 -0.011441 0.023550
3 0 38 112
3 38 109 112
3 38 2 109
3 38 81 2
3 81 16 2
3 16 71 2
3 16 97 71
3 16 79 97
3 16 26 79
3 26 20 79
3 26 30 20
3 30 82 20
3 30 6 82
3 30 87 6
3 87 7 6
3 7 126 6
3 126 8 6
3 8 53 6
3 8 5 53
3 8 76 5
3 8 22 76
3 8 4 22
3 7 80 126
3 16 75 26
3 71 77 2
3 77 50 2
3 50 19 2
3 19 49 2
3 8 54 4
3 8 94 54
3 16 3 75
3 3 128 75
3 3 83 128
3 79 124 97
3 79 105 124
3 22 95 76
3 38 57 81
3 38 51 57
3 38 86 51
3 38 1 86
3 83 60 128
3 50 44 19
3 49 116 2
3 51 24 57
3 20 28 79
3 105 118 124
3 94 102 54
3 54 23 4
3 86 131 51
3 49 29 116
3 77 72 50
3 80 129 126
3 71 106 77
3 19 104 49
3 30 130 87
3 9 31 67
3 0 37 35
3 37 109 70
3 1 40 39
3 98 21 42
3 34 42 31
3 74 42 111
3 115 33 99
3 102 10 58
3 10 55 101
3 125 24 99
3 55 99 13
3 48 43 55
3 43 7 119
3 52 99 131
3 23 11 108
3 135 92 11
3 30 26 130
3 75 130 26
3 87 130 7
3 61 43 130
3 61 115 43
3 133 115 99
3 133 43 115
3 80 7 43
3 119 130 43
3 119 7 130
3 128 60 115
3 33 60 99
3 33 115 60
3 61 75 115
3 61 130 75
3 128 115 75
3 84 103 91
3 84 78 103
3 110 103 117
3 110 91 103
3 76 95 78
3 103 95 117
3 103 78 95
3 123 14 127
3 123 117 14
3 18 14 27
3 18 127 14
3 123 114 117
3 123 127 114
3 110 114 91
3 110 117 114
3 66 5 78
3 66 59 5
3 76 78 5
3 84 73 78
3 84 91 73
3 66 73 59
3 66 78 73
3 53 59 6
3 53 5 59
3 28 120 56
3 28 20 120
3 12 120 91
3 12 56 120
3 105 79 56
3 28 56 79
3 107 82 59
3 107 20 82
3 6 59 82
3 73 120 59
3 73 91 120
3 107 120 20
3 107 59 120
3 41 25 127
3 41 89 25
3 114 25 91
3 114 127 25
3 18 62 127
3 18 27 62
3 41 62 89
3 41 127 62
3 69 118 56
3 69 89 118
3 105 56 118
3 12 25 56
3 12 91 25
3 69 25 89
3 69 56 25
3 108 122 23
3 108 11 122
3 54 11 23
3 46 21 11
3 46 42 21
3 68 11 21
3 68 122 11
3 4 23 100
3 45 23 122
3 45 100 23
3 22 4 100
3 65 63 122
3 65 15 63
3 121 63 117
3 121 122 63
3 85 14 15
3 85 27 14
3 63 14 117
3 63 15 14
3 36 95 100
3 36 117 95
3 22 100 95
3 36 45 117
3 36 100 45
3 121 45 122
3 121 117 45
3 17 90 15
3 17 21 90
3 85 90 27
3 85 15 90
3 65 68 15
3 65 122 68
3 17 68 21
3 17 15 68
3 93 98 31
3 93 21 98
3 34 98 42
3 34 31 98
3 9 90 31
3 9 27 90
3 93 90 21
3 93 31 90
3 136 43 10
3 136 129 43
3 80 43 129
3 133 55 43
3 133 99 55
3 48 10 43
3 48 55 10
3 94 8 129
3 126 129 8
3 136 102 129
3 136 10 102
3 94 129 102
3 135 10 92
3 135 11 10
3 46 92 42
3 46 11 92
3 54 102 11
3 58 11 102
3 58 10 11
3 47 92 55
3 47 42 92
3 101 92 10
3 101 55 92
3 132 47 99
3 132 42 47
3 13 47 55
3 13 99 47
3 16 81 3
3 83 3 24
3 57 3 81
3 57 24 3
3 125 60 24
3 125 99 60
3 83 24 60
3 51 99 24
3 32 19 44
3 32 27 19
3 96 72 106
3 96 89 72
3 77 106 72
3 124 118 106
3 96 118 89
3 96 106 118
3 64 62 44
3 64 89 62
3 32 62 27
3 32 44 62
3 50 72 44
3 64 72 89
3 64 44 72
3 71 97 106
3 124 106 97
3 134 37 29
3 134 111 37
3 113 111 42
3 113 37 111
3 112 109 37
3 70 29 37
3 70 109 29
3 67 31 111
3 67 27 9
3 74 31 42
3 74 111 31
3 134 104 111
3 134 29 104
3 67 104 27
3 67 111 104
3 19 27 104
3 49 104 29
3 116 109 2
3 116 29 109
3 51 131 99
3 52 88 99
3 52 131 88
3 132 88 42
3 132 99 88
3 86 39 131
3 86 1 39
3 88 39 42
3 88 131 39
3 35 1 0
3 35 37 1
3 112 37 0
3 113 39 37
3 113 42 39
3 40 37 39
3 40 1 37
3 38 0 1
