OFF
1076 1482 0
-0.0329339077 0.0286915585 -0.0267059953
-0.3133575781 0.0340788395 -0.0539616281
0.0626150455 -0.0323907705 -0.0228977232
-0.1629576311 0.0000146858 -0.0241802574
0.3443737727 0.0328460373 -0.0562289082
0.0984288106 -0.0045868442 0.0094046167
0.0846373560 0.0770925097 -0.1058926090
-0.3137502414 -0.0470195537 -0.0855320812
-0.3679111954 -0.0083047643 -0.0471440685
-0.3678757444 -0.0082957970 -0.0442446862
0.0414963464 0.0860684259 -0.0573139748
0.2630260035 0.0219371380 0.0004658859
-0.4023384485 -0.1147855931 -0.0545257323
-0.3137344884 0.0771361512 -0.0852090152
0.4553084197 -0.0000120968 -0.0370462851
0.4145485097 -0.0235188411 -0.0380433721
-0.3133804353 0.0377586753 -0.0557735944
0.3441419845 0.0167546852 -0.0699825835
-0.0317420857 0.1036156948 -0.0410247414
-0.1615215300 -0.0564599032 -0.0366076260
-0.3950196666 0.0592505309 -0.0848002370
-0.1624521145 0.1123983745 -0.0565308123
0.0895267937 0.0716955939 -0.0371826891
-0.1630195646 0.0226855228 -0.0345865655
0.1364889746 0.0705656365 -0.0392783155
0.0227082658 -0.0000316851 -0.0670314506
0.3084788888 0.0151588075 -0.0064983862
0.2588619870 -0.0271626100 -0.0012594491
-0.3992383916 0.1181727600 -0.0170384766
0.3440543677 -0.0000453180 -0.0733165796
0.1476896171 0.0243057634 0.0002806283
-0.1222476364 -0.0889861281 -0.0499158645
0.0765417871 -0.0392831183 -0.0254589287
-0.1994525606 0.0986232815 -0.0406988240
0.3448255723 0.0000182520 -0.0092092810
0.2706231610 0.0000499145 0.0214246390
-0.0348629337 -0.0131673099 -0.0112207063
0.1525639618 -0.0301402750 -0.0591712971
-0.1984277971 -0.0890537487 -0.0592364170
-0.2405949446 0.1156129781 -0.0081057642
-0.2887417204 -0.3777669840 -0.0601431409
-0.3548592792 0.0805671615 -0.0610566434
0.3743441518 0.0114552841 -0.0720184674
-0.3453370643 0.0452296704 -0.0831947006
-0.4638991183 -0.2505945368 -0.0676245570
-0.3550733462 -0.0776024502 -0.0773348368
0.3221627266 0.0328021798 -0.0384993024
0.1365655076 0.0335401209 -0.0211105199
-0.3452651297 -0.0757815131 -0.0763704670
-0.3949028432 0.0745550313 -0.0753645448
-0.1994911444 -0.0563969185 -0.0342996520
0.2683177504 -0.0128213438 0.0174354024
-0.1810693873 0.3295816316 -0.0633302774
-0.3449035570 -0.0685266648 -0.0468547698
-0.3550639038 0.0775330243 -0.0777687701
-0.4088157623 0.1009777032 -0.0550395528
-0.1607051292 0.1112931201 -0.0252834261
-0.4060598103 -0.1462610842 0.1012710277
-0.1981059157 0.0387819478 -0.0388970018
0.3448262396 -0.0054112556 -0.0103175764
0.1507067116 -0.0166188814 -0.0662214731
-0.3949119217 -0.0746050728 -0.0749473076
-0.3452559083 0.0757169626 -0.0767942014
-0.2278621010 -0.3810693008 -0.0613797535
-0.3448952083 0.0686258707 -0.0472383335
0.0447457113 0.0772994723 -0.1101478750
0.2505896768 0.0354332412 -0.0323047551
0.0168133237 -0.1080597725 -0.0470938079
0.0626189959 0.0325763850 -0.0230797607
-0.3946289438 0.0413340788 -0.0527047159
0.0464584092 -0.0725778472 -0.0367345229
0.1195446814 -0.0707000428 -0.0379886436
-0.3449631619 0.0402108504 -0.0525751566
-0.3119073273 0.0153196018 -0.0425422471
-0.1259271402 -0.0448963703 -0.1053582219
-0.3137873128 -0.0448337159 -0.0885810507
0.0846279545 -0.0773726036 -0.1054605390
0.3445560005 0.0331339074 -0.0414132825
-0.4023347125 0.1144149766 -0.0595314342
-0.5000000000 -0.2367290780 -0.0729476257
-0.3449680521 -0.0401398855 -0.0523503699
0.0756287415 0.0722950961 -0.0368743173
0.4553392828 -0.0079207744 -0.0373958255
0.3252206054 -0.0148101444 -0.0025384312
0.0448358293 0.1063592465 -0.0504959540
-0.3947385720 -0.0771150261 -0.0606638847
-0.3946339700 -0.0412582102 -0.0524736262
-0.3137962935 -0.0635353045 -0.0891701522
-0.4060419444 0.1471961124 0.1004505450
-0.2070062844 -0.3768904560 -0.0617266189
0.1042654344 0.0389029817 -0.0254745553
0.1551053662 0.0697858522 -0.0566136888
0.3219961779 0.0400133333 -0.0544149799
0.4142280782 0.0247537546 -0.0649702863
-0.3448690227 -0.0531324820 -0.0441499891
-0.3947291835 0.0771448744 -0.0610954250
-0.0317546937 -0.1035185516 -0.0404454163
-0.0318710571 -0.1035479857 -0.0499622468
0.4551984819 -0.0201353546 -0.0529138972
0.2282512915 0.0000535004 0.0245212407
-0.4454870674 -0.2499109252 -0.0674249197
-0.3546328546 0.0529106357 -0.0423229124
-0.3132385931 -0.0335094235 -0.0437907182
-0.3134433581 0.0808009644 -0.0612545507
0.0991009256 0.0000429135 0.0108849927
0.0428808123 -0.0274259005 -0.0597486943
-0.3546686451 0.0697634855 -0.0453811610
0.0480706712 0.0405092023 -0.1107878900
-0.1259216945 0.0446436803 -0.1056090160
-0.3127329281 0.0000044632 -0.0387607600
0.0221473978 0.0129697745 -0.0652314188
-0.1607186566 -0.1110921045 -0.0246607096
0.1195532940 0.0707924763 -0.0383843705
-0.2307143321 0.2362279157 -0.0608488980
0.0464672506 0.0726863743 -0.0371408655
-0.3451269916 0.0359126289 -0.0659409433
0.0902805021 -0.0400958125 -0.0256275573
0.1525676295 0.0301122534 -0.0593398020
0.0451234287 -0.0326536226 -0.0234829081
0.2280247367 0.0045924835 0.0235164501
0.4141139168 -0.0152427092 -0.0709835561
-0.3974855776 -0.1226640672 -0.0188283117
0.3604567882 -0.0090033392 -0.0145495547
0.1188202750 0.0390898325 -0.0256983526
0.3743427494 -0.0115821997 -0.0719540399
-0.3678747287 0.0084148237 -0.0442915407
-0.3947832788 0.0373131903 -0.0652100378
-0.3137438854 -0.0772510866 -0.0847771862
-0.3131404145 0.0556068325 -0.0364538345
0.3221587436 -0.0327343087 -0.0383155036
-0.2133429470 0.1691868937 -0.0486569915
-0.3137445256 0.0469004716 -0.0857948464
-0.1622964732 -0.1123286980 -0.0420540192
-0.1624657964 -0.1123715283 -0.0559021919
0.4548930333 -0.0000467652 -0.0724138635
0.3251621713 0.0200144532 -0.0126669495
0.1551647108 0.0000490638 0.0183328877
-0.2307430867 -0.2362157217 -0.0595273275
-0.2306601763 -0.2361947495 -0.0527464581
-0.4023244727 0.1148483743 -0.0551681371
0.0610756491 0.0721102597 -0.0366797008
-0.1981835611 -0.0730277259 -0.0393855798
-0.1212003414 -0.0000222048 -0.0611867696
-0.4427003974 0.1193752614 -0.0591249978
-0.3547478059 -0.0385460937 -0.0510133939
-0.3947878204 -0.0373073781 -0.0650012939
0.4550483300 -0.0188333006 -0.0647397414
0.4552876819 -0.0167933555 -0.0445254292
-0.3133617219 -0.0340201770 -0.0537710595
-0.0581169612 0.1666354996 -0.0449004063
-0.2134593100 0.1691627215 -0.0581738383
0.1362923352 0.0738441946 -0.0565054570
-0.3137885672 0.0633955379 -0.0895251463
0.2499162124 -0.0566820845 -0.0535295907
-0.4088625937 0.1009679620 -0.0588696945
-0.1942409640 0.3673908675 -0.0641489722
-0.0329373882 -0.0285154037 -0.0265458597
-0.1942856866 -0.3673987860 -0.0620935869
0.0895180732 -0.0715922722 -0.0367818291
-0.3137702063 0.0798148340 -0.0881511222
0.3163401836 0.0000235760 -0.0042733297
-0.3949787751 0.0460296002 -0.0813530332
-0.0582333255 0.1666113271 -0.0544173583
0.3084770646 -0.0149106270 -0.0064137834
-0.1659652454 -0.3330145344 -0.0582352273
-0.1997078807 -0.0985644517 -0.0600476317
-0.1994645585 -0.0985029033 -0.0401474076
0.0480657242 -0.0408118204 -0.1105602068
0.3220160028 0.0323685940 -0.0504100163
0.2261642591 0.0116706894 0.0203841326
-0.3945348066 0.0535315471 -0.0451003105
-0.0108651604 -0.1059703673 -0.0416844588
0.1036413436 0.0372684968 -0.0241694482
0.4146062456 -0.0000006333 -0.0259293277
-0.3132788739 -0.0372699436 -0.0469698647
-0.3453880041 -0.0594821310 -0.0865467792
0.2683193304 0.0132080336 0.0173622454
-0.3139198210 -0.1021968731 -0.0467234353
-0.3140795174 -0.1022372683 -0.0597842827
-0.4047167123 0.1094187688 -0.0580533008
-0.1993518518 -0.1127474916 -0.0447632337
-0.1994682164 -0.1127769260 -0.0542801695
-0.0348613211 0.0134303480 -0.0112956213
-0.2995674838 -0.1139151608 -0.0539483680
-0.2525829798 0.3317904739 -0.0566595445
0.3252224320 0.0150772331 -0.0026214185
0.1535090774 -0.0118694915 0.0141117431
-0.1610745449 -0.0997750765 -0.0387062350
-0.1575540325 -0.0000175713 -0.0576401571
-0.2565931480 -0.1724788988 -0.0503542800
0.2505853693 -0.0353219637 -0.0321069166
-0.1991549425 -0.0208293616 -0.0366037269
-0.1659247079 0.3330248941 -0.0600983451
-0.3848372716 -0.0939893609 -0.0528018405
0.0627466245 -0.0152525763 -0.0003907496
-0.4427149257 -0.1193280514 -0.0584572725
-0.0346214318 0.1378442054 -0.0442035242
-0.0108522541 0.1060584631 -0.0422774523
-0.3132345072 0.0336235154 -0.0439785087
-0.2671449613 0.2381983529 -0.0566378496
-0.1984169566 0.0890665908 -0.0597347204
0.3160634042 0.0048839093 -0.0041376334
-0.3992527666 -0.1178964665 -0.0163786895
-0.2671739540 -0.2381569526 -0.0553053356
0.3219060120 0.0320824248 -0.0592315070
-0.2852513383 -0.3320560794 -0.0588270183
0.1188155262 -0.0389256893 -0.0254801586
-0.4999711839 0.2366995803 -0.0742718226
0.4552009320 0.0201052607 -0.0530263872
-0.3448625474 0.0532476326 -0.0444475120
-0.1621612872 0.0111337051 -0.0253294670
0.0451274091 0.0328386663 -0.0236665701
0.3304451638 0.0052586524 -0.0072425839
-0.0423842749 0.1086716073 -0.0271861750
0.3443697724 -0.0328798797 -0.0560450495
-0.3139073758 0.1022938134 -0.0472955296
-0.3679101796 0.0084079611 -0.0471909295
-0.3132743314 0.0373664103 -0.0471786574
0.1488358441 0.0209261778 0.0028976916
0.5000000000 -0.0000363769 -0.0610772546
-0.1621626276 -0.0109334907 -0.0252675149
-0.3792186899 -0.1481299392 0.1154315226
0.0902853978 0.0402622913 -0.0258519459
-0.3453807703 0.0593612297 -0.0868791746
0.3848302581 -0.0000464806 -0.0742986474
0.4141157652 0.0151161294 -0.0710684228
0.1488333124 -0.0206056992 0.0030135448
0.1040711416 -0.0717799759 -0.0369755036
-0.3131933212 0.0562935329 -0.0407001990
0.0814223491 -0.0415350468 -0.1093403004
-0.2502544363 -0.1130542099 -0.0472194973
0.3448269233 0.0056333955 -0.0103475344
0.0168264801 0.1081143522 -0.0476985728
0.2588653058 0.0274449916 -0.0014125958
-0.3552079939 -0.0597411925 -0.0884862038
-0.3132001661 -0.0561598226 -0.0403856772
-0.3792006057 0.1491421038 0.1145992385
0.0221458165 -0.0130154042 -0.0651587142
0.1018685415 0.0297702669 -0.0146808562
-0.1981746647 0.0731520594 -0.0397945442
0.1476866847 -0.0240002317 0.0004163853
-0.3134306636 0.0840735799 -0.0603278224
-0.0368433846 0.0000279481 -0.0083746105
0.2696519932 -0.0061639023 0.0205464064
-0.3133058696 0.0808294280 -0.0500099412
0.0984293950 0.0049487029 0.0093782750
0.1042607072 -0.0387357911 -0.0252575268
-0.3787876162 0.0153282280 -0.0484754216
-0.3797840504 0.0247553271 -0.0492176450
0.1364803890 -0.0704785721 -0.0388838702
0.4144311475 0.0280768581 -0.0494205294
-0.4046698822 0.1094274574 -0.0542232610
-0.1615146481 0.0565954094 -0.0369237995
-0.3721725357 -0.0000027615 -0.0479791853
-0.1238658424 0.0323502421 -0.0574488159
0.0996240561 0.0164538720 0.0037900387
-0.4454566469 0.2499059702 -0.0688230680
-0.4023486374 -0.1143749883 -0.0588914299
-0.1811095071 -0.3295866473 -0.0614864165
-0.1810265967 -0.3295656751 -0.0547055471
-0.2133635364 -0.1691087315 -0.0477106371
-0.2134798997 -0.1691381656 -0.0572274677
-0.1809864758 0.3295986051 -0.0565492905
-0.2278157140 0.3810693008 -0.0635116413
0.4553402444 0.0079784660 -0.0374408013
0.4550506170 0.0187374458 -0.0648448139
-0.0346382064 -0.1377626497 -0.0434325800
-0.0347545697 -0.1377920838 -0.0529494106
0.3604578945 0.0091995455 -0.0146006046
-0.3134408958 -0.0840502744 -0.0598574972
-0.3132812007 -0.0840098795 -0.0467967551
-0.3867023349 0.0945802014 -0.0573760203
0.1364112580 -0.0911203775 -0.0509193174
0.4146328940 0.0096297899 -0.0269234925
0.3219021034 -0.0321312332 -0.0590519057
0.1507087300 0.0165518959 -0.0663143021
-0.2069604056 0.3768857844 -0.0638350576
-0.3945653652 0.0679200498 -0.0477114939
-0.3549226362 0.0339159713 -0.0658757225
-0.3950268855 -0.0593549935 -0.0844684721
0.0451531796 0.0403696065 -0.0266960034
-0.3548690855 -0.0805426311 -0.0606060172
0.1364223509 0.0911389426 -0.0514291621
-0.3546771310 -0.0696505981 -0.0449912325
-0.3132709690 0.0841055558 -0.0472670542
-0.2565721475 0.1725477005 -0.0513193524
0.0765465771 0.0394522256 -0.0256793495
0.3220120630 -0.0323680929 -0.0502289022
0.0451482716 -0.0402021287 -0.0264709539
-0.4638686130 0.2505904430 -0.0690264114
-0.0318584499 0.1035925746 -0.0505416967
0.3447313073 -0.0280911802 -0.0249638729
0.3219913064 -0.0400343193 -0.0541910255
0.0610668777 -0.0719995094 -0.0362766139
-0.3949843841 -0.0461140209 -0.0810953424
0.0414858688 -0.0860712816 -0.0568324891
-0.3551528361 0.0441245291 -0.0847825643
-0.2527062770 -0.3317707532 -0.0615843960
-0.2526233666 -0.3317497810 -0.0548035267
-0.1981106286 -0.0386526643 -0.0386803944
0.0448228856 -0.1063231065 -0.0499009387
0.0428841505 0.0274079626 -0.0599020148
0.3441399390 -0.0168665074 -0.0698884664
-0.0581372417 -0.1665550676 -0.0439684767
-0.0582536050 -0.1665845017 -0.0534853072
0.4140197723 -0.0000482600 -0.0750141185
-0.4046831985 -0.1093586557 -0.0536112577
-0.4047300287 -0.1093705014 -0.0574412876
0.3278503497 -0.0099597415 -0.0007964047
-0.1238697792 -0.0323348786 -0.0572678613
0.1036368168 -0.0370942405 -0.0239615019
0.4142250589 -0.0248456081 -0.0648315806
0.1564224698 -0.0039000004 0.0171646494
-0.3451313632 -0.0359181002 -0.0657399881
-0.3137818637 0.0446968643 -0.0888314997
-0.2886957350 0.3777814512 -0.0622566410
-0.3140670705 0.1022607851 -0.0603562944
0.2696527606 0.0065676969 0.0205101775
0.3160628342 -0.0046242729 -0.0041103240
-0.2502406703 0.1131395522 -0.0478523119
-0.2406089990 -0.1153059361 -0.0074598052
0.4550011750 0.0153336598 -0.0676914270
0.0627485043 0.0155640452 -0.0004766116
0.4145513728 0.0235769268 -0.0381753851
0.3752677598 -0.0000510543 -0.0783353508
-0.1622827931 0.1124338379 -0.0426827220
0.1362833467 -0.0738541640 -0.0560922157
-0.1996958822 0.0985733092 -0.0605990840
0.1564229647 0.0042979795 0.0171413932
0.4549993012 -0.0154461277 -0.0676053633
0.0996220755 -0.0161233668 0.0038813472
-0.3138408012 -0.0640169660 -0.0928065783
-0.1271150108 -0.0640795138 -0.1095703006
-0.3450787282 -0.0784652271 -0.0611042999
-0.3547431093 0.0386243729 -0.0512292894
-0.4088748811 -0.1009244172 -0.0583049016
-0.4088280496 -0.1009125712 -0.0544747664
-0.2306314220 0.2362446784 -0.0540680156
0.1365614470 -0.0333528744 -0.0209225247
-0.1991523980 0.0209708694 -0.0367206207
-0.1610623922 0.0998978494 -0.0392647933
0.2280241967 -0.0041674659 0.0235403925
-0.1222368012 0.0890416027 -0.0504138814
-0.1271072236 0.0638026741 -0.1099277116
0.3223638425 -0.0291377888 -0.0204499419
0.0611983239 -0.0397815313 -0.0259486178
0.3447347371 0.0282307376 -0.0251212705
-0.3945736264 -0.0678159921 -0.0473317859
-0.3546392880 -0.0527822797 -0.0420273050
0.0756199474 -0.0721872128 -0.0364701832
0.3445519694 -0.0330855724 -0.0412281074
-0.1246777951 0.0797615332 -0.1049435996
0.0447362876 -0.0775981650 -0.1097142566
0.1365274324 -0.0394236463 -0.0255509968
0.3278515701 0.0102373870 -0.0008536240
-0.0423975036 -0.1084959599 -0.0265795996
-0.1993381217 0.1128422090 -0.0453942849
0.3223674066 0.0293046608 -0.0206128472
0.0814273854 0.0412340406 -0.1095719371
0.0524384014 0.0625009363 -0.1154315226
-0.2852109163 0.3320777134 -0.0606847671
-0.3945413156 -0.0534136913 -0.0448011446
-0.3848258267 0.0940611644 -0.0533279169
0.4144277296 -0.0280819416 -0.0492634259
-0.3974706190 0.1229259733 -0.0195143949
-0.0347377949 0.1378189807 -0.0537203678
0.4552897264 0.0168109991 -0.0446194942
0.2261628692 -0.0112626081 0.0204487641
0.1365322380 0.0395853141 -0.0257722641
0.1040798860 0.0718804303 -0.0373773057
-0.1994842700 0.0565499996 -0.0346155954
-0.3119091848 -0.0151981449 -0.0424568888
-0.1994544847 0.1128180367 -0.0549111317
0.1535105354 0.0122519332 0.0140434361
-0.3133850280 -0.0377101050 -0.0555624369
-0.2995536133 0.1139697641 -0.0545857830
0.4146317212 -0.0095097086 -0.0268705973
0.1550968705 -0.0697987156 -0.0562232328
0.0612031709 0.0399493559 -0.0261721184
0.0626842212 0.0000390875 0.0052323214
0.3448127818 -0.0174600689 -0.0151119913
-0.3137799304 -0.0799479219 -0.0877042421
-0.1246875197 -0.0800106940 -0.1044966902
-0.3797870580 -0.0246630275 -0.0490793939
-0.3797516070 -0.0246540602 -0.0461800117
-0.3721370850 -0.0000001084 -0.0450797835
-0.3867138456 -0.0945311155 -0.0568470832
-0.3787540251 -0.0152226462 -0.0454905508
-0.3787894762 -0.0152316136 -0.0483899331
-0.2526658913 0.3317735004 -0.0634405315
0.3304445369 -0.0050177643 -0.0072139502
-0.3131471743 -0.0554500249 -0.0361432119
0.3448149205 0.0176544407 -0.0152100966
0.2499231114 0.0566721017 -0.0538466888
0.1018649405 -0.0295435429 -0.0145142029
-0.3134531928 -0.0807834480 -0.0608025614
-0.3133157040 -0.0807486702 -0.0495579714
-0.3549267636 -0.0339188996 -0.0656858659
-0.3138330183 0.0638568019 -0.0931642789
-0.3453425775 -0.0453311827 -0.0829414853
0.0524307744 -0.0628302997 -0.1150808455
-0.3787521665 0.0153361426 -0.0455761413
-0.3797485981 0.0247632424 -0.0463181542
-0.3552007297 0.0596104639 -0.0888200665
0.2630233544 -0.0216447585 0.0005880810
-0.1630223179 -0.0225370233 -0.0344601369
0.3251597506 -0.0198031075 -0.0125553473
0.1507893092 -0.0000390778 -0.0714736517
-0.3551582143 -0.0442337084 -0.0845354262
-0.3450691754 0.0784855897 -0.0615433229
0.2059309238 0.0214316579 0.0016817888
0.2082662159 -0.0167571250 0.0073499120
-0.4532845052 0.1849828522 -0.0640757046
-0.4766278445 0.2108412163 -0.0691737636
-0.4713357906 0.1780374209 -0.0666984102
-0.3725051301 0.1819378671 -0.0617044255
-0.3360293717 0.1479538156 -0.0581451042
-0.3797618587 0.1760833777 -0.0645896812
-0.4070191272 0.1694801827 -0.0673140585
-0.4534951555 0.2030898815 -0.0707929405
-0.4767331697 0.2198947309 -0.0725323816
-0.4354438701 0.2100353129 -0.0681702350
-0.3889678417 0.1764256141 -0.0646913529
-0.3605430989 0.1358704839 -0.0638351765
-0.4264182274 0.2135080286 -0.0668588822
-0.3725272756 -0.1819130430 -0.0606866438
-0.3509529661 -0.1143503770 -0.0542370502
-0.3874328620 -0.1483493181 -0.0576061881
-0.3360473797 -0.1479141019 -0.0573175059
-0.4239127580 -0.1823482592 -0.0609753260
-0.4090071715 -0.2159119841 -0.0640557818
-0.3874328620 -0.1483493181 -0.0576061881
-0.3817333010 -0.1822548488 -0.0607864625
-0.4511743187 -0.1755520332 -0.0659195278
-0.4713574629 -0.1780285647 -0.0657024491
-0.4267614780 -0.1449635107 -0.0624054789
-0.3725051301 0.1819378671 -0.0617044255
-0.4440785221 0.1846406158 -0.0639740329
-0.4076027637 0.1506565642 -0.0604147116
-0.4082918261 0.1832892415 -0.0628392292
-0.4433894597 0.1520079386 -0.0615495153
-0.4089808885 0.2159219187 -0.0652637467
-0.4447675845 0.2172732930 -0.0663985504
-0.4082918261 0.1832892415 -0.0628392292
-0.3711270053 0.1166725127 -0.0568553904
-0.3360293717 0.1479538156 -0.0581451042
-0.3718160677 0.1493051899 -0.0592799079
-0.3353403093 0.1153211384 -0.0557205867
-0.4076027637 0.1506565642 -0.0604147116
-0.4069137014 0.1180238870 -0.0579901941
-0.3718160677 0.1493051899 -0.0592799079
-0.4532845052 0.1849828522 -0.0640757046
-0.3889678417 0.1764256141 -0.0646913529
-0.4070191272 0.1694801827 -0.0673140585
-0.3783837340 0.1108180232 -0.0597406461
-0.3927014306 0.1401491030 -0.0635273523
-0.3605430989 0.1358704839 -0.0638351765
-0.4713357906 0.1780374209 -0.0666984102
-0.4534951555 0.2030898815 -0.0707929405
-0.4570180940 0.1487063411 -0.0629117040
-0.4511692242 -0.1757573356 -0.0637366790
-0.4267538364 -0.1452714644 -0.0591312057
-0.4713574629 -0.1780285647 -0.0657024491
-0.4511692242 -0.1757573356 -0.0637366790
-0.4755846121 -0.2062432068 -0.0683421524
-0.4331187834 -0.1826900650 -0.0610751447
-0.4331187834 -0.1826900650 -0.0610751447
-0.3817333010 -0.1822548488 -0.0607864625
-0.3889893178 -0.1764159025 -0.0637044198
-0.3406503924 -0.1480850048 -0.0573674153
-0.3889893178 -0.1764159025 -0.0637044198
-0.4331238778 -0.1824847626 -0.0632579935
-0.4177362576 -0.1484298754 -0.0610747117
-0.4264442181 -0.2135052197 -0.0656644884
-0.3515344176 -0.1393265854 -0.0617443513
-0.3956689776 -0.1453954454 -0.0612979249
-0.3582140774 -0.1083061283 -0.0593378563
-0.4511743187 -0.1755520332 -0.0659195278
-0.4331238778 -0.1824847626 -0.0632579935
-0.4755871593 -0.2061405556 -0.0694335768
-0.2402439541 0.2036926233 -0.0526474205
-0.2579211691 0.2841611959 -0.0573763914
-0.2403021357 0.2036805372 -0.0574058439
-0.2579626242 0.2841528145 -0.0607668326
-0.2220118564 -0.2026517405 -0.0502285476
-0.2416417714 -0.2839722653 -0.0537749924
-0.2436681174 -0.2043473103 -0.0549408038
-0.2417246819 -0.2839932375 -0.0605558617
-0.2402439541 0.2036926233 -0.0526474205
-0.2579211691 0.2841611959 -0.0573763914
-0.2403021357 0.2036805372 -0.0574058439
-0.2579626242 0.2841528145 -0.0607668326
-0.2436266621 -0.2043368242 -0.0515503691
-0.2762126462 -0.2851065160 -0.0570661770
-0.2436681174 -0.2043473103 -0.0549408038
-0.2762126462 -0.2851065160 -0.0570661770
0.2905140162 0.0301235857 -0.0199559491
0.1935775922 0.0344866810 -0.0267076375
-0.0979767362 0.0256885407 -0.0306462804
-0.2374471076 0.0055690842 -0.0320451135
-0.2550066215 0.0270507748 -0.0407196245
-0.2563593886 0.0450867575 -0.0392970520
-0.2556575396 0.0643794460 -0.0381241893
-0.2563617648 0.0913644186 -0.0439829391
-0.1017233335 0.1042847284 -0.0332254842
0.2474656468 0.0083578037 -0.0707281176
0.2363073710 0.0243171604 -0.0627729045
0.2012453705 0.0433921775 -0.0565932454
0.1781753683 0.0565890149 -0.0566034671
0.2025142388 0.0632289769 -0.0552301888
-0.0415907243 0.0829149795 -0.0811287872
0.0015774935 0.0801072259 -0.0956383311
-0.0000471890 0.0844917027 -0.0692213810
0.0215369199 0.0830878259 -0.0764761529
-0.0399660419 0.0785305027 -0.1075457373
-0.0831342597 0.0813382563 -0.0930361934
0.0015774935 0.0801072259 -0.0956383311
-0.0373344111 0.0631518052 -0.1126796171
-0.0367416465 0.0535723083 -0.1105202693
0.0078483774 0.0580366223 -0.1129758959
-0.0389255116 0.0425764413 -0.1081984530
0.0864280639 0.0147608352 -0.0657728604
0.0864683535 0.0064653483 -0.0683525353
-0.0492460378 -0.0000269450 -0.0641091101
0.1182663758 0.0555099464 -0.0830928129
0.1931727312 0.0739055221 -0.0526379254
0.1932276747 0.0481287079 -0.0398094765
0.1932060430 0.0636188691 -0.0465625022
0.1648583247 0.0593471722 -0.0395438960
-0.0604778840 0.0992334002 -0.0569223935
-0.0403702274 0.0875550143 -0.0538639281
-0.1114649993 0.1058158874 -0.0567266029
-0.2458880110 0.0203791016 -0.0523198727
-0.1848769267 0.0263646719 -0.0548843443
-0.2627321061 0.0041951949 -0.0524155433
-0.2204445437 0.0542497692 -0.0993796057
-0.2671132037 0.0494733167 -0.0941055527
-0.2204701210 0.0638297380 -0.1015459953
-0.2192554067 0.0718091676 -0.0990539392
-0.2180035038 0.0844282183 -0.0692825018
-0.1713406494 0.0820948757 -0.0871130507
-0.1701201525 0.0867349105 -0.0598481916
-0.1467887253 0.0855682392 -0.0687634660
-0.2192240007 0.0797881836 -0.0965473609
-0.2658868551 0.0821215262 -0.0787168120
-0.1713406494 0.0820948757 -0.0871130507
-0.2188238530 0.0385235532 -0.0731401578
-0.2186117102 0.0332145408 -0.0557052220
-0.2660907156 0.0363011963 -0.0635508930
-0.0404908459 0.0298791024 -0.0586754153
-0.0415187720 0.0360258215 -0.0827555154
-0.0404908459 0.0298791024 -0.0586754153
-0.0826923072 0.0341880318 -0.0701021656
0.0006826893 0.0317168920 -0.0713287651
-0.0837202332 0.0403347509 -0.0941822657
-0.0826923072 0.0341880318 -0.0701021656
-0.1037930378 0.0363424965 -0.0758155408
0.0171504628 0.0732140348 -0.0344867279
0.0066926617 0.0682271806 -0.0323456558
-0.0323379967 0.0661536267 -0.0338653684
0.0060967507 0.0307651124 -0.0251862827
0.2862929274 0.0377232873 -0.0433598675
0.1977117170 -0.0302577422 -0.0110909869
0.1935734082 -0.0343374190 -0.0265147206
0.2282868520 -0.0287101761 -0.0061752180
0.0914348336 -0.0818491124 -0.0438269201
-0.0989426258 -0.0178521666 -0.0228404216
-0.0970059666 -0.0641452401 -0.0326260474
-0.0964146193 -0.1016468140 -0.0395758257
-0.0643803301 -0.0838318958 -0.0365357318
-0.1290402557 -0.0819601583 -0.0356661412
-0.0643803301 -0.0838318958 -0.0365357318
-0.0323460410 -0.0660169776 -0.0334956380
-0.0649716774 -0.0463303219 -0.0295859535
-0.2556746109 -0.0360810439 -0.0412355563
-0.2556289015 -0.0470513446 -0.0374118031
-0.2563861725 -0.0702033990 -0.0405482035
-0.2560516910 -0.0876122995 -0.0430545075
-0.1023469884 -0.1104123290 -0.0343168094
0.2473805397 -0.0083320997 -0.0697690263
0.2474233253 -0.0167426944 -0.0680549697
-0.0387556744 -0.0832921466 -0.0798150605
0.0029903066 -0.0804451558 -0.0947646586
0.0222380877 -0.0832582187 -0.0757985738
0.0013650972 -0.0846817141 -0.0683237748
-0.0403808838 -0.0875287048 -0.0533741768
-0.0805016554 -0.0861391373 -0.0648654625
0.0013650972 -0.0846817141 -0.0683237748
-0.0361283727 -0.0714204969 -0.1097887679
-0.0373421182 -0.0634549067 -0.1123255731
-0.0395246433 -0.0524456671 -0.1100652537
0.0075443281 -0.0631426032 -0.1137032093
0.0873548892 -0.0215778396 -0.0621650056
-0.0505807567 -0.0161832818 -0.0621496560
0.1185959582 -0.0537564393 -0.0823159180
0.1931637352 -0.0739012310 -0.0522244540
0.1935328792 -0.0529002679 -0.0354953934
-0.2565743883 -0.0913073630 -0.0599525644
-0.2480211575 -0.0161688200 -0.0526235233
-0.2198839707 -0.0544566681 -0.0990824001
-0.2668356418 -0.0496451920 -0.0938317254
-0.2198572265 -0.0448650431 -0.0969696363
-0.2204474706 -0.0720137178 -0.0986372714
-0.2196444311 -0.0394582737 -0.0795646407
-0.2186157506 -0.0331775278 -0.0555194604
-0.1717571052 -0.0358965761 -0.0684162510
-0.2665030765 -0.0367392254 -0.0666678501
-0.1717571052 -0.0358965761 -0.0684162510
-0.1488421227 -0.0403964732 -0.0868872365
-0.1727857857 -0.0421773220 -0.0924614313
-0.0404944834 -0.0298803895 -0.0585082778
-0.2513296277 -0.0237832461 -0.0528288972
-0.0379020275 -0.0365733495 -0.0839140341
-0.0404944834 -0.0298803895 -0.0585082778
0.0024893924 -0.0319996250 -0.0718313642
-0.0808859034 -0.0344541140 -0.0705909477
0.0050818483 -0.0386925850 -0.0972371205
0.0024893924 -0.0319996250 -0.0718313642
0.0239813303 -0.0330592427 -0.0784929074
0.2032774614 0.0258753775 -0.0005659837
0.0906624019 0.0884624415 -0.0448871348
0.0906624019 0.0884624415 -0.0448871348
0.0138788374 0.0230033665 -0.0171876910
-0.0975475975 0.0199126318 -0.0260177312
-0.0973808251 0.0631506088 -0.0378056534
-0.0979767362 0.0256885407 -0.0306462804
-0.0651573664 0.0459210837 -0.0322558244
-0.1302001948 0.0429180658 -0.0361961095
-0.0645614554 0.0833831518 -0.0394151974
-0.0651573664 0.0459210837 -0.0322558244
-0.0323379967 0.0661536267 -0.0338653684
-0.0973808251 0.0631506088 -0.0378056534
-0.0964022390 0.1017567721 -0.0401447674
-0.1292216087 0.0815242291 -0.0385352234
-0.0645614554 0.0833831518 -0.0394151974
-0.1620409784 0.0612916861 -0.0369256794
-0.1302001948 0.0429180658 -0.0361961095
-0.1292216087 0.0815242291 -0.0385352234
-0.2550066215 0.0270507748 -0.0407196245
-0.2563593886 0.0450867575 -0.0392970520
-0.2556575396 0.0643794460 -0.0381241893
-0.2557228168 0.0786288076 -0.0435307992
-0.0970124394 0.1080247664 -0.0418537317
-0.0964022390 0.1017567721 -0.0401447674
0.2474656468 0.0083578037 -0.0707281176
0.2474253573 0.0166532906 -0.0681484428
0.2372368208 0.0310973391 -0.0592856545
0.2012453705 0.0433921775 -0.0565932454
0.2795714164 0.0315898819 -0.0592585807
0.1931727312 0.0739055221 -0.0526379254
0.0905190232 0.0755718334 -0.0833266660
0.0660076848 0.0808201297 -0.0703203204
0.0888943408 0.0799563102 -0.0569097159
-0.0415907243 0.0829149795 -0.0811287872
-0.0819137628 0.0859782911 -0.0657713343
-0.0831342597 0.0813382563 -0.0930361934
-0.1032957789 0.0828699121 -0.0853574669
-0.0403702274 0.0875550143 -0.0538639281
-0.0000471890 0.0844917027 -0.0692213810
-0.0819137628 0.0859782911 -0.0657713343
-0.0411807562 0.0705510732 -0.1100377933
-0.0373344111 0.0631518052 -0.1126796171
-0.0508592223 0.0226600083 -0.0613401173
-0.0495264718 0.0064737848 -0.0632090942
-0.0860297819 0.0113189017 -0.0612634435
0.1182663758 0.0555099464 -0.0830928129
0.1932276747 0.0481287079 -0.0398094765
0.1003191503 0.0353107278 -0.0850638460
0.0977258900 0.0287601080 -0.0596209084
0.0716016504 0.0313593452 -0.0724829304
0.0889593486 0.0886036843 -0.0543715684
-0.0588081426 0.1093788105 -0.0535133831
-0.0069861567 0.1078690285 -0.0520046686
-0.0604778840 0.0992334002 -0.0569223935
-0.2562420136 0.0956636880 -0.0600455074
-0.2648632841 -0.0000101664 -0.0528096712
-0.2204445437 0.0542497692 -0.0993796057
-0.1731831191 0.0494467247 -0.1024943108
-0.2198517791 0.0446702723 -0.0972202578
-0.2192554067 0.0718091676 -0.0990539392
-0.2560935815 0.0844407124 -0.0739429213
-0.2188238530 0.0385235532 -0.0731401578
-0.2198517791 0.0446702723 -0.0972202578
-0.1723727738 0.0415836167 -0.0893745869
-0.2663028584 0.0416102087 -0.0809858288
-0.1723727738 0.0415836167 -0.0893745869
-0.1481193081 0.0369669294 -0.0734117014
-0.1713448477 0.0354368977 -0.0652944869
-0.2458880110 0.0203791016 -0.0523198727
-0.3068990953 0.0143935314 -0.0497554011
-0.2186117102 0.0332145408 -0.0557052220
-0.0415187720 0.0360258215 -0.0827555154
-0.0389255116 0.0425764413 -0.1081984530
0.0032759496 0.0382675119 -0.0967717027
-0.0837202332 0.0403347509 -0.0941822657
0.0032759496 0.0382675119 -0.0967717027
0.0230800501 0.0328377372 -0.0783368587
0.0006826893 0.0317168920 -0.0713287651
0.2864746059 -0.0322298762 -0.0262784292
0.1977117170 -0.0302577422 -0.0110909869
0.0149046182 -0.0218839900 -0.0134683047
0.0149046182 -0.0218839900 -0.0134683047
-0.0989426258 -0.0178521666 -0.0228404216
-0.0972294591 -0.0424876535 -0.0315767428
-0.0979798530 -0.0255262135 -0.0305029983
-0.1301258885 -0.0325123384 -0.0330184398
-0.0970059666 -0.0641452401 -0.0326260474
-0.0972294591 -0.0424876535 -0.0315767428
-0.1290402557 -0.0819601583 -0.0356661412
-0.2370359062 -0.0130658178 -0.0338622019
-0.2374334079 -0.0075917295 -0.0333185731
-0.2561967678 -0.0271693925 -0.0401972226
-0.2556289015 -0.0470513446 -0.0374118031
-0.2563861725 -0.0702033990 -0.0405482035
-0.2560516910 -0.0876122995 -0.0430545075
-0.0970255835 -0.1079236248 -0.0412497177
-0.0962366752 -0.1073053280 -0.0325530629
0.2473805397 -0.0083320997 -0.0697690263
0.2483519504 -0.0235033912 -0.0645298817
0.2372776341 -0.0350872971 -0.0566811613
0.2385440884 -0.0549165174 -0.0552071292
0.1961872523 -0.0524430064 -0.0564521971
0.1931637352 -0.0739012310 -0.0522244540
0.0630569117 -0.0817219426 -0.0811465141
0.0982913697 -0.0779349986 -0.0565278610
0.0630569117 -0.0817219426 -0.0811465141
0.1198624125 -0.0735856596 -0.0808418859
-0.0387556744 -0.0832921466 -0.0798150605
-0.0817215970 -0.0816514203 -0.0921558754
-0.0805016554 -0.0861391373 -0.0648654625
-0.1019846167 -0.0853187742 -0.0710358699
-0.0399756160 -0.0788044295 -0.1071054734
0.0029903066 -0.0804451558 -0.0947646586
-0.0817215970 -0.0816514203 -0.0921558754
-0.0373421182 -0.0634549067 -0.1123255731
-0.0395246433 -0.0524456671 -0.1100652537
0.0867074887 -0.0083252832 -0.0666264619
-0.0505807567 -0.0161832818 -0.0621496560
-0.0872252680 -0.0242590802 -0.0597087586
-0.0492460378 -0.0000269450 -0.0641091101
0.1185959582 -0.0537564393 -0.0823159180
0.1935328792 -0.0529002679 -0.0354953934
0.1935564009 -0.0373728050 -0.0288289567
0.1650066341 -0.0616894200 -0.0371896318
0.0977223871 -0.0287830877 -0.0594599957
0.1169931555 -0.0358376609 -0.0842557987
0.0621515807 -0.0344804736 -0.0845444973
0.0905531162 -0.0900886353 -0.0529965772
-0.0971684267 -0.1079597570 -0.0529322194
-0.0403808838 -0.0875287048 -0.0533741768
-0.2480211575 -0.0161688200 -0.0526235233
-0.2648632841 -0.0000101664 -0.0528096712
-0.1859454684 -0.0242518493 -0.0549456923
-0.2198839707 -0.0544566681 -0.0990824001
-0.1729055555 -0.0496765192 -0.1022203110
-0.2204779060 -0.0640482399 -0.1011884394
-0.2192337250 -0.0799793080 -0.0961004662
-0.2190642078 -0.0820304842 -0.0821770937
-0.2662525518 -0.0830403793 -0.0710172954
-0.2192337250 -0.0799793080 -0.0961004662
-0.2190642078 -0.0820304842 -0.0821770937
-0.1706559221 -0.0855083062 -0.0660464791
-0.1718758637 -0.0810205891 -0.0933368919
-0.1476717209 -0.0827595001 -0.0852715847
-0.2178442661 -0.0865182012 -0.0548866808
-0.2662525518 -0.0830403793 -0.0710172954
-0.1706559221 -0.0855083062 -0.0660464791
-0.2196444311 -0.0394582737 -0.0795646407
-0.2198572265 -0.0448650431 -0.0969696363
-0.2665030765 -0.0367392254 -0.0666678501
-0.2518284186 -0.0284989530 -0.0531736276
-0.2518284186 -0.0284989530 -0.0531736276
-0.0379020275 -0.0365733495 -0.0839140341
-0.0389307080 -0.0428540954 -0.1079592144
-0.0819145839 -0.0407348599 -0.0946361280
0.0050818483 -0.0386925850 -0.0972371205
-0.0819145839 -0.0407348599 -0.0946361280
-0.1028921816 -0.0365348692 -0.0759519947
-0.0808859034 -0.0344541140 -0.0705909477
0.0171415556 -0.0730862480 -0.0340777063
0.0066967890 -0.0718603401 -0.0334581851
0.0061054417 -0.0343587662 -0.0265084068
-0.0323460410 -0.0660169776 -0.0334956380
0.2859641377 -0.0445250887 -0.0518792464
-0.2566799682 0.1004585474 -0.0439971768
-0.2280662644 0.0995409145 -0.0423480004
-0.2772511602 0.1089533958 -0.0277006469
-0.3883356124 0.1360340385 0.0475424218
-0.3565728837 0.1102332867 -0.0321670031
-0.3233184445 0.1314045453 0.0461723904
-0.3098977752 0.1323775409 0.0532467372
-0.3646801945 0.1393003288 0.0733114677
-0.2566921898 -0.1003498882 -0.0434354215
-0.2772644100 -0.1087514046 -0.0270916203
-0.2280783741 -0.0994263958 -0.0417914145
-0.3233344046 -0.1307835102 0.0469056112
-0.4017726939 -0.1344625757 0.0412213580
-0.3604099911 -0.1267237887 0.0140386498
-0.3625535493 -0.1326230429 0.0440634846
-0.3996291357 -0.1285633214 0.0111965232
-0.3646971075 -0.1385222972 0.0740883194
-0.4039162521 -0.1403618299 0.0712461928
-0.3625535493 -0.1326230429 0.0440634846
-0.3190472883 -0.1189850017 -0.0131440585
-0.2819717018 -0.1230447232 0.0197229030
-0.3211908465 -0.1248842559 0.0168807764
-0.2798281437 -0.1171454689 -0.0103019319
-0.3604099911 -0.1267237887 0.0140386498
-0.3582664329 -0.1208245344 -0.0159861851
-0.3211908465 -0.1248842559 0.0168807764
-0.3226460987 -0.1123322959 -0.0305355314
-0.3636646486 -0.1108454758 -0.0420733946
-0.3199308828 -0.1166012013 -0.0119192474
-0.3190472883 -0.1189850017 -0.0131440585
-0.3238700069 -0.1178591385 -0.0330239045
-0.2798281437 -0.1171454689 -0.0103019319
-0.3099138445 -0.1317179377 0.0539858587
-0.3199308828 -0.1166012013 -0.0119192474
-0.3545833055 -0.1248072021 0.0188035846
-0.3149223637 -0.1241595695 0.0210333056
-0.3595918247 -0.1172488339 -0.0141489685
-0.2752614218 -0.1235119369 0.0232630267
-0.2802699409 -0.1159535687 -0.0096895263
-0.3149223637 -0.1241595695 0.0210333056
-0.3892357283 -0.1330132029 0.0495264165
-0.3445662672 -0.1399239385 0.0847086906
-0.3495747864 -0.1323655703 0.0517561376
-0.3842272091 -0.1405715710 0.0824789695
-0.3545833055 -0.1248072021 0.0188035846
-0.3942442474 -0.1254548347 0.0165738635
-0.3495747864 -0.1323655703 0.0517561376
-0.3098977752 0.1323775409 0.0532467372
-0.3190327818 0.1192694757 -0.0138100796
-0.3536841971 0.1276517571 0.0168661711
-0.3144652785 0.1258235083 0.0197183288
-0.3582517004 0.1210977245 -0.0166622372
-0.2752463599 0.1239952595 0.0225704865
-0.2798138632 0.1174412269 -0.0109579219
-0.3144652785 0.1258235083 0.0197183288
-0.3883356124 0.1360340385 0.0475424218
-0.3445491904 0.1407598223 0.0839229878
-0.3491166938 0.1342057897 0.0503945795
-0.3837681090 0.1425880711 0.0810708302
-0.3536841971 0.1276517571 0.0168661711
-0.3929031157 0.1294800059 0.0140140134
-0.3491166938 0.1342057897 0.0503945795
-0.3199166681 0.1168928690 -0.0125721204
-0.3565728837 0.1102332867 -0.0321670031
-0.2772511602 0.1089533958 -0.0277006469
-0.2054728998 0.1122163362 -0.0365678690
-0.2006500369 0.1134530491 -0.0166945951
-0.3214597087 0.1152306762 -0.0316369507
-0.3618920907 0.1150395253 -0.0434025439
-0.3190327818 0.1192694757 -0.0138100796
-0.3214597087 0.1152306762 -0.0316369507
-0.2810273266 0.1154218272 -0.0198713574
-0.3262825715 0.1139939632 -0.0515102245
-0.3233184445 0.1314045453 0.0461723904
-0.4026401680 0.1326844362 0.0417060342
-0.3612784180 0.1247886526 0.0145669569
-0.3629793063 0.1320444907 0.0439392123
-0.4009392798 0.1254285981 0.0123337788
-0.3646801945 0.1393003288 0.0733114677
-0.4043410562 0.1399402743 0.0710782896
-0.3629793063 0.1320444907 0.0439392123
-0.3199166681 0.1168928690 -0.0125721204
-0.2819566945 0.1235087617 0.0190333131
-0.3216175563 0.1241487072 0.0168001350
-0.2802558063 0.1162529236 -0.0103389423
-0.3612784180 0.1247886526 0.0145669569
-0.3595775298 0.1175328145 -0.0148052985
-0.3216175563 0.1241487072 0.0168001350
-0.3233344046 -0.1307835102 0.0469056112
-0.3099138445 -0.1317179377 0.0539858587
-0.3646971075 -0.1385222972 0.0740883194
-0.3226460987 -0.1123322959 -0.0305355314
-0.2199804254 -0.1140267139 -0.0261115195
-0.3485265307 -0.1182896140 -0.0363883398
-0.3754324896 -0.1165376036 -0.0454570361
-0.3509529661 -0.1143503770 -0.0542370502
-0.3238700069 -0.1178591385 -0.0330239045
-0.3892357283 -0.1330132029 0.0495264165
-0.1878128700 0.1408103658 -0.0456698567
-0.2317918086 0.1411632229 -0.0482546517
-0.2058089489 0.2829216418 -0.0553086531
-0.2167847278 0.3306945395 -0.0566044175
-0.2416072009 0.2840175762 -0.0553637801
-0.1196513564 0.2480964793 -0.0588738179
-0.1358463178 0.1678870243 -0.0562955983
-0.1665553332 0.2086296004 -0.0585238281
-0.1277488371 0.2079917518 -0.0575847081
-0.1746528139 0.1685248729 -0.0572347183
-0.0889423409 0.2073539032 -0.0566455881
-0.0970398216 0.1672491757 -0.0553564783
-0.1277488371 0.2079917518 -0.0575847081
-0.1972643487 0.2493721765 -0.0607520579
-0.1503603719 0.2888390555 -0.0611020477
-0.1584578525 0.2487343279 -0.0598129379
-0.1891668680 0.2894769041 -0.0620411677
-0.1665553332 0.2086296004 -0.0585238281
-0.2053618293 0.2092674490 -0.0594629481
-0.1584578525 0.2487343279 -0.0598129379
-0.2280133161 0.1426828686 -0.0531152421
-0.0821214536 0.2188479919 -0.0555144251
-0.1315954205 0.2742148117 -0.0594223513
-0.0745491139 0.2205696231 -0.0538984590
-0.0821066365 -0.2188127238 -0.0508996775
-0.1315666166 -0.2741891995 -0.0528026123
-0.0745759609 -0.2205371535 -0.0526645176
-0.2279724999 -0.1426131952 -0.0475587569
-0.1195819192 -0.2480603714 -0.0493370119
-0.1357503890 -0.1678318996 -0.0458395569
-0.1664727278 -0.2085845514 -0.0485238245
-0.1276661541 -0.2079461355 -0.0475882844
-0.1745569627 -0.1684703155 -0.0467750970
-0.0888595804 -0.2073077195 -0.0466527443
-0.0969438153 -0.1671934836 -0.0449040168
-0.1276661541 -0.2079461355 -0.0475882844
-0.1971950665 -0.2493372033 -0.0512080921
-0.1503042579 -0.2888130232 -0.0520212795
-0.1583884928 -0.2486987873 -0.0502725520
-0.1891108316 -0.2894514392 -0.0529568196
-0.1664727278 -0.2085845514 -0.0485238245
-0.2052793015 -0.2092229674 -0.0494593646
-0.1583884928 -0.2486987873 -0.0502725520
-0.1879728480 -0.1407548470 -0.0565648298
-0.2059262969 -0.2829011845 -0.0605068720
-0.2169078920 -0.3306787003 -0.0615354062
-0.2417246819 -0.2839932375 -0.0605558617
-0.2318671680 -0.1410961877 -0.0522234825
-0.0745491139 0.2205696231 -0.0538984590
-0.0883884810 0.2195416786 -0.0511878987
-0.0288613169 0.1643419876 -0.0507985159
-0.0959193650 0.2178285341 -0.0494133714
-0.0883884810 0.2195416786 -0.0511878987
-0.1384529204 0.2737135696 -0.0529813310
-0.0970124394 0.1080247664 -0.0418537317
-0.0658169356 0.1229344859 -0.0430286280
-0.0984521124 0.1251390216 -0.0434431231
-0.0984521124 0.1251390216 -0.0434431231
-0.0665367721 0.1314916135 -0.0438233237
-0.1101998771 0.1395346688 -0.0437915641
-0.1357299541 0.1679111967 -0.0467786989
-0.1745364505 0.1685490452 -0.0477178452
-0.1878128700 0.1408103658 -0.0456698567
-0.1490063736 0.1401725173 -0.0447307104
-0.1101998771 0.1395346688 -0.0437915641
-0.0969234576 0.1672733482 -0.0458395526
-0.1490063736 0.1401725173 -0.0447307104
-0.2317918086 0.1411632229 -0.0482546517
-0.1443741916 0.2014400890 -0.0494842110
-0.1875028068 0.2188423837 -0.0517761133
-0.2219871845 0.2027157861 -0.0513625036
-0.1788585693 0.1853134914 -0.0490706012
-0.1357299541 0.1679111967 -0.0467786989
-0.1012455764 0.1840377943 -0.0471923086
-0.1745364505 0.1685490452 -0.0477178452
-0.1195517185 0.2481170524 -0.0507248484
-0.1750915702 0.2421808654 -0.0523964320
-0.1502690972 0.2888578288 -0.0536370694
-0.1780390230 0.2858897353 -0.0544728613
-0.1473216444 0.2451489589 -0.0515606402
-0.2058089489 0.2829216418 -0.0553086531
-0.2028614961 0.2392127719 -0.0532322238
-0.1780390230 0.2858897353 -0.0544728613
-0.1443741916 0.2014400890 -0.0494842110
-0.0888343398 0.2073762760 -0.0478126273
-0.1166042657 0.2044081825 -0.0486484191
-0.1012455764 0.1840377943 -0.0471923086
-0.1750915702 0.2421808654 -0.0523964320
-0.1875028068 0.2188423837 -0.0517761133
-0.1473216444 0.2451489589 -0.0515606402
-0.2348411054 0.3536900281 -0.0594029658
-0.2273102214 0.3554031726 -0.0611774931
-0.1226588800 0.1363776481 -0.0543577675
-0.1156564673 0.1082053057 -0.0527264142
-0.1575554760 0.1105116712 -0.0538187730
-0.0772586649 0.1199851113 -0.0524497321
-0.1680590950 0.1527701848 -0.0562658029
-0.1610566823 0.1245978424 -0.0546344496
-0.2064568974 0.1409903791 -0.0565424850
-0.1226588800 0.1363776481 -0.0543577675
-0.1358463178 0.1678870243 -0.0562955983
-0.0970398216 0.1672491757 -0.0553564783
-0.1680590950 0.1527701848 -0.0562658029
-0.0772586649 0.1199851113 -0.0524497321
-0.0904461027 0.1514944876 -0.0543875629
-0.0450458877 0.1351019509 -0.0524795275
-0.2330626006 0.2504681109 -0.0608071849
-0.2070659940 0.2900248713 -0.0620687312
-0.2428642460 0.2911208057 -0.0621238582
-0.2168676393 0.3306775660 -0.0633854045
-0.1972643487 0.2493721765 -0.0607520579
-0.2232609553 0.2098154162 -0.0594905116
-0.2070659940 0.2900248713 -0.0620687312
-0.2280133161 0.1426828686 -0.0531152421
-0.2273102214 0.3554031726 -0.0611774931
-0.2255678121 0.3325513037 -0.0603915561
-0.2580029782 0.3665923119 -0.0617170670
-0.2273102214 0.3554031726 -0.0611774931
-0.0821214536 0.2188479919 -0.0555144251
-0.0326474867 0.1634811720 -0.0516064990
-0.1196513564 0.2480964793 -0.0588738179
-0.0821066365 -0.2188127238 -0.0508996775
-0.0326466564 -0.1634362482 -0.0489967427
-0.1195819192 -0.2480603714 -0.0493370119
-0.1225591151 -0.1363136415 -0.0440780267
-0.1155532728 -0.1081330216 -0.0426043250
-0.1574525623 -0.1104402566 -0.0436837793
-0.0771569044 -0.1199160965 -0.0422617215
-0.1679613257 -0.1527111865 -0.0458943319
-0.1609554834 -0.1245305665 -0.0444206302
-0.2063576941 -0.1409281115 -0.0462369354
-0.1225591151 -0.1363136415 -0.0440780267
-0.1357503890 -0.1678318996 -0.0458395569
-0.0969438153 -0.1671934836 -0.0449040168
-0.1679613257 -0.1527111865 -0.0458943319
-0.0771569044 -0.1199160965 -0.0422617215
-0.0903481784 -0.1514343546 -0.0440232517
-0.0449459677 -0.1350368096 -0.0422069465
-0.2279724999 -0.1426131952 -0.0475587569
-0.2329934515 -0.2504292563 -0.0512570819
-0.2070100241 -0.2899974657 -0.0529813145
-0.2428084090 -0.2910895186 -0.0530303043
-0.2168249816 -0.3306577281 -0.0547545369
-0.1971950665 -0.2493372033 -0.0512080921
-0.2231784939 -0.2097689939 -0.0494838595
-0.2070100241 -0.2899974657 -0.0529813145
-0.2565567197 -0.3565626901 -0.0601033859
-0.2256082919 -0.3325353069 -0.0585311228
-0.2397685124 -0.3497274327 -0.0604603026
-0.1957867686 -0.3327749207 -0.0583831751
-0.0971684267 -0.1079597570 -0.0529322194
-0.0659614982 -0.1228759204 -0.0529408150
-0.0986101830 -0.1250818061 -0.0544258012
-0.0986101830 -0.1250818061 -0.0544258012
-0.0666823764 -0.1314369449 -0.0536876059
-0.1103597007 -0.1394780150 -0.0546937496
-0.1358667524 -0.1678613337 -0.0553563874
-0.1746733260 -0.1684997496 -0.0562919276
-0.1879728480 -0.1407548470 -0.0565648298
-0.1491662744 -0.1401164310 -0.0556292897
-0.1103597007 -0.1394780150 -0.0546937496
-0.0970601787 -0.1672229177 -0.0544208473
-0.1491662744 -0.1401164310 -0.0556292897
-0.1444983459 -0.2014001117 -0.0565063173
-0.1876207163 -0.2188079167 -0.0580168224
-0.2221114932 -0.2026769437 -0.0583773976
-0.1789891228 -0.1852691387 -0.0568668925
-0.1358667524 -0.1678613337 -0.0553563874
-0.1013759754 -0.1839923067 -0.0549958123
-0.1746733260 -0.1684997496 -0.0562919276
-0.1196815560 -0.2480855745 -0.0574858618
-0.1752123214 -0.2421506481 -0.0585065946
-0.1503955316 -0.2888361109 -0.0594861392
-0.1781609142 -0.2858686477 -0.0599965056
-0.1474469387 -0.2451181113 -0.0579962282
-0.2059262969 -0.2829011845 -0.0605068720
-0.2029777041 -0.2391831849 -0.0590169611
-0.1781609142 -0.2858686477 -0.0599965056
-0.1444983459 -0.2014001117 -0.0565063173
-0.0889675805 -0.2073350381 -0.0554855845
-0.1167329632 -0.2043675749 -0.0559959509
-0.1013759754 -0.1839923067 -0.0549958123
-0.1752123214 -0.2421506481 -0.0585065946
-0.1876207163 -0.2188079167 -0.0580168224
-0.1474469387 -0.2451181113 -0.0579962282
-0.2318671680 -0.1410961877 -0.0522234825
-0.2349256137 -0.3536768157 -0.0608147787
-0.2349256137 -0.3536768157 -0.0608147787
-0.2618336671 -0.3657218998 -0.0604789598
-0.2331804227 -0.3308213634 -0.0601567174
-0.0745759609 -0.2205371535 -0.0526645176
-0.1003599076 -0.2354033091 -0.0555923189
-0.0288813186 -0.1642984630 -0.0498791627
-0.1079320384 -0.2336893656 -0.0572179135
3 176 317 201
3 317 35 160
3 218 373 169
3 119 317 176
3 328 136 99
3 11 176 26
3 11 169 176
3 169 373 328
3 99 35 317
3 243 51 163
3 35 243 318
3 186 226 404
3 243 341 367
3 136 312 341
3 163 51 404
3 51 367 404
3 186 367 341
3 35 99 341
3 201 26 176
3 160 201 317
3 169 410 218
3 11 410 169
3 176 169 119
3 99 119 328
3 328 119 169
3 317 119 99
3 163 318 243
3 318 160 35
3 367 411 404
3 186 411 367
3 367 51 243
3 341 99 136
3 341 312 186
3 341 243 35
3 289 413 412
3 207 413 289
3 412 414 143
3 207 414 412
3 316 416 375
3 415 416 316
3 415 417 256
3 316 417 415
3 289 420 207
3 419 420 289
3 419 421 418
3 289 421 419
3 422 423 418
3 316 423 422
3 418 424 422
3 289 424 418
3 143 78 139
3 426 427 425
3 12 427 426
3 426 428 183
3 425 428 426
3 429 430 425
3 100 430 429
3 429 431 12
3 425 431 429
3 100 432 183
3 44 432 100
3 433 434 195
3 79 434 433
3 195 435 433
3 257 435 195
3 12 257 195
3 143 139 375
3 438 439 437
3 436 439 438
3 438 440 143
3 437 440 438
3 441 442 437
3 256 442 441
3 441 443 436
3 437 443 441
3 445 446 444
3 436 446 445
3 445 447 375
3 444 447 445
3 448 449 444
3 143 449 448
3 448 450 436
3 444 450 448
3 256 451 143
3 289 451 256
3 256 452 289
3 316 452 256
3 316 78 143
3 143 455 454
3 453 455 143
3 454 456 316
3 453 456 454
3 457 458 453
3 207 458 457
3 453 459 457
3 143 459 453
3 195 461 12
3 460 461 195
3 460 462 79
3 195 462 460
3 44 464 79
3 463 464 44
3 463 465 12
3 44 465 463
3 100 466 44
3 12 466 100
3 467 468 178
3 44 468 467
3 178 469 467
3 183 469 178
3 470 472 257
3 471 472 470
3 471 473 44
3 470 473 471
3 474 475 257
3 470 475 474
3 474 476 178
3 257 476 474
3 477 478 44
3 257 478 477
3 44 479 477
3 79 479 44
3 49 20 161
3 43 223 152
3 16 217 72
3 228 209 72
3 209 228 244
3 103 409 64
3 13 152 223
3 62 409 103
3 16 115 43
3 62 54 41
3 43 296 403
3 115 278 296
3 72 334 278
3 209 101 334
3 64 106 101
3 409 41 106
3 62 223 403
3 106 277 170
3 41 95 277
3 54 49 95
3 403 20 49
3 296 161 20
3 278 126 161
3 334 69 126
3 101 170 69
3 361 86 145
3 175 399 7
3 174 374 313
3 94 235 174
3 235 94 53
3 333 395 396
3 87 127 48
3 333 48 127
3 313 374 7
3 45 48 333
3 408 399 175
3 397 313 399
3 144 80 313
3 348 94 80
3 283 53 94
3 281 333 53
3 175 48 45
3 347 283 348
3 85 281 283
3 61 45 281
3 279 234 45
3 294 408 234
3 145 397 408
3 86 144 397
3 361 348 144
3 161 126 69
3 161 69 170
3 161 170 277
3 161 277 95
3 161 95 49
3 152 131 43
3 72 115 16
3 72 217 228
3 244 64 209
3 64 244 103
3 223 62 13
3 103 13 62
3 43 131 16
3 41 409 62
3 403 223 43
3 296 43 115
3 278 115 72
3 334 72 209
3 101 209 64
3 106 64 409
3 403 54 62
3 170 101 106
3 277 106 41
3 95 41 54
3 49 54 403
3 20 403 296
3 161 296 278
3 126 278 334
3 69 334 101
3 145 294 279
3 145 279 61
3 145 61 85
3 145 85 347
3 145 347 361
3 7 87 175
3 313 80 174
3 174 80 94
3 53 396 235
3 396 53 333
3 48 175 87
3 127 395 333
3 7 399 313
3 333 281 45
3 175 234 408
3 399 408 397
3 313 397 144
3 80 144 348
3 94 348 283
3 53 283 281
3 45 234 175
3 348 361 347
3 283 347 85
3 281 85 61
3 45 61 279
3 234 279 294
3 408 294 145
3 397 145 86
3 144 86 361
3 337 480 130
3 199 480 337
3 184 481 337
3 360 481 184
3 285 482 150
3 199 482 285
3 199 483 113
3 360 483 199
3 189 484 260
3 138 484 189
3 203 485 138
3 298 485 203
3 261 486 189
3 137 486 261
3 203 487 297
3 137 487 203
3 285 488 199
3 130 488 285
3 199 489 360
3 337 489 199
3 113 490 199
3 150 490 113
3 389 491 360
3 113 491 389
3 203 492 189
3 138 492 203
3 298 493 205
3 203 493 298
3 203 494 137
3 189 494 203
3 297 495 203
3 205 495 297
3 14 219 264
3 264 273 173
3 273 264 366
3 366 264 219
3 219 208 366
3 208 250 323
3 250 77 346
3 250 93 4
3 250 208 265
3 265 208 219
3 273 268 231
3 201 160 34
3 273 323 346
3 392 346 357
3 357 233 26
3 392 268 346
3 231 268 392
3 219 134 321
3 134 305 225
3 305 224 42
3 42 224 324
3 324 29 42
3 42 29 17
3 219 321 265
3 93 265 321
3 225 42 17
3 77 46 357
3 66 496 46
3 233 496 66
3 30 497 47
3 66 497 30
3 4 168 46
3 46 168 66
3 369 112 24
3 238 172 68
3 47 238 255
3 238 68 322
3 211 0 182
3 24 112 123
3 112 369 90
3 22 222 90
3 81 286 222
3 140 378 286
3 114 280 378
3 66 368 47
3 233 11 26
3 30 218 11
3 182 242 379
3 30 255 218
3 373 245 328
3 245 104 136
3 255 245 373
3 379 104 245
3 210 498 23
3 0 498 210
3 232 114 84
3 340 252 23
3 33 239 252
3 252 239 370
3 252 370 58
3 58 339 23
3 339 73 210
3 210 3 242
3 73 499 210
3 109 499 73
3 198 500 58
3 73 500 198
3 128 501 370
3 198 501 128
3 284 502 239
3 128 502 284
3 215 503 33
3 284 503 215
3 56 213 18
3 56 504 213
3 340 504 56
3 251 55 362
3 275 505 407
3 17 505 275
3 117 506 275
3 204 506 117
3 204 4 17
3 4 204 92
3 117 508 507
3 91 508 117
3 507 509 393
3 91 509 507
3 91 151 282
3 91 6 65
3 511 512 10
3 510 512 511
3 65 513 10
3 511 513 65
3 514 515 510
3 351 515 514
3 514 516 65
3 510 516 514
3 65 517 343
3 359 517 65
3 107 519 359
3 518 519 107
3 518 520 108
3 107 520 518
3 359 358 107
3 6 359 65
3 301 521 110
3 275 521 301
3 275 522 110
3 407 522 275
3 110 523 142
3 25 523 110
3 254 142 188
3 358 359 6
3 117 524 91
3 358 524 117
3 109 73 125
3 198 402 401
3 24 525 282
3 393 525 24
3 526 527 24
3 393 527 526
3 368 528 24
3 526 528 368
3 107 358 117
3 282 151 10
3 529 530 342
3 10 530 529
3 342 531 529
3 21 531 342
3 316 327 200
3 241 284 362
3 216 253 385
3 247 216 125
3 248 247 401
3 188 533 254
3 532 533 188
3 532 534 216
3 188 534 532
3 402 198 1
3 78 179 251
3 179 154 55
3 78 316 241
3 372 21 342
3 319 372 327
3 342 200 327
3 398 536 314
3 535 536 398
3 535 537 343
3 398 537 535
3 159 538 398
3 351 538 159
3 540 541 342
3 539 541 540
3 351 542 342
3 540 542 351
3 543 544 539
3 159 544 543
3 543 545 351
3 539 545 543
3 546 547 1
3 254 547 546
3 314 548 1
3 546 548 314
3 110 549 301
3 254 549 110
3 247 248 1
3 551 552 550
3 254 552 551
3 551 553 301
3 550 553 551
3 554 555 254
3 550 555 554
3 108 556 254
3 554 556 108
3 232 557 280
3 197 557 232
3 558 559 0
3 18 559 558
3 558 560 211
3 0 560 558
3 128 228 217
3 284 244 228
3 241 103 244
3 159 13 103
3 398 152 13
3 314 131 152
3 1 16 131
3 198 217 16
3 172 238 47
3 123 90 172
3 168 4 92
3 362 55 154
3 393 561 92
3 66 561 393
3 280 211 68
3 201 354 185
3 354 201 212
3 354 212 135
3 26 185 135
3 82 219 14
3 376 82 14
3 82 376 15
3 219 82 147
3 147 98 219
3 363 98 147
3 350 363 15
3 311 363 350
3 98 363 311
3 219 98 146
3 376 173 34
3 160 390 59
3 15 376 122
3 291 380 406
3 27 344 406
3 291 122 380
3 59 390 406
3 329 134 219
3 305 134 329
3 224 305 120
3 324 224 124
3 124 29 324
3 302 29 124
3 146 329 219
3 146 311 120
3 120 311 214
3 129 350 291
3 190 129 344
3 562 563 190
3 338 563 562
3 190 564 562
3 27 564 190
3 287 214 350
3 190 287 129
3 300 565 70
3 272 565 300
3 2 310 394
3 394 338 240
3 2 394 330
3 118 2 194
3 71 249 353
3 227 71 206
3 116 158 227
3 32 349 158
3 345 293 349
3 288 70 293
3 338 353 190
3 163 404 27
3 226 240 27
3 242 36 194
3 226 330 240
3 312 5 186
3 104 5 312
3 5 330 226
3 379 194 330
3 156 566 405
3 36 566 156
3 300 70 67
3 568 569 567
3 96 569 568
3 568 570 187
3 567 570 568
3 571 572 156
3 96 572 571
3 571 573 567
3 156 573 571
3 141 166 187
3 50 141 19
3 299 50 19
3 191 299 19
3 371 191 405
3 3 220 36
3 371 220 3
3 191 574 299
3 102 574 191
3 50 575 391
3 299 575 50
3 141 576 270
3 50 576 141
3 166 577 177
3 141 577 166
3 111 578 355
3 132 578 111
3 111 355 96
3 306 177 270
3 407 579 60
3 29 579 407
3 37 580 302
3 60 580 37
3 302 214 274
3 292 274 214
3 37 274 292
3 326 377 153
3 377 326 295
3 352 583 582
3 295 583 352
3 582 584 581
3 295 584 582
3 585 586 581
3 31 586 585
3 585 587 295
3 581 587 585
3 352 588 400
3 382 588 352
3 589 590 167
3 332 590 589
3 167 591 589
3 400 591 167
3 167 229 400
3 352 400 76
3 60 592 237
3 37 592 60
3 60 237 25
3 237 593 25
3 309 593 237
3 188 142 309
3 76 400 229
3 377 594 37
3 76 594 377
3 371 109 385
3 102 371 9
3 249 595 153
3 272 595 249
3 153 596 249
3 190 596 153
3 229 167 105
3 326 272 300
3 300 67 97
3 178 597 165
3 269 597 178
3 270 269 386
3 253 8 9
3 8 388 387
3 388 383 384
3 8 598 309
3 253 598 8
3 102 384 383
3 307 257 12
3 335 307 306
3 307 335 386
3 133 181 165
3 230 183 178
3 165 38 31
3 331 600 599
3 75 600 331
3 599 601 74
3 75 601 599
3 331 602 381
3 332 602 331
3 31 38 269
3 604 605 603
3 309 605 604
3 604 606 148
3 603 606 604
3 309 608 607
3 74 608 309
3 607 609 603
3 74 609 607
3 237 610 309
3 105 610 237
3 8 611 388
3 309 611 8
3 613 614 612
3 105 614 613
3 613 615 309
3 612 615 613
3 616 617 105
3 612 617 616
3 167 618 105
3 616 618 167
3 171 67 70
3 96 171 288
3 235 391 102
3 396 270 391
3 395 269 270
3 127 381 269
3 87 331 381
3 7 75 331
3 374 148 75
3 174 102 148
3 338 394 310
3 206 353 338
3 292 214 287
3 336 193 386
3 153 292 287
3 116 246 310
3 308 318 163
3 390 318 308
3 390 308 83
3 406 83 163
3 173 14 264
3 366 323 273
3 323 366 208
3 346 323 250
3 4 77 250
3 265 93 250
3 231 34 173
3 231 173 273
3 34 231 212
3 34 212 201
3 346 268 273
3 357 135 392
3 26 135 357
3 392 135 212
3 392 212 231
3 225 321 134
3 42 225 305
3 321 225 93
3 17 4 93
3 17 93 225
3 357 346 77
3 233 357 46
3 66 619 233
3 30 619 66
3 46 77 4
3 282 620 24
3 84 620 282
3 114 621 84
3 24 621 114
3 24 114 140
3 24 140 81
3 24 81 22
3 24 22 369
3 255 30 47
3 322 255 238
3 322 622 182
3 68 622 322
3 182 68 211
3 123 368 24
3 90 123 112
3 90 369 22
3 222 22 81
3 286 81 140
3 378 140 114
3 11 233 30
3 379 322 182
3 136 328 245
3 373 218 255
3 245 255 322
3 245 322 379
3 182 623 210
3 0 623 182
3 625 626 624
3 0 626 625
3 625 627 23
3 624 627 625
3 628 629 0
3 624 629 628
3 628 630 18
3 0 630 628
3 632 633 631
3 340 633 632
3 632 634 18
3 631 634 632
3 635 636 631
3 23 636 635
3 635 637 340
3 631 637 635
3 252 340 33
3 23 252 58
3 210 23 339
3 242 182 210
3 109 3 210
3 339 638 73
3 58 638 339
3 58 639 198
3 370 639 58
3 370 640 128
3 239 640 370
3 33 641 239
3 284 641 33
3 56 642 325
3 18 642 56
3 213 643 18
3 340 643 213
3 362 284 215
3 362 215 251
3 29 644 17
3 407 644 29
3 204 645 275
3 17 645 204
3 393 92 204
3 646 647 393
3 117 647 646
3 393 648 646
3 204 648 393
3 91 649 393
3 282 649 91
3 65 651 650
3 10 651 65
3 650 652 151
3 10 652 650
3 65 151 91
3 654 655 351
3 653 655 654
3 342 656 351
3 654 656 342
3 657 658 653
3 10 658 657
3 657 659 342
3 653 659 657
3 351 660 343
3 65 660 351
3 108 661 359
3 343 661 108
3 301 117 275
3 407 25 110
3 662 663 142
3 110 663 662
3 254 664 142
3 662 664 254
3 6 665 358
3 91 665 6
3 125 385 109
3 401 125 73
3 401 73 198
3 66 666 368
3 393 666 66
3 667 668 301
3 117 668 667
3 107 669 301
3 667 669 107
3 84 670 10
3 282 670 84
3 21 290 232
3 21 232 84
3 10 672 84
3 671 672 10
3 671 673 21
3 10 673 671
3 241 674 200
3 316 674 241
3 362 271 241
3 385 125 216
3 125 401 247
3 401 402 248
3 216 675 253
3 188 675 216
3 1 248 402
3 251 139 78
3 55 251 179
3 241 271 154
3 241 154 179
3 241 179 78
3 342 327 372
3 327 316 375
3 327 375 319
3 343 677 676
3 108 677 343
3 676 678 314
3 108 678 676
3 343 679 351
3 398 679 343
3 241 680 159
3 200 680 241
3 159 200 342
3 682 683 681
3 108 683 682
3 682 684 314
3 681 684 682
3 108 686 685
3 254 686 108
3 685 687 681
3 254 687 685
3 1 689 216
3 688 689 1
3 688 690 254
3 1 690 688
3 1 216 247
3 692 693 691
3 107 693 692
3 692 694 108
3 691 694 692
3 107 696 695
3 301 696 107
3 695 697 691
3 301 697 695
3 280 114 232
3 211 280 197
3 211 197 18
3 217 198 128
3 228 128 284
3 244 284 241
3 103 241 159
3 13 159 398
3 152 398 314
3 131 314 1
3 16 1 198
3 172 47 368
3 172 368 123
3 154 271 362
3 66 168 92
3 68 172 90
3 68 90 222
3 68 222 286
3 68 286 378
3 68 378 280
3 185 26 201
3 135 185 354
3 14 173 376
3 15 147 82
3 147 15 363
3 15 291 350
3 350 214 311
3 311 146 98
3 34 59 122
3 34 122 376
3 59 34 160
3 160 318 390
3 122 291 15
3 406 344 291
3 406 163 27
3 406 380 122
3 406 122 59
3 329 120 305
3 120 124 224
3 120 329 146
3 214 302 124
3 214 124 120
3 291 344 129
3 27 698 344
3 190 698 27
3 240 699 27
3 338 699 240
3 350 129 287
3 272 249 71
3 272 71 227
3 272 227 158
3 272 158 349
3 272 349 293
3 272 293 70
3 240 330 394
3 330 194 2
3 36 700 194
3 156 700 36
3 118 701 156
3 194 701 118
3 353 206 71
3 206 246 227
3 227 246 116
3 158 116 32
3 349 32 345
3 293 345 288
3 27 404 226
3 194 379 242
3 312 136 104
3 226 186 5
3 330 5 104
3 330 104 379
3 220 702 36
3 405 702 220
3 703 704 405
3 156 704 703
3 19 705 405
3 703 705 19
3 706 707 19
3 156 707 706
3 19 708 706
3 187 708 19
3 187 19 141
3 19 405 191
3 405 709 371
3 220 709 405
3 36 242 3
3 109 710 3
3 371 710 109
3 371 711 191
3 102 711 371
3 102 712 299
3 391 712 102
3 391 713 50
3 270 713 391
3 270 714 141
3 177 714 270
3 355 715 96
3 132 715 355
3 187 716 96
3 111 716 187
3 270 193 336
3 270 336 306
3 302 717 29
3 60 717 302
3 274 718 302
3 37 718 274
3 292 153 377
3 719 720 377
3 292 720 719
3 37 721 377
3 719 721 37
3 326 722 272
3 153 722 326
3 352 723 295
3 76 723 352
3 724 725 76
3 295 725 724
3 724 726 377
3 76 726 724
3 728 729 31
3 727 729 728
3 382 730 31
3 728 730 382
3 731 732 727
3 352 732 731
3 731 733 382
3 727 733 731
3 382 734 400
3 332 734 382
3 74 735 332
3 167 735 74
3 37 105 237
3 407 736 25
3 60 736 407
3 142 738 309
3 737 738 142
3 737 739 25
3 142 739 737
3 229 740 76
3 37 740 229
3 385 9 371
3 9 387 384
3 9 384 102
3 741 742 353
3 190 742 741
3 353 743 741
3 249 743 353
3 744 745 229
3 37 745 744
3 744 746 105
3 229 746 744
3 295 747 300
3 326 747 295
3 31 748 133
3 97 748 31
3 97 749 295
3 31 749 97
3 97 295 300
3 269 38 165
3 386 193 270
3 9 385 253
3 387 9 8
3 384 387 388
3 750 751 188
3 253 751 750
3 188 752 750
3 309 752 188
3 383 148 102
3 12 306 307
3 306 336 335
3 386 269 178
3 386 178 257
3 386 257 307
3 165 31 133
3 178 165 181
3 178 181 230
3 332 754 74
3 753 754 332
3 753 755 331
3 332 755 753
3 332 756 381
3 382 756 332
3 381 758 269
3 757 758 381
3 757 759 382
3 381 759 757
3 761 762 382
3 760 762 761
3 31 763 382
3 761 763 31
3 764 765 760
3 269 765 764
3 764 766 31
3 760 766 764
3 767 768 75
3 74 768 767
3 75 769 767
3 148 769 75
3 148 770 309
3 383 770 148
3 388 771 383
3 309 771 388
3 773 774 772
3 74 774 773
3 773 775 167
3 772 775 773
3 74 777 776
3 309 777 74
3 776 778 772
3 309 778 776
3 70 779 171
3 288 779 70
3 288 118 156
3 780 781 156
3 288 781 780
3 780 782 96
3 156 782 780
3 102 174 235
3 391 235 396
3 270 396 395
3 269 395 127
3 381 127 87
3 331 87 7
3 75 7 374
3 148 374 174
3 338 310 246
3 338 246 206
3 386 335 336
3 190 783 287
3 153 783 190
3 310 2 118
3 310 118 288
3 310 288 345
3 310 345 32
3 310 32 116
3 163 83 308
3 83 406 390
3 39 785 33
3 784 785 39
3 784 786 215
3 39 786 784
3 88 787 364
3 236 787 88
3 251 788 28
3 215 788 251
3 88 364 28
3 364 139 251
3 325 356 319
3 33 340 56
3 319 375 139
3 789 790 236
3 39 790 789
3 236 791 789
3 88 791 236
3 792 793 320
3 177 793 792
3 320 794 792
3 166 794 320
3 797 798 796
3 795 798 797
3 797 799 121
3 796 799 797
3 800 801 796
3 57 801 800
3 800 802 795
3 796 802 800
3 804 805 803
3 795 805 804
3 804 806 320
3 803 806 804
3 807 808 803
3 121 808 807
3 807 809 795
3 803 809 807
3 202 811 306
3 810 811 202
3 810 812 320
3 202 812 810
3 202 121 57
3 12 121 202
3 132 111 320
3 187 166 320
3 813 814 230
3 121 814 813
3 230 815 813
3 320 815 230
3 818 819 817
3 816 819 818
3 818 820 202
3 817 820 818
3 821 822 817
3 320 822 821
3 821 823 816
3 817 823 821
3 825 826 824
3 816 826 825
3 825 827 221
3 824 827 825
3 828 829 824
3 202 829 828
3 828 830 816
3 824 830 828
3 833 834 832
3 831 834 833
3 833 835 364
3 832 835 833
3 836 837 832
3 39 837 836
3 836 838 831
3 832 838 836
3 840 841 839
3 831 841 840
3 840 842 236
3 839 842 840
3 843 844 839
3 364 844 843
3 843 845 831
3 839 845 843
3 846 847 215
3 28 847 846
3 846 848 39
3 215 848 846
3 251 28 364
3 39 849 319
3 56 849 39
3 319 56 325
3 33 850 39
3 56 850 33
3 364 852 139
3 851 852 364
3 851 853 39
3 364 853 851
3 319 855 39
3 854 855 319
3 854 856 139
3 319 856 854
3 859 860 858
3 857 860 859
3 859 861 28
3 858 861 859
3 862 863 858
3 88 863 862
3 862 864 857
3 858 864 862
3 866 867 865
3 857 867 866
3 866 868 39
3 865 868 866
3 869 870 865
3 28 870 869
3 869 871 857
3 865 871 869
3 872 873 221
3 320 873 872
3 221 874 872
3 57 874 221
3 177 875 320
3 306 875 177
3 202 306 12
3 230 876 320
3 180 876 230
3 320 180 132
3 320 111 187
3 121 878 877
3 12 878 121
3 877 879 183
3 12 879 877
3 183 880 121
3 230 880 183
3 57 881 202
3 221 881 57
3 149 196 197
3 197 196 18
3 356 882 130
3 325 882 356
3 285 883 130
3 319 883 285
3 884 885 184
3 262 885 884
3 884 886 337
3 184 886 884
3 276 263 315
3 162 365 290
3 889 890 888
3 887 890 889
3 889 891 150
3 888 891 889
3 892 893 888
3 162 893 892
3 892 894 887
3 888 894 892
3 896 897 895
3 887 897 896
3 896 898 52
3 895 898 896
3 899 900 895
3 150 900 899
3 899 901 887
3 895 901 899
3 365 232 290
3 319 902 372
3 285 902 319
3 276 155 192
3 192 904 52
3 903 904 192
3 903 905 232
3 192 905 903
3 164 907 259
3 906 907 164
3 906 908 67
3 164 908 906
3 96 266 171
3 303 266 96
3 260 909 189
3 180 909 260
3 912 913 911
3 910 913 912
3 912 914 260
3 911 914 912
3 915 916 911
3 303 916 915
3 915 917 910
3 911 917 915
3 919 920 918
3 910 920 919
3 919 921 259
3 918 921 919
3 922 923 918
3 260 923 922
3 922 924 910
3 918 924 922
3 259 298 205
3 181 925 261
3 133 925 181
3 926 927 297
3 258 927 926
3 926 928 137
3 297 928 926
3 97 67 267
3 181 929 230
3 261 929 181
3 205 297 258
3 258 304 267
3 930 931 197
3 192 931 930
3 197 932 930
3 232 932 197
3 933 934 192
3 197 934 933
3 192 935 933
3 262 935 192
3 197 262 149
3 18 937 936
3 196 937 18
3 936 938 325
3 196 938 936
3 149 940 196
3 939 940 149
3 939 941 325
3 149 941 939
3 943 944 325
3 130 944 943
3 943 945 942
3 325 945 943
3 946 947 942
3 149 947 946
3 946 948 325
3 942 948 946
3 356 949 319
3 130 949 356
3 951 952 130
3 337 952 951
3 951 953 950
3 130 953 951
3 954 955 950
3 149 955 954
3 950 956 954
3 130 956 950
3 959 960 958
3 262 960 959
3 959 961 957
3 958 961 959
3 962 963 958
3 337 963 962
3 962 964 262
3 958 964 962
3 957 967 966
3 965 967 957
3 966 968 149
3 965 968 966
3 969 970 965
3 337 970 969
3 965 971 969
3 957 971 965
3 315 360 184
3 184 972 315
3 262 972 184
3 315 262 192
3 155 973 192
3 315 973 155
3 315 155 276
3 290 21 372
3 974 976 372
3 975 976 974
3 975 977 290
3 974 977 975
3 978 979 372
3 974 979 978
3 978 980 150
3 372 980 978
3 981 983 162
3 982 983 981
3 982 984 150
3 981 984 982
3 985 986 162
3 981 986 985
3 985 987 290
3 162 987 985
3 150 113 389
3 989 990 389
3 988 990 989
3 989 991 52
3 389 991 989
3 992 993 988
3 150 993 992
3 992 994 52
3 988 994 992
3 150 995 285
3 372 995 150
3 192 52 389
3 192 389 360
3 996 997 360
3 192 997 996
3 360 998 996
3 315 998 360
3 263 999 315
3 192 999 263
3 192 263 276
3 232 365 162
3 162 1001 232
3 1000 1001 162
3 1000 1002 52
3 162 1002 1000
3 67 171 266
3 67 266 303
3 303 1004 67
3 1003 1004 303
3 1003 1005 259
3 303 1005 1003
3 96 132 180
3 1006 1008 180
3 1007 1008 1006
3 1007 1009 96
3 1006 1009 1007
3 1010 1011 180
3 1006 1011 1010
3 1010 1012 260
3 180 1012 1010
3 1013 1015 303
3 1014 1015 1013
3 1014 1016 260
3 1013 1016 1014
3 1017 1018 303
3 1013 1018 1017
3 1017 1019 96
3 303 1019 1017
3 230 1020 180
3 189 1020 230
3 260 138 298
3 1022 1023 298
3 1021 1023 1022
3 1022 1024 259
3 298 1024 1022
3 1025 1026 1021
3 260 1026 1025
3 1025 1027 259
3 1021 1027 1025
3 40 1028 205
3 63 1028 40
3 205 63 89
3 205 89 157
3 1029 1030 157
3 205 1030 1029
3 157 1031 1029
3 164 1031 157
3 205 164 259
3 97 1033 1032
3 267 1033 97
3 1032 1034 133
3 267 1034 1032
3 304 1036 267
3 1035 1036 304
3 1035 1037 133
3 304 1037 1035
3 1039 1040 133
3 261 1040 1039
3 1039 1041 1038
3 133 1041 1039
3 1042 1043 1038
3 304 1043 1042
3 1042 1044 133
3 1038 1044 1042
3 1046 1047 261
3 137 1047 1046
3 1046 1048 1045
3 261 1048 1046
3 1049 1050 1045
3 304 1050 1049
3 1045 1051 1049
3 261 1051 1045
3 1054 1055 1053
3 258 1055 1054
3 1054 1056 1052
3 1053 1056 1054
3 1057 1058 1053
3 137 1058 1057
3 1057 1059 258
3 1053 1059 1057
3 1052 1062 1061
3 1060 1062 1052
3 1061 1063 304
3 1060 1063 1061
3 1064 1065 1060
3 137 1065 1064
3 1060 1066 1064
3 1052 1066 1060
3 189 1067 261
3 230 1067 189
3 258 164 157
3 258 157 89
3 258 89 63
3 63 1068 258
3 40 1068 63
3 205 1070 40
3 1069 1070 205
3 1069 1071 258
3 205 1071 1069
3 1072 1073 267
3 164 1073 1072
3 267 1074 1072
3 67 1074 267
3 164 1075 267
3 258 1075 164