OFF
1353 1448 0
0.0006743907 -0.0610068254 0.0032351198
0.4997939119 -0.1941673975 0.0087811465
0.4997955356 -0.1941684363 0.0018001697
-0.4998639648 -0.1887406214 0.0085478339
-0.4998623411 -0.1887416603 0.0015668571
-0.2206564629 -0.0281969605 -0.0088394110
-0.2206586517 -0.0281955601 0.0005714016
0.2223540263 -0.0306019021 -0.0087360157
0.2223518374 -0.0306005016 0.0006747969
0.0021035030 0.2010594859 -0.0244025097
0.0020940665 0.2010655236 0.0161698866
0.1863826606 -0.0110731849 -0.0122145739
0.1863788589 -0.0110707525 0.0041308096
-0.1844735753 -0.0090599424 -0.0123011290
-0.1844773770 -0.0090575100 0.0040442546
-0.2206139360 -0.0203554066 -0.0086595747
-0.2206160406 -0.0203540601 0.0003892512
0.2223965532 -0.0227603482 -0.0085561793
0.2223944486 -0.0227590016 0.0004926465
0.0017429263 0.1376113874 0.0447522077
0.0617074825 0.1381794502 0.0032196737
-0.0581925355 0.1388303435 0.0031916900
0.1866992014 0.0479533093 0.0044626207
0.1867031615 0.0479507755 -0.0125638030
-0.1841570345 0.0499665518 0.0043760656
-0.1841530744 0.0499640180 -0.0126503580
-0.1199988011 -0.0152148028 -0.0075258282
-0.1200003889 -0.0152137869 -0.0006992219
0.1218426415 -0.0165276713 -0.0074693843
0.1218410537 -0.0165266554 -0.0006427780
-0.2209555635 -0.0830911582 -0.0041259050
0.2220549257 -0.0854960997 -0.0040225097
-0.0557267160 0.1512868470 0.0031904098
0.0593770488 0.1506619909 0.0032172742
-0.0531412050 0.1769248593 -0.0091713890
-0.0964047693 0.1771620260 0.0064377147
-0.0963976462 0.1771574685 -0.0241880445
-0.0792820155 0.1770702856 0.0146614405
-0.0792711439 0.1770633297 -0.0320814612
0.1093473954 0.1760427683 -0.0091334654
0.0660838310 0.1762799349 0.0064756384
0.0660909541 0.1762753774 -0.0241501208
-0.0621564905 0.1769761046 0.0064457080
-0.0621493674 0.1769715471 -0.0241800512
-0.1054127892 0.1772086226 -0.0091835888
0.0832055326 0.1761882003 0.0146993639
0.0832164042 0.1761812444 -0.0320435378
0.1003321099 0.1760940136 0.0064836316
0.1003392330 0.1760894561 -0.0241421275
0.0570758111 0.1763265316 -0.0091456652
0.0498522352 0.1631835872 0.0032131955
-0.0460665165 0.1637042949 0.0031908087
-0.2205947083 -0.0164322712 0.0002076792
-0.2205926878 -0.0164335640 -0.0084791600
0.2224157809 -0.0188372128 0.0003110745
0.2224178013 -0.0188385055 -0.0083757646
0.0026742912 0.1345241374 0.0447528837
0.0007780981 0.1345344311 0.0447524412
0.4998964853 -0.1752601405 0.0090692089
0.4998982442 -0.1752612659 0.0015065278
-0.4997613915 -0.1698333644 0.0088358962
-0.4997596325 -0.1698344898 0.0012732152
0.0015940211 0.1094986422 0.0288622977
0.0016093555 0.1094888309 -0.0370678989
0.4999478677 -0.1658076292 0.0087769620
0.4999494914 -0.1658086681 0.0017959852
-0.4997100090 -0.1603808531 0.0085436494
-0.4997083854 -0.1603818920 0.0015626726
-0.2205504555 -0.0085918215 -0.0070324754
-0.2205518025 -0.0085909597 -0.0012413194
0.2224600336 -0.0109967630 -0.0069290801
0.2224586867 -0.0109959012 -0.0011379241
0.0017931555 0.1461261291 0.0275889927
0.0018079001 0.1461166953 -0.0358054028
0.0403284732 0.1757050725 0.0032091170
-0.0364073699 0.1761216433 0.0031912075
0.1868226097 0.0700857619 -0.0095023884
0.1868200752 0.0700873835 0.0013946743
-0.1840336262 0.0720990044 -0.0095889435
-0.1840361607 0.0721006260 0.0013081192
0.4999651117 -0.1626561627 0.0081947928
0.4999664648 -0.1626570284 0.0023773297
-0.4996927650 -0.1572293867 0.0079614802
-0.4996914120 -0.1572302524 0.0021440170
0.0023697662 0.1365809373 0.0447525068
0.0011049359 0.1365878036 0.0447522116
-0.1203609235 -0.0817736219 -0.0041027043
0.1214805191 -0.0830864904 -0.0040462603
0.0020282445 0.1883828800 0.0031983224
0.0006824460 0.1314527564 0.0447528775
0.0027364798 0.1314416058 0.0447533569
0.1860603323 -0.0700970320 -0.0040331730
-0.1847959036 -0.0680837895 -0.0041197281
0.1867797029 0.0627090587 0.0027578432
0.1867828710 0.0627070317 -0.0108633799
-0.1840765330 0.0647223012 0.0026712881
-0.1840733650 0.0647202742 -0.0109499350
-0.2205298388 -0.0046695749 -0.0041374761
0.2224806504 -0.0070745164 -0.0040340807
0.0016313854 0.1170647347 0.0447552393
0.1867431322 0.0553283014 -0.0122243714
0.1867393305 0.0553307338 0.0041210121
-0.1841131037 0.0573415440 -0.0123109265
-0.1841169054 0.0573439764 0.0040344570
-0.1200387496 -0.0226102937 -0.0083781418
-0.1200407344 -0.0226090238 0.0001552740
0.1218026930 -0.0239231622 -0.0083216978
0.1218007083 -0.0239218923 0.0002117179
0.0019934677 0.1827525457 0.0212441909
0.0020052634 0.1827449986 -0.0294714097
0.0027087022 0.1334969033 0.0447530446
0.0007325364 0.1335076312 0.0447525834
0.0010122564 -0.0003921350 -0.0345158848
0.0009981016 -0.0003830785 0.0263427096
-0.1199788864 -0.0115170193 -0.0068437553
-0.1199801567 -0.0115162066 -0.0013823861
0.1218625562 -0.0128298878 -0.0067873113
0.1218612860 -0.0128290751 -0.0013259421
-0.0800458611 0.0374904787 0.0408746156
-0.0800307641 0.0374808193 -0.0240351784
-0.0437653124 0.0372886403 0.0077788708
-0.0562776555 0.0373597655 0.0294654797
-0.0562677641 0.0373534368 -0.0130630128
-0.1038098092 0.0376178002 0.0294543860
-0.1037999177 0.0376114714 -0.0130741065
0.1187232879 0.0364065493 0.0078167944
-0.1163120630 0.0376824700 0.0077619389
0.1062109448 0.0364776745 0.0295034033
0.1062208363 0.0364713458 -0.0130250892
0.0586787912 0.0367357092 0.0294923096
0.0586886827 0.0367293804 -0.0130361829
0.0461765374 0.0368003790 0.0077998625
0.0824416870 0.0366083933 0.0409125389
0.0824567840 0.0365987340 -0.0239972550
-0.2207862861 -0.0517222994 0.0002128862
-0.2207842657 -0.0517235921 -0.0084739529
0.2222242031 -0.0541272409 0.0003162816
0.2222262235 -0.0541285336 -0.0083705576
0.0021982033 0.2193761321 -0.0041190137
-0.0046116954 0.1685179624 0.0186903462
-0.0046020526 0.1685117928 -0.0227688123
-0.0073112116 0.1685295585 -0.0020398116
0.0019282365 0.1684750753 -0.0313537396
0.0019145996 0.1684838005 0.0272783209
0.1868613924 0.0774640479 -0.0040549456
-0.1839948436 0.0794772905 -0.0041415007
0.0026240961 0.1252778280 0.0447542480
0.0007279029 0.1252881217 0.0447538055
0.0724752054 -0.0485208162 0.0091374021
0.0724705472 -0.0485178359 0.0291650534
-0.0950202805 -0.0476100967 0.0189118333
-0.0804996599 -0.0476911338 0.0039371796
-0.0805067695 -0.0476865849 0.0345050630
-0.0659860067 -0.0477677131 0.0189186096
-0.0900123427 -0.0476387309 0.0090994787
-0.0900170009 -0.0476357505 0.0291271300
0.0914981686 -0.0486240849 0.0091418419
0.0914935105 -0.0486211046 0.0291694932
0.0674672676 -0.0484921820 0.0189497566
0.0819878882 -0.0485732191 0.0039751029
0.0819807786 -0.0485686702 0.0345429863
0.0965015414 -0.0486497984 0.0189565330
-0.0709893795 -0.0477419996 0.0091039186
-0.0709940376 -0.0477390192 0.0291315698
-0.1201993772 -0.0521917237 -0.0082030961
-0.1202012826 -0.0521905046 -0.0000110422
0.1216420654 -0.0535045922 -0.0081466521
0.1216401601 -0.0535033731 0.0000454017
0.0132179132 0.1234241947 -0.0041021719
0.0132125449 0.1234276294 0.0189789004
-0.0006299790 0.1234993698 -0.0041054039
-0.0006353473 0.1235028046 0.0189756684
-0.0563359531 0.0390609376 0.0032069687
0.0587678116 0.0384360815 0.0032338331
-0.2205715717 -0.0125126928 -0.0077558703
-0.2205732554 -0.0125116155 -0.0005167675
0.2224389175 -0.0149176343 -0.0076524750
0.2224372338 -0.0149165570 -0.0004133722
-0.1200809210 -0.0300043622 0.0003270461
-0.1200788569 -0.0300056829 -0.0085477315
0.1217605216 -0.0313172308 0.0003834901
0.1217625857 -0.0313185514 -0.0084912876
0.4999307308 -0.1689581083 0.0089228529
0.4999324222 -0.1689591905 0.0016510240
-0.4997271459 -0.1635313323 0.0086895403
-0.4997254546 -0.1635324144 0.0014177114
-0.1200187158 -0.0189125863 -0.0082080064
-0.1200206212 -0.0189113672 -0.0000159526
0.1218227268 -0.0202254548 -0.0081515624
0.1218208214 -0.0202242358 0.0000404914
0.4996578767 -0.2193761321 0.0052944302
-0.5000000000 -0.2139493561 0.0050611175
0.0001154872 -0.1642693967 -0.0039250835
0.0001154764 -0.1642693898 -0.0038787828
0.0001154894 -0.1642693982 -0.0039347645
0.0001154818 -0.1642693933 -0.0039019332
0.0001154742 -0.1642693884 -0.0038692070
-0.0968821867 -0.0189411303 0.0291098984
-0.0968744258 -0.0189460958 -0.0042579101
-0.0803401878 -0.0190371237 -0.0128584967
-0.0803520328 -0.0190295451 0.0380691397
0.0656064137 -0.0198232213 0.0291478221
0.0656141746 -0.0198281869 -0.0042199864
-0.1055784090 -0.0188964326 0.0120902834
0.0569101914 -0.0197785237 0.0121282071
-0.0551146271 -0.0191703820 0.0121020613
0.1073739733 -0.0200524730 0.0121399849
-0.0638187654 -0.0191206195 0.0291176152
-0.0638110046 -0.0191255850 -0.0042501933
0.0821473603 -0.0199192090 -0.0128205733
0.0821355153 -0.0199116304 0.0381070631
0.0986698349 -0.0200027105 0.0291555388
0.0986775958 -0.0200076761 -0.0042122697
0.4999823501 -0.1595057485 0.0076125185
0.4999834325 -0.1595064411 0.0029585690
-0.4996755267 -0.1540789725 0.0073792058
-0.4996744442 -0.1540796650 0.0027252564
-0.1199594481 -0.0078189310 -0.0041136163
0.1218819946 -0.0091317995 -0.0040571723
0.1866231353 0.0331947221 -0.0129021458
0.1866190168 0.0331973572 0.0048053180
-0.1842331006 0.0352079646 -0.0129887008
-0.1842372191 0.0352105997 0.0047187629
0.0019070244 0.1644306166 -0.0345402044
0.0018928696 0.1644396731 0.0263183900
0.5000000000 -0.1563545418 0.0052851314
-0.4996578767 -0.1509277657 0.0050518187
-0.0317147442 -0.0159938224 -0.0350272197
-0.0317214760 -0.0159895153 -0.0060836465
0.0009281104 -0.0161719130 -0.0410139540
0.0009185901 -0.0161658217 -0.0000815704
-0.0452376937 -0.0159182760 -0.0205585885
0.0639691722 0.1132276036 0.0032239129
-0.0607249945 0.1139045225 0.0031948102
-0.0794063139 0.1516189923 -0.0447552393
-0.0794236888 0.1516301091 0.0299482944
0.0613585547 0.1508639156 0.0168445062
0.0613699387 0.1508566319 -0.0321009373
-0.0462830087 0.1514445790 -0.0081427583
0.1047752747 0.1506282221 0.0168546394
0.1047866587 0.1506209385 -0.0320908041
0.0133682719 0.1511213476 -0.0041062586
0.0133629036 0.1511247824 0.0189748137
0.1162055916 0.1505624880 -0.0081048346
-0.1125476987 0.1518043057 -0.0081582239
-0.1011289934 0.1517460009 0.0168065829
-0.1011176094 0.1517387172 -0.0321388606
0.0499409017 0.1509222147 -0.0081203003
-0.0577122734 0.1515103075 0.0168167160
-0.0577008894 0.1515030238 -0.0321287275
-0.0004796204 0.1511965227 -0.0041094906
-0.0004849887 0.1511999575 0.0189715817
0.0830812342 0.1507369070 -0.0447173160
0.0830638593 0.1507480238 0.0299862178
0.0002098257 -0.1468974675 -0.0040649701
0.0009415141 0.1355605912 0.0447523265
0.0025220258 0.1355520112 0.0447526953
0.0939864400 0.0492139448 0.0164965537
0.1401826495 0.0190715962 0.0103136816
0.0941065190 0.0713479997 0.0168338078
0.0935292170 -0.0352400553 0.0111547683
0.1397947746 -0.0526685437 0.0035607976
0.0936884803 -0.0057269155 0.0152367596
0.0932962431 -0.0789853262 -0.0081397720
0.1398394518 -0.0450292555 -0.0101771730
0.0931350790 -0.1084972498 -0.0040490716
0.0938176958 0.0164012935 -0.0237090153
0.1401001782 0.0026640543 -0.0179617946
0.0936974585 -0.0057326599 -0.0233652294
0.0945091393 0.1447317578 -0.0013621697
0.0483536713 0.1820539450 -0.0027405917
0.0944570709 0.1355764536 0.0087822804
0.0944368847 0.1318872911 0.0094638649
0.0943663991 0.1190416398 0.0126826015
0.0942960355 0.1061964912 0.0153905054
0.0942060862 0.0896617432 0.0161971554
0.0479996208 0.1178939362 0.0218930741
0.0941065190 0.0713479997 0.0168338078
0.0939864400 0.0492139448 0.0164965537
0.0477902306 0.0793562935 0.0226794257
0.0012960614 0.0545577818 0.0276025036
0.0474922708 0.0244154332 0.0214196316
0.0936884803 -0.0057269155 0.0152367596
0.1401826495 0.0190715962 0.0103136816
0.0474922708 0.0244154332 0.0214196316
0.0931350790 -0.1084972498 -0.0040490716
0.0935292170 -0.0352400553 0.0111547683
0.0470665903 -0.0544401641 0.0111468190
0.0933321480 -0.0718686525 0.0035528484
0.0472636593 -0.0178115669 0.0187487389
0.1395977056 -0.0892971409 -0.0040411223
0.1397947746 -0.0526685437 0.0035607976
0.0933321480 -0.0718686525 0.0035528484
0.0006039636 -0.0736402730 0.0111388697
0.0466724523 -0.1276973587 -0.0040570209
0.0468695213 -0.0910687614 0.0035448991
0.0004068946 -0.1102688703 0.0035369498
0.0470665903 -0.0544401641 0.0111468190
0.0008010326 -0.0370116758 0.0187407897
0.0468695213 -0.0910687614 0.0035448991
0.0932962431 -0.0789853262 -0.0081397720
0.0006110410 -0.0736448013 -0.0192904275
0.0471542498 -0.0396887306 -0.0213278284
0.0469536421 -0.0763150637 -0.0137150998
0.0008116487 -0.0370184681 -0.0269031562
0.0467530344 -0.1129413969 -0.0061023711
0.0004104333 -0.1102711344 -0.0116776988
0.0469536421 -0.0763150637 -0.0137150998
0.0936974585 -0.0057326599 -0.0233652294
0.1398394518 -0.0450292555 -0.0101771730
0.0934968508 -0.0423589931 -0.0157525007
0.1400400595 -0.0084029224 -0.0177899017
0.0471542498 -0.0396887306 -0.0213278284
0.0473548574 -0.0030623975 -0.0289405571
0.0934968508 -0.0423589931 -0.0157525007
0.0941162454 0.0713417765 -0.0249850223
0.0938176958 0.0164012935 -0.0237090153
0.0475642509 0.0354748207 -0.0297504536
0.1403696903 0.0522682493 -0.0189435840
0.0475642509 0.0354748207 -0.0297504536
0.0013108059 0.0545483480 -0.0357918919
0.0478628004 0.0904153037 -0.0310264606
0.0942555308 0.0970337354 -0.0241846029
0.0941562585 0.0787198032 -0.0248158509
0.0480317154 0.1215752153 -0.0299950028
0.0943250783 0.1098794590 -0.0233822879
0.0943940672 0.1227260151 -0.0201673948
0.0944630564 0.1355726239 -0.0169524490
0.0945297978 0.1484200900 -0.0040869797
0.0944824477 0.1392617669 -0.0142287277
0.0483640006 0.1838981111 -0.0041029967
-0.0914416779 0.0502205661 0.0164532761
-0.1379595275 0.0205815281 0.0102487653
-0.0913215990 0.0723546209 0.0167905303
-0.0918989010 -0.0342334340 0.0111114907
-0.1383474023 -0.0511586118 0.0034958813
-0.0917396377 -0.0047202942 0.0151934821
-0.0921318748 -0.0779787050 -0.0081830496
-0.1383027251 -0.0435193237 -0.0102420893
-0.0922930390 -0.1074906285 -0.0040923491
-0.0916104221 0.0174079148 -0.0237522928
-0.1380419987 0.0041739862 -0.0180267109
-0.0917306595 -0.0047260387 -0.0234085069
-0.0909189787 0.1457383791 -0.0014054473
-0.0443603877 0.1825572556 -0.0027622305
-0.0909710471 0.1365830748 0.0087390029
-0.0909912333 0.1328939124 0.0094205874
-0.0910617188 0.1200482610 0.0126393240
-0.0911320824 0.1072031124 0.0153472278
-0.0912220318 0.0906683644 0.0161538778
-0.0447144381 0.1183972468 0.0218714353
-0.0913215990 0.0723546209 0.0167905303
-0.0914416779 0.0502205661 0.0164532761
-0.0449238284 0.0798596041 0.0226577869
0.0012960614 0.0545577818 0.0276025036
-0.0452217882 0.0249187438 0.0213979929
-0.0917396377 -0.0047202942 0.0151934821
-0.1379595275 0.0205815281 0.0102487653
-0.0452217882 0.0249187438 0.0213979929
-0.0922930390 -0.1074906285 -0.0040923491
-0.0918989010 -0.0342334340 0.0111114907
-0.0456474687 -0.0539368535 0.0111251802
-0.0920959700 -0.0708620313 0.0035095708
-0.0454503997 -0.0173082563 0.0187271002
-0.1385444713 -0.0877872090 -0.0041060386
-0.1383474023 -0.0511586118 0.0034958813
-0.0920959700 -0.0708620313 0.0035095708
0.0006039636 -0.0736402730 0.0111388697
-0.0460416067 -0.1271940480 -0.0040786596
-0.0458445377 -0.0905654508 0.0035232603
0.0004068946 -0.1102688703 0.0035369498
-0.0456474687 -0.0539368535 0.0111251802
0.0008010326 -0.0370116758 0.0187407897
-0.0458445377 -0.0905654508 0.0035232603
-0.0921318748 -0.0779787050 -0.0081830496
0.0006110410 -0.0736448013 -0.0192904275
-0.0455598092 -0.0391854200 -0.0213494672
-0.0457604169 -0.0758117531 -0.0137367385
0.0008116487 -0.0370184681 -0.0269031562
-0.0459610246 -0.1124380862 -0.0061240098
0.0004104333 -0.1102711344 -0.0116776988
-0.0457604169 -0.0758117531 -0.0137367385
-0.0917306595 -0.0047260387 -0.0234085069
-0.1383027251 -0.0435193237 -0.0102420893
-0.0919312672 -0.0413523718 -0.0157957782
-0.1381021174 -0.0068929905 -0.0178548180
-0.0455598092 -0.0391854200 -0.0213494672
-0.0453592015 -0.0025590868 -0.0289621959
-0.0919312672 -0.0413523718 -0.0157957782
-0.0913118726 0.0723483978 -0.0250282999
-0.0916104221 0.0174079148 -0.0237522928
-0.0451498081 0.0359781314 -0.0297720924
-0.1377724866 0.0537781812 -0.0190085003
-0.0451498081 0.0359781314 -0.0297720924
0.0013108059 0.0545483480 -0.0357918919
-0.0448512585 0.0909186144 -0.0310480994
-0.0911725872 0.0980403567 -0.0242278804
-0.0912718595 0.0797264245 -0.0248591285
-0.0446823435 0.1220785260 -0.0300166416
-0.0911030397 0.1108860803 -0.0234255655
-0.0910340508 0.1237326364 -0.0202106723
-0.0909650616 0.1365792452 -0.0169957266
-0.0908983201 0.1494267113 -0.0041302572
-0.0909456703 0.1402683882 -0.0142720052
-0.0443500584 0.1844014217 -0.0041246355
0.3432064644 -0.0804850202 0.0067932323
0.4215001881 -0.1373262088 0.0077871894
0.3432577510 -0.0710313917 0.0069372634
0.3430183678 -0.1152234423 0.0047126199
0.4213381223 -0.1672997872 0.0050035250
0.3430863854 -0.1026190750 0.0064559781
0.3428591045 -0.1447365821 0.0006306286
0.3429279339 -0.1321327342 -0.0011165017
0.4212584906 -0.1820563571 0.0029625294
0.3430890981 -0.1026208106 -0.0052072021
0.3431404524 -0.0931672254 -0.0053540230
0.4214423168 -0.1483946235 -0.0017035162
0.3434218712 -0.0410208503 0.0017787864
0.3432978434 -0.0636534156 0.0067659148
0.3432064644 -0.0804850202 0.0067932323
0.2649127406 -0.0236438315 0.0057992751
0.2257658787 0.0047767628 0.0053022966
0.2647926616 -0.0457778863 0.0054620209
0.3430863854 -0.1026190750 0.0064559781
0.4215001881 -0.1373262088 0.0077871894
0.2647326222 -0.0568449137 0.0052933938
0.3430183678 -0.1152234423 0.0047126199
0.2646986134 -0.0631470974 0.0044217148
0.2255387361 -0.0371089249 0.0042762622
0.2645393500 -0.0926602372 0.0003397234
0.3428591045 -0.1447365821 0.0006306286
0.4213381223 -0.1672997872 0.0050035250
0.2644597184 -0.1074168071 -0.0017012722
0.3430890981 -0.1026208106 -0.0052072021
0.3429279339 -0.1321327342 -0.0011165017
0.2644941331 -0.1011148831 -0.0025748373
0.4214423168 -0.1483946235 -0.0017035162
0.2647358793 -0.0568469978 -0.0087108880
0.2645747152 -0.0863589213 -0.0046201876
0.2255592700 -0.0339600913 -0.0104627310
0.3432606898 -0.0710332719 -0.0056978090
0.3431404524 -0.0931672254 -0.0053540230
0.2647615565 -0.0521202051 -0.0087842985
0.4215794670 -0.1231472689 -0.0020956406
0.2649419125 -0.0189192749 -0.0092999774
0.2648216752 -0.0410532284 -0.0089561914
0.2257825239 0.0071377236 -0.0111010616
0.3433177918 -0.0605042075 -0.0054563895
0.3434306962 -0.0394452469 0.0006150929
-0.3420505920 -0.0767650109 0.0066332984
-0.4209572784 -0.1327528161 0.0075905661
-0.3419993053 -0.0673113824 0.0067773296
-0.3422386885 -0.1115034330 0.0045526860
-0.4211193443 -0.1627263946 0.0048069018
-0.3421706709 -0.0988990657 0.0062960442
-0.3423979518 -0.1410165728 0.0004706947
-0.3423291224 -0.1284127249 -0.0012764355
-0.4211989759 -0.1774829644 0.0027659061
-0.3421679582 -0.0989008013 -0.0053671360
-0.3421166039 -0.0894472161 -0.0055139569
-0.4210151497 -0.1438212308 -0.0019001395
-0.3418351851 -0.0373008410 0.0016188526
-0.3419592130 -0.0599334063 0.0066059809
-0.3420505920 -0.0767650109 0.0066332984
-0.2631439055 -0.0207772056 0.0056760307
-0.2236905623 0.0072166971 0.0051973968
-0.2632639845 -0.0429112604 0.0053387765
-0.3421706709 -0.0988990657 0.0062960442
-0.4209572784 -0.1327528161 0.0075905661
-0.2633240240 -0.0539782878 0.0051701494
-0.3422386885 -0.1115034330 0.0045526860
-0.2633580328 -0.0602804715 0.0042984703
-0.2239177049 -0.0346689907 0.0041713624
-0.2635172961 -0.0897936113 0.0002164790
-0.3423979518 -0.1410165728 0.0004706947
-0.4211193443 -0.1627263946 0.0048069018
-0.2635969277 -0.1045501812 -0.0018245167
-0.3421679582 -0.0989008013 -0.0053671360
-0.3423291224 -0.1284127249 -0.0012764355
-0.2635625130 -0.0982482572 -0.0026980818
-0.4210151497 -0.1438212308 -0.0019001395
-0.2633207668 -0.0539803718 -0.0088341325
-0.2634819309 -0.0834922954 -0.0047434320
-0.2238971711 -0.0315201571 -0.0105676307
-0.3419963666 -0.0673132626 -0.0058577428
-0.3421166039 -0.0894472161 -0.0055139569
-0.2632950896 -0.0492535792 -0.0089075429
-0.4208779995 -0.1185738762 -0.0022922638
-0.2631147336 -0.0160526490 -0.0094232218
-0.2632349710 -0.0381866025 -0.0090794359
-0.2236739171 0.0095776578 -0.0112059613
-0.3419392645 -0.0567841982 -0.0056163233
-0.3418263601 -0.0357252376 0.0004551590
0.1718475429 -0.0694997364 -0.0019885540
0.1718533713 -0.0686075120 -0.0062084090
0.1718475429 -0.0694997364 -0.0019885540
0.1718533713 -0.0686075120 -0.0062084090
-0.1705784230 -0.0676408314 -0.0020684736
-0.1705725946 -0.0667486070 -0.0062883286
-0.1705784230 -0.0676408314 -0.0020684736
-0.1705725946 -0.0667486070 -0.0062883286
0.1112082682 0.0935200813 0.0106992843
0.0936084809 0.0936183077 0.0288835892
0.0708713253 0.0937418665 0.0297392637
0.0537675461 0.0938321473 0.0123221844
0.0719133614 0.0937276829 -0.0280490961
0.0946510353 0.0936041264 -0.0288712026
0.1112082682 0.0935200813 0.0106992843
0.0936084809 0.0936183077 0.0288835892
0.0708713253 0.0937418665 0.0297392637
0.0537675461 0.0938321473 0.0123221844
0.0600293107 0.0937930061 -0.0225685601
0.0719133614 0.0937276829 -0.0280490961
0.0946510353 0.0936041264 -0.0288712026
0.1117549733 0.0935137439 -0.0121370049
-0.0512803321 0.0944021723 0.0106613607
-0.0688790672 0.0945003931 0.0288456658
-0.0916167490 0.0946239546 0.0297013402
-0.1087205282 0.0947142355 0.0122842609
-0.0905741867 0.0946097682 -0.0280870195
-0.0678370390 0.0944862145 -0.0289091261
-0.0512803321 0.0944021723 0.0106613607
-0.0688790672 0.0945003931 0.0288456658
-0.0916167490 0.0946239546 0.0297013402
-0.1087205282 0.0947142355 0.0122842609
-0.1024587636 0.0946750943 -0.0226064836
-0.0905741867 0.0946097682 -0.0280870195
-0.0678370390 0.0944862145 -0.0289091261
-0.0507331009 0.0943958321 -0.0121749284
-0.0149034382 0.0762471426 0.0105973372
-0.0233124571 0.0301288137 0.0022568454
0.0014165949 0.0761589894 0.0135983752
-0.0249246945 0.0762998432 -0.0009341211
-0.0262744526 0.0763056412 -0.0112992000
-0.0181583984 0.0762589852 -0.0288980160
-0.0018369711 0.0761699399 -0.0318913832
-0.0086151440 0.0300435361 -0.0349559850
-0.0249246945 0.0762998432 -0.0009341211
-0.0195129779 0.0762678680 -0.0185335157
-0.0158029998 -0.0901294526 -0.0049812147
-0.0225611059 -0.0900938346 -0.0122302608
-0.0225611032 -0.0900938364 -0.0122418360
-0.0157996274 -0.0901316103 -0.0194809921
0.0306959538 0.0818569547 0.0239940405
0.0011528880 0.0280289546 0.0239951795
0.0301995985 0.0777504081 0.0239945362
0.0297211011 -0.0112853720 0.0032344764
0.0007011468 0.0321406482 0.0239944626
-0.0278307812 -0.0109729439 0.0032210442
-0.0278174032 0.0356007929 0.0136007157
0.0006877687 -0.0144330886 0.0136147912
-0.0278040251 0.0821745297 0.0239803871
0.0007145249 0.0787143849 0.0343741340
-0.0278174032 0.0356007929 0.0136007157
-0.0278267536 0.0852568470 0.0239799231
0.0945091393 0.1447317578 -0.0013621697
0.0942060862 0.0896617432 0.0161971554
0.1632807542 0.0040004218 0.0072222456
0.1403027284 0.0412056510 0.0106509358
0.0477902306 0.0793562935 0.0226794257
0.1403627679 0.0522726784 0.0108195629
0.1630868168 -0.0318696481 0.0038458036
0.1399540379 -0.0231554039 0.0076427889
0.0472636593 -0.0178115669 0.0187487389
0.1399540379 -0.0231554039 0.0076427889
0.1862214964 -0.0405851085 -0.0081238735
0.1396782877 -0.0745411791 -0.0060864725
0.0467530344 -0.1129413969 -0.0061023711
0.1395977056 -0.0892971409 -0.0040411223
0.1402204156 0.0247980078 -0.0183055805
0.1633616567 0.0179293882 -0.0154319702
0.0474149761 0.0080045793 -0.0291124501
0.1401001782 0.0026640543 -0.0179617946
0.0941162454 0.0713417765 -0.0249850223
0.0944630564 0.1355726239 -0.0169524490
0.0482654756 0.1664764074 0.0128168757
0.0943865853 0.1227308022 0.0120010171
0.0481799334 0.1508970928 0.0169633962
0.0943161000 0.1098852035 0.0152197011
0.0480944525 0.1353180821 0.0208544477
0.0942461785 0.0970397192 0.0160258067
0.0248963882 0.1320100326 0.0247410334
0.0479000537 0.0995801927 0.0225297265
0.1404125515 0.0614295502 0.0105012367
0.0478502701 0.0904233209 0.0228480528
0.0243941661 0.0394866075 0.0245110676
0.0246921259 0.0944274678 0.0257708617
0.0708883353 0.0642851192 0.0195879897
0.0243941661 0.0394866075 0.0245110676
0.1170845447 0.0341427705 0.0134051176
0.1400336696 -0.0083988340 0.0096837846
0.0473432909 -0.0030549970 0.0207897346
0.0705903755 0.0093442588 0.0183281956
0.0702979036 -0.0448401097 0.0111507936
0.0701008346 -0.0814687070 0.0035488737
0.0240323460 -0.0274116213 0.0187447643
0.0702979036 -0.0448401097 0.0111507936
0.1165634613 -0.0622685981 0.0035568230
0.1628290189 -0.0796970865 -0.0040371477
0.1163663923 -0.0988971954 -0.0040450969
0.1165634613 -0.0622685981 0.0035568230
0.0236382080 -0.1006688158 0.0035409244
0.0699037656 -0.1180973042 -0.0040530462
0.0234411390 -0.1372974131 -0.0040609955
0.0236382080 -0.1006688158 0.0035409244
0.0238352770 -0.0640402186 0.0111428444
0.0240323460 -0.0274116213 0.0187447643
0.0701008346 -0.0814687070 0.0035488737
0.0238352770 -0.0640402186 0.0111428444
0.0238826454 -0.0566667659 -0.0203091280
0.0702252464 -0.0593370284 -0.0147338002
0.0240832531 -0.0200404328 -0.0279218566
0.0238826454 -0.0566667659 -0.0203091280
0.0236820377 -0.0932930991 -0.0126963993
0.0234814300 -0.1299194322 -0.0050836706
0.0700246388 -0.0959633615 -0.0071210716
0.0236820377 -0.0932930991 -0.0126963993
0.1167684552 -0.0253809577 -0.0167712012
0.1165678475 -0.0620072909 -0.0091584725
0.1631110562 -0.0280512202 -0.0111958735
0.1167684552 -0.0253809577 -0.0167712012
0.0704258541 -0.0227106953 -0.0223465289
0.0240832531 -0.0200404328 -0.0279218566
0.0702252464 -0.0593370284 -0.0147338002
0.0704258541 -0.0227106953 -0.0223465289
0.0708402481 0.0534082986 -0.0273677380
0.0474149761 0.0080045793 -0.0291124501
0.1402204156 0.0247980078 -0.0183055805
0.1170936931 0.0343347714 -0.0213262997
0.0245868032 0.0724818258 -0.0334091762
0.0242882536 0.0175413429 -0.0321331692
0.0708402481 0.0534082986 -0.0273677380
0.0245868032 0.0724818258 -0.0334091762
0.0478828070 0.0941043171 -0.0309418749
0.1404793462 0.0724922555 -0.0183742029
0.0479324431 0.1032612832 -0.0306262509
0.0249198078 0.1338459553 -0.0329002028
0.0942755161 0.1007224984 -0.0240148871
0.0481160513 0.1371550378 -0.0289612462
0.0943449477 0.1135688241 -0.0227017922
0.0481996653 0.1527355069 -0.0248194022
0.0944139366 0.1264153802 -0.0194868990
0.0482832797 0.1683160549 -0.0206774794
-0.0909189787 0.1457383791 -0.0014054473
-0.0912220318 0.0906683644 0.0161538778
-0.1612184523 0.0057620090 0.0071465099
-0.1378394485 0.0427155829 0.0105860195
-0.0449238284 0.0798596041 0.0226577869
-0.1377794091 0.0537826103 0.0107546466
-0.1614123897 -0.0301080609 0.0037700679
-0.1381881390 -0.0216454720 0.0075778727
-0.0454503997 -0.0173082563 0.0187271002
-0.1381881390 -0.0216454720 0.0075778727
-0.1846347395 -0.0385718659 -0.0082104285
-0.1384638892 -0.0730312472 -0.0061513888
-0.0459610246 -0.1124380862 -0.0061240098
-0.1385444713 -0.0877872090 -0.0041060386
-0.1379217614 0.0263079397 -0.0183704968
-0.1611375497 0.0196909754 -0.0155077059
-0.0452990829 0.0085078899 -0.0291340888
-0.1380419987 0.0041739862 -0.0180267109
-0.0913118726 0.0723483978 -0.0250282999
-0.0909650616 0.1365792452 -0.0169957266
-0.0444485834 0.1669797180 0.0127952370
-0.0910415327 0.1237374235 0.0119577395
-0.0445341256 0.1514004034 0.0169417575
-0.0911120179 0.1108918247 0.0151764235
-0.0446196064 0.1358213927 0.0208328089
-0.0911819395 0.0980463405 0.0159825292
-0.0214606413 0.1322616880 0.0247302140
-0.0448140053 0.1000835033 0.0225080878
-0.1377296255 0.0629394821 0.0104363204
-0.0448637889 0.0909266316 0.0228264140
-0.0219628634 0.0397382628 0.0245002482
-0.0216649036 0.0946791232 0.0257600423
-0.0681827532 0.0650400851 0.0195555315
-0.0219628634 0.0397382628 0.0245002482
-0.1147006027 0.0354010471 0.0133510207
-0.1381085074 -0.0068889021 0.0096188683
-0.0453707680 -0.0025516864 0.0207680958
-0.0684807129 0.0100992248 0.0182957375
-0.0687731848 -0.0440851438 0.0111183355
-0.0689702538 -0.0807137410 0.0035164156
-0.0223246835 -0.0271599660 0.0187339449
-0.0687731848 -0.0440851438 0.0111183355
-0.1152216862 -0.0610103215 0.0035027261
-0.1616701875 -0.0779354993 -0.0041128833
-0.1154187552 -0.0976389188 -0.0040991939
-0.1152216862 -0.0610103215 0.0035027261
-0.0227188215 -0.1004171605 0.0035301050
-0.0691673228 -0.1173423383 -0.0040855044
-0.0229158905 -0.1370457578 -0.0040718149
-0.0227188215 -0.1004171605 0.0035301050
-0.0225217525 -0.0637885633 0.0111320250
-0.0223246835 -0.0271599660 0.0187339449
-0.0689702538 -0.0807137410 0.0035164156
-0.0225217525 -0.0637885633 0.0111320250
-0.0224743841 -0.0564151106 -0.0203199473
-0.0688458420 -0.0585820625 -0.0147662584
-0.0222737764 -0.0197887775 -0.0279326760
-0.0224743841 -0.0564151106 -0.0203199473
-0.0226749918 -0.0930414438 -0.0127072187
-0.0228755995 -0.1296677769 -0.0050944900
-0.0690464497 -0.0952083956 -0.0071535297
-0.0226749918 -0.0930414438 -0.0127072187
-0.1150166923 -0.0241226812 -0.0168252981
-0.1152173000 -0.0607490143 -0.0092125694
-0.1613881502 -0.0262896330 -0.0112716091
-0.1150166923 -0.0241226812 -0.0168252981
-0.0686452343 -0.0219557293 -0.0223789871
-0.0222737764 -0.0197887775 -0.0279326760
-0.0688458420 -0.0585820625 -0.0147662584
-0.0686452343 -0.0219557293 -0.0223789871
-0.0682308403 0.0541632646 -0.0274001961
-0.0452990829 0.0085078899 -0.0291340888
-0.1379217614 0.0263079397 -0.0183704968
-0.1146914544 0.0355930480 -0.0213803966
-0.0217702263 0.0727334812 -0.0334199956
-0.0220687758 0.0177929982 -0.0321439886
-0.0682308403 0.0541632646 -0.0274001961
-0.0217702263 0.0727334812 -0.0334199956
-0.0448312520 0.0946076277 -0.0309635137
-0.1376628308 0.0740021874 -0.0184391192
-0.0447816158 0.1037645938 -0.0306478896
-0.0214372217 0.1340976106 -0.0329110222
-0.0911526018 0.1017291196 -0.0240581646
-0.0445980077 0.1376583484 -0.0289828849
-0.0910831703 0.1145754454 -0.0227450697
-0.0445143937 0.1532388175 -0.0248410410
-0.0910141814 0.1274220015 -0.0195301766
-0.0444307793 0.1688193656 -0.0206991181
0.3432978434 -0.0636534156 0.0067659148
0.4604979995 -0.1933379597 0.0051489776
0.4214061399 -0.1546954199 0.0067468832
0.2646986134 -0.0631470974 0.0044217148
0.4214401487 -0.1483932362 0.0076185623
0.4213617348 -0.1631505853 0.0003418340
0.2644597184 -0.1074168071 -0.0017012722
0.4213273200 -0.1694525092 0.0012153991
0.4604581837 -0.2007162446 0.0041284798
0.3432606898 -0.0710332719 -0.0056978090
0.2651416318 0.0182215988 -0.0011380796
0.3434012127 -0.0447091825 0.0045035964
0.3433925935 -0.0462843896 0.0047947335
0.3433637853 -0.0515492853 0.0057674026
0.3433350307 -0.0568136872 0.0065219325
0.2649985224 -0.0078500532 0.0056142677
0.3432577510 -0.0710313917 0.0069372634
0.2061924477 0.0189870600 0.0050538073
0.2256457997 -0.0173572920 0.0049650424
0.3040596025 -0.0520644258 0.0062962537
0.2255857603 -0.0284243194 0.0047964153
0.3823533263 -0.1089056145 0.0072902108
0.4214401487 -0.1483932362 0.0076185623
0.3039095038 -0.0797319944 0.0058746860
0.2647926616 -0.0457778863 0.0054620209
0.1862195956 -0.0405838923 0.0000488183
0.2253794728 -0.0666220647 0.0001942709
0.3038584906 -0.0891852699 0.0045671673
0.2252998412 -0.0813786346 -0.0018467248
0.3821782450 -0.1412616148 0.0048580725
0.4212584906 -0.1820563571 0.0029625294
0.3036594114 -0.1260766946 -0.0005353218
0.2645393500 -0.0926602372 0.0003397234
0.2645747152 -0.0863589213 -0.0046201876
0.3037110335 -0.1166238087 -0.0018456695
0.4213617348 -0.1631505853 0.0003418340
0.3822657075 -0.1255077170 -0.0034553592
0.2253175237 -0.0782279767 -0.0043266803
0.3039124887 -0.0797339042 -0.0069590451
0.2253981058 -0.0634720149 -0.0063720305
0.1862214964 -0.0405851085 -0.0081238735
0.2648216752 -0.0410532284 -0.0089561914
0.3039510044 -0.0726437153 -0.0070691608
0.4215193483 -0.1342142457 -0.0019237476
0.3824200784 -0.0970902704 -0.0038967248
0.2256021679 -0.0260632066 -0.0105853827
0.3041013011 -0.0449762734 -0.0074988932
0.2256622865 -0.0149962299 -0.0107572756
0.2062028296 0.0201662228 -0.0120016037
0.3432777787 -0.0678822342 -0.0056255609
0.2650104767 -0.0062767160 -0.0090100962
0.3433463118 -0.0552401833 -0.0052141931
0.3433746679 -0.0499749984 -0.0042430251
0.3434030211 -0.0447103396 -0.0032719097
0.3434113049 -0.0431343899 -0.0021086285
0.2651460443 0.0190094005 -0.0017199264
-0.3419592130 -0.0599334063 0.0066059809
-0.4605596721 -0.1883378753 0.0049340097
-0.4210513267 -0.1501220272 0.0065502600
-0.2633580328 -0.0602804715 0.0042984703
-0.4210173179 -0.1438198436 0.0074219390
-0.4210957318 -0.1585771926 0.0001452108
-0.2635969277 -0.1045501812 -0.0018245167
-0.4211301465 -0.1648791165 0.0010187759
-0.4605994880 -0.1957161603 0.0039135118
-0.3419963666 -0.0673132626 -0.0058577428
-0.2629150143 0.0210882247 -0.0012613240
-0.3418558437 -0.0409891732 0.0043436625
-0.3418644628 -0.0425643803 0.0046347997
-0.3418932710 -0.0478292760 0.0056074688
-0.3419220257 -0.0530936779 0.0063619987
-0.2630581237 -0.0049834273 0.0054910233
-0.3419993053 -0.0673113824 0.0067773296
-0.2039638907 0.0212136484 0.0049580799
-0.2238106413 -0.0149173578 0.0048601426
-0.3025972487 -0.0487711082 0.0061546645
-0.2238706808 -0.0259843852 0.0046915155
-0.3815039352 -0.1047589135 0.0071119323
-0.4210173179 -0.1438198436 0.0074219390
-0.3027473474 -0.0764386768 0.0057330968
-0.2632639845 -0.0429112604 0.0053387765
-0.1846366403 -0.0385706497 -0.0000377368
-0.2240769682 -0.0641821305 0.0000893711
-0.3027983606 -0.0858919523 0.0044255782
-0.2241565999 -0.0789387004 -0.0019516245
-0.3816790164 -0.1371149138 0.0046797939
-0.4211989759 -0.1774829644 0.0027659061
-0.3029974398 -0.1227833770 -0.0006769110
-0.2635172961 -0.0897936113 0.0002164790
-0.2634819309 -0.0834922954 -0.0047434320
-0.3029458177 -0.1133304911 -0.0019872587
-0.4210957318 -0.1585771926 0.0001452108
-0.3815915540 -0.1213610161 -0.0036336377
-0.2241389173 -0.0757880425 -0.0044315801
-0.3027443625 -0.0764405866 -0.0071006342
-0.2240583352 -0.0610320807 -0.0064769303
-0.1846347395 -0.0385718659 -0.0082104285
-0.2632349710 -0.0381866025 -0.0090794359
-0.3027058468 -0.0693503977 -0.0072107499
-0.4209381182 -0.1296408530 -0.0021203709
-0.3814371830 -0.0929435694 -0.0040750033
-0.2238542731 -0.0236232724 -0.0106902824
-0.3025555501 -0.0416829558 -0.0076404823
-0.2237941545 -0.0125562957 -0.0108621754
-0.2039535089 0.0223928112 -0.0120973311
-0.3419792776 -0.0641622249 -0.0057854947
-0.2630461694 -0.0034100901 -0.0091333407
-0.3419107446 -0.0515201740 -0.0053741270
-0.3418823885 -0.0462549891 -0.0044029590
-0.3418540352 -0.0409903303 -0.0034318435
-0.3418457515 -0.0394143807 -0.0022685624
-0.2629106019 0.0218760264 -0.0018431708
0.1719923623 -0.0427222358 0.0003498858
0.1969512343 -0.0774979180 -0.0030055318
0.1719321816 -0.0538153070 0.0001808416
0.1969541485 -0.0770518059 -0.0051154593
0.1717677224 -0.0842912950 -0.0040343850
0.1719980458 -0.0420532471 -0.0084413339
0.1719923623 -0.0427222358 0.0003498858
0.1719980458 -0.0420532471 -0.0084413339
-0.1704336036 -0.0408633308 0.0002699662
-0.1957669933 -0.0753659948 -0.0030971893
-0.1704937843 -0.0519564020 0.0001009220
-0.1957640790 -0.0749198826 -0.0052071168
-0.1706582435 -0.0824323900 -0.0041143046
-0.1704279201 -0.0401943421 -0.0085212535
-0.1704336036 -0.0408633308 0.0002699662
-0.1704279201 -0.0401943421 -0.0085212535
0.0480587195 0.0938612969 -0.0001602189
0.1117549733 0.0935137439 -0.0121370049
0.1137069299 0.1220412846 0.0012972248
0.1054931098 0.0935529483 0.0231790213
0.0518542239 0.1223771810 0.0021009420
0.0480587195 0.0938612969 -0.0001602189
-0.1144298808 0.0947433879 -0.0001981425
-0.0507331009 0.0943958321 -0.0121749284
-0.0487816704 0.1229233756 0.0012593012
-0.0569949645 0.0944350365 0.0231410978
-0.1106341134 0.1232592706 0.0020630185
-0.1144298808 0.0947433879 -0.0001981425
-0.0350811941 0.0301907836 -0.0107463548
-0.0181665857 0.0762642236 0.0063033499
-0.0195129779 0.0762678680 -0.0185335157
-0.0289945984 0.0301559094 -0.0231632099
-0.0149034382 0.0762471426 0.0105973372
-0.0147681949 0.1224089028 0.0088781125
-0.0262744526 0.0763056412 -0.0112992000
-0.0134120948 0.1223987132 -0.0102866636
-0.0181583984 0.0762589852 -0.0288980160
-0.0018369711 0.0761699399 -0.0318913832
0.0005170333 -0.0902176058 -0.0019801766
-0.0074422048 -0.0531476371 -0.0025313925
-0.0074357585 -0.0531517616 -0.0302474731
0.0005217999 -0.0902206556 -0.0224743593
0.0213491197 0.1561430049 0.0239808119
0.0333528260 0.1223346047 0.0239886349
0.0332966342 0.1192527158 0.0239890805
0.0613684919 0.0758318426 0.0032288730
0.0299603498 0.0332325181 0.0136145063
0.0013921367 0.0725468447 0.0343752094
0.0009136394 -0.0164889354 0.0136151497
0.0299603498 0.0332325181 0.0136145063
-0.0585304738 0.0764827301 0.0032008895
-0.0300212742 0.1226786395 0.0239738439
-0.0299962290 0.1237060769 0.0239736968
-0.0173322218 0.1568665153 0.0239717076
0.0944368847 0.1318872911 0.0094638649
0.0943663991 0.1190416398 0.0126826015
0.0942960355 0.1061964912 0.0153905054
0.1404125515 0.0614295502 0.0105012367
0.0942461785 0.0970397192 0.0160258067
0.1864989378 0.0110633023 0.0044680638
0.1634008331 0.0261344767 0.0075594998
0.1170845447 0.0341427705 0.0134051176
0.1634008331 0.0261344767 0.0075594998
0.0708883353 0.0642851192 0.0195879897
0.0478502701 0.0904233209 0.0228480528
0.1172346434 0.0618103390 0.0138266854
0.1403027284 0.0412056510 0.0106509358
0.1629275534 -0.0613827878 -0.0002361877
0.1862195956 -0.0405838923 0.0000488183
0.1166619958 -0.0439542995 0.0073577830
0.1630868168 -0.0318696481 0.0038458036
0.0703964381 -0.0265258111 0.0149517536
0.0473432909 -0.0030549970 0.0207897346
0.1400336696 -0.0083988340 0.0096837846
0.1168212591 -0.0144411597 0.0114397743
0.1629498921 -0.0575631438 -0.0071051730
0.1631110562 -0.0280512202 -0.0111958735
0.1165678475 -0.0620072909 -0.0091584725
0.1629498921 -0.0575631438 -0.0071051730
0.0700246388 -0.0959633615 -0.0071210716
0.0466724523 -0.1276973587 -0.0040570209
0.1163663923 -0.0988971954 -0.0040450969
0.1396782877 -0.0745411791 -0.0060864725
0.1633616567 0.0179293882 -0.0154319702
0.1169589370 0.0095326739 -0.0208354050
0.1865028979 0.0110607686 -0.0125583598
0.1632414194 -0.0042045653 -0.0150881843
0.0705562173 0.0011359597 -0.0262388397
0.0473548574 -0.0030623975 -0.0289405571
0.1400400595 -0.0084029224 -0.0177899017
0.1169589370 0.0095326739 -0.0208354050
0.0941562585 0.0787198032 -0.0248158509
0.1403696903 0.0522682493 -0.0189435840
0.0942555308 0.0970337354 -0.0241846029
0.0943250783 0.1098794590 -0.0233822879
0.0943940672 0.1227260151 -0.0201673948
0.0252759373 0.2007150386 -0.0034298027
0.0483016029 0.1728986407 0.0074038584
0.1406646073 0.1074095707 0.0000162523
0.0482755687 0.1683209886 0.0124760835
0.0245431460 0.0669570377 0.0251409647
0.0011470815 0.0270873517 0.0269726066
0.0014450413 0.0820282120 0.0282324007
0.0245431460 0.0669570377 0.0251409647
0.0476412507 0.0518858633 0.0220495286
0.0707393554 0.0368146890 0.0189580926
0.0242451862 0.0120161773 0.0238811706
0.0476412507 0.0518858633 0.0220495286
0.0938374601 0.0217435147 0.0158666566
0.1169355649 0.0066723403 0.0127752206
0.1632807542 0.0040004218 0.0072222456
0.1169355649 0.0066723403 0.0127752206
0.0705903755 0.0093442588 0.0183281956
0.0242451862 0.0120161773 0.0238811706
0.0938374601 0.0217435147 0.0158666566
0.0707393554 0.0368146890 0.0189580926
0.0939669706 0.0438715350 -0.0243470188
0.0706909734 0.0259380571 -0.0267297344
0.0242882536 0.0175413429 -0.0321331692
0.0706909734 0.0259380571 -0.0267297344
0.1170936931 0.0343347714 -0.0213262997
0.1634964128 0.0427314857 -0.0159228649
0.0939669706 0.0438715350 -0.0243470188
0.1172429679 0.0618050129 -0.0219643032
0.0244375284 0.0450115844 -0.0327711727
0.0014600807 0.0820185895 -0.0364298954
0.0011615312 0.0270781065 -0.0351538884
0.0244375284 0.0450115844 -0.0327711727
0.0477135257 0.0629450622 -0.0303884571
0.0709895229 0.0808785401 -0.0280057415
0.0247360780 0.0999520673 -0.0340471797
0.0477135257 0.0629450622 -0.0303884571
0.0482929753 0.1701606264 -0.0193156187
0.1406955951 0.1129420690 -0.0040709626
0.0483166504 0.1747397880 -0.0142447447
0.0252811020 0.2016371216 -0.0041110052
-0.0909912333 0.1328939124 0.0094205874
-0.0910617188 0.1200482610 0.0126393240
-0.0911320824 0.1072031124 0.0153472278
-0.1377296255 0.0629394821 0.0104363204
-0.0911819395 0.0980463405 0.0159825292
-0.1843572981 0.0130765449 0.0043815087
-0.1610983733 0.0278960639 0.0074837641
-0.1147006027 0.0354010471 0.0133510207
-0.1610983733 0.0278960639 0.0074837641
-0.0681827532 0.0650400851 0.0195555315
-0.0448637889 0.0909266316 0.0228264140
-0.1145505040 0.0630686156 0.0137725885
-0.1378394485 0.0427155829 0.0105860195
-0.1615716530 -0.0596212006 -0.0003119234
-0.1846366403 -0.0385706497 -0.0000377368
-0.1151231517 -0.0426960229 0.0073036860
-0.1614123897 -0.0301080609 0.0037700679
-0.0686746504 -0.0257708451 0.0149192955
-0.0453707680 -0.0025516864 0.0207680958
-0.1381085074 -0.0068889021 0.0096188683
-0.1149638884 -0.0131828831 0.0113856774
-0.1615493144 -0.0558015566 -0.0071809087
-0.1613881502 -0.0262896330 -0.0112716091
-0.1152173000 -0.0607490143 -0.0092125694
-0.1615493144 -0.0558015566 -0.0071809087
-0.0690464497 -0.0952083956 -0.0071535297
-0.0460416067 -0.1271940480 -0.0040786596
-0.1154187552 -0.0976389188 -0.0040991939
-0.1384638892 -0.0730312472 -0.0061513888
-0.1611375497 0.0196909754 -0.0155077059
-0.1148262104 0.0107909505 -0.0208895019
-0.1843533380 0.0130740111 -0.0126449149
-0.1612577870 -0.0024429781 -0.0151639199
-0.0685148712 0.0018909256 -0.0262712979
-0.0453592015 -0.0025590868 -0.0289621959
-0.1381021174 -0.0068929905 -0.0178548180
-0.1148262104 0.0107909505 -0.0208895019
-0.0912718595 0.0797264245 -0.0248591285
-0.1377724866 0.0537781812 -0.0190085003
-0.0911725872 0.0980403567 -0.0242278804
-0.0911030397 0.1108860803 -0.0234255655
-0.0910340508 0.1237326364 -0.0202106723
-0.0210810922 0.2009666939 -0.0034406221
-0.0444124561 0.1734019513 0.0073822197
-0.1374775697 0.1089195025 -0.0000486640
-0.0444384903 0.1688242992 0.0124544447
-0.0218138835 0.0672086930 0.0251301453
0.0011470815 0.0270873517 0.0269726066
0.0014450413 0.0820282120 0.0282324007
-0.0218138835 0.0672086930 0.0251301453
-0.0450728083 0.0523891740 0.0220278899
-0.0683317331 0.0375696550 0.0189256345
-0.0221118433 0.0122678327 0.0238703512
-0.0450728083 0.0523891740 0.0220278899
-0.0915906578 0.0227501359 0.0158233791
-0.1148495826 0.0079306169 0.0127211237
-0.1612184523 0.0057620090 0.0071465099
-0.1148495826 0.0079306169 0.0127211237
-0.0684807129 0.0100992248 0.0182957375
-0.0221118433 0.0122678327 0.0238703512
-0.0915906578 0.0227501359 0.0158233791
-0.0683317331 0.0375696550 0.0189256345
-0.0914611473 0.0448781563 -0.0243902963
-0.0683801151 0.0266930231 -0.0267621926
-0.0220687758 0.0177929982 -0.0321439886
-0.0683801151 0.0266930231 -0.0267621926
-0.1146914544 0.0355930480 -0.0213803966
-0.1610027936 0.0444930729 -0.0159986006
-0.0914611473 0.0448781563 -0.0243902963
-0.1145421796 0.0630632895 -0.0220184001
-0.0219195011 0.0452632397 -0.0327819921
0.0014600807 0.0820185895 -0.0364298954
0.0011615312 0.0270781065 -0.0351538884
-0.0219195011 0.0452632397 -0.0327819921
-0.0450005333 0.0634483729 -0.0304100959
-0.0680815656 0.0816335061 -0.0280381996
-0.0216209515 0.1002037227 -0.0340579991
-0.0450005333 0.0634483729 -0.0304100959
-0.0444210836 0.1706639371 -0.0193372574
-0.1374465818 0.1144520009 -0.0041358789
-0.0443974086 0.1752430986 -0.0142663834
-0.0210759275 0.2018887769 -0.0041218246
0.3434218712 -0.0410208503 0.0017787864
0.4606470500 -0.1657468032 0.0082841679
0.4215514748 -0.1278725803 0.0079312206
0.2649127406 -0.0236438315 0.0057992751
0.4215771181 -0.1231457661 0.0080032361
0.4215193483 -0.1342142457 -0.0019237476
0.2647358793 -0.0568469978 -0.0087108880
0.4214936712 -0.1389410383 -0.0018503371
0.4606189262 -0.1712815299 0.0000483268
0.3433463118 -0.0552401833 -0.0052141931
0.3433746679 -0.0499749984 -0.0042430251
0.3434030211 -0.0447103396 -0.0032719097
0.2651063344 0.0119014969 0.0030947039
0.3433724073 -0.0499735520 0.0054763180
0.2650717441 0.0055798867 0.0042626229
0.3433435991 -0.0552384477 0.0064489871
0.2650371806 -0.0007414767 0.0053214723
0.3433149661 -0.0605023995 0.0066927368
0.2258488619 0.0200516280 0.0050384442
0.2649584301 -0.0152280292 0.0057856164
0.4215971643 -0.1194567781 0.0079175618
0.2649383839 -0.0189170172 0.0058712907
0.2057995342 -0.0536029785 0.0001215446
0.2059587975 -0.0240898387 0.0042035359
0.2451186747 -0.0501280112 0.0043489885
0.2057995342 -0.0536029785 0.0001215446
0.2842785520 -0.0761661836 0.0044944410
0.3037788589 -0.1039418397 0.0025261717
0.2449992273 -0.0722628660 0.0012874950
0.2253794728 -0.0666220647 0.0001942709
0.3625983064 -0.1282425285 0.0047853462
0.3820986134 -0.1560181847 0.0028170768
0.4604979995 -0.1933379597 0.0051489776
0.3820587976 -0.1633964696 0.0017965790
0.3232592580 -0.1354066383 0.0000476534
0.3037390431 -0.1113201247 0.0015056738
0.2252600253 -0.0887569196 -0.0028672226
0.3037788589 -0.1039418397 0.0025261717
0.3038319066 -0.0944898660 -0.0049136948
0.2252772327 -0.0856059576 -0.0033040052
0.3037916156 -0.1018678469 -0.0038910197
0.3233194837 -0.1243782714 -0.0014810856
0.3821448344 -0.1476416597 -0.0003873338
0.4606189262 -0.1712815299 0.0000483268
0.3821851254 -0.1402636788 -0.0014100089
0.3626774028 -0.1140642638 -0.0043312806
0.2253981058 -0.0634720149 -0.0063720305
0.2450267015 -0.0675374872 -0.0065187842
0.3038319066 -0.0944898660 -0.0049136948
0.2843241840 -0.0682904510 -0.0078349665
0.2058098011 -0.0520285617 -0.0072479520
0.2451475746 -0.0454035445 -0.0095868095
0.2059709653 -0.0225166381 -0.0113386524
0.2058098011 -0.0520285617 -0.0072479520
0.2649504570 -0.0173437561 -0.0092638533
0.4216251070 -0.1147316990 -0.0019026827
0.2649704636 -0.0136547427 -0.0091792676
0.2258568191 0.0208370298 -0.0107869496
0.3433263264 -0.0589289463 -0.0053839089
0.2650447220 0.0000440591 -0.0087192823
0.3433547985 -0.0536643635 -0.0049235209
0.2650787694 0.0063660166 -0.0075532025
0.3433831517 -0.0483997047 -0.0039524054
0.2651128154 0.0126877111 -0.0063871490
-0.3418351851 -0.0373008410 0.0016188526
-0.4604106216 -0.1607467188 0.0080692000
-0.4209059917 -0.1232991876 0.0077345973
-0.2631439055 -0.0207772056 0.0056760307
-0.4208803484 -0.1185723734 0.0078066129
-0.4209381182 -0.1296408530 -0.0021203709
-0.2633207668 -0.0539803718 -0.0088341325
-0.4209637954 -0.1343676456 -0.0020469604
-0.4604387454 -0.1662814455 -0.0001666412
-0.3419107446 -0.0515201740 -0.0053741270
-0.3418823885 -0.0462549891 -0.0044029590
-0.3418540352 -0.0409903303 -0.0034318435
-0.2629503118 0.0147681228 0.0029714594
-0.3418846490 -0.0462535427 0.0053163841
-0.2629849020 0.0084465126 0.0041393784
-0.3419134572 -0.0515184384 0.0062890532
-0.2630194655 0.0021251492 0.0051982278
-0.3419420902 -0.0567823902 0.0065328030
-0.2236075791 0.0224915623 0.0049335445
-0.2630982160 -0.0123614033 0.0056623719
-0.4208603022 -0.1148833854 0.0077209386
-0.2631182622 -0.0160503913 0.0057480463
-0.2043568043 -0.0513763901 0.0000258172
-0.2041975410 -0.0218632504 0.0041078085
-0.2436378688 -0.0474747311 0.0042349164
-0.2043568043 -0.0513763901 0.0000258172
-0.2830781967 -0.0730862119 0.0043620242
-0.3028779923 -0.1006485221 0.0023845825
-0.2437573163 -0.0696095859 0.0011734229
-0.2240769682 -0.0641821305 0.0000893711
-0.3619588525 -0.1243091734 0.0046162400
-0.3817586480 -0.1518714837 0.0026387983
-0.4605596721 -0.1883378753 0.0049340097
-0.3817984639 -0.1592497686 0.0016183004
-0.3226976958 -0.1318999749 -0.0001031081
-0.3029178081 -0.1080268071 0.0013640847
-0.2241964157 -0.0863169853 -0.0029721224
-0.3028779923 -0.1006485221 0.0023845825
-0.3028249446 -0.0911965484 -0.0050552840
-0.2241792083 -0.0831660234 -0.0034089049
-0.3028652356 -0.0985745293 -0.0040326089
-0.3226374700 -0.1208716080 -0.0016318471
-0.3817124271 -0.1434949587 -0.0005656124
-0.4604387454 -0.1662814455 -0.0001666412
-0.3816721360 -0.1361169778 -0.0015882875
-0.3618797561 -0.1101309087 -0.0045003868
-0.2240583352 -0.0610320807 -0.0064769303
-0.2437298420 -0.0648842072 -0.0066328563
-0.3028249446 -0.0911965484 -0.0050552840
-0.2830325647 -0.0652104792 -0.0079673833
-0.2043465374 -0.0498019733 -0.0073436794
-0.2436089689 -0.0427502645 -0.0097008816
-0.2041853732 -0.0202900497 -0.0114343799
-0.2043465374 -0.0498019733 -0.0073436794
-0.2631061891 -0.0144771302 -0.0093870978
-0.4208323595 -0.1101583063 -0.0020993060
-0.2630861826 -0.0107881168 -0.0093025121
-0.2235996219 0.0232769640 -0.0108918493
-0.3419307299 -0.0552089370 -0.0055438427
-0.2630119241 0.0029106850 -0.0088425267
-0.3419022578 -0.0499443542 -0.0050834547
-0.2629778767 0.0092326425 -0.0076764470
-0.3418739046 -0.0446796954 -0.0041123393
-0.2629438307 0.0155543370 -0.0065103935
0.1971720999 -0.0366613687 0.0005123414
0.1720561795 -0.0309588662 0.0005291435
0.1971121347 -0.0480908904 -0.0084059458
0.1719341445 -0.0538165629 -0.0082586049
0.1468764420 -0.0370197333 0.0003666879
0.1719321816 -0.0538153070 0.0001808416
0.1467438515 -0.0615015548 -0.0009715761
0.1717677224 -0.0842912950 -0.0040343850
0.1467477184 -0.0610560521 -0.0071775305
0.1719341445 -0.0538165629 -0.0082586049
0.1468200556 -0.0477789197 -0.0082939930
0.1720583060 -0.0309602267 -0.0086136516
-0.1955461277 -0.0345294455 0.0004206839
-0.1703697864 -0.0290999612 0.0004492238
-0.1956060929 -0.0459589671 -0.0084976032
-0.1704918215 -0.0519576579 -0.0083385245
-0.1452572623 -0.0354338465 0.0002985061
-0.1704937843 -0.0519564020 0.0001009220
-0.1453898528 -0.0599156680 -0.0010397579
-0.1706582435 -0.0824323900 -0.0041143046
-0.1453859859 -0.0594701654 -0.0072457124
-0.1704918215 -0.0519576579 -0.0083385245
-0.1453136486 -0.0461930329 -0.0083621748
-0.1703676599 -0.0291013217 -0.0086935713
0.1087096065 0.0649988779 0.0201013438
0.1174644398 0.0934845186 -0.0001440201
0.0880250839 0.0651133505 0.0348980640
0.1054931098 0.0935529483 0.0231790213
0.0766565061 0.0651751299 0.0353259013
0.0827527732 0.0936782085 0.0354493784
0.0562231686 0.0652839282 0.0209072470
0.0600186730 0.0937998124 0.0231684079
0.0543147922 0.0938257975 -0.0105782416
0.0533737011 0.0652953386 -0.0065982009
0.0653010220 0.0652285317 -0.0205426395
0.0600293107 0.0937930061 -0.0225685601
0.1004359358 0.0650377361 -0.0209481459
0.0827690091 0.0936678205 -0.0343572855
0.1152391306 0.0649601466 -0.0021601052
0.1055037475 0.0935461421 -0.0225579467
0.1086965614 0.0082019194 0.0184861666
0.0941732301 0.0082830221 0.0338052332
0.0740240504 0.0083925860 0.0350301805
0.0577944913 0.0084785927 0.0208102583
0.0558953560 0.0084860961 0.0017899380
0.0704180215 0.0084050857 -0.0129283781
0.0905671899 0.0082955290 -0.0141047623
0.1067974048 0.0082094364 -0.0004425521
0.0991918778 0.1221232649 0.0228691143
0.0827527732 0.0936782085 0.0354493784
0.0661149400 0.1223028910 0.0232918850
0.0600186730 0.0937998124 0.0231684079
0.0543147922 0.0938257975 -0.0105782416
0.0549851062 0.1223576104 -0.0153444302
0.0774972978 0.1222322949 -0.0363832060
0.0827690091 0.0936678205 -0.0343572855
0.0888661347 0.1221705167 -0.0367942593
0.1055037475 0.0935461421 -0.0225579467
0.1082708160 0.1220673412 -0.0221139045
0.1174644398 0.0934845186 -0.0001440201
0.1086965614 0.0082019194 0.0184861666
0.0941732301 0.0082830221 0.0338052332
0.0740240504 0.0083925860 0.0350301805
0.0577944913 0.0084785927 0.0208102583
0.0558953560 0.0084860961 0.0017899380
0.0704180215 0.0084050857 -0.0129283781
0.0905671899 0.0082955290 -0.0141047623
0.1067974048 0.0082094364 -0.0004425521
-0.0537789938 0.0658809689 0.0200634202
-0.0450241606 0.0943666097 -0.0001819437
-0.0744624642 0.0659954359 0.0348601407
-0.0569949645 0.0944350365 0.0231410978
-0.0858313050 0.0660572166 0.0352879779
-0.0797347749 0.0945602939 0.0354114550
-0.1062651687 0.0661660178 0.0208693234
-0.1024694013 0.0946819005 0.0231304844
-0.1081738082 0.0947078886 -0.0106161652
-0.1091148993 0.0661774297 -0.0066361245
-0.0971870522 0.0661106198 -0.0205805630
-0.1024587636 0.0946750943 -0.0226064836
-0.0620524015 0.0659198257 -0.0209860695
-0.0797185390 0.0945499058 -0.0343952088
-0.0472492067 0.0658422362 -0.0021980288
-0.0569843267 0.0944282303 -0.0225958702
-0.0537920389 0.0090840104 0.0184482430
-0.0683148442 0.0091651102 0.0337673097
-0.0884640239 0.0092746742 0.0349922570
-0.1046941091 0.0093606838 0.0207723347
-0.1065932444 0.0093681871 0.0017520144
-0.0920700527 0.0092871738 -0.0129663016
-0.0719208843 0.0091776171 -0.0141426858
-0.0556911956 0.0090915274 -0.0004804758
-0.0632956703 0.1230053503 0.0228311909
-0.0797347749 0.0945602939 0.0354114550
-0.0963728712 0.1231849778 0.0232539615
-0.1024694013 0.0946819005 0.0231304844
-0.1081738082 0.0947078886 -0.0106161652
-0.1075032311 0.1232397000 -0.0153823537
-0.0849902503 0.1231143803 -0.0364211294
-0.0797185390 0.0945499058 -0.0343952088
-0.0736216764 0.1230526034 -0.0368321827
-0.0569843267 0.0944282303 -0.0225958702
-0.0542169952 0.1229494279 -0.0221518279
-0.0450241606 0.0943666097 -0.0001819437
-0.0537920389 0.0090840104 0.0184482430
-0.0683148442 0.0091651102 0.0337673097
-0.0884640239 0.0092746742 0.0349922570
-0.1046941091 0.0093606838 0.0207723347
-0.1065932444 0.0093681871 0.0017520144
-0.0920700527 0.0092871738 -0.0129663016
-0.0719208843 0.0091776171 -0.0141426858
-0.0556911956 0.0090915274 -0.0004804758
-0.0111969335 0.0069814960 0.0010876375
-0.0069924240 0.0300406604 0.0052578834
-0.0064944193 0.1223654715 0.0189378290
-0.0069924240 0.0300406604 0.0052578834
-0.0086151440 0.0300435361 -0.0349559850
-0.0113802255 0.1223853890 -0.0258334142
-0.0201649441 0.0070248568 -0.0349916024
-0.0249365713 0.0301325814 -0.0319626179
-0.0074422048 -0.0531476371 -0.0025313925
-0.0078437617 -0.1271994212 -0.0044299987
-0.0195818404 -0.0345685762 -0.0043075195
-0.0237622379 -0.0530594839 -0.0055324306
-0.0158029971 -0.0901294543 -0.0049927898
-0.0338993998 -0.0530060553 -0.0163944246
-0.0271379237 -0.0530438294 -0.0236345279
-0.0157996285 -0.0901316096 -0.0194761516
-0.0237571858 -0.0530627164 -0.0272541059
-0.0195752513 -0.0345727920 -0.0326373464
-0.0078420690 -0.1272005042 -0.0117078783
-0.0074357585 -0.0531517616 -0.0302474731
0.0021990053 0.1624819086 0.0239754146
0.0116886821 0.1722629425 0.0135895671
0.0214252495 0.1556285419 0.0239809062
0.0310256700 0.1425930641 0.0239850789
0.0473325630 0.0975422792 0.0136089767
0.0166600250 0.1035673914 0.0343741443
0.0447318827 0.0601465181 0.0136139368
0.0473325630 0.0975422792 0.0136089767
0.0156762433 0.0528896814 0.0239948579
0.0444837051 0.0580932448 0.0136141846
0.0159154919 0.0974075714 0.0343748878
0.0156762433 0.0528896814 0.0239948579
0.0154369946 0.0083717913 0.0136148280
0.0151977459 -0.0361460987 0.0032347981
0.0442444564 0.0135753548 0.0032341547
0.0154369946 0.0083717913 0.0136148280
-0.0135648172 0.0105838521 0.0136077534
-0.0420833672 0.0140439969 0.0032140065
-0.0135781953 -0.0359898847 0.0032280820
-0.0135648172 0.0105838521 0.0136077534
-0.0135514392 0.0571575889 0.0239874248
-0.0135380611 0.1037313257 0.0343670963
-0.0420699891 0.0606177337 0.0135936779
-0.0135514392 0.0571575889 0.0239874248
-0.0442758740 0.0995806848 0.0135873667
-0.0420813534 0.0621588923 0.0135934459
-0.0135721538 0.1083548017 0.0343664003
-0.0442758740 0.0995806848 0.0135873667
-0.0273926009 0.1434237191 0.0239713681
-0.0176512170 0.1563547234 0.0239717095
-0.0076519886 0.1726246977 0.0135850150
0.0018855854 0.1629971337 0.0239752650
3 144 555 77
3 138 555 144
3 77 897 93
3 10 897 77
3 93 898 101
3 108 898 93
3 101 899 22
3 224 899 101
3 22 900 220
3 556 900 22
3 556 901 72
3 22 901 556
3 557 902 220
3 12 902 557
3 557 903 258
3 220 903 557
3 558 904 258
3 257 904 558
3 558 905 220
3 258 905 558
3 259 906 257
3 559 906 259
3 559 907 62
3 259 907 559
3 257 908 259
3 560 908 257
3 560 909 220
3 257 909 560
3 561 910 91
3 261 910 561
3 561 911 12
3 91 911 561
3 562 912 261
3 260 912 562
3 562 913 12
3 261 913 562
3 262 914 260
3 563 914 262
3 563 915 113
3 262 915 563
3 564 916 262
3 12 916 564
3 260 917 262
3 564 917 260
3 565 918 264
3 91 918 565
3 565 919 11
3 264 919 565
3 566 920 264
3 263 920 566
3 566 921 91
3 264 921 566
3 265 922 263
3 567 922 265
3 567 923 254
3 265 923 567
3 263 924 265
3 568 924 263
3 568 925 91
3 263 925 568
3 569 926 267
3 219 926 569
3 569 927 266
3 267 927 569
3 570 928 11
3 219 928 570
3 570 929 267
3 11 929 570
3 266 930 571
3 268 930 266
3 571 931 112
3 268 931 571
3 572 932 268
3 11 932 572
3 268 933 572
3 266 933 268
3 573 934 23
3 63 934 573
3 23 935 573
3 219 935 23
3 100 936 73
3 23 936 100
3 94 937 223
3 100 937 94
3 76 938 109
3 94 938 76
3 144 574 9
3 76 574 144
3 10 939 138
3 270 939 10
3 270 940 269
3 10 940 270
3 271 941 269
3 77 941 271
3 269 942 271
3 10 942 269
3 108 575 10
3 272 575 108
3 272 576 93
3 108 576 272
3 224 577 108
3 273 577 224
3 273 578 101
3 224 578 273
3 72 579 224
3 274 579 72
3 274 580 22
3 72 580 274
3 62 581 72
3 276 581 62
3 276 582 275
3 62 582 276
3 277 583 275
3 220 583 277
3 275 584 277
3 62 584 275
3 585 943 280
3 279 943 585
3 585 944 113
3 280 944 585
3 586 945 280
3 62 945 586
3 586 946 279
3 280 946 586
3 587 947 281
3 279 947 587
3 587 948 278
3 281 948 587
3 588 949 281
3 113 949 588
3 588 950 279
3 281 950 588
3 589 951 282
3 278 951 589
3 589 952 283
3 282 952 589
3 590 953 283
3 12 953 590
3 590 954 282
3 283 954 590
3 591 955 284
3 282 955 591
3 591 956 113
3 284 956 591
3 592 957 278
3 282 957 592
3 592 958 284
3 278 958 592
3 288 593 287
3 286 593 288
3 288 594 285
3 287 594 288
3 289 595 287
3 113 595 289
3 289 596 286
3 287 596 289
3 291 597 290
3 286 597 291
3 291 598 91
3 290 598 291
3 292 599 290
3 285 599 292
3 292 600 286
3 290 600 292
3 295 601 294
3 293 601 295
3 295 602 285
3 294 602 295
3 296 603 294
3 254 603 296
3 296 604 293
3 294 604 296
3 298 605 297
3 293 605 298
3 298 606 113
3 297 606 298
3 299 607 297
3 285 607 299
3 299 608 293
3 297 608 299
3 303 609 302
3 301 609 303
3 303 610 300
3 302 610 303
3 304 611 302
3 112 611 304
3 304 612 301
3 302 612 304
3 306 613 305
3 301 613 306
3 306 614 254
3 305 614 306
3 307 615 305
3 300 615 307
3 307 616 301
3 305 616 307
3 310 617 309
3 308 617 310
3 310 618 300
3 309 618 310
3 311 619 309
3 11 619 311
3 311 620 308
3 309 620 311
3 313 621 312
3 308 621 313
3 313 622 112
3 312 622 313
3 314 623 312
3 300 623 314
3 314 624 308
3 312 624 314
3 625 959 316
3 315 959 625
3 625 960 317
3 316 960 625
3 626 961 317
3 112 961 626
3 626 962 316
3 317 962 626
3 627 963 318
3 316 963 627
3 627 964 219
3 318 964 627
3 628 965 315
3 316 965 628
3 628 966 318
3 315 966 628
3 629 967 320
3 319 967 629
3 629 968 63
3 320 968 629
3 630 969 320
3 112 969 630
3 630 970 319
3 320 970 630
3 631 971 321
3 319 971 631
3 631 972 315
3 321 972 631
3 632 973 321
3 63 973 632
3 632 974 319
3 321 974 632
3 322 633 63
3 323 633 322
3 323 634 23
3 322 634 323
3 324 635 63
3 322 635 324
3 63 636 324
3 73 636 63
3 325 637 73
3 100 637 325
3 73 638 325
3 223 638 73
3 326 639 223
3 94 639 326
3 223 640 326
3 109 640 223
3 327 641 109
3 76 641 327
3 109 642 327
3 9 642 109
3 328 975 9
3 329 975 328
3 329 976 144
3 328 976 329
3 330 977 9
3 328 977 330
3 9 978 330
3 138 978 9
3 145 643 79
3 138 643 145
3 79 979 95
3 10 979 79
3 95 980 103
3 108 980 95
3 103 981 24
3 224 981 103
3 24 982 222
3 644 982 24
3 644 983 72
3 24 983 644
3 645 984 222
3 14 984 645
3 645 985 332
3 222 985 645
3 646 986 332
3 331 986 646
3 646 987 222
3 332 987 646
3 333 988 331
3 647 988 333
3 647 989 62
3 333 989 647
3 331 990 333
3 648 990 331
3 648 991 222
3 331 991 648
3 649 992 92
3 335 992 649
3 649 993 14
3 92 993 649
3 650 994 335
3 334 994 650
3 650 995 14
3 335 995 650
3 336 996 334
3 651 996 336
3 651 997 113
3 336 997 651
3 652 998 336
3 14 998 652
3 334 999 336
3 652 999 334
3 653 1000 338
3 92 1000 653
3 653 1001 13
3 338 1001 653
3 654 1002 338
3 337 1002 654
3 654 1003 92
3 338 1003 654
3 339 1004 337
3 655 1004 339
3 655 1005 254
3 339 1005 655
3 337 1006 339
3 656 1006 337
3 656 1007 92
3 337 1007 656
3 657 1008 341
3 221 1008 657
3 657 1009 340
3 341 1009 657
3 658 1010 13
3 221 1010 658
3 658 1011 341
3 13 1011 658
3 340 1012 659
3 342 1012 340
3 659 1013 112
3 342 1013 659
3 660 1014 342
3 13 1014 660
3 342 1015 660
3 340 1015 342
3 661 1016 25
3 63 1016 661
3 25 1017 661
3 221 1017 25
3 102 1018 73
3 25 1018 102
3 96 1019 223
3 102 1019 96
3 78 1020 109
3 96 1020 78
3 145 662 9
3 78 662 145
3 10 1021 138
3 344 1021 10
3 344 1022 343
3 10 1022 344
3 345 1023 343
3 79 1023 345
3 343 1024 345
3 10 1024 343
3 108 663 10
3 346 663 108
3 346 664 95
3 108 664 346
3 224 665 108
3 347 665 224
3 347 666 103
3 224 666 347
3 72 667 224
3 348 667 72
3 348 668 24
3 72 668 348
3 62 669 72
3 350 669 62
3 350 670 349
3 62 670 350
3 351 671 349
3 222 671 351
3 349 672 351
3 62 672 349
3 673 1025 354
3 353 1025 673
3 673 1026 113
3 354 1026 673
3 674 1027 354
3 62 1027 674
3 674 1028 353
3 354 1028 674
3 675 1029 355
3 353 1029 675
3 675 1030 352
3 355 1030 675
3 676 1031 355
3 113 1031 676
3 676 1032 353
3 355 1032 676
3 677 1033 356
3 352 1033 677
3 677 1034 357
3 356 1034 677
3 678 1035 357
3 14 1035 678
3 678 1036 356
3 357 1036 678
3 679 1037 358
3 356 1037 679
3 679 1038 113
3 358 1038 679
3 680 1039 352
3 356 1039 680
3 680 1040 358
3 352 1040 680
3 362 681 361
3 360 681 362
3 362 682 359
3 361 682 362
3 363 683 361
3 113 683 363
3 363 684 360
3 361 684 363
3 365 685 364
3 360 685 365
3 365 686 92
3 364 686 365
3 366 687 364
3 359 687 366
3 366 688 360
3 364 688 366
3 369 689 368
3 367 689 369
3 369 690 359
3 368 690 369
3 370 691 368
3 254 691 370
3 370 692 367
3 368 692 370
3 372 693 371
3 367 693 372
3 372 694 113
3 371 694 372
3 373 695 371
3 359 695 373
3 373 696 367
3 371 696 373
3 377 697 376
3 375 697 377
3 377 698 374
3 376 698 377
3 378 699 376
3 112 699 378
3 378 700 375
3 376 700 378
3 380 701 379
3 375 701 380
3 380 702 254
3 379 702 380
3 381 703 379
3 374 703 381
3 381 704 375
3 379 704 381
3 384 705 383
3 382 705 384
3 384 706 374
3 383 706 384
3 385 707 383
3 13 707 385
3 385 708 382
3 383 708 385
3 387 709 386
3 382 709 387
3 387 710 112
3 386 710 387
3 388 711 386
3 374 711 388
3 388 712 382
3 386 712 388
3 713 1041 390
3 389 1041 713
3 713 1042 391
3 390 1042 713
3 714 1043 391
3 112 1043 714
3 714 1044 390
3 391 1044 714
3 715 1045 392
3 390 1045 715
3 715 1046 221
3 392 1046 715
3 716 1047 389
3 390 1047 716
3 716 1048 392
3 389 1048 716
3 717 1049 394
3 393 1049 717
3 717 1050 63
3 394 1050 717
3 718 1051 394
3 112 1051 718
3 718 1052 393
3 394 1052 718
3 719 1053 395
3 393 1053 719
3 719 1054 389
3 395 1054 719
3 720 1055 395
3 63 1055 720
3 720 1056 393
3 395 1056 720
3 396 721 63
3 397 721 396
3 397 722 25
3 396 722 397
3 398 723 63
3 396 723 398
3 63 724 398
3 73 724 63
3 399 725 73
3 102 725 399
3 73 726 399
3 223 726 73
3 400 727 223
3 96 727 400
3 223 728 400
3 109 728 223
3 401 729 109
3 78 729 401
3 109 730 401
3 9 730 109
3 402 1057 9
3 403 1057 402
3 403 1058 145
3 402 1058 403
3 404 1059 9
3 402 1059 404
3 9 1060 404
3 138 1060 9
3 225 1061 213
3 144 1061 225
3 77 80 213
3 93 64 80
3 101 182 64
3 182 731 58
3 22 731 182
3 58 1062 1
3 406 1062 58
3 406 1063 405
3 58 1063 406
3 407 1064 405
3 220 1064 407
3 405 1065 407
3 58 1065 405
3 1 732 190
3 409 732 1
3 409 733 408
3 1 733 409
3 410 734 408
3 12 734 410
3 408 735 410
3 1 735 408
3 411 736 2
3 412 736 411
3 412 737 91
3 411 737 412
3 413 738 2
3 411 738 413
3 2 739 413
3 190 739 2
3 414 1066 59
3 415 1066 414
3 415 1067 11
3 414 1067 415
3 416 1068 59
3 414 1068 416
3 59 1069 416
3 2 1069 59
3 183 740 219
3 59 740 183
3 23 65 183
3 81 1070 100
3 65 1070 81
3 214 1071 94
3 81 1071 214
3 225 1072 76
3 214 1072 225
3 77 741 144
3 417 741 77
3 417 742 213
3 77 742 417
3 93 1073 77
3 743 1073 93
3 743 1074 80
3 93 1074 743
3 101 1075 93
3 744 1075 101
3 744 1076 64
3 101 1076 744
3 22 1077 101
3 745 1077 22
3 745 1078 182
3 22 1078 745
3 220 1079 22
3 746 1079 220
3 746 1080 418
3 220 1080 746
3 747 1081 418
3 58 1081 747
3 418 1082 747
3 220 1082 418
3 12 748 220
3 421 748 12
3 421 749 420
3 12 749 421
3 422 750 420
3 419 750 422
3 420 751 422
3 12 751 420
3 423 752 419
3 424 752 423
3 424 753 1
3 423 753 424
3 419 754 423
3 425 754 419
3 425 755 12
3 419 755 425
3 756 1083 428
3 91 1083 756
3 756 1084 12
3 428 1084 756
3 757 1085 428
3 427 1085 757
3 757 1086 91
3 428 1086 757
3 429 1087 427
3 758 1087 429
3 758 1088 426
3 429 1088 758
3 429 1089 759
3 427 1089 429
3 759 1090 91
3 427 1090 759
3 430 1091 426
3 760 1091 430
3 760 1092 431
3 430 1092 760
3 761 1093 431
3 190 1093 761
3 431 1094 761
3 430 1094 431
3 426 1095 430
3 762 1095 426
3 762 1096 432
3 426 1096 762
3 763 1097 432
3 91 1097 763
3 432 1098 763
3 426 1098 432
3 435 1099 433
3 764 1099 435
3 764 1100 91
3 435 1100 764
3 765 1101 433
3 435 1101 765
3 433 1102 765
3 434 1102 433
3 436 1103 434
3 766 1103 436
3 766 1104 2
3 436 1104 766
3 767 1105 434
3 436 1105 767
3 434 1106 767
3 433 1106 434
3 768 1107 437
3 91 1107 768
3 438 1108 437
3 768 1108 438
3 769 1109 438
3 433 1109 769
3 438 1110 769
3 437 1110 438
3 770 1111 439
3 91 1111 770
3 770 1112 437
3 439 1112 770
3 771 1113 439
3 11 1113 771
3 771 1114 91
3 439 1114 771
3 442 772 440
3 11 772 442
3 440 773 442
3 441 773 440
3 443 774 441
3 59 774 443
3 441 775 443
3 440 775 441
3 444 776 11
3 445 776 444
3 445 777 440
3 444 777 445
3 446 778 11
3 444 778 446
3 11 779 446
3 219 779 11
3 447 1115 219
3 780 1115 447
3 780 1116 183
3 447 1116 780
3 781 1117 219
3 447 1117 781
3 219 1118 781
3 23 1118 219
3 782 1119 23
3 65 1119 782
3 23 1120 782
3 100 1120 23
3 783 1121 100
3 81 1121 783
3 100 1122 783
3 94 1122 100
3 784 1123 94
3 214 1123 784
3 94 1124 784
3 76 1124 94
3 448 785 76
3 225 785 448
3 76 786 448
3 144 786 76
3 226 1125 215
3 145 1125 226
3 79 82 215
3 95 66 82
3 103 184 66
3 184 787 60
3 24 787 184
3 60 1126 3
3 450 1126 60
3 450 1127 449
3 60 1127 450
3 451 1128 449
3 222 1128 451
3 449 1129 451
3 60 1129 449
3 3 788 191
3 453 788 3
3 453 789 452
3 3 789 453
3 454 790 452
3 14 790 454
3 452 791 454
3 3 791 452
3 455 792 4
3 456 792 455
3 456 793 92
3 455 793 456
3 457 794 4
3 455 794 457
3 4 795 457
3 191 795 4
3 458 1130 61
3 459 1130 458
3 459 1131 13
3 458 1131 459
3 460 1132 61
3 458 1132 460
3 61 1133 460
3 4 1133 61
3 185 796 221
3 61 796 185
3 25 67 185
3 83 1134 102
3 67 1134 83
3 216 1135 96
3 83 1135 216
3 226 1136 78
3 216 1136 226
3 79 797 145
3 461 797 79
3 461 798 215
3 79 798 461
3 95 1137 79
3 799 1137 95
3 799 1138 82
3 95 1138 799
3 103 1139 95
3 800 1139 103
3 800 1140 66
3 103 1140 800
3 24 1141 103
3 801 1141 24
3 801 1142 184
3 24 1142 801
3 222 1143 24
3 802 1143 222
3 802 1144 462
3 222 1144 802
3 803 1145 462
3 60 1145 803
3 462 1146 803
3 222 1146 462
3 14 804 222
3 465 804 14
3 465 805 464
3 14 805 465
3 466 806 464
3 463 806 466
3 464 807 466
3 14 807 464
3 467 808 463
3 468 808 467
3 468 809 3
3 467 809 468
3 463 810 467
3 469 810 463
3 469 811 14
3 463 811 469
3 812 1147 472
3 92 1147 812
3 812 1148 14
3 472 1148 812
3 813 1149 472
3 471 1149 813
3 813 1150 92
3 472 1150 813
3 473 1151 471
3 814 1151 473
3 814 1152 470
3 473 1152 814
3 473 1153 815
3 471 1153 473
3 815 1154 92
3 471 1154 815
3 474 1155 470
3 816 1155 474
3 816 1156 475
3 474 1156 816
3 817 1157 475
3 191 1157 817
3 475 1158 817
3 474 1158 475
3 470 1159 474
3 818 1159 470
3 818 1160 476
3 470 1160 818
3 819 1161 476
3 92 1161 819
3 476 1162 819
3 470 1162 476
3 479 1163 477
3 820 1163 479
3 820 1164 92
3 479 1164 820
3 821 1165 477
3 479 1165 821
3 477 1166 821
3 478 1166 477
3 480 1167 478
3 822 1167 480
3 822 1168 4
3 480 1168 822
3 823 1169 478
3 480 1169 823
3 478 1170 823
3 477 1170 478
3 824 1171 481
3 92 1171 824
3 482 1172 481
3 824 1172 482
3 825 1173 482
3 477 1173 825
3 482 1174 825
3 481 1174 482
3 826 1175 483
3 92 1175 826
3 826 1176 481
3 483 1176 826
3 827 1177 483
3 13 1177 827
3 827 1178 92
3 483 1178 827
3 486 828 484
3 13 828 486
3 484 829 486
3 485 829 484
3 487 830 485
3 61 830 487
3 485 831 487
3 484 831 485
3 488 832 13
3 489 832 488
3 489 833 484
3 488 833 489
3 490 834 13
3 488 834 490
3 13 835 490
3 221 835 13
3 491 1179 221
3 836 1179 491
3 836 1180 185
3 491 1180 836
3 837 1181 221
3 491 1181 837
3 221 1182 837
3 25 1182 221
3 838 1183 25
3 67 1183 838
3 25 1184 838
3 102 1184 25
3 839 1185 102
3 83 1185 839
3 102 1186 839
3 96 1186 102
3 840 1187 96
3 216 1187 840
3 96 1188 840
3 78 1188 96
3 492 841 78
3 226 841 492
3 78 842 492
3 145 842 78
3 218 71 98
3 117 177 71
3 29 54 177
3 189 18 54
3 107 8 18
3 136 1189 843
3 8 1189 136
3 843 1190 180
3 8 1190 843
3 136 844 31
3 493 844 136
3 493 845 167
3 136 845 493
3 137 846 494
3 31 846 137
3 494 847 87
3 31 847 494
3 7 1191 848
3 137 1191 7
3 848 1192 166
3 137 1192 848
3 181 17 7
3 106 55 17
3 188 176 55
3 28 70 176
3 116 98 70
3 218 117 71
3 117 29 177
3 29 189 54
3 189 107 18
3 107 180 8
3 167 1193 180
3 849 1193 167
3 849 1194 136
3 167 1194 849
3 87 1195 167
3 495 1195 87
3 495 1196 31
3 87 1196 495
3 87 1197 496
3 166 1197 87
3 496 1198 137
3 166 1198 496
3 181 1199 166
3 850 1199 181
3 850 1200 7
3 181 1200 850
3 181 106 17
3 106 188 55
3 188 28 176
3 28 116 70
3 116 218 98
3 217 69 97
3 115 175 69
3 27 52 175
3 187 16 52
3 105 6 16
3 134 1201 851
3 6 1201 134
3 851 1202 178
3 6 1202 851
3 134 852 30
3 497 852 134
3 497 853 165
3 134 853 497
3 135 854 498
3 30 854 135
3 498 855 86
3 30 855 498
3 5 1203 856
3 135 1203 5
3 856 1204 164
3 135 1204 856
3 179 15 5
3 104 53 15
3 186 174 53
3 26 68 174
3 114 97 68
3 217 115 69
3 115 27 175
3 27 187 52
3 187 105 16
3 105 178 6
3 165 1205 178
3 857 1205 165
3 857 1206 134
3 165 1206 857
3 86 1207 165
3 499 1207 86
3 499 1208 30
3 86 1208 499
3 86 1209 500
3 164 1209 86
3 500 1210 135
3 164 1210 500
3 179 1211 164
3 858 1211 179
3 858 1212 5
3 179 1212 858
3 179 104 15
3 104 186 53
3 186 26 174
3 26 114 68
3 114 217 97
3 39 239 243
3 47 253 239
3 45 236 253
3 40 247 236
3 49 237 247
3 41 252 237
3 46 240 252
3 48 243 240
3 125 1213 127
3 501 1213 125
3 501 1214 243
3 125 1214 501
3 127 1215 132
3 502 1215 127
3 502 1216 239
3 127 1216 502
3 129 1217 503
3 132 1217 129
3 503 1218 253
3 132 1218 503
3 131 1219 504
3 129 1219 131
3 504 1220 236
3 129 1220 504
3 859 1221 130
3 247 1221 859
3 131 1222 130
3 859 1222 131
3 133 1223 505
3 130 1223 133
3 505 1224 237
3 130 1224 505
3 133 1225 128
3 506 1225 133
3 506 1226 252
3 133 1226 506
3 128 1227 125
3 860 1227 128
3 860 1228 240
3 128 1228 860
3 206 1229 211
3 125 1229 206
3 211 1230 210
3 127 1230 211
3 210 1231 201
3 132 1231 210
3 201 1232 204
3 129 1232 201
3 204 1233 202
3 131 1233 204
3 202 1234 209
3 130 1234 202
3 209 1235 212
3 133 1235 209
3 212 1236 206
3 128 1236 212
3 206 157 161
3 211 160 157
3 210 149 160
3 201 158 149
3 204 148 158
3 202 159 148
3 209 156 159
3 212 161 156
3 39 47 239
3 47 45 253
3 45 40 236
3 40 49 247
3 49 41 237
3 41 46 252
3 46 48 240
3 48 39 243
3 239 861 243
3 507 861 239
3 507 862 127
3 239 862 507
3 253 1237 239
3 508 1237 253
3 508 1238 132
3 253 1238 508
3 253 1239 509
3 236 1239 253
3 509 1240 129
3 236 1240 509
3 236 863 510
3 247 863 236
3 510 864 131
3 247 864 510
3 511 1241 247
3 130 1241 511
3 237 1242 247
3 511 1242 237
3 237 1243 512
3 252 1243 237
3 512 1244 133
3 252 1244 512
3 240 1245 252
3 513 1245 240
3 513 1246 128
3 240 1246 513
3 243 1247 240
3 514 1247 243
3 514 1248 125
3 243 1248 514
3 127 1249 125
3 211 1249 127
3 132 1250 127
3 210 1250 132
3 129 1251 132
3 201 1251 129
3 131 1252 129
3 204 1252 131
3 130 1253 131
3 202 1253 130
3 133 1254 130
3 209 1254 133
3 128 1255 133
3 212 1255 128
3 125 1256 128
3 206 1256 125
3 206 211 157
3 211 210 160
3 210 201 149
3 201 204 158
3 204 202 148
3 202 209 159
3 209 212 156
3 212 206 161
3 34 248 238
3 42 235 248
3 37 245 235
3 35 244 245
3 44 246 244
3 36 234 246
3 38 249 234
3 43 238 249
3 120 1257 121
3 515 1257 120
3 515 1258 238
3 120 1258 515
3 121 1259 118
3 516 1259 121
3 516 1260 248
3 121 1260 516
3 123 1261 517
3 118 1261 123
3 517 1262 235
3 118 1262 517
3 126 1263 518
3 123 1263 126
3 518 1264 245
3 123 1264 518
3 865 1265 124
3 244 1265 865
3 126 1266 124
3 865 1266 126
3 119 1267 519
3 124 1267 119
3 519 1268 246
3 124 1268 519
3 119 1269 122
3 520 1269 119
3 520 1270 234
3 119 1270 520
3 122 1271 120
3 866 1271 122
3 866 1272 249
3 122 1272 866
3 205 1273 207
3 120 1273 205
3 207 1274 200
3 121 1274 207
3 200 1275 197
3 118 1275 200
3 197 1276 203
3 123 1276 197
3 203 1277 198
3 126 1277 203
3 198 1278 199
3 124 1278 198
3 199 1279 208
3 119 1279 199
3 208 1280 205
3 122 1280 208
3 205 163 153
3 207 152 163
3 200 155 152
3 197 150 155
3 203 154 150
3 198 151 154
3 199 162 151
3 208 153 162
3 34 42 248
3 42 37 235
3 37 35 245
3 35 44 244
3 44 36 246
3 36 38 234
3 38 43 249
3 43 34 238
3 248 867 238
3 521 867 248
3 521 868 121
3 248 868 521
3 235 1281 248
3 522 1281 235
3 522 1282 118
3 235 1282 522
3 235 1283 523
3 245 1283 235
3 523 1284 123
3 245 1284 523
3 245 869 524
3 244 869 245
3 524 870 126
3 244 870 524
3 525 1285 244
3 124 1285 525
3 246 1286 244
3 525 1286 246
3 246 1287 526
3 234 1287 246
3 526 1288 119
3 234 1288 526
3 249 1289 234
3 527 1289 249
3 527 1290 122
3 249 1290 527
3 238 1291 249
3 528 1291 238
3 528 1292 120
3 238 1292 528
3 121 1293 120
3 207 1293 121
3 118 1294 121
3 200 1294 118
3 123 1295 118
3 197 1295 123
3 126 1296 123
3 203 1296 126
3 124 1297 126
3 198 1297 124
3 119 1298 124
3 199 1298 119
3 122 1299 119
3 208 1299 122
3 120 1300 122
3 205 1300 120
3 205 207 163
3 207 200 152
3 200 197 155
3 197 203 150
3 203 198 154
3 198 199 151
3 199 208 162
3 208 205 153
3 228 1301 530
3 230 1301 228
3 530 1302 529
3 230 1302 530
3 531 1303 529
3 143 1303 531
3 531 1304 230
3 529 1304 531
3 228 871 231
3 532 871 228
3 532 872 139
3 228 872 532
3 533 873 227
3 141 873 533
3 231 874 227
3 533 874 231
3 535 1305 534
3 229 1305 535
3 535 1306 140
3 534 1306 535
3 229 1307 536
3 227 1307 229
3 536 1308 534
3 227 1308 536
3 230 193 196
3 228 195 193
3 231 192 195
3 227 194 192
3 139 875 143
3 228 875 139
3 141 876 139
3 537 876 141
3 537 877 231
3 141 877 537
3 140 878 141
3 538 878 140
3 538 879 227
3 140 879 538
3 142 880 140
3 229 880 142
3 881 1309 539
3 230 1309 881
3 881 1310 193
3 539 1310 881
3 230 1311 882
3 228 1311 230
3 882 1312 539
3 228 1312 882
3 540 1313 228
3 195 1313 540
3 228 1314 540
3 231 1314 228
3 231 1315 541
3 227 1315 231
3 541 1316 192
3 227 1316 541
3 883 1317 227
3 542 1317 883
3 229 1318 227
3 883 1318 229
3 884 1319 542
3 194 1319 884
3 884 1320 229
3 542 1320 884
3 88 84 19
3 74 256 84
3 50 56 256
3 33 110 56
3 20 90 110
3 232 146 90
3 173 99 146
3 0 147 99
3 172 89 147
3 233 111 89
3 21 57 111
3 32 255 57
3 51 85 255
3 75 19 85
3 885 1321 88
3 84 1321 885
3 74 1322 88
3 885 1322 74
3 50 1323 74
3 256 1323 50
3 50 1324 56
3 33 1324 50
3 33 20 110
3 20 886 90
3 232 886 20
3 887 1325 543
3 232 1325 887
3 887 1326 146
3 543 1326 887
3 888 1327 543
3 173 1327 888
3 888 1328 232
3 543 1328 888
3 889 1329 545
3 544 1329 889
3 889 1330 173
3 545 1330 889
3 890 1331 545
3 99 1331 890
3 890 1332 544
3 545 1332 890
3 891 1333 546
3 544 1333 891
3 891 1334 0
3 546 1334 891
3 892 1335 546
3 173 1335 892
3 892 1336 544
3 546 1336 892
3 549 1337 548
3 547 1337 549
3 549 1338 172
3 548 1338 549
3 550 1339 548
3 0 1339 550
3 550 1340 547
3 548 1340 550
3 552 1341 551
3 547 1341 552
3 552 1342 147
3 551 1342 552
3 553 1343 551
3 172 1343 553
3 553 1344 547
3 551 1344 553
3 893 1345 554
3 233 1345 893
3 893 1346 172
3 554 1346 893
3 894 1347 554
3 89 1347 894
3 894 1348 233
3 554 1348 894
3 21 895 233
3 111 895 21
3 21 32 57
3 51 1349 32
3 255 1349 51
3 51 1350 85
3 75 1350 51
3 75 1351 896
3 88 1351 75
3 896 1352 19
3 88 1352 896
3 250 241 170
3 170 241 168
3 250 171 251
3 250 170 171
3 250 251 241
3 241 251 242
3 241 242 169
3 241 169 168
3 170 169 171
3 170 168 169
3 171 242 251
3 171 169 242