OFF

176 348 0
-0.012177 -0.034859 -0.027949
0.048603 0.054119 -0.031511
0.068035 0.017902 -0.033766
0.304023 0.051688 -0.034106
-0.046387 -0.028118 -0.031902
0.070497 0.065011 -0.007787
-0.204352 0.030042 0.051763
-0.296090 0.033679 0.039646
-0.270932 -0.007028 0.017187
-0.008566 0.058399 0.010164
0.068186 0.010841 -0.032180
-0.147435 -0.029555 0.043383
-0.146995 0.012245 0.048039
-0.268569 -0.003550 0.042107
-0.300569 0.002799 -0.007606
-0.152527 0.065994 -0.010285
-0.010242 0.067001 -0.007515
-0.304624 0.012827 -0.001448
-0.123443 -0.002396 -0.038096
-0.268272 0.045102 0.045253
-0.046630 -0.015967 -0.034461
0.048274 0.031505 -0.034980
0.052165 0.005391 0.006048
-0.269273 -0.006170 0.034683
-0.149470 0.065986 0.021950
-0.300746 0.007945 0.039451
-0.206727 0.067199 0.026724
0.049001 0.060891 -0.027304
0.071161 0.006280 -0.000809
-0.011919 0.058408 -0.025199
0.068276 0.055082 -0.031220
-0.301040 0.007010 0.036347
-0.043776 0.067298 -0.004335
-0.012764 -0.015143 -0.034127
-0.088125 0.067691 -0.000129
-0.301245 0.018304 0.034191
-0.208194 0.068764 0.011257
-0.008307 -0.034869 0.012869
0.070756 0.003652 -0.005073
-0.296862 0.036001 0.031498
-0.204456 0.009749 0.050656
-0.303900 0.018310 0.006197
0.070979 0.061224 -0.002708
-0.007720 -0.015156 0.019058
-0.150999 -0.043736 0.005805
-0.295060 0.017316 0.050499
-0.209661 0.067207 -0.004211
-0.304104 0.007018 0.004035
-0.295139 0.007113 0.049660
0.052063 0.054110 0.004986
-0.155002 0.012266 -0.036401
-0.154841 0.033641 -0.034694
-0.208194 -0.008660 0.011237
-0.304399 0.007955 0.000931
0.049547 0.065057 -0.021548
-0.211931 0.009769 -0.028172
0.050333 0.066465 -0.013259
-0.300520 0.012817 0.041833
0.051119 0.065053 -0.004971
-0.272980 0.051247 -0.004386
-0.274011 0.008044 -0.015278
-0.267767 0.024624 0.050572
-0.295177 0.024747 0.049262
-0.300151 0.000007 -0.003198
-0.268116 0.000989 0.046894
-0.154562 -0.029536 -0.031766
-0.007935 -0.027141 0.016791
-0.300425 0.029920 -0.006078
0.050333 -0.003465 -0.013277
-0.304542 0.015319 -0.000576
-0.040921 -0.015982 0.025750
-0.086650 0.065445 0.015427
-0.296447 -0.001615 0.035867
-0.153097 -0.042206 -0.016326
-0.212036 0.030062 -0.029269
-0.300848 0.017038 0.038382
-0.085626 0.058813 0.026225
-0.273970 0.036726 -0.014834
-0.297975 0.036789 0.019762
-0.303648 0.006476 0.008846
0.051665 0.060884 0.000782
-0.267895 0.036710 0.049230
-0.210679 0.062595 -0.014950
-0.300576 0.009396 0.041244
-0.041164 -0.028132 0.023184
-0.147104 -0.017105 0.046882
-0.011232 0.064831 -0.017951
-0.297975 -0.002141 0.019753
-0.204507 0.044821 0.050134
-0.012835 0.013110 -0.034865
-0.044896 0.065098 -0.016150
-0.147634 0.048461 0.041313
-0.091373 0.048057 -0.034383
-0.210208 -0.007601 -0.010001
-0.211613 0.001159 -0.024819
0.052392 0.031495 0.008444
-0.299503 -0.001607 0.003637
-0.153588 0.059322 -0.021477
0.017783 -0.000983 -0.034260
-0.204965 0.055082 0.045306
-0.084366 -0.017077 0.039489
-0.115682 -0.002516 0.043744
-0.295525 0.029907 0.045599
-0.040841 0.012656 0.026600
-0.041878 0.058578 0.015679
-0.268886 0.051236 0.038789
-0.091833 0.033321 -0.039244
0.048501 0.005401 -0.032597
-0.148409 0.059308 0.033138
-0.084686 -0.029442 0.036113
-0.009253 0.064826 0.002920
-0.300773 0.024762 -0.009744
-0.153987 -0.037567 -0.025714
0.068628 0.061231 -0.027506
-0.274098 0.024640 -0.016182
-0.084261 0.012072 0.040606
-0.046242 0.048007 -0.030351
0.303858 0.052880 -0.035844
-0.295799 -0.000005 0.042705
-0.273749 0.001003 -0.012516
-0.041309 0.047994 0.021672
-0.154364 0.048479 -0.029657
-0.267854 0.008028 0.049659
-0.205326 -0.004408 0.041486
0.052336 0.013166 0.007848
-0.045674 0.058587 -0.024354
0.071331 0.055074 0.001003
0.071572 0.017893 0.003531
-0.007650 0.013097 0.019809
-0.299088 0.036007 0.008026
-0.300890 0.017332 -0.010984
-0.300811 0.007128 -0.010150
-0.084417 0.033301 0.038969
-0.148010 -0.037583 0.037327
-0.091989 0.012092 -0.040893
-0.042655 0.065093 0.007479
0.068851 0.003657 -0.025170
0.051870 0.000378 0.002933
0.049254 -0.002510 -0.024657
-0.211423 0.055098 -0.022800
-0.211062 -0.004393 -0.019010
-0.084877 0.048040 0.034115
0.186857 0.024157 -0.025214
-0.046710 0.012671 -0.035297
-0.273593 0.045116 -0.010853
0.068446 0.006287 -0.029432
-0.154893 -0.017084 -0.035259
0.303954 0.052426 -0.034840
-0.090624 0.058826 -0.026488
-0.205709 0.062582 0.037460
-0.304569 0.009406 -0.000861
-0.211881 0.044840 -0.027633
0.022336 0.008169 0.013751
-0.089600 0.065453 -0.015687
-0.091564 -0.029424 -0.036420
-0.301497 0.006471 0.031535
-0.091884 -0.017058 -0.039790
-0.269724 0.055012 0.029944
-0.299861 0.033689 -0.000122
0.071421 0.010833 0.001941
-0.304297 0.017048 0.002005
0.051412 -0.002516 -0.001895
-0.204775 0.001142 0.047299
-0.272592 -0.006161 -0.000309
0.048796 0.000386 -0.029485
-0.270933 0.056292 0.017203
-0.295381 0.002785 0.047114
-0.206180 -0.007612 0.032476
-0.272141 0.055019 0.004461
-0.300603 0.015308 0.040962
0.069803 0.002790 -0.015121
-0.012549 -0.027129 -0.031867
-0.273295 -0.003538 -0.007731
-0.147157 0.033621 0.046343
0.048330 0.013177 -0.034393
-0.148900 -0.042217 0.027937
3 147 117 3
3 117 142 3
3 117 113 142
3 117 5 113
3 5 54 113
3 5 56 54
3 113 30 142
3 30 2 142
3 2 10 142
3 10 145 142
3 145 136 142
3 142 126 3
3 142 127 126
3 142 159 127
3 142 28 159
3 5 58 56
3 136 170 142
3 37 0 84
3 0 4 84
3 4 109 84
3 4 154 109
3 154 44 109
3 44 175 109
3 154 73 44
3 175 133 109
3 154 112 73
3 133 11 109
3 154 65 112
3 37 138 0
3 37 68 138
3 37 161 68
3 84 66 37
3 37 137 161
3 175 167 133
3 112 140 73
3 30 21 2
3 30 1 21
3 127 95 126
3 95 49 126
3 142 38 28
3 1 29 21
3 29 89 21
3 29 116 89
3 116 143 89
3 116 106 143
3 116 92 106
3 29 125 116
3 95 9 49
3 95 128 9
3 128 120 9
3 120 104 9
3 9 80 49
3 128 103 120
3 103 132 120
3 103 115 132
3 127 124 95
3 125 148 116
3 120 141 104
3 36 24 26
3 36 15 24
3 15 34 24
3 15 153 34
3 129 78 158
3 78 41 158
3 78 39 41
3 39 35 41
3 35 155 41
3 155 79 41
3 155 87 79
3 155 72 87
3 17 53 150
3 41 17 160
3 41 47 17
3 75 169 57
3 41 79 47
3 17 69 160
3 47 53 17
3 35 25 155
3 155 25 31
3 75 57 25
3 75 25 35
3 25 57 83
3 98 33 174
3 95 43 152
3 5 117 42
3 42 147 126
3 142 170 38
3 1 30 27
3 27 113 54
3 58 5 80
3 80 42 49
3 124 127 22
3 22 159 137
3 137 28 161
3 161 38 68
3 68 170 138
3 138 136 164
3 164 145 107
3 107 10 174
3 174 2 21
3 29 27 86
3 86 54 16
3 16 56 110
3 110 58 9
3 152 128 95
3 152 43 128
3 43 124 66
3 66 22 37
3 0 164 171
3 171 107 33
3 98 89 33
3 98 174 89
3 125 29 90
3 90 86 32
3 32 16 135
3 135 110 104
3 103 128 70
3 70 43 84
3 4 171 20
3 20 33 143
3 134 143 106
3 92 116 148
3 148 125 153
3 153 90 34
3 34 32 71
3 71 135 76
3 76 104 141
3 141 120 132
3 115 103 100
3 100 70 109
3 154 4 156
3 156 20 134
3 50 134 51
3 51 106 121
3 121 92 97
3 97 148 15
3 24 71 108
3 108 76 91
3 91 141 173
3 173 132 12
3 101 12 115
3 101 85 12
3 85 100 11
3 65 154 146
3 18 146 156
3 18 50 146
3 74 50 151
3 151 51 139
3 139 121 82
3 82 97 46
3 46 15 36
3 26 24 149
3 149 108 99
3 99 91 88
3 88 173 6
3 6 12 40
3 40 85 162
3 162 11 123
3 123 133 167
3 167 175 52
3 52 44 93
3 93 73 140
3 140 112 94
3 94 65 55
3 55 146 74
3 114 74 77
3 77 151 144
3 144 139 59
3 59 82 168
3 168 46 165
3 165 36 157
3 157 26 105
3 105 149 19
3 19 99 81
3 81 88 61
3 61 6 122
3 122 40 64
3 64 162 13
3 13 123 23
3 23 167 8
3 8 52 163
3 163 93 172
3 172 140 119
3 119 94 60
3 60 55 114
3 130 114 111
3 111 77 67
3 67 144 158
3 158 59 129
3 129 168 78
3 78 165 39
3 39 157 7
3 7 105 102
3 102 19 62
3 62 81 45
3 45 61 48
3 48 122 166
3 166 64 118
3 118 13 72
3 72 23 87
3 87 8 96
3 96 163 63
3 63 172 14
3 14 119 131
3 131 60 130
3 17 130 69
3 69 111 160
3 160 67 41
3 35 7 75
3 75 102 169
3 169 62 57
3 57 45 83
3 83 48 25
3 25 166 31
3 31 118 155
3 79 96 47
3 47 63 53
3 53 14 150
3 150 131 17
3 117 147 42
3 147 3 126
3 30 113 27
3 5 42 80
3 42 126 49
3 127 159 22
3 159 28 137
3 28 38 161
3 38 170 68
3 170 136 138
3 136 145 164
3 145 10 107
3 10 2 174
3 1 27 29
3 27 54 86
3 54 56 16
3 56 58 110
3 58 80 9
3 95 124 43
3 124 22 66
3 22 137 37
3 138 164 0
3 164 107 171
3 107 174 33
3 174 21 89
3 29 86 90
3 86 16 32
3 16 110 135
3 110 9 104
3 128 43 70
3 43 66 84
3 0 171 4
3 171 33 20
3 33 89 143
3 125 90 153
3 90 32 34
3 32 135 71
3 135 104 76
3 103 70 100
3 70 84 109
3 4 20 156
3 20 143 134
3 134 106 51
3 106 92 121
3 92 148 97
3 148 153 15
3 34 71 24
3 71 76 108
3 76 141 91
3 141 132 173
3 132 115 12
3 101 100 85
3 101 115 100
3 100 109 11
3 154 156 146
3 18 134 50
3 18 156 134
3 50 51 151
3 51 121 139
3 121 97 82
3 97 15 46
3 24 108 149
3 108 91 99
3 91 173 88
3 173 12 6
3 12 85 40
3 85 11 162
3 11 133 123
3 175 44 52
3 44 73 93
3 112 65 94
3 65 146 55
3 146 50 74
3 74 151 77
3 151 139 144
3 139 82 59
3 82 46 168
3 46 36 165
3 36 26 157
3 26 149 105
3 149 99 19
3 99 88 81
3 88 6 61
3 6 40 122
3 40 162 64
3 162 123 13
3 123 167 23
3 167 52 8
3 52 93 163
3 93 140 172
3 140 94 119
3 94 55 60
3 55 74 114
3 114 77 111
3 77 144 67
3 144 59 158
3 59 168 129
3 168 165 78
3 165 157 39
3 157 105 7
3 105 19 102
3 19 81 62
3 81 61 45
3 61 122 48
3 122 64 166
3 64 13 118
3 13 23 72
3 23 8 87
3 8 163 96
3 163 172 63
3 172 119 14
3 119 60 131
3 60 114 130
3 130 111 69
3 111 67 160
3 67 158 41
3 39 7 35
3 7 102 75
3 102 62 169
3 62 45 57
3 45 48 83
3 48 166 25
3 166 118 31
3 118 72 155
3 87 96 79
3 96 63 47
3 63 14 53
3 14 131 150
3 131 130 17
