OFF
1408 1354 0
-0.2632855450 0.2836545719 0.0472172774
-0.2646030775 0.2892817352 -0.0219062334
-0.2634403050 0.2506640953 0.0473842001
0.1479832473 -0.2868527289 -0.0292303051
0.1462061443 -0.2952192977 -0.1185357649
0.1530448089 0.2881392658 -0.0328081678
0.1513407776 0.2954197553 -0.1222097312
-0.2788868146 0.2894253590 -0.0225501462
-0.2805908564 0.2967026991 -0.1119514802
-0.4366157991 0.2900190099 -0.0194886205
-0.4353333885 0.2845424394 0.0477920974
-0.4354705875 0.2514766664 0.0488804165
-0.1190908404 -0.2861965272 -0.0221892579
-0.1177534458 -0.2798992336 0.0450191455
-0.1175818322 -0.2468249725 0.0456980855
0.2719656148 0.2866252850 -0.0332708500
0.2732480254 0.2811487146 0.0340098680
0.2731108264 0.2480829415 0.0350981871
-0.1627004846 -0.2860743993 -0.0222617886
-0.1613264141 -0.2796036857 0.0467895178
-0.1611731591 -0.2466161934 0.0465459565
0.4516010829 0.2802192868 0.0314625582
0.4502835504 0.2858464501 -0.0376609526
0.4514463229 0.2472288102 0.0316294809
0.1821215969 0.2823039511 0.0366992518
0.1808040742 0.2879332149 -0.0324242719
0.1819668467 0.2493155750 0.0368661615
0.3907465250 0.1717501759 0.1092087811
0.1665202864 0.2880747255 -0.0330702720
0.1648162552 0.2953552150 -0.1224718353
-0.4258607500 -0.2848983261 -0.0180639749
-0.4276378648 -0.2932674156 -0.1073694193
0.4225593104 0.1470950721 0.1087382737
0.4227881707 0.1961015518 0.1084372783
-0.3964989760 -0.2848678911 -0.0167935440
-0.3951615814 -0.2785705975 0.0504148594
-0.3949899678 -0.2454963363 0.0510937993
-0.4207991885 0.2900936685 -0.0216418377
-0.4225032345 0.2973710073 -0.1110433817
0.2827206639 -0.2882920509 -0.0318462044
0.2809435491 -0.2966611404 -0.1211516487
0.3120824379 -0.2882616159 -0.0305757735
0.3134198325 -0.2819643223 0.0366326300
0.3135914461 -0.2488900612 0.0373115699
-0.2839515672 -0.2855666333 -0.0189743223
-0.2857286861 -0.2939357240 -0.1082799767
0.2877822254 0.2866999437 -0.0354240671
0.2860781795 0.2939772825 -0.1248256111
0.4225237699 0.2860546040 -0.0380448512
0.4208197239 0.2933319428 -0.1274463952
0.3916424370 0.1783111063 0.1091516292
0.3915811192 0.1651809573 0.1092322739
0.4381332147 0.1842072981 0.1082103374
0.4380147480 0.1588397075 0.1083661439
0.4067067392 0.2859799473 -0.0358916259
0.4079891498 0.2805033769 0.0313890921
0.4078519508 0.2474376038 0.0324774112
-0.4073237109 0.2900291282 -0.0219039418
-0.4090277569 0.2973064670 -0.1113054858
0.1614555747 -0.2869172541 -0.0294923479
0.1596784717 -0.2952838230 -0.1187978078
0.3012577030 0.2866354034 -0.0356861713
0.2995536570 0.2939127422 -0.1250877152
0.4359992474 0.2859900637 -0.0383069553
0.4342952015 0.2932674025 -0.1277084993
-0.2680631910 -0.2854716743 -0.0174428782
-0.2667257351 -0.2791743617 0.0497686754
-0.2665541624 -0.2461001133 0.0504455152
0.4309349557 -0.2890019179 -0.0347290395
0.4291578409 -0.2973710073 -0.1240344839
-0.4975612601 0.2635955835 0.0169680475
-0.5000000000 -0.2586185442 0.0201754612
-0.3102987443 -0.2788788264 0.0515369476
-0.3101454893 -0.2458913342 0.0512933863
-0.3116728148 -0.2853495401 -0.0175143588
0.4174617883 -0.2889373886 -0.0344669803
0.4156846735 -0.2973064781 -0.1237724246
0.0394868982 0.2822044544 0.0413282163
0.0381693657 0.2878316177 -0.0277952945
0.0393321382 0.2492139777 0.0414951389
0.4032139182 -0.2887848257 -0.0332690801
0.4045879886 -0.2823141120 0.0357822264
0.4047412436 -0.2493266198 0.0355386651
0.4468234574 -0.2889069531 -0.0331965473
0.4481608519 -0.2826096595 0.0340118561
0.4483324656 -0.2495353984 0.0346907960
0.1773439836 -0.2868196632 -0.0279598699
0.1786813777 -0.2805224746 0.0392485342
0.1788529918 -0.2474481085 0.0399274735
-0.4123884227 -0.2849628513 -0.0183260178
-0.4141655375 -0.2933319408 -0.1076314622
0.3982594975 0.1896517091 0.1089541108
0.3980919649 0.1537774788 0.1091744486
0.1337343389 -0.2866976403 -0.0280323999
0.1351083976 -0.2802294472 0.0410189220
0.1352616649 -0.2472393294 0.0407753445
0.4341276002 0.1894799202 0.1082564600
0.4339600675 0.1536056899 0.1084767978
0.2961929912 -0.2883565762 -0.0321082472
0.2944158764 -0.2967256656 -0.1214136916
0.4286885011 0.1495989614 0.1086037295
0.4288936964 0.1935380144 0.1083338580
0.4033255585 0.1497204363 0.1090970503
0.4035307539 0.1936594893 0.1088271787
-0.4773532639 0.2456641269 0.1247450862
-0.1592066135 0.2886903687 -0.0248843548
-0.1579242029 0.2832137983 0.0423963631
-0.1580614019 0.2501480252 0.0434846822
0.0188208760 -0.2870167509 -0.0248633835
0.0170437571 -0.2953858416 -0.1141690379
-0.0054075505 0.2879651154 -0.0260259658
-0.0041251399 0.2824885450 0.0412547522
-0.0042623389 0.2494227719 0.0423430712
-0.4401096702 -0.2847457581 -0.0168660543
-0.4387355998 -0.2782750445 0.0521852521
-0.4385823448 -0.2452875522 0.0519416908
0.4842270840 -0.2419888014 0.1089648247
0.4864828652 0.2410478689 0.1059980369
0.5000000000 0.2588178003 -0.0024349708
0.4975564860 -0.2644186348 0.0007787219
0.2684717437 -0.2881394830 -0.0306482837
0.2698458141 -0.2816687693 0.0384030227
0.2699990691 -0.2486812771 0.0381594614
0.3942048170 0.1844176915 0.1090647647
0.3940863504 0.1590501009 0.1092205712
0.0053474986 -0.2869522206 -0.0246013202
0.0035703797 -0.2953213113 -0.1139069746
-0.1484515644 -0.2862269673 -0.0234597092
-0.1502286792 -0.2945960567 -0.1127651536
0.4406384459 0.1780764417 0.1081986346
0.4405771281 0.1649462927 0.1082792794
-0.1433900028 0.2887650274 -0.0270375720
-0.1450940488 0.2960423662 -0.1164391160
0.0347092522 -0.2869217919 -0.0233319393
0.0360467081 -0.2806244793 0.0438796143
0.0362182809 -0.2475502308 0.0445564541
0.0104091011 0.2880397868 -0.0281770828
0.0087050592 0.2953171268 -0.1175784168
-0.0075263011 -0.2803289440 0.0456478864
-0.0073730461 -0.2473414518 0.0454043251
-0.0089003715 -0.2867996577 -0.0234034200
0.4094314042 0.1471579477 0.1089936174
0.4096602645 0.1961644274 0.1086926220
-0.4789423077 -0.2389612204 0.1277084993
-0.1143132148 0.2829297127 0.0424698476
-0.1156307473 0.2885568760 -0.0266536632
-0.1144679748 0.2499392361 0.0426367703
0.0238845786 0.2879752464 -0.0284391870
0.0221805367 0.2952525865 -0.1178405209
-0.1299145253 0.2887004870 -0.0272996761
-0.1316185713 0.2959778258 -0.1167012201
-0.3081789437 0.2894152279 -0.0201369250
-0.3068965330 0.2839386575 0.0471437929
-0.3070337321 0.2508728844 0.0482321120
-0.3917213504 0.2842583489 0.0478655615
-0.3930388829 0.2898855121 -0.0212579493
-0.3918761104 0.2512678722 0.0480324842
0.3168600635 0.2808646240 0.0340833321
0.3155425310 0.2864917873 -0.0350401787
0.3167053035 0.2478741474 0.0342502547
0.1372282081 0.2880667076 -0.0306549636
0.1385106089 0.2825880367 0.0366257673
0.1383734197 0.2495243641 0.0377140734
-0.2974238946 -0.2855021081 -0.0187122794
-0.2992010135 -0.2938711988 -0.1080179338
-0.2923622921 0.2894898993 -0.0222880421
-0.2940663340 0.2967672394 -0.1116893761
-0.1349792370 -0.2862914925 -0.0237217521
-0.1367563518 -0.2946605820 -0.1130271965
0.4159913159 0.1462611089 0.1088712608
0.4162282492 0.1969962901 0.1085596478
0.4414726201 0.1715072251 0.1082221356
0.0034369101 0.0018376627 0.1168549554
0.2449598876 0.1214427658 0.1114264962
0.2438319970 -0.1200755693 0.1129098900
0.3645934858 -0.0602730178 0.1101956604
0.2443959423 0.0006835983 0.1121681931
0.3640295405 -0.1810321854 0.1109373574
0.1241983988 0.0616402143 0.1141407258
0.1236344536 -0.0591189533 0.1148824227
0.2443959423 0.0006835983 0.1121681931
0.4853549746 -0.0004704662 0.1074814308
0.3651574311 0.0604861498 0.1094539635
0.4859189199 0.1202887013 0.1067397339
0.3657213764 0.1812453174 0.1087122666
0.3645934858 -0.0602730178 0.1101956604
0.4847910293 -0.1212296338 0.1082231277
0.3651574311 0.0604861498 0.1094539635
0.0045648006 0.2433559979 0.1153715616
-0.2369581769 0.1237508948 0.1208000208
-0.1167606334 0.0627942788 0.1188274881
0.0040008554 0.1225968303 0.1161132585
-0.1161966881 0.1835534464 0.1180857912
-0.2363942316 0.2445100624 0.1200583239
-0.3571557204 0.1847075109 0.1227725535
-0.1161966881 0.1835534464 0.1180857912
0.2449598876 0.1214427658 0.1114264962
0.2455238329 0.2422019334 0.1106847993
0.1247623441 0.1823993819 0.1133990289
0.3657213764 0.1812453174 0.1087122666
0.1241983988 0.0616402143 0.1141407258
0.1247623441 0.1823993819 0.1133990289
0.0040008554 0.1225968303 0.1161132585
0.0034369101 0.0018376627 0.1168549554
-0.2377526988 -0.1185617788 0.1222817274
-0.2369581769 0.1237508948 0.1208000208
-0.3575529814 0.0635511740 0.1235134068
-0.2373554379 0.0025945580 0.1215408741
-0.3571557204 0.1847075109 0.1227725535
-0.1171578944 -0.0583620580 0.1195683414
-0.1167606334 0.0627942788 0.1188274881
-0.2373554379 0.0025945580 0.1215408741
-0.4781477858 0.0033514533 0.1262267928
-0.3583475033 -0.1787614996 0.1249951133
-0.3579502423 -0.0576051628 0.1242542601
-0.4785450467 -0.1178048836 0.1269676460
-0.3575529814 0.0635511740 0.1235134068
-0.4777505249 0.1245077901 0.1254859395
-0.3579502423 -0.0576051628 0.1242542601
0.0026423882 -0.2404750109 0.1183366620
0.2438319970 -0.1200755693 0.1129098900
0.1232371926 -0.1802752901 0.1156232760
0.1236344536 -0.0591189533 0.1148824227
0.0030396491 -0.1193186741 0.1175958087
0.2434347361 -0.2412319062 0.1136507433
0.3640295405 -0.1810321854 0.1109373574
0.1232371926 -0.1802752901 0.1156232760
-0.2377526988 -0.1185617788 0.1222817274
-0.2381499598 -0.2397181156 0.1230225807
-0.1175551553 -0.1795183949 0.1203091947
-0.3583475033 -0.1787614996 0.1249951133
-0.1171578944 -0.0583620580 0.1195683414
-0.1175551553 -0.1795183949 0.1203091947
0.0030396491 -0.1193186741 0.1175958087
0.4987782430 -0.0028004173 -0.0008281245
0.4915026635 -0.1223946093 0.0540683501
0.4921135420 0.0084144994 0.0532649269
0.4921135420 0.0084144994 0.0532649269
0.4853549746 -0.0004704662 0.1074814308
0.4960567710 0.1336161499 0.0254149780
0.0012193699 0.2612066919 0.0072665383
-0.0055391975 0.2523217262 0.0614830422
0.2438511176 0.2511272804 0.0566322876
-0.2481709451 0.2624011377 0.0121172929
0.2506096850 0.2600122461 0.0024157837
0.2438511176 0.2511272804 0.0566322876
0.3685462751 0.2505300575 0.0542069103
-0.0055391975 0.2523217262 0.0614830422
0.0045648006 0.2433559979 0.1153715616
-0.2363942316 0.2445100624 0.1200583239
0.2404718338 0.2466847976 0.0837405396
-0.2515502288 0.2579586549 0.0392255449
-0.2414462307 0.2489929266 0.0931140642
-0.3745557445 0.2607771192 0.0280967962
-0.4882517839 0.0123171816 0.0723382734
-0.4781477858 0.0033514533 0.1262267928
-0.4929065220 0.1379563826 0.0446531605
-0.4987806301 0.0024885197 0.0185717544
-0.4888614689 -0.1182363503 0.0731401268
-0.4882517839 0.0123171816 0.0723382734
-0.0078864580 -0.2503036728 0.0645701429
-0.2539432290 -0.2544611085 0.0423728021
-0.3769716145 -0.2565398263 0.0312741317
-0.2434143828 -0.2446324466 0.0961393211
0.0026423882 -0.2404750109 0.1183366620
0.2381703130 -0.2461462371 0.0867674838
-0.2381499598 -0.2397181156 0.1230225807
-0.0012217570 -0.2615185895 0.0104770915
0.2481673645 -0.2629686122 0.0056279067
0.3661972243 -0.2524787068 0.0572963657
0.2415026635 -0.2517536955 0.0597209581
-0.0078864580 -0.2503036728 0.0645701429
-0.2506108785 -0.2600685668 0.0153262764
0.2415026635 -0.2517536955 0.0597209581
-0.0000023871 -0.0004115256 0.0088733847
0.2499988065 0.1292031373 0.0032192069
0.2487770494 -0.1324150802 0.0048260533
0.3737776462 -0.0676077487 0.0019989644
0.2493879279 -0.0016059715 0.0040226301
0.3731667677 -0.1984168575 0.0028023876
0.1243873312 -0.0664133029 0.0068497190
0.2493879279 -0.0016059715 0.0040226301
0.1249982097 0.0643958058 0.0060462958
0.4987782430 -0.0028004173 -0.0008281245
0.3743885247 0.0632013600 0.0011955412
0.4993891215 0.1280086915 -0.0016315477
0.3749994032 0.1940104688 0.0003921180
0.3737776462 -0.0676077487 0.0019989644
0.4981673645 -0.1336095260 -0.0000247013
0.3743885247 0.0632013600 0.0011955412
0.0012193699 0.2612066919 0.0072665383
-0.2487818236 0.1315920290 0.0129207161
-0.1237812268 0.1963993604 0.0100936272
-0.1243921054 0.0655902517 0.0108970504
0.0006084914 0.1303975831 0.0080699615
-0.2481709451 0.2624011377 0.0121172929
-0.3731715419 0.1975938062 0.0149443818
-0.1237812268 0.1963993604 0.0100936272
0.2499988065 0.1292031373 0.0032192069
0.2506096850 0.2600122461 0.0024157837
0.1256090882 0.1952049146 0.0052428726
0.3749994032 0.1940104688 0.0003921180
0.1249982097 0.0643958058 0.0060462958
0.1256090882 0.1952049146 0.0052428726
0.0006084914 0.1303975831 0.0080699615
-0.0000023871 -0.0004115256 0.0088733847
-0.2487818236 0.1315920290 0.0129207161
-0.4987806301 0.0024885197 0.0185717544
-0.3743909118 -0.0635132576 0.0165480887
-0.3737812268 0.0670402743 0.0157462352
-0.4993903150 -0.1280650122 0.0193736078
-0.3731715419 0.1975938062 0.0149443818
-0.4981709451 0.1330420516 0.0177699009
-0.3737812268 0.0670402743 0.0157462352
-0.2500011935 -0.1295150349 0.0145244230
-0.1243921054 0.0655902517 0.0108970504
-0.2493915086 0.0010384970 0.0137225695
-0.1250017903 -0.0649632803 0.0116989038
-0.3743909118 -0.0635132576 0.0165480887
-0.3750005968 -0.1940667895 0.0173499421
-0.2493915086 0.0010384970 0.0137225695
-0.0012217570 -0.2615185895 0.0104770915
0.2487770494 -0.1324150802 0.0048260533
0.1243873312 -0.0664133029 0.0068497190
-0.0006120721 -0.1309650576 0.0096752381
0.1237776462 -0.1969668349 0.0076515724
0.2481673645 -0.2629686122 0.0056279067
0.3731667677 -0.1984168575 0.0028023876
0.1237776462 -0.1969668349 0.0076515724
-0.2500011935 -0.1295150349 0.0145244230
-0.2506108785 -0.2600685668 0.0153262764
-0.1256114753 -0.1955168122 0.0125007573
-0.3750005968 -0.1940667895 0.0173499421
-0.1256114753 -0.1955168122 0.0125007573
-0.0006120721 -0.1309650576 0.0096752381
-0.1250017903 -0.0649632803 0.0116989038
0.3044947141 -0.0297947098 0.1111819268
0.3047766867 0.0305848740 0.1108110783
0.4244102849 -0.1511309096 0.1095802425
0.3042127414 -0.0901742936 0.1115527752
0.1840151979 -0.0292176775 0.1135253079
0.0635356818 -0.0286406453 0.1158686891
0.1842971706 0.0311619063 0.1131544595
0.1840151979 -0.0292176775 0.1135253079
0.4258201481 0.1507670094 0.1077260002
0.4252562029 0.0300078418 0.1084676972
0.3053406320 0.1513440416 0.1100693814
0.4258201481 0.1507670094 0.1077260002
0.4246922576 -0.0907513258 0.1092093941
0.4244102849 -0.1511309096 0.1095802425
0.3047766867 0.0305848740 0.1108110783
0.4252562029 0.0300078418 0.1084676972
-0.0560979164 0.1530751384 0.1170995249
-0.0563798890 0.0926955546 0.1174703733
-0.1765774325 0.1536521706 0.1194429060
-0.0560979164 0.1530751384 0.1170995249
-0.2967749760 0.2146087866 0.1214154387
-0.3568737478 0.2450870947 0.1224017051
-0.1159147155 0.2439330302 0.1177149427
-0.1765774325 0.1536521706 0.1194429060
0.1851430885 0.2123006577 0.1120419141
0.1250443168 0.2427789657 0.1130281804
0.3660033490 0.2416249012 0.1083414181
0.3053406320 0.1513440416 0.1100693814
0.0643815997 0.1524981061 0.1147561437
0.1848611159 0.1519210739 0.1124127625
0.0640996271 0.0921185223 0.1151269922
0.0643815997 0.1524981061 0.1147561437
-0.2972555791 0.0936510344 0.1221567138
-0.2976528401 -0.0275053024 0.1228975671
-0.4174531226 0.1546076505 0.1241292465
-0.2972555791 0.0936510344 0.1221567138
-0.1770580356 0.0326944184 0.1201841811
-0.0568604922 -0.0282621976 0.1182116484
-0.1774552966 -0.0884619184 0.1209250344
-0.1770580356 0.0326944184 0.1201841811
-0.4182476445 -0.0877050232 0.1256109531
-0.2980501010 -0.1486616392 0.1236384204
-0.4186449055 -0.2088613600 0.1263518063
-0.4182476445 -0.0877050232 0.1256109531
-0.4178503836 0.0334513137 0.1248700998
-0.4174531226 0.1546076505 0.1241292465
-0.2976528401 -0.0275053024 0.1228975671
-0.4178503836 0.0334513137 0.1248700998
0.0633370513 -0.0892188137 0.1162391157
0.1835345948 -0.1501754297 0.1142665830
0.0629397904 -0.2103751505 0.1169799690
0.0633370513 -0.0892188137 0.1162391157
0.3037321383 -0.2111320458 0.1122940503
0.3638309101 -0.2416103538 0.1113077840
0.1230385621 -0.2408534585 0.1159937027
0.1835345948 -0.1501754297 0.1142665830
-0.1778525575 -0.2096182552 0.1216658877
-0.1177537858 -0.2400965633 0.1206796213
-0.3585461337 -0.2393396680 0.1253655400
-0.2980501010 -0.1486616392 0.1236384204
-0.0572577531 -0.1494185345 0.1189525017
-0.1774552966 -0.0884619184 0.1209250344
-0.0568604922 -0.0282621976 0.1182116484
-0.0572577531 -0.1494185345 0.1189525017
0.4981673645 -0.1336095260 -0.0000247013
0.4945295747 -0.1934066221 0.0274235360
0.4993891215 0.1280086915 -0.0016315477
0.4915026635 -0.1223946093 0.0540683501
0.4859189199 0.1202887013 0.1067397339
0.4881703130 -0.1167871510 0.0811148758
0.4892982036 0.1247311842 0.0796314819
0.4912698181 0.1873320094 0.0657065075
0.1191559600 0.2517245033 0.0590576649
0.2404718338 0.2466847976 0.0837405396
-0.2515502288 0.2579586549 0.0392255449
-0.1234757876 0.2618039148 0.0096919156
0.3685462751 0.2505300575 0.0542069103
0.1259145274 0.2606094690 0.0048411610
0.4342731375 0.2546739289 0.0258859697
0.3753048425 0.2594150232 -0.0000095936
-0.2414462307 0.2489929266 0.0931140642
-0.1159147155 0.2439330302 0.1177149427
0.2455238329 0.2422019334 0.1106847993
0.1174663182 0.2495032619 0.0726117909
-0.3644517464 0.2518113909 0.0819853155
-0.1285447131 0.2551401906 0.0503542935
-0.3644517464 0.2518113909 0.0819853155
-0.4259545042 0.2532206231 0.0764209412
-0.4777505249 0.1245077901 0.1254859395
-0.4835970458 -0.1133220194 0.1000233864
-0.4828025239 0.1289906542 0.0985416798
-0.4851298930 0.1918102547 0.0846991233
-0.4993903150 -0.1280650122 0.0193736078
-0.4944307344 -0.1884274473 0.0466577940
-0.4981709451 0.1330420516 0.0177699009
-0.4888614689 -0.1182363503 0.0731401268
-0.4279569611 -0.2477505233 0.0794913155
-0.3664427683 -0.2467111644 0.0850406507
-0.1309148435 -0.2523823906 0.0534714725
-0.3664427683 -0.2467111644 0.0850406507
0.1151419275 -0.2482249549 0.0756688134
0.2434347361 -0.2412319062 0.1136507433
-0.1177537858 -0.2400965633 0.1206796213
-0.2434143828 -0.2446324466 0.0961393211
0.3728619252 -0.2636936235 0.0032033143
0.4318768551 -0.2584486708 0.0290375438
0.1234728037 -0.2622436008 0.0080524991
0.3661972243 -0.2524787068 0.0572963657
-0.1259163178 -0.2607935782 0.0129016840
-0.2539432290 -0.2544611085 0.0423728021
0.2381703130 -0.2461462371 0.0867674838
0.1168081028 -0.2510286841 0.0621455505
0.3115827871 -0.0346068601 0.0030107972
0.3118882263 0.0307976943 0.0026090857
0.4356670661 -0.1660131918 0.0013888431
0.3109719086 -0.1654159689 0.0038142204
0.1871930688 0.0313949172 0.0050344629
0.1868876296 -0.0340096372 0.0054361745
0.0624979113 0.0319921401 0.0074598402
0.1871930688 0.0313949172 0.0050344629
0.4371942624 0.1610095802 -0.0006197148
0.4368888231 0.0956050258 -0.0002180032
0.3124991048 0.1616068031 0.0018056625
0.4371942624 0.1610095802 -0.0006197148
0.4359725053 -0.1006086374 0.0009871315
0.4356670661 -0.1660131918 0.0013888431
0.3118882263 0.0307976943 0.0026090857
0.4365833839 0.0302004714 0.0001837084
-0.0618918070 0.0979939174 0.0094835059
-0.1865869645 0.0985911403 0.0119088832
-0.0615863677 0.1633984718 0.0090817944
-0.0618918070 0.0979939174 0.0094835059
-0.3106712435 0.2299974720 0.0135308374
-0.3728661026 0.2629983606 0.0145426702
-0.1234757876 0.2618039148 0.0096919156
-0.1862815252 0.1639956947 0.0115071716
0.1881093866 0.2276085804 0.0038293282
0.1259145274 0.2606094690 0.0048411610
0.3753048425 0.2594150232 -0.0000095936
0.3124991048 0.1616068031 0.0018056625
0.0631087898 0.1628012489 0.0066564171
0.1878039473 0.1622040260 0.0042310398
0.0628033506 0.0973966945 0.0070581286
0.0631087898 0.1628012489 0.0066564171
-0.4365857709 -0.0305123690 0.0175599215
-0.3115863677 0.0340393857 0.0147344024
-0.4371954559 -0.1610659009 0.0183617750
-0.4365857709 -0.0305123690 0.0175599215
-0.4359760860 0.1000411630 0.0167580681
-0.4353664010 0.2305946949 0.0159562146
-0.3109766827 0.1645929176 0.0139325489
-0.4359760860 0.1000411630 0.0167580681
-0.1871966494 -0.0319623916 0.0127107367
-0.1865869645 0.0985911403 0.0119088832
-0.0621972462 0.0325893630 0.0098852175
-0.1871966494 -0.0319623916 0.0127107367
-0.3121960527 -0.0965141463 0.0155362558
-0.4371954559 -0.1610659009 0.0183617750
-0.3115863677 0.0340393857 0.0147344024
-0.3121960527 -0.0965141463 0.0155362558
0.0615827871 -0.1639659462 0.0086634053
0.0621924720 -0.0334124143 0.0078615518
0.1865821903 -0.0994141916 0.0058378861
0.0615827871 -0.1639659462 0.0086634053
0.3109719086 -0.1654159689 0.0038142204
0.3728619252 -0.2636936235 0.0032033143
0.1234728037 -0.2622436008 0.0080524991
0.1859725053 -0.2299677235 0.0066397396
-0.1878063344 -0.1625159235 0.0135125901
-0.1259163178 -0.2607935782 0.0129016840
-0.3753054393 -0.2593435555 0.0177508688
-0.3128057376 -0.2270676782 0.0163381092
-0.0628069312 -0.0979641689 0.0106870710
-0.0634166161 -0.2285177008 0.0114889244
-0.1878063344 -0.1625159235 0.0135125901
-0.0628069312 -0.0979641689 0.0106870710
0.2441139697 -0.0596959855 0.1125390416
0.3042127414 -0.0901742936 0.1115527752
0.2446779150 0.0610631820 0.1117973447
0.3044947141 -0.0297947098 0.1111819268
0.3643115132 -0.1206526016 0.1105665089
0.4241283123 -0.2115104934 0.1099510910
0.3039307688 -0.1505538774 0.1119236237
0.3643115132 -0.1206526016 0.1105665089
0.1239164262 0.0012606305 0.1145115743
0.1837332253 -0.0895972613 0.1138961564
0.1239164262 0.0012606305 0.1145115743
0.0638176545 0.0317389385 0.1154978406
0.2446779150 0.0610631820 0.1117973447
0.1845791432 0.0915414901 0.1127836110
0.2441139697 -0.0596959855 0.1125390416
0.1842971706 0.0311619063 0.1131544595
0.4255381755 0.0903874256 0.1080968487
0.4862008925 0.1806682851 0.1063688854
0.4856369472 0.0599091176 0.1071105823
0.4255381755 0.0903874256 0.1080968487
0.3050586594 0.0909644578 0.1104402298
0.3654394038 0.1208657336 0.1090831150
0.4261021208 0.2111465932 0.1073551518
0.3654394038 0.1208657336 0.1090831150
0.4850730020 -0.0608500500 0.1078522793
0.4249742302 -0.0303717420 0.1088385456
0.4845090567 -0.1816092176 0.1085939762
0.4246922576 -0.0907513258 0.1092093941
0.3648754585 0.0001065660 0.1098248120
0.3050586594 0.0909644578 0.1104402298
0.3648754585 0.0001065660 0.1098248120
0.4249742302 -0.0303717420 0.1088385456
-0.0563798890 0.0926955546 0.1174703733
0.0042828280 0.1829764141 0.1157424100
-0.0566618617 0.0323159708 0.1178412218
0.0037188827 0.0622172465 0.1164841070
-0.1768594052 0.0932725868 0.1198137545
-0.1164786608 0.1231738626 0.1184566397
-0.0558159438 0.2134547221 0.1167286764
-0.1164786608 0.1231738626 0.1184566397
-0.2970569487 0.1542292028 0.1217862872
-0.2366762043 0.1841304786 0.1204291724
-0.4172544922 0.2151858189 0.1237588199
-0.2967749760 0.2146087866 0.1214154387
-0.1762954599 0.2140317544 0.1190720576
-0.0558159438 0.2134547221 0.1167286764
-0.1762954599 0.2140317544 0.1190720576
-0.2366762043 0.1841304786 0.1204291724
0.1848611159 0.1519210739 0.1124127625
0.2452418603 0.1818223496 0.1110556477
0.0646635724 0.2128776899 0.1143852952
0.1851430885 0.2123006577 0.1120419141
0.3056226047 0.2117236254 0.1096985329
0.4261021208 0.2111465932 0.1073551518
0.3056226047 0.2117236254 0.1096985329
0.2452418603 0.1818223496 0.1110556477
0.1244803715 0.1220197981 0.1137698774
0.0646635724 0.2128776899 0.1143852952
0.1244803715 0.1220197981 0.1137698774
0.1845791432 0.0915414901 0.1127836110
0.0037188827 0.0622172465 0.1164841070
0.0638176545 0.0317389385 0.1154978406
0.0042828280 0.1829764141 0.1157424100
0.0640996271 0.0921185223 0.1151269922
-0.2974542096 0.0330728660 0.1225271405
-0.2371568074 0.0631727264 0.1211704475
-0.2375540683 -0.0579836104 0.1219113007
-0.2974542096 0.0330728660 0.1225271405
-0.3573543509 0.1241293425 0.1231429802
-0.4172544922 0.2151858189 0.1237588199
-0.2970569487 0.1542292028 0.1217862872
-0.3573543509 0.1241293425 0.1231429802
-0.1169592639 0.0022161104 0.1191979148
-0.1768594052 0.0932725868 0.1198137545
-0.0566618617 0.0323159708 0.1178412218
-0.1169592639 0.0022161104 0.1191979148
-0.1772566661 -0.0278837500 0.1205546078
-0.2375540683 -0.0579836104 0.1219113007
-0.2371568074 0.0631727264 0.1211704475
-0.1772566661 -0.0278837500 0.1205546078
-0.3581488728 -0.1181833312 0.1246246867
-0.4180490141 -0.0271268548 0.1252405264
-0.2978514706 -0.0880834708 0.1232679937
-0.3581488728 -0.1181833312 0.1246246867
-0.4184462750 -0.1482831916 0.1259813797
-0.4787436772 -0.1783830520 0.1273380727
-0.4783464163 -0.0572267151 0.1265972194
-0.4184462750 -0.1482831916 0.1259813797
-0.4176517531 0.0940294821 0.1244996731
-0.4779491553 0.0639296217 0.1258563661
-0.4775518944 0.1850859585 0.1251155129
-0.4176517531 0.0940294821 0.1244996731
-0.3577516118 0.0029730056 0.1238838334
-0.2978514706 -0.0880834708 0.1232679937
-0.4180490141 -0.0271268548 0.1252405264
-0.3577516118 0.0029730056 0.1238838334
0.1234358231 -0.1196971217 0.1152528494
0.0635356818 -0.0286406453 0.1158686891
0.1837332253 -0.0895972613 0.1138961564
0.1234358231 -0.1196971217 0.1152528494
0.0631384209 -0.1497969821 0.1166095424
0.0028410186 -0.1798968425 0.1179662353
0.0032382796 -0.0587405057 0.1172253821
0.0631384209 -0.1497969821 0.1166095424
0.3039307688 -0.1505538774 0.1119236237
0.2436333666 -0.1806537377 0.1132803167
0.4241283123 -0.2115104934 0.1099510910
0.3037321383 -0.2111320458 0.1122940503
0.1833359644 -0.2107535981 0.1146370097
0.0629397904 -0.2103751505 0.1169799690
0.1833359644 -0.2107535981 0.1146370097
0.2436333666 -0.1806537377 0.1132803167
-0.1776539271 -0.1490400868 0.1212954610
-0.2379513293 -0.1791399472 0.1226521540
-0.0574563836 -0.2099967029 0.1193229283
-0.1778525575 -0.2096182552 0.1216658877
-0.2982487315 -0.2092398076 0.1240088470
-0.4186449055 -0.2088613600 0.1263518063
-0.2982487315 -0.2092398076 0.1240088470
-0.2379513293 -0.1791399472 0.1226521540
-0.1173565248 -0.1189402264 0.1199387680
-0.0574563836 -0.2099967029 0.1193229283
-0.1776539271 -0.1490400868 0.1212954610
-0.1173565248 -0.1189402264 0.1199387680
-0.0570591226 -0.0888403661 0.1185820751
0.0032382796 -0.0587405057 0.1172253821
0.0028410186 -0.1798968425 0.1179662353
-0.0570591226 -0.0888403661 0.1185820751
0.4945295747 -0.1934066221 0.0274235360
0.4951404532 -0.0625975133 0.0266201128
0.4908917850 -0.2532037181 0.0548717733
0.4878648738 -0.1821917054 0.0815165874
0.4957513318 0.0682115955 0.0258166896
0.4960567710 0.1336161499 0.0254149780
0.4881703130 -0.1167871510 0.0811148758
0.4951404532 -0.0625975133 0.0266201128
0.4892982036 0.1247311842 0.0796314819
0.4890162310 0.0643516004 0.0800023304
0.4847910293 -0.1212296338 0.1082231277
0.4901419275 -0.0541863258 0.0671899013
0.4912698181 0.1873320094 0.0657065075
0.4940851565 0.0710153246 0.0393399525
0.4932414326 0.2499328346 0.0517815331
0.4980283855 0.1962169751 0.0114900036
0.1225352437 0.2561669862 0.0319494130
0.0601876650 0.2564655976 0.0331621016
0.3651669914 0.2460875747 0.0813151623
0.1191559600 0.2517245033 0.0590576649
-0.1268550713 0.2573614320 0.0368001676
-0.3728661026 0.2629983606 0.0145426702
-0.1268550713 0.2573614320 0.0368001676
-0.0645074925 0.2570628205 0.0355874789
0.3095779800 0.2552711518 0.0283113470
0.3651669914 0.2460875747 0.0813151623
0.1225352437 0.2561669862 0.0319494130
0.1848828225 0.2558683747 0.0307367243
0.4275145701 0.2457889632 0.0801024736
0.4932414326 0.2499328346 0.0517815331
0.3095779800 0.2552711518 0.0283113470
0.4342731375 0.2546739289 0.0258859697
-0.1209667146 0.2484158943 0.0907706831
-0.3568737478 0.2450870947 0.1224017051
-0.1209667146 0.2484158943 0.0907706831
-0.0607269565 0.2481273782 0.0895989925
0.1250443168 0.2427789657 0.1130281804
0.3634773495 0.2438663333 0.0948692883
0.1225183172 0.2450203978 0.0995560506
0.0559635604 0.2509124941 0.0670474166
-0.3029489885 0.2504021587 0.0875496899
-0.3593997473 0.2473285267 0.1089295752
-0.1234927141 0.2506573264 0.0772985532
-0.1900474710 0.2565494227 0.0447899192
-0.4259545042 0.2532206231 0.0764209412
-0.3130529866 0.2593678870 0.0336611705
-0.4874572620 0.2546298552 0.0708565669
-0.4360585023 0.2621863514 0.0225324218
-0.4828025239 0.1289906542 0.0985416798
-0.4830011544 0.0684124858 0.0989121065
-0.4785450467 -0.1178048836 0.1269676460
-0.4859244149 -0.0505024189 0.0861808299
-0.4851298930 0.1918102547 0.0846991233
-0.4905791530 0.0751367821 0.0584957169
-0.4874572620 0.2546298552 0.0708565669
-0.4952338911 0.2007759830 0.0308106040
-0.4944307344 -0.1884274473 0.0466577940
-0.4938210495 -0.0578739153 0.0458559406
-0.4894711538 -0.2487898823 0.0739419803
-0.4839018883 -0.1785987854 0.1004243131
-0.4932113645 0.0726796166 0.0450540872
-0.4929065220 0.1379563826 0.0446531605
-0.4835970458 -0.1133220194 0.1000233864
-0.4938210495 -0.0578739153 0.0458559406
-0.4384858072 -0.2575791852 0.0257247965
-0.4894711538 -0.2487898823 0.0739419803
-0.3154574217 -0.2555004674 0.0368234669
-0.4279569611 -0.2477505233 0.0794913155
-0.1924290362 -0.2534217496 0.0479221373
-0.1256504204 -0.2474680597 0.0803547320
-0.3611783453 -0.2417968335 0.1119239102
-0.3049285756 -0.2456718055 0.0905899859
0.0536277348 -0.2492643139 0.0701194782
0.1204063506 -0.2433106240 0.1025520729
0.3611986985 -0.2440675193 0.0978661542
0.1230385621 -0.2408534585 0.1159937027
-0.0628201219 -0.2452001180 0.0926248821
-0.1230182089 -0.2450108942 0.0937963618
-0.3585461337 -0.2393396680 0.1253655400
-0.1230182089 -0.2450108942 0.0937963618
0.4318768551 -0.2584486708 0.0290375438
0.3071822944 -0.2577236595 0.0314621362
0.4908917850 -0.2532037181 0.0548717733
0.4252121541 -0.2472337541 0.0831305952
0.1824877336 -0.2569986481 0.0338867286
0.1201404532 -0.2566361425 0.0350990248
0.3628648738 -0.2468712484 0.0843428914
0.3071822944 -0.2577236595 0.0314621362
-0.0669013879 -0.2555486255 0.0387359135
-0.1292486682 -0.2551861198 0.0399482097
-0.3753054393 -0.2593435555 0.0177508688
-0.1292486682 -0.2551861198 0.0399482097
0.1168081028 -0.2510286841 0.0621455505
0.3628648738 -0.2468712484 0.0843428914
0.0577931729 -0.2562736368 0.0363113210
0.1201404532 -0.2566361425 0.0350990248
0.2490824887 -0.0670105258 0.0044243417
0.3112773478 -0.1000114145 0.0034125088
0.2496933672 0.0637985829 0.0036209185
0.3115827871 -0.0346068601 0.0030107972
0.3734722070 -0.1330123031 0.0024006760
0.4353616268 -0.2314177462 0.0017905547
0.3734722070 -0.1330123031 0.0024006760
0.3112773478 -0.1000114145 0.0034125088
0.1868876296 -0.0340096372 0.0054361745
0.2496933672 0.0637985829 0.0036209185
0.1865821903 -0.0994141916 0.0058378861
0.2490824887 -0.0670105258 0.0044243417
0.0621924720 -0.0334124143 0.0078615518
0.1246927704 -0.0010087485 0.0064480074
0.1874985081 0.0967994716 0.0046327514
0.1246927704 -0.0010087485 0.0064480074
0.4368888231 0.0956050258 -0.0002180032
0.4996945607 0.1934132459 -0.0020332593
0.4365833839 0.0302004714 0.0001837084
0.4990836822 0.0626041371 -0.0012298361
0.3121936656 0.0962022487 0.0022073741
0.3746939640 0.1286059144 0.0007938296
0.4374997016 0.2264141345 -0.0010214264
0.3746939640 0.1286059144 0.0007938296
0.4984728037 -0.0682049717 -0.0004264129
0.4362779446 -0.0352040830 0.0005854199
0.4978619252 -0.1990140804 0.0003770103
0.4359725053 -0.1006086374 0.0009871315
0.3740830855 -0.0022031944 0.0015972528
0.3121936656 0.0962022487 0.0022073741
0.3740830855 -0.0022031944 0.0015972528
0.4362779446 -0.0352040830 0.0005854199
-0.1240866661 0.1309948060 0.0104953388
-0.0621972462 0.0325893630 0.0098852175
-0.1240866661 0.1309948060 0.0104953388
-0.1862815252 0.1639956947 0.0115071716
0.0009139307 0.1958021375 0.0076682499
-0.0612809285 0.2288030262 0.0086800828
0.0003030522 0.0649930287 0.0084716731
-0.0615863677 0.1633984718 0.0090817944
-0.3109766827 0.1645929176 0.0139325489
-0.2484763844 0.1969965833 0.0125190045
-0.4353664010 0.2305946949 0.0159562146
-0.3106712435 0.2299974720 0.0135308374
-0.1859760860 0.2294002491 0.0111054601
-0.0612809285 0.2288030262 0.0086800828
-0.1859760860 0.2294002491 0.0111054601
-0.2484763844 0.1969965833 0.0125190045
0.1878039473 0.1622040260 0.0042310398
0.2503042457 0.1946076917 0.0028174953
0.0634142291 0.2282058033 0.0062547055
0.1881093866 0.2276085804 0.0038293282
0.3128045441 0.2270113574 0.0014039509
0.4374997016 0.2264141345 -0.0010214264
0.3128045441 0.2270113574 0.0014039509
0.2503042457 0.1946076917 0.0028174953
0.1253036489 0.1298003602 0.0056445842
0.0634142291 0.2282058033 0.0062547055
0.1253036489 0.1298003602 0.0056445842
0.1874985081 0.0967994716 0.0046327514
0.0003030522 0.0649930287 0.0084716731
0.0624979113 0.0319921401 0.0074598402
0.0009139307 0.1958021375 0.0076682499
0.0628033506 0.0973966945 0.0070581286
-0.3740860693 0.0017635084 0.0161471619
-0.4362809285 0.0347643970 0.0171589948
-0.3112815252 0.0993161516 0.0143334757
-0.3740860693 0.0017635084 0.0161471619
-0.4368906134 -0.0957891349 0.0179608482
-0.4996951575 -0.1933417782 0.0197745345
-0.4990854726 -0.0627882463 0.0189726811
-0.4368906134 -0.0957891349 0.0179608482
-0.4356712435 0.1653179289 0.0163571414
-0.4984757876 0.0677652856 0.0181708277
-0.4978661026 0.1983188176 0.0173689742
-0.4356712435 0.1653179289 0.0163571414
-0.3734763844 0.1323170403 0.0153453085
-0.3112815252 0.0993161516 0.0143334757
-0.4362809285 0.0347643970 0.0171589948
-0.3734763844 0.1323170403 0.0153453085
-0.1868918070 0.0333143743 0.0123098100
-0.2496963511 -0.0642382689 0.0141234962
-0.2490866661 0.0663152630 0.0133216428
-0.1868918070 0.0333143743 0.0123098100
-0.1246969478 0.0003134857 0.0112979771
-0.0625020887 -0.0326874030 0.0102861442
-0.1875014919 -0.0972391576 0.0131116634
-0.1246969478 0.0003134857 0.0112979771
-0.3746957543 -0.1287900236 0.0169490154
-0.3125008952 -0.1617909122 0.0159371825
-0.4375002984 -0.2263426668 0.0187627017
-0.3746957543 -0.1287900236 0.0169490154
-0.3118912102 -0.0312373803 0.0151353291
-0.2490866661 0.0663152630 0.0133216428
-0.2496963511 -0.0642382689 0.0141234962
-0.3118912102 -0.0312373803 0.0151353291
0.0618876296 -0.0986891802 0.0082624785
-0.0009169145 -0.1962418235 0.0100761648
-0.0003072296 -0.0656882916 0.0092743114
0.0618876296 -0.0986891802 0.0082624785
0.1240824887 -0.1316900689 0.0072506457
0.1862773478 -0.1646909575 0.0062388128
0.0612779446 -0.2292427122 0.0090643320
0.1240824887 -0.1316900689 0.0072506457
0.2484722070 -0.1976918462 0.0052269800
0.3106670661 -0.2306927348 0.0042151471
0.4353616268 -0.2314177462 0.0017905547
0.3106670661 -0.2306927348 0.0042151471
0.1859725053 -0.2299677235 0.0066397396
0.0612779446 -0.2292427122 0.0090643320
0.2484722070 -0.1976918462 0.0052269800
0.1862773478 -0.1646909575 0.0062388128
-0.2503060360 -0.1947918009 0.0149253497
-0.1881111769 -0.2277926895 0.0139135168
-0.0634166161 -0.2285177008 0.0114889244
-0.1881111769 -0.2277926895 0.0139135168
-0.3128057376 -0.2270676782 0.0163381092
-0.4375002984 -0.2263426668 0.0187627017
-0.2503060360 -0.1947918009 0.0149253497
-0.3125008952 -0.1617909122 0.0159371825
-0.0631117737 -0.1632409349 0.0110879977
-0.0003072296 -0.0656882916 0.0092743114
-0.0009169145 -0.1962418235 0.0100761648
-0.0631117737 -0.1632409349 0.0110879977
-0.1253066328 -0.1302400462 0.0120998305
-0.1875014919 -0.0972391576 0.0131116634
-0.0625020887 -0.0326874030 0.0102861442
-0.1253066328 -0.1302400462 0.0120998305
0.2741633556 -0.0749351396 0.1120459084
0.2743043419 -0.0447453477 0.1118604842
0.3344031136 -0.0752236557 0.1108742178
0.2741633556 -0.0749351396 0.1120459084
0.2747273009 0.0458240280 0.1113042115
0.2748682872 0.0760138199 0.1111187873
0.3346850863 -0.0148440719 0.1105033694
0.2744453282 -0.0145555558 0.1116750599
0.3943608991 -0.1358917556 0.1100733757
0.3945018854 -0.1057019637 0.1098879515
0.4543186845 -0.1965598555 0.1092725336
0.3940789264 -0.1962713394 0.1104442242
0.3341211410 -0.1356032395 0.1112450663
0.2738813829 -0.1353147233 0.1124167569
0.3344031136 -0.0752236557 0.1108742178
0.3341211410 -0.1356032395 0.1112450663
0.1539658121 -0.0139785235 0.1140184411
0.1541067984 0.0162112684 0.1138330169
0.2139235975 -0.0746466234 0.1132175990
0.1536838394 -0.0743581073 0.1143892896
0.0938670403 0.0164997845 0.1150047075
0.0937260540 -0.0136900074 0.1151901317
0.0336272823 0.0167883006 0.1161763980
0.0938670403 0.0164997845 0.1150047075
0.2146285291 0.0763023361 0.1122904778
0.2144875428 0.0461125442 0.1124759021
0.1543887710 0.0765908522 0.1134621684
0.2146285291 0.0763023361 0.1122904778
0.2142055701 -0.0142670396 0.1128467505
0.2139235975 -0.0746466234 0.1132175990
0.1541067984 0.0162112684 0.1138330169
0.2142055701 -0.0142670396 0.1128467505
0.4557285477 0.1053380635 0.1074182913
0.3954887896 0.1056265796 0.1085899819
0.4561515067 0.1959074392 0.1068620186
0.4560105203 0.1657176473 0.1070474428
0.4555875614 0.0751482716 0.1076037155
0.4554465751 0.0449584797 0.1077891397
0.3952068170 0.0452469958 0.1089608303
0.4555875614 0.0751482716 0.1076037155
0.3352490316 0.1059150957 0.1097616724
0.2750092735 0.1062036118 0.1109333630
0.3353900179 0.1361048876 0.1095762482
0.3352490316 0.1059150957 0.1097616724
0.3959117486 0.1961959553 0.1080337092
0.4561515067 0.1959074392 0.1068620186
0.3954887896 0.1056265796 0.1085899819
0.3956297760 0.1358163715 0.1084045576
0.4550236161 -0.0456108960 0.1083454124
0.4548826298 -0.0758006879 0.1085308367
0.3946428717 -0.0755121718 0.1097025273
0.4550236161 -0.0456108960 0.1083454124
0.4544596708 -0.1663700636 0.1090871094
0.4543186845 -0.1965598555 0.1092725336
0.3945018854 -0.1057019637 0.1098879515
0.4547416434 -0.1059904798 0.1087162609
0.3348260726 0.0153457200 0.1103179451
0.3346850863 -0.0148440719 0.1105033694
0.2748682872 0.0760138199 0.1111187873
0.3351080452 0.0757253038 0.1099470967
0.3949248443 -0.0151325880 0.1093316788
0.3952068170 0.0452469958 0.1089608303
0.4551646024 -0.0154211041 0.1081599882
0.3949248443 -0.0151325880 0.1093316788
-0.0261895168 0.1076461924 0.1167918159
-0.0864292749 0.1079347086 0.1179635065
-0.0257665579 0.1982155681 0.1162355432
-0.0259075442 0.1680257762 0.1164209675
-0.0264714895 0.0472666087 0.1171626644
-0.0867112476 0.0475551248 0.1183343550
-0.0263305032 0.0774564006 0.1169772401
-0.0264714895 0.0472666087 0.1171626644
-0.1466690330 0.1082232247 0.1191351971
-0.2069087910 0.1085117408 0.1203068877
-0.1465280467 0.1384130166 0.1189497728
-0.1466690330 0.1082232247 0.1191351971
-0.0860063159 0.1985040843 0.1174072338
-0.0257665579 0.1982155681 0.1162355432
-0.0864292749 0.1079347086 0.1179635065
-0.0862882886 0.1381245005 0.1177780823
-0.2668665765 0.1691798407 0.1211077298
-0.3269653482 0.1996581488 0.1220939961
-0.2667255901 0.1993696326 0.1209223055
-0.2668665765 0.1691798407 0.1211077298
-0.3872051063 0.1999466649 0.1232656867
-0.4171135058 0.2453756108 0.1235733956
-0.2966339897 0.2447985785 0.1212300145
-0.3269653482 0.1996581488 0.1220939961
-0.1462460740 0.1987926004 0.1185789244
-0.1761544736 0.2442215463 0.1188866333
-0.0556749574 0.2436445140 0.1165432522
-0.0860063159 0.1985040843 0.1174072338
-0.2064858321 0.1990811165 0.1197506150
-0.1462460740 0.1987926004 0.1185789244
-0.2066268184 0.1688913246 0.1199360392
-0.2064858321 0.1990811165 0.1197506150
0.2150514881 0.1668717117 0.1117342051
0.1549527163 0.1973500198 0.1127204715
0.2151924744 0.1970615036 0.1115487809
0.2150514881 0.1668717117 0.1117342051
0.0947129583 0.1976385359 0.1138921621
0.0648045587 0.2430674818 0.1141998710
0.1852840748 0.2424904496 0.1118564898
0.1549527163 0.1973500198 0.1127204715
0.3356719905 0.1964844714 0.1092053997
0.3057635910 0.2419134173 0.1095131087
0.4262431071 0.2413363851 0.1071697275
0.3959117486 0.1961959553 0.1080337092
0.2754322325 0.1967729875 0.1103770903
0.3356719905 0.1964844714 0.1092053997
0.2752912461 0.1665831956 0.1105625146
0.2754322325 0.1967729875 0.1103770903
0.0944309856 0.1372589521 0.1142630105
0.0942899993 0.1070691602 0.1144484348
0.0344732002 0.1979270520 0.1150638526
0.0947129583 0.1976385359 0.1138921621
0.1545297574 0.1067806441 0.1132767442
0.1546707437 0.1369704360 0.1130913199
0.2147695154 0.1064921280 0.1121050536
0.1545297574 0.1067806441 0.1132767442
0.0337682686 0.0469780925 0.1159909738
0.0339092549 0.0771678844 0.1158055496
0.0940080266 0.0466895764 0.1148192832
0.0337682686 0.0469780925 0.1159909738
0.0343322139 0.1677372601 0.1152492769
0.0344732002 0.1979270520 0.1150638526
0.0942899993 0.1070691602 0.1144484348
0.0340502412 0.1073576763 0.1156201253
-0.2673055085 0.0481227962 0.1218487940
-0.3274042802 0.0786011042 0.1228350603
-0.2671068780 0.1087009646 0.1214783673
-0.2673055085 0.0481227962 0.1218487940
-0.2675041390 -0.0124553722 0.1222192206
-0.2677027694 -0.0730335406 0.1225896472
-0.3276029107 0.0180229358 0.1232054869
-0.2675041390 -0.0124553722 0.1222192206
-0.3873044215 0.1696575807 0.1234509000
-0.3875030520 0.1090794123 0.1238213267
-0.4474031933 0.2001358887 0.1244371664
-0.3873044215 0.1696575807 0.1234509000
-0.3272056498 0.1391792727 0.1224646337
-0.2671068780 0.1087009646 0.1214783673
-0.3274042802 0.0786011042 0.1228350603
-0.3272056498 0.1391792727 0.1224646337
-0.1469093345 0.0477443486 0.1195058346
-0.1471079650 -0.0128338198 0.1198762613
-0.2070081063 0.0782226566 0.1204921010
-0.1469093345 0.0477443486 0.1195058346
-0.0868105628 0.0172660406 0.1185195683
-0.0267117910 -0.0132122674 0.1175333019
-0.0870091933 -0.0433121278 0.1188899949
-0.0868105628 0.0172660406 0.1185195683
-0.2074053672 -0.0429336802 0.1212329542
-0.1473065955 -0.0734119882 0.1202466879
-0.2076039977 -0.1035118486 0.1216033809
-0.2074053672 -0.0429336802 0.1212329542
-0.2072067368 0.0176444882 0.1208625276
-0.2070081063 0.0782226566 0.1204921010
-0.1471079650 -0.0128338198 0.1198762613
-0.2072067368 0.0176444882 0.1208625276
-0.3880989434 -0.0726550930 0.1249326066
-0.3882975739 -0.1332332614 0.1253030332
-0.4481977152 -0.0421767849 0.1259188729
-0.3880989434 -0.0726550930 0.1249326066
-0.3280001717 -0.1031334010 0.1239463402
-0.2679013999 -0.1336117090 0.1229600739
-0.3281988021 -0.1637115694 0.1243167669
-0.3280001717 -0.1031334010 0.1239463402
-0.4485949761 -0.1633331218 0.1266597262
-0.3884962044 -0.1938114298 0.1256734598
-0.4487936066 -0.2239112902 0.1270301528
-0.4485949761 -0.1633331218 0.1266597262
-0.4483963456 -0.1027549534 0.1262892996
-0.4481977152 -0.0421767849 0.1259188729
-0.3882975739 -0.1332332614 0.1253030332
-0.4483963456 -0.1027549534 0.1262892996
-0.4478004542 0.0789795519 0.1251780196
-0.3877016825 0.0485012439 0.1241917533
-0.4479990847 0.0184013835 0.1255484463
-0.4478004542 0.0789795519 0.1251780196
-0.4476018237 0.1395577203 0.1248075930
-0.4474031933 0.2001358887 0.1244371664
-0.3875030520 0.1090794123 0.1238213267
-0.4476018237 0.1395577203 0.1248075930
-0.3278015412 -0.0425552326 0.1235759136
-0.3276029107 0.0180229358 0.1232054869
-0.2677027694 -0.0730335406 0.1225896472
-0.3278015412 -0.0425552326 0.1235759136
-0.3879003129 -0.0120769246 0.1245621799
-0.4479990847 0.0184013835 0.1255484463
-0.3877016825 0.0485012439 0.1241917533
-0.3879003129 -0.0120769246 0.1245621799
0.0934857524 -0.0741688835 0.1155607692
0.0932871220 -0.1347470519 0.1159311959
0.0333869807 -0.0436905755 0.1165470356
0.0934857524 -0.0741688835 0.1155607692
0.1535845242 -0.1046471915 0.1145745029
0.2136832959 -0.1351254995 0.1135882365
0.1533858937 -0.1652253599 0.1149449295
0.1535845242 -0.1046471915 0.1145745029
0.0329897198 -0.1648469123 0.1172878889
0.0930884915 -0.1953252203 0.1163016225
0.0327910893 -0.2254250807 0.1176583155
0.0329897198 -0.1648469123 0.1172878889
0.0331883502 -0.1042687439 0.1169174622
0.0333869807 -0.0436905755 0.1165470356
0.0932871220 -0.1347470519 0.1159311959
0.0331883502 -0.1042687439 0.1169174622
0.2737820677 -0.1656038076 0.1126019702
0.3338808394 -0.1960821156 0.1116157038
0.2735834372 -0.2261819760 0.1129723968
0.2737820677 -0.1656038076 0.1126019702
0.3939796112 -0.2265604236 0.1106294375
0.4240289971 -0.2417995776 0.1101363043
0.3036328231 -0.2414211300 0.1124792637
0.3338808394 -0.1960821156 0.1116157038
0.1531872632 -0.2258035283 0.1153153562
0.1832366491 -0.2410426823 0.1148222230
0.0628404752 -0.2406642347 0.1171651823
0.0930884915 -0.1953252203 0.1163016225
0.2134846655 -0.1957036679 0.1139586632
0.1533858937 -0.1652253599 0.1149449295
0.2136832959 -0.1351254995 0.1135882365
0.2134846655 -0.1957036679 0.1139586632
-0.2078026282 -0.1640900170 0.1219738075
-0.1477038564 -0.1945683251 0.1209875412
-0.2080012587 -0.2246681854 0.1223442342
-0.2078026282 -0.1640900170 0.1219738075
-0.0876050847 -0.2250466331 0.1200012748
-0.0575556988 -0.2402857871 0.1195081417
-0.1779518728 -0.2399073395 0.1218511010
-0.1477038564 -0.1945683251 0.1209875412
-0.3283974326 -0.2242897378 0.1246871935
-0.2983480467 -0.2395288918 0.1241940603
-0.4187442207 -0.2391504442 0.1265370197
-0.3884962044 -0.1938114298 0.1256734598
-0.2681000304 -0.1941898774 0.1233305005
-0.3281988021 -0.1637115694 0.1243167669
-0.2679013999 -0.1336117090 0.1229600739
-0.2681000304 -0.1941898774 0.1233305005
-0.0874064542 -0.1644684647 0.1196308482
-0.0872078237 -0.1038902962 0.1192604216
-0.0273076825 -0.1949467727 0.1186445818
-0.0874064542 -0.1644684647 0.1196308482
-0.1475052260 -0.1339901566 0.1206171145
-0.2076039977 -0.1035118486 0.1216033809
-0.1473065955 -0.0734119882 0.1202466879
-0.1475052260 -0.1339901566 0.1206171145
-0.0269104215 -0.0737904359 0.1179037286
-0.0870091933 -0.0433121278 0.1188899949
-0.0267117910 -0.0132122674 0.1175333019
-0.0269104215 -0.0737904359 0.1179037286
-0.0271090520 -0.1343686043 0.1182741552
-0.0273076825 -0.1949467727 0.1186445818
-0.0872078237 -0.1038902962 0.1192604216
-0.0271090520 -0.1343686043 0.1182741552
0.4930161191 -0.1579006157 0.0407459430
0.4978619252 -0.1990140804 0.0003770103
0.4984728037 -0.0682049717 -0.0004264129
0.4966539089 -0.0981035197 0.0132977057
0.4893783294 -0.2176977117 0.0681941803
0.4960430304 -0.2289126284 0.0141011289
0.4930161191 -0.1579006157 0.0407459430
0.4893783294 -0.2176977117 0.0681941803
0.4990836822 0.0626041371 -0.0012298361
0.4972647874 0.0327055891 0.0124942826
0.4996945607 0.1934132459 -0.0020332593
0.4957513318 0.0682115955 0.0258166896
0.4918081028 -0.0569900550 0.0536666385
0.4878648738 -0.1821917054 0.0815165874
0.4918081028 -0.0569900550 0.0536666385
0.4936269976 -0.0270915069 0.0399425198
-0.4916461017 -0.1533318988 0.0598989604
-0.4996951575 -0.1933417782 0.0197745345
-0.4990854726 -0.0627882463 0.0189726811
-0.4966056823 -0.0929694638 0.0326147742
-0.4866865211 -0.2136943338 0.0871831467
-0.4972153672 -0.2235229957 0.0334166276
-0.4916461017 -0.1533318988 0.0598989604
-0.4866865211 -0.2136943338 0.0871831467
-0.4984757876 0.0677652856 0.0181708277
-0.4959959973 0.0375840681 0.0318129208
-0.4978661026 0.1983188176 0.0173689742
-0.4932113645 0.0726796166 0.0450540872
-0.4885566264 -0.0529595844 0.0727392001
-0.4839018883 -0.1785987854 0.1004243131
-0.4885566264 -0.0529595844 0.0727392001
-0.4910364167 -0.0227783669 0.0590971070
0.2801799183 -0.0835109702 0.0039184253
0.2803326379 -0.0508086930 0.0037175695
0.3425274970 -0.0838095816 0.0027057366
0.2801799183 -0.0835109702 0.0039184253
0.2806380771 0.0145958614 0.0033158579
0.2809435164 0.0800004158 0.0029141463
0.3428329363 -0.0184050272 0.0023040250
0.2806380771 0.0145958614 0.0033158579
0.4045696365 -0.1495127475 0.0018947595
0.4047223561 -0.1168104703 0.0016939038
0.4666117760 -0.2152159133 0.0010837825
0.4042641973 -0.2149173018 0.0022964711
0.3423747774 -0.1165118588 0.0029065924
0.3422220578 -0.1492141360 0.0031074482
0.2800271986 -0.1162132474 0.0041192810
0.3423747774 -0.1165118588 0.0029065924
0.2181377788 -0.0178078043 0.0047294023
0.1557902000 -0.0175091929 0.0059420910
0.2185959376 0.0802990273 0.0041268349
0.2182904984 0.0148944729 0.0045285465
0.2178323395 -0.0832123587 0.0051311139
0.1554847607 -0.0829137473 0.0063438025
0.2181377788 -0.0178078043 0.0047294023
0.2178323395 -0.0832123587 0.0051311139
0.0934426212 -0.0172105814 0.0071547796
0.0310950425 -0.0169119700 0.0083674683
0.0935953409 0.0154916958 0.0069539238
0.0934426212 -0.0172105814 0.0071547796
0.1562483589 0.0805976387 0.0053395236
0.2185959376 0.0802990273 0.0041268349
0.1557902000 -0.0175091929 0.0059420910
0.1559429196 0.0151930843 0.0057412352
0.4681389723 0.1118068586 -0.0009247755
0.4057913935 0.1121054701 0.0002879132
0.4685971312 0.2099136902 -0.0015273428
0.4682916919 0.1445091358 -0.0011256312
0.4678335330 0.0464023043 -0.0005230639
0.4054859543 0.0467009157 0.0006896248
0.4681389723 0.1118068586 -0.0009247755
0.4678335330 0.0464023043 -0.0005230639
0.3434438148 0.1124040815 0.0015006018
0.2810962360 0.1127026930 0.0027132905
0.3435965344 0.1451063587 0.0012997460
0.3434438148 0.1124040815 0.0015006018
0.4062495524 0.2102123017 -0.0003146542
0.4685971312 0.2099136902 -0.0015273428
0.4057913935 0.1121054701 0.0002879132
0.4059441132 0.1448077473 0.0000870574
0.4673753742 -0.0517045273 0.0000795035
0.4670699349 -0.1171090817 0.0004812151
0.4050277954 -0.0514059159 0.0012921922
0.4673753742 -0.0517045273 0.0000795035
0.4667644957 -0.1825136361 0.0008829267
0.4666117760 -0.2152159133 0.0010837825
0.4047223561 -0.1168104703 0.0016939038
0.4670699349 -0.1171090817 0.0004812151
0.3429856559 0.0142972500 0.0021031692
0.3428329363 -0.0184050272 0.0023040250
0.2809435164 0.0800004158 0.0029141463
0.3432910952 0.0797018044 0.0017014576
0.4051805150 -0.0187036387 0.0010913364
0.4053332347 0.0139986385 0.0008904806
0.4676808134 0.0137000271 -0.0003222081
0.4051805150 -0.0187036387 0.0010913364
-0.0929892365 0.1144943617 0.0099894224
-0.0928365169 0.1471966389 0.0097885666
-0.0309470970 0.0487911959 0.0091784453
-0.0932946758 0.0490898073 0.0103911340
-0.1551840957 0.1474952504 0.0110012552
-0.1553368153 0.1147929732 0.0112021110
-0.2175316744 0.1477938618 0.0122139439
-0.1551840957 0.1474952504 0.0110012552
-0.0301834989 0.2123025818 0.0081741663
-0.0304889381 0.1468980275 0.0085758779
-0.0925310776 0.2126011933 0.0093868550
-0.0301834989 0.2123025818 0.0081741663
-0.0306416578 0.1141957503 0.0087767337
-0.0309470970 0.0487911959 0.0091784453
-0.0928365169 0.1471966389 0.0097885666
-0.0304889381 0.1468980275 0.0085758779
-0.2797265336 0.1807947505 0.0132257767
-0.3420741123 0.1810933619 0.0144384654
-0.2794210943 0.2461993049 0.0128240651
-0.2797265336 0.1807947505 0.0132257767
-0.4041162518 0.2467965278 0.0152494424
-0.4352136814 0.2632969721 0.0157553589
-0.3105185239 0.2626997492 0.0133299816
-0.3417686731 0.2464979163 0.0140367538
-0.1547259368 0.2456020819 0.0103986878
-0.1858233663 0.2621025263 0.0109046043
-0.0611282088 0.2615053034 0.0084792270
-0.0923783580 0.2453034705 0.0091859992
-0.2172262352 0.2131984162 0.0118122323
-0.1548786564 0.2128998048 0.0105995436
-0.2175316744 0.1477938618 0.0122139439
-0.2172262352 0.2131984162 0.0118122323
0.2190540965 0.1784058588 0.0035242675
0.1567065178 0.1787044703 0.0047369562
0.2193595358 0.2438104132 0.0031225560
0.2190540965 0.1784058588 0.0035242675
0.0946643783 0.2444076361 0.0055479333
0.0635669487 0.2609080805 0.0060538497
0.1882621062 0.2603108575 0.0036284724
0.1570119570 0.2441090247 0.0043352446
0.3440546933 0.2432131903 0.0006971787
0.3129572637 0.2597136346 0.0012030951
0.4376524212 0.2591164117 -0.0012222822
0.4064022720 0.2429145789 -0.0005155100
0.2815543949 0.2108095246 0.0021107231
0.3439019737 0.2105109131 0.0008980345
0.2812489556 0.1454049702 0.0025124347
0.2815543949 0.2108095246 0.0021107231
0.0942062194 0.1463008046 0.0061505006
0.0940534997 0.1135985274 0.0063513564
0.0321640799 0.2120039704 0.0069614777
0.0945116586 0.2117053589 0.0057487890
0.1564010785 0.1132999159 0.0051386678
0.1565537981 0.1460021931 0.0049378120
0.2187486573 0.1130013045 0.0039259791
0.1564010785 0.1132999159 0.0051386678
0.0314004817 0.0484925844 0.0079657567
0.0317059210 0.1138971388 0.0075640451
0.0937480605 0.0481939730 0.0067530680
0.0314004817 0.0484925844 0.0079657567
0.0318586406 0.1465994160 0.0073631893
0.0321640799 0.2120039704 0.0069614777
0.0940534997 0.1135985274 0.0063513564
0.0317059210 0.1138971388 0.0075640451
-0.4051834989 0.0182639527 0.0166530784
-0.4054883414 -0.0470128133 0.0170540051
-0.4676832005 -0.0140119246 0.0180658379
-0.4051834989 0.0182639527 0.0166530784
-0.3426837973 0.0505398300 0.0152403188
-0.2801840957 0.0828157073 0.0138275592
-0.3429886398 -0.0147369360 0.0156412455
-0.3426837973 0.0505398300 0.0152403188
-0.4682928855 -0.1445654566 0.0188676914
-0.4057931839 -0.1122895792 0.0174549318
-0.4685977280 -0.2098422225 0.0192686181
-0.4682928855 -0.1445654566 0.0188676914
-0.4679880430 -0.0792886906 0.0184667647
-0.4676832005 -0.0140119246 0.0180658379
-0.4054883414 -0.0470128133 0.0170540051
-0.4679880430 -0.0792886906 0.0184667647
-0.4670735155 0.1165416073 0.0172639845
-0.4045738139 0.1488174846 0.0158512249
-0.4673783580 0.0512648413 0.0176649112
-0.4670735155 0.1165416073 0.0172639845
-0.4667686731 0.1818183733 0.0168630578
-0.4664638306 0.2470951392 0.0164621311
-0.4042689714 0.2140942506 0.0154502982
-0.4667686731 0.1818183733 0.0168630578
-0.3423789548 0.1158165960 0.0148393921
-0.3420741123 0.1810933619 0.0144384654
-0.2798792532 0.1480924733 0.0134266325
-0.3423789548 0.1158165960 0.0148393921
-0.4048786564 0.0835407186 0.0162521517
-0.4673783580 0.0512648413 0.0176649112
-0.4045738139 0.1488174846 0.0158512249
-0.4048786564 0.0835407186 0.0162521517
-0.2182940790 -0.0154619473 0.0132166531
-0.1557943774 0.0168139300 0.0118038935
-0.2185989215 -0.0807387133 0.0136175798
-0.2182940790 -0.0154619473 0.0132166531
-0.2179892365 0.0498148187 0.0128157264
-0.2176843940 0.1150915846 0.0124147997
-0.1554895349 0.0820906960 0.0114029668
-0.2179892365 0.0498148187 0.0128157264
-0.0935995183 -0.0161869586 0.0107920607
-0.0932946758 0.0490898073 0.0103911340
-0.0310998167 0.0160889187 0.0093793011
-0.0935995183 -0.0161869586 0.0107920607
-0.1560992199 -0.0484628359 0.0122048202
-0.2185989215 -0.0807387133 0.0136175798
-0.1557943774 0.0168139300 0.0118038935
-0.1560992199 -0.0484628359 0.0122048202
-0.3435983247 -0.1452904679 0.0164430990
-0.3432934822 -0.0800137019 0.0160421722
-0.2810986231 -0.1130145906 0.0150303394
-0.3435983247 -0.1452904679 0.0164430990
-0.4060980263 -0.1775663452 0.0178558585
-0.4685977280 -0.2098422225 0.0192686181
-0.4057931839 -0.1122895792 0.0174549318
-0.4060980263 -0.1775663452 0.0178558585
-0.2804889381 0.0175389413 0.0142284860
-0.3429886398 -0.0147369360 0.0156412455
-0.2801840957 0.0828157073 0.0138275592
-0.2804889381 0.0175389413 0.0142284860
-0.2807937806 -0.0477378246 0.0146294127
-0.2810986231 -0.1130145906 0.0150303394
-0.3432934822 -0.0800137019 0.0160421722
-0.2807937806 -0.0477378246 0.0146294127
0.0304853575 -0.1474655019 0.0091693217
0.0929850591 -0.1151896246 0.0077565621
0.0301805150 -0.2127422678 0.0095702484
0.0304853575 -0.1474655019 0.0091693217
0.0307902000 -0.0821887359 0.0087683950
0.0310950425 -0.0169119700 0.0083674683
0.0932899016 -0.0499128586 0.0073556354
0.0307902000 -0.0821887359 0.0087683950
0.1551799183 -0.1481905132 0.0067447293
0.1554847607 -0.0829137473 0.0063438025
0.2176796199 -0.1159146359 0.0053319697
0.1551799183 -0.1481905132 0.0067447293
0.0926802166 -0.1804663905 0.0081574888
0.0301805150 -0.2127422678 0.0095702484
0.0929850591 -0.1151896246 0.0077565621
0.0926802166 -0.1804663905 0.0081574888
0.2795696365 -0.2141922905 0.0047210636
0.2798744790 -0.1489155245 0.0043201368
0.3420693381 -0.1819164132 0.0033083040
0.2795696365 -0.2141922905 0.0047210636
0.4042641973 -0.2149173018 0.0022964711
0.4352092056 -0.2640561291 0.0019910181
0.3105146448 -0.2633311178 0.0044156105
0.3417644957 -0.2471931792 0.0037092307
0.1548750758 -0.2134672792 0.0071456560
0.1858200841 -0.2626061065 0.0068402029
0.0611255234 -0.2618810952 0.0092647953
0.0923753742 -0.2457431565 0.0085584156
0.2173747774 -0.1811914019 0.0057328964
0.2170699349 -0.2464681678 0.0061338231
0.1548750758 -0.2134672792 0.0071456560
0.2173747774 -0.1811914019 0.0057328964
-0.2192086065 -0.2112922452 0.0144194333
-0.2189037640 -0.1460154792 0.0140185065
-0.1567089048 -0.1790163679 0.0130066737
-0.2192086065 -0.2112922452 0.0144194333
-0.0945140457 -0.2120172565 0.0119948408
-0.0635690374 -0.2611560838 0.0116893878
-0.1882635981 -0.2604310725 0.0141139802
-0.1570137473 -0.2442931338 0.0134076004
-0.3439031672 -0.2105672339 0.0168440257
-0.3129581589 -0.2597060612 0.0165385726
-0.4376527196 -0.2589810498 0.0189631650
-0.4064028688 -0.2428431112 0.0182567852
-0.2814034656 -0.1782913565 0.0154312661
-0.2817083081 -0.2435681225 0.0158321928
-0.3439031672 -0.2105672339 0.0168440257
-0.2814034656 -0.1782913565 0.0154312661
-0.0317095016 -0.1144646132 0.0101811545
-0.0942092032 -0.1467404906 0.0115939141
-0.0314046591 -0.0491878473 0.0097802278
-0.0317095016 -0.1144646132 0.0101811545
-0.0320143441 -0.1797413792 0.0105820813
-0.0323191866 -0.2450181452 0.0109830080
-0.0945140457 -0.2120172565 0.0119948408
-0.0320143441 -0.1797413792 0.0105820813
-0.1564040624 -0.1137396019 0.0126057470
-0.1567089048 -0.1790163679 0.0130066737
-0.2189037640 -0.1460154792 0.0140185065
-0.1564040624 -0.1137396019 0.0126057470
-0.0939043608 -0.0814637246 0.0111929874
-0.0314046591 -0.0491878473 0.0097802278
-0.0942092032 -0.1467404906 0.0115939141
-0.0939043608 -0.0814637246 0.0111929874
3 512 864 336
3 174 864 512
3 176 865 336
3 512 865 176
3 336 866 175
3 513 866 336
3 513 867 174
3 336 867 513
3 176 868 514
3 337 868 176
3 514 869 173
3 337 869 514
3 515 870 337
3 175 870 515
3 337 871 515
3 176 871 337
3 177 872 516
3 338 872 177
3 516 873 175
3 338 873 516
3 517 874 338
3 116 874 517
3 338 875 517
3 177 875 338
3 518 876 339
3 177 876 518
3 339 877 518
3 174 877 339
3 519 878 339
3 175 878 519
3 519 879 177
3 339 879 519
3 179 880 520
3 340 880 179
3 520 881 178
3 340 881 520
3 521 882 340
3 174 882 521
3 340 883 521
3 179 883 340
3 522 884 341
3 178 884 522
3 179 885 341
3 522 885 179
3 341 886 172
3 523 886 341
3 523 887 178
3 341 887 523
3 524 888 342
3 173 888 524
3 180 889 342
3 524 889 180
3 342 890 178
3 525 890 342
3 525 891 173
3 342 891 525
3 526 892 343
3 180 892 526
3 526 893 174
3 343 893 526
3 527 894 343
3 178 894 527
3 527 895 180
3 343 895 527
3 344 896 183
3 528 896 344
3 528 897 182
3 344 897 528
3 529 898 344
3 117 898 529
3 183 899 344
3 529 899 183
3 530 900 345
3 183 900 530
3 181 901 345
3 530 901 181
3 531 902 345
3 182 902 531
3 531 903 183
3 345 903 531
3 532 904 346
3 182 904 532
3 346 905 532
3 173 905 346
3 184 906 533
3 346 906 184
3 533 907 182
3 346 907 533
3 347 908 184
3 534 908 347
3 534 909 117
3 347 909 534
3 535 910 347
3 182 910 535
3 184 911 347
3 535 911 184
3 536 912 348
3 181 912 536
3 186 913 348
3 536 913 186
3 537 914 348
3 185 914 537
3 537 915 181
3 348 915 537
3 186 916 538
3 349 916 186
3 538 917 116
3 349 917 538
3 539 918 349
3 185 918 539
3 349 919 539
3 186 919 349
3 187 920 540
3 350 920 187
3 540 921 185
3 350 921 540
3 541 922 350
3 173 922 541
3 350 923 541
3 187 923 350
3 542 924 351
3 185 924 542
3 542 925 187
3 351 925 542
3 351 926 181
3 543 926 351
3 543 927 185
3 351 927 543
3 352 928 191
3 544 928 352
3 544 929 190
3 352 929 544
3 545 930 352
3 188 930 545
3 191 931 352
3 545 931 191
3 546 932 353
3 172 932 546
3 353 933 546
3 190 933 353
3 191 934 547
3 353 934 191
3 547 935 172
3 353 935 547
3 548 936 354
3 190 936 548
3 354 937 548
3 189 937 354
3 192 938 549
3 354 938 192
3 549 939 190
3 354 939 549
3 355 940 192
3 550 940 355
3 550 941 188
3 355 941 550
3 551 942 355
3 190 942 551
3 192 943 355
3 551 943 192
3 552 944 356
3 189 944 552
3 552 945 194
3 356 945 552
3 193 946 553
3 356 946 193
3 553 947 189
3 356 947 553
3 357 948 194
3 554 948 357
3 554 949 104
3 357 949 554
3 555 950 357
3 193 950 555
3 357 951 555
3 194 951 357
3 358 952 195
3 556 952 358
3 556 953 193
3 358 953 556
3 557 954 358
3 188 954 557
3 358 955 557
3 195 955 358
3 558 956 359
3 193 956 558
3 359 957 558
3 195 957 359
3 189 958 559
3 359 958 189
3 559 959 193
3 359 959 559
3 560 960 360
3 196 960 560
3 560 961 198
3 360 961 560
3 197 962 561
3 360 962 197
3 561 963 196
3 360 963 561
3 361 964 198
3 562 964 361
3 562 965 188
3 361 965 562
3 563 966 361
3 197 966 563
3 361 967 563
3 198 967 361
3 362 968 199
3 564 968 362
3 564 969 197
3 362 969 564
3 565 970 362
3 117 970 565
3 362 971 565
3 199 971 362
3 566 972 363
3 197 972 566
3 363 973 566
3 199 973 363
3 196 974 567
3 363 974 196
3 567 975 197
3 363 975 567
3 201 976 568
3 364 976 201
3 568 977 200
3 364 977 568
3 569 978 364
3 188 978 569
3 364 979 569
3 201 979 364
3 570 980 365
3 200 980 570
3 201 981 365
3 570 981 201
3 365 982 196
3 571 982 365
3 571 983 200
3 365 983 571
3 572 984 366
3 172 984 572
3 202 985 366
3 572 985 202
3 366 986 200
3 573 986 366
3 573 987 172
3 366 987 573
3 202 988 574
3 367 988 202
3 574 989 188
3 367 989 574
3 575 990 367
3 200 990 575
3 367 991 575
3 202 991 367
3 576 992 368
3 207 992 576
3 576 993 206
3 368 993 576
3 577 994 368
3 205 994 577
3 577 995 207
3 368 995 577
3 578 996 369
3 207 996 578
3 578 997 204
3 369 997 578
3 579 998 369
3 206 998 579
3 579 999 207
3 369 999 579
3 580 1000 370
3 208 1000 580
3 580 1001 206
3 370 1001 580
3 581 1002 370
3 104 1002 581
3 581 1003 208
3 370 1003 581
3 582 1004 371
3 208 1004 582
3 582 1005 205
3 371 1005 582
3 583 1006 371
3 206 1006 583
3 583 1007 208
3 371 1007 583
3 584 1008 372
3 210 1008 584
3 584 1009 209
3 372 1009 584
3 585 1010 372
3 205 1010 585
3 585 1011 210
3 372 1011 585
3 586 1012 373
3 210 1012 586
3 586 1013 203
3 373 1013 586
3 587 1014 373
3 209 1014 587
3 587 1015 210
3 373 1015 587
3 588 1016 374
3 211 1016 588
3 588 1017 209
3 374 1017 588
3 589 1018 374
3 204 1018 589
3 589 1019 211
3 374 1019 589
3 590 1020 375
3 211 1020 590
3 590 1021 205
3 375 1021 590
3 591 1022 375
3 209 1022 591
3 591 1023 211
3 375 1023 591
3 592 1024 376
3 214 1024 592
3 592 1025 213
3 376 1025 592
3 593 1026 376
3 212 1026 593
3 593 1027 214
3 376 1027 593
3 594 1028 377
3 214 1028 594
3 594 1029 204
3 377 1029 594
3 595 1030 377
3 213 1030 595
3 595 1031 214
3 377 1031 595
3 596 1032 378
3 215 1032 596
3 596 1033 213
3 378 1033 596
3 597 1034 378
3 143 1034 597
3 597 1035 215
3 378 1035 597
3 598 1036 379
3 215 1036 598
3 598 1037 212
3 379 1037 598
3 599 1038 379
3 213 1038 599
3 599 1039 215
3 379 1039 599
3 600 1040 380
3 217 1040 600
3 600 1041 216
3 380 1041 600
3 601 1042 380
3 212 1042 601
3 601 1043 217
3 380 1043 601
3 602 1044 381
3 217 1044 602
3 602 1045 104
3 381 1045 602
3 603 1046 381
3 216 1046 603
3 603 1047 217
3 381 1047 603
3 604 1048 382
3 218 1048 604
3 604 1049 216
3 382 1049 604
3 605 1050 382
3 204 1050 605
3 605 1051 218
3 382 1051 605
3 606 1052 383
3 218 1052 606
3 606 1053 212
3 383 1053 606
3 607 1054 383
3 216 1054 607
3 607 1055 218
3 383 1055 607
3 608 1056 384
3 222 1056 608
3 608 1057 221
3 384 1057 608
3 609 1058 384
3 203 1058 609
3 609 1059 222
3 384 1059 609
3 610 1060 385
3 222 1060 610
3 610 1061 220
3 385 1061 610
3 611 1062 385
3 221 1062 611
3 611 1063 222
3 385 1063 611
3 612 1064 386
3 223 1064 612
3 612 1065 221
3 386 1065 612
3 613 1066 386
3 219 1066 613
3 613 1067 223
3 386 1067 613
3 614 1068 387
3 223 1068 614
3 614 1069 203
3 387 1069 614
3 615 1070 387
3 221 1070 615
3 615 1071 223
3 387 1071 615
3 616 1072 388
3 220 1072 616
3 616 1073 225
3 388 1073 616
3 617 1074 388
3 224 1074 617
3 617 1075 220
3 388 1075 617
3 225 1076 618
3 389 1076 225
3 618 1077 116
3 389 1077 618
3 619 1078 389
3 224 1078 619
3 389 1079 619
3 225 1079 389
3 226 1080 620
3 390 1080 226
3 620 1081 224
3 390 1081 620
3 621 1082 390
3 219 1082 621
3 390 1083 621
3 226 1083 390
3 622 1084 391
3 224 1084 622
3 622 1085 226
3 391 1085 622
3 623 1086 391
3 220 1086 623
3 623 1087 224
3 391 1087 623
3 624 1088 392
3 227 1088 624
3 624 1089 229
3 392 1089 624
3 625 1090 392
3 228 1090 625
3 625 1091 227
3 392 1091 625
3 229 1092 626
3 393 1092 229
3 626 1093 219
3 393 1093 626
3 627 1094 393
3 228 1094 627
3 393 1095 627
3 229 1095 393
3 230 1096 628
3 394 1096 230
3 628 1097 228
3 394 1097 628
3 629 1098 394
3 143 1098 629
3 394 1099 629
3 230 1099 394
3 630 1100 395
3 228 1100 630
3 630 1101 230
3 395 1101 630
3 631 1102 395
3 227 1102 631
3 631 1103 228
3 395 1103 631
3 632 1104 396
3 232 1104 632
3 632 1105 231
3 396 1105 632
3 633 1106 396
3 219 1106 633
3 633 1107 232
3 396 1107 633
3 634 1108 397
3 232 1108 634
3 634 1109 227
3 397 1109 634
3 635 1110 397
3 231 1110 635
3 635 1111 232
3 397 1111 635
3 636 1112 398
3 233 1112 636
3 636 1113 231
3 398 1113 636
3 637 1114 398
3 203 1114 637
3 637 1115 233
3 398 1115 637
3 638 1116 399
3 233 1116 638
3 638 1117 219
3 399 1117 638
3 639 1118 399
3 231 1118 639
3 639 1119 233
3 399 1119 639
3 400 1120 235
3 640 1120 400
3 640 1121 119
3 400 1121 640
3 641 1122 400
3 234 1122 641
3 235 1123 400
3 641 1123 235
3 642 1124 401
3 116 1124 642
3 642 1125 119
3 401 1125 642
3 643 1126 401
3 235 1126 643
3 643 1127 116
3 401 1127 643
3 644 1128 234
3 402 1128 644
3 236 1129 234
3 644 1129 236
3 645 1130 402
3 118 1130 645
3 645 1131 236
3 402 1131 645
3 646 1132 403
3 236 1132 646
3 646 1133 116
3 403 1133 646
3 647 1134 236
3 403 1134 647
3 234 1135 236
3 647 1135 234
3 404 648 237
3 117 648 404
3 238 649 237
3 404 649 238
3 405 650 238
3 116 650 405
3 238 651 405
3 237 651 238
3 406 652 239
3 117 652 406
3 406 653 237
3 239 653 406
3 407 654 118
3 117 654 407
3 407 655 239
3 118 655 407
3 408 656 240
3 242 656 408
3 241 657 240
3 408 657 241
3 409 658 242
3 117 658 409
3 409 659 241
3 242 659 409
3 410 660 243
3 241 660 410
3 410 661 70
3 243 661 410
3 411 662 241
3 243 662 411
3 240 663 241
3 411 663 240
3 245 664 244
3 412 664 245
3 412 665 117
3 245 665 412
3 413 666 245
3 240 666 413
3 244 667 245
3 413 667 244
3 414 668 117
3 246 668 414
3 414 669 118
3 117 669 414
3 415 670 246
3 244 670 415
3 415 671 118
3 246 671 415
3 416 672 249
3 247 672 416
3 416 673 104
3 249 673 416
3 417 674 247
3 249 674 417
3 248 675 247
3 417 675 248
3 250 676 248
3 418 676 250
3 418 677 117
3 250 677 418
3 419 678 248
3 250 678 419
3 248 679 419
3 247 679 248
3 251 680 420
3 252 680 251
3 420 681 104
3 252 681 420
3 421 682 252
3 247 682 421
3 252 683 421
3 251 683 252
3 422 684 253
3 104 684 422
3 422 685 251
3 253 685 422
3 423 686 70
3 104 686 423
3 423 687 253
3 70 687 423
3 424 688 254
3 104 688 424
3 255 689 254
3 424 689 255
3 425 690 255
3 143 690 425
3 255 691 425
3 254 691 255
3 426 692 256
3 104 692 426
3 426 693 254
3 256 693 426
3 427 694 70
3 104 694 427
3 427 695 256
3 70 695 427
3 428 1136 258
3 696 1136 428
3 696 1137 71
3 428 1137 696
3 697 1138 428
3 257 1138 697
3 258 1139 428
3 697 1139 258
3 698 1140 429
3 143 1140 698
3 698 1141 71
3 429 1141 698
3 699 1142 429
3 258 1142 699
3 699 1143 143
3 429 1143 699
3 700 1144 257
3 430 1144 700
3 259 1145 257
3 700 1145 259
3 701 1146 430
3 70 1146 701
3 701 1147 259
3 430 1147 701
3 702 1148 431
3 259 1148 702
3 702 1149 143
3 431 1149 702
3 703 1150 259
3 431 1150 703
3 257 1151 259
3 703 1151 257
3 432 704 71
3 262 704 432
3 432 705 143
3 71 705 432
3 433 706 262
3 261 706 433
3 433 707 143
3 262 707 433
3 263 708 261
3 434 708 263
3 434 709 260
3 263 709 434
3 435 710 263
3 143 710 435
3 261 711 263
3 435 711 261
3 264 712 260
3 436 712 264
3 436 713 265
3 264 713 436
3 437 714 265
3 116 714 437
3 265 715 437
3 264 715 265
3 264 716 438
3 260 716 264
3 438 717 266
3 260 717 438
3 439 718 266
3 143 718 439
3 439 719 260
3 266 719 439
3 440 720 269
3 119 720 440
3 440 721 268
3 269 721 440
3 441 722 116
3 119 722 441
3 441 723 269
3 116 723 441
3 268 724 442
3 270 724 268
3 442 725 267
3 270 725 442
3 443 726 270
3 116 726 443
3 270 727 443
3 268 727 270
3 267 728 444
3 271 728 267
3 444 729 272
3 271 729 444
3 445 730 272
3 71 730 445
3 445 731 271
3 272 731 445
3 446 732 273
3 271 732 446
3 446 733 116
3 273 733 446
3 271 734 447
3 267 734 271
3 447 735 273
3 267 735 447
3 736 1152 448
3 276 1152 736
3 278 1153 448
3 736 1153 278
3 448 1154 277
3 737 1154 448
3 737 1155 276
3 448 1155 737
3 738 1156 449
3 278 1156 738
3 738 1157 275
3 449 1157 738
3 739 1158 449
3 277 1158 739
3 739 1159 278
3 449 1159 739
3 279 1160 740
3 450 1160 279
3 740 1161 277
3 450 1161 740
3 741 1162 450
3 119 1162 741
3 450 1163 741
3 279 1163 450
3 742 1164 451
3 277 1164 742
3 279 1165 451
3 742 1165 279
3 451 1166 276
3 743 1166 451
3 743 1167 277
3 451 1167 743
3 452 1168 281
3 744 1168 452
3 744 1169 280
3 452 1169 744
3 745 1170 452
3 275 1170 745
3 745 1171 281
3 452 1171 745
3 746 1172 453
3 276 1172 746
3 453 1173 746
3 280 1173 453
3 747 1174 453
3 281 1174 747
3 747 1175 276
3 453 1175 747
3 748 1176 454
3 280 1176 748
3 454 1177 748
3 274 1177 454
3 282 1178 749
3 454 1178 282
3 749 1179 280
3 454 1179 749
3 455 1180 282
3 750 1180 455
3 750 1181 275
3 455 1181 750
3 751 1182 455
3 280 1182 751
3 282 1183 455
3 751 1183 282
3 456 1184 285
3 752 1184 456
3 752 1185 284
3 456 1185 752
3 753 1186 456
3 118 1186 753
3 753 1187 285
3 456 1187 753
3 754 1188 457
3 283 1188 754
3 457 1189 754
3 284 1189 457
3 755 1190 457
3 285 1190 755
3 755 1191 283
3 457 1191 755
3 756 1192 458
3 284 1192 756
3 458 1193 756
3 275 1193 458
3 286 1194 757
3 458 1194 286
3 757 1195 284
3 458 1195 757
3 459 1196 286
3 758 1196 459
3 758 1197 118
3 459 1197 758
3 759 1198 459
3 284 1198 759
3 286 1199 459
3 759 1199 286
3 760 1200 460
3 283 1200 760
3 760 1201 288
3 460 1201 760
3 460 1202 287
3 761 1202 460
3 761 1203 283
3 460 1203 761
3 288 1204 762
3 461 1204 288
3 762 1205 119
3 461 1205 762
3 763 1206 461
3 287 1206 763
3 461 1207 763
3 288 1207 461
3 289 1208 764
3 462 1208 289
3 764 1209 287
3 462 1209 764
3 765 1210 462
3 275 1210 765
3 462 1211 765
3 289 1211 462
3 766 1212 463
3 287 1212 766
3 289 1213 463
3 766 1213 289
3 767 1214 463
3 283 1214 767
3 767 1215 287
3 463 1215 767
3 293 1216 768
3 464 1216 293
3 768 1217 292
3 464 1217 768
3 769 1218 464
3 274 1218 769
3 464 1219 769
3 293 1219 464
3 770 1220 465
3 292 1220 770
3 293 1221 465
3 770 1221 293
3 465 1222 291
3 771 1222 465
3 771 1223 292
3 465 1223 771
3 772 1224 466
3 290 1224 772
3 772 1225 294
3 466 1225 772
3 466 1226 292
3 773 1226 466
3 773 1227 290
3 466 1227 773
3 774 1228 467
3 294 1228 774
3 774 1229 274
3 467 1229 774
3 775 1230 467
3 292 1230 775
3 467 1231 775
3 294 1231 467
3 776 1232 468
3 291 1232 776
3 468 1233 776
3 296 1233 468
3 777 1234 468
3 295 1234 777
3 777 1235 291
3 468 1235 777
3 296 1236 778
3 469 1236 296
3 778 1237 70
3 469 1237 778
3 779 1238 469
3 295 1238 779
3 296 1239 469
3 779 1239 296
3 297 1240 780
3 470 1240 297
3 780 1241 295
3 470 1241 780
3 781 1242 470
3 290 1242 781
3 297 1243 470
3 781 1243 297
3 782 1244 471
3 295 1244 782
3 471 1245 782
3 297 1245 471
3 783 1246 471
3 291 1246 783
3 783 1247 295
3 471 1247 783
3 784 1248 472
3 298 1248 784
3 472 1249 784
3 300 1249 472
3 785 1250 472
3 299 1250 785
3 785 1251 298
3 472 1251 785
3 300 1252 786
3 473 1252 300
3 786 1253 290
3 473 1253 786
3 787 1254 473
3 299 1254 787
3 300 1255 473
3 787 1255 300
3 301 1256 788
3 474 1256 301
3 788 1257 299
3 474 1257 788
3 789 1258 474
3 118 1258 789
3 301 1259 474
3 789 1259 301
3 790 1260 475
3 299 1260 790
3 475 1261 790
3 301 1261 475
3 791 1262 475
3 298 1262 791
3 791 1263 299
3 475 1263 791
3 303 1264 792
3 476 1264 303
3 792 1265 302
3 476 1265 792
3 793 1266 476
3 290 1266 793
3 476 1267 793
3 303 1267 476
3 794 1268 477
3 302 1268 794
3 303 1269 477
3 794 1269 303
3 477 1270 298
3 795 1270 477
3 795 1271 302
3 477 1271 795
3 796 1272 478
3 274 1272 796
3 796 1273 304
3 478 1273 796
3 478 1274 302
3 797 1274 478
3 797 1275 274
3 478 1275 797
3 798 1276 479
3 304 1276 798
3 798 1277 290
3 479 1277 798
3 799 1278 479
3 302 1278 799
3 479 1279 799
3 304 1279 479
3 800 1280 480
3 309 1280 800
3 800 1281 308
3 480 1281 800
3 801 1282 480
3 307 1282 801
3 801 1283 309
3 480 1283 801
3 802 1284 481
3 309 1284 802
3 802 1285 306
3 481 1285 802
3 803 1286 481
3 308 1286 803
3 803 1287 309
3 481 1287 803
3 804 1288 482
3 310 1288 804
3 804 1289 308
3 482 1289 804
3 805 1290 482
3 71 1290 805
3 805 1291 310
3 482 1291 805
3 806 1292 483
3 310 1292 806
3 806 1293 307
3 483 1293 806
3 807 1294 483
3 308 1294 807
3 807 1295 310
3 483 1295 807
3 808 1296 484
3 312 1296 808
3 808 1297 311
3 484 1297 808
3 809 1298 484
3 307 1298 809
3 809 1299 312
3 484 1299 809
3 810 1300 485
3 312 1300 810
3 810 1301 70
3 485 1301 810
3 811 1302 485
3 311 1302 811
3 811 1303 312
3 485 1303 811
3 812 1304 486
3 313 1304 812
3 812 1305 311
3 486 1305 812
3 813 1306 486
3 306 1306 813
3 813 1307 313
3 486 1307 813
3 814 1308 487
3 313 1308 814
3 814 1309 307
3 487 1309 814
3 815 1310 487
3 311 1310 815
3 815 1311 313
3 487 1311 815
3 816 1312 488
3 316 1312 816
3 816 1313 315
3 488 1313 816
3 817 1314 488
3 314 1314 817
3 817 1315 316
3 488 1315 817
3 818 1316 489
3 316 1316 818
3 818 1317 306
3 489 1317 818
3 819 1318 489
3 315 1318 819
3 819 1319 316
3 489 1319 819
3 820 1320 490
3 317 1320 820
3 820 1321 315
3 490 1321 820
3 821 1322 490
3 305 1322 821
3 821 1323 317
3 490 1323 821
3 822 1324 491
3 317 1324 822
3 822 1325 314
3 491 1325 822
3 823 1326 491
3 315 1326 823
3 823 1327 317
3 491 1327 823
3 824 1328 492
3 319 1328 824
3 824 1329 318
3 492 1329 824
3 825 1330 492
3 314 1330 825
3 825 1331 319
3 492 1331 825
3 826 1332 493
3 319 1332 826
3 826 1333 71
3 493 1333 826
3 827 1334 493
3 318 1334 827
3 827 1335 319
3 493 1335 827
3 828 1336 494
3 320 1336 828
3 828 1337 318
3 494 1337 828
3 829 1338 494
3 306 1338 829
3 829 1339 320
3 494 1339 829
3 830 1340 495
3 320 1340 830
3 830 1341 314
3 495 1341 830
3 831 1342 495
3 318 1342 831
3 831 1343 320
3 495 1343 831
3 832 1344 496
3 324 1344 832
3 832 1345 323
3 496 1345 832
3 833 1346 496
3 321 1346 833
3 833 1347 324
3 496 1347 833
3 834 1348 497
3 324 1348 834
3 834 1349 305
3 497 1349 834
3 835 1350 497
3 323 1350 835
3 835 1351 324
3 497 1351 835
3 836 1352 498
3 325 1352 836
3 836 1353 323
3 498 1353 836
3 837 1354 498
3 322 1354 837
3 837 1355 325
3 498 1355 837
3 838 1356 499
3 325 1356 838
3 838 1357 321
3 499 1357 838
3 839 1358 499
3 323 1358 839
3 839 1359 325
3 499 1359 839
3 840 1360 500
3 326 1360 840
3 840 1361 322
3 500 1361 840
3 841 1362 500
3 327 1362 841
3 841 1363 326
3 500 1363 841
3 501 1364 327
3 842 1364 501
3 842 1365 119
3 501 1365 842
3 843 1366 501
3 326 1366 843
3 327 1367 501
3 843 1367 327
3 502 1368 328
3 844 1368 502
3 844 1369 326
3 502 1369 844
3 845 1370 502
3 321 1370 845
3 328 1371 502
3 845 1371 328
3 846 1372 503
3 322 1372 846
3 846 1373 326
3 503 1373 846
3 847 1374 503
3 328 1374 847
3 847 1375 322
3 503 1375 847
3 848 1376 504
3 330 1376 848
3 848 1377 329
3 504 1377 848
3 849 1378 504
3 331 1378 849
3 849 1379 330
3 504 1379 849
3 505 1380 331
3 850 1380 505
3 850 1381 321
3 505 1381 850
3 851 1382 505
3 330 1382 851
3 331 1383 505
3 851 1383 331
3 506 1384 332
3 852 1384 506
3 852 1385 330
3 506 1385 852
3 853 1386 506
3 71 1386 853
3 332 1387 506
3 853 1387 332
3 854 1388 507
3 329 1388 854
3 854 1389 330
3 507 1389 854
3 855 1390 507
3 332 1390 855
3 855 1391 329
3 507 1391 855
3 856 1392 508
3 334 1392 856
3 856 1393 333
3 508 1393 856
3 857 1394 508
3 305 1394 857
3 857 1395 334
3 508 1395 857
3 858 1396 509
3 334 1396 858
3 858 1397 321
3 509 1397 858
3 859 1398 509
3 333 1398 859
3 859 1399 334
3 509 1399 859
3 860 1400 510
3 335 1400 860
3 860 1401 333
3 510 1401 860
3 861 1402 510
3 329 1402 861
3 861 1403 335
3 510 1403 861
3 862 1404 511
3 335 1404 862
3 862 1405 305
3 511 1405 862
3 863 1406 511
3 333 1406 863
3 863 1407 335
3 511 1407 863
3 51 27 124
3 124 27 92
3 92 27 102
3 102 27 141
3 141 27 169
3 169 27 32
3 32 27 100
3 100 27 97
3 97 27 53
3 53 27 130
3 130 27 171
3 171 27 129
3 129 27 52
3 52 27 96
3 96 27 101
3 101 27 33
3 33 27 170
3 170 27 142
3 142 27 103
3 103 27 91
3 91 27 123
3 123 27 50
3 64 49 63
3 63 48 49
3 21 54 22
3 21 54 55
3 23 55 21
3 23 56 55
3 62 47 61
3 61 46 47
3 157 15 158
3 157 15 16
3 159 16 157
3 159 17 16
3 29 6 28
3 28 5 6
3 24 160 25
3 24 160 161
3 26 161 24
3 26 162 161
3 148 137 147
3 147 136 137
3 77 110 78
3 77 110 111
3 79 111 77
3 79 112 111
3 150 132 149
3 149 131 132
3 144 105 145
3 144 105 106
3 146 106 144
3 146 107 106
3 8 166 7
3 7 165 166
3 0 151 1
3 0 151 152
3 2 152 0
3 2 153 152
3 58 38 57
3 57 37 38
3 154 9 155
3 154 9 10
3 156 10 154
3 156 11 10
3 31 90 30
3 30 89 90
3 114 34 113
3 114 34 35
3 115 35 114
3 115 36 35
3 164 45 163
3 163 44 45
3 72 65 74
3 72 65 66
3 73 66 72
3 73 67 66
3 128 168 127
3 127 167 168
3 19 12 18
3 19 12 13
3 20 13 19
3 20 14 13
3 126 109 125
3 125 108 109
3 138 133 140
3 138 133 134
3 139 134 138
3 139 135 134
3 4 60 3
3 3 59 60
3 94 86 93
3 94 86 87
3 95 87 94
3 95 88 87
3 40 99 39
3 39 98 99
3 121 41 120
3 121 41 42
3 122 42 121
3 122 43 42
3 76 69 75
3 75 68 69
3 81 83 80
3 81 83 84
3 82 84 81
3 82 85 84