OFF
1182 1288 0
-0.4297335803 -0.3721638541 0.1220001843
-0.4321617955 -0.3702029545 0.3685062840
-0.4248771499 -0.3760856533 -0.3710120150
-0.4315547417 -0.3706931794 0.3068797591
-0.4359451624 0.4289952680 0.1155659596
-0.4383733776 0.4309561676 0.3620720593
-0.4377663238 0.4304659427 0.3004455343
-0.4292557663 -0.4337914789 0.1224951247
-0.4316839815 -0.4318305793 0.3690012244
-0.4310769277 -0.4323208042 0.3073746994
-0.4354673484 0.3673676432 0.1160609000
-0.4378955636 0.3693285428 0.3625669996
-0.4306109180 0.3634458441 -0.3769512994
-0.4372885098 0.3688383179 0.3009404747
-0.1012597178 -0.2912077545 -0.3279486117
-0.1057217563 0.2842982515 -0.3325705836
0.2461187702 -0.1814815967 0.1887772574
0.2427740721 0.2499117768 0.1853126748
-0.2078453114 -0.2919542256 -0.3179982206
-0.2123073499 0.2835517804 -0.3226201925
-0.4265278873 0.1179525907 -0.3090874763
-0.4246093242 -0.1295003570 -0.3071001459
-0.4139148742 -0.3708164596 -0.1860367330
-0.4195913006 0.3613192038 -0.1919166203
-0.3193354880 -0.0464679608 -0.3384922174
-0.3199754168 0.0360689440 -0.3391550832
0.4293021855 -0.2866120706 -0.2679188045
0.4248401470 0.2888939355 -0.2725407764
0.3243600143 -0.2876391485 -0.2944948007
0.3198979758 0.2878668575 -0.2991167727
-0.4214117149 0.3637087553 -0.2579250156
-0.4156897950 -0.3742945845 -0.2519980041
-0.3200413869 0.1185793573 -0.3338472377
-0.3181228238 -0.1288735904 -0.3318599073
-0.2114911625 0.3650034819 -0.2993685144
-0.2057692425 -0.3729998580 -0.2934415028
-0.1052095067 0.1200243576 -0.3613207324
-0.1032909436 -0.1274285900 -0.3593334020
-0.1055430464 0.2023375050 -0.3499421836
-0.1023496313 -0.2095436542 -0.3466343065
0.4327749852 -0.0403699206 -0.3052784887
0.4321350564 0.0421669842 -0.3059413546
0.1060387761 0.3674027387 -0.3071669405
0.1117606961 -0.3706006012 -0.3012399290
-0.4913602027 -0.3726465049 0.1213969689
-0.4937884179 -0.3706856053 0.3679030686
-0.4931813641 -0.3711758302 0.3062765437
-0.5000000000 0.4304735168 0.3614688439
-0.4927153544 0.4245908181 -0.3780494551
-0.4993929462 0.4299832919 0.2998423190
-0.4933106039 -0.4323132301 0.3683980090
-0.4860259583 -0.4381959288 -0.3711202900
-0.4970939708 0.3668849925 0.1154576846
-0.4995221860 0.3688458920 0.3619637842
-0.4989151322 0.3683556671 0.3003372593
0.1119182556 -0.0433284511 -0.3639064929
0.1112783269 0.0392084537 -0.3645693587
-0.2119326996 -0.0457754625 -0.3559519540
-0.2125726283 0.0367614423 -0.3566148198
0.1798041023 0.1892721759 0.3700839745
0.1821931724 -0.1188659479 0.3725586764
-0.2128486267 0.1192705108 -0.3512716613
-0.2109300637 -0.1281824369 -0.3492843309
-0.2127593028 0.2015866199 -0.3399325703
-0.2095658877 -0.2102945393 -0.3366246932
0.4281644009 0.2069604338 -0.2895566867
0.4313578160 -0.2049207255 -0.2862488096
-0.4256034045 0.2002738484 -0.2979135600
-0.4224099894 -0.2116073108 -0.2946056829
-0.3195320267 0.2008981725 -0.3225766967
-0.3163386116 -0.2109829868 -0.3192688196
0.3165171896 0.3692845301 -0.2760504603
0.3222391096 -0.3687188097 -0.2701234488
-0.3167979421 0.3643244980 -0.2822494927
-0.3110760221 -0.3736788418 -0.2763224812
0.0055100810 -0.2904010018 -0.3305708510
0.0018600996 0.2031490430 -0.3525800220
0.0026162168 0.1208390884 -0.3639689668
0.0045347799 -0.1266138592 -0.3619816364
0.0050535147 -0.2087321163 -0.3492721449
0.0010480426 0.2851050042 -0.3351928230
0.0039548543 -0.0442037994 -0.3686731484
0.0001816511 0.3665444616 -0.3118413559
0.0059035711 -0.3714588782 -0.3059143444
0.0033149255 0.0383331054 -0.3693360143
0.3225992150 0.2059272510 -0.3162913702
0.3257926301 -0.2059539082 -0.3129834931
-0.4260311015 -0.0470959650 -0.3136846779
-0.4266710303 0.0354409398 -0.3143475437
0.2161889750 0.2049460805 -0.3357339271
0.2193823901 -0.2069350788 -0.3324260500
-0.1899556320 0.1863762715 0.3664646822
-0.1875665619 -0.1217618524 0.3689393841
0.2195501839 -0.0423961513 -0.3517285015
0.2189102552 0.0401407535 -0.3523913673
-0.1040816287 -0.0450201308 -0.3660207488
-0.1047215575 0.0375167740 -0.3666836146
-0.4194340852 -0.2932592497 -0.2762264279
-0.4238961237 0.2822467564 -0.2808483999
0.4946657556 -0.3649240929 0.1310484151
0.4922375404 -0.3629631933 0.3775545147
0.4928445942 -0.3634534182 0.3159279898
0.4860259583 0.4381959288 0.3711202900
0.4933106039 0.4323132301 -0.3683980090
0.4866330121 0.4377057039 0.3094937651
0.4927153544 -0.4245908181 0.3780494551
0.5000000000 -0.4304735168 -0.3614688439
0.4889319875 0.3746074044 0.1251091307
0.4865037723 0.3765683040 0.3716152304
0.4871108261 0.3760780791 0.3099887055
-0.1057471446 0.3657440621 -0.3092399492
-0.1000252247 -0.3722592777 -0.3033129377
0.4206319305 0.3703035188 -0.2496829010
0.4263538505 -0.3676998211 -0.2437558895
0.1091905730 0.2040192675 -0.3478403221
0.1123839881 -0.2078618917 -0.3445324450
0.1103689813 0.1217127370 -0.3592106012
0.1122875444 -0.1257402107 -0.3572232708
0.4305968695 0.1246654672 -0.3006977444
0.4325154326 -0.1227874805 -0.2987104140
0.3246182330 0.1236282377 -0.3275371628
0.3265367960 -0.1238247100 -0.3255498324
0.2115679455 0.3683168193 -0.2952275157
0.2172898655 -0.3696865205 -0.2893005042
-0.3139890394 -0.2926386055 -0.3007431063
-0.3184510779 0.2828674005 -0.3053650783
0.3265883209 -0.0414091794 -0.3321697684
0.3259483921 0.0411277254 -0.3328326342
0.4232335156 -0.3642600350 -0.1778425343
0.4175570892 0.3678756283 -0.1837224217
0.2185766641 -0.2886145507 -0.3138243054
0.2141146256 0.2868914554 -0.3184462773
-0.2468942089 -0.1853428026 0.1839515343
-0.2502389070 0.2460505708 0.1804869518
0.2177883503 0.1226431970 -0.3470564887
0.2197069133 -0.1248097506 -0.3450691584
0.1122076367 -0.2895359093 -0.3258591447
0.1077455982 0.2859700968 -0.3304811166
0.4330391332 -0.3654067436 0.1304451997
0.4306109180 -0.3634458441 0.3769512994
0.4378955636 -0.3693285428 -0.3625669996
0.4312179718 -0.3639360689 0.3153247744
0.4268275511 0.4357523785 0.1240109750
0.4243993359 0.4377132781 0.3705170746
0.4250063897 0.4372230532 0.3088905497
0.4335169472 -0.4270343684 0.1309401401
0.4310887320 -0.4250734688 0.3774462397
0.4316957858 -0.4255636937 0.3158197148
0.4273053651 0.3741247537 0.1245059153
0.4248771499 0.3760856533 0.3710120150
0.4321617955 0.3702029545 -0.3685062840
0.4254842037 0.3755954284 0.3093854901
0.4609855603 0.0046003304 0.1277771652
-0.4634137755 -0.0026394308 0.1187289345
-0.0043198987 0.4015600108 0.1200359375
0.0018916835 -0.3995991113 0.1264701622
-0.0038812298 0.0337551618 0.3695116793
-0.1887610970 0.0323072095 0.3677020332
-0.0026866948 -0.1203139002 0.3707490302
-0.0003877194 -0.1834121996 0.1863643958
0.0909027265 -0.1511390738 0.2794615361
-0.0323505183 -0.1521043753 0.2782551053
-0.2184249205 0.0005167344 0.2752081083
-0.0352174023 0.2176613734 0.2752854632
0.2129614363 0.0038952896 0.2794306160
-0.3411807787 0.0910124203 0.1500062171
-0.2485665580 0.0303538841 0.1822192430
-0.3883240635 0.2291900317 0.1330335585
0.0885332290 0.3100876622 0.1524964335
0.4301722491 0.0043590050 0.1274755575
0.3367120676 0.0963215785 0.1566415864
0.4316056912 -0.1805238693 0.1289603786
0.0016527765 -0.3687852989 0.1262226920
0.0930724621 -0.2753747731 0.1571983670
-0.0769108734 -0.2303587879 0.1705749507
0.2173459548 -0.3670960213 0.1283339459
-0.2140404019 -0.3704745765 0.1241114382
-0.1226207162 -0.2770640508 0.1550871132
-0.3383138946 -0.2787533284 0.1529758593
-0.0061410601 0.4030306855 0.3049155122
-0.0066834940 0.4340896104 0.3354813045
0.0286827207 0.4306542490 -0.1264160247
-0.0045588057 0.4323738232 0.1197884673
0.2277551359 0.4332033137 -0.0012025249
0.1115981651 0.4327885685 0.0592929712
0.2111343727 0.4340631009 0.1218997211
-0.2036312208 0.4298247585 -0.0054250325
-0.2202519840 0.4306845456 0.1176772134
-0.0874742501 0.4302395038 -0.0659205286
0.2609966623 0.4314837395 -0.2474070168
0.2277551359 0.4332033137 -0.0012025249
0.3439121067 0.4336180590 -0.0616980209
0.1448396915 0.4310689943 -0.1869115208
0.4600690775 0.4340328043 -0.1221935170
0.3771536331 0.4318984848 -0.3079025129
0.3439121067 0.4336180590 -0.0616980209
0.0000705221 -0.3981284366 0.3113497369
0.4591643989 0.0060710051 0.3126567400
-0.4652349369 -0.0011687561 0.3036085092
0.4896741832 0.0065574429 0.3437716101
-0.0004719118 -0.3670695117 0.3419155292
-0.0062056800 0.3724619856 0.3359762448
-0.4347251526 -0.0006823183 0.3347233793
0.4280475608 0.0060747922 0.3431683947
-0.0067481139 0.4035209104 0.3665420371
0.4585573451 0.0065612300 0.3742832649
-0.0005365317 -0.3976382117 0.3729762619
-0.4658419907 -0.0006785312 0.3652350341
-0.4963517750 -0.0011649691 0.3341201640
0.0000059022 -0.4286971365 0.3424104696
0.0353721169 -0.4321324979 -0.1194868596
-0.2253269207 -0.4351642133 -0.2453035748
-0.1969418247 -0.4329619884 0.0015041326
-0.3272913435 -0.4344778461 -0.0614042251
-0.0949774019 -0.4336483556 -0.1823952172
-0.4576408623 -0.4359937038 -0.1243125827
-0.3556764395 -0.4366800711 -0.3082119324
-0.3272913435 -0.4344778461 -0.0614042251
0.0069870209 -0.4343347228 -0.3662945669
0.2676860584 -0.4313030073 -0.2404778517
0.1373365397 -0.4328188651 -0.3033862093
0.2534935104 -0.4324041198 -0.3638817054
-0.2253269207 -0.4351642133 -0.2453035748
-0.2395194687 -0.4362653258 -0.3687074285
-0.0949774019 -0.4336483556 -0.1823952172
0.4944659937 -0.0279330562 -0.1181798566
0.4917988715 0.0048416558 0.1280787729
0.4945658747 -0.1964285745 0.0064342793
0.4931324326 -0.0115457002 0.0049494582
0.4932323136 -0.1800412186 0.1295635940
0.4916989906 0.1733371741 0.0034646371
0.4903654295 0.1897245301 0.1265939518
0.4931324326 -0.0115457002 0.0049494582
0.4973328778 -0.3976988049 -0.1152102144
0.4972329969 -0.2292032865 -0.2398243502
0.4958994358 -0.2128159305 -0.1166950355
0.4986664389 -0.4140861608 -0.2383395291
0.4945658747 -0.1964285745 0.0064342793
0.4959993167 -0.3813114489 0.0079191003
0.4958994358 -0.2128159305 -0.1166950355
-0.4915599645 -0.0356554682 -0.1278313027
-0.4921376595 0.1944676750 -0.2529403789
-0.4943269677 0.1656147621 -0.0061868091
-0.4946158151 0.2806763337 -0.0687413472
-0.4918488120 0.0794061034 -0.1903858408
-0.4949046626 0.3957379053 -0.1312958853
-0.4924265069 0.3095292465 -0.3154949170
-0.4946158151 0.2806763337 -0.0687413472
-0.4893706563 -0.0068025554 -0.3745848726
-0.4887929614 -0.2369256985 -0.2494757964
-0.4890818089 -0.1218641269 -0.3120303345
-0.4876983073 -0.2224992421 -0.3728525813
-0.4921376595 0.1944676750 -0.2529403789
-0.4910430054 0.2088941314 -0.3763171638
-0.4918488120 0.0794061034 -0.1903858408
0.0062852474 0.3657610792 -0.2802114522
-0.2121628353 0.3646034616 -0.3285813758
0.0007754387 0.3668243993 -0.3727287917
0.0119903447 -0.3700725012 -0.2743018663
0.0046593207 -0.3675382473 -0.1819396337
0.2249429541 -0.3697005220 -0.3184344330
-0.4222342253 -0.0073832247 -0.2814643177
-0.4167530874 -0.0047486279 -0.1889766767
-0.4235556876 -0.1917344390 -0.3262381663
0.4277263264 -0.0007264572 -0.2731447107
0.4299440609 0.1847382487 -0.3208254973
0.4350286795 0.0004372059 -0.3655366418
0.0375614251 -0.4032795850 -0.3662404294
-0.4893706563 -0.0068025554 -0.3745848726
0.0002976247 0.4284520241 -0.3732237320
0.4966553019 0.0009198566 -0.3649334264
0.4609855603 0.0046003304 0.1277771652
-0.4634137755 -0.0026394308 0.1187289345
-0.0043198987 0.4015600108 0.1200359375
0.0018916835 -0.3995991113 0.1264701622
-0.0038812298 0.0337551618 0.3695116793
0.1809986374 0.0352031140 0.3713213255
-0.0050757648 0.1878242237 0.3682743284
-0.0323505183 -0.1521043753 0.2782551053
-0.2485665580 0.0303538841 0.1822192430
-0.2184249205 0.0005167344 0.2752081083
-0.2192610950 0.1083650778 0.2743419626
-0.0037324174 0.2479811738 0.1828998133
-0.0352174023 0.2176613734 0.2752854632
0.0880358425 0.2186266749 0.2764918939
0.2444464212 0.0342150901 0.1870449661
0.2121252618 0.1117436330 0.2785644703
0.2129614363 0.0038952896 0.2794306160
-0.4326004643 -0.0023981055 0.1190305421
-0.4311670223 -0.1872809798 0.1205153632
-0.3411807787 0.0910124203 0.1500062171
-0.0040809917 0.3707461985 0.1202834076
-0.2197741700 0.3690569208 0.1181721538
0.0885332290 0.3100876622 0.1524964335
0.3367120676 0.0963215785 0.1566415864
0.3820087164 0.2352231661 0.1405737508
0.2444464212 0.0342150901 0.1870449661
0.0930724621 -0.2753747731 0.1571983670
0.2630557977 -0.3203907584 0.1438217834
-0.0003877194 -0.1834121996 0.1863643958
-0.0061410601 0.4030306855 0.3049155122
-0.0066834940 0.4340896104 0.3354813045
-0.4655443660 0.4277734928 -0.0079886979
0.4896682811 0.4352545794 0.0013611405
0.0286827207 0.4306542490 -0.1264160247
0.0002976247 0.4284520241 -0.3732237320
-0.2320163168 0.4276225336 -0.2522327399
-0.1016667981 0.4291383913 -0.1893243823
-0.2462088648 0.4265214211 -0.3756365936
0.2609966623 0.4314837395 -0.2474070168
0.2468041143 0.4303826271 -0.3708108705
0.1306471435 0.4299678818 -0.3103153744
-0.2320163168 0.4276225336 -0.2522327399
-0.4643302584 0.4267930430 -0.1312417478
-0.3339807396 0.4283089008 -0.0683333902
-0.3623658356 0.4261066758 -0.3151410975
-0.2036312208 0.4298247585 -0.0054250325
-0.1016667981 0.4291383913 -0.1893243823
-0.3339807396 0.4283089008 -0.0683333902
0.0000705221 -0.3981284366 0.3113497369
0.4591643989 0.0060710051 0.3126567400
-0.4652349369 -0.0011687561 0.3036085092
0.4896741832 0.0065574429 0.3437716101
-0.0004719118 -0.3670695117 0.3419155292
-0.0062056800 0.3724619856 0.3359762448
-0.4347251526 -0.0006823183 0.3347233793
0.4280475608 0.0060747922 0.3431683947
-0.0067481139 0.4035209104 0.3665420371
0.4585573451 0.0065612300 0.3742832649
-0.0005365317 -0.3976382117 0.3729762619
-0.4658419907 -0.0006785312 0.3652350341
-0.4963517750 -0.0011649691 0.3341201640
0.0000059022 -0.4286971365 0.3424104696
0.4655443660 -0.4277734928 0.0079886979
-0.4896682811 -0.4352545794 -0.0013611405
0.0353721169 -0.4321324979 -0.1194868596
0.2676860584 -0.4313030073 -0.2404778517
0.4667584736 -0.4287539426 -0.1152643519
0.3506015028 -0.4291686879 -0.0547688558
0.3838430292 -0.4308882621 -0.3009733478
0.2344445320 -0.4295834331 0.0057266402
0.1515290877 -0.4317177526 -0.1799823557
0.3506015028 -0.4291686879 -0.0547688558
0.0021305905 -0.4304129237 0.1267176324
-0.1969418247 -0.4329619884 0.0015041326
-0.0807848539 -0.4325472431 -0.0589913635
-0.2135625879 -0.4321022013 0.1246063785
0.2344445320 -0.4295834331 0.0057266402
0.2178237688 -0.4287236460 0.1288288862
0.1182875613 -0.4299981784 0.0662221363
0.4899071881 0.4044407670 0.0016086107
0.4963576772 -0.4275321675 0.0082903056
0.4944659937 -0.0279330562 -0.1181798566
0.4966553019 0.0009198566 -0.3649334264
0.4938882988 0.2021900869 -0.2432889328
0.4941771463 0.0871285154 -0.1807343947
0.4949829529 0.2166165433 -0.3666657177
0.4972329969 -0.2292032865 -0.2398243502
0.4983276510 -0.2147768301 -0.3632011351
0.4969441494 -0.1141417149 -0.3023788883
0.4938882988 0.2021900869 -0.2432889328
0.4911212957 0.4034603173 -0.1216444391
0.4914101431 0.2883987457 -0.0590899010
0.4935994513 0.3172516585 -0.3058434709
0.4916989906 0.1733371741 0.0034646371
0.4941771463 0.0871285154 -0.1807343947
0.4914101431 0.2883987457 -0.0590899010
-0.4899071881 -0.4044407670 -0.0016086107
-0.4963576772 0.4275321675 -0.0082903056
-0.4915599645 -0.0356554682 -0.1278313027
-0.4886930805 -0.4054212168 -0.1248616605
-0.4914600836 -0.2041509865 -0.0032171669
-0.4901265225 -0.2205383425 -0.1263464816
-0.4900266416 -0.3890338608 -0.0017323458
-0.4887929614 -0.2369256985 -0.2494757964
-0.4873595194 -0.4218085728 -0.2479909753
-0.4901265225 -0.2205383425 -0.1263464816
-0.4942270867 -0.0028807562 0.1184273268
-0.4943269677 0.1656147621 -0.0061868091
-0.4928935256 -0.0192681122 -0.0047019880
-0.4956605288 0.1820021181 0.1169425057
-0.4914600836 -0.2041509865 -0.0032171669
-0.4927936447 -0.1877636305 0.1199121479
-0.4928935256 -0.0192681122 -0.0047019880
0.0062852474 0.3657610792 -0.2802114522
0.2192235214 0.3679820169 -0.3243588681
-0.0010171057 0.3645974161 -0.1878195210
0.0119903447 -0.3700725012 -0.2743018663
0.0065092069 -0.3727070980 -0.3667895073
-0.2064434026 -0.3730790772 -0.3226569406
-0.4222342253 -0.0073832247 -0.2814643177
-0.4277440339 -0.0063199046 -0.3739816572
-0.4264225716 0.1780313097 -0.3292078085
0.4277263264 -0.0007264572 -0.2731447107
0.4328109450 -0.1850275000 -0.3178558551
0.4203953024 0.0018077966 -0.1807824780
0.0069870209 -0.4343347228 -0.3662945669
-0.4583184381 -0.0373750424 -0.3740357947
-0.0302767795 0.3973968863 -0.3732778696
0.4660808977 -0.0301352811 -0.3649875639
0.4441454627 0.1893625421 0.1261415403
0.4301722491 0.0043590050 0.1274755575
-0.4802538732 0.1821227808 0.1170933095
-0.4942270867 -0.0028807562 0.1184273268
-0.0045588057 0.4323738232 0.1197884673
-0.2198936235 0.3844638270 0.1180484187
0.2174654083 -0.3825029274 0.1284576809
0.0016527765 -0.3687852989 0.1262226920
-0.0957238959 -0.0440033453 0.3692255317
-0.0969184309 0.1100657166 0.3679881808
0.0891559713 -0.0425553931 0.3710351778
-0.0957238959 -0.0440033453 0.3692255317
0.1228655254 -0.1824468981 0.1875708266
0.2141559713 -0.1501737723 0.2806679669
-0.1236409641 -0.1843775011 0.1851579651
0.0909027265 -0.1511390738 0.2794615361
-0.2326595647 -0.0924130341 0.2295798213
-0.1887610970 0.0323072095 0.3677020332
-0.1427281547 0.2318559721 0.2278862075
-0.0050757648 0.1878242237 0.3682743284
0.1809986374 0.0352031140 0.3713213255
0.2295401032 -0.0887931535 0.2341039367
-0.0037324174 0.2479811738 0.1828998133
0.2579192971 0.3421062080 0.1385011744
0.2914154189 -0.0425800091 0.1727094219
0.4287388071 0.1892418794 0.1259907364
0.3381455097 -0.0885612958 0.1581264074
0.3395789517 -0.2734441701 0.1596112285
0.2404848830 0.3895543823 0.3074521088
-0.0059021531 0.3722168731 0.3051629824
-0.0069870209 0.4343347228 0.3662945669
0.2091614478 0.4356563318 0.3221859271
0.1282189283 0.4319287814 -0.0638092748
0.0120619575 0.4315140361 -0.0033137787
0.3272913435 0.4344778461 0.0614042251
0.1115981651 0.4327885685 0.0592929712
-0.1040950133 0.4310992909 0.0571817174
-0.3197881916 0.4294100132 0.0550704635
-0.1040950133 0.4310992909 0.0571817174
0.0120619575 0.4315140361 -0.0033137787
0.2443758991 0.4323435266 -0.1243047708
0.3272913435 0.4344778461 0.0614042251
0.1282189283 0.4319287814 -0.0638092748
0.2443758991 0.4323435266 -0.1243047708
0.3605328699 0.4327582719 -0.1848002669
0.4766898407 0.4331730172 -0.2452957630
0.4434483143 0.4348925914 0.0009087290
0.3605328699 0.4327582719 -0.1848002669
-0.0001683849 -0.3673146242 0.3111022668
0.2158831539 -0.4118460652 0.3135847259
0.4899777101 0.0063123305 0.3129583476
0.4451911854 -0.1789325319 0.3139907572
-0.4344216257 -0.0009274308 0.3039101169
-0.4792081505 -0.1861722932 0.3049425264
0.4893706563 0.0068025554 0.3745848726
0.4912593887 -0.1784479876 0.3298498000
0.2153730300 -0.3655027903 0.3286201518
-0.0001683849 -0.3673146242 0.3111022668
-0.0065092069 0.3727070980 0.3667895073
-0.2217470949 0.3706501517 0.3184583598
-0.4350286795 -0.0004372059 0.3655366418
-0.4331399472 -0.1856877489 0.3208015692
0.4267658823 0.1908351103 0.3262769424
0.4283510877 0.0058296797 0.3123551323
-0.0069870209 0.4343347228 0.3662945669
-0.2223218387 0.3864247266 0.3645545184
0.4414783405 0.2221372540 0.3724001697
0.4277440339 0.0063199046 0.3739816572
-0.0002976247 -0.4284520241 0.3732237320
0.2150371931 -0.3805420279 0.3749637806
-0.4829209954 0.2148974928 0.3633519390
-0.4966553019 -0.0009198566 0.3649334264
-0.4976334536 0.1835953490 0.3172287116
-0.4960482481 -0.0014100815 0.3033069015
-0.2155355127 -0.4305089704 0.3248925845
0.0003094291 -0.4289422490 0.3115972071
-0.2111343727 -0.4340631009 -0.1218997211
-0.3130987955 -0.4333767336 0.0619996286
-0.0807848539 -0.4325472431 -0.0589913635
-0.2111343727 -0.4340631009 -0.1218997211
-0.3414838915 -0.4355789586 -0.1848080787
-0.4718334103 -0.4370948163 -0.2477164363
-0.4434483143 -0.4348925914 -0.0009087290
-0.3414838915 -0.4355789586 -0.1848080787
0.1515290877 -0.4317177526 -0.1799823557
0.0211795689 -0.4332336103 -0.2428907133
0.3838430292 -0.4308882621 -0.3009733478
0.1373365397 -0.4328188651 -0.3033862093
-0.1091699499 -0.4347494681 -0.3057990709
-0.3556764395 -0.4366800711 -0.3082119324
-0.1091699499 -0.4347494681 -0.3057990709
0.0211795689 -0.4332336103 -0.2428907133
0.4931823731 -0.0957934594 0.0672565261
0.4945159342 -0.1121808154 -0.0558727887
0.4946158151 -0.2806763337 0.0687413472
0.4931823731 -0.0957934594 0.0672565261
0.4917489311 0.0890894150 0.0657717050
0.4903154890 0.2739722893 0.0642868839
0.4930824922 0.0727020590 -0.0573576098
0.4917489311 0.0890894150 0.0657717050
0.4972829373 -0.3134510457 -0.1775172823
0.4958494953 -0.1285681713 -0.1790021034
0.4986164984 -0.3298384017 -0.3006465971
0.4972829373 -0.3134510457 -0.1775172823
0.4959493762 -0.2970636897 -0.0543879676
0.4946158151 -0.2806763337 0.0687413472
0.4945159342 -0.1121808154 -0.0558727887
0.4959493762 -0.2970636897 -0.0543879676
-0.4932323136 0.1800412186 -0.1295635940
-0.4957104692 0.2662498773 0.0546354378
-0.4929434661 0.0649796470 -0.0670090559
-0.4932323136 0.1800412186 -0.1295635940
-0.4935211610 0.2951027901 -0.1921181321
-0.4938100085 0.4101643617 -0.2546726702
-0.4959993167 0.3813114489 -0.0079191003
-0.4935211610 0.2951027901 -0.1921181321
-0.4901764630 -0.1362905833 -0.1886535495
-0.4904653104 -0.0212290118 -0.2512080876
-0.4874094598 -0.3375608136 -0.3102980432
-0.4890818089 -0.1218641269 -0.3120303345
-0.4907541579 0.0938325598 -0.3137626257
-0.4924265069 0.3095292465 -0.3154949170
-0.4907541579 0.0938325598 -0.3137626257
-0.4904653104 -0.0212290118 -0.2512080876
-0.2066530266 0.3635401415 -0.2360640363
-0.3158770680 0.3629613327 -0.2602489981
0.2192235214 0.3679820169 -0.3243588681
-0.2121628353 0.3646034616 -0.3285813758
0.2176119302 -0.3671662681 -0.2260722003
-0.2009622648 -0.3704444804 -0.2301692996
0.2176119302 -0.3671662681 -0.2260722003
0.3240882349 -0.3669802785 -0.2481384836
-0.4180745497 -0.1890998421 -0.2337505253
-0.4209127629 0.1769679896 -0.2366904690
-0.4180745497 -0.1890998421 -0.2337505253
-0.4187352809 -0.2812754493 -0.2561374497
0.4226417078 0.1835745856 -0.2284335662
0.4237505751 0.2763069385 -0.2522739595
0.4328109450 -0.1850275000 -0.3178558551
0.4299440609 0.1847382487 -0.3208254973
0.0065092069 -0.3727070980 -0.3667895073
0.2687807125 -0.4168765509 -0.3638546367
-0.4910430054 0.2088941314 -0.3763171638
-0.4583184381 -0.0373750424 -0.3740357947
0.2468041143 0.4303826271 -0.3708108705
-0.0302767795 0.3973968863 -0.3732778696
0.4660808977 -0.0301352811 -0.3649875639
0.4949829529 0.2166165433 -0.3666657177
0.4778256580 -0.1801618812 0.1294127901
0.4917988715 0.0048416558 0.1280787729
-0.4465736779 -0.1874016425 0.1203645594
-0.4326004643 -0.0023981055 0.1190305421
-0.0040809917 0.3707461985 0.1202834076
0.2112538262 0.4186561947 0.1220234562
-0.2136820414 -0.4166952951 0.1244826434
0.0021305905 -0.4304129237 0.1267176324
0.0879614363 0.1115136689 0.3697978269
0.0891559713 -0.0425553931 0.3710351778
-0.0969184309 0.1100657166 0.3679881808
0.0879614363 0.1115136689 0.3697978269
-0.0026866948 -0.1203139002 0.3707490302
-0.1396223636 -0.1687235890 0.2311033198
0.0880358425 0.2186266749 0.2764918939
-0.1269856622 0.2470158723 0.1816933825
0.2112890872 0.2195919764 0.2776983247
0.1195208273 0.2489464753 0.1841062441
-0.3383138946 -0.2787533284 0.1529758593
-0.3397473366 -0.0938704540 0.1514910382
-0.4340339064 0.1824847689 0.1175457211
-0.2940374938 -0.0471651912 0.1669788757
-0.3428531277 0.3067091070 0.1482739259
-0.1271599493 0.3083983846 0.1503851797
0.2116121867 0.3724354761 0.1223946615
-0.0808528390 0.2780691165 0.1664916926
0.3395789517 -0.2734441701 0.1596112285
0.1695956162 -0.2284281849 0.1729878122
-0.0769108734 -0.2303587879 0.1705749507
0.1228655254 -0.1824468981 0.1875708266
-0.2527670031 0.4165069887 0.3023789156
-0.0063799671 0.4338444979 0.3046680420
-0.0063799671 0.4338444979 0.3046680420
-0.2225284358 0.4325228890 0.3487766819
-0.4963576772 0.4275321675 -0.0082903056
-0.4519588718 0.4293648302 0.1770416807
0.4600690775 0.4340328043 -0.1221935170
0.4878471197 0.4367252541 0.1862407153
0.0144901727 0.4295531365 -0.2498198784
-0.1158593461 0.4280372788 -0.3127282360
-0.3623658356 0.4261066758 -0.3151410975
-0.1158593461 0.4280372788 -0.3127282360
0.1306471435 0.4299678818 -0.3103153744
0.3771536331 0.4318984848 -0.3079025129
0.0144901727 0.4295531365 -0.2498198784
0.1448396915 0.4310689943 -0.1869115208
-0.3481732876 0.4272077883 -0.1917372438
-0.4501377104 0.4278941555 -0.0078378941
-0.4785228064 0.4256919306 -0.2546456014
-0.3481732876 0.4272077883 -0.1917372438
-0.2178237688 0.4287236460 -0.1288288862
-0.0874742501 0.4302395038 -0.0659205286
-0.3197881916 0.4294100132 0.0550704635
-0.2178237688 0.4287236460 -0.1288288862
0.0003094291 -0.4289422490 0.3115972071
-0.2157421098 -0.3844108080 0.3091147480
0.4283510877 0.0058296797 0.3123551323
0.4731376125 0.1910745421 0.3113227227
-0.4960482481 -0.0014100815 0.3033069015
-0.4512617234 0.1838347809 0.3022744920
0.4899777101 0.0063123305 0.3129583476
0.4880889778 0.1915628735 0.3576934202
-0.2163168537 -0.3686362331 0.3552109066
-0.0007754387 -0.3668243993 0.3727287917
-0.0059021531 0.3722168731 0.3051629824
0.2093357350 0.3742738194 0.3534941299
-0.4344216257 -0.0009274308 0.3039101169
-0.4363103581 0.1843231122 0.3486451895
0.4293292394 -0.1786855259 0.3600598470
0.4277440339 0.0063199046 0.3739816572
-0.0065092069 0.3727070980 0.3667895073
0.2088256110 0.4206170942 0.3685295559
0.4756363498 -0.2090147940 0.3761663600
0.4893706563 0.0068025554 0.3745848726
-0.0007754387 -0.3668243993 0.3727287917
-0.2161102566 -0.4147343955 0.3709887431
-0.4487629861 -0.2162545553 0.3671181292
-0.4350286795 -0.0004372059 0.3655366418
-0.4950700964 -0.1859252872 0.3510116163
-0.4966553019 -0.0009198566 0.3649334264
0.2155473171 -0.4268853027 0.3599283547
-0.0002976247 -0.4284520241 0.3732237320
0.4963576772 -0.4275321675 0.0082903056
0.4483165490 -0.4264234808 0.1927174688
-0.4576408623 -0.4359937038 -0.1243125827
-0.4914894425 -0.4337839047 0.1835184342
0.3672222660 -0.4300284750 -0.1778711018
0.4501377104 -0.4278941555 0.0078378941
0.4833792368 -0.4296137297 -0.2383665979
0.3672222660 -0.4300284750 -0.1778711018
0.2510652952 -0.4304432202 -0.1173756057
0.1349083245 -0.4308579655 -0.0568801097
0.3339807396 -0.4283089008 0.0683333902
0.2510652952 -0.4304432202 -0.1173756057
0.0187513537 -0.4312727108 0.0036153864
-0.0974056171 -0.4316874560 0.0641108825
-0.3130987955 -0.4333767336 0.0619996286
-0.0974056171 -0.4316874560 0.0641108825
0.1182875613 -0.4299981784 0.0662221363
0.3339807396 -0.4283089008 0.0683333902
0.0187513537 -0.4312727108 0.0036153864
0.1349083245 -0.4308579655 -0.0568801097
0.4896682811 0.4352545794 0.0013611405
0.4882054802 0.3905045355 0.1866119205
0.4973328778 -0.3976988049 -0.1152102144
0.4945365158 -0.4260614928 0.1931698804
0.4955606478 -0.0135065998 -0.2415566415
0.4952718004 0.1015549718 -0.3041111796
0.4935994513 0.3172516585 -0.3058434709
0.4952718004 0.1015549718 -0.3041111796
0.4969441494 -0.1141417149 -0.3023788883
0.4986164984 -0.3298384017 -0.3006465971
0.4955606478 -0.0135065998 -0.2415566415
0.4958494953 -0.1285681713 -0.1790021034
0.4925047972 0.3028252021 -0.1824666860
0.4900266416 0.3890338608 0.0017323458
0.4922159498 0.4178867737 -0.2450212241
0.4925047972 0.3028252021 -0.1824666860
0.4927936447 0.1877636305 -0.1199121479
0.4930824922 0.0727020590 -0.0573576098
0.4903154890 0.2739722893 0.0642868839
0.4927936447 0.1877636305 -0.1199121479
-0.4896682811 -0.4352545794 -0.0013611405
-0.4918478030 -0.3875631862 0.1831472290
-0.4949046626 0.3957379053 -0.1312958853
-0.4981788386 0.4290028421 0.1765892691
-0.4900765820 -0.3047861017 -0.0640394137
-0.4915100241 -0.1199032273 -0.0655242348
-0.4914101431 -0.2883987457 0.0590899010
-0.4900765820 -0.3047861017 -0.0640394137
-0.4887430209 -0.3211734577 -0.1871687284
-0.4874094598 -0.3375608136 -0.3102980432
-0.4901764630 -0.1362905833 -0.1886535495
-0.4887430209 -0.3211734577 -0.1871687284
-0.4942770272 0.0813670030 0.0561202588
-0.4929434661 0.0649796470 -0.0670090559
-0.4957104692 0.2662498773 0.0546354378
-0.4942770272 0.0813670030 0.0561202588
-0.4928435852 -0.1035158714 0.0576050799
-0.4914101431 -0.2883987457 0.0590899010
-0.4915100241 -0.1199032273 -0.0655242348
-0.4928435852 -0.1035158714 0.0576050799
0.3183903053 0.3679288226 -0.2540406449
0.2119211683 0.3668183538 -0.2319669369
-0.2066530266 0.3635401415 -0.2360640363
0.2119211683 0.3668183538 -0.2319669369
-0.2064434026 -0.3730790772 -0.3226569406
0.2249429541 -0.3697005220 -0.3184344330
-0.3101791384 -0.3719477684 -0.2543468368
-0.2009622648 -0.3704444804 -0.2301692996
-0.4264225716 0.1780313097 -0.3292078085
-0.4235556876 -0.1917344390 -0.3262381663
-0.4230069361 0.2696752567 -0.2605622144
-0.4209127629 0.1769679896 -0.2366904690
0.4280222303 -0.2746437675 -0.2478491947
0.4254799210 -0.1824932461 -0.2254936225
0.4226417078 0.1835745856 -0.2284335662
0.4254799210 -0.1824932461 -0.2254936225
-0.2395194687 -0.4362653258 -0.3687074285
0.0375614251 -0.4032795850 -0.3662404294
-0.4277440339 -0.0063199046 -0.3739816572
-0.4721721982 -0.2377854856 -0.3725780423
0.0007754387 0.3668243993 -0.3727287917
-0.2614960669 0.4109938522 -0.3756636623
0.4830404489 -0.2303043990 -0.3632282039
0.4350286795 0.0004372059 -0.3655366418
-0.2201325305 0.4152776394 0.1178009485
0.2112538262 0.4186561947 0.1220234562
-0.2201325305 0.4152776394 0.1178009485
-0.3279193930 0.4067295475 0.1168071892
0.2177043153 -0.4133167398 0.1287051511
0.3254911778 -0.4047686479 0.1296989105
-0.2139209484 -0.3858814827 0.1242351733
0.2174654083 -0.3825029274 0.1284576809
-0.0963211634 0.0330311856 0.3686068562
-0.1881638295 -0.0447273215 0.3683207086
-0.1893583645 0.1093417405 0.3670833577
-0.0963211634 0.0330311856 0.3686068562
-0.0032839623 -0.0432793692 0.3701303548
0.0897532388 -0.1195899241 0.3716538533
-0.0951266284 -0.1210378763 0.3698442071
-0.0032839623 -0.0432793692 0.3701303548
-0.2172303854 -0.1535523275 0.2764454592
-0.2029957412 -0.0606225590 0.3220737462
-0.2041902762 0.0934465029 0.3208363953
-0.2029957412 -0.0606225590 0.3220737462
-0.2200972695 0.2162134211 0.2734758170
-0.1125865172 0.2020188224 0.3208750727
0.0722933500 0.2034667747 0.3226847189
-0.0975156984 0.1871002476 0.3673695053
0.1975773043 -0.0574853291 0.3259946462
0.1963827693 0.0965837328 0.3247572953
0.1975773043 -0.0574853291 0.3259946462
0.2141559713 -0.1501737723 0.2806679669
-0.2494027325 0.1382022274 0.1813530974
-0.2940374938 -0.0471651912 0.1669788757
-0.2957098428 0.1685314955 0.1652465844
-0.3428531277 0.3067091070 0.1482739259
0.1195208273 0.2489464753 0.1841062441
-0.0808528390 0.2780691165 0.1664916926
0.1732262630 0.3260969351 0.1454988040
0.3350397186 0.3120182652 0.1549092951
0.3381455097 -0.0885612958 0.1581264074
0.3607938340 -0.0191105020 0.1500924897
0.3820087164 0.2352231661 0.1405737508
0.4294555281 0.0968004422 0.1267331470
0.3388622307 -0.1810027330 0.1588688180
0.4308889702 -0.0880824321 0.1282179681
0.4323224122 -0.2729653065 0.1297027892
0.3388622307 -0.1810027330 0.1588688180
-0.1226207162 -0.2770640508 0.1550871132
0.0080807944 -0.2528667805 0.1638866588
0.2630557977 -0.3203907584 0.1438217834
0.1094993656 -0.3679406601 0.1272783189
-0.2304673054 -0.2779086896 0.1540314862
-0.1061938127 -0.3696299377 0.1251670651
-0.3218869911 -0.3713192153 0.1230558113
-0.2304673054 -0.2779086896 0.1540314862
0.2402459760 0.4203681947 0.3072046387
0.3635589475 0.4136300431 0.3084729370
-0.2525280961 0.3856931763 0.3026263858
0.2404848830 0.3895543823 0.3074521088
0.2088579209 0.4359014442 0.3529991896
-0.2225284358 0.4325228890 0.3487766819
0.2088579209 0.4359014442 0.3529991896
0.3167803919 0.4366848049 0.3463515009
0.0701404429 0.4317214088 -0.0335615267
0.1696766505 0.4329959411 0.0290452232
0.0535196797 0.4325811959 0.0895407192
0.0701404429 0.4317214088 -0.0335615267
0.2692128581 0.4342704735 0.0916519731
0.3189809619 0.4349077397 0.1229553480
0.1032877835 0.4332184620 0.1208440942
0.1696766505 0.4329959411 0.0290452232
-0.1621734987 0.4308919182 0.0874294654
-0.1124053949 0.4315291844 0.1187328404
-0.3280985732 0.4298399068 0.1166215865
-0.2617097062 0.4296173859 0.0248227155
-0.0460165279 0.4313066635 0.0269339693
-0.1455527355 0.4300321311 -0.0356727806
-0.0293957647 0.4304468764 -0.0961682767
-0.0460165279 0.4313066635 0.0269339693
0.2858336213 0.4334106864 -0.0314502729
0.3024543845 0.4325508993 -0.1545525189
0.3853698289 0.4346852187 0.0311564770
0.2858336213 0.4334106864 -0.0314502729
0.1862974137 0.4321361540 -0.0940570228
0.0867612061 0.4308616217 -0.1566637727
0.2029181769 0.4312763669 -0.2171592688
0.1862974137 0.4321361540 -0.0940570228
0.4186113553 0.4329656445 -0.2150480150
0.3190751477 0.4316911122 -0.2776547649
0.4352321185 0.4321058574 -0.3381502609
0.4186113553 0.4329656445 -0.2150480150
0.4019905921 0.4338254316 -0.0919457690
0.3853698289 0.4346852187 0.0311564770
0.3024543845 0.4325508993 -0.1545525189
0.4019905921 0.4338254316 -0.0919457690
0.2156442469 -0.3810322528 0.3133372557
-0.2157421098 -0.3844108080 0.3091147480
0.2156442469 -0.3810322528 0.3133372557
0.3235505629 -0.3878910670 0.3144547502
0.2150695031 -0.3652576779 0.3594334143
0.3229919740 -0.3644743172 0.3527857256
-0.2160133268 -0.3688813456 0.3243976441
0.2153730300 -0.3655027903 0.3286201518
-0.2220506218 0.3708952642 0.3492716222
0.2093357350 0.3742738194 0.3534941299
-0.2220506218 0.3708952642 0.3492716222
-0.3298213292 0.3699893473 0.3405126797
-0.2225607457 0.4172385390 0.3643070482
0.2088256110 0.4206170942 0.3685295559
-0.2225607457 0.4172385390 0.3643070482
-0.3303476082 0.4086904471 0.3633132888
0.4722916517 0.2223785794 0.3727017774
0.4637521494 0.3301665914 0.3717602299
0.4448230386 -0.2092561194 0.3758647523
0.4414783405 0.2221372540 0.3724001697
0.2152761001 -0.4113558403 0.3752112508
-0.2161102566 -0.4147343955 0.3709887431
0.2152761001 -0.4113558403 0.3752112508
0.3230629626 -0.4028077483 0.3762050102
-0.4521076842 0.2151388182 0.3636535467
-0.4606471865 0.3229268302 0.3627119991
-0.4795762973 -0.2164958807 0.3668165215
-0.4829209954 0.2148974928 0.3633519390
-0.2158390396 -0.4302638579 0.3557058470
-0.3236097471 -0.4311697748 0.3469469044
0.2158508440 -0.4271304151 0.3291150922
-0.2155355127 -0.4305089704 0.3248925845
-0.2621165841 -0.4337199172 -0.0299500462
-0.2763091321 -0.4348210297 -0.1533538999
-0.3782735549 -0.4341346625 0.0305454498
-0.2621165841 -0.4337199172 -0.0299500462
-0.1459596133 -0.4333051720 -0.0904455423
-0.0298026425 -0.4328904267 -0.1509410384
-0.1601521613 -0.4344062845 -0.2138493960
-0.1459596133 -0.4333051720 -0.0904455423
-0.4066586509 -0.4363368875 -0.2162622575
-0.2905016801 -0.4359221422 -0.2767577536
-0.4208511989 -0.4374379999 -0.3396661112
-0.4066586509 -0.4363368875 -0.2162622575
-0.3924661029 -0.4352357750 -0.0928584039
-0.3782735549 -0.4341346625 0.0305454498
-0.2763091321 -0.4348210297 -0.1533538999
-0.3924661029 -0.4352357750 -0.0928584039
0.0863543283 -0.4324756815 -0.2114365345
0.2025112990 -0.4320609362 -0.2719320305
0.0721617803 -0.4335767939 -0.3348403881
0.0863543283 -0.4324756815 -0.2114365345
0.3186682698 -0.4316461909 -0.3324275266
0.3767467552 -0.4314388183 -0.3626752746
0.1302402657 -0.4333694213 -0.3650881362
0.2025112990 -0.4320609362 -0.2719320305
-0.1743447093 -0.4355073969 -0.3372532497
-0.1162662239 -0.4353000243 -0.3675009977
-0.3627727135 -0.4372306273 -0.3699138592
-0.2905016801 -0.4359221422 -0.2767577536
-0.0439951905 -0.4339915392 -0.2743448921
-0.1601521613 -0.4344062845 -0.2138493960
-0.0298026425 -0.4328904267 -0.1509410384
-0.0439951905 -0.4339915392 -0.2743448921
-0.4944713914 0.2231455479 -0.0374640781
-0.4933767373 0.2375720043 -0.1608408630
-0.4958548930 0.3237806631 0.0233581687
-0.4944713914 0.2231455479 -0.0374640781
-0.4930878898 0.1225104328 -0.0982863249
-0.4917043883 0.0218753176 -0.1591085718
-0.4919932357 0.1369368892 -0.2216631099
-0.4930878898 0.1225104328 -0.0982863249
-0.4936655848 0.3526335759 -0.2233954011
-0.4922820832 0.2519984607 -0.2842176480
-0.4925709307 0.3670600323 -0.3467721861
-0.4936655848 0.3526335759 -0.2233954011
-0.4947602389 0.3382071195 -0.1000186162
-0.4958548930 0.3237806631 0.0233581687
-0.4933767373 0.2375720043 -0.1608408630
-0.4947602389 0.3382071195 -0.1000186162
-0.4903208867 -0.0787597975 -0.2199308186
-0.4889373851 -0.1793949127 -0.2807530654
-0.4892262326 -0.0643333411 -0.3433076035
-0.4903208867 -0.0787597975 -0.2199308186
-0.4875538836 -0.2800300279 -0.3415753122
-0.4868621328 -0.3303475854 -0.3719864356
-0.4885344818 -0.1146508987 -0.3737187269
-0.4889373851 -0.1793949127 -0.2807530654
-0.4908985816 0.1513633456 -0.3450398948
-0.4902068309 0.1010457880 -0.3754510182
-0.4918791799 0.3167424747 -0.3771833095
-0.4922820832 0.2519984607 -0.2842176480
-0.4906097342 0.0363017740 -0.2824853567
-0.4919932357 0.1369368892 -0.2216631099
-0.4917043883 0.0218753176 -0.1591085718
-0.4906097342 0.0363017740 -0.2824853567
-0.3158770680 0.3629613327 -0.2602489981
-0.1029387939 0.3651822704 -0.3043964140
-0.4251011093 0.3623825239 -0.2844339599
-0.3213868766 0.3640246528 -0.3527663376
0.1099994801 0.3674032081 -0.3485438299
0.2164686171 0.3685136769 -0.3706175378
-0.2149177396 0.3651351217 -0.3748400455
-0.1029387939 0.3651822704 -0.3043964140
0.1111356254 -0.3673522577 -0.2040059170
0.2139464182 -0.3658991412 -0.1798910840
-0.2046277768 -0.3691773534 -0.1839881833
-0.0944859600 -0.3702584908 -0.2522355830
0.3240882349 -0.3669802785 -0.2481384836
0.1184666494 -0.3698865116 -0.2963681496
0.4305645396 -0.3667942889 -0.2702047670
0.3314192589 -0.3695145324 -0.3405007163
-0.4174138186 -0.0969242350 -0.2113636010
-0.4153339808 -0.1877825437 -0.1875067048
-0.4181721940 0.1782852880 -0.1904466485
-0.4215734941 0.0847923824 -0.2590773933
-0.4187352809 -0.2812754493 -0.2561374497
-0.4228949564 -0.0995588319 -0.3038512420
-0.4193960120 -0.3734510564 -0.2785243740
-0.4242164187 -0.2839100461 -0.3486250907
0.4237505751 0.2763069385 -0.2522739595
0.4288351937 0.0920058957 -0.2969851040
0.4248594423 0.3690392914 -0.2761143528
0.4310529282 0.2774706016 -0.3446658907
0.4339198123 -0.0922951471 -0.3416962485
0.4364621216 -0.1844456685 -0.3640518207
0.4335952375 0.1853200802 -0.3670214629
0.4288351937 0.0920058957 -0.2969851040
0.2222023852 -0.3710178204 -0.3646782535
-0.1936578624 -0.3896826192 -0.3686262222
0.2377284943 -0.3863040639 -0.3644037145
0.3843903563 -0.4236750339 -0.3626617403
-0.4918791799 0.3167424747 -0.3771833095
-0.4599907872 0.1783216443 -0.3757680860
-0.4876983073 -0.2224992421 -0.3728525813
-0.4444646781 0.1630354008 -0.3754935470
0.3700573591 0.4313479286 -0.3696044397
0.2162297101 0.3993274893 -0.3708650080
-0.2462088648 0.4265214211 -0.3756365936
0.2009425080 0.3837999204 -0.3708920768
0.4491213466 0.1700338367 -0.3667469240
0.4983276510 -0.2147768301 -0.3632011351
0.4644085487 0.1855614056 -0.3667198552
0.4941467784 0.3244648867 -0.3675318633
0.2114927332 0.3878423823 0.1222709264
-0.2198936235 0.3844638270 0.1180484187
0.2114927332 0.3878423823 0.1222709264
0.3192795956 0.3963904742 0.1232646858
-0.2139209484 -0.3858814827 0.1242351733
-0.3217078108 -0.3944295746 0.1232414139
0.2177043153 -0.4133167398 0.1287051511
-0.2136820414 -0.4166952951 0.1244826434
0.0885587038 0.0344791379 0.3704165024
0.1804013699 0.1122376450 0.3707026500
0.1815959049 -0.0418314170 0.3719400009
0.0885587038 0.0344791379 0.3704165024
-0.0044784973 0.1107896927 0.3688930039
-0.0975156984 0.1871002476 0.3673695053
0.0873641688 0.1885481998 0.3691791515
-0.0044784973 0.1107896927 0.3688930039
-0.0951266284 -0.1210378763 0.3698442071
0.0749213271 -0.1354851616 0.3254068909
-0.1099585401 -0.1369331139 0.3235972447
-0.2172303854 -0.1535523275 0.2764454592
-0.2192610950 0.1083650778 0.2743419626
-0.2477303834 -0.0774944593 0.1830853887
-0.2200972695 0.2162134211 0.2734758170
-0.2494027325 0.1382022274 0.1813530974
0.2436102466 0.1420634334 0.1861788205
0.2112890872 0.2195919764 0.2776983247
0.2452825957 -0.0736332533 0.1879111117
0.2121252618 0.1117436330 0.2785644703
-0.3390306156 -0.1863118912 0.1522334488
-0.4304503013 -0.2797224169 0.1212577738
-0.4318837433 -0.0948395426 0.1197729527
-0.3390306156 -0.1863118912 0.1522334488
-0.4333171854 0.0900433317 0.1182881316
-0.3883240635 0.2291900317 0.1330335585
-0.3633189791 -0.0247816483 0.1430047089
-0.3397473366 -0.0938704540 0.1514910382
-0.2813136489 0.3378830139 0.1332230398
-0.3276207592 0.3682122820 0.1171165269
-0.1119275808 0.3699015596 0.1192277807
-0.2350065385 0.3075537458 0.1493295528
0.1037655975 0.3715908373 0.1213390346
0.2579192971 0.3421062080 0.1385011744
0.0038401950 0.2940783894 0.1594940631
-0.1271599493 0.3083983846 0.1503851797
0.3350397186 0.3120182652 0.1549092951
0.2897430699 0.1731166777 0.1709771306
0.2914154189 -0.0425800091 0.1727094219
0.2436102466 0.1420634334 0.1861788205
-0.2525280961 0.3856931763 0.3026263858
-0.3758410677 0.3924313279 0.3013580875
0.2402459760 0.4203681947 0.3072046387
-0.2527670031 0.4165069887 0.3023789156
-0.2222249089 0.4322777765 0.3179634194
0.2091614478 0.4356563318 0.3221859271
-0.2222249089 0.4322777765 0.3179634194
-0.3301473798 0.4314944158 0.3246111081
0.4564267547 0.4369741536 0.2475656325
-0.4655443660 0.4277734928 -0.0079886979
-0.0506845867 0.4287952077 -0.2812740572
-0.0364920387 0.4298963202 -0.1578702035
-0.1668415575 0.4283804624 -0.2207785611
-0.0506845867 0.4287952077 -0.2812740572
-0.2971910762 0.4268646047 -0.2836869187
-0.3694621096 0.4255561196 -0.3768430243
-0.1229556201 0.4274867226 -0.3744301628
-0.1810341055 0.4272793499 -0.3441824148
0.1958219029 0.4307258107 -0.2788611956
0.1235508695 0.4294173256 -0.3720173013
0.3700573591 0.4313479286 -0.3696044397
0.3119788737 0.4311405559 -0.3393566917
0.0796649321 0.4303110654 -0.2183656996
0.0654723841 0.4292099529 -0.3417695532
0.1958219029 0.4307258107 -0.2788611956
0.0796649321 0.4303110654 -0.2183656996
-0.3991554990 0.4275509719 -0.0997875690
-0.2829985282 0.4279657172 -0.1602830650
-0.3849629510 0.4286520844 0.0236162847
-0.3991554990 0.4275509719 -0.0997875690
-0.4133480470 0.4264498594 -0.2231914226
-0.4275405950 0.4253487469 -0.3465952763
-0.2971910762 0.4268646047 -0.2836869187
-0.4133480470 0.4264498594 -0.2231914226
-0.1526490095 0.4294815749 -0.0973747074
-0.1668415575 0.4283804624 -0.2207785611
-0.0364920387 0.4298963202 -0.1578702035
-0.1526490095 0.4294815749 -0.0973747074
-0.2688059802 0.4290668296 -0.0368792113
-0.3849629510 0.4286520844 0.0236162847
-0.2829985282 0.4279657172 -0.1602830650
-0.2688059802 0.4290668296 -0.0368792113
-0.2155032028 -0.4152246204 0.3093622182
0.2158831539 -0.4118460652 0.3135847259
-0.2155032028 -0.4152246204 0.3093622182
-0.3234095187 -0.4083658061 0.3082447237
-0.2160133268 -0.3688813456 0.3243976441
-0.3239357977 -0.3696647063 0.3310453328
0.2150695031 -0.3652576779 0.3594334143
-0.2163168537 -0.3686362331 0.3552109066
0.2096392619 0.3740287070 0.3226808675
-0.2217470949 0.3706501517 0.3184583598
0.2096392619 0.3740287070 0.3226808675
0.3174099693 0.3749346239 0.3314398100
0.2090645180 0.3898032818 0.3687770261
-0.2223218387 0.3864247266 0.3645545184
0.2090645180 0.3898032818 0.3687770261
0.3168513804 0.3983513738 0.3697707854
0.4448230386 -0.2092561194 0.3758647523
0.4533625409 -0.3170441314 0.3768062999
0.4722916517 0.2223785794 0.3727017774
0.4756363498 -0.2090147940 0.3761663600
-0.2163491636 -0.3839205831 0.3707412729
0.2150371931 -0.3805420279 0.3749637806
-0.2163491636 -0.3839205831 0.3707412729
-0.3241360260 -0.3924686750 0.3697475136
-0.4795762973 -0.2164958807 0.3668165215
-0.4710367950 -0.3242838927 0.3677580691
-0.4521076842 0.2151388182 0.3636535467
-0.4487629861 -0.2162545553 0.3671181292
0.2158508440 -0.4271304151 0.3291150922
0.3236215515 -0.4262244982 0.3378740347
-0.2158390396 -0.4302638579 0.3557058470
0.2155473171 -0.4268853027 0.3599283547
-0.4612831851 -0.4330523545 0.2454465668
0.4655443660 -0.4277734928 0.0079886979
0.4086799882 -0.4289613152 -0.0850166039
0.3091437806 -0.4302358476 -0.1476233538
0.3920592250 -0.4281015281 0.0380856421
0.4086799882 -0.4289613152 -0.0850166039
0.4253007514 -0.4298211023 -0.2081188499
0.4419215146 -0.4306808894 -0.3312210958
0.3257645438 -0.4310956347 -0.2707255998
0.4253007514 -0.4298211023 -0.2081188499
0.1929868098 -0.4306505929 -0.0871278577
0.2096075730 -0.4315103800 -0.2102301037
0.0934506023 -0.4319251252 -0.1497346076
0.1929868098 -0.4306505929 -0.0871278577
0.2925230174 -0.4293760605 -0.0245211078
0.3920592250 -0.4281015281 0.0380856421
0.3091437806 -0.4302358476 -0.1476233538
0.2925230174 -0.4293760605 -0.0245211078
-0.0393271317 -0.4314800834 0.0338631344
-0.0227063685 -0.4323398705 -0.0892391116
-0.1388633393 -0.4327546157 -0.0287436155
-0.0393271317 -0.4314800834 0.0338631344
-0.2550203101 -0.4331693610 0.0317518806
-0.3214091771 -0.4329468401 0.1235507516
-0.1057159987 -0.4312575625 0.1256620055
-0.1554841025 -0.4318948286 0.0943586305
0.1763660466 -0.4297908058 0.0359743883
0.1099771797 -0.4295682848 0.1277732593
0.3256703580 -0.4278790072 0.1298845131
0.2759022542 -0.4285162734 0.0985811382
0.0768298391 -0.4310653381 -0.0266323616
0.0602090759 -0.4302055510 0.0964698843
0.1763660466 -0.4297908058 0.0359743883
0.0768298391 -0.4310653381 -0.0266323616
0.4936905550 -0.3947574555 0.2545489351
0.4899071881 0.4044407670 0.0016086107
0.4954162241 0.0440241860 -0.2728339106
0.4943215700 0.0295977296 -0.1494571256
0.4940327225 0.1446593012 -0.2120116637
0.4954162241 0.0440241860 -0.2728339106
0.4937438751 0.2597208727 -0.2745662018
0.4941467784 0.3244648867 -0.3675318633
0.4958191274 0.1087682000 -0.3657995721
0.4951273766 0.1590857576 -0.3353884486
0.4970885731 -0.1716725007 -0.2711016193
0.4974914764 -0.1069284867 -0.3640672808
0.4991638255 -0.3226251735 -0.3623349895
0.4984720747 -0.2723076159 -0.3319238661
0.4957050716 -0.0710373856 -0.2102793725
0.4967997257 -0.0566109292 -0.3336561574
0.4970885731 -0.1716725007 -0.2711016193
0.4957050716 -0.0710373856 -0.2102793725
0.4912657194 0.3459295315 -0.0903671701
0.4926492210 0.2452944163 -0.1511894169
0.4901710653 0.3315030751 0.0330096148
0.4912657194 0.3459295315 -0.0903671701
0.4923603735 0.3603559879 -0.2137439550
0.4934550276 0.3747824443 -0.3371207399
0.4937438751 0.2597208727 -0.2745662018
0.4923603735 0.3603559879 -0.2137439550
0.4929380684 0.1302328448 -0.0886348788
0.4940327225 0.1446593012 -0.2120116637
0.4943215700 0.0295977296 -0.1494571256
0.4929380684 0.1302328448 -0.0886348788
0.4915545669 0.2308679599 -0.0278126320
0.4901710653 0.3315030751 0.0330096148
0.4926492210 0.2452944163 -0.1511894169
0.4915545669 0.2308679599 -0.0278126320
-0.4985469854 0.3986792546 0.2384632642
-0.4899071881 -0.4044407670 -0.0016086107
0.3256926585 0.3690924857 -0.3464325760
0.4248594423 0.3690392914 -0.2761143528
0.1127543844 0.3668715480 -0.3022851601
0.3183903053 0.3679288226 -0.2540406449
-0.1001838896 0.3646506103 -0.2581377442
-0.2103042032 0.3629583100 -0.1898680707
0.2082699917 0.3662365222 -0.1857709714
0.1054520313 0.3657078849 -0.2098932290
-0.0972265290 -0.3715757892 -0.2984794035
-0.2091839715 -0.3743963757 -0.3689007611
0.2222023852 -0.3710178204 -0.3646782535
0.1157260805 -0.3712038100 -0.3426119701
-0.3156602762 -0.3745823652 -0.3468344778
-0.4193960120 -0.3734510564 -0.2785243740
-0.0972265290 -0.3715757892 -0.2984794035
-0.3101791384 -0.3719477684 -0.2543468368
-0.4243283984 0.0853240425 -0.3053360631
-0.4291774760 0.1785629697 -0.3754664783
-0.4263105919 -0.1912027789 -0.3724968361
-0.4256498608 -0.0990271718 -0.3501099118
-0.4285167448 0.2707385769 -0.3530795539
-0.4251011093 0.3623825239 -0.2844339599
-0.4243283984 0.0853240425 -0.3053360631
-0.4230069361 0.2696752567 -0.2605622144
0.4353532543 -0.2771780214 -0.3402114274
0.4305645396 -0.3667942889 -0.2702047670
0.4302686357 -0.0928769786 -0.2955002829
0.4280222303 -0.2746437675 -0.2478491947
0.4251840171 0.0914240642 -0.2507891384
0.4189761958 0.1848417125 -0.1822524498
0.4218144090 -0.1812261192 -0.1793125062
0.4229376117 -0.0903427247 -0.2031380502
-0.3627727135 -0.4372306273 -0.3699138592
-0.2089450645 -0.4052101880 -0.3686532910
0.2534935104 -0.4324041198 -0.3638817054
-0.1936578624 -0.3896826192 -0.3686262222
-0.2149177396 0.3651351217 -0.3748400455
0.2009425080 0.3837999204 -0.3708920768
-0.2304438487 0.3804213652 -0.3751145845
-0.3771057107 0.4177923351 -0.3768565587
3 72 26 113
3 28 66 26
3 86 119 66
3 121 40 119
3 126 41 40
3 127 120 41
3 120 85 118
3 85 29 65
3 29 71 27
3 123 28 72
3 130 86 28
3 90 121 86
3 135 126 121
3 93 127 126
3 94 134 127
3 134 89 120
3 89 131 85
3 131 122 29
3 43 130 123
3 136 90 130
3 115 135 90
3 117 93 135
3 55 94 93
3 56 116 94
3 116 114 134
3 114 137 89
3 137 42 131
3 83 136 43
3 75 115 136
3 79 117 115
3 78 55 117
3 81 56 55
3 84 77 56
3 77 76 116
3 76 80 114
3 80 82 137
3 111 14 83
3 14 39 75
3 39 37 79
3 37 95 78
3 95 84 81
3 96 77 84
3 36 76 77
3 38 80 76
3 15 82 80
3 35 18 111
3 18 64 14
3 64 62 39
3 62 57 37
3 57 96 95
3 58 36 96
3 61 38 36
3 63 15 38
3 19 110 15
3 74 124 35
3 124 70 18
3 70 33 64
3 33 24 62
3 24 58 57
3 25 61 58
3 32 63 61
3 69 19 63
3 125 34 19
3 31 97 74
3 97 68 124
3 68 21 70
3 21 87 33
3 87 25 24
3 88 32 25
3 20 69 32
3 67 125 69
3 98 73 125
3 26 72 28
3 66 28 86
3 119 86 121
3 40 121 126
3 41 126 127
3 41 120 118
3 118 85 65
3 65 29 27
3 27 71 112
3 28 123 130
3 86 130 90
3 121 90 135
3 126 135 93
3 127 93 94
3 127 134 120
3 120 89 85
3 85 131 29
3 29 122 71
3 130 43 136
3 90 136 115
3 135 115 117
3 93 117 55
3 94 55 56
3 94 116 134
3 134 114 89
3 89 137 131
3 131 42 122
3 136 83 75
3 115 75 79
3 117 79 78
3 55 78 81
3 56 81 84
3 56 77 116
3 116 76 114
3 114 80 137
3 137 82 42
3 83 14 75
3 75 39 79
3 79 37 78
3 78 95 81
3 84 95 96
3 77 96 36
3 76 36 38
3 80 38 15
3 82 15 110
3 111 18 14
3 14 64 39
3 39 62 37
3 37 57 95
3 96 57 58
3 36 58 61
3 38 61 63
3 15 63 19
3 110 19 34
3 35 124 18
3 18 70 64
3 64 33 62
3 62 24 57
3 58 24 25
3 61 25 32
3 63 32 69
3 19 69 125
3 34 125 73
3 74 97 124
3 124 68 70
3 70 21 33
3 33 87 24
3 25 87 88
3 32 88 20
3 69 20 67
3 125 67 98
3 73 98 30
3 107 400 152
3 148 400 107
3 152 401 138
3 148 401 152
3 10 402 153
3 52 402 10
3 153 403 44
3 52 403 153
3 404 714 154
3 4 714 404
3 404 715 142
3 154 715 404
3 405 716 4
3 154 716 405
3 10 717 4
3 405 717 10
3 406 718 145
3 155 718 406
3 138 719 145
3 406 719 138
3 407 720 155
3 0 720 407
3 407 721 138
3 155 721 407
3 408 722 157
3 156 722 408
3 408 723 92
3 157 723 408
3 409 724 157
3 91 724 409
3 409 725 156
3 157 725 409
3 410 726 158
3 156 726 410
3 410 727 60
3 158 727 410
3 411 728 158
3 92 728 411
3 411 729 156
3 158 729 411
3 160 412 16
3 159 412 160
3 160 413 60
3 16 413 160
3 161 414 159
3 132 414 161
3 161 415 60
3 159 415 161
3 416 730 92
3 132 730 416
3 416 731 162
3 92 731 416
3 417 732 162
3 91 732 417
3 417 733 92
3 162 733 417
3 418 734 91
3 133 734 418
3 418 735 163
3 91 735 418
3 419 736 163
3 59 736 419
3 163 737 419
3 91 737 163
3 420 738 164
3 60 738 420
3 420 739 59
3 164 739 420
3 421 740 60
3 164 740 421
3 421 741 16
3 60 741 421
3 165 742 133
3 166 742 165
3 166 743 132
3 165 743 166
3 167 744 133
3 165 744 167
3 167 745 10
3 133 745 167
3 168 746 17
3 422 746 168
3 422 747 133
3 168 747 422
3 17 748 168
3 423 748 17
3 423 749 148
3 17 749 423
3 424 750 169
3 16 750 424
3 170 751 169
3 424 751 170
3 425 752 170
3 148 752 425
3 170 753 425
3 169 753 170
3 426 754 171
3 16 754 426
3 426 755 169
3 171 755 426
3 427 756 171
3 138 756 427
3 427 757 16
3 171 757 427
3 174 758 172
3 132 758 174
3 172 759 174
3 173 759 172
3 175 760 173
3 138 760 175
3 173 761 175
3 172 761 173
3 177 762 176
3 132 762 177
3 177 763 172
3 176 763 177
3 178 764 176
3 0 764 178
3 178 765 132
3 176 765 178
3 10 6 13
3 148 144 142
3 107 151 148
3 10 54 52
3 428 766 104
3 179 766 428
3 109 767 104
3 428 767 109
3 429 768 179
3 54 768 429
3 429 769 109
3 179 769 429
3 430 770 180
3 143 770 430
3 430 771 5
3 180 771 430
3 431 772 143
3 180 772 431
3 144 773 143
3 431 773 144
3 432 774 184
3 181 774 432
3 432 775 183
3 184 775 432
3 433 776 184
3 182 776 433
3 433 777 181
3 184 777 433
3 183 778 434
3 185 778 183
3 434 779 142
3 185 779 434
3 435 780 185
3 182 780 435
3 185 781 435
3 183 781 185
3 186 782 436
3 187 782 186
3 436 783 182
3 187 783 436
3 437 784 187
3 4 784 437
3 187 785 437
3 186 785 187
3 438 786 188
3 182 786 438
3 438 787 186
3 188 787 438
3 439 788 188
3 181 788 439
3 439 789 182
3 188 789 439
3 440 790 191
3 190 790 440
3 440 791 189
3 191 791 440
3 441 792 191
3 142 792 441
3 441 793 190
3 191 793 441
3 442 794 192
3 190 794 442
3 442 795 181
3 192 795 442
3 443 796 192
3 189 796 443
3 443 797 190
3 192 797 443
3 444 798 194
3 193 798 444
3 444 799 189
3 194 799 444
3 445 800 194
3 103 800 445
3 445 801 193
3 194 801 445
3 446 802 195
3 193 802 446
3 446 803 142
3 195 803 446
3 447 804 195
3 189 804 447
3 447 805 193
3 195 805 447
3 0 46 3
3 138 101 99
3 448 806 196
3 141 806 448
3 448 807 3
3 196 807 448
3 449 808 141
3 196 808 449
3 147 809 141
3 449 809 147
3 7 3 9
3 145 141 138
3 197 450 101
3 109 450 197
3 101 451 197
3 141 451 101
3 198 452 3
3 13 452 198
3 3 453 198
3 46 453 3
3 199 454 100
3 108 454 199
3 100 455 199
3 101 455 100
3 456 810 139
3 200 810 456
3 141 811 139
3 456 811 141
3 457 812 200
3 3 812 457
3 457 813 141
3 200 813 457
3 458 814 201
3 11 814 458
3 458 815 149
3 201 815 458
3 459 816 11
3 201 816 459
3 13 817 11
3 459 817 13
3 202 460 1
3 11 460 202
3 1 461 202
3 3 461 1
3 149 462 203
3 151 462 149
3 203 463 141
3 151 463 203
3 464 818 204
3 5 818 464
3 464 819 143
3 204 819 464
3 465 820 5
3 204 820 465
3 11 821 5
3 465 821 11
3 466 822 102
3 205 822 466
3 143 823 102
3 466 823 143
3 467 824 205
3 146 824 467
3 467 825 143
3 205 825 467
3 468 826 206
3 146 826 468
3 468 827 8
3 206 827 468
3 469 828 146
3 206 828 469
3 139 829 146
3 469 829 139
3 470 830 5
3 207 830 470
3 47 831 5
3 470 831 47
3 471 832 207
3 50 832 471
3 471 833 47
3 207 833 471
3 53 472 208
3 54 472 53
3 208 473 46
3 54 473 208
3 474 834 8
3 209 834 474
3 9 835 8
3 474 835 9
3 475 836 209
3 147 836 475
3 475 837 9
3 209 837 475
3 476 838 213
3 212 838 476
3 476 839 211
3 213 839 476
3 477 840 213
3 7 840 477
3 477 841 212
3 213 841 477
3 478 842 214
3 212 842 478
3 478 843 210
3 214 843 478
3 479 844 214
3 211 844 479
3 479 845 212
3 214 845 479
3 480 846 216
3 215 846 480
3 480 847 211
3 216 847 480
3 481 848 216
3 51 848 481
3 481 849 215
3 216 849 481
3 482 850 217
3 215 850 482
3 482 851 7
3 217 851 482
3 483 852 217
3 211 852 483
3 483 853 215
3 217 853 483
3 484 854 220
3 210 854 484
3 484 855 219
3 220 855 484
3 485 856 220
3 218 856 485
3 485 857 210
3 220 857 485
3 219 858 486
3 221 858 219
3 486 859 106
3 221 859 486
3 487 860 221
3 218 860 487
3 221 861 487
3 219 861 221
3 222 862 488
3 223 862 222
3 488 863 218
3 223 863 488
3 489 864 223
3 51 864 489
3 223 865 489
3 222 865 223
3 490 866 224
3 218 866 490
3 490 867 222
3 224 867 490
3 491 868 224
3 210 868 491
3 491 869 218
3 224 869 491
3 228 492 227
3 226 492 228
3 228 493 225
3 227 493 228
3 229 494 227
3 99 494 229
3 229 495 226
3 227 495 229
3 231 496 230
3 226 496 231
3 231 497 107
3 230 497 231
3 232 498 230
3 225 498 232
3 232 499 226
3 230 499 232
3 235 500 234
3 233 500 235
3 235 501 225
3 234 501 235
3 236 502 234
3 106 502 236
3 236 503 233
3 234 503 236
3 238 504 237
3 233 504 238
3 238 505 99
3 237 505 238
3 239 506 237
3 225 506 239
3 239 507 233
3 237 507 239
3 508 870 243
3 242 870 508
3 508 871 241
3 243 871 508
3 509 872 243
3 52 872 509
3 509 873 242
3 243 873 509
3 510 874 244
3 242 874 510
3 510 875 240
3 244 875 510
3 511 876 244
3 241 876 511
3 511 877 242
3 244 877 511
3 512 878 246
3 245 878 512
3 512 879 241
3 246 879 512
3 513 880 246
3 48 880 513
3 513 881 245
3 246 881 513
3 514 882 247
3 245 882 514
3 514 883 52
3 247 883 514
3 515 884 247
3 241 884 515
3 515 885 245
3 247 885 515
3 516 886 250
3 240 886 516
3 516 887 249
3 250 887 516
3 517 888 250
3 248 888 517
3 517 889 240
3 250 889 517
3 249 890 518
3 251 890 249
3 518 891 51
3 251 891 518
3 519 892 251
3 248 892 519
3 251 893 519
3 249 893 251
3 252 894 520
3 253 894 252
3 520 895 248
3 253 895 520
3 521 896 253
3 48 896 521
3 253 897 521
3 252 897 253
3 522 898 254
3 248 898 522
3 522 899 252
3 254 899 522
3 523 900 254
3 240 900 523
3 523 901 248
3 254 901 523
3 524 902 256
3 23 902 524
3 524 903 255
3 256 903 524
3 525 904 12
3 23 904 525
3 525 905 256
3 12 905 525
3 255 906 526
3 257 906 255
3 526 907 150
3 257 907 526
3 527 908 257
3 12 908 527
3 257 909 527
3 255 909 257
3 258 910 528
3 259 910 258
3 528 911 128
3 259 911 528
3 529 912 259
3 22 912 529
3 259 913 529
3 258 913 259
3 530 914 260
3 128 914 530
3 530 915 258
3 260 915 530
3 531 916 140
3 128 916 531
3 531 917 260
3 140 917 531
3 261 918 532
3 262 918 261
3 532 919 22
3 262 919 532
3 533 920 262
3 23 920 533
3 262 921 533
3 261 921 262
3 534 922 263
3 22 922 534
3 534 923 261
3 263 923 534
3 535 924 2
3 22 924 535
3 535 925 263
3 2 925 535
3 536 926 265
3 129 926 536
3 536 927 264
3 265 927 536
3 537 928 150
3 129 928 537
3 537 929 265
3 150 929 537
3 264 930 538
3 266 930 264
3 538 931 140
3 266 931 538
3 539 932 266
3 150 932 539
3 266 933 539
3 264 933 266
3 267 934 140
3 540 934 267
3 540 935 2
3 267 935 540
3 541 936 140
3 267 936 541
3 140 937 541
3 106 937 140
3 12 938 48
3 542 938 12
3 542 939 268
3 12 939 542
3 543 940 268
3 51 940 543
3 268 941 543
3 12 941 268
3 150 942 103
3 544 942 150
3 544 943 269
3 150 943 544
3 545 944 269
3 48 944 545
3 269 945 545
3 150 945 269
3 270 946 150
3 546 946 270
3 546 947 106
3 270 947 546
3 547 948 150
3 270 948 547
3 150 949 547
3 103 949 150
3 138 548 271
3 99 548 138
3 271 549 107
3 99 549 271
3 44 550 272
3 0 550 44
3 272 551 10
3 0 551 272
3 552 950 273
3 148 950 552
3 552 951 10
3 273 951 552
3 553 952 148
3 273 952 553
3 142 953 148
3 553 953 142
3 554 954 0
3 274 954 554
3 7 955 0
3 554 955 7
3 555 956 274
3 145 956 555
3 555 957 7
3 274 957 555
3 556 958 276
3 275 958 556
3 556 959 59
3 276 959 556
3 557 960 276
3 60 960 557
3 557 961 275
3 276 961 557
3 558 962 277
3 275 962 558
3 558 963 91
3 277 963 558
3 559 964 277
3 59 964 559
3 559 965 275
3 277 965 559
3 278 966 92
3 560 966 278
3 560 967 60
3 278 967 560
3 561 968 92
3 278 968 561
3 561 969 132
3 92 969 561
3 280 970 279
3 91 970 280
3 280 971 132
3 279 971 280
3 281 972 133
3 91 972 281
3 281 973 279
3 133 973 281
3 283 562 282
3 59 562 283
3 283 563 133
3 282 563 283
3 284 564 17
3 59 564 284
3 284 565 282
3 17 565 284
3 286 974 17
3 285 974 286
3 286 975 59
3 17 975 286
3 287 976 285
3 16 976 287
3 287 977 59
3 285 977 287
3 566 978 289
3 132 978 566
3 566 979 0
3 289 979 566
3 567 980 289
3 288 980 567
3 567 981 132
3 289 981 567
3 290 982 288
3 568 982 290
3 568 983 10
3 290 983 568
3 290 984 569
3 288 984 290
3 569 985 132
3 288 985 569
3 133 986 570
3 292 986 133
3 570 987 10
3 292 987 570
3 571 988 292
3 291 988 571
3 571 989 133
3 292 989 571
3 293 990 291
3 572 990 293
3 572 991 148
3 293 991 572
3 291 992 293
3 573 992 291
3 573 993 133
3 291 993 573
3 295 994 17
3 148 994 295
3 295 995 294
3 17 995 295
3 296 996 294
3 16 996 296
3 294 997 296
3 17 997 294
3 298 574 16
3 138 574 298
3 298 575 297
3 16 575 298
3 299 576 297
3 132 576 299
3 297 577 299
3 16 577 297
3 6 10 4
3 144 148 151
3 151 107 109
3 54 10 13
3 578 998 54
3 300 998 578
3 49 999 54
3 578 999 49
3 579 1000 300
3 104 1000 579
3 579 1001 49
3 300 1001 579
3 580 1002 301
3 6 1002 580
3 580 1003 144
3 301 1003 580
3 581 1004 6
3 301 1004 581
3 5 1005 6
3 581 1005 5
3 302 582 47
3 48 582 302
3 47 583 302
3 5 583 47
3 143 1006 142
3 102 1006 143
3 4 1007 5
3 48 1007 4
3 303 584 142
3 103 584 303
3 142 585 303
3 102 585 142
3 586 1008 307
3 305 1008 586
3 586 1009 304
3 307 1009 586
3 587 1010 307
3 306 1010 587
3 587 1011 305
3 307 1011 587
3 308 1012 306
3 588 1012 308
3 588 1013 48
3 308 1013 588
3 589 1014 308
3 305 1014 589
3 306 1015 308
3 589 1015 306
3 310 1016 309
3 590 1016 310
3 590 1017 305
3 310 1017 590
3 591 1018 310
3 103 1018 591
3 309 1019 310
3 591 1019 309
3 592 1020 311
3 304 1020 592
3 592 1021 305
3 311 1021 592
3 593 1022 311
3 309 1022 593
3 593 1023 304
3 311 1023 593
3 594 1024 314
3 313 1024 594
3 594 1025 312
3 314 1025 594
3 595 1026 314
3 4 1026 595
3 595 1027 313
3 314 1027 595
3 596 1028 315
3 313 1028 596
3 596 1029 48
3 315 1029 596
3 597 1030 315
3 312 1030 597
3 597 1031 313
3 315 1031 597
3 598 1032 317
3 316 1032 598
3 598 1033 312
3 317 1033 598
3 599 1034 317
3 304 1034 599
3 599 1035 316
3 317 1035 599
3 600 1036 318
3 316 1036 600
3 600 1037 4
3 318 1037 600
3 601 1038 318
3 312 1038 601
3 601 1039 316
3 318 1039 601
3 46 0 44
3 101 138 141
3 602 1040 319
3 9 1040 602
3 602 1041 147
3 319 1041 602
3 603 1042 9
3 319 1042 603
3 3 1043 9
3 603 1043 3
3 3 7 0
3 141 145 147
3 320 604 151
3 141 604 320
3 151 605 320
3 109 605 151
3 321 606 54
3 46 606 321
3 54 607 321
3 13 607 54
3 322 608 109
3 101 608 322
3 109 609 322
3 108 609 109
3 610 1044 3
3 323 1044 610
3 1 1045 3
3 610 1045 1
3 611 1046 323
3 139 1046 611
3 611 1047 1
3 323 1047 611
3 612 1048 324
3 151 1048 612
3 612 1049 13
3 324 1049 612
3 613 1050 151
3 324 1050 613
3 149 1051 151
3 613 1051 149
3 325 614 13
3 3 614 325
3 13 615 325
3 11 615 13
3 141 616 326
3 139 616 141
3 326 617 149
3 139 617 326
3 618 1052 327
3 149 1052 618
3 618 1053 11
3 327 1053 618
3 619 1054 149
3 327 1054 619
3 143 1055 149
3 619 1055 143
3 620 1056 146
3 328 1056 620
3 105 1057 146
3 620 1057 105
3 621 1058 328
3 102 1058 621
3 621 1059 105
3 328 1059 621
3 622 1060 329
3 1 1060 622
3 622 1061 139
3 329 1061 622
3 623 1062 1
3 329 1062 623
3 8 1063 1
3 623 1063 8
3 624 1064 50
3 330 1064 624
3 8 1065 50
3 624 1065 8
3 625 1066 330
3 5 1066 625
3 625 1067 8
3 330 1067 625
3 46 626 331
3 45 626 46
3 331 627 53
3 45 627 331
3 628 1068 147
3 332 1068 628
3 146 1069 147
3 628 1069 146
3 629 1070 332
3 8 1070 629
3 629 1071 146
3 332 1071 629
3 333 630 105
3 106 630 333
3 105 631 333
3 146 631 105
3 8 1072 7
3 50 1072 8
3 145 1073 146
3 106 1073 145
3 334 632 7
3 51 632 334
3 7 633 334
3 50 633 7
3 634 1074 338
3 337 1074 634
3 634 1075 336
3 338 1075 634
3 635 1076 338
3 145 1076 635
3 635 1077 337
3 338 1077 635
3 636 1078 339
3 337 1078 636
3 636 1079 106
3 339 1079 636
3 637 1080 339
3 336 1080 637
3 637 1081 337
3 339 1081 637
3 638 1082 341
3 340 1082 638
3 638 1083 336
3 341 1083 638
3 639 1084 341
3 335 1084 639
3 639 1085 340
3 341 1085 639
3 640 1086 342
3 340 1086 640
3 640 1087 145
3 342 1087 640
3 641 1088 342
3 336 1088 641
3 641 1089 340
3 342 1089 641
3 642 1090 345
3 343 1090 642
3 642 1091 335
3 345 1091 642
3 643 1092 345
3 344 1092 643
3 643 1093 343
3 345 1093 643
3 346 1094 344
3 644 1094 346
3 644 1095 7
3 346 1095 644
3 645 1096 346
3 343 1096 645
3 344 1097 346
3 645 1097 344
3 348 1098 347
3 646 1098 348
3 646 1099 343
3 348 1099 646
3 647 1100 348
3 145 1100 647
3 347 1101 348
3 647 1101 347
3 648 1102 349
3 335 1102 648
3 648 1103 343
3 349 1103 648
3 649 1104 349
3 347 1104 649
3 649 1105 335
3 349 1105 649
3 350 650 102
3 103 650 350
3 102 651 350
3 108 651 102
3 100 1106 99
3 105 1106 100
3 107 1107 108
3 103 1107 107
3 351 652 99
3 106 652 351
3 99 653 351
3 105 653 99
3 654 1108 355
3 353 1108 654
3 654 1109 352
3 355 1109 654
3 655 1110 355
3 354 1110 655
3 655 1111 353
3 355 1111 655
3 356 1112 354
3 656 1112 356
3 656 1113 103
3 356 1113 656
3 657 1114 356
3 353 1114 657
3 354 1115 356
3 657 1115 354
3 358 1116 357
3 658 1116 358
3 658 1117 353
3 358 1117 658
3 659 1118 358
3 106 1118 659
3 357 1119 358
3 659 1119 357
3 660 1120 359
3 352 1120 660
3 660 1121 353
3 359 1121 660
3 661 1122 359
3 357 1122 661
3 661 1123 352
3 359 1123 661
3 662 1124 362
3 361 1124 662
3 662 1125 360
3 362 1125 662
3 663 1126 362
3 107 1126 663
3 663 1127 361
3 362 1127 663
3 664 1128 363
3 361 1128 664
3 664 1129 103
3 363 1129 664
3 665 1130 363
3 360 1130 665
3 665 1131 361
3 363 1131 665
3 666 1132 365
3 364 1132 666
3 666 1133 360
3 365 1133 666
3 667 1134 365
3 352 1134 667
3 667 1135 364
3 365 1135 667
3 668 1136 366
3 364 1136 668
3 668 1137 107
3 366 1137 668
3 669 1138 366
3 360 1138 669
3 669 1139 364
3 366 1139 669
3 367 670 50
3 51 670 367
3 50 671 367
3 45 671 50
3 53 1140 52
3 47 1140 53
3 44 1141 45
3 51 1141 44
3 368 672 52
3 48 672 368
3 52 673 368
3 47 673 52
3 372 674 371
3 370 674 372
3 372 675 369
3 371 675 372
3 373 676 371
3 44 676 373
3 373 677 370
3 371 677 373
3 375 678 374
3 370 678 375
3 375 679 51
3 374 679 375
3 376 680 374
3 369 680 376
3 376 681 370
3 374 681 376
3 379 682 378
3 377 682 379
3 379 683 369
3 378 683 379
3 380 684 378
3 52 684 380
3 380 685 377
3 378 685 380
3 382 686 381
3 377 686 382
3 382 687 44
3 381 687 382
3 383 688 381
3 369 688 383
3 383 689 377
3 381 689 383
3 690 1142 150
3 385 1142 690
3 690 1143 129
3 150 1143 690
3 691 1144 385
3 384 1144 691
3 691 1145 129
3 385 1145 691
3 386 1146 384
3 692 1146 386
3 692 1147 23
3 386 1147 692
3 693 1148 386
3 129 1148 693
3 384 1149 386
3 693 1149 384
3 388 1150 387
3 694 1150 388
3 694 1151 2
3 388 1151 694
3 695 1152 388
3 140 1152 695
3 387 1153 388
3 695 1153 387
3 696 1154 2
3 389 1154 696
3 696 1155 22
3 2 1155 696
3 697 1156 389
3 387 1156 697
3 697 1157 22
3 389 1157 697
3 391 1158 390
3 698 1158 391
3 698 1159 12
3 391 1159 698
3 699 1160 391
3 2 1160 699
3 390 1161 391
3 699 1161 390
3 700 1162 12
3 392 1162 700
3 700 1163 23
3 12 1163 700
3 701 1164 392
3 390 1164 701
3 701 1165 23
3 392 1165 701
3 702 1166 140
3 394 1166 702
3 702 1167 128
3 140 1167 702
3 703 1168 394
3 393 1168 703
3 703 1169 128
3 394 1169 703
3 395 1170 393
3 704 1170 395
3 704 1171 129
3 395 1171 704
3 705 1172 395
3 128 1172 705
3 393 1173 395
3 705 1173 393
3 2 1174 51
3 706 1174 2
3 706 1175 396
3 2 1175 706
3 707 1176 396
3 106 1176 707
3 396 1177 707
3 2 1177 396
3 397 708 2
3 12 708 397
3 2 709 397
3 51 709 2
3 398 1178 12
3 710 1178 398
3 710 1179 150
3 398 1179 710
3 711 1180 12
3 398 1180 711
3 12 1181 711
3 48 1181 12
3 140 712 106
3 399 712 140
3 399 713 150
3 140 713 399