OFF
1523 1543 0
0.0475807125 -0.3186082065 0.0183813178
0.0479502983 -0.3054964985 0.0620894825
0.0481082786 -0.2998790650 0.0808368137
0.0484778774 -0.2867674048 0.1245439690
-0.2304505922 -0.4790915459 -0.2286255571
-0.2237536676 -0.4005237372 -0.2336740438
-0.2193340474 -0.3379919141 -0.1834684564
0.0768093055 -0.3210680445 0.0188720775
0.0762817265 -0.3397971382 -0.0435824090
-0.3631470623 -0.2296684574 0.1566744103
-0.3658171345 -0.3244320935 -0.1592862286
-0.3644525766 -0.3294751065 -0.2658334959
-0.3556714028 -0.2049792922 -0.1648101393
-0.3597650948 -0.1898501864 0.1548330757
-0.3543068449 -0.2100223052 -0.2713574066
0.4434221109 -0.2016969381 -0.0746282698
0.4437632530 -0.2029577009 -0.1012652885
0.4911844283 0.4239692667 0.2167815981
0.4954486848 0.4082098033 -0.1161796216
0.4973249597 0.4012756318 -0.2626827198
0.4370738025 -0.2131130110 0.2462424861
0.4432143339 -0.2358066458 -0.2332218317
0.4889298203 0.3974241885 0.2180091343
0.4950703517 0.3747305537 -0.2614551835
0.4348191860 -0.2396581897 0.2474700270
0.4390834425 -0.2554176530 -0.0854911927
0.4409597174 -0.2623518245 -0.2319942909
0.4907688957 0.3557499040 -0.1004065398
0.4911100378 0.3544891412 -0.1270435585
0.0293133454 -0.3170708501 0.0180746014
0.0296829312 -0.3039591420 0.0617827661
0.0179904343 -0.5000000000 -0.2244541335
0.0246873588 -0.4214321913 -0.2295026202
0.0298409115 -0.2983417086 0.0805300973
0.0291069790 -0.3589003683 -0.1792970328
0.0302105102 -0.2852300484 0.1242372526
0.4702454840 -0.2484611861 -0.3123798706
0.4620581001 -0.2182029745 0.3269065594
0.4674272347 -0.2816424081 -0.3108454561
0.4592398508 -0.2513841964 0.3284409739
-0.4600008926 -0.1256661042 -0.0897971010
-0.4596597505 -0.1269268670 -0.1164341197
-0.4122385838 0.5000000000 0.2016127715
-0.4079743273 0.4842405367 -0.1313484482
-0.4060980524 0.4773063652 -0.2778515463
-0.4663492010 -0.1370821771 0.2310736549
-0.4602086696 -0.1597758119 -0.2483906630
-0.4144931832 0.4734550225 0.2028403031
-0.4083526518 0.4507613876 -0.2766240147
-0.4686038176 -0.1636273558 0.2323011957
-0.4643395611 -0.1793868191 -0.1006600239
-0.4624632861 -0.1863209906 -0.2471631221
-0.4126541078 0.4317807379 -0.1155753711
-0.4123129658 0.4305199751 -0.1422123898
0.0620364234 -0.3254572867 -0.0000932403
0.0616674300 -0.3385672192 -0.0438277889
-0.4863193266 -0.1679580110 -0.3284409739
-0.4945067104 -0.1376997994 0.3108454561
-0.4891375759 -0.2011392330 -0.3269065594
-0.4973249597 -0.1708810213 0.3123798706
-0.4334296367 -0.1279023044 -0.0893509591
-0.4330884946 -0.1291630672 -0.1159879778
-0.4091072908 0.1571424337 -0.1092059909
-0.4089367262 0.1565120762 -0.1225239956
-0.3856673279 0.4977637998 0.2020589135
-0.3814030714 0.4820043364 -0.1309023062
-0.3795267964 0.4750701649 -0.2774054044
-0.4397779451 -0.1393183773 0.2315197968
-0.4336374137 -0.1620120122 -0.2479445210
-0.3879219273 0.4712188222 0.2032864450
-0.3817813959 0.4485251874 -0.2761778728
-0.4226349899 -0.0021286386 -0.1018407457
-0.4224644254 -0.0027589961 -0.1151587503
-0.4420325616 -0.1658635560 0.2327473377
-0.4377683051 -0.1816230194 -0.1002138820
-0.4358920302 -0.1885571909 -0.2467169801
-0.3860828519 0.4295445377 -0.1151292291
-0.3857417098 0.4282837749 -0.1417662478
0.1629666043 -0.2739454579 0.1655080678
0.1602965320 -0.3687090940 -0.1504525711
0.1616610900 -0.3737521070 -0.2569998384
0.1704422637 -0.2492562927 -0.1559764818
0.1663485718 -0.2341271869 0.1636667333
0.1718068216 -0.2542993057 -0.2625237490
-0.3179322645 -0.2934796461 -0.0064730655
-0.3177736789 -0.2878604848 0.0122468724
-0.3174040930 -0.2747487768 0.0559550371
-0.3172461127 -0.2691313434 0.0747023682
-0.3168765140 -0.2560196831 0.1184095236
-0.3188291731 -0.3253174300 -0.1126358563
-0.3184598306 -0.3122087875 -0.0689285614
-0.3183012579 -0.3065895785 -0.0502076141
0.1137146325 -0.3110311341 0.0631936918
0.1138726128 -0.3054137007 0.0819410230
0.1142422116 -0.2923020404 0.1256481783
0.1122895525 -0.3615997873 -0.1053972015
0.1126588949 -0.3484911448 -0.0616899067
0.1128174677 -0.3428719358 -0.0429689594
0.4168507543 -0.1994607293 -0.0750744134
0.4171918964 -0.2007214921 -0.1017114321
0.4646130717 0.4262054754 0.2163354544
0.4688773282 0.4104460121 -0.1166257652
0.4707536031 0.4035118406 -0.2631288634
0.4411731002 0.0855840088 -0.0949294453
0.4413436648 0.0849536513 -0.1082474500
0.4105024459 -0.2108768023 0.2457963425
0.4166429773 -0.2335704371 -0.2336679754
0.4623584637 0.3996603973 0.2175629907
0.4684989951 0.3769667624 -0.2619013272
0.4276454010 -0.0736870636 -0.0875642000
0.4278159656 -0.0743174211 -0.1008822047
0.4082478294 -0.2374219810 0.2470238833
0.4125120858 -0.2531814443 -0.0859373363
0.4143883608 -0.2601156158 -0.2324404345
0.4641975391 0.3579861127 -0.1008526835
0.4645386812 0.3567253499 -0.1274897022
-0.1006718066 -0.4189959571 -0.2039612949
-0.1006718066 -0.4189959571 -0.2039612949
-0.0963228775 -0.2918872061 -0.2641786225
0.0377419721 -0.2730932559 -0.2633511858
-0.0912500116 -0.2321608054 -0.2669405778
-0.0963228775 -0.2918872061 -0.2641786225
-0.2303877270 -0.3106811563 -0.2650060592
-0.1013957433 -0.3516136067 -0.2614166671
-0.3627911146 -0.2571411399 -0.0022265764
0.1633225519 -0.3014181405 0.0066070811
-0.1020780223 -0.3490921003 -0.2081430335
-0.1027603012 -0.3465705938 -0.1548693998
0.0297915338 -0.3614221036 -0.2325714359
-0.1020780223 -0.3490921003 -0.2081430335
-0.1013957433 -0.3516136067 -0.2614166671
-0.2339475784 -0.3367620969 -0.1837146310
-0.1014252651 -0.2991887757 0.0031109196
-0.1000902290 -0.2518069577 0.1610912391
0.0307706696 -0.2865671168 0.0843094937
-0.2322861637 -0.2644286166 0.0798926650
0.1616315681 -0.3213272760 0.0075277484
0.0294356335 -0.3339489349 -0.0736708257
0.0307706696 -0.2865671168 0.0843094937
-0.1014252651 -0.2991887757 0.0031109196
-0.1027603012 -0.3465705938 -0.1548693998
-0.2336211998 -0.3118104346 -0.0780876545
0.0294356335 -0.3339489349 -0.0736708257
-0.3644820984 -0.2770502755 -0.0013059091
-0.2322861637 -0.2644286166 0.0798926650
-0.2336211998 -0.3118104346 -0.0780876545
0.0092690551 0.0417276851 -0.0983850955
0.2184572281 -0.0159796892 -0.0929746478
0.2252210777 0.0636558469 -0.0966572704
0.3298151642 0.0348021598 -0.0939520465
0.0025052056 -0.0379078511 -0.0947024729
-0.2066829674 0.0197995232 -0.1001129206
0.2184572281 -0.0159796892 -0.0929746478
0.0092690551 0.0417276851 -0.0983850955
-0.1999191178 0.0994350594 -0.1037955432
-0.2066829674 0.0197995232 -0.1001129206
-0.3112770539 0.0486532104 -0.1028181444
0.0160329047 0.1213632213 -0.1020677181
0.2252210777 0.0636558469 -0.0966572704
-0.1999191178 0.0994350594 -0.1037955432
0.0094396197 0.0410973276 -0.1117031001
-0.2065124028 0.0191691657 -0.1134309252
-0.1997485532 0.0988047019 -0.1171135479
-0.3077245645 0.0878406210 -0.1179774604
0.0026757701 -0.0385382086 -0.1080204775
0.2186277927 -0.0166100468 -0.1062926524
-0.2065124028 0.0191691657 -0.1134309252
0.0094396197 0.0410973276 -0.1117031001
0.2253916422 0.0630254894 -0.1099752751
0.2186277927 -0.0166100468 -0.1062926524
0.3266038039 -0.0056459658 -0.1054287399
0.0162034693 0.1207328638 -0.1153857228
-0.1997485532 0.0988047019 -0.1171135479
0.2253916422 0.0630254894 -0.1099752751
-0.0176334298 -0.1945419979 0.3196432150
-0.0176334298 -0.1945419979 0.3196432150
-0.0094460460 -0.2248002096 -0.3196432150
-0.0094460460 -0.2248002096 -0.3196432150
-0.0149488625 -0.2262617147 0.0007672072
0.4633335428 -0.2665133023 0.0087977589
0.2262391861 -0.2539520614 -0.1550391245
0.2241923401 -0.2463875085 0.0047824831
0.3447863644 -0.2602326818 -0.0731206828
0.1056451618 -0.2401068880 -0.0771359586
0.4653803887 -0.2740778552 -0.1510238486
0.3468332104 -0.2677972347 -0.2329422903
0.3447863644 -0.2602326818 -0.0731206828
0.2221454942 -0.2388229556 0.1646040906
0.4612866968 -0.2589487493 0.1686193664
0.3427395185 -0.2526681289 0.0867009247
0.3406926725 -0.2451035760 0.2465225322
0.2241923401 -0.2463875085 0.0047824831
0.1035983158 -0.2325423351 0.0826856489
0.3427395185 -0.2526681289 0.0867009247
-0.0108551706 -0.2413908205 -0.3188760078
-0.2520432192 -0.2137004738 -0.1630696761
-0.0129020166 -0.2338262676 -0.1590544003
-0.1314491949 -0.2275456472 -0.2409728419
-0.1334960409 -0.2199810943 -0.0811512344
-0.2499963732 -0.2212650268 -0.3228912836
-0.3705903975 -0.2074198534 -0.2449881178
-0.1314491949 -0.2275456472 -0.2409728419
0.2262391861 -0.2539520614 -0.1550391245
0.2282860320 -0.2615166143 -0.3148607320
0.1076920077 -0.2476714410 -0.2369575661
0.3468332104 -0.2677972347 -0.2329422903
-0.0129020166 -0.2338262676 -0.1590544003
0.1056451618 -0.2401068880 -0.0771359586
0.1076920077 -0.2476714410 -0.2369575661
-0.0149488625 -0.2262617147 0.0007672072
-0.4932312678 -0.1860101272 -0.0072633444
-0.2561369111 -0.1985713680 0.1565735389
-0.2540900652 -0.2061359209 -0.0032480686
-0.3746840895 -0.1922907476 0.0746550973
-0.1355428868 -0.2124165414 0.0786703731
-0.4952781138 -0.1784455742 0.1525582631
-0.3767309354 -0.1847261947 0.2344767048
-0.3746840895 -0.1922907476 0.0746550973
-0.2520432192 -0.2137004738 -0.1630696761
-0.4911844218 -0.1935746801 -0.1670849519
-0.3726372435 -0.1998553005 -0.0851665102
-0.3705903975 -0.2074198534 -0.2449881178
-0.2540900652 -0.2061359209 -0.0032480686
-0.1334960409 -0.2199810943 -0.0811512344
-0.3726372435 -0.1998553005 -0.0851665102
-0.0190425544 -0.2111326089 0.3204104222
0.2221454942 -0.2388229556 0.1646040906
-0.0169957085 -0.2186971618 0.1605888147
0.1015514699 -0.2249777822 0.2425072564
0.1035983158 -0.2325423351 0.0826856489
0.2200986482 -0.2312584027 0.3244256981
0.3406926725 -0.2451035760 0.2465225322
0.1015514699 -0.2249777822 0.2425072564
-0.2561369111 -0.1985713680 0.1565735389
-0.2581837571 -0.1910068151 0.3163951464
-0.1375897328 -0.2048519885 0.2384919806
-0.3767309354 -0.1847261947 0.2344767048
-0.0169957085 -0.2186971618 0.1605888147
-0.1355428868 -0.2124165414 0.0786703731
-0.1375897328 -0.2048519885 0.2384919806
-0.1030851391 -0.3369042874 -0.0871628815
-0.1030851391 -0.3369042874 -0.0871628815
-0.1281324173 -0.3160234326 -0.0251504272
-0.1281324173 -0.3160234326 -0.0251504272
-0.1440453738 -0.2959098134 0.0370148192
-0.1440453738 -0.2959098134 0.0370148192
-0.1435178012 -0.2771806959 0.0994698104
-0.1435178012 -0.2771806959 0.0994698104
-0.0973233443 -0.3797120527 -0.2064855383
-0.0973233443 -0.3797120527 -0.2064855383
-0.0951135342 -0.3484461412 -0.1813827446
0.0235487066 -0.4294501841 -0.2018755832
-0.1062300789 -0.4895457729 -0.2265398453
-0.2248923198 -0.4085417300 -0.2060470067
0.0326691062 -0.3328196565 -0.2605892304
0.0997015310 -0.3234226814 -0.2601755121
-0.2253148612 -0.2509547556 -0.2677680145
0.0377419721 -0.2730932559 -0.2633511858
-0.2253148612 -0.2509547556 -0.2677680145
-0.2923472860 -0.2603517307 -0.2681817329
0.0326691062 -0.3328196565 -0.2605892304
-0.2303877270 -0.3106811563 -0.2650060592
-0.3592312587 -0.2310602161 -0.0835183579
-0.3577182488 -0.1974147393 -0.0049885318
0.1683954177 -0.2416917398 0.0038451257
0.1668824078 -0.2753372166 -0.0746847003
-0.1007577471 -0.2754978667 0.0821010793
0.0314381876 -0.2628762078 0.1632996534
-0.2316186456 -0.2407377075 0.1588828247
-0.1007577471 -0.2754978667 0.0821010793
0.0301031515 -0.3102580259 0.0053193340
0.1609640501 -0.3450181850 -0.0714624113
0.1622990862 -0.2976363670 0.0865179081
0.0301031515 -0.3102580259 0.0053193340
-0.1020927832 -0.3228796847 -0.0758792401
-0.2342887179 -0.3355013436 -0.1570778142
0.0287681154 -0.3576398439 -0.1526609855
-0.1020927832 -0.3228796847 -0.0758792401
-0.2329536818 -0.2881195256 0.0009025052
-0.3638145803 -0.2533593664 0.0776842506
-0.3651496164 -0.3007411845 -0.0802960689
-0.2329536818 -0.2881195256 0.0009025052
-0.0983992453 -0.2318978221 0.1601705718
-0.0983992453 -0.2318978221 0.1601705718
0.3298151642 0.0348021598 -0.0939520465
0.1172450664 0.0526917660 -0.0975211829
0.4344092506 0.0059484726 -0.0912468227
0.3230513146 -0.0448333764 -0.0902694239
-0.1020888809 -0.0090541639 -0.0974076967
-0.2100648922 -0.0200182449 -0.0982716093
0.2150753033 -0.0557974573 -0.0911333365
0.1138631416 0.0128739979 -0.0956798716
-0.3112770539 0.0486532104 -0.1028181444
-0.0987069561 0.0307636042 -0.0992490080
-0.4158711404 0.0775068976 -0.1055233683
-0.3045132043 0.1282887466 -0.1065007671
0.1206269912 0.0925095341 -0.0993624943
0.2286030025 0.1034736150 -0.0984985817
-0.1965371930 0.1392528275 -0.1056368545
-0.0953250313 0.0705813722 -0.1010903194
-0.4230418722 0.1519392168 -0.1024631651
-0.4230418722 0.1519392168 -0.1024631651
-0.4227007302 0.1506784540 -0.1291001838
-0.4227007302 0.1506784540 -0.1291001838
-0.4112337553 0.4788477796 0.0357459275
-0.3846624993 0.4766115793 0.0361920694
-0.4361569292 0.1524269355 -0.1160047454
-0.4361569292 0.1524269355 -0.1160047454
-0.4095856732 0.1501907352 -0.1155586034
-0.4095856732 0.1501907352 -0.1155586034
-0.4387731251 -0.1604706983 0.0656529574
-0.4653443811 -0.1582344981 0.0652068155
0.4115072659 -0.2320291233 0.0799295031
0.4380786225 -0.2342653320 0.0803756467
0.4672660744 0.0763961016 -0.1008359142
0.4672660744 0.0763961016 -0.1008359142
0.4406947177 0.0786323103 -0.1012820578
0.4406947177 0.0786323103 -0.1012820578
0.4921892526 0.4028169959 0.0509147564
0.4656178959 0.4050532047 0.0504686127
0.4541509671 0.0768838245 -0.1143774953
0.4541509671 0.0768838245 -0.1143774953
0.4538098250 0.0781445873 -0.0877404766
0.4538098250 0.0781445873 -0.0877404766
-0.3077245645 0.0878406210 -0.1179774604
-0.0951544668 0.0699510147 -0.1144083240
-0.4157005758 0.0768765400 -0.1188413730
-0.3144884141 0.0082050848 -0.1142948378
0.1106517814 -0.0275741277 -0.1071565650
0.2152458679 -0.0564278149 -0.1044513411
-0.2098943276 -0.0206486024 -0.1115896139
-0.0985363916 0.0301332466 -0.1125670127
0.3266038039 -0.0056459658 -0.1054287399
0.1140337062 0.0122436404 -0.1089978763
0.4345798152 0.0053181151 -0.1045648273
0.3333676535 0.0739895704 -0.1091113625
-0.0917725420 0.1097687828 -0.1162496353
-0.1963666285 0.1386224700 -0.1189548592
0.2287735670 0.1028432575 -0.1118165864
0.1174156310 0.0520614085 -0.1108391876
0.4647426674 -0.2499226913 0.0080305516
0.4647426674 -0.2499226913 0.0080305516
-0.4918221431 -0.1694195162 -0.0080305516
-0.4918221431 -0.1694195162 -0.0080305516
0.2208032105 -0.2229630972 0.3240420945
-0.0190425544 -0.2111326089 0.3204104222
-0.2560700701 -0.1661208987 0.3152443356
-0.0162243051 -0.1779513870 0.3188760078
-0.0108551706 -0.2413908205 -0.3188760078
0.2303997190 -0.2366306979 -0.3160115428
-0.0080369213 -0.2082095986 -0.3204104222
-0.2492918109 -0.2129697213 -0.3232748872
0.2252157631 -0.2501697849 -0.0751283207
0.3437629414 -0.2564504054 0.0067901210
0.1046217388 -0.2363246116 0.0027748451
0.2252157631 -0.2501697849 -0.0751283207
0.3458097874 -0.2640149583 -0.1530314865
0.4664038117 -0.2778601316 -0.2309346524
0.4643569657 -0.2702955787 -0.0711130449
0.3458097874 -0.2640149583 -0.1530314865
0.3417160955 -0.2488858525 0.1666117285
0.4623101198 -0.2627310258 0.0887085626
0.4602632738 -0.2551664729 0.2485301701
0.3417160955 -0.2488858525 0.1666117285
0.2231689171 -0.2426052320 0.0846932868
0.1046217388 -0.2363246116 0.0027748451
0.3437629414 -0.2564504054 0.0067901210
0.2231689171 -0.2426052320 0.0846932868
-0.1324726179 -0.2237633707 -0.1610620382
-0.0118785936 -0.2376085441 -0.2389652040
-0.0139254395 -0.2300439912 -0.0791435965
-0.1324726179 -0.2237633707 -0.1610620382
-0.2510197962 -0.2174827503 -0.2429804798
-0.3695669746 -0.2112021299 -0.3248989215
-0.1304257719 -0.2313279236 -0.3208836457
-0.2510197962 -0.2174827503 -0.2429804798
0.2272626091 -0.2577343378 -0.2349499282
0.1087154307 -0.2514537174 -0.3168683699
0.3478566334 -0.2715795112 -0.3128530941
0.2272626091 -0.2577343378 -0.2349499282
0.1066685848 -0.2438891645 -0.1570467624
-0.0139254395 -0.2300439912 -0.0791435965
-0.0118785936 -0.2376085441 -0.2389652040
0.1066685848 -0.2438891645 -0.1570467624
-0.2551134881 -0.2023536445 0.0766627352
-0.3736606665 -0.1960730240 -0.0052557065
-0.1345194638 -0.2161988178 -0.0012404307
-0.2551134881 -0.2023536445 0.0766627352
-0.3757075124 -0.1885084711 0.1545659010
-0.4963015367 -0.1746632978 0.2324690669
-0.4942546908 -0.1822278507 0.0726474593
-0.3757075124 -0.1885084711 0.1545659010
-0.3716138205 -0.2036375770 -0.1650773140
-0.4922078448 -0.1897924036 -0.0871741482
-0.4901609989 -0.1973569565 -0.2469957557
-0.3716138205 -0.2036375770 -0.1650773140
-0.2530666422 -0.2099181974 -0.0831588723
-0.1345194638 -0.2161988178 -0.0012404307
-0.3736606665 -0.1960730240 -0.0052557065
-0.2530666422 -0.2099181974 -0.0831588723
0.1025748928 -0.2287600587 0.1625964527
-0.0180191315 -0.2149148853 0.2404996185
-0.0159722855 -0.2224794383 0.0806780110
0.1025748928 -0.2287600587 0.1625964527
0.2211220712 -0.2350406791 0.2445148943
0.3396692495 -0.2413212995 0.3264333360
0.1005280469 -0.2211955058 0.3224180602
0.2211220712 -0.2350406791 0.2445148943
-0.2571603341 -0.1947890916 0.2364843427
-0.1386131558 -0.2010697120 0.3184027843
-0.3777543584 -0.1809439182 0.3143875085
-0.2571603341 -0.1947890916 0.2364843427
-0.1365663098 -0.2086342649 0.1585811768
-0.0159722855 -0.2224794383 0.0806780110
-0.0180191315 -0.2149148853 0.2404996185
-0.1365663098 -0.2086342649 0.1585811768
-0.1029004679 -0.3303499662 -0.0653092340
0.0046022067 -0.3492520374 -0.0962800415
-0.1032698103 -0.3434586087 -0.1090165289
-0.2107724848 -0.3245565375 -0.0780457214
-0.1279479206 -0.3094684664 -0.0032831529
-0.0332324937 -0.3272953259 -0.0344891080
-0.1283169140 -0.3225783988 -0.0470177015
-0.2230323409 -0.3047515393 -0.0158117464
-0.0951135342 -0.3484461412 -0.1813827446
-0.0363179928 -0.4005721220 -0.2179940792
-0.0995331544 -0.4109779642 -0.2315883320
-0.1605385060 -0.3901178949 -0.2200797910
-0.0357824138 -0.3889481627 -0.1916291639
-0.1600029270 -0.3784939356 -0.1937148756
-0.0413406862 -0.4594979785 -0.2142077142
-0.0357824138 -0.3889481627 -0.1916291639
-0.1655611994 -0.4490437515 -0.2162934260
-0.0413406862 -0.4594979785 -0.2142077142
-0.1600029270 -0.3784939356 -0.1937148756
-0.1655611994 -0.4490437515 -0.2162934260
-0.3600619897 -0.2672271993 -0.2153218176
-0.3600619897 -0.2672271993 -0.2153218176
-0.3627911146 -0.2571411399 -0.0022265764
-0.3643041246 -0.2907866167 -0.0807564025
-0.3625241966 -0.2777461548 -0.1214022932
-0.3612781047 -0.2234956631 0.0763032497
-0.3592312587 -0.2310602161 -0.0835183579
0.1633225519 -0.3014181405 0.0066070811
0.1668824078 -0.2753372166 -0.0746847003
0.1648355618 -0.2677726637 0.0851369072
0.1635894699 -0.3220231553 -0.1125686357
0.1618095420 -0.3350636172 -0.0719227450
0.1660516768 -0.3115041999 -0.2064881601
0.1660516768 -0.3115041999 -0.2064881601
0.0291092549 -0.3589005971 -0.1792978023
-0.2339475784 -0.3367620969 -0.1837146310
0.0291092549 -0.3589005971 -0.1792978023
0.0950440329 -0.3650655988 -0.1915120035
-0.2332652994 -0.3392836034 -0.2369882647
0.0297915338 -0.3614221036 -0.2325714359
-0.2332652994 -0.3392836034 -0.2369882647
-0.2992000775 -0.3331186017 -0.2247740635
-0.0346597797 -0.2691870373 0.1227003664
-0.0353272978 -0.2928779463 0.0437102067
0.0968686369 -0.2802562874 0.1249087808
-0.0346597797 -0.2691870373 0.1227003664
-0.1661881964 -0.2581177871 0.1204919520
-0.2977166130 -0.2470485370 0.1182835376
-0.1668557144 -0.2818086961 0.0415017923
-0.1661881964 -0.2581177871 0.1204919520
0.0955336008 -0.3276381054 -0.0330715387
-0.0359948158 -0.3165688553 -0.0352799531
0.0948660827 -0.3513290144 -0.1120616984
0.0955336008 -0.3276381054 -0.0330715387
0.0962011189 -0.3039471964 0.0459186210
0.0968686369 -0.2802562874 0.1249087808
-0.0353272978 -0.2928779463 0.0437102067
0.0962011189 -0.3039471964 0.0459186210
-0.1681907505 -0.3291905142 -0.1164785272
-0.1675232325 -0.3054996052 -0.0374883674
-0.2997191672 -0.3181212641 -0.1186869415
-0.1681907505 -0.3291905142 -0.1164785272
-0.0366623339 -0.3402597643 -0.1142701128
0.0948660827 -0.3513290144 -0.1120616984
-0.0359948158 -0.3165688553 -0.0352799531
-0.0366623339 -0.3402597643 -0.1142701128
-0.2983841310 -0.2707394460 0.0392933779
-0.1668557144 -0.2818086961 0.0415017923
-0.2977166130 -0.2470485370 0.1182835376
-0.2983841310 -0.2707394460 0.0392933779
-0.2990516491 -0.2944303550 -0.0396967818
-0.2997191672 -0.3181212641 -0.1186869415
-0.1675232325 -0.3054996052 -0.0374883674
-0.2990516491 -0.2944303550 -0.0396967818
-0.0967082615 -0.2119886866 0.1592499045
0.0322836795 -0.2529216400 0.1628393198
-0.1000902290 -0.2518069577 0.1610912391
-0.2290821700 -0.2108740043 0.1575018238
0.2741361961 0.0094112353 -0.0934633472
0.3331970889 0.0746199279 -0.0957933579
0.1678511472 0.0183560384 -0.0952479154
0.1138631416 0.0128739979 -0.0956798716
0.3787302826 -0.0194424519 -0.0907581233
0.3854941322 0.0601930843 -0.0944407459
0.2741361961 0.0094112353 -0.0934633472
0.3787302826 -0.0194424519 -0.0907581233
-0.0987069561 0.0307636042 -0.0992490080
-0.0464099129 0.0163367606 -0.0978963961
-0.3146589787 0.0088354423 -0.1009768331
-0.1020888809 -0.0090541639 -0.0974076967
0.1104812168 -0.0269437702 -0.0938385603
0.3230513146 -0.0448333764 -0.0902694239
0.1104812168 -0.0269437702 -0.0938385603
0.0581841736 -0.0125169266 -0.0951911722
-0.2555980859 0.0740441349 -0.1033068438
-0.3146589787 0.0088354423 -0.1009768331
-0.1493130370 0.0650993318 -0.1015222756
-0.0953250313 0.0705813722 -0.1010903194
-0.3601921723 0.1028978221 -0.1060120677
-0.3669560219 0.0232622859 -0.1023294451
-0.2555980859 0.0740441349 -0.1033068438
-0.3601921723 0.1028978221 -0.1060120677
0.1172450664 0.0526917660 -0.0975211829
0.0649480232 0.0671186096 -0.0988737949
0.3331970889 0.0746199279 -0.0957933579
0.1206269912 0.0925095341 -0.0993624943
-0.0919431066 0.1103991403 -0.1029316307
-0.3045132043 0.1282887466 -0.1065007671
-0.0919431066 0.1103991403 -0.1029316307
-0.0396460633 0.0959722968 -0.1015790187
-0.4002880176 0.4514997801 0.0438555370
-0.4002880176 0.4514997801 0.0438555370
-0.4498894188 -0.1324922407 0.0708613479
-0.4498894188 -0.1324922407 0.0708613479
-0.4112337553 0.4788477796 0.0357459275
-0.4135736455 0.4526178802 0.0436324660
-0.4096040413 0.4815441581 -0.0478012604
-0.3846624993 0.4766115793 0.0361920694
-0.3830327853 0.4793079579 -0.0473551184
-0.3870023896 0.4503816799 0.0440786080
-0.4387731251 -0.1604706983 0.0656529574
-0.4366037909 -0.1336103409 0.0710844189
-0.4382707151 -0.1710468589 -0.0172804623
-0.4653443811 -0.1582344981 0.0652068155
-0.4648419711 -0.1688106586 -0.0177266042
-0.4631750468 -0.1313741406 0.0706382769
0.4115072659 -0.2320291233 0.0799295031
0.4120096759 -0.2426052838 -0.0030039166
0.4136766001 -0.2051687658 0.0853609645
0.4380786225 -0.2342653320 0.0803756467
0.4402479567 -0.2074049745 0.0858071081
0.4385810325 -0.2448414925 -0.0025577730
0.4921892526 0.4028169959 0.0509147564
0.4938189687 0.4055133996 -0.0326324326
0.4898493580 0.3765870463 0.0588012972
0.4656178959 0.4050532047 0.0504686127
0.4632780014 0.3788232550 0.0583551536
0.4672476121 0.4077496084 -0.0330785763
0.4269622784 -0.2062868702 0.0855840363
0.4269622784 -0.2062868702 0.0855840363
0.4765636797 0.3777051506 0.0585782254
0.4765636797 0.3777051506 0.0585782254
-0.2571184837 0.0535048933 -0.1157041928
-0.3043426397 0.1276583891 -0.1198187717
-0.1508334348 0.0445600902 -0.1139196246
-0.0985363916 0.0301332466 -0.1125670127
-0.3650944949 0.0425408124 -0.1165681054
-0.3583306454 0.1221763486 -0.1202507280
-0.2571184837 0.0535048933 -0.1157041928
-0.3650944949 0.0425408124 -0.1165681054
0.1140337062 0.0122436404 -0.1089978763
0.0600457006 0.0067615999 -0.1094298326
0.3232218791 -0.0454637339 -0.1035874286
0.1106517814 -0.0275741277 -0.1071565650
-0.1019183164 -0.0096845215 -0.1107257014
-0.3144884141 0.0082050848 -0.1142948378
-0.1019183164 -0.0096845215 -0.1107257014
-0.0479303107 -0.0042024810 -0.1102937451
0.2759977231 0.0286897618 -0.1077020075
0.3232218791 -0.0454637339 -0.1035874286
0.1697126742 0.0376345649 -0.1094865757
0.1174156310 0.0520614085 -0.1108391876
0.3839737344 0.0396538427 -0.1068380949
0.3772098848 -0.0399816935 -0.1031554723
0.2759977231 0.0286897618 -0.1077020075
0.3839737344 0.0396538427 -0.1068380949
-0.0951544668 0.0699510147 -0.1144083240
-0.0411664611 0.0754330552 -0.1139763677
-0.3043426397 0.1276583891 -0.1198187717
-0.0917725420 0.1097687828 -0.1162496353
0.1207975558 0.0918791766 -0.1126804989
0.3333676535 0.0739895704 -0.1091113625
0.1207975558 0.0918791766 -0.1126804989
0.0668095501 0.0863971361 -0.1131124552
0.4633335428 -0.2665133023 0.0087977589
0.4634003838 -0.2340628329 0.1674685555
0.4661517921 -0.2333320803 0.0072633444
0.4660849510 -0.2657825497 -0.1514074523
-0.4945735514 -0.1701502688 0.1521746595
-0.4932312678 -0.1860101272 -0.0072633444
-0.4890707349 -0.1686887636 -0.1682357628
-0.4904130185 -0.1528289052 -0.0087977589
0.2844893523 -0.2533100952 -0.0341690999
0.2855127752 -0.2570923716 -0.1140799036
0.4040599536 -0.2633729920 -0.0321614620
0.2844893523 -0.2533100952 -0.0341690999
0.1649187509 -0.2432471983 -0.0361767378
0.0453481496 -0.2331843014 -0.0381843757
0.1659421739 -0.2470294747 -0.1160875415
0.1649187509 -0.2432471983 -0.0361767378
0.4061067995 -0.2709375449 -0.1919830695
0.2865361982 -0.2608746481 -0.1939907074
0.4071302225 -0.2747198214 -0.2718938732
0.4061067995 -0.2709375449 -0.1919830695
0.4050833766 -0.2671552685 -0.1120722657
0.4040599536 -0.2633729920 -0.0321614620
0.2855127752 -0.2570923716 -0.1140799036
0.4050833766 -0.2671552685 -0.1120722657
0.4020131076 -0.2558084391 0.1276601455
0.2824425063 -0.2457455422 0.1256525076
0.4030365306 -0.2595907156 0.0477493418
0.4020131076 -0.2558084391 0.1276601455
0.4009896846 -0.2520261627 0.2075709493
0.3999662617 -0.2482438862 0.2874817531
0.2814190833 -0.2419632658 0.2055633114
0.4009896846 -0.2520261627 0.2075709493
0.1638953280 -0.2394649218 0.0437340660
0.1628719050 -0.2356826454 0.1236448697
0.0443247266 -0.2294020249 0.0417264281
0.1638953280 -0.2394649218 0.0437340660
0.2834659293 -0.2495278187 0.0457417039
0.4030365306 -0.2595907156 0.0477493418
0.2824425063 -0.2457455422 0.1256525076
0.2834659293 -0.2495278187 0.0457417039
-0.0721756057 -0.2306859574 -0.2000136211
-0.1917462071 -0.2206230605 -0.2020212590
-0.0711521828 -0.2344682339 -0.2799244249
-0.0721756057 -0.2306859574 -0.2000136211
-0.0731990287 -0.2269036809 -0.1201028174
-0.0742224517 -0.2231214045 -0.0401920136
-0.1927696300 -0.2168407841 -0.1221104553
-0.0731990287 -0.2269036809 -0.1201028174
-0.3102933854 -0.2143424401 -0.2839397007
-0.3113168084 -0.2105601636 -0.2040288969
-0.4298639867 -0.2042795432 -0.2859473386
-0.3102933854 -0.2143424401 -0.2839397007
-0.1907227841 -0.2244053370 -0.2819320628
-0.0711521828 -0.2344682339 -0.2799244249
-0.1917462071 -0.2206230605 -0.2020212590
-0.1907227841 -0.2244053370 -0.2819320628
0.1679890199 -0.2545940276 -0.2759091490
0.1669655969 -0.2508117512 -0.1959983453
0.0484184186 -0.2445311307 -0.2779167870
0.1679890199 -0.2545940276 -0.2759091490
0.2875596212 -0.2646569245 -0.2739015111
0.4071302225 -0.2747198214 -0.2718938732
0.2865361982 -0.2608746481 -0.1939907074
0.2875596212 -0.2646569245 -0.2739015111
0.0463715726 -0.2369665778 -0.1180951794
0.1659421739 -0.2470294747 -0.1160875415
0.0453481496 -0.2331843014 -0.0381843757
0.0463715726 -0.2369665778 -0.1180951794
0.0473949956 -0.2407488543 -0.1980059832
0.0484184186 -0.2445311307 -0.2779167870
0.1669655969 -0.2508117512 -0.1959983453
0.0473949956 -0.2407488543 -0.1980059832
-0.3143870773 -0.1992133343 0.0357035143
-0.3154105003 -0.1954310578 0.1156143181
-0.4339576786 -0.1891504374 0.0336958764
-0.3143870773 -0.1992133343 0.0357035143
-0.1948164760 -0.2092762311 0.0377111522
-0.0752458747 -0.2193391280 0.0397187902
-0.1958398990 -0.2054939547 0.1176219560
-0.1948164760 -0.2092762311 0.0377111522
-0.4360045246 -0.1815858845 0.1935174839
-0.3164339233 -0.1916487814 0.1955251218
-0.4370279476 -0.1778036080 0.2734282877
-0.4360045246 -0.1815858845 0.1935174839
-0.4349811016 -0.1853681609 0.1136066802
-0.4339576786 -0.1891504374 0.0336958764
-0.3154105003 -0.1954310578 0.1156143181
-0.4349811016 -0.1853681609 0.1136066802
-0.4319108327 -0.1967149903 -0.1261257311
-0.3123402313 -0.2067778872 -0.1241180932
-0.4329342556 -0.1929327138 -0.0462149273
-0.4319108327 -0.1967149903 -0.1261257311
-0.4308874097 -0.2004972667 -0.2060365348
-0.4298639867 -0.2042795432 -0.2859473386
-0.3113168084 -0.2105601636 -0.2040288969
-0.4308874097 -0.2004972667 -0.2060365348
-0.1937930530 -0.2130585076 -0.0421996515
-0.1927696300 -0.2168407841 -0.1221104553
-0.0742224517 -0.2231214045 -0.0401920136
-0.1937930530 -0.2130585076 -0.0421996515
-0.3133636543 -0.2029956107 -0.0442072894
-0.4329342556 -0.1929327138 -0.0462149273
-0.3123402313 -0.2067778872 -0.1241180932
-0.3133636543 -0.2029956107 -0.0442072894
0.0422778807 -0.2218374720 0.2015480356
0.1618484820 -0.2319003689 0.2035556735
0.0412544577 -0.2180551956 0.2814588393
0.0422778807 -0.2218374720 0.2015480356
0.0433013037 -0.2256197485 0.1216372318
0.0443247266 -0.2294020249 0.0417264281
0.1628719050 -0.2356826454 0.1236448697
0.0433013037 -0.2256197485 0.1216372318
0.2803956603 -0.2381809893 0.2854741151
0.2814190833 -0.2419632658 0.2055633114
0.3999662617 -0.2482438862 0.2874817531
0.2803956603 -0.2381809893 0.2854741151
0.1608250590 -0.2281180924 0.2834664772
0.0412544577 -0.2180551956 0.2814588393
0.1618484820 -0.2319003689 0.2035556735
0.1608250590 -0.2281180924 0.2834664772
-0.1978867449 -0.1979294018 0.2774435635
-0.1968633219 -0.2017116782 0.1975327598
-0.0783161436 -0.2079922987 0.2794512014
-0.1978867449 -0.1979294018 0.2774435635
-0.3174573462 -0.1878665049 0.2754359256
-0.4370279476 -0.1778036080 0.2734282877
-0.3164339233 -0.1916487814 0.1955251218
-0.3174573462 -0.1878665049 0.2754359256
-0.0762692976 -0.2155568516 0.1196295939
-0.1958398990 -0.2054939547 0.1176219560
-0.0752458747 -0.2193391280 0.0397187902
-0.0762692976 -0.2155568516 0.1196295939
-0.0772927206 -0.2117745751 0.1995403977
-0.0783161436 -0.2079922987 0.2794512014
-0.1968633219 -0.2017116782 0.1975327598
-0.0772927206 -0.2117745751 0.1995403977
-0.1438605809 -0.2893539594 0.0588689016
-0.0573660142 -0.3064903317 0.0275447103
-0.1442301667 -0.3024656674 0.0151607369
-0.2307247334 -0.2853292951 0.0464849282
-0.1433330019 -0.2706248657 0.1213233881
-0.0568384449 -0.2877612022 0.0899999539
-0.1437026006 -0.2837365260 0.0776162328
-0.2301971576 -0.2666001895 0.1089396670
-0.0341081827 -0.3693062105 -0.1928912855
-0.1583286959 -0.3588519834 -0.1949769973
-0.0341081827 -0.3693062105 -0.1928912855
-0.0036055069 -0.3797362451 -0.1986455560
-0.1605385060 -0.3901178949 -0.2200797910
-0.0363179928 -0.4005721220 -0.2179940792
-0.1899362767 -0.3640549045 -0.2017741237
-0.1583286959 -0.3588519834 -0.1949769973
0.0997015310 -0.3234226814 -0.2601755121
-0.0292904527 -0.2824902310 -0.2637649041
0.1667339558 -0.3140257063 -0.2597617937
0.1047743969 -0.2636962808 -0.2629374674
-0.1608188693 -0.2714209809 -0.2659733185
-0.2227784283 -0.2210915553 -0.2691489922
0.0402784050 -0.2432300556 -0.2647321634
-0.0292904527 -0.2824902310 -0.2637649041
-0.2923472860 -0.2603517307 -0.2681817329
-0.1608188693 -0.2714209809 -0.2659733185
-0.3593797107 -0.2697487058 -0.2685954512
-0.2974201518 -0.3200781314 -0.2654197775
-0.0343633185 -0.3422166316 -0.2610029488
0.0301326733 -0.3626828569 -0.2592082527
-0.2329241599 -0.3405443566 -0.2636250815
-0.1633553022 -0.3012841812 -0.2645923408
-0.3607442687 -0.2647056928 -0.1620481839
-0.3651348555 -0.3269536000 -0.2125598622
-0.3593797107 -0.2697487058 -0.2685954512
-0.3549891239 -0.2075007987 -0.2180837729
-0.3612781047 -0.2234956631 0.0763032497
-0.3644820984 -0.2770502755 -0.0013059091
0.1616315681 -0.3213272760 0.0075277484
0.1648355618 -0.2677726637 0.0851369072
0.1609788110 -0.3712306005 -0.2037262047
0.1653693979 -0.3089826934 -0.1532145264
0.1711245427 -0.2517777992 -0.2092501154
0.1667339558 -0.3140257063 -0.2597617937
-0.0368255232 -0.3527355955 -0.1670836011
0.0287681154 -0.3576398439 -0.1526609855
-0.2342887179 -0.3355013436 -0.1570778142
-0.1680128003 -0.3429270986 -0.1959288323
0.0950440329 -0.3650655988 -0.1915120035
-0.0364843837 -0.3539963487 -0.1937204179
0.1609788110 -0.3712306005 -0.2037262047
0.0957263119 -0.3675871053 -0.2447856371
-0.1673305214 -0.3454486051 -0.2492024659
-0.2329241599 -0.3405443566 -0.2636250815
0.0301326733 -0.3626828569 -0.2592082527
-0.0361432442 -0.3552571019 -0.2203572347
-0.2992000775 -0.3331186017 -0.2247740635
-0.1676716608 -0.3441878518 -0.2225656491
-0.3651348555 -0.3269536000 -0.2125598622
-0.2998823564 -0.3305970952 -0.1715004298
-0.0349935388 -0.2810324918 0.0832052865
-0.1004239880 -0.2636524122 0.1215961592
-0.1010915061 -0.2873433212 0.0426059995
-0.0349935388 -0.2810324918 0.0832052865
0.0311044286 -0.2747216623 0.1238045736
0.0972023959 -0.2684108329 0.1644038606
-0.0343260207 -0.2573415827 0.1621954463
0.0311044286 -0.2747216623 0.1238045736
-0.2319524047 -0.2525831621 0.1193877448
-0.1658544373 -0.2462723326 0.1599870319
-0.2973828540 -0.2352030825 0.1577786175
-0.2319524047 -0.2525831621 0.1193877448
-0.1665219554 -0.2699632416 0.0809968722
-0.1010915061 -0.2873433212 0.0426059995
-0.1004239880 -0.2636524122 0.1215961592
-0.1665219554 -0.2699632416 0.0809968722
0.0297693925 -0.3221034804 -0.0341757459
0.0958673598 -0.3157926509 0.0064235412
-0.0356610568 -0.3047234008 0.0042151268
0.0297693925 -0.3221034804 -0.0341757459
0.0951998418 -0.3394835599 -0.0725666185
0.1606302911 -0.3568636395 -0.1109574912
0.1612978091 -0.3331727305 -0.0319673315
0.0951998418 -0.3394835599 -0.0725666185
0.0965348779 -0.2921017419 0.0854137009
0.1619653272 -0.3094818215 0.0470228282
0.1626328452 -0.2857909124 0.1260129880
0.0965348779 -0.2921017419 0.0854137009
0.0304369105 -0.2984125713 0.0448144139
-0.0356610568 -0.3047234008 0.0042151268
0.0958673598 -0.3157926509 0.0064235412
0.0304369105 -0.2984125713 0.0448144139
-0.1678569915 -0.3173450597 -0.0769834473
-0.1024265422 -0.3347251393 -0.1153743200
-0.1017590242 -0.3110342302 -0.0363841602
-0.1678569915 -0.3173450597 -0.0769834473
-0.2339549588 -0.3236558891 -0.1175827344
-0.3000529262 -0.3299667186 -0.1581820214
-0.1685245096 -0.3410359687 -0.1559736070
-0.2339549588 -0.3236558891 -0.1175827344
0.0291018744 -0.3457943894 -0.1131659056
-0.0369960929 -0.3521052188 -0.1537651926
0.0945323237 -0.3631744690 -0.1515567783
0.0291018744 -0.3457943894 -0.1131659056
-0.0363285749 -0.3284143098 -0.0747750329
-0.1017590242 -0.3110342302 -0.0363841602
-0.1024265422 -0.3347251393 -0.1153743200
-0.0363285749 -0.3284143098 -0.0747750329
-0.2326199227 -0.2762740711 0.0403975851
-0.2987178901 -0.2825849005 -0.0002017020
-0.1671894734 -0.2936541507 0.0020067124
-0.2326199227 -0.2762740711 0.0403975851
-0.2980503720 -0.2588939915 0.0787884578
-0.3634808213 -0.2415139119 0.1171793304
-0.3641483394 -0.2652048209 0.0381891707
-0.2980503720 -0.2588939915 0.0787884578
-0.2993854081 -0.3062758095 -0.0791918617
-0.3648158574 -0.2888957300 -0.0408009890
-0.3654833755 -0.3125866390 -0.1197911487
-0.2993854081 -0.3062758095 -0.0791918617
-0.2332874408 -0.2999649801 -0.0385925746
-0.1671894734 -0.2936541507 0.0020067124
-0.2987178901 -0.2825849005 -0.0002017020
-0.2332874408 -0.2999649801 -0.0385925746
0.0339746633 -0.2330125045 0.1619186525
-0.2290821700 -0.2108740043 0.1575018238
0.0339746633 -0.2330125045 0.1619186525
0.0993161256 -0.2435244135 0.1632530265
-0.2307731538 -0.2307831398 0.1584224910
0.0322836795 -0.2529216400 0.1628393198
-0.2307731538 -0.2307831398 0.1584224910
-0.2961146161 -0.2202712308 0.1570881170
-0.4045623621 0.2907418772 -0.1087961971
-0.4097562443 0.1508211166 -0.1022400941
-0.4415213824 0.0131365563 -0.0961301330
-0.4363275002 0.1530573169 -0.1026862360
-0.4094151022 0.1495603538 -0.1288771128
-0.4175068480 0.2905992145 -0.1356562868
-0.4359863581 0.1517965541 -0.1293232547
-0.4278946124 0.0107576934 -0.1225440808
-0.4070361898 0.4807734509 -0.2045999972
-0.3804649339 0.4785372507 -0.2041538553
-0.4242349475 0.2914734553 -0.1291085676
-0.4363275002 0.1530573169 -0.1026862360
-0.4479083398 0.0127500343 -0.1162194326
-0.4359863581 0.1517965541 -0.1293232547
-0.4097562443 0.1508211166 -0.1022400941
-0.3976636915 0.2892372550 -0.1286624256
-0.4094151022 0.1495603538 -0.1288771128
-0.4215076550 0.0111442154 -0.1024547813
-0.4368301677 -0.1850901051 -0.1734654311
-0.4634014236 -0.1828539049 -0.1739115730
0.4134502233 -0.2566485301 -0.1591888854
0.4400215799 -0.2588847388 -0.1587427418
0.4670955033 0.0770264830 -0.0875174048
0.4791880561 0.2154426214 -0.1139397364
0.4674366454 0.0757657202 -0.1141544235
0.4553440927 -0.0626504183 -0.0877320920
0.4526166995 0.2176788301 -0.1143858800
0.4405241467 0.0792626917 -0.0879635485
0.4289433071 -0.0610445909 -0.1014967450
0.4408652888 0.0780019289 -0.1146005672
0.4963868222 0.4047427176 -0.1894311707
0.4698154656 0.4069789263 -0.1898773143
0.4674366454 0.0757657202 -0.1141544235
0.4593448241 0.2168045872 -0.1209335988
0.4408652888 0.0780019289 -0.1146005672
0.4489571101 -0.0630369382 -0.1078213919
0.4722893604 0.2169472457 -0.0940735082
0.4670955033 0.0770264830 -0.0875174048
0.4353302897 -0.0606580710 -0.0814074450
0.4405241467 0.0792626917 -0.0879635485
0.4619912591 -0.2506534439 0.1682357628
0.4660849510 -0.2657825497 -0.1514074523
0.4619912591 -0.2506534439 0.1682357628
0.4613201173 -0.2427235147 0.2479547647
0.4674940757 -0.2491919387 -0.1521746595
0.4634003838 -0.2340628329 0.1674685555
0.4674940757 -0.2491919387 -0.1521746595
0.4681652175 -0.2571218679 -0.2318936614
-0.4931644268 -0.1535596578 0.1514074523
-0.4945401309 -0.1539250341 0.2315100578
-0.4904798595 -0.1852793746 -0.1674685555
-0.4945735514 -0.1701502688 0.1521746595
-0.4904798595 -0.1852793746 -0.1674685555
-0.4891041554 -0.1849139983 -0.2475711611
-0.4931644268 -0.1535596578 0.1514074523
-0.4890707349 -0.1686887636 -0.1682357628
0.2222123352 -0.2063724862 0.3232748872
0.3414306553 -0.2205830358 0.3254743269
-0.2574791947 -0.1827115096 0.3160115428
0.2208032105 -0.2229630972 0.3240420945
-0.2574791947 -0.1827115096 0.3160115428
-0.3766975149 -0.1685009600 0.3138121031
0.2222123352 -0.2063724862 0.3232748872
-0.2560700701 -0.1661208987 0.3152443356
0.2289905944 -0.2532213088 -0.3152443356
-0.2492918109 -0.2129697213 -0.3232748872
0.2289905944 -0.2532213088 -0.3152443356
0.3489134768 -0.2591365530 -0.3134284995
-0.2478826863 -0.1963791103 -0.3240420945
0.2303997190 -0.2366306979 -0.3160115428
-0.2478826863 -0.1963791103 -0.3240420945
-0.3678055687 -0.1904638662 -0.3258579306
0.0949981795 -0.3254141362 0.0098056414
0.0047868779 -0.3426977161 -0.0744263941
-0.2107724848 -0.3245565375 -0.0780457214
0.0047868779 -0.3426977161 -0.0744263941
0.0586305508 -0.3488715911 -0.0789849741
-0.2109571561 -0.3311108587 -0.0998993689
0.0046022067 -0.3492520374 -0.0962800415
-0.2109571561 -0.3311108587 -0.0998993689
-0.2648008290 -0.3249369837 -0.0953407889
-0.0330479970 -0.3207403597 -0.0126218337
-0.2230323409 -0.3047515393 -0.0158117464
-0.0330479970 -0.3207403597 -0.0126218337
0.0144019648 -0.3263763063 -0.0172911741
-0.2232168376 -0.3113065056 -0.0376790207
-0.0332324937 -0.3272953259 -0.0344891080
-0.2232168376 -0.3113065056 -0.0376790207
-0.2706667994 -0.3056705589 -0.0330096802
-0.0571812213 -0.2999344777 0.0493987927
-0.2307247334 -0.2853292951 0.0464849282
-0.0571812213 -0.2999344777 0.0493987927
-0.0138415415 -0.3052247369 0.0446637382
-0.2309095263 -0.2918851491 0.0246308458
-0.0573660142 -0.3064903317 0.0275447103
-0.2309095263 -0.2918851491 0.0246308458
-0.2742492061 -0.2865948900 0.0293659003
-0.0566536455 -0.2812053721 0.1118535315
-0.2301971576 -0.2666001895 0.1089396670
-0.0566536455 -0.2812053721 0.1118535315
-0.0133139673 -0.2864956253 0.1071186032
-0.2303819570 -0.2731560196 0.0870860893
-0.0568384449 -0.2877612022 0.0899999539
-0.2303819570 -0.2731560196 0.0870860893
-0.2737216352 -0.2678657664 0.0918210176
-0.0978926704 -0.3837210491 -0.1926720198
-0.0330032776 -0.3536732547 -0.1803398887
-0.1572237908 -0.3432190277 -0.1824256005
-0.0978926704 -0.3837210491 -0.1926720198
-0.0385615500 -0.4242230706 -0.2029184391
0.0207695704 -0.4647250921 -0.2131648583
0.0263278428 -0.3941752762 -0.1905863080
-0.0385615500 -0.4242230706 -0.2029184391
-0.1034509428 -0.4542708650 -0.2152505701
-0.1683403356 -0.4843186594 -0.2275827012
-0.0441198223 -0.4947728865 -0.2254969894
-0.1034509428 -0.4542708650 -0.2152505701
-0.1627820632 -0.4137688435 -0.2050041508
-0.2221131836 -0.3732668221 -0.1947577315
-0.2276714560 -0.4438166379 -0.2173362819
-0.1627820632 -0.4137688435 -0.2050041508
0.0687217515 -0.2982579687 -0.2617633489
0.0971650981 -0.3532858818 -0.2587945344
-0.0318268856 -0.3123534313 -0.2623839264
0.0016893268 -0.3076549438 -0.2621770673
0.1357541763 -0.2888609936 -0.2613496306
0.1306813105 -0.3485873942 -0.2585876752
0.0687217515 -0.2982579687 -0.2617633489
0.1357541763 -0.2888609936 -0.2613496306
-0.1260344405 -0.2517908931 -0.2664569481
-0.1582824364 -0.2415577805 -0.2673542962
-0.2898108530 -0.2304885304 -0.2695627105
-0.1582824364 -0.2415577805 -0.2673542962
-0.0267540198 -0.2526270307 -0.2651458818
0.1047743969 -0.2636962808 -0.2629374674
-0.0267540198 -0.2526270307 -0.2651458818
-0.0602702322 -0.2573255182 -0.2653527410
-0.2613675065 -0.2855164435 -0.2665938960
-0.2898108530 -0.2304885304 -0.2695627105
-0.1956032982 -0.2910510686 -0.2654896888
-0.1633553022 -0.3012841812 -0.2645923408
-0.3283999313 -0.2949134186 -0.2670076144
-0.3233270654 -0.2351870179 -0.2697695697
-0.2613675065 -0.2855164435 -0.2665938960
-0.3283999313 -0.2949134186 -0.2670076144
-0.0318268856 -0.3123534313 -0.2623839264
-0.0653430980 -0.3170519189 -0.2625907856
0.0971650981 -0.3532858818 -0.2587945344
-0.0343633185 -0.3422166316 -0.2610029488
-0.1658917352 -0.3311473815 -0.2632113631
-0.2974201518 -0.3200781314 -0.2654197775
-0.1658917352 -0.3311473815 -0.2632113631
-0.1323755228 -0.3264488940 -0.2630045040
-0.3625241966 -0.2777461548 -0.1214022932
-0.3610111867 -0.2441006780 -0.0428724671
-0.3607442687 -0.2647056928 -0.1620481839
-0.3574513308 -0.2180197541 -0.1241642486
-0.3620346097 -0.2403184015 0.0370383366
-0.3587416718 -0.1936324628 0.0749222720
-0.3566948258 -0.2011970157 -0.0848993355
-0.3610111867 -0.2441006780 -0.0428724671
0.1651024798 -0.2883776785 -0.0340388096
0.1694188407 -0.2454740162 -0.0760656780
0.1673719947 -0.2379094633 0.0837559295
0.1640790569 -0.2845954021 0.0458719941
0.1686623357 -0.2622967546 -0.1153305910
0.1653693979 -0.3089826934 -0.1532145264
0.1651024798 -0.2883776785 -0.0340388096
0.1635894699 -0.3220231553 -0.1125686357
0.2218391529 0.0238380788 -0.0948159591
0.2775181209 0.0492290034 -0.0953046585
0.3854941322 0.0601930843 -0.0944407459
0.2792090833 0.0691378874 -0.0962253141
0.1712330720 0.0581738065 -0.0970892267
0.2218391529 0.0238380788 -0.0948159591
0.0615660984 0.0273008415 -0.0970324836
0.1678511472 0.0183560384 -0.0952479154
0.3821122074 0.0203753162 -0.0925994346
0.4310273258 -0.0338692955 -0.0894055114
0.4377911754 0.0457662407 -0.0930881340
0.3821122074 0.0203753162 -0.0925994346
0.3264332394 -0.0050156083 -0.0921107352
0.2707542713 -0.0304065328 -0.0916220358
0.3753483578 -0.0592602200 -0.0889168120
0.3264332394 -0.0050156083 -0.0921107352
-0.0464099129 0.0163367606 -0.0978963961
-0.1526949618 0.0252815637 -0.0996809643
0.0058871303 0.0019099170 -0.0965437842
-0.0497918377 -0.0234810075 -0.0960550848
-0.2623619354 -0.0055914013 -0.0996242212
-0.3163499411 -0.0110734418 -0.1000561775
-0.1037798433 -0.0289630480 -0.0964870411
-0.1543859242 0.0053726796 -0.0987603087
0.1627782601 -0.0413706138 -0.0924859484
0.1087902544 -0.0468526542 -0.0929179047
0.3213603522 -0.0647422605 -0.0893487682
0.2707542713 -0.0304065328 -0.0916220358
0.0581841736 -0.0125169266 -0.0951911722
0.1644692225 -0.0214617297 -0.0934066040
0.0058871303 0.0019099170 -0.0965437842
0.0615660984 0.0273008415 -0.0970324836
-0.2033010426 0.0596172913 -0.1019542319
-0.2589800106 0.0342263668 -0.1014655325
-0.3669560219 0.0232622859 -0.1023294451
-0.2606709730 0.0143174828 -0.1005448769
-0.1526949618 0.0252815637 -0.0996809643
-0.2033010426 0.0596172913 -0.1019542319
-0.0430279881 0.0561545287 -0.0997377074
-0.1493130370 0.0650993318 -0.1015222756
-0.3635740971 0.0630800540 -0.1041707564
-0.4124892156 0.1173246656 -0.1073646796
-0.4192530652 0.0376891295 -0.1036820570
-0.3635740971 0.0630800540 -0.1041707564
-0.3078951291 0.0884709785 -0.1046594558
-0.2522161611 0.1138619030 -0.1051481551
-0.3568102475 0.1427155902 -0.1078533790
-0.3078951291 0.0884709785 -0.1046594558
0.0649480232 0.0671186096 -0.0988737949
0.1712330720 0.0581738065 -0.0970892267
0.0126509799 0.0815454532 -0.1002264068
0.0683299480 0.1069363777 -0.1007151062
0.2809000457 0.0890467715 -0.0971459698
0.3348880513 0.0945288119 -0.0967140135
0.1223179536 0.1124184181 -0.1002831499
0.1729240344 0.0780826905 -0.0980098823
-0.1442401498 0.1248259839 -0.1042842426
-0.0902521442 0.1303080244 -0.1038522863
-0.3028222419 0.1481976306 -0.1074214227
-0.2522161611 0.1138619030 -0.1051481551
-0.0396460633 0.0959722968 -0.1015790187
-0.1459311122 0.1049170999 -0.1033635869
0.0126509799 0.0815454532 -0.1002264068
-0.0430279881 0.0561545287 -0.0997377074
-0.3941049724 0.4613593011 0.1235709910
-0.3870023896 0.4503816799 0.0440786080
-0.4064710627 0.4416402590 -0.0358599170
-0.4135736455 0.4526178802 0.0436324660
-0.4448336820 -0.1359053090 0.1511905724
-0.4366037909 -0.1336103409 0.0710844189
-0.4549451557 -0.1290791724 -0.0094678766
-0.4631750468 -0.1313741406 0.0706382769
-0.4101064555 0.4921202683 0.0351321617
-0.4128634692 0.4761514010 0.1192931153
-0.4131138767 0.4421993090 -0.0359714525
-0.4128634692 0.4761514010 0.1192931153
-0.4119439315 0.4553142587 -0.0399147218
-0.4111290746 0.4566624480 -0.0816883157
-0.4096745778 0.4556467130 -0.1734061935
-0.4092055091 0.4539131701 -0.2100319680
-0.3826342531 0.4516769699 -0.2095858261
-0.3831033219 0.4534105128 -0.1729600516
-0.3851649136 0.4871876895 0.1191254914
-0.3835351996 0.4898840681 0.0355783036
-0.3845578186 0.4544262478 -0.0812421738
-0.3853726756 0.4530780585 -0.0394685799
-0.3862922133 0.4739152008 0.1197392572
-0.3865426208 0.4399631088 -0.0355253106
-0.4399004334 -0.1737432877 0.0662667279
-0.4392755351 -0.1498945378 0.1485863771
-0.4350167138 -0.1307563226 -0.0091332701
-0.4392755351 -0.1498945378 0.1485863771
-0.4361013809 -0.1441865014 -0.0118490008
-0.4358501759 -0.1494745816 -0.0533157107
-0.4349593311 -0.1571265862 -0.1447267044
-0.4344902624 -0.1588601290 -0.1813524790
-0.4610615183 -0.1566239288 -0.1817986209
-0.4615305871 -0.1548903859 -0.1451728464
-0.4669740993 -0.1609309269 0.1487540056
-0.4664716893 -0.1715070875 0.0658205859
-0.4624214318 -0.1472383814 -0.0537618526
-0.4626726368 -0.1419503011 -0.0122951428
-0.4658467910 -0.1476583376 0.1481402352
-0.4615879697 -0.1285201224 -0.0095794120
0.4098775476 -0.2347255521 0.1634766932
0.4103799576 -0.2453017126 0.0805432735
0.4144302151 -0.2210330066 -0.0390391650
0.4141790101 -0.2157449263 0.0024275448
0.4110048559 -0.2214529628 0.1628629228
0.4152636772 -0.2023147476 0.0051432755
0.4157901286 -0.2304185540 -0.1670759333
0.4153210599 -0.2286850111 -0.1304501588
0.4418924165 -0.2309212198 -0.1300040151
0.4423614852 -0.2326547627 -0.1666297897
0.4369513142 -0.2475379214 0.0809894171
0.4375762125 -0.2236891715 0.1633090664
0.4418350338 -0.2045509563 0.0055894192
0.4375762125 -0.2236891715 0.1633090664
0.4407503667 -0.2179811350 0.0028736884
0.4410015717 -0.2232692153 -0.0385930214
0.4916868404 0.4133931313 0.1338481772
0.4933165565 0.4160895350 0.0503009882
0.4922939322 0.3806316518 -0.0665194862
0.4914790741 0.3792834500 -0.0247458917
0.4905595364 0.4001205922 0.1344619453
0.4903091269 0.3661684751 -0.0208026213
0.4942174987 0.3778823865 -0.1948631391
0.4937484300 0.3796159294 -0.1582373646
0.4671770734 0.3818521381 -0.1586835082
0.4676461421 0.3801185952 -0.1953092828
0.4667451999 0.4183257437 0.0498548446
0.4639881798 0.4023568010 0.1340158017
0.4637377702 0.3684046839 -0.0212487649
0.4639881798 0.4023568010 0.1340158017
0.4649077175 0.3815196587 -0.0251920354
0.4657225756 0.3828678605 -0.0669656299
0.4402479567 -0.2074049745 0.0858071081
0.4187323622 -0.2085818362 0.1656901894
0.4136766001 -0.2051687658 0.0853609645
0.4351921947 -0.2039919041 0.0054778833
0.4827467500 0.3875646696 0.1382936799
0.4898493580 0.3765870463 0.0588012972
0.4703806094 0.3678456317 -0.0211372290
0.4632780014 0.3788232550 0.0583551536
-0.2031304780 0.0589869338 -0.1152722366
-0.2537365589 0.0933226614 -0.1175455041
-0.3583306454 0.1221763486 -0.1202507280
-0.2520455965 0.1132315455 -0.1184661598
-0.1474515100 0.0843778583 -0.1157609359
-0.2031304780 0.0589869338 -0.1152722366
-0.0445483859 0.0356152871 -0.1121350564
-0.1508334348 0.0445600902 -0.1139196246
-0.3617125702 0.0823585805 -0.1184094167
-0.4190825006 0.0370587719 -0.1170000616
-0.4123186510 0.1166943081 -0.1206826843
-0.3617125702 0.0823585805 -0.1184094167
-0.3111064893 0.0480228529 -0.1161361491
-0.2605004085 0.0136871252 -0.1138628815
-0.3684764197 0.0027230443 -0.1147267941
-0.3111064893 0.0480228529 -0.1161361491
0.0600457006 0.0067615999 -0.1094298326
0.1663307494 -0.0021832032 -0.1076452644
0.0060576949 0.0012795595 -0.1098617888
0.0566637758 -0.0330561682 -0.1075885212
0.2692338735 -0.0509457744 -0.1040193848
0.3215309167 -0.0653726180 -0.1026667729
0.1089608190 -0.0474830117 -0.1062359093
0.1646397870 -0.0220920872 -0.1067246087
-0.1559063220 -0.0151665619 -0.1111576576
-0.1036092788 -0.0295934055 -0.1098050457
-0.3161793765 -0.0117037993 -0.1133741821
-0.2605004085 0.0136871252 -0.1138628815
-0.0479303107 -0.0042024810 -0.1102937451
-0.1542153596 0.0047423221 -0.1120783133
0.0060576949 0.0012795595 -0.1098617888
-0.0445483859 0.0356152871 -0.1121350564
0.2220097175 0.0232077213 -0.1081339637
0.2726157983 -0.0111280063 -0.1058606961
0.3772098848 -0.0399816935 -0.1031554723
0.2709248359 -0.0310368903 -0.1049400405
0.1663307494 -0.0021832032 -0.1076452644
0.2220097175 0.0232077213 -0.1081339637
0.0634276253 0.0465793680 -0.1112711439
0.1697126742 0.0376345649 -0.1094865757
0.3805918096 -0.0001639254 -0.1049967836
0.4379617400 0.0451358832 -0.1064061386
0.4311978904 -0.0344996530 -0.1027235160
0.3805918096 -0.0001639254 -0.1049967836
0.3299857287 0.0341718023 -0.1072700512
0.2793796479 0.0685075299 -0.1095433188
0.3873556592 0.0794716108 -0.1086794062
0.3299857287 0.0341718023 -0.1072700512
-0.0411664611 0.0754330552 -0.1139763677
-0.1474515100 0.0843778583 -0.1157609359
0.0128215445 0.0809150957 -0.1135444115
-0.0377845363 0.1152508233 -0.1158176790
-0.2503546341 0.1331404295 -0.1193868155
-0.3026516773 0.1475672731 -0.1207394274
-0.0900815796 0.1296776669 -0.1171702910
-0.1457605476 0.1042867424 -0.1166815916
0.1747855614 0.0973612171 -0.1122485426
0.1224885182 0.1117880606 -0.1136011546
0.3350586159 0.0938984544 -0.1100320182
0.2793796479 0.0685075299 -0.1095433188
0.0668095501 0.0863971361 -0.1131124552
0.1730945990 0.0774523330 -0.1113278870
0.0128215445 0.0809150957 -0.1135444115
0.0634276253 0.0465793680 -0.1112711439
0.3414306553 -0.2205830358 0.3254743269
0.1022894527 -0.2004572421 0.3214590511
0.4003352531 -0.2359836161 0.3269576504
0.3400215307 -0.2371736468 0.3262415342
-0.1375563123 -0.1886267538 0.3178273789
-0.2581837571 -0.1910068151 0.3163951464
0.2200986482 -0.2312584027 0.3244256981
0.1015848904 -0.2087525475 0.3218426547
-0.3766975149 -0.1685009600 0.3138121031
-0.1375563123 -0.1886267538 0.3178273789
-0.4356021127 -0.1531003797 0.3123287796
-0.3752883903 -0.1519103490 0.3130448959
0.1029940150 -0.1921619366 0.3210754475
0.2229168975 -0.1980771807 0.3228912836
-0.2553655078 -0.1578255932 0.3148607320
-0.1368517499 -0.1803314483 0.3174437753
0.1090677119 -0.2473060647 -0.3170601717
0.2282860320 -0.2615166143 -0.3148607320
-0.2499963732 -0.2212650268 -0.3228912836
-0.1293689284 -0.2188849654 -0.3214590511
0.3489134768 -0.2591365530 -0.3134284995
0.1097722742 -0.2390107592 -0.3174437753
0.4095794804 -0.2537988696 -0.3129041850
0.3503226015 -0.2425459420 -0.3141957067
-0.1286643661 -0.2105896599 -0.3218426547
-0.2471781239 -0.1880838048 -0.3244256981
0.2311042813 -0.2283353924 -0.3163951464
0.1104768365 -0.2307154537 -0.3178273789
-0.3678055687 -0.1904638662 -0.3258579306
-0.1286643661 -0.2105896599 -0.3218426547
-0.4284715723 -0.1958015496 -0.3263822450
-0.3692146934 -0.2070544771 -0.3250907233
0.2850010638 -0.2552012334 -0.0741245017
0.2247040516 -0.2482786467 -0.0351729188
0.2257274746 -0.2520609232 -0.1150837226
0.2850010638 -0.2552012334 -0.0741245017
0.3442746529 -0.2583415436 -0.0331652809
0.4035482421 -0.2614818538 0.0077939399
0.2839776408 -0.2514189569 0.0057863020
0.3442746529 -0.2583415436 -0.0331652809
0.1051334503 -0.2382157498 -0.0371805567
0.1644070395 -0.2413560600 0.0037786641
0.0448364381 -0.2312931631 0.0017710262
0.1051334503 -0.2382157498 -0.0371805567
0.1654304624 -0.2451383365 -0.0761321397
0.2257274746 -0.2520609232 -0.1150837226
0.2247040516 -0.2482786467 -0.0351729188
0.1654304624 -0.2451383365 -0.0761321397
0.3463214989 -0.2659060965 -0.1929868884
0.4055950881 -0.2690464067 -0.1520276676
0.2860244867 -0.2589835098 -0.1540353055
0.3463214989 -0.2659060965 -0.1929868884
0.4066185110 -0.2728286832 -0.2319384713
0.4669155232 -0.2797512698 -0.2708900543
0.4658921002 -0.2759689934 -0.1909792505
0.4066185110 -0.2728286832 -0.2319384713
0.4045716651 -0.2652641303 -0.0721168638
0.4648686772 -0.2721867169 -0.1110684468
0.4638452542 -0.2684044405 -0.0311576430
0.4045716651 -0.2652641303 -0.0721168638
0.3452980759 -0.2621238200 -0.1130760847
0.2860244867 -0.2589835098 -0.1540353055
0.4055950881 -0.2690464067 -0.1520276676
0.3452980759 -0.2621238200 -0.1130760847
0.3422278070 -0.2507769907 0.1266563266
0.4015013961 -0.2539173009 0.1676155474
0.2819307948 -0.2438544040 0.1656079095
0.3422278070 -0.2507769907 0.1266563266
0.4025248191 -0.2576995774 0.0877047437
0.4628218313 -0.2646221640 0.0487531607
0.4617984083 -0.2608398876 0.1286639645
0.4025248191 -0.2576995774 0.0877047437
0.4004779732 -0.2501350244 0.2475263512
0.4607749853 -0.2570576111 0.2085747683
0.4597515623 -0.2532753347 0.2884855720
0.4004779732 -0.2501350244 0.2475263512
0.3412043840 -0.2469947142 0.2065671303
0.2819307948 -0.2438544040 0.1656079095
0.4015013961 -0.2539173009 0.1676155474
0.3412043840 -0.2469947142 0.2065671303
0.1633836165 -0.2375737836 0.0836894679
0.2236806286 -0.2444963703 0.0447378849
0.2226572056 -0.2407140938 0.1246486887
0.1633836165 -0.2375737836 0.0836894679
0.1041100273 -0.2344334734 0.0427302470
0.0448364381 -0.2312931631 0.0017710262
0.1644070395 -0.2413560600 0.0037786641
0.1041100273 -0.2344334734 0.0427302470
0.3432512299 -0.2545592671 0.0467455228
0.2839776408 -0.2514189569 0.0057863020
0.4035482421 -0.2614818538 0.0077939399
0.3432512299 -0.2545592671 0.0467455228
0.2829542178 -0.2476366805 0.0856971058
0.2226572056 -0.2407140938 0.1246486887
0.2236806286 -0.2444963703 0.0447378849
0.2829542178 -0.2476366805 0.0856971058
-0.1319609064 -0.2256545090 -0.2010174401
-0.0726873172 -0.2287948192 -0.1600582192
-0.1922579185 -0.2187319223 -0.1620658571
-0.1319609064 -0.2256545090 -0.2010174401
-0.0716638942 -0.2325770956 -0.2399690230
-0.0113668821 -0.2394996823 -0.2789206059
-0.0123903051 -0.2357174058 -0.1990098022
-0.0716638942 -0.2325770956 -0.2399690230
-0.0737107402 -0.2250125427 -0.0801474155
-0.0134137281 -0.2319351294 -0.1190989984
-0.0144371510 -0.2281528529 -0.0391881946
-0.0737107402 -0.2250125427 -0.0801474155
-0.1329843294 -0.2218722325 -0.1211066363
-0.1922579185 -0.2187319223 -0.1620658571
-0.0726873172 -0.2287948192 -0.1600582192
-0.1329843294 -0.2218722325 -0.1211066363
-0.3108050969 -0.2124513019 -0.2439842988
-0.2505080847 -0.2193738885 -0.2829358817
-0.2515315077 -0.2155916121 -0.2030250780
-0.3108050969 -0.2124513019 -0.2439842988
-0.3700786860 -0.2093109916 -0.2849435196
-0.4293522752 -0.2061706814 -0.3259027405
-0.3097816739 -0.2162335783 -0.3238951026
-0.3700786860 -0.2093109916 -0.2849435196
-0.1309374834 -0.2294367854 -0.2809282438
-0.1902110726 -0.2262964752 -0.3218874646
-0.0706404713 -0.2363593721 -0.3198798267
-0.1309374834 -0.2294367854 -0.2809282438
-0.1912344956 -0.2225141987 -0.2419766609
-0.2515315077 -0.2155916121 -0.2030250780
-0.2505080847 -0.2193738885 -0.2829358817
-0.1912344956 -0.2225141987 -0.2419766609
0.1674773084 -0.2527028894 -0.2359537472
0.2277743205 -0.2596254761 -0.2749053301
0.2267508976 -0.2558431996 -0.1949945263
0.1674773084 -0.2527028894 -0.2359537472
0.1082037192 -0.2495625792 -0.2769129680
0.0489301301 -0.2464222690 -0.3178721888
0.1685007314 -0.2564851659 -0.3158645509
0.1082037192 -0.2495625792 -0.2769129680
0.3473449219 -0.2696883730 -0.2728976922
0.2880713327 -0.2665480627 -0.3138569130
0.4076419340 -0.2766109596 -0.3118492751
0.3473449219 -0.2696883730 -0.2728976922
0.2870479097 -0.2627657863 -0.2339461093
0.2267508976 -0.2558431996 -0.1949945263
0.2277743205 -0.2596254761 -0.2749053301
0.2870479097 -0.2627657863 -0.2339461093
0.1061568733 -0.2419980263 -0.1170913605
0.0468832841 -0.2388577161 -0.1580505813
0.1664538854 -0.2489206129 -0.1560429434
0.1061568733 -0.2419980263 -0.1170913605
0.0458598611 -0.2350754396 -0.0781397776
-0.0144371510 -0.2281528529 -0.0391881946
-0.0134137281 -0.2319351294 -0.1190989984
0.0458598611 -0.2350754396 -0.0781397776
0.0479067071 -0.2426399925 -0.2379613851
-0.0123903051 -0.2357174058 -0.1990098022
-0.0113668821 -0.2394996823 -0.2789206059
0.0479067071 -0.2426399925 -0.2379613851
0.1071802962 -0.2457803027 -0.1970021642
0.1664538854 -0.2489206129 -0.1560429434
0.0468832841 -0.2388577161 -0.1580505813
0.1071802962 -0.2457803027 -0.1970021642
-0.3148987888 -0.1973221960 0.0756589162
-0.2546017766 -0.2042447827 0.0367073333
-0.2556251996 -0.2004625063 0.1166181370
-0.3148987888 -0.1973221960 0.0756589162
-0.3741723780 -0.1941818858 0.0346996954
-0.4334459671 -0.1910415756 -0.0062595254
-0.3138753658 -0.2011044725 -0.0042518875
-0.3741723780 -0.1941818858 0.0346996954
-0.1350311753 -0.2143076796 0.0387149712
-0.1943047645 -0.2111673694 -0.0022442496
-0.0747341632 -0.2212302663 -0.0002366117
-0.1350311753 -0.2143076796 0.0387149712
-0.1953281875 -0.2073850929 0.0776665541
-0.2556251996 -0.2004625063 0.1166181370
-0.2546017766 -0.2042447827 0.0367073333
-0.1953281875 -0.2073850929 0.0776665541
-0.3762192239 -0.1866173329 0.1945213029
-0.4354928131 -0.1834770227 0.1535620821
-0.3159222118 -0.1935399196 0.1555697200
-0.3762192239 -0.1866173329 0.1945213029
-0.4365162361 -0.1796947462 0.2334728858
-0.4968132482 -0.1727721596 0.2724244687
-0.4957898252 -0.1765544360 0.1925136650
-0.4365162361 -0.1796947462 0.2334728858
-0.4344693901 -0.1872592991 0.0736512783
-0.4947664023 -0.1803367125 0.1126028612
-0.4937429793 -0.1841189889 0.0326920575
-0.4344693901 -0.1872592991 0.0736512783
-0.3751958009 -0.1903996094 0.1146104991
-0.3159222118 -0.1935399196 0.1555697200
-0.4354928131 -0.1834770227 0.1535620821
-0.3751958009 -0.1903996094 0.1146104991
-0.3721255320 -0.2017464387 -0.1251219121
-0.4313991212 -0.1986061285 -0.1660811330
-0.3118285199 -0.2086690254 -0.1640734950
-0.3721255320 -0.2017464387 -0.1251219121
-0.4324225442 -0.1948238521 -0.0861703292
-0.4927195563 -0.1879012654 -0.0472187463
-0.4916961333 -0.1916835418 -0.1271295500
-0.4324225442 -0.1948238521 -0.0861703292
-0.4303756982 -0.2023884050 -0.2459919367
-0.4906727103 -0.1954658183 -0.2070403538
-0.4896492874 -0.1992480948 -0.2869511575
-0.4303756982 -0.2023884050 -0.2459919367
-0.3711021090 -0.2055287152 -0.2050327159
-0.3118285199 -0.2086690254 -0.1640734950
-0.4313991212 -0.1986061285 -0.1660811330
-0.3711021090 -0.2055287152 -0.2050327159
-0.1932813415 -0.2149496458 -0.0821550534
-0.2535783537 -0.2080270592 -0.0432034705
-0.2525549307 -0.2118093356 -0.1231142742
-0.1932813415 -0.2149496458 -0.0821550534
-0.1340077523 -0.2180899560 -0.0411958326
-0.0747341632 -0.2212302663 -0.0002366117
-0.1943047645 -0.2111673694 -0.0022442496
-0.1340077523 -0.2180899560 -0.0411958326
-0.3731489550 -0.1979641623 -0.0452111084
-0.3138753658 -0.2011044725 -0.0042518875
-0.4334459671 -0.1910415756 -0.0062595254
-0.3731489550 -0.1979641623 -0.0452111084
-0.3128519428 -0.2048867489 -0.0841626913
-0.2525549307 -0.2118093356 -0.1231142742
-0.2535783537 -0.2080270592 -0.0432034705
-0.3128519428 -0.2048867489 -0.0841626913
0.1020631814 -0.2268689205 0.2025518545
0.0427895922 -0.2237286102 0.1615926337
0.1623601935 -0.2337915071 0.1636002716
0.1020631814 -0.2268689205 0.2025518545
0.0417661692 -0.2199463338 0.2415034374
-0.0185308429 -0.2130237471 0.2804550204
-0.0175074200 -0.2168060236 0.2005442166
0.0417661692 -0.2199463338 0.2415034374
0.0438130152 -0.2275108867 0.0816818299
-0.0164839970 -0.2205883000 0.1206334129
-0.0154605740 -0.2243705765 0.0407226091
0.0438130152 -0.2275108867 0.0816818299
0.1030866043 -0.2306511969 0.1226410508
0.1623601935 -0.2337915071 0.1636002716
0.0427895922 -0.2237286102 0.1615926337
0.1030866043 -0.2306511969 0.1226410508
0.2809073718 -0.2400721276 0.2455187133
0.2206103597 -0.2331495409 0.2844702962
0.2216337827 -0.2369318173 0.2045594924
0.2809073718 -0.2400721276 0.2455187133
0.3401809610 -0.2432124378 0.2864779341
0.3994545502 -0.2463527480 0.3274371549
0.2798839489 -0.2362898511 0.3254295170
0.3401809610 -0.2432124378 0.2864779341
0.1010397584 -0.2230866440 0.2824626583
0.1603133475 -0.2262269542 0.3234218791
0.0407427462 -0.2161640573 0.3214142412
0.1010397584 -0.2230866440 0.2824626583
0.1613367705 -0.2300092307 0.2435110754
0.2216337827 -0.2369318173 0.2045594924
0.2206103597 -0.2331495409 0.2844702962
0.1613367705 -0.2300092307 0.2435110754
-0.1973750334 -0.1998205400 0.2374881616
-0.2576720456 -0.1928979533 0.2764397446
-0.2566486226 -0.1966802298 0.1965289408
-0.1973750334 -0.1998205400 0.2374881616
-0.1381014443 -0.2029608502 0.2784473825
-0.0788278551 -0.2061011604 0.3194066033
-0.1983984564 -0.1960382636 0.3173989654
-0.1381014443 -0.2029608502 0.2784473825
-0.3772426469 -0.1828350565 0.2744321066
-0.3179690577 -0.1859753667 0.3153913275
-0.4375396591 -0.1759124698 0.3133836896
-0.3772426469 -0.1828350565 0.2744321066
-0.3169456348 -0.1897576431 0.2354805237
-0.2566486226 -0.1966802298 0.1965289408
-0.2576720456 -0.1928979533 0.2764397446
-0.3169456348 -0.1897576431 0.2354805237
-0.1360545983 -0.2105254031 0.1186257750
-0.0767810091 -0.2136657134 0.1595849958
-0.1963516105 -0.2036028165 0.1575773579
-0.1360545983 -0.2105254031 0.1186257750
-0.0757575862 -0.2174479898 0.0796741920
-0.0154605740 -0.2243705765 0.0407226091
-0.0164839970 -0.2205883000 0.1206334129
-0.0757575862 -0.2174479898 0.0796741920
-0.0778044321 -0.2098834369 0.2394957995
-0.0175074200 -0.2168060236 0.2005442166
-0.0185308429 -0.2130237471 0.2804550204
-0.0778044321 -0.2098834369 0.2394957995
-0.1370780213 -0.2067431267 0.1985365787
-0.1963516105 -0.2036028165 0.1575773579
-0.0767810091 -0.2136657134 0.1595849958
-0.1370780213 -0.2067431267 0.1985365787
3 94 93 2
3 2 3 94
3 7 0 1
3 1 92 7
3 97 930 92
3 8 930 97
3 8 7 92
3 416 931 240
3 96 931 416
3 416 932 90
3 240 932 416
3 417 933 96
3 240 933 417
3 95 934 96
3 417 934 95
3 418 935 241
3 89 935 418
3 418 936 95
3 241 936 418
3 419 937 89
3 241 937 419
3 90 938 89
3 419 938 90
3 420 939 242
3 54 939 420
3 420 940 84
3 242 940 420
3 421 941 54
3 242 941 421
3 55 942 54
3 421 942 55
3 422 943 243
3 91 943 422
3 422 944 55
3 243 944 422
3 423 945 91
3 243 945 423
3 84 946 91
3 423 946 84
3 726 947 244
3 30 947 726
3 726 948 86
3 244 948 726
3 727 949 30
3 244 949 727
3 29 950 30
3 727 950 29
3 728 951 245
3 85 951 728
3 728 952 29
3 245 952 728
3 729 953 85
3 245 953 729
3 86 954 85
3 729 954 86
3 730 955 246
3 35 955 730
3 730 956 88
3 246 956 730
3 731 957 35
3 246 957 731
3 33 958 35
3 731 958 33
3 732 959 247
3 87 959 732
3 732 960 33
3 247 960 732
3 733 961 87
3 247 961 733
3 88 962 87
3 733 962 88
3 424 734 248
3 34 734 424
3 424 735 6
3 248 735 424
3 425 736 34
3 248 736 425
3 32 737 34
3 425 737 32
3 426 738 249
3 5 738 426
3 426 739 32
3 249 739 426
3 5 740 427
3 6 740 5
3 427 741 249
3 6 741 427
3 428 963 250
3 116 963 428
3 428 964 34
3 250 964 428
3 429 965 250
3 6 965 429
3 429 966 116
3 250 966 429
3 430 967 251
3 116 967 430
3 430 968 31
3 251 968 430
3 431 969 251
3 34 969 431
3 431 970 116
3 251 970 431
3 432 971 252
3 117 971 432
3 432 972 4
3 252 972 432
3 433 973 252
3 31 973 433
3 433 974 117
3 252 974 433
3 434 975 253
3 117 975 434
3 434 976 6
3 253 976 434
3 435 977 253
3 4 977 435
3 435 978 117
3 253 978 435
3 254 979 119
3 742 979 254
3 742 980 80
3 254 980 742
3 743 981 254
3 118 981 743
3 119 982 254
3 743 982 119
3 744 983 255
3 83 983 744
3 744 984 80
3 255 984 744
3 745 985 255
3 119 985 745
3 745 986 83
3 255 986 745
3 118 987 746
3 120 987 118
3 746 988 256
3 120 988 746
3 747 989 256
3 14 989 747
3 747 990 120
3 256 990 747
3 748 991 257
3 120 991 748
3 748 992 83
3 257 992 748
3 749 993 120
3 257 993 749
3 118 994 120
3 749 994 118
3 258 995 122
3 750 995 258
3 750 996 14
3 258 996 750
3 258 997 751
3 122 997 258
3 751 998 121
3 122 998 751
3 752 999 259
3 11 999 752
3 752 1000 14
3 259 1000 752
3 753 1001 259
3 122 1001 753
3 753 1002 11
3 259 1002 753
3 754 1003 121
3 260 1003 754
3 123 1004 121
3 754 1004 123
3 755 1005 260
3 80 1005 755
3 755 1006 123
3 260 1006 755
3 756 1007 261
3 123 1007 756
3 756 1008 11
3 261 1008 756
3 757 1009 123
3 261 1009 757
3 121 1010 123
3 757 1010 121
3 436 758 10
3 12 758 436
3 436 759 11
3 10 759 436
3 437 760 14
3 11 760 437
3 437 761 12
3 14 761 437
3 9 762 13
3 438 762 9
3 438 763 10
3 9 763 438
3 439 1011 262
3 10 1011 439
3 439 1012 124
3 262 1012 439
3 440 1013 12
3 10 1013 440
3 440 1014 262
3 12 1014 440
3 263 1015 124
3 441 1015 263
3 441 1016 13
3 263 1016 441
3 442 1017 263
3 12 1017 442
3 263 1018 442
3 124 1018 263
3 443 764 78
3 79 764 443
3 78 765 443
3 82 765 78
3 264 1019 125
3 444 1019 264
3 444 1020 81
3 264 1020 444
3 445 1021 264
3 82 1021 445
3 264 1022 445
3 125 1022 264
3 446 1023 81
3 265 1023 446
3 446 1024 79
3 81 1024 446
3 447 1025 265
3 125 1025 447
3 447 1026 79
3 265 1026 447
3 448 766 79
3 80 766 448
3 448 767 81
3 79 767 448
3 449 768 83
3 81 768 449
3 449 769 80
3 83 769 449
3 126 770 450
3 127 770 126
3 450 771 79
3 127 771 450
3 451 772 127
3 10 772 451
3 127 773 451
3 126 773 127
3 452 774 128
3 79 774 452
3 128 775 452
3 126 775 128
3 453 776 80
3 79 776 453
3 453 777 128
3 80 777 453
3 129 778 454
3 130 778 129
3 454 779 11
3 130 779 454
3 455 780 130
3 80 780 455
3 130 781 455
3 129 781 130
3 456 782 131
3 11 782 456
3 131 783 456
3 129 783 131
3 457 784 10
3 11 784 457
3 457 785 131
3 10 785 457
3 458 786 266
3 134 786 458
3 458 787 133
3 266 787 458
3 459 788 266
3 132 788 459
3 459 789 134
3 266 789 459
3 460 790 267
3 134 790 460
3 460 791 78
3 267 791 460
3 461 792 267
3 133 792 461
3 461 793 134
3 267 793 461
3 462 794 268
3 135 794 462
3 462 795 133
3 268 795 462
3 463 796 268
3 9 796 463
3 463 797 135
3 268 797 463
3 464 798 269
3 135 798 464
3 464 799 132
3 269 799 464
3 465 800 269
3 133 800 465
3 465 801 135
3 269 801 465
3 466 802 270
3 137 802 466
3 466 803 136
3 270 803 466
3 467 804 270
3 132 804 467
3 467 805 137
3 270 805 467
3 468 806 271
3 137 806 468
3 468 807 79
3 271 807 468
3 469 808 271
3 136 808 469
3 469 809 137
3 271 809 469
3 470 810 272
3 138 810 470
3 470 811 136
3 272 811 470
3 471 812 272
3 78 812 471
3 471 813 138
3 272 813 471
3 472 814 273
3 138 814 472
3 472 815 132
3 273 815 472
3 473 816 273
3 136 816 473
3 473 817 138
3 273 817 473
3 474 818 274
3 141 818 474
3 474 819 140
3 274 819 474
3 475 820 274
3 139 820 475
3 475 821 141
3 274 821 475
3 476 822 275
3 141 822 476
3 476 823 10
3 275 823 476
3 477 824 275
3 140 824 477
3 477 825 141
3 275 825 477
3 478 826 276
3 142 826 478
3 478 827 140
3 276 827 478
3 479 828 276
3 79 828 479
3 479 829 142
3 276 829 479
3 480 830 277
3 142 830 480
3 480 831 139
3 277 831 480
3 481 832 277
3 140 832 481
3 481 833 142
3 277 833 481
3 482 834 278
3 144 834 482
3 482 835 143
3 278 835 482
3 483 836 278
3 139 836 483
3 483 837 144
3 278 837 483
3 484 838 279
3 144 838 484
3 484 839 9
3 279 839 484
3 485 840 279
3 143 840 485
3 485 841 144
3 279 841 485
3 486 842 280
3 145 842 486
3 486 843 143
3 280 843 486
3 487 844 280
3 10 844 487
3 487 845 145
3 280 845 487
3 488 846 281
3 145 846 488
3 488 847 139
3 281 847 488
3 489 848 281
3 143 848 489
3 489 849 145
3 281 849 489
3 490 850 282
3 82 850 490
3 490 851 13
3 282 851 490
3 491 852 82
3 282 852 491
3 78 853 82
3 491 853 78
3 492 854 283
3 9 854 492
3 492 855 78
3 283 855 492
3 493 856 9
3 283 856 493
3 13 857 9
3 493 857 13
3 494 1027 148
3 147 1027 494
3 494 1028 284
3 148 1028 494
3 495 1029 284
3 103 1029 495
3 284 1030 495
3 148 1030 284
3 496 1031 148
3 285 1031 496
3 496 1032 147
3 148 1032 496
3 285 1033 146
3 497 1033 285
3 497 1034 147
3 285 1034 497
3 498 1035 286
3 149 1035 498
3 498 1036 109
3 286 1036 498
3 499 1037 286
3 103 1037 499
3 499 1038 149
3 286 1038 499
3 500 1039 287
3 149 1039 500
3 500 1040 147
3 287 1040 500
3 501 1041 287
3 109 1041 501
3 501 1042 149
3 287 1042 501
3 502 1043 288
3 146 1043 502
3 288 1044 502
3 151 1044 288
3 503 1045 150
3 146 1045 503
3 503 1046 288
3 150 1046 503
3 151 1047 504
3 289 1047 151
3 504 1048 71
3 289 1048 504
3 505 1049 289
3 150 1049 505
3 289 1050 505
3 151 1050 289
3 152 1051 506
3 290 1051 152
3 506 1052 150
3 290 1052 506
3 507 1053 290
3 109 1053 507
3 290 1054 507
3 152 1054 290
3 508 1055 291
3 150 1055 508
3 291 1056 508
3 152 1056 291
3 509 1057 146
3 150 1057 509
3 509 1058 291
3 146 1058 509
3 510 1059 155
3 154 1059 510
3 510 1060 292
3 155 1060 510
3 511 1061 292
3 71 1061 511
3 292 1062 511
3 155 1062 292
3 512 1063 155
3 293 1063 512
3 512 1064 154
3 155 1064 512
3 293 1065 153
3 513 1065 293
3 513 1066 154
3 293 1066 513
3 514 1067 294
3 156 1067 514
3 514 1068 62
3 294 1068 514
3 515 1069 294
3 71 1069 515
3 515 1070 156
3 294 1070 515
3 516 1071 295
3 156 1071 516
3 516 1072 154
3 295 1072 516
3 517 1073 295
3 62 1073 517
3 517 1074 156
3 295 1074 517
3 518 1075 296
3 153 1075 518
3 296 1076 518
3 158 1076 296
3 519 1077 157
3 153 1077 519
3 519 1078 296
3 157 1078 519
3 158 1079 520
3 297 1079 158
3 520 1080 103
3 297 1080 520
3 521 1081 297
3 157 1081 521
3 297 1082 521
3 158 1082 297
3 159 1083 522
3 298 1083 159
3 522 1084 157
3 298 1084 522
3 523 1085 298
3 62 1085 523
3 298 1086 523
3 159 1086 298
3 524 1087 299
3 157 1087 524
3 299 1088 524
3 159 1088 299
3 525 1089 153
3 157 1089 525
3 525 1090 299
3 153 1090 525
3 42 64 69
3 69 47 42
3 70 66 44
3 44 48 70
3 45 67 73
3 73 49 45
3 47 1091 526
3 69 1091 47
3 526 1092 76
3 69 1092 526
3 76 1093 527
3 52 1093 76
3 527 1094 47
3 52 1094 527
3 48 53 77
3 77 70 48
3 52 858 300
3 76 858 52
3 300 859 60
3 76 859 300
3 60 860 301
3 40 860 60
3 301 861 52
3 40 861 301
3 45 1095 528
3 67 1095 45
3 528 1096 60
3 67 1096 528
3 60 1097 529
3 40 1097 60
3 529 1098 45
3 40 1098 529
3 61 41 46
3 46 68 61
3 302 862 77
3 61 862 302
3 77 863 302
3 53 863 77
3 303 864 41
3 53 864 303
3 41 865 303
3 61 865 41
3 530 1099 42
3 43 1099 530
3 42 1100 530
3 47 1100 42
3 304 1101 52
3 531 1101 304
3 531 1102 47
3 304 1102 531
3 532 1103 52
3 304 1103 532
3 43 1104 52
3 532 1104 43
3 43 1105 866
3 53 1105 43
3 866 1106 44
3 53 1106 866
3 53 48 44
3 43 52 53
3 77 76 65
3 867 1107 77
3 66 1107 867
3 65 1108 77
3 867 1108 65
3 66 70 77
3 69 1109 533
3 64 1109 69
3 533 1110 65
3 64 1110 533
3 65 1111 534
3 76 1111 65
3 534 1112 305
3 76 1112 534
3 535 1113 305
3 69 1113 535
3 305 1114 535
3 76 1114 305
3 52 868 53
3 306 868 52
3 306 869 40
3 52 869 306
3 40 870 307
3 41 870 40
3 307 871 53
3 41 871 307
3 308 872 76
3 60 872 308
3 76 873 308
3 77 873 76
3 309 874 61
3 77 874 309
3 61 875 309
3 60 875 61
3 536 1115 73
3 74 1115 536
3 73 1116 536
3 67 1116 73
3 310 1117 60
3 537 1117 310
3 537 1118 67
3 310 1118 537
3 538 1119 60
3 310 1119 538
3 74 1120 60
3 538 1120 74
3 74 1121 876
3 61 1121 74
3 876 1122 75
3 61 1122 876
3 61 68 75
3 74 60 61
3 41 40 50
3 877 1123 41
3 51 1123 877
3 50 1124 41
3 877 1124 50
3 51 46 41
3 45 1125 539
3 49 1125 45
3 539 1126 50
3 49 1126 539
3 50 1127 540
3 40 1127 50
3 540 1128 311
3 40 1128 540
3 541 1129 311
3 45 1129 541
3 311 1130 541
3 40 1130 311
3 105 1131 542
3 111 1131 105
3 542 1132 112
3 111 1132 542
3 112 1133 543
3 98 1133 112
3 543 1134 312
3 98 1134 543
3 544 1135 312
3 105 1135 544
3 312 1136 544
3 98 1136 312
3 878 1137 99
3 113 1137 878
3 112 1138 99
3 878 1138 112
3 113 106 99
3 99 98 112
3 25 15 16
3 25 1139 879
3 16 1139 25
3 879 1140 26
3 16 1140 879
3 16 21 26
3 545 1141 24
3 25 1141 545
3 24 1142 545
3 20 1142 24
3 313 1143 15
3 546 1143 313
3 546 1144 20
3 313 1144 546
3 547 1145 15
3 313 1145 547
3 25 1146 15
3 547 1146 25
3 314 880 27
3 15 880 314
3 27 881 314
3 28 881 27
3 315 882 16
3 28 882 315
3 16 883 315
3 15 883 16
3 114 884 115
3 316 884 114
3 316 885 98
3 114 885 316
3 98 886 317
3 99 886 98
3 317 887 115
3 99 887 317
3 22 1147 548
3 17 1147 22
3 548 1148 18
3 17 1148 548
3 18 1149 549
3 27 1149 18
3 549 1150 318
3 27 1150 549
3 550 1151 318
3 22 1151 550
3 318 1152 550
3 27 1152 318
3 888 1153 28
3 19 1153 888
3 18 1154 28
3 888 1154 18
3 19 23 28
3 28 27 18
3 101 114 115
3 101 1155 889
3 115 1155 101
3 889 1156 102
3 115 1156 889
3 115 108 102
3 551 1157 100
3 101 1157 551
3 100 1158 551
3 107 1158 100
3 319 1159 114
3 552 1159 319
3 552 1160 107
3 319 1160 552
3 553 1161 114
3 319 1161 553
3 101 1162 114
3 553 1162 101
3 320 890 28
3 16 890 320
3 28 891 320
3 115 891 28
3 321 892 99
3 115 892 321
3 99 893 321
3 16 893 99
3 16 99 106
3 106 21 16
3 554 1163 20
3 15 1163 554
3 20 1164 554
3 105 1164 20
3 555 1165 98
3 105 1165 555
3 98 1166 555
3 15 1166 98
3 114 894 322
3 27 894 114
3 322 895 15
3 27 895 322
3 15 896 323
3 98 896 15
3 323 897 114
3 98 897 323
3 108 115 28
3 28 23 108
3 107 1167 556
3 22 1167 107
3 556 1168 27
3 22 1168 556
3 27 1169 557
3 114 1169 27
3 557 1170 107
3 114 1170 557
3 105 20 24
3 24 111 105
3 23 19 102
3 102 108 23
3 100 17 22
3 22 107 100
3 558 1171 162
3 161 1171 558
3 558 1172 324
3 162 1172 558
3 559 1173 324
3 63 1173 559
3 324 1174 559
3 162 1174 324
3 560 1175 162
3 325 1175 560
3 560 1176 161
3 162 1176 560
3 325 1177 160
3 561 1177 325
3 561 1178 161
3 325 1178 561
3 562 1179 326
3 163 1179 562
3 562 1180 72
3 326 1180 562
3 563 1181 326
3 63 1181 563
3 563 1182 163
3 326 1182 563
3 564 1183 327
3 163 1183 564
3 564 1184 161
3 327 1184 564
3 565 1185 327
3 72 1185 565
3 565 1186 163
3 327 1186 565
3 566 1187 328
3 160 1187 566
3 328 1188 566
3 165 1188 328
3 567 1189 164
3 160 1189 567
3 567 1190 328
3 164 1190 567
3 165 1191 568
3 329 1191 165
3 568 1192 110
3 329 1192 568
3 569 1193 329
3 164 1193 569
3 329 1194 569
3 165 1194 329
3 166 1195 570
3 330 1195 166
3 570 1196 164
3 330 1196 570
3 571 1197 330
3 72 1197 571
3 330 1198 571
3 166 1198 330
3 572 1199 331
3 164 1199 572
3 331 1200 572
3 166 1200 331
3 573 1201 160
3 164 1201 573
3 573 1202 331
3 160 1202 573
3 574 1203 169
3 168 1203 574
3 574 1204 332
3 169 1204 574
3 575 1205 332
3 110 1205 575
3 332 1206 575
3 169 1206 332
3 576 1207 169
3 333 1207 576
3 576 1208 168
3 169 1208 576
3 333 1209 167
3 577 1209 333
3 577 1210 168
3 333 1210 577
3 578 1211 334
3 170 1211 578
3 578 1212 104
3 334 1212 578
3 579 1213 334
3 110 1213 579
3 579 1214 170
3 334 1214 579
3 580 1215 335
3 170 1215 580
3 580 1216 168
3 335 1216 580
3 581 1217 335
3 104 1217 581
3 581 1218 170
3 335 1218 581
3 582 1219 336
3 167 1219 582
3 336 1220 582
3 172 1220 336
3 583 1221 171
3 167 1221 583
3 583 1222 336
3 171 1222 583
3 172 1223 584
3 337 1223 172
3 584 1224 63
3 337 1224 584
3 585 1225 337
3 171 1225 585
3 337 1226 585
3 172 1226 337
3 173 1227 586
3 338 1227 173
3 586 1228 171
3 338 1228 586
3 587 1229 338
3 104 1229 587
3 338 1230 587
3 173 1230 338
3 588 1231 339
3 171 1231 588
3 339 1232 588
3 173 1232 339
3 589 1233 167
3 171 1233 589
3 589 1234 339
3 167 1234 589
3 75 68 46
3 46 51 75
3 26 21 106
3 106 113 26
3 590 898 340
3 39 898 590
3 590 899 38
3 340 899 590
3 591 900 39
3 340 900 591
3 37 901 39
3 591 901 37
3 592 902 341
3 36 902 592
3 592 903 37
3 341 903 592
3 593 904 36
3 341 904 593
3 38 905 36
3 593 905 38
3 594 906 57
3 342 906 594
3 59 907 57
3 594 907 59
3 595 908 342
3 58 908 595
3 595 909 59
3 342 909 595
3 596 910 58
3 343 910 596
3 56 911 58
3 596 911 56
3 597 912 343
3 57 912 597
3 597 913 56
3 343 913 597
3 914 1235 344
3 37 1235 914
3 344 1236 914
3 174 1236 344
3 37 1237 915
3 39 1237 37
3 915 1238 344
3 39 1238 915
3 345 1239 174
3 916 1239 345
3 916 1240 59
3 345 1240 916
3 917 1241 345
3 39 1241 917
3 345 1242 917
3 174 1242 345
3 918 1243 346
3 59 1243 918
3 346 1244 918
3 175 1244 346
3 59 1245 919
3 57 1245 59
3 919 1246 346
3 57 1246 919
3 175 1247 920
3 347 1247 175
3 920 1248 37
3 347 1248 920
3 921 1249 347
3 57 1249 921
3 347 1250 921
3 175 1250 347
3 176 1251 922
3 348 1251 176
3 922 1252 38
3 348 1252 922
3 923 1253 348
3 58 1253 923
3 348 1254 923
3 176 1254 348
3 924 1255 349
3 38 1255 924
3 349 1256 924
3 176 1256 349
3 38 1257 925
3 36 1257 38
3 925 1258 349
3 36 1258 925
3 350 1259 177
3 926 1259 350
3 926 1260 56
3 350 1260 926
3 927 1261 350
3 36 1261 927
3 350 1262 927
3 177 1262 350
3 928 1263 351
3 56 1263 928
3 351 1264 928
3 177 1264 351
3 56 1265 929
3 58 1265 56
3 929 1266 351
3 58 1266 929
3 598 1267 352
3 182 1267 598
3 598 1268 181
3 352 1268 598
3 599 1269 352
3 180 1269 599
3 599 1270 182
3 352 1270 599
3 600 1271 353
3 182 1271 600
3 600 1272 179
3 353 1272 600
3 601 1273 353
3 181 1273 601
3 601 1274 182
3 353 1274 601
3 602 1275 354
3 183 1275 602
3 602 1276 181
3 354 1276 602
3 603 1277 354
3 178 1277 603
3 603 1278 183
3 354 1278 603
3 604 1279 355
3 183 1279 604
3 604 1280 180
3 355 1280 604
3 605 1281 355
3 181 1281 605
3 605 1282 183
3 355 1282 605
3 606 1283 356
3 185 1283 606
3 606 1284 184
3 356 1284 606
3 607 1285 356
3 180 1285 607
3 607 1286 185
3 356 1286 607
3 608 1287 357
3 185 1287 608
3 608 1288 38
3 357 1288 608
3 609 1289 357
3 184 1289 609
3 609 1290 185
3 357 1290 609
3 610 1291 358
3 186 1291 610
3 610 1292 184
3 358 1292 610
3 611 1293 358
3 179 1293 611
3 611 1294 186
3 358 1294 611
3 612 1295 359
3 186 1295 612
3 612 1296 180
3 359 1296 612
3 613 1297 359
3 184 1297 613
3 613 1298 186
3 359 1298 613
3 614 1299 360
3 189 1299 614
3 614 1300 188
3 360 1300 614
3 615 1301 360
3 187 1301 615
3 615 1302 189
3 360 1302 615
3 616 1303 361
3 189 1303 616
3 616 1304 179
3 361 1304 616
3 617 1305 361
3 188 1305 617
3 617 1306 189
3 361 1306 617
3 618 1307 362
3 190 1307 618
3 618 1308 188
3 362 1308 618
3 619 1309 362
3 39 1309 619
3 619 1310 190
3 362 1310 619
3 620 1311 363
3 190 1311 620
3 620 1312 187
3 363 1312 620
3 621 1313 363
3 188 1313 621
3 621 1314 190
3 363 1314 621
3 622 1315 364
3 192 1315 622
3 622 1316 191
3 364 1316 622
3 623 1317 364
3 187 1317 623
3 623 1318 192
3 364 1318 623
3 624 1319 365
3 192 1319 624
3 624 1320 178
3 365 1320 624
3 625 1321 365
3 191 1321 625
3 625 1322 192
3 365 1322 625
3 626 1323 366
3 193 1323 626
3 626 1324 191
3 366 1324 626
3 627 1325 366
3 179 1325 627
3 627 1326 193
3 366 1326 627
3 628 1327 367
3 193 1327 628
3 628 1328 187
3 367 1328 628
3 629 1329 367
3 191 1329 629
3 629 1330 193
3 367 1330 629
3 630 1331 368
3 197 1331 630
3 630 1332 196
3 368 1332 630
3 631 1333 368
3 195 1333 631
3 631 1334 197
3 368 1334 631
3 632 1335 369
3 197 1335 632
3 632 1336 194
3 369 1336 632
3 633 1337 369
3 196 1337 633
3 633 1338 197
3 369 1338 633
3 634 1339 370
3 198 1339 634
3 634 1340 196
3 370 1340 634
3 635 1341 370
3 178 1341 635
3 635 1342 198
3 370 1342 635
3 636 1343 371
3 198 1343 636
3 636 1344 195
3 371 1344 636
3 637 1345 371
3 196 1345 637
3 637 1346 198
3 371 1346 637
3 638 1347 372
3 200 1347 638
3 638 1348 199
3 372 1348 638
3 639 1349 372
3 195 1349 639
3 639 1350 200
3 372 1350 639
3 640 1351 373
3 200 1351 640
3 640 1352 58
3 373 1352 640
3 641 1353 373
3 199 1353 641
3 641 1354 200
3 373 1354 641
3 642 1355 374
3 201 1355 642
3 642 1356 199
3 374 1356 642
3 643 1357 374
3 194 1357 643
3 643 1358 201
3 374 1358 643
3 644 1359 375
3 201 1359 644
3 644 1360 195
3 375 1360 644
3 645 1361 375
3 199 1361 645
3 645 1362 201
3 375 1362 645
3 646 1363 376
3 204 1363 646
3 646 1364 203
3 376 1364 646
3 647 1365 376
3 202 1365 647
3 647 1366 204
3 376 1366 647
3 648 1367 377
3 204 1367 648
3 648 1368 194
3 377 1368 648
3 649 1369 377
3 203 1369 649
3 649 1370 204
3 377 1370 649
3 650 1371 378
3 205 1371 650
3 650 1372 203
3 378 1372 650
3 651 1373 378
3 38 1373 651
3 651 1374 205
3 378 1374 651
3 652 1375 379
3 205 1375 652
3 652 1376 202
3 379 1376 652
3 653 1377 379
3 203 1377 653
3 653 1378 205
3 379 1378 653
3 654 1379 380
3 207 1379 654
3 654 1380 206
3 380 1380 654
3 655 1381 380
3 202 1381 655
3 655 1382 207
3 380 1382 655
3 656 1383 381
3 207 1383 656
3 656 1384 178
3 381 1384 656
3 657 1385 381
3 206 1385 657
3 657 1386 207
3 381 1386 657
3 658 1387 382
3 208 1387 658
3 658 1388 206
3 382 1388 658
3 659 1389 382
3 194 1389 659
3 659 1390 208
3 382 1390 659
3 660 1391 383
3 208 1391 660
3 660 1392 202
3 383 1392 660
3 661 1393 383
3 206 1393 661
3 661 1394 208
3 383 1394 661
3 662 1395 384
3 213 1395 662
3 662 1396 212
3 384 1396 662
3 663 1397 384
3 211 1397 663
3 663 1398 213
3 384 1398 663
3 664 1399 385
3 213 1399 664
3 664 1400 210
3 385 1400 664
3 665 1401 385
3 212 1401 665
3 665 1402 213
3 385 1402 665
3 666 1403 386
3 214 1403 666
3 666 1404 212
3 386 1404 666
3 667 1405 386
3 209 1405 667
3 667 1406 214
3 386 1406 667
3 668 1407 387
3 214 1407 668
3 668 1408 211
3 387 1408 668
3 669 1409 387
3 212 1409 669
3 669 1410 214
3 387 1410 669
3 670 1411 388
3 216 1411 670
3 670 1412 215
3 388 1412 670
3 671 1413 388
3 211 1413 671
3 671 1414 216
3 388 1414 671
3 672 1415 389
3 216 1415 672
3 672 1416 59
3 389 1416 672
3 673 1417 389
3 215 1417 673
3 673 1418 216
3 389 1418 673
3 674 1419 390
3 217 1419 674
3 674 1420 215
3 390 1420 674
3 675 1421 390
3 210 1421 675
3 675 1422 217
3 390 1422 675
3 676 1423 391
3 217 1423 676
3 676 1424 211
3 391 1424 676
3 677 1425 391
3 215 1425 677
3 677 1426 217
3 391 1426 677
3 678 1427 392
3 220 1427 678
3 678 1428 219
3 392 1428 678
3 679 1429 392
3 218 1429 679
3 679 1430 220
3 392 1430 679
3 680 1431 393
3 220 1431 680
3 680 1432 210
3 393 1432 680
3 681 1433 393
3 219 1433 681
3 681 1434 220
3 393 1434 681
3 682 1435 394
3 221 1435 682
3 682 1436 219
3 394 1436 682
3 683 1437 394
3 58 1437 683
3 683 1438 221
3 394 1438 683
3 684 1439 395
3 221 1439 684
3 684 1440 218
3 395 1440 684
3 685 1441 395
3 219 1441 685
3 685 1442 221
3 395 1442 685
3 686 1443 396
3 223 1443 686
3 686 1444 222
3 396 1444 686
3 687 1445 396
3 218 1445 687
3 687 1446 223
3 396 1446 687
3 688 1447 397
3 223 1447 688
3 688 1448 209
3 397 1448 688
3 689 1449 397
3 222 1449 689
3 689 1450 223
3 397 1450 689
3 690 1451 398
3 224 1451 690
3 690 1452 222
3 398 1452 690
3 691 1453 398
3 210 1453 691
3 691 1454 224
3 398 1454 691
3 692 1455 399
3 224 1455 692
3 692 1456 218
3 399 1456 692
3 693 1457 399
3 222 1457 693
3 693 1458 224
3 399 1458 693
3 694 1459 400
3 228 1459 694
3 694 1460 227
3 400 1460 694
3 695 1461 400
3 226 1461 695
3 695 1462 228
3 400 1462 695
3 696 1463 401
3 228 1463 696
3 696 1464 225
3 401 1464 696
3 697 1465 401
3 227 1465 697
3 697 1466 228
3 401 1466 697
3 698 1467 402
3 229 1467 698
3 698 1468 227
3 402 1468 698
3 699 1469 402
3 209 1469 699
3 699 1470 229
3 402 1470 699
3 700 1471 403
3 229 1471 700
3 700 1472 226
3 403 1472 700
3 701 1473 403
3 227 1473 701
3 701 1474 229
3 403 1474 701
3 702 1475 404
3 231 1475 702
3 702 1476 230
3 404 1476 702
3 703 1477 404
3 226 1477 703
3 703 1478 231
3 404 1478 703
3 704 1479 405
3 231 1479 704
3 704 1480 39
3 405 1480 704
3 705 1481 405
3 230 1481 705
3 705 1482 231
3 405 1482 705
3 706 1483 406
3 232 1483 706
3 706 1484 230
3 406 1484 706
3 707 1485 406
3 225 1485 707
3 707 1486 232
3 406 1486 707
3 708 1487 407
3 232 1487 708
3 708 1488 226
3 407 1488 708
3 709 1489 407
3 230 1489 709
3 709 1490 232
3 407 1490 709
3 710 1491 408
3 235 1491 710
3 710 1492 234
3 408 1492 710
3 711 1493 408
3 233 1493 711
3 711 1494 235
3 408 1494 711
3 712 1495 409
3 235 1495 712
3 712 1496 225
3 409 1496 712
3 713 1497 409
3 234 1497 713
3 713 1498 235
3 409 1498 713
3 714 1499 410
3 236 1499 714
3 714 1500 234
3 410 1500 714
3 715 1501 410
3 59 1501 715
3 715 1502 236
3 410 1502 715
3 716 1503 411
3 236 1503 716
3 716 1504 233
3 411 1504 716
3 717 1505 411
3 234 1505 717
3 717 1506 236
3 411 1506 717
3 718 1507 412
3 238 1507 718
3 718 1508 237
3 412 1508 718
3 719 1509 412
3 233 1509 719
3 719 1510 238
3 412 1510 719
3 720 1511 413
3 238 1511 720
3 720 1512 209
3 413 1512 720
3 721 1513 413
3 237 1513 721
3 721 1514 238
3 413 1514 721
3 722 1515 414
3 239 1515 722
3 722 1516 237
3 414 1516 722
3 723 1517 414
3 225 1517 723
3 723 1518 239
3 414 1518 723
3 724 1519 415
3 239 1519 724
3 724 1520 233
3 415 1520 724
3 725 1521 415
3 237 1521 725
3 725 1522 239
3 415 1522 725