OFF

179 354 0
-0.331720 -0.055475 -0.060825
-0.310030 0.124345 -0.045945
-0.269212 -0.121613 -0.049194
-0.304186 -0.116725 -0.015905
-0.304876 0.114969 -0.010501
-0.204686 -0.099632 -0.003694
-0.199061 -0.100274 -0.043239
-0.085784 -0.000703 0.001766
-0.309492 -0.124728 -0.050882
-0.298416 0.077690 0.064757
-0.267890 0.038900 0.077018
-0.118083 0.079595 -0.030608
-0.100491 0.062484 0.027590
-0.161405 0.054393 -0.062609
-0.230144 0.059874 -0.078680
-0.269737 0.121339 -0.044378
-0.333880 0.041824 0.004265
-0.312996 -0.025975 -0.075051
-0.297434 0.043020 -0.083631
-0.182661 -0.036544 -0.076100
-0.251520 0.041091 -0.082213
-0.216809 -0.109065 -0.025600
-0.093138 0.030891 0.014678
-0.272896 0.022309 -0.085745
-0.114719 -0.050911 -0.059427
-0.341115 -0.028331 -0.031763
-0.309657 0.026881 0.057841
-0.189465 -0.000502 0.074921
-0.232944 -0.087857 -0.072871
-0.213414 -0.000196 0.082099
-0.294272 0.003526 -0.089278
-0.299069 0.091641 0.044850
-0.237363 0.000110 0.089278
-0.100969 -0.041799 0.049763
-0.137804 -0.024910 -0.065544
-0.292725 0.121717 -0.024949
-0.208791 0.038549 0.075947
-0.140306 0.049329 0.062817
-0.097884 -0.064392 -0.001597
-0.232739 0.038855 0.083125
-0.122475 -0.021079 0.061228
-0.235128 0.116083 -0.002386
-0.178805 0.028975 -0.074539
-0.286699 -0.119169 -0.032549
-0.186457 0.065515 0.048123
-0.228116 0.077599 0.076973
-0.143982 -0.000359 0.072693
-0.113116 -0.072463 0.000444
-0.242063 0.099459 -0.059689
-0.090670 -0.032293 -0.012621
-0.318184 -0.000088 0.046282
-0.350509 -0.001186 -0.002701
-0.337205 -0.028578 0.015792
-0.317739 0.100335 -0.022265
-0.089190 0.020749 -0.021749
-0.341176 0.027802 -0.029900
-0.258116 0.116461 0.017043
-0.240181 -0.117215 0.031585
-0.160670 -0.052245 -0.066471
-0.207428 -0.075566 -0.080201
-0.136483 0.027669 -0.063935
-0.337451 0.026182 0.017564
-0.278072 -0.019997 0.076348
-0.201817 -0.036004 -0.083335
-0.331842 0.056790 -0.057100
-0.212469 0.097147 0.034985
-0.244369 -0.060414 0.073341
-0.139744 0.066994 -0.046608
-0.196205 0.003558 -0.086469
-0.283153 0.058295 0.070888
-0.324392 0.053550 0.037829
-0.212773 -0.026732 0.074952
-0.332576 0.002094 -0.065309
-0.170277 -0.017033 -0.074050
-0.116336 0.058779 0.042587
-0.227731 -0.056789 -0.082486
-0.234556 -0.117856 -0.007960
-0.222120 -0.017228 -0.085620
-0.279395 -0.060370 0.067297
-0.095830 0.063526 -0.024483
-0.164586 -0.026285 0.067115
-0.307834 0.081261 0.037994
-0.320936 0.090567 -0.051522
-0.296670 0.038950 0.071305
-0.100213 -0.064901 0.023815
-0.092287 -0.040712 -0.048282
-0.229444 0.118333 -0.042811
-0.253646 -0.077575 -0.081636
-0.162216 0.064895 0.047375
-0.185087 0.066525 -0.068878
-0.248035 -0.038013 -0.084770
-0.090807 0.031412 -0.011359
-0.092998 -0.032802 0.012791
-0.089035 -0.020707 -0.023258
-0.234464 0.095716 0.057506
-0.100965 -0.000403 0.060706
-0.090989 0.001860 -0.052433
-0.211849 -0.100302 0.029323
-0.188788 0.050569 0.064314
-0.199494 0.100084 -0.039267
-0.273949 -0.058798 -0.083920
-0.233849 -0.098919 0.051711
-0.252432 0.118711 -0.023382
-0.109287 0.071039 -0.001509
-0.159430 -0.067308 0.044262
-0.119960 -0.058484 0.041563
-0.307877 -0.040311 0.053015
-0.299864 -0.079583 -0.083071
-0.263266 0.077644 0.070865
-0.206785 0.099397 -0.005440
-0.169545 0.081834 -0.035724
-0.263919 0.091596 0.050958
-0.202487 0.041107 -0.080809
-0.332148 -0.026691 -0.063067
-0.268875 -0.098875 0.045667
-0.188184 -0.053574 0.060627
-0.316586 0.042304 -0.071647
-0.093528 0.019270 0.027193
-0.143814 0.080714 -0.033166
-0.223863 0.022325 -0.084341
-0.214800 0.082201 0.051176
-0.265020 0.100424 -0.060398
-0.269530 -0.112968 0.025329
-0.301400 -0.020050 0.065434
-0.219106 0.098495 -0.058980
-0.275421 0.119089 -0.003953
-0.321043 -0.028029 0.040284
-0.283976 -0.112438 -0.058211
-0.334347 -0.000637 0.021791
-0.176835 0.081147 -0.001896
-0.245238 0.003542 -0.087874
-0.101272 0.039244 0.052619
-0.157894 0.002478 -0.072000
-0.183517 -0.083389 0.027061
-0.139707 -0.052068 0.059310
-0.294923 0.000211 0.077852
-0.321288 0.026731 0.042056
-0.102854 -0.024526 -0.055930
-0.271153 -0.017243 -0.087024
-0.189156 0.080245 -0.055436
-0.341543 0.000454 -0.034005
-0.184126 0.080461 0.031932
-0.315047 -0.083130 -0.060259
-0.205517 -0.082006 0.049449
-0.115072 0.052860 -0.055871
-0.210312 -0.046915 0.070593
-0.261220 -0.040206 0.074845
-0.120635 0.024463 0.061762
-0.095555 -0.063883 -0.027009
-0.150472 0.080074 -0.001584
-0.093376 -0.021251 0.025764
-0.332209 0.029442 -0.061204
-0.240812 0.113832 0.038039
-0.166385 0.025105 0.068503
-0.252626 0.019505 0.083148
-0.227518 -0.080623 0.071838
-0.124741 0.078954 0.000974
-0.297068 -0.038029 -0.086174
-0.305429 0.022915 -0.080462
-0.248003 0.058249 0.076995
-0.325566 0.063329 0.007748
-0.314394 -0.046752 -0.073500
-0.194801 -0.085371 -0.056988
-0.258460 -0.100147 -0.065541
-0.310531 0.046250 0.054567
-0.222433 -0.108424 0.013946
-0.296246 -0.040161 0.068800
-0.157763 0.079387 0.032243
-0.300595 0.082514 -0.077985
-0.141955 -0.066480 -0.049199
-0.092595 0.042201 -0.045265
-0.254682 0.080585 -0.076566
-0.262543 -0.080578 0.065793
-0.266143 0.000161 0.083565
-0.098161 0.063005 0.001553
-0.114939 0.002425 -0.064618
-0.276058 0.061803 -0.080099
-0.232440 -0.040256 0.080558
-0.270267 0.109713 0.031491
3 78 106 166
3 78 172 106
3 172 114 106
3 114 122 106
3 122 3 106
3 3 126 106
3 3 52 126
3 3 8 52
3 8 142 52
3 142 0 52
3 0 25 52
3 25 51 52
3 126 50 106
3 85 24 148
3 24 169 148
3 169 162 148
3 162 6 148
3 162 59 6
3 59 28 6
3 28 163 6
3 163 21 6
3 163 2 21
3 2 76 21
3 2 57 76
3 2 122 57
3 2 43 122
3 43 3 122
3 6 47 148
3 6 133 47
3 133 104 47
3 104 84 47
3 104 105 84
3 6 5 133
3 169 58 162
3 104 134 105
3 82 53 64
3 53 160 64
3 160 55 64
3 160 16 55
3 53 4 160
3 4 81 160
3 4 31 81
3 4 178 31
3 82 1 53
3 4 125 178
3 81 70 160
3 82 168 1
3 178 111 31
3 31 9 81
3 16 51 55
3 168 121 1
3 74 156 12
3 74 167 156
3 74 88 167
3 74 37 88
3 12 131 74
3 167 149 156
3 88 141 167
3 48 124 86
3 48 171 124
3 171 14 124
3 14 89 124
3 89 139 124
3 14 112 89
3 139 99 124
3 89 13 139
3 93 85 7
3 131 7 117
3 141 98 44
3 33 150 7
3 7 170 54
3 28 59 163
3 142 8 107
3 127 8 163
3 27 32 29
3 10 9 69
3 32 10 154
3 136 70 50
3 83 70 164
3 5 165 57
3 0 161 157
3 72 64 151
3 0 72 113
3 135 106 123
3 135 146 62
3 155 66 146
3 45 94 152
3 35 125 1
3 56 152 125
3 86 171 48
3 118 110 11
3 12 79 174
3 103 12 11
3 73 19 132
3 137 24 96
3 158 30 116
3 38 148 84
3 177 115 145
3 147 46 37
3 147 95 46
3 147 131 95
3 147 37 131
3 74 131 37
3 156 11 12
3 11 144 79
3 144 170 79
3 144 175 170
3 175 96 170
3 137 175 24
3 137 96 175
3 24 85 96
3 47 84 148
3 105 33 84
3 105 134 33
3 40 134 46
3 40 33 134
3 40 95 33
3 40 46 95
3 153 27 98
3 153 46 27
3 153 37 46
3 153 98 37
3 88 98 141
3 88 37 98
3 129 149 141
3 129 110 149
3 167 141 149
3 156 149 11
3 118 149 110
3 118 11 149
3 67 110 13
3 67 11 110
3 67 144 11
3 67 13 144
3 60 13 132
3 60 144 13
3 60 175 144
3 60 132 175
3 34 132 58
3 34 175 132
3 34 24 175
3 34 58 24
3 169 24 58
3 104 133 115
3 104 115 134
3 80 115 27
3 80 134 115
3 80 46 134
3 80 27 46
3 39 36 32
3 39 45 36
3 29 36 27
3 29 32 36
3 36 98 27
3 36 45 98
3 120 45 152
3 120 98 45
3 44 120 141
3 44 98 120
3 65 120 152
3 65 141 120
3 41 109 152
3 41 86 109
3 65 109 141
3 65 152 109
3 129 109 110
3 129 141 109
3 99 109 86
3 99 110 109
3 139 110 99
3 124 99 86
3 139 13 110
3 89 112 13
3 42 112 68
3 42 13 112
3 42 132 13
3 42 68 132
3 63 19 68
3 63 59 19
3 73 68 19
3 73 132 68
3 19 58 132
3 19 59 58
3 162 58 59
3 21 76 5
3 165 76 57
3 165 5 76
3 21 5 6
3 97 5 57
3 97 133 5
3 143 97 155
3 143 133 97
3 101 97 57
3 101 155 97
3 143 115 133
3 143 155 115
3 145 155 177
3 145 115 155
3 71 177 32
3 71 115 177
3 71 27 115
3 71 32 27
3 83 10 135
3 83 9 10
3 173 10 32
3 173 135 10
3 159 39 10
3 159 45 39
3 154 39 32
3 154 10 39
3 69 108 10
3 69 9 108
3 159 108 45
3 159 10 108
3 31 111 9
3 108 111 45
3 108 9 111
3 94 111 152
3 94 45 111
3 178 152 111
3 4 1 125
3 178 125 152
3 102 41 125
3 102 86 41
3 56 41 152
3 56 125 41
3 35 15 125
3 35 1 15
3 102 15 86
3 102 125 15
3 15 121 86
3 15 1 121
3 121 171 86
3 121 168 171
3 176 18 20
3 176 168 18
3 23 18 30
3 23 20 18
3 14 171 20
3 176 171 168
3 176 20 171
3 119 112 20
3 119 68 112
3 14 20 112
3 23 130 20
3 23 30 130
3 119 130 68
3 119 20 130
3 138 157 90
3 138 30 157
3 100 157 107
3 100 90 157
3 77 130 90
3 77 68 130
3 138 130 30
3 138 90 130
3 75 63 90
3 75 59 63
3 77 63 68
3 77 90 63
3 100 87 90
3 100 107 87
3 75 87 59
3 75 90 87
3 127 107 8
3 127 163 107
3 87 163 59
3 87 107 163
3 2 163 8
3 43 8 3
3 43 2 8
3 122 114 57
3 101 114 155
3 101 57 114
3 172 155 114
3 78 166 146
3 62 166 135
3 62 146 166
3 66 172 146
3 66 155 172
3 78 146 172
3 177 146 32
3 177 155 146
3 173 146 135
3 173 32 146
3 26 50 70
3 26 135 50
3 164 9 83
3 164 70 9
3 26 83 135
3 26 70 83
3 81 9 70
3 53 1 4
3 82 64 168
3 116 64 72
3 116 168 64
3 18 116 30
3 18 168 116
3 158 72 30
3 158 116 72
3 17 72 0
3 17 30 72
3 161 107 157
3 161 0 107
3 17 157 30
3 17 0 157
3 142 107 0
3 166 106 135
3 123 50 135
3 123 106 50
3 128 61 50
3 128 51 61
3 136 61 70
3 136 50 61
3 61 16 70
3 61 51 16
3 160 70 16
3 151 55 72
3 151 64 55
3 140 55 51
3 140 72 55
3 140 25 72
3 140 51 25
3 113 25 0
3 113 72 25
3 126 52 50
3 128 52 51
3 128 50 52
3 117 95 131
3 117 7 95
3 22 131 12
3 22 7 131
3 174 91 12
3 174 79 91
3 22 91 7
3 22 12 91
3 91 170 7
3 91 79 170
3 54 96 7
3 54 170 96
3 93 96 85
3 93 7 96
3 49 85 148
3 49 7 85
3 92 49 84
3 92 7 49
3 38 49 148
3 38 84 49
3 92 33 7
3 92 84 33
3 150 95 7
3 150 33 95
3 103 79 12
3 103 11 79
