OFF

242 480 0
0.254363 -0.157955 -0.000163
-0.035090 -0.201687 -0.065893
-0.035101 -0.141770 -0.157895
0.114020 -0.000051 -0.140451
-0.035101 -0.043881 -0.207613
-0.035088 0.065753 -0.201727
-0.035066 0.157755 -0.141811
-0.035042 0.207473 -0.043922
0.114074 0.121458 0.070060
-0.035021 0.201587 0.065712
-0.035010 0.141671 0.157714
-0.035010 0.043782 0.207433
-0.035023 -0.065852 0.201546
-0.035045 -0.157855 0.141630
-0.035069 -0.207573 0.043741
0.280654 -0.174774 -0.101034
0.114032 -0.140398 -0.000134
0.114020 -0.121589 -0.070299
0.114062 0.140266 -0.000104
0.114074 -0.000081 0.140213
0.114048 -0.121604 0.070034
0.061466 0.143698 0.143679
0.026291 -0.166600 -0.157049
0.087734 0.151861 -0.087806
0.359667 0.236628 0.065639
0.140367 -0.073139 0.082560
0.280691 0.174629 -0.100997
0.219282 0.061329 -0.106474
0.026350 0.219136 -0.065860
0.219310 -0.061483 0.106194
0.061463 -0.000083 0.210389
-0.035056 0.189855 -0.109704
0.254362 0.078871 -0.136861
0.087742 0.161257 -0.052722
0.280653 -0.000062 -0.201879
-0.008688 0.065702 0.245409
0.359573 -0.127245 -0.220457
0.061381 -0.000038 -0.210608
-0.035013 -0.000073 0.219179
0.140355 -0.104692 0.034948
0.140378 -0.022007 0.108018
0.166661 0.043791 -0.076082
0.087696 -0.087754 -0.152038
0.254411 -0.000098 0.157727
0.280702 -0.145906 0.129590
0.061379 -0.143818 -0.143898
-0.008742 -0.227939 0.131442
0.254349 -0.000064 -0.158020
0.087747 -0.113467 0.126105
0.061410 0.143728 -0.143867
0.359686 0.127061 0.220123
0.026302 0.052592 -0.222807
-0.008793 -0.227910 -0.131681
0.061466 0.052544 0.196294
0.087706 0.035038 -0.166125
0.026374 0.222648 0.052546
0.219323 0.061307 0.106207
0.087755 -0.087787 0.151791
-0.035097 -0.189931 -0.109745
0.087770 0.126157 0.113290
0.307003 0.212607 -0.122925
-0.008693 0.227805 0.131490
0.166672 -0.076033 0.043717
0.140383 0.035004 0.104499
0.219272 -0.000064 -0.122931
0.254398 -0.079032 0.136568
0.280651 -0.039532 -0.191308
-0.008744 0.227833 -0.131633
0.359591 -0.236811 -0.065973
0.026312 0.118371 -0.205174
0.359581 -0.220354 -0.127367
0.114031 0.070114 -0.121643
0.026389 0.065701 0.219090
0.061400 -0.210559 -0.000132
0.061454 0.196332 0.052537
-0.035079 -0.219319 -0.000114
0.307052 -0.000113 0.245424
-0.035030 -0.109704 0.189791
0.061433 0.196343 -0.052713
0.026341 -0.205153 0.118281
-0.008798 -0.065807 -0.245600
0.061469 0.105170 0.182199
0.087701 -0.151968 -0.087838
0.114046 0.121473 -0.070273
0.026295 -0.205128 -0.118530
0.219296 0.106270 -0.061523
0.280669 0.100799 -0.174843
0.280731 0.174607 0.100731
0.359668 -0.065898 0.236552
0.306950 -0.122855 -0.212850
0.061390 0.052586 -0.196501
0.026287 -0.118440 -0.205199
0.306978 -0.245668 -0.000183
0.307055 0.167631 0.167597
0.280705 0.191073 -0.039600
0.166662 -0.087779 -0.000139
0.359614 0.175258 -0.172269
0.166654 -0.000062 -0.087837
0.140335 -0.035141 -0.104748
0.026392 0.118327 0.204995
0.280679 -0.191240 0.039296
0.306968 -0.229210 -0.061577
0.114016 -0.070219 -0.121658
0.359643 0.237816 -0.061537
0.219283 -0.122868 -0.000153
0.254381 -0.136812 0.078776
0.306958 -0.212753 -0.122971
-0.008757 -0.245557 0.065659
0.087699 -0.126282 -0.113518
0.254350 -0.136795 -0.079098
0.280715 -0.100966 0.174539
0.219273 -0.106411 -0.061546
-0.008782 -0.245543 -0.065903
0.359679 -0.000119 0.254185
0.026384 0.205015 0.118325
0.061423 -0.182368 0.105121
-0.035104 -0.109664 -0.189995
-0.035007 0.109564 0.189814
0.087714 0.087661 -0.152019
0.166652 -0.043917 -0.076092
0.087763 -0.035164 0.165897
0.026338 0.205041 -0.118486
0.061382 -0.182346 -0.105378
0.254345 -0.079003 -0.136878
0.307042 -0.061506 0.228967
0.087722 0.113341 -0.126334
-0.008685 0.131485 0.227791
0.026290 -0.065814 -0.219295
-0.008713 -0.131638 0.227762
0.359602 -0.254444 -0.000194
0.359576 -0.061462 -0.238075
0.026367 -0.118484 0.204969
0.140341 0.021870 -0.108267
0.061446 -0.105329 0.182177
0.140364 0.104555 -0.035197
0.087773 0.087629 0.151809
-0.008797 -0.179750 -0.179831
0.166655 -0.076024 -0.043992
0.280734 0.039365 0.191005
0.307017 0.229051 -0.061528
0.166688 0.075881 0.043733
-0.008759 0.179683 -0.179793
0.087728 -0.161383 0.052493
0.026305 -0.222761 -0.052751
-0.008703 -0.065860 0.245395
0.140351 0.073002 -0.082809
0.026377 -0.052705 0.222602
0.307056 0.061285 0.228980
-0.035081 0.109605 -0.189971
-0.035032 0.219220 -0.000067
0.140343 -0.108211 -0.022063
0.306976 0.122728 -0.212824
0.359577 -0.172194 -0.175517
0.087735 -0.151986 0.087577
0.061398 0.105209 -0.182395
0.359682 0.172010 0.175183
0.280683 0.145739 -0.129893
0.087769 -0.000082 0.175301
0.219319 0.106257 0.061267
0.087753 0.175352 -0.000095
0.166691 0.043775 0.075832
-0.008692 -0.000081 0.263028
0.306953 -0.061457 -0.229294
0.219309 0.122714 -0.000127
0.359628 0.220198 -0.127320
0.061462 0.182226 0.105160
-0.008715 0.263071 -0.000067
-0.008771 -0.263176 -0.000124
0.061421 0.182248 -0.105339
0.280731 -0.000105 0.201576
-0.035014 0.189831 0.109564
0.166689 -0.000081 0.087578
0.026329 -0.219249 0.065655
-0.008794 -0.000024 -0.263219
0.087710 -0.166074 -0.035215
0.114078 0.070088 0.121419
0.166681 0.087636 -0.000120
0.306992 -0.229224 0.061214
0.359600 0.127108 -0.220430
0.254397 0.157793 -0.000130
0.280693 -0.174796 0.100694
0.026388 0.166488 0.156845
0.359656 0.254260 -0.000140
0.359682 0.061278 0.237741
0.219297 -0.106424 0.061244
0.087772 0.052544 0.161206
0.026365 0.236754 -0.000077
0.061455 -0.052706 0.196283
0.026324 0.156891 -0.166646
0.280724 0.185187 0.061264
-0.035098 -0.000026 -0.219360
-0.008784 0.065755 -0.245586
0.140336 -0.082753 -0.073195
0.306967 0.061334 -0.229281
0.140382 0.082616 0.072946
0.359580 -0.000065 -0.254519
0.280714 0.201644 -0.000130
0.254415 0.078842 0.136585
-0.008727 -0.179789 0.179602
-0.035054 -0.189954 0.109524
0.061376 -0.105290 -0.182417
0.307051 0.212581 0.122657
0.359616 -0.238000 0.061203
-0.008689 0.179645 0.179641
0.254410 0.136634 0.078805
0.114063 -0.070245 0.121404
0.026386 -0.000082 0.236708
0.061411 -0.196463 0.052495
0.219320 -0.000090 0.122651
0.254379 0.136651 -0.079069
0.280737 0.100762 0.174561
0.061391 -0.196452 -0.052755
0.061445 0.210438 -0.000087
0.307041 0.229038 0.061263
0.087698 -0.052670 -0.161434
0.280734 0.129658 0.145671
0.280663 0.061332 -0.185422
0.280722 -0.061499 0.185119
0.306954 -0.167804 -0.167910
-0.008802 -0.131590 -0.227981
-0.008773 0.131533 -0.227953
0.280650 -0.129825 -0.145974
0.166671 0.075891 -0.043976
0.307031 0.245495 -0.000131
0.026294 -0.000031 -0.236913
0.219269 -0.061461 -0.106487
0.359590 0.065714 -0.236887
0.280647 -0.100929 -0.174864
0.306990 0.167667 -0.167875
0.307059 0.122682 0.212537
0.087759 0.165948 0.034987
-0.008704 0.245438 0.065712
-0.008730 0.245452 -0.065850
0.061378 -0.052664 -0.196512
0.026355 -0.157003 0.166442
0.061435 -0.143849 0.143649
0.026314 -0.236867 -0.000128
0.280660 -0.185354 -0.061567
0.166682 -0.043934 0.075823
0.087716 -0.175478 -0.000133
0.140375 0.108074 0.021814
0.306957 -0.000060 -0.245738
3 177 202 180
3 202 44 180
3 202 110 44
3 202 88 110
3 88 124 110
3 202 113 88
3 202 183 113
3 202 155 183
3 202 24 155
3 202 182 24
3 202 129 182
3 24 201 155
3 124 217 110
3 180 100 177
3 44 105 180
3 217 65 110
3 0 92 100
3 0 237 92
3 11 12 38
3 11 77 12
3 11 13 77
3 11 199 13
3 11 14 199
3 11 75 14
3 11 1 75
3 11 58 1
3 11 2 58
3 11 116 2
3 11 4 116
3 11 190 4
3 11 5 190
3 11 148 5
3 11 6 148
3 11 31 6
3 11 7 31
3 11 149 7
3 11 9 149
3 11 170 9
3 11 10 170
3 11 117 10
3 3 37 54
3 3 214 37
3 8 165 59
3 8 230 165
3 70 152 129
3 152 36 129
3 36 130 129
3 130 195 129
3 195 178 129
3 178 164 129
3 164 103 129
3 103 182 129
3 155 50 183
3 178 96 164
3 129 68 70
3 195 226 178
3 15 106 237
3 16 239 73
3 150 137 16
3 17 82 122
3 192 119 17
3 42 200 102
3 97 102 98
3 132 41 3
3 118 154 71
3 222 71 145
3 23 168 83
3 176 83 134
3 18 159 212
3 240 140 18
3 160 8 194
3 135 81 175
3 171 175 63
3 238 19 40
3 157 30 19
3 57 133 205
3 62 205 25
3 95 20 39
3 153 115 20
3 26 60 209
3 151 32 86
3 241 47 34
3 76 43 169
3 87 201 204
3 89 123 227
3 223 179 196
3 229 197 210
3 75 167 14
3 199 14 46
3 107 14 167
3 107 46 14
3 236 172 167
3 236 73 172
3 107 172 46
3 107 167 172
3 79 172 115
3 79 46 172
3 207 172 73
3 207 115 172
3 239 142 73
3 239 16 142
3 207 142 115
3 207 73 142
3 142 20 115
3 142 16 20
3 39 16 95
3 39 20 16
3 62 20 95
3 104 62 95
3 184 62 104
3 0 184 104
3 105 184 0
3 100 105 0
3 180 105 100
3 177 100 92
3 129 202 92
3 177 92 202
3 199 46 13
3 77 13 128
3 198 13 46
3 198 128 13
3 79 234 46
3 79 115 234
3 198 234 128
3 198 46 234
3 131 234 133
3 131 128 234
3 235 234 115
3 235 133 234
3 153 48 115
3 153 20 48
3 235 48 133
3 235 115 48
3 48 205 133
3 48 20 205
3 25 20 62
3 25 205 20
3 238 205 62
3 184 238 62
3 29 238 184
3 105 29 184
3 65 29 105
3 44 65 105
3 110 65 44
3 77 128 12
3 38 12 161
3 144 12 128
3 144 161 12
3 131 146 128
3 131 133 146
3 144 146 161
3 144 128 146
3 206 146 30
3 206 161 146
3 187 146 133
3 187 30 146
3 57 120 133
3 57 205 120
3 187 120 30
3 187 133 120
3 120 19 30
3 120 205 19
3 40 205 238
3 40 19 205
3 171 19 238
3 29 171 238
3 208 171 29
3 65 208 29
3 43 208 65
3 217 43 65
3 169 217 76
3 169 43 217
3 124 76 217
3 124 88 76
3 113 76 88
3 38 161 11
3 117 11 126
3 35 11 161
3 35 126 11
3 206 72 161
3 206 30 72
3 35 72 126
3 35 161 72
3 99 72 81
3 99 126 72
3 53 72 30
3 53 81 72
3 157 185 30
3 157 19 185
3 53 185 81
3 53 30 185
3 185 175 81
3 185 19 175
3 63 19 171
3 63 175 19
3 160 175 171
3 208 160 171
3 56 160 208
3 43 56 208
3 197 56 43
3 138 43 76
3 138 197 43
3 210 138 229
3 210 197 138
3 147 138 76
3 147 229 138
3 113 183 76
3 147 183 229
3 147 76 183
3 50 229 183
3 117 126 10
3 170 10 61
3 203 10 126
3 203 61 10
3 99 181 126
3 99 81 181
3 203 181 61
3 203 126 181
3 114 181 165
3 114 61 181
3 21 181 81
3 21 165 181
3 135 59 81
3 135 175 59
3 21 59 165
3 21 81 59
3 59 175 8
3 194 175 160
3 194 8 175
3 140 8 160
3 56 140 160
3 158 140 56
3 197 158 56
3 204 158 197
3 215 197 229
3 215 204 197
3 87 215 201
3 87 204 215
3 93 215 229
3 93 201 215
3 50 155 229
3 93 155 201
3 93 229 155
3 170 61 9
3 149 9 166
3 231 9 61
3 231 166 9
3 114 55 61
3 114 165 55
3 231 55 166
3 231 61 55
3 186 55 212
3 186 166 55
3 74 55 165
3 74 212 55
3 74 230 212
3 74 165 230
3 230 18 212
3 230 8 18
3 240 8 140
3 240 18 8
3 176 18 140
3 158 176 140
3 163 176 158
3 204 163 158
3 179 163 204
3 189 204 201
3 189 179 204
3 196 189 223
3 196 179 189
3 213 189 201
3 213 223 189
3 213 24 223
3 213 201 24
3 182 223 24
3 149 166 7
3 31 7 67
3 232 7 166
3 232 67 7
3 186 28 166
3 186 212 28
3 232 28 67
3 232 166 28
3 121 28 168
3 121 67 28
3 78 28 212
3 78 168 28
3 159 33 212
3 159 18 33
3 78 33 168
3 78 212 33
3 33 83 168
3 33 18 83
3 134 18 176
3 134 83 18
3 222 83 176
3 163 222 176
3 85 222 163
3 179 85 163
3 209 85 179
3 94 179 223
3 94 209 179
3 26 94 60
3 26 209 94
3 139 94 223
3 139 60 94
3 182 103 223
3 139 103 60
3 139 223 103
3 164 60 103
3 31 67 6
3 148 6 220
3 141 6 67
3 141 220 6
3 121 188 67
3 121 168 188
3 141 188 220
3 141 67 188
3 69 188 154
3 69 220 188
3 49 188 168
3 49 154 188
3 23 125 168
3 23 83 125
3 49 125 154
3 49 168 125
3 125 71 154
3 125 83 71
3 145 83 222
3 145 71 83
3 41 71 222
3 85 41 222
3 27 41 85
3 209 27 85
3 32 27 209
3 156 209 60
3 156 32 209
3 86 156 151
3 86 32 156
3 228 156 60
3 228 151 156
3 164 96 60
3 228 96 151
3 228 60 96
3 178 151 96
3 148 220 5
3 190 5 173
3 191 5 220
3 191 173 5
3 69 51 220
3 69 154 51
3 191 51 173
3 191 220 51
3 224 51 37
3 224 173 51
3 90 51 154
3 90 37 51
3 118 54 154
3 118 71 54
3 90 54 37
3 90 154 54
3 54 71 3
3 132 71 41
3 132 3 71
3 97 3 41
3 27 97 41
3 64 97 27
3 32 64 27
3 47 64 32
3 216 32 151
3 216 47 32
3 34 216 241
3 34 47 216
3 193 216 151
3 193 241 216
3 178 226 151
3 193 226 241
3 193 151 226
3 195 241 226
3 190 173 4
3 116 4 219
3 80 4 173
3 80 219 4
3 224 127 173
3 224 37 127
3 80 127 219
3 80 173 127
3 91 127 200
3 91 219 127
3 233 127 37
3 233 200 127
3 233 214 200
3 233 37 214
3 214 102 200
3 214 3 102
3 98 3 97
3 98 102 3
3 119 102 97
3 64 119 97
3 225 119 64
3 47 225 64
3 123 225 47
3 66 47 241
3 66 123 47
3 227 66 89
3 227 123 66
3 162 66 241
3 162 89 66
3 195 130 241
3 162 130 89
3 162 241 130
3 36 89 130
3 116 219 2
3 58 2 52
3 136 2 219
3 136 52 2
3 91 22 219
3 91 200 22
3 136 22 52
3 136 219 22
3 84 22 122
3 84 52 22
3 45 22 200
3 45 122 22
3 42 108 200
3 42 102 108
3 45 108 122
3 45 200 108
3 108 17 122
3 108 102 17
3 192 102 119
3 192 17 102
3 137 17 119
3 225 137 119
3 111 137 225
3 123 111 225
3 109 111 123
3 221 123 89
3 221 109 123
3 15 221 106
3 15 109 221
3 218 221 89
3 218 106 221
3 36 152 89
3 218 152 106
3 218 89 152
3 70 106 152
3 58 52 1
3 75 1 167
3 112 1 52
3 112 167 1
3 84 143 52
3 84 122 143
3 112 143 167
3 112 52 143
3 236 143 73
3 236 167 143
3 211 143 122
3 211 73 143
3 82 174 122
3 82 17 174
3 211 174 73
3 211 122 174
3 174 16 73
3 174 17 16
3 150 17 137
3 150 16 17
3 95 16 137
3 111 95 137
3 104 95 111
3 109 104 111
3 0 104 109
3 237 109 15
3 237 0 109
3 101 237 106
3 101 92 237
3 70 68 106
3 101 68 92
3 101 106 68
3 129 92 68
