OFF
1550 1837 0
-0.2575690369 -0.1338797897 0.0301840814
0.1263545181 -0.2346592558 -0.0338135146
-0.2549164145 -0.0021107138 -0.0673667894
0.1277588222 -0.1950915350 0.0438335688
-0.2541821581 -0.1570104050 -0.0274024351
-0.3237994645 -0.0860305218 0.0004991730
0.2762520537 0.0341380234 -0.0560085762
0.4461733001 -0.0398340842 -0.0190488591
0.4651137560 -0.0306421310 -0.0020486095
0.3162857976 0.0460839476 -0.0248877953
0.2665059948 0.0460702205 -0.0247641573
0.0089574530 -0.2082890676 0.0504270370
-0.3612887195 0.0475808107 -0.0283315715
0.2092712171 -0.0989875195 0.0423607357
-0.4587183848 -0.0125143931 -0.0259367934
-0.4589578824 -0.0126898996 -0.0391641818
0.0074773729 -0.2505165620 -0.0314731271
-0.2693148337 -0.1458753970 -0.0343915382
-0.1788604234 -0.1619123412 -0.0366570512
0.1126576332 -0.2814605544 -0.0049272241
-0.3987409543 -0.2373751259 -0.0083280478
0.2003586554 0.1976842329 -0.0402810843
-0.3186750498 -0.0013916432 -0.0527014678
0.2483748138 0.0666499742 -0.0713798854
0.1710060871 0.3042637759 -0.0450434109
0.1713868665 0.3045428154 -0.0240130694
-0.4261684492 -0.0097266910 -0.0233504885
0.0528319803 0.2590130631 -0.0423033223
0.0532127597 0.2592921025 -0.0212729807
-0.2586155674 -0.1610962165 -0.0277156347
0.1998431443 -0.1533636368 -0.0700219744
0.3624585754 -0.0528939785 -0.0370245407
0.2884203569 -0.0355728448 0.0261261149
0.4925854950 -0.0071183516 -0.0396750985
-0.2080492316 0.1330560552 0.0049091792
0.1096752851 0.1792171508 -0.0067773357
-0.2148747533 -0.2578504412 -0.0107162796
-0.2575000932 -0.0785941599 0.0342009215
-0.4262315281 0.0114558924 -0.0267597719
-0.2528632823 -0.3395275215 -0.0132236250
-0.3280409682 0.3625098337 -0.0514585845
0.2485921867 0.1183576125 -0.0591792956
0.2762440092 -0.0009847541 -0.0565858095
-0.0887141074 0.4765035627 -0.0396804736
0.3624259267 0.0528685854 -0.0384272520
0.2885361530 -0.0608163171 0.0324256229
0.4571583143 0.0305266756 0.0070461109
0.4586626916 0.0250299833 0.0091154376
0.1687133137 -0.1713305869 -0.0121803406
0.1681497681 -0.1717435595 -0.0433048083
0.0040588434 0.1159301344 -0.0910262511
-0.3231768966 0.0007456255 0.0352102009
-0.4261370489 -0.0000393528 -0.0215796731
-0.4274862797 -0.0001059211 -0.0265674317
-0.4364176080 -0.0001065319 -0.0264056060
-0.2570557398 0.0010821251 0.0590428305
-0.3681016176 0.0001794289 -0.0064346273
-0.2530708405 0.3396579090 -0.0222315865
-0.3278190503 -0.3631928111 -0.0418336728
-0.4926128716 0.3694664878 -0.0314874240
-0.4175508382 -0.0113733184 -0.0265819257
-0.2575490729 0.0800712628 0.0320965684
-0.0710564705 0.4766888170 -0.0261155954
0.0720606596 0.4548173513 -0.0275751358
0.0717788830 0.4546108622 -0.0431375801
-0.2587139149 0.1609015066 -0.0319862560
0.3163141561 -0.0457811302 -0.0236694041
0.2665343533 -0.0457948573 -0.0235457660
0.3619820523 0.0370519603 -0.0630009616
0.3633359092 0.0380440820 0.0117721829
0.4693681745 -0.0429442762 -0.0488354121
0.4520252227 -0.0325277146 0.0105447080
-0.4175847504 0.0094021658 -0.0283819591
-0.4261443926 -0.0057422661 -0.0220068316
0.4691597955 0.0174071873 -0.0601150788
0.4335871404 -0.0343129420 0.0135260123
0.3157220264 -0.0327586839 -0.0563216221
0.3168979835 -0.0318969291 0.0086261661
0.2659422218 -0.0327724124 -0.0561980893
0.2671181770 -0.0319106591 0.0087495936
-0.2694037289 0.1455023877 -0.0382560523
0.4599002657 -0.0283551690 0.0114438574
-0.3612592813 -0.0477817941 -0.0270667932
-0.2981108522 0.0342868200 -0.0228487358
-0.2986098047 0.0339211820 -0.0504057423
0.2586337183 -0.1197114306 0.0162633309
0.0043869251 -0.1893035438 -0.0740046496
-0.3614823911 -0.0007143112 -0.0392102851
0.4439915192 -0.0343605217 0.0111251089
-0.3238516936 0.0865702778 -0.0017900218
0.4620960221 0.0328513109 -0.0065425607
-0.3900398992 -0.0153552044 -0.0216283646
-0.3904989353 -0.0156915913 -0.0469808064
-0.1189142166 -0.1094965879 0.0568327532
0.3983125873 0.0110098627 0.0378901002
0.0041265885 -0.1069338015 -0.0880704247
-0.3614127671 -0.0370655911 -0.0355027801
-0.2893552339 0.1852706417 -0.0114268694
0.4831804256 0.0133932683 -0.0115441284
-0.2707931433 -0.2627899562 0.0044590377
0.4464705558 -0.0534589246 -0.0494302119
0.4923157149 -0.0101554559 -0.0467365315
-0.2381802965 0.1007996926 -0.0068013005
0.2575782754 0.1439537356 -0.0410855709
-0.3243627281 0.1031609974 -0.0299500930
0.4566937546 0.0392115440 -0.0185772274
0.4421395164 -0.0372056795 0.0008729168
-0.3682597257 0.0409579892 -0.0150120871
0.1995775547 0.0939172369 -0.0838117131
0.4079579511 -0.0006364889 -0.0857787171
0.1199937844 0.1085956311 -0.0895405187
0.4462739502 -0.0401474049 -0.0602958898
0.4505289434 0.0351854309 0.0063673141
-0.4487148001 0.3874799062 -0.0253231501
0.1097836106 -0.1785126049 -0.0020327873
0.4211873191 -0.0075940812 0.0358897091
0.4840855533 -0.0228908672 -0.0521632526
-0.4488668683 -0.3866947258 -0.0364951433
-0.2381192588 -0.1003360015 -0.0041336522
0.0092135691 -0.1221843855 0.0648393677
-0.4176035645 -0.0002495530 -0.0294517313
-0.3186364854 -0.0441583182 -0.0506754298
-0.2546548180 0.1322880402 -0.0524689745
0.2004796898 -0.1978057630 -0.0350357472
0.0044378914 0.2058443000 -0.0698103460
-0.1204689391 -0.2244865296 -0.0294651386
0.2765807073 -0.0720150667 -0.0382598904
0.1124857824 0.2820538802 -0.0124010605
0.1998837807 0.1667599067 -0.0666240291
0.4086029969 -0.0600078780 -0.0503795581
-0.3684716337 -0.0490239620 -0.0270557552
0.2092105466 0.1009588260 0.0397088615
-0.3182662482 0.1005486556 -0.0297386953
-0.2548978216 0.0744840416 -0.0661081468
-0.2892420058 -0.1849314868 -0.0065169211
0.0088303366 0.2103121826 0.0448751601
-0.0212441255 -0.4999961994 -0.0249997421
-0.0766898753 -0.5000000000 -0.0239957803
-0.0591475255 -0.4998983529 -0.0167400289
-0.0037007233 -0.4998945522 -0.0177440098
0.2586201570 0.0716491647 0.0162387974
0.4689796463 -0.0077868092 -0.0701595480
0.4459310865 -0.0079126217 -0.0791091770
-0.1189814309 0.1116475288 0.0538997365
-0.3306263397 -0.1910925755 -0.0350501208
0.1276388314 0.1970177637 0.0386330693
0.2586639705 -0.0702811754 0.0181211959
0.1262117910 0.2345114142 -0.0400360853
-0.2153997165 -0.2567160090 -0.0397041027
0.2483591227 -0.0018656061 -0.0725058274
0.4923846070 0.0053357366 -0.0450244512
0.1199671726 -0.0030071324 -0.0913745486
0.4575677683 -0.0389500993 -0.0306067180
-0.3275169427 0.3644129768 -0.0225110483
0.0050240557 0.2440152584 -0.0372937797
0.4831254014 -0.0150589143 -0.0146906544
0.4693437389 0.0362126641 -0.0498852574
0.1184476691 0.4049643238 -0.0454279156
0.1188284485 0.4052433633 -0.0243975741
0.4535019261 -0.0346128808 0.0000515954
0.4585648232 -0.0250407011 0.0035790603
0.4425732001 0.0450766409 -0.0126569781
0.4098200266 -0.0415875873 0.0169030099
0.4082882527 -0.0427100886 -0.0676964381
0.0382230681 0.3203098285 -0.0428521219
0.0386038475 0.3205888679 -0.0218217804
-0.1191150847 -0.1866288946 0.0454474273
-0.4175991303 -0.0050384626 -0.0292249688
0.4462926924 0.0449713895 -0.0174250837
-0.1205555930 -0.0028951488 -0.0846351547
0.4464396675 0.0500101964 -0.0508025247
0.4926340375 0.0038353366 -0.0384644708
0.4462538980 0.0248099758 -0.0611574088
0.1996322378 -0.0866332532 -0.0814170829
-0.3235845886 -0.0504477175 0.0125008201
0.4927176761 -0.0013229864 -0.0362487222
0.1279105719 0.1167366300 0.0533365553
0.2576661387 -0.1440812427 -0.0372653918
-0.4491025778 0.3860713917 -0.0467442633
0.0097147038 0.0016135820 0.0929841573
-0.1184285516 0.0014550870 0.0840164284
0.4429393270 0.0382325030 0.0075371867
-0.4484783965 -0.3875343959 -0.0150442128
0.4516499233 -0.0374580385 -0.0102005967
-0.2898792578 0.1833685525 -0.0403743143
0.0504840543 -0.1859664266 -0.0123702676
0.0500118937 -0.1863124312 -0.0384475670
-0.0434898270 0.4268677691 -0.0411032312
-0.0431852027 0.4270910013 -0.0242789159
-0.2079673316 -0.1322518389 0.0084279137
-0.4175871124 -0.0088406433 -0.0285756495
0.3027604482 0.0050030589 0.0282035039
-0.2150319207 0.2580984683 -0.0175592623
-0.3302191040 0.1925504303 -0.0111655561
-0.1192298182 0.1884495632 0.0404728050
0.2078644621 -0.2029543050 -0.0356654872
0.4823725153 -0.0229784346 -0.0353109158
0.4331146092 -0.0413547656 -0.0125971006
0.4436162389 -0.0392908318 -0.0096191435
0.0384177444 -0.3205554206 -0.0343523755
0.0387985238 -0.3202763812 -0.0133220340
-0.3993361285 0.2359455808 -0.0395221829
0.4839989688 0.0048311513 -0.0568401030
-0.2387043147 0.0988976076 -0.0357484297
-0.3614032225 0.0401244303 -0.0346834469
-0.0432293725 -0.4270801284 -0.0297774051
-0.0429247482 -0.4268568963 -0.0129530898
0.4840060730 -0.0181822184 -0.0565348805
0.2585594072 0.1210127326 0.0130706464
-0.1789592164 0.1615283881 -0.0409468108
0.4519175383 0.0379773452 -0.0039730742
0.4594277345 -0.0353969925 -0.0146792555
-0.0884230167 -0.4766875843 -0.0270384008
-0.3185291408 -0.0781216702 -0.0448756879
-0.3681326862 -0.0239546782 -0.0082418164
-0.2542779846 0.1568271249 -0.0315647239
-0.3915120984 0.0284285131 -0.0221826496
-0.3919711346 0.0280921262 -0.0475350913
0.1203478556 0.1928189462 -0.0696674068
-0.4616449428 0.0152151229 -0.0262517316
-0.4618844405 0.0150396163 -0.0394791199
-0.4777610969 0.0020273733 -0.0296448020
-0.4778908262 0.0019323062 -0.0368097163
-0.2576510580 0.1352298100 0.0266149065
0.4691752652 -0.0327054385 -0.0594504434
-0.0769953833 0.4998948680 -0.0372572768
0.3620051385 -0.0377338607 -0.0620090897
0.3633589954 -0.0367417389 0.0127640548
-0.3681475691 0.0242570947 -0.0088812411
0.0789015914 0.3630514843 -0.0128676891
0.1200571754 -0.1001634720 -0.0867717624
0.1208969231 0.2285750623 -0.0392087236
-0.4927176761 0.3690864912 -0.0372768975
0.4832856092 -0.0000060201 -0.0057858826
-0.1206064280 0.2243062829 -0.0354174221
-0.3186638003 0.0477351778 -0.0518942170
-0.2386442144 -0.0992015637 -0.0331210543
-0.4261479097 0.0056512728 -0.0221579422
-0.0594519810 0.4999964099 -0.0300015431
0.0091384332 0.1246212436 0.0615660066
0.1686084413 0.1718038612 -0.0167312948
0.1680448958 0.1713908886 -0.0478557625
-0.3991924212 -0.2364005448 -0.0332574967
0.4317289677 0.0489543144 -0.0148231497
0.2884980592 0.0625854448 0.0307889658
-0.3301013768 -0.1922259553 -0.0060623118
0.2485640888 -0.1088799555 -0.0615912924
0.2763490790 -0.0558428284 -0.0509907942
-0.4175576903 0.0111643120 -0.0268808404
-0.4923874234 -0.3697178974 -0.0216836949
0.4581189757 0.0318850517 -0.0208863804
-0.2897669671 -0.1837970531 -0.0355046389
-0.0215485810 0.4998984581 -0.0382612549
-0.2416972902 0.2036919236 0.0008761107
-0.2687898724 -0.1470098307 -0.0054038204
-0.1783354564 -0.1630467707 -0.0076690177
-0.4176022014 0.0052509819 -0.0293614379
0.2883978971 0.0371837158 0.0251611567
0.4097939067 0.0430256215 0.0157807990
0.4082621328 0.0419031202 -0.0688186491
0.4589508290 0.0015256314 0.0249394124
-0.1202372848 -0.1696371191 -0.0676290416
-0.3236160035 0.0513184246 0.0111511127
0.1711919042 -0.3044932702 -0.0369695293
0.1715726836 -0.3042142307 -0.0159391878
0.4279011189 -0.0390678035 0.0008953663
0.4468415748 -0.0298758503 0.0178956159
-0.4262244954 -0.0116669396 -0.0264530957
-0.0040062311 0.5000000000 -0.0310055021
0.1210370305 -0.2287063328 -0.0331439627
0.0791223987 -0.3624627593 -0.0032452572
0.3017830292 0.0879000029 0.0080273344
0.4480866261 -0.0324238830 0.0151314929
0.4411845858 0.0422857651 -0.0023176561
-0.3988854677 0.2375823041 -0.0146273673
-0.4261743096 0.0095986455 -0.0236067991
-0.3272940871 -0.3643272433 -0.0128458498
-0.1205311424 0.1038598995 -0.0828806927
-0.4924924154 -0.3694905894 -0.0274812230
0.4208413413 0.0096035392 0.0364995623
-0.2535948660 0.3377547659 -0.0511791227
-0.1196661790 0.2186289044 -0.0347350754
-0.1195332551 -0.2187914211 -0.0289337095
-0.2533882452 -0.3383941418 -0.0422114341
0.2090114813 0.1704171635 0.0289780338
-0.2155559465 0.2561963777 -0.0465068125
0.4085660575 0.0596542772 -0.0519666174
0.2490148803 -0.1404263820 -0.0367567296
0.2765362819 0.0718971703 -0.0401685745
-0.2995530170 -0.0226325585 -0.0220673933
-0.3000519695 -0.0229981965 -0.0496243998
-0.2548546459 -0.0687893153 -0.0642079170
-0.3307431298 0.1906483397 -0.0401131062
0.2762723327 -0.0315603334 -0.0551373351
-0.3614770601 0.0225597806 -0.0388277666
0.4501628161 0.0420306213 -0.0138268647
0.2077413077 0.2028188217 -0.0410471216
-0.3182051627 -0.1007417591 -0.0270689950
-0.1201913981 0.1844262401 -0.0638708026
-0.3685018374 0.0488183821 -0.0283534220
0.3032847683 -0.0754406182 0.0101674161
0.4447726846 0.0335994112 0.0142312404
0.4843099057 -0.0067281440 -0.0607010896
-0.3614636211 -0.0209745894 -0.0382503775
0.0503701711 0.1863575840 -0.0173083581
0.0498980105 0.1860115794 -0.0433856575
0.1995554495 -0.0026053807 -0.0853979145
0.0040315582 -0.0032137537 -0.0929841573
0.2484143769 -0.0615112874 -0.0696801039
0.1279808858 -0.1144485362 0.0564027448
0.4321935467 0.0402684074 0.0108012549
0.4468104842 0.0352917209 0.0111343343
-0.4794097446 -0.3153446517 -0.0302465353
0.3154684496 -0.0004574175 -0.0702036184
0.3637658977 0.0009578131 0.0353787428
0.3171315056 0.0007612888 0.0216465103
0.2097421625 0.0013528566 0.0687494635
0.2586276277 0.0011291764 0.0507464413
0.2809705991 -0.0000594626 -0.0393953990
0.2886362319 0.0009718606 0.0381865768
0.2656886468 -0.0004711447 -0.0700799804
0.1284719703 0.0015295419 0.0839628913
0.2673516990 0.0007475589 0.0217699379
0.3617132002 -0.0005464269 -0.0779911747
0.4840743334 0.0134611015 -0.0526452774
-0.1784351871 0.1634315340 -0.0119990642
-0.2688797050 0.1474044769 -0.0093086075
-0.2415728007 -0.2029905797 0.0062698922
-0.1204694980 -0.0958317358 -0.0802322157
-0.4793399706 0.3158453908 -0.0241316098
0.4441156688 0.0458815928 -0.0220072460
-0.4791472637 -0.3159123948 -0.0157526694
-0.4796019822 0.3148932937 -0.0386053183
-0.3682344853 -0.0408123619 -0.0139276857
0.0529909165 -0.2592566549 -0.0354295781
0.0533716959 -0.2589776155 -0.0143992366
-0.3243000290 -0.1033625526 -0.0272110917
0.2763634830 0.0606449840 -0.0497543273
0.4828714711 0.0172884145 -0.0285919968
0.1203010335 -0.1773204471 -0.0735963101
0.1186946077 -0.4051999667 -0.0346827842
0.1190753871 -0.4049209273 -0.0136524426
0.3983187655 -0.0090038225 0.0381555384
0.4475558689 -0.0393946772 -0.0142069998
-0.2546872827 -0.1217436207 -0.0551654217
0.0051726481 -0.2441618356 -0.0308192352
0.4267912792 0.0466286406 -0.0012334118
0.0723382343 -0.4545898730 -0.0155137618
0.0720564577 -0.4547963621 -0.0310762061
0.2489292725 0.1403083126 -0.0404799810
-0.2709545262 0.2634052443 -0.0025198208
0.2091151157 -0.1687071799 0.0334758026
0.0073248625 0.2503528817 -0.0381160081
-0.0707664320 -0.4765032773 -0.0134734909
-0.3185079412 0.0848086038 -0.0431462493
0.3157019739 0.0321997493 -0.0571831550
0.3168779310 0.0330615041 0.0077646332
0.2659221692 0.0321860208 -0.0570596222
0.2670981244 0.0330477741 0.0078880607
0.2576222071 -0.0000637535 -0.0391754813
0.2576441729 -0.0720724981 -0.0382204365
0.2804315219 0.0342565587 -0.0154590774
0.2332490902 -0.1613328678 -0.0097010782
0.2339494224 -0.0489291716 0.0465535885
0.2094763545 0.0511558413 0.0542291625
0.2332948783 0.1571854496 -0.0060537685
0.2078028849 -0.0000677417 -0.0383563044
0.2078336735 -0.1015110233 -0.0370108958
0.2327037232 0.0293687895 -0.0391562567
0.1677348169 -0.2016832179 -0.0001688560
0.1685150197 -0.1470395273 0.0430971523
0.1688615241 -0.0565478398 0.0625761041
0.1688412584 0.0512441839 0.0618358764
0.1684610266 0.1435768968 0.0411572946
0.1676900695 0.1999182927 -0.0012070261
0.1262831545 -0.0000739208 -0.0369248000
0.1263188363 -0.1173665883 -0.0353691573
0.1670916492 -0.1601604467 -0.0355173222
0.1670738083 -0.1015141129 -0.0362951436
0.1670381266 0.0157785546 -0.0378507863
0.1262474728 0.1172187467 -0.0384804426
0.1874512943 -0.0935878752 -0.0367581367
0.0676180976 -0.2228040485 0.0061802208
0.0082174130 -0.2294028148 0.0094769549
0.0683581376 -0.2016903013 0.0471303029
0.0684691694 -0.1613688019 0.0534148909
0.0090855111 -0.1652367266 0.0576332023
0.0685972275 -0.1183164608 0.0606210562
0.0688427697 -0.0603274218 0.0744011295
0.0094641365 -0.0602854017 0.0789117625
0.0690933370 0.0015715619 0.0884735243
0.0688126378 0.0591751060 0.0731603563
0.0094265685 0.0631174128 0.0772750819
0.0685245026 0.1206789368 0.0574512809
0.0683886323 0.1608195036 0.0500995380
0.0089843849 0.1674667131 0.0532205833
0.0682345840 0.2036649731 0.0417541147
0.0675210638 0.2224117984 0.0024195374
0.0080775995 0.2303325321 0.0033795760
0.0667683267 0.2424321479 -0.0390760467
0.0074011177 -0.0000818402 -0.0347945676
0.0668778179 -0.1173705480 -0.0343040411
0.0074392453 -0.1252992011 -0.0331338473
0.0371775954 -0.1839435550 -0.0328885841
0.0371394678 -0.0587261941 -0.0345493043
0.0371775954 -0.1839435550 -0.0328885841
0.0669159455 -0.2425879089 -0.0326433208
0.0966161680 -0.1760149019 -0.0340587779
0.0668396903 0.0078468129 -0.0359647613
0.0073629901 0.1251355208 -0.0364552878
0.0371013402 0.0664911669 -0.0362100246
0.0370822764 0.1290998473 -0.0370403847
0.0668778179 -0.1173705480 -0.0343040411
0.0965971042 -0.1134062214 -0.0348891380
0.0371394678 -0.0587261941 -0.0345493043
-0.0557557431 -0.2163877986 0.0104809492
-0.1197920119 -0.2055577121 0.0079911443
-0.0550788159 -0.1974589811 0.0479372321
-0.0549507578 -0.1544066401 0.0551433975
-0.0545997564 -0.0539415030 0.0749084553
-0.1186713841 -0.0540207505 0.0704245908
-0.0543569239 0.0015343345 0.0885002928
-0.0546450592 0.0630381653 0.0727912175
-0.1187049912 0.0565513079 0.0689580825
-0.0549214988 0.1181343862 0.0577328716
-0.0550755471 0.1609798557 0.0493874483
-0.0559524779 0.2194012225 0.0011783985
-0.1199181231 0.2063779231 0.0025276915
-0.0566407828 0.2373295823 -0.0367667151
-0.0565645275 -0.0131051396 -0.0334452746
-0.1205376836 -0.0000901233 -0.0324412804
-0.1205033114 -0.1122883265 -0.0309532095
-0.0885167333 -0.1187958346 -0.0314552066
-0.0885339195 -0.0626967330 -0.0321992421
-0.0885854778 0.1056005717 -0.0344313484
-0.1205720558 0.1121080798 -0.0339293513
-0.0725750027 0.0462477161 -0.0339383115
-0.0245435773 -0.1318108508 -0.0324592009
-0.0885167333 -0.1187958346 -0.0314552066
-0.0725062582 -0.1781486902 -0.0309621697
-0.0405540524 -0.0724579952 -0.0329522377
-0.0725062582 -0.1781486902 -0.0309621697
-0.0564957831 -0.2375015458 -0.0304691329
-0.0085331022 -0.1911637064 -0.0319661640
-0.1888653260 -0.1738625556 0.0088658963
-0.1882071549 -0.0940453739 0.0455168374
-0.1879643224 -0.0385695365 0.0591086750
-0.2227322078 -0.0585818482 0.0466547982
-0.1877421457 0.0012686060 0.0715296294
-0.1880185853 0.0563648269 0.0564712835
-0.2225371625 0.0287234760 0.0577570570
-0.1882652519 0.0958593958 0.0429981525
-0.1883894455 0.1342604130 0.0362846867
-0.1891287430 0.1797680465 -0.0044012578
-0.1895914270 -0.0317925115 -0.0307256973
-0.2586647411 -0.0000973550 -0.0298509453
-0.2586401542 -0.0805967857 -0.0287832900
-0.2241034972 -0.0964443640 -0.0292206660
-0.2241157906 -0.0561946486 -0.0297544937
-0.2241526710 0.0645544976 -0.0313559767
-0.2586893280 0.0804020758 -0.0309186007
-0.2068720490 0.0163809930 -0.0310408370
-0.1550301831 -0.1281395205 -0.0300954180
-0.2241034972 -0.0964443640 -0.0292206660
-0.2068228752 -0.1446178685 -0.0289055263
-0.1723108051 -0.0799660160 -0.0304105576
-0.1895422533 -0.1927913731 -0.0285903867
-0.1377495611 -0.1763130251 -0.0297802783
-0.2068228752 -0.1446178685 -0.0289055263
-0.2914891477 -0.0289676096 -0.0288328638
-0.3243313786 -0.0001007776 -0.0285805923
-0.2750523575 -0.0950319130 -0.0282742492
0.2489720764 -0.0000590347 -0.0386183553
0.2004191726 -0.0000607650 -0.0376584157
0.2003889140 0.0988117340 -0.0389697500
0.2247044811 -0.0287487252 -0.0377578641
0.1599627052 0.1433680916 -0.0767395599
0.1597746169 0.0529951252 -0.0874692166
0.1597997052 -0.0448201928 -0.0863958158
0.1599501598 -0.1267635544 -0.0783968684
0.1603903616 -0.1875631050 -0.0543160286
0.1209669768 -0.0000656353 -0.0361763432
0.1209319500 0.1142547135 -0.0376925334
0.1606453027 0.1559694732 -0.0389868088
0.1606628161 0.0988092988 -0.0382287137
0.1606978429 -0.0155110499 -0.0367125235
0.1210020037 -0.1143859840 -0.0346601529
0.1805282491 0.0910865915 -0.0384968039
0.0626859557 0.2184171023 -0.0534805932
0.0622158379 0.1572199655 -0.0796754323
0.0042483674 0.1608872172 -0.0804182985
0.0620263139 0.1122628827 -0.0902833849
0.0620130080 0.0564615010 -0.0912003999
0.0040452008 0.0563581904 -0.0920052042
0.0619993654 -0.0031104430 -0.0921793530
0.0620443668 -0.0516886129 -0.0898779598
0.0040790734 -0.0550737776 -0.0905272910
0.0620918820 -0.1035486367 -0.0874210935
0.0622138110 -0.1421271243 -0.0808333674
0.0627119778 -0.2090049383 -0.0535743062
0.0050983519 -0.0000732886 -0.0340565075
0.0629976375 0.1142508868 -0.0366326155
0.0050612038 0.1219709849 -0.0356751436
0.0340108466 0.1791330726 -0.0369631976
0.0340479947 0.0570887991 -0.0353445615
0.0340108466 0.1791330726 -0.0369631976
0.0629604894 0.2362951604 -0.0382512517
0.0919472803 0.1714129746 -0.0379206696
0.0630347856 -0.0077933867 -0.0350139794
0.0051355000 -0.1221175621 -0.0324378714
0.0340851428 -0.0649554744 -0.0337259254
0.0341037168 -0.1259776112 -0.0329166073
0.0629976375 0.1142508868 -0.0366326155
0.0919658544 0.1103908378 -0.0371113515
0.0340479947 0.0570887991 -0.0353445615
-0.0576141438 0.2122366022 -0.0522727107
-0.0580662774 0.1501781873 -0.0774485268
-0.1203612703 0.1441430698 -0.0733757476
-0.0582361495 0.1098950170 -0.0869534719
-0.0582497921 0.0503230729 -0.0879324250
-0.1205433677 0.0504823754 -0.0837579237
-0.0582620174 -0.0030544512 -0.0888096560
-0.0582145022 -0.0549144751 -0.0863527897
-0.1205125455 -0.0493634423 -0.0824336852
-0.0581714548 -0.1013827686 -0.0841513202
-0.0580412865 -0.1425676398 -0.0771184327
-0.0575323184 -0.2068994774 -0.0492241384
-0.0572545997 0.0126119186 -0.0331137446
-0.1195997171 -0.0000812584 -0.0318343925
-0.1196329481 0.1092738230 -0.0332847339
-0.0884603894 0.1156204115 -0.0339244100
-0.0884437739 0.0609428708 -0.0331992393
-0.0883939274 -0.1030897512 -0.0310237271
-0.1195664861 -0.1094363398 -0.0303840510
-0.0728242636 -0.0452389163 -0.0320687358
-0.0261152720 0.1283135885 -0.0352037622
-0.0884603894 0.1156204115 -0.0339244100
-0.0728907255 0.1734712465 -0.0349694188
-0.0416849359 0.0704627536 -0.0341587534
-0.0728907255 0.1734712465 -0.0349694188
-0.0573210617 0.2313220814 -0.0360144276
-0.0105456082 0.1861644235 -0.0362487709
-0.1875929802 0.1180739699 -0.0676748336
-0.1877267073 0.0357944464 -0.0753716508
-0.2213122644 0.0551392440 -0.0707398988
-0.1877360037 -0.0025029313 -0.0760009721
-0.1876929562 -0.0489712248 -0.0737995026
-0.1875459653 -0.1192132172 -0.0659184793
-0.1871102689 -0.1702675209 -0.0420495656
-0.1869241685 0.0308092497 -0.0310687552
-0.2542300713 -0.0000916400 -0.0294835795
-0.2542540280 0.0783677424 -0.0305241517
-0.2206010766 0.0938181873 -0.0313167396
-0.2205890983 0.0545884961 -0.0307964535
-0.2205531633 -0.0631005776 -0.0292355952
-0.2542061147 -0.0785510225 -0.0284430073
-0.2037386659 -0.0161456640 -0.0301521752
-0.1532951738 0.1247190770 -0.0329019153
-0.2206010766 0.0938181873 -0.0313167396
-0.2037865792 0.1407731010 -0.0322333196
-0.1701096712 0.0777641634 -0.0319853353
-0.1869720818 0.1877280146 -0.0331498996
-0.1364806764 0.1716739907 -0.0338184954
-0.2037865792 0.1407731010 -0.0322333196
-0.2862415737 0.0280426829 -0.0293168594
-0.3182357054 -0.0000965517 -0.0284038451
-0.2702597792 0.0924349039 -0.0304407916
0.4085845272 -0.0001768004 -0.0511730877
0.1699976539 0.2381733383 -0.0203721821
0.1451076575 0.3548930893 -0.0242053217
0.0178581943 0.3950712428 -0.0185733025
0.1104384380 0.2152019758 -0.0450795424
0.1046145776 0.3122868022 -0.0439477664
0.1406781471 -0.2413634178 -0.0089859876
0.1158665101 -0.3431907408 -0.0092898334
0.1106018989 -0.2454028507 -0.0377085482
0.1696708362 -0.2381184149 -0.0401371688
0.1090808309 -0.1790279954 -0.0408761877
0.0858427621 -0.3322283108 -0.0350561812
0.1449432559 -0.3548466184 -0.0358261568
0.1120914104 -0.2818749625 -0.0361995537
-0.2990436152 -0.3135585998 -0.0041934060
0.2804315219 0.0342565587 -0.0154590774
0.3025338988 0.0062296924 0.0090973752
0.2690048986 0.0891051472 -0.0282723241
0.2327037232 0.0293687895 -0.0391562567
0.2576222071 -0.0000637535 -0.0391754813
0.2202225154 0.1160938056 -0.0401016891
0.1677348169 -0.2016832179 -0.0001688560
0.1685150197 -0.1470395273 0.0430971523
0.1688615241 -0.0565478398 0.0625761041
0.1688412584 0.0512441839 0.0618358764
0.1684610266 0.1435768968 0.0411572946
0.1676900695 0.1999182927 -0.0012070261
0.1670381266 0.0157785546 -0.0378507863
0.2078028849 -0.0000677417 -0.0383563044
0.2077720963 0.1013755400 -0.0397017130
0.1874512943 -0.0935878752 -0.0367581367
0.1466249588 0.1251449844 -0.0389434358
0.1873897171 0.1092986881 -0.0394489539
0.1364183749 0.1798281993 -0.0394897605
0.0676180976 -0.2228040485 0.0061802208
0.1270566701 -0.2148753954 0.0050100271
0.0669159455 -0.2425879089 -0.0326433208
0.0684691694 -0.1613688019 0.0534148909
0.0688427697 -0.0603274218 0.0744011295
0.1282264280 -0.0564594971 0.0701828180
0.0685972275 -0.1183164608 0.0606210562
0.0688126378 0.0591751060 0.0731603563
0.1281912711 0.0591330859 0.0686497233
0.0690933370 0.0015715619 0.0884735243
0.0683886323 0.1608195036 0.0500995380
0.0675210638 0.2224117984 0.0024195374
0.1269253112 0.2157645889 -0.0007015080
0.0682345840 0.2036649731 0.0417541147
0.0668396903 0.0078468129 -0.0359647613
0.1262831545 -0.0000739208 -0.0369248000
0.1262474728 0.1172187467 -0.0384804426
0.0965257406 0.1211791136 -0.0380004233
0.0965435815 0.0625327798 -0.0372226020
0.0965971042 -0.1134062214 -0.0348891380
0.1263188363 -0.1173665883 -0.0353691573
0.0817183972 -0.0527797042 -0.0354269497
0.0370822764 0.1290998473 -0.0370403847
0.0965257406 0.1211791136 -0.0380004233
0.0816470337 0.1818056308 -0.0385382350
0.0519609833 0.0684733301 -0.0365025730
0.0816470337 0.1818056308 -0.0385382350
0.0667683267 0.2424321479 -0.0390760467
0.0222035694 0.1897263645 -0.0375781964
-0.0557557431 -0.2163877986 0.0104809492
0.0082174130 -0.2294028148 0.0094769549
-0.0564957831 -0.2375015458 -0.0304691329
-0.0549507578 -0.1544066401 0.0551433975
0.0090855111 -0.1652367266 0.0576332023
-0.0550788159 -0.1974589811 0.0479372321
-0.0545997564 -0.0539415030 0.0749084553
0.0094641365 -0.0602854017 0.0789117625
-0.0548503237 -0.1158404867 0.0608360604
-0.0546450592 0.0630381653 0.0727912175
0.0094265685 0.0631174128 0.0772750819
-0.0543569239 0.0015343345 0.0885002928
-0.0550755471 0.1609798557 0.0493874483
0.0089843849 0.1674667131 0.0532205833
-0.0549214988 0.1181343862 0.0577328716
-0.0559524779 0.2194012225 0.0011783985
0.0080775995 0.2303325321 0.0033795760
-0.0551997408 0.1993808729 0.0426739826
0.0074011177 -0.0000818402 -0.0347945676
-0.0566026552 0.1121122214 -0.0351059949
0.0073629901 0.1251355208 -0.0364552878
-0.0246388964 0.1812325515 -0.0366110015
-0.0246007687 0.0560151906 -0.0349502812
-0.0246388964 0.1812325515 -0.0366110015
-0.0566407828 0.2373295823 -0.0367667151
-0.0886045416 0.1682092522 -0.0352617085
-0.0565645275 -0.0131051396 -0.0334452746
0.0074392453 -0.1252992011 -0.0331338473
-0.0245626411 -0.0692021703 -0.0332895610
-0.0245435773 -0.1318108508 -0.0324592009
-0.0566026552 0.1121122214 -0.0351059949
-0.0885854778 0.1056005717 -0.0344313484
-0.0246007687 0.0560151906 -0.0349502812
-0.1888653260 -0.1738625556 0.0088658963
-0.1546671326 -0.1991745426 -0.0102996212
-0.1895422533 -0.1927913731 -0.0285903867
-0.1883420608 -0.1602543422 0.0378157544
-0.1882416268 -0.1216881888 0.0435084173
-0.1536281387 -0.1348754650 0.0473242538
-0.1879643224 -0.0385695365 0.0591086750
-0.1186713841 -0.0540207505 0.0704245908
-0.1882071549 -0.0940453739 0.0455168374
-0.1880185853 0.0563648269 0.0564712835
-0.1187049912 0.0565513079 0.0689580825
-0.1877421457 0.0012686060 0.0715296294
-0.1883894455 0.1342604130 0.0362846867
-0.1538096318 0.1613549881 0.0383787459
-0.1882652519 0.0958593958 0.0429981525
-0.1891287430 0.1797680465 -0.0044012578
-0.1548675855 0.2020371647 -0.0199093400
-0.1884404381 0.1618396866 0.0335438558
-0.1205376836 -0.0000901233 -0.0324412804
-0.1205720558 0.1121080798 -0.0339293513
-0.1896601715 0.1926038948 -0.0337018391
-0.1896429854 0.1365047932 -0.0329578036
-0.1205892419 0.1682071814 -0.0346733867
-0.1896257992 0.0804056916 -0.0322137682
-0.1205548697 0.0560089782 -0.0331853158
-0.1896429854 0.1365047932 -0.0329578036
-0.1895914270 -0.0317925115 -0.0307256973
-0.1205033114 -0.1122883265 -0.0309532095
-0.1205204975 -0.0561892249 -0.0316972450
-0.1550301831 -0.1281395205 -0.0300954180
-0.1896257992 0.0804056916 -0.0322137682
-0.2241526710 0.0645544976 -0.0313559767
-0.1896086131 0.0243065901 -0.0314697328
-0.2909345330 -0.1186211712 0.0014864949
-0.2903201642 -0.0246827962 0.0357718253
-0.2903629847 0.0404084441 0.0336533847
-0.2912828042 0.1237358922 -0.0168881389
-0.2586647411 -0.0000973550 -0.0298509453
-0.2586893280 0.0804020758 -0.0309186007
-0.2915383215 0.1320312520 -0.0309681745
-0.2915137346 0.0515318212 -0.0299005191
-0.2914891477 -0.0289676096 -0.0288328638
-0.2586401542 -0.0805967857 -0.0287832900
-0.3079259379 0.0370966939 -0.0293914784
-0.3243313786 -0.0001007776 -0.0285805923
-0.3684867356 -0.0001027900 -0.0277045886
0.2247044811 -0.0287487252 -0.0377578641
0.2489720764 -0.0000590347 -0.0386183553
0.2125920855 -0.1132772441 -0.0363968056
0.1599627052 0.1433680916 -0.0767395599
0.1597746169 0.0529951252 -0.0874692166
0.1597997052 -0.0448201928 -0.0863958158
0.1599501598 -0.1267635544 -0.0783968684
0.1606978429 -0.0155110499 -0.0367125235
0.2004191726 -0.0000607650 -0.0376584157
0.2004494312 -0.0989332640 -0.0363470814
0.1805282491 0.0910865915 -0.0384968039
0.1408674367 -0.1221086914 -0.0349282431
0.1805887664 -0.1066584064 -0.0358741353
0.1309522336 -0.1754075121 -0.0340361029
0.0626859557 0.2184171023 -0.0534805932
0.0622158379 0.1572199655 -0.0796754323
0.0620130080 0.0564615010 -0.0912003999
0.1199804785 0.0527942493 -0.0904575337
0.0620263139 0.1122628827 -0.0902833849
0.0620443668 -0.0516886129 -0.0898779598
0.1200121740 -0.0515853022 -0.0890731555
0.0619993654 -0.0031104430 -0.0921793530
0.0622138110 -0.1421271243 -0.0808333674
0.0627119778 -0.2090049383 -0.0535743062
0.0630347856 -0.0077933867 -0.0350139794
0.1209669768 -0.0000656353 -0.0361763432
0.1210020037 -0.1143859840 -0.0346601529
0.0920359081 -0.1182498597 -0.0340789711
0.0920183946 -0.0610896853 -0.0348370662
0.0919658544 0.1103908378 -0.0371113515
0.1209319500 0.1142547135 -0.0376925334
0.0775003200 0.0512987256 -0.0360626655
0.0341037168 -0.1259776112 -0.0329166073
0.0920359081 -0.1182498597 -0.0340789711
0.0775703737 -0.1773419720 -0.0330302850
0.0485692512 -0.0668854989 -0.0339652934
0.0775703737 -0.1773419720 -0.0330302850
0.0631048393 -0.2364340842 -0.0319815990
0.0196381825 -0.1850697234 -0.0318679213
-0.0576141438 0.2122366022 -0.0522727107
-0.0580662774 0.1501781873 -0.0774485268
0.0042483674 0.1608872172 -0.0804182985
-0.0578767534 0.1951352701 -0.0668405743
-0.0582497921 0.0503230729 -0.0879324250
0.0040452008 0.0563581904 -0.0920052042
-0.0582361495 0.1098950170 -0.0869534719
-0.0582145022 -0.0549144751 -0.0863527897
0.0040790734 -0.0550737776 -0.0905272910
-0.0582620174 -0.0030544512 -0.0888096560
-0.0580412865 -0.1425676398 -0.0771184327
0.0042567568 -0.1481186727 -0.0810375372
-0.0581714548 -0.1013827686 -0.0841513202
-0.0575323184 -0.2068994774 -0.0492241384
0.0050983519 -0.0000732886 -0.0340565075
-0.0572174516 -0.1094323549 -0.0314951085
0.0051355000 -0.1221175621 -0.0324378714
-0.0260224018 -0.1767970953 -0.0311571719
-0.0260595499 -0.0547528217 -0.0327758080
-0.0260224018 -0.1767970953 -0.0311571719
-0.0571803035 -0.2314766284 -0.0298764724
-0.0883753534 -0.1641118880 -0.0302144090
-0.0572545997 0.0126119186 -0.0331137446
0.0050612038 0.1219709849 -0.0356751436
-0.0260966980 0.0672914518 -0.0343944441
-0.0261152720 0.1283135885 -0.0352037622
-0.0572174516 -0.1094323549 -0.0314951085
-0.0883939274 -0.1030897512 -0.0310237271
-0.0260595499 -0.0547528217 -0.0327758080
-0.1869720818 0.1877280146 -0.0331498996
-0.1874231080 0.1583571402 -0.0581698885
-0.1875929802 0.1180739699 -0.0676748336
-0.1539771252 0.1311085199 -0.0705252906
-0.1877267073 0.0357944464 -0.0753716508
-0.1205433677 0.0504823754 -0.0837579237
-0.1877144820 0.0891719706 -0.0744944197
-0.1876929562 -0.0489712248 -0.0737995026
-0.1205125455 -0.0493634423 -0.0824336852
-0.1877360037 -0.0025029313 -0.0760009721
-0.1875459653 -0.1192132172 -0.0659184793
-0.1871102689 -0.1702675209 -0.0420495656
-0.1195997171 -0.0000812584 -0.0318343925
-0.1195664861 -0.1094363398 -0.0303840510
-0.1868577066 -0.1879009130 -0.0281680723
-0.1868743221 -0.1332233724 -0.0288932430
-0.1195498706 -0.1641138804 -0.0296588802
-0.1868909376 -0.0785458317 -0.0296184138
-0.1195831016 -0.0547587991 -0.0311092217
-0.1868743221 -0.1332233724 -0.0288932430
-0.1869241685 0.0308092497 -0.0310687552
-0.1196329481 0.1092738230 -0.0332847339
-0.1196163326 0.0545962823 -0.0325595632
-0.1532951738 0.1247190770 -0.0329019153
-0.1868909376 -0.0785458317 -0.0296184138
-0.2205531633 -0.0631005776 -0.0292355952
-0.1869075531 -0.0238682910 -0.0303435845
-0.2542300713 -0.0000916400 -0.0294835795
-0.2542061147 -0.0785510225 -0.0284430073
-0.2862415737 0.0280426829 -0.0293168594
-0.3182357054 -0.0000965517 -0.0284038451
-0.3612740004 -0.0001004917 -0.0276991823
-0.3445543700 0.0091147954 -0.0486932743
-0.3455325577 0.0028979773 -0.0221250214
0.0207261429 0.4524295959 -0.0413425962
0.0148667809 0.4407339432 -0.0425541946
0.0148667809 0.4407339432 -0.0425541946
0.0374789211 0.4159160465 -0.0432655734
-0.0026333795 0.3735887988 -0.0419776766
0.0783353686 0.3626370761 -0.0441400188
0.0296882337 0.4526198866 -0.0271995586
0.0542949126 0.4078356854 -0.0200336239
0.0097248052 0.4315239471 -0.0214346161
0.1110805338 0.2306355155 -0.0095891981
0.1405471119 0.2269288707 -0.0145661776
0.1251442290 0.3337971498 -0.0184403793
0.1104384380 0.2152019758 -0.0450795424
0.1695254914 0.2378273322 -0.0464495867
0.1119190337 0.2816384195 -0.0436733666
0.1046145776 0.3122868022 -0.0439477664
0.1447268781 0.3546140499 -0.0452356633
0.0783353686 0.3626370761 -0.0441400188
-0.0191360654 -0.4102777103 -0.0291740779
0.0085868095 -0.4102758100 -0.0296760588
0.0254061661 -0.4773962807 -0.0280379741
0.0552371011 -0.3876758914 -0.0327142908
0.0552371011 -0.3876758914 -0.0327142908
0.0377108377 -0.4311786558 -0.0104946335
0.0099874366 -0.4311805561 -0.0099926431
0.0815708437 -0.2337134905 -0.0086487459
0.0662470473 -0.3107201874 -0.0088222469
0.1406781471 -0.2413634178 -0.0089859876
-0.0101745008 -0.4100873670 -0.0150310315
0.0143120115 -0.3651818741 -0.0141765327
0.0099874366 -0.4311805561 -0.0099926431
0.1106018989 -0.2454028507 -0.0377085482
0.0858427621 -0.3322283108 -0.0350561812
-0.3731562710 0.3534206286 -0.0442280101
-0.3731562710 0.3534206286 -0.0442280101
-0.4329369736 0.3612535599 -0.0407524538
-0.3665984241 0.3263240298 -0.0448922205
-0.3665984241 0.3263240298 -0.0448922205
-0.4231002032 0.3206086618 -0.0417487694
-0.3264654972 0.2868501733 -0.0453506528
-0.3264654972 0.2868501733 -0.0453506528
-0.3286043135 0.2387492565 -0.0427318795
-0.2921689979 0.2642015528 -0.0456461144
-0.2921689979 0.2642015528 -0.0456461144
-0.3817836989 0.3164358660 -0.0170036224
-0.3728418560 0.3545621984 -0.0268595053
-0.3174272697 0.3280468875 -0.0196176045
-0.3349199969 0.2504937742 -0.0085735940
-0.3751472484 0.2896253175 -0.0133257153
-0.3349199969 0.2504937742 -0.0085735940
-0.4391127191 0.2767138474 -0.0193794886
-0.3817836989 0.3164358660 -0.0170036224
-0.3751472484 0.2896253175 -0.0133257153
-0.4371982852 0.3429511769 -0.0242455232
-0.2344192371 0.1724484703 -0.0406605626
-0.2344192371 0.1724484703 -0.0406605626
-0.2717370619 0.2605616592 -0.0457767185
-0.3911296912 -0.2766438212 -0.0314929309
-0.3911296912 -0.2766438212 -0.0314929309
-0.4418110533 -0.3230672053 -0.0294870769
-0.3693169177 -0.2852458894 -0.0359998911
-0.3693169177 -0.2852458894 -0.0359998911
-0.4090918930 -0.3359703076 -0.0362475172
-0.3883429593 -0.3749437684 -0.0391644081
-0.3485679840 -0.3242193503 -0.0389167820
-0.3087930087 -0.2734949321 -0.0386691559
-0.3295419424 -0.2345214713 -0.0357522650
-0.3183060295 -0.3183438716 -0.0402514144
-0.3087930087 -0.2734949321 -0.0386691559
-0.3183060295 -0.3183438716 -0.0402514144
-0.2715776061 -0.2610955974 -0.0388580365
-0.3596357699 -0.3251621761 -0.0052925875
-0.2990436152 -0.3135585998 -0.0041934060
-0.3878862418 -0.3759308196 -0.0139450313
-0.3815902834 -0.3162539268 -0.0086123286
-0.3908147146 -0.2773246921 -0.0141003080
-0.3908147146 -0.2773246921 -0.0141003080
-0.3400283602 -0.2311280894 -0.0103086145
-0.3815902834 -0.3162539268 -0.0086123286
-0.2460162298 -0.2187978527 -0.0376662442
-0.2161243343 -0.2501532415 -0.0394342426
-0.2423302221 -0.1589997082 -0.0353936492
-0.2460162298 -0.2187978527 -0.0376662442
0.3025338988 0.0062296924 0.0090973752
0.2731011459 -0.1024487799 -0.0024198844
0.2796806523 0.1159268693 -0.0165291182
0.2804754535 -0.1097609304 -0.0135489879
0.2804534877 -0.0377521858 -0.0145040326
0.2576002412 0.0719449911 -0.0401305261
0.2918581451 -0.0205920297 -0.0026458307
0.2338895431 -0.1194941777 0.0257984993
0.2340482557 0.0614025030 0.0352339800
0.2341811597 0.0365010107 0.0424941304
0.2337854443 0.1457149480 0.0210243401
0.2078490678 -0.1522326642 -0.0363381915
0.2327345118 -0.0720744922 -0.0378108481
0.2077720963 0.1013755400 -0.0397017130
0.2451849310 -0.0573562266 -0.0382108242
0.1270566701 -0.2148753954 0.0050100271
0.1684369690 -0.1818993575 0.0386546857
0.1278698540 -0.1547700356 0.0501181568
0.1686260514 -0.1067180278 0.0493817402
0.1282264280 -0.0564594971 0.0701828180
0.1691070664 0.0014411992 0.0763561774
0.1281912711 0.0591330859 0.0686497233
0.1685605592 0.1088477280 0.0465227084
0.1277747016 0.1568771969 0.0459848123
0.1683251563 0.1837174636 0.0338055516
0.1269253112 0.2157645889 -0.0007015080
0.1669765493 0.2186651179 -0.0405416034
0.1263366772 -0.1760129221 -0.0345913359
0.1671094901 -0.2188067804 -0.0347395009
0.1263009954 -0.0587202546 -0.0361469786
0.1670916492 -0.1601604467 -0.0355173222
0.1262653137 0.0585724129 -0.0377026213
0.1466249588 0.1251449844 -0.0389434358
0.1568672244 -0.0468308980 -0.0368414683
0.1670738083 -0.1015141129 -0.0362951436
0.0392787368 -0.0293569199 0.0836926434
0.0390281694 -0.0912559037 0.0696202486
0.0986573700 -0.0293989400 0.0791820104
0.0392787368 -0.0293569199 0.0836926434
0.0389755355 0.0918981748 0.0673631814
0.0392636708 0.0303943440 0.0830722568
0.0983616049 0.0879558680 0.0632484558
0.0389755355 0.0918981748 0.0673631814
0.0520277067 -0.1506570515 -0.0335963126
0.0074583091 -0.1879078816 -0.0323034872
0.0074201815 -0.0626905206 -0.0339642075
0.0222893566 -0.0920126976 -0.0338415758
0.0817660567 -0.2093014054 -0.0333510493
0.0223274842 -0.2172300585 -0.0321808556
0.0520277067 -0.1506570515 -0.0335963126
0.0817660567 -0.2093014054 -0.0333510493
0.0073820539 0.0625268403 -0.0356249277
0.0222512289 0.0332046633 -0.0355022961
0.0073439263 0.1877442012 -0.0372856480
0.0371013402 0.0664911669 -0.0362100246
0.0668587541 -0.0547618675 -0.0351344012
0.0966161680 -0.1760149019 -0.0340587779
0.0668587541 -0.0547618675 -0.0351344012
0.0519895790 -0.0254396906 -0.0352570328
-0.0869324872 -0.1319516140 0.0559880754
-0.0548503237 -0.1158404867 0.0608360604
-0.0865141540 -0.0262432080 0.0794624418
-0.0867569865 -0.0817190454 0.0658706042
-0.0224425263 -0.0261639605 0.0839463063
-0.0865141540 -0.0262432080 0.0794624418
-0.0868132450 0.0873428470 0.0633454770
-0.0865368054 0.0322466261 0.0784038229
-0.0227533130 0.0938297044 0.0671786120
-0.0868132450 0.0873428470 0.0633454770
-0.0870284890 0.1363136922 0.0516435924
-0.0551997408 0.1993808729 0.0426739826
-0.0885339195 -0.0626967330 -0.0321992421
-0.1204861253 -0.1683874280 -0.0302091741
-0.1045358015 -0.0313934282 -0.0323202612
-0.1205204975 -0.0561892249 -0.0316972450
-0.1205548697 0.0560089782 -0.0331853158
-0.1045959529 0.1649534273 -0.0349243853
-0.1045615807 0.0527552242 -0.0334363144
-0.0965563431 0.0230787964 -0.0331897959
-0.0485249178 -0.1549797705 -0.0317106853
-0.1044928362 -0.1716411821 -0.0304601726
-0.0725406304 -0.0659504871 -0.0324502406
-0.0645353929 -0.0956269149 -0.0322037222
-0.0325144426 -0.2143326261 -0.0312176484
-0.0964875987 -0.2013176099 -0.0302136542
-0.0485249178 -0.1549797705 -0.0317106853
-0.0325144426 -0.2143326261 -0.0312176484
-0.2232171815 -0.1538711726 0.0195249889
-0.1883420608 -0.1602543422 0.0378157544
-0.1882416268 -0.1216881888 0.0435084173
-0.2228880959 -0.1139625818 0.0378504594
-0.2572779165 -0.0387560174 0.0466218760
-0.2225100311 -0.0187437057 0.0590757527
-0.1531964370 -0.0185572247 0.0715625517
-0.2225100311 -0.0187437057 0.0590757527
-0.2573024063 0.0405766939 0.0455696994
-0.2227838291 0.0682180448 0.0442839260
-0.1535000081 0.0840061778 0.0551855100
-0.2227838291 0.0682180448 0.0442839260
-0.2229692592 0.1071658379 0.0341906276
-0.1884404381 0.1618396866 0.0335438558
-0.2233899005 0.1574989283 0.0111068243
-0.1896601715 0.1926038948 -0.0337018391
-0.2909345330 -0.1186211712 0.0014864949
-0.2903201642 -0.0246827962 0.0357718253
-0.2903629847 0.0404084441 0.0336533847
-0.2906335308 0.0932741173 0.0188830096
-0.3243157038 -0.0517316651 -0.0278958420
-0.3079259379 0.0370966939 -0.0293914784
-0.3078945884 -0.0661650811 -0.0280219777
-0.2914577982 -0.1322293846 -0.0274633632
-0.3464009332 -0.0272720853 -0.0277822568
0.2489506744 0.0701246389 -0.0395491681
0.2627755811 -0.0342646059 -0.0384626521
0.2241292973 0.1167049404 -0.0690019573
0.2239683387 0.0460258154 -0.0781587703
0.1995938436 -0.0446193170 -0.0834074987
0.1997376910 -0.1199984450 -0.0757195287
0.2247472851 -0.1691160725 -0.0358962384
0.2003737847 0.1482479834 -0.0396254171
0.2246742225 0.0701237738 -0.0390691984
0.2004494312 -0.0989332640 -0.0363470814
0.2368168768 0.0557797937 -0.0391189225
0.1603903519 0.1976674845 -0.0529163764
0.1201708200 0.1507072887 -0.0796039627
0.1597856695 0.1012564340 -0.0866761159
0.1199804785 0.0527942493 -0.0904575337
0.1597613110 -0.0028062565 -0.0883862315
0.1200121740 -0.0515853022 -0.0890731555
0.1598447066 -0.0933983626 -0.0840944226
0.1201791044 -0.1387419595 -0.0801840362
0.1600720889 -0.1653420419 -0.0718091422
0.1209144366 0.1714148879 -0.0384506285
0.1606277892 0.2131296476 -0.0397449039
0.1209494634 0.0570945391 -0.0369344383
0.1606453027 0.1559694732 -0.0389868088
0.1209844903 -0.0572258096 -0.0354182480
0.1408674367 -0.1221086914 -0.0349282431
0.1507476130 0.0455104781 -0.0373365735
0.1606628161 0.0988092988 -0.0382287137
0.0338550057 0.2312161804 -0.0453871865
0.0623928735 0.1993316231 -0.0697388764
0.0330222831 0.0266238737 -0.0920922786
0.0330359257 0.0861958177 -0.0911133255
0.0909900903 0.0267271843 -0.0912874742
0.0330222831 0.0266238737 -0.0920922786
0.0330854777 -0.0793112072 -0.0889741923
0.0330379625 -0.0274511833 -0.0914310586
0.0910507711 -0.0759260424 -0.0883248611
0.0330854777 -0.0793112072 -0.0889741923
0.0042567568 -0.1481186727 -0.0810375372
0.0623439793 -0.1833119955 -0.0738004798
0.0339423129 -0.2265833870 -0.0421967707
0.0631048393 -0.2364340842 -0.0319815990
0.0485042421 0.1466919797 -0.0367979066
0.0050426297 0.1829931217 -0.0364844617
0.0050797778 0.0609488481 -0.0348658255
0.0195545992 0.0895298920 -0.0355098526
0.0774538849 0.2038540675 -0.0380859606
0.0195174511 0.2115741655 -0.0371284887
0.0485042421 0.1466919797 -0.0367979066
0.0774538849 0.2038540675 -0.0380859606
0.0051169259 -0.0610954254 -0.0332471894
0.0195917473 -0.0325143815 -0.0338912164
0.0051540740 -0.1831396989 -0.0316285533
0.0340851428 -0.0649554744 -0.0337259254
0.0630162116 0.0532287501 -0.0358232975
0.0919472803 0.1714129746 -0.0379206696
0.0630162116 0.0532287501 -0.0358232975
0.0485413901 0.0246477062 -0.0351792705
-0.0889027710 0.1983314212 -0.0580717566
-0.0578767534 0.1951352701 -0.0668405743
-0.0894026925 0.0237139621 -0.0862837899
-0.0893904672 0.0770914862 -0.0854065588
-0.0271091169 0.0235546596 -0.0904582911
-0.0894026925 0.0237139621 -0.0862837899
-0.0893420001 -0.0753731055 -0.0832925027
-0.0893850476 -0.0289048120 -0.0854939722
-0.0270439569 -0.0809241383 -0.0872116072
-0.0893420001 -0.0753731055 -0.0832925027
-0.0892553923 -0.1191996878 -0.0786753242
-0.0579251799 -0.1794703315 -0.0708168456
-0.0888848016 -0.1882682982 -0.0584265900
-0.0571803035 -0.2314766284 -0.0298764724
-0.0884437739 0.0609428708 -0.0331992393
-0.1196495635 0.1639513637 -0.0340099047
-0.1040217455 0.0304308062 -0.0325168159
-0.1196163326 0.0545962823 -0.0325595632
-0.1195831016 -0.0547587991 -0.0311092217
-0.1039635913 -0.1609405862 -0.0299787183
-0.1039968223 -0.0515855048 -0.0314290598
-0.0962119903 -0.0226600873 -0.0319515641
-0.0495029988 0.1508924175 -0.0350865905
-0.1040632842 0.1671246579 -0.0343297427
-0.0728574946 0.0641161651 -0.0335190773
-0.0650726626 0.0930415825 -0.0340415817
-0.0339333349 0.2087432524 -0.0361315992
-0.0962784523 0.1960500754 -0.0348522471
-0.0495029988 0.1508924175 -0.0350865905
-0.0339333349 0.2087432524 -0.0361315992
-0.1874231080 0.1583571402 -0.0581698885
-0.2212454009 0.0962790058 -0.0668914902
-0.1877144820 0.0891719706 -0.0744944197
-0.2213046854 -0.0255409693 -0.0705831460
-0.1876620719 -0.0823105255 -0.0722200664
-0.2212003056 -0.0940012662 -0.0650631982
-0.1874622837 -0.1456903699 -0.0613972316
-0.2208987758 -0.1460055708 -0.0486074937
-0.1868577066 -0.1879009130 -0.0281680723
-0.2867901074 0.0228122320 -0.0596305032
-0.3182509768 0.0502260519 -0.0290712702
-0.3022233682 -0.0363495381 -0.0281929272
-0.3022539109 0.0642956693 -0.0295277774
-0.2862721164 0.1286878903 -0.0306517096
-0.3397627647 0.0263834307 -0.0284027442
0.4330761478 -0.0195634498 -0.0408899029
0.4330669129 0.0103520890 -0.0412866677
0.4335839101 -0.0425242895 -0.0234002489
0.4091799821 0.0513399493 -0.0180929092
0.4085845272 -0.0001768004 -0.0511730877
0.3859809962 -0.0483748085 -0.0188077516
0.3861099167 0.0479471035 -0.0113232265
-0.0024810673 0.3737004149 -0.0335655189
0.0814440224 0.2192546267 -0.0140251582
0.0755448149 0.3013213741 -0.0171114204
0.1405471119 0.2269288707 -0.0145661776
0.1412417182 0.2601136092 -0.0163866213
0.1251442290 0.3337971498 -0.0184403793
0.1120046245 0.3589722868 -0.0185365054
0.0282310209 0.3578300554 -0.0201975415
-0.0022906776 0.3738399346 -0.0230503482
0.0513649954 0.2225123212 -0.0428444899
0.1089714531 0.1787012340 -0.0456207100
0.0787232789 0.2856499326 -0.0431255444
0.1119190337 0.2816384195 -0.0436733666
0.1093626037 -0.1788215091 -0.0253139538
-0.0022154244 -0.3736782548 -0.0215497196
0.0757303165 -0.4085263161 -0.0093795095
0.0815708437 -0.2337134905 -0.0086487459
0.0662470473 -0.3107201874 -0.0088222469
0.1546957304 -0.2063470024 -0.0105831641
0.1701429987 -0.2377724088 -0.0140597642
0.1437195969 -0.3237024858 -0.0126145106
0.1453240353 -0.3545675790 -0.0147958152
0.1393758335 -0.2085732051 -0.0405066783
0.1408969016 -0.2749480604 -0.0373390387
0.0803068963 -0.2158576409 -0.0380780576
0.1393758335 -0.2085732051 -0.0405066783
0.1285173332 -0.3183607905 -0.0360128552
0.1022686849 -0.3687141388 -0.0348694827
0.0694168393 -0.2957424829 -0.0352428796
0.1285173332 -0.3183607905 -0.0360128552
-0.1969955668 0.2098139558 -0.0292529383
-0.4100649072 0.3669397323 -0.0269992361
-0.2340513806 0.2988781886 -0.0198954244
-0.1967335539 0.2107650011 -0.0147791633
-0.3005868151 0.2279778373 -0.0068426884
-0.1968675884 -0.2098813912 -0.0236866654
-0.2618282128 -0.3011587389 -0.0043822936
-0.2900786847 -0.3519273824 -0.0130347374
-0.2398460297 -0.1516632906 0.0010681200
-0.2472180415 -0.2712590506 -0.0034768664
-0.2114210425 -0.1950511401 -0.0011441830
-0.4455641888 -0.3035465116 -0.0150058713
0.2332490902 -0.1613328678 -0.0097010782
0.2339494224 -0.0489291716 0.0465535885
0.2341811597 0.0365010107 0.0424941304
0.2332948783 0.1571854496 -0.0060537685
0.2576002412 0.0719449911 -0.0401305261
0.2451849310 -0.0573562266 -0.0382108242
0.2451409993 0.0866612626 -0.0401209138
0.2139819115 0.1594563136 -0.0405744054
0.2084897889 -0.1858307425 -0.0010948423
0.1671094901 -0.2188067804 -0.0347395009
0.2091931664 -0.1338473497 0.0379182692
0.1684369690 -0.1818993575 0.0386546857
0.2095066898 -0.0488173314 0.0555550996
0.1686260514 -0.1067180278 0.0493817402
0.2094763545 0.0511558413 0.0542291625
0.1691070664 0.0014411992 0.0763561774
0.2091110139 0.1356879947 0.0343434477
0.1685605592 0.1088477280 0.0465227084
0.2083763945 0.1866179926 -0.0060345439
0.1683251563 0.1837174636 0.0338055516
0.1873897171 0.1092986881 -0.0394489539
0.2077874906 0.0506538992 -0.0390290087
0.2078336735 -0.1015110233 -0.0370108958
0.1772447105 -0.0389046603 -0.0373044615
0.1771831332 0.1639819030 -0.0399952787
0.1568315427 0.0704617695 -0.0383971110
0.1771831332 0.1639819030 -0.0399952787
0.1669765493 0.2186651179 -0.0405416034
0.1278698540 -0.1547700356 0.0501181568
0.0683581376 -0.2016903013 0.0471303029
0.0984118278 -0.0873879790 0.0654019371
0.0986573700 -0.0293989400 0.0791820104
0.0390281694 -0.0912559037 0.0696202486
0.0984118278 -0.0873879790 0.0654019371
0.0986423041 0.0303523239 0.0785616238
0.0983616049 0.0879558680 0.0632484558
0.0392636708 0.0303943440 0.0830722568
0.0986423041 0.0303523239 0.0785616238
0.1277747016 0.1568771969 0.0459848123
0.0685245026 0.1206789368 0.0574512809
0.0965435815 0.0625327798 -0.0372226020
0.1262296319 0.1758650804 -0.0392582640
0.1114133680 0.0312294295 -0.0370737010
0.1262653137 0.0585724129 -0.0377026213
0.1263009954 -0.0587202546 -0.0361469786
0.1114758111 -0.1740327386 -0.0343513263
0.1114401293 -0.0567400711 -0.0359069690
0.1040007759 -0.0264268125 -0.0361758748
0.0593646550 0.1554527390 -0.0377893099
0.1113687658 0.1778452639 -0.0390182543
0.0816827154 0.0645129633 -0.0369825923
0.0742433620 0.0948262218 -0.0372514982
0.0444859481 0.2160792562 -0.0383271215
0.1039294123 0.2081585225 -0.0392871602
0.0593646550 0.1554527390 -0.0377893099
0.0444859481 0.2160792562 -0.0383271215
-0.0241391851 -0.2334521803 -0.0104960890
-0.0233991451 -0.2123384331 0.0304539931
-0.0881123411 -0.2204371641 -0.0094920947
-0.0241391851 -0.2334521803 -0.0104960890
-0.0226930936 -0.0880629442 0.0698739115
-0.0224425263 -0.0261639605 0.0839463063
-0.0867569865 -0.0817190454 0.0658706042
-0.0226930936 -0.0880629442 0.0698739115
-0.0224651777 0.0323258736 0.0828876874
-0.0227533130 0.0938297044 0.0671786120
-0.0865368054 0.0322466261 0.0784038229
-0.0224651777 0.0323258736 0.0828876874
-0.0235610706 0.2148567025 0.0230267793
-0.0243138077 0.2348770521 -0.0184688048
-0.0875911480 0.2039253928 0.0208256018
-0.0235610706 0.2148567025 0.0230267793
-0.0406207758 0.1466723865 -0.0358584982
0.0073439263 0.1877442012 -0.0372856480
0.0073820539 0.0625268403 -0.0356249277
-0.0086188893 0.0905753557 -0.0357027845
-0.0726226622 0.2027694172 -0.0360142118
-0.0086570169 0.2157927166 -0.0373635048
-0.0406207758 0.1466723865 -0.0358584982
-0.0726226622 0.2027694172 -0.0360142118
0.0074201815 -0.0626905206 -0.0339642075
-0.0085807617 -0.0346420052 -0.0340420643
0.0074583091 -0.1879078816 -0.0323034872
-0.0245626411 -0.0692021703 -0.0332895610
-0.0565835914 0.0495035409 -0.0342756347
-0.0886045416 0.1682092522 -0.0352617085
-0.0565835914 0.0495035409 -0.0342756347
-0.0405826481 0.0214550255 -0.0341977779
-0.1539902054 -0.1802457251 0.0271566618
-0.1197920119 -0.2055577121 0.0079911443
-0.2237404467 -0.1674793860 -0.0094248692
-0.1546671326 -0.1991745426 -0.0102996212
-0.1534392695 -0.0740330622 0.0579707141
-0.1531964370 -0.0185572247 0.0715625517
-0.2227322078 -0.0585818482 0.0466547982
-0.1534392695 -0.0740330622 0.0579707141
-0.1532235685 0.0289099570 0.0702438559
-0.1535000081 0.0840061778 0.0551855100
-0.2225371625 0.0287234760 0.0577570570
-0.1532235685 0.0289099570 0.0702438559
-0.1199181231 0.2063779231 0.0025276915
-0.1541792806 0.1841088048 0.0180357736
-0.2233899005 0.1574989283 0.0111068243
-0.1541792806 0.1841088048 0.0180357736
-0.1551161136 0.1523559873 -0.0338155952
-0.2241870432 0.1767527007 -0.0328440475
-0.1551332998 0.2084550888 -0.0345596306
-0.1551161136 0.1523559873 -0.0338155952
-0.1550989275 0.0962568857 -0.0330715597
-0.1550817414 0.0401577842 -0.0323275243
-0.2241698571 0.1206535991 -0.0321000121
-0.1550989275 0.0962568857 -0.0330715597
-0.1550645553 -0.0159413174 -0.0315834889
-0.1550473692 -0.0720404190 -0.0308394534
-0.1204861253 -0.1683874280 -0.0302091741
-0.1550473692 -0.0720404190 -0.0308394534
-0.1896086131 0.0243065901 -0.0314697328
-0.2241698571 0.1206535991 -0.0321000121
-0.1550645553 -0.0159413174 -0.0315834889
-0.1550817414 0.0401577842 -0.0323275243
-0.2906842507 -0.1099551558 0.0153416272
-0.2572779165 -0.0387560174 0.0466218760
-0.2905423409 -0.0645209387 0.0233508708
-0.2573024063 0.0405766939 0.0455696994
-0.2901163182 0.0009138753 0.0471265157
-0.2906335308 0.0932741173 0.0188830096
-0.3456547914 -0.0116045264 0.0134841923
-0.3458588106 0.0257489267 0.0023582427
-0.3243470533 0.0515301099 -0.0292653426
-0.3464009332 -0.0272720853 -0.0277822568
-0.3973666828 0.0301371372 -0.0275565969
-0.3973515809 -0.0187840348 -0.0269077636
0.2627755811 -0.0342646059 -0.0384626521
0.2239683387 0.0460258154 -0.0781587703
0.2239849132 -0.0320583340 -0.0775390092
0.2489934784 -0.0702427084 -0.0376875425
0.2368168768 0.0557797937 -0.0391189225
0.2368596807 -0.0845875536 -0.0372572968
0.2065358876 -0.1555415035 -0.0357162764
0.1603903519 0.1976674845 -0.0529163764
0.1997306677 0.1303385718 -0.0752178711
0.1601158182 0.1797894265 -0.0681457180
0.1995665021 0.0456559281 -0.0846048138
0.1597856695 0.1012564340 -0.0866761159
0.1995938436 -0.0446193170 -0.0834074987
0.1597613110 -0.0028062565 -0.0883862315
0.1603903616 -0.1875631050 -0.0543160286
0.1805887664 -0.1066584064 -0.0358741353
0.2004343019 -0.0494970145 -0.0370027486
0.2003889140 0.0988117340 -0.0389697500
0.1706130460 0.0377877708 -0.0376046637
0.1706735633 -0.1599572272 -0.0349819951
0.1507826398 -0.0688098706 -0.0358203833
0.1706735633 -0.1599572272 -0.0349819951
0.1607583602 -0.2132560479 -0.0340898549
0.1201708200 0.1507072887 -0.0796039627
0.0623928735 0.1993316231 -0.0697388764
0.0910033962 0.0825285660 -0.0903704593
0.0909900903 0.0267271843 -0.0912874742
0.0330359257 0.0861958177 -0.0911133255
0.0910033962 0.0825285660 -0.0903704593
0.1201791044 -0.1387419595 -0.0801840362
0.0620918820 -0.1035486367 -0.0874210935
0.0915065056 -0.1931626927 -0.0635853081
0.0623439793 -0.1833119955 -0.0738004798
0.0920183946 -0.0610896853 -0.0348370662
0.1210195171 -0.1715461584 -0.0339020578
0.1064926857 -0.0305776603 -0.0355067047
0.1209844903 -0.0572258096 -0.0354182480
0.1209494634 0.0570945391 -0.0369344383
0.1064313888 0.1694829500 -0.0381600376
0.1064664156 0.0551626013 -0.0366438473
0.0992336484 0.0256165452 -0.0361195043
0.0558370453 -0.1516597916 -0.0329734462
0.1065364693 -0.1734780963 -0.0336114669
0.0775353468 -0.0630216232 -0.0345464752
0.0703025796 -0.0925676793 -0.0340221322
0.0413715109 -0.2107519038 -0.0319247601
0.0993037021 -0.2030241524 -0.0330871239
0.0558370453 -0.1516597916 -0.0329734462
0.0413715109 -0.2107519038 -0.0319247601
-0.0262950441 0.2281259303 -0.0447832452
-0.0573210617 0.2313220814 -0.0360144276
-0.0268141930 0.1780112436 -0.0736294364
-0.0270037170 0.1330541608 -0.0842373890
-0.0891288378 0.1673022137 -0.0706596647
-0.0268141930 0.1780112436 -0.0736294364
-0.0270954744 0.0831266037 -0.0894793380
-0.0271091169 0.0235546596 -0.0904582911
-0.0893904672 0.0770914862 -0.0854065588
-0.0270954744 0.0831266037 -0.0894793380
-0.0270914720 -0.0290641144 -0.0896684735
-0.0270439569 -0.0809241383 -0.0872116072
-0.0893850476 -0.0289048120 -0.0854939722
-0.0270914720 -0.0290641144 -0.0896684735
-0.0261798351 -0.2255306565 -0.0400216868
-0.0579251799 -0.1794703315 -0.0708168456
-0.0416199267 -0.1431147251 -0.0313261402
0.0051540740 -0.1831396989 -0.0316285533
0.0051169259 -0.0610954254 -0.0332471894
-0.0104620250 -0.0884351919 -0.0326068397
-0.0727778285 -0.1977942582 -0.0300454407
-0.0104248769 -0.2104794654 -0.0309882036
-0.0416199267 -0.1431147251 -0.0313261402
-0.0727778285 -0.1977942582 -0.0300454407
0.0050797778 0.0609488481 -0.0348658255
-0.0104991730 0.0336090816 -0.0342254758
0.0050426297 0.1829931217 -0.0364844617
-0.0260966980 0.0672914518 -0.0343944441
-0.0572360257 -0.0484102181 -0.0323044266
-0.0883753534 -0.1641118880 -0.0302144090
-0.0572360257 -0.0484102181 -0.0323044266
-0.0416570748 -0.0210704515 -0.0329447763
-0.1872346914 0.1706266825 -0.0477177632
-0.1533191304 0.2031784595 -0.0339424875
-0.1541289248 0.0698271730 -0.0791261717
-0.1541411501 0.0164496488 -0.0800034027
-0.2213122644 0.0551392440 -0.0707398988
-0.1541289248 0.0698271730 -0.0791261717
-0.1541242746 -0.0259331868 -0.0792173286
-0.1540812271 -0.0724014803 -0.0770158591
-0.2213046854 -0.0255409693 -0.0705831460
-0.1541242746 -0.0259331868 -0.0792173286
-0.1538916251 -0.1444251682 -0.0667737604
-0.1876620719 -0.0823105255 -0.0722200664
-0.1533217620 -0.1945294710 -0.0354916376
-0.1874622837 -0.1456903699 -0.0613972316
-0.1532120964 -0.1486686264 -0.0292760616
-0.2205199323 -0.1724556590 -0.0277852537
-0.1531954809 -0.2033461671 -0.0285508909
-0.1532120964 -0.1486686264 -0.0292760616
-0.1532287118 -0.0939910857 -0.0300012324
-0.1532453273 -0.0393135450 -0.0307264031
-0.2205365478 -0.1177781183 -0.0285104244
-0.1532287118 -0.0939910857 -0.0300012324
-0.1532619428 0.0153639957 -0.0314515739
-0.1532785583 0.0700415364 -0.0321767446
-0.1196495635 0.1639513637 -0.0340099047
-0.1532785583 0.0700415364 -0.0321767446
-0.1869075531 -0.0238682910 -0.0303435845
-0.2205365478 -0.1177781183 -0.0285104244
-0.1532619428 0.0153639957 -0.0314515739
-0.1532453273 -0.0393135450 -0.0307264031
-0.2865813796 0.1085483220 -0.0478076119
-0.2867901074 0.0228122320 -0.0596305032
-0.2867648478 -0.0350904792 -0.0584546924
-0.2866618840 -0.0829509694 -0.0529204258
-0.2863556494 -0.1175660376 -0.0361390615
-0.2861936604 -0.1288760820 -0.0272357150
-0.2862176170 -0.0504166995 -0.0282762872
-0.2542540280 0.0783677424 -0.0305241517
-0.3022233682 -0.0363495381 -0.0281929272
-0.3182204341 -0.0504191554 -0.0277364201
-0.3397627647 0.0263834307 -0.0284027442
0.2665201740 0.0001376816 -0.0241549617
0.2665201740 0.0001376816 -0.0241549617
0.4330669129 0.0103520890 -0.0412866677
0.4275213322 -0.0049988408 -0.0505910414
-0.3882503154 0.0179267441 -0.0436077293
-0.3787838435 0.0106156412 -0.0447849621
-0.3805989799 -0.0037087178 -0.0241595624
0.1092075334 0.1788742363 -0.0325820603
0.1092075334 0.1788742363 -0.0325820603
0.1698072642 0.2380338185 -0.0308873529
0.0207261429 0.4524295959 -0.0413425962
-0.0369236632 0.4586187530 -0.0411173341
-0.0369236632 0.4586187530 -0.0411173341
0.0374789211 0.4159160465 -0.0432655734
0.0378509946 0.3681129375 -0.0430588477
-0.0030054530 0.4213919078 -0.0421844023
0.0779632951 0.4104401851 -0.0443467445
0.0378509946 0.3681129375 -0.0430588477
0.0296882337 0.4526198866 -0.0271995586
0.0742583411 0.4289316249 -0.0257985663
0.0865616805 0.4065395244 -0.0222155990
-0.0148818736 0.4763081482 -0.0286005508
0.0542949126 0.4078356854 -0.0200336239
0.0814440224 0.2192546267 -0.0140251582
0.0821466467 0.2449638090 -0.0154310894
0.0956936869 0.3225526822 -0.0126343748
0.1545777766 0.1993663659 -0.0156487362
0.1110805338 0.2306355155 -0.0095891981
0.0039225605 0.4198701506 -0.0194916422
0.0097248052 0.4315239471 -0.0214346161
0.1407222626 0.2597328759 -0.0450614767
0.1392416669 0.1932964322 -0.0464676525
0.0816352092 0.2371075194 -0.0436914323
0.1407222626 0.2597328759 -0.0450614767
0.1115311234 0.3586255630 -0.0446878410
0.1378103324 0.3082752890 -0.0444955887
0.0714188228 0.3162983153 -0.0433999442
0.1115311234 0.3586255630 -0.0446878410
0.1698612259 -0.2379788951 -0.0296219981
-0.0191360654 -0.4102777103 -0.0291740779
-0.0479129704 -0.4551388552 -0.0265849291
0.0085868095 -0.4102758100 -0.0296760588
0.0403216336 -0.4325360860 -0.0303761325
-0.0063286580 -0.4551360047 -0.0273379004
0.0235022769 -0.3654156153 -0.0320142172
0.0403216336 -0.4325360860 -0.0303761325
0.0636467794 -0.4212361267 -0.0318952485
0.0785561760 -0.3628776937 -0.0345175798
0.0757303165 -0.4085263161 -0.0093795095
0.0343187555 -0.4772422126 -0.0166288858
0.0377108377 -0.4311786558 -0.0104946335
-0.0245800444 -0.4655394545 -0.0133663360
0.0956772271 -0.2061130477 -0.0053407666
0.1112206219 -0.2299865796 -0.0034800057
0.1561254153 -0.2727888242 -0.0124625877
0.1112206219 -0.2299865796 -0.0034800057
0.1158665101 -0.3431907408 -0.0092898334
-0.0101745008 -0.4100873670 -0.0150310315
0.0467172051 -0.3638223167 -0.0087108950
0.0344739489 -0.3862750632 -0.0091381443
-0.0346610132 -0.4549928600 -0.0158855302
0.0344739489 -0.3862750632 -0.0091381443
0.0803068963 -0.2158576409 -0.0380780576
0.1120914104 -0.2818749625 -0.0361995537
0.0694168393 -0.2957424829 -0.0352428796
0.0785561760 -0.3628776937 -0.0345175798
-0.1969955668 0.2098139558 -0.0292529383
-0.3883097603 0.3752421842 -0.0346276558
-0.3513487219 0.3619130788 -0.0489616930
-0.4329369736 0.3612535599 -0.0407524538
-0.4562694779 0.3380734268 -0.0396788860
-0.4263791266 0.3341569611 -0.0414166642
-0.3133755685 0.3455876972 -0.0477035664
-0.4231002032 0.3206086618 -0.0417487694
-0.4394690553 0.2754194373 -0.0390637506
-0.3829672763 0.2811348053 -0.0422072017
-0.3100966450 0.3320393978 -0.0480356716
-0.3829672763 0.2811348053 -0.0422072017
-0.3629008128 0.2613978771 -0.0424364178
-0.3650396291 0.2132969602 -0.0398176445
-0.2900301816 0.3123024696 -0.0482648877
-0.3286043135 0.2387492565 -0.0427318795
-0.3114560639 0.2274249462 -0.0428796103
-0.2717370619 0.2605616592 -0.0457767185
-0.3728418560 0.3545621984 -0.0268595053
-0.3174272697 0.3280468875 -0.0196176045
-0.4371982852 0.3429511769 -0.0242455232
-0.2941908979 0.2957260659 -0.0110687126
-0.3263691125 0.2899205551 -0.0097617216
-0.2248732609 0.1683739894 0.0028926450
-0.2563259082 0.2335485839 -0.0008218550
-0.2248732609 0.1683739894 0.0028926450
-0.2801548800 0.2243379430 -0.0069733451
-0.3005868151 0.2279778373 -0.0068426884
-0.3645522859 0.2150663672 -0.0128964617
-0.3669027323 0.2440380391 -0.0116004807
-0.3230508873 0.2765152809 -0.0079227680
-0.4272436095 0.3027353542 -0.0187286625
-0.4071299838 0.2831695825 -0.0163526019
-0.2642917863 0.1411330800 -0.0380613720
-0.2088317656 0.1302129978 -0.0383476203
-0.1972575815 0.2088623829 -0.0437268117
-0.2527176022 0.2197824651 -0.0434405634
-0.2527176022 0.2197824651 -0.0434405634
-0.2345754062 0.2969755718 -0.0488429676
-0.1968675884 -0.2098813912 -0.0236866654
-0.3881487234 -0.3753636035 -0.0284389428
-0.3845883558 -0.2495708524 -0.0328755871
-0.3845883558 -0.2495708524 -0.0328755871
-0.4418110533 -0.3230672053 -0.0294870769
-0.4671517343 -0.3462788973 -0.0284841500
-0.4199982797 -0.3316692735 -0.0339940371
-0.3404483291 -0.2302204372 -0.0334987849
-0.4090918930 -0.3359703076 -0.0362475172
-0.2906036478 -0.3507934764 -0.0420225535
-0.2810906269 -0.3059445369 -0.0404402950
-0.2992799879 -0.2286459926 -0.0370868974
-0.2810906269 -0.3059445369 -0.0404402950
-0.3596357699 -0.3251621761 -0.0052925875
-0.4369888534 -0.3429859121 -0.0151480117
-0.2398460297 -0.1516632906 0.0010681200
-0.2472180415 -0.2712590506 -0.0034768664
-0.2114210425 -0.1950511401 -0.0011441830
-0.2697915079 -0.2048998935 -0.0004723913
-0.4112444001 -0.2809719263 -0.0138730033
-0.4112444001 -0.2809719263 -0.0138730033
-0.3400283602 -0.2311280894 -0.0103086145
-0.2800175746 -0.2238607215 -0.0010289417
-0.3308039290 -0.2700573242 -0.0048206351
-0.4416010690 -0.3235212947 -0.0178920014
-0.3261917133 -0.2895219415 -0.0020766454
-0.1974923789 -0.2060327914 -0.0380456469
-0.2497022375 -0.2785959972 -0.0399388391
-0.2124383266 -0.1903550970 -0.0371616477
-0.2087523189 -0.1305569525 -0.0348890527
-0.2423302221 -0.1589997082 -0.0353936492
-0.2613515394 -0.2421347694 -0.0383014861
-0.2613515394 -0.2421347694 -0.0383014861
3 300 45 191
3 45 32 191
3 32 319 191
3 319 257 191
3 257 244 191
3 244 271 191
3 191 894 300
3 271 894 191
3 85 895 177
3 45 895 85
3 85 146 32
3 146 317 319
3 317 140 257
3 140 208 244
3 208 896 271
3 103 896 208
3 360 897 300
3 177 897 360
3 360 898 359
3 300 898 360
3 361 899 359
3 103 899 361
3 359 900 361
3 300 900 359
3 351 362 195
3 85 362 351
3 13 901 351
3 146 901 13
3 316 363 13
3 317 363 316
3 131 902 364
3 140 902 131
3 364 903 316
3 140 903 364
3 131 904 208
3 284 904 131
3 296 365 284
3 103 365 296
3 177 905 195
3 367 905 177
3 367 906 366
3 177 906 367
3 368 907 366
3 296 907 368
3 366 908 368
3 177 908 366
3 369 909 3
3 1 909 369
3 369 910 351
3 3 910 369
3 370 911 309
3 3 911 370
3 370 912 13
3 309 912 370
3 371 913 321
3 309 913 371
3 371 914 316
3 321 914 371
3 372 915 176
3 321 915 372
3 372 916 131
3 176 916 372
3 373 917 145
3 176 917 373
3 373 918 284
3 145 918 373
3 374 919 147
3 145 919 374
3 374 920 296
3 147 920 374
3 377 921 1
3 376 921 377
3 377 922 195
3 1 922 377
3 378 923 376
3 375 923 378
3 378 924 195
3 376 924 378
3 379 925 375
3 380 925 379
3 380 926 147
3 379 926 380
3 379 927 381
3 375 927 379
3 381 928 195
3 375 928 381
3 382 383 11
3 16 383 382
3 382 384 3
3 11 384 382
3 385 386 119
3 11 386 385
3 385 387 309
3 119 387 385
3 389 929 388
3 179 929 389
3 389 930 119
3 388 930 389
3 390 931 388
3 321 931 390
3 390 932 179
3 388 932 390
3 392 933 391
3 239 933 392
3 392 934 179
3 391 934 392
3 393 935 391
3 176 935 393
3 393 936 239
3 391 936 393
3 394 395 135
3 239 395 394
3 394 396 145
3 135 396 394
3 397 398 352
3 135 398 397
3 397 399 147
3 352 399 397
3 402 937 401
3 403 937 402
3 403 938 16
3 402 938 403
3 404 939 402
3 400 939 404
3 401 940 402
3 404 940 401
3 406 941 405
3 1 941 406
3 406 942 16
3 405 942 406
3 407 943 405
3 401 943 407
3 407 944 1
3 405 944 407
3 410 945 400
3 409 945 410
3 408 946 400
3 410 946 408
3 411 947 409
3 352 947 411
3 411 948 408
3 409 948 411
3 413 949 412
3 408 949 413
3 413 950 1
3 412 950 413
3 414 951 408
3 412 951 414
3 400 952 408
3 414 952 400
3 415 416 166
3 125 416 415
3 415 417 11
3 166 417 415
3 166 953 418
3 93 953 166
3 418 954 119
3 93 954 418
3 420 955 419
3 180 955 420
3 420 956 93
3 419 956 420
3 421 957 419
3 179 957 421
3 421 958 180
3 419 958 421
3 423 959 422
3 143 959 423
3 423 960 180
3 422 960 423
3 424 961 422
3 239 961 424
3 424 962 143
3 422 962 424
3 194 963 143
3 425 963 194
3 425 964 135
3 194 964 425
3 426 427 234
3 194 427 426
3 426 428 352
3 234 428 426
3 432 965 431
3 429 965 432
3 432 966 125
3 431 966 432
3 429 967 433
3 430 967 429
3 433 968 431
3 430 968 433
3 434 969 430
3 435 969 434
3 435 970 234
3 434 970 435
3 436 971 430
3 434 971 436
3 429 972 430
3 436 972 429
3 438 973 437
3 439 973 438
3 439 974 125
3 438 974 439
3 440 975 438
3 429 975 440
3 437 976 438
3 440 976 437
3 442 977 441
3 16 977 442
3 442 978 125
3 441 978 442
3 443 979 441
3 437 979 443
3 443 980 16
3 441 980 443
3 29 981 444
3 0 981 29
3 444 982 166
3 0 982 444
3 445 983 0
3 93 983 445
3 37 984 0
3 445 984 37
3 447 985 55
3 37 985 447
3 447 986 446
3 55 986 447
3 448 987 446
3 180 987 448
3 448 988 55
3 446 988 448
3 450 989 61
3 55 989 450
3 450 990 449
3 61 990 450
3 451 991 449
3 143 991 451
3 451 992 61
3 449 992 451
3 223 993 61
3 452 993 223
3 452 994 194
3 223 994 452
3 65 995 223
3 453 995 65
3 453 996 234
3 65 996 453
3 456 457 454
3 29 457 456
3 455 458 454
3 456 458 455
3 459 460 455
3 65 460 459
3 455 461 459
3 454 461 455
3 463 464 462
3 29 464 463
3 463 465 454
3 462 465 463
3 466 467 462
3 125 467 466
3 466 468 29
3 462 468 466
3 5 997 336
3 0 997 5
3 5 174 37
3 51 998 174
3 55 998 51
3 262 999 51
3 61 999 262
3 89 1000 262
3 223 1000 89
3 89 104 65
3 469 1001 336
3 470 1001 469
3 470 1002 104
3 469 1002 470
3 471 1003 336
3 469 1003 471
3 471 1004 29
3 336 1004 471
3 130 333 5
3 333 214 174
3 214 56 51
3 56 228 262
3 228 107 89
3 107 299 104
3 130 1005 299
3 336 1005 130
3 267 26 333
3 26 73 214
3 73 52 56
3 52 237 228
3 237 275 107
3 275 38 299
3 38 267 130
3 54 26 267
3 54 73 26
3 54 52 73
3 54 237 52
3 54 275 237
3 54 38 275
3 54 267 38
3 288 337 318
3 337 6 318
3 6 42 318
3 42 293 318
3 293 247 318
3 247 126 318
3 126 288 318
3 349 41 337
3 41 23 6
3 23 149 42
3 149 308 293
3 308 246 247
3 246 287 126
3 288 1006 349
3 472 1006 288
3 472 1007 287
3 288 1007 472
3 21 128 41
3 108 1008 128
3 23 1008 108
3 306 1009 108
3 149 1009 306
3 308 1010 173
3 306 1010 308
3 246 1011 30
3 173 1011 246
3 30 1012 287
3 123 1012 30
3 349 1013 21
3 474 1013 349
3 474 1014 473
3 349 1014 474
3 475 1015 473
3 123 1015 475
3 473 1016 475
3 349 1016 473
3 218 1017 231
3 128 1017 218
3 476 1018 110
3 218 1018 476
3 476 1019 108
3 110 1019 476
3 477 1020 151
3 110 1020 477
3 477 1021 306
3 151 1021 477
3 478 1022 230
3 151 1022 478
3 478 1023 173
3 230 1023 478
3 479 1024 339
3 230 1024 479
3 479 1025 30
3 339 1025 479
3 269 480 339
3 123 480 269
3 483 1026 231
3 482 1026 483
3 483 1027 21
3 231 1027 483
3 484 1028 482
3 481 1028 484
3 484 1029 21
3 482 1029 484
3 485 1030 481
3 486 1030 485
3 486 1031 269
3 485 1031 486
3 485 1032 487
3 481 1032 485
3 487 1033 21
3 481 1033 487
3 124 1034 154
3 488 1034 124
3 488 1035 218
3 124 1035 488
3 489 490 50
3 124 490 489
3 489 491 110
3 50 491 489
3 493 1036 492
3 307 1036 493
3 493 1037 50
3 492 1037 493
3 494 1038 492
3 151 1038 494
3 494 1039 307
3 492 1039 494
3 496 1040 495
3 95 1040 496
3 496 1041 307
3 495 1041 496
3 497 1042 495
3 230 1042 497
3 497 1043 95
3 495 1043 497
3 498 1044 86
3 95 1044 498
3 498 1045 339
3 86 1045 498
3 86 1046 499
3 345 1046 86
3 499 1047 269
3 345 1047 499
3 502 1048 501
3 503 1048 502
3 503 1049 154
3 502 1049 503
3 504 1050 502
3 500 1050 504
3 501 1051 502
3 504 1051 501
3 506 1052 505
3 231 1052 506
3 506 1053 154
3 505 1053 506
3 507 1054 505
3 501 1054 507
3 507 1055 231
3 505 1055 507
3 510 1056 500
3 509 1056 510
3 508 1057 500
3 510 1057 508
3 511 1058 509
3 345 1058 511
3 511 1059 508
3 509 1059 511
3 513 1060 512
3 508 1060 513
3 513 1061 231
3 512 1061 513
3 514 1062 508
3 512 1062 514
3 500 1063 508
3 514 1063 500
3 281 1064 515
3 298 1064 281
3 515 1065 124
3 298 1065 515
3 516 517 277
3 298 517 516
3 516 518 50
3 277 518 516
3 520 1066 519
3 169 1066 520
3 520 1067 277
3 519 1067 520
3 521 1068 519
3 307 1068 521
3 521 1069 169
3 519 1069 521
3 523 1070 522
3 328 1070 523
3 523 1071 169
3 522 1071 523
3 524 1072 522
3 95 1072 524
3 524 1073 328
3 522 1073 524
3 261 1074 328
3 525 1074 261
3 525 1075 86
3 261 1075 525
3 282 1076 261
3 526 1076 282
3 526 1077 345
3 282 1077 526
3 530 1078 529
3 527 1078 530
3 530 1079 281
3 529 1079 530
3 527 1080 531
3 528 1080 527
3 531 1081 529
3 528 1081 531
3 532 1082 528
3 533 1082 532
3 533 1083 282
3 532 1083 533
3 534 1084 528
3 532 1084 534
3 527 1085 528
3 534 1085 527
3 536 1086 535
3 537 1086 536
3 537 1087 281
3 536 1087 537
3 538 1088 536
3 527 1088 538
3 535 1089 536
3 538 1089 535
3 540 1090 539
3 154 1090 540
3 540 1091 281
3 539 1091 540
3 541 1092 539
3 535 1092 541
3 541 1093 154
3 539 1093 541
3 215 1094 298
3 122 1094 215
3 122 1095 542
3 133 1095 122
3 542 1096 277
3 133 1096 542
3 2 544 133
3 543 544 2
3 543 545 169
3 2 545 543
3 291 1097 2
3 546 1097 291
3 546 1098 328
3 291 1098 546
3 344 1099 291
3 547 1099 344
3 547 1100 261
3 344 1100 547
3 4 1101 344
3 548 1101 4
3 548 1102 282
3 4 1102 548
3 551 552 549
3 215 552 551
3 550 553 549
3 551 553 550
3 554 555 550
3 4 555 554
3 550 556 554
3 549 556 550
3 558 559 557
3 215 559 558
3 558 560 549
3 557 560 558
3 561 562 557
3 281 562 561
3 561 563 215
3 557 563 561
3 132 354 122
3 354 235 133
3 22 1103 235
3 2 1103 22
3 22 121 291
3 121 213 344
3 213 297 4
3 564 1104 132
3 565 1104 564
3 565 1105 297
3 564 1105 565
3 566 1106 132
3 564 1106 566
3 566 1107 215
3 132 1107 566
3 12 204 354
3 204 294 235
3 294 87 22
3 87 303 121
3 303 96 213
3 96 82 297
3 12 1108 82
3 132 1108 12
3 248 72 204
3 72 256 294
3 256 120 87
3 120 167 303
3 167 190 96
3 190 60 82
3 60 248 12
3 53 72 248
3 53 256 72
3 53 120 256
3 53 167 120
3 53 190 167
3 53 60 190
3 53 248 60
3 44 9 355
3 69 356 9
3 314 315 356
3 227 77 315
3 31 66 77
3 226 76 66
3 323 313 76
3 68 355 313
3 101 33 175
3 10 358 322
3 324 202 302
3 129 1109 567
3 152 1109 129
3 567 1110 286
3 152 1110 567
3 162 1111 129
3 160 1111 162
3 162 115 260
3 279 258 47
3 250 1112 286
3 258 1112 250
3 170 1113 286
3 129 1113 170
3 259 109 142
3 109 163 111
3 163 129 100
3 286 259 172
3 142 111 224
3 172 142 141
3 170 172 74
3 100 170 156
3 111 100 70
3 260 47 98
3 160 260 233
3 152 160 155
3 250 152 196
3 47 250 338
3 313 355 357
3 76 313 320
3 66 76 78
3 77 66 67
3 315 77 79
3 356 315 322
3 9 356 358
3 355 9 10
3 233 98 171
3 155 233 175
3 196 155 33
3 338 196 101
3 98 338 150
3 141 224 207
3 74 141 302
3 156 74 202
3 70 156 324
3 224 70 116
3 314 342 162
3 162 1114 227
3 129 1114 162
3 69 258 94
3 31 129 163
3 226 163 109
3 323 109 259
3 68 259 286
3 286 1115 44
3 258 1115 286
3 258 279 94
3 342 314 94
3 115 162 342
3 279 260 115
3 115 342 94
3 289 83 84
3 83 216 217
3 216 219 220
3 219 221 222
3 221 14 15
3 14 91 92
3 91 289 290
3 84 217 220
3 289 91 14
3 243 330 105
3 161 168 295
3 106 88 272
3 265 75 266
3 304 35 240
3 240 25 24
3 25 158 157
3 158 63 64
3 63 268 252
3 268 238 225
3 238 62 43
3 62 188 187
3 165 1116 188
3 164 1116 165
3 165 28 27
3 28 304 305
3 157 64 252
3 238 268 63
3 304 1117 35
3 28 1117 304
3 28 1118 127
3 165 1118 28
3 568 1119 127
3 240 1119 568
3 25 1120 127
3 568 1120 25
3 569 1121 229
3 25 1121 569
3 158 1122 229
3 569 1122 158
3 229 1123 570
3 165 1123 229
3 570 1124 188
3 165 1124 570
3 571 1125 305
3 27 1125 571
3 571 1126 241
3 305 1126 571
3 164 1127 572
3 27 1127 164
3 572 1128 24
3 27 1128 572
3 49 1129 186
3 48 1129 49
3 49 263 264
3 263 340 341
3 340 348 347
3 348 136 139
3 136 137 138
3 137 212 353
3 212 205 206
3 199 1130 205
3 200 1130 199
3 199 334 335
3 334 186 185
3 199 205 212
3 341 1131 270
3 347 1131 341
3 335 1132 19
3 185 1132 335
3 200 1133 270
3 335 1133 200
3 114 1134 573
3 48 1134 114
3 573 1135 264
3 48 1135 573
3 19 1136 574
3 264 1136 19
3 574 1137 341
3 264 1137 574
3 138 353 206
3 576 1138 575
3 49 1138 576
3 576 1139 263
3 575 1139 576
3 577 1140 575
3 186 1140 577
3 577 1141 49
3 575 1141 577
3 579 1142 578
3 263 1142 579
3 579 1143 340
3 578 1143 579
3 580 1144 578
3 334 1144 580
3 580 1145 263
3 578 1145 580
3 102 34 325
3 192 1146 325
3 285 1146 192
3 192 57 280
3 57 153 40
3 153 113 178
3 113 59 232
3 59 329 332
3 329 274 201
3 274 193 292
3 193 97 184
3 97 326 80
3 326 102 203
3 280 40 178
3 113 1147 59
3 153 1147 113
3 34 102 326
3 350 1148 192
3 57 1148 350
3 253 1149 325
3 192 1149 253
3 253 326 97
3 97 1150 350
3 193 1150 97
3 184 80 203
3 236 18 255
3 148 1151 18
3 36 1151 148
3 148 283 39
3 283 58 276
3 58 117 182
3 117 278 249
3 278 312 331
3 312 242 20
3 242 144 245
3 144 251 134
3 251 17 254
3 17 236 118
3 251 144 242
3 581 1152 39
3 99 1152 581
3 581 1153 276
3 39 1153 581
3 254 1154 327
3 118 1154 254
3 36 1155 327
3 39 1155 36
3 255 1156 189
3 36 1156 255
3 99 134 254
3 331 1157 249
3 20 1157 331
3 283 148 18
3 177 45 300
3 85 32 45
3 146 319 32
3 317 257 319
3 140 244 257
3 208 271 244
3 582 583 271
3 300 583 582
3 271 584 582
3 103 584 271
3 177 1158 85
3 195 1158 177
3 351 146 85
3 146 1159 317
3 13 1159 146
3 317 1160 140
3 316 1160 317
3 131 208 140
3 208 1161 103
3 284 1161 208
3 585 1162 103
3 586 1162 585
3 586 1163 177
3 585 1163 586
3 587 1164 103
3 585 1164 587
3 103 1165 587
3 296 1165 103
3 588 1166 195
3 351 1166 588
3 588 1167 1
3 195 1167 588
3 589 1168 351
3 13 1168 589
3 589 1169 3
3 351 1169 589
3 590 1170 13
3 316 1170 590
3 590 1171 309
3 13 1171 590
3 591 1172 316
3 131 1172 591
3 591 1173 321
3 316 1173 591
3 592 1174 131
3 284 1174 592
3 592 1175 176
3 131 1175 592
3 593 1176 284
3 296 1176 593
3 593 1177 145
3 284 1177 593
3 596 1178 594
3 296 1178 596
3 594 1179 596
3 595 1179 594
3 597 1180 595
3 195 1180 597
3 595 1181 597
3 594 1181 595
3 599 1182 598
3 296 1182 599
3 599 1183 594
3 598 1183 599
3 600 1184 296
3 598 1184 600
3 600 1185 147
3 296 1185 600
3 601 602 1
3 3 602 601
3 601 603 16
3 1 603 601
3 604 1186 3
3 309 1186 604
3 604 1187 11
3 3 1187 604
3 606 1188 605
3 309 1188 606
3 606 1189 321
3 605 1189 606
3 607 1190 605
3 119 1190 607
3 607 1191 309
3 605 1191 607
3 609 1192 608
3 321 1192 609
3 609 1193 176
3 608 1193 609
3 610 1194 608
3 179 1194 610
3 610 1195 321
3 608 1195 610
3 611 1196 176
3 145 1196 611
3 611 1197 239
3 176 1197 611
3 612 613 145
3 147 613 612
3 612 614 135
3 145 614 612
3 618 1198 617
3 615 1198 618
3 618 1199 147
3 617 1199 618
3 615 1200 619
3 616 1200 615
3 619 1201 617
3 616 1201 619
3 620 1202 616
3 621 1202 620
3 621 1203 1
3 620 1203 621
3 622 1204 616
3 620 1204 622
3 615 1205 616
3 622 1205 615
3 624 1206 623
3 625 1206 624
3 625 1207 147
3 624 1207 625
3 626 1208 624
3 615 1208 626
3 623 1209 624
3 626 1209 623
3 628 1210 627
3 352 1210 628
3 628 1211 147
3 627 1211 628
3 629 1212 627
3 623 1212 629
3 629 1213 352
3 627 1213 629
3 631 1214 630
3 16 1214 631
3 631 1215 11
3 630 1215 631
3 632 1216 630
3 125 1216 632
3 632 1217 16
3 630 1217 632
3 633 634 11
3 119 634 633
3 633 635 166
3 11 635 633
3 637 1218 636
3 119 1218 637
3 637 1219 179
3 636 1219 637
3 638 1220 636
3 93 1220 638
3 638 1221 119
3 636 1221 638
3 640 1222 639
3 179 1222 640
3 640 1223 239
3 639 1223 640
3 641 1224 639
3 180 1224 641
3 641 1225 179
3 639 1225 641
3 642 643 239
3 135 643 642
3 642 644 143
3 239 644 642
3 646 1226 645
3 135 1226 646
3 646 1227 352
3 645 1227 646
3 647 1228 645
3 194 1228 647
3 647 1229 135
3 645 1229 647
3 650 1230 649
3 651 1230 650
3 651 1231 352
3 650 1231 651
3 652 1232 650
3 648 1232 652
3 649 1233 650
3 652 1233 649
3 654 1234 653
3 234 1234 654
3 654 1235 352
3 653 1235 654
3 655 1236 653
3 649 1236 655
3 655 1237 234
3 653 1237 655
3 658 1238 648
3 657 1238 658
3 656 1239 648
3 658 1239 656
3 659 1240 657
3 16 1240 659
3 659 1241 656
3 657 1241 659
3 661 1242 660
3 656 1242 661
3 661 1243 234
3 660 1243 661
3 662 1244 656
3 660 1244 662
3 648 1245 656
3 662 1245 648
3 664 1246 166
3 663 1246 664
3 664 1247 125
3 166 1247 664
3 665 1248 663
3 29 1248 665
3 665 1249 125
3 663 1249 665
3 666 667 93
3 0 667 666
3 166 668 93
3 666 668 166
3 670 1250 669
3 93 1250 670
3 670 1251 180
3 669 1251 670
3 671 1252 669
3 37 1252 671
3 671 1253 93
3 669 1253 671
3 673 1254 672
3 180 1254 673
3 673 1255 143
3 672 1255 673
3 674 1256 672
3 55 1256 674
3 674 1257 180
3 672 1257 674
3 143 676 194
3 675 676 143
3 675 677 61
3 143 677 675
3 679 1258 194
3 234 1258 679
3 679 1259 678
3 194 1259 679
3 680 1260 678
3 223 1260 680
3 680 1261 194
3 678 1261 680
3 684 1262 683
3 682 1262 684
3 684 1263 65
3 683 1263 684
3 685 1264 683
3 234 1264 685
3 685 1265 682
3 683 1265 685
3 687 1266 686
3 682 1266 687
3 687 1267 681
3 686 1267 687
3 688 1268 686
3 65 1268 688
3 688 1269 682
3 686 1269 688
3 691 1270 689
3 681 1270 691
3 691 1271 690
3 689 1271 691
3 692 1272 690
3 125 1272 692
3 692 1273 689
3 690 1273 692
3 694 1274 693
3 689 1274 694
3 694 1275 65
3 693 1275 694
3 695 1276 681
3 689 1276 695
3 695 1277 693
3 681 1277 695
3 29 696 0
3 336 696 29
3 37 1278 5
3 0 1278 37
3 697 1279 37
3 55 1279 697
3 697 1280 174
3 37 1280 697
3 698 1281 55
3 61 1281 698
3 698 1282 51
3 55 1282 698
3 61 1283 223
3 262 1283 61
3 223 699 65
3 89 699 223
3 701 702 104
3 65 702 701
3 701 703 700
3 104 703 701
3 704 705 700
3 29 705 704
3 700 706 704
3 104 706 700
3 130 5 336
3 333 174 5
3 174 1284 51
3 214 1284 174
3 51 1285 262
3 56 1285 51
3 228 89 262
3 107 104 89
3 299 1286 104
3 707 1286 299
3 707 1287 336
3 299 1287 707
3 267 333 130
3 26 214 333
3 73 56 214
3 52 228 56
3 237 107 228
3 275 299 107
3 708 1288 38
3 299 1288 708
3 708 1289 130
3 38 1289 708
3 349 337 288
3 41 6 337
3 23 42 6
3 149 293 42
3 308 247 293
3 246 126 247
3 126 1290 288
3 287 1290 126
3 21 41 349
3 128 23 41
3 23 1291 149
3 108 1291 23
3 149 1292 308
3 306 1292 149
3 173 246 308
3 30 287 246
3 709 1293 287
3 710 1293 709
3 710 1294 349
3 709 1294 710
3 711 1295 287
3 709 1295 711
3 287 1296 711
3 123 1296 287
3 21 1297 128
3 231 1297 21
3 712 1298 128
3 108 1298 712
3 712 1299 218
3 128 1299 712
3 713 1300 108
3 306 1300 713
3 713 1301 110
3 108 1301 713
3 714 1302 306
3 173 1302 714
3 714 1303 151
3 306 1303 714
3 173 715 30
3 230 715 173
3 30 1304 123
3 339 1304 30
3 718 1305 716
3 123 1305 718
3 716 1306 718
3 717 1306 716
3 719 1307 717
3 21 1307 719
3 717 1308 719
3 716 1308 717
3 721 1309 720
3 123 1309 721
3 721 1310 716
3 720 1310 721
3 722 1311 123
3 720 1311 722
3 722 1312 269
3 123 1312 722
3 231 723 218
3 154 723 231
3 724 1313 218
3 110 1313 724
3 724 1314 124
3 218 1314 724
3 726 1315 725
3 110 1315 726
3 726 1316 151
3 725 1316 726
3 727 1317 725
3 50 1317 727
3 727 1318 110
3 725 1318 727
3 728 729 151
3 230 729 728
3 728 730 307
3 151 730 728
3 731 1319 230
3 339 1319 731
3 731 1320 95
3 230 1320 731
3 269 1321 732
3 339 1321 269
3 732 1322 86
3 339 1322 732
3 736 1323 735
3 733 1323 736
3 736 1324 269
3 735 1324 736
3 733 1325 737
3 734 1325 733
3 737 1326 735
3 734 1326 737
3 738 1327 734
3 739 1327 738
3 739 1328 231
3 738 1328 739
3 740 1329 734
3 738 1329 740
3 733 1330 734
3 740 1330 733
3 742 1331 741
3 743 1331 742
3 743 1332 269
3 742 1332 743
3 744 1333 742
3 733 1333 744
3 741 1334 742
3 744 1334 741
3 746 1335 745
3 345 1335 746
3 746 1336 269
3 745 1336 746
3 747 1337 745
3 741 1337 747
3 747 1338 345
3 745 1338 747
3 124 1339 748
3 154 1339 124
3 748 1340 281
3 154 1340 748
3 750 1341 749
3 124 1341 750
3 750 1342 50
3 749 1342 750
3 751 1343 749
3 298 1343 751
3 751 1344 124
3 749 1344 751
3 753 1345 752
3 50 1345 753
3 753 1346 307
3 752 1346 753
3 754 1347 752
3 277 1347 754
3 754 1348 50
3 752 1348 754
3 756 1349 755
3 307 1349 756
3 756 1350 95
3 755 1350 756
3 757 1351 755
3 169 1351 757
3 757 1352 307
3 755 1352 757
3 758 759 95
3 86 759 758
3 758 760 328
3 95 760 758
3 86 1353 345
3 761 1353 86
3 761 1354 261
3 86 1354 761
3 764 1355 763
3 765 1355 764
3 765 1356 345
3 764 1356 765
3 766 1357 764
3 762 1357 766
3 763 1358 764
3 766 1358 763
3 768 1359 767
3 282 1359 768
3 768 1360 345
3 767 1360 768
3 769 1361 767
3 763 1361 769
3 769 1362 282
3 767 1362 769
3 772 1363 762
3 771 1363 772
3 770 1364 762
3 772 1364 770
3 773 1365 771
3 154 1365 773
3 773 1366 770
3 771 1366 773
3 775 1367 774
3 770 1367 775
3 775 1368 282
3 774 1368 775
3 776 1369 770
3 774 1369 776
3 762 1370 770
3 776 1370 762
3 777 1371 298
3 215 1371 777
3 298 1372 777
3 281 1372 298
3 778 779 277
3 122 779 778
3 298 780 277
3 778 780 298
3 782 1373 781
3 277 1373 782
3 782 1374 169
3 781 1374 782
3 783 1375 781
3 133 1375 783
3 783 1376 277
3 781 1376 783
3 785 1377 784
3 169 1377 785
3 785 1378 328
3 784 1378 785
3 786 1379 784
3 2 1379 786
3 786 1380 169
3 784 1380 786
3 328 1381 261
3 787 1381 328
3 787 1382 291
3 328 1382 787
3 261 1383 282
3 788 1383 261
3 788 1384 344
3 261 1384 788
3 792 1385 791
3 790 1385 792
3 792 1386 4
3 791 1386 792
3 793 1387 791
3 282 1387 793
3 793 1388 790
3 791 1388 793
3 795 1389 794
3 790 1389 795
3 795 1390 789
3 794 1390 795
3 796 1391 794
3 4 1391 796
3 796 1392 790
3 794 1392 796
3 799 1393 797
3 789 1393 799
3 799 1394 798
3 797 1394 799
3 800 1395 798
3 281 1395 800
3 800 1396 797
3 798 1396 800
3 802 1397 801
3 797 1397 802
3 802 1398 4
3 801 1398 802
3 803 1399 789
3 797 1399 803
3 803 1400 801
3 789 1400 803
3 132 122 215
3 133 1401 354
3 122 1401 133
3 133 1402 2
3 235 1402 133
3 2 1403 291
3 22 1403 2
3 291 1404 344
3 121 1404 291
3 344 1405 4
3 213 1405 344
3 805 1406 297
3 4 1406 805
3 805 1407 804
3 297 1407 805
3 806 1408 804
3 215 1408 806
3 804 1409 806
3 297 1409 804
3 12 354 132
3 204 235 354
3 294 22 235
3 87 121 22
3 303 213 121
3 96 297 213
3 82 1410 297
3 807 1410 82
3 807 1411 132
3 82 1411 807
3 248 204 12
3 72 294 204
3 256 87 294
3 120 303 87
3 167 96 303
3 190 82 96
3 60 808 82
3 12 808 60
3 44 355 68
3 69 9 44
3 314 356 69
3 227 315 314
3 31 77 227
3 226 66 31
3 323 76 226
3 68 313 323
3 101 175 171
3 101 171 150
3 10 322 79
3 79 1412 10
3 67 1412 79
3 78 1413 67
3 10 1413 78
3 10 78 320
3 10 320 357
3 324 302 207
3 324 207 116
3 250 1414 152
3 286 1414 250
3 129 160 152
3 162 260 160
3 279 47 260
3 258 250 47
3 100 1415 170
3 129 1415 100
3 259 142 172
3 109 111 142
3 163 100 111
3 286 172 170
3 142 224 141
3 172 141 74
3 170 74 156
3 100 156 70
3 111 70 224
3 260 98 233
3 160 233 155
3 152 155 196
3 250 196 338
3 47 338 98
3 313 357 320
3 76 320 78
3 66 78 67
3 77 67 79
3 315 79 322
3 356 322 358
3 9 358 10
3 355 10 357
3 233 171 175
3 155 175 33
3 196 33 101
3 338 101 150
3 98 150 171
3 141 207 302
3 74 302 202
3 156 202 324
3 70 324 116
3 224 116 207
3 314 162 227
3 227 129 31
3 69 94 314
3 31 163 226
3 226 109 323
3 323 259 68
3 68 286 44
3 44 258 69
3 115 94 279
3 289 84 290
3 83 217 84
3 216 220 217
3 219 222 220
3 221 15 222
3 14 92 15
3 91 290 92
3 84 220 222
3 15 1416 222
3 84 1416 15
3 92 1417 15
3 84 1417 92
3 290 809 92
3 84 809 290
3 289 14 221
3 289 221 219
3 216 1418 219
3 289 1418 216
3 83 810 216
3 289 810 83
3 243 105 90
3 243 90 46
3 243 46 301
3 243 301 310
3 243 310 346
3 161 295 210
3 161 210 112
3 161 112 311
3 161 311 181
3 161 181 273
3 106 272 71
3 106 71 159
3 106 159 183
3 106 183 343
3 106 343 198
3 265 266 81
3 265 81 8
3 265 8 211
3 265 211 7
3 265 7 197
3 240 1419 304
3 241 1419 240
3 305 1420 241
3 304 1420 305
3 241 1421 24
3 240 1421 241
3 25 157 24
3 158 64 157
3 63 252 64
3 268 225 252
3 238 43 225
3 62 187 43
3 188 164 187
3 165 27 164
3 28 305 27
3 252 811 157
3 225 811 252
3 812 1422 225
3 157 1422 812
3 225 1423 812
3 43 1423 225
3 187 1424 43
3 813 1424 187
3 813 1425 157
3 187 1425 813
3 815 1426 814
3 164 1426 815
3 815 1427 187
3 814 1427 815
3 816 1428 814
3 157 1428 816
3 816 1429 164
3 814 1429 816
3 63 1430 238
3 158 1430 63
3 818 1431 158
3 817 1431 818
3 229 1432 158
3 818 1432 229
3 819 1433 817
3 238 1433 819
3 819 1434 229
3 817 1434 819
3 820 1435 28
3 35 1435 820
3 127 1436 28
3 820 1436 127
3 165 1437 127
3 229 1437 165
3 35 1438 240
3 821 1438 35
3 821 1439 127
3 35 1439 821
3 127 822 25
3 229 822 127
3 188 1440 229
3 62 1440 188
3 62 1441 229
3 238 1441 62
3 824 1442 823
3 24 1442 824
3 824 1443 241
3 823 1443 824
3 825 1444 823
3 27 1444 825
3 825 1445 24
3 823 1445 825
3 827 1446 826
3 157 1446 827
3 827 1447 24
3 826 1447 827
3 828 1448 826
3 164 1448 828
3 828 1449 157
3 826 1449 828
3 186 48 114
3 186 114 185
3 48 1450 264
3 49 1450 48
3 263 341 264
3 340 347 341
3 348 139 347
3 136 138 139
3 137 353 138
3 212 206 353
3 205 200 206
3 199 335 200
3 334 185 335
3 212 1451 199
3 137 1451 212
3 136 1452 137
3 829 1452 136
3 829 1453 199
3 136 1453 829
3 831 1454 830
3 348 1454 831
3 831 1455 136
3 830 1455 831
3 832 1456 830
3 199 1456 832
3 832 1457 348
3 830 1457 832
3 340 1458 348
3 833 1458 340
3 833 1459 199
3 340 1459 833
3 834 1460 347
3 270 1460 834
3 834 1461 139
3 347 1461 834
3 835 1462 139
3 270 1462 835
3 139 1463 835
3 138 1463 139
3 185 1464 836
3 114 1464 185
3 836 1465 19
3 114 1465 836
3 19 837 335
3 270 837 19
3 19 1466 264
3 838 1466 19
3 838 1467 114
3 19 1467 838
3 270 1468 341
3 19 1468 270
3 206 1469 138
3 200 1469 206
3 200 1470 840
3 270 1470 200
3 840 1471 839
3 270 1471 840
3 841 1472 839
3 138 1472 841
3 841 1473 270
3 839 1473 841
3 334 1474 186
3 842 1474 334
3 842 1475 263
3 334 1475 842
3 199 1476 334
3 843 1476 199
3 843 1477 340
3 199 1477 843
3 102 325 209
3 102 209 203
3 209 1478 285
3 325 1478 209
3 192 280 285
3 57 40 280
3 40 1479 178
3 153 1479 40
3 113 232 178
3 59 332 232
3 329 201 332
3 274 292 201
3 193 184 292
3 97 80 184
3 326 203 80
3 844 1480 178
3 280 1480 844
3 178 1481 844
3 232 1481 178
3 232 1482 846
3 332 1482 232
3 846 1483 845
3 332 1483 846
3 847 1484 845
3 280 1484 847
3 845 1485 847
3 332 1485 845
3 849 1486 201
3 332 1486 849
3 849 1487 848
3 201 1487 849
3 850 1488 848
3 280 1488 850
3 850 1489 201
3 848 1489 850
3 852 1490 201
3 851 1490 852
3 852 1491 292
3 201 1491 852
3 853 1492 851
3 280 1492 853
3 853 1493 292
3 851 1493 853
3 184 1494 292
3 854 1494 184
3 854 1495 280
3 184 1495 854
3 153 1496 59
3 57 1496 153
3 856 1497 855
3 57 1497 856
3 856 1498 59
3 855 1498 856
3 57 1499 857
3 350 1499 57
3 857 1500 855
3 350 1500 857
3 326 1501 34
3 253 1501 326
3 192 1502 350
3 253 1502 192
3 325 1503 253
3 34 1503 325
3 253 1504 350
3 97 1504 253
3 858 1505 193
3 350 1505 858
3 858 1506 274
3 193 1506 858
3 859 1507 274
3 860 1507 859
3 860 1508 350
3 859 1508 860
3 861 1509 859
3 329 1509 861
3 274 1510 859
3 861 1510 274
3 862 863 329
3 350 863 862
3 329 864 862
3 59 864 329
3 865 1511 203
3 184 1511 865
3 865 1512 209
3 203 1512 865
3 866 1513 285
3 209 1513 866
3 866 1514 184
3 285 1514 866
3 867 1515 285
3 184 1515 867
3 867 1516 280
3 285 1516 867
3 236 255 189
3 236 189 118
3 255 1517 36
3 18 1517 255
3 148 39 36
3 283 276 39
3 276 1518 182
3 58 1518 276
3 117 249 182
3 278 331 249
3 312 20 331
3 242 245 20
3 144 134 245
3 251 254 134
3 17 118 254
3 242 1519 251
3 312 1519 242
3 868 1520 312
3 251 1520 868
3 312 1521 868
3 278 1521 312
3 117 1522 278
3 870 1522 117
3 870 1523 869
3 117 1523 870
3 871 1524 869
3 251 1524 871
3 869 1525 871
3 117 1525 869
3 873 874 58
3 117 874 873
3 873 875 872
3 58 875 873
3 876 877 872
3 251 877 876
3 872 878 876
3 58 878 872
3 880 1526 283
3 58 1526 880
3 880 1527 879
3 283 1527 880
3 881 1528 879
3 251 1528 881
3 881 1529 283
3 879 1529 881
3 882 883 276
3 99 883 882
3 882 884 182
3 276 884 882
3 885 1530 182
3 99 1530 885
3 182 1531 885
3 249 1531 182
3 189 1532 118
3 327 1532 189
3 99 1533 39
3 327 1533 99
3 327 1534 36
3 189 1534 327
3 327 1535 254
3 99 1535 327
3 20 1536 249
3 245 1536 20
3 886 1537 245
3 249 1537 886
3 245 1538 886
3 134 1538 245
3 888 1539 99
3 134 1539 888
3 888 1540 887
3 99 1540 888
3 889 1541 887
3 249 1541 889
3 887 1542 889
3 99 1542 887
3 890 1543 18
3 891 1543 890
3 891 1544 283
3 890 1544 891
3 892 1545 18
3 890 1545 892
3 892 1546 236
3 18 1546 892
3 17 1547 236
3 893 1547 17
3 893 1548 283
3 17 1548 893
3 251 1549 17
3 283 1549 251