OFF
1080 1202 0
-0.1328733854 0.0484580051 -0.0502113522
0.0613506487 0.0419049925 -0.0559235916
-0.0631673978 -0.0112594298 0.2137431078
-0.0151591828 0.0596965929 -0.3956262878
-0.0541946467 0.0136803930 0.2612475136
-0.0010718075 0.0118880575 0.2596851407
-0.0650446963 -0.0518495474 -0.3997033592
-0.0320169587 -0.0529638852 -0.4006747237
-0.0086138160 0.0431113181 0.0951447173
0.1621568976 -0.0023183915 -0.1582157706
0.0744425307 -0.0001456254 -0.0326094615
-0.1572026466 0.0078234529 -0.0498019079
0.0961987561 0.0001689079 -0.1972354934
-0.1417815336 0.0069513216 0.0047672235
-0.1694193109 0.0086631270 -0.1162975651
0.1806441402 -0.0025957124 -0.2129372278
0.0911909993 -0.0001297223 -0.1239622626
0.2106936621 -0.0038188678 -0.1810885531
-0.1786888536 0.0094434654 -0.1891508923
0.0969917974 -0.0007909491 -0.0513318939
0.0706553873 -0.0002161838 -0.0014806673
0.0953150690 0.0005141894 -0.2465450941
0.1281269954 -0.0014084063 -0.1199684584
0.0828704825 -0.0002764831 -0.0568625953
-0.0451918134 0.0584563714 -0.4138387544
-0.0486331443 -0.0509369044 -0.4053541037
-0.0179455925 0.0134826343 0.3458211226
-0.0245507905 -0.0656547209 -0.3475313234
-0.0702170028 -0.0641139679 -0.3461882541
-0.0820135466 -0.0171265093 0.1377327146
0.0173104390 -0.0204776462 0.1348115397
-0.0215435051 -0.0571563811 -0.3874537089
-0.0749824893 -0.0553533790 -0.3858820379
-0.0007279988 0.0615474037 0.0010570178
-0.0492669978 0.0086129310 -0.5000000000
-0.1421351950 -0.0312334390 -0.3519541561
0.0474953141 -0.0376314685 -0.3575312973
-0.0287676836 -0.0008532172 0.3162511442
0.0077582204 0.0270390146 -0.4389345501
-0.1029804864 0.0307752780 -0.4356776617
-0.0189936419 -0.0137752942 0.3093572457
-0.0172497915 0.0194415964 0.2602126870
-0.0082468721 -0.0477494612 0.0492222016
-0.0634194200 -0.0458879697 0.0508448576
-0.0257492545 -0.0484352902 -0.4080346817
-0.0714154669 -0.0468945372 -0.4066916124
-0.0212124169 -0.0619131002 -0.3707394025
-0.0746514011 -0.0601100981 -0.3691677316
-0.0768033609 -0.0010858144 -0.4755609984
-0.0603021837 -0.0071448776 -0.4760869348
-0.0707410473 -0.0287580744 -0.4370573853
-0.0622044331 0.0171235711 0.2139245972
0.0043598054 0.0148777302 0.2119669050
-0.0024167522 0.0000478480 0.3452690811
-0.0486283671 0.0016070025 0.3466281910
-0.0641779170 -0.0643026017 -0.3559456693
-0.0311501794 -0.0654169395 -0.3569170339
-0.0017365430 0.0773630993 -0.3110927633
-0.0826309464 0.0800924322 -0.3087136129
-0.0765329603 -0.0619735878 -0.0526686630
-0.0023456477 -0.0644766271 -0.0548505541
-0.0423037206 0.0786346944 -0.3387879373
-0.0071006474 -0.0077739555 0.3453479166
-0.0426576033 0.0782185608 -0.3503430529
-0.1245237696 -0.0198686803 0.3659608630
0.0682430661 -0.0263725279 0.3602914807
-0.0593709342 0.0773822225 -0.3550407418
-0.0263431965 0.0762678847 -0.3560121064
-0.0805766838 0.0252244540 0.1380035193
0.0187473019 0.0218733171 0.1350823444
0.0021280652 0.0809139301 -0.2593745318
-0.0472419109 -0.0669165089 -0.3397186350
-0.1074087921 -0.0253501133 0.0522792962
0.0370339096 -0.0302235310 0.0480311541
-0.0470888710 -0.0255339469 0.1740325080
0.0715578784 0.0484669312 -0.1961603129
-0.1508307029 0.0559702002 -0.1896197381
-0.0474325892 0.0108301578 0.3103682452
-0.0051162583 0.0094024280 0.3091236978
-0.0112664861 -0.0542326305 -0.3897530518
-0.0851564966 -0.0517396219 -0.3875799045
-0.0066938419 -0.0687513214 -0.3120270625
-0.0875882453 -0.0660219885 -0.3096479120
-0.0161263347 0.0057694571 -0.4772798113
0.0712483483 0.0020418998 -0.3579310350
0.0503617401 0.0030064591 -0.3979555542
-0.1812220649 0.0099465484 -0.2545507281
-0.1755519013 0.0100864860 -0.3065208043
-0.1168078383 0.0089177671 -0.4354358248
-0.1631463129 0.0099502474 -0.3510373546
0.0200725061 0.0042994992 -0.4394615537
-0.1446264857 0.0095852552 -0.3922208395
0.0949170395 0.0006297662 -0.2626721363
0.0862284597 0.0012541599 -0.3142199137
-0.1053191894 0.0362401012 0.0526731224
0.0391235124 0.0313666835 0.0484249803
0.0647794896 -0.0442406557 -0.1235167171
-0.1460578629 -0.0371271189 -0.1173158706
-0.0072489963 0.0641812901 -0.3889958779
-0.0811390069 0.0666742986 -0.3868227306
-0.0439455400 0.0094282130 0.3465493822
-0.0130291315 -0.0817563676 -0.0735486087
-0.0553126506 -0.0797090678 -0.1693722922
-0.0394039096 -0.0795313181 -0.2815806457
-0.0072099008 -0.0814980198 -0.1448277076
-0.0994224867 -0.0776939738 -0.2504690601
-0.0159137710 -0.0807785480 -0.2111635521
-0.0048658491 0.0519048541 0.0498594209
-0.0600383969 0.0537663457 0.0514820770
-0.0174700504 -0.0215820929 0.2123342878
-0.0428956508 -0.0207242471 0.2130820692
-0.0863198183 -0.0704759248 -0.1924335575
-0.0013751988 -0.0733419097 -0.1949318271
-0.0480447527 -0.0072131201 0.3102528711
-0.0166597451 0.0722751003 -0.3698813632
-0.0700987293 0.0740781024 -0.3683096922
-0.0719867714 0.0720244376 -0.0518128872
0.0022005412 0.0695213983 -0.0539947783
-0.0707666805 0.0208774849 0.1750656741
0.0108594626 0.0181234635 0.1726650027
-0.0818483395 -0.0671060340 -0.1194096678
-0.0570362658 -0.0377616811 0.0959606946
0.0062451613 -0.0175578022 -0.4392197154
-0.1044935455 -0.0138215388 -0.4359628270
-0.0072791808 0.0877220585 -0.0724659606
-0.0811143482 0.0829541528 -0.1914535273
0.0038302713 0.0800881679 -0.1939517969
-0.0475617669 -0.0663306298 -0.3512662961
0.0036200479 0.0756391168 -0.1208491145
-0.0180031372 0.0154194395 0.3095439255
0.0199041300 0.0003957128 0.1722703512
0.0410005881 0.0001844049 0.0933809311
0.0117348402 0.0004211027 0.2116450953
0.0297524141 0.0003024468 0.1346021471
0.0551275371 -0.0000029603 0.0477266566
-0.0004268471 0.0002117196 0.3089190866
-0.1234127707 0.0060208920 0.0529776287
-0.0930186482 0.0044446752 0.1382129139
0.0048145147 0.0003503454 0.2594293447
-0.1066496252 0.0051660423 0.0977234079
-0.0809922063 0.0037999000 0.1752377699
-0.0220834505 0.0596128305 -0.4073437898
-0.0677496629 0.0611535835 -0.4060007205
-0.0843840451 -0.0581961101 -0.3538373468
0.0669323240 -0.0461089959 -0.2622011652
-0.1564694918 -0.0385715409 -0.2556307907
-0.1393919108 0.0496237792 -0.3514371310
0.0502385984 0.0432257496 -0.3570142722
-0.0719475283 -0.0139275365 0.1748431204
0.0096786148 -0.0166815578 0.1724424491
-0.0197469486 0.0759375253 -0.3466269878
-0.0654131609 0.0774782783 -0.3452839185
-0.0014599268 0.0879801891 -0.1437440135
-0.0173052186 0.0677654353 -0.3866549216
-0.0707442028 0.0695684373 -0.3850832506
-0.0791055486 -0.0471044597 -0.3945501033
-0.1890342554 -0.0486429838 0.4331009641
0.1344982394 -0.0595587931 0.4235856893
-0.0703981226 -0.0548115329 0.0022295431
-0.0517642885 -0.0312497180 0.1367463213
-0.0138268808 -0.0325297053 0.1356305606
-0.0495627106 0.0897690441 -0.1682896461
0.0277647420 0.0261266073 0.0939584563
0.0678295713 0.0456602016 -0.1229429117
-0.0259942991 0.0419749219 -0.4378399959
-0.0916868007 0.0301567322 0.0974715934
-0.1430077848 0.0527736338 -0.1167420658
-0.0761999877 0.0166983709 -0.4754472810
-0.0221978047 0.0148763668 -0.4770355160
-0.0139991947 0.0297298739 0.1734756151
-0.0159119451 0.0243424427 0.2126279430
-0.0184932322 -0.0172092320 0.2599793782
-0.0331006056 -0.0118286910 0.3460761742
0.0683406995 -0.0463581447 -0.1967666527
-0.1540478818 -0.0388548757 -0.1902260779
-0.0101638382 0.0886993544 -0.2100809073
0.0516129234 0.0371099516 -0.0006497575
-0.1202527456 0.0429086052 0.0044049097
-0.0271575198 -0.0402611783 0.3991592906
-0.1490218237 0.0543952411 -0.3069672984
0.0627618704 0.0472497752 -0.3131959774
-0.1520856082 -0.0359085950 -0.3075447280
0.0596980858 -0.0430540609 -0.3137734070
-0.2106936621 -0.0793466485 0.5000000000
0.1579304356 -0.0917838238 0.4891585555
0.0491266384 -0.0361723154 -0.0011183461
-0.1227390306 -0.0303736618 0.0039363210
-0.0494393781 0.0372760942 0.1371844958
-0.0115019705 0.0359961069 0.1360687350
-0.0936725574 0.0917838238 -0.2493864160
-0.0610607819 0.0655756607 -0.3989535549
-0.0280330443 0.0644613229 -0.3999249194
-0.0549631161 -0.0089708457 0.2611037223
-0.0108087139 -0.0608096715 -0.3666430620
-0.0846987244 -0.0583166630 -0.3644699148
-0.0934148543 -0.0207769626 0.0971459082
0.0260366848 -0.0248071921 0.0936327704
-0.0063565272 0.0704167672 -0.3658039611
-0.0802465378 0.0729097757 -0.3636308138
-0.0447463446 0.0636249769 -0.4046215609
-0.0336539533 0.0899463671 -0.2804969549
-0.0075125608 0.0701890569 -0.3551321249
-0.0955508333 -0.0488944687 0.4242347425
0.0408511060 -0.0534965955 0.4202230838
0.0701641772 0.0491485992 -0.2615920598
-0.1532376386 0.0566860542 -0.2550216852
-0.1493335573 -0.0586870938 0.4502825723
0.0952883967 -0.0669405047 0.4430881014
-0.0487232996 -0.0456327846 -0.4145043315
0.0328826722 0.0372663603 -0.3971928754
-0.1248663869 0.0425887272 -0.3925533858
0.0306005909 -0.0299970823 -0.3976229779
-0.1271474213 -0.0246747507 -0.3929835190
-0.0884330714 -0.0703361416 -0.2578493707
-0.1356830856 -0.0343577056 -0.0507398530
0.0585409485 -0.0409107182 -0.0564520924
-0.0644873928 0.0363750999 -0.4367588288
-0.0322479430 -0.0231579383 -0.4381385503
-0.0590698346 0.0452359354 -0.4156519748
-0.0700127848 0.0511426600 -0.3940898368
-0.0364301936 -0.0323311309 -0.4168849094
-0.0242524788 -0.0385507710 -0.3960865406
-0.0661894738 0.0563888920 -0.3738427553
-0.0734522358 0.0599064181 -0.3532846279
-0.0991593113 0.0512475726 -0.3729190068
-0.0661894738 0.0563888920 -0.3738427553
0.0175397078 0.0514611713 -0.3763202800
-0.0268917271 -0.0440965962 -0.3757301624
-0.0184443655 -0.0479137893 -0.3556843221
0.0060781127 -0.0389554358 -0.3766536500
-0.0268917271 -0.0440965962 -0.3757301624
-0.1106203718 -0.0391689493 -0.3732521297
-0.0705642269 0.0634934393 -0.3312649472
-0.0734522358 0.0599064181 -0.3532846279
-0.0361503850 0.0704282693 -0.3211788552
-0.1110114286 0.0648581057 -0.3300753719
-0.0705642269 0.0634934393 -0.3312649472
0.0276246548 0.0587194160 -0.3341640511
0.0276246548 0.0587194160 -0.3341640511
-0.0200464656 -0.0518267285 -0.3335896047
-0.0184443655 -0.0479137893 -0.3556843221
-0.0538173554 -0.0589243585 -0.3216187583
0.0204007361 -0.0531913950 -0.3347791799
-0.0200464656 -0.0518267285 -0.3335896047
-0.1182348266 -0.0470523526 -0.3306910374
-0.1182348266 -0.0470523526 -0.3306910374
-0.0734468793 0.0676545856 -0.2831709151
-0.0734468793 0.0676545856 -0.2831709151
-0.0755547867 0.0687999922 -0.2571981085
-0.1133422589 0.0621703199 -0.2690963002
-0.0402514406 0.0805031812 -0.2840440723
0.0342138171 0.0632558493 -0.2863424116
0.0342138171 0.0632558493 -0.2863424116
0.0788394549 0.0239397707 -0.2879340569
0.0788394549 0.0239397707 -0.2879340569
0.0765803918 -0.0224274180 -0.2882105395
0.0765803918 -0.0224274180 -0.2882105395
-0.0143674928 -0.0566951013 -0.2858113888
-0.0143674928 -0.0566951013 -0.2858113888
-0.0107503737 -0.0582225687 -0.2600252680
0.0262824156 -0.0514020486 -0.2740062770
-0.0475634566 -0.0695437315 -0.2849382166
-0.1220288685 -0.0522967647 -0.2826393513
-0.1220288685 -0.0522967647 -0.2826393513
-0.1666538366 -0.0129810233 -0.2810477281
-0.1666538366 -0.0129810233 -0.2810477281
-0.1643947699 0.0333862701 -0.2807712448
-0.1643947699 0.0333862701 -0.2807712448
-0.0747036836 0.0683871110 -0.2244867411
-0.0755547867 0.0687999922 -0.2571981085
-0.0362878092 0.0746505206 -0.2419306364
-0.1171759934 0.0698201035 -0.2232376063
-0.0747036836 0.0683871110 -0.2244867411
-0.0354367062 0.0742376394 -0.2092192690
-0.1171759934 0.0698201035 -0.2232376063
0.0368429718 0.0646904307 -0.2277674224
0.0368429718 0.0646904307 -0.2277674224
0.0831814667 0.0246587535 -0.2294137766
0.0831814667 0.0246587535 -0.2294137766
0.0816288695 -0.0228641892 -0.2297193945
0.0816288695 -0.0228641892 -0.2297193945
-0.0096937471 -0.0582924603 -0.2273173614
-0.0107503737 -0.0582225687 -0.2600252680
-0.0490634093 -0.0643143010 -0.2425833660
0.0327785626 -0.0597254528 -0.2285664962
-0.0096937471 -0.0582924603 -0.2273173614
-0.0480067827 -0.0643841925 -0.2098754594
0.0327785626 -0.0597254528 -0.2285664962
-0.1212404766 -0.0545955086 -0.2240377243
-0.1212404766 -0.0545955086 -0.2240377243
-0.1675791727 -0.0145640378 -0.2223908415
-0.1675791727 -0.0145640378 -0.2223908415
-0.1660263839 0.0329583743 -0.2220852331
-0.1660263839 0.0329583743 -0.2220852331
-0.0736053275 0.0658046585 -0.1552344263
-0.1122180152 0.0608874293 -0.1724270822
-0.0387471501 0.0792966348 -0.1561513209
-0.0736053275 0.0658046585 -0.1552344263
-0.0696938684 0.0642063753 -0.1187955902
-0.1083065561 0.0592891461 -0.1359882461
-0.0349926398 0.0707218877 -0.1380417704
-0.1122180152 0.0608874293 -0.1724270822
-0.1083065561 0.0592891461 -0.1359882461
-0.1469192438 0.0543719170 -0.1531809020
-0.0387471501 0.0792966348 -0.1561513209
-0.0386420385 0.0815211603 -0.1927026621
0.0037251596 0.0778636423 -0.1574004557
0.0358299213 0.0628741848 -0.1584473543
0.0376940749 0.0642775495 -0.1950560549
0.0696937249 0.0470635664 -0.1595516123
0.0358299213 0.0628741848 -0.1584473543
0.0813744389 0.0241686044 -0.1600612878
0.0813744389 0.0241686044 -0.1600612878
0.0804891229 -0.0220358739 -0.1603761053
0.0804891229 -0.0220358739 -0.1603761053
-0.0067538200 -0.0567320893 -0.1580881602
0.0307934397 -0.0515451170 -0.1774274065
-0.0416117692 -0.0702239719 -0.1571707474
-0.0067538200 -0.0567320893 -0.1580881602
-0.0085344250 -0.0556733449 -0.1214631924
0.0290128348 -0.0504863725 -0.1408024387
-0.0443010798 -0.0619190617 -0.1387489140
0.0307934397 -0.0515451170 -0.1774274065
0.0290128348 -0.0504863725 -0.1408024387
0.0665600946 -0.0452994002 -0.1601416849
-0.0416117692 -0.0702239719 -0.1571707474
-0.0438475085 -0.0719089172 -0.1936826923
-0.0840840789 -0.0687909794 -0.1559216126
-0.1161888406 -0.0538015218 -0.1548747140
-0.1201838501 -0.0546654002 -0.1913298177
-0.1500528724 -0.0379909973 -0.1537709742
-0.1161888406 -0.0538015218 -0.1548747140
-0.1617335963 -0.0150958743 -0.1532618215
-0.1617335963 -0.0150958743 -0.1532618215
-0.1608483192 0.0311085496 -0.1529464791
-0.1608483192 0.0311085496 -0.1529464791
-0.0704036218 0.0611475160 -0.0853684221
-0.0696938684 0.0642063753 -0.1187955902
-0.0333917870 0.0683933164 -0.1031087683
-0.1074972781 0.0623990357 -0.0842774765
-0.0704036218 0.0611475160 -0.0853684221
0.0324853483 0.0587720546 -0.0883863530
0.0324853483 0.0587720546 -0.0883863530
0.0753500269 0.0226918593 -0.0899027535
0.0753500269 0.0226918593 -0.0899027535
0.0748659739 -0.0205202202 -0.0902071775
0.0748659739 -0.0205202202 -0.0902071775
-0.0058767353 -0.0531071218 -0.0880926901
-0.0085344250 -0.0556733449 -0.1214631924
-0.0438625374 -0.0601065779 -0.1037511789
0.0312169209 -0.0543586414 -0.0891836356
-0.0058767353 -0.0531071218 -0.0880926901
-0.1087657126 -0.0507318698 -0.0850747604
-0.1087657126 -0.0507318698 -0.0850747604
-0.1516302547 -0.0146518330 -0.0835588893
-0.1516302547 -0.0146518330 -0.0835588893
-0.1511463481 0.0285605660 -0.0832544586
-0.1511463481 0.0285605660 -0.0832544586
-0.0668006921 0.0550027044 -0.0245771672
-0.0668006921 0.0550027044 -0.0245771672
-0.0604903722 0.0522280044 0.0027309637
-0.0998370387 0.0517303547 -0.0373942597
-0.0363573851 0.0667859207 -0.0253779347
0.0269067323 0.0533156749 -0.0273222679
0.0269067323 0.0533156749 -0.0273222679
-0.0059285871 -0.0478611255 -0.0271112747
-0.0059285871 -0.0478611255 -0.0271112747
-0.0106357421 -0.0454919241 0.0005555985
0.0263061807 -0.0443859219 -0.0417816835
-0.0363718852 -0.0596440800 -0.0263105055
-0.0996359954 -0.0461736248 -0.0243661710
-0.0996359954 -0.0461736248 -0.0243661710
-0.0625592973 0.0474067296 0.0271321653
-0.0604903722 0.0522280044 0.0027309637
-0.0316436481 0.0544770667 0.0140945915
-0.0625592973 0.0474067296 0.0271321653
0.0191977568 0.0464570436 0.0247409990
-0.0071463908 -0.0410301425 0.0248632557
-0.0106357421 -0.0454919241 0.0005555985
-0.0387722567 -0.0479208377 0.0135463994
-0.0071463908 -0.0410301425 0.0248632557
-0.0889034574 -0.0400808231 0.0272544197
-0.0569665027 0.0396757097 0.0739089198
-0.0100011781 -0.0339926060 0.0719959244
-0.0515943856 0.0330764195 0.1167701642
-0.0128638018 -0.0280284550 0.1151895458
0.0528652779 -0.0302060052 0.3699184167
0.0645813760 -0.0463185205 0.4027048498
0.0528652779 -0.0302060052 0.3699184167
0.1112559058 -0.0690511722 0.4459317026
0.0332603566 -0.0338968609 0.3796696228
0.0060417112 -0.0271749064 0.3682371140
0.0068467931 -0.0468788869 0.4096911872
-0.0279626017 -0.0205571977 0.3577052174
-0.0621592585 -0.0248738430 0.3702429433
-0.0279626017 -0.0205571977 0.3577052174
-0.0613541766 -0.0445778235 0.4116970165
-0.0890506204 -0.0297701555 0.3832668582
-0.1197306728 -0.0400999329 0.4081255721
-0.1652121675 -0.0597232907 0.4540627860
-0.1089009695 -0.0247481005 0.3746760542
-0.1089009695 -0.0247481005 0.3746760542
-0.0504758691 0.0897529412 -0.1609261883
-0.0288775250 0.0887374998 -0.1166960745
-0.0475662421 0.0898820065 -0.1965652147
-0.0475662421 0.0898820065 -0.1965652147
-0.0519181978 0.0902415891 -0.2297336617
-0.0262165206 -0.0806438428 -0.1775646272
-0.0262165206 -0.0806438428 -0.1775646272
-0.0196228260 -0.0812001052 -0.1255566180
-0.0473582801 -0.0796201929 -0.2254764690
-0.0473582801 -0.0796201929 -0.2254764690
-0.0773675686 -0.0787015208 -0.2099206761
-0.0694131982 -0.0786126460 -0.2660248529
0.1530043656 -0.0016523392 -0.2138168236
0.1818490139 -0.0027356035 -0.1974526884
0.1287359833 -0.0009021010 -0.2023804324
0.1117210322 -0.0004471084 -0.1832567763
0.1287359833 -0.0009021010 -0.2023804324
0.1199240138 -0.0009277574 -0.1516126174
0.0961534332 -0.0001383798 -0.1489384940
0.1117210322 -0.0004471084 -0.1832567763
0.0965726153 -0.0004646645 -0.1001351939
0.0848787998 0.0001842820 -0.1395772778
-0.0895902371 0.0237368245 -0.4555624714
-0.0510971434 0.0293366464 -0.4566436385
-0.0342208837 0.0218686928 -0.4571909156
-0.0342208837 0.0218686928 -0.4571909156
-0.0241871388 -0.0086942406 -0.4577091808
-0.0434336910 -0.0114943087 -0.4571685983
-0.0434336910 -0.0114943087 -0.4571685983
-0.0823978646 -0.0104832082 -0.4560248809
-0.0644873928 0.0363750999 -0.4367588288
-0.0371145087 0.0524662642 -0.4056391313
-0.0864966356 0.0409589690 -0.4148837493
-0.0590698346 0.0452359354 -0.4156519748
0.0034441865 0.0396206411 -0.4175164356
0.0034441865 0.0396206411 -0.4175164356
0.0290599802 0.0150227369 -0.4184450522
0.0253365485 -0.0128487915 -0.4185422658
-0.0322479430 -0.0231579383 -0.4381385503
-0.0577678711 -0.0397177953 -0.4057175063
-0.0090036588 -0.0280542866 -0.4176531280
-0.0364301936 -0.0323311309 -0.4168849094
-0.0989442343 -0.0267164125 -0.4150204522
-0.0989442343 -0.0267164125 -0.4150204522
-0.1245600156 -0.0021181418 -0.4140918333
-0.1208371126 0.0257532471 -0.4139946053
-0.0700127848 0.0511426600 -0.3940898368
-0.0368510173 0.0632889745 -0.3644874401
0.0175397078 0.0514611713 -0.3763202800
0.0520655102 0.0196541300 -0.3775619552
0.0520655102 0.0196541300 -0.3775619552
0.0489285271 -0.0173125047 -0.3777434258
0.0489285271 -0.0173125047 -0.3777434258
-0.0242524788 -0.0385507710 -0.3960865406
-0.0556378861 -0.0511463532 -0.3647837546
-0.1106203718 -0.0391689493 -0.3732521297
-0.1451468671 -0.0073622517 -0.3720104368
-0.1451468671 -0.0073622517 -0.3720104368
-0.1420091982 0.0296045172 -0.3718289853
-0.1420091982 0.0296045172 -0.3718289853
-0.0421837447 0.0787277658 -0.3099031881
-0.1110114286 0.0648581057 -0.3300753719
0.0682335290 0.0222399548 -0.3356170930
0.0682335290 0.0222399548 -0.3356170930
0.0654732170 -0.0205060806 -0.3358522210
0.0654732170 -0.0205060806 -0.3358522210
-0.0471410436 -0.0673866550 -0.3108374872
0.0204007361 -0.0531913950 -0.3347791799
-0.1588435482 -0.0105734765 -0.3292374802
-0.1588435482 -0.0105734765 -0.3292374802
-0.1560840683 0.0321727442 -0.3290023265
-0.1560840683 0.0321727442 -0.3290023265
-0.1112343515 0.0610249134 -0.2950691068
-0.0402514406 0.0805031812 -0.2840440723
-0.1133422589 0.0621703199 -0.2690963002
-0.0356594071 0.0742842579 -0.2712727234
-0.1311820413 0.0582827805 -0.2880317993
-0.1112343515 0.0610249134 -0.2950691068
-0.0421837447 0.0787277658 -0.3099031881
0.0001957611 0.0791385147 -0.2852336476
0.0305126637 0.0623064373 -0.3121443704
0.0664630238 0.0481991872 -0.2873940186
0.0361461212 0.0650312647 -0.2604832958
0.0001957611 0.0791385147 -0.2852336476
0.0226652965 -0.0498745811 -0.2997923979
-0.0475634566 -0.0695437315 -0.2849382166
0.0262824156 -0.0514020486 -0.2740062770
-0.0514002821 -0.0635156214 -0.2718303798
0.0429902507 -0.0472280547 -0.2938898420
0.0226652965 -0.0498745811 -0.2997923979
-0.0471410436 -0.0673866550 -0.3108374872
-0.0880106583 -0.0681790651 -0.2837486413
-0.1198369267 -0.0509652918 -0.3085963200
-0.1542775500 -0.0372400679 -0.2815877594
-0.1224512816 -0.0544538412 -0.2567400807
-0.0880106583 -0.0681790651 -0.2837486413
-0.0362878092 0.0746505206 -0.2419306364
-0.1139706611 0.0625365826 -0.2397542132
0.0029791682 0.0805010490 -0.2266631644
-0.0354367062 0.0742376394 -0.2092192690
-0.1159725255 0.0694621765 -0.1905366327
-0.1520341707 0.0563281272 -0.2223207117
0.0361461212 0.0650312647 -0.2604832958
0.0708610278 0.0488077652 -0.2288761864
0.0376940749 0.0642775495 -0.1950560549
0.0029791682 0.0805010490 -0.2266631644
0.0825406084 0.0248891827 -0.2621320981
0.0955578978 0.0003993370 -0.2299538149
0.0838783173 0.0243179195 -0.1966979032
0.0708610278 0.0488077652 -0.2288761864
0.0809246818 -0.0227396148 -0.2624366508
0.0676365117 -0.0462335703 -0.2294839090
0.0822697278 -0.0230946184 -0.1970010730
0.0955578978 0.0003993370 -0.2299538149
-0.0490634093 -0.0643143010 -0.2425833660
0.0286192884 -0.0522007281 -0.2447592633
-0.0873764448 -0.0704060332 -0.2251414641
-0.0480067827 -0.0643841925 -0.2098754594
0.0334827503 -0.0598500272 -0.1958492399
0.0676365117 -0.0462335703 -0.2294839090
-0.1224512816 -0.0544538412 -0.2567400807
-0.1552586868 -0.0387132083 -0.2229284343
-0.1201838501 -0.0546654002 -0.1913298177
-0.0873764448 -0.0704060332 -0.2251414641
-0.1688457784 -0.0143124962 -0.2550907594
-0.1799554593 0.0096950069 -0.2218508102
-0.1663683677 -0.0147057051 -0.1896884851
-0.1552586868 -0.0387132083 -0.2229284343
-0.1672298518 0.0333163013 -0.2547862067
-0.1520341707 0.0563281272 -0.2223207117
-0.1647597782 0.0327068328 -0.1893853152
-0.1799554593 0.0096950069 -0.2218508102
0.0357248096 0.0606496592 -0.1218960131
0.0037251596 0.0778636423 -0.1574004557
0.0838783173 0.0243179195 -0.1966979032
0.0936948777 0.0000195928 -0.1605988780
0.0795102853 0.0227652397 -0.1234525872
0.0696937249 0.0470635664 -0.1595516123
0.0822697278 -0.0230946184 -0.1970010730
0.0665600946 -0.0452994002 -0.1601416849
0.0779852445 -0.0221851890 -0.1237394899
0.0936948777 0.0000195928 -0.1605988780
-0.1139531012 -0.0521165764 -0.1183627692
-0.0840840789 -0.0687909794 -0.1559216126
-0.1663683677 -0.0147057051 -0.1896884851
-0.1740540822 0.0090532962 -0.1527242287
-0.1577385869 -0.0142319960 -0.1168067178
-0.1500528724 -0.0379909973 -0.1537709742
-0.1647597782 0.0327068328 -0.1893853152
-0.1469192438 0.0543719170 -0.1531809020
-0.1562135478 0.0307183804 -0.1165198155
-0.1740540822 0.0090532962 -0.1527242287
-0.0333917870 0.0683933164 -0.1031087683
-0.1067057033 0.0569605749 -0.1010552439
0.0029102945 0.0725802576 -0.0874219464
-0.0341015403 0.0653344572 -0.0696816002
-0.1024300784 0.0602412213 -0.0510121197
-0.1379405851 0.0506158194 -0.0834767090
-0.0341015403 0.0653344572 -0.0696816002
-0.1074972781 0.0623990357 -0.0842774765
0.0357248096 0.0606496592 -0.1218960131
0.0645901100 0.0437825970 -0.0894332516
0.0317755949 0.0557131954 -0.0549591849
0.0029102945 0.0725802576 -0.0874219464
0.0795102853 0.0227652397 -0.1234525872
0.0870307409 -0.0002031027 -0.0904124290
0.0779852445 -0.0221851890 -0.1237394899
0.0616602190 -0.0425756870 -0.0899844048
-0.0438625374 -0.0601065779 -0.1037511789
0.0294513771 -0.0486738888 -0.1058047036
-0.0791906499 -0.0645398109 -0.0860391654
-0.0412048478 -0.0575403548 -0.0703806765
0.0280976504 -0.0526936727 -0.0556513233
0.0616602190 -0.0425756870 -0.0899844048
-0.0412048478 -0.0575403548 -0.0703806765
0.0312169209 -0.0543586414 -0.0891836356
-0.1139531012 -0.0521165764 -0.1183627692
-0.1408704743 -0.0357424122 -0.0840278618
-0.1061080230 -0.0481656467 -0.0517042580
-0.0791906499 -0.0645398109 -0.0860391654
-0.1577385869 -0.0142319960 -0.1168067178
-0.1633109787 0.0082432899 -0.0830497365
-0.1562135478 0.0307183804 -0.1165198155
-0.1379405851 0.0506158194 -0.0834767090
-0.0998370387 0.0517303547 -0.0373942597
-0.0363573851 0.0667859207 -0.0253779347
-0.0935267188 0.0489556548 -0.0100861288
-0.0337643454 0.0582750540 -0.0117600747
-0.0935267188 0.0489556548 -0.0100861288
-0.1265630655 0.0456833051 -0.0229032212
-0.0348931151 0.0707729180 -0.0529038327
0.0007362712 0.0655344010 -0.0264688802
0.0317755949 0.0557131954 -0.0549591849
0.0564817861 0.0395074720 -0.0282866745
0.0660030180 0.0208444043 -0.0287021294
0.0660030180 0.0208444043 -0.0287021294
0.0659985604 -0.0182243993 -0.0289904707
0.0659985604 -0.0182243993 -0.0289904707
0.0263061807 -0.0443859219 -0.0417816835
-0.0363718852 -0.0596440800 -0.0263105055
0.0215990256 -0.0420167205 -0.0141148104
-0.0381633549 -0.0513363292 -0.0124408658
0.0215990256 -0.0420167205 -0.0141148104
0.0538337934 -0.0385415168 -0.0287852193
-0.0394393040 -0.0632251075 -0.0537596085
-0.0734655415 -0.0583925603 -0.0252195599
-0.1061080230 -0.0481656467 -0.0517042580
-0.1292110581 -0.0323656837 -0.0234017660
-0.1387323096 -0.0137031920 -0.0229863148
-0.1387323096 -0.0137031920 -0.0229863148
-0.1387276961 0.0253660290 -0.0226984991
-0.1387276961 0.0253660290 -0.0226984991
-0.0901455713 0.0483374754 0.0279434933
0.0191977568 0.0464570436 0.0247409990
0.0533702303 0.0185534957 0.0235384496
0.0533702303 0.0185534957 0.0235384496
0.0538446485 -0.0152198574 0.0232752434
0.0538446485 -0.0152198574 0.0232752434
0.0204398831 -0.0419608883 0.0240519277
-0.0889034574 -0.0400808231 0.0272544197
-0.1230759006 -0.0121763849 0.0284569748
-0.1230759006 -0.0121763849 0.0284569748
-0.1235503615 0.0215957114 0.0287201729
-0.1235503615 0.0215957114 0.0287201729
-0.0569665027 0.0396757097 0.0739089198
-0.0501503084 0.0366340251 0.0963081553
-0.0811428460 0.0379579055 0.0632910211
-0.0343261065 0.0484388319 0.0733133971
0.0114494464 0.0390157307 0.0719089386
0.0114494464 0.0390157307 0.0719089386
0.0400620502 0.0157755442 0.0709029557
0.0405821110 -0.0124050762 0.0706797135
-0.0100011781 -0.0339926060 0.0719959244
-0.0154997905 -0.0312844366 0.0947967325
0.0135163658 -0.0321080685 0.0600135392
-0.0326415690 -0.0427555712 0.0725914481
-0.0784171371 -0.0333324661 0.0739953829
-0.0784171371 -0.0333324661 0.0739953829
-0.1070292087 -0.0100920355 0.0750013521
-0.1075497857 0.0180888121 0.0752246110
-0.0501503084 0.0366340251 0.0963081553
-0.0301041008 0.0380938688 0.1059574407
0.0050667429 0.0324923176 0.1151135308
-0.0154997905 -0.0312844366 0.0947967325
-0.0349500338 -0.0328950681 0.1055751202
-0.0695249062 -0.0274440952 0.1168467046
-0.0472879392 0.0274771640 0.1557395672
-0.0148892160 -0.0230057965 0.1544220238
-0.0433393128 0.0226099638 0.1938468085
-0.0433393128 0.0226099638 0.1938468085
-0.0166085180 -0.0187029025 0.1927622591
-0.0397271123 0.0182825838 0.2370686421
-0.0397271123 0.0182825838 0.2370686421
-0.0033791960 -0.0083940646 0.2358122367
-0.0362165832 -0.0152764693 0.2367190051
-0.0360988919 0.0145499162 0.2853957196
-0.0332689924 -0.0122111760 0.2851161246
0.0197376913 -0.0136128725 0.3382713124
0.0936817587 -0.0448823991 0.3967520530
0.1530043656 -0.0016523392 -0.2138168236
0.0936817587 -0.0448823991 0.3967520530
0.0179068462 -0.0235858689 0.3594779970
0.0995398077 -0.0529386568 0.4131452696
0.1462143375 -0.0756713085 0.4563721224
0.0645813760 -0.0463185205 0.4027048498
0.0642743767 -0.0504186828 0.4113788621
0.0060417112 -0.0271749064 0.3682371140
-0.0621592585 -0.0248738430 0.3702429433
-0.1191920889 -0.0442286247 0.4167747153
-0.1197306728 -0.0400999329 0.4081255721
-0.1998639587 -0.0639948162 0.4665504821
-0.1543824641 -0.0443714583 0.4206132681
-0.0742491782 -0.0204765751 0.3621883581
-0.1489676124 -0.0366955422 0.4038885091
-0.1489676124 -0.0366955422 0.4038885091
-0.0766457266 -0.0103609488 0.3411060036
-0.0437483057 0.0685455544 -0.3763138542
-0.0437483057 0.0685455544 -0.3763138542
-0.0479826052 -0.0562746467 -0.3771114833
-0.0479826052 -0.0562746467 -0.3771114833
-0.0043695538 0.0878511238 -0.1081049871
-0.0259678979 0.0888665651 -0.1523351009
-0.0720742133 0.0907683825 -0.2051563022
-0.0245130844 0.0889310978 -0.1701546141
-0.0245130844 0.0889310978 -0.1701546141
-0.0519181978 0.0902415891 -0.2297336617
-0.0219088958 0.0893228608 -0.2452889311
-0.0636632554 0.0908650955 -0.2649416855
0.0961534332 -0.0001383798 -0.1489384940
0.0796606653 0.0000193283 -0.0860933696
-0.0491988962 0.0157873689 -0.4762413985
-0.0382142592 -0.0006877103 -0.4766833730
-0.0010626493 0.0095879330 -0.4582485348
0.0019730857 0.0050344782 -0.4583706825
-0.0968055996 0.0039159764 -0.4554984116
-0.0968055996 0.0039159764 -0.4554984116
-0.0974395859 0.0468656936 -0.3933216113
-0.1139234366 0.0366820026 -0.4141155237
-0.0425859838 0.0554196265 -0.3948580623
-0.0864966356 0.0409589690 -0.4148837493
0.0088617447 0.0484814766 -0.3964095816
-0.0205767410 0.0508357574 -0.4167331419
0.0290599802 0.0150227369 -0.4184450522
0.0253365485 -0.0128487915 -0.4185422658
0.0031740560 -0.0342739266 -0.3968547592
0.0184228761 -0.0237774422 -0.4184213467
-0.0516790137 -0.0428276153 -0.3953183219
-0.0090036588 -0.0280542866 -0.4176531280
-0.1031264849 -0.0358896052 -0.3937668112
-0.0749232979 -0.0379312670 -0.4158037443
-0.1245600156 -0.0021181418 -0.4140918333
-0.1208371126 0.0257532471 -0.4139946053
-0.0406743283 0.0580427425 -0.3847345216
-0.0955279304 0.0494888096 -0.3831980705
-0.0406743283 0.0580427425 -0.3847345216
-0.0113358718 0.0649428249 -0.3753792063
-0.1064220733 0.0547650986 -0.3523608794
-0.1192756110 0.0504356759 -0.3621780689
-0.0404823983 0.0650477375 -0.3542083764
-0.0991593113 0.0512475726 -0.3729190068
0.0088617447 0.0484814766 -0.3964095816
0.0415606353 0.0402460549 -0.3771035738
0.0213630188 0.0567074033 -0.3560731985
-0.0113358718 0.0649428249 -0.3753792063
-0.0529986378 -0.0456005279 -0.3851401328
0.0018544319 -0.0370468392 -0.3866765701
-0.0529986378 -0.0456005279 -0.3851401328
-0.0817447968 -0.0526502849 -0.3741937250
0.0145254743 -0.0427726289 -0.3566078097
0.0267867134 -0.0382934522 -0.3670924736
-0.0514142053 -0.0530549497 -0.3547608344
0.0060781127 -0.0389554358 -0.3766536500
-0.1031264849 -0.0358896052 -0.3937668112
-0.1346413082 -0.0279540948 -0.3724688376
-0.1132596200 -0.0447147745 -0.3528957515
-0.0817447968 -0.0526502849 -0.3741937250
-0.0390383939 0.0668412481 -0.3431985360
-0.1049780688 0.0565586092 -0.3413510391
-0.0390383939 0.0668412481 -0.3431985360
-0.0046245519 0.0737760781 -0.3331124441
-0.1158263851 0.0672438367 -0.3078404557
-0.1442068672 0.0520095102 -0.3292022147
0.0213630188 0.0567074033 -0.3560731985
0.0565002344 0.0452377624 -0.3351051248
0.0305126637 0.0623064373 -0.3121443704
-0.0046245519 0.0737760781 -0.3331124441
0.0744951650 0.0242519676 -0.3137079456
0.0565002344 0.0452377624 -0.3351051248
0.0729632728 -0.0208999505 -0.3139966604
0.0787384040 0.0016480299 -0.3360754744
-0.0522152553 -0.0550114193 -0.3437134757
0.0137244243 -0.0447290985 -0.3455604510
-0.0522152553 -0.0550114193 -0.3437134757
-0.0859861452 -0.0621090493 -0.3317426294
0.0265021220 -0.0559026912 -0.3129002347
0.0535967000 -0.0403427647 -0.3356523522
-0.1132596200 -0.0447147745 -0.3528957515
-0.1471104016 -0.0335710170 -0.3297494421
-0.1198369267 -0.0509652918 -0.3085963200
-0.0859861452 -0.0621090493 -0.3317426294
-0.1638187548 -0.0129110545 -0.3070327662
-0.1471104016 -0.0335710170 -0.3297494421
-0.1622868625 0.0322408636 -0.3067440514
-0.1693491071 0.0100183667 -0.3287790795
0.0744951650 0.0242519676 -0.3137079456
0.0905727496 0.0009419631 -0.2884460250
0.0825406084 0.0248891827 -0.2621320981
0.0664630238 0.0481991872 -0.2873940186
0.0729632728 -0.0208999505 -0.3139966604
0.0633152049 -0.0445815284 -0.2879872861
0.0809246818 -0.0227396148 -0.2624366508
0.0905727496 0.0009419631 -0.2884460250
-0.1638187548 -0.0129110545 -0.3070327662
-0.1783869831 0.0100165172 -0.2805357662
-0.1688457784 -0.0143124962 -0.2550907594
-0.1542775500 -0.0372400679 -0.2815877594
-0.1622868625 0.0322408636 -0.3067440514
-0.1511297311 0.0555406476 -0.2809944918
-0.1672298518 0.0333163013 -0.2547862067
-0.1783869831 0.0100165172 -0.2805357662
-0.0554957464 0.0715188158 -0.2332086888
-0.0367133608 0.0748569611 -0.2582863202
-0.1143962126 0.0627430232 -0.2561098969
-0.0947627239 0.0656682874 -0.2484761608
-0.0162287690 0.0773693442 -0.2179412167
-0.0170798720 0.0777822254 -0.2506525841
-0.0554957464 0.0715188158 -0.2332086888
-0.0162287690 0.0773693442 -0.2179412167
-0.1340033481 0.0628951518 -0.2064286722
-0.0991451708 0.0763871282 -0.2073455668
-0.1352068160 0.0632530788 -0.2391296458
-0.1340033481 0.0628951518 -0.2064286722
-0.0386420385 0.0815211603 -0.1927026621
-0.0582755272 0.0785958961 -0.2003363982
-0.1139706611 0.0625365826 -0.2397542132
-0.0991451708 0.0763871282 -0.2073455668
0.0535035745 0.0569195149 -0.2446797411
0.0194855185 0.0728021804 -0.2435709771
0.0542004251 0.0565786809 -0.2119638676
0.0535035745 0.0569195149 -0.2446797411
0.0203366215 0.0723892993 -0.2108596096
0.0542004251 0.0565786809 -0.2119638676
0.0194855185 0.0728021804 -0.2435709771
0.0203366215 0.0723892993 -0.2108596096
-0.0293785782 -0.0613033806 -0.2349503637
-0.0495917225 -0.0642793552 -0.2589373193
0.0280909751 -0.0521657823 -0.2611132166
0.0089344574 -0.0552116484 -0.2523922656
-0.0676916138 -0.0673951129 -0.2175084617
-0.0687482403 -0.0673252213 -0.2502163683
-0.0293785782 -0.0613033806 -0.2349503637
-0.0676916138 -0.0673951129 -0.2175084617
0.0505596310 -0.0530417987 -0.2126665744
0.0157016819 -0.0665336813 -0.2117491616
0.0498554433 -0.0529172243 -0.2453838307
0.0505596310 -0.0530417987 -0.2126665744
-0.0438475085 -0.0719089172 -0.1936826923
-0.0246909908 -0.0688630511 -0.2024036432
0.0286192884 -0.0522007281 -0.2447592633
0.0157016819 -0.0665336813 -0.2117491616
-0.1388549842 -0.0465835248 -0.2398342575
-0.1048367740 -0.0624658251 -0.2409435475
-0.1376441792 -0.0467251921 -0.2071319011
-0.1388549842 -0.0465835248 -0.2398342575
-0.1037801474 -0.0625357167 -0.2082356409
-0.1376441792 -0.0467251921 -0.2071319011
-0.1048367740 -0.0624658251 -0.2409435475
-0.1037801474 -0.0625357167 -0.2082356409
-0.1159725255 0.0694621765 -0.1905366327
-0.0966661817 0.0719207911 -0.1819403048
-0.0349926398 0.0707218877 -0.1380417704
-0.0599307492 0.0811253938 -0.1738024241
-0.0890002123 0.0617477607 -0.1273919181
-0.1063508266 0.0584900045 -0.1177688280
-0.0330369103 0.0699227461 -0.1198223524
-0.0542989836 0.0682632731 -0.1466380984
-0.1276129000 0.0568305316 -0.1445845740
-0.0929116713 0.0633460439 -0.1638307543
-0.1315243590 0.0584288148 -0.1810234102
-0.1276129000 0.0568305316 -0.1445845740
-0.0174584394 0.0796924013 -0.1750515589
-0.0599307492 0.0811253938 -0.1738024241
-0.0175635511 0.0774678758 -0.1385002177
-0.0174584394 0.0796924013 -0.1750515589
0.0536938999 0.0556705580 -0.1773038336
0.0198300963 0.0714811763 -0.1761995756
0.0518297463 0.0542671932 -0.1406951330
0.0536938999 0.0556705580 -0.1773038336
0.0197249846 0.0692566508 -0.1396482344
0.0518297463 0.0542671932 -0.1406951330
0.0198300963 0.0714811763 -0.1761995756
0.0197249846 0.0692566508 -0.1396482344
0.0334827503 -0.0598500272 -0.1958492399
0.0147091205 -0.0624435134 -0.1861796168
-0.0443010798 -0.0619190617 -0.1387489140
-0.0214934840 -0.0717829408 -0.1760512873
0.0102392049 -0.0530798587 -0.1311328156
0.0281225323 -0.0499570003 -0.1224899548
-0.0451913822 -0.0613896895 -0.1204364301
-0.0255274499 -0.0593255755 -0.1484185371
0.0477864647 -0.0478928864 -0.1504720618
0.0120198099 -0.0541386032 -0.1677577833
0.0495670696 -0.0489516308 -0.1870970296
0.0477864647 -0.0478928864 -0.1504720618
-0.0639657937 -0.0703499483 -0.1748021524
-0.0214934840 -0.0717829408 -0.1760512873
-0.0617300544 -0.0686650030 -0.1382902076
-0.0639657937 -0.0703499483 -0.1748021524
-0.1351183612 -0.0463281987 -0.1725503960
-0.1012543294 -0.0621387233 -0.1736541357
-0.1311233518 -0.0454643203 -0.1360952923
-0.1351183612 -0.0463281987 -0.1725503960
-0.0990185901 -0.0604537779 -0.1371421909
-0.1311233518 -0.0454643203 -0.1360952923
-0.1012543294 -0.0621387233 -0.1736541357
-0.0990185901 -0.0604537779 -0.1371421909
-0.0518977044 0.0647704162 -0.0942385952
-0.0330369103 0.0699227461 -0.1198223524
-0.1063508266 0.0584900045 -0.1177688280
-0.0881997859 0.0605834751 -0.1099254171
-0.0155956229 0.0689573574 -0.0785517733
-0.0148858695 0.0720162166 -0.1119789414
-0.0518977044 0.0647704162 -0.0942385952
-0.0155956229 0.0689573574 -0.0785517733
-0.0348931151 0.0707729180 -0.0529038327
-0.0530441559 0.0686794474 -0.0607472437
-0.1067057033 0.0569605749 -0.1010552439
-0.0897420248 0.0672117367 -0.0680451818
0.0501574598 0.0522161281 -0.1056646324
0.0180526981 0.0672055857 -0.1046177338
0.0469179985 0.0503385235 -0.0721549723
0.0501574598 0.0522161281 -0.1056646324
0.0721105656 0.0208142547 -0.0563930934
0.0645901100 0.0437825970 -0.0894332516
0.0707057155 -0.0205936006 -0.0566573439
0.0870307409 -0.0002031027 -0.0904124290
-0.0248696364 -0.0566068498 -0.0959219345
-0.0451913822 -0.0613896895 -0.1204364301
0.0281225323 -0.0499570003 -0.1224899548
0.0104584761 -0.0521736168 -0.1136339480
-0.0601977489 -0.0610400829 -0.0782099210
-0.0628554385 -0.0636063060 -0.1115804233
-0.0248696364 -0.0566068498 -0.0959219345
-0.0601977489 -0.0610400829 -0.0782099210
-0.0394393040 -0.0632251075 -0.0537596085
-0.0217752478 -0.0610084910 -0.0626156153
0.0294513771 -0.0486738888 -0.1058047036
0.0144356366 -0.0594176343 -0.0720170948
-0.1274117877 -0.0439294943 -0.1011953155
-0.0953070261 -0.0589189519 -0.1022422141
-0.1222243991 -0.0425447877 -0.0679073067
-0.1274117877 -0.0439294943 -0.1011953155
-0.1464428661 -0.0132671264 -0.0502708805
-0.1408704743 -0.0357424122 -0.0840278618
-0.1450380160 0.0281407290 -0.0500066301
-0.1633109787 0.0082432899 -0.0830497365
0.0254424623 0.0493286776 0.0002036302
0.0007362712 0.0655344010 -0.0264688802
0.0721105656 0.0208142547 -0.0563930934
0.0767629349 -0.0002463335 -0.0291716313
0.0611341554 0.0184468839 -0.0010652124
0.0564817861 0.0395074720 -0.0282866745
0.0707057155 -0.0205936006 -0.0566573439
0.0538337934 -0.0385415168 -0.0287852193
0.0598910128 -0.0181942496 -0.0012995067
0.0767629349 -0.0002463335 -0.0291716313
-0.0965685766 -0.0425925973 0.0030829321
-0.0734655415 -0.0583925603 -0.0252195599
-0.1464428661 -0.0132671264 -0.0502708805
-0.1494920901 0.0073873872 -0.0225173422
-0.1322602821 -0.0117111701 0.0043517723
-0.1292110581 -0.0323656837 -0.0234017660
-0.1450380160 0.0281407290 -0.0500066301
-0.1265630655 0.0456833051 -0.0229032212
-0.1310171396 0.0249299634 0.0045860666
-0.1494920901 0.0073873872 -0.0225173422
-0.0316436481 0.0544770667 0.0140945915
-0.0914060214 0.0451576674 0.0157685375
-0.0027969239 0.0567261289 0.0254582194
-0.0337125732 0.0496557919 0.0384957931
-0.0826787932 0.0450032235 0.0520775997
-0.1127859675 0.0395743532 0.0285390160
-0.0337125732 0.0496557919 0.0384957931
-0.0901455713 0.0483374754 0.0279434933
0.0254424623 0.0493286776 0.0002036302
0.0453682179 0.0342383176 0.0238876114
0.0171288316 0.0416357688 0.0491422006
-0.0027969239 0.0567261289 0.0254582194
-0.0387722567 -0.0479208377 0.0135463994
0.0209901238 -0.0386012290 0.0118724548
-0.0669087713 -0.0503497513 0.0265372004
-0.0352829054 -0.0434590561 0.0378540567
0.0143935187 -0.0389864961 0.0486266778
0.0430802740 -0.0331979232 0.0234564040
-0.0352829054 -0.0434590561 0.0378540567
0.0204398831 -0.0419608883 0.0240519277
-0.0965685766 -0.0425925973 0.0030829321
-0.1150739114 -0.0278618875 0.0281078086
-0.0854141061 -0.0356190415 0.0515620769
-0.0669087713 -0.0503497513 0.0265372004
-0.0811428460 0.0379579055 0.0632910211
-0.0343261065 0.0484388319 0.0733133971
-0.0324521230 0.0528355999 0.0506707490
-0.0067398326 0.0475080861 0.0725020691
0.0171288316 0.0416357688 0.0491422006
0.0334441272 0.0287466454 0.0711917183
0.0400620502 0.0157755442 0.0709029557
0.0405821110 -0.0124050762 0.0706797135
0.0135163658 -0.0321080685 0.0600135392
-0.0326415690 -0.0427555712 0.0725914481
-0.0358331461 -0.0468187154 0.0500335296
-0.0602278429 -0.0418248254 0.0734027761
-0.0854141061 -0.0356190415 0.0515620769
-0.1004118232 -0.0230635379 0.0747126022
-0.1070292087 -0.0100920355 0.0750013521
-0.1075497857 0.0180888121 0.0752246110
-0.0705630894 0.0337164132 0.1173280446
-0.0515943856 0.0330764195 0.1167701642
0.0050667429 0.0324923176 0.1151135308
0.0287585780 0.0132145271 0.1142803017
0.0291555136 -0.0101466206 0.1140962354
0.0061049020 -0.0286684487 0.1146316655
-0.0128638018 -0.0280284550 0.1151895458
-0.0695249062 -0.0274440952 0.1168467046
-0.0932167512 -0.0081661437 0.1176794110
-0.0936131545 0.0151952482 0.1178634636
-0.0472879392 0.0274771640 0.1557395672
-0.0317192864 0.0335029841 0.1553300554
-0.0003212539 0.0270597852 0.1543668689
-0.0148892160 -0.0230057965 0.1544220238
-0.0304578759 -0.0290318261 0.1548315343
-0.0618559084 -0.0225886272 0.1557947209
-0.0423829376 0.0253036794 0.1742706446
-0.0149555699 0.0270361583 0.1930517791
-0.0187051281 -0.0211077524 0.1732374785
-0.0449922609 -0.0231290970 0.1935572886
-0.0038957178 -0.0191318254 0.1923883684
-0.0715983197 0.0104617356 0.1945811835
-0.0390581891 0.0207330069 0.2132762701
-0.0165808683 0.0218920196 0.2364203150
-0.0033791960 -0.0083940646 0.2358122367
-0.0362165832 -0.0152764693 0.2367190051
-0.0586810222 0.0012104816 0.2374953107
-0.0360988919 0.0145499162 0.2853957196
-0.0070895636 -0.0067124744 0.2843932952
-0.0070895636 -0.0067124744 0.2843932952
-0.0332689924 -0.0122111760 0.2851161246
-0.0511978526 0.0009296561 0.2857359838
0.0995398077 -0.0529386568 0.4131452696
0.0732735183 -0.0375442021 0.3833352349
0.0120487972 -0.0155296112 0.3430847805
0.0412441111 -0.0349521947 0.3810914234
0.1053978568 -0.0609949145 0.4295384861
0.0879186409 -0.0576848464 0.4243182762
0.1345931707 -0.0804174980 0.4675451290
0.1403562885 -0.0676150508 0.4399789059
0.1112559058 -0.0690511722 0.4459317026
0.0332603566 -0.0338968609 0.3796696228
0.0680697514 -0.0602185501 0.4316555926
0.0487673666 -0.0421577719 0.3955242424
0.0022463365 -0.0173750391 0.3479603835
0.0234464086 -0.0403357509 0.3942300989
-0.0105579043 -0.0337180423 0.3836982023
0.0234464086 -0.0403357509 0.3942300989
-0.0113629862 -0.0140140618 0.3422441291
-0.0105579043 -0.0337180423 0.3836982023
-0.0446583891 -0.0325675106 0.3847011169
-0.0454634710 -0.0128635301 0.3432470437
-0.0788550459 -0.0368841559 0.3972388429
-0.0446583891 -0.0325675106 0.3847011169
-0.0788550459 -0.0368841559 0.3972388429
-0.0589091520 -0.0153116864 0.3497590012
-0.1041213546 -0.0369993901 0.4000207867
-0.1224421953 -0.0537907813 0.4372586574
-0.0890506204 -0.0297701555 0.3832668582
-0.1652121675 -0.0597232907 0.4540627860
-0.1944491070 -0.0563189000 0.4498257231
-0.1879529148 -0.0695349696 0.4770313930
-0.1424714202 -0.0499116118 0.4310941791
-0.1597973158 -0.0520473745 0.4373380271
-0.0969899255 -0.0302882540 0.3851569651
-0.0688343265 -0.0128006589 0.3454635992
-0.1289342909 -0.0307218213 0.3892822817
-0.1543824641 -0.0443714583 0.4206132681
-0.0553024872 0.0679673248 -0.3795613365
-0.0363310786 0.0708297842 -0.3671398982
-0.0364955827 -0.0576758995 -0.3738766584
-0.0593286889 -0.0569055230 -0.3732051237
-0.0058118825 0.0883397718 -0.1769124604
-0.0173384613 0.0888152261 -0.1901177607
-0.0706193997 0.0908329151 -0.2229758154
-0.0310410180 0.0894704718 -0.2199072845
-0.0427860756 0.0900939781 -0.2551153083
-0.0310410180 0.0894704718 -0.2199072845
-0.0727953776 0.0910127065 -0.2395600388
-0.0427860756 0.0900939781 -0.2551153083
-0.0233069052 -0.0805146690 -0.2132041767
-0.0196228260 -0.0812001052 -0.1255566180
-0.0341708910 -0.0807327177 -0.1214604504
-0.0374677383 -0.0804545865 -0.1474644551
-0.0328102151 -0.0800875805 -0.2295726365
-0.0513354654 -0.0796646303 -0.1974243806
-0.0733903834 -0.0786570834 -0.2379727645
-0.0513354654 -0.0796646303 -0.1974243806
-0.0433810949 -0.0795757555 -0.2535285573
-0.0733903834 -0.0786570834 -0.2379727645
0.1864252799 -0.0030686297 -0.1696521619
0.1575806316 -0.0019853654 -0.1860162971
0.1241597173 -0.0005690749 -0.2301809589
0.1575806316 -0.0019853654 -0.1860162971
0.1369389649 -0.0013827500 -0.1707362734
0.1035180506 0.0000335405 -0.2149009352
0.1369389649 -0.0013827500 -0.1707362734
0.1451419465 -0.0018633989 -0.1390921145
0.1199240138 -0.0009277574 -0.1516126174
0.0957342511 0.0001879048 -0.1977417941
0.0963630242 -0.0003015222 -0.1245368440
0.1125593964 -0.0010996777 -0.0856501762
3 34 692 167
3 168 692 34
3 34 83 168
3 34 693 83
3 49 693 34
3 34 48 49
3 34 167 48
3 216 424 167
3 39 424 216
3 216 425 164
3 167 425 216
3 168 426 167
3 38 426 168
3 164 427 38
3 167 427 164
3 168 83 90
3 38 694 90
3 168 694 38
3 122 695 83
3 90 695 122
3 122 428 217
3 83 428 122
3 217 429 50
3 83 429 217
3 49 430 83
3 50 430 49
3 49 48 123
3 50 431 123
3 49 431 50
3 123 696 88
3 48 696 123
3 48 167 39
3 39 697 48
3 88 697 39
3 218 432 164
3 39 432 218
3 164 433 218
3 3 433 164
3 434 698 210
3 219 698 434
3 434 699 39
3 210 699 434
3 435 700 219
3 3 700 435
3 435 701 39
3 219 701 435
3 38 436 164
3 209 436 38
3 437 702 3
3 209 702 437
3 437 703 164
3 3 703 437
3 90 704 38
3 85 704 90
3 209 438 85
3 38 438 209
3 122 705 90
3 211 705 122
3 85 439 211
3 90 439 85
3 220 440 50
3 122 440 220
3 50 441 220
3 155 441 50
3 442 706 211
3 221 706 442
3 442 707 122
3 211 707 442
3 443 708 221
3 155 708 443
3 443 709 122
3 221 709 443
3 123 444 50
3 212 444 123
3 445 710 155
3 212 710 445
3 445 711 50
3 155 711 445
3 88 712 123
3 91 712 88
3 212 446 91
3 123 446 212
3 39 713 88
3 210 713 39
3 91 447 210
3 88 447 91
3 448 714 222
3 3 714 448
3 448 715 210
3 222 715 448
3 449 716 3
3 222 716 449
3 449 717 201
3 3 717 449
3 224 718 146
3 223 718 224
3 210 719 146
3 224 719 210
3 225 720 223
3 201 720 225
3 225 721 210
3 223 721 225
3 450 722 209
3 3 722 450
3 450 723 147
3 209 723 450
3 226 724 201
3 147 724 226
3 226 725 3
3 201 725 226
3 85 451 209
3 84 451 85
3 147 452 84
3 209 452 147
3 211 453 85
3 36 453 211
3 84 454 36
3 85 454 84
3 455 726 227
3 155 726 455
3 455 727 211
3 227 727 455
3 456 728 155
3 227 728 456
3 456 729 143
3 155 729 456
3 229 730 36
3 228 730 229
3 211 731 36
3 229 731 211
3 230 732 228
3 143 732 230
3 230 733 211
3 228 733 230
3 457 734 212
3 155 734 457
3 457 735 35
3 212 735 457
3 231 736 143
3 35 736 231
3 231 737 155
3 143 737 231
3 91 458 212
3 89 458 91
3 35 459 89
3 212 459 35
3 210 460 91
3 146 460 210
3 89 461 146
3 91 461 89
3 233 738 232
3 201 738 233
3 233 739 146
3 232 739 233
3 234 740 201
3 232 740 234
3 234 741 57
3 201 741 234
3 235 742 179
3 58 742 235
3 235 743 146
3 179 743 235
3 236 462 58
3 57 462 236
3 236 463 146
3 58 463 236
3 237 744 147
3 201 744 237
3 237 745 180
3 147 745 237
3 238 746 57
3 180 746 238
3 238 747 201
3 57 747 238
3 84 464 147
3 93 464 84
3 465 748 180
3 93 748 465
3 465 749 147
3 180 749 465
3 36 466 84
3 182 466 36
3 467 750 93
3 182 750 467
3 467 751 84
3 93 751 467
3 240 752 239
3 143 752 240
3 240 753 36
3 239 753 240
3 241 754 143
3 239 754 241
3 241 755 82
3 143 755 241
3 242 756 182
3 81 756 242
3 242 757 36
3 182 757 242
3 243 468 81
3 82 468 243
3 243 469 36
3 81 469 243
3 244 758 35
3 143 758 244
3 244 759 181
3 35 759 244
3 245 760 82
3 181 760 245
3 245 761 143
3 82 761 245
3 89 470 35
3 87 470 89
3 471 762 181
3 87 762 471
3 471 763 35
3 181 763 471
3 146 472 89
3 179 472 146
3 473 764 87
3 179 764 473
3 473 765 89
3 87 765 473
3 58 474 179
3 246 474 58
3 246 475 70
3 58 475 246
3 248 476 247
3 205 476 248
3 248 477 70
3 247 477 248
3 205 478 249
3 179 478 205
3 249 479 247
3 179 479 249
3 250 480 57
3 58 480 250
3 250 481 70
3 57 481 250
3 251 482 180
3 57 482 251
3 251 483 204
3 180 483 251
3 252 484 70
3 204 484 252
3 252 485 57
3 70 485 252
3 253 766 93
3 180 766 253
3 253 767 92
3 93 767 253
3 254 768 204
3 92 768 254
3 254 769 180
3 204 769 254
3 255 770 182
3 93 770 255
3 255 771 144
3 182 771 255
3 256 772 92
3 144 772 256
3 256 773 93
3 92 773 256
3 81 486 182
3 257 486 81
3 257 487 213
3 81 487 257
3 259 488 258
3 144 488 259
3 259 489 213
3 258 489 259
3 144 490 260
3 182 490 144
3 260 491 258
3 182 491 260
3 261 492 82
3 81 492 261
3 261 493 213
3 82 493 261
3 262 494 181
3 82 494 262
3 262 495 145
3 181 495 262
3 263 496 213
3 145 496 263
3 263 497 82
3 213 497 263
3 264 774 87
3 181 774 264
3 264 775 86
3 87 775 264
3 265 776 145
3 86 776 265
3 265 777 181
3 145 777 265
3 266 778 179
3 87 778 266
3 266 779 205
3 179 779 266
3 267 780 86
3 205 780 267
3 267 781 87
3 86 781 267
3 269 782 268
3 498 782 269
3 498 783 70
3 269 783 498
3 499 784 269
3 205 784 499
3 268 785 269
3 499 785 268
3 500 786 270
3 126 786 500
3 500 787 70
3 270 787 500
3 501 788 270
3 268 788 501
3 501 789 126
3 270 789 501
3 502 790 271
3 76 790 502
3 502 791 125
3 271 791 502
3 503 792 271
3 205 792 503
3 503 793 76
3 271 793 503
3 273 794 125
3 126 794 273
3 272 795 125
3 273 795 272
3 274 796 272
3 205 796 274
3 272 797 274
3 125 797 272
3 504 798 275
3 204 798 504
3 504 799 70
3 275 799 504
3 505 800 275
3 75 800 505
3 505 801 204
3 275 801 505
3 506 802 276
3 126 802 506
3 506 803 75
3 276 803 506
3 507 804 276
3 70 804 507
3 507 805 126
3 276 805 507
3 277 508 92
3 204 508 277
3 277 509 12
3 92 509 277
3 278 510 75
3 12 510 278
3 278 511 204
3 75 511 278
3 279 512 144
3 92 512 279
3 279 513 173
3 144 513 279
3 280 514 12
3 173 514 280
3 280 515 92
3 12 515 280
3 282 806 281
3 516 806 282
3 516 807 213
3 282 807 516
3 517 808 282
3 144 808 517
3 281 809 282
3 517 809 281
3 518 810 283
3 111 810 518
3 518 811 213
3 283 811 518
3 519 812 283
3 281 812 519
3 519 813 111
3 283 813 519
3 520 814 284
3 173 814 520
3 520 815 112
3 284 815 520
3 521 816 284
3 144 816 521
3 521 817 173
3 284 817 521
3 286 818 112
3 111 818 286
3 285 819 112
3 286 819 285
3 287 820 285
3 144 820 287
3 285 821 287
3 112 821 285
3 522 822 288
3 145 822 522
3 522 823 213
3 288 823 522
3 523 824 288
3 174 824 523
3 523 825 145
3 288 825 523
3 524 826 289
3 111 826 524
3 524 827 174
3 289 827 524
3 525 828 289
3 213 828 525
3 525 829 111
3 289 829 525
3 290 526 86
3 145 526 290
3 290 527 18
3 86 527 290
3 291 528 174
3 18 528 291
3 291 529 145
3 174 529 291
3 292 530 205
3 86 530 292
3 292 531 76
3 205 531 292
3 293 532 18
3 76 532 293
3 293 533 86
3 18 533 293
3 295 830 125
3 76 830 295
3 294 831 125
3 295 831 294
3 296 832 294
3 128 832 296
3 294 833 296
3 125 833 294
3 297 834 299
3 298 834 297
3 299 835 166
3 298 835 299
3 300 836 298
3 128 836 300
3 298 837 300
3 297 837 298
3 302 838 301
3 166 838 302
3 302 839 297
3 301 839 302
3 303 840 301
3 76 840 303
3 303 841 166
3 301 841 303
3 305 842 304
3 126 842 305
3 305 843 125
3 304 843 305
3 306 844 304
3 128 844 306
3 306 845 126
3 304 845 306
3 308 846 307
3 75 846 308
3 308 847 126
3 307 847 308
3 309 848 307
3 163 848 309
3 309 849 75
3 307 849 309
3 534 850 310
3 128 850 534
3 534 851 163
3 310 851 534
3 535 852 310
3 126 852 535
3 535 853 128
3 310 853 535
3 311 536 12
3 75 536 311
3 311 537 16
3 12 537 311
3 312 538 163
3 16 538 312
3 312 539 75
3 163 539 312
3 313 540 173
3 12 540 313
3 313 541 96
3 173 541 313
3 314 542 16
3 96 542 314
3 314 543 12
3 16 543 314
3 316 854 112
3 173 854 316
3 315 855 112
3 316 855 315
3 317 856 315
3 120 856 317
3 315 857 317
3 112 857 315
3 318 858 320
3 319 858 318
3 320 859 96
3 319 859 320
3 321 860 319
3 120 860 321
3 319 861 321
3 318 861 319
3 323 862 322
3 96 862 323
3 323 863 318
3 322 863 323
3 324 864 322
3 173 864 324
3 324 865 96
3 322 865 324
3 326 866 325
3 111 866 326
3 326 867 112
3 325 867 326
3 327 868 325
3 120 868 327
3 327 869 111
3 325 869 327
3 329 870 328
3 174 870 329
3 329 871 111
3 328 871 329
3 330 872 328
3 97 872 330
3 330 873 174
3 328 873 330
3 544 874 331
3 120 874 544
3 544 875 97
3 331 875 544
3 545 876 331
3 111 876 545
3 545 877 120
3 331 877 545
3 332 546 18
3 174 546 332
3 332 547 14
3 18 547 332
3 333 548 97
3 14 548 333
3 333 549 174
3 97 549 333
3 334 550 76
3 18 550 334
3 334 551 166
3 76 551 334
3 335 552 14
3 166 552 335
3 335 553 18
3 14 553 335
3 337 878 336
3 554 878 337
3 554 879 128
3 337 879 554
3 555 880 337
3 166 880 555
3 336 881 337
3 555 881 336
3 556 882 338
3 117 882 556
3 556 883 128
3 338 883 556
3 557 884 338
3 336 884 557
3 557 885 117
3 338 885 557
3 339 558 0
3 116 558 339
3 339 559 166
3 0 559 339
3 560 886 116
3 117 886 560
3 340 887 116
3 560 887 340
3 561 888 340
3 166 888 561
3 340 889 561
3 116 889 340
3 562 890 341
3 163 890 562
3 562 891 128
3 341 891 562
3 563 892 341
3 1 892 563
3 563 893 163
3 341 893 563
3 342 564 117
3 1 564 342
3 342 565 128
3 117 565 342
3 343 566 16
3 163 566 343
3 343 567 23
3 16 567 343
3 344 894 1
3 23 894 344
3 344 895 163
3 1 895 344
3 345 568 96
3 16 568 345
3 345 569 215
3 96 569 345
3 346 896 23
3 215 896 346
3 346 897 16
3 23 897 346
3 348 898 347
3 570 898 348
3 570 899 120
3 348 899 570
3 571 900 348
3 96 900 571
3 347 901 348
3 571 901 347
3 572 902 349
3 59 902 572
3 572 903 120
3 349 903 572
3 573 904 349
3 347 904 573
3 573 905 59
3 349 905 573
3 350 574 215
3 60 574 350
3 350 575 96
3 215 575 350
3 576 906 60
3 59 906 576
3 351 907 60
3 576 907 351
3 577 908 351
3 96 908 577
3 351 909 577
3 60 909 351
3 578 910 352
3 97 910 578
3 578 911 120
3 352 911 578
3 579 912 352
3 214 912 579
3 579 913 97
3 352 913 579
3 353 580 59
3 214 580 353
3 353 581 120
3 59 581 353
3 354 582 14
3 97 582 354
3 354 583 11
3 14 583 354
3 355 914 214
3 11 914 355
3 355 915 97
3 214 915 355
3 356 584 166
3 14 584 356
3 356 585 0
3 166 585 356
3 357 916 11
3 0 916 357
3 357 917 14
3 11 917 357
3 116 586 0
3 358 586 116
3 358 587 33
3 116 587 358
3 360 588 359
3 177 588 360
3 360 589 33
3 359 589 360
3 361 590 177
3 359 590 361
3 361 591 0
3 177 591 361
3 362 592 117
3 116 592 362
3 362 593 33
3 117 593 362
3 363 594 1
3 117 594 363
3 363 595 176
3 1 595 363
3 364 918 33
3 176 918 364
3 364 919 117
3 33 919 364
3 596 920 23
3 1 920 596
3 596 921 20
3 23 921 596
3 597 922 176
3 20 922 597
3 597 923 1
3 176 923 597
3 598 924 215
3 23 924 598
3 598 925 185
3 215 925 598
3 599 926 20
3 185 926 599
3 599 927 23
3 20 927 599
3 60 600 215
3 365 600 60
3 365 601 158
3 60 601 365
3 367 602 366
3 185 602 367
3 367 603 158
3 366 603 367
3 368 604 185
3 366 604 368
3 368 605 215
3 185 605 368
3 369 606 59
3 60 606 369
3 369 607 158
3 59 607 369
3 370 608 214
3 59 608 370
3 370 609 186
3 214 609 370
3 371 928 158
3 186 928 371
3 371 929 59
3 158 929 371
3 610 930 11
3 214 930 610
3 610 931 13
3 11 931 610
3 611 932 186
3 13 932 611
3 611 933 214
3 186 933 611
3 612 934 0
3 11 934 612
3 612 935 177
3 0 935 612
3 613 936 13
3 177 936 613
3 613 937 11
3 13 937 613
3 373 938 372
3 33 938 373
3 373 939 177
3 372 939 373
3 374 940 107
3 33 940 374
3 374 941 372
3 107 941 374
3 614 942 94
3 108 942 614
3 614 943 177
3 94 943 614
3 108 944 107
3 375 944 108
3 375 945 177
3 108 945 375
3 376 946 176
3 33 946 376
3 376 947 95
3 176 947 376
3 615 948 107
3 95 948 615
3 615 949 33
3 107 949 615
3 20 616 176
3 134 616 20
3 95 617 134
3 176 617 95
3 185 618 20
3 73 618 185
3 134 619 73
3 20 619 134
3 378 950 377
3 158 950 378
3 378 951 185
3 377 951 378
3 379 952 43
3 158 952 379
3 379 953 377
3 43 953 379
3 620 954 73
3 42 954 620
3 620 955 185
3 73 955 620
3 42 956 43
3 380 956 42
3 380 957 185
3 42 957 380
3 381 958 186
3 158 958 381
3 381 959 72
3 186 959 381
3 621 960 43
3 72 960 621
3 621 961 158
3 43 961 621
3 13 622 186
3 136 622 13
3 72 623 136
3 186 623 72
3 177 624 13
3 94 624 177
3 136 625 94
3 13 625 136
3 108 962 94
3 626 962 108
3 626 963 8
3 108 963 626
3 382 627 165
3 8 627 382
3 165 628 382
3 94 628 165
3 629 964 107
3 108 964 629
3 629 965 8
3 107 965 629
3 630 966 95
3 107 966 630
3 630 967 162
3 95 967 630
3 8 631 162
3 107 631 8
3 134 632 95
3 131 632 134
3 162 968 131
3 95 968 162
3 73 633 134
3 196 633 73
3 131 969 196
3 134 969 131
3 42 970 73
3 634 970 42
3 634 971 121
3 42 971 634
3 383 635 196
3 121 635 383
3 196 636 383
3 73 636 196
3 637 972 43
3 42 972 637
3 637 973 121
3 43 973 637
3 638 974 72
3 43 974 638
3 638 975 195
3 72 975 638
3 121 639 195
3 43 639 121
3 136 640 72
3 139 640 136
3 195 976 139
3 72 976 195
3 94 641 136
3 165 641 94
3 139 977 165
3 136 977 139
3 384 642 8
3 165 642 384
3 188 643 8
3 384 643 188
3 68 978 187
3 165 978 68
3 187 979 188
3 165 979 187
3 162 644 8
3 69 644 162
3 188 980 69
3 8 980 188
3 131 981 162
3 133 981 131
3 162 133 69
3 196 982 131
3 30 982 196
3 131 30 133
3 385 645 121
3 196 645 385
3 159 646 121
3 385 646 159
3 30 983 160
3 196 983 30
3 160 984 159
3 196 984 160
3 195 647 121
3 29 647 195
3 159 985 29
3 121 985 159
3 139 986 195
3 137 986 139
3 195 137 29
3 165 987 139
3 68 987 165
3 139 68 137
3 187 988 68
3 169 988 187
3 118 648 169
3 68 648 118
3 188 989 187
3 169 989 188
3 69 990 188
3 119 990 69
3 188 119 169
3 69 133 130
3 69 130 119
3 133 30 149
3 133 149 130
3 160 991 30
3 74 991 160
3 149 649 74
3 30 649 149
3 159 992 160
3 74 992 159
3 29 993 159
3 148 993 29
3 159 148 74
3 29 137 140
3 29 140 148
3 137 68 118
3 137 118 140
3 650 994 169
3 118 994 650
3 650 995 170
3 169 995 650
3 51 651 170
3 118 651 51
3 169 119 52
3 169 52 170
3 119 130 132
3 119 132 52
3 130 149 132
3 652 996 74
3 149 996 652
3 652 997 110
3 74 997 652
3 132 998 109
3 149 998 132
3 149 110 109
3 74 148 2
3 74 2 110
3 148 140 2
3 140 118 51
3 2 999 51
3 140 999 2
3 653 1000 170
3 51 1000 653
3 653 1001 41
3 170 1001 653
3 4 654 41
3 51 654 4
3 170 52 5
3 170 5 41
3 52 132 138
3 52 138 5
3 109 655 132
3 171 655 109
3 138 1002 171
3 132 1002 138
3 110 1003 109
3 192 1003 110
3 171 656 192
3 109 656 171
3 110 2 192
3 51 1004 2
3 4 1004 51
3 2 4 192
3 41 657 4
3 129 657 41
3 77 1005 129
3 4 1005 77
3 41 5 78
3 41 78 129
3 5 138 135
3 5 135 78
3 171 1006 138
3 40 1006 171
3 135 1007 40
3 138 1007 135
3 192 658 171
3 113 658 192
3 40 1008 113
3 171 1008 40
3 4 1009 192
3 77 1009 4
3 192 77 113
3 77 129 26
3 77 26 100
3 129 78 26
3 78 135 53
3 78 53 26
3 135 62 53
3 135 40 62
3 40 113 172
3 40 172 62
3 113 54 172
3 113 77 100
3 113 100 54
3 386 659 65
3 37 659 386
3 65 660 386
3 157 660 65
3 66 115 154
3 151 198 99
3 127 56 46
3 71 27 193
3 189 161 124
3 103 106 104
3 15 661 21
3 17 661 15
3 662 1010 387
3 157 1010 662
3 387 1011 662
3 388 1011 387
3 663 1012 388
3 37 1012 663
3 388 1013 663
3 387 1013 388
3 157 1014 664
3 389 1014 157
3 664 1015 387
3 389 1015 664
3 665 1016 389
3 184 1016 665
3 389 1017 665
3 157 1017 389
3 207 1018 184
3 666 1018 207
3 666 1019 37
3 207 1019 666
3 667 1020 203
3 207 1020 667
3 203 1021 667
3 390 1021 203
3 668 1022 390
3 37 1022 668
3 390 1023 668
3 203 1023 390
3 392 1024 391
3 178 1024 392
3 392 1025 203
3 391 1025 392
3 393 1026 391
3 37 1026 393
3 393 1027 178
3 391 1027 393
3 395 1028 394
3 178 1028 395
3 395 1029 37
3 394 1029 395
3 396 1030 394
3 202 1030 396
3 396 1031 178
3 394 1031 396
3 397 1032 202
3 669 1032 397
3 669 1033 37
3 397 1033 669
3 202 1034 397
3 670 1034 202
3 670 1035 206
3 202 1035 670
3 671 1036 206
3 37 1036 671
3 206 1037 671
3 183 1037 206
3 399 1038 156
3 672 1038 399
3 672 1039 183
3 399 1039 672
3 673 1040 399
3 398 1040 673
3 156 1041 399
3 673 1041 156
3 400 1042 398
3 674 1042 400
3 674 1043 37
3 400 1043 674
3 398 1044 400
3 675 1044 398
3 675 1045 156
3 398 1045 675
3 64 676 156
3 401 676 64
3 401 677 37
3 64 677 401
3 37 64 37
3 66 154 190
3 66 190 199
3 66 199 191
3 66 191 153
3 66 153 114
3 66 114 67
3 66 67 63
3 151 99 142
3 142 1046 151
3 24 1046 142
3 24 678 151
3 141 678 24
3 98 679 141
3 151 679 98
3 197 1047 98
3 151 1047 197
3 151 197 150
3 151 150 61
3 127 46 31
3 127 31 7
3 127 7 25
3 127 25 6
3 127 6 32
3 127 32 47
3 127 47 55
3 71 193 79
3 79 1048 71
3 44 1048 79
3 44 680 71
3 208 680 44
3 45 681 208
3 71 681 45
3 80 1049 45
3 71 1049 80
3 71 80 194
3 71 194 28
3 403 682 152
3 124 682 403
3 403 683 402
3 152 683 403
3 404 684 402
3 189 684 404
3 402 685 404
3 152 685 402
3 686 1050 175
3 152 1050 686
3 405 1051 175
3 686 1051 405
3 687 1052 405
3 189 1052 687
3 405 1053 687
3 175 1053 405
3 688 1054 406
3 200 1054 688
3 688 1055 175
3 406 1055 688
3 689 1056 406
3 189 1056 689
3 689 1057 200
3 406 1057 689
3 407 1058 104
3 103 1058 407
3 104 1059 407
3 101 1059 104
3 409 1060 102
3 101 1060 409
3 408 1061 102
3 409 1061 408
3 410 1062 408
3 103 1062 410
3 408 1063 410
3 102 1063 408
3 412 1064 411
3 105 1064 412
3 412 1065 102
3 411 1065 412
3 413 1066 411
3 103 1066 413
3 413 1067 105
3 411 1067 413
3 415 1068 9
3 17 1068 415
3 415 1069 414
3 9 1069 415
3 416 1070 414
3 21 1070 416
3 416 1071 9
3 414 1071 416
3 418 1072 417
3 9 1072 418
3 418 1073 21
3 417 1073 418
3 419 1074 9
3 417 1074 419
3 419 1075 22
3 9 1075 419
3 420 1076 22
3 421 1076 420
3 421 1077 21
3 420 1077 421
3 22 1078 420
3 422 1078 22
3 422 1079 19
3 22 1079 422
3 423 690 19
3 21 690 423
3 19 691 423
3 10 691 19