OFF

342 680 0
0.288701 -0.125812 -0.020258
0.288973 -0.129700 0.004041
0.296127 -0.130528 0.003219
0.325214 -0.129274 -0.007015
0.324680 -0.121515 -0.007015
0.366981 -0.120373 -0.007719
0.296128 -0.130642 -0.036483
0.288942 -0.129237 0.010522
0.361144 -0.124911 0.003303
0.288916 -0.129007 -0.049865
0.303695 -0.126288 -0.084252
0.336269 -0.127381 0.023220
0.325130 -0.127971 0.029430
0.369170 -0.122741 -0.011593
0.288755 -0.126525 0.010522
0.303975 -0.130290 -0.063415
0.367276 -0.124681 -0.021762
0.353157 -0.125203 -0.068350
0.353180 -0.125519 -0.060806
0.366974 -0.120296 -0.021762
0.367207 -0.123703 -0.032438
0.284757 -0.128859 0.005174
0.367278 -0.124693 -0.011007
0.360868 -0.121022 -0.048864
0.353129 -0.124808 -0.074181
0.324688 -0.121763 -0.064294
0.288722 -0.126165 -0.041310
0.303836 -0.128328 -0.082084
0.284734 -0.128524 0.005674
0.314471 -0.123195 -0.080960
0.369116 -0.121967 -0.013732
0.314875 -0.128814 0.026973
0.353009 -0.122832 0.024461
0.288973 -0.129793 -0.035484
0.303939 -0.129567 0.023760
0.288940 -0.129335 -0.046135
0.324693 -0.121673 0.006269
0.345682 -0.126009 -0.076985
0.314501 -0.123389 0.026973
0.303565 -0.124143 0.023760
0.352917 -0.121515 0.015936
0.336146 -0.125879 -0.096188
0.369119 -0.122006 -0.014091
0.335842 -0.121379 -0.062609
0.304003 -0.130678 -0.053617
0.369129 -0.122147 -0.010779
0.352896 -0.121397 -0.060806
0.284785 -0.129276 0.002644
0.314629 -0.125534 -0.095369
0.345657 -0.125390 0.029287
0.324744 -0.122633 -0.085994
0.314955 -0.130018 0.005316
0.367007 -0.120739 -0.003369
0.336313 -0.128146 -0.032403
0.295734 -0.124803 0.015517
0.288858 -0.128166 -0.053699
0.369163 -0.122640 -0.014389
0.314397 -0.122042 -0.047733
0.360845 -0.120634 -0.024649
0.366971 -0.120253 -0.017508
0.303501 -0.123420 -0.063415
0.296023 -0.129195 -0.066669
0.295867 -0.126941 -0.072134
0.325164 -0.128472 0.023841
0.284772 -0.129162 -0.027311
0.314770 -0.127574 -0.092911
0.336192 -0.126539 -0.091142
0.303581 -0.124607 -0.077805
0.345567 -0.124373 -0.090732
0.345378 -0.121570 -0.068214
0.352917 -0.121715 -0.068350
0.295980 -0.128573 -0.070296
0.288722 -0.126063 0.004041
0.304021 -0.130915 -0.042196
0.367089 -0.121925 -0.000619
0.314937 -0.129739 0.014628
0.366992 -0.120524 -0.005253
0.284785 -0.129343 -0.024630
0.353012 -0.123118 -0.080174
0.352968 -0.122245 0.023054
0.288710 -0.125971 -0.035484
0.324821 -0.123473 0.033116
0.304029 -0.130994 -0.028009
0.295681 -0.124147 -0.036483
0.335921 -0.122322 0.028662
0.324711 -0.122131 -0.076164
0.335962 -0.122908 0.032252
0.336093 -0.125110 -0.098746
0.303891 -0.129104 -0.077805
0.367015 -0.120919 -0.030557
0.336305 -0.128078 -0.049138
0.335847 -0.121298 0.006108
0.295711 -0.124485 0.010188
0.335862 -0.121709 -0.074167
0.335865 -0.121536 0.015806
0.369165 -0.122673 -0.011061
0.369125 -0.122078 -0.010891
0.369153 -0.122496 -0.014776
0.352874 -0.121022 -0.041082
0.366982 -0.120424 -0.025186
0.367248 -0.124237 -0.003369
0.295678 -0.124084 -0.024457
0.369127 -0.122125 -0.014619
0.325029 -0.126793 -0.098775
0.336026 -0.124146 -0.098746
0.353096 -0.124343 -0.078158
0.288986 -0.129951 -0.020258
0.345749 -0.126872 -0.029949
0.369114 -0.121935 -0.012792
0.303681 -0.125811 0.028318
0.335929 -0.122716 -0.091142
0.304019 -0.130771 0.004639
0.361048 -0.123484 0.013874
0.345649 -0.125549 -0.083764
0.360940 -0.122101 -0.061632
0.314415 -0.122184 0.005316
0.304001 -0.130492 0.012861
0.295776 -0.125596 -0.066669
0.296113 -0.130453 -0.046164
0.336239 -0.126932 0.028662
0.352899 -0.121276 0.010094
0.314909 -0.129536 -0.071766
0.303937 -0.129761 -0.071532
0.345744 -0.126716 0.005333
0.369168 -0.122713 -0.011291
0.352887 -0.121108 0.002451
0.314617 -0.125058 0.032137
0.369171 -0.122755 -0.013313
0.369132 -0.122202 -0.014776
0.360869 -0.120910 0.003303
0.314515 -0.123853 -0.088066
0.345350 -0.121078 -0.029949
0.284716 -0.128361 -0.031514
0.324885 -0.124402 0.034951
0.303476 -0.123033 -0.053616
0.369150 -0.122453 -0.010725
0.366974 -0.120283 -0.011007
0.284645 -0.127238 0.004168
0.284773 -0.129096 0.004168
0.324775 -0.122818 0.029430
0.367266 -0.124552 -0.025186
0.353209 -0.125894 -0.041082
0.325205 -0.129115 0.006269
0.369158 -0.122574 -0.014619
0.345611 -0.125006 -0.088388
0.314825 -0.128351 -0.088066
0.360969 -0.122336 0.013874
0.361130 -0.124692 0.007601
0.336265 -0.127548 -0.074167
0.284632 -0.127057 0.002644
0.284801 -0.129557 -0.017620
0.288889 -0.128618 -0.052409
0.361017 -0.123223 -0.063116
0.352882 -0.121165 -0.051698
0.352943 -0.122109 -0.074181
0.314436 -0.122464 0.014628
0.314436 -0.122667 -0.071766
0.303458 -0.122716 -0.028009
0.288703 -0.125852 -0.028693
0.288779 -0.126871 0.012331
0.296091 -0.130143 -0.054471
0.336306 -0.127957 0.006108
0.314938 -0.129925 -0.060668
0.325080 -0.127531 -0.093593
0.345509 -0.123244 0.030923
0.325206 -0.129251 -0.050461
0.303479 -0.122938 0.004639
0.336314 -0.128099 -0.006829
0.369171 -0.122757 -0.011996
0.303825 -0.127899 0.028318
0.353163 -0.125085 0.020224
0.367279 -0.124724 -0.017508
0.295740 -0.125070 -0.061350
0.324786 -0.123259 -0.093593
0.288762 -0.126757 -0.049865
0.345402 -0.121707 0.021011
0.367144 -0.122794 -0.034371
0.369115 -0.121941 -0.011996
0.369115 -0.121944 -0.013313
0.360905 -0.121418 0.010757
0.336142 -0.125515 0.034039
0.296134 -0.130706 -0.024457
0.360884 -0.121129 0.007601
0.288959 -0.129599 -0.041310
0.284614 -0.126857 -0.021393
0.314761 -0.127145 0.032137
0.284650 -0.127396 -0.029383
0.353215 -0.125942 -0.027895
0.369123 -0.122058 -0.014389
0.314871 -0.129008 -0.080960
0.353135 -0.124672 0.023054
0.335830 -0.121177 -0.049138
0.303500 -0.123218 0.012861
0.296063 -0.129564 0.019427
0.345714 -0.126242 0.021011
0.324740 -0.122317 0.023841
0.360887 -0.121312 -0.054415
0.325188 -0.129026 -0.064294
0.353059 -0.123799 -0.080174
0.295712 -0.124647 -0.054471
0.367167 -0.123052 -0.000619
0.345361 -0.121299 -0.057623
0.367251 -0.124343 -0.028123
0.361082 -0.124147 -0.058706
0.284609 -0.126776 -0.017620
0.369171 -0.122763 -0.012792
0.303774 -0.127422 -0.084252
0.361107 -0.124509 -0.054415
0.345432 -0.122401 -0.083764
0.345729 -0.126650 -0.057623
0.345381 -0.121429 0.014218
0.284635 -0.127171 -0.027311
0.314464 -0.122862 0.021747
0.345402 -0.121940 -0.076985
0.284668 -0.127662 -0.030796
0.325214 -0.129327 -0.033276
0.295930 -0.127849 -0.072134
0.345709 -0.126379 -0.068214
0.345732 -0.126520 0.014218
0.360974 -0.122598 -0.063116
0.369166 -0.122693 -0.014091
0.325086 -0.127315 0.033116
0.303528 -0.123616 0.019147
0.296061 -0.129720 -0.061350
0.296091 -0.129986 0.015517
0.335835 -0.121157 -0.006829
0.288813 -0.127359 0.013232
0.314956 -0.130161 -0.047733
0.369169 -0.122731 -0.013732
0.314708 -0.126669 -0.095369
0.336291 -0.127719 0.015806
0.361159 -0.125187 -0.024649
0.288982 -0.129911 -0.028693
0.367229 -0.123952 -0.001986
0.336232 -0.127098 -0.083741
0.303892 -0.128877 0.026804
0.303462 -0.122796 -0.042196
0.367039 -0.121274 -0.032438
0.367177 -0.123284 -0.033721
0.361085 -0.124022 0.012839
0.360847 -0.120677 -0.034352
0.314411 -0.122279 -0.060668
0.314828 -0.128123 0.030420
0.345750 -0.126833 -0.006519
0.295692 -0.124337 -0.046164
0.335892 -0.122157 -0.083741
0.367231 -0.124058 -0.030557
0.325022 -0.126385 0.034951
0.366996 -0.120633 -0.028123
0.352975 -0.122575 -0.078158
0.336020 -0.123740 0.034039
0.353185 -0.125402 0.015936
0.360854 -0.120808 -0.042163
0.361128 -0.124799 -0.048864
0.345428 -0.122076 0.025997
0.367203 -0.123581 -0.001073
0.335974 -0.123376 -0.096188
0.325124 -0.128155 -0.085994
0.369118 -0.121986 -0.011291
0.295764 -0.125225 0.019427
0.288885 -0.128403 0.013232
0.345366 -0.121233 0.005333
0.369136 -0.122245 -0.010725
0.284738 -0.128672 -0.030796
0.335828 -0.121110 -0.032403
0.336199 -0.126346 0.032252
0.353200 -0.125640 0.010094
0.369139 -0.122292 -0.014856
0.288788 -0.127146 -0.052409
0.361110 -0.124401 0.010757
0.284661 -0.127474 0.005174
0.295695 -0.124261 0.003219
0.295802 -0.125778 0.022008
0.288737 -0.126262 0.007778
0.314964 -0.130240 -0.031663
0.345610 -0.124705 0.030923
0.361159 -0.125156 -0.009821
0.295818 -0.126217 -0.070296
0.353095 -0.124084 0.024461
0.361154 -0.125064 -0.002320
0.345512 -0.123578 -0.090732
0.303633 -0.125382 -0.082084
0.369121 -0.122025 -0.011061
0.353210 -0.125808 0.002451
0.335889 -0.121874 0.023220
0.352872 -0.120975 -0.027895
0.369146 -0.122406 -0.014856
0.345743 -0.126817 -0.045281
0.296025 -0.129012 0.022008
0.284684 -0.127809 0.005674
0.360931 -0.121798 0.012839
0.360857 -0.120756 -0.002320
0.303613 -0.124832 0.026804
0.296112 -0.130304 0.010188
0.369162 -0.122621 -0.010891
0.367273 -0.124604 -0.007719
0.345356 -0.121116 -0.006519
0.325189 -0.128850 0.016227
0.288919 -0.128893 0.012331
0.353216 -0.125909 -0.007742
0.284623 -0.126990 -0.024630
0.295971 -0.128230 0.023292
0.367027 -0.121024 -0.001986
0.325161 -0.128658 -0.076164
0.288740 -0.126429 -0.046135
0.288819 -0.127598 -0.053699
0.314549 -0.124079 0.030420
0.303536 -0.123949 -0.071531
0.352939 -0.121830 0.020224
0.345351 -0.121133 -0.045281
0.361154 -0.125142 -0.034352
0.324713 -0.121939 0.016227
0.353198 -0.125752 -0.051698
0.345469 -0.122944 -0.088388
0.367068 -0.121693 -0.033721
0.284690 -0.127973 -0.031514
0.361052 -0.123721 -0.061632
0.324674 -0.121538 -0.050461
0.361144 -0.125013 -0.042163
0.295856 -0.126560 0.023292
0.360850 -0.120664 -0.009821
0.314567 -0.124629 -0.092911
0.345689 -0.125873 0.025997
0.367263 -0.124452 -0.005253
0.324672 -0.121463 -0.033276
0.345462 -0.122559 0.029287
0.314911 -0.129341 0.021747
0.288960 -0.129501 0.007778
0.367053 -0.121396 -0.001073
0.324895 -0.124856 -0.101402
0.369116 -0.121957 -0.011593
0.324969 -0.125933 -0.101402
0.284756 -0.128937 -0.029383
0.360911 -0.121673 -0.058706
0.324836 -0.123996 -0.098775
0.336289 -0.127877 -0.062609
0.284795 -0.129476 -0.021393
0.303974 -0.130094 0.019147
0.369157 -0.122551 -0.010779
0.352878 -0.121009 -0.007742
0.367101 -0.122182 -0.034371
0.314394 -0.121962 -0.031663
3 28 289 21
3 289 270 21
3 270 138 21
3 270 137 138
3 137 47 138
3 137 149 47
3 149 204 47
3 204 150 47
3 204 184 150
3 184 336 150
3 184 300 336
3 300 77 336
3 300 211 77
3 211 64 77
3 211 186 64
3 186 332 64
3 186 214 332
3 214 263 332
3 214 315 263
3 315 132 263
3 150 1 47
3 150 2 1
3 150 106 2
3 106 181 2
3 181 111 2
3 181 82 111
3 82 51 111
3 82 3 51
3 82 274 3
3 274 215 3
3 215 53 3
3 53 167 3
3 53 107 167
3 107 243 167
3 107 187 243
3 187 299 243
3 149 72 204
3 72 271 204
3 271 0 204
3 271 101 0
3 271 166 101
3 166 157 101
3 166 115 157
3 115 4 157
3 4 341 157
3 4 324 341
3 4 264 324
3 4 225 264
3 225 131 264
3 225 296 131
3 115 36 4
3 296 339 131
3 72 92 271
3 149 273 72
3 150 232 106
3 258 282 262
3 262 282 96
3 262 135 95
3 135 294 95
3 45 262 96
3 258 177 330
3 294 135 338
3 95 13 258
3 258 13 177
3 30 228 42
3 95 124 13
3 262 95 258
3 177 13 168
3 108 177 168
3 205 178 108
3 205 127 178
3 108 168 205
3 178 127 228
3 102 56 97
3 56 228 220
3 188 42 102
3 30 178 228
3 42 56 102
3 97 56 143
3 128 286 267
3 56 42 228
3 128 102 97
3 128 97 286
3 171 205 22
3 22 168 295
3 295 13 323
3 323 124 100
3 100 95 233
3 233 294 255
3 255 338 200
3 200 135 74
3 74 262 328
3 328 45 302
3 302 96 52
3 52 282 76
3 76 258 5
3 5 330 136
3 136 177 59
3 59 108 19
3 19 178 99
3 99 30 248
3 248 42 89
3 89 188 237
3 237 102 314
3 314 128 340
3 340 267 176
3 176 286 238
3 238 97 20
3 20 143 246
3 246 56 202
3 202 220 140
3 140 228 16
3 16 127 171
3 231 171 276
3 276 22 279
3 279 295 8
3 8 323 147
3 147 100 269
3 269 233 239
3 239 255 112
3 112 200 146
3 146 74 290
3 290 328 179
3 179 302 182
3 182 52 129
3 129 76 291
3 291 5 320
3 320 136 58
3 58 59 240
3 240 19 252
3 252 99 23
3 23 248 196
3 196 89 333
3 333 237 114
3 114 314 219
3 219 340 152
3 152 176 316
3 316 238 203
3 203 20 207
3 207 246 253
3 253 202 318
3 318 140 310
3 310 16 231
3 187 231 299
3 299 276 283
3 283 279 266
3 266 8 251
3 251 147 170
3 170 269 190
3 190 239 278
3 278 112 32
3 32 146 79
3 79 290 308
3 308 179 40
3 40 182 120
3 120 129 125
3 125 291 339
3 339 320 285
3 285 58 98
3 98 240 153
3 153 252 46
3 46 23 70
3 70 196 154
3 154 333 249
3 249 114 78
3 78 219 198
3 198 152 105
3 105 316 24
3 24 203 17
3 17 207 18
3 18 253 312
3 312 318 141
3 141 310 187
3 243 299 123
3 123 283 218
3 218 266 194
3 194 251 322
3 322 170 49
3 49 190 275
3 275 278 164
3 164 32 325
3 325 79 254
3 254 308 175
3 175 40 210
3 210 120 261
3 261 125 296
3 131 285 309
3 309 98 201
3 201 153 69
3 69 46 213
3 213 70 208
3 208 154 313
3 313 249 280
3 280 78 68
3 68 198 144
3 144 105 113
3 113 24 37
3 37 17 217
3 217 18 209
3 209 312 287
3 287 141 107
3 167 243 161
3 161 123 230
3 230 218 11
3 11 194 119
3 119 322 265
3 265 49 180
3 180 275 250
3 250 164 86
3 86 325 84
3 84 254 284
3 284 175 94
3 94 210 91
3 91 261 225
3 264 131 191
3 191 309 43
3 43 201 93
3 93 69 245
3 245 213 110
3 110 208 256
3 256 313 104
3 104 280 87
3 87 68 41
3 41 144 66
3 66 113 234
3 234 37 148
3 148 217 335
3 335 209 90
3 90 287 53
3 3 167 142
3 142 161 297
3 297 230 63
3 63 11 12
3 12 119 221
3 221 265 247
3 247 180 133
3 133 250 81
3 81 86 139
3 139 84 195
3 195 284 311
3 311 94 36
3 36 91 4
3 324 264 317
3 317 191 25
3 25 43 85
3 85 93 50
3 50 245 173
3 173 110 334
3 334 256 329
3 329 104 331
3 331 87 103
3 103 41 163
3 163 66 257
3 257 234 303
3 303 148 197
3 197 335 165
3 165 90 215
3 51 142 75
3 75 297 326
3 326 63 31
3 31 12 242
3 242 221 185
3 185 247 126
3 126 133 306
3 306 81 38
3 38 139 212
3 212 195 155
3 155 311 115
3 341 324 57
3 57 317 241
3 241 25 156
3 156 85 29
3 29 50 130
3 130 173 321
3 321 334 48
3 48 329 229
3 229 331 65
3 65 103 145
3 145 163 189
3 189 257 121
3 121 303 162
3 162 197 227
3 227 165 274
3 111 51 116
3 116 75 337
3 337 326 34
3 34 31 235
3 235 242 169
3 169 185 109
3 109 126 292
3 292 306 39
3 39 38 222
3 222 212 192
3 192 155 166
3 157 341 236
3 236 57 134
3 134 241 60
3 60 156 307
3 307 29 67
3 67 130 281
3 281 321 10
3 10 48 206
3 206 229 27
3 27 65 88
3 88 145 122
3 122 189 15
3 15 121 44
3 44 162 73
3 73 227 82
3 2 111 293
3 293 116 224
3 224 337 193
3 193 34 288
3 288 235 301
3 301 169 319
3 319 109 272
3 272 292 259
3 259 39 54
3 54 222 92
3 92 192 271
3 101 157 83
3 83 236 244
3 244 134 199
3 199 60 172
3 172 307 117
3 117 67 277
3 277 281 62
3 62 10 216
3 216 206 71
3 71 27 61
3 61 88 223
3 223 122 160
3 160 15 118
3 118 44 6
3 6 73 181
3 1 293 327
3 327 224 7
3 7 193 298
3 298 288 260
3 260 301 226
3 226 319 159
3 159 272 14
3 14 259 273
3 273 54 72
3 0 101 158
3 158 83 80
3 80 244 26
3 26 199 304
3 304 172 174
3 174 117 268
3 268 277 305
3 305 62 55
3 55 216 151
3 151 71 9
3 9 61 35
3 35 223 183
3 183 160 33
3 33 118 232
3 232 6 106
3 47 327 138
3 138 7 21
3 21 298 28
3 28 260 289
3 289 226 270
3 270 159 137
3 137 14 149
3 204 158 184
3 184 80 300
3 300 26 211
3 211 304 186
3 186 174 214
3 214 268 315
3 315 305 132
3 132 55 263
3 263 151 332
3 332 9 64
3 64 35 77
3 77 183 336
3 336 33 150
3 205 168 22
3 168 13 295
3 13 124 323
3 124 95 100
3 95 294 233
3 294 338 255
3 338 135 200
3 135 262 74
3 262 45 328
3 45 96 302
3 96 282 52
3 282 258 76
3 258 330 5
3 330 177 136
3 177 108 59
3 108 178 19
3 178 30 99
3 30 42 248
3 42 188 89
3 188 102 237
3 102 128 314
3 128 267 340
3 267 286 176
3 286 97 238
3 97 143 20
3 143 56 246
3 56 220 202
3 220 228 140
3 228 127 16
3 127 205 171
3 171 22 276
3 22 295 279
3 295 323 8
3 323 100 147
3 100 233 269
3 233 255 239
3 255 200 112
3 200 74 146
3 74 328 290
3 328 302 179
3 302 52 182
3 52 76 129
3 76 5 291
3 5 136 320
3 136 59 58
3 59 19 240
3 19 99 252
3 99 248 23
3 248 89 196
3 89 237 333
3 237 314 114
3 314 340 219
3 340 176 152
3 176 238 316
3 238 20 203
3 20 246 207
3 246 202 253
3 202 140 318
3 140 16 310
3 16 171 231
3 231 276 299
3 276 279 283
3 279 8 266
3 8 147 251
3 147 269 170
3 269 239 190
3 239 112 278
3 112 146 32
3 146 290 79
3 290 179 308
3 179 182 40
3 182 129 120
3 129 291 125
3 291 320 339
3 320 58 285
3 58 240 98
3 240 252 153
3 252 23 46
3 23 196 70
3 196 333 154
3 333 114 249
3 114 219 78
3 219 152 198
3 152 316 105
3 316 203 24
3 203 207 17
3 207 253 18
3 253 318 312
3 318 310 141
3 310 231 187
3 299 283 123
3 283 266 218
3 266 251 194
3 251 170 322
3 170 190 49
3 190 278 275
3 278 32 164
3 32 79 325
3 79 308 254
3 308 40 175
3 40 120 210
3 120 125 261
3 125 339 296
3 339 285 131
3 285 98 309
3 98 153 201
3 153 46 69
3 46 70 213
3 70 154 208
3 154 249 313
3 249 78 280
3 78 198 68
3 198 105 144
3 105 24 113
3 24 17 37
3 17 18 217
3 18 312 209
3 312 141 287
3 141 187 107
3 243 123 161
3 123 218 230
3 218 194 11
3 194 322 119
3 322 49 265
3 49 275 180
3 275 164 250
3 164 325 86
3 325 254 84
3 254 175 284
3 175 210 94
3 210 261 91
3 261 296 225
3 131 309 191
3 309 201 43
3 201 69 93
3 69 213 245
3 213 208 110
3 208 313 256
3 313 280 104
3 280 68 87
3 68 144 41
3 144 113 66
3 113 37 234
3 37 217 148
3 217 209 335
3 209 287 90
3 287 107 53
3 167 161 142
3 161 230 297
3 230 11 63
3 11 119 12
3 119 265 221
3 265 180 247
3 180 250 133
3 250 86 81
3 86 84 139
3 84 284 195
3 284 94 311
3 94 91 36
3 91 225 4
3 264 191 317
3 191 43 25
3 43 93 85
3 93 245 50
3 245 110 173
3 110 256 334
3 256 104 329
3 104 87 331
3 87 41 103
3 41 66 163
3 66 234 257
3 234 148 303
3 148 335 197
3 335 90 165
3 90 53 215
3 3 142 51
3 142 297 75
3 297 63 326
3 63 12 31
3 12 221 242
3 221 247 185
3 247 133 126
3 133 81 306
3 81 139 38
3 139 195 212
3 195 311 155
3 311 36 115
3 324 317 57
3 317 25 241
3 25 85 156
3 85 50 29
3 50 173 130
3 173 334 321
3 334 329 48
3 329 331 229
3 331 103 65
3 103 163 145
3 163 257 189
3 257 303 121
3 303 197 162
3 197 165 227
3 165 215 274
3 51 75 116
3 75 326 337
3 326 31 34
3 31 242 235
3 242 185 169
3 185 126 109
3 126 306 292
3 306 38 39
3 38 212 222
3 212 155 192
3 155 115 166
3 341 57 236
3 57 241 134
3 241 156 60
3 156 29 307
3 29 130 67
3 130 321 281
3 321 48 10
3 48 229 206
3 229 65 27
3 65 145 88
3 145 189 122
3 189 121 15
3 121 162 44
3 162 227 73
3 227 274 82
3 111 116 293
3 116 337 224
3 337 34 193
3 34 235 288
3 235 169 301
3 169 109 319
3 109 292 272
3 292 39 259
3 39 222 54
3 222 192 92
3 192 166 271
3 157 236 83
3 236 134 244
3 134 60 199
3 60 307 172
3 307 67 117
3 67 281 277
3 281 10 62
3 10 206 216
3 206 27 71
3 27 88 61
3 88 122 223
3 122 15 160
3 15 44 118
3 44 73 6
3 73 82 181
3 2 293 1
3 293 224 327
3 224 193 7
3 193 288 298
3 288 301 260
3 301 319 226
3 319 272 159
3 272 259 14
3 259 54 273
3 54 92 72
3 101 83 158
3 83 244 80
3 244 199 26
3 199 172 304
3 172 117 174
3 117 277 268
3 277 62 305
3 62 216 55
3 216 71 151
3 71 61 9
3 61 223 35
3 223 160 183
3 160 118 33
3 118 6 232
3 6 181 106
3 1 327 47
3 327 7 138
3 7 298 21
3 298 260 28
3 260 226 289
3 226 159 270
3 159 14 137
3 14 273 149
3 0 158 204
3 158 80 184
3 80 26 300
3 26 304 211
3 304 174 186
3 174 268 214
3 268 305 315
3 305 55 132
3 55 151 263
3 151 9 332
3 9 35 64
3 35 183 77
3 183 33 336
3 33 232 150
