OFF
1413 1453 0
-0.1647480524 -0.0453042927 -0.0110671389
0.2877158565 -0.0440907335 -0.0110639093
-0.2885047022 -0.0456362220 -0.0110680222
0.1639592066 -0.0444226628 -0.0110647927
-0.2679143786 -0.0321734788 -0.0110969521
-0.1854102961 -0.0319521936 -0.0110963632
0.1845495303 -0.0309599196 -0.0110937225
0.2670536128 -0.0307386344 -0.0110931337
-0.1447841557 0.0914855900 -0.0182203088
-0.1447842708 0.0915048581 -0.0093356636
0.1432619328 0.0922581621 -0.0182182528
0.1432618177 0.0922774302 -0.0093336076
-0.1449081273 0.1376956337 -0.0138781825
0.1431379613 0.1384682058 -0.0138761265
-0.1447223162 0.0684050387 -0.0091078304
-0.1447221965 0.0683850000 -0.0183478404
0.1433237724 0.0691776108 -0.0091057744
0.1433238921 0.0691575720 -0.0183457844
-0.1448462163 0.1146031361 -0.0102742262
-0.1448461243 0.1145877217 -0.0173819424
0.1431998722 0.1153757082 -0.0102721703
0.1431999643 0.1153602937 -0.0173798864
0.4996923375 -0.1332192035 -0.0132822999
-0.5000000000 -0.1359004910 -0.0132894354
-0.0009655088 0.1680485469 -0.0066035168
-0.0009653187 0.1680167168 -0.0212805970
-0.0009399435 0.1585126939 -0.0050639261
-0.0009397141 0.1584742757 -0.0227788120
-0.0011431847 0.2342969283 -0.0079702963
-0.0011430262 0.2342704030 -0.0202012842
0.0005093504 -0.2091914498 -0.0122454288
0.0005093426 -0.2091901405 -0.0116417191
0.0007061299 -0.2091905817 -0.0120885281
0.0000463359 -0.2091928361 -0.0123120432
0.0000463247 -0.2091909716 -0.0114523067
-0.0006134640 -0.2091941210 -0.0120885375
-0.0004166804 -0.2091939335 -0.0122454354
-0.0004166882 -0.2091926242 -0.0116417257
0.4997384040 -0.1504116684 -0.0068917736
0.4997385686 -0.1504392245 -0.0195980895
-0.4999539335 -0.1530929559 -0.0068989091
-0.4999537689 -0.1531205121 -0.0196052250
-0.0012564126 0.2471034071 -0.0141464260
-0.0012564220 0.2471049793 -0.0134214903
-0.0010648951 0.2471043295 -0.0139579561
-0.0011774885 0.2471034456 -0.0142262957
-0.0011775019 0.2471056841 -0.0131940858
-0.0012900889 0.2471037255 -0.0139579577
-0.0010985665 0.2471038305 -0.0141464249
-0.0010985759 0.2471054027 -0.0134214892
0.0064299113 0.0955775784 -0.0137848807
0.0064297248 0.0956088129 0.0006175469
-0.0022116397 0.0955544008 -0.0137849423
-0.0022118263 0.0955856353 0.0006174852
-0.1621519199 -0.0520005623 -0.0110525831
0.2903119890 -0.0507870031 -0.0110493535
-0.2910648776 -0.0523463214 -0.0110535032
0.1613990313 -0.0511327622 -0.0110502737
0.1694188609 0.0135613727 -0.0138086289
0.1086617699 0.0133984153 -0.0138090626
-0.1705186261 0.0126496220 -0.0138110553
-0.1097625874 0.0128125766 -0.0138106216
-0.0011252014 0.2275931960 -0.0084024650
-0.0011250545 0.2275686084 -0.0197399373
-0.1645862394 -0.1056350573 -0.0109362976
0.2878776694 -0.1044214981 -0.0109330681
-0.2883428893 -0.1059669866 -0.0109371810
0.1641210196 -0.1047534274 -0.0109339514
-0.0010721320 0.2078005986 -0.0060782287
-0.0010719260 0.2077661160 -0.0219784077
0.1137078234 0.0199931138 -0.0138232991
-0.1654725726 0.0192443205 -0.0138252918
0.1643375049 0.0201289083 -0.0138229378
-0.1148428911 0.0193801150 -0.0138249305
0.4997230357 -0.1446789013 -0.0079631500
0.4997231729 -0.1447018646 -0.0185516939
-0.4999693018 -0.1473601888 -0.0079702855
-0.4999691646 -0.1473831522 -0.0185588294
-0.2263212561 -0.1594286034 -0.0108204355
0.2261437051 -0.1582150414 -0.0108172059
0.4997847243 -0.1676466158 -0.0200901904
0.4997845459 -0.1676167634 -0.0063250412
-0.4999076132 -0.1703279033 -0.0200973259
-0.4999077915 -0.1702980509 -0.0063321767
-0.0008232615 0.1150322256 -0.0138271659
0.1061839318 -0.0063548806 -0.0137662558
-0.1729964642 -0.0071036739 -0.0137682485
0.1720026230 -0.0061783474 -0.0137657860
-0.1071777730 -0.0069271407 -0.0137677787
0.5000000000 -0.2479288940 -0.0130335253
-0.4996923375 -0.2506101816 -0.0130406608
-0.0008164152 0.1124551136 -0.0046098307
-0.0008161765 0.1124151588 -0.0230332363
0.4997076674 -0.1389461340 -0.0090344211
0.4997077771 -0.1389645048 -0.0175052984
-0.4999846700 -0.1416274215 -0.0090415566
-0.4999845603 -0.1416457923 -0.0175124339
-0.0011254313 0.2276744774 -0.0067328294
-0.0011252412 0.2276426473 -0.0214099097
0.4997539568 -0.1561759146 -0.0198504103
0.4997537854 -0.1561472103 -0.0066146778
-0.4999383806 -0.1588572022 -0.0198575458
-0.4999385521 -0.1588284979 -0.0066218133
-0.0010017049 0.1815408893 -0.0054681822
-0.0010014846 0.1815040078 -0.0224744432
-0.1448771856 0.1261516972 -0.0110100048
-0.1448771120 0.1261393656 -0.0166961567
0.1431689030 0.1269242693 -0.0110079488
0.1431689766 0.1269119377 -0.0166941007
-0.1448151365 0.1030360779 -0.0180676228
-0.1448152470 0.1030545753 -0.0095383424
0.1432309520 0.1038086500 -0.0180655668
0.1432308415 0.1038271474 -0.0095362864
-0.0004458043 -0.0257225206 -0.0050186834
-0.0004455840 -0.0257594020 -0.0220249445
-0.1401935660 0.0324765550 -0.0138536611
0.1389878823 0.0332253511 -0.0138516684
-0.0011786435 0.2475337672 -0.0141145262
-0.0011868947 0.2506101816 -0.0141211981
0.0343075176 0.1129483663 -0.0079056614
0.0238472974 0.1129674291 0.0138204468
0.0238476777 0.1129037567 -0.0155392910
-0.0008173211 0.1128305822 -0.0187764749
-0.0008178627 0.1129212548 0.0230332363
0.0063835565 0.1128606398 -0.0138223630
0.0063833699 0.1128918743 0.0005800646
-0.0254827841 0.1128351202 0.0138200946
-0.0254824038 0.1127714479 -0.0155396431
-0.0022579945 0.1128374622 -0.0138224247
-0.0022581811 0.1128686967 0.0005800029
-0.0359424414 0.1127599480 -0.0079061628
0.1074145500 0.0068128534 -0.0137947967
-0.1717658460 0.0060640601 -0.0137967894
0.1707013888 0.0069825959 -0.0137943449
-0.1084790072 0.0062338026 -0.0137963377
0.0000484378 -0.2099743552 -0.0131223138
-0.1442885602 -0.0933053622 -0.0133772033
0.1437575284 -0.0925327902 -0.0133751473
-0.1445363329 -0.0009137915 -0.0178421835
-0.1445364434 -0.0008952941 -0.0093129030
0.1435097557 -0.0001412195 -0.0178401275
0.1435096452 -0.0001227220 -0.0093108470
-0.2782090128 -0.0389053752 -0.0110824860
0.1742548960 -0.0376918160 -0.0110792565
-0.1750796990 -0.0386287707 -0.0110817499
0.2773842099 -0.0374152115 -0.0110785204
-0.1568991533 0.0956314047 0.0024388318
-0.1568988903 0.0955873857 -0.0178586310
-0.1347036150 0.0956467854 -0.0179186647
-0.1347039560 0.0957038708 0.0084037935
-0.1059187930 0.0957245603 -0.0176552767
-0.1634873916 0.0955701548 -0.0176556876
0.1109626209 0.0963498402 0.0024407437
0.1109628838 0.0963058212 -0.0178567191
-0.1125075519 0.0957504680 0.0024391486
-0.1125072890 0.0957064490 -0.0178583142
0.1619429812 0.0964429958 -0.0176533648
0.1043743825 0.0962885903 -0.0176537757
0.1331592114 0.0963652237 -0.0179167528
0.1331588704 0.0964223091 0.0084057054
0.1553542222 0.0964689035 0.0024410605
0.1553544851 0.0964248844 -0.0178564023
0.1695777414 -0.0456760467 -0.0136801589
0.1088206504 -0.0458390041 -0.0136805925
-0.1703597456 -0.0465877974 -0.0136825852
-0.1096037069 -0.0464248428 -0.0136821516
0.1625063441 -0.0790934353 -0.0107508510
-0.1342331117 -0.0798469412 0.0087896724
-0.1342328560 -0.0798897514 -0.0109503823
-0.1053564823 -0.0798118735 -0.0107527630
0.1113631384 -0.0792309371 -0.0109033800
0.1113629412 -0.0791979259 0.0043182702
-0.1564996880 -0.0799493754 -0.0109052919
-0.1564998852 -0.0799163642 0.0043163583
0.1558968013 -0.0791114928 -0.0109030621
0.1558966041 -0.0790784816 0.0043185881
-0.1119660251 -0.0798299311 -0.0109049740
-0.1119662223 -0.0797969199 0.0043166761
0.1047535916 -0.0792483346 -0.0107512633
0.1336297147 -0.0791285029 0.0087915844
0.1336299704 -0.0791713131 -0.0109484703
-0.1631092348 -0.0799667729 -0.0107531752
-0.0011074681 0.2210168807 -0.0217013426
-0.0011076661 0.2210500372 -0.0064126604
-0.2266808421 -0.0253596532 -0.0111111951
0.2257841191 -0.0241460912 -0.0111079655
-0.1595378088 -0.0654000163 -0.0110234899
0.2929261001 -0.0641864571 -0.0110202603
-0.2936070743 -0.0657596051 -0.0110244468
0.1588568346 -0.0645460459 -0.0110212172
-0.1398404998 -0.0991615702 -0.0135681733
0.1393409485 -0.0984127740 -0.0135661806
-0.0011609377 0.2409192739 -0.0092077629
-0.0011608109 0.2408980537 -0.0189925532
-0.0010634533 0.2045670951 -0.0069353763
-0.0010632697 0.2045363606 -0.0211072430
0.1592571985 0.0266974990 -0.0138372488
-0.1199231975 0.0259487057 -0.0138392416
0.1187528219 0.0265888617 -0.0138375380
-0.1604275741 0.0258400684 -0.0138395307
0.4998768532 -0.2020314501 -0.0067798241
0.4998770178 -0.2020590062 -0.0194861400
-0.4998154842 -0.2047127376 -0.0067869596
-0.4998153196 -0.2047402937 -0.0194932755
0.2493384399 0.0267166369 -0.0063688508
0.2494023606 0.0028845743 -0.0064290264
0.3746396069 -0.0995734379 -0.0066044253
0.2493562070 0.0200919176 -0.0062016349
0.2495172456 -0.0399401736 -0.0098185210
0.3747586228 -0.1439345338 -0.0114260232
0.4373793114 -0.1959317139 -0.0122297742
0.3746970494 -0.1209858118 -0.0082991726
0.2494556722 -0.0169914516 -0.0066916704
0.1242758684 0.0640541867 -0.0082110189
0.3746662627 -0.1095114508 -0.0067357473
0.2495883693 -0.0664483342 -0.0134303456
0.2495268782 -0.0435133903 -0.0166566529
0.3747019480 -0.1227861983 -0.0180713965
0.1243825539 0.0242919457 -0.0136287557
0.3747941846 -0.1571886141 -0.0132319355
0.3747326936 -0.1342536702 -0.0164582428
0.4373970923 -0.2025587541 -0.0131327304
0.2494558496 -0.0170211447 -0.0203833685
0.2494097028 0.0001850505 -0.0206853937
0.3746664337 -0.1095400755 -0.0199347543
0.2493563991 0.0200597501 -0.0210342991
0.2493384399 0.0267166369 -0.0063688508
0.2494023606 0.0028845743 -0.0064290264
0.1241651143 0.1053425865 -0.0062536275
0.0615464911 0.1565715925 -0.0061659281
0.1242184259 0.0854665606 -0.0065162716
0.2494556722 -0.0169914516 -0.0066916704
0.3746396069 -0.0995734379 -0.0066044253
0.1242450817 0.0755285477 -0.0066475936
0.2495172456 -0.0399401736 -0.0098185210
0.1242758684 0.0640541867 -0.0082110189
0.0616551798 0.1160513668 -0.0074072678
0.1243469921 0.0375460260 -0.0118228435
0.2495883693 -0.0664483342 -0.0134303456
0.3747586228 -0.1439345338 -0.0114260232
0.1243825539 0.0242919457 -0.0136287557
0.2494558496 -0.0170211447 -0.0203833685
0.2495268782 -0.0435133903 -0.0166566529
0.1243518084 0.0357594176 -0.0152419094
0.3746664337 -0.1095400755 -0.0199347543
0.1242452655 0.0754977860 -0.0208319828
0.1243162941 0.0490055404 -0.0171052672
0.0616399734 0.1217572514 -0.0210562899
0.2493563991 0.0200597501 -0.0210342991
0.2494097028 0.0001850505 -0.0206853937
0.1242221921 0.0841008836 -0.0209829954
0.3745705617 -0.0737934329 -0.0205622447
0.1241422365 0.1139129330 -0.0215063534
0.1241955402 0.0940382334 -0.0211574480
0.0615351552 0.1608395245 -0.0217423805
0.2493232444 0.0324204830 -0.0207758765
-0.2505077288 0.0253759932 -0.0063724185
-0.2504438081 0.0015439305 -0.0064325941
-0.3751296462 -0.1015844035 -0.0066097769
-0.2504899618 0.0187512739 -0.0062052027
-0.2503289231 -0.0412808173 -0.0098220888
-0.3750106303 -0.1459454994 -0.0114313748
-0.4373514839 -0.1982778405 -0.0122360178
-0.3750722037 -0.1229967775 -0.0083045242
-0.2503904965 -0.0183320953 -0.0066952382
-0.1256472160 0.0633838648 -0.0082128028
-0.3751029904 -0.1115224165 -0.0067410989
-0.2502577995 -0.0677889780 -0.0134339133
-0.2503192905 -0.0448540341 -0.0166602207
-0.3750673051 -0.1247971639 -0.0180767481
-0.1255405305 0.0236216238 -0.0136305396
-0.3749750685 -0.1591995798 -0.0132372871
-0.3750365595 -0.1362646359 -0.0164635944
-0.4373337030 -0.2049048807 -0.0131389740
-0.2503903191 -0.0183617885 -0.0203869363
-0.2504364659 -0.0011555933 -0.0206889615
-0.3751028194 -0.1115510411 -0.0199401059
-0.2504897696 0.0187191063 -0.0210378668
-0.2505077288 0.0253759932 -0.0063724185
-0.2504438081 0.0015439305 -0.0064325941
-0.1257579701 0.1046722646 -0.0062554114
-0.0634150510 0.1562364316 -0.0061668200
-0.1257046585 0.0847962387 -0.0065180555
-0.2503904965 -0.0183320953 -0.0066952382
-0.3751296462 -0.1015844035 -0.0066097769
-0.1256780026 0.0748582258 -0.0066493775
-0.2503289231 -0.0412808173 -0.0098220888
-0.1256472160 0.0633838648 -0.0082128028
-0.0633063624 0.1157162059 -0.0074081598
-0.1255760923 0.0368757041 -0.0118246273
-0.2502577995 -0.0677889780 -0.0134339133
-0.3750106303 -0.1459454994 -0.0114313748
-0.1255405305 0.0236216238 -0.0136305396
-0.2503903191 -0.0183617885 -0.0203869363
-0.2503192905 -0.0448540341 -0.0166602207
-0.1255712760 0.0350890957 -0.0152436933
-0.3751028194 -0.1115510411 -0.0199401059
-0.1256778189 0.0748274642 -0.0208337667
-0.1256067903 0.0483352186 -0.0171070511
-0.0633215688 0.1214220905 -0.0210571818
-0.2504897696 0.0187191063 -0.0210378668
-0.2504364659 -0.0011555933 -0.0206889615
-0.1257008923 0.0834305618 -0.0209847793
-0.3751986914 -0.0758043985 -0.0205675964
-0.1257808478 0.1132426111 -0.0215081373
-0.1257275441 0.0933679116 -0.0211592319
-0.0634263869 0.1605043636 -0.0217432725
-0.2505229243 0.0310798393 -0.0207794442
0.0713466150 0.0561661958 -0.0069603388
0.1074281301 0.0280217369 -0.0081355929
0.0712536786 0.0908163622 -0.0068578025
0.0716558621 -0.0591276554 -0.0091969154
0.1075827536 -0.0296251887 -0.0092538812
0.0715319205 -0.0129226213 -0.0071647652
0.0717790967 -0.1050577873 -0.0154812206
0.1076444262 -0.0525995034 -0.0166606740
0.0719029831 -0.1512535727 -0.0132487305
0.0714391541 0.0216990850 -0.0201853644
0.1073815231 0.0454283285 -0.0192655744
0.0715320859 -0.0129503107 -0.0199325360
0.0711919144 0.1138451524 -0.0070848503
0.0713466150 0.0561661958 -0.0069603388
-0.0006311097 0.0433662965 -0.0048142570
0.0354504054 0.0152218376 -0.0059895111
0.0352650999 0.0843106547 -0.0057850847
0.0715319205 -0.0129226213 -0.0071647652
0.1074281301 0.0280217369 -0.0081355929
0.0354504054 0.0152218376 -0.0059895111
0.0719029831 -0.1512535727 -0.0132487305
0.0716558621 -0.0591276554 -0.0091969154
0.0357285894 -0.0884880466 -0.0091337070
0.1078302558 -0.1218931814 -0.0133119389
-0.0001986832 -0.1178484379 -0.0090704986
0.0359757104 -0.1806139639 -0.0131855222
0.0357285894 -0.0884880466 -0.0091337070
0.0717790967 -0.1050577873 -0.0154812206
-0.0001985731 -0.1178668786 -0.0175736291
0.0356667564 -0.0654085947 -0.0187530826
0.0359137672 -0.1575160713 -0.0143017672
0.0715320859 -0.0129503107 -0.0199325360
0.1076444262 -0.0525995034 -0.0166606740
0.0356667564 -0.0654085947 -0.0187530826
0.0714391541 0.0216990850 -0.0201853644
-0.0006308802 0.0433278784 -0.0225290904
0.0353114888 0.0670571219 -0.0216093004
0.0354967851 -0.0020301585 -0.0211051545
0.0712538578 0.0907863654 -0.0206895103
0.1073815231 0.0454283285 -0.0192655744
0.0353114888 0.0670571219 -0.0216093004
0.0711611094 0.1253662189 -0.0204985324
-0.0726764293 0.0557799098 -0.0069613668
-0.1086064363 0.0274423078 -0.0081371349
-0.0727693657 0.0904300762 -0.0068588305
-0.0723671822 -0.0595139414 -0.0091979434
-0.1084518128 -0.0302046178 -0.0092554232
-0.0724911238 -0.0133089073 -0.0071657932
-0.0722439476 -0.1054440734 -0.0154822486
-0.1083901402 -0.0531789324 -0.0166622160
-0.0721200612 -0.1516398587 -0.0132497585
-0.0725838902 0.0213127990 -0.0201863924
-0.1086530433 0.0448488995 -0.0192671164
-0.0724909584 -0.0133365968 -0.0199335640
-0.0728311298 0.1134588663 -0.0070858783
-0.0726764293 0.0557799098 -0.0069613668
-0.0006311097 0.0433662965 -0.0048142570
-0.0365611168 0.0150286946 -0.0059900251
-0.0367464222 0.0841175117 -0.0057855987
-0.0724911238 -0.0133089073 -0.0071657932
-0.1086064363 0.0274423078 -0.0081371349
-0.0365611168 0.0150286946 -0.0059900251
-0.0721200612 -0.1516398587 -0.0132497585
-0.0723671822 -0.0595139414 -0.0091979434
-0.0362829327 -0.0886811897 -0.0091342210
-0.1082043107 -0.1224726105 -0.0133134809
-0.0001986832 -0.1178484379 -0.0090704986
-0.0360358117 -0.1808071070 -0.0131860362
-0.0362829327 -0.0886811897 -0.0091342210
-0.0722439476 -0.1054440734 -0.0154822486
-0.0001985731 -0.1178668786 -0.0175736291
-0.0363447658 -0.0656017377 -0.0187535966
-0.0360977549 -0.1577092143 -0.0143022812
-0.0724909584 -0.0133365968 -0.0199335640
-0.1083901402 -0.0531789324 -0.0166622160
-0.0363447658 -0.0656017377 -0.0187535966
-0.0725838902 0.0213127990 -0.0201863924
-0.0006308802 0.0433278784 -0.0225290904
-0.0367000333 0.0668639789 -0.0216098144
-0.0365147371 -0.0022233015 -0.0211056685
-0.0727691865 0.0904000794 -0.0206905383
-0.1086530433 0.0448488995 -0.0192671164
-0.0367000333 0.0668639789 -0.0216098144
-0.0728619349 0.1249799328 -0.0204995604
0.0121783200 -0.0481113557 0.0010893638
0.0119468110 -0.0481117713 0.0011840700
-0.0129497362 -0.0481787520 0.0010891845
-0.0130481240 -0.0481795004 0.0008657786
-0.0127180339 -0.0482106941 -0.0139258432
0.0121785141 -0.0481438465 -0.0138923599
0.2299401462 -0.0552999228 -0.0123494270
0.2287277054 -0.0750487724 -0.0123066135
0.1978607232 -0.1019455441 -0.0122486824
0.2274357052 -0.1166319069 -0.0115619097
0.1978607232 -0.1019455441 -0.0122486824
-0.2140916945 -0.1025642784 -0.0122526771
-0.2293513174 -0.0762773920 -0.0123098831
-0.2140916945 -0.1025642784 -0.0122526771
-0.2333017692 -0.0364316395 -0.0123963476
0.2492645120 0.0542938166 -0.0115744736
0.2492810490 0.0481201863 -0.0085854564
0.2492976097 0.0419426299 -0.0074310349
0.2493141770 0.0357636335 -0.0066737536
0.3745614929 -0.0704500632 -0.0063469460
0.2493230596 0.0324514134 -0.0065136691
0.4372582301 -0.1508024440 -0.0066921247
0.3745934533 -0.0823660945 -0.0063770338
0.1241651143 0.1053425865 -0.0062536275
0.3745703764 -0.0737624229 -0.0062633380
0.4686896557 -0.2219303040 -0.0126316498
0.4373177380 -0.1729829919 -0.0091029236
0.3121379342 -0.0919373537 -0.0106222721
0.4372869513 -0.1615086309 -0.0075394983
0.1868965570 0.0120570066 -0.0090147700
0.1242450817 0.0755285477 -0.0066475936
0.3120609675 -0.0632514512 -0.0067137089
0.3746970494 -0.1209858118 -0.0082991726
0.3747326936 -0.1342536702 -0.0164582428
0.3121144131 -0.0831497943 -0.0173640247
0.1243518084 0.0357594176 -0.0152419094
0.1869854616 -0.0210781943 -0.0135295507
0.4373048557 -0.1681563382 -0.0179721914
0.3121912769 -0.1118184742 -0.0133311405
0.4373356012 -0.1796238102 -0.0163590377
0.4686985462 -0.2252438241 -0.0130831278
0.3745972135 -0.0837307827 -0.0203877921
0.1242452655 0.0754977860 -0.0208319828
0.3746202869 -0.0923338803 -0.0202367795
0.4372717258 -0.1557995409 -0.0197104471
0.2493410154 0.0257951007 -0.0209144090
0.3745705617 -0.0737934329 -0.0205622447
0.2493232444 0.0324204830 -0.0207758765
0.2493066637 0.0386017114 -0.0205039996
0.2492900733 0.0447842692 -0.0193764891
0.2492734831 0.0509667745 -0.0182489258
0.2492645120 0.0542938166 -0.0115744736
0.2492810490 0.0481201863 -0.0085854564
0.2492976097 0.0419426299 -0.0074310349
0.2493141770 0.0357636335 -0.0066737536
0.1241153869 0.1238833371 -0.0063907556
0.2493562070 0.0200919176 -0.0062016349
0.0303448355 0.1420499569 -0.0070053923
0.0617263035 0.0895432061 -0.0110190924
0.1868965570 0.0120570066 -0.0090147700
0.0617618653 0.0762891258 -0.0128250047
0.3121379342 -0.0919373537 -0.0106222721
0.3747941846 -0.1571886141 -0.0132319355
0.1869854616 -0.0210781943 -0.0135295507
0.1243469921 0.0375460260 -0.0118228435
0.1243162941 0.0490055404 -0.0171052672
0.1869393433 -0.0038769863 -0.0159492812
0.3747019480 -0.1227861983 -0.0180713965
0.3120611417 -0.0632806101 -0.0201590614
0.0617465163 0.0820188830 -0.0154662165
0.1868505575 0.0292383207 -0.0206076756
0.0617110020 0.0952650058 -0.0173295743
0.0303373274 0.1448869841 -0.0211684435
0.2493410154 0.0257951007 -0.0209144090
0.1241078882 0.1267186819 -0.0212386095
0.2493066637 0.0386017114 -0.0205039996
0.2492900733 0.0447842692 -0.0193764891
0.2492734831 0.0509667745 -0.0182489258
0.2492568470 0.0571572819 -0.0136984130
-0.2505816568 0.0529531728 -0.0115780414
-0.2505651197 0.0467795425 -0.0085890242
-0.2505485591 0.0406019862 -0.0074346027
-0.2505319917 0.0344229898 -0.0066773214
-0.3752077602 -0.0724610289 -0.0063522976
-0.2505231091 0.0311107697 -0.0065172368
-0.4374725652 -0.1531485706 -0.0066983683
-0.3751757998 -0.0843770602 -0.0063823854
-0.1257579701 0.1046722646 -0.0062554114
-0.3751988766 -0.0757733885 -0.0062686897
-0.4685219107 -0.2244440110 -0.0126383393
-0.4374130573 -0.1753291185 -0.0091091672
-0.3126697767 -0.0936131584 -0.0106267318
-0.4374438439 -0.1638547575 -0.0075457419
-0.1879880695 0.0110515238 -0.0090174458
-0.1256780026 0.0748582258 -0.0066493775
-0.3127467434 -0.0649272559 -0.0067181686
-0.3750722037 -0.1229967775 -0.0083045242
-0.3750365595 -0.1362646359 -0.0164635944
-0.3126932978 -0.0848255990 -0.0173684844
-0.1255712760 0.0350890957 -0.0152436933
-0.1878991650 -0.0220836771 -0.0135322265
-0.4374259396 -0.1705024648 -0.0179784350
-0.3126164340 -0.1134942789 -0.0133356002
-0.4373951940 -0.1819699368 -0.0163652813
-0.4685130202 -0.2277575311 -0.0130898174
-0.3751720396 -0.0857417483 -0.0203931437
-0.1256778189 0.0748274642 -0.0208337667
-0.3751489662 -0.0943448459 -0.0202421311
-0.4374590695 -0.1581456674 -0.0197166907
-0.2505051533 0.0244544569 -0.0209179768
-0.3751986914 -0.0758043985 -0.0205675964
-0.2505229243 0.0310798393 -0.0207794442
-0.2505395050 0.0372610676 -0.0205075673
-0.2505560954 0.0434436254 -0.0193800568
-0.2505726856 0.0496261307 -0.0182524936
-0.2505816568 0.0529531728 -0.0115780414
-0.2505651197 0.0467795425 -0.0085890242
-0.2505485591 0.0406019862 -0.0074346027
-0.2505319917 0.0344229898 -0.0066773214
-0.1258076975 0.1232130152 -0.0063925394
-0.2504899618 0.0187512739 -0.0062052027
-0.0321359356 0.1418823764 -0.0070058383
-0.0632352387 0.0892080452 -0.0110199843
-0.1879880695 0.0110515238 -0.0090174458
-0.0631996769 0.0759539649 -0.0128258966
-0.3126697767 -0.0936131584 -0.0106267318
-0.3749750685 -0.1591995798 -0.0132372871
-0.1878991650 -0.0220836771 -0.0135322265
-0.1255760923 0.0368757041 -0.0118246273
-0.1256067903 0.0483352186 -0.0171070511
-0.1879452833 -0.0048824692 -0.0159519570
-0.3750673051 -0.1247971639 -0.0180767481
-0.3127465693 -0.0649564148 -0.0201635211
-0.0632150259 0.0816837221 -0.0154671085
-0.1880340690 0.0282328378 -0.0206103515
-0.0632505402 0.0949298449 -0.0173304663
-0.0321434437 0.1447194036 -0.0211688894
-0.2505051533 0.0244544569 -0.0209179768
-0.1258151962 0.1260483600 -0.0212403934
-0.2505395050 0.0372610676 -0.0205075673
-0.2505560954 0.0434436254 -0.0193800568
-0.2505726856 0.0496261307 -0.0182524936
-0.2505893217 0.0558166381 -0.0137019808
0.0711919144 0.1138451524 -0.0070848503
0.1077066953 -0.0758302228 -0.0112860313
0.1436335868 -0.0463277561 -0.0113429972
0.0356050289 -0.0424250880 -0.0071077994
0.1075827536 -0.0296251887 -0.0092538812
0.1436336421 -0.0463370048 -0.0156076374
0.1077683126 -0.0987952887 -0.0144281840
0.0359137672 -0.1575160713 -0.0143017672
0.1078302558 -0.1218931814 -0.0133119389
0.0712538578 0.0907863654 -0.0206895103
0.0709910041 0.1887672254 -0.0125645735
0.0710373354 0.1714844521 -0.0093373176
0.0710836941 0.1541971213 -0.0082358314
0.0711300564 0.1369091597 -0.0074008949
0.0351259854 0.1361789231 -0.0060743882
0.0712536786 0.0908163622 -0.0068578025
0.0717794226 -0.1051906140 -0.0112228229
0.0356050289 -0.0424250880 -0.0071077994
0.1077066953 -0.0758302228 -0.0112860313
0.0717794226 -0.1051906140 -0.0112228229
0.0358521499 -0.1345510053 -0.0111596146
-0.0000751227 -0.1639113965 -0.0110964062
-0.0003222437 -0.0717854792 -0.0070445910
0.0358521499 -0.1345510053 -0.0111596146
0.0357902618 -0.1114623330 -0.0165274249
-0.0003220785 -0.0718131403 -0.0197992868
-0.0000750677 -0.1639206169 -0.0153479715
0.0357902618 -0.1114623330 -0.0165274249
0.0716555913 -0.0590040490 -0.0177068783
0.1075209208 -0.0065457651 -0.0188863317
0.0355432510 -0.0193548564 -0.0209787402
0.0716555913 -0.0590040490 -0.0177068783
0.0712228782 0.1023366605 -0.0206257445
0.0351106977 0.1419202473 -0.0216386722
0.0711147337 0.1426563289 -0.0202700050
0.0710683473 0.1599483272 -0.0192435647
0.0710219610 0.1772402731 -0.0182170190
0.0709755333 0.1945391937 -0.0139986623
-0.0728311298 0.1134588663 -0.0070858783
-0.1083278712 -0.0764096518 -0.0112875733
-0.1444125018 -0.0471003282 -0.0113450532
-0.0364064932 -0.0426182310 -0.0071083134
-0.1084518128 -0.0302046178 -0.0092554232
-0.1444124465 -0.0471095769 -0.0156096934
-0.1082662539 -0.0993747178 -0.0144297259
-0.0360977549 -0.1577092143 -0.0143022812
-0.1082043107 -0.1224726105 -0.0133134809
-0.0727691865 0.0904000794 -0.0206905383
-0.0730320402 0.1883809394 -0.0125656015
-0.0729857089 0.1710981661 -0.0093383456
-0.0729393502 0.1538108352 -0.0082368594
-0.0728929879 0.1365228737 -0.0074019229
-0.0368855367 0.1359857801 -0.0060749022
-0.0727693657 0.0904300762 -0.0068588305
-0.0722436217 -0.1055769001 -0.0112238509
-0.0364064932 -0.0426182310 -0.0071083134
-0.1083278712 -0.0764096518 -0.0112875733
-0.0722436217 -0.1055769001 -0.0112238509
-0.0361593722 -0.1347441483 -0.0111601286
-0.0000751227 -0.1639113965 -0.0110964062
-0.0003222437 -0.0717854792 -0.0070445910
-0.0361593722 -0.1347441483 -0.0111601286
-0.0362212603 -0.1116554760 -0.0165279389
-0.0003220785 -0.0718131403 -0.0197992868
-0.0000750677 -0.1639206169 -0.0153479715
-0.0362212603 -0.1116554760 -0.0165279389
-0.0723674530 -0.0593903351 -0.0177079063
-0.1085136457 -0.0071251942 -0.0188878737
-0.0364682712 -0.0195479994 -0.0209792542
-0.0723674530 -0.0593903351 -0.0177079063
-0.0728001661 0.1019503744 -0.0206267725
-0.0369008245 0.1417271043 -0.0216391862
-0.0729083106 0.1422700429 -0.0202710330
-0.0729546970 0.1595620411 -0.0192445927
-0.0730010832 0.1768539870 -0.0182180470
-0.0730475110 0.1941529076 -0.0139996903
0.0113912011 0.1800358793 -0.0000687547
0.0113743607 0.1800364159 0.0001994788
-0.0133301430 0.1799704022 0.0003130044
-0.0133696031 0.1799700498 0.0001993022
-0.0133694082 0.1799374275 -0.0148430346
0.0113350946 0.1800036011 -0.0148827934
0.0174084301 -0.0481208871 -0.0097736902
0.0232429188 0.0324185053 -0.0034081488
0.0055644742 0.0324047418 0.0121086532
-0.0003857690 -0.0481348584 0.0057904648
-0.0006172755 -0.0481356847 0.0056957553
-0.0068837994 0.0323712514 0.0120612104
-0.0244952827 0.0322902238 -0.0035201921
-0.0182779527 -0.0482170865 -0.0099973501
-0.0181795609 -0.0482169928 -0.0100757991
-0.0067676775 0.0323099440 -0.0163511590
-0.0003854926 -0.0481811270 -0.0155442590
-0.0001539853 -0.0481804338 -0.0155109518
0.0056805965 0.0323433678 -0.0163344174
0.0175068238 -0.0481211077 -0.0099970947
0.1589197926 0.0086822571 -0.0066673884
0.1444919685 0.0086702003 0.0056163225
0.1222609058 0.0086121916 0.0063619878
0.1078581063 0.0085507528 -0.0041552598
0.1222964271 0.0085672540 -0.0144025947
0.1445280063 0.0086268654 -0.0144099074
0.1589197926 0.0086822571 -0.0066673884
0.1444919685 0.0086702003 0.0056163225
0.1222609058 0.0086121916 0.0063619878
0.1078581063 0.0085507528 -0.0041552598
0.1222964271 0.0085672540 -0.0144025947
0.1445280063 0.0086268654 -0.0144099074
-0.1089425076 0.0079638202 -0.0066693003
-0.1233703318 0.0079517634 0.0056144105
-0.1456019206 0.0078937533 0.0063600759
-0.1600041940 0.0078323159 -0.0041571717
-0.1455658732 0.0078488172 -0.0144045066
-0.1233348201 0.0079084272 -0.0144118194
-0.1089425076 0.0079638202 -0.0066693003
-0.1233703318 0.0079517634 0.0056144105
-0.1456019206 0.0078937533 0.0063600759
-0.1600041940 0.0078323159 -0.0041571717
-0.1455658732 0.0078488172 -0.0144045066
-0.1233348201 0.0079084272 -0.0144118194
0.1722684705 0.0012213853 -0.0124727517
0.2299401462 -0.0552999228 -0.0123494270
0.1837192323 -0.0738107954 -0.0129644206
0.1827423268 -0.1283139077 -0.0121916932
-0.1834372040 0.0035584509 -0.0124824281
-0.2573320727 -0.1326977950 -0.0108788082
-0.1830808779 -0.1292950868 -0.0121943044
-0.1679624815 -0.1029267231 -0.0122512935
-0.1769660971 -0.1008629243 -0.0129104252
-0.2293513174 -0.0762773920 -0.0123098831
0.3744860897 -0.0423261587 -0.0103044474
0.2492568470 0.0571572819 -0.0136984130
0.4685675417 -0.1764169470 -0.0067359744
0.4372120764 -0.1335951006 -0.0064647332
0.3120209838 -0.0483444318 -0.0065167258
0.4371889996 -0.1249914290 -0.0063510375
0.1867837375 0.0541135804 -0.0063413270
0.1241420375 0.1139462581 -0.0061399318
0.3119632917 -0.0268352526 -0.0062324865
0.3745934533 -0.0823660945 -0.0063770338
0.3746202869 -0.0923338803 -0.0202367795
0.3120034582 -0.0417728661 -0.0205365929
0.1242221921 0.0841008836 -0.0209829954
0.1868505575 0.0292383207 -0.0206076756
0.4372025056 -0.1299902480 -0.0201634849
0.3120611417 -0.0632806101 -0.0201590614
0.4372255790 -0.1385933456 -0.0200124723
0.4685743718 -0.1789292735 -0.0195982936
0.2492657633 0.0538394251 -0.0161374266
0.3744906301 -0.0439988652 -0.0178771121
0.1240429342 0.1509137919 -0.0128444999
0.2492733649 0.0509865700 -0.0091210920
0.1240600556 0.1445197301 -0.0088966097
0.2492899255 0.0448090135 -0.0079667231
0.1240772125 0.1381197791 -0.0077006656
0.2493064863 0.0386314045 -0.0068123015
0.0302371796 0.1821860956 -0.0061220784
0.0615998028 0.1366955667 -0.0064285722
0.1867837375 0.0541135804 -0.0063413270
0.0616264586 0.1267575538 -0.0065598942
0.3120209838 -0.0483444318 -0.0065167258
0.3746662627 -0.1095114508 -0.0067357473
0.1868503770 0.0292685481 -0.0066696320
0.1242184259 0.0854665606 -0.0065162716
0.1241955402 0.0940382334 -0.0211574480
0.1868159474 0.0421429671 -0.0208341946
0.3745972135 -0.0837307827 -0.0203877921
0.3119634804 -0.0268668414 -0.0207982719
0.0616151108 0.1310274751 -0.0212190225
0.1867493178 0.0669863416 -0.0212703262
0.0615884589 0.1409648249 -0.0213934752
0.0302316146 0.1843028202 -0.0218603941
0.2492989658 0.0414703913 -0.0199808018
0.1240735236 0.1395273361 -0.0197888866
0.2492823755 0.0476529491 -0.0188532913
0.1240563361 0.1459324141 -0.0186207395
0.2492657633 0.0538394251 -0.0161374266
0.1240391017 0.1523455245 -0.0139064696
-0.3752831634 -0.0443371243 -0.0103097990
-0.2505893217 0.0558166381 -0.0137019808
-0.4686440247 -0.1789306541 -0.0067426639
-0.4375187188 -0.1359412272 -0.0064709768
-0.3127867271 -0.0500202365 -0.0065211855
-0.4375417957 -0.1273375555 -0.0063572811
-0.1881008891 0.0531080976 -0.0063440028
-0.1257810469 0.1132759363 -0.0061417157
-0.3128444192 -0.0285110573 -0.0062369462
-0.3751757998 -0.0843770602 -0.0063823854
-0.3751489662 -0.0943448459 -0.0202421311
-0.3128042527 -0.0434486708 -0.0205410526
-0.1257008923 0.0834305618 -0.0209847793
-0.1880340690 0.0282328378 -0.0206103515
-0.4375282897 -0.1323363746 -0.0201697285
-0.3127465693 -0.0649564148 -0.0201635211
-0.4375052163 -0.1409394722 -0.0200187159
-0.4686371945 -0.1814429806 -0.0196049831
-0.2505804055 0.0524987813 -0.0161409943
-0.3752786230 -0.0460098308 -0.0178824637
-0.1258801501 0.1502434700 -0.0128462838
-0.2505728039 0.0496459262 -0.0091246598
-0.1258630287 0.1438494082 -0.0088983936
-0.2505562432 0.0434683697 -0.0079702909
-0.1258458719 0.1374494572 -0.0077024495
-0.2505396824 0.0372907608 -0.0068158693
-0.0322435915 0.1820185151 -0.0061225243
-0.0633617394 0.1363604058 -0.0064294641
-0.1881008891 0.0531080976 -0.0063440028
-0.0633350836 0.1264223928 -0.0065607861
-0.3127867271 -0.0500202365 -0.0065211855
-0.3751029904 -0.1115224165 -0.0067410989
-0.1880342496 0.0282630652 -0.0066723079
-0.1257046585 0.0847962387 -0.0065180555
-0.1257275441 0.0933679116 -0.0211592319
-0.1880686791 0.0411374842 -0.0208368704
-0.3751720396 -0.0857417483 -0.0203931437
-0.3128442305 -0.0285426461 -0.0208027316
-0.0633464314 0.1306923142 -0.0212199145
-0.1881353087 0.0659808587 -0.0212730020
-0.0633730832 0.1406296640 -0.0213943671
-0.0322491565 0.1841352398 -0.0218608401
-0.2505472029 0.0401297476 -0.0199843696
-0.1258495608 0.1388570142 -0.0197906705
-0.2505637933 0.0463123053 -0.0188568591
-0.1258667483 0.1452620922 -0.0186225234
-0.2505804055 0.0524987813 -0.0161409943
-0.1258839826 0.1516752026 -0.0139082535
0.0709910041 0.1887672254 -0.0125645735
0.1434167088 0.0345274444 -0.0092083107
0.1073351937 0.0626719033 -0.0080330566
0.0352650999 0.0843106547 -0.0057850847
0.1072887255 0.0799969865 -0.0079817885
0.1434168239 0.0345081763 -0.0180929559
0.1074744549 0.0107789328 -0.0190127460
0.0354967851 -0.0020301585 -0.0211051545
0.1074744549 0.0107789328 -0.0190127460
0.0710219610 0.1772402731 -0.0182170190
0.0349020547 0.2196887035 -0.0133428858
0.0710218508 0.1772587326 -0.0097052069
0.0353577527 0.0497662462 -0.0058872979
-0.0005384570 0.0088218880 -0.0049164702
-0.0007237624 0.0779107051 -0.0047120438
0.0353577527 0.0497662462 -0.0058872979
0.0714392677 0.0216217872 -0.0070625520
0.1075207828 -0.0065226717 -0.0082378061
0.0355430581 -0.0193225709 -0.0060917243
0.0714392677 0.0216217872 -0.0070625520
0.0354041369 0.0325134817 -0.0213572274
-0.0007235284 0.0778715186 -0.0227811633
-0.0005382321 0.0087842382 -0.0222770175
0.0354041369 0.0325134817 -0.0213572274
0.0713465060 0.0562427252 -0.0204374374
0.1072888750 0.0799719687 -0.0195176474
0.0352188407 0.1016007621 -0.0218613733
0.0713465060 0.0562427252 -0.0204374374
0.0710064534 0.1830184071 -0.0168080319
0.0348943193 0.2225746876 -0.0140599302
-0.0730320402 0.1883809394 -0.0125656015
-0.1446293798 0.0337548723 -0.0092103667
-0.1086993727 0.0620924742 -0.0080345986
-0.0367464222 0.0841175117 -0.0057855987
-0.1087458409 0.0794175575 -0.0079833305
-0.1446292647 0.0337356042 -0.0180950119
-0.1085601115 0.0101995037 -0.0190142879
-0.0365147371 -0.0022233015 -0.0211056685
-0.1085601115 0.0101995037 -0.0190142879
-0.0730010832 0.1768539870 -0.0182180470
-0.0371094675 0.2194955605 -0.0133433998
-0.0730011935 0.1768724466 -0.0097062349
-0.0366537695 0.0495731031 -0.0058878119
-0.0005384570 0.0088218880 -0.0049164702
-0.0007237624 0.0779107051 -0.0047120438
-0.0366537695 0.0495731031 -0.0058878119
-0.0725837765 0.0212355012 -0.0070635800
-0.1085137836 -0.0071021007 -0.0082393481
-0.0364684640 -0.0195157140 -0.0060922383
-0.0725837765 0.0212355012 -0.0070635800
-0.0366073852 0.0323203387 -0.0213577414
-0.0007235284 0.0778715186 -0.0227811633
-0.0005382321 0.0087842382 -0.0222770175
-0.0366073852 0.0323203387 -0.0213577414
-0.0726765383 0.0558564392 -0.0204384654
-0.1087456915 0.0793925397 -0.0195191894
-0.0367926815 0.1014076191 -0.0218618873
-0.0726765383 0.0558564392 -0.0204384654
-0.0730165909 0.1826321211 -0.0168090599
-0.0371172029 0.2223815446 -0.0140604442
-0.0009582193 0.1800133287 0.0048058735
0.0052782490 0.1464788353 0.0116163575
-0.0070740029 0.1464458285 0.0116731204
-0.0009976823 0.1800134695 0.0049195752
-0.0186162652 0.1799318368 -0.0109320603
0.0166044756 0.1800260984 -0.0110260431
0.0232429188 0.0324185053 -0.0034081488
0.0063438313 -0.1286507481 -0.0052761776
0.0235451081 0.0726929672 0.0052061490
0.0180128087 0.0324280367 0.0074549053
0.0178970542 0.0324278289 0.0075022584
0.0147058858 0.0726860854 0.0129645500
0.0059965679 -0.1286513714 -0.0051341184
0.0055644742 0.0324047418 0.0121086532
-0.0068837994 0.0323712514 0.0120612104
-0.0066832122 -0.1286856881 -0.0052762706
-0.0161832918 0.0726031858 0.0129406525
-0.0192162601 0.0323281841 0.0074546396
-0.0192654541 0.0323278099 0.0073429366
-0.0249890334 0.0725626720 0.0051499513
-0.0068307940 -0.1286868107 -0.0056113795
-0.0244952827 0.0322902238 -0.0035201921
-0.0270610012 0.0322714776 -0.0089909809
-0.0129495421 -0.0482112428 -0.0138925392
-0.0191002189 0.0322803769 -0.0147327431
-0.0161250406 0.0725406960 -0.0159454010
-0.0063358490 -0.1287017651 -0.0131189432
-0.0067676775 0.0323099440 -0.0163511590
0.0056805965 0.0323433678 -0.0163344174
0.0063439322 -0.1286676482 -0.0130688943
0.0147641371 0.0726235623 -0.0159368542
0.0180130959 0.0323799551 -0.0147158254
0.0122769038 -0.0481434125 -0.0138139095
0.0259071707 0.0324136293 -0.0089513780
0.1390608416 -0.0352291513 0.0072039534
0.1556254131 0.0086952109 0.0033798243
0.1279453103 -0.0352581556 0.0075767861
0.1333942926 0.0086469031 0.0085986449
0.1168297828 -0.0353318415 -0.0126529873
0.1111630111 0.0085374420 -0.0143800495
0.1502124038 -0.0352423137 -0.0126564848
0.1333945909 0.0085969553 -0.0144326115
0.1604313869 0.0525626264 -0.0121603766
0.1556254131 0.0086952109 0.0033798243
0.1499230953 0.0525695519 0.0040286915
0.1333942926 0.0086469031 0.0085986449
0.1166117634 0.0524810159 0.0044013658
0.1111627811 0.0085759571 0.0033795069
0.1061162444 0.0524196715 -0.0109045178
0.1045639871 0.0085201278 -0.0142025195
0.1277278193 0.0524662389 -0.0161596737
0.1333945909 0.0085969553 -0.0144326115
0.1388436089 0.0524960446 -0.0161633301
0.1556256432 0.0086566958 -0.0143797322
-0.1288017218 -0.0359475889 0.0072020415
-0.1122368871 0.0079767740 0.0033779124
-0.1399175162 -0.0359765939 0.0075748742
-0.1344685339 0.0079284648 0.0085967330
-0.1510327806 -0.0360502791 -0.0126548993
-0.1566992892 0.0078190052 -0.0143819615
-0.1176504226 -0.0359607520 -0.0126583967
-0.1344682355 0.0078785170 -0.0144345235
-0.1074306503 0.0518441902 -0.0121622885
-0.1122368871 0.0079767740 0.0033779124
-0.1179389419 0.0518511157 0.0040267796
-0.1344685339 0.0079284648 0.0085967330
-0.1512505369 0.0517625790 0.0043994538
-0.1566995192 0.0078575203 0.0033775950
-0.1617457928 0.0517012354 -0.0109064297
-0.1632983132 0.0078016909 -0.0142044314
-0.1401347441 0.0517478013 -0.0161615857
-0.1344682355 0.0078785170 -0.0144345235
-0.1290192176 0.0517776063 -0.0161652420
-0.1122366571 0.0079382589 -0.0143816441
0.2030207475 0.0012433584 -0.0124724010
0.2589089078 -0.0798607104 -0.0116412476
0.2324643616 -0.0351824022 -0.0123930231
0.2274357052 -0.1166319069 -0.0115619097
0.1991527234 -0.0603624096 -0.0129933862
0.2570106872 -0.1313182697 -0.0108751370
0.2583026874 -0.0897351352 -0.0116198408
0.1364708350 -0.0752962157 -0.0123072720
0.2009713846 -0.0307391351 -0.0130576065
0.2287277054 -0.0750487724 -0.0123066135
0.1325203832 -0.0354504633 -0.0123937365
0.1722684705 0.0012213853 -0.0124727517
-0.1358820062 -0.0562810990 -0.0123520382
-0.2202064753 -0.1309964409 -0.0115365563
-0.2512172919 -0.1042656325 -0.0115949291
-0.1769660971 -0.1008629243 -0.0129104252
-0.2202064753 -0.1309964409 -0.0115365563
-0.2319834100 -0.0561737013 -0.0123535160
-0.2588471034 -0.0911221893 -0.0116235320
-0.1358820062 -0.0562810990 -0.0123520382
-0.1551001227 -0.0728746838 -0.0136253793
-0.1922257201 -0.0745760379 -0.0129676312
-0.2512172919 -0.1042656325 -0.0115949291
-0.1922257201 -0.0745760379 -0.0129676312
-0.2319834100 -0.0561737013 -0.0123535160
-0.2031491167 -0.0217676567 -0.0130822981
0.3745020423 -0.0482793575 -0.0082743032
0.2492733649 0.0509865700 -0.0091210920
0.3745180068 -0.0542345192 -0.0071614043
0.2492899255 0.0448090135 -0.0079667231
0.3745339812 -0.0601917884 -0.0066442157
0.2493064863 0.0386314045 -0.0068123015
0.4371730194 -0.1190334133 -0.0063359936
0.3745461126 -0.0647152867 -0.0064917643
0.1241153869 0.1238833371 -0.0063907556
0.3745384225 -0.0618478985 -0.0065641734
0.4999384266 -0.2249801721 -0.0099066747
0.4686280823 -0.1989815820 -0.0095047992
0.4060689671 -0.1699331239 -0.0118278987
0.4685972956 -0.1875072210 -0.0079413739
0.3434482785 -0.1179359437 -0.0110241476
0.3121071475 -0.0804629927 -0.0090588468
0.4059920004 -0.1412472214 -0.0079193355
0.4373177380 -0.1729829919 -0.0091029236
0.2182069013 -0.0139415835 -0.0094166455
0.1868657703 0.0235313676 -0.0074513447
0.0616551798 0.1160513668 -0.0074072678
0.1868503770 0.0292685481 -0.0066696320
0.2807583199 -0.0401214514 -0.0067026897
0.3120917542 -0.0747258122 -0.0082771342
0.4372715580 -0.1557714505 -0.0067577857
0.3121071475 -0.0804629927 -0.0090588468
0.3121605314 -0.1003510022 -0.0149442942
0.4372894829 -0.1624226023 -0.0187787682
0.3121451586 -0.0946172663 -0.0157508710
0.2808206456 -0.0633315923 -0.0170103388
0.1869393433 -0.0038769863 -0.0159492812
0.0617796462 0.0696620856 -0.0137279608
0.1869547160 -0.0096107223 -0.0151427043
0.2182869154 -0.0437632643 -0.0134799481
0.4373356012 -0.1796238102 -0.0163590377
0.4060187746 -0.1512050042 -0.0172152171
0.3121605314 -0.1003510022 -0.0149442942
0.3434927308 -0.1345035442 -0.0132815380
0.4686063095 -0.1908414082 -0.0179225889
0.4060956385 -0.1798736841 -0.0131823329
0.4686370551 -0.2023088802 -0.0163094352
0.4999385089 -0.2249939501 -0.0162598327
0.3745474861 -0.0651904070 -0.0203824097
0.1241422365 0.1139129330 -0.0215063534
0.3745551780 -0.0680580823 -0.0204423547
0.4371776430 -0.1207200243 -0.0203262176
0.2493155503 0.0352888281 -0.0206497160
0.3745386006 -0.0618777158 -0.0203131434
0.2492989658 0.0414703913 -0.0199808018
0.3745226161 -0.0559187566 -0.0200510445
0.2492823755 0.0476529491 -0.0188532913
0.3745066231 -0.0499587977 -0.0189640915
0.1240943728 0.1317190555 -0.0067032915
0.2493230596 0.0324514134 -0.0065136691
0.0615038604 0.1724666871 -0.0064017080
0.1241331539 0.1172586178 -0.0062235397
0.3745614929 -0.0704500632 -0.0063469460
0.1241420375 0.1139462581 -0.0061399318
-0.0008943851 0.1415403863 -0.0102153413
0.0304159592 0.1155417962 -0.0106172169
0.0929655241 0.0900527768 -0.0078091434
0.0304515210 0.1022877159 -0.0124231291
0.1555862127 0.0380555966 -0.0086128944
0.1869321188 -0.0011970738 -0.0108206823
0.0930544287 0.0569175759 -0.0123239241
0.0617263035 0.0895432061 -0.0110190924
0.2808275899 -0.0659387636 -0.0102203966
0.3121734960 -0.1051914340 -0.0124281844
0.4373793114 -0.1959317139 -0.0122297742
0.3121912769 -0.1118184742 -0.0133311405
0.2182869154 -0.0437632643 -0.0134799481
0.1869498997 -0.0078241139 -0.0117236384
0.0617796462 0.0696620856 -0.0137279608
0.1869321188 -0.0011970738 -0.0108206823
0.1868860718 0.0159921979 -0.0187443179
0.0617642734 0.0753958216 -0.0145345376
0.1869038290 0.0093691365 -0.0178126390
0.2182331107 -0.0236951883 -0.0163029671
0.3121144131 -0.0831497943 -0.0173640247
0.4372717258 -0.1557995409 -0.0197104471
0.3120966560 -0.0765267329 -0.0182957036
0.2807584956 -0.0401508774 -0.0202712150
0.0617110020 0.0952650058 -0.0173295743
0.0930314052 0.0655122117 -0.0162857419
0.1868860718 0.0159921979 -0.0187443179
0.1555479115 0.0523680534 -0.0207198292
0.0304438703 0.1051486157 -0.0155783701
0.0929426194 0.0986275187 -0.0209441363
0.0304083560 0.1183947385 -0.0174417279
-0.0008942901 0.1415244712 -0.0175538814
0.1241345447 0.1167806083 -0.0214464084
0.3745386006 -0.0618777158 -0.0203131434
0.1241256592 0.1200932995 -0.0213771421
0.0615002100 0.1738677813 -0.0214699761
0.2493155503 0.0352888281 -0.0206497160
0.1240907112 0.1331221793 -0.0209569546
-0.3752672107 -0.0502903231 -0.0082796548
-0.2505728039 0.0496459262 -0.0091246598
-0.3752512463 -0.0562454849 -0.0071667559
-0.2505562432 0.0434683697 -0.0079702909
-0.3752352719 -0.0622027540 -0.0066495673
-0.2505396824 0.0372907608 -0.0068158693
-0.4375577759 -0.1213795399 -0.0063422371
-0.3752231405 -0.0667262524 -0.0064971159
-0.1258076975 0.1232130152 -0.0063925394
-0.3752308306 -0.0638588641 -0.0065695250
-0.4997539108 -0.2276614596 -0.0099138102
-0.4685834840 -0.2014952890 -0.0095114887
-0.4061810571 -0.1721116700 -0.0118336963
-0.4686142707 -0.1900209281 -0.0079480634
-0.3438402035 -0.1197793289 -0.0110290533
-0.3127005634 -0.0821387974 -0.0090633065
-0.4062580238 -0.1434257675 -0.0079251331
-0.4374130573 -0.1753291185 -0.0091091672
-0.2191584963 -0.0151146468 -0.0094197673
-0.1880188562 0.0225258847 -0.0074540205
-0.0633063624 0.1157162059 -0.0074081598
-0.1880342496 0.0282630652 -0.0066723079
-0.2815686200 -0.0416296756 -0.0067067034
-0.3127159567 -0.0764016169 -0.0082815939
-0.4374592373 -0.1581175770 -0.0067640293
-0.3127005634 -0.0821387974 -0.0090633065
-0.3126471795 -0.1020268069 -0.0149487539
-0.4374413123 -0.1647687288 -0.0187850118
-0.3126625523 -0.0962930710 -0.0157553307
-0.2815062942 -0.0648398165 -0.0170143525
-0.1879452833 -0.0048824692 -0.0159519570
-0.0631818960 0.0693269247 -0.0137288527
-0.1879299105 -0.0106162051 -0.0151453801
-0.2190784822 -0.0449363275 -0.0134830699
-0.4373951940 -0.1819699368 -0.0163652813
-0.4062312496 -0.1533835503 -0.0172210147
-0.3126471795 -0.1020268069 -0.0149487539
-0.3437957512 -0.1363469293 -0.0132864437
-0.4686052568 -0.1933551153 -0.0179292784
-0.4061543857 -0.1820522302 -0.0131881305
-0.4685745113 -0.2048225872 -0.0163161247
-0.4997538285 -0.2276752377 -0.0162669682
-0.3752217670 -0.0672013726 -0.0203877613
-0.1257808478 0.1132426111 -0.0215081373
-0.3752140751 -0.0700690479 -0.0204477063
-0.4375531523 -0.1230661509 -0.0203324612
-0.2505306185 0.0339481843 -0.0206532838
-0.3752306525 -0.0638886814 -0.0203184950
-0.2505472029 0.0401297476 -0.0199843696
-0.3752466370 -0.0579297222 -0.0200563962
-0.2505637933 0.0463123053 -0.0188568591
-0.3752626300 -0.0519697634 -0.0189694431
-0.1258287115 0.1310487336 -0.0067050754
-0.2505231091 0.0311107697 -0.0065172368
-0.0634576818 0.1721315262 -0.0064025999
-0.1257899304 0.1165882959 -0.0062253236
-0.3752077602 -0.0724610289 -0.0063522976
-0.1257810469 0.1132759363 -0.0061417157
-0.0008943851 0.1415403863 -0.0102153413
-0.0320648119 0.1153742157 -0.0106176628
-0.0944767892 0.0895500353 -0.0078104813
-0.0320292501 0.1021201354 -0.0124235751
-0.1568176427 0.0372176943 -0.0086151243
-0.1879525077 -0.0022025566 -0.0108233581
-0.0943878846 0.0564148345 -0.0123252620
-0.0632352387 0.0892080452 -0.0110199843
-0.2814993499 -0.0674469878 -0.0102244103
-0.3126342149 -0.1068672387 -0.0124326441
-0.4373514839 -0.1982778405 -0.0122360178
-0.3126164340 -0.1134942789 -0.0133356002
-0.2190784822 -0.0449363275 -0.0134830699
-0.1879347268 -0.0088295968 -0.0117263142
-0.0631818960 0.0693269247 -0.0137288527
-0.1879525077 -0.0022025566 -0.0108233581
-0.1879985547 0.0149867150 -0.0187469937
-0.0631972687 0.0750606607 -0.0145354296
-0.1879807976 0.0083636536 -0.0178153148
-0.2191322869 -0.0248682516 -0.0163060888
-0.3126932978 -0.0848255990 -0.0173684844
-0.4374590695 -0.1581456674 -0.0197166907
-0.3127110550 -0.0782025376 -0.0183001633
-0.2815684442 -0.0416591016 -0.0202752287
-0.0632505402 0.0949298449 -0.0173304663
-0.0944109081 0.0650094703 -0.0162870798
-0.1879985547 0.0149867150 -0.0187469937
-0.1568559440 0.0515301510 -0.0207220591
-0.0320369008 0.1049810352 -0.0155788161
-0.0944996938 0.0981247773 -0.0209454743
-0.0320724151 0.1182271580 -0.0174421739
-0.0008942901 0.1415244712 -0.0175538814
-0.1257885397 0.1161102864 -0.0214481922
-0.3752306525 -0.0638886814 -0.0203184950
-0.1257974252 0.1194229776 -0.0213789260
-0.0634613321 0.1735326203 -0.0214708680
-0.2505306185 0.0339481843 -0.0206532838
-0.1258323731 0.1324518574 -0.0209587385
0.0710373354 0.1714844521 -0.0093373176
0.0710836941 0.1541971213 -0.0082358314
0.0711300564 0.1369091597 -0.0074008949
0.1072578434 0.0915113816 -0.0080953124
0.0711609371 0.1253950620 -0.0071987668
0.1253759513 0.0485996738 -0.0086206837
0.1254688876 0.0139495074 -0.0087232200
0.0893873726 0.0420939663 -0.0075479659
0.1253759513 0.0485996738 -0.0086206837
0.0533058575 0.0702384252 -0.0063727118
0.0352186317 0.1016357379 -0.0057338166
0.0893176703 0.0680815912 -0.0074710637
0.1073351937 0.0626719033 -0.0080330566
0.1256701410 -0.0610789894 -0.0113145142
0.0896193079 -0.0443764220 -0.0092253983
0.1255461994 -0.0148739554 -0.0092823641
0.1256701410 -0.0610789894 -0.0113145142
0.0535684747 -0.0276738546 -0.0071362823
0.0355430581 -0.0193225709 -0.0060917243
0.1075207828 -0.0065226717 -0.0082378061
0.0896193079 -0.0443764220 -0.0092253983
0.1257009773 -0.0725661468 -0.0150179107
0.1255770909 -0.0263703614 -0.0172504008
0.0897117615 -0.0788286454 -0.0160709473
0.1257009773 -0.0725661468 -0.0150179107
0.0538464320 -0.1312869293 -0.0148914939
0.0359757104 -0.1806139639 -0.0131855222
0.0898666194 -0.1365733771 -0.0132803347
0.1077683126 -0.0987952887 -0.0144281840
0.1254456394 0.0226435545 -0.0185528509
0.1253527076 0.0572929503 -0.0188056794
0.0894103386 0.0335637068 -0.0197254694
0.1254456394 0.0226435545 -0.0185528509
0.0534679696 0.0098344633 -0.0206452595
0.0355432510 -0.0193548564 -0.0209787402
0.1075209208 -0.0065457651 -0.0188863317
0.0895032704 -0.0010856890 -0.0194726410
0.0712228782 0.1023366605 -0.0206257445
0.1072888750 0.0799719687 -0.0195176474
0.0711611094 0.1253662189 -0.0204985324
0.0711147337 0.1426563289 -0.0202700050
0.0710683473 0.1599483272 -0.0192435647
0.0349560670 0.1995388240 -0.0088698913
0.0710682095 0.1599714017 -0.0086037733
0.0350101204 0.1793821082 -0.0075856038
0.0711145683 0.1426840183 -0.0075022343
0.0350641758 0.1592250245 -0.0064345385
0.0711609371 0.1253950620 -0.0071987668
-0.0008781794 0.1354839038 -0.0048368784
0.0351877496 0.1131501330 -0.0058473405
0.1072578434 0.0915113816 -0.0080953124
0.0352186317 0.1016357379 -0.0057338166
0.0174096478 0.0292940671 -0.0054018841
0.0533985102 0.0356940167 -0.0064749250
0.0175023006 -0.0052503415 -0.0055040973
0.0174096478 0.0292940671 -0.0054018841
0.0173169951 0.0638384756 -0.0052996709
0.0172243424 0.0983828842 -0.0051974577
0.0533058575 0.0702384252 -0.0063727118
0.0173169951 0.0638384756 -0.0052996709
0.0894800253 0.0075495578 -0.0076501791
0.0893873726 0.0420939663 -0.0075479659
0.1254688876 0.0139495074 -0.0087232200
0.0894800253 0.0075495578 -0.0076501791
0.0534911629 0.0011496081 -0.0065771382
0.0175023006 -0.0052503415 -0.0055040973
0.0533985102 0.0356940167 -0.0064749250
0.0534911629 0.0011496081 -0.0065771382
0.0536922258 -0.0738078510 -0.0091653112
0.0538157863 -0.1198708097 -0.0111912188
0.0176413926 -0.0571052836 -0.0070761952
0.0536922258 -0.0738078510 -0.0091653112
0.0897430589 -0.0905104184 -0.0112544271
0.1257938921 -0.1072129858 -0.0133435431
0.0898666194 -0.1365733771 -0.0132803347
0.0897430589 -0.0905104184 -0.0112544271
0.0178885136 -0.1492312009 -0.0111280104
0.0539393468 -0.1659337683 -0.0132171263
0.0180120741 -0.1952941596 -0.0131539180
0.0178885136 -0.1492312009 -0.0111280104
0.0177649531 -0.1031682423 -0.0091021028
0.0176413926 -0.0571052836 -0.0070761952
0.0538157863 -0.1198708097 -0.0111912188
0.0177649531 -0.1031682423 -0.0091021028
0.0177340916 -0.0916377366 -0.0181633559
0.0537229266 -0.0852331910 -0.0171171516
0.0176105862 -0.0455839983 -0.0203890135
0.0177340916 -0.0916377366 -0.0181633559
0.0178575971 -0.1376914749 -0.0159376982
0.0179811025 -0.1837452132 -0.0137120405
0.0538464320 -0.1312869293 -0.0148914939
0.0178575971 -0.1376914749 -0.0159376982
0.0895882560 -0.0327749071 -0.0182966050
0.0897117615 -0.0788286454 -0.0160709473
0.1255770909 -0.0263703614 -0.0172504008
0.0895882560 -0.0327749071 -0.0182966050
0.0535994211 -0.0391794527 -0.0193428093
0.0176105862 -0.0455839983 -0.0203890135
0.0537229266 -0.0852331910 -0.0171171516
0.0535994211 -0.0391794527 -0.0193428093
0.0173403043 0.0551925002 -0.0220691954
0.0533753214 0.0443781035 -0.0208973324
0.0172476561 0.0897361404 -0.0223212683
0.0173403043 0.0551925002 -0.0220691954
0.0174329524 0.0206488600 -0.0218171224
0.0175256006 -0.0138947803 -0.0215650495
0.0534679696 0.0098344633 -0.0206452595
0.0174329524 0.0206488600 -0.0218171224
0.0893176905 0.0681073470 -0.0199775424
0.0894103386 0.0335637068 -0.0197254694
0.1253527076 0.0572929503 -0.0188056794
0.0893176905 0.0681073470 -0.0199775424
0.0532826733 0.0789217437 -0.0211494054
0.0172476561 0.0897361404 -0.0223212683
0.0533753214 0.0443781035 -0.0208973324
0.0532826733 0.0789217437 -0.0211494054
0.0351724664 0.1188906889 -0.0217658843
0.1072115211 0.1088121905 -0.0193583926
0.0351724664 0.1188906889 -0.0217658843
0.0171472606 0.1271677031 -0.0223359543
0.0711456190 0.1311414628 -0.0204221894
0.0350566246 0.1620801684 -0.0213722241
0.0710992399 0.1484321508 -0.0199271648
0.0350025388 0.1822423439 -0.0201754038
0.0710528535 0.1657241492 -0.0189006718
0.0349484533 0.2024044408 -0.0189784781
-0.0729857089 0.1710981661 -0.0093383456
-0.0729393502 0.1538108352 -0.0082368594
-0.0728929879 0.1365228737 -0.0074019229
-0.1087767230 0.0909319525 -0.0080968543
-0.0728621072 0.1250087760 -0.0071997948
-0.1266643762 0.0479236733 -0.0086224827
-0.1265714399 0.0132735069 -0.0087250190
-0.0906414328 0.0416111088 -0.0075492509
-0.1266643762 0.0479236733 -0.0086224827
-0.0547114257 0.0699487107 -0.0063734828
-0.0367928904 0.1014425949 -0.0057343306
-0.0907111351 0.0675987336 -0.0074723487
-0.1086993727 0.0620924742 -0.0080345986
-0.1263701865 -0.0617549900 -0.0113163132
-0.0904094975 -0.0448592796 -0.0092266833
-0.1264941281 -0.0155499559 -0.0092841631
-0.1263701865 -0.0617549900 -0.0113163132
-0.0544488085 -0.0279635692 -0.0071370533
-0.0364684640 -0.0195157140 -0.0060922383
-0.1085137836 -0.0071021007 -0.0082393481
-0.0904094975 -0.0448592796 -0.0092266833
-0.1263393502 -0.0732421473 -0.0150197097
-0.1264632366 -0.0270463620 -0.0172521997
-0.0903170439 -0.0793115029 -0.0160722323
-0.1263393502 -0.0732421473 -0.0150197097
-0.0541708512 -0.1315766438 -0.0148922649
-0.0360358117 -0.1808071070 -0.0131860362
-0.0901621859 -0.1370562346 -0.0132816197
-0.1082662539 -0.0993747178 -0.0144297259
-0.1265946881 0.0219675540 -0.0185546499
-0.1266876199 0.0566169497 -0.0188074784
-0.0906184668 0.0330808492 -0.0197267544
-0.1265946881 0.0219675540 -0.0185546499
-0.0545493136 0.0095447487 -0.0206460305
-0.0364682712 -0.0195479994 -0.0209792542
-0.1085136457 -0.0071251942 -0.0188878737
-0.0905255350 -0.0015685465 -0.0194739260
-0.0728001661 0.1019503744 -0.0206267725
-0.1087456915 0.0793925397 -0.0195191894
-0.0728619349 0.1249799328 -0.0204995604
-0.0729083106 0.1422700429 -0.0202710330
-0.0729546970 0.1595620411 -0.0192445927
-0.0370554551 0.1993456810 -0.0088704053
-0.0729548348 0.1595851156 -0.0086048013
-0.0370014017 0.1791889652 -0.0075861178
-0.0729084760 0.1422977323 -0.0075032623
-0.0369473464 0.1590318815 -0.0064350525
-0.0728621072 0.1250087760 -0.0071997948
-0.0008781794 0.1354839038 -0.0048368784
-0.0368237725 0.1129569900 -0.0058478545
-0.1087767230 0.0909319525 -0.0080968543
-0.0367928904 0.1014425949 -0.0057343306
-0.0185961132 0.0291974956 -0.0054021411
-0.0546187730 0.0354043022 -0.0064756960
-0.0185034605 -0.0053469130 -0.0055043543
-0.0185961132 0.0291974956 -0.0054021411
-0.0186887660 0.0637419041 -0.0052999279
-0.0187814187 0.0982863127 -0.0051977147
-0.0547114257 0.0699487107 -0.0063734828
-0.0186887660 0.0637419041 -0.0052999279
-0.0905487801 0.0070667002 -0.0076514641
-0.0906414328 0.0416111088 -0.0075492509
-0.1265714399 0.0132735069 -0.0087250190
-0.0905487801 0.0070667002 -0.0076514641
-0.0545261203 0.0008598936 -0.0065779092
-0.0185034605 -0.0053469130 -0.0055043543
-0.0546187730 0.0354043022 -0.0064756960
-0.0545261203 0.0008598936 -0.0065779092
-0.0543250575 -0.0740975655 -0.0091660822
-0.0542014970 -0.1201605242 -0.0111919898
-0.0183643685 -0.0572018551 -0.0070764522
-0.0543250575 -0.0740975655 -0.0091660822
-0.0902857464 -0.0909932759 -0.0112557121
-0.1262464354 -0.1078889864 -0.0133453421
-0.0901621859 -0.1370562346 -0.0132816197
-0.0902857464 -0.0909932759 -0.0112557121
-0.0181172475 -0.1493277724 -0.0111282674
-0.0540779365 -0.1662234828 -0.0132178973
-0.0179936870 -0.1953907311 -0.0131541750
-0.0181172475 -0.1493277724 -0.0111282674
-0.0182408080 -0.1032648138 -0.0091023598
-0.0183643685 -0.0572018551 -0.0070764522
-0.0542014970 -0.1201605242 -0.0111919898
-0.0182408080 -0.1032648138 -0.0091023598
-0.0182716694 -0.0917343081 -0.0181636129
-0.0542943567 -0.0855229055 -0.0171179226
-0.0183951749 -0.0456805699 -0.0203892705
-0.0182716694 -0.0917343081 -0.0181636129
-0.0181481640 -0.1377880464 -0.0159379552
-0.0180246586 -0.1838417847 -0.0137122975
-0.0541708512 -0.1315766438 -0.0148922649
-0.0181481640 -0.1377880464 -0.0159379552
-0.0904405493 -0.0332577646 -0.0182978900
-0.0903170439 -0.0793115029 -0.0160722323
-0.1264632366 -0.0270463620 -0.0172521997
-0.0904405493 -0.0332577646 -0.0182978900
-0.0544178621 -0.0394691672 -0.0193435803
-0.0183951749 -0.0456805699 -0.0203892705
-0.0542943567 -0.0855229055 -0.0171179226
-0.0544178621 -0.0394691672 -0.0193435803
-0.0186654568 0.0550959287 -0.0220694524
-0.0546419618 0.0440883889 -0.0208981034
-0.0187581049 0.0896395689 -0.0223215253
-0.0186654568 0.0550959287 -0.0220694524
-0.0185728087 0.0205522884 -0.0218173794
-0.0184801605 -0.0139913518 -0.0215653065
-0.0545493136 0.0095447487 -0.0206460305
-0.0185728087 0.0205522884 -0.0218173794
-0.0907111149 0.0676244894 -0.0199788274
-0.0906184668 0.0330808492 -0.0197267544
-0.1266876199 0.0566169497 -0.0188074784
-0.0907111149 0.0676244894 -0.0199788274
-0.0547346099 0.0786320292 -0.0211501763
-0.0187581049 0.0896395689 -0.0223215253
-0.0546419618 0.0440883889 -0.0208981034
-0.0547346099 0.0786320292 -0.0211501763
-0.0368390557 0.1186975458 -0.0217663983
-0.1088230453 0.1082327614 -0.0193599346
-0.0368390557 0.1186975458 -0.0217663983
-0.0188585005 0.1270711315 -0.0223362113
-0.0728774253 0.1307551768 -0.0204232174
-0.0369548976 0.1618870253 -0.0213727381
-0.0729238044 0.1480458647 -0.0199281928
-0.0370089833 0.1820492009 -0.0201759178
-0.0729701908 0.1653378631 -0.0189016998
-0.0370630689 0.2022112977 -0.0189789921
0.0228493594 0.1464921228 -0.0039872080
0.0166213113 0.1800263479 -0.0109318087
-0.0185994317 0.1799324636 -0.0106638266
-0.0246560222 0.1463649989 -0.0038534303
-0.0010368669 0.1799669947 -0.0164614504
-0.0070933646 0.1463840048 -0.0168097547
0.0052588867 0.1464170917 -0.0168296341
-0.0009974048 0.1799670139 -0.0165013853
0.1574081984 -0.0351981123 -0.0011744002
0.1622246626 0.0086747803 -0.0142021079
0.1096105237 -0.0353235866 0.0000815052
0.1111627811 0.0085759571 0.0033795069
-0.1104543650 -0.0359165499 -0.0011763121
-0.1056376376 0.0079563434 -0.0142040199
-0.1582520396 -0.0360420242 0.0000795933
-0.1566995192 0.0078575203 0.0033775950
0.2318137444 -0.0286019306 -0.0124073026
0.2904018848 -0.0843039776 -0.0109766642
0.2614331232 -0.0597431899 -0.0116848437
0.2009713846 -0.0307391351 -0.0130576065
0.2626952308 -0.0496844297 -0.0117066417
0.2280817053 -0.0958403397 -0.0119342616
0.2120022141 -0.1300802927 -0.0115329442
0.1837192323 -0.0738107954 -0.0129644206
0.1985067233 -0.0811539768 -0.0126210343
0.2576566873 -0.1105267025 -0.0112474889
0.2267897051 -0.1374234742 -0.0111895578
0.2280817053 -0.0958403397 -0.0119342616
0.2576566873 -0.1105267025 -0.0112474889
0.1990262948 -0.0114623529 -0.0117903586
0.1516511761 -0.0021855290 -0.0124656302
0.2318137444 -0.0286019306 -0.0124073026
0.1544593450 -0.0720444104 -0.0136231697
0.1686008359 -0.1001791591 -0.0129074315
0.2120022141 -0.1300802927 -0.0115329442
0.1686008359 -0.1001791591 -0.0129074315
-0.1628019311 0.0002621807 -0.0124750121
-0.2050590231 -0.0109006011 -0.0117968116
-0.2614791959 -0.0710184985 -0.0116671650
-0.1998555315 -0.0614325947 -0.0129962342
-0.2614791959 -0.0710184985 -0.0116671650
-0.2762270888 -0.0784408972 -0.0113239894
-0.2333017692 -0.0364316395 -0.0123963476
-0.2141709763 -0.0031667052 -0.0124682414
-0.1526667468 -0.0030017439 -0.0124678024
-0.1387830942 -0.0746757830 -0.0129667226
-0.1830808779 -0.1292950868 -0.0121943044
-0.2314153618 -0.0231411306 -0.0124251463
3 22 665 93
3 407 665 22
3 407 666 117
3 22 666 407
3 93 921 74
3 408 921 93
3 408 922 192
3 93 922 408
3 74 923 38
3 409 923 74
3 409 924 28
3 74 924 409
3 38 925 100
3 410 925 38
3 410 926 97
3 38 926 410
3 100 927 81
3 411 927 100
3 411 928 204
3 100 928 411
3 412 929 204
3 183 929 412
3 204 930 412
3 100 930 204
3 81 667 200
3 413 667 81
3 413 668 206
3 81 668 413
3 414 669 206
3 205 669 414
3 206 670 414
3 81 670 206
3 207 671 205
3 415 671 207
3 415 672 68
3 207 672 415
3 205 673 207
3 416 673 205
3 416 674 81
3 205 674 416
3 417 931 200
3 89 931 417
3 417 932 210
3 200 932 417
3 418 933 210
3 209 933 418
3 210 934 418
3 200 934 210
3 211 935 209
3 419 935 211
3 419 936 208
3 211 936 419
3 209 937 211
3 420 937 209
3 420 938 200
3 209 938 420
3 212 939 208
3 421 939 212
3 421 940 213
3 212 940 421
3 422 941 213
3 24 941 422
3 213 942 422
3 212 942 213
3 208 943 212
3 423 943 208
3 423 944 214
3 208 944 423
3 424 945 214
3 200 945 424
3 214 946 424
3 208 946 214
3 217 947 215
3 425 947 217
3 425 948 201
3 217 948 425
3 426 949 215
3 217 949 426
3 215 950 426
3 216 950 215
3 218 951 216
3 427 951 218
3 427 952 84
3 218 952 427
3 428 953 216
3 218 953 428
3 216 954 428
3 215 954 216
3 429 955 219
3 201 955 429
3 219 956 429
3 220 956 219
3 430 957 220
3 215 957 430
3 220 958 430
3 219 958 220
3 221 959 201
3 431 959 221
3 431 960 219
3 221 960 431
3 432 961 201
3 221 961 432
3 432 962 89
3 201 962 432
3 433 675 222
3 80 675 433
3 222 676 433
3 223 676 222
3 434 677 223
3 25 677 434
3 223 678 434
3 222 678 223
3 224 679 80
3 435 679 224
3 435 680 222
3 224 680 435
3 436 681 80
3 224 681 436
3 80 682 436
3 201 682 80
3 225 963 99
3 437 963 225
3 437 964 69
3 225 964 437
3 438 965 99
3 225 965 438
3 99 966 438
3 80 966 99
3 439 967 39
3 182 967 439
3 39 968 439
3 99 968 39
3 440 969 75
3 98 969 440
3 75 970 440
3 39 970 75
3 441 971 94
3 29 971 441
3 94 972 441
3 75 972 94
3 442 683 22
3 193 683 442
3 22 684 442
3 94 684 22
3 192 685 117
3 443 685 192
3 443 686 93
3 192 686 443
3 28 687 192
3 444 687 28
3 444 688 74
3 28 688 444
3 97 689 28
3 445 689 97
3 445 690 38
3 97 690 445
3 183 973 97
3 446 973 183
3 446 974 100
3 183 974 446
3 68 975 183
3 447 975 68
3 447 976 226
3 68 976 447
3 448 977 226
3 81 977 448
3 226 978 448
3 68 978 226
3 24 691 68
3 229 691 24
3 229 692 228
3 24 692 229
3 230 693 228
3 227 693 230
3 228 694 230
3 24 694 228
3 231 695 227
3 232 695 231
3 232 696 200
3 231 696 232
3 227 697 231
3 233 697 227
3 233 698 24
3 227 698 233
3 449 979 84
3 24 979 449
3 449 980 236
3 84 980 449
3 450 981 236
3 235 981 450
3 236 982 450
3 84 982 236
3 237 983 235
3 451 983 237
3 451 984 234
3 237 984 451
3 235 985 237
3 452 985 235
3 452 986 84
3 235 986 452
3 238 987 234
3 453 987 238
3 453 988 239
3 238 988 453
3 454 989 239
3 89 989 454
3 239 990 454
3 238 990 239
3 234 991 238
3 455 991 234
3 455 992 240
3 234 992 455
3 456 993 240
3 84 993 456
3 240 994 456
3 234 994 240
3 243 995 241
3 457 995 243
3 457 996 84
3 243 996 457
3 458 997 241
3 243 997 458
3 241 998 458
3 242 998 241
3 244 999 242
3 459 999 244
3 459 1000 201
3 244 1000 459
3 460 1001 242
3 244 1001 460
3 242 1002 460
3 241 1002 242
3 461 1003 245
3 84 1003 461
3 245 1004 461
3 246 1004 245
3 462 1005 246
3 241 1005 462
3 246 1006 462
3 245 1006 246
3 247 1007 84
3 463 1007 247
3 463 1008 245
3 247 1008 463
3 464 1009 84
3 247 1009 464
3 464 1010 25
3 84 1010 464
3 250 699 248
3 25 699 250
3 248 700 250
3 249 700 248
3 251 701 249
3 80 701 251
3 249 702 251
3 248 702 249
3 252 703 25
3 253 703 252
3 253 704 248
3 252 704 253
3 254 705 25
3 252 705 254
3 25 706 254
3 69 706 25
3 255 1011 69
3 465 1011 255
3 465 1012 99
3 255 1012 465
3 466 1013 69
3 255 1013 466
3 69 1014 466
3 182 1014 69
3 467 1015 182
3 39 1015 467
3 182 1016 467
3 98 1016 182
3 468 707 98
3 75 707 468
3 98 708 468
3 29 708 98
3 469 709 29
3 94 709 469
3 29 710 469
3 193 710 29
3 470 711 193
3 22 711 470
3 193 712 470
3 117 712 193
3 23 713 95
3 471 713 23
3 471 714 117
3 23 714 471
3 95 1017 76
3 472 1017 95
3 472 1018 192
3 95 1018 472
3 76 1019 40
3 473 1019 76
3 473 1020 28
3 76 1020 473
3 40 1021 102
3 474 1021 40
3 474 1022 97
3 40 1022 474
3 102 1023 83
3 475 1023 102
3 475 1024 256
3 102 1024 475
3 476 1025 256
3 183 1025 476
3 256 1026 476
3 102 1026 256
3 83 715 202
3 477 715 83
3 477 716 258
3 83 716 477
3 478 717 258
3 257 717 478
3 258 718 478
3 83 718 258
3 259 719 257
3 479 719 259
3 479 720 68
3 259 720 479
3 257 721 259
3 480 721 257
3 480 722 83
3 257 722 480
3 481 1027 202
3 90 1027 481
3 481 1028 262
3 202 1028 481
3 482 1029 262
3 261 1029 482
3 262 1030 482
3 202 1030 262
3 263 1031 261
3 483 1031 263
3 483 1032 260
3 263 1032 483
3 261 1033 263
3 484 1033 261
3 484 1034 202
3 261 1034 484
3 264 1035 260
3 485 1035 264
3 485 1036 265
3 264 1036 485
3 486 1037 265
3 24 1037 486
3 265 1038 486
3 264 1038 265
3 260 1039 264
3 487 1039 260
3 487 1040 266
3 260 1040 487
3 488 1041 266
3 202 1041 488
3 266 1042 488
3 260 1042 266
3 269 1043 267
3 489 1043 269
3 489 1044 203
3 269 1044 489
3 490 1045 267
3 269 1045 490
3 267 1046 490
3 268 1046 267
3 270 1047 268
3 491 1047 270
3 491 1048 84
3 270 1048 491
3 492 1049 268
3 270 1049 492
3 268 1050 492
3 267 1050 268
3 493 1051 271
3 203 1051 493
3 271 1052 493
3 272 1052 271
3 494 1053 272
3 267 1053 494
3 272 1054 494
3 271 1054 272
3 273 1055 203
3 495 1055 273
3 495 1056 271
3 273 1056 495
3 496 1057 203
3 273 1057 496
3 496 1058 90
3 203 1058 496
3 497 723 274
3 82 723 497
3 274 724 497
3 275 724 274
3 498 725 275
3 25 725 498
3 275 726 498
3 274 726 275
3 276 727 82
3 499 727 276
3 499 728 274
3 276 728 499
3 500 729 82
3 276 729 500
3 82 730 500
3 203 730 82
3 277 1059 101
3 501 1059 277
3 501 1060 69
3 277 1060 501
3 502 1061 101
3 277 1061 502
3 101 1062 502
3 82 1062 101
3 503 1063 41
3 182 1063 503
3 41 1064 503
3 101 1064 41
3 504 1065 77
3 98 1065 504
3 77 1066 504
3 41 1066 77
3 505 1067 96
3 29 1067 505
3 96 1068 505
3 77 1068 96
3 506 731 23
3 193 731 506
3 23 732 506
3 96 732 23
3 192 733 117
3 507 733 192
3 507 734 95
3 192 734 507
3 28 735 192
3 508 735 28
3 508 736 76
3 28 736 508
3 97 737 28
3 509 737 97
3 509 738 40
3 97 738 509
3 183 1069 97
3 510 1069 183
3 510 1070 102
3 183 1070 510
3 68 1071 183
3 511 1071 68
3 511 1072 278
3 68 1072 511
3 512 1073 278
3 83 1073 512
3 278 1074 512
3 68 1074 278
3 24 739 68
3 281 739 24
3 281 740 280
3 24 740 281
3 282 741 280
3 279 741 282
3 280 742 282
3 24 742 280
3 283 743 279
3 284 743 283
3 284 744 202
3 283 744 284
3 279 745 283
3 285 745 279
3 285 746 24
3 279 746 285
3 513 1075 84
3 24 1075 513
3 513 1076 288
3 84 1076 513
3 514 1077 288
3 287 1077 514
3 288 1078 514
3 84 1078 288
3 289 1079 287
3 515 1079 289
3 515 1080 286
3 289 1080 515
3 287 1081 289
3 516 1081 287
3 516 1082 84
3 287 1082 516
3 290 1083 286
3 517 1083 290
3 517 1084 291
3 290 1084 517
3 518 1085 291
3 90 1085 518
3 291 1086 518
3 290 1086 291
3 286 1087 290
3 519 1087 286
3 519 1088 292
3 286 1088 519
3 520 1089 292
3 84 1089 520
3 292 1090 520
3 286 1090 292
3 295 1091 293
3 521 1091 295
3 521 1092 84
3 295 1092 521
3 522 1093 293
3 295 1093 522
3 293 1094 522
3 294 1094 293
3 296 1095 294
3 523 1095 296
3 523 1096 203
3 296 1096 523
3 524 1097 294
3 296 1097 524
3 294 1098 524
3 293 1098 294
3 525 1099 297
3 84 1099 525
3 297 1100 525
3 298 1100 297
3 526 1101 298
3 293 1101 526
3 298 1102 526
3 297 1102 298
3 299 1103 84
3 527 1103 299
3 527 1104 297
3 299 1104 527
3 528 1105 84
3 299 1105 528
3 528 1106 25
3 84 1106 528
3 302 747 300
3 25 747 302
3 300 748 302
3 301 748 300
3 303 749 301
3 82 749 303
3 301 750 303
3 300 750 301
3 304 751 25
3 305 751 304
3 305 752 300
3 304 752 305
3 306 753 25
3 304 753 306
3 25 754 306
3 69 754 25
3 307 1107 69
3 529 1107 307
3 529 1108 101
3 307 1108 529
3 530 1109 69
3 307 1109 530
3 69 1110 530
3 182 1110 69
3 531 1111 182
3 41 1111 531
3 182 1112 531
3 98 1112 182
3 532 755 98
3 77 755 532
3 98 756 532
3 29 756 98
3 533 757 29
3 96 757 533
3 29 758 533
3 193 758 29
3 534 759 193
3 23 759 534
3 193 760 534
3 117 760 193
3 13 761 107
3 118 761 13
3 107 1113 20
3 62 1113 107
3 20 1114 112
3 194 1114 20
3 112 1115 11
3 103 1115 112
3 11 1116 16
3 535 1116 11
3 535 1117 26
3 11 1117 535
3 762 1118 309
3 16 1118 762
3 762 1119 141
3 309 1119 762
3 763 1120 309
3 308 1120 763
3 763 1121 16
3 309 1121 763
3 310 1122 308
3 764 1122 310
3 764 1123 91
3 310 1123 764
3 310 1124 765
3 308 1124 310
3 765 1125 16
3 308 1125 765
3 536 1126 312
3 137 1126 536
3 536 1127 311
3 312 1127 536
3 537 1128 312
3 141 1128 537
3 537 1129 137
3 312 1129 537
3 311 1130 538
3 313 1130 311
3 538 1131 113
3 313 1131 538
3 539 1132 313
3 141 1132 539
3 313 1133 539
3 311 1133 313
3 540 1134 315
3 137 1134 540
3 540 1135 140
3 315 1135 540
3 541 1136 315
3 314 1136 541
3 541 1137 137
3 315 1137 541
3 316 1138 314
3 542 1138 316
3 542 1139 135
3 316 1139 542
3 314 1140 316
3 543 1140 314
3 543 1141 137
3 314 1141 543
3 766 1142 318
3 140 1142 766
3 766 1143 17
3 318 1143 766
3 767 1144 318
3 317 1144 767
3 767 1145 140
3 318 1145 767
3 319 1146 317
3 768 1146 319
3 768 1147 114
3 319 1147 768
3 769 1148 319
3 140 1148 769
3 317 1149 319
3 769 1149 317
3 544 1150 10
3 92 1150 544
3 10 1151 544
3 17 1151 10
3 111 1152 27
3 10 1152 111
3 21 1153 104
3 111 1153 21
3 108 1154 195
3 21 1154 108
3 13 770 63
3 108 770 13
3 62 771 118
3 545 771 62
3 545 772 107
3 62 772 545
3 194 1155 62
3 546 1155 194
3 546 1156 20
3 194 1156 546
3 103 1157 194
3 547 1157 103
3 547 1158 112
3 103 1158 547
3 26 1159 103
3 548 1159 26
3 548 1160 11
3 26 1160 548
3 549 1161 91
3 26 1161 549
3 549 1162 320
3 91 1162 549
3 550 1163 320
3 16 1163 550
3 320 1164 550
3 91 1164 320
3 773 1165 323
3 322 1165 773
3 773 1166 321
3 323 1166 773
3 774 1167 323
3 113 1167 774
3 774 1168 322
3 323 1168 774
3 775 1169 324
3 322 1169 775
3 775 1170 91
3 324 1170 775
3 776 1171 324
3 321 1171 776
3 776 1172 322
3 324 1172 776
3 777 1173 326
3 325 1173 777
3 777 1174 321
3 326 1174 777
3 778 1175 326
3 141 1175 778
3 778 1176 325
3 326 1176 778
3 779 1177 327
3 325 1177 779
3 779 1178 113
3 327 1178 779
3 780 1179 327
3 321 1179 780
3 780 1180 325
3 327 1180 780
3 551 1181 330
3 329 1181 551
3 551 1182 328
3 330 1182 551
3 552 1183 330
3 113 1183 552
3 552 1184 329
3 330 1184 552
3 553 1185 331
3 329 1185 553
3 553 1186 137
3 331 1186 553
3 554 1187 331
3 328 1187 554
3 554 1188 329
3 331 1188 554
3 555 1189 333
3 332 1189 555
3 555 1190 328
3 333 1190 555
3 556 1191 333
3 135 1191 556
3 556 1192 332
3 333 1192 556
3 557 1193 334
3 332 1193 557
3 557 1194 113
3 334 1194 557
3 558 1195 334
3 328 1195 558
3 558 1196 332
3 334 1196 558
3 559 1197 337
3 336 1197 559
3 559 1198 335
3 337 1198 559
3 560 1199 337
3 114 1199 560
3 560 1200 336
3 337 1200 560
3 561 1201 338
3 336 1201 561
3 561 1202 135
3 338 1202 561
3 562 1203 338
3 335 1203 562
3 562 1204 336
3 338 1204 562
3 563 1205 340
3 339 1205 563
3 563 1206 335
3 340 1206 563
3 564 1207 340
3 140 1207 564
3 564 1208 339
3 340 1208 564
3 565 1209 341
3 339 1209 565
3 565 1210 114
3 341 1210 565
3 566 1211 341
3 335 1211 566
3 566 1212 339
3 341 1212 566
3 781 1213 344
3 343 1213 781
3 781 1214 342
3 344 1214 781
3 782 1215 344
3 92 1215 782
3 782 1216 343
3 344 1216 782
3 783 1217 345
3 343 1217 783
3 783 1218 114
3 345 1218 783
3 784 1219 345
3 342 1219 784
3 784 1220 343
3 345 1220 784
3 785 1221 347
3 346 1221 785
3 785 1222 342
3 347 1222 785
3 786 1223 347
3 17 1223 786
3 786 1224 346
3 347 1224 786
3 787 1225 348
3 346 1225 787
3 787 1226 92
3 348 1226 787
3 788 1227 348
3 342 1227 788
3 788 1228 346
3 348 1228 788
3 567 1229 349
3 92 1229 567
3 567 1230 10
3 349 1230 567
3 568 1231 92
3 349 1231 568
3 27 1232 92
3 568 1232 27
3 569 1233 27
3 111 1233 569
3 27 1234 569
3 104 1234 27
3 570 1235 104
3 21 1235 570
3 104 1236 570
3 195 1236 104
3 571 1237 195
3 108 1237 571
3 195 1238 571
3 63 1238 195
3 572 789 63
3 13 789 572
3 63 790 572
3 118 790 63
3 12 791 105
3 118 791 12
3 105 1239 18
3 62 1239 105
3 18 1240 110
3 194 1240 18
3 110 1241 9
3 103 1241 110
3 9 1242 14
3 573 1242 9
3 573 1243 26
3 9 1243 573
3 792 1244 351
3 14 1244 792
3 792 1245 139
3 351 1245 792
3 793 1246 351
3 350 1246 793
3 793 1247 14
3 351 1247 793
3 352 1248 350
3 794 1248 352
3 794 1249 91
3 352 1249 794
3 352 1250 795
3 350 1250 352
3 795 1251 14
3 350 1251 795
3 574 1252 354
3 136 1252 574
3 574 1253 353
3 354 1253 574
3 575 1254 354
3 139 1254 575
3 575 1255 136
3 354 1255 575
3 353 1256 576
3 355 1256 353
3 576 1257 113
3 355 1257 576
3 577 1258 355
3 139 1258 577
3 355 1259 577
3 353 1259 355
3 578 1260 357
3 136 1260 578
3 578 1261 138
3 357 1261 578
3 579 1262 357
3 356 1262 579
3 579 1263 136
3 357 1263 579
3 358 1264 356
3 580 1264 358
3 580 1265 135
3 358 1265 580
3 356 1266 358
3 581 1266 356
3 581 1267 136
3 356 1267 581
3 796 1268 360
3 138 1268 796
3 796 1269 15
3 360 1269 796
3 797 1270 360
3 359 1270 797
3 797 1271 138
3 360 1271 797
3 361 1272 359
3 798 1272 361
3 798 1273 114
3 361 1273 798
3 799 1274 361
3 138 1274 799
3 359 1275 361
3 799 1275 359
3 582 1276 8
3 92 1276 582
3 8 1277 582
3 15 1277 8
3 109 1278 27
3 8 1278 109
3 19 1279 104
3 109 1279 19
3 106 1280 195
3 19 1280 106
3 12 800 63
3 106 800 12
3 62 801 118
3 583 801 62
3 583 802 105
3 62 802 583
3 194 1281 62
3 584 1281 194
3 584 1282 18
3 194 1282 584
3 103 1283 194
3 585 1283 103
3 585 1284 110
3 103 1284 585
3 26 1285 103
3 586 1285 26
3 586 1286 9
3 26 1286 586
3 587 1287 91
3 26 1287 587
3 587 1288 362
3 91 1288 587
3 588 1289 362
3 14 1289 588
3 362 1290 588
3 91 1290 362
3 803 1291 365
3 364 1291 803
3 803 1292 363
3 365 1292 803
3 804 1293 365
3 113 1293 804
3 804 1294 364
3 365 1294 804
3 805 1295 366
3 364 1295 805
3 805 1296 91
3 366 1296 805
3 806 1297 366
3 363 1297 806
3 806 1298 364
3 366 1298 806
3 807 1299 368
3 367 1299 807
3 807 1300 363
3 368 1300 807
3 808 1301 368
3 139 1301 808
3 808 1302 367
3 368 1302 808
3 809 1303 369
3 367 1303 809
3 809 1304 113
3 369 1304 809
3 810 1305 369
3 363 1305 810
3 810 1306 367
3 369 1306 810
3 589 1307 372
3 371 1307 589
3 589 1308 370
3 372 1308 589
3 590 1309 372
3 113 1309 590
3 590 1310 371
3 372 1310 590
3 591 1311 373
3 371 1311 591
3 591 1312 136
3 373 1312 591
3 592 1313 373
3 370 1313 592
3 592 1314 371
3 373 1314 592
3 593 1315 375
3 374 1315 593
3 593 1316 370
3 375 1316 593
3 594 1317 375
3 135 1317 594
3 594 1318 374
3 375 1318 594
3 595 1319 376
3 374 1319 595
3 595 1320 113
3 376 1320 595
3 596 1321 376
3 370 1321 596
3 596 1322 374
3 376 1322 596
3 597 1323 379
3 378 1323 597
3 597 1324 377
3 379 1324 597
3 598 1325 379
3 114 1325 598
3 598 1326 378
3 379 1326 598
3 599 1327 380
3 378 1327 599
3 599 1328 135
3 380 1328 599
3 600 1329 380
3 377 1329 600
3 600 1330 378
3 380 1330 600
3 601 1331 382
3 381 1331 601
3 601 1332 377
3 382 1332 601
3 602 1333 382
3 138 1333 602
3 602 1334 381
3 382 1334 602
3 603 1335 383
3 381 1335 603
3 603 1336 114
3 383 1336 603
3 604 1337 383
3 377 1337 604
3 604 1338 381
3 383 1338 604
3 811 1339 386
3 385 1339 811
3 811 1340 384
3 386 1340 811
3 812 1341 386
3 92 1341 812
3 812 1342 385
3 386 1342 812
3 813 1343 387
3 385 1343 813
3 813 1344 114
3 387 1344 813
3 814 1345 387
3 384 1345 814
3 814 1346 385
3 387 1346 814
3 815 1347 389
3 388 1347 815
3 815 1348 384
3 389 1348 815
3 816 1349 389
3 15 1349 816
3 816 1350 388
3 389 1350 816
3 817 1351 390
3 388 1351 817
3 817 1352 92
3 390 1352 817
3 818 1353 390
3 384 1353 818
3 818 1354 388
3 390 1354 818
3 605 1355 391
3 92 1355 605
3 605 1356 8
3 391 1356 605
3 606 1357 92
3 391 1357 606
3 27 1358 92
3 606 1358 27
3 607 1359 27
3 109 1359 607
3 27 1360 607
3 104 1360 27
3 608 1361 104
3 19 1361 608
3 104 1362 608
3 195 1362 104
3 609 1363 195
3 106 1363 609
3 195 1364 609
3 63 1364 195
3 610 819 63
3 12 819 610
3 63 820 610
3 118 820 63
3 120 1365 611
3 119 1365 120
3 611 1366 44
3 119 1366 611
3 612 821 123
3 49 821 612
3 120 822 123
3 612 822 120
3 126 823 613
3 123 823 126
3 613 824 46
3 123 824 613
3 614 1367 130
3 43 1367 614
3 126 1368 130
3 614 1368 126
3 127 825 47
3 130 825 127
3 615 1369 122
3 42 1369 615
3 127 1370 122
3 615 1370 127
3 121 1371 616
3 122 1371 121
3 616 1372 45
3 122 1372 616
3 121 826 119
3 48 826 121
3 119 31 32
3 120 34 31
3 123 37 34
3 126 35 37
3 130 36 35
3 127 33 36
3 122 30 33
3 121 32 30
3 44 49 120
3 49 46 123
3 46 43 126
3 43 47 130
3 47 42 127
3 42 45 122
3 45 48 121
3 48 44 119
3 617 827 392
3 119 827 617
3 617 828 31
3 392 828 617
3 119 829 618
3 120 829 119
3 618 830 392
3 120 830 618
3 619 831 120
3 393 831 619
3 123 832 120
3 619 832 123
3 620 833 393
3 34 833 620
3 620 834 123
3 393 834 620
3 621 835 394
3 123 835 621
3 621 836 37
3 394 836 621
3 123 837 622
3 126 837 123
3 622 838 394
3 126 838 622
3 623 839 126
3 395 839 623
3 130 840 126
3 623 840 130
3 624 841 395
3 35 841 624
3 624 842 130
3 395 842 624
3 127 843 130
3 625 843 127
3 625 844 36
3 127 844 625
3 626 845 127
3 396 845 626
3 122 846 127
3 626 846 122
3 627 847 396
3 33 847 627
3 627 848 122
3 396 848 627
3 628 849 397
3 122 849 628
3 628 850 30
3 397 850 628
3 122 851 629
3 121 851 122
3 629 852 397
3 121 852 629
3 630 853 121
3 32 853 630
3 121 854 630
3 119 854 121
3 166 1373 175
3 631 1373 166
3 631 1374 156
3 166 1374 631
3 175 855 179
3 632 855 175
3 632 856 160
3 175 856 632
3 171 857 633
3 179 857 171
3 633 858 159
3 179 858 633
3 178 1375 634
3 171 1375 178
3 634 1376 152
3 171 1376 634
3 157 170 178
3 180 859 635
3 170 859 180
3 635 860 153
3 170 860 635
3 180 861 174
3 636 861 180
3 636 862 158
3 180 862 636
3 161 166 174
3 160 863 156
3 637 863 160
3 637 864 175
3 160 864 637
3 159 865 160
3 638 865 159
3 638 866 179
3 159 866 638
3 159 867 639
3 152 867 159
3 639 868 171
3 152 868 639
3 152 869 640
3 157 869 152
3 640 870 178
3 157 870 640
3 157 153 170
3 153 871 641
3 158 871 153
3 641 872 180
3 158 872 641
3 161 873 158
3 642 873 161
3 642 874 174
3 161 874 642
3 161 156 166
3 169 1377 177
3 643 1377 169
3 643 1378 150
3 169 1378 643
3 177 875 167
3 644 875 177
3 644 876 154
3 177 876 644
3 173 877 645
3 167 877 173
3 645 878 149
3 167 878 645
3 181 1379 646
3 173 1379 181
3 646 1380 146
3 173 1380 646
3 151 172 181
3 168 879 647
3 172 879 168
3 647 880 147
3 172 880 647
3 168 881 176
3 648 881 168
3 648 882 148
3 168 882 648
3 155 169 176
3 154 883 150
3 649 883 154
3 649 884 177
3 154 884 649
3 149 885 154
3 650 885 149
3 650 886 167
3 149 886 650
3 149 887 651
3 146 887 149
3 651 888 173
3 146 888 651
3 146 889 652
3 151 889 146
3 652 890 181
3 151 890 652
3 151 147 172
3 147 891 653
3 148 891 147
3 653 892 168
3 148 892 653
3 155 893 148
3 654 893 155
3 654 894 176
3 155 894 654
3 155 150 169
3 185 895 7
3 116 895 185
3 196 145 7
3 72 1 145
3 58 55 1
3 55 1381 187
3 133 1381 55
3 896 1382 187
3 65 1382 896
3 896 1383 398
3 187 1383 896
3 897 1384 398
3 87 1384 897
3 398 1385 897
3 187 1385 398
3 400 1386 399
3 898 1386 400
3 898 1387 79
3 400 1387 898
3 899 1388 400
3 162 1388 899
3 399 1389 400
3 899 1389 399
3 900 1390 401
3 65 1390 900
3 900 1391 79
3 401 1391 900
3 901 1392 401
3 399 1392 901
3 901 1393 65
3 401 1393 901
3 191 67 79
3 189 902 163
3 67 902 189
3 85 57 189
3 131 3 57
3 59 143 3
3 70 6 143
3 6 1394 185
3 655 1394 6
3 655 1395 198
3 6 1395 655
3 116 196 7
3 196 72 145
3 72 58 1
3 58 133 55
3 87 1396 133
3 187 1396 87
3 162 903 87
3 656 903 162
3 656 904 65
3 162 904 656
3 657 1397 191
3 162 1397 657
3 657 1398 402
3 191 1398 657
3 658 1399 402
3 79 1399 658
3 658 1400 191
3 402 1400 658
3 191 163 67
3 163 905 189
3 85 905 163
3 85 131 57
3 131 59 3
3 59 70 143
3 70 198 6
3 116 906 198
3 185 906 116
3 659 1401 5
3 115 1401 659
3 5 1402 659
3 184 1402 5
3 197 144 5
3 73 0 144
3 61 54 0
3 134 186 54
3 186 907 64
3 88 907 186
3 165 78 64
3 660 908 403
3 78 908 660
3 660 909 66
3 403 909 660
3 661 910 403
3 190 910 661
3 661 911 78
3 403 911 661
3 912 1403 404
3 188 1403 912
3 912 1404 164
3 404 1404 912
3 913 1405 188
3 404 1405 913
3 66 1406 188
3 913 1406 66
3 56 1407 86
3 188 1407 56
3 132 2 56
3 60 142 2
3 71 4 142
3 184 1408 199
3 4 1408 184
3 115 1409 5
3 197 1409 115
3 197 73 144
3 73 61 0
3 61 134 54
3 134 88 186
3 165 914 88
3 64 914 165
3 190 1410 165
3 662 1410 190
3 662 1411 78
3 190 1411 662
3 663 915 164
3 190 915 663
3 663 916 405
3 164 916 663
3 664 917 405
3 66 917 664
3 664 918 164
3 405 918 664
3 406 919 164
3 188 919 406
3 164 920 406
3 86 920 164
3 86 1412 56
3 132 1412 86
3 132 60 2
3 60 71 142
3 71 199 4
3 199 115 184
3 128 124 52
3 52 124 50
3 128 53 129
3 128 52 53
3 128 129 124
3 124 129 125
3 124 125 51
3 124 51 50
3 52 51 53
3 52 50 51
3 53 125 129
3 53 51 125