OFF
1674 1942 0
0.2561858728 0.0472075655 -0.0618382214
-0.4532909832 0.0142082147 -0.1760906367
-0.3493662235 -0.0153306921 -0.1817199082
0.3899840164 -0.0164624607 -0.0576373258
0.0695926064 0.3203379993 -0.1278831423
-0.2454593738 0.0594576658 -0.1311579575
0.1259286175 0.0585570846 -0.0769041740
-0.4456735435 -0.0258031227 -0.1104476811
0.2570867885 0.0435196417 -0.0699963693
0.0247328488 0.3062838396 -0.1331575206
0.0417885372 -0.4381036902 -0.0932007093
0.1870819819 -0.4386587199 -0.0769048466
-0.4415081379 0.0371105931 -0.1454435053
0.1575632853 -0.0529652032 -0.0779252294
0.1412131714 -0.0517628288 -0.0520400086
-0.3547928502 -0.0509734288 -0.1345502351
0.1632821985 -0.0529525066 -0.0764438291
-0.1792934626 -0.0140344079 -0.0339898331
-0.3445824030 -0.0146120053 -0.0819275430
0.0030067552 -0.0155252987 -0.0328628200
0.4543272305 -0.1523810872 0.0461598884
0.1319029559 0.0548152367 -0.0853332723
0.1561486107 0.0555861832 -0.0616148201
0.1619604322 0.0555639817 -0.0609629762
0.0612361430 0.3028053399 -0.1289229053
0.4147270604 -0.0067988573 -0.0005811303
0.0581212499 -0.3398722736 -0.1005525011
0.0102154343 -0.0559140920 -0.0985108200
-0.1057697149 -0.0540202215 -0.0762408085
-0.3557500770 -0.0539633997 -0.1261174656
0.1623249718 -0.0559424775 -0.0680110597
-0.4386421416 -0.0209078214 -0.1729727273
0.0686835320 -0.4757006639 -0.0869241376
0.0041554619 0.0543821548 -0.0407236404
-0.0166302694 0.1040522181 -0.1385380504
0.2514561202 0.0389355795 -0.0199496234
-0.2522316944 0.0410669562 -0.0714025213
-0.2410674200 0.0276633140 -0.1713993929
-0.3597773534 0.0321237229 -0.0872782967
-0.2468177922 0.0641548169 -0.1188863556
0.0097284280 0.0631747949 -0.0901125731
-0.4576097699 -0.0226890842 -0.1388411640
0.3884705909 -0.0240904217 0.0005713566
0.3853991808 0.0145680162 -0.0157021796
-0.3593297042 0.0520516602 -0.0905907869
0.2594741979 -0.0159927122 -0.0933094068
-0.2484253771 0.0614091327 -0.1046466919
0.0078421183 0.0605338049 -0.0733842403
-0.2575201657 -0.0234073103 -0.0339424320
0.2482696484 0.0127199697 -0.0074236332
0.2507663435 0.0123995436 -0.0147033990
0.3328739473 0.0118095858 -0.0122131063
0.3846160472 0.0121300319 0.0061887908
0.3849935948 0.0116795284 -0.0046885621
0.3852781170 0.0112639670 -0.0147353125
0.1568491628 0.0131037446 -0.0168372207
0.4423403960 -0.1622488320 0.0477568018
0.1521181553 0.4145216588 -0.1183954850
-0.3297413318 -0.0128667265 -0.0567787617
-0.1004598680 0.0561922131 -0.1198294657
-0.3558288528 0.0582731021 -0.1215923788
0.1311549229 0.0565509718 -0.0636131036
0.1676249232 0.0199421181 -0.1126806802
0.3888072177 0.0208243210 -0.0458750520
0.4716768257 -0.1515780568 0.0489106488
0.4253680700 -0.1514702409 0.0420367849
0.0135068061 -0.3247106397 -0.1070284659
-0.3501882930 0.0419189294 -0.1724404636
0.1015969050 -0.5000000000 -0.0813742561
-0.4377721871 -0.0061617386 -0.1802269717
0.4356705069 -0.0058022966 0.0076125708
-0.4595256380 -0.0177825445 -0.1215922241
0.2031906326 -0.4753797254 -0.0718731698
0.0463998636 0.3488765975 -0.1299983859
0.1484000381 0.0519715847 -0.0900973447
-0.2518262696 0.0559875251 -0.0745090887
-0.4427497619 -0.0327630151 -0.1367530852
0.2587098423 0.0370483270 -0.0846878802
0.0223060355 -0.3422052053 -0.1036241457
0.1657681679 -0.0455124753 -0.0983552567
0.1569420554 -0.0421972229 -0.0195489746
0.2545754508 -0.0442973035 -0.0505963600
-0.2425159566 -0.0446436602 -0.1609470250
0.0140302636 -0.0456236822 -0.1321732424
-0.0457474253 -0.0453953278 -0.1388778051
-0.1766483941 -0.0208896104 -0.0578066728
0.2112007556 0.4745363799 -0.1109374853
0.0429211460 0.2970319582 -0.1307312638
0.0379095349 -0.2972922523 -0.1062902965
0.4028934754 0.0066372448 0.1203760119
-0.2588591604 0.0067126579 -0.0134823160
0.4279339856 0.0092704558 0.1895416175
0.3721350989 0.0039913333 0.0497291234
0.3416233393 0.0077348798 0.1345034780
0.0028899245 0.0037783429 -0.0311636878
0.3885411691 0.0095591114 0.1884832941
-0.3483963218 0.0002152295 -0.1898380366
-0.4528391166 0.0014777736 -0.1805530594
0.2603441524 -0.0012466294 -0.1005636512
0.3028234592 0.0059486799 0.0831130514
0.4111784514 0.0075382179 0.1439835539
0.1685638391 -0.0013450756 -0.1217770593
0.1565788796 0.0031566987 -0.0147661758
0.4204793870 0.0083662671 0.1660261500
-0.1798807492 0.0057546353 -0.0205837918
-0.3085689894 0.0062462321 -0.0350172433
0.4139612745 0.0018625939 0.0065415998
0.3909539180 -0.0009165391 -0.0657554542
-0.4573915646 0.0031877579 -0.1399053223
0.3922117912 0.0057108406 0.0956586232
0.4455552669 0.0091340551 0.1898380366
0.3791354962 0.0093877826 0.1823885094
0.3828710602 0.0021195331 0.0064144819
-0.2399061020 -0.0004064643 -0.1827097149
0.0166401182 -0.0013864863 -0.1539359323
-0.4597142604 0.0040602058 -0.1191665187
-0.1090072947 0.0041367107 -0.0453938409
-0.4742811756 0.0036667867 -0.1317201227
0.2477088114 0.0034994403 0.0122543358
0.3851936504 0.0012471249 -0.0143233802
-0.4458846854 0.0044218941 -0.1075356962
0.2480922735 0.0027380257 -0.0061821446
-0.4372442957 0.0011764026 -0.1846837025
-0.3604741779 0.0047518975 -0.0819977014
0.4349035966 0.0017135066 0.0072105011
-0.1762260614 0.0291946001 -0.0598663341
0.0641868270 -0.3207304218 -0.1015198678
0.1665283491 0.0446369983 -0.1020625604
0.1577022366 0.0479522508 -0.0232562783
0.2553356320 0.0458521702 -0.0543036636
-0.2417557754 0.0455058135 -0.1646543287
0.0147904448 0.0445257915 -0.1358805461
-0.0449872441 0.0447541459 -0.1425851088
0.0280778277 0.3422684789 -0.1317724167
0.2580763609 -0.0380758836 -0.0815984749
0.0405154493 -0.3489528762 -0.1013008719
-0.4421444183 0.0390243534 -0.1397052663
0.1475272349 -0.0515336785 -0.0858407980
-0.2526990729 -0.0475177380 -0.0702525420
-0.4591596163 0.0256237713 -0.1233772639
-0.4376454873 0.0088635246 -0.1808448701
0.4357972068 0.0092229666 0.0069946724
0.1100293581 0.5000000000 -0.1224982198
-0.3508780854 -0.0398831758 -0.1690764368
0.0189829654 0.3247040971 -0.1337349740
0.4742811756 0.1572703643 0.0362095775
0.4279724198 0.1573781801 0.0293357136
0.1672729793 -0.0217947240 -0.1109642958
0.3884552738 -0.0209125211 -0.0441586676
-0.1013889823 -0.0539909448 -0.1152982975
-0.3567579671 -0.0519100558 -0.1170612106
0.1302258086 -0.0536321861 -0.0590819354
-0.3294316211 0.0238616945 -0.0582891800
-0.4431143445 -0.0317886903 -0.1334692922
0.1451216158 -0.4151941306 -0.0842742829
0.4451277567 0.1683027469 0.0341632107
0.2481007152 -0.0073137145 -0.0065997687
0.2505974104 -0.0076341406 -0.0138795345
0.3327050142 -0.0082240984 -0.0113892418
0.3844471141 -0.0079036523 0.0070126553
0.3848246617 -0.0083541558 -0.0038646976
0.3851091839 -0.0087697172 -0.0139114480
0.1566802297 -0.0069299396 -0.0160133562
-0.2570274441 0.0350242687 -0.0363453701
-0.2494108024 -0.0554519200 -0.0998409022
0.0068566929 -0.0563272477 -0.0685784507
0.0767077328 0.4758849150 -0.1260571085
0.2597275976 0.0140578141 -0.0945452036
-0.4425230875 0.0383281518 -0.1363527747
0.3851739367 -0.0121435627 -0.0146036936
-0.3601321187 -0.0431062346 -0.0866775171
-0.4571733594 0.0290646001 -0.1409694806
0.3889070014 0.0276632625 -0.0015569600
-0.2478595286 -0.0593841305 -0.1138059445
0.0086866916 -0.0603641524 -0.0850321619
-0.2415319861 -0.0274293176 -0.1691337655
-0.3602419194 -0.0229689087 -0.0850126693
0.2508367166 -0.0345191574 -0.0169288734
-0.2528510980 -0.0323877806 -0.0683817714
-0.0183899714 -0.1046298872 -0.1299562150
0.0032967364 -0.0474536346 -0.0365357491
-0.4382620421 0.0241679681 -0.1748264224
0.0111727041 0.0576080132 -0.1031792990
-0.1048124451 0.0595018837 -0.0809092874
-0.3547928072 0.0595587056 -0.1307859446
0.1632822416 0.0575796277 -0.0726795386
0.0638508089 0.3395929896 -0.1284948060
0.4148678380 0.0098958795 -0.0012676841
0.0561259876 -0.3032051864 -0.1040013504
0.1309879194 -0.0536984475 -0.0808707595
0.1552335741 -0.0529275010 -0.0571523073
0.1610453957 -0.0529497025 -0.0565004634
0.4569456581 0.1581368075 0.0333901618
-0.1789696742 0.0243634868 -0.0355689067
-0.3442586146 0.0237858894 -0.0835066166
0.0033305436 0.0228725960 -0.0344418936
0.1584642441 0.0538790073 -0.0823190868
0.1421141302 0.0550813817 -0.0564338661
-0.3538918914 0.0558707817 -0.1389440925
0.1641831573 0.0538917039 -0.0808376866
-0.4420853260 -0.0313378280 -0.1426286349
0.0195663824 -0.3064045814 -0.1079613442
0.2563547628 -0.0432908847 -0.0664263764
0.0491792531 0.4383572572 -0.1292442575
0.1944726977 0.4378022275 -0.1129483948
-0.4451667442 0.0342979299 -0.1129192746
-0.2464307214 -0.0557339132 -0.1264208232
0.1249572699 -0.0566344944 -0.0721670397
-0.3490987461 0.0163893079 -0.1830243603
0.3902514938 0.0152575393 -0.0589417779
-0.4535021496 -0.0108338905 -0.1750608061
0.2553975360 -0.0462808555 -0.0579936069
-0.1304529640 -0.0746367737 -0.1454516200
-0.1441316910 -0.0450194940 -0.1499124150
-0.0744214677 -0.0896333304 -0.1377039175
0.1359370823 -0.4755401946 -0.0793986537
-0.1194878370 0.0623443109 -0.0961352980
-0.1188220472 -0.0576491112 -0.1061583822
0.1439542442 0.4752106475 -0.1184972969
-0.1291930224 0.0747790158 -0.1515961895
-0.0729116459 0.0894156169 -0.1450671199
-0.1433715098 0.0451299797 -0.1536197187
0.3101136862 0.0033646795 0.0217734894
0.4297582707 0.0054983245 0.0981898182
-0.0009199123 0.0742890048 -0.1372092982
0.1218259754 0.4380797423 -0.1210963262
-0.0864477589 0.0260335981 -0.0471541139
-0.0868208195 -0.0182074546 -0.0453347464
0.0843460052 -0.2716443035 -0.1034305308
0.1357139936 -0.3551515117 -0.0901676887
0.0633658222 -0.2599120089 -0.1071152490
0.1144352596 -0.4383812050 -0.0850527779
0.3152899358 0.0028094867 0.0093344088
0.4282507437 -0.0799661063 0.0225229756
-0.1248461589 -0.0315215184 -0.0515576810
-0.0609197019 -0.0235234086 -0.0422102505
-0.1247011683 -0.0474856863 -0.0533941455
-0.1145045753 -0.1846771500 -0.1339877454
-0.1304529640 -0.0746367737 -0.1454516200
-0.0664472733 -0.1446535186 -0.1319719802
-0.1224787696 -0.1296569618 -0.1397196827
-0.0744214677 -0.0896333304 -0.1377039175
-0.1785102659 -0.1146604051 -0.1474673852
-0.1864844603 -0.0596402169 -0.1531993225
-0.1224787696 -0.1296569618 -0.1397196827
-0.0024415827 -0.2146702634 -0.1184923405
-0.0504988846 -0.2546938948 -0.1205081057
-0.0584730790 -0.1996737067 -0.1262400430
0.0055326117 -0.2696904516 -0.1127604032
-0.0664472733 -0.1446535186 -0.1319719802
-0.0104157770 -0.1596500753 -0.1242242777
-0.0584730790 -0.1996737067 -0.1262400430
-0.1003637097 -0.2413736752 -0.1270738671
-0.1145045753 -0.1846771500 -0.1339877454
-0.0504988846 -0.2546938948 -0.1205081057
-0.1714398332 -0.1430086677 -0.1440104461
-0.0292875862 -0.3397386827 -0.1101372882
-0.0434284518 -0.2830421575 -0.1170511665
0.0062504755 -0.3889211864 -0.1016689988
0.0005882055 -0.2055172343 -0.1189587796
0.0188680081 -0.2039175368 -0.1169787827
0.0633658222 -0.2599120089 -0.1071152490
0.1042437190 -0.3375530698 -0.0956947660
0.0188680081 -0.2039175368 -0.1169787827
0.0928185326 -0.3820735034 -0.0927875774
0.0934550765 -0.4266489104 -0.0887374961
0.0411519933 -0.3935282832 -0.0972507906
-0.0512364893 -0.0507369281 -0.0563882788
-0.1792343939 -0.0507689798 -0.0732466752
-0.1460890734 -0.0505646205 -0.1326493142
-0.1441316910 -0.0450194940 -0.1499124150
-0.1962598974 -0.0531492668 -0.1295350687
0.0879918011 -0.0507132837 -0.0984330384
0.0827721774 0.0542430279 -0.0483202593
-0.1711078217 0.0508490133 -0.1422418972
-0.0503284916 0.0569420193 -0.0608164639
-0.1221349576 0.0578956437 -0.0726851662
-0.1238354039 0.0551848400 -0.0576163645
-0.1852801673 0.0596523882 -0.0886659290
-0.1113864050 0.1851049553 -0.1491946513
0.0011763480 0.2143781576 -0.1361365122
-0.0640083372 0.1445785867 -0.1438663508
-0.0551050285 0.1997415565 -0.1426655818
-0.0077269607 0.1592151879 -0.1373372813
-0.0462017198 0.2549045262 -0.1414648127
0.0100796567 0.2695411274 -0.1349357431
-0.0551050285 0.1997415565 -0.1426655818
-0.1291930224 0.0747790158 -0.1515961895
-0.1765710902 0.1153053844 -0.1569244900
-0.1202897137 0.1299419855 -0.1503954204
-0.1854743989 0.0601424146 -0.1581252591
-0.0640083372 0.1445785867 -0.1438663508
-0.0729116459 0.0894156169 -0.1450671199
-0.1202897137 0.1299419855 -0.1503954204
-0.0962882612 0.2419315353 -0.1469492931
-0.0235545040 0.3401443963 -0.1380967753
0.0128123745 0.3892508267 -0.1336705164
-0.0386526479 0.2833178162 -0.1403421336
-0.1113864050 0.1851049553 -0.1491946513
-0.1690220183 0.1437186744 -0.1558018109
-0.0462017198 0.2549045262 -0.1414648127
0.0040512897 0.2051680289 -0.1358477855
0.0223029368 0.2034287790 -0.1337304778
0.0677439430 0.2592869385 -0.1284667677
0.0223029368 0.2034287790 -0.1337304778
0.1099310492 0.3369042987 -0.1234311263
0.1301900044 0.4564468185 -0.1200908714
0.0799884830 -0.0271917871 -0.0262745527
0.3199603013 0.0046051405 0.0539564795
0.1359370823 -0.4755401946 -0.0793986537
-0.1436397057 -0.0364123227 -0.1540057853
0.3240301886 -0.0272691721 -0.0696179003
0.0906516214 -0.0337092031 -0.1215687691
-0.3967174959 -0.0359406251 -0.1537614812
-0.3047285200 -0.0497138969 -0.0936568763
-0.2986544034 -0.0478085445 -0.1477486300
-0.1240381162 0.0477245555 -0.0560630809
0.0805163901 0.0354124234 -0.0288490860
0.3099219551 0.0037453868 0.0309917296
0.3374792790 0.0049700066 0.0664210874
0.2752661353 0.0047240601 0.0476836936
0.3201316690 0.0298799502 -0.0329123377
0.2065189343 0.0469022105 -0.0387799710
-0.2978238334 0.0506882976 -0.1517992106
-0.3038775407 0.0567303964 -0.0976187394
0.3528584673 0.0062929624 0.1017445316
0.0912076840 0.0322339548 -0.1242806131
0.2059410561 -0.0437344300 -0.0367146684
-0.1430273321 0.0362087299 -0.1569922508
0.3198746938 -0.0282204331 -0.0326000268
0.1224895849 -0.4567417078 -0.0825369396
0.1218259754 0.4380797423 -0.1210963262
-0.0962882612 0.2419315353 -0.1469492931
-0.1113864050 0.1851049553 -0.1491946513
-0.0462017198 0.2549045262 -0.1414648127
-0.1690220183 0.1437186744 -0.1558018109
-0.0235545040 0.3401443963 -0.1380967753
-0.0386526479 0.2833178162 -0.1403421336
0.0128123745 0.3892508267 -0.1336705164
-0.1113864050 0.1851049553 -0.1491946513
-0.1085114633 0.1758948266 -0.1489059246
-0.0462017198 0.2549045262 -0.1414648127
0.1079844821 0.3770573242 -0.1234451455
0.1006487042 0.4264394580 -0.1238198713
0.0565150310 0.3889751234 -0.1288695317
0.0535654556 0.2296379024 -0.1304902969
0.1028418055 0.3220797806 -0.1244428909
0.0081244494 0.1737797429 -0.1357540071
0.0081244494 0.1737797429 -0.1357540071
-0.0994173147 0.1712688858 -0.1476927962
-0.0282480844 0.2341504220 -0.1392120300
-0.1085114633 0.1758948266 -0.1489059246
-0.1003637097 -0.2413736752 -0.1270738671
-0.0292875862 -0.3397386827 -0.1101372882
0.0062504755 -0.3889211864 -0.1016689988
-0.0434284518 -0.2830421575 -0.1170511665
-0.1145045753 -0.1846771500 -0.1339877454
-0.1714398332 -0.1430086677 -0.1440104461
-0.0504988846 -0.2546938948 -0.1205081057
-0.1145045753 -0.1846771500 -0.1339877454
-0.0504988846 -0.2546938948 -0.1205081057
-0.1114747871 -0.1755241208 -0.1344541846
0.1016214329 -0.3775332021 -0.0924133920
0.0499548936 -0.3889879819 -0.0968766052
0.0934550765 -0.4266489104 -0.0887374961
0.0496870953 -0.2302947292 -0.1115760440
0.0051892812 -0.1743002571 -0.1214395778
0.0974043556 -0.3227444299 -0.0979251635
0.0051892812 -0.1743002571 -0.1214395778
-0.1114747871 -0.1755241208 -0.1344541846
-0.0130905214 -0.1758999546 -0.1234195746
-0.0786111062 -0.1104597243 -0.1366659948
-0.0622826543 -0.1757120377 -0.1289368796
-0.0458508138 -0.1431798395 -0.1300427847
-0.0950429467 -0.1429919226 -0.1355600897
-0.0294189734 -0.1106476412 -0.1311486899
-0.0621792658 -0.0779275261 -0.1377719000
-0.0458508138 -0.1431798395 -0.1300427847
-0.0459542024 -0.2409643511 -0.1212077644
0.0032379305 -0.2411522680 -0.1156904594
-0.0295223619 -0.2084321529 -0.1223136695
-0.0131939100 -0.2736844663 -0.1145845543
-0.0622826543 -0.1757120377 -0.1289368796
-0.0787144947 -0.2082442360 -0.1278309745
-0.0295223619 -0.2084321529 -0.1223136695
-0.1441316910 -0.0450194940 -0.1499124150
-0.1769953719 -0.1100838905 -0.1477006048
-0.1278032390 -0.1102718074 -0.1421832998
-0.1605635314 -0.0775516923 -0.1488065099
-0.1442350795 -0.1428040057 -0.1410773947
-0.1933238238 -0.0448315771 -0.1554297200
-0.2097556643 -0.0773637754 -0.1543238149
-0.1605635314 -0.0775516923 -0.1488065099
-0.0786111062 -0.1104597243 -0.1366659948
-0.0949395581 -0.0452074109 -0.1443951101
-0.1113713986 -0.0777396092 -0.1432892049
-0.0621792658 -0.0779275261 -0.1377719000
-0.1278032390 -0.1102718074 -0.1421832998
-0.0950429467 -0.1429919226 -0.1355600897
-0.1113713986 -0.0777396092 -0.1432892049
-0.3006430293 0.0294050790 -0.0599259934
0.0706672783 -0.2420270238 -0.1078913259
0.1005561227 -0.2421412010 -0.1045390445
0.0572931932 -0.1438824416 -0.1183561434
0.1288746301 -0.3403428719 -0.0923980862
0.0124599265 -0.1437111758 -0.1233845655
0.0423487709 -0.1438253530 -0.1200322841
-0.0166437494 -0.0945532518 -0.1311311853
0.1144352596 -0.4383812050 -0.0850527779
0.1218259754 0.4380797423 -0.1210963262
0.4297374130 0.0792587446 0.0109430986
0.0921325207 0.0092778159 -0.1333083062
0.1359370823 -0.4755401946 -0.0793986537
-0.1125578286 0.0220596636 -0.1592951305
-0.1116329919 -0.0008964753 -0.1683228236
-0.0479588552 0.0103365886 -0.1566155314
-0.1762319653 0.0108265996 -0.1710024227
-0.0488836919 0.0332927275 -0.1475878383
-0.0479588552 0.0103365886 -0.1566155314
-0.0161217869 0.0159531206 -0.1507618853
0.1439542442 0.4752106475 -0.1184972969
0.0912970514 -0.0234843789 -0.1269751509
-0.2947318709 0.0139392718 -0.1806187147
-0.2946361628 -0.0078685782 -0.1822148115
0.3935161224 -0.0803025928 0.0173853233
0.3631105683 -0.0442633456 0.0029980407
0.4213989107 -0.0882357545 0.0233656225
0.4213989107 -0.0882357545 0.0233656225
0.3949098027 0.0849731967 0.0105885277
0.3638918750 0.0483913912 -0.0008122893
0.4229263298 0.0929000350 0.0159166009
0.4229263298 0.0929000350 0.0159166009
-0.1178654729 0.0613162303 -0.1106352653
-0.1178654729 0.0613162303 -0.1106352653
-0.1194878370 0.0623443109 -0.0961352980
-0.1203620554 -0.0579080362 -0.0924365320
-0.1203620554 -0.0579080362 -0.0924365320
0.4445745068 0.0835831219 0.0174709467
0.0834543001 0.2295237252 -0.1271380155
0.0491223724 0.1370247583 -0.1315092808
0.0319564086 0.0907752749 -0.1336949134
0.0334120154 0.1667879716 -0.1328380329
0.0677439430 0.2592869385 -0.1284667677
0.1177862277 0.3220226920 -0.1227667503
0.0255568368 0.1816695783 -0.1335024090
0.1046315713 0.2411640095 -0.1244144705
0.0834543001 0.2295237252 -0.1271380155
0.1177862277 0.3220226920 -0.1227667503
0.0597110080 0.1428449005 -0.1301475083
0.1495521345 0.3394831185 -0.1186814326
0.1283748633 0.3278428342 -0.1214049777
0.1720124161 0.3886426730 -0.1158149137
0.0706672783 -0.2420270238 -0.1078913259
0.0124599265 -0.1437111758 -0.1233845655
-0.0166437494 -0.0945532518 -0.1311311853
0.0423487709 -0.1438253530 -0.1200322841
0.1005561227 -0.2421412010 -0.1045390445
0.1288746301 -0.3403428719 -0.0923980862
0.0572931932 -0.1438824416 -0.1183561434
0.4297582707 0.0054983245 0.0981898182
0.4218597726 0.0036804592 0.0523657090
0.4188835290 0.0074224478 0.1427483299
0.2042342900 0.0301758972 -0.0189798387
-0.1248461589 -0.0315215184 -0.0515576810
-0.1247011683 -0.0474856863 -0.0533941455
-0.0607022159 -0.0474696605 -0.0449649473
-0.1792343939 -0.0507689798 -0.0732466752
-0.0455867740 -0.0549525184 -0.1069045588
-0.1460890734 -0.0505646205 -0.1326493142
0.0827721774 0.0542430279 -0.0483202593
0.0815952415 0.0482486881 -0.1129889454
-0.0428347116 0.0503590023 -0.1278550059
-0.1433715098 0.0451299797 -0.1536197187
-0.1221349576 0.0578956437 -0.0726851662
0.0722549539 -0.0496082317 -0.0442878789
0.0801193959 -0.0448254288 -0.0280423619
0.1079844821 0.3770573242 -0.1234451455
0.0565150310 0.3889751234 -0.1288695317
0.1006487042 0.4264394580 -0.1238198713
0.1301900044 0.4564468185 -0.1200908714
0.3183671186 0.0250997732 -0.0173424679
0.3180053266 -0.0233313600 -0.0157662835
0.2037584731 -0.0207245485 -0.0164711148
0.0799884830 -0.0271917871 -0.0262745527
0.3199603013 0.0046051405 0.0539564795
0.3570009553 0.0067434489 0.1135483027
0.1144352596 -0.4383812050 -0.0850527779
-0.3047285200 -0.0497138969 -0.0936568763
-0.2986544034 -0.0478085445 -0.1477486300
-0.1244505754 0.0319697761 -0.0529222075
-0.1240381162 0.0477245555 -0.0560630809
-0.0601475567 0.0431759655 -0.0468229239
0.0805163901 0.0354124234 -0.0288490860
0.3475176252 0.0058297603 0.0893858373
0.3201316690 0.0298799502 -0.0329123377
0.2065189343 0.0469022105 -0.0387799710
-0.2978238334 0.0506882976 -0.1517992106
-0.3038775407 0.0567303964 -0.0976187394
-0.3958482155 0.0395147612 -0.1589419845
0.3248318802 0.0180658939 -0.0752216672
0.2059410561 -0.0437344300 -0.0367146684
0.3198746938 -0.0282204331 -0.0326000268
0.1224895849 -0.4567417078 -0.0825369396
0.1439542442 0.4752106475 -0.1184972969
-0.0994173147 0.1712688858 -0.1476927962
-0.1433715098 0.0451299797 -0.1536197187
-0.0722022794 0.1080115158 -0.1451389525
-0.1213944122 0.1081994328 -0.1506562575
-0.0941793769 0.0449420628 -0.1481024138
-0.1705865451 0.1083873497 -0.1561735624
-0.1925636426 0.0453178966 -0.1591370237
-0.1213944122 0.1081994328 -0.1506562575
-0.0010330491 0.1708930520 -0.1366581863
-0.0282480844 0.2341504220 -0.1392120300
-0.0502251819 0.1710809689 -0.1421754913
0.0209440485 0.2339625051 -0.1336947250
-0.0722022794 0.1080115158 -0.1451389525
-0.0230101466 0.1078235989 -0.1396216475
-0.0502251819 0.1710809689 -0.1421754913
-0.0130905214 -0.1758999546 -0.1234195746
0.0843460052 -0.2716443035 -0.1034305308
0.0633658222 -0.2599120089 -0.1071152490
0.1357139936 -0.3551515117 -0.0901676887
0.4432019431 -0.0791884571 0.0241647592
0.0535654556 0.2296379024 -0.1304902969
0.0042891058 0.1371960241 -0.1365377029
-0.0203490692 0.0909750850 -0.1395614058
0.0341779502 0.1370818469 -0.1331854215
0.0834543001 0.2295237252 -0.1271380155
0.1028418055 0.3220797806 -0.1244428909
0.0491223724 0.1370247583 -0.1315092808
0.1046315713 0.2411640095 -0.1244144705
0.1495521345 0.3394831185 -0.1186814326
0.1720124161 0.3886426730 -0.1158149137
0.1283748633 0.3278428342 -0.1214049777
0.0834543001 0.2295237252 -0.1271380155
0.0597110080 0.1428449005 -0.1301475083
0.1177862277 0.3220226920 -0.1227667503
0.0921325207 0.0092778159 -0.1333083062
0.0912076840 0.0322339548 -0.1242806131
0.0534614828 0.0269018037 -0.1345944262
-0.1424466731 0.0221738408 -0.1626474118
0.0912970514 -0.0234843789 -0.1269751509
0.0926019787 -0.0013657810 -0.1378564958
0.0539685848 -0.0124354326 -0.1404555416
-0.1124459339 -0.0144079019 -0.1615348489
-0.1137508612 -0.0365264999 -0.1506535039
-0.0492078352 -0.0300157921 -0.1468540456
-0.1769889600 -0.0209186097 -0.1653343072
-0.0492078352 -0.0300157921 -0.1468540456
-0.0162838585 -0.0157011392 -0.1503949890
-0.0479029079 -0.0078971941 -0.1577353906
-0.1124459339 -0.0144079019 -0.1615348489
-0.1116329919 -0.0008964753 -0.1683228236
-0.1769889600 -0.0209186097 -0.1653343072
0.3935161224 -0.0803025928 0.0173853233
0.3790365421 -0.0798471697 0.0153237715
0.4069193304 -0.0877803313 0.0213040707
0.3558707782 -0.0440356341 0.0019672648
0.3949098027 0.0849731967 0.0105885277
0.3804231836 0.0845938830 0.0085613036
0.4084397106 0.0925207213 0.0138893768
0.3566485654 0.0482017344 -0.0018259014
-0.0949395581 -0.0452074109 -0.1443951101
-0.1864844603 -0.0596402169 -0.1531993225
-0.0881001947 -0.0600160508 -0.1421647126
-0.0320686984 -0.0750126075 -0.1344170101
-0.4030633024 -0.0092735073 -0.0962741828
-0.1185446821 0.0636648059 -0.1044994644
-0.0558228593 0.0614390579 -0.0847597692
0.0798695436 0.0084410438 -0.0240004543
0.0797850771 -0.0015757983 -0.0235885220
-0.1195864185 -0.0598741414 -0.0994190532
-0.0543033065 -0.0567816016 -0.1023346011
-0.4028310194 0.0182728085 -0.0974069965
-0.0308087567 0.0744031820 -0.1405615796
-0.0870901332 0.0597665808 -0.1470906492
-0.1854743989 0.0601424146 -0.1581252591
-0.0941793769 0.0449420628 -0.1481024138
0.4315940885 0.0924668134 0.0173263087
0.3154816668 0.0024287794 0.0001161687
0.3464923732 0.0027421063 0.0140939857
0.4030865328 0.0037867173 0.0511001115
0.4376567688 0.0073161898 0.1440139274
0.4084273750 0.0042499194 0.0634588058
0.3528584673 0.0062929624 0.1017445316
-0.0528383756 0.0135046533 -0.0399178672
-0.1313369101 0.0276140991 -0.0535102240
-0.0528383756 0.0135046533 -0.0399178672
-0.1317346068 -0.0195485325 -0.0515707096
-0.0530002698 -0.0056942940 -0.0391283304
-0.0530002698 -0.0056942940 -0.0391283304
0.1613979877 -0.3969051158 -0.0835362676
0.1147338105 -0.3434192171 -0.0938524069
0.0329780169 -0.1881370953 -0.1166933729
0.1042437190 -0.3375530698 -0.0956947660
0.3099219551 0.0037453868 0.0309917296
0.3437125173 0.0034004100 0.0295317661
0.4030865328 0.0037867173 0.0511001115
0.3528584673 0.0062929624 0.1017445316
0.4065377027 -0.0441601311 0.0093291390
0.4432019431 -0.0791884571 0.0241647592
0.2042342900 0.0301758972 -0.0189798387
-0.0288114827 -0.0354885216 -0.0393729998
-0.0607747112 -0.0394875765 -0.0440467150
-0.1887726159 -0.0395196282 -0.0609051115
-0.0607747112 -0.0394875765 -0.0440467150
-0.0984501187 -0.1096451461 -0.1387118001
-0.0904759243 -0.1646653343 -0.1329798628
-0.0424186224 -0.1246417029 -0.1309640976
-0.0984501187 -0.1096451461 -0.1387118001
-0.1544816150 -0.0946485894 -0.1464595026
-0.2105131113 -0.0796520326 -0.1542072051
-0.1465074206 -0.1496687775 -0.1407275653
-0.1544816150 -0.0946485894 -0.1464595026
-0.0264702336 -0.2346820791 -0.1195002231
-0.0825017299 -0.2196855224 -0.1272479256
-0.0184960392 -0.2897022673 -0.1137682858
-0.0264702336 -0.2346820791 -0.1195002231
-0.0344444280 -0.1796618910 -0.1252321603
-0.0424186224 -0.1246417029 -0.1309640976
-0.0904759243 -0.1646653343 -0.1329798628
-0.0344444280 -0.1796618910 -0.1252321603
-0.0434284518 -0.2830421575 -0.1170511665
-0.0825017299 -0.2196855224 -0.1272479256
-0.1785102659 -0.1146604051 -0.1474673852
-0.1359017714 -0.1921911714 -0.1355421566
-0.0149608229 -0.3038763986 -0.1120398162
-0.0648256480 -0.2905561789 -0.1186055777
0.0098786408 -0.3568159131 -0.1043487323
0.0276476717 -0.3814071649 -0.1001145876
-0.0024415827 -0.2146702634 -0.1184923405
0.0097597818 -0.2009610697 -0.1181232557
0.0100772939 -0.2559609079 -0.1134600619
0.1006238017 -0.3591996585 -0.0941378167
0.0838047706 -0.2987325393 -0.1014050075
0.0224879254 -0.1822709480 -0.1185357320
0.0374969979 -0.2535613616 -0.1104900666
0.1046542214 -0.3679622762 -0.0928970754
0.0673035349 -0.4100885968 -0.0929941434
0.1189700742 -0.3986338170 -0.0885309302
0.0666669909 -0.3655131898 -0.0970442247
0.0673035349 -0.4100885968 -0.0929941434
-0.0221898982 -0.0535320879 -0.0624833647
-0.0494565110 -0.0551737346 -0.0724096296
-0.1775902587 -0.0547360708 -0.0880408553
-0.2143225982 -0.0531104499 -0.0865437887
-0.0177659955 -0.0506547099 -0.1186943126
0.0898992158 -0.0455680788 -0.1152642496
0.0510110323 -0.0481684829 -0.1153031404
0.0809288493 0.0511672028 -0.0319899594
0.0453071479 0.0573884164 -0.0608522498
-0.0428347116 0.0503590023 -0.1278550059
-0.1729596209 0.0578249394 -0.1254937116
-0.2082835978 0.0551533395 -0.1366999274
-0.0484851634 0.0600178443 -0.0771467639
-0.0212431867 0.0587379121 -0.0671003521
-0.1869806136 0.0569415844 -0.0735971274
-0.0589897478 0.0561388993 -0.0567044033
-0.1869806136 0.0569415844 -0.0735971274
-0.2185532185 0.0578199567 -0.0815875089
-0.0314159946 0.1794783722 -0.1400014315
-0.0876973711 0.1648417710 -0.1465305011
-0.0403193033 0.1243154024 -0.1412022006
-0.0314159946 0.1794783722 -0.1400014315
-0.0225126859 0.2346413419 -0.1388006624
-0.0136093772 0.2898043117 -0.1375998933
-0.0787940624 0.2200047408 -0.1453297320
-0.0225126859 0.2346413419 -0.1388006624
-0.1528820563 0.0950422001 -0.1542603398
-0.1439787476 0.1502051698 -0.1530595707
-0.2091634328 0.0804055989 -0.1607894093
-0.1528820563 0.0950422001 -0.1542603398
-0.0966006798 0.1096788012 -0.1477312702
-0.0403193033 0.1243154024 -0.1412022006
-0.0876973711 0.1648417710 -0.1465305011
-0.0966006798 0.1096788012 -0.1477312702
0.0340811093 0.3815306772 -0.1314896158
0.0158976700 0.3569774619 -0.1337027452
-0.0599213826 0.2910379658 -0.1425230342
-0.0098348412 0.3040109567 -0.1370385538
-0.1326551397 0.1928251049 -0.1513755520
-0.1765710902 0.1153053844 -0.1569244900
-0.0787940624 0.2200047408 -0.1453297320
-0.0386526479 0.2833178162 -0.1403421336
0.0011763480 0.2143781576 -0.1361365122
0.0143920693 0.2557259342 -0.1345026530
0.0131454383 0.2005420882 -0.1346346571
0.0417695399 0.2531170595 -0.1313266916
0.0255568368 0.1816695783 -0.1335024090
0.0888374961 0.2980956186 -0.1259489470
0.1066771492 0.3586634994 -0.1236591952
0.1108553809 0.3674298291 -0.1231393136
0.0896846287 0.4474020379 -0.1246675645
0.1439542442 0.4752106475 -0.1184972969
0.2037584731 -0.0207245485 -0.0164711148
0.1183343564 -0.0170608634 -0.0211439545
0.0801193959 -0.0448254288 -0.0280423619
0.3560860462 0.0051579906 0.0748075513
0.3099219551 0.0037453868 0.0309917296
0.3570009553 0.0067434489 0.1135483027
0.3810513631 0.0080505734 0.1502648140
0.1278827569 -0.4571796919 -0.0819144921
0.1695638575 -0.4754599600 -0.0756359118
-0.1930778312 -0.0405279915 -0.1574764051
-0.1441316910 -0.0450194940 -0.1499124150
-0.2959410900 -0.0299871761 -0.1713334666
0.2126746701 -0.0299353038 -0.0962813853
0.0898992158 -0.0455680788 -0.1152642496
0.1282098947 -0.0396108392 -0.1099620129
-0.4016232316 -0.0374474624 -0.1100734046
-0.2705851800 -0.0462261024 -0.1543478275
-0.2966970210 -0.0422634180 -0.1650117309
-0.3058018115 0.0440556240 -0.0808936927
-0.1879321929 0.0518560403 -0.0652860848
-0.1238354039 0.0551848400 -0.0576163645
0.0423359260 0.0448972891 -0.0347863632
0.0809288493 0.0511672028 -0.0319899594
0.2114464998 0.0454700154 -0.0827627834
0.3236691411 0.0293885905 -0.0644690736
0.3544694433 0.0253521356 -0.0393936948
0.3184276505 0.0267517979 -0.0178259015
-0.3258578624 0.0532795397 -0.1453716515
-0.2959720342 0.0437123714 -0.1685473962
-0.4004977985 0.0462855160 -0.1172558267
-0.3958482155 0.0395147612 -0.1589419845
0.3722584073 0.0071860623 0.1274397449
0.3222233992 0.0068417799 0.1088082647
0.1288680166 0.0384354766 -0.1131715868
0.0906593970 0.0445813949 -0.1189715533
0.2131279734 0.0293474062 -0.0983038820
0.3248318802 0.0180658939 -0.0752216672
0.1814415558 -0.0429658264 -0.0281318215
0.2038893860 -0.0383581901 -0.0182389240
-0.3936803941 0.0202786380 -0.1789253914
-0.2956278565 0.0347911217 -0.1719199283
-0.1433715098 0.0451299797 -0.1536197187
-0.1920473761 0.0319360220 -0.1641958218
0.2853557052 -0.0313697952 -0.0247644501
0.3180053266 -0.0233313600 -0.0157662835
0.3232658173 -0.0294942023 -0.0628785712
0.1628401088 -0.4660607166 -0.0772050547
0.1144352596 -0.4383812050 -0.0850527779
0.1355902152 0.4568435713 -0.1195027517
0.0855026143 0.4382184998 -0.1251702919
-0.0386526479 0.2833178162 -0.1403421336
-0.0787940624 0.2200047408 -0.1453297320
-0.1765710902 0.1153053844 -0.1569244900
-0.1326551397 0.1928251049 -0.1513755520
-0.0098348412 0.3040109567 -0.1370385538
-0.0599213826 0.2910379658 -0.1425230342
0.0158976700 0.3569774619 -0.1337027452
0.0340811093 0.3815306772 -0.1314896158
0.0785818676 0.4077072907 -0.1263447015
0.1300513187 0.3957894915 -0.1209203152
0.0859176455 0.3583251569 -0.1259699757
0.0785818676 0.4077072907 -0.1263447015
0.1108553809 0.3674298291 -0.1231393136
0.1066771492 0.3586634994 -0.1236591952
0.0782036306 0.2758588415 -0.1274665939
0.0042891058 0.1371960241 -0.1365377029
0.0346802962 0.2382925414 -0.1323384562
0.0346802962 0.2382925414 -0.1323384562
-0.0010330491 0.1708930520 -0.1366581863
0.0073365308 0.2655911901 -0.1349716469
-0.0373422330 0.2387763627 -0.1404251584
-0.1705865451 0.1083873497 -0.1561735624
-0.0418893073 0.2410893331 -0.1410317226
0.0276476717 -0.3814071649 -0.1001145876
0.0098786408 -0.3568159131 -0.1043487323
-0.0648256480 -0.2905561789 -0.1186055777
-0.0149608229 -0.3038763986 -0.1120398162
-0.1359017714 -0.1921911714 -0.1355421566
-0.1785102659 -0.1146604051 -0.1474673852
-0.0825017299 -0.2196855224 -0.1272479256
-0.0434284518 -0.2830421575 -0.1170511665
0.0717049851 -0.4078184461 -0.0928070507
0.0798713414 -0.3587027378 -0.0964829466
0.1233715244 -0.3963636664 -0.0883438375
0.0717049851 -0.4078184461 -0.0928070507
0.1046542214 -0.3679622762 -0.0928970754
0.0306576344 -0.2387527217 -0.1127204641
0.0019698350 -0.1378450285 -0.1252269246
0.0735457254 -0.2765195796 -0.1047506038
0.1006238017 -0.3591996585 -0.0941378167
-0.0039189452 -0.1713437901 -0.1225840508
0.0306576344 -0.2387527217 -0.1127204641
-0.2184540967 0.0203894520 -0.0284645810
-0.2941453908 0.0152871762 -0.0358857480
-0.2156006843 0.0327152215 -0.0534857140
-0.2830445776 -0.0085805391 -0.0344798377
-0.2912962149 -0.0226272536 -0.0625802665
-0.2190763115 -0.0036608750 -0.0237360745
-0.2170842799 -0.0221484603 -0.0458745524
0.0423487709 -0.1438253530 -0.1200322841
0.0789246580 -0.1930118213 -0.1114475940
0.1438190523 -0.3403999604 -0.0907219455
0.0997709542 -0.2911849479 -0.1001447060
0.0281895173 -0.0947245176 -0.1261027633
0.0415636024 -0.1928690998 -0.1156379457
0.0132450950 -0.0946674290 -0.1277789039
-0.0158585809 -0.0455095050 -0.1355255238
0.4300737083 -0.0878342392 0.0247410027
0.4074655317 0.0402529347 -0.0016901408
0.4445745068 0.0835831219 0.0174709467
0.3252140580 -0.0084546257 -0.0795324305
0.3253407578 0.0065706375 -0.0801503289
0.4069193304 -0.0877803313 0.0213040707
0.4378630706 -0.1203084208 0.0347627555
0.4084397106 0.0925207213 0.0138893768
0.4399359939 0.1255184213 0.0246533813
-0.1171433349 0.0585328395 -0.1171686283
-0.0533463844 0.0594621218 -0.1069072821
-0.1758151186 0.0618283503 -0.0998978215
0.0704416755 0.0598628834 -0.0768628383
0.0659069814 -0.0564808710 -0.0703727452
-0.1212770547 -0.0558895838 -0.0842096764
-0.0567526812 -0.0571176419 -0.0805074913
-0.1195864185 -0.0598741414 -0.0994190532
-0.1848864289 -0.0566799781 -0.0961387171
-0.1188220472 -0.0576491112 -0.1061583822
-0.1746242554 -0.0566875377 -0.1145521210
0.4297211724 0.0467395007 0.0081016313
0.4315940885 0.0924668134 0.0173263087
0.3101136862 0.0033646795 0.0217734894
-0.0009199123 0.0742890048 -0.1372092982
0.0162460515 0.1205384882 -0.1350236656
0.0662883363 0.1832742417 -0.1293236482
0.0083908730 0.1354200949 -0.1356880416
0.1006202639 0.2757732086 -0.1249523829
0.1099310492 0.3369042987 -0.1234311263
0.0466503899 0.2204782584 -0.1309845883
0.0334120154 0.1667879716 -0.1328380329
0.0706672783 -0.2420270238 -0.1078913259
-0.0158585809 -0.0455095050 -0.1355255238
0.0132450950 -0.0946674290 -0.1277789039
0.0415636024 -0.1928690998 -0.1156379457
0.0281895173 -0.0947245176 -0.1261027633
0.0997709542 -0.2911849479 -0.1001447060
0.1438190523 -0.3403999604 -0.0907219455
0.0789246580 -0.1930118213 -0.1114475940
0.0423487709 -0.1438253530 -0.1200322841
0.3154816668 0.0024287794 0.0001161687
0.4282507437 -0.0799661063 0.0225229756
-0.1887726159 -0.0395196282 -0.0609051115
-0.1249221714 -0.0239565397 -0.0506222957
-0.4028310194 0.0182728085 -0.0974069965
-0.3064916084 -0.0377470076 -0.0775296442
0.0928185326 -0.3820735034 -0.0927875774
-0.0177659955 -0.0506547099 -0.1186943126
-0.0735682038 -0.0496931363 -0.1270880513
-0.1739098519 -0.0548624290 -0.1208595604
-0.0959182493 -0.0479799742 -0.1357635596
0.0879918011 -0.0507132837 -0.0984330384
0.0694985206 0.0585423884 -0.0684986720
0.1202372070 0.0510976393 -0.0357882688
0.0797863711 0.0547897990 -0.0966383218
0.0463839728 0.0529283507 -0.1080841222
0.0906593970 0.0445813949 -0.1189715533
-0.0158310038 0.0539835078 -0.1155171524
-0.0446435820 0.0569001131 -0.1115043823
-0.0941793769 0.0449420628 -0.1481024138
-0.1711078217 0.0508490133 -0.1422418972
0.0740349322 -0.0540450382 -0.0603092297
0.0395558234 -0.0529677397 -0.0564331648
0.1185307256 -0.0435113258 -0.0237956682
0.0722549539 -0.0496082317 -0.0442878789
0.0785818676 0.4077072907 -0.1263447015
0.0859176455 0.3583251569 -0.1259699757
0.1300513187 0.3957894915 -0.1209203152
0.0785818676 0.4077072907 -0.1263447015
0.2110614654 -0.0444016800 -0.0823908166
0.1706953800 0.4654915992 -0.1155141784
0.1218259754 0.4380797423 -0.1210963262
0.3180222302 0.0118317553 -0.0147193557
0.2845667310 0.0187496584 -0.0160229335
0.2843013685 -0.0154827503 -0.0148229090
0.3178856735 -0.0098888517 -0.0142416140
0.0416426097 -0.0373227109 -0.0314051509
0.0798434924 -0.0112276192 -0.0244380881
0.2752661353 0.0047240601 0.0476836936
0.3475176252 0.0058297603 0.0893858373
0.1278827569 -0.4571796919 -0.0819144921
0.0781118984 -0.4382424476 -0.0891267436
-0.4030084020 -0.0193421702 -0.0971066067
-0.2959410900 -0.0299871761 -0.1713334666
-0.3943251363 -0.0230224572 -0.1746517043
0.3247291071 -0.0162275864 -0.0754733663
0.2126746701 -0.0299353038 -0.0962813853
-0.3967174959 -0.0359406251 -0.1537614812
-0.4016232316 -0.0374474624 -0.1100734046
-0.3267236268 -0.0493909867 -0.1411494325
-0.3006117858 -0.0533536710 -0.1304855291
-0.0601475567 0.0431759655 -0.0468229239
-0.1883411349 0.0365183662 -0.0621623644
-0.0284085066 0.0330242807 -0.0406324088
-0.0605600159 0.0274211861 -0.0436820505
0.1186827764 0.0242580840 -0.0228431534
0.0800898532 0.0179881703 -0.0256395572
0.3374792790 0.0049700066 0.0664210874
0.3821734450 0.0048510870 0.0726938733
0.3236691411 0.0293885905 -0.0644690736
0.2857938946 0.0344077649 -0.0264309805
0.3220714249 0.0333382456 -0.0500893578
0.1821105855 0.0474272307 -0.0310181246
0.2086480321 0.0507080759 -0.0576333199
-0.2697898044 0.0480970555 -0.1582267696
-0.2996756326 0.0576642237 -0.1350510250
-0.4004977985 0.0462855160 -0.1172558267
0.3847786624 0.0085026678 0.1620225477
0.2131279734 0.0293474062 -0.0983038820
-0.2956278565 0.0347911217 -0.1719199283
0.3541649838 -0.0245664771 -0.0383793472
0.3215153623 -0.0326049123 -0.0473775138
0.3232658173 -0.0294942023 -0.0628785712
0.0821390611 -0.4474226990 -0.0878688244
0.1359370823 -0.4755401946 -0.0793986537
0.1355902152 0.4568435713 -0.1195027517
0.1775774999 0.4748735137 -0.1147173911
-0.1077868946 0.0765707478 -0.1493793356
-0.0858097971 0.1396402008 -0.1464158744
-0.0585947617 0.0763828309 -0.1438620307
-0.1077868946 0.0765707478 -0.1493793356
-0.1569790274 0.0767586647 -0.1548966406
-0.2061711602 0.0769465816 -0.1604139456
-0.1350019299 0.1398281177 -0.1519331793
-0.1569790274 0.0767586647 -0.1548966406
-0.0146405667 0.2025217370 -0.1379351081
-0.0638326995 0.2027096539 -0.1434524131
0.0073365308 0.2655911901 -0.1349716469
-0.0146405667 0.2025217370 -0.1379351081
-0.0366176642 0.1394522839 -0.1408985694
-0.0585947617 0.0763828309 -0.1438620307
-0.0858097971 0.1396402008 -0.1464158744
-0.0366176642 0.1394522839 -0.1408985694
0.0032379305 -0.2411522680 -0.1156904594
-0.0039189452 -0.1713437901 -0.1225840508
-0.2184540967 0.0203894520 -0.0284645810
-0.2156006843 0.0327152215 -0.0534857140
-0.2936307487 -0.0181370184 -0.0453605969
-0.2987167505 -0.0234998930 -0.0751546572
-0.2190763115 -0.0036608750 -0.0237360745
-0.2170842799 -0.0221484603 -0.0458745524
0.0706672783 -0.2420270238 -0.1078913259
0.1042437190 -0.3375530698 -0.0956947660
0.0329780169 -0.1881370953 -0.1166933729
0.1147338105 -0.3434192171 -0.0938524069
0.1613979877 -0.3969051158 -0.0835362676
0.4289645017 -0.0429936572 0.0117918145
0.4300737083 -0.0878342392 0.0247410027
-0.0150983996 0.0446399687 -0.1392328274
0.0095397753 0.0908609078 -0.1362091245
0.0289272807 0.1834169632 -0.1335139999
0.0244841975 0.0908038192 -0.1345329838
0.0782036306 0.2758588415 -0.1274665939
0.1177862277 0.3220226920 -0.1227667503
0.0662883363 0.1832742417 -0.1293236482
0.0341779502 0.1370818469 -0.1331854215
0.4297374130 0.0792587446 0.0109430986
0.2141457183 0.0063563692 -0.1081611314
0.0534614828 0.0269018037 -0.1345944262
0.1298787220 0.0146099670 -0.1229944932
0.0350508005 0.0127576587 -0.1442651792
0.0543863195 0.0039456648 -0.1436221193
-0.1125578286 0.0220596636 -0.1592951305
-0.1430273321 0.0362087299 -0.1569922508
-0.1911763875 0.0108836882 -0.1726785634
0.2138085658 -0.0115206767 -0.1057639735
0.0539685848 -0.0124354326 -0.1404555416
0.1299304452 -0.0124147273 -0.1243761051
0.0339994242 -0.0290295574 -0.1363143920
0.0526636575 -0.0345540306 -0.1295741966
-0.2947318709 0.0139392718 -0.1806187147
-0.1761760180 -0.0074071831 -0.1721222819
-0.0479029079 -0.0078971941 -0.1577353906
-0.1761760180 -0.0074071831 -0.1721222819
-0.2084475310 -0.0106625370 -0.1740220110
-0.2946361628 -0.0078685782 -0.1822148115
0.4239216765 -0.1163418400 0.0317726058
0.3790365421 -0.0798471697 0.0153237715
0.4259277304 0.1215550021 0.0219893447
0.3804231836 0.0845938830 0.0085613036
-0.3003548418 0.0600127993 -0.1289152241
-0.1171433349 0.0585328395 -0.1171686283
-0.0881001947 -0.0600160508 -0.1421647126
-0.1195356246 -0.0451134525 -0.1471537626
-0.1933238238 -0.0448315771 -0.1554297200
-0.1584687122 -0.0671384953 -0.1493254712
-0.0600844465 -0.0675143291 -0.1382908613
-0.1024372159 -0.0821350521 -0.1415777688
-0.0464057196 -0.0971316088 -0.1338300663
-0.0600844465 -0.0675143291 -0.1382908613
0.0715378300 0.0562116250 -0.0942562857
0.1523937688 -0.4876898627 -0.0766237130
0.1023103071 -0.4756204293 -0.0831613957
0.3224965452 0.0340159433 -0.0538566367
-0.4031794316 0.0045868958 -0.0947666988
-0.3817687401 -0.0022608049 -0.0891359421
-0.3016090921 0.0604839191 -0.1177163182
0.0416000436 0.0156568199 -0.0292211739
0.0800898532 0.0179881703 -0.0256395572
0.0704416755 0.0598628834 -0.0768628383
0.0797850771 -0.0015757983 -0.0235885220
0.0798695436 0.0084410438 -0.0240004543
0.0685412508 -0.0549797169 -0.0638301930
0.0798434924 -0.0112276192 -0.0244380881
0.0413959161 -0.0085505485 -0.0282256710
-0.1212770547 -0.0558895838 -0.0842096764
-0.3023087478 -0.0556470931 -0.1154335775
0.3219264049 -0.0335966883 -0.0510761373
-0.3010903992 -0.0548486564 -0.1262691444
-0.3816525986 0.0115123530 -0.0897023489
-0.4031794316 0.0045868958 -0.0947666988
0.1103309885 0.4755477812 -0.1222772027
0.1606150569 0.4872681899 -0.1167178526
-0.0589494450 0.0670848814 -0.1438261144
-0.0447709576 0.0967339175 -0.1418025851
-0.1010523341 0.0820973164 -0.1483316547
-0.0589494450 0.0670848814 -0.1438261144
-0.1573337106 0.0674607152 -0.1548607243
-0.1925636426 0.0453178966 -0.1591370237
-0.1187754433 0.0450360212 -0.1508610663
-0.0870901332 0.0597665808 -0.1470906492
0.3162696938 -0.0025828133 0.0004152553
0.3162739147 -0.0076086834 0.0002064433
0.2021438455 0.0033280695 -0.0012559200
0.3464923732 0.0027421063 0.0140939857
0.2791029798 0.0030513526 0.0077956724
0.3775030795 0.0030554332 0.0280718027
0.3411243925 0.0036780064 0.0357513064
0.3930481867 0.0029269636 0.0281353616
0.3821734450 0.0048510870 0.0726938733
0.3930481867 0.0029269636 0.0281353616
0.4242243711 0.0078856499 0.1551070242
0.4337075197 0.0064072571 0.1211018728
0.4218597726 0.0036804592 0.0523657090
0.4056604252 0.0054435821 0.0919174089
0.3810513631 0.0080505734 0.1502648140
-0.0150983996 0.0446399687 -0.1392328274
-0.0308087567 0.0744031820 -0.1405615796
0.1581493366 0.4379409849 -0.1170223605
0.1006487042 0.4264394580 -0.1238198713
-0.1244505754 0.0319697761 -0.0529222075
-0.1249221714 -0.0239565397 -0.0506222957
0.0934550765 -0.4266489104 -0.0887374961
0.1507586207 -0.4385199624 -0.0809788123
0.2021438455 0.0033280695 -0.0012559200
0.3437125173 0.0034004100 0.0295317661
0.2814993736 0.0031544635 0.0107943723
0.3632917887 0.0027599715 0.0179731240
0.3490804980 0.0024645099 0.0078744454
0.3930481867 0.0029269636 0.0281353616
0.3930481867 0.0029269636 0.0281353616
0.3821734450 0.0048510870 0.0726938733
0.3810513631 0.0080505734 0.1502648140
0.3178799691 0.0120395360 -0.0096959805
0.3164428478 0.0124250008 -0.0006174212
0.2045791784 0.0434439151 -0.0216029508
0.2275003168 0.0212877204 -0.0168416188
-0.4022482242 0.0431747951 -0.1017550308
-0.3064916084 -0.0377470076 -0.0775296442
-0.0944630215 -0.1371552402 -0.1358458315
-0.1264658668 -0.1021468678 -0.1425856514
-0.1184916725 -0.1571670559 -0.1368537141
-0.0944630215 -0.1371552402 -0.1358458315
-0.0704343705 -0.1171434245 -0.1348379489
-0.0464057196 -0.0971316088 -0.1338300663
-0.1024372159 -0.0821350521 -0.1415777688
-0.0704343705 -0.1171434245 -0.1348379489
-0.1824973631 -0.0871503110 -0.1503333538
-0.1584687122 -0.0671384953 -0.1493254712
-0.2145002085 -0.0521419386 -0.1570731737
-0.1824973631 -0.0871503110 -0.1503333538
-0.1504945178 -0.1221586835 -0.1435935340
-0.1184916725 -0.1571670559 -0.1368537141
-0.1264658668 -0.1021468678 -0.1425856514
-0.1504945178 -0.1221586835 -0.1435935340
-0.0544859818 -0.2271838008 -0.1233740743
-0.0304573308 -0.2071719851 -0.1223661917
-0.0864888271 -0.1921754283 -0.1301138942
-0.0544859818 -0.2271838008 -0.1233740743
-0.0224831364 -0.2621921732 -0.1166342544
0.0095197089 -0.2972005457 -0.1098944346
0.0015455145 -0.2421803575 -0.1156263718
-0.0224831364 -0.2621921732 -0.1166342544
-0.0384315252 -0.1521517969 -0.1280981290
-0.0064286799 -0.1871601694 -0.1213583091
-0.0144028742 -0.1321399812 -0.1270902464
-0.0384315252 -0.1521517969 -0.1280981290
-0.0624601762 -0.1721636126 -0.1291060116
-0.0864888271 -0.1921754283 -0.1301138942
-0.0304573308 -0.2071719851 -0.1223661917
-0.0624601762 -0.1721636126 -0.1291060116
-0.0718960807 -0.2622079163 -0.1220625168
-0.0184960392 -0.2897022673 -0.1137682858
-0.0754312971 -0.2480337850 -0.1237909864
-0.1074341425 -0.2130254126 -0.1305308063
-0.1465074206 -0.1496687775 -0.1407275653
-0.2069778949 -0.0938261640 -0.1524787355
-0.1429722042 -0.1638429088 -0.1389990958
-0.1181327406 -0.2167824233 -0.1313080119
-0.0078903901 -0.3322246612 -0.1085828771
-0.0363580190 -0.3113904201 -0.1135942274
-0.0718960807 -0.2622079163 -0.1220625168
-0.0470566171 -0.3151474308 -0.1143714330
-0.0115185554 -0.3643299346 -0.1059031435
-0.0078903901 -0.3322246612 -0.1085828771
0.0240195064 -0.4135124383 -0.0974348540
0.0098786408 -0.3568159131 -0.1043487323
0.0374969979 -0.2535613616 -0.1104900666
0.0097597818 -0.2009610697 -0.1181232557
0.0320472864 -0.3901544477 -0.0984124275
-0.1943025150 -0.0476041404 -0.1467981696
-0.0959182493 -0.0479799742 -0.1357635596
-0.1943025150 -0.0476041404 -0.1467981696
-0.2193879270 -0.0488964635 -0.1452410468
0.0510110323 -0.0481684829 -0.1153031404
0.1268799845 -0.0481128795 -0.0983941476
0.0306132333 -0.0520412875 -0.1069069802
0.0491036177 -0.0533136878 -0.0984719292
0.0434638197 0.0543125914 -0.0445219499
0.1202372070 0.0510976393 -0.0357882688
0.0434638197 0.0543125914 -0.0445219499
0.0247313049 0.0558852856 -0.0507879451
-0.2082835978 0.0551533395 -0.1366999274
-0.1357838449 0.0535206132 -0.1310356814
-0.2250196866 0.0503295765 -0.1506771280
-0.2064317986 0.0481774134 -0.1534481129
-0.0595566828 0.1721600716 -0.1432659663
-0.0269643402 0.2070598570 -0.1394010470
-0.0832457167 0.1924232559 -0.1459301166
-0.0595566828 0.1721600716 -0.1432659663
-0.0358676489 0.1518968873 -0.1406018161
-0.0121786150 0.1316337030 -0.1379376658
-0.0032753063 0.1867966727 -0.1367368967
-0.0358676489 0.1518968873 -0.1406018161
-0.0180610315 0.2622228268 -0.1382002779
0.0056280024 0.2419596425 -0.1355361276
0.0145313111 0.2971226122 -0.1343353586
-0.0180610315 0.2622228268 -0.1382002779
-0.0506533741 0.2273230413 -0.1420651972
-0.0832457167 0.1924232559 -0.1459301166
-0.0269643402 0.2070598570 -0.1394010470
-0.0506533741 0.2273230413 -0.1420651972
-0.1484304020 0.1226236850 -0.1536599552
-0.1247413680 0.1023605007 -0.1509958050
-0.1158380593 0.1575234704 -0.1497950359
-0.1484304020 0.1226236850 -0.1536599552
-0.1810227446 0.0877238995 -0.1575248745
-0.2136150872 0.0528241141 -0.1613897939
-0.1573337106 0.0674607152 -0.1548607243
-0.1810227446 0.0877238995 -0.1575248745
-0.0684599915 0.1169971018 -0.1444667354
-0.1010523341 0.0820973164 -0.1483316547
-0.0447709576 0.0967339175 -0.1418025851
-0.0684599915 0.1169971018 -0.1444667354
-0.0921490254 0.1372602861 -0.1471308856
-0.1158380593 0.1575234704 -0.1497950359
-0.1247413680 0.1023605007 -0.1509958050
-0.0921490254 0.1372602861 -0.1471308856
0.0158976700 0.3569774619 -0.1337027452
0.0309958138 0.4138040420 -0.1314573870
-0.0022857693 0.3324242467 -0.1359158747
-0.0053710647 0.3646976115 -0.1358836459
-0.0417379433 0.3155911810 -0.1403099048
-0.0674704545 0.2626246758 -0.1436457133
-0.0311035760 0.3117311062 -0.1392194544
-0.0022857693 0.3324242467 -0.1359158747
-0.1144717004 0.2173783201 -0.1491624225
-0.1402042116 0.1644118149 -0.1524982311
-0.2053888969 0.0946122439 -0.1602280698
-0.1439787476 0.1502051698 -0.1530595707
-0.1038373331 0.2135182453 -0.1480719722
-0.0712449905 0.2484180308 -0.1442070529
-0.0136093772 0.2898043117 -0.1375998933
-0.0674704545 0.2626246758 -0.1436457133
0.0131454383 0.2005420882 -0.1346346571
0.0417695399 0.2531170595 -0.1313266916
0.0386285404 0.3903128680 -0.1305083371
0.0565150310 0.3889751234 -0.1288695317
0.2110614654 -0.0444016800 -0.0823908166
0.0629434929 0.4571210861 -0.1276506830
0.1034488686 0.4661658668 -0.1230739900
0.1706953800 0.4654915992 -0.1155141784
0.1103309885 0.4755477812 -0.1222772027
0.2036388200 -0.0072820401 -0.0149464454
0.2272975949 -0.0276218529 -0.0166999941
0.1376382059 -0.0296290431 -0.0203464645
0.1184652692 -0.0346945050 -0.0229117636
0.0416426097 -0.0373227109 -0.0314051509
0.1184652692 -0.0346945050 -0.0229117636
0.3821734450 0.0048510870 0.0726938733
0.3460477001 0.0042982369 0.0518428015
0.2838345563 0.0040522904 0.0331054076
0.3410285270 0.0038683601 0.0403604265
0.3603794177 0.0085613312 0.1584459937
0.3998074416 0.0088770248 0.1742073297
0.1615095321 -0.4570994573 -0.0781517502
0.1023103071 -0.4756204293 -0.0831613957
0.1615095321 -0.4570994573 -0.0781517502
0.1783229197 -0.4570593399 -0.0762703792
-0.4030084020 -0.0193421702 -0.0971066067
-0.3226536568 -0.0226589341 -0.1765266874
-0.2966970210 -0.0422634180 -0.1650117309
-0.3943251363 -0.0230224572 -0.1746517043
0.3247291071 -0.0162275864 -0.0754733663
0.2917521933 -0.0216309422 -0.0814636536
0.1892214190 -0.0377238896 -0.0973183210
0.2119222644 -0.0417941795 -0.0899768658
-0.3757551731 -0.0434570270 -0.1441558581
-0.3947601135 -0.0303954986 -0.1710245821
-0.3307432435 -0.0508119764 -0.1053590435
-0.3064155958 -0.0453119863 -0.0784650295
0.0419234669 0.0291425097 -0.0316454898
0.0228332348 0.0338849426 -0.0346141284
0.1191093134 0.0416823371 -0.0260526821
0.0423359260 0.0448972891 -0.0347863632
0.3063727072 0.0048470334 0.0570523905
0.3410285270 0.0038683601 0.0403604265
0.2788153833 0.0036224136 0.0216230327
0.3063727072 0.0048470334 0.0570523905
0.2309272832 0.0463771904 -0.0465418173
0.2045791784 0.0434439151 -0.0216029508
-0.2778519051 0.0563589608 -0.0860639140
-0.3055779869 0.0540195927 -0.0825499378
-0.3799137514 0.0491685881 -0.1039233068
-0.4022482242 0.0431747951 -0.1017550308
-0.4170551288 0.0318413646 -0.1668842034
-0.3942251676 0.0330434487 -0.1736334430
-0.3719343435 0.0310987837 -0.1756829275
-0.3942251676 0.0330434487 -0.1736334430
0.1830153707 -0.4707202210 -0.0745391123
0.1547857834 -0.4477002138 -0.0797208931
0.0821390611 -0.4474226990 -0.0878688244
0.1507586207 -0.4385199624 -0.0809788123
0.1061489740 0.4663642432 -0.1227799301
0.1581493366 0.4379409849 -0.1170223605
0.0992668541 0.4569823287 -0.1235767173
0.0629434929 0.4571210861 -0.1276506830
-0.0674704545 0.2626246758 -0.1436457133
-0.0136093772 0.2898043117 -0.1375998933
-0.0712449905 0.2484180308 -0.1442070529
-0.1038373331 0.2135182453 -0.1480719722
-0.1439787476 0.1502051698 -0.1530595707
-0.2053888969 0.0946122439 -0.1602280698
-0.1402042116 0.1644118149 -0.1524982311
-0.1144717004 0.2173783201 -0.1491624225
-0.0022857693 0.3324242467 -0.1359158747
-0.0311035760 0.3117311062 -0.1392194544
-0.0674704545 0.2626246758 -0.1436457133
-0.0417379433 0.3155911810 -0.1403099048
-0.0053710647 0.3646976115 -0.1358836459
-0.0022857693 0.3324242467 -0.1359158747
0.0309958138 0.4138040420 -0.1314573870
0.0158976700 0.3569774619 -0.1337027452
-0.0418893073 0.2410893331 -0.1410317226
-0.1765710902 0.1153053844 -0.1569244900
-0.0433267781 0.2456943975 -0.1411760860
-0.0136093772 0.2898043117 -0.1375998933
0.0386285404 0.3903128680 -0.1305083371
0.0565150310 0.3889751234 -0.1288695317
0.1043165932 0.4017483911 -0.1236325084
0.0749139787 0.4323983576 -0.1265320644
0.1263834298 0.4204805584 -0.1211076781
0.1043165932 0.4017483911 -0.1236325084
0.0822497565 0.3830162238 -0.1261573386
0.0601829199 0.3642840565 -0.1286821689
0.0528471420 0.4136661903 -0.1290568946
0.0822497565 0.3830162238 -0.1261573386
0.0839566461 0.3307344197 -0.1262910502
0.1274799804 0.3683007197 -0.1214191880
0.0905227180 0.2989693110 -0.1259547424
0.0574007993 0.2662216211 -0.1297066011
0.0289272807 0.1834169632 -0.1335139999
-0.0184313973 0.1092669444 -0.1391695579
0.0308449525 0.2017088226 -0.1331221520
0.0574007993 0.2662216211 -0.1297066011
0.0098786408 -0.3568159131 -0.1043487323
0.0240195064 -0.4135124383 -0.0974348540
-0.0078903901 -0.3322246612 -0.1085828771
-0.0115185554 -0.3643299346 -0.1059031435
-0.0470566171 -0.3151474308 -0.1143714330
-0.0718960807 -0.2622079163 -0.1220625168
-0.0363580190 -0.3113904201 -0.1135942274
-0.0078903901 -0.3322246612 -0.1085828771
-0.1181327406 -0.2167824233 -0.1313080119
-0.1429722042 -0.1638429088 -0.1389990958
-0.2069778949 -0.0938261640 -0.1524787355
-0.1465074206 -0.1496687775 -0.1407275653
-0.1074341425 -0.2130254126 -0.1305308063
-0.0754312971 -0.2480337850 -0.1237909864
-0.0184960392 -0.2897022673 -0.1137682858
-0.0718960807 -0.2622079163 -0.1220625168
-0.0184960392 -0.2897022673 -0.1137682858
-0.0474690964 -0.2455408657 -0.1209745448
-0.1785102659 -0.1146604051 -0.1474673852
-0.0459542024 -0.2409643511 -0.1212077644
0.0320472864 -0.3901544477 -0.0984124275
0.0499548936 -0.3889879819 -0.0968766052
0.0757881632 -0.3832605920 -0.0946449986
0.0458717154 -0.4135458360 -0.0950386573
0.0540380717 -0.3644301277 -0.0987145532
0.0757881632 -0.3832605920 -0.0946449986
0.0975382547 -0.4020910562 -0.0905754441
0.1192883462 -0.4209215205 -0.0865058895
0.0676218069 -0.4323763003 -0.0909691027
0.0975382547 -0.4020910562 -0.0905754441
0.0529065415 -0.2667499578 -0.1077886972
0.0274381882 -0.2022974932 -0.1165078109
-0.0202790721 -0.1098477925 -0.1301586914
0.0258284651 -0.1840698789 -0.1184014843
0.0529065415 -0.2667499578 -0.1077886972
0.0854750405 -0.2996320048 -0.1013378836
0.1212629857 -0.3689692803 -0.0910997232
0.0783748947 -0.3312024224 -0.0990695835
-0.0704468802 -0.1430858810 -0.1328014372
-0.0376865879 -0.1758059962 -0.1261782271
-0.0868787207 -0.1756180793 -0.1316955321
-0.0704468802 -0.1430858810 -0.1328014372
-0.0540150398 -0.1105536828 -0.1339073424
-0.0375831993 -0.0780214845 -0.1350132475
-0.0212547474 -0.1432737979 -0.1272841323
-0.0540150398 -0.1105536828 -0.1339073424
-0.0213581359 -0.2410583096 -0.1184491119
-0.0049262955 -0.2085261113 -0.1195550170
0.0114021564 -0.2737784247 -0.1118259018
-0.0213581359 -0.2410583096 -0.1184491119
-0.0541184283 -0.2083381944 -0.1250723220
-0.0868787207 -0.1756180793 -0.1316955321
-0.0376865879 -0.1758059962 -0.1261782271
-0.0541184283 -0.2083381944 -0.1250723220
-0.1523993055 -0.1101778490 -0.1449419523
-0.1359674650 -0.0776456507 -0.1460478574
-0.1196390131 -0.1428979641 -0.1383187422
-0.1523993055 -0.1101778490 -0.1449419523
-0.1851595978 -0.0774577338 -0.1515651624
-0.2179198902 -0.0447376187 -0.1581883725
-0.1687277574 -0.0449255356 -0.1526710675
-0.1851595978 -0.0774577338 -0.1515651624
-0.0867753322 -0.0778335676 -0.1405305525
-0.1195356246 -0.0451134525 -0.1471537626
-0.0703434917 -0.0453013694 -0.1416364576
-0.0867753322 -0.0778335676 -0.1405305525
-0.1032071726 -0.1103657659 -0.1394246473
-0.1196390131 -0.1428979641 -0.1383187422
-0.1359674650 -0.0776456507 -0.1460478574
-0.1032071726 -0.1103657659 -0.1394246473
-0.2982451545 0.0324264228 -0.0774545689
-0.2764373619 0.0352360176 -0.0656642573
-0.2932295326 0.0294429816 -0.0473172751
-0.2765022756 0.0109999170 -0.0246840320
-0.3345215837 0.0054990648 -0.0585074724
-0.2936307487 -0.0181370184 -0.0453605969
-0.2744081903 -0.0230172819 -0.0482613493
-0.1444440220 0.0049456730 -0.0329888163
-0.1439884844 0.0142500987 -0.0404813738
-0.3345215837 0.0054990648 -0.0585074724
-0.1441503787 -0.0049488486 -0.0396918370
-0.1444440220 0.0049456730 -0.0329888163
0.0565080246 -0.1929261884 -0.1139618050
0.0356617284 -0.0947530619 -0.1252646929
0.0639802357 -0.1929547327 -0.1131237346
0.0897403903 -0.2175765112 -0.1079933192
0.1221875875 -0.2912705807 -0.0976304950
0.1579783060 -0.3895007959 -0.0846514664
0.1147153764 -0.2912420364 -0.0984685654
0.0852191162 -0.2666059859 -0.1040180159
0.0132450950 -0.0946674290 -0.1277789039
0.0203247219 -0.1192178467 -0.1247436644
0.0565080246 -0.1929261884 -0.1139618050
0.0270117644 -0.1682901378 -0.1195112556
-0.0013067429 -0.0700884670 -0.1316522138
-0.0020919115 -0.1191322138 -0.1272578754
-0.0311955874 -0.0699742898 -0.1350044952
-0.0013067429 -0.0700884670 -0.1316522138
0.1507586207 -0.4385199624 -0.0809788123
0.0934550765 -0.4266489104 -0.0887374961
0.3605878026 -0.0161572601 -0.0054089426
0.0535654556 0.2296379024 -0.1304902969
0.1006487042 0.4264394580 -0.1238198713
0.1581493366 0.4379409849 -0.1170223605
0.3608904744 0.0197364241 -0.0068850332
0.2141457183 0.0063563692 -0.1081611314
0.0926019787 -0.0013657810 -0.1378564958
0.1298787220 0.0146099670 -0.1229944932
0.1023103071 -0.4756204293 -0.0831613957
0.1523937688 -0.4876898627 -0.0766237130
-0.0797959236 0.0047200567 -0.1624691775
-0.0474964369 -0.0011414808 -0.1611293780
-0.1757695470 -0.0006514698 -0.1755162692
-0.1443948970 0.0164431316 -0.1651487766
-0.0161217869 0.0159531206 -0.1507618853
-0.0802583419 0.0161981261 -0.1579553309
0.0157152815 0.0215696526 -0.1449082392
-0.0170466235 0.0389092595 -0.1417341922
0.1606150569 0.4872681899 -0.1167178526
0.1103309885 0.4755477812 -0.1222772027
0.2138085658 -0.0115206767 -0.1057639735
0.0906516214 -0.0337092031 -0.1215687691
0.1299304452 -0.0124147273 -0.1243761051
-0.2941512119 -0.0000956174 -0.1862738757
-0.2673189865 0.0067664037 -0.1816642148
-0.3931715209 0.0087828553 -0.1838540314
-0.2954491048 -0.0213800048 -0.1754268368
-0.2680840744 -0.0176489479 -0.1756742885
-0.3930842545 -0.0029732545 -0.1850325041
0.3605878026 -0.0161572601 -0.0054089426
0.3909933566 -0.0521965073 0.0089783399
0.4239216765 -0.1163418400 0.0317726058
0.4049347508 -0.0561630881 0.0119684895
0.3608904744 0.0197364241 -0.0068850332
0.3919084021 0.0563182296 0.0045157838
0.4259277304 0.1215550021 0.0219893447
0.4059166656 0.0602816488 0.0071798204
-0.1185446821 0.0636648059 -0.1044994644
-0.1816624234 0.0603869481 -0.1208966114
0.0685506608 0.0580825489 -0.0900417365
-0.0558228593 0.0614390579 -0.0847597692
-0.1758151186 0.0618283503 -0.0998978215
0.0698373055 -0.0570313000 -0.0829514607
-0.0543033065 -0.0567816016 -0.1023346011
-0.1746242554 -0.0566875377 -0.1145521210
0.4093140869 0.0372013816 0.0032723356
0.4167407541 0.0556231922 0.0079569933
0.4594278412 0.1204267431 0.0268402621
0.4167407541 0.0556231922 0.0079569933
0.3162696938 -0.0025828133 0.0004152553
0.3166049496 -0.0080417159 -0.0102556083
0.4084273750 0.0042499194 0.0634588058
0.0076630696 0.0974137465 -0.1361164819
0.0233734267 0.0676505332 -0.1347877298
0.0405393905 0.1139000166 -0.1326020971
0.0076630696 0.0974137465 -0.1361164819
0.0577053544 0.1601495000 -0.1304164645
0.0584331577 0.1981558484 -0.1299880242
0.0287566227 0.1362224266 -0.1335986612
0.0162460515 0.1205384882 -0.1350236656
0.0920372820 0.2526484669 -0.1260451992
0.0927650854 0.2906548152 -0.1256167590
0.1349521915 0.3682721754 -0.1205811176
0.0888374961 0.2980956186 -0.1259489470
0.0571971665 0.2398825984 -0.1297256780
0.0545055685 0.2055966517 -0.1303202123
0.0044632837 0.1428608982 -0.1360202297
0.0584331577 0.1981558484 -0.1299880242
0.1283748633 0.3278428342 -0.1214049777
0.1006202639 0.2757732086 -0.1249523829
0.0491223724 0.1370247583 -0.1315092808
0.0821712897 0.1920044550 -0.1272809894
0.1402465093 0.3711822465 -0.1199002314
0.1270918529 0.2903235640 -0.1215479515
0.1508351449 0.3770023887 -0.1185384588
0.1832425569 0.4132224503 -0.1143816543
0.0843460052 -0.2716443035 -0.1034305308
0.0124599265 -0.1437111758 -0.1233845655
-0.0013067429 -0.0700884670 -0.1316522138
-0.0311955874 -0.0699742898 -0.1350044952
-0.0020919115 -0.1191322138 -0.1272578754
-0.0013067429 -0.0700884670 -0.1316522138
0.0270117644 -0.1682901378 -0.1195112556
0.0565080246 -0.1929261884 -0.1139618050
0.0203247219 -0.1192178467 -0.1247436644
0.0132450950 -0.0946674290 -0.1277789039
0.0852191162 -0.2666059859 -0.1040180159
0.1147153764 -0.2912420364 -0.0984685654
0.1579783060 -0.3895007959 -0.0846514664
0.1221875875 -0.2912705807 -0.0976304950
0.0897403903 -0.2175765112 -0.1079933192
0.0639802357 -0.1929547327 -0.1131237346
0.0356617284 -0.0947530619 -0.1252646929
0.0565080246 -0.1929261884 -0.1139618050
0.2815952391 0.0029641099 0.0061852522
0.3152899358 0.0028094867 0.0093344088
0.4030865328 0.0037867173 0.0511001115
0.4070357819 0.0046956499 0.0740121661
0.4376567688 0.0073161898 0.1440139274
0.4055476601 0.0065666442 0.1192034765
0.4499637847 -0.1157720816 0.0357168122
0.4195759461 -0.0803676215 0.0211475954
0.3176911953 0.0122647877 -0.0042573041
0.3155703543 0.0074197514 -0.0005045756
0.2038077531 0.0127516441 -0.0157703099
0.1805417264 0.0216398209 -0.0179085297
-0.4239988818 0.0262853692 -0.1051631355
-0.4024720488 0.0332108264 -0.1000987857
-0.0512364893 -0.0507369281 -0.0563882788
-0.0927016921 -0.0474776734 -0.0491795464
-0.1887001206 -0.0475017122 -0.0618233438
-0.1425020544 -0.0523946007 -0.0747437418
0.0706016768 -0.0548062697 -0.0896907898
0.1268799845 -0.0481128795 -0.0983941476
0.0463839728 0.0529283507 -0.1080841222
0.1149976398 0.0501101364 -0.1015431451
0.0305872088 0.0487270711 -0.1219823341
0.0481928431 0.0463872398 -0.1244347457
0.1285938731 0.0446091966 -0.1105170568
0.0815952415 0.0482486881 -0.1129889454
-0.0727235560 0.0504731795 -0.1312072872
-0.1219156889 0.0506610964 -0.1367245922
-0.1925636426 0.0453178966 -0.1591370237
-0.1357838449 0.0535206132 -0.1310356814
-0.1766189111 0.0604555082 -0.0927779897
-0.0589897478 0.0561388993 -0.0567044033
0.1377363905 -0.0428542743 -0.0216723214
0.1106662836 -0.0482941288 -0.0400411853
0.0417080662 -0.0461395317 -0.0322890555
0.1067340626 -0.0506855302 -0.0481639438
0.0822497565 0.3830162238 -0.1261573386
0.0528471420 0.4136661903 -0.1290568946
0.0601829199 0.3642840565 -0.1286821689
0.0822497565 0.3830162238 -0.1261573386
0.1043165932 0.4017483911 -0.1236325084
0.1263834298 0.4204805584 -0.1211076781
0.0749139787 0.4323983576 -0.1265320644
0.1043165932 0.4017483911 -0.1236325084
0.1909480678 0.4700139895 -0.1132258319
0.1623313511 0.4471245230 -0.1165196331
0.0896846287 0.4474020379 -0.1246675645
0.1581493366 0.4379409849 -0.1170223605
0.2038893860 -0.0383581901 -0.0182389240
0.1803502643 -0.0314608857 -0.0180100447
0.0223246824 -0.0264240048 -0.0321339854
0.0414976191 -0.0213585429 -0.0295686863
0.1183343564 -0.0170608634 -0.0211439545
0.0414976191 -0.0213585429 -0.0295686863
0.2976132183 0.0046646003 0.0508200865
0.2838345563 0.0040522904 0.0331054076
0.3560860462 0.0051579906 0.0748075513
0.3251705422 0.0058892201 0.0862494443
0.3222233992 0.0068417799 0.1088082647
0.3764008953 0.0076365488 0.1392435159
0.0982831445 -0.4664401779 -0.0844193149
0.1507586207 -0.4385199624 -0.0809788123
0.0915593958 -0.4570409345 -0.0859884578
0.0552360346 -0.4569021770 -0.0900624235
-0.4029028311 -0.0344546786 -0.0985625991
-0.4244465437 -0.0074601381 -0.1023211514
-0.3726016108 -0.0314528165 -0.1718640705
-0.3935692053 -0.0107462153 -0.1809734399
-0.4176798188 -0.0284242233 -0.1633671042
-0.3984390881 -0.0411556284 -0.1385894350
-0.3808776752 -0.0402768485 -0.0983754609
-0.3999361558 -0.0418493730 -0.1252652514
-0.2787137965 -0.0486158175 -0.0819547091
-0.3030843847 -0.0536809879 -0.1084510564
-0.3058018115 0.0440556240 -0.0808936927
0.1191093134 0.0416823371 -0.0260526821
0.1381925065 0.0361051674 -0.0230497158
0.0419234669 0.0291425097 -0.0316454898
0.1186827764 0.0242580840 -0.0228431534
0.2114464998 0.0454700154 -0.0827627834
-0.3298531967 0.0575017492 -0.1096055591
-0.3021271149 0.0598411174 -0.1131195354
-0.3748700534 0.0476927715 -0.1489430385
-0.3977000147 0.0464906874 -0.1421937989
0.3764008953 0.0076365488 0.1392435159
0.3847786624 0.0085026678 0.1620225477
0.1898281612 0.0369922023 -0.1001832212
0.2136762604 0.0169999661 -0.1036129419
0.2917708612 0.0275571104 -0.0799547737
0.3253407578 0.0065706375 -0.0801503289
0.2302582535 -0.0440158667 -0.0436555142
0.2078104233 -0.0486235030 -0.0535484117
-0.3936803941 0.0202786380 -0.1789253914
-0.3223633013 0.0255902148 -0.1774721443
-0.2950830831 0.0220263110 -0.1772118766
0.0552360346 -0.4569021770 -0.0900624235
0.0955865585 -0.4662211858 -0.0847305386
0.1628401088 -0.4660607166 -0.0772050547
0.1023103071 -0.4756204293 -0.0831613957
0.1692134710 0.4565064375 -0.1157228459
0.1103309885 0.4755477812 -0.1222772027
0.1692134710 0.4565064375 -0.1157228459
0.1860250988 0.4563378706 -0.1138328930
-0.0967983458 0.1081054743 -0.1478976050
-0.1323829610 0.0766647062 -0.1521379881
-0.1104058635 0.1397341593 -0.1491745268
-0.0967983458 0.1081054743 -0.1478976050
-0.0831908282 0.0764767893 -0.1466206831
-0.0695833105 0.0448481043 -0.1453437613
-0.1187754433 0.0450360212 -0.1508610663
-0.0831908282 0.0764767893 -0.1466206831
-0.1815750938 0.0768526231 -0.1576552931
-0.1679675762 0.0452239381 -0.1563783712
-0.2171597090 0.0454118550 -0.1618956762
-0.1815750938 0.0768526231 -0.1576552931
-0.1459904787 0.1082933912 -0.1534149100
-0.1104058635 0.1397341593 -0.1491745268
-0.1323829610 0.0766647062 -0.1521379881
-0.1459904787 0.1082933912 -0.1534149100
-0.0392366331 0.2026156955 -0.1406937606
-0.0256291155 0.1709870105 -0.1394168388
-0.0748212483 0.1711749274 -0.1449341437
-0.0392366331 0.2026156955 -0.1406937606
-0.0036520180 0.2340564636 -0.1364533775
0.0319325972 0.2654972317 -0.1322129944
0.0099554997 0.2024277786 -0.1351764557
-0.0036520180 0.2340564636 -0.1364533775
-0.0476062130 0.1079175574 -0.1423803000
-0.0120215978 0.1393583255 -0.1381399169
-0.0339986953 0.0762888724 -0.1411033782
-0.0476062130 0.1079175574 -0.1423803000
-0.0612137306 0.1395462424 -0.1436572219
-0.0748212483 0.1711749274 -0.1449341437
-0.0256291155 0.1709870105 -0.1394168388
-0.0612137306 0.1395462424 -0.1436572219
0.0114021564 -0.2737784247 -0.1118259018
0.0124095067 -0.2365961035 -0.1148549356
-0.0294189734 -0.1106476412 -0.1311486899
0.0169952949 -0.2343180212 -0.1144371736
-0.2193699548 0.0062336466 -0.0170330539
-0.2386566285 0.0135510549 -0.0209734485
-0.3006430293 0.0294050790 -0.0599259934
-0.2179985591 0.0296938777 -0.0359571384
-0.2363140642 0.0338697451 -0.0449155421
-0.2184068141 -0.0187208591 -0.0339661326
-0.2382982386 -0.0135340926 -0.0288392533
-0.2147497461 -0.0266386955 -0.0630942221
-0.2349676889 -0.0272681205 -0.0571281619
0.0124599265 -0.1437111758 -0.1233845655
0.0843460052 -0.2716443035 -0.1034305308
0.4087175463 -0.0335420394 0.0061815855
0.4158362670 -0.0516394394 0.0123680579
0.4574393844 -0.1153832569 0.0365377040
0.4158362670 -0.0516394394 0.0123680579
-0.0027793122 0.0677504382 -0.1377209760
-0.0326681566 0.0678646154 -0.1410732573
-0.0080299817 0.1140855545 -0.1380495543
-0.0027793122 0.0677504382 -0.1377209760
0.0166081932 0.1603064937 -0.1350258514
0.0438717029 0.1833598746 -0.1318378592
0.0143866516 0.1139999217 -0.1355353433
0.0095397753 0.0908609078 -0.1362091245
0.0658845431 0.2527483719 -0.1289784454
0.0931480528 0.2758017529 -0.1257904532
0.1274799804 0.3683007197 -0.1214191880
0.1006202639 0.2757732086 -0.1249523829
0.0748713182 0.2063989835 -0.1282308319
0.0513439140 0.1833313303 -0.1309997889
0.0319564086 0.0907752749 -0.1336949134
0.0438717029 0.1833598746 -0.1318378592
0.1832425569 0.4132224503 -0.1143816543
0.1508351449 0.3770023887 -0.1185384588
0.1270918529 0.2903235640 -0.1215479515
0.1402465093 0.3711822465 -0.1199002314
0.0821712897 0.1920044550 -0.1272809894
0.0491223724 0.1370247583 -0.1315092808
0.1006202639 0.2757732086 -0.1249523829
0.1283748633 0.3278428342 -0.1214049777
0.4520092943 0.1182645544 0.0235763381
0.4210696543 0.0796919662 0.0095333908
0.4210696543 0.0796919662 0.0095333908
-0.0488836919 0.0332927275 -0.1475878383
-0.1424466731 0.0221738408 -0.1626474118
-0.1920473761 0.0319360220 -0.1641958218
-0.0937169586 0.0334639933 -0.1526162603
-0.1917570466 0.0249185774 -0.1670234024
-0.2161219038 0.0192735011 -0.1720389781
-0.0808268846 -0.0222118470 -0.1541944473
-0.0498602988 -0.0410750910 -0.1414133732
-0.1776414237 -0.0319779087 -0.1598936347
-0.1453699106 -0.0287225548 -0.1579939056
-0.0175887858 -0.0378197371 -0.1395136440
0.0153351909 -0.0235050842 -0.1430545874
-0.0808268846 -0.0222118470 -0.1541944473
-0.0162838585 -0.0157011392 -0.1503949890
0.3976949607 -0.0559353765 0.0109377137
0.4022023060 -0.1156587053 0.0286802782
0.3837535665 -0.0519687957 0.0079475641
0.3605878026 -0.0161572601 -0.0054089426
0.3986733560 0.0600919919 0.0061662084
0.4041978017 0.1209860315 0.0189485086
0.3846650925 0.0561285727 0.0035021718
0.3608904744 0.0197364241 -0.0068850332
3 30 16 13
3 190 191 30
3 12 198 184
3 41 76 200
3 5 982 198
3 39 982 5
3 153 76 41
3 59 983 5
3 182 983 59
3 563 984 212
3 84 984 563
3 212 985 563
3 213 985 212
3 564 986 213
3 82 986 564
3 213 987 564
3 212 987 213
3 565 988 214
3 84 988 565
3 565 989 212
3 214 989 565
3 566 990 214
3 179 990 566
3 566 991 84
3 214 991 566
3 6 992 21
3 182 992 6
3 215 993 68
3 72 993 215
3 68 994 215
3 32 994 68
3 199 8 0
3 8 995 0
3 63 995 8
3 567 996 123
3 120 996 567
3 176 997 123
3 567 997 176
3 106 124 70
3 136 184 60
3 39 998 184
3 46 998 39
3 216 568 40
3 39 568 216
3 40 569 216
3 47 569 40
3 94 999 570
3 195 999 94
3 570 1000 55
3 195 1000 570
3 6 1001 40
3 61 1001 6
3 102 1002 94
3 162 1002 102
3 185 0 129
3 81 148 211
3 0 63 129
3 102 1003 55
3 94 1003 102
3 191 81 211
3 207 1004 151
3 165 1004 207
3 571 1005 19
3 162 1005 571
3 94 1006 19
3 571 1006 94
3 28 1007 164
3 165 1007 28
3 164 1008 150
3 173 1008 164
3 153 150 29
3 202 1009 148
3 211 1009 202
3 30 211 202
3 174 207 189
3 217 572 174
3 173 572 217
3 174 573 217
3 27 573 174
3 112 52 141
3 173 1010 29
3 206 1010 173
3 76 29 15
3 38 1011 574
3 123 1011 38
3 574 1012 120
3 123 1012 574
3 196 199 185
3 185 23 22
3 12 136 171
3 171 136 168
3 142 1013 166
3 218 1013 142
3 218 1014 86
3 142 1014 218
3 575 1015 220
3 132 1015 575
3 575 1016 34
3 220 1016 575
3 576 1017 220
3 219 1017 576
3 576 1018 132
3 220 1018 576
3 221 1019 219
3 577 1019 221
3 577 1020 130
3 221 1020 577
3 219 1021 221
3 578 1021 219
3 578 1022 132
3 219 1022 578
3 172 53 51
3 192 579 172
3 145 579 192
3 192 155 145
3 192 146 155
3 121 156 162
3 112 1023 121
3 159 1023 112
3 162 156 157
3 160 1024 159
3 156 1024 160
3 121 1025 102
3 118 1025 121
3 580 1026 222
3 112 1026 580
3 580 1027 121
3 222 1027 580
3 581 1028 92
3 112 1028 581
3 581 1029 222
3 92 1029 581
3 112 1030 92
3 106 1030 112
3 582 1031 92
3 109 1031 582
3 582 1032 106
3 92 1032 582
3 583 1033 89
3 110 1033 583
3 89 1034 583
3 223 1034 89
3 584 1035 223
3 106 1035 584
3 223 1036 584
3 89 1036 223
3 110 103 89
3 103 100 89
3 110 91 103
3 109 585 99
3 89 585 109
3 100 1037 93
3 103 1037 100
3 52 53 141
3 53 54 141
3 224 1038 132
3 131 1038 224
3 224 1039 34
3 132 1039 224
3 57 1040 204
3 225 1040 57
3 225 1041 203
3 57 1041 225
3 123 18 176
3 18 178 176
3 125 1042 195
3 36 1042 125
3 226 586 116
3 195 586 226
3 116 587 226
3 125 587 116
3 94 588 195
3 116 588 94
3 38 194 123
3 38 36 194
3 85 1043 178
3 19 1043 85
3 116 589 85
3 227 589 116
3 227 590 19
3 116 590 227
3 94 591 116
3 19 591 94
3 154 592 11
3 229 592 154
3 229 593 228
3 154 593 229
3 230 594 228
3 179 594 230
3 228 595 230
3 154 595 228
3 231 1044 154
3 10 1044 231
3 154 1045 231
3 11 1045 154
3 70 160 159
3 70 161 160
3 121 1046 118
3 102 1046 121
3 596 1047 232
3 92 1047 596
3 596 1048 118
3 232 1048 596
3 92 1049 597
3 112 1049 92
3 597 1050 232
3 112 1050 597
3 112 1051 106
3 92 1051 112
3 598 1052 92
3 106 1052 598
3 598 1053 109
3 92 1053 598
3 109 89 110
3 89 103 110
3 89 100 103
3 103 91 110
3 109 599 89
3 99 599 109
3 100 1054 103
3 93 1054 100
3 158 160 42
3 25 600 160
3 233 600 25
3 233 601 64
3 25 601 233
3 64 56 20
3 56 65 20
3 50 49 55
3 54 1055 50
3 53 1055 54
3 102 55 49
3 112 1056 52
3 49 1056 112
3 602 1057 35
3 128 1057 602
3 35 1058 602
3 50 1058 35
3 115 71 117
3 117 71 41
3 19 603 235
3 180 603 19
3 235 604 234
3 180 604 235
3 236 605 234
3 138 605 236
3 236 606 180
3 234 606 236
3 38 1059 44
3 205 1059 38
3 138 1060 178
3 170 1060 138
3 117 108 171
3 139 205 120
3 171 168 205
3 607 1061 240
3 239 1061 607
3 607 1062 238
3 240 1062 607
3 608 1063 240
3 237 1063 608
3 608 1064 239
3 240 1064 608
3 609 1065 241
3 239 1065 609
3 609 1066 179
3 241 1066 609
3 610 1067 241
3 238 1067 610
3 610 1068 239
3 241 1068 610
3 611 1069 243
3 242 1069 611
3 611 1070 238
3 243 1070 611
3 612 1071 243
3 82 1071 612
3 612 1072 242
3 243 1072 612
3 613 1073 244
3 242 1073 613
3 613 1074 237
3 244 1074 613
3 614 1075 244
3 238 1075 614
3 614 1076 242
3 244 1076 614
3 615 1077 247
3 246 1077 615
3 615 1078 245
3 247 1078 615
3 616 1079 247
3 237 1079 616
3 616 1080 246
3 247 1080 616
3 617 1081 248
3 246 1081 617
3 617 1082 66
3 248 1082 617
3 618 1083 248
3 245 1083 618
3 618 1084 246
3 248 1084 618
3 619 1085 250
3 249 1085 619
3 619 1086 245
3 250 1086 619
3 620 1087 250
3 179 1087 620
3 620 1088 249
3 250 1088 620
3 621 1089 251
3 249 1089 621
3 621 1090 237
3 251 1090 621
3 622 1091 251
3 245 1091 622
3 622 1092 249
3 251 1092 622
3 254 1093 252
3 623 1093 254
3 623 1094 66
3 254 1094 623
3 624 1095 252
3 254 1095 624
3 624 1096 253
3 252 1096 624
3 255 1097 253
3 625 1097 255
3 625 1098 82
3 255 1098 625
3 626 1099 253
3 255 1099 626
3 253 1100 626
3 252 1100 253
3 627 1101 256
3 66 1101 627
3 627 1102 257
3 256 1102 627
3 628 1103 257
3 252 1103 628
3 257 1104 628
3 256 1104 257
3 629 1105 256
3 258 1105 629
3 629 1106 66
3 256 1106 629
3 630 1107 258
3 10 1107 630
3 630 1108 66
3 258 1108 630
3 201 631 179
3 66 631 201
3 259 632 88
3 179 632 259
3 88 633 259
3 201 633 88
3 88 1109 188
3 260 1109 88
3 260 1110 179
3 88 1110 260
3 262 634 188
3 154 634 262
3 188 635 262
3 261 635 188
3 263 636 261
3 179 636 263
3 261 637 263
3 188 637 261
3 154 126 188
3 26 638 154
3 126 638 26
3 66 78 10
3 135 1111 78
3 10 1111 135
3 265 639 264
3 10 639 265
3 265 640 154
3 264 640 265
3 266 641 264
3 135 641 266
3 266 642 10
3 264 642 266
3 180 643 267
3 165 643 180
3 267 644 28
3 165 644 267
3 268 645 164
3 28 645 268
3 138 646 164
3 268 646 138
3 83 647 27
3 84 647 83
3 270 1112 269
3 82 1112 270
3 270 1113 84
3 269 1113 270
3 271 1114 82
3 269 1114 271
3 206 1115 82
3 271 1115 206
3 16 137 13
3 16 79 137
3 648 1116 272
3 83 1116 648
3 648 1117 79
3 272 1117 648
3 83 1118 649
3 27 1118 83
3 649 1119 272
3 27 1119 649
3 23 197 22
3 23 128 197
3 650 1120 273
3 33 1120 650
3 650 1121 128
3 273 1121 650
3 651 1122 33
3 273 1122 651
3 47 1123 33
3 651 1123 47
3 196 74 199
3 74 127 199
3 74 21 182
3 132 652 59
3 131 652 132
3 653 1124 274
3 5 1124 653
3 653 1125 59
3 274 1125 653
3 5 1126 654
3 130 1126 5
3 654 1127 274
3 130 1127 654
3 275 655 47
3 183 655 275
3 33 656 47
3 275 656 33
3 277 657 276
3 75 657 277
3 277 658 33
3 276 658 277
3 278 659 75
3 276 659 278
3 46 660 75
3 278 660 46
3 190 14 191
3 14 80 191
3 14 151 165
3 661 1128 282
3 281 1128 661
3 661 1129 280
3 282 1129 661
3 662 1130 282
3 279 1130 662
3 662 1131 281
3 282 1131 662
3 663 1132 283
3 281 1132 663
3 663 1133 34
3 283 1133 663
3 664 1134 283
3 280 1134 664
3 664 1135 281
3 283 1135 664
3 665 1136 285
3 284 1136 665
3 665 1137 280
3 285 1137 665
3 666 1138 285
3 144 1138 666
3 666 1139 284
3 285 1139 666
3 667 1140 286
3 284 1140 667
3 667 1141 279
3 286 1141 667
3 668 1142 286
3 280 1142 668
3 668 1143 284
3 286 1143 668
3 669 1144 289
3 288 1144 669
3 669 1145 287
3 289 1145 669
3 670 1146 289
3 279 1146 670
3 670 1147 288
3 289 1147 670
3 671 1148 290
3 288 1148 671
3 671 1149 130
3 290 1149 671
3 672 1150 290
3 287 1150 672
3 672 1151 288
3 290 1151 672
3 673 1152 292
3 291 1152 673
3 673 1153 287
3 292 1153 673
3 674 1154 292
3 34 1154 674
3 674 1155 291
3 292 1155 674
3 675 1156 293
3 291 1156 675
3 675 1157 279
3 293 1157 675
3 676 1158 293
3 287 1158 676
3 676 1159 291
3 293 1159 676
3 677 1160 296
3 144 1160 677
3 677 1161 203
3 296 1161 677
3 678 1162 295
3 144 1162 678
3 678 1163 296
3 295 1163 678
3 297 1164 295
3 679 1164 297
3 679 1165 294
3 297 1165 679
3 680 1166 295
3 297 1166 680
3 680 1167 144
3 295 1167 680
3 298 1168 294
3 681 1168 298
3 681 1169 299
3 298 1169 681
3 682 1170 299
3 130 1170 682
3 299 1171 682
3 298 1171 299
3 683 1172 294
3 298 1172 683
3 683 1173 300
3 294 1173 683
3 684 1174 300
3 144 1174 684
3 300 1175 684
3 294 1175 300
3 9 685 144
3 34 685 9
3 87 686 9
3 301 686 87
3 301 687 34
3 87 687 301
3 302 1176 87
3 34 1176 302
3 87 1177 302
3 24 1177 87
3 303 688 24
3 304 688 303
3 304 689 34
3 303 689 304
3 24 690 303
3 305 690 24
3 305 691 57
3 24 691 305
3 24 4 57
3 186 692 4
3 57 692 186
3 203 133 144
3 73 1178 203
3 133 1178 73
3 73 1179 186
3 203 1179 73
3 1 181 12
3 97 140 181
3 134 1180 202
3 79 1180 134
3 693 1181 166
3 203 1181 693
3 693 1182 306
3 166 1182 693
3 694 1183 306
3 86 1183 694
3 306 1184 694
3 166 1184 306
3 35 43 54
3 157 161 169
3 117 139 115
3 695 1185 157
3 162 1185 695
3 157 1186 695
3 177 1186 157
3 171 139 117
3 162 1187 696
3 80 1187 162
3 696 1188 307
3 80 1188 696
3 697 1189 307
3 180 1189 697
3 697 1190 80
3 307 1190 697
3 698 1191 92
3 109 1191 698
3 698 1192 308
3 92 1192 698
3 699 1193 308
3 118 1193 699
3 308 1194 699
3 92 1194 308
3 89 700 100
3 99 700 89
3 701 1195 111
3 93 1195 701
3 701 1196 103
3 111 1196 701
3 702 1197 309
3 11 1197 702
3 702 1198 32
3 309 1198 702
3 703 1199 11
3 309 1199 703
3 72 1200 11
3 703 1200 72
3 176 1201 120
3 170 1201 176
3 71 7 153
3 115 120 7
3 41 108 117
3 175 704 310
3 82 704 175
3 310 705 84
3 82 705 310
3 143 1202 2
3 706 1202 143
3 706 1203 82
3 143 1203 706
3 31 1204 69
3 143 1204 31
3 311 1205 45
3 3 1205 311
3 134 1206 45
3 311 1206 134
3 147 1207 707
3 79 1207 147
3 707 1208 134
3 79 1208 707
3 312 708 79
3 83 708 312
3 147 709 79
3 312 709 147
3 143 1209 15
3 313 1209 143
3 313 1210 31
3 143 1210 313
3 7 710 153
3 170 710 7
3 170 1211 150
3 314 1211 170
3 314 1212 138
3 170 1212 314
3 206 711 315
3 82 711 206
3 315 712 143
3 82 712 315
3 210 31 69
3 41 200 31
3 44 713 38
3 75 713 44
3 36 714 316
3 75 714 36
3 316 715 33
3 75 715 316
3 716 1213 195
3 317 1213 716
3 33 1214 195
3 716 1214 33
3 717 1215 317
3 128 1215 717
3 717 1216 33
3 317 1216 717
3 319 1217 318
3 99 1217 319
3 319 1218 92
3 318 1218 319
3 320 1219 318
3 118 1219 320
3 320 1220 99
3 318 1220 320
3 127 718 199
3 77 718 127
3 77 719 8
3 209 719 77
3 43 720 63
3 321 720 43
3 321 721 35
3 43 721 321
3 35 1221 129
3 322 1221 35
3 322 1222 128
3 35 1222 322
3 67 722 198
3 323 722 67
3 323 723 130
3 67 723 323
3 46 1223 324
3 75 1223 46
3 324 1224 44
3 75 1224 324
3 60 1225 724
3 44 1225 60
3 724 1226 205
3 44 1226 724
3 12 1227 725
3 181 1227 12
3 725 1228 67
3 181 1228 725
3 325 726 93
3 89 726 325
3 325 727 99
3 93 727 325
3 91 95 111
3 62 728 326
3 127 728 62
3 326 729 131
3 127 729 326
3 77 730 167
3 127 730 77
3 209 731 107
3 77 731 209
3 191 732 327
3 80 732 191
3 327 733 177
3 80 733 327
3 208 1229 734
3 67 1229 208
3 734 1230 181
3 67 1230 734
3 130 735 37
3 67 735 130
3 328 736 130
3 132 736 328
3 130 737 328
3 37 737 130
3 81 738 329
3 177 738 81
3 329 739 169
3 177 739 329
3 3 740 148
3 134 740 3
3 97 1 171
3 108 41 210
3 54 43 63
3 119 107 3
3 119 161 70
3 11 1231 72
3 741 1231 11
3 741 1232 330
3 11 1232 741
3 742 1233 330
3 10 1233 742
3 330 1234 742
3 11 1234 330
3 331 1235 166
3 743 1235 331
3 743 1236 204
3 331 1236 743
3 744 1237 166
3 331 1237 744
3 744 1238 203
3 166 1238 744
3 124 141 54
3 334 1239 332
3 745 1239 334
3 745 1240 144
3 334 1240 745
3 746 1241 332
3 334 1241 746
3 746 1242 333
3 332 1242 746
3 335 1243 333
3 747 1243 335
3 747 1244 130
3 335 1244 747
3 748 1245 333
3 335 1245 748
3 333 1246 748
3 332 1246 333
3 749 1247 336
3 144 1247 749
3 749 1248 337
3 336 1248 749
3 750 1249 337
3 332 1249 750
3 337 1250 750
3 336 1250 337
3 751 1251 336
3 338 1251 751
3 751 1252 144
3 336 1252 751
3 752 1253 338
3 203 1253 752
3 752 1254 144
3 338 1254 752
3 339 1255 9
3 340 1255 339
3 340 1256 130
3 339 1256 340
3 341 1257 9
3 339 1257 341
3 9 1258 341
3 144 1258 9
3 144 133 203
3 73 1259 133
3 203 1259 73
3 73 1260 203
3 186 1260 73
3 753 1261 343
3 342 1261 753
3 753 1262 203
3 343 1262 753
3 754 1263 343
3 57 1263 754
3 754 1264 342
3 343 1264 754
3 755 1265 344
3 342 1265 755
3 755 1266 186
3 344 1266 755
3 756 1267 344
3 203 1267 756
3 756 1268 342
3 344 1268 756
3 186 757 57
3 4 757 186
3 4 24 57
3 346 1269 24
3 758 1269 346
3 758 1270 57
3 346 1270 758
3 24 1271 346
3 759 1271 24
3 759 1272 345
3 24 1272 759
3 347 1273 345
3 760 1273 347
3 760 1274 132
3 347 1274 760
3 761 1275 345
3 347 1275 761
3 761 1276 24
3 345 1276 761
3 87 762 24
3 348 762 87
3 348 763 132
3 87 763 348
3 9 764 87
3 350 764 9
3 350 765 349
3 9 765 350
3 351 766 349
3 130 766 351
3 349 767 351
3 9 767 349
3 768 1277 354
3 66 1277 768
3 768 1278 10
3 354 1278 768
3 769 1279 353
3 66 1279 769
3 769 1280 354
3 353 1280 769
3 355 1281 353
3 770 1281 355
3 770 1282 352
3 355 1282 770
3 771 1283 353
3 355 1283 771
3 771 1284 66
3 353 1284 771
3 356 1285 352
3 772 1285 356
3 772 1286 357
3 356 1286 772
3 773 1287 357
3 82 1287 773
3 357 1288 773
3 356 1288 357
3 774 1289 352
3 356 1289 774
3 774 1290 358
3 352 1290 774
3 775 1291 358
3 66 1291 775
3 358 1292 775
3 352 1292 358
3 201 1293 66
3 360 1293 201
3 360 1294 359
3 201 1294 360
3 361 1295 359
3 82 1295 361
3 359 1296 361
3 201 1296 359
3 10 78 66
3 135 1297 10
3 78 1297 135
3 135 1298 26
3 10 1298 135
3 776 1299 363
3 362 1299 776
3 776 1300 10
3 363 1300 776
3 777 1301 363
3 26 1301 777
3 777 1302 362
3 363 1302 777
3 778 1303 364
3 362 1303 778
3 778 1304 154
3 364 1304 778
3 779 1305 364
3 10 1305 779
3 779 1306 362
3 364 1306 779
3 26 780 126
3 154 780 26
3 154 188 126
3 781 1307 365
3 188 1307 781
3 781 1308 366
3 365 1308 781
3 782 1309 366
3 84 1309 782
3 366 1310 782
3 365 1310 366
3 783 1311 188
3 365 1311 783
3 188 1312 783
3 367 1312 188
3 784 1313 367
3 154 1313 784
3 367 1314 784
3 188 1314 367
3 368 785 88
3 84 785 368
3 88 786 368
3 188 786 88
3 373 1315 372
3 371 1315 373
3 373 1316 370
3 372 1316 373
3 374 1317 372
3 369 1317 374
3 374 1318 371
3 372 1318 374
3 376 1319 375
3 371 1319 376
3 376 1320 84
3 375 1320 376
3 377 1321 375
3 370 1321 377
3 377 1322 371
3 375 1322 377
3 380 1323 379
3 378 1323 380
3 380 1324 370
3 379 1324 380
3 381 1325 379
3 201 1325 381
3 381 1326 378
3 379 1326 381
3 383 1327 382
3 378 1327 383
3 383 1328 369
3 382 1328 383
3 384 1329 382
3 370 1329 384
3 384 1330 378
3 382 1330 384
3 388 1331 387
3 386 1331 388
3 388 1332 385
3 387 1332 388
3 389 1333 387
3 369 1333 389
3 389 1334 386
3 387 1334 389
3 391 1335 390
3 386 1335 391
3 391 1336 82
3 390 1336 391
3 392 1337 390
3 385 1337 392
3 392 1338 386
3 390 1338 392
3 395 1339 394
3 393 1339 395
3 395 1340 385
3 394 1340 395
3 396 1341 394
3 84 1341 396
3 396 1342 393
3 394 1342 396
3 398 1343 397
3 393 1343 398
3 398 1344 369
3 397 1344 398
3 399 1345 397
3 385 1345 399
3 399 1346 393
3 397 1346 399
3 193 787 163
3 104 787 193
3 400 1347 36
3 194 1347 400
3 163 1348 36
3 400 1348 163
3 788 1349 163
3 152 1349 788
3 163 1350 788
3 90 1350 163
3 125 789 36
3 193 789 125
3 152 1351 123
3 105 1351 152
3 90 790 105
3 48 790 90
3 123 194 152
3 791 1352 48
3 58 1352 791
3 178 1353 48
3 791 1353 178
3 104 792 90
3 17 792 104
3 193 1354 104
3 116 1354 193
3 125 1355 193
3 116 1355 125
3 17 793 48
3 85 793 17
3 58 1356 105
3 123 1356 58
3 85 1357 116
3 17 1357 85
3 17 1358 116
3 104 1358 17
3 58 18 123
3 403 1359 401
3 794 1359 403
3 794 1360 83
3 403 1360 794
3 795 1361 401
3 403 1361 795
3 401 1362 795
3 402 1362 401
3 404 1363 402
3 796 1363 404
3 796 1364 11
3 404 1364 796
3 797 1365 402
3 404 1365 797
3 402 1366 797
3 401 1366 402
3 798 1367 405
3 83 1367 798
3 406 1368 405
3 798 1368 406
3 799 1369 406
3 401 1369 799
3 406 1370 799
3 405 1370 406
3 800 1371 407
3 83 1371 800
3 800 1372 405
3 407 1372 800
3 801 1373 407
3 84 1373 801
3 801 1374 83
3 407 1374 801
3 154 1375 11
3 408 1375 154
3 408 1376 10
3 154 1376 408
3 20 65 56
3 20 56 64
3 20 802 42
3 64 802 20
3 119 1377 42
3 158 1377 119
3 34 1378 57
3 132 1378 34
3 409 1379 57
3 203 1379 409
3 57 1380 409
3 204 1380 57
3 155 146 192
3 145 155 192
3 187 803 119
3 410 803 187
3 410 804 145
3 187 804 410
3 119 1381 51
3 172 1381 119
3 98 1382 101
3 167 1382 98
3 411 1383 101
3 114 1383 411
3 101 1384 411
3 62 1384 101
3 207 30 13
3 207 151 14
3 68 1385 32
3 412 1385 68
3 412 1386 72
3 68 1386 412
3 413 1387 415
3 414 1387 413
3 415 1388 114
3 414 1388 415
3 416 1389 414
3 113 1389 416
3 414 1390 416
3 413 1390 414
3 418 1391 417
3 114 1391 418
3 417 1392 418
3 413 1392 417
3 419 1393 131
3 114 1393 419
3 419 1394 417
3 131 1394 419
3 98 805 107
3 45 805 98
3 420 1395 142
3 86 1395 420
3 142 1396 420
3 166 1396 142
3 45 1397 147
3 98 1397 45
3 69 122 97
3 98 806 167
3 107 806 98
3 421 1398 147
3 83 1398 421
3 147 1399 421
3 101 1399 147
3 422 1400 113
3 96 1400 422
3 37 1401 113
3 422 1401 37
3 96 1402 122
3 208 1402 96
3 175 84 83
3 97 122 140
3 423 1403 175
3 2 1403 423
3 113 1404 175
3 423 1404 113
3 185 22 197
3 2 1405 69
3 96 1405 2
3 21 74 196
3 425 1406 42
3 158 1406 425
3 425 1407 424
3 42 1407 425
3 426 1408 424
3 20 1408 426
3 424 1409 426
3 42 1409 424
3 427 807 65
3 42 807 427
3 65 808 427
3 20 808 65
3 429 1410 172
3 51 1410 429
3 429 1411 428
3 172 1411 429
3 430 1412 428
3 192 1412 430
3 428 1413 430
3 172 1413 428
3 431 809 146
3 172 809 431
3 146 810 431
3 192 810 146
3 88 188 126
3 201 66 78
3 87 24 4
3 9 144 133
3 12 184 136
3 198 39 184
3 432 811 182
3 5 811 432
3 40 812 182
3 432 812 40
3 433 1414 39
3 40 1414 433
3 39 1415 433
3 5 1415 39
3 40 1416 6
3 182 1416 40
3 199 0 185
3 106 70 159
3 106 159 112
3 136 60 168
3 184 46 60
3 183 1417 47
3 434 1417 183
3 434 1418 39
3 183 1418 434
3 46 813 183
3 39 813 46
3 47 814 61
3 40 814 47
3 185 129 23
3 191 211 30
3 174 815 207
3 165 815 174
3 435 816 165
3 164 816 435
3 174 817 165
3 435 817 174
3 436 818 173
3 174 818 436
3 173 819 436
3 164 819 173
3 150 173 29
3 153 29 76
3 30 202 16
3 27 1419 189
3 174 1419 27
3 149 1420 27
3 820 1420 149
3 820 1421 173
3 149 1421 820
3 206 821 149
3 173 821 206
3 112 141 124
3 112 124 106
3 29 206 15
3 76 15 200
3 187 1422 822
3 172 1422 187
3 822 1423 437
3 172 1423 822
3 823 1424 437
3 145 1424 823
3 823 1425 172
3 437 1425 823
3 172 187 53
3 121 162 102
3 156 1426 159
3 121 1426 156
3 160 1427 156
3 161 1427 160
3 156 161 157
3 118 824 92
3 121 824 118
3 109 1428 89
3 106 1428 109
3 825 1429 440
3 34 1429 825
3 825 1430 131
3 440 1430 825
3 826 1431 440
3 439 1431 826
3 826 1432 34
3 440 1432 826
3 441 1433 439
3 827 1433 441
3 827 1434 438
3 441 1434 827
3 441 1435 828
3 439 1435 441
3 828 1436 34
3 439 1436 828
3 442 1437 438
3 829 1437 442
3 829 1438 443
3 442 1438 829
3 830 1439 443
3 57 1439 830
3 443 1440 830
3 442 1440 443
3 438 1441 442
3 831 1441 438
3 831 1442 444
3 438 1442 831
3 832 1443 444
3 34 1443 832
3 444 1444 832
3 438 1444 444
3 447 1445 445
3 57 1445 447
3 445 1446 447
3 446 1446 445
3 448 1447 446
3 131 1447 448
3 446 1448 448
3 445 1448 446
3 449 1449 57
3 450 1449 449
3 450 1450 445
3 449 1450 450
3 451 1451 57
3 449 1451 451
3 57 1452 451
3 204 1452 57
3 833 1453 179
3 11 1453 833
3 179 1454 833
3 84 1454 179
3 834 1455 454
3 83 1455 834
3 834 1456 84
3 454 1456 834
3 835 1457 454
3 453 1457 835
3 835 1458 83
3 454 1458 835
3 455 1459 453
3 836 1459 455
3 836 1460 452
3 455 1460 836
3 455 1461 837
3 453 1461 455
3 837 1462 83
3 453 1462 837
3 456 1463 452
3 838 1463 456
3 838 1464 457
3 456 1464 838
3 839 1465 457
3 11 1465 839
3 457 1466 839
3 456 1466 457
3 452 1467 456
3 840 1467 452
3 840 1468 458
3 452 1468 840
3 841 1469 458
3 83 1469 841
3 458 1470 841
3 452 1470 458
3 121 1471 842
3 118 1471 121
3 842 1472 112
3 118 1472 842
3 460 1473 109
3 106 1473 460
3 459 1474 109
3 460 1474 459
3 461 1475 459
3 110 1475 461
3 459 1476 461
3 109 1476 459
3 20 1477 64
3 843 1477 20
3 843 1478 160
3 20 1478 843
3 160 20 42
3 53 1479 50
3 52 1479 53
3 50 52 49
3 102 49 121
3 121 1480 112
3 49 1480 121
3 462 1481 55
3 50 1481 462
3 128 1482 55
3 462 1482 128
3 178 844 138
3 463 844 178
3 463 845 19
3 178 845 463
3 120 1483 846
3 205 1483 120
3 846 1484 38
3 205 1484 846
3 176 847 170
3 178 847 176
3 139 120 115
3 171 205 139
3 26 848 135
3 154 848 26
3 465 1485 28
3 180 1485 465
3 28 1486 465
3 464 1486 28
3 466 1487 464
3 138 1487 466
3 464 1488 466
3 28 1488 464
3 467 849 84
3 27 849 467
3 467 850 149
3 84 850 467
3 468 851 149
3 206 851 468
3 149 852 468
3 84 852 149
3 853 1489 189
3 27 1489 853
3 189 1490 853
3 79 1490 189
3 79 189 137
3 469 854 61
3 47 854 469
3 61 855 469
3 128 855 61
3 128 61 197
3 856 1491 470
3 182 1491 856
3 856 1492 74
3 470 1492 856
3 182 1493 857
3 131 1493 182
3 857 1494 470
3 131 1494 857
3 74 1495 127
3 858 1495 74
3 858 1496 131
3 74 1496 858
3 131 859 471
3 182 859 131
3 471 860 59
3 182 860 471
3 861 1497 59
3 132 1497 861
3 861 1498 472
3 59 1498 861
3 862 1499 472
3 130 1499 862
3 472 1500 862
3 59 1500 472
3 473 1501 183
3 46 1501 473
3 183 1502 473
3 33 1502 183
3 474 863 165
3 14 863 474
3 180 864 165
3 474 864 180
3 14 1503 80
3 865 1503 14
3 865 1504 475
3 14 1504 865
3 866 1505 475
3 180 1505 866
3 475 1506 866
3 14 1506 475
3 867 1507 477
3 476 1507 867
3 867 1508 203
3 477 1508 867
3 868 1509 477
3 186 1509 868
3 868 1510 476
3 477 1510 868
3 869 1511 478
3 476 1511 869
3 869 1512 57
3 478 1512 869
3 870 1513 478
3 203 1513 870
3 870 1514 476
3 478 1514 870
3 1 12 171
3 97 181 1
3 16 871 79
3 202 871 16
3 204 1515 86
3 872 1515 204
3 872 1516 479
3 204 1516 872
3 873 1517 479
3 203 1517 873
3 479 1518 873
3 204 1518 479
3 480 874 50
3 54 874 480
3 35 875 50
3 480 875 35
3 177 876 481
3 157 876 177
3 481 877 169
3 157 877 481
3 482 1519 80
3 177 1519 482
3 162 1520 80
3 482 1520 162
3 180 1521 878
3 19 1521 180
3 878 1522 483
3 19 1522 878
3 879 1523 483
3 162 1523 879
3 879 1524 19
3 483 1524 879
3 99 1525 880
3 484 1525 99
3 880 1526 118
3 484 1526 880
3 881 1527 484
3 109 1527 881
3 484 1528 881
3 99 1528 484
3 485 1529 93
3 99 1529 485
3 485 1530 100
3 93 1530 485
3 103 111 95
3 103 95 91
3 486 1531 32
3 882 1531 486
3 882 1532 11
3 486 1532 882
3 883 1533 32
3 486 1533 883
3 883 1534 10
3 32 1534 883
3 884 1535 7
3 170 1535 884
3 7 1536 884
3 120 1536 7
3 71 153 41
3 115 7 71
3 175 885 82
3 2 885 175
3 2 1537 143
3 886 1537 2
3 886 1538 69
3 2 1538 886
3 107 887 3
3 45 887 107
3 45 888 134
3 147 888 45
3 200 1539 31
3 889 1539 200
3 889 1540 15
3 200 1540 889
3 150 1541 170
3 890 1541 150
3 890 1542 153
3 150 1542 890
3 164 1543 138
3 487 1543 164
3 487 1544 150
3 164 1544 487
3 143 891 488
3 15 891 143
3 488 892 206
3 15 892 488
3 210 69 97
3 41 31 210
3 36 1545 75
3 38 1545 36
3 490 893 489
3 33 893 490
3 490 894 36
3 489 894 490
3 33 895 491
3 195 895 33
3 491 896 489
3 195 896 491
3 897 1546 128
3 492 1546 897
3 55 1547 128
3 897 1547 55
3 898 1548 492
3 195 1548 898
3 898 1549 55
3 492 1549 898
3 493 899 92
3 99 899 493
3 493 900 109
3 92 900 493
3 8 1550 77
3 199 1550 8
3 63 901 209
3 8 901 63
3 129 902 35
3 494 902 129
3 494 903 63
3 129 903 494
3 23 904 128
3 495 904 23
3 495 905 129
3 23 905 495
3 5 906 130
3 496 906 5
3 496 907 198
3 5 907 496
3 44 1551 497
3 60 1551 44
3 497 1552 46
3 60 1552 497
3 168 908 205
3 60 908 168
3 67 1553 498
3 198 1553 67
3 498 1554 12
3 198 1554 498
3 89 1555 93
3 100 1555 89
3 111 909 91
3 93 909 111
3 103 1556 93
3 91 1556 103
3 62 1557 127
3 910 1557 62
3 910 1558 167
3 62 1558 910
3 167 1559 77
3 499 1559 167
3 499 1560 107
3 167 1560 499
3 177 1561 500
3 81 1561 177
3 500 1562 191
3 81 1562 500
3 140 1563 181
3 208 1563 140
3 67 1564 911
3 208 1564 67
3 911 1565 37
3 208 1565 911
3 169 912 501
3 148 912 169
3 501 913 81
3 148 913 501
3 202 914 134
3 148 914 202
3 97 171 108
3 108 210 97
3 54 63 209
3 54 209 107
3 54 107 119
3 119 3 148
3 119 148 169
3 119 169 161
3 119 70 124
3 915 1566 32
3 10 1566 915
3 915 1567 502
3 32 1567 915
3 916 1568 502
3 72 1568 916
3 502 1569 916
3 32 1569 502
3 917 1570 503
3 204 1570 917
3 917 1571 166
3 503 1571 917
3 918 1572 204
3 503 1572 918
3 86 1573 204
3 918 1573 86
3 124 54 119
3 919 1574 507
3 506 1574 919
3 919 1575 505
3 507 1575 919
3 920 1576 507
3 504 1576 920
3 920 1577 506
3 507 1577 920
3 921 1578 508
3 506 1578 921
3 921 1579 132
3 508 1579 921
3 922 1580 508
3 505 1580 922
3 922 1581 506
3 508 1581 922
3 923 1582 510
3 509 1582 923
3 923 1583 505
3 510 1583 923
3 924 1584 510
3 130 1584 924
3 924 1585 509
3 510 1585 924
3 925 1586 511
3 509 1586 925
3 925 1587 504
3 511 1587 925
3 926 1588 511
3 505 1588 926
3 926 1589 509
3 511 1589 926
3 927 1590 514
3 513 1590 927
3 927 1591 512
3 514 1591 927
3 928 1592 514
3 504 1592 928
3 928 1593 513
3 514 1593 928
3 929 1594 515
3 513 1594 929
3 929 1595 87
3 515 1595 929
3 930 1596 515
3 512 1596 930
3 930 1597 513
3 515 1597 930
3 931 1598 517
3 516 1598 931
3 931 1599 512
3 517 1599 931
3 932 1600 517
3 132 1600 932
3 932 1601 516
3 517 1601 932
3 933 1602 518
3 516 1602 933
3 933 1603 504
3 518 1603 933
3 934 1604 518
3 512 1604 934
3 934 1605 516
3 518 1605 934
3 88 1606 201
3 935 1606 88
3 935 1607 519
3 88 1607 935
3 936 1608 519
3 84 1608 936
3 519 1609 936
3 88 1609 519
3 937 1610 90
3 104 1610 937
3 163 1611 90
3 937 1611 163
3 152 1612 163
3 194 1612 152
3 152 90 105
3 938 1613 163
3 193 1613 938
3 36 1614 163
3 938 1614 36
3 105 939 58
3 48 939 105
3 58 940 18
3 178 940 58
3 941 1615 48
3 17 1615 941
3 90 1616 48
3 941 1616 90
3 942 1617 178
3 85 1617 942
3 48 1618 178
3 942 1618 48
3 179 1619 84
3 943 1619 179
3 943 1620 11
3 179 1620 943
3 520 944 154
3 521 944 520
3 521 945 179
3 520 945 521
3 522 946 154
3 520 946 522
3 154 947 522
3 11 947 154
3 25 1621 948
3 42 1621 25
3 948 1622 523
3 42 1622 948
3 949 1623 523
3 64 1623 949
3 949 1624 42
3 523 1624 949
3 42 25 119
3 950 1625 526
3 131 1625 950
3 950 1626 132
3 526 1626 950
3 951 1627 526
3 525 1627 951
3 951 1628 131
3 526 1628 951
3 527 1629 525
3 952 1629 527
3 952 1630 524
3 527 1630 952
3 527 1631 953
3 525 1631 527
3 953 1632 131
3 525 1632 953
3 528 1633 524
3 954 1633 528
3 954 1634 529
3 528 1634 954
3 955 1635 529
3 57 1635 955
3 529 1636 955
3 528 1636 529
3 524 1637 528
3 956 1637 524
3 956 1638 530
3 524 1638 956
3 957 1639 530
3 131 1639 957
3 530 1640 957
3 524 1640 530
3 57 1641 204
3 533 1641 57
3 533 1642 532
3 57 1642 533
3 534 1643 532
3 531 1643 534
3 532 1644 534
3 57 1644 532
3 535 1645 531
3 536 1645 535
3 536 1646 131
3 535 1646 536
3 531 1647 535
3 537 1647 531
3 537 1648 57
3 531 1648 537
3 192 1649 145
3 958 1649 192
3 958 1650 119
3 192 1650 958
3 172 1651 192
3 119 1651 172
3 62 959 167
3 101 959 62
3 539 960 538
3 131 960 539
3 539 961 62
3 538 961 539
3 131 962 540
3 114 962 131
3 540 963 538
3 114 963 540
3 207 13 137
3 207 137 189
3 207 14 190
3 207 190 30
3 132 1652 131
3 964 1652 132
3 964 1653 113
3 132 1653 964
3 541 1654 37
3 965 1654 541
3 965 1655 132
3 541 1655 965
3 966 1656 37
3 541 1656 966
3 113 1657 37
3 966 1657 113
3 101 967 98
3 147 967 101
3 543 968 542
3 114 968 543
3 543 969 101
3 542 969 543
3 114 970 544
3 83 970 114
3 544 971 542
3 83 971 544
3 208 972 37
3 96 972 208
3 122 208 140
3 546 1658 545
3 547 1658 546
3 547 1659 83
3 546 1659 547
3 548 1660 546
3 175 1660 548
3 545 1661 546
3 548 1661 545
3 550 1662 83
3 549 1662 550
3 550 1663 114
3 83 1663 550
3 551 1664 549
3 545 1664 551
3 551 1665 114
3 549 1665 551
3 553 973 552
3 113 973 553
3 553 974 114
3 552 974 553
3 554 975 113
3 552 975 554
3 175 976 113
3 554 976 175
3 96 977 113
3 2 977 96
3 185 197 61
3 185 61 6
3 69 96 122
3 21 196 185
3 21 185 6
3 65 978 20
3 555 978 65
3 555 979 158
3 65 979 555
3 556 1666 42
3 557 1666 556
3 557 1667 65
3 556 1667 557
3 558 1668 42
3 556 1668 558
3 558 1669 158
3 42 1669 558
3 146 980 192
3 559 980 146
3 559 981 51
3 146 981 559
3 560 1670 172
3 561 1670 560
3 561 1671 146
3 560 1671 561
3 562 1672 172
3 560 1672 562
3 562 1673 51
3 172 1673 562
3 88 126 26
3 88 26 135
3 88 135 78
3 88 78 66
3 88 66 201
3 201 78 135
3 201 135 26
3 201 26 126
3 201 126 188
3 201 188 88
3 87 4 186
3 87 186 73
3 87 73 133
3 87 133 144
3 87 144 9
3 9 133 73
3 9 73 186
3 9 186 4
3 9 4 24
3 9 24 87