OFF

133 262 0
-0.262634 -0.058296 0.046038
-0.314178 0.096821 -0.068732
-0.345429 0.063881 -0.042153
-0.323211 -0.079703 -0.004065
-0.298510 -0.054187 0.022030
-0.471589 0.009413 -0.066473
-0.379354 -0.013010 0.026024
-0.330281 -0.026352 -0.000902
-0.395986 -0.024530 -0.051570
-0.260270 0.116848 -0.033356
-0.377702 0.014729 0.007722
-0.369129 -0.003531 -0.056363
-0.329920 0.020576 -0.002113
-0.452815 -0.042216 -0.056074
-0.343969 -0.004389 -0.068074
-0.289830 -0.086788 0.016204
-0.499379 0.014293 -0.030344
-0.446310 -0.052454 -0.028943
-0.310861 -0.066945 0.008983
-0.424161 -0.007301 0.030802
-0.380828 -0.013905 -0.062175
-0.430940 -0.003272 -0.072817
-0.318571 0.021404 0.005851
-0.322058 -0.049253 0.006230
-0.453905 0.020109 -0.065124
-0.469729 0.025757 0.021522
-0.407987 -0.025590 -0.064274
-0.494033 -0.036139 -0.037573
-0.372049 -0.002502 0.004853
-0.379051 0.008756 0.026033
-0.365670 0.022772 -0.052893
-0.442127 -0.056666 -0.025936
-0.422940 0.034641 0.010985
-0.401018 0.030337 -0.024225
-0.318507 -0.028819 0.006998
-0.356016 -0.038598 -0.060414
-0.360729 0.024576 -0.040398
-0.435146 -0.037276 -0.066374
-0.442086 0.014673 0.023827
-0.422425 -0.052454 -0.045869
-0.474634 0.000764 0.025382
-0.469316 -0.044640 0.008206
-0.461695 -0.002232 0.021028
-0.422366 -0.039475 0.011888
-0.426001 -0.001661 0.035319
-0.437168 -0.050052 -0.048506
-0.416557 -0.001722 0.041128
-0.392941 -0.002093 0.029958
-0.190412 0.130509 -0.022804
-0.392591 0.017355 0.027772
-0.252295 0.113665 -0.045768
-0.495249 -0.002372 -0.001949
-0.457361 0.019272 0.023444
-0.426454 -0.030597 0.026838
-0.342903 -0.073665 -0.064466
-0.350340 0.021463 -0.018904
-0.396830 0.019471 -0.052671
-0.450426 -0.010897 -0.071496
-0.482605 0.043222 -0.006731
-0.442451 -0.017907 0.024755
-0.493326 0.026645 -0.003633
-0.366652 -0.028886 -0.051868
-0.435695 0.047621 -0.051484
-0.483038 -0.045656 -0.005625
-0.481225 -0.001302 0.025311
-0.500000 -0.018131 -0.029801
-0.341014 0.048125 -0.024275
-0.393271 0.024065 -0.038288
-0.329540 -0.038959 -0.070810
-0.399612 -0.034212 -0.003795
-0.428223 0.036312 -0.016667
-0.395531 0.025306 0.008904
-0.390560 0.032447 -0.057376
-0.327507 -0.094520 -0.022221
-0.352370 -0.028110 -0.018737
-0.418697 0.048393 -0.047072
-0.440375 -0.001582 0.027681
-0.337791 -0.053907 -0.011401
-0.453856 0.032982 0.015940
-0.335819 0.046568 -0.013528
-0.398747 0.028862 -0.004858
-0.339582 0.071778 -0.067401
-0.423737 0.004193 0.030873
-0.489834 -0.004554 -0.052989
-0.426069 0.027711 0.025931
-0.464262 -0.022392 0.017054
-0.327371 0.030696 -0.070973
-0.445228 -0.040637 -0.006046
-0.376643 0.016512 -0.017083
-0.491861 0.032026 -0.039637
-0.411864 0.007407 0.030748
-0.390191 -0.029365 -0.037587
-0.443923 0.037779 -0.007406
-0.414869 0.033618 -0.041525
-0.469733 0.042890 -0.046571
-0.492535 -0.029268 -0.004006
-0.442338 0.049724 -0.030727
-0.466382 0.044527 0.012064
-0.336610 0.085201 -0.050290
-0.412447 -0.010784 0.029326
-0.280561 -0.030968 0.032013
-0.380609 0.005584 -0.063386
-0.469912 -0.018521 -0.070174
-0.408415 0.018195 -0.063581
-0.436222 0.030806 -0.063776
-0.393270 -0.021785 0.028499
-0.415322 -0.038613 -0.040563
-0.342518 -0.055473 -0.021589
-0.459357 0.047359 -0.028270
-0.455453 -0.054856 -0.009380
-0.455048 -0.035279 0.016904
-0.404616 -0.035670 -0.023486
-0.354356 0.034123 -0.061882
-0.397392 -0.012168 -0.055466
-0.378263 -0.018136 0.007857
-0.451264 0.003070 -0.069645
-0.470485 -0.047157 -0.045775
-0.366769 -0.002907 -0.002215
-0.338504 -0.003450 -0.008034
-0.475917 -0.024755 0.020499
-0.378023 -0.020494 -0.016478
-0.295199 0.110017 -0.038632
-0.435899 0.052010 -0.022293
-0.448981 0.051828 -0.009970
-0.338778 -0.091432 -0.048618
-0.396288 -0.031223 0.011370
-0.394463 -0.038249 -0.057935
-0.397358 0.006791 -0.057360
-0.458286 -0.021046 0.024247
-0.361825 -0.031242 -0.039114
-0.429189 -0.040041 -0.015062
-0.298488 -0.003641 0.017987
-0.457060 -0.001413 0.027409
3 15 73 0
3 0 4 15
3 73 124 0
3 124 54 0
3 54 68 0
3 68 48 0
3 68 50 48
3 68 1 50
3 68 86 1
3 48 9 0
3 9 100 0
3 9 131 100
3 9 22 131
3 9 121 22
3 86 81 1
3 15 3 73
3 121 79 22
3 121 98 79
3 68 14 86
3 79 12 22
3 79 55 12
3 12 118 22
3 73 3 124
3 3 107 124
3 107 129 124
3 98 2 79
3 2 66 79
3 121 1 98
3 66 55 79
3 118 7 23
3 118 4 34
3 3 77 74
3 18 4 3
3 81 112 11
3 54 11 35
3 108 123 94
3 123 62 96
3 56 127 101
3 101 127 113
3 20 101 113
3 8 20 113
3 20 37 26
3 116 13 37
3 102 21 57
3 104 5 24
3 21 5 115
3 17 45 109
3 126 20 8
3 101 72 56
3 8 106 39
3 126 8 39
3 106 130 31
3 39 106 31
3 130 87 109
3 31 130 109
3 87 110 41
3 109 87 41
3 110 85 41
3 41 85 119
3 56 72 75
3 93 56 75
3 93 75 122
3 70 93 122
3 70 122 123
3 92 70 123
3 92 123 97
3 78 92 97
3 25 78 97
3 52 78 25
3 52 25 40
3 42 52 40
3 42 40 119
3 85 42 119
3 51 16 65
3 62 75 72
3 62 72 104
3 94 62 104
3 24 94 104
3 24 5 94
3 89 94 5
3 89 5 83
3 16 89 83
3 16 83 65
3 103 72 101
3 103 104 72
3 103 21 104
3 103 101 21
3 115 104 21
3 115 5 104
3 5 21 102
3 83 5 102
3 83 102 27
3 65 83 27
3 21 101 20
3 26 21 20
3 26 37 21
3 57 37 102
3 57 21 37
3 13 102 37
3 13 116 102
3 27 102 116
3 37 20 126
3 37 126 45
3 116 37 45
3 45 126 39
3 45 39 31
3 45 31 109
3 17 116 45
3 17 109 116
3 116 109 63
3 27 116 63
3 27 63 95
3 65 27 95
3 65 95 51
3 63 109 41
3 63 41 119
3 95 63 119
3 95 119 64
3 51 95 64
3 64 119 40
3 16 51 60
3 89 16 60
3 89 60 58
3 94 89 58
3 108 58 123
3 108 94 58
3 96 94 123
3 96 62 94
3 62 123 122
3 75 62 122
3 60 51 64
3 60 64 25
3 58 60 25
3 58 25 97
3 123 58 97
3 25 64 40
3 2 98 36
3 98 1 81
3 86 14 81
3 121 9 1
3 50 9 48
3 50 1 9
3 7 74 23
3 7 118 74
3 12 55 118
3 100 4 0
3 100 131 4
3 34 131 118
3 34 4 131
3 23 4 118
3 22 118 131
3 66 36 55
3 66 2 36
3 30 36 98
3 11 30 81
3 98 81 30
3 112 14 11
3 112 81 14
3 61 11 54
3 35 14 54
3 35 11 14
3 68 54 14
3 129 61 124
3 54 124 61
3 107 74 129
3 107 3 74
3 77 23 74
3 77 3 23
3 23 3 4
3 18 15 4
3 18 3 15
3 67 56 93
3 127 11 113
3 113 11 8
3 11 61 8
3 8 61 91
3 61 129 91
3 91 129 120
3 129 74 120
3 120 74 117
3 56 11 127
3 30 11 56
3 67 30 56
3 36 30 67
3 88 36 67
3 55 36 88
3 117 55 88
3 118 55 117
3 74 118 117
3 117 28 120
3 28 117 88
3 28 114 120
3 10 28 88
3 91 111 106
3 33 67 93
3 8 91 106
3 106 111 130
3 130 111 69
3 130 69 43
3 87 130 43
3 87 43 110
3 85 110 128
3 85 128 42
3 43 69 125
3 43 125 53
3 110 43 53
3 110 53 59
3 128 110 59
3 128 59 132
3 42 128 132
3 53 125 105
3 53 105 19
3 59 53 19
3 59 19 76
3 132 59 76
3 19 105 99
3 19 99 44
3 76 19 44
3 44 99 46
3 93 70 33
3 92 78 32
3 70 92 32
3 70 32 80
3 33 70 80
3 52 42 132
3 52 132 38
3 78 52 38
3 78 38 84
3 32 78 84
3 32 84 71
3 80 32 71
3 38 132 76
3 38 76 82
3 84 38 82
3 84 82 49
3 71 84 49
3 82 76 44
3 82 44 90
3 49 82 90
3 90 44 46
3 67 33 88
3 91 120 111
3 88 33 80
3 88 80 10
3 120 114 69
3 111 120 69
3 10 80 71
3 10 71 29
3 28 10 29
3 28 29 6
3 114 28 6
3 114 6 125
3 69 114 125
3 29 71 49
3 29 49 47
3 6 29 47
3 6 47 105
3 125 6 105
3 47 49 90
3 47 90 99
3 105 47 99
3 99 90 46
