OFF

61 118 0
0.266327 0.222064 -0.050310
0.436464 0.184835 -0.046257
0.358001 0.187165 -0.123814
0.468208 0.181963 -0.074724
0.417038 0.245335 -0.103095
0.472696 0.030696 -0.039634
0.443277 -0.007218 -0.025853
0.447371 0.249483 -0.089601
0.393789 0.254977 -0.104689
0.440651 0.204973 -0.094494
0.329471 0.238497 -0.114478
0.377085 0.233908 -0.114675
0.397839 0.225836 -0.113374
0.411262 0.214861 -0.111219
0.417973 0.200630 -0.108144
0.421856 0.161778 -0.099372
0.424288 0.113689 -0.088452
0.423885 0.019718 -0.065003
0.475535 0.145283 -0.038245
0.476353 0.092466 -0.026203
0.407878 -0.019732 0.001213
0.406120 0.085438 -0.022762
0.391833 -0.024848 -0.020051
0.330286 0.203623 -0.054301
0.399473 -0.021233 -0.004754
0.473293 0.257461 -0.067673
0.482284 0.262385 -0.078226
0.461169 0.275878 -0.071562
0.487998 0.093834 -0.030686
0.490791 -0.020430 -0.007926
0.440827 0.115360 -0.030503
0.479714 0.236159 -0.062976
0.299172 0.309077 -0.084101
0.476268 -0.019033 -0.000735
0.373021 0.176164 -0.049147
0.468703 0.280972 -0.082116
0.385801 0.239076 -0.057320
0.391397 0.130731 -0.039251
0.493933 0.145831 -0.051910
0.485208 0.145924 -0.042510
0.417107 0.226934 -0.055366
0.452338 0.268767 -0.065842
0.397961 0.263430 -0.063201
0.399343 0.300052 -0.075467
0.498067 -0.021640 -0.013768
0.496135 0.094011 -0.040132
0.473269 0.189618 -0.048312
0.437764 0.289872 -0.074147
0.406197 0.233808 -0.056651
0.396720 0.083254 -0.028546
0.338129 0.212204 -0.049936
0.463846 0.251754 -0.062257
0.488837 0.238279 -0.072891
0.406443 0.305189 -0.086018
0.302228 0.217134 -0.050123
0.438730 0.140500 -0.036190
0.419194 0.160276 -0.040196
0.383838 0.212088 -0.051105
0.430518 0.282515 -0.068411
0.401925 0.135717 -0.034135
0.442015 0.295310 -0.084692
3 32 23 0
3 32 10 23
3 0 54 32
3 10 2 23
3 2 34 23
3 2 37 34
3 2 49 37
3 2 17 49
3 17 22 49
3 54 50 32
3 2 16 17
3 50 36 32
3 36 42 32
3 42 43 32
3 2 15 16
3 16 5 17
3 16 45 5
3 42 58 43
3 36 48 42
3 51 46 31
3 51 1 46
3 51 40 1
3 40 57 1
3 57 34 1
3 34 56 1
3 34 59 56
3 34 37 59
3 40 48 57
3 31 25 51
3 57 50 34
3 48 36 57
3 46 18 31
3 40 41 48
3 8 53 4
3 9 15 14
3 35 26 7
3 4 53 60
3 16 15 3
3 5 45 44
3 22 17 6
3 6 17 5
3 22 6 20
3 22 20 24
3 3 38 16
3 3 52 38
3 35 7 60
3 9 4 7
3 2 10 11
3 54 0 50
3 15 2 14
3 10 53 8
3 52 7 26
3 52 3 9
3 11 8 12
3 13 4 9
3 44 6 5
3 3 15 9
3 19 21 33
3 16 38 45
3 6 44 33
3 4 60 7
3 11 12 14
3 12 8 4
3 14 12 13
3 7 52 9
3 13 9 14
3 10 8 11
3 11 14 2
3 29 33 44
3 20 33 21
3 53 10 32
3 4 13 12
3 33 20 6
3 18 55 59
3 56 59 1
3 29 45 28
3 29 44 45
3 33 28 19
3 33 29 28
3 28 38 39
3 28 45 38
3 19 39 18
3 19 28 39
3 30 59 21
3 30 18 59
3 30 19 18
3 30 21 19
3 39 52 31
3 39 38 52
3 18 39 31
3 46 1 18
3 55 1 59
3 55 18 1
3 48 41 58
3 40 51 41
3 58 41 47
3 41 27 47
3 47 27 60
3 27 35 60
3 41 51 27
3 51 25 27
3 27 25 35
3 25 26 35
3 31 26 25
3 31 52 26
3 43 47 53
3 47 60 53
3 58 47 43
3 57 36 50
3 42 48 58
3 22 24 49
3 24 21 49
3 24 20 21
3 37 49 59
3 49 21 59
3 23 34 50
3 23 50 0
3 43 53 32
