OFF

302 600 0
0.465493 0.059534 -0.045666
0.364073 0.057135 -0.063914
0.364073 0.057135 -0.023819
0.458225 0.058081 -0.049263
0.458225 0.058081 -0.041588
0.453696 0.055178 -0.048770
0.453696 0.055178 -0.042225
0.399573 0.054133 -0.057518
0.399573 0.054133 -0.031593
0.399590 0.051454 -0.056951
0.399590 0.051454 -0.032159
0.453734 0.049435 -0.046182
0.453734 0.049435 -0.044814
0.465539 0.052666 -0.046297
0.465539 0.052666 -0.045035
0.453647 0.062440 -0.045498
0.465536 0.053040 -0.046578
0.465536 0.053040 -0.044754
0.458271 0.051163 -0.048424
0.458271 0.051163 -0.042427
0.419991 0.061709 -0.039926
0.419991 0.061709 -0.050350
0.363989 0.069730 -0.032018
0.363989 0.069730 -0.055715
0.354181 0.039821 -0.036453
0.354181 0.039821 -0.051582
0.420002 0.060174 -0.051212
0.420002 0.060174 -0.039064
0.388731 0.042885 -0.044636
0.499290 0.056178 -0.044905
0.420081 0.048303 -0.041015
0.420081 0.048303 -0.049260
0.453727 0.050546 -0.047432
0.453727 0.050546 -0.043564
0.420091 0.046769 -0.046596
0.420091 0.046769 -0.043679
0.399634 0.044902 -0.036894
0.399634 0.044902 -0.052216
0.427705 0.064692 -0.041697
0.427705 0.064692 -0.048352
0.364166 0.043303 -0.058847
0.364166 0.043303 -0.028886
0.499290 0.056162 -0.046566
0.465529 0.054149 -0.044322
0.465529 0.054149 -0.047010
0.399483 0.067475 -0.039254
0.399483 0.067475 -0.049857
0.427825 0.046691 -0.041697
0.427825 0.046691 -0.048352
0.363966 0.073145 -0.043866
0.465501 0.058346 -0.044513
0.465501 0.058346 -0.046819
0.479604 0.058176 -0.043992
0.479604 0.058176 -0.047273
0.363969 0.072754 -0.048057
0.363969 0.072754 -0.039675
0.458287 0.048823 -0.045426
0.399476 0.068607 -0.044555
0.388621 0.059307 -0.033034
0.388621 0.059307 -0.056238
0.363976 0.071599 -0.052065
0.363976 0.071599 -0.035667
0.479627 0.054718 -0.043831
0.479627 0.054718 -0.047434
0.458192 0.062969 -0.045426
0.364145 0.046327 -0.026409
0.364145 0.046327 -0.061324
0.419971 0.064710 -0.045138
0.479637 0.053179 -0.044225
0.479637 0.053179 -0.047041
0.388703 0.047036 -0.035570
0.388703 0.047036 -0.053702
0.420051 0.052837 -0.051808
0.420051 0.052837 -0.038467
0.388724 0.043970 -0.039674
0.388724 0.043970 -0.049598
0.388565 0.067701 -0.047172
0.388565 0.067701 -0.042100
0.465493 0.059456 -0.045988
0.465493 0.059456 -0.045343
0.419976 0.063926 -0.042285
0.419976 0.063926 -0.047990
0.479599 0.058899 -0.044225
0.479599 0.058899 -0.047041
0.399520 0.062056 -0.055843
0.399520 0.062056 -0.033268
0.453656 0.061183 -0.047432
0.453656 0.061183 -0.043564
0.354067 0.056959 -0.062513
0.354067 0.056959 -0.025521
0.364122 0.049741 -0.024695
0.364122 0.049741 -0.063038
0.479609 0.057359 -0.043831
0.479609 0.057359 -0.047434
0.354044 0.060400 -0.026329
0.354044 0.060400 -0.061705
0.353987 0.068817 -0.054949
0.353987 0.068817 -0.033086
0.354154 0.043936 -0.030196
0.354154 0.043936 -0.057838
0.399622 0.046735 -0.034869
0.399622 0.046735 -0.054241
0.427772 0.054662 -0.036888
0.427772 0.054662 -0.053161
0.458208 0.060629 -0.048424
0.458208 0.060629 -0.042427
0.465524 0.054835 -0.044190
0.465524 0.054835 -0.047141
0.479632 0.053902 -0.043992
0.479632 0.053902 -0.047273
0.388729 0.043160 -0.047172
0.388729 0.043160 -0.042100
0.388571 0.066890 -0.039674
0.388571 0.066890 -0.049598
0.453735 0.049291 -0.045498
0.427831 0.045840 -0.045025
0.388591 0.063824 -0.035570
0.388591 0.063824 -0.053702
0.453648 0.062296 -0.046182
0.453648 0.062296 -0.044814
0.453687 0.056552 -0.048770
0.453687 0.056552 -0.042225
0.420038 0.054692 -0.052113
0.420038 0.054692 -0.038162
0.458254 0.053710 -0.049263
0.458254 0.053710 -0.041588
0.427721 0.062284 -0.051105
0.427721 0.062284 -0.038944
0.465519 0.055569 -0.047209
0.465519 0.055569 -0.044123
0.364049 0.060790 -0.024695
0.364049 0.060790 -0.063038
0.388673 0.051554 -0.033034
0.388673 0.051554 -0.056238
0.420026 0.056588 -0.052113
0.420026 0.056588 -0.038162
0.465514 0.056319 -0.047209
0.465514 0.056319 -0.044123
0.458216 0.059432 -0.048920
0.458216 0.059432 -0.041931
0.427700 0.065329 -0.043324
0.427700 0.065329 -0.046726
0.427818 0.047721 -0.049834
0.427818 0.047721 -0.040216
0.354003 0.066462 -0.030196
0.354003 0.066462 -0.057838
0.354170 0.041581 -0.054949
0.354170 0.041581 -0.033086
0.354113 0.049998 -0.026329
0.354113 0.049998 -0.061705
0.354090 0.053440 -0.062513
0.354090 0.053440 -0.025521
0.453651 0.061872 -0.044159
0.453651 0.061872 -0.046836
0.453705 0.053833 -0.042368
0.453705 0.053833 -0.048627
0.399505 0.064272 -0.034869
0.399505 0.064272 -0.054241
0.427798 0.050765 -0.037939
0.427798 0.050765 -0.052110
0.364026 0.064205 -0.026409
0.364026 0.064205 -0.061324
0.399607 0.048951 -0.055843
0.399607 0.048951 -0.033268
0.388563 0.067975 -0.044636
0.465509 0.057054 -0.044190
0.465509 0.057054 -0.047141
0.364195 0.038933 -0.052065
0.364195 0.038933 -0.035667
0.479592 0.059944 -0.044862
0.479592 0.059944 -0.046403
0.364202 0.037779 -0.048057
0.364202 0.037779 -0.039675
0.420087 0.047355 -0.042285
0.420087 0.047355 -0.047990
0.364205 0.037387 -0.043866
0.458283 0.049434 -0.047067
0.458283 0.049434 -0.043784
0.479589 0.060313 -0.045633
0.427785 0.052648 -0.052806
0.427785 0.052648 -0.037243
0.479615 0.056485 -0.043749
0.479615 0.056485 -0.047517
0.420013 0.058442 -0.051808
0.420013 0.058442 -0.038467
0.453669 0.059153 -0.048347
0.453669 0.059153 -0.042648
0.465540 0.052433 -0.045988
0.465540 0.052433 -0.045343
0.364006 0.067229 -0.058847
0.364006 0.067229 -0.028886
0.420093 0.046571 -0.045138
0.458193 0.062814 -0.044587
0.458193 0.062814 -0.046265
0.458244 0.055156 -0.041413
0.458244 0.055156 -0.049439
0.458278 0.050174 -0.047798
0.458278 0.050174 -0.043054
0.399651 0.042400 -0.044555
0.364182 0.040802 -0.032018
0.364182 0.040802 -0.055715
0.479646 0.051858 -0.045239
0.479646 0.051858 -0.046027
0.427745 0.058736 -0.052806
0.427745 0.058736 -0.037243
0.453721 0.051466 -0.047943
0.453721 0.051466 -0.043052
0.399643 0.043532 -0.039254
0.399643 0.043532 -0.049857
0.388689 0.049158 -0.055201
0.388689 0.049158 -0.034071
0.453662 0.060265 -0.047943
0.453662 0.060265 -0.043052
0.465533 0.053542 -0.044513
0.465533 0.053542 -0.046819
0.399492 0.066105 -0.036894
0.399492 0.066105 -0.052216
0.353976 0.070577 -0.036453
0.353976 0.070577 -0.051582
0.479595 0.059496 -0.044519
0.479595 0.059496 -0.046746
0.388656 0.054119 -0.032503
0.388656 0.054119 -0.056769
0.419973 0.064512 -0.046596
0.419973 0.064512 -0.043679
0.364098 0.053397 -0.063914
0.458201 0.061618 -0.047798
0.458201 0.061618 -0.043054
0.465505 0.057739 -0.044322
0.465505 0.057739 -0.047010
0.364098 0.053397 -0.023819
0.419983 0.062978 -0.041015
0.419983 0.062978 -0.049260
0.458234 0.056636 -0.041413
0.458234 0.056636 -0.049439
0.427732 0.060618 -0.037939
0.427732 0.060618 -0.052110
0.420062 0.051105 -0.051212
0.420062 0.051105 -0.039064
0.420072 0.049572 -0.039926
0.420072 0.049572 -0.050350
0.458286 0.048977 -0.044587
0.458286 0.048977 -0.046265
0.453713 0.052578 -0.048347
0.453713 0.052578 -0.042648
0.479641 0.052581 -0.044519
0.479641 0.052581 -0.046746
0.388579 0.065579 -0.051807
0.388579 0.065579 -0.037465
0.427712 0.063663 -0.049834
0.427712 0.063663 -0.040216
0.427829 0.046055 -0.043324
0.427829 0.046055 -0.046726
0.458196 0.062358 -0.047067
0.458196 0.062358 -0.043784
0.465541 0.052355 -0.045666
0.388715 0.045281 -0.051807
0.388715 0.045281 -0.037465
0.479590 0.060219 -0.045239
0.479590 0.060219 -0.046027
0.399536 0.059552 -0.056951
0.399536 0.059552 -0.032159
0.399554 0.056873 -0.057518
0.399554 0.056873 -0.031593
0.465497 0.058849 -0.046578
0.465497 0.058849 -0.044754
0.427809 0.049100 -0.051105
0.427809 0.049100 -0.038944
0.465495 0.059223 -0.046297
0.465495 0.059223 -0.045035
0.354191 0.038366 -0.044017
0.353968 0.071664 -0.040150
0.353968 0.071664 -0.047884
0.388638 0.056741 -0.032503
0.388638 0.056741 -0.056769
0.453678 0.057897 -0.042368
0.453678 0.057897 -0.048627
0.453732 0.049859 -0.044159
0.453732 0.049859 -0.046836
0.354135 0.046782 -0.060124
0.354135 0.046782 -0.027911
0.427699 0.065544 -0.045025
0.399649 0.042686 -0.047265
0.399649 0.042686 -0.041845
0.354022 0.063615 -0.060124
0.354022 0.063615 -0.027911
0.354189 0.038733 -0.040150
0.354189 0.038733 -0.047884
0.353966 0.072032 -0.044017
0.479621 0.055592 -0.043749
0.479621 0.055592 -0.047517
0.479647 0.051765 -0.045633
0.388605 0.061703 -0.055201
0.388605 0.061703 -0.034071
0.399478 0.068321 -0.047265
0.399478 0.068321 -0.041845
0.458263 0.052359 -0.048920
0.458263 0.052359 -0.041931
0.427758 0.056722 -0.036888
0.427758 0.056722 -0.053161
0.479644 0.052134 -0.044862
0.479644 0.052134 -0.046403
3 13 42 268
3 268 78 13
3 78 0 13
3 0 79 13
3 79 269 13
3 269 187 13
3 269 255 187
3 269 188 255
3 269 29 188
3 29 14 188
3 42 264 268
3 13 16 42
3 269 265 29
3 29 17 14
3 16 214 42
3 42 51 264
3 29 213 17
3 265 50 29
3 214 44 42
3 42 229 51
3 29 43 213
3 50 228 29
3 42 166 229
3 44 107 42
3 228 165 29
3 29 106 43
3 42 136 166
3 107 128 42
3 29 129 106
3 165 137 29
3 2 130 230
3 130 90 230
3 130 160 90
3 160 65 90
3 160 190 65
3 190 41 65
3 190 22 41
3 22 199 41
3 22 61 199
3 61 168 199
3 61 55 168
3 55 172 168
3 55 49 172
3 49 175 172
3 49 171 175
3 49 54 171
3 54 167 171
3 54 200 167
3 54 40 200
3 54 66 40
3 54 91 66
3 54 225 91
3 54 1 225
3 54 131 1
3 54 161 131
3 54 189 161
3 54 23 189
3 54 60 23
3 136 42 128
3 129 29 137
3 178 0 259
3 259 78 170
3 170 268 220
3 220 264 83
3 83 51 53
3 53 229 93
3 93 166 182
3 182 136 290
3 290 128 63
3 63 107 109
3 109 44 69
3 69 214 246
3 246 16 301
3 301 13 202
3 202 187 291
3 291 255 201
3 201 188 300
3 300 14 245
3 245 17 68
3 68 213 108
3 108 43 62
3 62 106 289
3 289 129 181
3 181 137 92
3 92 165 52
3 52 228 82
3 82 50 219
3 219 265 169
3 169 269 258
3 258 79 178
3 15 178 118
3 118 259 153
3 153 170 86
3 86 220 211
3 211 83 185
3 185 53 276
3 276 93 120
3 120 182 5
3 5 290 155
3 155 63 243
3 243 109 205
3 205 69 32
3 32 246 278
3 278 301 11
3 11 202 114
3 114 291 12
3 12 201 277
3 277 300 33
3 33 245 206
3 206 68 244
3 244 108 154
3 154 62 6
3 6 289 121
3 121 181 275
3 275 92 186
3 186 52 212
3 212 82 87
3 87 219 152
3 152 169 119
3 119 258 15
3 64 15 193
3 193 118 253
3 253 153 226
3 226 86 104
3 104 211 138
3 138 185 3
3 3 276 234
3 234 120 195
3 195 5 124
3 124 155 296
3 296 243 18
3 18 205 196
3 196 32 176
3 176 278 242
3 242 11 56
3 56 114 241
3 241 12 177
3 177 277 197
3 197 33 19
3 19 206 297
3 297 244 125
3 125 154 194
3 194 6 233
3 233 121 4
3 4 275 139
3 139 186 105
3 105 212 227
3 227 87 254
3 254 152 192
3 192 119 64
3 67 64 223
3 223 193 81
3 81 253 232
3 232 226 21
3 21 104 26
3 26 138 183
3 183 3 134
3 134 234 122
3 122 195 72
3 72 124 237
3 237 296 240
3 240 18 31
3 31 196 174
3 174 176 34
3 34 242 191
3 191 56 35
3 35 241 173
3 173 177 30
3 30 197 239
3 239 19 238
3 238 297 73
3 73 125 123
3 123 194 135
3 135 233 184
3 184 4 27
3 27 139 20
3 20 105 231
3 231 227 80
3 80 254 224
3 224 192 67
3 281 67 141
3 141 223 39
3 39 81 249
3 249 232 126
3 126 21 236
3 236 26 203
3 203 183 299
3 299 134 103
3 103 122 179
3 179 72 159
3 159 237 266
3 266 240 142
3 142 31 48
3 48 174 252
3 252 34 115
3 115 191 251
3 251 35 47
3 47 173 143
3 143 30 267
3 267 239 158
3 158 238 180
3 180 73 102
3 102 123 298
3 298 135 204
3 204 184 235
3 235 27 127
3 127 20 250
3 250 231 38
3 38 80 140
3 140 224 281
3 164 281 76
3 76 141 113
3 113 39 247
3 247 249 117
3 117 126 292
3 292 236 59
3 59 203 274
3 274 299 222
3 222 103 133
3 133 179 209
3 209 159 71
3 71 266 256
3 256 142 75
3 75 48 110
3 110 252 28
3 28 115 111
3 111 251 74
3 74 47 257
3 257 143 70
3 70 267 210
3 210 158 132
3 132 180 221
3 221 102 273
3 273 298 58
3 58 204 293
3 293 235 116
3 116 127 248
3 248 250 112
3 112 38 77
3 77 140 164
3 57 164 294
3 294 76 46
3 46 113 216
3 216 247 157
3 157 117 84
3 84 292 260
3 260 59 262
3 262 274 7
3 7 222 9
3 9 133 162
3 162 209 101
3 101 71 37
3 37 256 208
3 208 75 282
3 282 110 198
3 198 28 283
3 283 111 207
3 207 74 36
3 36 257 100
3 100 70 163
3 163 210 10
3 10 132 8
3 8 221 263
3 263 273 261
3 261 58 85
3 85 293 156
3 156 116 215
3 215 248 45
3 45 112 295
3 295 77 57
3 288 57 272
3 272 294 218
3 218 46 96
3 96 216 145
3 145 157 284
3 284 84 95
3 95 260 88
3 88 262 150
3 150 7 149
3 149 9 279
3 279 162 99
3 99 101 146
3 146 37 25
3 25 208 287
3 287 282 270
3 270 198 286
3 286 283 24
3 24 207 147
3 147 36 98
3 98 100 280
3 280 163 148
3 148 10 151
3 151 8 89
3 89 263 94
3 94 261 285
3 285 85 144
3 144 156 97
3 97 215 217
3 217 45 271
3 271 295 288
3 49 288 54
3 54 272 60
3 60 218 23
3 23 96 189
3 189 145 161
3 161 284 131
3 131 95 1
3 1 88 225
3 225 150 91
3 91 149 66
3 66 279 40
3 40 99 200
3 200 146 167
3 167 25 171
3 171 287 175
3 175 270 172
3 172 286 168
3 168 24 199
3 199 147 41
3 41 98 65
3 65 280 90
3 90 148 230
3 230 151 2
3 2 89 130
3 130 94 160
3 160 285 190
3 190 144 22
3 22 97 61
3 61 217 55
3 55 271 49
3 0 78 259
3 78 268 170
3 268 264 220
3 264 51 83
3 51 229 53
3 229 166 93
3 166 136 182
3 136 128 290
3 128 107 63
3 107 44 109
3 44 214 69
3 214 16 246
3 16 13 301
3 13 187 202
3 187 255 291
3 255 188 201
3 188 14 300
3 14 17 245
3 17 213 68
3 213 43 108
3 43 106 62
3 106 129 289
3 129 137 181
3 137 165 92
3 165 228 52
3 228 50 82
3 50 265 219
3 265 269 169
3 269 79 258
3 79 0 178
3 178 259 118
3 259 170 153
3 170 220 86
3 220 83 211
3 83 53 185
3 53 93 276
3 93 182 120
3 182 290 5
3 290 63 155
3 63 109 243
3 109 69 205
3 69 246 32
3 246 301 278
3 301 202 11
3 202 291 114
3 291 201 12
3 201 300 277
3 300 245 33
3 245 68 206
3 68 108 244
3 108 62 154
3 62 289 6
3 289 181 121
3 181 92 275
3 92 52 186
3 52 82 212
3 82 219 87
3 219 169 152
3 169 258 119
3 258 178 15
3 15 118 193
3 118 153 253
3 153 86 226
3 86 211 104
3 211 185 138
3 185 276 3
3 276 120 234
3 120 5 195
3 5 155 124
3 155 243 296
3 243 205 18
3 205 32 196
3 32 278 176
3 278 11 242
3 11 114 56
3 114 12 241
3 12 277 177
3 277 33 197
3 33 206 19
3 206 244 297
3 244 154 125
3 154 6 194
3 6 121 233
3 121 275 4
3 275 186 139
3 186 212 105
3 212 87 227
3 87 152 254
3 152 119 192
3 119 15 64
3 64 193 223
3 193 253 81
3 253 226 232
3 226 104 21
3 104 138 26
3 138 3 183
3 3 234 134
3 234 195 122
3 195 124 72
3 124 296 237
3 296 18 240
3 18 196 31
3 196 176 174
3 176 242 34
3 242 56 191
3 56 241 35
3 241 177 173
3 177 197 30
3 197 19 239
3 19 297 238
3 297 125 73
3 125 194 123
3 194 233 135
3 233 4 184
3 4 139 27
3 139 105 20
3 105 227 231
3 227 254 80
3 254 192 224
3 192 64 67
3 67 223 141
3 223 81 39
3 81 232 249
3 232 21 126
3 21 26 236
3 26 183 203
3 183 134 299
3 134 122 103
3 122 72 179
3 72 237 159
3 237 240 266
3 240 31 142
3 31 174 48
3 174 34 252
3 34 191 115
3 191 35 251
3 35 173 47
3 173 30 143
3 30 239 267
3 239 238 158
3 238 73 180
3 73 123 102
3 123 135 298
3 135 184 204
3 184 27 235
3 27 20 127
3 20 231 250
3 231 80 38
3 80 224 140
3 224 67 281
3 281 141 76
3 141 39 113
3 39 249 247
3 249 126 117
3 126 236 292
3 236 203 59
3 203 299 274
3 299 103 222
3 103 179 133
3 179 159 209
3 159 266 71
3 266 142 256
3 142 48 75
3 48 252 110
3 252 115 28
3 115 251 111
3 251 47 74
3 47 143 257
3 143 267 70
3 267 158 210
3 158 180 132
3 180 102 221
3 102 298 273
3 298 204 58
3 204 235 293
3 235 127 116
3 127 250 248
3 250 38 112
3 38 140 77
3 140 281 164
3 164 76 294
3 76 113 46
3 113 247 216
3 247 117 157
3 117 292 84
3 292 59 260
3 59 274 262
3 274 222 7
3 222 133 9
3 133 209 162
3 209 71 101
3 71 256 37
3 256 75 208
3 75 110 282
3 110 28 198
3 28 111 283
3 111 74 207
3 74 257 36
3 257 70 100
3 70 210 163
3 210 132 10
3 132 221 8
3 221 273 263
3 273 58 261
3 58 293 85
3 293 116 156
3 116 248 215
3 248 112 45
3 112 77 295
3 77 164 57
3 57 294 272
3 294 46 218
3 46 216 96
3 216 157 145
3 157 84 284
3 84 260 95
3 260 262 88
3 262 7 150
3 7 9 149
3 9 162 279
3 162 101 99
3 101 37 146
3 37 208 25
3 208 282 287
3 282 198 270
3 198 283 286
3 283 207 24
3 207 36 147
3 36 100 98
3 100 163 280
3 163 10 148
3 10 8 151
3 8 263 89
3 263 261 94
3 261 85 285
3 85 156 144
3 156 215 97
3 215 45 217
3 45 295 271
3 295 57 288
3 288 272 54
3 272 218 60
3 218 96 23
3 96 145 189
3 145 284 161
3 284 95 131
3 95 88 1
3 88 150 225
3 150 149 91
3 149 279 66
3 279 99 40
3 99 146 200
3 146 25 167
3 25 287 171
3 287 270 175
3 270 286 172
3 286 24 168
3 24 147 199
3 147 98 41
3 98 280 65
3 280 148 90
3 148 151 230
3 151 89 2
3 89 94 130
3 94 285 160
3 285 144 190
3 144 97 22
3 97 217 61
3 217 271 55
3 271 288 49
