OFF
1593 1882 0
0.0792753751 0.0186768200 0.0196044409
0.0792364451 -0.0200631471 0.0195732118
0.1252945505 0.0184992184 0.1825532574
0.1252556206 -0.0202407487 0.1825220283
0.1825942023 -0.0009415689 0.1989166894
0.1195390510 -0.0006982205 -0.0243546357
0.1731278736 -0.0002626263 -0.1015664371
0.2696030981 0.0827363650 0.0740227437
0.2694349483 -0.0845927367 0.0738878560
0.2590741802 0.0827769992 0.0367410085
0.2589060304 -0.0845521025 0.0366061208
0.2513216123 -0.0839484197 0.1325315919
0.2514884076 0.0820328721 0.1326653931
0.2127920476 -0.0837997228 -0.0038973403
0.2129588429 0.0821815690 -0.0037635391
0.1867934223 -0.0855795133 0.1640354654
0.1869635751 0.0837428576 0.1641719599
0.1413159863 -0.0854040025 0.0030048883
0.1414861391 0.0839183684 0.0031413828
0.2690094267 -0.0536890923 0.1216930617
0.2691153896 0.0517566048 0.1217780638
0.1327866520 0.0309892847 -0.0266985083
0.1327229423 -0.0324095011 -0.0267496155
0.1951285740 0.0307486889 0.1940473504
0.1950648643 -0.0326500969 0.1939962433
-0.3806013497 0.0002917293 -0.0989745982
-0.3001527645 -0.0000187454 0.1858849548
0.1218713734 0.1017843493 0.0956374949
0.1216652032 -0.1033796284 0.0954721077
0.1496486115 -0.0009047207 0.1942759445
0.0938882472 -0.0006895250 -0.0031653457
0.2779768683 -0.0216347277 0.0468451189
0.2780185103 0.0198039624 0.0468785235
0.2953288532 -0.0009817515 0.1082295566
0.2857838941 0.0343051579 0.0743348983
0.2857130474 -0.0361957483 0.0742780659
0.2934781501 -0.0216945517 0.1017334452
0.2935197920 0.0197441384 0.1017668498
0.2948708723 0.0099121829 0.1065779201
0.2948489801 -0.0118731009 0.1065603585
0.2913508671 -0.0294846369 0.0942224327
0.2914081820 0.0275505827 0.0942684101
0.2761680893 -0.0009078045 0.0403834084
0.2886750916 -0.0344807764 0.0847615860
0.2887424696 0.0325683710 0.0848156358
0.2827541918 -0.0344579259 0.0637963338
0.2828215698 0.0325912215 0.0638503836
0.2800884784 -0.0294411720 0.0543435586
0.2801457933 0.0275940476 0.0543895360
0.2766476802 0.0099825116 0.0420516102
0.2766257881 -0.0118027722 0.0420340486
0.2487782553 0.0700287405 0.0064660234
0.2486357958 -0.0717354171 0.0063517442
0.2766582969 0.0699211432 0.1051861708
0.2765158374 -0.0718430144 0.1050718916
-0.2293214916 -0.1362690463 0.1582054666
-0.2290477542 0.1361323377 0.1584250553
-0.3058325280 -0.1359737677 -0.1127116612
-0.3055587906 0.1364276163 -0.1124920724
0.2729564793 -0.0536771331 0.1019372351
0.2730624421 0.0517685640 0.1020222372
0.2827077889 -0.0537147662 0.1364655451
0.2828137517 0.0517309308 0.1365505473
0.2696898025 -0.0601984836 0.1105367922
0.2697029007 -0.0471641377 0.1105472995
0.2697957653 0.0452472134 0.1106217943
0.2698088636 0.0582815594 0.1106323016
0.2754215011 -0.0602206040 0.1308321040
0.2754345994 -0.0471862580 0.1308426113
0.2755274640 0.0452250931 0.1309171061
0.2755405623 0.0582594391 0.1309276134
0.3017888123 0.0186277627 0.0776753633
0.3017494375 -0.0205549232 0.0776437772
0.2845580127 0.0186942615 0.0166630053
0.2845186378 -0.0204884245 0.0166314193
0.1733735504 -0.0612156527 0.1822926092
0.1734947341 0.0593766143 0.1823898213
0.1203424058 -0.0610109899 -0.0054848156
0.1204635895 0.0595812771 -0.0053876035
-0.1631623259 0.2724003496 -0.0062958891
-0.1637097985 -0.2724003496 -0.0067350650
-0.2107225772 0.0001814582 -0.1739518000
-0.1161495493 -0.0001835269 0.1609208443
-0.1388087873 -0.2318170511 0.0813247103
-0.1383430755 0.2316218559 0.0816982986
-0.1885287711 -0.2316251671 -0.0947282599
-0.1880630593 0.2318137400 -0.0943546715
0.0890447467 0.0701528922 0.0515772833
0.0889022873 -0.0716112654 0.0514630041
0.1169247883 0.0700452949 0.1502974306
0.1167823288 -0.0717188627 0.1501831514
0.2048292857 -0.0321155405 -0.0360368667
0.2048922751 0.0305664131 -0.0359863374
0.2613773790 -0.0323337763 0.1641936850
0.2614403684 0.0303481773 0.1642442143
0.2717988793 -0.0426046617 0.1209173599
0.2717765964 -0.0647788760 0.1208994847
0.2719048422 0.0628410353 0.1210023620
0.2718825592 0.0406668210 0.1209844869
0.5000000000 -0.0011113035 0.0137984747
0.2979888677 -0.0642715209 0.1312269613
0.2980100603 -0.0431823815 0.1312439617
0.2980948316 0.0411752105 0.1313119643
0.2981160242 0.0622643499 0.1313289647
0.2887146374 -0.0642357289 0.0983879364
0.2887358300 -0.0431465895 0.0984049368
0.2888206013 0.0412110025 0.0984729393
0.2888417939 0.0623001419 0.0984899397
0.1704954387 0.0309599758 -0.0373480639
0.1704317290 -0.0324388100 -0.0373991711
0.2328373607 0.0307193800 0.1833977949
0.2327736510 -0.0326794058 0.1833466877
0.2240741639 -0.0856084895 0.1535067965
0.2242443167 0.0837138814 0.1536432911
0.1785967278 -0.0854329787 -0.0075237805
0.1787668807 0.0838893922 -0.0073872860
0.2925181426 -0.0536923372 0.0964127132
0.2926241054 0.0517533598 0.0964977153
0.3022694521 -0.0537299704 0.1309410232
0.3023754150 0.0517157267 0.1310260253
0.1667355822 -0.1049076693 0.1371121355
0.1669446650 0.1031546687 0.1372798591
0.1382941220 -0.1047979053 0.0364040669
0.1385032048 0.1032644326 0.0365717906
0.1526014601 -0.0838716901 0.1604117185
0.1527682554 0.0821096017 0.1605455197
0.1140718954 -0.0837229932 0.0239827863
0.1142386907 0.0822582986 0.0241165875
0.1230063448 0.1429866767 -0.0872552394
0.1227185206 -0.1434327580 -0.0874861285
-0.0213134493 -0.1364307191 0.0994607177
-0.0210397119 0.1359706650 0.0996803065
-0.0978244857 -0.1361354405 -0.1714564101
-0.0975507484 0.1362659436 -0.1712368213
0.1066542736 0.0828630158 0.1200420594
0.1064861239 -0.0844660859 0.1199071717
0.0961253557 0.0829036500 0.0827603242
0.0959572059 -0.0844254517 0.0826254365
0.2460215342 -0.0009908673 0.1810038113
0.1829663829 -0.0007475189 -0.0422675137
-0.0095454795 0.2203023464 -0.1056038669
-0.0099883973 -0.2204537368 -0.1059591701
0.0196792116 0.2201895597 -0.0021224641
0.0192362939 -0.2205665235 -0.0024777673
0.2270580937 -0.1049545545 0.1200761077
0.2272671764 0.1031077834 0.1202438314
0.1986166335 -0.1048447906 0.0193680391
0.1988257162 0.1032175474 0.0195357628
0.2847242917 0.0696931961 0.1058691784
0.2845822730 -0.0716323803 0.1057552527
0.2846183278 -0.0357535354 0.1057841755
0.2846882359 0.0338133168 0.1058402548
0.2818817648 -0.0536814318 0.0961436768
0.2819877276 0.0517642652 0.0962286789
0.2875922709 -0.0747926915 0.1164219882
0.2876346560 -0.0326144127 0.1164559890
0.2876982337 0.0306530055 0.1165069903
0.2877406189 0.0728312843 0.1165409911
0.2933451621 -0.0537256724 0.1367343004
0.2934511249 0.0517200246 0.1368193025
0.2907508968 0.0696699376 0.1272087212
0.2906088781 -0.0716556387 0.1270947955
0.2906449329 -0.0357767938 0.1271237183
0.2907148409 0.0337900583 0.1271797976
0.2986689634 -0.0707798768 0.1200696972
0.2987749262 0.0346658202 0.1201546993
0.2987032542 -0.0366563914 0.1200972049
0.2988092171 0.0687893056 0.1201822070
0.2951267129 -0.0707662062 0.1075269795
0.2952326757 0.0346794908 0.1076119816
0.2951610037 -0.0366427209 0.1075544872
0.2952669666 0.0688029762 0.1076394893
0.2800659221 -0.0707654177 0.1253234892
0.2801718850 0.0346802793 0.1254084913
0.2801002130 -0.0366419324 0.1253509969
0.2802061758 0.0688037647 0.1254359990
0.2765236716 -0.0707517472 0.1127807715
0.2766296345 0.0346939499 0.1128657736
0.2765579625 -0.0366282618 0.1128082792
0.2766639253 0.0688174353 0.1128932813
0.2283871603 -0.0521017672 -0.0208482101
0.2284902459 0.0504807388 -0.0207655161
0.2734980015 -0.0522758632 0.1388842953
0.2736010871 0.0503066429 0.1389669893
0.2603189101 0.0364106534 -0.0061875196
0.2602440136 -0.0381202355 -0.0062476006
0.2930940045 0.0362841646 0.1098654691
0.2930191081 -0.0382467242 0.1098053881
0.1041212122 -0.0320372659 -0.0075953198
0.1041842016 0.0306446877 -0.0075447905
0.1606693056 -0.0322555016 0.1926352319
0.1607322949 0.0304264520 0.1926857612
0.1325774155 0.0838726606 0.0003733241
0.1324082367 -0.0844804870 0.0002376109
0.0852909016 0.0840551532 -0.1670629981
0.0851217227 -0.0842979944 -0.1671987113
0.2943827048 -0.0338849019 0.0467698537
0.2944489352 0.0320222791 0.0468229830
0.2450979901 -0.0612714000 0.1620364972
0.2452191738 0.0593208670 0.1621337093
0.1920668454 -0.0610667373 -0.0257409276
0.1921880291 0.0595255298 -0.0256437155
0.0741994635 0.0515897180 0.0764791479
0.0740943032 -0.0530574301 0.0763947895
0.0912354394 0.0515239712 0.1368016564
0.0911302790 -0.0531231769 0.1367172980
-0.5000000000 0.0002605575 0.0885354814
0.0810429428 0.0187993359 0.1400174753
0.0810035679 -0.0203833500 0.1399858892
0.0638121432 0.0188658346 0.0790051173
0.0637727683 -0.0203168513 0.0789735313
0.2815645116 0.0624775125 0.0504949301
0.2814370912 -0.0643210934 0.0503927150
0.2987318827 -0.0009877731 0.1114571764
0.2642700023 -0.0008547746 -0.0105685350
0.1147236688 0.0968001879 0.0589281149
0.1145275897 -0.0983219336 0.0587708227
0.1349797190 0.0967220138 0.1306525511
0.1347836399 -0.0984001076 0.1304952588
-0.4495921392 0.1434317248 0.0744555953
-0.4498799634 -0.1429877099 0.0742247063
0.2184957009 -0.1155788421 0.0884701046
0.2187262060 0.1138012354 0.0886550129
0.2078464590 -0.1155377435 0.0507623152
0.2080769640 0.1138423340 0.0509472235
0.2864913759 -0.0642625846 0.1344740342
0.2865125685 -0.0431734452 0.1344910346
0.2865973398 0.0411841469 0.1345590371
0.2866185324 0.0622732863 0.1345760375
0.2772171456 -0.0642267926 0.1016350092
0.2772383382 -0.0431376532 0.1016520097
0.2773231095 0.0412199389 0.1017200122
0.2773443021 0.0623090783 0.1017370126
0.3034503295 -0.0426292626 0.1119784916
0.3034280465 -0.0648034769 0.1119606165
0.3035562923 0.0628164345 0.1120634937
0.3035340093 0.0406422202 0.1120456186
0.0667276554 -0.0007543424 0.1110991439
0.2438960953 0.1016895065 0.0611757906
0.2436899251 -0.1034744712 0.0610104034
0.2716733334 -0.0009995635 0.1598142402
0.2159129691 -0.0007843679 -0.0376270500
0.2997923264 -0.0602218806 0.1020353651
0.2998054247 -0.0471875346 0.1020458724
0.2998982893 0.0452238164 0.1021203672
0.2999113875 0.0582581624 0.1021308745
0.3055240251 -0.0602440009 0.1223306769
0.3055371234 -0.0472096550 0.1223411841
0.3056299879 0.0452016961 0.1224156790
0.3056430862 0.0582360421 0.1224261863
-0.4119942649 0.0842959251 0.1541689479
-0.4121634437 -0.0840572225 0.1540332347
-0.4592807788 0.0844784176 -0.0132673743
-0.4594499577 -0.0838747300 -0.0134030875
0.2988326486 -0.0009347443 0.0455490363
0.1574833400 -0.1155314207 0.1057009567
0.1577138451 0.1138486568 0.1058858651
0.1468340980 -0.1154903221 0.0679931673
0.1470646031 0.1138897554 0.0681780757
0.2307766631 0.0967099865 0.0261529206
0.2305805840 -0.0984121349 0.0259956283
0.2510327133 0.0966318125 0.0978773567
0.2508366342 -0.0984903090 0.0977200645
0.2403059600 0.0185516601 -0.0258731338
0.2402670301 -0.0201883070 -0.0259043629
0.2863251355 0.0183740586 0.1370756828
0.2862862055 -0.0203659085 0.1370444536
0.0841232118 0.0626309723 0.1062554644
0.0839957913 -0.0641676336 0.1061532493
0.1012905829 -0.0008343132 0.1672177107
0.0668287025 -0.0007013147 0.0451919993
0.2744300250 0.0514340902 0.0199308822
0.2743248646 -0.0532130579 0.0198465238
0.2914660009 0.0513683434 0.0802533907
0.2913608405 -0.0532788047 0.0801690323
0.3062175001 -0.0537180120 0.1111849155
0.3063234630 0.0517276851 0.1112699176
-0.0267185071 0.0000166764 -0.1989166894
0.0537300781 -0.0002937983 0.0859428637
0.0711113688 -0.0337113658 0.1098251972
0.0711775993 0.0321958152 0.1098783265
-0.3461064299 0.2205639360 -0.0105537511
-0.3465493477 -0.2201921472 -0.0109090543
-0.3168817388 0.2204511493 0.0929276518
-0.3173246565 -0.2203049339 0.0925723485
0.1500055553 -0.0007180550 -0.0377290391
0.1826594650 -0.1214378451 0.0782267366
0.1829018334 0.1197477233 0.0784211616
0.2107246822 0.0624466436 0.1770961995
0.2105972617 -0.0643519622 0.1769939844
0.2001148151 0.1016704281 0.1394199962
0.1999086449 -0.1034935496 0.1392546089
0.1656529347 0.1018034266 0.0173942848
0.1654467645 -0.1033605511 0.0172288975
0.2155557442 -0.0009710325 0.1943769382
0.1549643179 0.0626618393 -0.0203450907
0.1548368974 -0.0641367666 -0.0204473058
0.1739409492 0.1151916662 0.0467042943
0.1737078070 -0.1168126583 0.0465172705
0.1918534914 0.1151225364 0.1101306277
0.1916203493 -0.1168817881 0.1099436039
0.0725414761 0.0365566020 0.0468437867
0.0724665796 -0.0379742868 0.0467837057
0.1053165705 0.0364301133 0.1628967754
0.1052416741 -0.0381007755 0.1628366944
0.0919592169 -0.0519957296 0.0176811909
0.0920623025 0.0505867765 0.0177638850
0.1370700581 -0.0521698256 0.1774136963
0.1371731437 0.0504126805 0.1774963903
-0.2081511569 -0.0001011362 0.1734028996
-0.1727355204 -0.0682262866 0.1595631555
-0.2187363242 -0.0681850912 0.1658041831
-0.1621503531 -0.0001423316 0.1671618720
-0.2647371280 -0.0681438959 0.1720452107
-0.2541519607 -0.0000599408 0.1796439272
-0.2187363242 -0.0681850912 0.1658041831
-0.0312097356 -0.0002386626 0.1234318540
0.0162083144 -0.0683622587 0.0927017907
-0.0262615924 -0.0683346908 0.1114462858
0.0112601713 -0.0002662305 0.1046873588
-0.0687314993 -0.0683071230 0.1301907810
-0.0736796424 -0.0002110948 0.1421763492
-0.0262615924 -0.0683346908 0.1114462858
-0.1253174704 -0.1363498827 0.1288330921
-0.1727355204 -0.0682262866 0.1595631555
-0.1207335098 -0.0682667048 0.1448769682
-0.1490264954 -0.1022880846 0.1441981238
-0.1444425348 -0.0342049068 0.1602419999
-0.1773194810 -0.1363094645 0.1435192793
-0.2010285060 -0.1022476665 0.1588843110
-0.1490264954 -0.1022880846 0.1441981238
-0.0687314993 -0.0683071230 0.1301907810
-0.0733154599 -0.1363903009 0.1141469049
-0.0970244849 -0.1023285028 0.1295119366
-0.0450224743 -0.1023689210 0.1148257494
-0.1207335098 -0.0682667048 0.1448769682
-0.0924405243 -0.0342453250 0.1455558127
-0.0970244849 -0.1023285028 0.1295119366
-0.3207424676 -0.1101631344 0.1561193506
-0.3561581041 -0.0420379840 0.1699590947
-0.3104476161 -0.0550909399 0.1710021527
-0.3664529557 -0.0971101785 0.1550762926
-0.2647371280 -0.0681438959 0.1720452107
-0.2750319796 -0.1232160903 0.1571624086
-0.3104476161 -0.0550909399 0.1710021527
0.0555473937 -0.1104556030 0.0498491643
0.0162083144 -0.0683622587 0.0927017907
0.0546387359 -0.0553747007 0.0678960140
0.0171169722 -0.1234431610 0.0746549410
0.0930691574 -0.0423871426 0.0430902373
0.0939778152 -0.0974680450 0.0250433876
0.0546387359 -0.0553747007 0.0678960140
0.1479231971 -0.0718476922 -0.0945262828
0.1275633787 -0.1139566225 -0.0436242588
0.1401657169 -0.0781640896 -0.0471443360
0.1353208589 -0.1076402251 -0.0910062056
0.1527680551 -0.0423715566 -0.0506644131
0.1605255353 -0.0360551592 -0.0980463599
0.1401657169 -0.0781640896 -0.0471443360
0.1480671092 0.0713620252 -0.0944108383
0.1528526445 0.0418050172 -0.0505965565
0.1403222624 0.0776173429 -0.0470187571
0.1605974914 0.0355496994 -0.0979886377
0.1277918802 0.1134296687 -0.0434409577
0.1355367270 0.1071743509 -0.0908330388
0.1403222624 0.0776173429 -0.0470187571
0.1324928261 -0.0003039132 0.0003054675
0.1528526445 0.0418050172 -0.0505965565
0.1528103498 -0.0002832697 -0.0506304848
0.1325351208 0.0417843737 0.0003393958
0.1527680551 -0.0423715566 -0.0506644131
0.1324505314 -0.0423922001 0.0002715392
0.1528103498 -0.0002832697 -0.0506304848
0.1479231971 -0.0718476922 -0.0945262828
0.1291247982 -0.0422803104 -0.1343825742
0.1165224599 -0.0780728433 -0.1308624970
0.1605255353 -0.0360551592 -0.0980463599
0.1039201217 -0.1138653762 -0.1273424199
0.1353208589 -0.1076402251 -0.0910062056
0.1165224599 -0.0780728433 -0.1308624970
0.1480671092 0.0713620252 -0.0944108383
0.1041486232 0.1135209149 -0.1271591188
0.1166790054 0.0777085892 -0.1307369182
0.1355367270 0.1071743509 -0.0908330388
0.1292093876 0.0418962634 -0.1343147176
0.1605974914 0.0355496994 -0.0979886377
0.1166790054 0.0777085892 -0.1307369182
0.0852063122 -0.0001214206 -0.1671308547
0.0292861972 0.0420359148 -0.1829898437
0.0292439025 -0.0000523721 -0.1830237720
0.0852486069 0.0419668663 -0.1670969264
0.0292016078 -0.0421406590 -0.1830577003
0.0851640175 -0.0422097075 -0.1671647830
0.0292439025 -0.0000523721 -0.1830237720
0.0852063122 -0.0001214206 -0.1671308547
0.1291247982 -0.0422803104 -0.1343825742
0.1291670929 -0.0001920235 -0.1343486459
0.0851640175 -0.0422097075 -0.1671647830
0.1292093876 0.0418962634 -0.1343147176
0.0852486069 0.0419668663 -0.1670969264
0.1291670929 -0.0001920235 -0.1343486459
-0.3205210095 0.1102141314 0.1562970016
-0.2646002593 0.0680567962 0.1721550051
-0.3103368870 0.0550976930 0.1710909782
-0.2747843819 0.1231732346 0.1573610285
-0.3560735147 0.0421385898 0.1700269513
-0.3662576372 0.0972550283 0.1552329747
-0.3103368870 0.0550976930 0.1710909782
-0.2081511569 -0.0001011362 0.1734028996
-0.2646002593 0.0680567962 0.1721550051
-0.2185994555 0.0680156008 0.1659139775
-0.2541519607 -0.0000599408 0.1796439272
-0.1725986517 0.0679744054 0.1596729498
-0.1621503531 -0.0001423316 0.1671618720
-0.2185994555 0.0680156008 0.1659139775
-0.0312097356 -0.0002386626 0.1234318540
-0.0685946306 0.0678935690 0.1303005754
-0.0261247238 0.0678660012 0.1115560802
-0.0736796424 -0.0002110948 0.1421763492
0.0163451831 0.0678384333 0.0928115851
0.0112601713 -0.0002662305 0.1046873588
-0.0261247238 0.0678660012 0.1115560802
-0.1250437331 0.1360515014 0.1290526809
-0.0685946306 0.0678935690 0.1303005754
-0.1205966412 0.0679339872 0.1449867626
-0.0968191818 0.1019725352 0.1296766282
-0.0923720899 0.0338550210 0.1456107099
-0.0730417225 0.1360110832 0.1143664937
-0.0448171713 0.1019321170 0.1149904409
-0.0968191818 0.1019725352 0.1296766282
-0.1725986517 0.0679744054 0.1596729498
-0.1770457436 0.1360919196 0.1437388681
-0.1488211924 0.1020129534 0.1443628154
-0.2008232030 0.1020533716 0.1590490026
-0.1205966412 0.0679339872 0.1449867626
-0.1443741005 0.0338954392 0.1602968971
-0.1488211924 0.1020129534 0.1443628154
0.0557688518 0.1099216628 0.0500268153
0.0931537468 0.0417894312 0.0431580939
0.0547494650 0.0548139322 0.0679848395
0.0941731337 0.0968971617 0.0252000697
0.0163451831 0.0678384333 0.0928115851
0.0173645699 0.1229461639 0.0748535609
0.0547494650 0.0548139322 0.0679848395
-0.4120788543 0.0001193513 0.1541010913
-0.3560735147 0.0421385898 0.1700269513
-0.3561158094 0.0000503029 0.1699930230
-0.4120365596 0.0422076382 0.1541350196
-0.3561581041 -0.0420379840 0.1699590947
-0.4121211490 -0.0419689356 0.1540671630
-0.3561158094 0.0000503029 0.1699930230
-0.1253174704 -0.1363498827 0.1288330921
-0.0800611183 -0.1841238851 0.0903927140
-0.1320631289 -0.1840834669 0.1050789012
-0.0733154599 -0.1363903009 0.1141469049
-0.1840651394 -0.1840430487 0.1197650884
-0.1773194810 -0.1363094645 0.1435192793
-0.1320631289 -0.1840834669 0.1050789012
-0.2280667219 -0.2260609925 0.0869485294
-0.2733230741 -0.1782869901 0.1253889075
-0.2286941067 -0.1811650194 0.1225769980
-0.2726956892 -0.2231829632 0.0897604390
-0.1840651394 -0.1840430487 0.1197650884
-0.1834377546 -0.2289390218 0.0841366198
-0.2286941067 -0.1811650194 0.1225769980
-0.3647440501 -0.1521810782 0.1233027916
-0.3836023100 -0.1816463219 0.0833985274
-0.4073120068 -0.1475843941 0.0987637489
-0.3410343533 -0.1862430061 0.1079375701
-0.4310217035 -0.1135224662 0.1141289705
-0.3884537469 -0.1181191504 0.1386680131
-0.4073120068 -0.1475843941 0.0987637489
-0.3207424676 -0.1101631344 0.1561193506
-0.2733230741 -0.1782869901 0.1253889075
-0.3190335621 -0.1652340342 0.1243458496
-0.2750319796 -0.1232160903 0.1571624086
-0.3647440501 -0.1521810782 0.1233027916
-0.3664529557 -0.0971101785 0.1550762926
-0.3190335621 -0.1652340342 0.1243458496
0.0563650617 -0.1819432474 -0.0967226493
0.0378006778 -0.2012548855 -0.0496002083
0.0231883322 -0.2011984921 -0.1013409097
0.0046239483 -0.2205101302 -0.0542184687
0.0709774073 -0.1819996408 -0.0449819479
0.0895417912 -0.1626880027 -0.0921043889
0.0378006778 -0.2012548855 -0.0496002083
-0.0868490979 -0.2464270432 -0.0563471176
-0.0992585842 -0.2260394519 -0.1003437150
-0.1376889345 -0.2390261051 -0.0755376887
-0.0484187476 -0.2334403900 -0.0811531438
-0.1376889345 -0.2390261051 -0.0755376887
-0.1761192848 -0.2520127583 -0.0507316624
-0.1252794482 -0.2594136964 -0.0315410913
-0.0868490979 -0.2464270432 -0.0563471176
-0.0722367523 -0.2464834366 -0.0046064161
-0.0338064020 -0.2334967834 -0.0294124424
-0.1179732754 -0.2594418931 -0.0056707406
-0.0338064020 -0.2334967834 -0.0294124424
0.0046239483 -0.2205101302 -0.0542184687
-0.0484187476 -0.2334403900 -0.0811531438
-0.0597862467 -0.2261917873 0.0394234715
-0.0800611183 -0.1841238851 0.0903927140
-0.0405498480 -0.1813112532 0.0694420946
-0.0992975170 -0.2290044192 0.0603740909
-0.0010385777 -0.1784986213 0.0484914752
-0.0202749764 -0.2233791554 0.0184728521
-0.0405498480 -0.1813112532 0.0694420946
0.0758222653 -0.1525235052 -0.0011200782
0.1275633787 -0.1139566225 -0.0436242588
0.0992703930 -0.1479781316 -0.0443031033
0.1041152510 -0.1185019961 -0.0004412337
0.0709774073 -0.1819996408 -0.0449819479
0.0475292796 -0.1865450144 -0.0017989228
0.0992703930 -0.1479781316 -0.0443031033
0.0555473937 -0.1104556030 0.0498491643
0.0758222653 -0.1525235052 -0.0011200782
0.0373918438 -0.1655110633 0.0236856985
0.0939778152 -0.0974680450 0.0250433876
-0.0010385777 -0.1784986213 0.0484914752
0.0171169722 -0.1234431610 0.0746549410
0.0373918438 -0.1655110633 0.0236856985
-0.0992585842 -0.2260394519 -0.1003437150
-0.0539064415 -0.1782945887 -0.1387077901
-0.0985415349 -0.1810874462 -0.1359000625
-0.0546234907 -0.2232465944 -0.1031514426
-0.1431766284 -0.1838803038 -0.1330923350
-0.1438936776 -0.2288323095 -0.0975359874
-0.0985415349 -0.1810874462 -0.1359000625
0.0375666627 -0.1523758656 -0.1365789407
0.0563650617 -0.1819432474 -0.0967226493
0.0801425917 -0.1479043118 -0.1120325346
0.0137891327 -0.1864148012 -0.1212690554
0.1039201217 -0.1138653762 -0.1273424199
0.0613441927 -0.1183369300 -0.1518888260
0.0801425917 -0.1479043118 -0.1120325346
-0.0063513815 -0.1102167174 -0.1693275607
0.0292016078 -0.0421406590 -0.1830577003
-0.0165349443 -0.0551000205 -0.1841221250
0.0393851706 -0.0972573559 -0.1682631360
-0.0622714964 -0.0680593820 -0.1851865497
-0.0520879336 -0.1231760790 -0.1703919854
-0.0165349443 -0.0551000205 -0.1841221250
-0.0063513815 -0.1102167174 -0.1693275607
-0.0539064415 -0.1782945887 -0.1387077901
-0.0081698894 -0.1653352271 -0.1376433654
-0.0520879336 -0.1231760790 -0.1703919854
0.0375666627 -0.1523758656 -0.1365789407
0.0393851706 -0.0972573559 -0.1682631360
-0.0081698894 -0.1653352271 -0.1376433654
-0.2018285069 -0.1360546041 -0.1420840356
-0.2471806495 -0.1837994674 -0.1037199605
-0.1951786390 -0.1838398856 -0.1184061477
-0.2538305174 -0.1360141859 -0.1273978484
-0.1431766284 -0.1838803038 -0.1330923350
-0.1498264963 -0.1360950223 -0.1567702228
-0.1951786390 -0.1838398856 -0.1184061477
-0.1187205421 0.0000990673 -0.1864342447
-0.1542735315 -0.0679769912 -0.1727041050
-0.1082725139 -0.0680181866 -0.1789453274
-0.1647215597 0.0001402627 -0.1801930224
-0.0622714964 -0.0680593820 -0.1851865497
-0.0727195246 0.0000578718 -0.1926754670
-0.1082725139 -0.0680181866 -0.1789453274
-0.2956619634 0.0002365937 -0.1364631991
-0.3432169388 -0.0678410192 -0.1058431297
-0.3007472457 -0.0678685870 -0.1245874302
-0.3381316565 0.0002641615 -0.1177188987
-0.2582775526 -0.0678961548 -0.1433317306
-0.2531922703 0.0002090260 -0.1552074996
-0.3007472457 -0.0678685870 -0.1245874302
-0.2018285069 -0.1360546041 -0.1420840356
-0.1542735315 -0.0679769912 -0.1727041050
-0.2062755420 -0.0679365730 -0.1580179178
-0.1780510192 -0.1020157976 -0.1573940703
-0.1824980543 -0.0338977665 -0.1733279525
-0.1498264963 -0.1360950223 -0.1567702228
-0.1260490086 -0.1020562158 -0.1720802576
-0.1780510192 -0.1020157976 -0.1573940703
-0.2582775526 -0.0678961548 -0.1433317306
-0.2538305174 -0.1360141859 -0.1273978484
-0.2300530297 -0.1019753794 -0.1427078831
-0.2820550403 -0.1019349612 -0.1280216959
-0.2062755420 -0.0679365730 -0.1580179178
-0.2345000649 -0.0338573483 -0.1586417653
-0.2300530297 -0.1019753794 -0.1427078831
-0.2956619634 0.0002365937 -0.1364631991
-0.2581406839 0.0683045372 -0.1432219362
-0.3006103770 0.0683321050 -0.1244776358
-0.2531922703 0.0002090260 -0.1552074996
-0.3430800702 0.0683596728 -0.1057333353
-0.3381316565 0.0002641615 -0.1177188987
-0.3006103770 0.0683321050 -0.1244776358
-0.1187205421 0.0000990673 -0.1864342447
-0.0621346277 0.0681413100 -0.1850767553
-0.1081356452 0.0681825054 -0.1788355330
-0.0727195246 0.0000578718 -0.1926754670
-0.1541366628 0.0682237009 -0.1725943107
-0.1647215597 0.0001402627 -0.1801930224
-0.1081356452 0.0681825054 -0.1788355330
-0.2015547695 0.1363467799 -0.1418644468
-0.1428069038 0.1840398418 -0.1327957464
-0.1948089144 0.1840802599 -0.1181095592
-0.1495527589 0.1363063617 -0.1565506341
-0.2468109250 0.1841206781 -0.1034233720
-0.2535567801 0.1363871981 -0.1271782596
-0.1948089144 0.1840802599 -0.1181095592
-0.2015547695 0.1363467799 -0.1418644468
-0.2581406839 0.0683045372 -0.1432219362
-0.2061386733 0.0682641190 -0.1579081234
-0.2298477267 0.1023256586 -0.1425431915
-0.2344316305 0.0342429977 -0.1585868681
-0.2535567801 0.1363871981 -0.1271782596
-0.2818497373 0.1023660768 -0.1278570043
-0.2298477267 0.1023256586 -0.1425431915
-0.1541366628 0.0682237009 -0.1725943107
-0.1495527589 0.1363063617 -0.1565506341
-0.1778457161 0.1022852404 -0.1572293787
-0.1258437056 0.1022448222 -0.1719155660
-0.2061386733 0.0682641190 -0.1579081234
-0.1824296200 0.0342025795 -0.1732730553
-0.1778457161 0.1022852404 -0.1572293787
-0.0988042694 0.2260580432 -0.0999792692
-0.1428069038 0.1840398418 -0.1327957464
-0.0981775089 0.1811619934 -0.1356080452
-0.1434336643 0.2289358916 -0.0971669704
-0.0535481139 0.1782841450 -0.1384203441
-0.0541748745 0.2231801948 -0.1027915681
-0.0981775089 0.1811619934 -0.1356080452
-0.0061299234 0.1101605484 -0.1691499097
-0.0621346277 0.0681413100 -0.1850767553
-0.0164242152 0.0550886124 -0.1840332995
-0.0518403359 0.1232132460 -0.1701933655
0.0292861972 0.0420359148 -0.1829898437
0.0395804891 0.0971078508 -0.1681064539
-0.0164242152 0.0550886124 -0.1840332995
0.0378727110 0.1521787498 -0.1363334325
0.1041486232 0.1135209149 -0.1271591188
0.0804395279 0.1475827132 -0.1117943360
0.0615818063 0.1181169515 -0.1516982153
0.0567304326 0.1816445115 -0.0964295532
0.0141636158 0.1862405481 -0.1209686497
0.0804395279 0.1475827132 -0.1117943360
-0.0061299234 0.1101605484 -0.1691499097
0.0378727110 0.1521787498 -0.1363334325
-0.0078377015 0.1652314474 -0.1373768883
0.0395804891 0.0971078508 -0.1681064539
-0.0535481139 0.1782841450 -0.1384203441
-0.0518403359 0.1232132460 -0.1701933655
-0.0078377015 0.1652314474 -0.1373768883
-0.0863539027 0.2463513480 -0.0559498780
-0.1372084810 0.2390825440 -0.0751522748
-0.1247581143 0.2593758488 -0.0311228835
-0.1756126926 0.2521070448 -0.0503252803
-0.0988042694 0.2260580432 -0.0999792692
-0.0479496911 0.2333268472 -0.0807768724
-0.1372084810 0.2390825440 -0.0751522748
0.0713427782 0.1815881182 -0.0446888518
0.0308986494 0.2009452323 -0.0751463593
0.0455109949 0.2008888390 -0.0234056579
0.0050668661 0.2202459531 -0.0538631655
0.0567304326 0.1816445115 -0.0964295532
0.0898683887 0.1623155941 -0.0918423963
0.0308986494 0.2009452323 -0.0751463593
-0.0717415571 0.2462949547 -0.0042091766
-0.0863539027 0.2463513480 -0.0559498780
-0.0406435183 0.2332986505 -0.0549065217
-0.1247581143 0.2593758488 -0.0311228835
-0.0406435183 0.2332986505 -0.0549065217
0.0050668661 0.2202459531 -0.0538631655
-0.0260311727 0.2332422572 -0.0031658203
-0.3644380018 0.1523735372 0.1235482998
-0.4307932021 0.1138638249 0.1143122716
-0.4070150705 0.1479026310 0.0990019476
-0.3882161334 0.1183347311 0.1388586238
-0.3832369390 0.1819414370 0.0836916235
-0.3406598703 0.1864123433 0.1082379758
-0.4070150705 0.1479026310 0.0990019476
-0.2276124071 0.2260365026 0.0873129752
-0.1836954148 0.1838770968 0.1200616770
-0.2283300807 0.1810844202 0.1228690153
-0.1829777413 0.2288291793 0.0845056369
-0.2729647465 0.1782917435 0.1256763536
-0.2722470730 0.2232438260 0.0901203135
-0.2283300807 0.1810844202 0.1228690153
-0.3205210095 0.1102141314 0.1562970016
-0.3644380018 0.1523735372 0.1235482998
-0.3187013742 0.1653326404 0.1246123267
-0.3662576372 0.0972550283 0.1552329747
-0.2729647465 0.1782917435 0.1256763536
-0.2747843819 0.1231732346 0.1573610285
-0.3187013742 0.1653326404 0.1246123267
-0.1250437331 0.1360515014 0.1290526809
-0.1836954148 0.1838770968 0.1200616770
-0.1316934043 0.1838366786 0.1053754898
-0.1770457436 0.1360919196 0.1437388681
-0.0796913937 0.1837962605 0.0906893026
-0.0730417225 0.1360110832 0.1143664937
-0.1316934043 0.1838366786 0.1053754898
-0.0593319319 0.2259057078 0.0397879173
-0.0006802502 0.1780801123 0.0487789212
-0.0401858219 0.1809381864 0.0697341119
-0.0198263601 0.2230476338 0.0188327266
-0.0796913937 0.1837962605 0.0906893026
-0.0988375037 0.2287637819 0.0607431080
-0.0401858219 0.1809381864 0.0697341119
0.0761283136 0.1520311102 -0.0008745700
0.0713427782 0.1815881182 -0.0446888518
0.0995673292 0.1475088934 -0.0440649047
0.0479037626 0.1861103350 -0.0014985170
0.1277918802 0.1134296687 -0.0434409577
0.1043528646 0.1179518854 -0.0002506230
0.0995673292 0.1475088934 -0.0440649047
0.0557688518 0.1099216628 0.0500268153
-0.0006802502 0.1780801123 0.0487789212
0.0377240317 0.1650556113 0.0239521756
0.0173645699 0.1229461639 0.0748535609
0.0761283136 0.1520311102 -0.0008745700
0.0941731337 0.0968971617 0.0252000697
0.0377240317 0.1650556113 0.0239521756
-0.4749399817 -0.0713635762 0.0813800938
-0.4560817219 -0.0418983325 0.1212843580
-0.4435517127 -0.0777103994 0.1177066642
-0.4874699908 -0.0355515093 0.0849577876
-0.4310217035 -0.1135224662 0.1141289705
-0.4624099725 -0.1071756431 0.0778024001
-0.4435517127 -0.0777103994 0.1177066642
-0.4747960696 0.0718461412 0.0814955384
-0.4307932021 0.1138638249 0.1143122716
-0.4433951672 0.0780710331 0.1178322431
-0.4621941044 0.1076389330 0.0779755668
-0.4559971324 0.0422782413 0.1213522146
-0.4873980348 0.0360533493 0.0850155099
-0.4433951672 0.0780710331 0.1178322431
-0.4120788543 0.0001193513 0.1541010913
-0.4560817219 -0.0418983325 0.1212843580
-0.4560394271 0.0001899544 0.1213182863
-0.4121211490 -0.0419689356 0.1540671630
-0.4559971324 0.0422782413 0.1213522146
-0.4120365596 0.0422076382 0.1541350196
-0.4560394271 0.0001899544 0.1213182863
-0.4749399817 -0.0713635762 0.0813800938
-0.4546649605 -0.1134312199 0.0304108094
-0.4671949697 -0.0776191531 0.0339885032
-0.4624099725 -0.1071756431 0.0778024001
-0.4797249788 -0.0418070862 0.0375661969
-0.4874699908 -0.0355515093 0.0849577876
-0.4671949697 -0.0776191531 0.0339885032
-0.4593653683 0.0003018438 -0.0133352309
-0.4200256537 -0.0417915003 -0.0561888429
-0.4199833590 0.0002967866 -0.0561549146
-0.4594076630 -0.0417864431 -0.0133691592
-0.4199410643 0.0423850735 -0.0561209863
-0.4593230735 0.0423901307 -0.0133013026
-0.4199833590 0.0002967866 -0.0561549146
-0.4747960696 0.0718461412 0.0814955384
-0.4796403894 0.0423694876 0.0376340535
-0.4670384242 0.0781622794 0.0341140820
-0.4873980348 0.0360533493 0.0850155099
-0.4544364590 0.1139550712 0.0305941105
-0.4621941044 0.1076389330 0.0779755668
-0.4670384242 0.0781622794 0.0341140820
-0.4593653683 0.0003018438 -0.0133352309
-0.4796403894 0.0423694876 0.0376340535
-0.4796826841 0.0002812007 0.0376001252
-0.4593230735 0.0423901307 -0.0133013026
-0.4797249788 -0.0418070862 0.0375661969
-0.4594076630 -0.0417864431 -0.0133691592
-0.4796826841 0.0002812007 0.0376001252
-0.4029996527 -0.1520334386 -0.0121560709
-0.4546649605 -0.1134312199 0.0304108094
-0.4264398080 -0.1475105743 0.0310343177
-0.4312248052 -0.1179540843 -0.0127795792
-0.3982146555 -0.1815899286 0.0316578260
-0.3747745002 -0.1861127929 -0.0115325626
-0.4264398080 -0.1475105743 0.0310343177
-0.2675390594 -0.2259086572 -0.0528186571
-0.2471806495 -0.1837994674 -0.1037199605
-0.2866857937 -0.1809412124 -0.0827651591
-0.2280339152 -0.2287669121 -0.0737734585
-0.3261909378 -0.1780829575 -0.0618103577
-0.3070442035 -0.2230504022 -0.0318638557
-0.2866857937 -0.1809412124 -0.0827651591
-0.3826412428 -0.1099242488 -0.0630573744
-0.3432169388 -0.0678410192 -0.1058431297
-0.3816212963 -0.0548162598 -0.0810159863
-0.3442368854 -0.1229490083 -0.0878845178
-0.4200256537 -0.0417915003 -0.0561888429
-0.4210456003 -0.0968994894 -0.0382302309
-0.3816212963 -0.0548162598 -0.0810159863
-0.2670847446 0.2261888380 -0.0524542113
-0.3258326103 0.1784957762 -0.0615229117
-0.2863217676 0.1813082271 -0.0824731418
-0.3065955873 0.2233763870 -0.0315039812
-0.2468109250 0.1841206781 -0.1034233720
-0.2275739019 0.2290012890 -0.0734044414
-0.2863217676 0.1813082271 -0.0824731418
-0.4026936044 0.1525211768 -0.0119105627
-0.3978492846 0.1819978304 0.0319509221
-0.4261428718 0.1479764508 0.0312725163
-0.3744000172 0.1865425564 -0.0112321569
-0.4544364590 0.1139550712 0.0305941105
-0.4309871916 0.1184997972 -0.0125889685
-0.4261428718 0.1479764508 0.0312725163
-0.3824197847 0.1104530170 -0.0628797234
-0.4199410643 0.0423850735 -0.0561209863
-0.3815105672 0.0553723731 -0.0809271608
-0.4208502818 0.0974657173 -0.0380735488
-0.3430800702 0.0683596728 -0.1057333353
-0.3439892877 0.1234403166 -0.0876858979
-0.3815105672 0.0553723731 -0.0809271608
-0.3836023100 -0.1816463219 0.0833985274
-0.3650758288 -0.2009192346 0.0362447366
-0.3504634833 -0.2009756279 0.0879854380
-0.3319370021 -0.2202485406 0.0408316471
-0.3982146555 -0.1815899286 0.0316578260
-0.4240473095 -0.1622888193 0.0529412661
-0.3650758288 -0.2009192346 0.0362447366
-0.2405172275 -0.2463526418 0.0429186418
-0.2280667219 -0.2260609925 0.0869485294
-0.1896630074 -0.2390848464 0.0621216760
-0.2789209420 -0.2333287878 0.0677454952
-0.1896630074 -0.2390848464 0.0621216760
-0.1512592929 -0.2521087004 0.0372948227
-0.2021135130 -0.2593764957 0.0180917884
-0.2551295731 -0.2462962484 -0.0088220596
-0.2218291721 -0.2389607078 -0.0517751598
-0.2094196858 -0.2593482990 -0.0077785623
-0.1761192848 -0.2520127583 -0.0507316624
-0.2675390594 -0.2259086572 -0.0528186571
-0.3008394604 -0.2332441978 -0.0098655570
-0.2218291721 -0.2389607078 -0.0517751598
-0.2551295731 -0.2462962484 -0.0088220596
-0.2862271148 -0.2333005912 0.0418751445
-0.3008394604 -0.2332441978 -0.0098655570
-0.3319370021 -0.2202485406 0.0408316471
-0.2405172275 -0.2463526418 0.0429186418
-0.2094196858 -0.2593482990 -0.0077785623
-0.2862271148 -0.2333005912 0.0418751445
-0.0722367523 -0.2464834366 -0.0046064161
-0.1055227698 -0.2391502438 0.0383591471
-0.1179732754 -0.2594418931 -0.0056707406
-0.1512592929 -0.2521087004 0.0372948227
-0.0597862467 -0.2261917873 0.0394234715
-0.0265002292 -0.2335249800 -0.0035420917
-0.1055227698 -0.2391502438 0.0383591471
-0.0717415571 0.2462949547 -0.0042091766
-0.0593319319 0.2259057078 0.0397879173
-0.1050423163 0.2389584053 0.0387445610
-0.0260311727 0.2332422572 -0.0031658203
-0.1050423163 0.2389584053 0.0387445610
-0.1507527007 0.2520111028 0.0377012048
-0.1174519415 0.2593476522 -0.0052525328
-0.2546343779 0.2464821428 -0.0084248201
-0.2670847446 0.2261888380 -0.0524542113
-0.2213487186 0.2391479414 -0.0513897458
-0.3003704039 0.2335230394 -0.0094892856
-0.2213487186 0.2391479414 -0.0513897458
-0.1756126926 0.2521070448 -0.0503252803
-0.2088983519 0.2594412462 -0.0073603546
-0.2400220323 0.2464257495 0.0433158813
-0.1891825539 0.2390238027 0.0625070900
-0.2015921791 0.2594130496 0.0185099961
-0.1507527007 0.2520111028 0.0377012048
-0.2276124071 0.2260365026 0.0873129752
-0.2784518856 0.2334384494 0.0681217666
-0.1891825539 0.2390238027 0.0625070900
-0.3978492846 0.1819978304 0.0319509221
-0.3573655117 0.2012244898 0.0624392869
-0.3719778573 0.2012808832 0.0106985855
-0.3314940844 0.2205075427 0.0411869503
-0.3832369390 0.1819414370 0.0836916235
-0.4237207119 0.1627147776 0.0532032587
-0.3573655117 0.2012244898 0.0624392869
-0.2400220323 0.2464257495 0.0433158813
-0.2930642311 0.2334948427 0.0163810651
-0.2784518856 0.2334384494 0.0681217666
-0.3314940844 0.2205075427 0.0411869503
-0.2546343779 0.2464821428 -0.0084248201
-0.2088983519 0.2594412462 -0.0073603546
-0.2930642311 0.2334948427 0.0163810651
0.1324928261 -0.0003039132 0.0003054675
0.0930691574 -0.0423871426 0.0430902373
0.0931114521 -0.0002988557 0.0431241656
0.1324505314 -0.0423922001 0.0002715392
0.0931537468 0.0417894312 0.0431580939
0.1325351208 0.0417843737 0.0003393958
0.0931114521 -0.0002988557 0.0431241656
-0.3826412428 -0.1099242488 -0.0630573744
-0.4029996527 -0.1520334386 -0.0121560709
-0.3645952953 -0.1650581980 -0.0369832143
-0.4210456003 -0.0968994894 -0.0382302309
-0.3261909378 -0.1780829575 -0.0618103577
-0.3442368854 -0.1229490083 -0.0878845178
-0.3645952953 -0.1650581980 -0.0369832143
-0.3824197847 0.1104530170 -0.0628797234
-0.3258326103 0.1784957762 -0.0615229117
-0.3642631073 0.1655084765 -0.0367167372
-0.3439892877 0.1234403166 -0.0876858979
-0.4026936044 0.1525211768 -0.0119105627
-0.4208502818 0.0974657173 -0.0380735488
-0.3642631073 0.1655084765 -0.0367167372
0.3883128941 -0.0064570378 0.0279162617
0.3883128941 -0.0064570378 0.0279162617
0.3900442392 -0.0152762377 0.0340710166
0.3900442392 -0.0152762377 0.0340710166
0.3928565237 -0.0186535259 0.0440382703
0.3928565237 -0.0186535259 0.0440382703
0.3956754335 -0.0152979702 0.0540104537
0.3956754335 -0.0152979702 0.0540104537
0.3974244901 -0.0064922022 0.0601794166
0.3976644266 -0.0010465275 0.0610140156
0.3976644266 -0.0010465275 0.0610140156
0.3974354361 0.0044004397 0.0601881974
0.3957040910 0.0132196396 0.0540334424
0.3943712348 0.0157285338 0.0493070552
0.3928919470 0.0165969272 0.0440666865
0.3928919470 0.0165969272 0.0440666865
0.3914107849 0.0157399590 0.0388244291
0.3890092551 0.0093463295 0.0303384991
0.3883238401 0.0044356040 0.0279250425
0.3883238401 0.0044356040 0.0279250425
-0.1904433386 -0.0341637114 0.1664830275
-0.2010285060 -0.1022476665 0.1588843110
-0.1444425348 -0.0342049068 0.1602419999
-0.1904433386 -0.0341637114 0.1664830275
-0.2364441424 -0.0341225160 0.1727240551
-0.2824449462 -0.0340813206 0.1789650827
-0.2470293098 -0.1022064711 0.1651253386
-0.2364441424 -0.0341225160 0.1727240551
-0.0075007106 -0.0343004607 0.1080668223
-0.0025525674 -0.1023964889 0.0960812542
0.0349691963 -0.0343280285 0.0893223272
-0.0075007106 -0.0343004607 0.1080668223
-0.0499706174 -0.0342728928 0.1268113175
-0.0924405243 -0.0342453250 0.1455558127
-0.0450224743 -0.1023689210 0.1148257494
-0.0499706174 -0.0342728928 0.1268113175
-0.1467345151 -0.0682464957 0.1522200618
-0.1230254901 -0.1023082937 0.1368550302
-0.1184415296 -0.0342251159 0.1528989063
-0.1467345151 -0.0682464957 0.1522200618
-0.1750275007 -0.1022678755 0.1515412174
-0.2033204863 -0.1362892554 0.1508623730
-0.1513184757 -0.1363296736 0.1361761857
-0.1750275007 -0.1022678755 0.1515412174
-0.0710234796 -0.1023487119 0.1221688430
-0.0993164652 -0.1363700918 0.1214899985
-0.0473144546 -0.1364105100 0.1068038113
-0.0710234796 -0.1023487119 0.1221688430
-0.0947325046 -0.0682869139 0.1375338746
-0.1184415296 -0.0342251159 0.1528989063
-0.1230254901 -0.1023082937 0.1368550302
-0.0947325046 -0.0682869139 0.1375338746
-0.3384502859 -0.0761005592 0.1630392227
-0.3281554343 -0.0210283647 0.1779220248
-0.3841607739 -0.0630476032 0.1619961647
-0.3384502859 -0.0761005592 0.1630392227
-0.2927397978 -0.0891535151 0.1640822806
-0.2470293098 -0.1022064711 0.1651253386
-0.2824449462 -0.0340813206 0.1789650827
-0.2927397978 -0.0891535151 0.1640822806
0.0358778541 -0.0894089308 0.0712754775
0.0349691963 -0.0343280285 0.0893223272
-0.0025525674 -0.1023964889 0.0960812542
0.0358778541 -0.0894089308 0.0712754775
0.0743082756 -0.0764213728 0.0464697008
0.1127386971 -0.0634338148 0.0216639241
0.0733996178 -0.0213404705 0.0645165505
0.0743082756 -0.0764213728 0.0464697008
0.1377432879 -0.0929021573 -0.0690752708
0.1299858077 -0.0992185547 -0.0216933240
0.1251409497 -0.1286946902 -0.0655551936
0.1377432879 -0.0929021573 -0.0690752708
0.1503456261 -0.0571096244 -0.0725953479
0.1629479643 -0.0213170915 -0.0761154251
0.1425881459 -0.0634260218 -0.0252134011
0.1503456261 -0.0571096244 -0.0725953479
0.1504598769 0.0565835212 -0.0725036974
0.1427150300 0.0628388389 -0.0251116162
0.1629902591 0.0207711954 -0.0760814968
0.1504598769 0.0565835212 -0.0725036974
0.1379294947 0.0923958469 -0.0689258980
0.1253991125 0.1282081727 -0.0653480986
0.1301846479 0.0986511647 -0.0215338168
0.1379294947 0.0923958469 -0.0689258980
0.1426727353 0.0207505520 -0.0251455445
0.1629902591 0.0207711954 -0.0760814968
0.1427150300 0.0628388389 -0.0251116162
0.1426727353 0.0207505520 -0.0251455445
0.1426304406 -0.0213377349 -0.0251794728
0.1425881459 -0.0634260218 -0.0252134011
0.1629479643 -0.0213170915 -0.0761154251
0.1426304406 -0.0213377349 -0.0251794728
0.1385239976 -0.0570640013 -0.1144544285
0.1071232605 -0.0632891524 -0.1507906428
0.1511263359 -0.0212714683 -0.1179745056
0.1385239976 -0.0570640013 -0.1144544285
0.1259216594 -0.0928565342 -0.1109343513
0.1133193212 -0.1286490671 -0.1074142742
0.0945209222 -0.0990816853 -0.1472705656
0.1259216594 -0.0928565342 -0.1109343513
0.1261078662 0.0924414701 -0.1107849785
0.0947197624 0.0987880341 -0.1471110584
0.1135774840 0.1282537958 -0.1072071791
0.1261078662 0.0924414701 -0.1107849785
0.1386382484 0.0566291443 -0.1143627779
0.1511686306 0.0208168186 -0.1179405773
0.1072501446 0.0629757083 -0.1506888579
0.1386382484 0.0566291443 -0.1143627779
0.0572462547 0.0209572471 -0.1750603492
0.0012838451 0.0210262956 -0.1909532665
0.0572885494 0.0630455340 -0.1750264209
0.0572462547 0.0209572471 -0.1750603492
0.0572039600 -0.0211310398 -0.1750942775
0.0571616653 -0.0632193267 -0.1751282058
0.0012415504 -0.0210619913 -0.1909871948
0.0572039600 -0.0211310398 -0.1750942775
0.1071655552 -0.0212008655 -0.1507567145
0.1511263359 -0.0212714683 -0.1179745056
0.1071232605 -0.0632891524 -0.1507906428
0.1071655552 -0.0212008655 -0.1507567145
0.1072078499 0.0208874214 -0.1507227862
0.1072501446 0.0629757083 -0.1506888579
0.1511686306 0.0208168186 -0.1179405773
0.1072078499 0.0208874214 -0.1507227862
-0.2925606344 0.0891354638 0.1642260033
-0.2823765119 0.0340190254 0.1790199799
-0.2468240068 0.1020945670 0.1652900302
-0.2925606344 0.0891354638 0.1642260033
-0.3382972621 0.0761763606 0.1631619765
-0.3840338898 0.0632172575 0.1620979496
-0.3281131396 0.0210599222 0.1779559531
-0.3382972621 0.0761763606 0.1631619765
-0.2363757081 0.0339778300 0.1727789523
-0.2468240068 0.1020945670 0.1652900302
-0.2823765119 0.0340190254 0.1790199799
-0.2363757081 0.0339778300 0.1727789523
-0.1903749043 0.0339366346 0.1665379247
-0.1443741005 0.0338954392 0.1602968971
-0.2008232030 0.1020533716 0.1590490026
-0.1903749043 0.0339366346 0.1665379247
-0.0499021831 0.0338274532 0.1268662147
-0.0448171713 0.1019321170 0.1149904409
-0.0923720899 0.0338550210 0.1456107099
-0.0499021831 0.0338274532 0.1268662147
-0.0074322762 0.0337998853 0.1081217195
0.0350376306 0.0337723175 0.0893772244
-0.0023472644 0.1019045492 0.0962459458
-0.0074322762 0.0337998853 0.1081217195
-0.0945956359 0.0679137781 0.1376436690
-0.1228201871 0.1019927443 0.1370197218
-0.1183730952 0.0338752301 0.1529538035
-0.0945956359 0.0679137781 0.1376436690
-0.0708181766 0.1019523261 0.1223335345
-0.0470407172 0.1359908741 0.1070234001
-0.0990427278 0.1360312923 0.1217095873
-0.0708181766 0.1019523261 0.1223335345
-0.1748221977 0.1020331625 0.1517059090
-0.1510447384 0.1360717105 0.1363957745
-0.2030467489 0.1361121286 0.1510819617
-0.1748221977 0.1020331625 0.1517059090
-0.1465976465 0.0679541963 0.1523298562
-0.1183730952 0.0338752301 0.1529538035
-0.1228201871 0.1019927443 0.1370197218
-0.1465976465 0.0679541963 0.1523298562
0.0744612993 0.0758555470 0.0465924546
0.0734419125 0.0207478164 0.0645504788
0.1128655812 0.0628310459 0.0217657090
0.0744612993 0.0758555470 0.0465924546
0.0360570174 0.0888800481 0.0714192002
-0.0023472644 0.1019045492 0.0962459458
0.0350376306 0.0337723175 0.0893772244
0.0360570174 0.0888800481 0.0714192002
-0.3840761845 0.0211289706 0.1620640213
-0.3281131396 0.0210599222 0.1779559531
-0.3840338898 0.0632172575 0.1620979496
-0.3840761845 0.0211289706 0.1620640213
-0.3841184792 -0.0209593163 0.1620300930
-0.3841607739 -0.0630476032 0.1619961647
-0.3281554343 -0.0210283647 0.1779220248
-0.3841184792 -0.0209593163 0.1620300930
-0.1026892944 -0.1602368839 0.1096129031
-0.1094349528 -0.2079704681 0.0858587121
-0.0506872838 -0.1602773021 0.0949267158
-0.1026892944 -0.1602368839 0.1096129031
-0.1546913049 -0.1601964657 0.1242990903
-0.2066933155 -0.1601560475 0.1389852775
-0.1614369633 -0.2079300499 0.1005448994
-0.1546913049 -0.1601964657 0.1242990903
-0.2506948980 -0.2021739913 0.1061687185
-0.2513222828 -0.1572780182 0.1417971871
-0.2953238653 -0.1992959620 0.1089806280
-0.2506948980 -0.2021739913 0.1061687185
-0.2060659307 -0.2050520206 0.1033568089
-0.1614369633 -0.2079300499 0.1005448994
-0.2066933155 -0.1601560475 0.1389852775
-0.2060659307 -0.2050520206 0.1033568089
-0.3741731800 -0.1669137001 0.1033506595
-0.4167411367 -0.1623170159 0.0788116168
-0.3504634833 -0.2009756279 0.0879854380
-0.3741731800 -0.1669137001 0.1033506595
-0.3978828768 -0.1328517722 0.1187158810
-0.4215925736 -0.0987898444 0.1340811026
-0.4404508335 -0.1282550881 0.0941768384
-0.3978828768 -0.1328517722 0.1187158810
-0.2970327709 -0.1442250623 0.1407541291
-0.2953238653 -0.1992959620 0.1089806280
-0.2513222828 -0.1572780182 0.1417971871
-0.2970327709 -0.1442250623 0.1407541291
-0.3427432589 -0.1311721063 0.1397110711
-0.3884537469 -0.1181191504 0.1386680131
-0.3410343533 -0.1862430061 0.1079375701
-0.3427432589 -0.1311721063 0.1397110711
0.0139061403 -0.2108543112 -0.0777796892
0.0470828697 -0.1915990664 -0.0731614288
0.0285184858 -0.2109107045 -0.0260389878
0.0139061403 -0.2108543112 -0.0777796892
0.0802595992 -0.1723438217 -0.0685431684
0.0968479639 -0.1627161994 -0.0662340382
0.0451068506 -0.2012830821 -0.0237298576
0.0470828697 -0.1915990664 -0.0731614288
-0.1122690162 -0.2427265742 -0.0659424031
-0.1438936776 -0.2288323095 -0.0975359874
-0.0546234907 -0.2232465944 -0.1031514426
-0.0738386659 -0.2297399210 -0.0907484294
-0.1506993665 -0.2557132274 -0.0411363768
-0.1631088528 -0.2353256361 -0.0851329743
-0.1122690162 -0.2427265742 -0.0659424031
-0.1506993665 -0.2557132274 -0.0411363768
-0.0603277499 -0.2399619133 -0.0428797800
-0.0265002292 -0.2335249800 -0.0035420917
-0.1024111866 -0.2529344682 -0.0310089291
-0.1252794482 -0.2594136964 -0.0315410913
-0.0218973996 -0.2269752601 -0.0676858063
-0.0072850541 -0.2270316534 -0.0159451049
-0.0603277499 -0.2399619133 -0.0428797800
-0.0218973996 -0.2269752601 -0.0676858063
-0.0699236825 -0.2051578362 0.0649080927
-0.0506872838 -0.1602773021 0.0949267158
-0.1094349528 -0.2079704681 0.0858587121
-0.0699236825 -0.2051578362 0.0649080927
-0.0304124122 -0.2023452043 0.0439574733
0.0090988581 -0.1995325724 0.0230068539
-0.0111760135 -0.1574646702 0.0739760964
-0.0304124122 -0.2023452043 0.0439574733
0.1016928220 -0.1332400639 -0.0223721685
0.1251409497 -0.1286946902 -0.0655551936
0.1299858077 -0.0992185547 -0.0216933240
0.1016928220 -0.1332400639 -0.0223721685
0.0733998363 -0.1672615730 -0.0230510131
0.0451068506 -0.2012830821 -0.0237298576
0.0968479639 -0.1627161994 -0.0662340382
0.0733998363 -0.1672615730 -0.0230510131
0.0656848295 -0.1314895541 0.0243645430
0.0475292796 -0.1865450144 -0.0017989228
0.1041152510 -0.1185019961 -0.0004412337
0.0656848295 -0.1314895541 0.0243645430
0.0272544080 -0.1444771121 0.0491703197
-0.0111760135 -0.1574646702 0.0739760964
0.0090988581 -0.1995325724 0.0230068539
0.0272544080 -0.1444771121 0.0491703197
-0.0765825128 -0.2021670203 -0.1195257526
-0.0758654636 -0.1572150146 -0.1550821001
-0.0319474194 -0.1993741627 -0.1223334801
-0.0765825128 -0.2021670203 -0.1195257526
-0.1212176063 -0.2049598779 -0.1167180250
-0.1658526998 -0.2077527354 -0.1139102974
-0.1205005571 -0.1600078721 -0.1522743725
-0.1212176063 -0.2049598779 -0.1167180250
0.0469658622 -0.1671595565 -0.1166507950
0.0895417912 -0.1626880027 -0.0921043889
0.0231883322 -0.2011984921 -0.1013409097
0.0469658622 -0.1671595565 -0.1166507950
0.0707433922 -0.1331206209 -0.1319606803
0.0945209222 -0.0990816853 -0.1472705656
0.1133193212 -0.1286490671 -0.1074142742
0.0707433922 -0.1331206209 -0.1319606803
0.0114251132 -0.0761786882 -0.1761926305
0.0012415504 -0.0210619913 -0.1909871948
0.0571616653 -0.0632193267 -0.1751282058
0.0114251132 -0.0761786882 -0.1761926305
-0.0343114389 -0.0891380497 -0.1772570552
-0.0800479911 -0.1020974113 -0.1783214799
-0.0444950017 -0.0340213528 -0.1920516195
-0.0343114389 -0.0891380497 -0.1772570552
-0.0301289115 -0.1442556531 -0.1540176754
-0.0319474194 -0.1993741627 -0.1223334801
-0.0758654636 -0.1572150146 -0.1550821001
-0.0301289115 -0.1442556531 -0.1540176754
0.0156076406 -0.1312962915 -0.1529532507
0.0613441927 -0.1183369300 -0.1518888260
0.0137891327 -0.1864148012 -0.1212690554
0.0156076406 -0.1312962915 -0.1529532507
-0.2245045782 -0.1599270357 -0.1229019981
-0.2178547103 -0.2077123172 -0.0992241102
-0.2765065888 -0.1598866176 -0.1082158109
-0.2245045782 -0.1599270357 -0.1229019981
-0.1725025676 -0.1599674539 -0.1375881853
-0.1205005571 -0.1600078721 -0.1522743725
-0.1658526998 -0.2077527354 -0.1139102974
-0.1725025676 -0.1599674539 -0.1375881853
-0.1364970368 -0.0339389619 -0.1795691749
-0.1260490086 -0.1020562158 -0.1720802576
-0.1824980543 -0.0338977665 -0.1733279525
-0.1364970368 -0.0339389619 -0.1795691749
-0.0904960193 -0.0339801574 -0.1858103972
-0.0444950017 -0.0340213528 -0.1920516195
-0.0800479911 -0.1020974113 -0.1783214799
-0.0904960193 -0.0339801574 -0.1858103972
-0.3194394511 -0.0338022127 -0.1211531644
-0.3245247334 -0.1019073935 -0.1092773954
-0.3619091443 -0.0337746449 -0.1024088640
-0.3194394511 -0.0338022127 -0.1211531644
-0.2769697580 -0.0338297805 -0.1398974649
-0.2345000649 -0.0338573483 -0.1586417653
-0.2820550403 -0.1019349612 -0.1280216959
-0.2769697580 -0.0338297805 -0.1398974649
-0.1802745367 -0.0679567821 -0.1653610114
-0.2040520244 -0.1019955885 -0.1500509767
-0.2084990596 -0.0338775574 -0.1659848589
-0.1802745367 -0.0679567821 -0.1653610114
-0.1520500139 -0.1020360067 -0.1647371639
-0.1238254910 -0.1361152314 -0.1641133164
-0.1758275016 -0.1360748132 -0.1494271292
-0.1520500139 -0.1020360067 -0.1647371639
-0.2560540350 -0.1019551703 -0.1353647895
-0.2278295121 -0.1360343950 -0.1347409420
-0.2798315227 -0.1359939768 -0.1200547548
-0.2560540350 -0.1019551703 -0.1353647895
-0.2322765473 -0.0679163639 -0.1506748242
-0.2084990596 -0.0338775574 -0.1659848589
-0.2040520244 -0.1019955885 -0.1500509767
-0.2322765473 -0.0679163639 -0.1506748242
-0.2769013237 0.0342705655 -0.1398425677
-0.2818497373 0.1023660768 -0.1278570043
-0.2344316305 0.0342429977 -0.1585868681
-0.2769013237 0.0342705655 -0.1398425677
-0.3193710168 0.0342981333 -0.1210982672
-0.3618407099 0.0343257011 -0.1023539668
-0.3243194304 0.1023936446 -0.1091127039
-0.3193710168 0.0342981333 -0.1210982672
-0.0904275849 0.0341201886 -0.1857555000
-0.0798426880 0.1022036268 -0.1781567883
-0.0444265674 0.0340789932 -0.1919967223
-0.0904275849 0.0341201886 -0.1857555000
-0.1364286025 0.0341613841 -0.1795142777
-0.1824296200 0.0342025795 -0.1732730553
-0.1258437056 0.1022448222 -0.1719155660
-0.1364286025 0.0341613841 -0.1795142777
-0.1721808367 0.1601933108 -0.1373300966
-0.1654349816 0.2079267909 -0.1135752090
-0.1201788261 0.1601528927 -0.1520162838
-0.1721808367 0.1601933108 -0.1373300966
-0.2241828472 0.1602337290 -0.1226439094
-0.2761848578 0.1602741472 -0.1079577222
-0.2174369921 0.2079672090 -0.0988890217
-0.2241828472 0.1602337290 -0.1226439094
-0.2321396786 0.0682843281 -0.1505650298
-0.2038467214 0.1023054495 -0.1498862851
-0.2084306253 0.0342227886 -0.1659299617
-0.2321396786 0.0682843281 -0.1505650298
-0.2558487320 0.1023458677 -0.1352000979
-0.2795577853 0.1364074072 -0.1198351660
-0.2275557748 0.1363669890 -0.1345213532
-0.2558487320 0.1023458677 -0.1352000979
-0.1518447108 0.1022650313 -0.1645724724
-0.1755537642 0.1363265708 -0.1492075404
-0.1235517536 0.1362861526 -0.1638937277
-0.1518447108 0.1022650313 -0.1645724724
-0.1801376681 0.0682439100 -0.1652512170
-0.2084306253 0.0342227886 -0.1659299617
-0.2038467214 0.1023054495 -0.1498862851
-0.1801376681 0.0682439100 -0.1652512170
-0.1208055866 0.2050489425 -0.1163875078
-0.1201788261 0.1601528927 -0.1520162838
-0.1654349816 0.2079267909 -0.1135752090
-0.1208055866 0.2050489425 -0.1163875078
-0.0761761917 0.2021710941 -0.1191998067
-0.0315467967 0.1992932457 -0.1220121055
-0.0755494311 0.1572750443 -0.1548285827
-0.0761761917 0.2021710941 -0.1191998067
-0.0341322756 0.0891509292 -0.1771133325
-0.0444265674 0.0340789932 -0.1919967223
-0.0798426880 0.1022036268 -0.1781567883
-0.0341322756 0.0891509292 -0.1771133325
0.0115781369 0.0760982316 -0.1760698767
0.0572885494 0.0630455340 -0.1750264209
0.0012838451 0.0210262956 -0.1909532665
0.0115781369 0.0760982316 -0.1760698767
0.0710106671 0.1328498324 -0.1317462756
0.1135774840 0.1282537958 -0.1072071791
0.0947197624 0.0987880341 -0.1471110584
0.0710106671 0.1328498324 -0.1317462756
0.0473015718 0.1669116307 -0.1163814928
0.0235924766 0.2009734290 -0.1010167100
0.0898683887 0.1623155941 -0.0918423963
0.0473015718 0.1669116307 -0.1163814928
0.0158713938 0.1311696491 -0.1527416711
0.0141636158 0.1862405481 -0.1209686497
0.0615818063 0.1181169515 -0.1516982153
0.0158713938 0.1311696491 -0.1527416711
-0.0298390187 0.1442223467 -0.1537851269
-0.0755494311 0.1572750443 -0.1548285827
-0.0315467967 0.1992932457 -0.1220121055
-0.0298390187 0.1442223467 -0.1537851269
-0.1501854034 0.2557414468 -0.0407240819
-0.1117811918 0.2427169460 -0.0655510764
-0.1626357701 0.2354481420 -0.0847534731
-0.1501854034 0.2557414468 -0.0407240819
-0.0733769802 0.2296924452 -0.0903780708
-0.0541748745 0.2231801948 -0.1027915681
-0.1434336643 0.2289358916 -0.0971669704
-0.1117811918 0.2427169460 -0.0655510764
0.0252889305 0.2105673960 -0.0386344117
0.0511207138 0.1912666753 -0.0599176055
0.0106765849 0.2106237893 -0.0903751131
0.0252889305 0.2105673960 -0.0386344117
0.0971745615 0.1622873975 -0.0659720456
0.0806055835 0.1719518562 -0.0682656240
0.0235924766 0.2009734290 -0.1010167100
0.0511207138 0.1912666753 -0.0599176055
-0.0561925377 0.2397968026 -0.0295578492
-0.0479496911 0.2333268472 -0.0807768724
-0.0982498357 0.2528354018 -0.0176660300
-0.1174519415 0.2593476522 -0.0052525328
-0.0104821533 0.2267441051 -0.0285144929
-0.0250944989 0.2268004985 -0.0802551943
-0.0561925377 0.2397968026 -0.0295578492
-0.0104821533 0.2267441051 -0.0285144929
-0.3976156019 0.1331186811 0.1189302857
-0.4401926706 0.1286477749 0.0943839335
-0.4213937335 0.0990798750 0.1342406097
-0.3976156019 0.1331186811 0.1189302857
-0.3738374704 0.1671574871 0.1036199617
-0.3500593389 0.2011962932 0.0883096377
-0.4164145391 0.1626865809 0.0790736094
-0.3738374704 0.1671574871 0.1036199617
-0.2056539110 0.2049567997 0.1036873261
-0.2063715845 0.1600047173 0.1392433662
-0.1610192451 0.2077494764 0.1008799878
-0.2056539110 0.2049567997 0.1036873261
-0.2502885768 0.2021641231 0.1064946644
-0.2949232427 0.1993714464 0.1093020027
-0.2510062504 0.1572120406 0.1420507045
-0.2502885768 0.2021641231 0.1064946644
-0.3424795057 0.1312938343 0.1399226507
-0.3406598703 0.1864123433 0.1082379758
-0.3882161334 0.1183347311 0.1388586238
-0.3424795057 0.1312938343 0.1399226507
-0.2967428780 0.1442529375 0.1409866776
-0.2510062504 0.1572120406 0.1420507045
-0.2949232427 0.1993714464 0.1093020027
-0.2967428780 0.1442529375 0.1409866776
-0.1543695740 0.1599642991 0.1245571790
-0.1610192451 0.2077494764 0.1008799878
-0.2063715845 0.1600047173 0.1392433662
-0.1543695740 0.1599642991 0.1245571790
-0.1023675634 0.1599238809 0.1098709917
-0.0503655528 0.1598834627 0.0951848045
-0.1090172346 0.2077090582 0.0861938006
-0.1023675634 0.1599238809 0.1098709917
-0.0300060910 0.2019929101 0.0442834192
-0.0108599810 0.1570253887 0.0742296138
0.0094994807 0.1991348360 0.0233282286
-0.0300060910 0.2019929101 0.0442834192
-0.0695116628 0.2048509841 0.0652386099
-0.1090172346 0.2077090582 0.0861938006
-0.0503655528 0.1598834627 0.0951848045
-0.0695116628 0.2048509841 0.0652386099
0.0737355459 0.1668096142 -0.0227817109
0.0971745615 0.1622873975 -0.0659720456
0.0455109949 0.2008888390 -0.0234056579
0.0737355459 0.1668096142 -0.0227817109
0.1019600969 0.1327303894 -0.0221577638
0.1301846479 0.0986511647 -0.0215338168
0.1253991125 0.1282081727 -0.0653480986
0.1019600969 0.1327303894 -0.0221577638
0.0275443008 0.1440008876 0.0494028682
0.0094994807 0.1991348360 0.0233282286
-0.0108599810 0.1570253887 0.0742296138
0.0275443008 0.1440008876 0.0494028682
0.0659485827 0.1309763865 0.0245761226
0.1043528646 0.1179518854 -0.0002506230
0.0479037626 0.1861103350 -0.0014985170
0.0659485827 0.1309763865 0.0245761226
-0.4655108518 -0.0566309543 0.1013322259
-0.4341225828 -0.0629777775 0.1376587963
-0.4780408609 -0.0208188875 0.1049099197
-0.4655108518 -0.0566309543 0.1013322259
-0.4529808426 -0.0924430212 0.0977545321
-0.4404508335 -0.1282550881 0.0941768384
-0.4215925736 -0.0987898444 0.1340811026
-0.4529808426 -0.0924430212 0.0977545321
-0.4527946358 0.0928549830 0.0979039050
-0.4213937335 0.0990798750 0.1342406097
-0.4401926706 0.1286477749 0.0943839335
-0.4527946358 0.0928549830 0.0979039050
-0.4653966010 0.0570621912 0.1014238765
-0.4779985662 0.0212693994 0.1049438480
-0.4339956987 0.0632870832 0.1377605812
-0.4653966010 0.0570621912 0.1014238765
-0.4340802881 -0.0208894906 0.1376927246
-0.4780408609 -0.0208188875 0.1049099197
-0.4341225828 -0.0629777775 0.1376587963
-0.4340802881 -0.0208894906 0.1376927246
-0.4340379934 0.0211987963 0.1377266529
-0.4339956987 0.0632870832 0.1377605812
-0.4779985662 0.0212693994 0.1049438480
-0.4340379934 0.0211987963 0.1377266529
-0.4648024711 -0.0923973981 0.0558954516
-0.4570574591 -0.0986529750 0.0085038609
-0.4522724620 -0.1282094649 0.0523177578
-0.4648024711 -0.0923973981 0.0558954516
-0.4773324803 -0.0565853312 0.0594731454
-0.4898624894 -0.0207732643 0.0630508392
-0.4695874683 -0.0628409081 0.0120815547
-0.4773324803 -0.0565853312 0.0594731454
-0.4396955110 -0.0207448282 -0.0347620369
-0.4003135017 -0.0207498855 -0.0775817205
-0.4397378057 -0.0628331151 -0.0347959652
-0.4396955110 -0.0207448282 -0.0347620369
-0.4396532163 0.0213434587 -0.0347281086
-0.4396109216 0.0634317456 -0.0346941803
-0.4002712070 0.0213384014 -0.0775477922
-0.4396532163 0.0213434587 -0.0347281086
-0.4772182295 0.0571078144 0.0595647959
-0.4694605841 0.0634239526 0.0121833396
-0.4898201947 0.0213150226 0.0630847675
-0.4772182295 0.0571078144 0.0595647959
-0.4646162643 0.0929006062 0.0560448244
-0.4520142991 0.1286933980 0.0525248529
-0.4568586189 0.0992167444 0.0086633681
-0.4646162643 0.0929006062 0.0560448244
-0.4695028788 0.0213356657 0.0121494113
-0.4898201947 0.0213150226 0.0630847675
-0.4694605841 0.0634239526 0.0121833396
-0.4695028788 0.0213356657 0.0121494113
-0.4695451735 -0.0207526212 0.0121154830
-0.4695874683 -0.0628409081 0.0120815547
-0.4898624894 -0.0207732643 0.0630508392
-0.4695451735 -0.0207526212 0.0121154830
-0.4288323066 -0.1327323293 0.0091273692
-0.4522724620 -0.1282094649 0.0523177578
-0.4570574591 -0.0986529750 0.0085038609
-0.4288323066 -0.1327323293 0.0091273692
-0.4006071541 -0.1668116836 0.0097508775
-0.3723820016 -0.2008910379 0.0103743858
-0.4240473095 -0.1622888193 0.0529412661
-0.4006071541 -0.1668116836 0.0097508775
-0.2573598545 -0.2048540623 -0.0782693088
-0.2765065888 -0.1598866176 -0.1082158109
-0.2178547103 -0.2077123172 -0.0992241102
-0.2573598545 -0.2048540623 -0.0782693088
-0.2968649986 -0.2019958073 -0.0573145074
-0.3363701428 -0.1991375524 -0.0363597060
-0.3160117329 -0.1570283626 -0.0872610095
-0.2968649986 -0.2019958073 -0.0573145074
-0.3629290908 -0.0888826340 -0.0844502520
-0.3619091443 -0.0337746449 -0.1024088640
-0.3245247334 -0.1019073935 -0.1092773954
-0.3629290908 -0.0888826340 -0.0844502520
-0.4013334483 -0.0758578746 -0.0596231086
-0.4397378057 -0.0628331151 -0.0347959652
-0.4003135017 -0.0207498855 -0.0775817205
-0.4013334483 -0.0758578746 -0.0596231086
-0.2964586774 0.2023423071 -0.0569885615
-0.3156957005 0.1574616962 -0.0870074921
-0.3359695201 0.1995298561 -0.0360383314
-0.2964586774 0.2023423071 -0.0569885615
-0.2569478348 0.2051547581 -0.0779387916
-0.2174369921 0.2079672090 -0.0988890217
-0.2761848578 0.1602741472 -0.1079577222
-0.2569478348 0.2051547581 -0.0779387916
-0.4002714445 0.1672595036 0.0100201797
-0.4237207119 0.1627147776 0.0532032587
-0.3719778573 0.2012808832 0.0106985855
-0.4002714445 0.1672595036 0.0100201797
-0.4285650317 0.1332381240 0.0093417739
-0.4568586189 0.0992167444 0.0086633681
-0.4520142991 0.1286933980 0.0525248529
-0.4285650317 0.1332381240 0.0093417739
-0.4011804245 0.0764190452 -0.0595003548
-0.4002712070 0.0213384014 -0.0775477922
-0.4396109216 0.0634317456 -0.0346941803
-0.4011804245 0.0764190452 -0.0595003548
-0.3627499274 0.0894063449 -0.0843065293
-0.3243194304 0.1023936446 -0.1091127039
-0.3618407099 0.0343257011 -0.1023539668
-0.3627499274 0.0894063449 -0.0843065293
-0.3412002427 -0.2106120842 0.0644085425
-0.3743390694 -0.1912827783 0.0598216320
-0.3558125882 -0.2105556909 0.0126678411
-0.3412002427 -0.2106120842 0.0644085425
-0.4167411367 -0.1623170159 0.0788116168
-0.4038248097 -0.1719675706 0.0681698968
-0.3723820016 -0.2008910379 0.0103743858
-0.3743390694 -0.1912827783 0.0598216320
-0.2150901175 -0.2427187441 0.0525201589
-0.1834377546 -0.2289390218 0.0841366198
-0.2726956892 -0.2231829632 0.0897604390
-0.2534938320 -0.2296948902 0.0773470123
-0.1766864030 -0.2557425980 0.0276933055
-0.1642358973 -0.2354509488 0.0717231932
-0.2150901175 -0.2427187441 0.0525201589
-0.1766864030 -0.2557425980 0.0276933055
-0.1927694853 -0.2556805287 -0.0292551124
-0.2384793726 -0.2426284781 -0.0302986097
-0.2051789716 -0.2352929374 -0.0732517098
-0.1927694853 -0.2556805287 -0.0292551124
-0.2841892599 -0.2295764275 -0.0313421070
-0.3070442035 -0.2230504022 -0.0318638557
-0.2280339152 -0.2287669121 -0.0737734585
-0.2384793726 -0.2426284781 -0.0302986097
-0.3163882312 -0.2267463692 0.0154830451
-0.2706783440 -0.2397984198 0.0165265424
-0.3017758857 -0.2268027625 0.0672237465
-0.3163882312 -0.2267463692 0.0154830451
-0.2249684567 -0.2528504704 0.0175700397
-0.2021135130 -0.2593764957 0.0180917884
-0.2789209420 -0.2333287878 0.0677454952
-0.2706783440 -0.2397984198 0.0165265424
-0.1346162841 -0.2557752967 0.0158120411
-0.0888797611 -0.2428168402 0.0168763655
-0.1221657785 -0.2354836475 0.0598419287
-0.1346162841 -0.2557752967 0.0158120411
-0.0431432380 -0.2298583837 0.0179406899
-0.0202749764 -0.2233791554 0.0184728521
-0.0992975170 -0.2290044192 0.0603740909
-0.0888797611 -0.2428168402 0.0168763655
-0.0883919367 0.2426266800 0.0172676922
-0.0988375037 0.2287637819 0.0607431080
-0.0198263601 0.2230476338 0.0188327266
-0.0426815523 0.2295739825 0.0183110485
-0.1341023211 0.2556793775 0.0162243360
-0.1216926959 0.2352901306 0.0602214298
-0.0883919367 0.2426266800 0.0172676922
-0.1341023211 0.2556793775 0.0162243360
-0.2379915482 0.2428150421 -0.0299072829
-0.2275739019 0.2290012890 -0.0734044414
-0.3065955873 0.2233763870 -0.0315039812
-0.2837275743 0.2298559387 -0.0309717484
-0.1922555222 0.2557741455 -0.0288428174
-0.2047058889 0.2354808407 -0.0728722087
-0.2379915482 0.2428150421 -0.0299072829
-0.1922555222 0.2557741455 -0.0288428174
-0.1761724399 0.2557120762 0.0281056005
-0.2146022931 0.2427247761 0.0529114857
-0.1637628147 0.2353228293 0.0721026943
-0.1761724399 0.2557120762 0.0281056005
-0.2530321463 0.2297374760 0.0777173709
-0.2722470730 0.2232438260 0.0901203135
-0.1829777413 0.2288291793 0.0845056369
-0.2146022931 0.2427247761 0.0529114857
-0.3517359708 0.2108942129 0.0259427679
-0.3776073981 0.1916111601 0.0471951045
-0.3371236252 0.2108378196 0.0776834694
-0.3517359708 0.2108942129 0.0259427679
-0.4034788255 0.1723281073 0.0684474411
-0.4164145391 0.1626865809 0.0790736094
-0.3500593389 0.2011962932 0.0883096377
-0.3776073981 0.1916111601 0.0471951045
-0.3049729850 0.2269729960 0.0546543585
-0.2665431317 0.2399602961 0.0298484732
-0.3195853305 0.2270293894 0.0029136570
-0.3049729850 0.2269729960 0.0546543585
-0.2015921791 0.2594130496 0.0185099961
-0.2244601921 0.2529334979 0.0179777634
-0.3003704039 0.2335230394 -0.0094892856
-0.2665431317 0.2399602961 0.0298484732
0.1127809918 -0.0213455279 0.0216978524
0.0733996178 -0.0213404705 0.0645165505
0.1127386971 -0.0634338148 0.0216639241
0.1127809918 -0.0213455279 0.0216978524
0.1128232865 0.0207427590 0.0217317807
0.1128655812 0.0628310459 0.0217657090
0.0734419125 0.0207478164 0.0645504788
0.1128232865 0.0207427590 0.0217317807
-0.3928204478 -0.1309788437 -0.0376067226
-0.3747745002 -0.1861127929 -0.0115325626
-0.4312248052 -0.1179540843 -0.0127795792
-0.3928204478 -0.1309788437 -0.0376067226
-0.3544160903 -0.1440036032 -0.0624338660
-0.3160117329 -0.1570283626 -0.0872610095
-0.3363701428 -0.1991375524 -0.0363597060
-0.3544160903 -0.1440036032 -0.0624338660
-0.3541261975 0.1444743966 -0.0622013175
-0.3359695201 0.1995298561 -0.0360383314
-0.3156957005 0.1574616962 -0.0870074921
-0.3541261975 0.1444743966 -0.0622013175
-0.3925566946 0.1314870969 -0.0373951430
-0.4309871916 0.1184997972 -0.0125889685
-0.3744000172 0.1865425564 -0.0112321569
-0.3925566946 0.1314870969 -0.0373951430
3 29 4 190
3 294 24 4
3 75 190 24
3 4 24 190
3 240 93 138
3 198 111 93
3 294 138 111
3 93 111 138
3 291 15 112
3 75 289 15
3 198 112 289
3 15 289 112
3 294 111 24
3 198 289 111
3 75 24 289
3 111 289 24
3 29 190 3
3 75 307 190
3 304 3 307
3 190 307 3
3 291 120 15
3 218 124 120
3 75 15 124
3 120 124 15
3 268 205 135
3 304 90 205
3 218 135 90
3 205 90 135
3 75 124 307
3 218 90 124
3 304 307 90
3 124 90 307
3 268 135 137
3 218 28 135
3 216 137 28
3 135 28 137
3 291 300 120
3 286 255 300
3 218 120 255
3 300 255 120
3 293 122 298
3 216 257 122
3 286 298 257
3 122 257 298
3 218 255 28
3 286 257 255
3 216 28 257
3 255 257 28
3 291 144 300
3 262 221 144
3 286 300 221
3 144 221 300
3 212 10 8
3 260 239 10
3 262 8 239
3 10 239 8
3 293 298 146
3 286 223 298
3 260 146 223
3 298 223 146
3 262 239 221
3 260 223 239
3 286 221 223
3 239 223 221
3 291 112 144
3 198 11 112
3 262 144 11
3 112 11 144
3 240 266 93
3 187 182 266
3 198 93 182
3 266 182 93
3 212 8 274
3 262 54 8
3 187 274 54
3 8 54 274
3 198 182 11
3 187 54 182
3 262 11 54
3 182 54 11
3 212 274 196
3 187 72 274
3 254 196 72
3 274 72 196
3 240 265 266
3 186 213 265
3 187 266 213
3 265 213 266
3 211 197 273
3 254 71 197
3 186 273 71
3 197 71 273
3 187 213 72
3 186 71 213
3 254 72 71
3 213 71 72
3 212 196 272
3 254 74 196
3 185 272 74
3 196 74 272
3 211 271 197
3 184 73 271
3 254 197 73
3 271 73 197
3 241 264 263
3 185 214 264
3 184 263 214
3 264 214 263
3 254 73 74
3 184 214 73
3 185 74 214
3 73 214 74
3 293 146 114
3 260 13 146
3 200 114 13
3 146 13 114
3 212 272 10
3 185 52 272
3 260 10 52
3 272 52 10
3 241 91 264
3 200 180 91
3 185 264 180
3 91 180 264
3 260 52 13
3 185 180 52
3 200 13 180
3 52 180 13
3 293 114 17
3 200 296 114
3 77 17 296
3 114 296 17
3 241 139 91
3 285 109 139
3 200 91 109
3 139 109 91
3 30 188 5
3 77 22 188
3 285 5 22
3 188 22 5
3 200 109 296
3 285 22 109
3 77 296 22
3 109 22 296
3 30 5 189
3 285 21 5
3 78 189 21
3 5 21 189
3 241 92 139
3 201 108 92
3 285 139 108
3 92 108 139
3 292 18 115
3 78 295 18
3 201 115 295
3 18 295 115
3 285 108 21
3 201 295 108
3 78 21 295
3 108 295 21
3 292 115 147
3 201 14 115
3 259 147 14
3 115 14 147
3 241 263 92
3 184 181 263
3 201 92 181
3 263 181 92
3 211 9 271
3 259 51 9
3 184 271 51
3 9 51 271
3 201 181 14
3 184 51 181
3 259 14 51
3 181 51 14
3 292 147 297
3 259 224 147
3 287 297 224
3 147 224 297
3 211 7 9
3 261 238 7
3 259 9 238
3 7 238 9
3 290 299 145
3 287 222 299
3 261 145 222
3 299 222 145
3 259 238 224
3 261 222 238
3 287 224 222
3 238 222 224
3 292 297 123
3 287 258 297
3 215 123 258
3 297 258 123
3 290 121 299
3 217 256 121
3 287 299 256
3 121 256 299
3 267 136 134
3 215 27 136
3 217 134 27
3 136 27 134
3 287 256 258
3 217 27 256
3 215 258 27
3 256 27 258
3 267 134 204
3 217 89 134
3 303 204 89
3 134 89 204
3 290 16 121
3 76 125 16
3 217 121 125
3 16 125 121
3 29 2 191
3 303 308 2
3 76 191 308
3 2 308 191
3 217 125 89
3 76 308 125
3 303 89 308
3 125 308 89
3 29 191 4
3 76 23 191
3 294 4 23
3 191 23 4
3 290 113 16
3 199 288 113
3 76 16 288
3 113 288 16
3 240 138 94
3 294 110 138
3 199 94 110
3 138 110 94
3 76 288 23
3 199 110 288
3 294 23 110
3 288 110 23
3 290 145 113
3 261 12 145
3 199 113 12
3 145 12 113
3 211 273 7
3 186 53 273
3 261 7 53
3 273 53 7
3 240 94 265
3 199 183 94
3 186 265 183
3 94 183 265
3 261 53 12
3 186 183 53
3 199 12 183
3 53 183 12
3 268 279 205
3 237 208 279
3 304 205 208
3 279 208 205
3 267 204 280
3 303 207 204
3 237 280 207
3 204 207 280
3 29 3 2
3 304 269 3
3 303 2 269
3 3 269 2
3 237 207 208
3 303 269 207
3 304 208 269
3 207 269 208
3 268 203 279
3 302 210 203
3 237 279 210
3 203 210 279
3 30 0 1
3 301 270 0
3 302 1 270
3 0 270 1
3 267 280 202
3 237 209 280
3 301 202 209
3 280 209 202
3 302 270 210
3 301 209 270
3 237 210 209
3 270 209 210
3 268 137 203
3 216 88 137
3 302 203 88
3 137 88 203
3 293 17 122
3 77 126 17
3 216 122 126
3 17 126 122
3 30 1 188
3 302 305 1
3 77 188 305
3 1 305 188
3 216 126 88
3 77 305 126
3 302 88 305
3 126 305 88
3 292 123 18
3 215 127 123
3 78 18 127
3 123 127 18
3 267 202 136
3 301 87 202
3 215 136 87
3 202 87 136
3 30 189 0
3 78 306 189
3 301 0 306
3 189 306 0
3 215 87 127
3 301 306 87
3 78 127 306
3 87 306 127
3 42 901 99
3 50 901 42
3 31 902 50
3 99 902 31
3 31 903 99
3 47 903 31
3 45 904 47
3 99 904 45
3 45 905 99
3 35 905 45
3 43 906 35
3 99 906 43
3 43 907 99
3 40 907 43
3 36 908 40
3 99 908 36
3 36 909 99
3 39 909 36
3 39 910 99
3 33 910 39
3 38 911 33
3 99 911 38
3 37 912 38
3 99 912 37
3 37 913 99
3 41 913 37
3 41 914 99
3 44 914 41
3 44 915 99
3 34 915 44
3 46 916 34
3 99 916 46
3 48 917 46
3 99 917 48
3 48 918 99
3 32 918 48
3 32 919 99
3 49 919 32
3 42 920 49
3 99 920 42
3 49 32 48
3 62 159 227
3 119 102 159
3 163 227 102
3 159 102 227
3 62 227 69
3 163 173 227
3 98 69 173
3 227 173 69
3 98 173 177
3 163 156 173
3 151 177 156
3 173 156 177
3 163 165 156
3 236 169 165
3 151 156 169
3 165 169 156
3 163 102 165
3 119 248 102
3 236 165 248
3 102 248 165
3 236 248 276
3 119 249 248
3 235 276 249
3 248 249 276
3 236 276 244
3 235 245 276
3 117 244 245
3 276 245 244
3 151 169 106
3 236 244 169
3 117 106 244
3 169 244 106
3 151 106 231
3 117 153 106
3 60 231 153
3 106 153 231
3 60 153 232
3 117 107 153
3 148 232 107
3 153 107 232
3 148 107 171
3 117 245 107
3 235 171 245
3 107 245 171
3 148 171 157
3 235 167 171
3 160 157 167
3 171 167 157
3 148 157 179
3 160 175 157
3 97 179 175
3 157 175 179
3 97 175 70
3 160 228 175
3 62 70 228
3 175 228 70
3 62 228 159
3 160 103 228
3 119 159 103
3 228 103 159
3 160 167 103
3 235 249 167
3 119 103 249
3 167 249 103
3 98 20 69
3 97 70 20
3 62 69 70
3 20 70 69
3 98 65 20
3 60 66 65
3 97 20 66
3 65 66 20
3 98 177 65
3 151 231 177
3 60 65 231
3 177 231 65
3 148 179 232
3 97 66 179
3 60 232 66
3 179 66 232
3 61 158 225
3 118 100 158
3 161 225 100
3 158 100 225
3 61 225 67
3 161 172 225
3 96 67 172
3 225 172 67
3 96 172 176
3 161 154 172
3 149 176 154
3 172 154 176
3 161 164 154
3 234 168 164
3 149 154 168
3 164 168 154
3 161 100 164
3 118 246 100
3 234 164 246
3 100 246 164
3 234 246 275
3 118 247 246
3 233 275 247
3 246 247 275
3 234 275 242
3 233 243 275
3 116 242 243
3 275 243 242
3 149 168 104
3 234 242 168
3 116 104 242
3 168 242 104
3 149 104 229
3 116 152 104
3 59 229 152
3 104 152 229
3 59 152 230
3 116 105 152
3 150 230 105
3 152 105 230
3 150 105 170
3 116 243 105
3 233 170 243
3 105 243 170
3 150 170 155
3 233 166 170
3 162 155 166
3 170 166 155
3 150 155 178
3 162 174 155
3 95 178 174
3 155 174 178
3 95 174 68
3 162 226 174
3 61 68 226
3 174 226 68
3 61 226 158
3 162 101 226
3 118 158 101
3 226 101 158
3 162 166 101
3 233 247 166
3 118 101 247
3 166 247 101
3 96 19 67
3 95 68 19
3 61 67 68
3 19 68 67
3 96 63 19
3 59 64 63
3 95 19 64
3 63 64 19
3 96 176 63
3 149 229 176
3 59 63 229
3 176 229 63
3 150 178 230
3 95 64 178
3 59 230 64
3 178 64 230
3 311 921 310
3 309 921 311
3 311 922 55
3 310 922 311
3 312 923 310
3 82 923 312
3 312 924 309
3 310 924 312
3 314 925 313
3 309 925 314
3 314 926 26
3 313 926 314
3 315 927 313
3 55 927 315
3 315 928 309
3 313 928 315
3 318 929 317
3 316 929 318
3 318 930 130
3 317 930 318
3 319 931 317
3 278 931 319
3 319 932 316
3 317 932 319
3 321 933 320
3 316 933 321
3 321 934 82
3 320 934 321
3 322 935 320
3 130 935 322
3 322 936 316
3 320 936 322
3 326 937 325
3 324 937 326
3 326 938 323
3 325 938 326
3 327 939 325
3 82 939 327
3 327 940 324
3 325 940 327
3 329 941 328
3 324 941 329
3 329 942 55
3 328 942 329
3 330 943 328
3 323 943 330
3 330 944 324
3 328 944 330
3 333 945 332
3 331 945 333
3 333 946 323
3 332 946 333
3 334 947 332
3 130 947 334
3 334 948 331
3 332 948 334
3 336 949 335
3 331 949 336
3 336 950 82
3 335 950 336
3 337 951 335
3 323 951 337
3 337 952 331
3 335 952 337
3 340 953 339
3 338 953 340
3 340 954 26
3 339 954 340
3 341 955 339
3 251 955 341
3 341 956 338
3 339 956 341
3 343 957 342
3 338 957 343
3 343 958 55
3 342 958 343
3 344 959 342
3 26 959 344
3 344 960 338
3 342 960 344
3 347 961 346
3 345 961 347
3 347 962 278
3 346 962 347
3 348 963 346
3 130 963 348
3 348 964 345
3 346 964 348
3 350 965 349
3 345 965 350
3 350 966 193
3 349 966 350
3 351 967 349
3 278 967 351
3 351 968 345
3 349 968 351
3 354 969 353
3 352 969 354
3 354 970 193
3 353 970 354
3 355 971 353
3 129 971 355
3 355 972 352
3 353 972 355
3 357 973 356
3 352 973 357
3 357 974 6
3 356 974 357
3 358 975 356
3 193 975 358
3 358 976 352
3 356 976 358
3 361 977 360
3 359 977 361
3 361 978 192
3 360 978 361
3 362 979 360
3 6 979 362
3 362 980 359
3 360 980 362
3 364 981 363
3 359 981 364
3 364 982 128
3 363 982 364
3 365 983 363
3 192 983 365
3 365 984 359
3 363 984 365
3 368 985 367
3 366 985 368
3 368 986 6
3 367 986 368
3 369 987 367
3 192 987 369
3 369 988 366
3 367 988 369
3 371 989 370
3 366 989 371
3 371 990 193
3 370 990 371
3 372 991 370
3 6 991 372
3 372 992 366
3 370 992 372
3 375 993 374
3 373 993 375
3 375 994 195
3 374 994 375
3 376 995 374
3 6 995 376
3 376 996 373
3 374 996 376
3 378 997 377
3 373 997 378
3 378 998 129
3 377 998 378
3 379 999 377
3 195 999 379
3 379 1000 373
3 377 1000 379
3 382 1001 381
3 380 1001 382
3 382 1002 194
3 381 1002 382
3 383 1003 381
3 128 1003 383
3 383 1004 380
3 381 1004 383
3 385 1005 384
3 380 1005 385
3 385 1006 6
3 384 1006 385
3 386 1007 384
3 194 1007 386
3 386 1008 380
3 384 1008 386
3 389 1009 388
3 387 1009 389
3 389 1010 277
3 388 1010 389
3 390 1011 388
3 194 1011 390
3 390 1012 387
3 388 1012 390
3 392 1013 391
3 387 1013 392
3 392 1014 195
3 391 1014 392
3 393 1015 391
3 277 1015 393
3 393 1016 387
3 391 1016 393
3 396 1017 395
3 394 1017 396
3 396 1018 6
3 395 1018 396
3 397 1019 395
3 195 1019 397
3 397 1020 394
3 395 1020 397
3 399 1021 398
3 394 1021 399
3 399 1022 194
3 398 1022 399
3 400 1023 398
3 6 1023 400
3 400 1024 394
3 398 1024 400
3 403 1025 402
3 401 1025 403
3 403 1026 26
3 402 1026 403
3 404 1027 402
3 56 1027 404
3 404 1028 401
3 402 1028 404
3 406 1029 405
3 401 1029 406
3 406 1030 250
3 405 1030 406
3 407 1031 405
3 26 1031 407
3 407 1032 401
3 405 1032 407
3 410 1033 409
3 408 1033 410
3 410 1034 56
3 409 1034 410
3 411 1035 409
3 26 1035 411
3 411 1036 408
3 409 1036 411
3 413 1037 412
3 408 1037 413
3 413 1038 82
3 412 1038 413
3 414 1039 412
3 56 1039 414
3 414 1040 408
3 412 1040 414
3 417 1041 416
3 415 1041 417
3 417 1042 131
3 416 1042 417
3 418 1043 416
3 82 1043 418
3 418 1044 415
3 416 1044 418
3 420 1045 419
3 415 1045 420
3 420 1046 278
3 419 1046 420
3 421 1047 419
3 131 1047 421
3 421 1048 415
3 419 1048 421
3 425 1049 424
3 423 1049 425
3 425 1050 422
3 424 1050 425
3 426 1051 424
3 82 1051 426
3 426 1052 423
3 424 1052 426
3 428 1053 427
3 423 1053 428
3 428 1054 131
3 427 1054 428
3 429 1055 427
3 422 1055 429
3 429 1056 423
3 427 1056 429
3 432 1057 431
3 430 1057 432
3 432 1058 422
3 431 1058 432
3 433 1059 431
3 56 1059 433
3 433 1060 430
3 431 1060 433
3 435 1061 434
3 430 1061 435
3 435 1062 82
3 434 1062 435
3 436 1063 434
3 422 1063 436
3 436 1064 430
3 434 1064 436
3 439 1065 438
3 437 1065 439
3 439 1066 278
3 438 1066 439
3 440 1067 438
3 192 1067 440
3 440 1068 437
3 438 1068 440
3 442 1069 441
3 437 1069 442
3 442 1070 131
3 441 1070 442
3 443 1071 441
3 278 1071 443
3 443 1072 437
3 441 1072 443
3 446 1073 445
3 444 1073 446
3 446 1074 26
3 445 1074 446
3 447 1075 445
3 250 1075 447
3 447 1076 444
3 445 1076 447
3 449 1077 448
3 444 1077 449
3 449 1078 251
3 448 1078 449
3 450 1079 448
3 26 1079 450
3 450 1080 444
3 448 1080 450
3 453 1081 452
3 451 1081 453
3 453 1082 83
3 452 1082 453
3 454 1083 452
3 130 1083 454
3 454 1084 451
3 452 1084 454
3 456 1085 455
3 451 1085 456
3 456 1086 55
3 455 1086 456
3 457 1087 455
3 83 1087 457
3 457 1088 451
3 455 1088 457
3 460 1089 459
3 458 1089 460
3 460 1090 55
3 459 1090 460
3 461 1091 459
3 284 1091 461
3 461 1092 458
3 459 1092 461
3 463 1093 462
3 458 1093 463
3 463 1094 83
3 462 1094 463
3 464 1095 462
3 55 1095 464
3 464 1096 458
3 462 1096 464
3 467 1097 466
3 465 1097 467
3 467 1098 220
3 466 1098 467
3 468 1099 466
3 284 1099 468
3 468 1100 465
3 466 1100 468
3 470 1101 469
3 465 1101 470
3 470 1102 251
3 469 1102 470
3 471 1103 469
3 220 1103 471
3 471 1104 465
3 469 1104 471
3 474 1105 473
3 472 1105 474
3 474 1106 284
3 473 1106 474
3 475 1107 473
3 55 1107 475
3 475 1108 472
3 473 1108 475
3 477 1109 476
3 472 1109 477
3 477 1110 251
3 476 1110 477
3 478 1111 476
3 284 1111 478
3 478 1112 472
3 476 1112 478
3 481 1113 480
3 141 1113 481
3 481 1114 479
3 480 1114 481
3 482 1115 480
3 143 1115 482
3 482 1116 141
3 480 1116 482
3 479 1117 484
3 483 1117 479
3 484 1118 129
3 483 1118 484
3 485 1119 483
3 143 1119 485
3 483 1120 485
3 479 1120 483
3 487 1121 486
3 488 1121 487
3 488 1122 85
3 487 1122 488
3 489 1123 487
3 141 1123 489
3 486 1124 487
3 489 1124 486
3 491 1125 490
3 80 1125 491
3 491 1126 85
3 490 1126 491
3 492 1127 490
3 486 1127 492
3 492 1128 80
3 490 1128 492
3 494 1129 493
3 495 1129 494
3 495 1130 143
3 494 1130 495
3 494 1131 496
3 493 1131 494
3 496 1132 80
3 493 1132 496
3 498 1133 497
3 141 1133 498
3 498 1134 143
3 497 1134 498
3 499 1135 497
3 493 1135 499
3 499 1136 141
3 497 1136 499
3 502 1137 501
3 500 1137 502
3 502 1138 130
3 501 1138 502
3 503 1139 501
3 83 1139 503
3 503 1140 500
3 501 1140 503
3 505 1141 504
3 500 1141 505
3 505 1142 143
3 504 1142 505
3 506 1143 504
3 130 1143 506
3 506 1144 500
3 504 1144 506
3 509 1145 508
3 507 1145 509
3 509 1146 129
3 508 1146 509
3 510 1147 508
3 193 1147 510
3 510 1148 507
3 508 1148 510
3 512 1149 511
3 507 1149 512
3 512 1150 143
3 511 1150 512
3 513 1151 511
3 129 1151 513
3 513 1152 507
3 511 1152 513
3 516 1153 515
3 514 1153 516
3 516 1154 143
3 515 1154 516
3 517 1155 515
3 193 1155 517
3 517 1156 514
3 515 1156 517
3 519 1157 518
3 514 1157 519
3 519 1158 130
3 518 1158 519
3 520 1159 518
3 143 1159 520
3 520 1160 514
3 518 1160 520
3 523 1161 522
3 521 1161 523
3 523 1162 132
3 522 1162 523
3 524 1163 522
3 141 1163 524
3 524 1164 521
3 522 1164 524
3 526 1165 525
3 521 1165 526
3 526 1166 85
3 525 1166 526
3 527 1167 525
3 132 1167 527
3 527 1168 521
3 525 1168 527
3 530 1169 529
3 528 1169 530
3 530 1170 129
3 529 1170 530
3 531 1171 529
3 141 1171 531
3 531 1172 528
3 529 1172 531
3 533 1173 532
3 528 1173 533
3 533 1174 195
3 532 1174 533
3 534 1175 532
3 129 1175 534
3 534 1176 528
3 532 1176 534
3 537 1177 536
3 535 1177 537
3 537 1178 277
3 536 1178 537
3 538 1179 536
3 195 1179 538
3 538 1180 535
3 536 1180 538
3 540 1181 539
3 535 1181 540
3 540 1182 132
3 539 1182 540
3 541 1183 539
3 277 1183 541
3 541 1184 535
3 539 1184 541
3 544 1185 543
3 542 1185 544
3 544 1186 141
3 543 1186 544
3 545 1187 543
3 132 1187 545
3 545 1188 542
3 543 1188 545
3 547 1189 546
3 542 1189 547
3 547 1190 195
3 546 1190 547
3 548 1191 546
3 141 1191 548
3 548 1192 542
3 546 1192 548
3 551 1193 550
3 549 1193 551
3 551 1194 85
3 550 1194 551
3 552 1195 550
3 57 1195 552
3 552 1196 549
3 550 1196 552
3 554 1197 553
3 549 1197 554
3 554 1198 132
3 553 1198 554
3 555 1199 553
3 85 1199 555
3 555 1200 549
3 553 1200 555
3 558 1201 557
3 556 1201 558
3 558 1202 132
3 557 1202 558
3 559 1203 557
3 81 1203 559
3 559 1204 556
3 557 1204 559
3 561 1205 560
3 556 1205 561
3 561 1206 277
3 560 1206 561
3 562 1207 560
3 132 1207 562
3 562 1208 556
3 560 1208 562
3 565 1209 564
3 563 1209 565
3 565 1210 57
3 564 1210 565
3 566 1211 564
3 25 1211 566
3 566 1212 563
3 564 1212 566
3 568 1213 567
3 563 1213 568
3 568 1214 81
3 567 1214 568
3 569 1215 567
3 57 1215 569
3 569 1216 563
3 567 1216 569
3 573 1217 572
3 571 1217 573
3 573 1218 570
3 572 1218 573
3 574 1219 572
3 81 1219 574
3 574 1220 571
3 572 1220 574
3 576 1221 575
3 571 1221 576
3 576 1222 132
3 575 1222 576
3 577 1223 575
3 570 1223 577
3 577 1224 571
3 575 1224 577
3 580 1225 579
3 578 1225 580
3 580 1226 570
3 579 1226 580
3 581 1227 579
3 57 1227 581
3 581 1228 578
3 579 1228 581
3 583 1229 582
3 578 1229 583
3 583 1230 81
3 582 1230 583
3 584 1231 582
3 570 1231 584
3 584 1232 578
3 582 1232 584
3 587 1233 586
3 585 1233 587
3 587 1234 58
3 586 1234 587
3 588 1235 586
3 81 1235 588
3 588 1236 585
3 586 1236 588
3 590 1237 589
3 585 1237 590
3 590 1238 25
3 589 1238 590
3 591 1239 589
3 58 1239 591
3 591 1240 585
3 589 1240 591
3 594 1241 593
3 592 1241 594
3 594 1242 133
3 593 1242 594
3 595 1243 593
3 277 1243 595
3 595 1244 592
3 593 1244 595
3 597 1245 596
3 592 1245 597
3 597 1246 81
3 596 1246 597
3 598 1247 596
3 133 1247 598
3 598 1248 592
3 596 1248 598
3 601 1249 600
3 599 1249 601
3 601 1250 86
3 600 1250 601
3 602 1251 600
3 133 1251 602
3 602 1252 599
3 600 1252 602
3 604 1253 603
3 599 1253 604
3 604 1254 58
3 603 1254 604
3 605 1255 603
3 86 1255 605
3 605 1256 599
3 603 1256 605
3 609 1257 608
3 607 1257 609
3 609 1258 606
3 608 1258 609
3 610 1259 608
3 81 1259 610
3 610 1260 607
3 608 1260 610
3 612 1261 611
3 607 1261 612
3 612 1262 58
3 611 1262 612
3 613 1263 611
3 606 1263 613
3 613 1264 607
3 611 1264 613
3 616 1265 615
3 614 1265 616
3 616 1266 606
3 615 1266 616
3 617 1267 615
3 133 1267 617
3 617 1268 614
3 615 1268 617
3 619 1269 618
3 614 1269 619
3 619 1270 81
3 618 1270 619
3 620 1271 618
3 606 1271 620
3 620 1272 614
3 618 1272 620
3 623 1273 622
3 621 1273 623
3 623 1274 133
3 622 1274 623
3 624 1275 622
3 86 1275 624
3 624 1276 621
3 622 1276 624
3 626 1277 625
3 621 1277 626
3 626 1278 140
3 625 1278 626
3 627 1279 625
3 133 1279 627
3 627 1280 621
3 625 1280 627
3 630 1281 629
3 628 1281 630
3 630 1282 277
3 629 1282 630
3 631 1283 629
3 133 1283 631
3 631 1284 628
3 629 1284 631
3 633 1285 632
3 628 1285 633
3 633 1286 194
3 632 1286 633
3 634 1287 632
3 277 1287 634
3 634 1288 628
3 632 1288 634
3 637 1289 636
3 635 1289 637
3 637 1290 128
3 636 1290 637
3 638 1291 636
3 194 1291 638
3 638 1292 635
3 636 1292 638
3 640 1293 639
3 635 1293 640
3 640 1294 140
3 639 1294 640
3 641 1295 639
3 128 1295 641
3 641 1296 635
3 639 1296 641
3 644 1297 643
3 642 1297 644
3 644 1298 140
3 643 1298 644
3 645 1299 643
3 194 1299 645
3 645 1300 642
3 643 1300 645
3 647 1301 646
3 642 1301 647
3 647 1302 133
3 646 1302 647
3 648 1303 646
3 140 1303 648
3 648 1304 642
3 646 1304 648
3 651 1305 650
3 79 1305 651
3 651 1306 649
3 650 1306 651
3 652 1307 650
3 86 1307 652
3 652 1308 79
3 650 1308 652
3 649 1309 654
3 653 1309 649
3 654 1310 140
3 653 1310 654
3 655 1311 653
3 86 1311 655
3 653 1312 655
3 649 1312 653
3 658 1313 657
3 142 1313 658
3 658 1314 656
3 657 1314 658
3 659 1315 657
3 140 1315 659
3 659 1316 142
3 657 1316 659
3 661 1317 656
3 128 1317 661
3 660 1318 656
3 661 1318 660
3 662 1319 660
3 140 1319 662
3 660 1320 662
3 656 1320 660
3 664 1321 663
3 665 1321 664
3 665 1322 140
3 664 1322 665
3 664 1323 666
3 663 1323 664
3 666 1324 79
3 663 1324 666
3 668 1325 667
3 142 1325 668
3 668 1326 140
3 667 1326 668
3 669 1327 667
3 663 1327 669
3 669 1328 142
3 667 1328 669
3 672 1329 671
3 670 1329 672
3 672 1330 219
3 671 1330 672
3 673 1331 671
3 250 1331 673
3 673 1332 670
3 671 1332 673
3 675 1333 674
3 670 1333 675
3 675 1334 283
3 674 1334 675
3 676 1335 674
3 219 1335 676
3 676 1336 670
3 674 1336 676
3 679 1337 678
3 677 1337 679
3 679 1338 56
3 678 1338 679
3 680 1339 678
3 84 1339 680
3 680 1340 677
3 678 1340 680
3 682 1341 681
3 677 1341 682
3 682 1342 283
3 681 1342 682
3 683 1343 681
3 56 1343 683
3 683 1344 677
3 681 1344 683
3 686 1345 685
3 684 1345 686
3 686 1346 283
3 685 1346 686
3 687 1347 685
3 250 1347 687
3 687 1348 684
3 685 1348 687
3 689 1349 688
3 684 1349 689
3 689 1350 56
3 688 1350 689
3 690 1351 688
3 283 1351 690
3 690 1352 684
3 688 1352 690
3 693 1353 692
3 691 1353 693
3 693 1354 84
3 692 1354 693
3 694 1355 692
3 56 1355 694
3 694 1356 691
3 692 1356 694
3 696 1357 695
3 691 1357 696
3 696 1358 131
3 695 1358 696
3 697 1359 695
3 84 1359 697
3 697 1360 691
3 695 1360 697
3 700 1361 699
3 698 1361 700
3 700 1362 131
3 699 1362 700
3 701 1363 699
3 142 1363 701
3 701 1364 698
3 699 1364 701
3 703 1365 702
3 698 1365 703
3 703 1366 84
3 702 1366 703
3 704 1367 702
3 131 1367 704
3 704 1368 698
3 702 1368 704
3 707 1369 706
3 705 1369 707
3 707 1370 128
3 706 1370 707
3 708 1371 706
3 142 1371 708
3 708 1372 705
3 706 1372 708
3 710 1373 709
3 705 1373 710
3 710 1374 192
3 709 1374 710
3 711 1375 709
3 128 1375 711
3 711 1376 705
3 709 1376 711
3 714 1377 713
3 712 1377 714
3 714 1378 142
3 713 1378 714
3 715 1379 713
3 131 1379 715
3 715 1380 712
3 713 1380 715
3 717 1381 716
3 712 1381 717
3 717 1382 192
3 716 1382 717
3 718 1383 716
3 142 1383 718
3 718 1384 712
3 716 1384 718
3 721 1385 720
3 719 1385 721
3 721 1386 251
3 720 1386 721
3 722 1387 720
3 206 1387 722
3 722 1388 719
3 720 1388 722
3 724 1389 723
3 719 1389 724
3 724 1390 220
3 723 1390 724
3 725 1391 723
3 251 1391 725
3 725 1392 719
3 723 1392 725
3 728 1393 727
3 726 1393 728
3 728 1394 250
3 727 1394 728
3 729 1395 727
3 219 1395 729
3 729 1396 726
3 727 1396 729
3 731 1397 730
3 726 1397 731
3 731 1398 206
3 730 1398 731
3 732 1399 730
3 250 1399 732
3 732 1400 726
3 730 1400 732
3 735 1401 734
3 733 1401 735
3 735 1402 206
3 734 1402 735
3 736 1403 734
3 251 1403 736
3 736 1404 733
3 734 1404 736
3 738 1405 737
3 733 1405 738
3 738 1406 250
3 737 1406 738
3 739 1407 737
3 206 1407 739
3 739 1408 733
3 737 1408 739
3 742 1409 741
3 740 1409 742
3 742 1410 253
3 741 1410 742
3 743 1411 741
3 220 1411 743
3 743 1412 740
3 741 1412 743
3 745 1413 744
3 740 1413 745
3 745 1414 206
3 744 1414 745
3 746 1415 744
3 253 1415 746
3 746 1416 740
3 744 1416 746
3 749 1417 748
3 747 1417 749
3 749 1418 25
3 748 1418 749
3 750 1419 748
3 253 1419 750
3 750 1420 747
3 748 1420 750
3 752 1421 751
3 747 1421 752
3 752 1422 252
3 751 1422 752
3 753 1423 751
3 25 1423 753
3 753 1424 747
3 751 1424 753
3 756 1425 755
3 754 1425 756
3 756 1426 252
3 755 1426 756
3 757 1427 755
3 206 1427 757
3 757 1428 754
3 755 1428 757
3 759 1429 758
3 754 1429 759
3 759 1430 219
3 758 1430 759
3 760 1431 758
3 252 1431 760
3 760 1432 754
3 758 1432 760
3 763 1433 762
3 761 1433 763
3 763 1434 206
3 762 1434 763
3 764 1435 762
3 252 1435 764
3 764 1436 761
3 762 1436 764
3 766 1437 765
3 761 1437 766
3 766 1438 253
3 765 1438 766
3 767 1439 765
3 206 1439 767
3 767 1440 761
3 765 1440 767
3 770 1441 769
3 768 1441 770
3 770 1442 220
3 769 1442 770
3 771 1443 769
3 253 1443 771
3 771 1444 768
3 769 1444 771
3 773 1445 772
3 768 1445 773
3 773 1446 282
3 772 1446 773
3 774 1447 772
3 220 1447 774
3 774 1448 768
3 772 1448 774
3 777 1449 776
3 775 1449 777
3 777 1450 57
3 776 1450 777
3 778 1451 776
3 85 1451 778
3 778 1452 775
3 776 1452 778
3 780 1453 779
3 775 1453 780
3 780 1454 282
3 779 1454 780
3 781 1455 779
3 57 1455 781
3 781 1456 775
3 779 1456 781
3 784 1457 783
3 782 1457 784
3 784 1458 25
3 783 1458 784
3 785 1459 783
3 57 1459 785
3 785 1460 782
3 783 1460 785
3 787 1461 786
3 782 1461 787
3 787 1462 253
3 786 1462 787
3 788 1463 786
3 25 1463 788
3 788 1464 782
3 786 1464 788
3 791 1465 790
3 789 1465 791
3 791 1466 58
3 790 1466 791
3 792 1467 790
3 281 1467 792
3 792 1468 789
3 790 1468 792
3 794 1469 793
3 789 1469 794
3 794 1470 86
3 793 1470 794
3 795 1471 793
3 58 1471 795
3 795 1472 789
3 793 1472 795
3 798 1473 797
3 796 1473 798
3 798 1474 219
3 797 1474 798
3 799 1475 797
3 281 1475 799
3 799 1476 796
3 797 1476 799
3 801 1477 800
3 796 1477 801
3 801 1478 252
3 800 1478 801
3 802 1479 800
3 219 1479 802
3 802 1480 796
3 800 1480 802
3 805 1481 804
3 803 1481 805
3 805 1482 25
3 804 1482 805
3 806 1483 804
3 252 1483 806
3 806 1484 803
3 804 1484 806
3 808 1485 807
3 803 1485 808
3 808 1486 58
3 807 1486 808
3 809 1487 807
3 25 1487 809
3 809 1488 803
3 807 1488 809
3 812 1489 811
3 284 1489 812
3 812 1490 810
3 811 1490 812
3 813 1491 811
3 282 1491 813
3 813 1492 284
3 811 1492 813
3 815 1493 810
3 220 1493 815
3 814 1494 810
3 815 1494 814
3 816 1495 814
3 282 1495 816
3 814 1496 816
3 810 1496 814
3 818 1497 817
3 819 1497 818
3 819 1498 83
3 818 1498 819
3 820 1499 818
3 284 1499 820
3 817 1500 818
3 820 1500 817
3 822 1501 821
3 80 1501 822
3 822 1502 83
3 821 1502 822
3 823 1503 821
3 817 1503 823
3 823 1504 80
3 821 1504 823
3 826 1505 825
3 80 1505 826
3 826 1506 824
3 825 1506 826
3 827 1507 825
3 85 1507 827
3 827 1508 80
3 825 1508 827
3 824 1509 829
3 828 1509 824
3 829 1510 282
3 828 1510 829
3 830 1511 828
3 85 1511 830
3 828 1512 830
3 824 1512 828
3 833 1513 832
3 282 1513 833
3 833 1514 831
3 832 1514 833
3 834 1515 832
3 284 1515 834
3 834 1516 282
3 832 1516 834
3 831 1517 836
3 835 1517 831
3 836 1518 80
3 835 1518 836
3 837 1519 835
3 284 1519 837
3 835 1520 837
3 831 1520 835
3 840 1521 839
3 80 1521 840
3 840 1522 838
3 839 1522 840
3 841 1523 839
3 83 1523 841
3 841 1524 80
3 839 1524 841
3 838 1525 843
3 842 1525 838
3 843 1526 143
3 842 1526 843
3 844 1527 842
3 83 1527 844
3 842 1528 844
3 838 1528 842
3 846 1529 845
3 847 1529 846
3 847 1530 84
3 846 1530 847
3 848 1531 846
3 142 1531 848
3 845 1532 846
3 848 1532 845
3 850 1533 849
3 79 1533 850
3 850 1534 84
3 849 1534 850
3 851 1535 849
3 845 1535 851
3 851 1536 79
3 849 1536 851
3 853 1537 852
3 854 1537 853
3 854 1538 86
3 853 1538 854
3 855 1539 853
3 281 1539 855
3 852 1540 853
3 855 1540 852
3 857 1541 856
3 79 1541 857
3 857 1542 86
3 856 1542 857
3 858 1543 856
3 852 1543 858
3 858 1544 79
3 856 1544 858
3 861 1545 860
3 79 1545 861
3 861 1546 859
3 860 1546 861
3 862 1547 860
3 84 1547 862
3 862 1548 79
3 860 1548 862
3 859 1549 864
3 863 1549 859
3 864 1550 283
3 863 1550 864
3 865 1551 863
3 84 1551 865
3 863 1552 865
3 859 1552 863
3 868 1553 867
3 281 1553 868
3 868 1554 866
3 867 1554 868
3 869 1555 867
3 283 1555 869
3 869 1556 281
3 867 1556 869
3 866 1557 871
3 870 1557 866
3 871 1558 219
3 870 1558 871
3 872 1559 870
3 283 1559 872
3 870 1560 872
3 866 1560 870
3 875 1561 874
3 283 1561 875
3 875 1562 873
3 874 1562 875
3 876 1563 874
3 281 1563 876
3 876 1564 283
3 874 1564 876
3 878 1565 873
3 79 1565 878
3 877 1566 873
3 878 1566 877
3 879 1567 877
3 281 1567 879
3 877 1568 879
3 873 1568 877
3 882 1569 881
3 880 1569 882
3 882 1570 278
3 881 1570 882
3 883 1571 881
3 193 1571 883
3 883 1572 880
3 881 1572 883
3 885 1573 884
3 880 1573 885
3 885 1574 192
3 884 1574 885
3 886 1575 884
3 278 1575 886
3 886 1576 880
3 884 1576 886
3 889 1577 888
3 887 1577 889
3 889 1578 282
3 888 1578 889
3 890 1579 888
3 253 1579 890
3 890 1580 887
3 888 1580 890
3 892 1581 891
3 887 1581 892
3 892 1582 57
3 891 1582 892
3 893 1583 891
3 282 1583 893
3 893 1584 887
3 891 1584 893
3 896 1585 895
3 894 1585 896
3 896 1586 281
3 895 1586 896
3 897 1587 895
3 58 1587 897
3 897 1588 894
3 895 1588 897
3 899 1589 898
3 894 1589 899
3 899 1590 252
3 898 1590 899
3 900 1591 898
3 281 1591 900
3 900 1592 894
3 898 1592 900
3 49 48 46
3 49 46 34
3 49 34 44
3 49 44 41
3 49 41 37
3 49 37 38
3 49 38 33
3 49 33 39
3 49 39 36
3 49 36 40
3 49 40 43
3 49 43 35
3 49 35 45
3 49 45 47
3 49 47 31
3 49 31 50
3 49 50 42