OFF
1160 1312 0
0.3932411549 -0.0554905127 -0.0242245639
-0.2559176331 -0.0913499949 -0.0154683231
-0.2558506757 -0.0913435451 -0.0105841274
-0.2510341699 -0.0913493273 -0.0155352714
-0.2509672125 -0.0913428775 -0.0106510756
0.4881164136 0.0583673238 0.0165588951
-0.2557565226 -0.0000052465 -0.0022679438
-0.4999665207 -0.0000386309 0.0010799738
-0.2508730594 -0.0000045789 -0.0023348920
-0.2509400168 -0.0000110287 -0.0072190878
0.4836806268 -0.0669490453 -0.0254524246
-0.2513639513 -0.0057330749 -0.0041835064
0.3553636806 0.0134333363 0.0185148789
0.3977211519 0.0442562202 -0.0276183420
0.3513786090 -0.0212690298 0.0096697533
0.4756504017 0.0585207512 0.0200697085
0.4329968175 0.0576905564 -0.0281975742
0.4514021117 -0.0587207521 -0.0038333947
0.4638371606 -0.0586913024 0.0170436898
0.4544908528 -0.0587363505 -0.0160269946
0.4632633592 -0.0587468790 -0.0250425086
0.4548218526 -0.0587042636 0.0082712951
-0.2513079701 -0.0099178175 0.0000118234
-0.2513110133 0.0099115230 -0.0000124258
0.4753450780 0.0583054684 -0.0286181957
0.4270279062 -0.0811080399 -0.0034950545
0.4280451806 -0.0779256754 0.0086977605
0.4997392741 0.0584943697 -0.0046839965
0.3902913356 0.0641459453 0.0089703441
0.3982991890 -0.0443418786 0.0213410068
-0.2509144035 0.0527168465 -0.0046713963
0.4925819065 0.0757628831 -0.0046086802
0.4760113048 0.0583695391 0.0199795891
0.4966525987 -0.0582648511 0.0077244163
0.4867685398 -0.0582782793 -0.0013001828
0.4749967921 -0.0583161188 -0.0286185796
0.3889546719 -0.0669184087 -0.0030701655
0.4751674877 -0.0794524081 -0.0163781498
-0.2510741024 0.0000179483 0.0171701112
0.4632420886 0.0583078959 -0.0251964784
-0.2554065095 -0.0912986544 0.0218155156
0.4756036685 0.0707278051 0.0167825331
0.4901015414 0.0734342651 -0.0167843547
-0.2505446442 0.0000291617 0.0216213134
-0.4844579958 0.0867063050 -0.0077005390
0.3497971282 -0.0242283315 -0.0025190954
0.4904363202 0.0734637768 0.0076359962
0.4276830915 0.0781304069 -0.0159279144
0.4304623837 0.0695251836 0.0174061208
0.3547943498 0.0133552721 -0.0237829376
0.4638169425 0.0583632621 0.0168897059
-0.2509813608 0.0527099757 -0.0095555915
-0.2557999716 0.0527157576 -0.0046044187
0.4513787362 0.0583337068 -0.0039873351
0.4544706347 0.0583181088 -0.0161809783
0.3937326308 -0.0556672871 0.0180738143
0.4901242400 -0.0732559977 -0.0165913745
0.4548005820 0.0583500903 0.0081173259
-0.4844914752 0.0867027643 -0.0101426891
0.3510490910 -0.0212886467 -0.0147506828
0.3937153659 0.0559068693 0.0179270271
-0.2512327851 0.0114516211 0.0057091991
0.4755043707 -0.0794180543 0.0080421659
0.3510424807 0.0214283726 -0.0148068971
0.4867504700 0.0584958813 -0.0014538259
0.4749787223 0.0584580418 -0.0287722226
0.3112745228 -0.0210866866 -0.0141743106
-0.1513525783 -0.0211499294 -0.0078320747
-0.2558234799 -0.0000127489 -0.0071521382
-0.5000000000 -0.0000429084 -0.0013621753
-0.2510942486 -0.0057079452 0.0156434728
0.4756255164 -0.0704657344 0.0169682662
0.4277072466 -0.0779695024 -0.0157225283
-0.2505549645 0.0527533651 0.0215478296
0.4754797553 0.0796559927 0.0078328585
-0.4844166167 -0.0868087486 -0.0074567065
-0.4844500947 -0.0868119734 -0.0098987518
0.4842397427 0.0671526736 0.0166688623
0.4842604836 -0.0668889787 0.0168451662
-0.4952927597 -0.0501316533 -0.0011765553
-0.4953262391 -0.0501348783 -0.0036187058
0.3889339329 0.0671008237 -0.0032465450
-0.2511510434 -0.0099037538 0.0114588001
-0.2558669289 0.0527087815 -0.0094886137
-0.2511540866 0.0099255868 0.0114345509
0.4966345290 0.0585089937 0.0075707736
0.3932239605 0.0556188293 -0.0243708436
0.4926053210 -0.0755520499 -0.0044096027
0.4997573441 -0.0582815802 -0.0045303511
0.4280210291 0.0781510775 0.0084924049
0.4904590181 -0.0732216441 0.0078289700
0.3497896045 0.0243998074 -0.0025829978
0.3547984659 -0.0132382921 -0.0237478758
-0.1508557667 0.0000477040 0.0287722226
0.3117734393 0.0001109471 0.0224299578
-0.2510104261 0.0913045762 -0.0109069427
0.4270027761 0.0813008600 -0.0037086534
-0.2554405326 0.0527522762 0.0216148072
0.3111468563 0.0122679346 -0.0231541901
-0.1514802447 0.0122046918 -0.0168119541
-0.2508905935 -0.0527338742 -0.0045236269
-0.2509575509 -0.0527403241 -0.0094078227
-0.2557751092 -0.0527345420 -0.0044566643
-0.2558420666 -0.0527409918 -0.0093408600
0.3112680298 0.0212176257 -0.0142260866
-0.1513590713 0.0211543829 -0.0078838507
-0.2505662412 0.0913499949 0.0214940678
-0.1508987428 -0.0121685177 0.0255155637
0.3117304632 -0.0121052746 0.0191732989
-0.2512292700 -0.0114449043 0.0057372817
-0.2554281073 0.0000274416 0.0216882630
0.3513719948 0.0214734616 0.0096135055
0.3982854270 0.0445912134 0.0212239651
0.4304838628 -0.0692761833 0.0175888053
0.4836598830 0.0671016590 -0.0256288456
0.4872417244 0.0584660344 -0.0256665452
-0.4953168061 0.0500467517 -0.0013173591
-0.2510773835 0.0912979158 -0.0157911382
-0.2558938893 0.0913036981 -0.0108399942
0.4298966395 -0.0693509870 -0.0247087703
0.4753684535 -0.0587484642 -0.0284642559
0.4965781498 -0.0587295393 -0.0166000832
0.4875649352 -0.0587425013 -0.0253733487
0.4881366317 -0.0586869250 0.0167128786
0.5000000000 -0.0587130501 -0.0044951065
0.4969091496 -0.0586974524 0.0076982065
0.4760315228 -0.0586842886 0.0201335720
0.4751428716 0.0796257439 -0.0165874626
0.4330146516 -0.0575608533 -0.0280459388
-0.4953502855 0.0500433162 -0.0037595093
0.3977348301 -0.0441358515 -0.0275020136
0.4756684710 -0.0582505675 0.0202233478
0.4878343909 -0.0582532178 0.0167848728
0.3553678021 -0.0132045413 0.0185498939
0.3116093013 -0.0210554908 0.0102460381
-0.1510177997 -0.0211187336 0.0165882740
-0.2513657091 0.0057167667 -0.0041975498
0.3111038648 0.0000485538 -0.0264120026
0.3600413651 0.0000552173 -0.0271028960
0.3606983082 0.0001197139 0.0217391295
-0.2513858608 -0.0000112325 -0.0057246064
-0.1515232362 -0.0000146891 -0.0200697666
-0.2512310305 0.0000038844 0.0057230292
-0.2554497043 0.0913488010 0.0215610167
0.3900279325 -0.0638292604 -0.0152819209
0.3903111549 -0.0639317484 0.0091388901
-0.2505230464 -0.0912969343 0.0217485660
-0.2505311661 -0.0526971463 0.0216947567
-0.2554156818 -0.0526978140 0.0217617194
0.4750217040 0.0706757376 -0.0255151446
0.4336737636 0.0577342151 0.0206444151
0.3111506053 -0.0121590257 -0.0231243002
-0.1514764957 -0.0122222685 -0.0167820643
-0.1514764972 -0.0122222686 -0.0167821695
0.4753374916 -0.0827066136 -0.0041634302
0.4965579317 0.0583251305 -0.0167540673
0.4962997503 0.0584785347 -0.0168495761
-0.2559608466 0.0912967220 -0.0157241893
0.3900081547 0.0639797126 -0.0154501126
0.3114424163 -0.0243429981 -0.0019599804
-0.1511846848 -0.0244062409 0.0043822556
0.4878163215 0.0585186271 0.0166312327
0.4298751558 0.0694892199 -0.0248914007
0.4968878790 0.0583571120 0.0075442370
0.4999766245 0.0583415141 -0.0046490472
0.4753118632 0.0829126201 -0.0043813669
0.3116028088 0.0212464006 0.0101942653
-0.1510242923 0.0211831578 0.0165365012
0.4336915912 -0.0574753024 0.0207959953
0.4963178206 -0.0582992047 -0.0166959283
0.4872597948 -0.0583122312 -0.0255128967
-0.1509024912 0.0122542324 0.0254856794
0.3117267148 0.0123174755 0.0191434145
0.4875436646 0.0583118526 -0.0255273179
0.3114349193 0.0245039756 -0.0020197509
-0.1511921817 0.0244407328 0.0043224850
-0.2510960046 0.0057397914 0.0156295374
0.4750435546 -0.0705258013 -0.0253292957
0.3792165692 -0.0220080688 -0.0028814420
0.3792165692 -0.0220080688 -0.0028814420
0.4156569203 -0.0509513659 -0.0033524660
0.4156569203 -0.0509513659 -0.0033524660
0.4543441917 -0.0578957106 -0.0039112921
0.4543441917 -0.0578957106 -0.0039112921
0.3791633961 0.0223232154 -0.0029394655
0.3791633961 0.0223232154 -0.0029394655
0.4156974577 0.0509952177 -0.0034869634
0.4156974577 0.0509952177 -0.0034869634
0.4543236096 0.0581056538 -0.0040639329
0.4543236096 0.0581056538 -0.0040639329
0.0804354741 0.0061825897 0.0239578186
-0.0352335086 0.0092184110 0.0247217490
0.0804121118 0.0122858539 0.0223145470
0.0804354741 0.0061825897 0.0239578186
0.1961044567 0.0031467684 0.0231938882
0.0804588363 0.0000793255 0.0256010902
0.0803501588 0.0167503165 0.0178399723
-0.0352761662 0.0145022744 0.0216628258
0.0802892582 0.0212147792 0.0133653833
0.0803501588 0.0167503165 0.0178399723
0.1960384368 0.0145338960 0.0184916934
0.0804121118 0.0122858539 0.0223145470
0.0802053135 0.0228435667 0.0072583752
-0.0354934341 0.0236421497 0.0057904301
0.0801213688 0.0244723542 0.0011513671
0.0802053135 0.0228435667 0.0072583752
0.1959040611 0.0220449836 0.0087263202
0.0802892582 0.0212147792 0.0133653833
0.0800379240 0.0228291792 -0.0049518008
-0.0356605736 0.0219917810 -0.0064178257
0.0799544793 0.0211860043 -0.0110549686
0.0800379240 0.0228291792 -0.0049518008
0.1957364217 0.0236665774 -0.0034857758
0.0801213688 0.0244723542 0.0011513671
0.0798938925 0.0167111587 -0.0155190204
-0.0357931761 0.0144579253 -0.0161654872
0.0798333058 0.0122363132 -0.0199830721
0.0798938925 0.0167111587 -0.0155190204
0.1955809612 0.0189643922 -0.0148725535
0.0799544793 0.0211860043 -0.0110549686
0.0798118101 0.0061266228 -0.0216119783
-0.0358557131 0.0030559669 -0.0208408725
0.0797903143 0.0000169323 -0.0232408846
0.0798118101 0.0061266228 -0.0216119783
0.1954793332 0.0091972787 -0.0223830842
0.0798333058 0.0122363132 -0.0199830721
0.0798136846 -0.0060868574 -0.0215970334
-0.0358547758 -0.0030507732 -0.0208334000
0.0798370541 -0.0121906472 -0.0199532349
0.0798136846 -0.0060868574 -0.0215970334
0.1954587747 -0.0030191518 -0.0240045180
0.0797903143 0.0000169323 -0.0232408846
0.0798990128 -0.0166544776 -0.0154782401
-0.0357267827 -0.0189022035 -0.0116551574
0.0799609722 -0.0211183080 -0.0110031927
0.0798990128 -0.0166544776 -0.0154782401
0.1955867678 -0.0188705821 -0.0148262754
0.0798370541 -0.0121906472 -0.0199532349
0.0800449190 -0.0227464638 -0.0048960275
-0.0355698829 -0.0235763523 -0.0002568860
0.0801288658 -0.0243746195 0.0012111376
0.0800449190 -0.0227464638 -0.0048960275
0.1956597209 -0.0219165752 -0.0095351691
0.0799609722 -0.0211183080 -0.0110031927
0.0802123083 -0.0227308659 0.0073141468
-0.0354027457 -0.0219247997 0.0119512104
0.0802957508 -0.0210871122 0.0134171560
0.0802123083 -0.0227308659 0.0073141468
0.1958273623 -0.0235369320 0.0026770832
0.0801288658 -0.0243746195 0.0012111376
0.0803563317 -0.0166120041 0.0178807864
-0.0352712055 -0.0143902609 0.0216981750
0.0804158602 -0.0121368961 0.0223444313
0.0803563317 -0.0166120041 0.0178807864
0.1959828165 -0.0188337474 0.0140634123
0.0802957508 -0.0210871122 0.0134171560
0.0804373482 -0.0060287853 0.0239727607
-0.0352092092 -0.0029905407 0.0263724917
0.0804588363 0.0000793255 0.0256010902
0.0804373482 -0.0060287853 0.0239727607
0.1960839057 -0.0090670299 0.0215730298
0.0804158602 -0.0121368961 0.0223444313
-0.3755339345 -0.0514330976 -0.0028166098
-0.3700958629 -0.0697716453 -0.0059566854
-0.4272562398 -0.0782901969 -0.0067066960
-0.3156545218 -0.0520838198 -0.0036366370
-0.4354133471 -0.0507823755 -0.0019965826
-0.4299752756 -0.0691209231 -0.0051366582
-0.4599149819 -0.0687955620 -0.0047266446
-0.3700958629 -0.0697716453 -0.0059566854
-0.3129732693 -0.0805575952 -0.0082704064
-0.3129354861 -0.0612530936 -0.0052066748
-0.2843741893 -0.0666460686 -0.0063635353
-0.3701336462 -0.0890761468 -0.0090204170
-0.4272562398 -0.0782901969 -0.0067066960
-0.3129732693 -0.0805575952 -0.0082704064
-0.3755246412 -0.0250684499 -0.0017222496
-0.4377455809 -0.0125535404 -0.0003211379
-0.4354087004 -0.0376000516 -0.0014494025
-0.4665191703 -0.0313425968 -0.0007488466
-0.4066351111 -0.0188109951 -0.0010216937
-0.4665191703 -0.0313425968 -0.0007488466
-0.4976296402 -0.0250851421 -0.0000482908
-0.4688560508 -0.0062960856 0.0003794180
-0.3778615217 -0.0000219387 -0.0005939850
-0.3156405819 -0.0125368482 -0.0019950967
-0.3467510518 -0.0062793934 -0.0012945408
-0.3168090222 -0.0000135926 -0.0014309644
-0.4377455809 -0.0125535404 -0.0003211379
-0.4389140212 -0.0000302848 0.0002429944
-0.4066351111 -0.0188109951 -0.0010216937
-0.3755246412 -0.0250684499 -0.0017222496
-0.3156498752 -0.0389014959 -0.0030894569
-0.3156405819 -0.0125368482 -0.0019950967
-0.2857031989 -0.0194533712 -0.0026787004
-0.3455872582 -0.0319849729 -0.0024058532
-0.2857031989 -0.0194533712 -0.0026787004
-0.2557658159 -0.0263698942 -0.0033623040
-0.2857124922 -0.0458180190 -0.0037730606
-0.3755339345 -0.0514330976 -0.0028166098
-0.4354087004 -0.0376000516 -0.0014494025
-0.4054713174 -0.0445165746 -0.0021330061
-0.4354133471 -0.0507823755 -0.0019965826
-0.3156498752 -0.0389014959 -0.0030894569
-0.3156545218 -0.0520838198 -0.0036366370
-0.3455872582 -0.0319849729 -0.0024058532
-0.3778832462 0.0263385634 -0.0017622224
-0.4389248835 0.0131499663 -0.0003411243
-0.4671208448 0.0315983590 -0.0008292417
-0.4694457021 0.0065556677 0.0003694248
-0.4976416634 0.0250040604 -0.0001186926
-0.4366000261 0.0381926575 -0.0015397908
-0.4084040648 0.0197442648 -0.0010516733
-0.4671208448 0.0315983590 -0.0008292417
-0.3755583888 0.0513812547 -0.0029608889
-0.3168416089 0.0395271605 -0.0031833205
-0.3473624275 0.0329328620 -0.0024727715
-0.3156791802 0.0520485061 -0.0037826538
-0.4366000261 0.0381926575 -0.0015397908
-0.4354375975 0.0507140032 -0.0021391240
-0.4060792075 0.0447869561 -0.0022503398
-0.3778832462 0.0263385634 -0.0017622224
-0.3168198844 0.0131666585 -0.0020150831
-0.3168416089 0.0395271605 -0.0031833205
-0.2863099280 0.0329412081 -0.0033097509
-0.3473515653 0.0197526109 -0.0018886528
-0.2863099280 0.0329412081 -0.0033097509
-0.2557782471 0.0263552556 -0.0034361812
-0.2862882035 0.0065807060 -0.0021415134
-0.3778615217 -0.0000219387 -0.0005939850
-0.4389248835 0.0131499663 -0.0003411243
-0.4083932026 0.0065640138 -0.0004675546
-0.4389140212 -0.0000302848 0.0002429944
-0.3168198844 0.0131666585 -0.0020150831
-0.3168090222 -0.0000135926 -0.0014309644
-0.3473515653 0.0197526109 -0.0018886528
-0.3756053477 0.0706752249 -0.0060786766
-0.4354610769 0.0603609883 -0.0036980179
-0.4653889415 0.0552038700 -0.0025076885
-0.4300316718 0.0786907650 -0.0068896078
-0.3701759426 0.0890050016 -0.0092702666
-0.3157496185 0.0809894615 -0.0084593354
-0.4273169692 0.0878556533 -0.0084854028
-0.3756053477 0.0706752249 -0.0060786766
-0.3157496185 0.0809894615 -0.0084593354
-0.2857747951 0.0668526096 -0.0065318770
-0.3157026597 0.0616954913 -0.0053415477
-0.3755583888 0.0513812547 -0.0029608889
-0.4354610769 0.0603609883 -0.0036980179
-0.3157026597 0.0616954913 -0.0053415477
-0.3756086072 0.0513760488 -0.0066240615
-0.3701792021 0.0697057729 -0.0098156514
-0.4273353386 0.0782042686 -0.0099791702
-0.3157377681 0.0520424152 -0.0080563376
-0.4354794464 0.0507096825 -0.0051917854
-0.4300500412 0.0690394066 -0.0083833753
-0.4599854608 0.0687062234 -0.0076672372
-0.3701792021 0.0697057729 -0.0098156514
-0.3130700244 0.0805012474 -0.0127699203
-0.3130230655 0.0612072772 -0.0096521326
-0.2844684766 0.0666050145 -0.0111292670
-0.3702261609 0.0889997431 -0.0129334392
-0.4273353386 0.0782042686 -0.0099791702
-0.3130700244 0.0805012474 -0.0127699203
-0.3755868827 0.0250152837 -0.0054558237
-0.4377934413 0.0124861876 -0.0034089995
-0.4354685841 0.0375292999 -0.0046076665
-0.4665718634 0.0312647519 -0.0035842544
-0.4066901620 0.0187507356 -0.0044324116
-0.4665718634 0.0312647519 -0.0035842544
-0.4976751427 0.0250002039 -0.0025608423
-0.4688967207 0.0062216396 -0.0023855874
-0.3779117399 -0.0000278286 -0.0042571567
-0.3157051813 0.0125012674 -0.0063039810
-0.3468084606 0.0062367194 -0.0052805688
-0.3168676099 -0.0000202888 -0.0057046474
-0.4377934413 0.0124861876 -0.0034089995
-0.4389558700 -0.0000353685 -0.0028096660
-0.4066901620 0.0187507356 -0.0044324116
-0.3755868827 0.0250152837 -0.0054558237
-0.3157269058 0.0388620326 -0.0074722187
-0.3157051813 0.0125012674 -0.0063039810
-0.2857751928 0.0194246419 -0.0073121785
-0.3456568942 0.0319386581 -0.0064640212
-0.2857751928 0.0194246419 -0.0073121785
-0.2558452044 0.0263480163 -0.0083203759
-0.2857969174 0.0457854070 -0.0084804162
-0.3756086072 0.0513760488 -0.0066240615
-0.4354685841 0.0375292999 -0.0046076665
-0.4055385956 0.0444526744 -0.0056158640
-0.4354794464 0.0507096825 -0.0051917854
-0.3157269058 0.0388620326 -0.0074722187
-0.3157377681 0.0520424152 -0.0080563376
-0.3456568942 0.0319386581 -0.0064640212
-0.3779210333 -0.0263919501 -0.0053515177
-0.4389605167 -0.0132174293 -0.0033568465
-0.4671433779 -0.0316761538 -0.0034877762
-0.4694802583 -0.0066301688 -0.0023595109
-0.4976631196 -0.0250888934 -0.0024904406
-0.4366236362 -0.0382634142 -0.0044851117
-0.4084407750 -0.0198046897 -0.0043541821
-0.4671433779 -0.0316761538 -0.0034877762
-0.3755841529 -0.0514379351 -0.0064797829
-0.3168815500 -0.0395664710 -0.0073461888
-0.3474012916 -0.0329792105 -0.0063488532
-0.3157131098 -0.0520894634 -0.0079103215
-0.4366236362 -0.0382634142 -0.0044851117
-0.4354551960 -0.0507864067 -0.0050492444
-0.4061038945 -0.0448506746 -0.0054824473
-0.3779210333 -0.0263919501 -0.0053515177
-0.3168815500 -0.0395664710 -0.0073461888
-0.2863525149 -0.0197896099 -0.0072491635
-0.2863618083 -0.0461537314 -0.0083435244
-0.2558327733 -0.0263768703 -0.0082464991
-0.3168722566 -0.0132023495 -0.0062518279
-0.3474012916 -0.0329792105 -0.0063488532
-0.2863525149 -0.0197896099 -0.0072491635
-0.3779117399 -0.0000278286 -0.0042571567
-0.4389605167 -0.0132174293 -0.0033568465
-0.4084407750 -0.0198046897 -0.0043541821
-0.4389558700 -0.0000353685 -0.0028096660
-0.3168722566 -0.0132023495 -0.0062518279
-0.3168676099 -0.0000202888 -0.0057046474
-0.3473919983 -0.0066150891 -0.0052544923
-0.3756219361 -0.0707424366 -0.0095435145
-0.4354740876 -0.0604386575 -0.0065811102
-0.4654001634 -0.0552867679 -0.0050999080
-0.4300360154 -0.0787772050 -0.0097211331
-0.3701838639 -0.0890809842 -0.0126835375
-0.3157697846 -0.0810462158 -0.0125059188
-0.4273169793 -0.0879464788 -0.0112911446
-0.3756219361 -0.0707424366 -0.0095435145
-0.3157697846 -0.0810462158 -0.0125059188
-0.2858059256 -0.0668936038 -0.0109233894
-0.3157320014 -0.0617417142 -0.0094421872
-0.3755841529 -0.0514379351 -0.0064797829
-0.4354740876 -0.0604386575 -0.0065811102
-0.3157320014 -0.0617417142 -0.0094421872
0.4693042186 -0.0002207053 -0.0268303522
0.4693042186 -0.0002207053 -0.0268303522
0.4588664707 -0.0002142273 -0.0206117365
0.4588664707 -0.0002142273 -0.0206117365
0.4529363732 -0.0002013216 -0.0100071865
0.4529363732 -0.0002013216 -0.0100071865
0.4531002944 -0.0001852784 0.0021419800
0.4531002944 -0.0001852784 0.0021419800
0.4593188713 -0.0001706061 0.0125805079
0.4593188713 -0.0001706061 0.0125805079
0.4699242327 -0.0001605132 0.0185116390
0.4699242327 -0.0001605132 0.0185116390
0.4820739682 -0.0001586929 0.0183462338
0.4820739682 -0.0001586929 0.0183462338
0.4925127816 -0.0001650643 0.0121285508
0.4925127816 -0.0001650643 0.0121285508
0.4984439395 -0.0001779690 0.0015245652
0.4984439395 -0.0001779690 0.0015245652
0.4982773871 -0.0001940126 -0.0106245652
0.4982773871 -0.0001940126 -0.0106245652
0.4920614334 -0.0002086854 -0.0210637080
0.4920614334 -0.0002086854 -0.0210637080
0.4814560590 -0.0002183058 -0.0269957869
0.4814560590 -0.0002183058 -0.0269957869
0.3980170096 -0.0442388651 -0.0030805034
0.3794987486 -0.0221110823 0.0215400682
0.3603698367 0.0000874656 -0.0026818833
0.3788880976 -0.0220403171 -0.0273024548
0.4333531214 -0.0575180778 -0.0036249717
0.4159953901 -0.0509085905 0.0210685011
0.3980170096 -0.0442388651 -0.0030805034
0.4153747409 -0.0508483524 -0.0277739762
0.4753326316 -0.0582833431 -0.0041976159
0.4546800311 -0.0578629349 0.0205096716
0.4333531214 -0.0575180778 -0.0036249717
0.4540057219 -0.0579384860 -0.0283322592
0.3980032894 0.0444237168 -0.0031971885
0.3788812585 0.0221557188 -0.0273606190
0.3603698367 0.0000874656 -0.0026818833
0.3794918676 0.0223554637 0.0214815473
0.4333352906 0.0577123858 -0.0037765795
0.4153589847 0.0509733883 -0.0279079581
0.3980032894 0.0444237168 -0.0031971885
0.4159795953 0.0511627143 0.0209341901
0.4753145620 0.0584893965 -0.0043512571
0.4539877699 0.0580742991 -0.0284848984
0.4333352906 0.0577123858 -0.0037765795
0.4546620827 0.0581274832 0.0203570618
-0.0352101463 0.0031151468 0.0263650206
-0.0930446376 0.0046330575 0.0267469858
0.1960810944 0.0092500326 0.0215506166
-0.0352335086 0.0092184110 0.0247217490
0.1960810944 0.0092500326 0.0215506166
0.2539155858 0.0077321219 0.0211686514
-0.0352101463 0.0031151468 0.0263650206
0.1961044567 0.0031467684 0.0231938882
-0.0931502293 0.0178427161 0.0190996635
-0.0353370668 0.0189667371 0.0171882368
0.1959764838 0.0189983585 0.0140171188
-0.0353370668 0.0189667371 0.0171882368
0.1959764838 0.0189983585 0.0140171188
0.2538206228 0.0178901483 0.0143429794
-0.0352761662 0.0145022744 0.0216628258
0.1960384368 0.0145338960 0.0184916934
-0.0354094894 0.0220133622 0.0118974382
-0.0932588632 0.0224126538 0.0111634657
0.1958201164 0.0236737711 0.0026193121
-0.0354934341 0.0236421497 0.0057904301
0.1958201164 0.0236737711 0.0026193121
0.2536694902 0.0232744796 0.0033532847
-0.0354094894 0.0220133622 0.0118974382
0.1959040611 0.0220449836 0.0087263202
-0.0355771288 0.0236349560 -0.0003146579
-0.0934263777 0.0232162569 -0.0010476703
0.1956529769 0.0220234024 -0.0095889437
-0.0356605736 0.0219917810 -0.0064178257
0.1956529769 0.0220234024 -0.0095889437
0.2535022258 0.0224421015 -0.0088559312
-0.0355771288 0.0236349560 -0.0003146579
0.1957364217 0.0236665774 -0.0034857758
-0.0357325894 0.0189327708 -0.0117014355
-0.0935761237 0.0178061541 -0.0120246690
0.1955203744 0.0144895467 -0.0193366052
-0.0357931761 0.0144579253 -0.0161654872
0.1955203744 0.0144895467 -0.0193366052
0.2533639087 0.0156161634 -0.0190133718
-0.0357325894 0.0189327708 -0.0117014355
0.1955809612 0.0189643922 -0.0148725535
-0.0358342173 0.0091656573 -0.0192119662
-0.0936679789 0.0076303293 -0.0188264133
0.1954578374 0.0030875883 -0.0240119905
-0.0358557131 0.0030559669 -0.0208408725
0.1954578374 0.0030875883 -0.0240119905
0.2532915990 0.0046229162 -0.0243975434
-0.0358342173 0.0091656573 -0.0192119662
0.1954793332 0.0091972787 -0.0223830842
-0.0936656365 -0.0076365209 -0.0188077848
-0.0358314063 -0.0091545630 -0.0191896015
0.1954821450 -0.0091229415 -0.0223606668
-0.0358314063 -0.0091545630 -0.0191896015
0.1954821450 -0.0091229415 -0.0223606668
0.2533046900 -0.0075890888 -0.0235644091
-0.0358547758 -0.0030507732 -0.0208334000
0.1954587747 -0.0030191518 -0.0240045180
-0.0357887422 -0.0144383731 -0.0161302048
-0.0936016400 -0.0155622361 -0.0142186634
0.1955867678 -0.0188705821 -0.0148262754
-0.0357267827 -0.0189022035 -0.0116551574
0.2533686866 -0.0155148039 -0.0189752878
0.1955248091 -0.0144067517 -0.0193012701
-0.0357887422 -0.0144383731 -0.0161302048
0.1955248091 -0.0144067517 -0.0193012701
-0.0356538296 -0.0219481966 -0.0063640511
-0.0934612306 -0.0223631409 -0.0040444803
0.1957436677 -0.0235447309 -0.0034280039
-0.0355698829 -0.0235763523 -0.0002568860
0.1957436677 -0.0235447309 -0.0034280039
0.2535510686 -0.0231297867 -0.0057475747
-0.0356538296 -0.0219481966 -0.0063640511
0.1956597209 -0.0219165752 -0.0095351691
-0.0354861882 -0.0235685534 0.0058482012
-0.0932937152 -0.0231655203 0.0081667330
0.1959108048 -0.0218931783 0.0087800925
-0.0354027457 -0.0219247997 0.0119512104
0.1959108048 -0.0218931783 0.0087800925
0.2537183318 -0.0222962114 0.0064615607
-0.0354861882 -0.0235685534 0.0058482012
0.1958273623 -0.0235369320 0.0026770832
-0.0353307340 -0.0188653688 0.0172345302
-0.0931445026 -0.0177544972 0.0191432245
0.1960433975 -0.0143586393 0.0185270426
-0.0352712055 -0.0143902609 0.0216981750
0.1960433975 -0.0143586393 0.0185270426
0.2538566399 -0.0154695110 0.0166183556
-0.0353307340 -0.0188653688 0.0172345302
0.1959828165 -0.0188337474 0.0140634123
-0.0352306973 -0.0090986515 0.0247441622
-0.0930539760 -0.0075795292 0.0259440277
0.1961053938 -0.0029589191 0.0232013593
-0.0352092092 -0.0029905407 0.0263724917
0.1961053938 -0.0029589191 0.0232013593
0.2539286725 -0.0044780414 0.0220014938
-0.0352306973 -0.0090986515 0.0247441622
0.1960839057 -0.0090670299 0.0215730298
-0.2013582648 -0.0134415021 -0.0060077905
-0.2012463274 -0.0171620292 0.0021970395
-0.2011235349 -0.0162818190 0.0111627779
-0.2010248931 -0.0110361357 0.0184871819
-0.2009750077 -0.0028301206 0.0222078477
-0.2009882968 0.0061360903 0.0213278953
-0.2010601484 0.0134614746 0.0160830193
-0.2011731342 0.0171831598 0.0078785180
-0.2012959282 0.0163030020 -0.0010873258
-0.2013956290 0.0110581074 -0.0084121900
-0.2014444727 0.0028510388 -0.0121336582
-0.2014435938 -0.0028738820 -0.0121266365
-0.2507068200 -0.0720154043 0.0086124695
-0.2507068200 -0.0720154043 0.0086124695
-0.2507021128 -0.0263508626 0.0096799323
-0.2507021128 -0.0263508626 0.0096799323
-0.2507295238 0.0263730041 0.0084749585
-0.2507295238 0.0263730041 0.0084749585
-0.2507826953 0.0720289706 0.0053204434
-0.2507826953 0.0720289706 0.0053204434
-0.2556248380 0.0720322793 0.0084782990
-0.2556248380 0.0720322793 0.0084782990
-0.2555985276 0.0263735149 0.0096734317
-0.2555985276 0.0263735149 0.0096734317
-0.2556016082 -0.0263535502 0.0086157994
-0.2556016082 -0.0263535502 0.0086157994
-0.2556331788 -0.0720206796 0.0055887960
-0.2556331788 -0.0720206796 0.0055887960
-0.4299752756 -0.0691209231 -0.0051366582
-0.4013950871 -0.0648616473 -0.0047616529
-0.3129354861 -0.0612530936 -0.0052066748
-0.3455942282 -0.0517584587 -0.0032266234
-0.4599149819 -0.0687955620 -0.0047266446
-0.4054736408 -0.0511077366 -0.0024065962
-0.4776038708 -0.0594636077 -0.0029515999
-0.4653530534 -0.0504570144 -0.0015865690
-0.2843741893 -0.0666460686 -0.0063635353
-0.3415345661 -0.0751646202 -0.0071135459
-0.2558128925 -0.0720390435 -0.0075203958
-0.2844119725 -0.0859505701 -0.0094272669
-0.3986949430 -0.0836831719 -0.0078635565
-0.4272751314 -0.0879424477 -0.0082385617
-0.3129921609 -0.0902098460 -0.0098022722
-0.3415345661 -0.0751646202 -0.0071135459
-0.4898874010 0.0683765284 -0.0045089490
-0.4599595364 0.0735336467 -0.0056992784
-0.4055332123 0.0655181066 -0.0048883473
-0.4599595364 0.0735336467 -0.0056992784
-0.3456774831 0.0758323432 -0.0072690060
-0.3130349159 0.0901543498 -0.0100551304
-0.3987464559 0.0884303274 -0.0088778347
-0.4300316718 0.0786907650 -0.0068896078
-0.2858217539 0.0861465798 -0.0096496648
-0.2558469305 0.0720097279 -0.0077222064
-0.3456774831 0.0758323432 -0.0072690060
-0.2857747951 0.0668526096 -0.0065318770
-0.4055332123 0.0655181066 -0.0048883473
-0.4354375975 0.0507140032 -0.0021391240
-0.3156791802 0.0520485061 -0.0037826538
-0.3456305243 0.0565383730 -0.0041512183
-0.3702094212 0.0890015135 -0.0117123641
-0.4300500412 0.0690394066 -0.0083833753
-0.4014719729 0.0647901587 -0.0083016159
-0.3130230655 0.0612072772 -0.0096521326
-0.3456731876 0.0517092320 -0.0073401996
-0.4599854608 0.0687062234 -0.0076672372
-0.4055440268 0.0510428657 -0.0059079235
-0.4776678731 0.0593747698 -0.0057133733
-0.4654148659 0.0503764993 -0.0044756474
-0.2844684766 0.0666050145 -0.0111292670
-0.3416246132 0.0751035102 -0.0112927859
-0.2559138878 0.0720027517 -0.0126064015
-0.2845154355 0.0858989847 -0.0142470548
-0.3987807498 0.0836020059 -0.0114563047
-0.4273588181 0.0878512537 -0.0115380641
-0.3130935038 0.0901482325 -0.0143288142
-0.3416246132 0.0751035102 -0.0112927859
-0.4898881669 -0.0684734259 -0.0067587288
-0.4599620911 -0.0736253155 -0.0082399310
-0.4055480119 -0.0655905470 -0.0080623123
-0.4599620911 -0.0736253155 -0.0082399310
-0.3456958604 -0.0758943262 -0.0110247166
-0.3130507485 -0.0902154895 -0.0140759303
-0.3987504216 -0.0885137315 -0.0119873410
-0.4300360154 -0.0787772050 -0.0097211331
-0.2858437089 -0.0861981053 -0.0139871210
-0.2558798499 -0.0720454934 -0.0124045916
-0.3456958604 -0.0758943262 -0.0110247166
-0.2858059256 -0.0668936038 -0.0109233894
-0.4055480119 -0.0655905470 -0.0080623123
-0.4354551960 -0.0507864067 -0.0050492444
-0.3157131098 -0.0520894634 -0.0079103215
-0.3456580771 -0.0565898246 -0.0079609851
-0.3701671249 -0.0890793718 -0.0114625148
0.4662837889 -0.0294837922 -0.0259364304
0.4753567657 -0.0002214979 -0.0285412258
0.4662731536 0.0290435953 -0.0260134153
0.4632527239 -0.0002194916 -0.0251194935
0.4610649149 -0.0294805532 -0.0228271225
0.4632527239 -0.0002194916 -0.0251194935
0.4610542796 0.0290468343 -0.0229041074
0.4544807437 -0.0002091208 -0.0161039865
0.4537136130 -0.0294688361 -0.0130170905
0.4544807437 -0.0002091208 -0.0161039865
0.4521575547 0.0290661926 -0.0069972608
0.4513904239 -0.0001935227 -0.0039103649
0.4539610735 -0.0294447710 0.0052066376
0.4513904239 -0.0001935227 -0.0039103649
0.4522395153 0.0290742142 -0.0009226776
0.4548112173 -0.0001770866 0.0081943105
0.4615780160 -0.0294309542 0.0148120988
0.4548112173 -0.0001770866 0.0081943105
0.4615679069 0.0290963280 0.0147351069
0.4638270516 -0.0001640201 0.0169666978
0.4668806966 -0.0294259078 0.0177776644
0.4638270516 -0.0001640201 0.0169666978
0.4729677687 0.0291045129 0.0192456140
0.4760214138 -0.0001573747 0.0200565806
0.4851053000 -0.0294228089 0.0175295562
0.4760214138 -0.0001573747 0.0200565806
0.4850951909 0.0291043154 0.0174525645
0.4881265226 -0.0001598006 0.0166358868
0.4947109656 -0.0294312583 0.0099133786
0.4881265226 -0.0001598006 0.0166358868
0.4947003303 0.0290960239 0.0098363939
0.4968985143 -0.0001701702 0.0076212218
0.4992219698 -0.0294455095 -0.0014852706
0.4968985143 -0.0001701702 0.0076212218
0.4976659093 0.0290895715 0.0045344011
0.4999883122 -0.0001857680 -0.0045720768
0.4991386936 -0.0294535313 -0.0075598359
0.4999883122 -0.0001857680 -0.0045720768
0.4974176594 0.0290655590 -0.0136893162
0.4965680407 -0.0002022044 -0.0166770752
0.4943197916 -0.0294691123 -0.0188318956
0.4965680407 -0.0002022044 -0.0166770752
0.4943096826 0.0290582226 -0.0189088876
0.4875542999 -0.0002153243 -0.0254503333
0.4845104971 -0.0294804035 -0.0261845678
0.4875542999 -0.0002153243 -0.0254503333
0.4784005685 0.0290435813 -0.0278069913
0.4753567657 -0.0002214979 -0.0285412258
0.3745502165 -0.0344359142 0.0183118541
0.3794987486 -0.0221110823 0.0215400682
0.3708448819 -0.0426003891 0.0094043217
0.3745502165 -0.0344359142 0.0183118541
0.3693759000 -0.0455733701 -0.0027946305
0.3700541415 -0.0440800399 0.0033098973
0.3700018814 -0.0441035277 -0.0089104242
0.3700018814 -0.0441035277 -0.0089104242
0.3724131992 -0.0385337763 -0.0195148983
0.3724131992 -0.0385337763 -0.0195148983
0.3766412600 -0.0277176477 -0.0256637300
0.3766412600 -0.0277176477 -0.0256637300
0.3887578791 -0.0331749737 0.0092297824
0.3884756997 -0.0330719602 -0.0151917278
0.3699574387 -0.0109441775 0.0094288437
0.3887578791 -0.0331749737 0.0092297824
0.3696289672 -0.0109764258 -0.0149921690
0.3699574387 -0.0109441775 0.0094288437
0.3884756997 -0.0330719602 -0.0151917278
0.3696289672 -0.0109764258 -0.0149921690
0.4518353485 -0.0741957049 0.0128330133
0.4512661385 -0.0802630471 0.0022735557
0.4512661385 -0.0802630471 0.0022735557
0.4515223691 -0.0803380580 -0.0099429792
0.4515223691 -0.0803380580 -0.0099429792
0.3772068370 0.0280132916 0.0198330783
0.3772068370 0.0280132916 0.0198330783
0.3728275081 0.0387896408 0.0137426115
0.3728275081 0.0387896408 0.0137426115
0.3701529639 0.0442871427 0.0031834802
0.3701529639 0.0442871427 0.0031834802
0.3693617687 0.0457503155 -0.0029147714
0.3698988796 0.0441897600 -0.0090165552
0.3705253177 0.0427040426 -0.0151285048
0.3740091551 0.0344870507 -0.0240768906
0.3740091551 0.0344870507 -0.0240768906
0.3788812585 0.0221557188 -0.0273606190
0.3884422740 0.0332897178 -0.0152789037
0.3887244115 0.0334572144 0.0091422498
0.3696023806 0.0111892163 -0.0150211807
0.3884422740 0.0332897178 -0.0152789037
0.3699308521 0.0112214646 0.0093998320
0.3696023806 0.0111892163 -0.0150211807
0.3887244115 0.0334572144 0.0091422498
0.3699308521 0.0112214646 0.0093998320
0.4516664461 0.0805318488 0.0020555190
0.4516664461 0.0805318488 0.0020555190
0.4510728238 0.0804633019 -0.0101480580
0.4510728238 0.0804633019 -0.0101480580
0.4513523977 0.0744030723 -0.0207215295
0.3355726150 0.0000518855 -0.0267574493
0.3362143857 -0.0059927803 0.0204562142
0.3362143857 -0.0059927803 0.0204562142
0.3362358737 0.0001153305 0.0220845437
0.3355941107 0.0061615760 -0.0251285430
0.3355941107 0.0061615760 -0.0251285430
-0.0930446376 0.0046330575 0.0267469858
0.0226126639 0.0046488683 0.0251614196
-0.1219735644 0.0084436449 0.0261163326
-0.0930679999 0.0107363217 0.0251037142
0.1382466031 0.0107679433 0.0219325818
0.1960694133 0.0123016647 0.0207289807
-0.0352451897 0.0122700431 0.0239001132
0.0226009827 0.0077005004 0.0243397838
0.2539155858 0.0077321219 0.0211686514
0.1382582842 0.0077163112 0.0227542176
0.2828445125 0.0039215345 0.0217993046
0.2539389480 0.0016288577 0.0228119230
0.0226243450 0.0015972362 0.0259830554
-0.0351984652 0.0000635147 0.0271866564
0.1961161378 0.0000951363 0.0240155240
0.1382699654 0.0046646791 0.0235758534
-0.0930893287 0.0133782534 0.0235742526
-0.1220263602 0.0150484742 0.0222926714
0.0225369963 0.0156262955 0.0197513991
-0.0931502293 0.0178427161 0.0190996635
0.1381633213 0.0178743375 0.0159285456
0.1959460335 0.0212305899 0.0117798243
-0.0353675170 0.0211989685 0.0149509423
0.0224760957 0.0200907582 0.0152768100
0.2538206228 0.0178901483 0.0143429794
0.1381633213 0.0178743375 0.0159285456
0.2827736688 0.0151038119 0.0167431970
0.2538825758 0.0134256857 0.0188175540
0.0225679728 0.0133940642 0.0219886864
-0.0352451897 0.0122700431 0.0239001132
0.1960694133 0.0123016647 0.0207289807
0.1381942978 0.0156421062 0.0181658329
-0.0932588632 0.0224126538 0.0111634657
0.0223979121 0.0224284645 0.0095779067
-0.1222255225 0.0234266933 0.0077429754
-0.0933428079 0.0240414412 0.0050564576
0.1379707426 0.0240730626 0.0018853396
0.1957781441 0.0244881649 -0.0004341919
-0.0355354065 0.0244565435 0.0027369261
0.0223559397 0.0232428582 0.0065244026
0.2536694902 0.0232744796 0.0033532847
0.1380127150 0.0232586689 0.0049388436
0.2826361495 0.0222604401 0.0067737750
0.2537534349 0.0216456921 0.0094602928
0.0224398844 0.0216140707 0.0126314107
-0.0353675170 0.0211989685 0.0149509423
0.1959460335 0.0212305899 0.0117798243
0.1380546873 0.0224442752 0.0079923477
-0.0934263777 0.0232162569 -0.0010476703
0.0222303976 0.0232320676 -0.0026332293
-0.1223927245 0.0221853199 -0.0044657605
-0.0935098224 0.0215730820 -0.0071508382
0.1378037281 0.0216047034 -0.0103219562
0.1956112545 0.0212018150 -0.0126405276
-0.0357022960 0.0211701936 -0.0094694097
0.0221886752 0.0224104801 -0.0056848133
0.2535022258 0.0224421015 -0.0088559312
0.1378454505 0.0224262908 -0.0072703722
0.2824685725 0.0234730386 -0.0054378411
0.2535856705 0.0240852765 -0.0027527634
0.0222721200 0.0240536551 0.0004183546
-0.0355354065 0.0244565435 0.0027369261
0.1957781441 0.0244881649 -0.0004341919
0.1378871729 0.0232478783 -0.0042187883
-0.0935761237 0.0178061541 -0.0120246690
0.0220806516 0.0178219648 -0.0136102279
-0.1225281842 0.0150054229 -0.0144183115
-0.0936367104 0.0133313085 -0.0164887207
0.1376768401 0.0133629299 -0.0196598386
0.1954900811 0.0122521239 -0.0215686311
-0.0358234695 0.0122205025 -0.0183975131
0.0220503582 0.0155845420 -0.0158422538
0.2533639087 0.0156161634 -0.0190133718
0.1377071335 0.0156003527 -0.0174278128
0.2823159693 0.0184168945 -0.0166197292
0.2534244955 0.0200910089 -0.0145493201
0.0221109450 0.0200593875 -0.0113782021
-0.0357022960 0.0211701936 -0.0094694097
0.1956112545 0.0212018150 -0.0126405276
0.1377677202 0.0200751982 -0.0129637611
-0.0936679789 0.0076303293 -0.0188264133
0.0219887964 0.0076461400 -0.0204119723
-0.1225956076 0.0038078201 -0.0194480900
-0.0936894747 0.0015206389 -0.0204553196
0.1376240759 0.0015522603 -0.0236264375
0.1954470896 0.0000327430 -0.0248264436
-0.0358664610 0.0000011216 -0.0216553256
0.0219780485 0.0045912948 -0.0212264254
0.2532915990 0.0046229162 -0.0243975434
0.1376348237 0.0046071055 -0.0228119844
0.2822192277 0.0084454254 -0.0237758667
0.2533130948 0.0107326067 -0.0227686371
0.0219995442 0.0107009853 -0.0195975192
-0.0358234695 0.0122205025 -0.0183975131
0.1954900811 0.0122521239 -0.0215686311
0.1376455716 0.0076619507 -0.0219975313
-0.0936890060 -0.0015327311 -0.0204515833
-0.1225944364 -0.0038256050 -0.0194387757
0.0219794544 -0.0045688153 -0.0212152167
-0.0936656365 -0.0076365209 -0.0188077848
0.1376479148 -0.0076048995 -0.0219788501
0.1954938297 -0.0121748364 -0.0215387675
-0.0358197215 -0.0122064579 -0.0183677022
0.0220028239 -0.0106726051 -0.0195714182
0.2533046900 -0.0075890888 -0.0235644091
0.1376479148 -0.0076048995 -0.0219788501
0.2822042774 -0.0037702675 -0.0249882058
0.2532813198 -0.0014852990 -0.0252082603
0.0219677692 -0.0015169204 -0.0220371423
-0.0358664610 0.0000011216 -0.0216553256
0.1954470896 0.0000327430 -0.0248264436
0.1376362296 -0.0045530046 -0.0228007757
-0.0936016400 -0.0155622361 -0.0142186634
0.0220551353 -0.0155464254 -0.0158042224
-0.1224771091 -0.0183560828 -0.0110253691
-0.0935396805 -0.0200260665 -0.0097436160
0.1377738700 -0.0199944451 -0.0129147340
0.1956177475 -0.0211024973 -0.0125887517
-0.0356958030 -0.0211341187 -0.0094176337
0.0220861150 -0.0177783406 -0.0135666987
0.2534306453 -0.0199786344 -0.0145002930
0.2823216047 -0.0183007453 -0.0165747992
0.1377428903 -0.0177625299 -0.0151522577
0.2533686866 -0.0155148039 -0.0189752878
0.0220551353 -0.0155464254 -0.0158042224
-0.0358197215 -0.0122064579 -0.0183677022
0.1954938297 -0.0121748364 -0.0215387675
0.1376809316 -0.0132986994 -0.0196272525
-0.0934612306 -0.0223631409 -0.0040444803
0.0221955447 -0.0223473302 -0.0056300393
-0.1223229577 -0.0233846909 0.0001688876
-0.0933772838 -0.0239912966 0.0020626848
0.1379362667 -0.0239596752 -0.0011084332
0.1957856410 -0.0243588088 -0.0003744214
-0.0355279095 -0.0243904302 0.0027966966
0.0222375181 -0.0231614081 -0.0025764567
0.2535510686 -0.0231297867 -0.0057475747
0.1378942933 -0.0231455974 -0.0041620157
0.2824127957 -0.0221082366 -0.0099609427
0.2534671218 -0.0215016309 -0.0118547399
0.0221535713 -0.0215332523 -0.0086836219
-0.0356958030 -0.0211341187 -0.0094176337
0.1956177475 -0.0211024973 -0.0125887517
0.1378523199 -0.0223315195 -0.0072155983
-0.0932937152 -0.0231655203 0.0081667330
0.0223630600 -0.0231497096 0.0065811740
-0.1221557575 -0.0221421270 0.0123775035
-0.0932102727 -0.0215217667 0.0142697422
0.1381032778 -0.0214901453 0.0110986243
0.1959525261 -0.0210713015 0.0118315971
-0.0353610245 -0.0211029229 0.0150027150
0.0224047813 -0.0223278328 0.0096326786
0.2537183318 -0.0222962114 0.0064615607
0.1380615566 -0.0223120221 0.0080471196
0.2825803741 -0.0233196048 0.0022507901
0.2536348893 -0.0239399650 0.0003585514
0.0223213388 -0.0239715864 0.0035296694
-0.0355279095 -0.0243904302 0.0027966966
0.1957856410 -0.0243588088 -0.0003744214
0.1380198353 -0.0231338989 0.0049956150
-0.0931445026 -0.0177544972 0.0191432245
0.0225425631 -0.0155011325 0.0197894807
-0.1220216227 -0.0149615075 0.0223293941
-0.0930849742 -0.0132793893 0.0236068693
0.1382296288 -0.0132477677 0.0204357369
0.1960731617 -0.0121210853 0.0207588651
-0.0352414413 -0.0121527069 0.0239299975
0.0225425631 -0.0155011325 0.0197894807
0.2538566399 -0.0154695110 0.0166183556
0.1381998646 -0.0154853217 0.0182039145
0.2827329706 -0.0182625009 0.0134321968
0.2537960589 -0.0199446191 0.0121547252
0.0224825084 -0.0199762405 0.0153258431
-0.0353610245 -0.0211029229 0.0150027150
0.1959525261 -0.0210713015 0.0118315971
0.1381695741 -0.0177228758 0.0159720993
-0.0930539760 -0.0075795292 0.0259440277
0.0226033255 -0.0075637184 0.0243584615
-0.1219548714 -0.0037659126 0.0273581251
-0.0930324880 -0.0014714184 0.0275723571
0.1382821150 -0.0014397968 0.0244012247
0.1961161378 0.0000951363 0.0240155240
-0.0351984652 0.0000635147 0.0271866564
0.0226140695 -0.0045096630 0.0251726262
0.2539286725 -0.0044780414 0.0220014938
0.1382713710 -0.0044938522 0.0235870600
0.2828295679 -0.0082916580 0.0205873963
0.2539071845 -0.0105861523 0.0203731643
0.0225925815 -0.0106177738 0.0235442967
-0.0352414413 -0.0121527069 0.0239299975
0.1960731617 -0.0121210853 0.0207588651
0.1382606270 -0.0075479076 0.0227728953
-0.2013582648 -0.0134415021 -0.0060077905
-0.1764173803 -0.0128318853 -0.0113949274
-0.2014202235 -0.0089776717 -0.0104827853
-0.2012463274 -0.0171620292 0.0021970395
-0.1762994529 -0.0191559793 -0.0028175176
-0.2013302742 -0.0155338735 -0.0039101257
-0.2011235349 -0.0162818190 0.0111627779
-0.1761541098 -0.0203440299 0.0077725167
-0.2012069774 -0.0179255726 0.0050597687
-0.2010248931 -0.0110361357 0.0184871819
-0.1760213464 -0.0160774347 0.0175377279
-0.2010844216 -0.0155112437 0.0140235370
-0.2009750077 -0.0028301206 0.0222078477
-0.1759368752 -0.0074993191 0.0238617057
-0.2009964957 -0.0089382314 0.0205795182
-0.2009882968 0.0061360903 0.0213278953
-0.1759220317 0.0030918972 0.0250500589
-0.2009649345 0.0000328261 0.0229711669
-0.2010601484 0.0134614746 0.0160830193
-0.1759813198 0.0128578535 0.0207843493
-0.2009992479 0.0089970119 0.0205576084
-0.2011731342 0.0171831598 0.0078785180
-0.1760987132 0.0191831588 0.0122075096
-0.2010891895 0.0155543723 0.0139855261
-0.2012959282 0.0163030020 -0.0010873258
-0.1762440549 0.0203718674 0.0016175796
-0.2012124834 0.0179461769 0.0050158421
-0.2013956290 0.0110581074 -0.0084121900
-0.1763773501 0.0161062451 -0.0081480203
-0.2013350423 0.0155329529 -0.0039481383
-0.2014444727 0.0028510388 -0.0121336582
-0.1764623587 0.0075278653 -0.0144728062
-0.2014229769 0.0089607293 -0.0105047519
-0.2014435938 -0.0028738820 -0.0121266365
-0.2014202235 -0.0089776717 -0.0104827853
-0.1764600448 -0.0075480752 -0.0144543504
-0.2509289030 -0.0720383759 -0.0075873513
-0.2507451294 -0.0913199059 0.0055487452
-0.2508818265 -0.0263692266 -0.0034292595
-0.2507963531 -0.0395423684 0.0025781527
-0.2505379052 -0.0263339923 0.0216580351
-0.2506233785 -0.0131608504 0.0156506229
-0.2508937314 0.0263561338 -0.0035031442
-0.2506370840 0.0132010829 0.0150481360
-0.2505498044 0.0263912634 0.0215845715
-0.2508219637 0.0395449253 0.0019017811
-0.2505606029 0.0720516800 0.0215209487
-0.2507883337 0.0913272856 0.0052935625
-0.2558469305 0.0720097279 -0.0077222064
-0.2556717968 0.0913262496 0.0053605113
-0.2557782471 0.0263552556 -0.0034361812
-0.2556992496 0.0395446362 0.0025345065
-0.2554343200 0.0263898589 0.0216515351
-0.2555133174 0.0132004782 0.0156808474
-0.2557658159 -0.0263698942 -0.0033623040
-0.2555148578 -0.0131630543 0.0151520312
-0.2554218945 -0.0263351862 0.0217249912
-0.2556883587 -0.0395440461 0.0020795676
-0.2554110956 -0.0719982342 0.0217886175
-0.2556285926 -0.0913210998 0.0056156941
-0.4521323756 -0.0219480686 -0.0005349922
-0.4653507301 -0.0438658525 -0.0013129789
-0.4054666708 -0.0313342507 -0.0015858260
-0.4210219057 -0.0282055234 -0.0012355481
-0.4832428455 -0.0156906138 0.0001655636
-0.4809059650 -0.0407371251 -0.0009627010
-0.4521323756 -0.0219480686 -0.0005349922
-0.4832428455 -0.0156906138 0.0001655636
-0.3455826115 -0.0188026490 -0.0018586731
-0.3611378465 -0.0156739217 -0.0015083952
-0.2856985523 -0.0062710473 -0.0021315202
-0.3467510518 -0.0062793934 -0.0012945408
-0.4078035513 -0.0062877395 -0.0004575614
-0.4688560508 -0.0062960856 0.0003794180
-0.4078035513 -0.0062877395 -0.0004575614
-0.3922483164 -0.0094164669 -0.0008078393
-0.3006765371 -0.0291774336 -0.0028840786
-0.2856985523 -0.0062710473 -0.0021315202
-0.3455826115 -0.0188026490 -0.0018586731
-0.3306139200 -0.0222609105 -0.0022004750
-0.2707391541 -0.0360939566 -0.0035676823
-0.2707298608 -0.0097293088 -0.0024733221
-0.3006765371 -0.0291774336 -0.0028840786
-0.2707391541 -0.0360939566 -0.0035676823
-0.4054666708 -0.0313342507 -0.0015858260
-0.3904979793 -0.0347925123 -0.0019276278
-0.4653507301 -0.0438658525 -0.0013129789
-0.4054713174 -0.0445165746 -0.0021330061
-0.3455919048 -0.0451672968 -0.0029530334
-0.2857124922 -0.0458180190 -0.0037730606
-0.3455919048 -0.0451672968 -0.0029530334
-0.3605605963 -0.0417090353 -0.0026112315
-0.4835436828 0.0157798641 0.0001253661
-0.4530228641 0.0223741626 -0.0005851830
-0.4812188254 0.0408225553 -0.0010733004
-0.4835436828 0.0157798641 0.0001253661
-0.4225020455 0.0289684612 -0.0012957321
-0.4072416361 0.0322656105 -0.0016510066
-0.4659584161 0.0441197046 -0.0014285749
-0.4530228641 0.0223741626 -0.0005851830
-0.3614604082 0.0421570583 -0.0027168302
-0.3461999989 0.0454542076 -0.0030721047
-0.2863207902 0.0461214591 -0.0038938696
-0.3461999989 0.0454542076 -0.0030721047
-0.4060792075 0.0447869561 -0.0022503398
-0.4659584161 0.0441197046 -0.0014285749
-0.3919812268 0.0355627597 -0.0020062811
-0.4072416361 0.0322656105 -0.0016510066
-0.3015649062 0.0230539333 -0.0026624170
-0.2863207902 0.0461214591 -0.0038938696
-0.3473624275 0.0329328620 -0.0024727715
-0.3320965871 0.0296398857 -0.0025359866
-0.2710332253 0.0164679808 -0.0027888473
-0.2710549498 0.0428284828 -0.0039570848
-0.3015649062 0.0230539333 -0.0026624170
-0.2710332253 0.0164679808 -0.0027888473
-0.4084040648 0.0197442648 -0.0010516733
-0.3931382244 0.0164512886 -0.0011148885
-0.4694457021 0.0065556677 0.0003694248
-0.4083932026 0.0065640138 -0.0004675546
-0.3473407030 0.0065723599 -0.0013045340
-0.2862882035 0.0065807060 -0.0021415134
-0.3473407030 0.0065723599 -0.0013045340
-0.3626065435 0.0098653361 -0.0012413189
-0.4521826524 0.0218754698 -0.0034966270
-0.4654094348 0.0437863081 -0.0041835879
-0.4055277334 0.0312722918 -0.0050317451
-0.4210793731 0.0281400178 -0.0045200391
-0.4832859317 0.0156109217 -0.0024732149
-0.4809610745 0.0406540340 -0.0036718819
-0.4521826524 0.0218754698 -0.0034966270
-0.4832859317 0.0156109217 -0.0024732149
-0.3456460320 0.0187582755 -0.0058799024
-0.3611976716 0.0156260015 -0.0053681963
-0.2857643306 0.0062442593 -0.0067280596
-0.3468084606 0.0062367194 -0.0052805688
-0.4078525906 0.0062291795 -0.0038330781
-0.4688967207 0.0062216396 -0.0023855874
-0.4078525906 0.0062291795 -0.0038330781
-0.3923009510 0.0093614535 -0.0043447842
-0.3007510493 0.0291433372 -0.0073921986
-0.2857643306 0.0062442593 -0.0067280596
-0.3456460320 0.0187582755 -0.0058799024
-0.3306810378 0.0222199628 -0.0063840011
-0.2708210609 0.0360667117 -0.0084003961
-0.2707993364 0.0097059465 -0.0072321583
-0.3007510493 0.0291433372 -0.0073921986
-0.2708210609 0.0360667117 -0.0084003961
-0.4055277334 0.0312722918 -0.0050317451
-0.3905627392 0.0347339790 -0.0055358439
-0.4654094348 0.0437863081 -0.0041835879
-0.4055385956 0.0444526744 -0.0056158640
-0.3456677565 0.0451190407 -0.0070481401
-0.2857969174 0.0457854070 -0.0084804162
-0.3456677565 0.0451190407 -0.0070481401
-0.3606327507 0.0416573535 -0.0065440414
-0.4835716889 -0.0158595311 -0.0024249757
-0.4530519473 -0.0224467915 -0.0034223113
-0.4812348085 -0.0409055160 -0.0035532410
-0.4835716889 -0.0158595311 -0.0024249757
-0.4225322056 -0.0290340520 -0.0044196469
-0.4072723348 -0.0323276822 -0.0049183147
-0.4659749377 -0.0441991463 -0.0040519088
-0.4530519473 -0.0224467915 -0.0034223113
-0.3614927223 -0.0422085728 -0.0064143181
-0.3462328514 -0.0455022030 -0.0069129859
-0.2863618083 -0.0461537314 -0.0083435244
-0.3462328514 -0.0455022030 -0.0069129859
-0.4061038945 -0.0448506746 -0.0054824473
-0.4659749377 -0.0441991463 -0.0040519088
-0.3920124639 -0.0356213124 -0.0054169825
-0.4072723348 -0.0323276822 -0.0049183147
-0.2710972908 -0.0362653009 -0.0082950118
-0.3016170325 -0.0296780404 -0.0072976762
-0.2710879974 -0.0099011794 -0.0072006508
-0.2710972908 -0.0362653009 -0.0082950118
-0.3321367741 -0.0230907800 -0.0063003406
-0.3473966450 -0.0197971498 -0.0058016728
-0.2863478682 -0.0066075492 -0.0067019830
-0.3016170325 -0.0296780404 -0.0072976762
-0.3931762575 -0.0099162592 -0.0043056694
-0.4084361283 -0.0066226290 -0.0038070016
-0.4694802583 -0.0066301688 -0.0023595109
-0.4084361283 -0.0066226290 -0.0038070016
-0.3473919983 -0.0066150891 -0.0052544923
-0.2863478682 -0.0066075492 -0.0067019830
-0.3626565158 -0.0165035196 -0.0053030050
-0.3473966450 -0.0197971498 -0.0058016728
3 120 676 20
3 438 676 120
3 438 677 24
3 120 677 438
3 24 678 439
3 39 678 24
3 439 679 20
3 39 679 439
3 19 680 440
3 20 680 19
3 440 681 39
3 20 681 440
3 54 682 39
3 441 682 54
3 441 683 19
3 54 683 441
3 17 684 442
3 19 684 17
3 442 685 54
3 19 685 442
3 54 686 443
3 53 686 54
3 443 687 17
3 53 687 443
3 17 688 21
3 444 688 17
3 444 689 53
3 17 689 444
3 57 690 53
3 445 690 57
3 445 691 21
3 57 691 445
3 21 692 18
3 446 692 21
3 446 693 57
3 21 693 446
3 57 694 447
3 50 694 57
3 447 695 18
3 50 695 447
3 126 696 448
3 18 696 126
3 448 697 50
3 18 697 448
3 50 698 449
3 32 698 50
3 449 699 126
3 32 699 449
3 126 700 123
3 450 700 126
3 450 701 32
3 126 701 450
3 32 702 451
3 5 702 32
3 451 703 123
3 5 703 451
3 123 704 125
3 452 704 123
3 452 705 5
3 123 705 452
3 5 706 453
3 163 706 5
3 453 707 125
3 163 707 453
3 125 708 124
3 454 708 125
3 454 709 163
3 125 709 454
3 164 710 163
3 455 710 164
3 455 711 124
3 164 711 455
3 121 712 456
3 124 712 121
3 456 713 164
3 124 713 456
3 164 714 457
3 155 714 164
3 457 715 121
3 155 715 457
3 122 716 458
3 121 716 122
3 458 717 155
3 121 717 458
3 173 718 155
3 459 718 173
3 459 719 122
3 173 719 459
3 120 720 460
3 122 720 120
3 460 721 173
3 122 721 460
3 173 722 461
3 24 722 173
3 461 723 120
3 24 723 461
3 29 724 133
3 55 724 29
3 133 725 29
3 139 725 133
3 55 726 14
3 145 726 55
3 14 727 55
3 133 727 14
3 145 728 45
3 36 728 145
3 14 729 45
3 145 729 14
3 144 730 36
3 59 730 144
3 45 731 59
3 36 731 45
3 0 732 144
3 92 732 0
3 59 733 92
3 144 733 59
3 130 734 0
3 138 734 130
3 92 735 138
3 0 735 92
3 462 736 178
3 29 736 462
3 462 737 130
3 178 737 462
3 463 738 178
3 139 738 463
3 463 739 29
3 178 739 463
3 464 740 179
3 138 740 464
3 464 741 139
3 179 741 464
3 465 742 179
3 130 742 465
3 465 743 138
3 179 743 465
3 168 113 55
3 29 168 55
3 113 26 145
3 55 113 145
3 26 25 36
3 145 26 36
3 25 72 144
3 36 25 144
3 72 119 0
3 144 72 0
3 119 128 130
3 0 119 130
3 180 466 168
3 128 466 180
3 180 467 29
3 168 467 180
3 181 468 130
3 29 468 181
3 181 469 128
3 130 469 181
3 131 71 113
3 168 131 113
3 62 744 71
3 26 744 62
3 113 71 26
3 154 745 62
3 25 745 154
3 26 746 25
3 62 746 26
3 37 747 154
3 72 747 37
3 25 748 72
3 154 748 25
3 37 177 119
3 72 37 119
3 177 35 128
3 119 177 128
3 182 470 131
3 35 470 182
3 182 471 168
3 131 471 182
3 183 472 128
3 168 472 183
3 183 473 35
3 128 473 183
3 131 78 71
3 78 90 62
3 71 78 62
3 90 87 154
3 62 90 154
3 87 56 37
3 154 87 37
3 56 10 177
3 37 56 177
3 177 10 35
3 131 132 78
3 132 33 90
3 78 132 90
3 33 88 87
3 90 33 87
3 88 169 56
3 87 88 56
3 169 170 10
3 56 169 10
3 10 170 35
3 132 131 34
3 33 132 34
3 88 33 34
3 169 88 34
3 170 169 34
3 35 170 34
3 131 35 34
3 112 749 60
3 139 749 112
3 12 750 139
3 60 750 12
3 60 751 28
3 12 751 60
3 111 752 12
3 28 752 111
3 28 753 81
3 111 753 28
3 91 754 111
3 81 754 91
3 158 755 91
3 81 755 158
3 63 756 91
3 158 756 63
3 86 757 63
3 158 757 86
3 63 758 86
3 49 758 63
3 13 759 49
3 86 759 13
3 49 760 13
3 138 760 49
3 474 761 184
3 13 761 474
3 474 762 112
3 184 762 474
3 475 763 184
3 138 763 475
3 475 764 13
3 184 764 475
3 476 765 185
3 139 765 476
3 476 766 138
3 185 766 476
3 477 767 185
3 112 767 477
3 477 768 139
3 185 768 477
3 48 150 112
3 60 48 112
3 89 48 60
3 28 89 60
3 96 89 28
3 81 96 28
3 47 96 81
3 158 47 81
3 162 47 158
3 86 162 158
3 16 162 86
3 13 16 86
3 186 478 16
3 150 478 186
3 186 479 13
3 16 479 186
3 187 480 112
3 13 480 187
3 187 481 150
3 112 481 187
3 41 15 150
3 48 41 150
3 74 41 48
3 89 74 48
3 74 769 165
3 89 769 74
3 96 770 89
3 165 770 96
3 165 771 127
3 96 771 165
3 47 772 96
3 127 772 47
3 127 773 149
3 47 773 127
3 162 149 47
3 65 149 162
3 16 65 162
3 188 482 65
3 15 482 188
3 188 483 16
3 65 483 188
3 189 484 150
3 16 484 189
3 189 485 15
3 150 485 189
3 41 77 15
3 46 77 41
3 74 46 41
3 31 46 74
3 165 31 74
3 42 31 165
3 127 42 165
3 114 42 127
3 149 114 127
3 65 114 149
3 77 161 15
3 85 161 77
3 46 85 77
3 27 85 46
3 31 27 46
3 156 27 31
3 42 156 31
3 115 156 42
3 114 115 42
3 65 115 114
3 64 15 161
3 64 161 85
3 64 85 27
3 64 27 156
3 64 156 115
3 64 115 65
3 64 65 15
3 137 151 92
3 92 774 137
3 138 774 92
3 151 66 59
3 92 151 59
3 66 159 45
3 59 66 45
3 159 134 14
3 45 159 14
3 134 108 133
3 14 134 133
3 94 775 108
3 139 775 94
3 133 776 139
3 108 776 133
3 94 172 12
3 12 777 94
3 139 777 12
3 172 166 111
3 12 172 111
3 166 174 91
3 111 166 91
3 174 104 63
3 91 174 63
3 104 98 49
3 63 104 49
3 137 778 98
3 138 778 137
3 49 779 138
3 98 779 49
3 486 780 191
3 93 780 486
3 191 781 486
3 190 781 191
3 93 782 487
3 171 782 93
3 487 783 191
3 171 783 487
3 190 784 488
3 192 784 190
3 488 785 172
3 192 785 488
3 489 786 192
3 171 786 489
3 192 787 489
3 190 787 192
3 490 788 194
3 172 788 490
3 194 789 490
3 193 789 194
3 172 790 491
3 94 790 172
3 491 791 194
3 94 791 491
3 193 792 492
3 195 792 193
3 492 793 93
3 195 793 492
3 493 794 195
3 94 794 493
3 195 795 493
3 193 795 195
3 494 796 171
3 197 796 494
3 167 797 171
3 494 797 167
3 495 798 197
3 196 798 495
3 495 799 167
3 197 799 495
3 198 800 196
3 496 800 198
3 496 801 166
3 198 801 496
3 497 802 198
3 167 802 497
3 196 803 198
3 497 803 196
3 498 804 200
3 166 804 498
3 200 805 498
3 199 805 200
3 166 806 499
3 172 806 166
3 499 807 200
3 172 807 499
3 199 808 500
3 201 808 199
3 500 809 171
3 201 809 500
3 501 810 201
3 172 810 501
3 201 811 501
3 199 811 201
3 502 812 203
3 167 812 502
3 203 813 502
3 202 813 203
3 167 814 503
3 175 814 167
3 503 815 203
3 175 815 503
3 202 816 504
3 204 816 202
3 504 817 174
3 204 817 504
3 505 818 204
3 175 818 505
3 204 819 505
3 202 819 204
3 506 820 206
3 174 820 506
3 206 821 506
3 205 821 206
3 174 822 507
3 166 822 174
3 507 823 206
3 166 823 507
3 205 824 508
3 207 824 205
3 508 825 167
3 207 825 508
3 509 826 207
3 166 826 509
3 207 827 509
3 205 827 207
3 510 828 209
3 175 828 510
3 209 829 510
3 208 829 209
3 175 830 511
3 105 830 175
3 511 831 209
3 105 831 511
3 208 832 512
3 210 832 208
3 512 833 104
3 210 833 512
3 513 834 210
3 105 834 513
3 210 835 513
3 208 835 210
3 514 836 212
3 104 836 514
3 212 837 514
3 211 837 212
3 104 838 515
3 174 838 104
3 515 839 212
3 174 839 515
3 211 840 516
3 213 840 211
3 516 841 175
3 213 841 516
3 517 842 213
3 174 842 517
3 213 843 517
3 211 843 213
3 518 844 215
3 105 844 518
3 215 845 518
3 214 845 215
3 105 846 519
3 99 846 105
3 519 847 215
3 99 847 519
3 214 848 520
3 216 848 214
3 520 849 98
3 216 849 520
3 521 850 216
3 99 850 521
3 216 851 521
3 214 851 216
3 522 852 218
3 98 852 522
3 218 853 522
3 217 853 218
3 98 854 523
3 104 854 98
3 523 855 218
3 104 855 523
3 217 856 524
3 219 856 217
3 524 857 105
3 219 857 524
3 525 858 219
3 104 858 525
3 217 859 219
3 525 859 217
3 526 860 221
3 99 860 526
3 221 861 526
3 220 861 221
3 99 862 527
3 141 862 99
3 527 863 221
3 141 863 527
3 220 864 528
3 222 864 220
3 528 865 137
3 222 865 528
3 529 866 222
3 141 866 529
3 222 867 529
3 220 867 222
3 530 868 224
3 137 868 530
3 224 869 530
3 223 869 224
3 137 870 531
3 98 870 137
3 531 871 224
3 98 871 531
3 223 872 532
3 225 872 223
3 532 873 99
3 225 873 532
3 533 874 225
3 98 874 533
3 225 875 533
3 223 875 225
3 534 876 141
3 227 876 534
3 153 877 141
3 534 877 153
3 535 878 227
3 226 878 535
3 535 879 153
3 227 879 535
3 228 880 226
3 536 880 228
3 536 881 151
3 228 881 536
3 537 882 228
3 153 882 537
3 226 883 228
3 537 883 226
3 538 884 230
3 151 884 538
3 230 885 538
3 229 885 230
3 151 886 539
3 137 886 151
3 539 887 230
3 137 887 539
3 229 888 540
3 231 888 229
3 540 889 141
3 231 889 540
3 541 890 231
3 137 890 541
3 231 891 541
3 229 891 231
3 542 892 233
3 153 892 542
3 233 893 542
3 232 893 233
3 153 894 543
3 67 894 153
3 543 895 233
3 67 895 543
3 232 896 544
3 234 896 232
3 544 897 66
3 234 897 544
3 545 898 234
3 67 898 545
3 234 899 545
3 232 899 234
3 546 900 66
3 236 900 546
3 151 901 66
3 546 901 151
3 547 902 236
3 235 902 547
3 547 903 151
3 236 903 547
3 237 904 235
3 548 904 237
3 548 905 153
3 237 905 548
3 549 906 237
3 151 906 549
3 235 907 237
3 549 907 235
3 550 908 239
3 67 908 550
3 239 909 550
3 238 909 239
3 67 910 551
3 160 910 67
3 551 911 239
3 160 911 551
3 238 912 552
3 240 912 238
3 552 913 159
3 240 913 552
3 553 914 240
3 160 914 553
3 240 915 553
3 238 915 240
3 554 916 242
3 159 916 554
3 242 917 554
3 241 917 242
3 159 918 555
3 66 918 159
3 555 919 242
3 66 919 555
3 241 920 556
3 243 920 241
3 556 921 67
3 243 921 556
3 557 922 243
3 66 922 557
3 243 923 557
3 241 923 243
3 558 924 245
3 160 924 558
3 245 925 558
3 244 925 245
3 160 926 559
3 135 926 160
3 559 927 245
3 135 927 559
3 244 928 560
3 246 928 244
3 560 929 134
3 246 929 560
3 561 930 246
3 135 930 561
3 246 931 561
3 244 931 246
3 562 932 248
3 134 932 562
3 248 933 562
3 247 933 248
3 134 934 563
3 159 934 134
3 563 935 248
3 159 935 563
3 247 936 564
3 249 936 247
3 564 937 160
3 249 937 564
3 565 938 249
3 159 938 565
3 249 939 565
3 247 939 249
3 566 940 251
3 135 940 566
3 566 941 250
3 251 941 566
3 135 942 567
3 107 942 135
3 567 943 251
3 107 943 567
3 250 944 568
3 252 944 250
3 568 945 108
3 252 945 568
3 569 946 252
3 107 946 569
3 252 947 569
3 250 947 252
3 570 948 254
3 108 948 570
3 254 949 570
3 253 949 254
3 108 950 571
3 134 950 108
3 571 951 254
3 134 951 571
3 253 952 572
3 255 952 253
3 572 953 135
3 255 953 572
3 573 954 255
3 134 954 573
3 255 955 573
3 253 955 255
3 574 956 257
3 107 956 574
3 257 957 574
3 256 957 257
3 107 958 575
3 93 958 107
3 575 959 257
3 93 959 575
3 256 960 576
3 258 960 256
3 576 961 94
3 258 961 576
3 577 962 258
3 93 962 577
3 258 963 577
3 256 963 258
3 578 964 260
3 94 964 578
3 260 965 578
3 259 965 260
3 94 966 579
3 108 966 94
3 579 967 260
3 108 967 579
3 259 968 580
3 261 968 259
3 580 969 107
3 261 969 580
3 581 970 261
3 108 970 581
3 261 971 581
3 259 971 261
3 22 972 11
3 67 972 22
3 67 973 582
3 152 973 67
3 582 974 11
3 152 974 582
3 109 975 22
3 160 975 109
3 160 976 583
3 67 976 160
3 583 977 22
3 67 977 583
3 82 978 109
3 135 978 82
3 135 979 584
3 160 979 135
3 584 980 109
3 160 980 584
3 70 981 82
3 107 981 70
3 107 982 585
3 135 982 107
3 585 983 82
3 135 983 585
3 38 984 70
3 93 984 38
3 93 985 586
3 107 985 93
3 586 986 70
3 107 986 586
3 176 987 38
3 171 987 176
3 171 988 587
3 93 988 171
3 587 989 38
3 93 989 587
3 84 990 176
3 167 990 84
3 167 991 588
3 171 991 167
3 588 992 176
3 171 992 588
3 61 993 84
3 175 993 61
3 175 994 589
3 167 994 175
3 589 995 84
3 167 995 589
3 23 996 61
3 105 996 23
3 105 997 590
3 175 997 105
3 590 998 61
3 175 998 590
3 136 999 23
3 99 999 136
3 99 1000 591
3 105 1000 99
3 591 1001 23
3 105 1001 591
3 140 1002 136
3 141 1002 140
3 141 1003 592
3 99 1003 141
3 592 1004 136
3 99 1004 592
3 22 11 142
3 109 22 142
3 82 109 142
3 70 82 142
3 38 70 142
3 176 38 142
3 84 176 142
3 61 84 142
3 23 61 142
3 136 23 142
3 140 136 142
3 11 140 142
3 140 1005 141
3 11 1005 140
3 593 1006 152
3 11 1006 593
3 141 1007 152
3 593 1007 141
3 594 1008 4
3 100 1008 594
3 594 1009 146
3 4 1009 594
3 147 595 146
3 100 595 147
3 596 1010 100
3 8 1010 596
3 147 1011 100
3 596 1011 147
3 597 1012 43
3 147 1012 597
3 8 1013 43
3 597 1013 8
3 598 1014 8
3 30 1014 598
3 8 1015 598
3 43 1015 8
3 599 1016 73
3 43 1016 599
3 73 1017 599
3 30 1017 73
3 30 600 95
3 73 600 30
3 601 1018 106
3 73 1018 601
3 601 1019 95
3 106 1019 601
3 118 95 106
3 143 118 106
3 602 1020 118
3 52 1020 602
3 602 1021 143
3 118 1021 602
3 97 603 143
3 52 603 97
3 604 1022 52
3 6 1022 604
3 97 1023 52
3 604 1023 97
3 605 1024 110
3 97 1024 605
3 6 1025 110
3 605 1025 6
3 606 1026 6
3 102 1026 606
3 6 1027 606
3 110 1027 6
3 607 1028 148
3 110 1028 607
3 148 1029 607
3 102 1029 148
3 102 608 2
3 148 608 102
3 609 1030 40
3 148 1030 609
3 609 1031 2
3 40 1031 609
3 4 2 40
3 146 4 40
3 40 148 147
3 146 40 147
3 148 110 43
3 147 148 43
3 110 97 73
3 43 110 73
3 97 143 106
3 73 97 106
3 101 3 4
3 100 101 4
3 9 101 100
3 8 9 100
3 51 9 8
3 30 51 8
3 117 51 30
3 95 117 30
3 157 117 95
3 118 157 95
3 83 157 118
3 52 83 118
3 68 83 52
3 6 68 52
3 103 68 6
3 102 103 6
3 1 103 102
3 2 1 102
3 3 1 2
3 4 3 2
3 1 3 101
3 103 1 101
3 103 101 9
3 68 103 9
3 68 9 51
3 83 68 51
3 83 51 117
3 157 83 117
3 264 610 262
3 75 610 264
3 263 611 262
3 264 611 263
3 265 612 263
3 102 612 265
3 263 613 265
3 262 613 263
3 267 614 266
3 75 614 267
3 267 615 262
3 266 615 267
3 75 616 268
3 79 616 75
3 268 617 266
3 79 617 268
3 271 618 270
3 102 618 271
3 271 619 269
3 270 619 271
3 272 620 2
3 102 620 272
3 272 621 270
3 2 621 272
3 269 622 274
3 273 622 269
3 274 623 75
3 273 623 274
3 275 624 273
3 2 624 275
3 273 625 275
3 269 625 273
3 278 1032 277
3 279 1032 278
3 279 1033 79
3 278 1033 279
3 280 1034 278
3 276 1034 280
3 277 1035 278
3 280 1035 277
3 282 1036 281
3 7 1036 282
3 282 1037 79
3 281 1037 282
3 283 1038 281
3 277 1038 283
3 283 1039 7
3 281 1039 283
3 286 1040 276
3 285 1040 286
3 284 1041 276
3 286 1041 284
3 287 1042 285
3 6 1042 287
3 287 1043 284
3 285 1043 287
3 289 1044 288
3 284 1044 289
3 289 1045 7
3 288 1045 289
3 290 1046 284
3 288 1046 290
3 276 1047 284
3 290 1047 276
3 293 1048 292
3 294 1048 293
3 294 1049 6
3 293 1049 294
3 295 1050 293
3 291 1050 295
3 292 1051 293
3 295 1051 292
3 297 1052 296
3 102 1052 297
3 297 1053 6
3 296 1053 297
3 298 1054 296
3 292 1054 298
3 298 1055 102
3 296 1055 298
3 301 1056 291
3 300 1056 301
3 299 1057 291
3 301 1057 299
3 302 1058 300
3 79 1058 302
3 302 1059 299
3 300 1059 302
3 304 1060 303
3 299 1060 304
3 304 1061 102
3 303 1061 304
3 305 1062 299
3 303 1062 305
3 291 1063 299
3 305 1063 291
3 309 1064 308
3 7 1064 309
3 309 1065 307
3 308 1065 309
3 310 1066 308
3 116 1066 310
3 310 1067 7
3 308 1067 310
3 307 1068 312
3 311 1068 307
3 312 1069 306
3 311 1069 312
3 313 1070 311
3 116 1070 313
3 311 1071 313
3 307 1071 311
3 306 1072 316
3 314 1072 306
3 316 1073 315
3 314 1073 316
3 317 1074 315
3 52 1074 317
3 317 1075 314
3 315 1075 317
3 319 1076 318
3 314 1076 319
3 319 1077 116
3 318 1077 319
3 314 1078 320
3 306 1078 314
3 320 1079 318
3 306 1079 320
3 323 1080 322
3 324 1080 323
3 324 1081 52
3 323 1081 324
3 325 1082 323
3 321 1082 325
3 322 1083 323
3 325 1083 322
3 327 1084 326
3 6 1084 327
3 327 1085 52
3 326 1085 327
3 328 1086 326
3 322 1086 328
3 328 1087 6
3 326 1087 328
3 331 1088 321
3 330 1088 331
3 329 1089 321
3 331 1089 329
3 332 1090 330
3 7 1090 332
3 332 1091 329
3 330 1091 332
3 334 1092 333
3 329 1092 334
3 334 1093 6
3 333 1093 334
3 335 1094 329
3 333 1094 335
3 321 1095 329
3 335 1095 321
3 338 626 44
3 116 626 338
3 338 627 337
3 44 627 338
3 339 628 337
3 336 628 339
3 339 629 44
3 337 629 339
3 340 630 336
3 341 630 340
3 341 631 118
3 340 631 341
3 336 632 340
3 342 632 336
3 342 633 44
3 336 633 342
3 345 634 118
3 344 634 345
3 345 635 52
3 118 635 345
3 346 636 344
3 343 636 346
3 346 637 52
3 344 637 346
3 347 638 343
3 348 638 347
3 348 639 116
3 347 639 348
3 349 640 347
3 52 640 349
3 343 641 347
3 349 641 343
3 44 58 157
3 118 642 157
3 44 642 118
3 352 643 350
3 58 643 352
3 351 644 350
3 352 644 351
3 353 645 351
3 83 645 353
3 351 646 353
3 350 646 351
3 355 647 354
3 58 647 355
3 355 648 350
3 354 648 355
3 58 649 356
3 129 649 58
3 356 650 354
3 129 650 356
3 359 651 358
3 83 651 359
3 359 652 357
3 358 652 359
3 360 653 157
3 83 653 360
3 360 654 358
3 157 654 360
3 357 655 362
3 361 655 357
3 362 656 58
3 361 656 362
3 363 657 361
3 157 657 363
3 361 658 363
3 357 658 361
3 366 1096 365
3 367 1096 366
3 367 1097 129
3 366 1097 367
3 368 1098 366
3 364 1098 368
3 365 1099 366
3 368 1099 365
3 370 1100 369
3 69 1100 370
3 370 1101 129
3 369 1101 370
3 371 1102 369
3 365 1102 371
3 371 1103 69
3 369 1103 371
3 374 1104 364
3 373 1104 374
3 372 1105 364
3 374 1105 372
3 375 1106 373
3 68 1106 375
3 375 1107 372
3 373 1107 375
3 377 1108 376
3 372 1108 377
3 377 1109 69
3 376 1109 377
3 378 1110 372
3 376 1110 378
3 364 1111 372
3 378 1111 364
3 381 1112 380
3 382 1112 381
3 382 1113 68
3 381 1113 382
3 383 1114 381
3 379 1114 383
3 380 1115 381
3 383 1115 380
3 385 1116 384
3 83 1116 385
3 385 1117 68
3 384 1117 385
3 386 1118 384
3 380 1118 386
3 386 1119 83
3 384 1119 386
3 389 1120 379
3 388 1120 389
3 387 1121 379
3 389 1121 387
3 390 1122 388
3 129 1122 390
3 390 1123 387
3 388 1123 390
3 392 1124 391
3 387 1124 392
3 392 1125 83
3 391 1125 392
3 393 1126 387
3 391 1126 393
3 379 1127 387
3 393 1127 379
3 397 1128 396
3 69 1128 397
3 397 1129 395
3 396 1129 397
3 398 1130 396
3 80 1130 398
3 398 1131 69
3 396 1131 398
3 395 1132 400
3 399 1132 395
3 400 1133 394
3 399 1133 400
3 401 1134 399
3 80 1134 401
3 399 1135 401
3 395 1135 399
3 394 1136 404
3 402 1136 394
3 404 1137 403
3 402 1137 404
3 405 1138 403
3 103 1138 405
3 405 1139 402
3 403 1139 405
3 407 1140 406
3 402 1140 407
3 407 1141 80
3 406 1141 407
3 402 1142 408
3 394 1142 402
3 408 1143 406
3 394 1143 408
3 412 1144 411
3 103 1144 412
3 412 1145 410
3 411 1145 412
3 413 1146 411
3 68 1146 413
3 413 1147 103
3 411 1147 413
3 410 1148 415
3 414 1148 410
3 415 1149 409
3 414 1149 415
3 416 1150 414
3 68 1150 416
3 414 1151 416
3 410 1151 414
3 409 1152 419
3 417 1152 409
3 419 1153 418
3 417 1153 419
3 420 1154 418
3 69 1154 420
3 420 1155 417
3 418 1155 420
3 422 1156 421
3 417 1156 422
3 422 1157 68
3 421 1157 422
3 417 1158 423
3 409 1158 417
3 423 1159 421
3 409 1159 423
3 426 659 76
3 80 659 426
3 426 660 425
3 76 660 426
3 427 661 425
3 424 661 427
3 427 662 76
3 425 662 427
3 428 663 424
3 429 663 428
3 429 664 1
3 428 664 429
3 424 665 428
3 430 665 424
3 430 666 76
3 424 666 430
3 433 667 1
3 432 667 433
3 433 668 103
3 1 668 433
3 434 669 432
3 431 669 434
3 434 670 103
3 432 670 434
3 435 671 431
3 436 671 435
3 436 672 80
3 435 672 436
3 437 673 435
3 103 673 437
3 431 674 435
3 437 674 431
3 2 675 75
3 1 675 2
3 76 75 1
3 80 79 75
3 76 80 75
3 80 69 7
3 79 80 7
3 69 129 116
3 7 69 116
3 116 129 58
3 44 116 58