OFF
1552 2204 0
-0.4939512996 -0.3903465057 -0.1226293764
-0.4381588435 0.1732873100 -0.1081978239
-0.4589473659 -0.1746713440 -0.1077174570
-0.4472372465 0.3915541373 -0.1237088128
0.4536627837 -0.1840775938 -0.0466221947
-0.4515251593 -0.0391459385 0.0127979588
-0.4460588525 0.0466681794 -0.0476738208
0.3345879664 -0.2196993999 -0.0926338669
-0.4597299610 -0.1656704811 0.1286474076
-0.4501718107 -0.0177061072 -0.0023213260
-0.4417742145 0.4817303488 -0.1389188416
-0.4782694048 -0.1042733619 0.1334688180
-0.4771175365 -0.1046337869 -0.0777600175
-0.4689893700 0.0395731890 0.0125684030
-0.4416811986 0.1131176245 -0.1232034115
-0.4701925032 0.0181013454 -0.0024916016
-0.4920136872 -0.3362652945 0.1086415826
-0.4818391013 -0.1644211551 0.1285247107
-0.0234754360 -0.3262716153 -0.0853220456
-0.4568367079 -0.1381480772 -0.0977095906
-0.1291965544 -0.3671364829 -0.0585863242
-0.4247235666 0.3944263387 -0.1487355696
-0.4065062806 0.4551447668 -0.0866896323
-0.4437933295 0.0962794210 0.0779910634
-0.4940793095 -0.3946884957 -0.1477672926
-0.0888986677 0.3274455880 -0.0574807295
-0.4460738482 0.0554236051 0.0478727223
-0.4654124660 0.1084495101 0.1080278159
-0.4466571679 0.0359089343 -0.0577163690
0.4070075149 0.1126029632 0.0182919061
-0.4655831153 0.0866283511 -0.0981408279
-0.4764261696 -0.0764174429 0.1032559266
-0.4789361828 -0.1368755292 -0.0978322743
-0.4435885993 0.1049713452 0.1333008992
-0.4424367309 0.1046109202 -0.0779279364
-0.4577103994 0.2395147606 0.1279670430
-0.4561482297 -0.1077114475 0.1084471762
0.4832935391 -0.1751270970 -0.0101466870
-0.4669852864 0.0695672149 -0.0277055236
-0.4670401364 0.0695843777 -0.0176471748
-0.0242848783 0.2994772244 -0.1206647583
-0.4597708532 -0.4561429319 -0.0874755078
0.1967596431 0.1938089281 -0.0647888765
-0.4681582760 0.0480628253 -0.0477967126
0.4384469906 -0.1884306691 0.0078079349
-0.4294718543 0.3412057132 0.1329747877
-0.4266700329 0.3862841602 0.1127962070
0.4963898535 0.0640187186 -0.0084205687
0.2819760226 -0.2351045567 -0.0202247240
0.3887821274 -0.2126508491 0.0166723511
0.3371826571 -0.2284180159 -0.0926007091
-0.4538467881 -0.0756152426 0.0379952528
-0.4973748526 -0.4439782036 -0.0873501297
0.4534356497 0.0825884188 0.0094899863
-0.4731102059 -0.0358790470 -0.0577381285
-0.4571719830 -0.4648620216 -0.0874547215
-0.4742367392 -0.4127458361 0.0837248103
-0.4220884292 0.4417371935 -0.1135986232
-0.4063121225 0.4550861208 -0.1230166388
-0.4383796735 0.1667854234 -0.1383629323
-0.4399429200 0.1672745706 0.1483041386
-0.4970894418 -0.4418682656 -0.1124998993
-0.4221123417 0.4439349400 -0.0884547779
-0.4434788899 0.0852448007 -0.0980179288
-0.4640973883 -0.2387032786 0.1287482089
-0.4359710997 0.2338762050 0.1482121536
0.4858820167 -0.1838215425 -0.0101136043
-0.4810823282 -0.1734039194 -0.1078403255
-0.4193564743 0.4890062185 -0.0985753331
-0.4191919300 0.4889547318 -0.1287493464
0.3540080667 0.1257062587 -0.0910545776
-0.4669649319 0.0761255414 0.0376647982
0.4034015971 0.1042733488 0.0182709615
-0.4698784786 -0.3375285948 0.1087644454
-0.4771356727 -0.4818438970 -0.1374675034
-0.4963639581 -0.4114873590 0.0836019992
-0.4491359902 -0.0006283189 -0.0023448178
-0.4488343154 -0.0007227143 -0.0576657359
-0.4805218073 -0.1670180566 -0.1380231637
-0.4820850538 -0.1665289095 0.1486439071
-0.4450890458 0.0769992163 0.1031650348
-0.4414793042 0.4904074363 -0.0986983637
-0.4413147599 0.4903559497 -0.1288723771
-0.4748524412 -0.0550297638 0.0479042569
-0.4500649568 0.3640028468 0.0875585105
-0.4773828545 -0.1132833717 -0.1230117854
-0.4718366051 -0.3916241019 -0.1225066011
-0.4724824923 -0.3848554966 0.0685973247
-0.4279447273 0.3626100623 0.0876815126
-0.4950007851 -0.3856570416 0.1137407696
-0.4028958749 0.4634968678 -0.0866759320
-0.4924111417 -0.3405103760 0.1337947976
-0.0643005441 -0.3385599673 -0.1218529027
-0.0925096563 0.3191007608 -0.0574975441
-0.4946128991 -0.3835811009 0.0684744691
-0.4658859668 0.0976664182 0.0778682216
-0.4771447564 -0.4774583796 -0.0871826833
0.4410384623 -0.1971408148 0.0078410607
-0.4448891248 0.0681872504 -0.0275826746
-0.4449439747 0.0682044132 -0.0175243259
0.4680204199 0.0763129354 -0.0449326791
0.4562544852 -0.1927846603 -0.0465973363
-0.4860655830 -0.2331031201 0.1487357978
-0.4778677144 -0.4903559497 -0.0972232954
-0.4777031701 -0.4904074363 -0.1273973087
-0.4580849287 0.2352375646 0.1480892400
-0.4712225997 0.0006517386 -0.0024674442
-0.4709209249 0.0005573431 -0.0577883623
-0.4196497214 0.4803569699 -0.1387958494
-0.4531029664 -0.0692961761 -0.0273928748
-0.4531578164 -0.0692790133 -0.0173345260
0.0111962184 0.2742066057 -0.0840989553
-0.4774430034 -0.0957754643 0.0781352737
-0.4992916540 -0.4761828953 -0.0873056307
-0.4515995476 0.3425948046 0.1328517512
-0.4486682392 0.3854414261 0.0674128114
-0.4487987573 0.3876733131 0.1126731648
0.3576232024 0.1340497820 -0.0910532321
-0.0208800452 -0.3349788965 -0.0852930351
0.4716305829 0.0846536629 -0.0449230925
-0.4713150926 -0.3633238761 0.0886836853
-0.4470817582 0.4133989713 0.0824632199
0.3861933767 -0.2039522212 0.0166588855
-0.4423138286 0.4775129503 -0.0886222352
-0.4265434997 0.3840721715 0.0675357979
-0.4251277265 0.3901899309 -0.1235859178
-0.4637747599 0.1144891556 -0.1233262319
-0.0278943881 0.2911405983 -0.1206733154
0.1703509032 -0.2685027517 -0.0661995659
-0.4201725921 0.4761427103 -0.0884991571
-0.4934438230 -0.3620733798 0.0885608797
-0.4681701170 0.0568190973 0.0477498463
-0.4752359694 -0.4452492771 -0.0872272335
-0.5000000000 -0.4891130017 -0.0973461076
-0.4998354557 -0.4891644883 -0.1275201209
-0.4543291557 -0.0776619055 0.1033785490
-0.4604960251 0.1681738373 -0.1384859058
-0.4620592716 0.1686629844 0.1481811651
-0.4595733515 -0.4562168101 -0.1238231287
-0.4749546829 -0.4431390928 -0.1123770261
-0.4295863019 0.3368825686 0.1078334014
0.3072419327 0.1558432273 -0.0186943650
-0.4759561748 -0.0743700408 0.0378725617
-0.4602872761 0.1746640284 -0.1083208433
-0.4639469491 -0.2343840559 0.1488586004
-0.4356095136 0.2381272706 0.1280899306
-0.4537452680 -0.0865940164 -0.0977807004
0.3036357231 0.1475105531 -0.0186956803
-0.4583974475 -0.1682724308 -0.1379003753
-0.4599606940 -0.1677832837 0.1487666956
-0.4249620669 0.4120144970 0.0825862049
-0.4027025282 0.4634227204 -0.1230235752
-0.4569782383 -0.4649276807 -0.1237827513
-0.0617084087 -0.3472701640 -0.1218280366
-0.4687377859 0.0373065958 -0.0578391634
-0.4442170465 0.4431108187 -0.1137216384
0.2845564178 -0.2438026584 -0.0201916792
-0.4448645389 0.0747298029 0.0377876971
-0.4442450833 0.4453088116 -0.0885778160
0.2003703631 0.2021485875 -0.0647792850
-0.4728640526 -0.3869121549 0.1138636268
-0.4702754402 -0.3417654277 0.1339176491
0.4570461042 0.0909332565 0.0094913041
0.5000000000 0.0723584009 -0.0084192439
-0.4738138393 -0.0466000920 -0.0476660277
-0.4752062738 -0.0680358163 -0.0275155586
-0.4752611238 -0.0680186535 -0.0174572099
-0.4433165507 0.1070654213 0.1081506706
-0.4862062822 -0.2374498283 0.1286255064
-0.4561648816 -0.1055306901 0.1335915033
-0.4550130132 -0.1058911151 -0.0776373322
-0.1317841178 -0.3584182699 -0.0586029155
-0.4625039411 0.1381676234 -0.0982119793
-0.4671770661 0.0783942157 0.1030422046
-0.4758570086 -0.0853362570 -0.0979034258
-0.4527471788 -0.0562747192 0.0480269251
-0.4468515063 0.3958113057 -0.1488586004
-0.4510202246 -0.0371199852 -0.0576155504
-0.4782517835 -0.1064552119 0.1083244981
-0.4992663074 -0.4805733162 -0.1375903537
-0.4719438545 -0.3959476717 -0.1476444355
0.0148021591 0.2825351626 -0.0840935027
-0.4404101333 0.1368002165 -0.0980891646
-0.4620693318 0.1664855947 0.1280678844
-0.4553423580 -0.0970284219 0.0782579304
-0.4517144880 0.3382634113 0.1077103763
-0.4722588382 -0.0164850057 -0.0024438541
-0.4552831331 -0.1145517954 -0.1228891074
-0.4736182954 -0.0379058465 0.0126753650
-0.4656856072 0.1063544645 0.1331780402
-0.4645337388 0.1059940395 -0.0780507953
-0.4481171798 0.0166843399 -0.0023688030
-0.4399686924 0.1650939804 0.1281907777
0.1729416996 -0.2772180422 -0.0661746984
-0.4517055453 -0.0478462632 -0.0475433409
-0.4469057203 0.0381743117 0.0126912160
-0.4303686201 0.3141586008 0.0022520064
-0.4273570142 0.3635362498 -0.0078762582
-0.4284716580 0.3502094092 0.0499785716
-0.4277481733 0.3521742659 -0.0606669557
-0.4329890668 0.2761429357 0.0651709685
-0.4299774610 0.3255205847 0.0550427039
-0.4325979077 0.2875049196 0.1179616660
-0.4303686201 0.3141586008 0.0022520064
-0.4329890668 0.2761429357 0.0651709685
-0.4325979077 0.2875049196 0.1179616660
-0.4299774610 0.3255205847 0.0550427039
-0.4273570142 0.3635362498 -0.0078762582
-0.4277481733 0.3521742659 -0.0606669557
-0.4284716580 0.3502094092 0.0499785716
-0.4273570142 0.3635362498 -0.0078762582
-0.4273570142 0.3635362498 -0.0078762582
-0.4415116912 0.1240085564 -0.0352050634
-0.4415514091 0.1207458616 -0.0628610749
-0.4431881151 0.0993691796 0.0012913169
-0.4415116912 0.1240085564 -0.0352050634
-0.4431881151 0.0993691796 0.0012913169
-0.4415514091 0.1207458616 -0.0628610749
-0.4409760865 0.1347833655 -0.0151033803
-0.4423847080 0.1155313932 0.0314438415
-0.4415116912 0.1240085564 -0.0352050634
-0.4409760865 0.1347833655 -0.0151033803
-0.4415116912 0.1240085564 -0.0352050634
-0.4423847080 0.1155313932 0.0314438415
-0.4407376971 0.1401763656 -0.0000235767
-0.4407376971 0.1401763656 -0.0000235767
-0.4390637680 0.1691906452 0.0099964769
-0.4407376971 0.1401763656 -0.0000235767
-0.4411901594 0.1381280332 0.0590735737
-0.4386113058 0.1712389776 -0.0491006735
-0.4395162302 0.1671423128 0.0690936273
-0.4411901594 0.1381280332 0.0590735737
-0.4414163905 0.1371038670 0.0886221489
-0.4390637680 0.1691906452 0.0099964769
-0.4395162302 0.1671423128 0.0690936273
-0.4414163905 0.1371038670 0.0886221489
-0.4411901594 0.1381280332 0.0590735737
-0.4407376971 0.1401763656 -0.0000235767
-0.4386113058 0.1712389776 -0.0491006735
-0.4411901594 0.1381280332 0.0590735737
-0.4325482095 0.2776419557 0.0023024299
-0.4390637680 0.1691906452 0.0099964769
-0.4353535265 0.2254646328 -0.0529476970
-0.4358059887 0.2234163004 0.0061494534
-0.4372086473 0.1973276390 -0.0214756100
-0.4339508680 0.2515532942 -0.0253226335
-0.4386113058 0.1712389776 -0.0491006735
-0.4367561850 0.1993759714 -0.0805727604
-0.4372086473 0.1973276390 -0.0214756100
-0.4362584510 0.2213679680 0.0652466038
-0.4395162302 0.1671423128 0.0690936273
-0.4376611095 0.1952793066 0.0376215404
-0.4381135717 0.1932309742 0.0967186908
-0.4358059887 0.2234163004 0.0061494534
-0.4344033302 0.2495049619 0.0337745169
-0.4376611095 0.1952793066 0.0376215404
-0.4316432850 0.2817386204 -0.1158918709
-0.4288379680 0.3339159433 -0.0606417440
-0.4320957473 0.2796902881 -0.0567947205
-0.4302406265 0.3078272819 -0.0882668074
-0.4306930887 0.3057789495 -0.0291696570
-0.4283855058 0.3359642757 -0.1197388944
-0.4269828473 0.3620529371 -0.0921138309
-0.4302406265 0.3078272819 -0.0882668074
-0.4353535265 0.2254646328 -0.0529476970
-0.4349010643 0.2275129652 -0.1120448474
-0.4334984058 0.2536016266 -0.0844197839
-0.4367561850 0.1993759714 -0.0805727604
-0.4320957473 0.2796902881 -0.0567947205
-0.4339508680 0.2515532942 -0.0253226335
-0.4334984058 0.2536016266 -0.0844197839
-0.4325482095 0.2776419557 0.0023024299
-0.4316432850 0.2817386204 -0.1158918709
-0.4353535265 0.2254646328 -0.0529476970
-0.4320957473 0.2796902881 -0.0567947205
-0.4334984058 0.2536016266 -0.0844197839
-0.4339508680 0.2515532942 -0.0253226335
-0.4349010643 0.2275129652 -0.1120448474
-0.4367561850 0.1993759714 -0.0805727604
-0.4334984058 0.2536016266 -0.0844197839
-0.4288379680 0.3339159433 -0.0606417440
-0.4283855058 0.3359642757 -0.1197388944
-0.4302406265 0.3078272819 -0.0882668074
-0.4269828473 0.3620529371 -0.0921138309
-0.4320957473 0.2796902881 -0.0567947205
-0.4306930887 0.3057789495 -0.0291696570
-0.4302406265 0.3078272819 -0.0882668074
-0.4390637680 0.1691906452 0.0099964769
-0.4362584510 0.2213679680 0.0652466038
-0.4358059887 0.2234163004 0.0061494534
-0.4376611095 0.1952793066 0.0376215404
-0.4344033302 0.2495049619 0.0337745169
-0.4395162302 0.1671423128 0.0690936273
-0.4381135717 0.1932309742 0.0967186908
-0.4376611095 0.1952793066 0.0376215404
-0.4353535265 0.2254646328 -0.0529476970
-0.4386113058 0.1712389776 -0.0491006735
-0.4372086473 0.1973276390 -0.0214756100
-0.4367561850 0.1993759714 -0.0805727604
-0.4358059887 0.2234163004 0.0061494534
-0.4339508680 0.2515532942 -0.0253226335
-0.4372086473 0.1973276390 -0.0214756100
-0.4325482095 0.2776419557 0.0023024299
-0.4362584510 0.2213679680 0.0652466038
-0.4381135717 0.1932309742 0.0967186908
-0.4340788615 0.2578846132 0.0651961803
-0.4303686201 0.3141586008 0.0022520064
-0.4288379680 0.3339159433 -0.0606417440
-0.4329890668 0.2761429357 0.0651709685
-0.4325482095 0.2776419557 0.0023024299
-0.4303686201 0.3141586008 0.0022520064
-0.4329890668 0.2761429357 0.0651709685
-0.4288379680 0.3339159433 -0.0606417440
-0.4362584510 0.2213679680 0.0652466038
-0.4340788615 0.2578846132 0.0651961803
-0.4381135717 0.1932309742 0.0967186908
-0.4265362269 0.3763999966 -0.0179522026
-0.4265362269 0.3763999966 -0.0179522026
-0.4258356131 0.3871310512 -0.0280250600
-0.4254816698 0.3886604911 -0.0758054889
-0.4243279207 0.4140035558 -0.0104594900
-0.4258356131 0.3871310512 -0.0280250600
-0.4243279207 0.4140035558 -0.0104594900
-0.4254816698 0.3886604911 -0.0758054889
-0.4426097959 0.2813000880 -0.1436107377
-0.4426097959 0.2813000880 -0.1436107377
-0.4426097959 0.2813000880 -0.1436107377
-0.4426097959 0.2813000880 -0.1436107377
-0.4336379478 0.4447637237 -0.0030180152
-0.4336379478 0.4447637237 -0.0030180152
-0.4336379478 0.4447637237 -0.0030180152
-0.4336379478 0.4447637237 -0.0030180152
-0.4427075013 0.2824269797 -0.1159533806
-0.4427075013 0.2824269797 -0.1159533806
-0.4427075013 0.2824269797 -0.1159533806
-0.4427075013 0.2824269797 -0.1159533806
-0.4353942915 0.4146904916 -0.0105210090
-0.4353942915 0.4146904916 -0.0105210090
-0.4353942915 0.4146904916 -0.0105210090
-0.4353942915 0.4146904916 -0.0105210090
-0.4315516200 0.2806058811 -0.1435492509
-0.4315516200 0.2806058811 -0.1435492509
-0.4225673295 0.4440786037 -0.0029564761
-0.4225673295 0.4440786037 -0.0029564761
-0.4317537000 0.2784876772 -0.1309744251
-0.4316432850 0.2817386204 -0.1158918709
-0.4350666867 0.2226365503 -0.1346686787
-0.4317537000 0.2784876772 -0.1309744251
-0.4350666867 0.2226365503 -0.1346686787
-0.4316432850 0.2817386204 -0.1158918709
-0.4233580459 0.4301074409 -0.0104816796
-0.4233580459 0.4301074409 -0.0104816796
-0.4446977934 0.4454559608 -0.0030795077
-0.4446977934 0.4454559608 -0.0030795077
-0.4454910339 0.4314771882 -0.0106047119
-0.4454910339 0.4314771882 -0.0106047119
-0.4536737657 0.2819925715 -0.1436722531
-0.4536737657 0.2819925715 -0.1436722531
-0.4538666358 0.2798639873 -0.1310973593
-0.4571813305 0.2240189123 -0.1347916325
-0.4537622613 0.2831090829 -0.1160148280
-0.4538666358 0.2798639873 -0.1310973593
-0.4537622613 0.2831090829 -0.1160148280
-0.4571813305 0.2240189123 -0.1347916325
-0.4872365534 -0.2786822812 -0.1303262701
-0.4838791803 -0.2228501689 -0.1341747169
-0.4875168139 -0.2818752125 -0.1152348510
-0.4872365534 -0.2786822812 -0.1303262701
-0.4875168139 -0.2818752125 -0.1152348510
-0.4838791803 -0.2228501689 -0.1341747169
-0.4873005584 -0.2808532761 -0.1428952282
-0.4873005584 -0.2808532761 -0.1428952282
-0.4969522765 -0.4298819981 -0.0094155808
-0.4969522765 -0.4298819981 -0.0094155808
-0.4978278060 -0.4438351272 -0.0018518157
-0.4978278060 -0.4438351272 -0.0018518157
-0.4748136244 -0.4311569381 -0.0092926793
-0.4748136244 -0.4311569381 -0.0092926793
-0.4651170263 -0.2799482663 -0.1302034882
-0.4653919855 -0.2831477229 -0.1151120290
-0.4617572369 -0.2241103486 -0.1340519317
-0.4651170263 -0.2799482663 -0.1302034882
-0.4617572369 -0.2241103486 -0.1340519317
-0.4653919855 -0.2831477229 -0.1151120290
-0.4756907478 -0.4451021078 -0.0017289365
-0.4756907478 -0.4451021078 -0.0017289365
-0.4651706510 -0.2821100512 -0.1427724054
-0.4651706510 -0.2821100512 -0.1427724054
-0.4849286725 -0.4144168501 -0.0093764025
-0.4849286725 -0.4144168501 -0.0093764025
-0.4849286725 -0.4144168501 -0.0093764025
-0.4849286725 -0.4144168501 -0.0093764025
-0.4764594666 -0.2825140106 -0.1151734633
-0.4764594666 -0.2825140106 -0.1151734633
-0.4764594666 -0.2825140106 -0.1151734633
-0.4764594666 -0.2825140106 -0.1151734633
-0.4867641966 -0.4444643657 -0.0017904102
-0.4867641966 -0.4444643657 -0.0017904102
-0.4867641966 -0.4444643657 -0.0017904102
-0.4867641966 -0.4444643657 -0.0017904102
-0.4762328309 -0.2814828641 -0.1428337996
-0.4762328309 -0.2814828641 -0.1428337996
-0.4762328309 -0.2814828641 -0.1428337996
-0.4762328309 -0.2814828641 -0.1428337996
-0.4721595487 -0.3882397993 -0.0269546382
-0.4719980769 -0.3899319506 -0.0747306196
-0.4738592309 -0.4150523869 -0.0093149544
-0.4721595487 -0.3882397993 -0.0269546382
-0.4738592309 -0.4150523869 -0.0093149544
-0.4719980769 -0.3899319506 -0.0747306196
-0.4715758489 -0.3774739890 -0.0169114579
-0.4715758489 -0.3774739890 -0.0169114579
-0.4657832831 -0.2786472915 0.0030704033
-0.4627566220 -0.2221588863 0.0658589054
-0.4612432915 -0.1939146837 0.0972531565
-0.4649403357 -0.2586752850 0.0659093061
-0.4679669967 -0.3151636902 0.0031208039
-0.4688099441 -0.3351356967 -0.0597180989
-0.4660321925 -0.2769334844 0.0659345064
-0.4657832831 -0.2786472915 0.0030704033
-0.4679669967 -0.3151636902 0.0031208039
-0.4660321925 -0.2769334844 0.0659345064
-0.4688099441 -0.3351356967 -0.0597180989
-0.4627566220 -0.2221588863 0.0658589054
-0.4649403357 -0.2586752850 0.0659093061
-0.4612432915 -0.1939146837 0.0972531565
-0.4657832831 -0.2786472915 0.0030704033
-0.4593386635 -0.1701709125 0.0104649753
-0.4623653245 -0.2266593177 -0.0523235269
-0.4625609733 -0.2244091020 0.0067676893
-0.4608519940 -0.1984151151 -0.0209292758
-0.4640743038 -0.2526533046 -0.0246265618
-0.4591430147 -0.1724211283 -0.0486262408
-0.4606563452 -0.2006653309 -0.0800204919
-0.4608519940 -0.1984151151 -0.0209292758
-0.4627566220 -0.2221588863 0.0658589054
-0.4595343122 -0.1679206968 0.0695561914
-0.4610476428 -0.1961648994 0.0381619404
-0.4612432915 -0.1939146837 0.0972531565
-0.4625609733 -0.2244091020 0.0067676893
-0.4642699525 -0.2504030889 0.0344646543
-0.4610476428 -0.1961648994 0.0381619404
-0.4653919855 -0.2831477229 -0.1151120290
-0.4688099441 -0.3351356967 -0.0597180989
-0.4655876343 -0.2808975072 -0.0560208129
-0.4671009648 -0.3091417098 -0.0874150640
-0.4672966136 -0.3068914941 -0.0283238478
-0.4686142953 -0.3373859124 -0.1188093150
-0.4703232746 -0.3633798993 -0.0911123500
-0.4671009648 -0.3091417098 -0.0874150640
-0.4623653245 -0.2266593177 -0.0523235269
-0.4621696757 -0.2289095335 -0.1114147430
-0.4638786550 -0.2549035203 -0.0837177779
-0.4606563452 -0.2006653309 -0.0800204919
-0.4655876343 -0.2808975072 -0.0560208129
-0.4640743038 -0.2526533046 -0.0246265618
-0.4638786550 -0.2549035203 -0.0837177779
-0.4657832831 -0.2786472915 0.0030704033
-0.4653919855 -0.2831477229 -0.1151120290
-0.4623653245 -0.2266593177 -0.0523235269
-0.4655876343 -0.2808975072 -0.0560208129
-0.4638786550 -0.2549035203 -0.0837177779
-0.4640743038 -0.2526533046 -0.0246265618
-0.4621696757 -0.2289095335 -0.1114147430
-0.4606563452 -0.2006653309 -0.0800204919
-0.4638786550 -0.2549035203 -0.0837177779
-0.4688099441 -0.3351356967 -0.0597180989
-0.4686142953 -0.3373859124 -0.1188093150
-0.4671009648 -0.3091417098 -0.0874150640
-0.4703232746 -0.3633798993 -0.0911123500
-0.4655876343 -0.2808975072 -0.0560208129
-0.4672966136 -0.3068914941 -0.0283238478
-0.4671009648 -0.3091417098 -0.0874150640
-0.4593386635 -0.1701709125 0.0104649753
-0.4627566220 -0.2221588863 0.0658589054
-0.4625609733 -0.2244091020 0.0067676893
-0.4610476428 -0.1961648994 0.0381619404
-0.4642699525 -0.2504030889 0.0344646543
-0.4595343122 -0.1679206968 0.0695561914
-0.4612432915 -0.1939146837 0.0972531565
-0.4610476428 -0.1961648994 0.0381619404
-0.4623653245 -0.2266593177 -0.0523235269
-0.4591430147 -0.1724211283 -0.0486262408
-0.4608519940 -0.1984151151 -0.0209292758
-0.4606563452 -0.2006653309 -0.0800204919
-0.4625609733 -0.2244091020 0.0067676893
-0.4640743038 -0.2526533046 -0.0246265618
-0.4608519940 -0.1984151151 -0.0209292758
-0.4593386635 -0.1701709125 0.0104649753
-0.4575477978 -0.1411913957 0.0003648596
-0.4577434466 -0.1389411800 0.0594560758
-0.4591430147 -0.1724211283 -0.0486262408
-0.4595343122 -0.1679206968 0.0695561914
-0.4577434466 -0.1389411800 0.0594560758
-0.4578412710 -0.1378160721 0.0890016838
-0.4593386635 -0.1701709125 0.0104649753
-0.4595343122 -0.1679206968 0.0695561914
-0.4578412710 -0.1378160721 0.0890016838
-0.4577434466 -0.1389411800 0.0594560758
-0.4575477978 -0.1411913957 0.0003648596
-0.4591430147 -0.1724211283 -0.0486262408
-0.4577434466 -0.1389411800 0.0594560758
-0.4575477978 -0.1411913957 0.0003648596
-0.4575477978 -0.1411913957 0.0003648596
-0.4571448620 -0.1358498829 -0.0147297633
-0.4562436100 -0.1164391524 0.0317640836
-0.4563970770 -0.1251432933 -0.0348611021
-0.4571448620 -0.1358498829 -0.0147297633
-0.4563970770 -0.1251432933 -0.0348611021
-0.4562436100 -0.1164391524 0.0317640836
-0.4563970770 -0.1251432933 -0.0348611021
-0.4560525912 -0.1219751787 -0.0625259915
-0.4551219326 -0.1003792679 0.0015670754
-0.4563970770 -0.1251432933 -0.0348611021
-0.4551219326 -0.1003792679 0.0015670754
-0.4560525912 -0.1219751787 -0.0625259915
-0.4708575418 -0.3645763483 -0.0068710778
-0.4708575418 -0.3645763483 -0.0068710778
-0.4679669967 -0.3151636902 0.0031208039
-0.4708575418 -0.3645763483 -0.0068710778
-0.4703680102 -0.3510524716 0.0509466838
-0.4699018009 -0.3533938960 -0.0596928986
-0.4660321925 -0.2769334844 0.0659345064
-0.4689227376 -0.3263461425 0.0559426247
-0.4669879334 -0.2881159367 0.1187563271
-0.4679669967 -0.3151636902 0.0031208039
-0.4660321925 -0.2769334844 0.0659345064
-0.4669879334 -0.2881159367 0.1187563271
-0.4689227376 -0.3263461425 0.0559426247
-0.4708575418 -0.3645763483 -0.0068710778
-0.4699018009 -0.3533938960 -0.0596928986
-0.4703680102 -0.3510524716 0.0509466838
-0.2152984582 0.3772816593 -0.1218484453
-0.2152984582 0.3772816593 -0.1218484453
-0.2152984582 0.3772816593 -0.1218484453
-0.2152984582 0.3772816593 -0.1218484453
0.1648615942 0.2125917415 -0.1058596680
0.1648615942 0.2125917415 -0.1058596680
0.1648615942 0.2125917415 -0.1058596680
0.1648615942 0.2125917415 -0.1058596680
-0.2477024741 0.3912951774 -0.0720851809
-0.2477024741 0.3912951774 -0.0720851809
-0.2477024741 0.3912951774 -0.0720851809
-0.2477024741 0.3912951774 -0.0720851809
-0.2171032553 0.3731133595 -0.1218449771
-0.2494108894 0.3870934408 -0.0902570915
-0.1709602728 0.3530971008 -0.0738773178
-0.1548064558 0.3461070602 -0.0896712606
-0.2101855811 0.3700952708 -0.0820672046
-0.3117076889 0.4140997402 -0.1224308080
-0.3278615060 0.4210897808 -0.1066368652
-0.2644054721 0.3936065498 -0.1221378925
-0.1224988217 0.3321269789 -0.1212591462
-0.1548064558 0.3461070602 -0.0896712606
-0.1236580560 0.3326039105 -0.0735844024
-0.1698010385 0.3526201692 -0.1215520617
-0.0751966049 0.3116337886 -0.1209662308
-0.1075042390 0.3256138699 -0.0893783452
-0.0602020222 0.3051206795 -0.0890854298
-0.2171032553 0.3731133595 -0.1218449771
-0.1224988217 0.3321269789 -0.1212591462
-0.0751966049 0.3116337886 -0.1209662308
-0.0602020222 0.3051206795 -0.0890854298
-0.1075042390 0.3256138699 -0.0893783452
-0.1548064558 0.3461070602 -0.0896712606
-0.1698010385 0.3526201692 -0.1215520617
-0.1236580560 0.3326039105 -0.0735844024
-0.2494108894 0.3870934408 -0.0902570915
-0.3117076889 0.4140997402 -0.1224308080
-0.2644054721 0.3936065498 -0.1221378925
-0.3278615060 0.4210897808 -0.1066368652
-0.1709602728 0.3530971008 -0.0738773178
-0.2101855811 0.3700952708 -0.0820672046
-0.1548064558 0.3461070602 -0.0896712606
0.1630568393 0.2084234285 -0.1058639465
0.0675812256 0.2497820134 -0.1132686309
0.0198434188 0.2704613058 -0.1169709732
0.0871265288 0.2413150171 -0.0949814509
0.1826021425 0.1999564322 -0.0875767665
0.2585324530 0.1670648436 -0.0984592621
0.0968991805 0.2370815189 -0.0858378609
0.1630568393 0.2084234285 -0.1058639465
0.1826021425 0.1999564322 -0.0875767665
0.0968991805 0.2370815189 -0.0858378609
0.2585324530 0.1670648436 -0.0984592621
0.0675812256 0.2497820134 -0.1132686309
0.0871265288 0.2413150171 -0.0949814509
0.0198434188 0.2704613058 -0.1169709732
0.3858280715 0.1119117442 -0.0318141797
0.4110142433 0.1010095971 -0.0679936284
0.3288218949 0.1366084059 -0.0548751290
0.3858280715 0.1119117442 -0.0318141797
0.3288218949 0.1366084059 -0.0548751290
0.4110142433 0.1010095971 -0.0679936284
0.3858280715 0.1119117442 -0.0318141797
0.3535186601 0.1258919509 -0.0002123594
0.4357110085 0.0902931421 -0.0133308588
0.3858280715 0.1119117442 -0.0318141797
0.4357110085 0.0902931421 -0.0133308588
0.3535186601 0.1258919509 -0.0002123594
0.2753838549 0.1597575934 -0.0779217271
0.2501976831 0.1706597406 -0.0417422784
0.3288218949 0.1366084059 -0.0548751290
0.2753838549 0.1597575934 -0.0779217271
0.3288218949 0.1366084059 -0.0548751290
0.2501976831 0.1706597406 -0.0417422784
0.1826021425 0.1999564322 -0.0875767665
0.1039779307 0.2340077669 -0.0744439159
0.2683051046 0.1628313454 -0.0893156721
0.1826021425 0.1999564322 -0.0875767665
0.2683051046 0.1628313454 -0.0893156721
0.1039779307 0.2340077669 -0.0744439159
-0.0406567190 0.2966536832 -0.0707982497
-0.0406567190 0.2966536832 -0.0707982497
-0.2494108894 0.3870934408 -0.0902570915
-0.3278615060 0.4210897808 -0.1066368652
-0.3671838933 0.4381172738 -0.0966632487
-0.3279585850 0.4211191038 -0.0884733619
-0.2495079684 0.3871227638 -0.0720935882
-0.1709602728 0.3530971008 -0.0738773178
-0.3280071245 0.4211337653 -0.0793916102
-0.2494108894 0.3870934408 -0.0902570915
-0.2495079684 0.3871227638 -0.0720935882
-0.3280071245 0.4211337653 -0.0793916102
-0.1709602728 0.3530971008 -0.0738773178
-0.3278615060 0.4210897808 -0.1066368652
-0.3279585850 0.4211191038 -0.0884733619
-0.3671838933 0.4381172738 -0.0966632487
0.3894362578 0.1202484451 -0.0318087287
0.3571247238 0.1342230952 -0.0002012294
0.4393190489 0.0986283131 -0.0133155932
0.3894362578 0.1202484451 -0.0318087287
0.4393190489 0.0986283131 -0.0133155932
0.3571247238 0.1342230952 -0.0002012294
0.3894362578 0.1202484451 -0.0318087287
0.3324325676 0.1449465046 -0.0548737986
0.4146268927 0.1093517224 -0.0679881623
0.3894362578 0.1202484451 -0.0318087287
0.4146268927 0.1093517224 -0.0679881623
0.3324325676 0.1449465046 -0.0548737986
0.2789967828 0.1680991847 -0.0779162586
0.2538061479 0.1789959074 -0.0417368250
0.3324325676 0.1449465046 -0.0548737986
0.2789967828 0.1680991847 -0.0779162586
0.3324325676 0.1449465046 -0.0548737986
0.2538061479 0.1789959074 -0.0417368250
0.1862126808 0.2082924723 -0.0875733674
0.1075862611 0.2423418751 -0.0744363939
0.2719179416 0.1711711271 -0.0893132998
0.1862126808 0.2082924723 -0.0875733674
0.2719179416 0.1711711271 -0.0893132998
0.1075862611 0.2423418751 -0.0744363939
0.1666691621 0.2167635032 -0.1058589952
0.1862126808 0.2082924723 -0.0875733674
0.1005074199 0.2454138175 -0.0858334351
0.2621461823 0.1754066426 -0.0984561137
0.0711921419 0.2581203638 -0.1132618767
0.0907356606 0.2496493329 -0.0949762490
0.0234536318 0.2787987941 -0.1169633175
0.1666691621 0.2167635032 -0.1058589952
0.0711921419 0.2581203638 -0.1132618767
0.0234536318 0.2787987941 -0.1169633175
0.0907356606 0.2496493329 -0.0949762490
0.1862126808 0.2082924723 -0.0875733674
0.2621461823 0.1754066426 -0.0984561137
0.1005074199 0.2454138175 -0.0858334351
-0.0370482543 0.3049903753 -0.0707871161
-0.0370482543 0.3049903753 -0.0707871161
-0.2134937033 0.3814499724 -0.1218441667
-0.1188892908 0.3404635984 -0.1212544625
-0.0715870845 0.3199704114 -0.1209596104
-0.0565917730 0.3134614062 -0.0890727439
-0.1038939792 0.3339545932 -0.0893675960
-0.1511961855 0.3544477802 -0.0896624481
-0.1661914970 0.3609567854 -0.1215493146
-0.1200474266 0.3409466841 -0.0735715888
-0.2458005980 0.3954341542 -0.0902521524
-0.3080981157 0.4224363464 -0.1224338710
-0.2607959095 0.4019431594 -0.1221390188
-0.3242515631 0.4294284373 -0.1066378638
-0.1673496328 0.3614398711 -0.0738664409
-0.2065751154 0.3784370126 -0.0820592966
-0.1511961855 0.3544477802 -0.0896624481
-0.2134937033 0.3814499724 -0.1218441667
-0.2458005980 0.3954341542 -0.0902521524
-0.1673496328 0.3614398711 -0.0738664409
-0.1511961855 0.3544477802 -0.0896624481
-0.2065751154 0.3784370126 -0.0820592966
-0.3080981157 0.4224363464 -0.1224338710
-0.3242515631 0.4294284373 -0.1066378638
-0.2607959095 0.4019431594 -0.1221390188
-0.1188892908 0.3404635984 -0.1212544625
-0.1511961855 0.3544477802 -0.0896624481
-0.1200474266 0.3409466841 -0.0735715888
-0.1661914970 0.3609567854 -0.1215493146
-0.0715870845 0.3199704114 -0.1209596104
-0.1038939792 0.3339545932 -0.0893675960
-0.0565917730 0.3134614062 -0.0890727439
-0.2458005980 0.3954341542 -0.0902521524
-0.3242515631 0.4294284373 -0.1066378638
-0.3635737190 0.4464626525 -0.0966568979
-0.3243482364 0.4294655110 -0.0884640422
-0.2458972713 0.3954712279 -0.0720783308
-0.1673496328 0.3614398711 -0.0738664409
-0.3243965731 0.4294840478 -0.0793771314
-0.2458005980 0.3954341542 -0.0902521524
-0.2458972713 0.3954712279 -0.0720783308
-0.3243965731 0.4294840478 -0.0793771314
-0.1673496328 0.3614398711 -0.0738664409
-0.3242515631 0.4294284373 -0.1066378638
-0.3243482364 0.4294655110 -0.0884640422
-0.3635737190 0.4464626525 -0.0966568979
-0.2606408801 -0.4017434870 -0.1228255827
-0.2606408801 -0.4017434870 -0.1228255827
-0.2606408801 -0.4017434870 -0.1228255827
-0.2606408801 -0.4017434870 -0.1228255827
0.1364410565 -0.2834889916 -0.1072268059
0.1364410565 -0.2834889916 -0.1072268059
0.1364410565 -0.2834889916 -0.1072268059
0.1364410565 -0.2834889916 -0.1072268059
-0.2944780504 -0.4116401457 -0.0730288185
-0.2944780504 -0.4116401457 -0.0730288185
-0.2944780504 -0.4116401457 -0.0730288185
-0.2944780504 -0.4116401457 -0.0730288185
-0.2593433235 -0.4060989223 -0.1228053939
-0.2930873963 -0.4160320818 -0.0911845377
-0.2111419753 -0.3915842823 -0.0748854309
-0.1942699389 -0.3866177026 -0.0906958590
-0.2521146858 -0.4038081821 -0.0830349843
-0.3581607809 -0.4355133015 -0.1232940726
-0.3750328173 -0.4404798812 -0.1074836445
-0.3087520522 -0.4208061119 -0.1230497333
-0.1605258661 -0.3766845432 -0.1223167153
-0.1942699389 -0.3866177026 -0.0906958590
-0.1617332466 -0.3768770928 -0.0746410916
-0.2099345948 -0.3913917327 -0.1225610546
-0.1111171374 -0.3619773536 -0.1220723759
-0.1448612102 -0.3719105130 -0.0904515197
-0.0954524815 -0.3572033234 -0.0902071804
-0.2593433235 -0.4060989223 -0.1228053939
-0.1605258661 -0.3766845432 -0.1223167153
-0.1111171374 -0.3619773536 -0.1220723759
-0.0954524815 -0.3572033234 -0.0902071804
-0.1448612102 -0.3719105130 -0.0904515197
-0.1942699389 -0.3866177026 -0.0906958590
-0.2099345948 -0.3913917327 -0.1225610546
-0.1617332466 -0.3768770928 -0.0746410916
-0.2930873963 -0.4160320818 -0.0911845377
-0.3581607809 -0.4355133015 -0.1232940726
-0.3087520522 -0.4208061119 -0.1230497333
-0.3750328173 -0.4404798812 -0.1074836445
-0.2111419753 -0.3915842823 -0.0748854309
-0.2521146858 -0.4038081821 -0.0830349843
-0.1942699389 -0.3866177026 -0.0906958590
0.1377371242 -0.2878440899 -0.1072143728
0.0380143577 -0.3175571270 -0.1145212047
-0.0118470255 -0.3324136455 -0.1181746206
0.0584285395 -0.3114114932 -0.0962537039
0.1581513059 -0.2816984562 -0.0889468721
0.2374598906 -0.2581310529 -0.0999075409
0.0686356304 -0.3083386764 -0.0871199536
0.1377371242 -0.2878440899 -0.1072143728
0.1581513059 -0.2816984562 -0.0889468721
0.0686356304 -0.3083386764 -0.0871199536
0.2374598906 -0.2581310529 -0.0999075409
0.0380143577 -0.3175571270 -0.1145212047
0.0584285395 -0.3114114932 -0.0962537039
-0.0118470255 -0.3324136455 -0.1181746206
0.3704054515 -0.2182936594 -0.0333945077
0.3967185711 -0.2106013381 -0.0695990227
0.3108695374 -0.2361103371 -0.0563961941
0.3704054515 -0.2182936594 -0.0333945077
0.3108695374 -0.2361103371 -0.0563961941
0.3967185711 -0.2106013381 -0.0695990227
0.3704054515 -0.2182936594 -0.0333945077
0.3366692726 -0.2282267538 -0.0017596640
0.4225183063 -0.2027177547 -0.0149624926
0.3704054515 -0.2182936594 -0.0333945077
0.4225183063 -0.2027177547 -0.0149624926
0.3366692726 -0.2282267538 -0.0017596640
0.2550621783 -0.2528180290 -0.0793877037
0.2287490587 -0.2605103503 -0.0431831888
0.3108695374 -0.2361103371 -0.0563961941
0.2550621783 -0.2528180290 -0.0793877037
0.3108695374 -0.2361103371 -0.0563961941
0.2287490587 -0.2605103503 -0.0431831888
0.1581513059 -0.2816984562 -0.0889468721
0.0760308272 -0.3060984693 -0.0757338667
0.2476669815 -0.2550582361 -0.0907737906
0.1581513059 -0.2816984562 -0.0889468721
0.2476669815 -0.2550582361 -0.0907737906
0.0760308272 -0.3060984693 -0.0757338667
-0.0750382998 -0.3510576897 -0.0719396796
-0.0750382998 -0.3510576897 -0.0719396796
-0.2930873963 -0.4160320818 -0.0911845377
-0.3750328173 -0.4404798812 -0.1074836445
-0.4161024002 -0.4526709514 -0.0974691830
-0.3751296897 -0.4404470517 -0.0893196296
-0.2931842687 -0.4159992522 -0.0730205228
-0.2111419753 -0.3915842823 -0.0748854309
-0.3751781259 -0.4404306369 -0.0802376222
-0.2930873963 -0.4160320818 -0.0911845377
-0.2931842687 -0.4159992522 -0.0730205228
-0.3751781259 -0.4404306369 -0.0802376222
-0.2111419753 -0.3915842823 -0.0748854309
-0.3750328173 -0.4404798812 -0.1074836445
-0.3751296897 -0.4404470517 -0.0893196296
-0.4161024002 -0.4526709514 -0.0974691830
0.3678194031 -0.2095910752 -0.0334234594
0.3340846996 -0.2195283889 -0.0017829193
0.4199280802 -0.1940149075 -0.0149816546
0.3678194031 -0.2095910752 -0.0334234594
0.4199280802 -0.1940149075 -0.0149816546
0.3340846996 -0.2195283889 -0.0017829193
0.3678194031 -0.2095910752 -0.0334234594
0.3082819945 -0.2274019783 -0.0564292955
0.3941253750 -0.2018884969 -0.0696280308
0.3678194031 -0.2095910752 -0.0334234594
0.3941253750 -0.2018884969 -0.0696280308
0.3082819945 -0.2274019783 -0.0564292955
0.2524694348 -0.2441010758 -0.0794167164
0.2261634629 -0.2518036542 -0.0432121450
0.3082819945 -0.2274019783 -0.0564292955
0.2524694348 -0.2441010758 -0.0794167164
0.3082819945 -0.2274019783 -0.0564292955
0.2261634629 -0.2518036542 -0.0432121450
0.1555562652 -0.2729855076 -0.0889779563
0.0734377336 -0.2973871835 -0.0757608058
0.2450721158 -0.2463424538 -0.0908059116
0.1555562652 -0.2729855076 -0.0889779563
0.2450721158 -0.2463424538 -0.0908059116
0.0734377336 -0.2973871835 -0.0757608058
0.1351437112 -0.2791296836 -0.1072433848
0.1555562652 -0.2729855076 -0.0889779563
0.0660404146 -0.2996285615 -0.0871500010
0.2348658388 -0.2494145418 -0.0999386258
0.0354215835 -0.3088448254 -0.1145481437
0.0558341376 -0.3027006494 -0.0962827152
-0.0144394803 -0.3237023963 -0.1182005232
0.1351437112 -0.2791296836 -0.1072433848
0.0354215835 -0.3088448254 -0.1145481437
-0.0144394803 -0.3237023963 -0.1182005232
0.0558341376 -0.3027006494 -0.0962827152
0.1555562652 -0.2729855076 -0.0889779563
0.2348658388 -0.2494145418 -0.0999386258
0.0660404146 -0.2996285615 -0.0871500010
-0.0776297769 -0.3423449426 -0.0719624806
-0.0776297769 -0.3423449426 -0.0719624806
-0.2619369478 -0.3973883887 -0.1228380157
-0.1631187459 -0.3679741780 -0.1223454592
-0.1137096450 -0.3532670726 -0.1220991809
-0.0980423309 -0.3484891186 -0.0902279091
-0.1474514318 -0.3631962239 -0.0904741874
-0.1968605328 -0.3779033293 -0.0907204656
-0.2125278469 -0.3826812833 -0.1225917374
-0.1643223253 -0.3681607996 -0.0746616906
-0.2956787346 -0.4073175400 -0.0912130221
-0.3607551497 -0.4268025994 -0.1233305722
-0.3113460487 -0.4120954940 -0.1230842939
-0.3776260431 -0.4317671750 -0.1075180754
-0.2137314262 -0.3828679049 -0.0749079688
-0.2547050804 -0.3950927224 -0.0830604955
-0.1968605328 -0.3779033293 -0.0907204656
-0.2619369478 -0.3973883887 -0.1228380157
-0.2956787346 -0.4073175400 -0.0912130221
-0.2137314262 -0.3828679049 -0.0749079688
-0.1968605328 -0.3779033293 -0.0907204656
-0.2547050804 -0.3950927224 -0.0830604955
-0.3607551497 -0.4268025994 -0.1233305722
-0.3776260431 -0.4317671750 -0.1075180754
-0.3113460487 -0.4120954940 -0.1230842939
-0.1631187459 -0.3679741780 -0.1223454592
-0.1968605328 -0.3779033293 -0.0907204656
-0.1643223253 -0.3681607996 -0.0746616906
-0.2125278469 -0.3826812833 -0.1225917374
-0.1137096450 -0.3532670726 -0.1220991809
-0.1474514318 -0.3631962239 -0.0904741874
-0.0980423309 -0.3484891186 -0.0902279091
-0.2956787346 -0.4073175400 -0.0912130221
-0.3776260431 -0.4317671750 -0.1075180754
-0.4186984482 -0.4439550535 -0.0974967916
-0.3777247939 -0.4317302359 -0.0893442649
-0.2957774855 -0.4072806009 -0.0730392116
-0.2137314262 -0.3828679049 -0.0749079688
-0.3777741694 -0.4317117664 -0.0802573597
-0.2956787346 -0.4073175400 -0.0912130221
-0.2957774855 -0.4072806009 -0.0730392116
-0.3777741694 -0.4317117664 -0.0802573597
-0.2137314262 -0.3828679049 -0.0749079688
-0.3776260431 -0.4317671750 -0.1075180754
-0.3777247939 -0.4317302359 -0.0893442649
-0.4186984482 -0.4439550535 -0.0974967916
-0.4299774610 0.3255205847 0.0550427039
-0.4294201391 0.3321840050 0.0261152890
-0.4262423704 0.3768630903 -0.0657310880
-0.4290583967 0.3331664333 -0.0292074747
-0.4312876844 0.3065127522 0.0865021849
-0.4316788434 0.2951507682 0.0337114874
-0.4342992902 0.2571351032 0.0966304495
-0.4312876844 0.3065127522 0.0865021849
-0.4312876844 0.3065127522 0.0865021849
-0.4342992902 0.2571351032 0.0966304495
-0.4316788434 0.2951507682 0.0337114874
-0.4312876844 0.3065127522 0.0865021849
-0.4290583967 0.3331664333 -0.0292074747
-0.4262423704 0.3768630903 -0.0657310880
-0.4294201391 0.3321840050 0.0261152890
-0.4299774610 0.3255205847 0.0550427039
-0.4284716580 0.3502094092 0.0499785716
-0.4265362269 0.3763999966 -0.0179522026
-0.4265362269 0.3763999966 -0.0179522026
-0.4284716580 0.3502094092 0.0499785716
-0.4415514091 0.1207458616 -0.0628610749
-0.4415514091 0.1207458616 -0.0628610749
-0.4430890187 0.1059054071 0.0547174525
-0.4429203127 0.1047565842 0.0113421584
-0.4395674650 0.1540353377 -0.0616506021
-0.4431881151 0.0993691796 0.0012913169
-0.4431881151 0.0993691796 0.0012913169
-0.4395674650 0.1540353377 -0.0616506021
-0.4429203127 0.1047565842 0.0113421584
-0.4430890187 0.1059054071 0.0547174525
-0.4409760865 0.1347833655 -0.0151033803
-0.4420271239 0.1236208935 0.0540635469
-0.4420271239 0.1236208935 0.0540635469
-0.4409760865 0.1347833655 -0.0151033803
-0.4409639283 0.1391521994 0.0295249985
-0.4420271239 0.1236208935 0.0540635469
-0.4394482703 0.1567318378 -0.0541107003
-0.4388375369 0.1702148114 -0.0195520983
-0.4414163905 0.1371038670 0.0886221489
-0.4392899991 0.1681664790 0.0395450521
-0.4416426216 0.1360797009 0.1181707241
-0.4397424613 0.1661181466 0.0986422025
-0.4397424613 0.1661181466 0.0986422025
-0.4416426216 0.1360797009 0.1181707241
-0.4392899991 0.1681664790 0.0395450521
-0.4414163905 0.1371038670 0.0886221489
-0.4388375369 0.1702148114 -0.0195520983
-0.4394482703 0.1567318378 -0.0541107003
-0.4420271239 0.1236208935 0.0540635469
-0.4409639283 0.1391521994 0.0295249985
-0.4377891030 0.2016106255 0.1281403541
-0.4359339823 0.2297476193 0.0966682672
-0.4344033302 0.2495049619 0.0337745169
-0.4348441876 0.2480059419 0.0966430554
-0.4306930887 0.3057789495 -0.0291696570
-0.4277481733 0.3521742659 -0.0606669557
-0.4316788434 0.2951507682 0.0337114874
-0.4340788615 0.2578846132 0.0651961803
-0.4340788615 0.2578846132 0.0651961803
-0.4316788434 0.2951507682 0.0337114874
-0.4277481733 0.3521742659 -0.0606669557
-0.4306930887 0.3057789495 -0.0291696570
-0.4348441876 0.2480059419 0.0966430554
-0.4344033302 0.2495049619 0.0337745169
-0.4359339823 0.2297476193 0.0966682672
-0.4377891030 0.2016106255 0.1281403541
-0.4272404771 0.3695050295 0.0348646550
-0.4258356131 0.3871310512 -0.0280250600
-0.4258356131 0.3871310512 -0.0280250600
-0.4272404771 0.3695050295 0.0348646550
-0.4236200341 0.4170624355 -0.1060203479
-0.4239739774 0.4155329956 -0.0582399190
-0.4261895564 0.3856016114 0.0197553690
-0.4232201312 0.4289692479 -0.0494571340
-0.4232201312 0.4289692479 -0.0494571340
-0.4261895564 0.3856016114 0.0197553690
-0.4239739774 0.4155329956 -0.0582399190
-0.4236200341 0.4170624355 -0.1060203479
-0.4536737657 0.2819925715 -0.1436722531
-0.4447306511 0.3385556969 -0.1462346690
-0.4447306511 0.3385556969 -0.1462346690
-0.4536737657 0.2819925715 -0.1436722531
-0.4404947347 0.2240427557 -0.1409868350
-0.4315516200 0.2806058811 -0.1435492509
-0.4315516200 0.2806058811 -0.1435492509
-0.4404947347 0.2240427557 -0.1409868350
-0.4332506138 0.4380841378 -0.1438272249
-0.4332506138 0.4380841378 -0.1438272249
-0.4332506138 0.4380841378 -0.1438272249
-0.4332506138 0.4380841378 -0.1438272249
-0.4446977934 0.4454559608 -0.0030795077
-0.4293000073 0.4283891104 0.0397840948
-0.4293000073 0.4283891104 0.0397840948
-0.4446977934 0.4454559608 -0.0030795077
-0.4379758882 0.4611383370 -0.0458201252
-0.4225673295 0.4440786037 -0.0029564761
-0.4225673295 0.4440786037 -0.0029564761
-0.4379758882 0.4611383370 -0.0458201252
-0.4437853236 0.2882355048 0.1405319524
-0.4437853236 0.2882355048 0.1405319524
-0.4437853236 0.2882355048 0.1405319524
-0.4437853236 0.2882355048 0.1405319524
-0.4537622613 0.2831090829 -0.1160148280
-0.4449723739 0.3369905585 -0.1198310967
-0.4449723739 0.3369905585 -0.1198310967
-0.4537622613 0.2831090829 -0.1160148280
-0.4404331724 0.2278571448 -0.1120756022
-0.4316432850 0.2817386204 -0.1158918709
-0.4316432850 0.2817386204 -0.1158918709
-0.4404331724 0.2278571448 -0.1120756022
-0.4464566612 0.4153751189 -0.0105825023
-0.4309688956 0.3993813315 0.0285073944
-0.4309688956 0.3993813315 0.0285073944
-0.4464566612 0.4153751189 -0.0105825023
-0.4398196874 0.4299996516 -0.0495494125
-0.4243279207 0.4140035558 -0.0104594900
-0.4243279207 0.4140035558 -0.0104594900
-0.4398196874 0.4299996516 -0.0495494125
-0.4436620008 0.2881953410 0.1179001534
-0.4436620008 0.2881953410 0.1179001534
-0.4436620008 0.2881953410 0.1179001534
-0.4436620008 0.2881953410 0.1179001534
-0.4478965791 0.0176403077 -0.0300305934
-0.4478965791 0.0176403077 -0.0300305934
-0.4441840073 0.0767160255 -0.0628003017
-0.4441840073 0.0767160255 -0.0628003017
-0.4400304360 0.1399515240 -0.1307831719
-0.4400304360 0.1399515240 -0.1307831719
-0.4317537000 0.2784876772 -0.1309744251
-0.4281375933 0.3375161099 -0.1461424102
-0.4281375933 0.3375161099 -0.1461424102
-0.4317537000 0.2784876772 -0.1309744251
-0.4223887239 0.4352734504 -0.1311908836
-0.4223887239 0.4352734504 -0.1311908836
-0.4233580459 0.4301074409 -0.0104816796
-0.4245554146 0.4140753876 0.0322896609
-0.4245554146 0.4140753876 0.0322896609
-0.4233580459 0.4301074409 -0.0104816796
-0.4327214770 0.2875409591 0.1405934707
-0.4327214770 0.2875409591 0.1405934707
-0.4441840073 0.0767160255 -0.0628003017
-0.4441840073 0.0767160255 -0.0628003017
-0.4349010643 0.2275129652 -0.1120448474
-0.4284407133 0.3343388041 -0.1272801715
-0.4349562718 0.2258874936 -0.1195861245
-0.4366127651 0.1979619301 -0.1214332513
-0.4366127651 0.1979619301 -0.1214332513
-0.4349562718 0.2258874936 -0.1195861245
-0.4284407133 0.3343388041 -0.1272801715
-0.4349010643 0.2275129652 -0.1120448474
-0.4223887239 0.4352734504 -0.1311908836
-0.4223887239 0.4352734504 -0.1311908836
-0.4243279207 0.4140035558 -0.0104594900
-0.4217653190 0.4531250756 -0.0494904183
-0.4217653190 0.4531250756 -0.0494904183
-0.4243279207 0.4140035558 -0.0104594900
-0.4325406839 0.2896664919 0.1305323592
-0.4325406839 0.2896664919 0.1305323592
-0.4449042568 0.0714671080 0.0101316856
-0.4449042568 0.0714671080 0.0101316856
-0.4670025342 0.0728549595 0.0100088117
-0.4670025342 0.0728549595 0.0100088117
-0.4548422382 0.2889161846 0.1404704956
-0.4548422382 0.2889161846 0.1404704956
-0.4546549735 0.2910547826 0.1304093971
-0.4546549735 0.2910547826 0.1304093971
-0.4466830163 0.4154486935 0.0321666519
-0.4454910339 0.4314771882 -0.0106047119
-0.4454910339 0.4314771882 -0.0106047119
-0.4466830163 0.4154486935 0.0321666519
-0.4439024312 0.4544950693 -0.0496134736
-0.4464566612 0.4153751189 -0.0105825023
-0.4464566612 0.4153751189 -0.0105825023
-0.4439024312 0.4544950693 -0.0496134736
-0.4445057305 0.4366422431 -0.1313138272
-0.4445057305 0.4366422431 -0.1313138272
-0.4445057305 0.4366422431 -0.1313138272
-0.4445057305 0.4366422431 -0.1313138272
-0.4502626360 0.3389019386 -0.1462654267
-0.4538666358 0.2798639873 -0.1310973593
-0.4538666358 0.2798639873 -0.1310973593
-0.4502626360 0.3389019386 -0.1462654267
-0.4587343033 0.1993414704 -0.1215562379
-0.4570769560 0.2272640079 -0.1197091013
-0.4505519412 0.3357090623 -0.1274030860
-0.4570247687 0.2288865556 -0.1121678357
-0.4570247687 0.2288865556 -0.1121678357
-0.4505519412 0.3357090623 -0.1274030860
-0.4570769560 0.2272640079 -0.1197091013
-0.4587343033 0.1993414704 -0.1215562379
-0.4621353925 0.1413314964 -0.1309060689
-0.4621353925 0.1413314964 -0.1309060689
-0.4662842009 0.0780977830 -0.0629231757
-0.4662842009 0.0780977830 -0.0629231757
-0.4662842009 0.0780977830 -0.0629231757
-0.4662842009 0.0780977830 -0.0629231757
-0.4699801928 0.0189791672 -0.0301533038
-0.4699801928 0.0189791672 -0.0301533038
-0.4721664028 -0.0176136542 -0.0301027863
-0.4721664028 -0.0176136542 -0.0301027863
-0.4755316412 -0.0766860366 -0.0627094922
-0.4755316412 -0.0766860366 -0.0627094922
-0.4755316412 -0.0766860366 -0.0627094922
-0.4755316412 -0.0766860366 -0.0627094922
-0.4789523309 -0.1401507142 -0.1305174746
-0.4789523309 -0.1401507142 -0.1305174746
-0.4824807542 -0.1981270441 -0.1210075212
-0.4841594408 -0.2260431003 -0.1190832978
-0.4905939265 -0.3345143934 -0.1264778232
-0.4842995710 -0.2276395660 -0.1115375882
-0.4842995710 -0.2276395660 -0.1115375882
-0.4905939265 -0.3345143934 -0.1264778232
-0.4841594408 -0.2260431003 -0.1190832978
-0.4824807542 -0.1981270441 -0.1210075212
-0.4906899339 -0.3377708859 -0.1453312604
-0.4872365534 -0.2786822812 -0.1303262701
-0.4872365534 -0.2786822812 -0.1303262701
-0.4906899339 -0.3377708859 -0.1453312604
-0.4966088035 -0.4354599110 -0.1301098651
-0.4966088035 -0.4354599110 -0.1301098651
-0.4966088035 -0.4354599110 -0.1301098651
-0.4966088035 -0.4354599110 -0.1301098651
-0.4981219653 -0.4530324467 -0.0483606057
-0.4959938759 -0.4137796522 -0.0094378303
-0.4959938759 -0.4137796522 -0.0094378303
-0.4981219653 -0.4530324467 -0.0483606057
-0.4962203526 -0.4137081140 0.0333113267
-0.4969522765 -0.4298819981 -0.0094155808
-0.4969522765 -0.4298819981 -0.0094155808
-0.4962203526 -0.4137081140 0.0333113267
-0.4893087119 -0.2889801021 0.1312101520
-0.4893087119 -0.2889801021 0.1312101520
-0.4892383624 -0.2868067481 0.1412652977
-0.4892383624 -0.2868067481 0.1412652977
-0.4756086493 -0.0711943472 0.0102076759
-0.4756086493 -0.0711943472 0.0102076759
-0.4535023023 -0.0724471279 0.0103303634
-0.4535023023 -0.0724471279 0.0103303634
-0.4671864143 -0.2902343531 0.1313329290
-0.4671864143 -0.2902343531 0.1313329290
-0.4738592309 -0.4150523869 -0.0093149544
-0.4759791904 -0.4543076589 -0.0482376813
-0.4759791904 -0.4543076589 -0.0482376813
-0.4738592309 -0.4150523869 -0.0093149544
-0.4744861389 -0.4367339994 -0.1299870522
-0.4744861389 -0.4367339994 -0.1299870522
-0.4621696757 -0.2289095335 -0.1114147430
-0.4684768157 -0.3357861841 -0.1263550446
-0.4620321961 -0.2273098052 -0.1189604726
-0.4603523014 -0.1993908463 -0.1208846943
-0.4603523014 -0.1993908463 -0.1208846943
-0.4620321961 -0.2273098052 -0.1189604726
-0.4684768157 -0.3357861841 -0.1263550446
-0.4621696757 -0.2289095335 -0.1114147430
-0.4534241172 -0.0779450963 -0.0625867876
-0.4534241172 -0.0779450963 -0.0625867876
-0.4671111947 -0.2880747418 0.1413881247
-0.4671111947 -0.2880747418 0.1413881247
-0.4748136244 -0.4311569381 -0.0092926793
-0.4740866201 -0.4149788022 0.0334341941
-0.4740866201 -0.4149788022 0.0334341941
-0.4748136244 -0.4311569381 -0.0092926793
-0.4744861389 -0.4367339994 -0.1299870522
-0.4744861389 -0.4367339994 -0.1299870522
-0.4651170263 -0.2799482663 -0.1302034882
-0.4685572527 -0.3390288614 -0.1452084204
-0.4685572527 -0.3390288614 -0.1452084204
-0.4651170263 -0.2799482663 -0.1302034882
-0.4568402903 -0.1414121131 -0.1303947413
-0.4568402903 -0.1414121131 -0.1303947413
-0.4534241172 -0.0779450963 -0.0625867876
-0.4534241172 -0.0779450963 -0.0625867876
-0.4500781074 -0.0188741521 -0.0299801841
-0.4500781074 -0.0188741521 -0.0299801841
-0.4780555378 -0.2874842865 0.1186948957
-0.4780555378 -0.2874842865 0.1186948957
-0.4780555378 -0.2874842865 0.1186948957
-0.4780555378 -0.2874842865 0.1186948957
-0.4911517625 -0.4291975269 -0.0483632661
-0.4738592309 -0.4150523869 -0.0093149544
-0.4738592309 -0.4150523869 -0.0093149544
-0.4911517625 -0.4291975269 -0.0483632661
-0.4959938759 -0.4137796522 -0.0094378303
-0.4787055824 -0.3996361734 0.0296104611
-0.4787055824 -0.3996361734 0.0296104611
-0.4959938759 -0.4137796522 -0.0094378303
-0.4677034163 -0.2285926773 -0.1114454601
-0.4653919855 -0.2831477229 -0.1151120290
-0.4653919855 -0.2831477229 -0.1151120290
-0.4677034163 -0.2285926773 -0.1114454601
-0.4875168139 -0.2818752125 -0.1152348510
-0.4852053831 -0.3364302582 -0.1189014198
-0.4852053831 -0.3364302582 -0.1189014198
-0.4875168139 -0.2818752125 -0.1152348510
-0.4781790454 -0.2874472159 0.1413266990
-0.4781790454 -0.2874472159 0.1413266990
-0.4781790454 -0.2874472159 0.1413266990
-0.4781790454 -0.2874472159 0.1413266990
-0.4930279253 -0.4603236305 -0.0445480204
-0.4756907478 -0.4451021078 -0.0017289365
-0.4756907478 -0.4451021078 -0.0017289365
-0.4930279253 -0.4603236305 -0.0445480204
-0.4978278060 -0.4438351272 -0.0018518157
-0.4805004679 -0.4286051009 0.0409672000
-0.4805004679 -0.4286051009 0.0409672000
-0.4978278060 -0.4438351272 -0.0018518157
-0.4856074911 -0.4382661963 -0.1426173980
-0.4856074911 -0.4382661963 -0.1426173980
-0.4856074911 -0.4382661963 -0.1426173980
-0.4856074911 -0.4382661963 -0.1426173980
-0.4673151392 -0.2248776475 -0.1403670874
-0.4651706510 -0.2821100512 -0.1427724054
-0.4651706510 -0.2821100512 -0.1427724054
-0.4673151392 -0.2248776475 -0.1403670874
-0.4873005584 -0.2808532761 -0.1428952282
-0.4851560702 -0.3380856799 -0.1453005461
-0.4851560702 -0.3380856799 -0.1453005461
-0.4873005584 -0.2808532761 -0.1428952282
-0.4735362873 -0.4184366895 -0.1048669173
-0.4736977591 -0.4167445382 -0.0570909359
-0.4723210205 -0.3865476479 0.0208213433
-0.4745476002 -0.4301508320 -0.0482710940
-0.4745476002 -0.4301508320 -0.0482710940
-0.4723210205 -0.3865476479 0.0208213433
-0.4736977591 -0.4167445382 -0.0570909359
-0.4735362873 -0.4184366895 -0.1048669173
-0.4714454707 -0.3703989325 0.0358861137
-0.4721595487 -0.3882397993 -0.0269546382
-0.4721595487 -0.3882397993 -0.0269546382
-0.4714454707 -0.3703989325 0.0358861137
-0.4619136747 -0.2021868798 0.1286978082
-0.4634270052 -0.2304310824 0.0973035571
-0.4642699525 -0.2504030889 0.0344646543
-0.4645188620 -0.2486892818 0.0973287575
-0.4672966136 -0.3068914941 -0.0283238478
-0.4699018009 -0.3533938960 -0.0596928986
-0.4669995946 -0.2960485873 0.0345276551
-0.4649403357 -0.2586752850 0.0659093061
-0.4649403357 -0.2586752850 0.0659093061
-0.4669995946 -0.2960485873 0.0345276551
-0.4699018009 -0.3533938960 -0.0596928986
-0.4672966136 -0.3068914941 -0.0283238478
-0.4645188620 -0.2486892818 0.0973287575
-0.4642699525 -0.2504030889 0.0344646543
-0.4634270052 -0.2304310824 0.0973035571
-0.4619136747 -0.2021868798 0.1286978082
-0.4576456222 -0.1400662879 0.0299104677
-0.4568480138 -0.1244514216 0.0544060179
-0.4582475819 -0.1579313699 -0.0536762987
-0.4592408391 -0.1712960204 -0.0190806328
-0.4578412710 -0.1378160721 0.0890016838
-0.4594364879 -0.1690458047 0.0400105834
-0.4579390954 -0.1366909643 0.1185472919
-0.4596321366 -0.1667955890 0.0991017995
-0.4596321366 -0.1667955890 0.0991017995
-0.4579390954 -0.1366909643 0.1185472919
-0.4594364879 -0.1690458047 0.0400105834
-0.4578412710 -0.1378160721 0.0890016838
-0.4592408391 -0.1712960204 -0.0190806328
-0.4582475819 -0.1579313699 -0.0536762987
-0.4568480138 -0.1244514216 0.0544060179
-0.4576456222 -0.1400662879 0.0299104677
-0.4571448620 -0.1358498829 -0.0147297633
-0.4568480138 -0.1244514216 0.0544060179
-0.4568480138 -0.1244514216 0.0544060179
-0.4571448620 -0.1358498829 -0.0147297633
-0.4557929840 -0.1067337872 0.0550110070
-0.4554958250 -0.1057325628 0.0116327448
-0.4580461139 -0.1552606135 -0.0612236101
-0.4551219326 -0.1003792679 0.0015670754
-0.4551219326 -0.1003792679 0.0015670754
-0.4580461139 -0.1552606135 -0.0612236101
-0.4554958250 -0.1057325628 0.0116327448
-0.4557929840 -0.1067337872 0.0550110070
-0.4560525912 -0.1219751787 -0.0625259915
-0.4560525912 -0.1219751787 -0.0625259915
-0.4703680102 -0.3510524716 0.0509466838
-0.4715758489 -0.3774739890 -0.0169114579
-0.4715758489 -0.3774739890 -0.0169114579
-0.4703680102 -0.3510524716 0.0509466838
-0.4689227376 -0.3263461425 0.0559426247
-0.4691675035 -0.3331080809 0.0270337438
-0.4713470735 -0.3781002251 -0.0646888394
-0.4689343988 -0.3342787931 -0.0282860473
-0.4679553355 -0.3072310396 0.0873494759
-0.4669995946 -0.2960485873 0.0345276551
-0.4650647904 -0.2578183815 0.0973413576
-0.4679553355 -0.3072310396 0.0873494759
-0.4679553355 -0.3072310396 0.0873494759
-0.4650647904 -0.2578183815 0.0973413576
-0.4669995946 -0.2960485873 0.0345276551
-0.4679553355 -0.3072310396 0.0873494759
-0.4689343988 -0.3342787931 -0.0282860473
-0.4713470735 -0.3781002251 -0.0646888394
-0.4691675035 -0.3331080809 0.0270337438
-0.4689227376 -0.3263461425 0.0559426247
-0.2134937033 0.3814499724 -0.1218441667
-0.1215964231 0.3342111288 -0.1212608803
-0.1215964231 0.3342111288 -0.1212608803
-0.2134937033 0.3814499724 -0.1218441667
-0.3090004932 0.4203521899 -0.1224360102
-0.2171032553 0.3731133595 -0.1218449771
-0.2171032553 0.3731133595 -0.1218449771
-0.3090004932 0.4203521899 -0.1224360102
0.1666691621 0.2167635032 -0.1058589952
0.2612423983 0.1733207618 -0.0984564501
0.2612423983 0.1733207618 -0.0984564501
0.1666691621 0.2167635032 -0.1058589952
0.0702883580 0.2560344829 -0.1132622131
0.1630568393 0.2084234285 -0.1058639465
0.1630568393 0.2084234285 -0.1058639465
0.0702883580 0.2560344829 -0.1132622131
0.1057832907 0.2381775966 -0.0744391202
0.1057832907 0.2381775966 -0.0744391202
0.1057832907 0.2381775966 -0.0744391202
0.1057832907 0.2381775966 -0.0744391202
-0.0083490849 0.2826736020 -0.1023861353
0.0393887220 0.2619943095 -0.0986837931
0.1153190325 0.2291027209 -0.1095662887
0.0491613736 0.2577608114 -0.0895402031
0.2107946462 0.1877441360 -0.1021616043
0.2683051046 0.1628313454 -0.0893156721
0.1397506615 0.2185189756 -0.0867073137
0.0871265288 0.2413150171 -0.0949814509
0.0871265288 0.2413150171 -0.0949814509
0.1397506615 0.2185189756 -0.0867073137
0.2683051046 0.1628313454 -0.0893156721
0.2107946462 0.1877441360 -0.1021616043
0.0491613736 0.2577608114 -0.0895402031
0.1153190325 0.2291027209 -0.1095662887
0.0393887220 0.2619943095 -0.0986837931
-0.0083490849 0.2826736020 -0.1023861353
0.3699180691 0.1188090015 -0.0614343787
0.4269242457 0.0941123398 -0.0383734294
0.3447318973 0.1297111487 -0.0252549300
0.3699180691 0.1188090015 -0.0614343787
0.3699180691 0.1188090015 -0.0614343787
0.3447318973 0.1297111487 -0.0252549300
0.4269242457 0.0941123398 -0.0383734294
0.3699180691 0.1188090015 -0.0614343787
0.4607280348 0.0794506771 -0.0177213464
0.4607280348 0.0794506771 -0.0177213464
0.4357110085 0.0902931421 -0.0133308588
0.4357110085 0.0902931421 -0.0133308588
0.3784601286 0.1150826498 0.0090293010
0.3447318973 0.1297111487 -0.0252549300
0.4269242457 0.0941123398 -0.0383734294
0.4107695400 0.1011024432 -0.0225725192
0.4107695400 0.1011024432 -0.0225725192
0.4269242457 0.0941123398 -0.0383734294
0.3447318973 0.1297111487 -0.0252549300
0.3784601286 0.1150826498 0.0090293010
0.2895097890 0.1536340732 -0.0483087037
0.2360717490 0.1767832607 -0.0713553018
0.3146959608 0.1427319260 -0.0844881524
0.2895097890 0.1536340732 -0.0483087037
0.2895097890 0.1536340732 -0.0483087037
0.3146959608 0.1427319260 -0.0844881524
0.2360717490 0.1767832607 -0.0713553018
0.2895097890 0.1536340732 -0.0483087037
0.1503687869 0.2139083475 -0.0696163962
0.0968991805 0.2370815189 -0.0858378609
0.2254536236 0.1813938888 -0.0884462193
0.2753838549 0.1597575934 -0.0779217271
0.2753838549 0.1597575934 -0.0779217271
0.2254536236 0.1813938888 -0.0884462193
0.0968991805 0.2370815189 -0.0858378609
0.1503687869 0.2139083475 -0.0696163962
-0.0147302503 0.2854301445 -0.0774486025
-0.0602020222 0.3051206795 -0.0890854298
-0.0602020222 0.3051206795 -0.0890854298
-0.0147302503 0.2854301445 -0.0774486025
0.4643383435 0.0877934597 -0.0177158942
0.4643383435 0.0877934597 -0.0177158942
0.4393190489 0.0986283131 -0.0133155932
0.4393190489 0.0986283131 -0.0133155932
0.3820661194 0.1234130292 0.0090453383
0.3483390953 0.1380458362 -0.0252515469
0.4305334203 0.1024510540 -0.0383659106
0.4143776534 0.1094383791 -0.0225621610
0.4143776534 0.1094383791 -0.0225621610
0.4305334203 0.1024510540 -0.0383659106
0.3483390953 0.1380458362 -0.0252515469
0.3820661194 0.1234130292 0.0090453383
0.3735297301 0.1271491135 -0.0614309804
0.3483390953 0.1380458362 -0.0252515469
0.4305334203 0.1024510540 -0.0383659106
0.3735297301 0.1271491135 -0.0614309804
0.3735297301 0.1271491135 -0.0614309804
0.4305334203 0.1024510540 -0.0383659106
0.3483390953 0.1380458362 -0.0252515469
0.3735297301 0.1271491135 -0.0614309804
0.2931193578 0.1619712060 -0.0483053118
0.2396835730 0.1851238861 -0.0713477718
0.3183099926 0.1510744834 -0.0844847454
0.2931193578 0.1619712060 -0.0483053118
0.2931193578 0.1619712060 -0.0483053118
0.3183099926 0.1510744834 -0.0844847454
0.2396835730 0.1851238861 -0.0713477718
0.2931193578 0.1619712060 -0.0483053118
0.1539783121 0.2222452313 -0.0696078395
0.1005074199 0.2454138175 -0.0858334351
0.2290653112 0.1897317997 -0.0884433336
0.2789967828 0.1680991847 -0.0779162586
0.2789967828 0.1680991847 -0.0779162586
0.2290653112 0.1897317997 -0.0884433336
0.1005074199 0.2454138175 -0.0858334351
0.1539783121 0.2222452313 -0.0696078395
0.0907356606 0.2496493329 -0.0949762490
0.1433600503 0.2268531449 -0.0867034012
0.2719179416 0.1711711271 -0.0893132998
0.2144076722 0.1960850729 -0.1021575544
0.0527689098 0.2660922478 -0.0895348758
0.1189306520 0.2374419335 -0.1095604360
0.0429971505 0.2703277632 -0.0986776897
-0.0047413596 0.2910061935 -0.1023791305
-0.0047413596 0.2910061935 -0.1023791305
0.0429971505 0.2703277632 -0.0986776897
0.1189306520 0.2374419335 -0.1095604360
0.0527689098 0.2660922478 -0.0895348758
0.2144076722 0.1960850729 -0.1021575544
0.2719179416 0.1711711271 -0.0893132998
0.1433600503 0.2268531449 -0.0867034012
0.0907356606 0.2496493329 -0.0949762490
-0.0111230476 0.2937627690 -0.0774403094
-0.0565917730 0.3134614062 -0.0890727439
-0.0565917730 0.3134614062 -0.0890727439
-0.0111230476 0.2937627690 -0.0774403094
-0.2619369478 -0.3973883887 -0.1228380157
-0.1624707121 -0.3701517271 -0.1223392427
-0.1624707121 -0.3701517271 -0.1223392427
-0.2619369478 -0.3973883887 -0.1228380157
-0.3601071158 -0.4289801486 -0.1233243557
-0.2593433235 -0.4060989223 -0.1228053939
-0.2593433235 -0.4060989223 -0.1228053939
-0.3601071158 -0.4289801486 -0.1233243557
0.1351437112 -0.2791296836 -0.1072433848
0.2355145114 -0.2515941958 -0.0999303364
0.2355145114 -0.2515941958 -0.0999303364
0.1351437112 -0.2791296836 -0.1072433848
0.0373663239 -0.3153795778 -0.1145274212
0.1377371242 -0.2878440899 -0.1072143728
0.1377371242 -0.2878440899 -0.1072143728
0.0373663239 -0.3153795778 -0.1145274212
0.0747354290 -0.3017408241 -0.0757463005
0.0747354290 -0.3017408241 -0.0757463005
0.0747354290 -0.3017408241 -0.0757463005
0.0747354290 -0.3017408241 -0.0757463005
-0.0412942269 -0.3411245302 -0.1035605358
0.0085671563 -0.3262680117 -0.0999071199
0.0878757410 -0.3027006084 -0.1108677888
0.0187742472 -0.3231951949 -0.0907733695
0.1875985074 -0.2729875714 -0.1035609569
0.2476669815 -0.2550582361 -0.0907737906
0.1133934682 -0.2950185663 -0.0880334128
0.0584285395 -0.3114114932 -0.0962537039
0.0584285395 -0.3114114932 -0.0962537039
0.1133934682 -0.2950185663 -0.0880334128
0.2476669815 -0.2550582361 -0.0907737906
0.1875985074 -0.2729875714 -0.1035609569
0.0187742472 -0.3231951949 -0.0907733695
0.0878757410 -0.3027006084 -0.1108677888
0.0085671563 -0.3262680117 -0.0999071199
-0.0412942269 -0.3411245302 -0.1035605358
0.3537940543 -0.2233558376 -0.0629976084
0.4133299684 -0.2055391599 -0.0399959220
0.3274809346 -0.2310481589 -0.0267930935
0.3537940543 -0.2233558376 -0.0629976084
0.3537940543 -0.2233558376 -0.0629976084
0.3274809346 -0.2310481589 -0.0267930935
0.4133299684 -0.2055391599 -0.0399959220
0.3537940543 -0.2233558376 -0.0629976084
0.4486464738 -0.1949627375 -0.0193781378
0.4486464738 -0.1949627375 -0.0193781378
0.4225183063 -0.2027177547 -0.0149624926
0.4225183063 -0.2027177547 -0.0149624926
0.3627257000 -0.2204388014 0.0074563435
0.3274809346 -0.2310481589 -0.0267930935
0.4133299684 -0.2055391599 -0.0399959220
0.3964618789 -0.2105057070 -0.0241785002
0.3964618789 -0.2105057070 -0.0241785002
0.4133299684 -0.2055391599 -0.0399959220
0.3274809346 -0.2310481589 -0.0267930935
0.3627257000 -0.2204388014 0.0074563435
0.2698092981 -0.2483103437 -0.0497896915
0.2140019389 -0.2650180356 -0.0727812011
0.2961224177 -0.2406180225 -0.0859942064
0.2698092981 -0.2483103437 -0.0497896915
0.2698092981 -0.2483103437 -0.0497896915
0.2961224177 -0.2406180225 -0.0859942064
0.2140019389 -0.2650180356 -0.0727812011
0.2698092981 -0.2483103437 -0.0497896915
0.1244862634 -0.2916582558 -0.0709542826
0.0686356304 -0.3083386764 -0.0871199536
0.2029091437 -0.2683783461 -0.0898603313
0.2550621783 -0.2528180290 -0.0793877037
0.2550621783 -0.2528180290 -0.0793877037
0.2029091437 -0.2683783461 -0.0898603313
0.0686356304 -0.3083386764 -0.0871199536
0.1244862634 -0.2916582558 -0.0709542826
-0.0479591725 -0.3430182931 -0.0786163573
-0.0954524815 -0.3572033234 -0.0902071804
-0.0954524815 -0.3572033234 -0.0902071804
-0.0479591725 -0.3430182931 -0.0786163573
0.4460548871 -0.1862541315 -0.0194071299
0.4460548871 -0.1862541315 -0.0194071299
0.4199280802 -0.1940149075 -0.0149816546
0.4199280802 -0.1940149075 -0.0149816546
0.3601390382 -0.2117403051 0.0074379831
0.3248977129 -0.2223478160 -0.0268240917
0.4107410934 -0.1968343345 -0.0400228270
0.3938737416 -0.2018029914 -0.0242025570
0.3938737416 -0.2018029914 -0.0242025570
0.4107410934 -0.1968343345 -0.0400228270
0.3248977129 -0.2223478160 -0.0268240917
0.3601390382 -0.2117403051 0.0074379831
0.3512036847 -0.2146452376 -0.0630286631
0.3248977129 -0.2223478160 -0.0268240917
0.4107410934 -0.1968343345 -0.0400228270
0.3512036847 -0.2146452376 -0.0630286631
0.3512036847 -0.2146452376 -0.0630286631
0.4107410934 -0.1968343345 -0.0400228270
0.3248977129 -0.2223478160 -0.0268240917
0.3512036847 -0.2146452376 -0.0630286631
0.2672227287 -0.2396028162 -0.0498207202
0.2114101690 -0.2563019137 -0.0728081411
0.2935287006 -0.2319002379 -0.0860252916
0.2672227287 -0.2396028162 -0.0498207202
0.2672227287 -0.2396028162 -0.0498207202
0.2935287006 -0.2319002379 -0.0860252916
0.2114101690 -0.2563019137 -0.0728081411
0.2672227287 -0.2396028162 -0.0498207202
0.1218943184 -0.2829449676 -0.0709801858
0.0660404146 -0.2996285615 -0.0871500010
0.2003141905 -0.2596639807 -0.0898919339
0.2524694348 -0.2441010758 -0.0794167164
0.2524694348 -0.2441010758 -0.0794167164
0.2003141905 -0.2596639807 -0.0898919339
0.0660404146 -0.2996285615 -0.0871500010
0.1218943184 -0.2829449676 -0.0709801858
0.0558341376 -0.3027006494 -0.0962827152
0.1107983399 -0.2863070345 -0.0880639786
0.2450721158 -0.2463424538 -0.0908059116
0.1850047750 -0.2642721127 -0.1035910053
0.0161793508 -0.3144861324 -0.0908023804
0.0852826473 -0.2939872545 -0.1108957642
0.0059730738 -0.3175582204 -0.0999350947
-0.0438879900 -0.3324157913 -0.1035874742
-0.0438879900 -0.3324157913 -0.1035874742
0.0059730738 -0.3175582204 -0.0999350947
0.0852826473 -0.2939872545 -0.1108957642
0.0161793508 -0.3144861324 -0.0908023804
0.1850047750 -0.2642721127 -0.1035910053
0.2450721158 -0.2463424538 -0.0908059116
0.1107983399 -0.2863070345 -0.0880639786
0.0558341376 -0.3027006494 -0.0962827152
-0.0505526064 -0.3343082789 -0.0786422631
-0.0980423309 -0.3484891186 -0.0902279091
-0.0980423309 -0.3484891186 -0.0902279091
-0.0505526064 -0.3343082789 -0.0786422631
3 198 892 196
3 140 892 198
3 197 893 196
3 198 893 197
3 199 894 197
3 125 894 199
3 197 895 199
3 196 895 197
3 201 896 200
3 140 896 201
3 201 897 196
3 200 897 201
3 202 898 200
3 145 898 202
3 202 899 140
3 200 899 202
3 205 900 204
3 140 900 205
3 205 901 145
3 204 901 205
3 206 902 204
3 203 902 206
3 206 903 140
3 204 903 206
3 207 904 203
3 208 904 207
3 208 905 125
3 207 905 208
3 207 906 209
3 203 906 207
3 209 907 140
3 203 907 209
3 88 908 140
3 210 908 88
3 210 909 125
3 88 909 210
3 211 910 88
3 125 910 211
3 88 911 211
3 140 911 88
3 182 912 99
3 1 912 182
3 182 913 1
3 99 913 182
3 98 99 182
3 182 99 98
3 34 98 182
3 182 98 34
3 212 213 99
3 1 213 212
3 99 214 212
3 157 214 99
3 99 216 157
3 215 216 99
3 215 217 1
3 99 217 215
3 157 914 23
3 219 914 157
3 219 915 218
3 157 915 219
3 220 916 218
3 1 916 220
3 218 917 220
3 157 917 218
3 221 918 157
3 222 918 221
3 222 919 1
3 221 919 222
3 223 920 157
3 221 920 223
3 157 921 223
3 23 921 157
3 224 922 23
3 1 922 224
3 23 923 224
3 167 923 23
3 23 924 167
3 225 924 23
3 225 925 1
3 23 925 225
3 226 926 228
3 227 926 226
3 228 927 167
3 227 927 228
3 229 928 227
3 1 928 229
3 227 929 229
3 226 929 227
3 231 930 230
3 167 930 231
3 231 931 226
3 230 931 231
3 232 932 192
3 167 932 232
3 232 933 230
3 192 933 232
3 235 934 192
3 234 934 235
3 235 935 167
3 192 935 235
3 236 936 234
3 233 936 236
3 236 937 167
3 234 937 236
3 237 938 233
3 238 938 237
3 238 939 1
3 237 939 238
3 239 940 237
3 167 940 239
3 233 941 237
3 239 941 233
3 243 244 242
3 241 244 243
3 243 245 240
3 242 245 243
3 246 247 242
3 1 247 246
3 246 248 241
3 242 248 246
3 250 251 249
3 241 251 250
3 250 252 192
3 249 252 250
3 253 254 249
3 240 254 253
3 253 255 241
3 249 255 253
3 258 259 257
3 256 259 258
3 258 260 240
3 257 260 258
3 261 262 257
3 125 262 261
3 261 263 256
3 257 263 261
3 265 266 264
3 256 266 265
3 265 267 1
3 264 267 265
3 268 269 264
3 240 269 268
3 268 270 256
3 264 270 268
3 274 275 273
3 272 275 274
3 274 276 271
3 273 276 274
3 277 278 273
3 1 278 277
3 277 279 272
3 273 279 277
3 281 282 280
3 272 282 281
3 281 283 125
3 280 283 281
3 284 285 280
3 271 285 284
3 284 286 272
3 280 286 284
3 289 290 288
3 287 290 289
3 289 291 271
3 288 291 289
3 292 293 288
3 192 293 292
3 292 294 287
3 288 294 292
3 296 297 295
3 287 297 296
3 296 298 1
3 295 298 296
3 299 300 295
3 271 300 299
3 299 301 287
3 295 301 299
3 304 942 145
3 192 942 304
3 304 943 303
3 145 943 304
3 305 944 303
3 302 944 305
3 303 945 305
3 145 945 303
3 306 946 302
3 307 946 306
3 307 947 125
3 306 947 307
3 302 948 306
3 308 948 302
3 308 949 145
3 302 949 308
3 311 950 309
3 145 950 311
3 309 951 311
3 310 951 309
3 312 952 310
3 125 952 312
3 310 953 312
3 309 953 310
3 313 954 145
3 314 954 313
3 314 955 309
3 313 955 314
3 315 956 145
3 313 956 315
3 315 957 192
3 145 957 315
3 124 958 88
3 316 958 124
3 316 959 125
3 124 959 316
3 317 960 124
3 125 960 317
3 124 961 317
3 88 961 124
3 319 962 62
3 125 962 319
3 319 963 318
3 62 963 319
3 320 964 318
3 124 964 320
3 318 965 320
3 62 965 318
3 321 966 62
3 322 966 321
3 322 967 124
3 321 967 322
3 323 968 62
3 321 968 323
3 323 969 125
3 62 969 323
3 57 125 62
3 62 125 57
3 154 28 107
3 107 28 154
3 77 28 107
3 107 28 77
3 43 6 154
3 154 6 43
3 28 6 154
3 154 6 28
3 30 63 43
3 43 63 30
3 6 63 43
3 43 63 6
3 126 14 30
3 30 14 126
3 63 14 30
3 30 14 63
3 136 59 126
3 126 59 136
3 14 59 126
3 126 59 14
3 324 970 176
3 136 970 324
3 21 971 176
3 324 971 21
3 21 972 325
3 176 972 21
3 325 973 136
3 176 973 325
3 136 974 326
3 59 974 136
3 326 975 21
3 59 975 326
3 327 976 59
3 21 976 327
3 136 977 59
3 327 977 136
3 10 978 176
3 108 978 10
3 10 979 108
3 176 979 10
3 21 980 176
3 108 980 21
3 21 981 108
3 176 981 21
3 82 69 10
3 10 69 82
3 108 69 10
3 10 69 108
3 81 68 82
3 82 68 81
3 69 68 82
3 82 68 69
3 123 129 81
3 81 129 123
3 68 129 81
3 81 129 68
3 328 982 121
3 123 982 328
3 121 983 328
3 150 983 121
3 121 984 150
3 329 984 121
3 329 985 123
3 121 985 329
3 129 986 123
3 330 986 129
3 330 987 150
3 129 987 330
3 331 988 129
3 150 988 331
3 129 989 331
3 123 989 129
3 116 46 121
3 121 46 116
3 150 46 121
3 121 46 150
3 114 45 116
3 116 45 114
3 46 45 116
3 116 45 46
3 105 990 114
3 65 990 105
3 105 991 65
3 114 991 105
3 45 992 114
3 65 992 45
3 45 993 65
3 114 993 45
3 137 60 105
3 105 60 137
3 65 60 105
3 105 60 65
3 189 33 137
3 137 33 189
3 60 33 137
3 137 33 60
3 173 80 189
3 189 80 173
3 33 80 189
3 189 80 33
3 131 26 173
3 173 26 131
3 80 26 173
3 173 26 80
3 13 195 131
3 131 195 13
3 26 195 131
3 131 195 26
3 15 191 13
3 13 191 15
3 195 191 13
3 13 191 195
3 106 76 15
3 15 76 106
3 191 76 15
3 15 76 191
3 107 77 106
3 106 77 107
3 76 77 106
3 106 77 76
3 190 34 38
3 38 34 190
3 98 34 38
3 38 34 98
3 172 182 190
3 190 182 172
3 34 182 190
3 190 182 34
3 143 1 172
3 172 1 143
3 182 1 172
3 172 1 182
3 332 994 3
3 143 994 332
3 125 995 3
3 332 995 125
3 125 996 333
3 3 996 125
3 333 997 143
3 3 997 333
3 143 998 334
3 1 998 143
3 334 999 125
3 1 999 334
3 335 1000 1
3 125 1000 335
3 143 1001 1
3 335 1001 143
3 155 57 3
3 3 57 155
3 125 57 3
3 3 57 125
3 158 62 155
3 155 62 158
3 57 62 155
3 155 62 57
3 336 1002 115
3 158 1002 336
3 115 1003 336
3 124 1003 115
3 115 1004 124
3 337 1004 115
3 337 1005 158
3 115 1005 337
3 62 1006 158
3 338 1006 62
3 338 1007 124
3 62 1007 338
3 339 1008 62
3 124 1008 339
3 62 1009 339
3 158 1009 62
3 84 88 115
3 115 88 84
3 124 88 115
3 115 88 124
3 185 140 84
3 84 140 185
3 88 140 84
3 84 140 88
3 35 1010 185
3 145 1010 35
3 35 1011 145
3 185 1011 35
3 140 1012 185
3 145 1012 140
3 140 1013 145
3 185 1013 140
3 183 192 35
3 35 192 183
3 145 192 35
3 35 192 145
3 27 167 183
3 183 167 27
3 192 167 183
3 183 167 192
3 95 23 27
3 27 23 95
3 167 23 27
3 27 23 167
3 71 157 95
3 95 157 71
3 23 157 95
3 95 157 23
3 39 99 71
3 71 99 39
3 157 99 71
3 71 99 157
3 38 98 39
3 39 98 38
3 99 98 39
3 39 98 99
3 107 77 106
3 106 77 107
3 76 77 106
3 106 77 76
3 77 1014 28
3 76 1014 77
3 77 1015 76
3 28 1015 77
3 191 6 28
3 28 6 191
3 6 1016 63
3 98 1016 6
3 6 1017 98
3 63 1017 6
3 34 14 63
3 63 14 34
3 182 1018 14
3 59 1018 182
3 182 1019 59
3 14 1019 182
3 340 1020 125
3 59 1020 340
3 125 1021 340
3 21 1021 125
3 125 1022 21
3 341 1022 125
3 341 1023 59
3 125 1023 341
3 21 1024 108
3 125 1024 21
3 21 1025 125
3 108 1025 21
3 57 69 108
3 108 69 57
3 57 68 69
3 69 68 57
3 57 129 68
3 68 129 57
3 342 1026 124
3 129 1026 342
3 150 1027 124
3 342 1027 150
3 150 1028 343
3 124 1028 150
3 343 1029 129
3 124 1029 343
3 88 46 150
3 150 46 88
3 140 45 46
3 46 45 140
3 145 1030 45
3 65 1030 145
3 145 1031 65
3 45 1031 145
3 192 60 65
3 65 60 192
3 167 33 60
3 60 33 167
3 167 80 33
3 33 80 167
3 23 26 80
3 80 26 23
3 157 195 26
3 26 195 157
3 6 191 195
3 195 191 6
3 28 76 191
3 191 76 28
3 34 1032 63
3 98 1032 34
3 34 1033 98
3 63 1033 34
3 14 182 34
3 34 182 14
3 59 1 182
3 182 1 59
3 344 1034 1
3 345 1034 344
3 345 1035 125
3 344 1035 345
3 346 1036 1
3 344 1036 346
3 59 1037 1
3 346 1037 59
3 59 1038 348
3 1 1038 59
3 348 1039 347
3 1 1039 348
3 349 1040 347
3 125 1040 349
3 347 1041 349
3 1 1041 347
3 57 1042 108
3 125 1042 57
3 57 1043 125
3 108 1043 57
3 129 62 57
3 57 62 129
3 350 1044 62
3 124 1044 350
3 62 1045 350
3 129 1045 62
3 62 1046 129
3 351 1046 62
3 351 1047 124
3 62 1047 351
3 150 88 124
3 124 88 150
3 46 140 88
3 88 140 46
3 140 1048 145
3 45 1048 140
3 140 1049 45
3 145 1049 140
3 65 192 145
3 145 192 65
3 60 167 192
3 192 167 60
3 80 23 167
3 167 23 80
3 26 157 23
3 23 157 26
3 195 1050 157
3 99 1050 195
3 195 1051 99
3 157 1051 195
3 195 98 99
3 99 98 195
3 98 195 6
3 6 195 98
3 13 1052 39
3 71 1052 13
3 13 1053 71
3 39 1053 13
3 131 13 71
3 71 13 131
3 95 71 131
3 131 71 95
3 173 131 95
3 95 131 173
3 27 95 173
3 173 95 27
3 189 173 27
3 27 173 189
3 137 189 27
3 27 189 137
3 183 27 137
3 137 27 183
3 105 137 183
3 183 137 105
3 35 183 105
3 105 183 35
3 35 1054 105
3 114 1054 35
3 35 1055 114
3 105 1055 35
3 185 1056 114
3 35 1056 185
3 185 1057 35
3 114 1057 185
3 116 114 185
3 185 114 116
3 84 185 116
3 116 185 84
3 121 116 84
3 84 116 121
3 115 84 121
3 121 84 115
3 121 1058 352
3 115 1058 121
3 352 1059 123
3 115 1059 352
3 353 1060 115
3 123 1060 353
3 121 1061 115
3 353 1061 121
3 158 1062 123
3 354 1062 158
3 354 1063 115
3 158 1063 354
3 355 1064 158
3 115 1064 355
3 158 1065 355
3 123 1065 158
3 155 123 158
3 158 123 155
3 81 155 123
3 123 155 81
3 82 81 155
3 155 81 82
3 10 82 155
3 155 82 10
3 155 1066 3
3 10 1066 155
3 155 1067 10
3 3 1067 155
3 176 1068 3
3 10 1068 176
3 176 1069 10
3 3 1069 176
3 3 1070 176
3 356 1070 3
3 356 1071 136
3 3 1071 356
3 357 1072 3
3 136 1072 357
3 3 1073 357
3 176 1073 3
3 136 1074 359
3 143 1074 136
3 359 1075 358
3 143 1075 359
3 360 1076 358
3 3 1076 360
3 358 1077 360
3 143 1077 358
3 361 1078 143
3 362 1078 361
3 362 1079 3
3 361 1079 362
3 363 1080 143
3 361 1080 363
3 136 1081 143
3 363 1081 136
3 172 136 143
3 143 136 172
3 172 1082 126
3 136 1082 172
3 172 1083 136
3 126 1083 172
3 190 126 172
3 172 126 190
3 30 190 126
3 126 190 30
3 190 1084 38
3 30 1084 190
3 190 1085 30
3 38 1085 190
3 43 1086 30
3 38 1086 43
3 43 1087 38
3 30 1087 43
3 13 38 43
3 43 38 13
3 38 13 39
3 39 13 38
3 15 13 43
3 43 13 15
3 154 43 15
3 15 43 154
3 106 15 154
3 154 15 106
3 107 1088 106
3 154 1088 107
3 107 1089 154
3 106 1089 107
3 107 1090 106
3 54 1090 107
3 107 1091 54
3 106 1091 107
3 106 186 54
3 54 186 106
3 54 164 186
3 186 164 54
3 186 188 164
3 164 188 186
3 165 188 166
3 166 188 165
3 188 165 164
3 164 165 188
3 164 1092 174
3 165 1092 164
3 164 1093 165
3 174 1093 164
3 12 1094 165
3 174 1094 12
3 12 1095 174
3 165 1095 12
3 174 12 85
3 85 12 174
3 12 85 32
3 32 85 12
3 32 1096 85
3 78 1096 32
3 32 1097 78
3 85 1097 32
3 32 78 67
3 67 78 32
3 78 1098 365
3 67 1098 78
3 365 1099 364
3 67 1099 365
3 366 1100 364
3 0 1100 366
3 364 1101 366
3 67 1101 364
3 367 1102 67
3 368 1102 367
3 368 1103 0
3 367 1103 368
3 369 1104 67
3 367 1104 369
3 78 1105 67
3 369 1105 78
3 0 1106 24
3 370 1106 0
3 370 1107 78
3 0 1107 370
3 371 1108 0
3 78 1108 371
3 0 1109 371
3 24 1109 0
3 24 1110 0
3 179 1110 24
3 24 1111 179
3 0 1111 24
3 61 1112 0
3 179 1112 61
3 61 1113 179
3 0 1113 61
3 179 134 61
3 61 134 179
3 134 133 61
3 61 133 134
3 133 61 113
3 113 61 133
3 61 113 52
3 52 113 61
3 52 1114 113
3 372 1114 52
3 372 1115 94
3 52 1115 372
3 373 1116 52
3 94 1116 373
3 52 1117 373
3 113 1117 52
3 75 1118 374
3 94 1118 75
3 374 1119 113
3 94 1119 374
3 375 1120 94
3 113 1120 375
3 75 1121 94
3 375 1121 75
3 94 130 75
3 75 130 94
3 75 89 130
3 130 89 75
3 130 16 89
3 89 16 130
3 89 91 16
3 16 91 89
3 16 1122 91
3 168 1122 16
3 16 1123 168
3 91 1123 16
3 168 1124 102
3 91 1124 168
3 168 1125 91
3 102 1125 168
3 168 17 102
3 102 17 168
3 102 79 17
3 17 79 102
3 17 178 79
3 79 178 17
3 79 11 178
3 178 11 79
3 11 31 178
3 178 31 11
3 178 112 31
3 31 112 178
3 31 83 112
3 112 83 31
3 112 142 83
3 83 142 112
3 83 188 142
3 142 188 83
3 188 1126 166
3 142 1126 188
3 188 1127 142
3 166 1127 188
3 109 5 194
3 194 5 109
3 5 109 110
3 110 109 5
3 5 1128 51
3 110 1128 5
3 5 1129 110
3 51 1129 5
3 175 51 184
3 184 51 175
3 135 184 36
3 36 184 135
3 149 36 8
3 8 36 149
3 144 8 64
3 64 8 144
3 73 1130 64
3 161 1130 73
3 73 1131 161
3 64 1131 73
3 160 73 120
3 120 73 160
3 56 120 87
3 87 120 56
3 376 1132 132
3 87 1132 376
3 132 1133 376
3 96 1133 132
3 132 1134 96
3 377 1134 132
3 377 1135 87
3 132 1135 377
3 96 132 139
3 139 132 96
3 139 1136 74
3 86 1136 139
3 139 1137 86
3 74 1137 139
3 378 1138 2
3 379 1138 378
3 379 1139 86
3 378 1139 379
3 380 1140 2
3 378 1140 380
3 148 1141 2
3 380 1141 148
3 148 1142 382
3 2 1142 148
3 382 1143 381
3 2 1143 382
3 383 1144 381
3 86 1144 383
3 381 1145 383
3 2 1145 381
3 148 2 19
3 19 2 148
3 187 19 170
3 170 19 187
3 170 1146 146
3 109 1146 170
3 170 1147 109
3 146 1147 170
3 177 76 9
3 9 76 177
3 194 9 5
3 5 9 194
3 51 5 175
3 175 5 51
3 184 175 135
3 135 175 184
3 36 135 169
3 169 135 36
3 36 169 149
3 149 169 36
3 8 149 144
3 144 149 8
3 64 1148 161
3 144 1148 64
3 64 1149 144
3 161 1149 64
3 73 161 160
3 160 161 73
3 120 160 56
3 56 160 120
3 384 1150 87
3 96 1150 384
3 56 1151 87
3 384 1151 56
3 56 1152 385
3 87 1152 56
3 385 1153 96
3 87 1153 385
3 139 96 103
3 103 96 139
3 139 103 104
3 104 103 139
3 139 104 74
3 74 104 139
3 180 1154 74
3 86 1154 180
3 180 1155 86
3 74 1155 180
3 386 1156 86
3 148 1156 386
3 86 1157 386
3 180 1157 86
3 86 1158 180
3 387 1158 86
3 387 1159 148
3 86 1159 387
3 19 1160 187
3 148 1160 19
3 19 1161 148
3 187 1161 19
3 170 187 146
3 146 187 170
3 194 1162 146
3 109 1162 194
3 194 1163 109
3 146 1163 194
3 9 194 177
3 177 194 9
3 77 1164 177
3 76 1164 77
3 77 1165 76
3 177 1165 77
3 76 77 106
3 106 77 76
3 107 77 106
3 106 77 107
3 110 109 166
3 166 109 110
3 165 109 166
3 166 109 165
3 51 110 142
3 142 110 51
3 166 110 142
3 142 110 166
3 184 51 112
3 112 51 184
3 142 51 112
3 112 51 142
3 36 184 178
3 178 184 36
3 112 184 178
3 178 184 112
3 8 36 17
3 17 36 8
3 178 36 17
3 17 36 178
3 64 8 168
3 168 8 64
3 17 8 168
3 168 8 17
3 73 1166 16
3 64 1166 73
3 73 1167 64
3 16 1167 73
3 168 1168 16
3 64 1168 168
3 168 1169 64
3 16 1169 168
3 120 73 130
3 130 73 120
3 16 73 130
3 130 73 16
3 87 120 94
3 94 120 87
3 130 120 94
3 94 120 130
3 132 1170 52
3 388 1170 132
3 388 1171 87
3 132 1171 388
3 389 1172 132
3 87 1172 389
3 132 1173 389
3 52 1173 132
3 390 1174 94
3 52 1174 390
3 94 1175 390
3 87 1175 94
3 94 1176 87
3 391 1176 94
3 391 1177 52
3 94 1177 391
3 139 132 61
3 61 132 139
3 52 132 61
3 61 132 52
3 86 139 0
3 0 139 86
3 61 139 0
3 0 139 61
3 67 1178 392
3 2 1178 67
3 392 1179 86
3 2 1179 392
3 393 1180 2
3 86 1180 393
3 67 1181 2
3 393 1181 67
3 394 1182 0
3 67 1182 394
3 86 1183 0
3 394 1183 86
3 86 1184 395
3 0 1184 86
3 395 1185 67
3 0 1185 395
3 19 2 32
3 32 2 19
3 67 2 32
3 32 2 67
3 170 19 12
3 12 19 170
3 32 19 12
3 12 19 32
3 109 170 165
3 165 170 109
3 12 170 165
3 165 170 12
3 76 77 106
3 106 77 76
3 107 77 106
3 106 77 107
3 9 76 186
3 186 76 9
3 106 76 186
3 186 76 106
3 5 9 188
3 188 9 5
3 186 9 188
3 188 9 186
3 175 5 83
3 83 5 175
3 188 5 83
3 83 5 188
3 135 175 31
3 31 175 135
3 83 175 31
3 31 175 83
3 169 135 11
3 11 135 169
3 31 135 11
3 11 135 31
3 149 169 79
3 79 169 149
3 11 169 79
3 79 169 11
3 144 149 102
3 102 149 144
3 79 149 102
3 102 149 79
3 161 1186 91
3 144 1186 161
3 161 1187 144
3 91 1187 161
3 102 1188 91
3 144 1188 102
3 102 1189 144
3 91 1189 102
3 160 161 89
3 89 161 160
3 91 161 89
3 89 161 91
3 56 160 75
3 75 160 56
3 89 160 75
3 75 160 89
3 96 1190 113
3 396 1190 96
3 396 1191 56
3 96 1191 396
3 397 1192 96
3 56 1192 397
3 96 1193 397
3 113 1193 96
3 398 1194 75
3 113 1194 398
3 75 1195 398
3 56 1195 75
3 75 1196 56
3 399 1196 75
3 399 1197 113
3 75 1197 399
3 103 96 133
3 133 96 103
3 113 96 133
3 133 96 113
3 104 103 134
3 134 103 104
3 133 103 134
3 134 103 133
3 74 104 179
3 179 104 74
3 134 104 179
3 179 104 134
3 180 1198 24
3 74 1198 180
3 180 1199 74
3 24 1199 180
3 179 1200 24
3 74 1200 179
3 179 1201 74
3 24 1201 179
3 78 1202 400
3 148 1202 78
3 400 1203 180
3 148 1203 400
3 401 1204 148
3 180 1204 401
3 78 1205 148
3 401 1205 78
3 402 1206 24
3 78 1206 402
3 180 1207 24
3 402 1207 180
3 180 1208 403
3 24 1208 180
3 403 1209 78
3 24 1209 403
3 187 148 85
3 85 148 187
3 78 148 85
3 85 148 78
3 146 187 174
3 174 187 146
3 85 187 174
3 174 187 85
3 194 146 164
3 164 146 194
3 174 146 164
3 164 146 174
3 177 194 54
3 54 194 177
3 164 194 54
3 54 194 164
3 77 177 107
3 107 177 77
3 54 177 107
3 107 177 54
3 139 86 132
3 132 86 139
3 405 1210 132
3 86 1210 405
3 405 1211 404
3 132 1211 405
3 406 1212 404
3 87 1212 406
3 404 1213 406
3 132 1213 404
3 407 1214 132
3 408 1214 407
3 408 1215 87
3 407 1215 408
3 409 1216 132
3 407 1216 409
3 409 1217 86
3 132 1217 409
3 87 1218 120
3 410 1218 87
3 410 1219 86
3 87 1219 410
3 411 1220 87
3 86 1220 411
3 87 1221 411
3 120 1221 87
3 414 1222 64
3 8 1222 414
3 414 1223 413
3 64 1223 414
3 415 1224 413
3 412 1224 415
3 413 1225 415
3 64 1225 413
3 416 1226 412
3 417 1226 416
3 417 1227 86
3 416 1227 417
3 412 1228 416
3 418 1228 412
3 418 1229 64
3 412 1229 418
3 421 1230 419
3 64 1230 421
3 419 1231 421
3 420 1231 419
3 422 1232 420
3 86 1232 422
3 420 1233 422
3 419 1233 420
3 423 1234 64
3 424 1234 423
3 424 1235 419
3 423 1235 424
3 425 1236 64
3 423 1236 425
3 425 1237 8
3 64 1237 425
3 429 430 428
3 427 430 429
3 429 431 426
3 428 431 429
3 432 433 428
3 2 433 432
3 432 434 427
3 428 434 432
3 436 437 435
3 427 437 436
3 436 438 8
3 435 438 436
3 439 440 435
3 426 440 439
3 439 441 427
3 435 441 439
3 444 445 443
3 442 445 444
3 444 446 426
3 443 446 444
3 447 448 443
3 86 448 447
3 447 449 442
3 443 449 447
3 451 452 450
3 442 452 451
3 451 453 2
3 450 453 451
3 454 455 450
3 426 455 454
3 454 456 442
3 450 456 454
3 460 461 459
3 458 461 460
3 460 462 457
3 459 462 460
3 463 464 459
3 2 464 463
3 463 465 458
3 459 465 463
3 467 468 466
3 458 468 467
3 467 469 86
3 466 469 467
3 470 471 466
3 457 471 470
3 470 472 458
3 466 472 470
3 475 476 474
3 473 476 475
3 475 477 457
3 474 477 475
3 478 479 474
3 8 479 478
3 478 480 473
3 474 480 478
3 482 483 481
3 473 483 482
3 482 484 2
3 481 484 482
3 485 486 481
3 457 486 485
3 485 487 473
3 481 487 485
3 488 1238 490
3 489 1238 488
3 490 1239 36
3 489 1239 490
3 491 1240 489
3 2 1240 491
3 489 1241 491
3 488 1241 489
3 493 1242 492
3 36 1242 493
3 493 1243 488
3 492 1243 493
3 494 1244 8
3 36 1244 494
3 494 1245 492
3 8 1245 494
3 497 1246 8
3 496 1246 497
3 497 1247 36
3 8 1247 497
3 498 1248 496
3 495 1248 498
3 498 1249 36
3 496 1249 498
3 499 1250 495
3 500 1250 499
3 500 1251 2
3 499 1251 500
3 501 1252 499
3 36 1252 501
3 495 1253 499
3 501 1253 495
3 502 1254 184
3 2 1254 502
3 184 1255 502
3 36 1255 184
3 184 1256 36
3 503 1256 184
3 503 1257 2
3 184 1257 503
3 51 1258 184
3 505 1258 51
3 505 1259 504
3 51 1259 505
3 506 1260 504
3 2 1260 506
3 504 1261 506
3 51 1261 504
3 507 1262 51
3 508 1262 507
3 508 1263 2
3 507 1263 508
3 509 1264 51
3 507 1264 509
3 51 1265 509
3 184 1265 51
3 510 511 110
3 2 511 510
3 110 512 510
3 51 512 110
3 110 514 51
3 513 514 110
3 513 515 2
3 110 515 513
3 170 109 19
3 19 109 170
3 109 110 19
3 19 110 109
3 19 1266 110
3 2 1266 19
3 19 1267 2
3 110 1267 19
3 120 1268 73
3 516 1268 120
3 516 1269 86
3 120 1269 516
3 517 1270 120
3 86 1270 517
3 120 1271 517
3 73 1271 120
3 520 1272 518
3 73 1272 520
3 519 1273 518
3 520 1273 519
3 521 1274 519
3 86 1274 521
3 519 1275 521
3 518 1275 519
3 523 1276 522
3 73 1276 523
3 523 1277 518
3 522 1277 523
3 524 1278 522
3 64 1278 524
3 524 1279 73
3 522 1279 524
3 527 1280 526
3 73 1280 527
3 527 1281 64
3 526 1281 527
3 528 1282 526
3 525 1282 528
3 528 1283 73
3 526 1283 528
3 529 1284 525
3 530 1284 529
3 530 1285 86
3 529 1285 530
3 529 1286 531
3 525 1286 529
3 531 1287 73
3 525 1287 531
3 532 1288 40
3 151 1288 532
3 40 1289 532
3 127 1289 40
3 40 1290 127
3 533 1290 40
3 533 1291 151
3 40 1291 533
3 58 1292 151
3 534 1292 58
3 534 1293 127
3 58 1293 534
3 535 1294 58
3 127 1294 535
3 58 1295 535
3 151 1295 58
3 536 1296 117
3 40 1296 536
3 70 1297 117
3 536 1297 70
3 70 1298 537
3 117 1298 70
3 537 1299 40
3 117 1299 537
3 127 1300 40
3 538 1300 127
3 538 1301 70
3 127 1301 538
3 539 1302 127
3 70 1302 539
3 127 1303 539
3 40 1303 127
3 119 100 117
3 117 100 119
3 70 100 117
3 117 100 70
3 163 47 119
3 119 47 163
3 100 47 119
3 119 47 100
3 162 53 163
3 163 53 162
3 47 53 163
3 163 53 47
3 29 72 162
3 162 72 29
3 53 72 162
3 162 72 53
3 141 147 29
3 29 147 141
3 72 147 29
3 29 147 72
3 159 42 141
3 141 42 159
3 147 42 141
3 141 42 147
3 181 1304 159
3 111 1304 181
3 181 1305 111
3 159 1305 181
3 42 1306 159
3 111 1306 42
3 42 1307 111
3 159 1307 42
3 25 93 181
3 181 93 25
3 111 93 181
3 181 93 111
3 90 540 25
3 22 540 90
3 90 541 22
3 25 541 90
3 93 542 25
3 22 542 93
3 93 543 22
3 25 543 93
3 151 58 90
3 90 58 151
3 22 58 90
3 90 58 22
3 546 547 544
3 93 547 546
3 544 548 546
3 545 548 544
3 549 550 545
3 58 550 549
3 545 551 549
3 544 551 545
3 552 554 93
3 553 554 552
3 553 555 544
3 552 555 553
3 556 557 93
3 552 557 556
3 556 558 127
3 93 558 556
3 561 562 93
3 127 562 561
3 561 563 560
3 93 563 561
3 564 565 560
3 559 565 564
3 560 566 564
3 93 566 560
3 567 569 559
3 568 569 567
3 568 570 58
3 567 570 568
3 559 572 567
3 571 572 559
3 571 573 93
3 559 573 571
3 576 1308 111
3 127 1308 576
3 576 1309 575
3 111 1309 576
3 577 1310 575
3 574 1310 577
3 575 1311 577
3 111 1311 575
3 578 1312 574
3 579 1312 578
3 579 1313 70
3 578 1313 579
3 574 1314 578
3 580 1314 574
3 580 1315 111
3 574 1315 580
3 583 1316 581
3 111 1316 583
3 581 1317 583
3 582 1317 581
3 584 1318 582
3 70 1318 584
3 582 1319 584
3 581 1319 582
3 585 1320 111
3 586 1320 585
3 586 1321 581
3 585 1321 586
3 587 1322 111
3 585 1322 587
3 587 1323 127
3 111 1323 587
3 589 1324 588
3 70 1324 589
3 589 1325 100
3 588 1325 589
3 590 1326 588
3 147 1326 590
3 590 1327 70
3 588 1327 590
3 592 1328 591
3 70 1328 592
3 592 1329 147
3 591 1329 592
3 593 1330 591
3 100 1330 593
3 593 1331 70
3 591 1331 593
3 47 1332 53
3 100 1332 47
3 47 1333 100
3 53 1333 47
3 53 1334 72
3 100 1334 53
3 53 1335 100
3 72 1335 53
3 594 1336 72
3 595 1336 594
3 595 1337 147
3 594 1337 595
3 596 1338 594
3 100 1338 596
3 72 1339 594
3 596 1339 72
3 72 1340 598
3 597 1340 72
3 598 1341 100
3 597 1341 598
3 599 1342 597
3 147 1342 599
3 597 1343 599
3 72 1343 597
3 601 1344 600
3 147 1344 601
3 601 1345 42
3 600 1345 601
3 602 1346 600
3 70 1346 602
3 602 1347 147
3 600 1347 602
3 604 1348 603
3 147 1348 604
3 604 1349 70
3 603 1349 604
3 605 1350 603
3 42 1350 605
3 605 1351 147
3 603 1351 605
3 606 1352 42
3 607 1352 606
3 607 1353 111
3 606 1353 607
3 42 1354 606
3 608 1354 42
3 608 1355 70
3 42 1355 608
3 610 1356 42
3 70 1356 610
3 42 1357 610
3 609 1357 42
3 611 1358 609
3 111 1358 611
3 609 1359 611
3 42 1359 609
3 127 1360 111
3 612 1360 127
3 612 1361 93
3 127 1361 612
3 613 1362 127
3 93 1362 613
3 127 1363 613
3 111 1363 127
3 58 616 615
3 22 616 58
3 615 617 614
3 22 617 615
3 618 619 614
3 93 619 618
3 614 620 618
3 22 620 614
3 621 623 22
3 622 623 621
3 622 624 93
3 621 624 622
3 625 626 22
3 621 626 625
3 58 627 22
3 625 627 58
3 163 1364 162
3 119 1364 163
3 163 1365 119
3 162 1365 163
3 162 1366 119
3 29 1366 162
3 162 1367 29
3 119 1367 162
3 628 1368 29
3 629 1368 628
3 629 1369 141
3 628 1369 629
3 630 1370 628
3 119 1370 630
3 29 1371 628
3 630 1371 29
3 29 1372 632
3 631 1372 29
3 632 1373 119
3 631 1373 632
3 633 1374 631
3 141 1374 633
3 631 1375 633
3 29 1375 631
3 635 1376 634
3 117 1376 635
3 635 1377 141
3 634 1377 635
3 636 1378 634
3 119 1378 636
3 636 1379 117
3 634 1379 636
3 638 1380 637
3 117 1380 638
3 638 1381 119
3 637 1381 638
3 639 1382 637
3 141 1382 639
3 639 1383 117
3 637 1383 639
3 641 1384 640
3 141 1384 641
3 641 1385 159
3 640 1385 641
3 642 1386 640
3 117 1386 642
3 642 1387 141
3 640 1387 642
3 644 1388 643
3 141 1388 644
3 644 1389 117
3 643 1389 644
3 645 1390 643
3 159 1390 645
3 645 1391 141
3 643 1391 645
3 646 1392 159
3 647 1392 646
3 647 1393 181
3 646 1393 647
3 159 1394 646
3 648 1394 159
3 648 1395 117
3 159 1395 648
3 650 1396 159
3 117 1396 650
3 159 1397 650
3 649 1397 159
3 651 1398 649
3 181 1398 651
3 649 1399 651
3 159 1399 649
3 654 1400 652
3 181 1400 654
3 652 1401 654
3 653 1401 652
3 655 1402 653
3 117 1402 655
3 653 1403 655
3 652 1403 653
3 656 1404 181
3 657 1404 656
3 657 1405 652
3 656 1405 657
3 658 1406 181
3 656 1406 658
3 658 1407 40
3 181 1407 658
3 661 1408 181
3 40 1408 661
3 661 1409 660
3 181 1409 661
3 662 1410 660
3 659 1410 662
3 660 1411 662
3 181 1411 660
3 663 1412 659
3 664 1412 663
3 664 1413 117
3 663 1413 664
3 659 1414 663
3 665 1414 659
3 665 1415 181
3 659 1415 665
3 40 1416 181
3 666 1416 40
3 666 1417 25
3 40 1417 666
3 667 1418 40
3 25 1418 667
3 40 1419 667
3 181 1419 40
3 670 671 25
3 40 671 670
3 670 672 669
3 25 672 670
3 673 674 669
3 668 674 673
3 669 675 673
3 25 675 669
3 676 678 668
3 677 678 676
3 677 679 151
3 676 679 677
3 668 681 676
3 680 681 668
3 680 682 25
3 668 682 680
3 685 686 683
3 25 686 685
3 683 687 685
3 684 687 683
3 688 689 684
3 151 689 688
3 684 690 688
3 683 690 684
3 691 693 25
3 692 693 691
3 692 694 683
3 691 694 692
3 695 696 25
3 691 696 695
3 695 697 40
3 25 697 695
3 151 700 699
3 90 700 151
3 699 701 698
3 90 701 699
3 702 703 698
3 25 703 702
3 698 704 702
3 90 704 698
3 705 707 90
3 706 707 705
3 706 708 25
3 705 708 706
3 709 710 90
3 705 710 709
3 151 711 90
3 709 711 151
3 712 1420 92
3 138 1420 712
3 153 1421 92
3 712 1421 153
3 153 1422 713
3 92 1422 153
3 713 1423 138
3 92 1423 713
3 152 1424 138
3 714 1424 152
3 714 1425 153
3 152 1425 714
3 715 1426 152
3 153 1426 715
3 152 1427 715
3 138 1427 152
3 716 1428 7
3 92 1428 716
3 50 1429 7
3 716 1429 50
3 50 1430 717
3 7 1430 50
3 717 1431 92
3 7 1431 717
3 92 1432 718
3 153 1432 92
3 718 1433 50
3 153 1433 718
3 719 1434 153
3 50 1434 719
3 92 1435 153
3 719 1435 92
3 4 101 7
3 7 101 4
3 50 101 7
3 7 101 50
3 37 66 4
3 4 66 37
3 101 66 4
3 4 66 101
3 44 97 37
3 37 97 44
3 66 97 37
3 37 97 66
3 122 49 44
3 44 49 122
3 97 49 44
3 44 49 97
3 48 156 122
3 122 156 48
3 49 156 122
3 122 156 49
3 128 193 48
3 48 193 128
3 156 193 48
3 48 193 156
3 18 1436 128
3 118 1436 18
3 18 1437 118
3 128 1437 18
3 193 1438 128
3 118 1438 193
3 193 1439 118
3 128 1439 193
3 171 20 18
3 18 20 171
3 118 20 18
3 18 20 118
3 41 720 171
3 55 720 41
3 41 721 55
3 171 721 41
3 20 722 171
3 55 722 20
3 20 723 55
3 171 723 20
3 138 152 41
3 41 152 138
3 55 152 41
3 41 152 55
3 726 727 724
3 20 727 726
3 724 728 726
3 725 728 724
3 729 730 725
3 152 730 729
3 725 731 729
3 724 731 725
3 732 734 20
3 733 734 732
3 733 735 724
3 732 735 733
3 736 737 20
3 732 737 736
3 736 738 153
3 20 738 736
3 741 742 20
3 153 742 741
3 741 743 740
3 20 743 741
3 744 745 740
3 739 745 744
3 740 746 744
3 20 746 740
3 747 749 739
3 748 749 747
3 748 750 152
3 747 750 748
3 739 752 747
3 751 752 739
3 751 753 20
3 739 753 751
3 756 1440 118
3 153 1440 756
3 756 1441 755
3 118 1441 756
3 757 1442 755
3 754 1442 757
3 755 1443 757
3 118 1443 755
3 758 1444 754
3 759 1444 758
3 759 1445 50
3 758 1445 759
3 754 1446 758
3 760 1446 754
3 760 1447 118
3 754 1447 760
3 763 1448 761
3 118 1448 763
3 761 1449 763
3 762 1449 761
3 764 1450 762
3 50 1450 764
3 762 1451 764
3 761 1451 762
3 765 1452 118
3 766 1452 765
3 766 1453 761
3 765 1453 766
3 767 1454 118
3 765 1454 767
3 767 1455 153
3 118 1455 767
3 769 1456 768
3 50 1456 769
3 769 1457 101
3 768 1457 769
3 770 1458 768
3 156 1458 770
3 770 1459 50
3 768 1459 770
3 772 1460 771
3 50 1460 772
3 772 1461 156
3 771 1461 772
3 773 1462 771
3 101 1462 773
3 773 1463 50
3 771 1463 773
3 66 1464 97
3 101 1464 66
3 66 1465 101
3 97 1465 66
3 97 1466 49
3 101 1466 97
3 97 1467 101
3 49 1467 97
3 774 1468 49
3 775 1468 774
3 775 1469 156
3 774 1469 775
3 776 1470 774
3 101 1470 776
3 49 1471 774
3 776 1471 49
3 49 1472 778
3 777 1472 49
3 778 1473 101
3 777 1473 778
3 779 1474 777
3 156 1474 779
3 777 1475 779
3 49 1475 777
3 781 1476 780
3 156 1476 781
3 781 1477 193
3 780 1477 781
3 782 1478 780
3 50 1478 782
3 782 1479 156
3 780 1479 782
3 784 1480 783
3 156 1480 784
3 784 1481 50
3 783 1481 784
3 785 1482 783
3 193 1482 785
3 785 1483 156
3 783 1483 785
3 786 1484 193
3 787 1484 786
3 787 1485 118
3 786 1485 787
3 193 1486 786
3 788 1486 193
3 788 1487 50
3 193 1487 788
3 790 1488 193
3 50 1488 790
3 193 1489 790
3 789 1489 193
3 791 1490 789
3 118 1490 791
3 789 1491 791
3 193 1491 789
3 153 1492 118
3 792 1492 153
3 792 1493 20
3 153 1493 792
3 793 1494 153
3 20 1494 793
3 153 1495 793
3 118 1495 153
3 152 796 795
3 55 796 152
3 795 797 794
3 55 797 795
3 798 799 794
3 20 799 798
3 794 800 798
3 55 800 794
3 801 803 55
3 802 803 801
3 802 804 20
3 801 804 802
3 805 806 55
3 801 806 805
3 152 807 55
3 805 807 152
3 37 1496 44
3 4 1496 37
3 37 1497 4
3 44 1497 37
3 44 1498 4
3 122 1498 44
3 44 1499 122
3 4 1499 44
3 808 1500 122
3 809 1500 808
3 809 1501 48
3 808 1501 809
3 810 1502 808
3 4 1502 810
3 122 1503 808
3 810 1503 122
3 122 1504 812
3 811 1504 122
3 812 1505 4
3 811 1505 812
3 813 1506 811
3 48 1506 813
3 811 1507 813
3 122 1507 811
3 815 1508 814
3 7 1508 815
3 815 1509 48
3 814 1509 815
3 816 1510 814
3 4 1510 816
3 816 1511 7
3 814 1511 816
3 818 1512 817
3 7 1512 818
3 818 1513 4
3 817 1513 818
3 819 1514 817
3 48 1514 819
3 819 1515 7
3 817 1515 819
3 821 1516 820
3 48 1516 821
3 821 1517 128
3 820 1517 821
3 822 1518 820
3 7 1518 822
3 822 1519 48
3 820 1519 822
3 824 1520 823
3 48 1520 824
3 824 1521 7
3 823 1521 824
3 825 1522 823
3 128 1522 825
3 825 1523 48
3 823 1523 825
3 826 1524 128
3 827 1524 826
3 827 1525 18
3 826 1525 827
3 128 1526 826
3 828 1526 128
3 828 1527 7
3 128 1527 828
3 830 1528 128
3 7 1528 830
3 128 1529 830
3 829 1529 128
3 831 1530 829
3 18 1530 831
3 829 1531 831
3 128 1531 829
3 834 1532 832
3 18 1532 834
3 832 1533 834
3 833 1533 832
3 835 1534 833
3 7 1534 835
3 833 1535 835
3 832 1535 833
3 836 1536 18
3 837 1536 836
3 837 1537 832
3 836 1537 837
3 838 1538 18
3 836 1538 838
3 838 1539 92
3 18 1539 838
3 841 1540 18
3 92 1540 841
3 841 1541 840
3 18 1541 841
3 842 1542 840
3 839 1542 842
3 840 1543 842
3 18 1543 840
3 843 1544 839
3 844 1544 843
3 844 1545 7
3 843 1545 844
3 839 1546 843
3 845 1546 839
3 845 1547 18
3 839 1547 845
3 92 1548 18
3 846 1548 92
3 846 1549 171
3 92 1549 846
3 847 1550 92
3 171 1550 847
3 92 1551 847
3 18 1551 92
3 850 851 171
3 92 851 850
3 850 852 849
3 171 852 850
3 853 854 849
3 848 854 853
3 849 855 853
3 171 855 849
3 856 858 848
3 857 858 856
3 857 859 138
3 856 859 857
3 848 861 856
3 860 861 848
3 860 862 171
3 848 862 860
3 865 866 863
3 171 866 865
3 863 867 865
3 864 867 863
3 868 869 864
3 138 869 868
3 864 870 868
3 863 870 864
3 871 873 171
3 872 873 871
3 872 874 863
3 871 874 872
3 875 876 171
3 871 876 875
3 875 877 92
3 171 877 875
3 138 880 879
3 41 880 138
3 879 881 878
3 41 881 879
3 882 883 878
3 171 883 882
3 878 884 882
3 41 884 878
3 885 887 41
3 886 887 885
3 886 888 171
3 885 888 886
3 889 890 41
3 885 890 889
3 138 891 41
3 889 891 138