OFF
1238 2442 0
0.3276361627 -0.2575578666 0.1099728702
-0.2027526071 -0.4984717247 -0.1263398366
0.4082832322 0.1800270546 0.0577863512
-0.2067062003 -0.3417220009 -0.0262595174
0.3951061373 0.1452555274 0.0692199271
-0.3165168802 -0.0228568753 0.1762031022
0.3132354221 0.3210015160 0.0801607589
0.3332002322 0.0432963731 0.0731122520
-0.0099735234 -0.0709219425 -0.1262975983
-0.4204736068 -0.3969679773 0.0532212064
0.3837628636 0.1630269081 0.0695964135
0.3729702967 0.1507408238 0.0719615732
0.3981936718 0.1828386055 -0.0652752606
-0.4863353536 -0.3642762755 0.0343451457
-0.3466194230 0.0555706547 0.0478192854
0.1409607505 0.1587195027 -0.0317668192
0.2653211960 0.3576234800 -0.1432340978
-0.0229183803 -0.4281652609 -0.1744540147
-0.0464593172 0.1043052342 -0.0761647015
-0.2351758289 -0.0127775081 0.1837013607
0.4284728591 0.1147245607 0.0569817516
-0.1353915955 -0.4266759251 0.1843627059
-0.1827692303 -0.4279642864 0.1203360879
0.2631221904 0.2648764104 0.1113341370
-0.1892784973 -0.4098410881 -0.1801725921
0.2055203207 -0.2717991442 0.1101303966
0.1831815725 -0.2618660011 0.1017764622
-0.3285364213 -0.3323758311 0.1990210242
0.2886048317 -0.2682022119 -0.0863725120
0.2006039524 -0.2342235204 -0.1321566274
-0.1143911320 -0.2916640646 -0.0645319807
0.2952701930 0.2663762612 -0.0400731123
-0.2947230776 -0.3913055318 -0.1089317122
0.2321925486 -0.3008457051 0.0876350561
-0.3251604360 -0.4645447564 0.1251790242
0.4118883532 0.0731084470 0.0766754677
-0.0286633414 -0.4508724970 0.1697597564
-0.2292556478 -0.4479594339 -0.1930235739
-0.1948262343 -0.0559724388 -0.2039277501
0.2842004064 0.1800752222 0.0866790032
0.3873135534 0.1508544731 0.0738568975
0.2313839867 -0.0268335836 0.0827519051
-0.2747603169 0.0997442319 -0.0365356554
-0.2187505832 -0.3224295685 0.0730594358
0.3944159815 0.1566019612 0.0724519850
-0.3435131533 -0.3794496542 -0.1162158763
-0.2374847976 -0.3391530771 -0.0374358048
-0.0293739257 -0.4148729489 0.1518826377
0.1553998915 -0.2365455606 0.0659911163
0.4779864079 0.0900401987 0.0405902703
-0.4595503221 -0.1913368137 0.1151176111
0.0716046628 0.1326747384 0.0837822514
0.1298253082 -0.1710839719 0.1362624586
-0.1027223392 -0.3219485700 0.1725998142
0.2970544446 -0.3194688018 0.0913730653
0.2549768140 0.3204620180 -0.0972252380
0.2553671356 0.0083042681 0.0772123077
0.4116962853 0.1577946036 -0.0399359523
-0.1900803316 -0.4156862596 -0.1770968156
-0.2975169474 -0.3972005629 -0.1861862239
0.1948812622 -0.2061212951 -0.1488730180
-0.1353571316 -0.4245773739 0.1186118005
-0.4032646583 -0.3402801890 -0.1354810541
0.3150643225 -0.3003060020 -0.0852365133
0.1326474519 0.1452627188 -0.0789412482
-0.4164191843 -0.0968193649 0.1454418110
0.3390102427 0.0639723164 0.0883228194
-0.0676237265 -0.4121316638 -0.1884980270
-0.1179947066 -0.3201997839 0.2043681882
-0.1556342007 -0.4181437428 -0.1257976464
0.0874700566 -0.1818514810 0.0920200338
-0.2846754626 0.0519195273 0.0957590143
0.3758935682 0.1792740824 0.0636373021
0.4310359647 0.1640289889 0.0316419260
0.4039284595 0.1520292365 -0.0636610621
0.2891346369 0.4512263315 -0.1146281057
-0.4534000068 -0.3966159490 -0.0502768060
-0.1362156733 -0.4861020492 -0.1403495971
0.2699967790 0.3149627141 -0.1408998642
-0.1915939596 -0.4954735692 0.1140141721
-0.0847146160 -0.2243246000 -0.1671365055
0.2650787561 0.3574031947 0.1448461258
0.1782820792 -0.2251982317 -0.1356008094
0.0756365309 -0.1772910691 0.0811114482
-0.2342953255 0.1123956485 0.0338463202
-0.4349717003 -0.3813515575 0.0623504633
-0.3780118901 0.0031505048 -0.0882961041
0.4691940231 0.0620725969 -0.0409826506
0.3996153000 0.1812872346 -0.0439295931
-0.3614527124 -0.3391209225 -0.1745782972
0.3044270318 0.2415792856 0.0377504654
0.2021857333 -0.2071004652 -0.0694209217
0.2137882814 -0.0883737941 0.1046106561
0.0446608409 -0.1209149435 0.1090617373
-0.2865745146 -0.4649905193 0.1794808023
0.4152097000 0.1266969453 0.0608205662
-0.0564915228 -0.3985526255 0.1515685218
0.2651161982 -0.2445112089 -0.1058482934
0.3431834455 -0.2936476014 0.1123571254
-0.1360616855 -0.3175326308 0.2095901793
0.3268157714 -0.3075872893 -0.1424036366
0.3601063773 0.1591071427 -0.0855712461
0.2849778437 0.4430957435 0.1457210045
-0.4208846629 -0.2886661412 0.1499306012
0.1336771537 -0.2110140824 0.1192459325
0.3118683836 -0.2853824130 -0.0796201917
0.0849864243 -0.2059506051 0.0430814145
0.1540517318 0.1031639936 -0.1167002285
0.2687246801 0.2343112699 -0.0783652439
0.3236537599 0.3394776920 0.0766233295
0.2708317448 -0.3070023131 -0.1351653126
0.3051452411 0.2278585297 -0.0370728085
-0.1561904454 -0.3609685343 0.2100614462
0.3435874518 -0.2711912393 -0.1128045899
-0.0138322523 0.0033600695 0.1373119739
-0.0461120281 -0.4264353761 -0.1239031383
-0.1914976704 -0.3166588809 -0.2131104131
-0.0898324070 -0.2811508590 -0.1784945543
-0.0435363273 -0.4044778303 -0.1510784781
0.0163442127 -0.2432600517 0.0189829992
0.2968046695 0.2113486765 0.0173319907
-0.5000000000 -0.3482264448 -0.0003774369
-0.3212135237 0.0867738840 0.0001056548
-0.3919232300 0.0296220099 0.0000024454
0.2723789195 -0.0233545666 0.0005209933
-0.4725143449 -0.1208585147 -0.0001804451
0.2998591518 0.2040524288 0.0007180103
-0.2606844776 0.1117108623 0.0001756627
0.1422373696 -0.1826483021 0.0002896634
-0.4630123057 -0.2920817424 -0.0003033771
-0.1204934657 -0.3346766714 -0.0000476942
0.2628451322 0.1798731240 0.0006683713
-0.4851622716 -0.3081088845 -0.0003342733
0.1759253414 -0.1526029103 0.0003409889
0.4804983170 0.0585507704 0.0007587707
-0.4187081410 -0.4345619035 -0.0003750419
-0.4929411209 -0.3945859299 -0.0004069459
0.2136788417 -0.0881803947 0.0004220229
0.2033458602 -0.1190784351 0.0003897002
0.4279833247 0.1813852063 0.0008085030
0.4976039115 0.1068853794 0.0008101261
-0.2967223298 -0.3796486650 -0.0002303919
-0.4865816452 -0.1974437598 -0.0002508459
0.0830287468 -0.2191047358 0.0002119581
0.3080181757 0.0007062610 0.0005693847
0.5000000000 0.0833221193 0.0007941246
-0.3803937900 -0.3953499714 -0.0003128136
0.2363435956 0.1697516039 0.0006383288
-0.1166944911 0.1314844647 0.0003119607
0.0180891227 -0.2448751177 0.0001376011
-0.0165506689 0.1327523572 0.0003972083
-0.4376155358 -0.0344071002 -0.0000849688
-0.4931046279 -0.3238006247 -0.0003529563
0.0491637059 0.1456499187 0.0004623739
-0.3579438497 0.0626513149 0.0000562979
0.3269388802 0.2080179292 0.0007438321
0.1516505581 0.1596180451 0.0005593048
0.4741705934 0.0506440279 0.0007473995
-0.4435071531 -0.4340613709 -0.0003955292
-0.2430703517 -0.3634369973 -0.0001728434
0.4788682039 0.0691019122 0.0007654670
0.4481262571 0.0350344840 0.0007135452
-0.1936020963 0.1259700533 0.0002430208
-0.4007023619 -0.4207458966 -0.0003493241
-0.0441744192 -0.2966324790 0.0000456248
0.2758163565 0.1952805780 0.0006910691
0.2757038628 0.3546532219 -0.1059294121
0.4005973508 0.1597254228 0.0687770422
-0.4372197055 -0.4116026428 0.0447670651
0.0163759325 -0.2432312305 -0.0187082153
0.2125491470 -0.1275505271 -0.0603917815
0.4293035495 0.1428353646 0.0468886184
0.2480628709 0.0708093569 0.1161044492
0.2482573272 0.0709860434 -0.1149590833
0.2811877221 0.1614364515 0.0972070167
-0.4046954500 -0.3095573927 -0.1741897276
0.3246215549 0.4159390836 0.0968155003
-0.2368830358 -0.4746374643 0.1141351487
-0.0149969961 -0.1247353012 0.1139190420
0.4088776039 0.1693923259 -0.0395418822
0.2515596021 0.1526795239 0.0954353778
0.4959739209 0.0988408572 -0.0065985439
0.3585258608 0.1156075530 -0.0913205160
-0.1947110185 -0.4681267046 -0.1097373017
-0.2774284998 -0.0113797815 0.1819419928
-0.1851854328 0.1045088105 -0.0726429880
0.3107598546 0.0076105453 -0.0280534443
0.2787251153 0.2374217461 0.0545542746
0.3238336036 0.4537583297 -0.1046480760
0.4501729637 0.0629407809 -0.0544862616
0.2698370069 -0.3289544423 -0.1227968679
0.0826909845 -0.0657850650 -0.1387681901
0.2922261106 0.4277393401 -0.0939682043
0.3237813111 0.3395935873 -0.0749399529
-0.3540579205 -0.2818217243 -0.1970951814
0.3145987151 0.4753229609 -0.1654280425
0.3102740623 -0.2743725643 -0.1511817052
-0.2460283321 -0.4964121084 -0.1629393035
0.0948919471 -0.1892312963 -0.0800330433
0.3851726050 0.1538210780 0.0814435689
0.2368423050 0.1035592803 0.1141298051
-0.2342386914 0.1124471073 -0.0334494438
-0.0446854870 -0.4570398856 0.1815468458
-0.0141466265 -0.1834435490 -0.1012006728
0.2500139072 0.2215793549 -0.0976146204
0.3272818565 0.4975542835 -0.1430299108
0.4280323866 0.0395908084 0.0451908004
-0.3064409213 0.0306118181 -0.1270560554
0.2051921352 -0.1459815644 -0.0512290112
0.0448439782 -0.1207485416 -0.1085519535
0.0591371063 -0.1593794629 -0.0902452536
0.2746231962 0.3605930147 -0.1216964262
0.2556040313 0.1782183412 -0.0935461962
0.2764609469 -0.2947031800 -0.0797641943
-0.0852640739 -0.2512592789 0.1358327527
-0.2371139990 -0.4947090633 0.1248669236
-0.4220343845 -0.4205060499 -0.0361274705
0.3335556517 -0.2648054505 -0.1345169389
0.2983990039 0.2031228188 0.0124049713
-0.2214941248 -0.3820962850 0.1298824318
0.1365075326 -0.1271492623 -0.1504942219
0.2206590244 -0.1831306486 0.1160780847
0.2665124332 0.2279180524 -0.0993626667
0.3453304722 0.1752256902 -0.0802675302
0.4780534129 0.0901010807 -0.0390286960
-0.4159150990 -0.3477211547 -0.0721459466
0.2736908954 -0.2862133683 -0.1347594360
-0.1209341796 -0.4531585391 -0.1130960655
0.2262195359 -0.2997465170 -0.0958521643
-0.2718350861 -0.4923216169 -0.1635030577
0.2694070253 0.3083657202 0.0694925944
-0.4556511830 -0.2501542276 -0.0947493346
0.4059659608 0.1408684090 -0.0479146934
0.2843451437 0.1802067332 -0.0853057852
-0.2342115805 -0.3133302456 -0.2112009407
0.3867819124 0.1585627255 0.0726798368
0.2190630925 -0.2209944560 0.1379474553
0.2656076133 -0.3211905105 0.0815220916
-0.1361610720 -0.4840045228 -0.1652894284
-0.1794979017 0.0816186622 0.0952359211
0.2074951246 -0.1980925834 0.1480112017
0.2741202963 -0.3260805394 -0.0868456304
0.2654011168 -0.3316298006 -0.1080864803
-0.1549040421 0.0654794153 0.1230017792
-0.1766451413 -0.2101273713 0.2266844196
-0.2392853903 -0.4363580505 0.1967377360
-0.4596189347 -0.4112255751 -0.0368014522
0.4285674916 0.1148105455 -0.0554657225
0.2031467317 -0.0762061426 0.0518346233
0.4120162101 0.0732246200 -0.0752509465
0.1829867892 -0.0753573902 -0.1502098443
0.1918623594 -0.2799564375 -0.0748124233
0.3190792940 -0.2692296873 0.1427352471
0.3377806454 -0.2850301333 -0.0898891896
0.2701080221 0.4021325278 -0.1391999508
-0.4489258596 -0.4281378166 -0.0188058984
-0.1292373051 -0.1552195364 0.2174284506
0.3333222415 0.0434072330 -0.0718657756
0.3133689658 0.3211228563 -0.0785231649
-0.4556739432 -0.3555410496 0.0561795294
0.2538945921 -0.2407168789 0.1232338821
0.4628927909 0.1046915320 -0.0372216200
-0.2029648470 -0.4986645698 0.1258551711
0.4491226933 0.1315102200 0.0430115884
0.4746319984 0.0565161912 0.0269606484
0.3959731696 0.1707872167 -0.0667993955
-0.2392244896 -0.2536562814 0.2237411310
0.4849103259 0.1151359502 -0.0171576540
-0.4349507347 -0.3102635440 0.0939228549
-0.1891414720 -0.4165082989 -0.1324715439
0.0150926353 -0.1695871911 0.0807032548
-0.0682740919 0.0014056283 -0.1535685222
0.2632439718 0.2660657324 -0.0956176334
0.2136470005 -0.0757182272 0.0299651163
-0.2559409074 -0.4931093731 0.1780046190
0.4962802547 0.1107507524 -0.0076436592
0.3910853639 0.0303782357 0.0464341001
-0.0695513555 -0.4665784742 0.1249968612
0.4769356912 0.0786633958 -0.0434390332
-0.0946372415 -0.1955136457 -0.1943435431
-0.0467364308 -0.0489202777 -0.1468610400
-0.1817164772 -0.4214576387 -0.1860531975
0.2649687195 0.3187392116 -0.1415950000
0.3038114829 -0.2858148946 0.1547233406
0.2382571391 -0.2656345681 0.0807163613
-0.1303998012 0.0888302426 -0.0916896074
0.1561047685 -0.2520555135 -0.0917091574
0.3354899100 -0.2680752417 0.1228079290
-0.2752043670 -0.4911716287 0.1244325407
0.3579100514 0.0138259799 0.0170449907
0.2810984536 0.4444307093 -0.1230270230
0.2464137814 0.1810291107 0.0491836269
0.2790722913 0.4165266970 -0.1031615925
0.2028244803 -0.1730109981 -0.1520256380
0.3223529020 0.4986645698 -0.1559701447
-0.0557182635 0.0856721295 -0.0883784407
0.3106520572 0.4549461490 -0.1274157112
0.1709161775 0.0723398626 -0.1278258750
-0.0586691239 -0.4104938192 -0.1336769891
-0.0621792161 -0.4348686032 0.1173282112
0.3163222304 0.1950442721 -0.0572923801
-0.3423044420 0.0373584090 -0.0830699174
0.2342277492 0.0005937879 0.0951171114
-0.0892644238 -0.4154647636 0.1883824387
0.1775670178 0.1476860848 -0.0367375175
-0.3068099706 -0.3687791798 -0.0901290744
0.2024432257 -0.1406300004 -0.1512920428
0.2118841500 -0.0275525291 -0.0916662919
0.2553709474 0.2611841886 -0.1086157885
-0.1050357218 -0.2890845362 -0.1413163380
-0.2563823238 -0.4375306884 -0.1984069660
0.2154021051 -0.0963918103 0.0780169222
-0.2641218311 -0.3392001582 -0.0819780364
0.3832683969 0.1607175380 -0.0733786092
-0.3123438356 -0.4183793680 0.1696925152
0.1580258928 -0.1646869348 -0.0424572656
0.2090228438 -0.0449974620 -0.0774069856
-0.4470416008 -0.1786560253 0.1347527945
0.4049068683 0.1440360650 0.0655482011
0.3032899168 0.1395446224 -0.1107064382
-0.4706818789 -0.3978630908 0.0401136551
-0.2029159556 -0.1641846951 0.2205567825
-0.4079516770 -0.3702796635 0.0448058362
-0.2497982205 0.0877587348 0.0720306100
0.3968054906 0.1683652795 -0.0585381249
0.2886067779 0.4066381727 -0.1186338218
-0.2809315247 -0.2096881768 0.2106983171
0.0527905173 -0.0282514755 -0.1336156240
-0.3954057100 -0.3641790325 0.0793837989
-0.2435466247 -0.3459736817 0.1039578014
0.2084284200 -0.1734345708 -0.0754945035
-0.4415416664 -0.2495144615 0.1390235824
0.0392080763 -0.2214065317 -0.0351040452
-0.0964406115 -0.2180618573 -0.2090870818
0.2668071876 -0.0089050872 0.0461446758
-0.1151472878 -0.4064017251 -0.1466614677
0.2246947211 -0.2055641506 0.1322167278
-0.3288197361 -0.4149167314 0.1263021263
0.2664360303 0.2068520617 -0.0603584191
0.2382001349 -0.2799798356 0.1368639762
0.2869506814 0.1944485650 -0.0578180246
0.2877027007 0.1261856155 -0.1150768829
0.0307299644 0.0565974737 0.1249540701
0.1918508618 0.1413322160 0.0786735331
0.3364257796 -0.3011607823 0.0908219615
0.2373272640 -0.2851277115 -0.0808710555
-0.1686249702 -0.0253511785 -0.1894158882
-0.1543800803 -0.3820947719 0.1903585306
-0.1763300077 -0.3346556751 0.1210273884
0.1994128890 0.1098977518 -0.1124343287
0.3083582433 0.1991300239 -0.0283256878
-0.3178822972 -0.3635732142 0.1904585607
-0.4648573522 -0.3056951449 -0.0345766327
0.2175675539 -0.1678719427 0.0995867482
0.2674374396 0.1320571460 0.1059661333
0.0583557409 -0.0863466114 0.1277463030
-0.0683445514 0.1263181859 -0.0300391826
0.2514195696 0.3053237992 -0.1097085111
0.2905446499 0.0888134567 0.1061014900
-0.4606503544 -0.0972397220 0.0298700225
-0.1306466084 -0.3308787812 -0.1332355717
0.2661709388 0.3146191419 0.1094566563
0.3245324128 0.4076712020 -0.0849129725
0.2454027079 -0.3111063917 -0.0824751558
0.3058074213 0.4183909129 0.0829024228
0.3960264270 0.1507783077 -0.0552537776
0.2501230098 0.2752843457 0.1094875615
-0.4176803864 -0.2499183443 -0.1655704658
-0.1273527624 -0.3288361940 -0.0260688217
0.3248862407 -0.3108587515 -0.1255637804
-0.1085625334 -0.2706389741 -0.1037746707
0.3418914474 -0.2881769502 -0.1261280346
-0.4871189702 -0.3935701874 -0.0254527377
0.0222608578 -0.2092462266 0.0537024268
0.4038810199 0.1637658056 0.0650351843
-0.4084561955 -0.0367587173 0.0939936758
-0.2403653298 -0.4764372412 0.1883995301
0.3351333859 -0.2700527674 -0.0969947960
-0.0974177365 -0.2473586713 0.2108181321
-0.1070657346 -0.2749105896 -0.2079267254
-0.4754369579 -0.3261011737 -0.0427471736
0.3319044961 -0.3070635969 -0.0900238800
-0.0709790358 -0.3975514575 -0.1480624932
0.2777801775 0.3445816815 -0.1539650738
-0.0812073535 -0.4229753040 -0.1956441040
0.3447457305 0.2016019178 -0.0551626323
0.3060183846 0.4703703877 0.1631875868
-0.1353338525 -0.4123189872 -0.1673668530
-0.0536249036 -0.2260310585 0.1333763170
0.1395300257 0.1293429162 0.0942571333
0.2770372503 0.2023076354 0.0639627860
0.4926314729 0.1141881258 0.0152867678
-0.1405866270 -0.3649765212 0.1837746875
0.3795992542 0.1714449604 -0.0769070500
0.0147727240 -0.0380206988 -0.1319744384
-0.0476042742 0.1161481959 0.0473851655
0.1521300837 -0.0524901455 -0.1524347135
0.3861637179 0.1610401253 0.0744991998
-0.0092513738 -0.2150138379 0.0793165466
0.4889205534 0.1074698033 -0.0099999185
0.3131806565 0.4865584567 -0.1326152555
0.2734226845 0.1888653387 -0.0946636667
0.2805725972 -0.3111505993 -0.1384668853
0.2296941914 0.1661280274 -0.0587398298
-0.3186562135 -0.4801657522 0.1493196825
-0.0592421109 -0.1877263073 0.1558696868
-0.2084867408 -0.4281707873 0.1853556921
0.3140658898 -0.3130863511 0.1425310567
0.2877452047 -0.3121847294 -0.0802115057
0.3772923529 0.2031215850 -0.0339315805
-0.1089383135 -0.3229832073 0.1911065522
0.2666341653 0.3359528997 0.0805659389
0.2570235564 -0.3255268118 -0.1235999640
0.3297064944 -0.2683989905 0.0862649614
0.2153731397 -0.1884839819 -0.1364912510
0.2837973633 0.0252692094 -0.0614836000
-0.0730184402 -0.4677813542 -0.1710990610
-0.0559343944 -0.4403416753 -0.1921588906
-0.0318660416 -0.4159055774 -0.1742575686
-0.1905616133 -0.4075027062 -0.1376230287
0.2557886542 -0.2444630311 -0.0936213435
0.3280876195 0.4788172590 0.1290432725
0.2626553523 0.2865046601 0.1219881947
-0.1961910940 -0.4718820240 -0.1886421380
-0.3091155134 0.0639783810 0.0725467767
-0.2449300914 -0.3667191117 -0.1092574174
0.3486994513 0.1511117505 0.0884371783
0.3230539011 0.4781109772 0.1230049146
-0.1713707733 -0.2452054130 -0.2265265222
-0.0214506663 -0.4479603690 -0.1433962509
-0.1366786591 -0.3615088135 0.1426838362
0.2891133886 0.4269904223 0.1620438089
-0.0871344170 -0.3090277041 0.0315540885
0.4505382288 0.0437374677 0.0254978574
0.0924452877 -0.0122332690 0.1380785104
0.2700745653 0.4082569586 -0.1184363531
0.4915048365 0.0780792629 -0.0239018782
-0.4215650741 -0.1784149305 -0.1558234282
0.2594665949 0.0404038217 -0.0926823028
-0.0302537482 -0.1541884901 0.1159402659
-0.1928217221 -0.3554843807 0.1256310101
0.3074767085 0.4851724180 0.1480731148
-0.1425325172 -0.0429288234 -0.1936291319
-0.3307483409 -0.4665586100 0.1407746648
-0.2689343848 0.0413270369 -0.1295512397
0.2966485438 0.4148760713 0.1672283238
0.3193378159 0.4166393564 0.0849387946
0.1758961788 -0.2013529095 0.0509001109
-0.2527879741 -0.4028407459 0.2083012365
0.3139929929 0.1535938544 0.1032063428
0.2823847286 0.3000099198 0.0903306744
-0.0371685819 -0.2148822563 -0.1238909687
-0.3141684277 0.0807159521 0.0393810988
0.1570628274 -0.2378854169 0.1150655532
-0.2906450360 -0.4367520119 0.1101151083
0.2579686267 -0.3293486640 -0.0929930702
-0.0266151032 -0.0349590625 0.1388757489
-0.4351257602 -0.0751016027 -0.0994155256
-0.0010962429 -0.2432060798 0.0434669859
-0.4814706411 -0.3136818883 -0.0293941536
0.3868287734 0.1412527758 0.0860990407
0.1843812173 -0.1401400361 -0.0400978559
0.2629495187 0.0983050810 0.1157574119
-0.0181594002 -0.4385992103 0.1502689349
-0.0688776039 -0.4163072489 -0.1167240688
-0.1153048625 -0.2287285026 0.2197710948
0.4080793869 0.1630335617 0.0596156158
0.2444290144 -0.2514235413 -0.1382339848
0.2479076839 -0.3218319559 -0.0932192554
-0.4473279859 -0.2939525311 -0.0493400647
0.4659881976 0.1419507803 0.0265484933
-0.4316948190 -0.4309769858 0.0215560091
0.2961348004 -0.3216150066 -0.1233731807
0.2267867412 -0.2929225360 -0.1173015315
-0.4947893300 -0.3444519847 0.0201537888
-0.4744710416 -0.1973414377 0.0736917496
0.2178642038 0.0293006235 0.1186939699
-0.1428586848 -0.0432251852 0.1939409305
-0.4297590147 -0.3391973328 0.0599894803
0.2912991539 -0.2650859340 -0.1223656717
0.4100022679 0.1641816947 -0.0525140946
0.2017781691 -0.2401620707 0.0698332866
0.4951764469 0.1163860345 0.0078568545
-0.2596199211 -0.4552437182 -0.1144830088
0.4850244085 0.1040556624 -0.0150291372
0.0848201540 -0.2144920038 0.0240929370
0.2700932707 -0.0179289508 -0.0274449465
0.1601305370 -0.2146968514 0.0546965110
0.1230057480 -0.1933940952 0.0195973973
-0.0295924879 -0.4512129573 0.1314517555
0.0212563901 0.1178076585 -0.0755212658
0.2094555186 -0.1120157333 -0.0487971913
0.3920797935 0.1786031526 -0.0628720741
0.4017272171 0.1450470562 -0.0628896143
0.4555771892 0.0800237086 -0.0529125362
0.1895948472 -0.1756797257 0.0481216515
-0.1888902872 -0.2934049913 -0.2207738265
0.4161873066 0.1581681555 0.0493602333
0.1007857890 0.0797512174 0.1230765684
-0.4108027877 -0.4250840385 -0.0211306756
0.2060005052 -0.0677757958 -0.0905066906
-0.1309391492 0.1130309595 0.0680088590
-0.1364383634 -0.3612904765 -0.1428485293
-0.0731831585 -0.3978779196 -0.1763580687
0.1283091041 -0.1806982030 -0.0524457374
0.1337108053 -0.2247507116 0.0772098845
0.2009013385 -0.0724588535 0.1208842615
-0.1722944043 -0.4538405177 0.1882122214
0.4295208320 0.1770117342 0.0160894313
-0.1071435006 -0.4146479624 0.1189480749
-0.1717499307 -0.3095583641 -0.1068010738
-0.4956771595 -0.3839932937 -0.0155840330
-0.4225349783 -0.3236519821 -0.1213992159
0.2436803886 0.1423562562 0.0992593469
0.2996249465 0.0175566366 0.0474413776
0.4467489136 0.0542558339 -0.0385901271
-0.0353493611 -0.2543746246 0.0798010365
-0.4083265775 -0.3570835091 -0.0851636132
-0.3184043383 -0.4799368938 -0.1499721178
-0.1080225426 -0.4060471923 0.1653335792
-0.4957027134 -0.3840165125 0.0147805327
0.2911851158 0.0490766153 0.0821433246
-0.1719295703 -0.3097215878 0.1066563878
-0.1069431292 -0.4144659013 -0.1191441522
0.4295465564 0.1770351078 -0.0144776502
0.2011040921 -0.0722746279 -0.1200385311
0.1338403400 -0.2246330140 -0.0767102627
0.1282203613 -0.1807788364 0.0530033030
-0.0734798981 -0.3981475426 0.1762440346
-0.1308251610 0.1131345313 -0.0674381237
-0.4108377447 -0.4251158011 0.0204071750
0.4162690735 0.1582424504 -0.0477996265
0.1186964378 -0.0804569224 0.1516205014
-0.0352151875 -0.2542527120 -0.0796312646
0.4466827382 0.0541957057 0.0400430296
0.2997038297 0.0176283114 -0.0462920080
-0.0694100658 -0.3985797491 -0.1612907964
-0.1119746981 -0.4130368971 -0.1760178747
-0.1860210813 -0.4341765651 -0.1928712016
0.2700461974 -0.0179717225 0.0284901473
0.4688440804 0.1524394700 -0.0054770272
0.4849977712 0.1040314593 0.0166226840
-0.2598121784 -0.4554184068 0.1139676045
0.4099125671 0.1641001909 0.0540732243
0.2910926039 -0.2652736091 0.1230683347
-0.4296575189 -0.3391051118 -0.0606133279
-0.4218270400 -0.1786529575 0.1554585872
0.2180631159 0.0294813585 -0.1176640703
-0.4743466022 -0.1972283699 -0.0741738738
0.2265888420 -0.2931023508 0.1178530528
0.2959266204 -0.3218041627 0.1239975284
-0.4323598527 -0.3544111814 -0.0581691803
-0.1152867458 -0.1886703052 0.2138100594
-0.4316578913 -0.4309434325 -0.0223235758
0.4660315195 0.1419901433 -0.0249289254
0.2597464281 0.3580730101 -0.1202827856
0.3062914932 0.4706185392 -0.1613348876
-0.2040610564 -0.4137972059 -0.1937110090
-0.4474105403 -0.2940275416 0.0487555576
0.1896752800 -0.1756066429 -0.0474529985
0.4554868616 0.0799416353 0.0544196684
0.3919726657 0.1785058143 0.0644230662
0.4016200892 0.1449497179 0.0644055260
0.2093727135 -0.1120909716 0.0495963853
0.0211285754 0.1176915237 0.0763551014
0.1230382876 -0.1933645290 -0.0190679880
0.2893846518 0.4272368970 -0.1602857920
0.3209288925 -0.2813979746 -0.1507153497
-0.0360753865 -0.4385576993 -0.1873970497
0.4689401934 0.0570537430 -0.0283701847
0.4081784203 0.1631235452 -0.0580611884
-0.0876380670 -0.2357420925 -0.1662407969
0.2341769273 -0.0589144558 0.0286998385
0.2631433354 0.0984811864 -0.1145461044
0.1843131261 -0.1402019051 0.0408118575
-0.4815195500 -0.3137263278 0.0287220585
0.3869724401 0.1413833140 -0.0846136226
-0.0010232875 -0.2431397912 -0.0432225747
-0.4352928975 -0.0752534667 0.0991861225
0.2154237840 -0.1239413591 -0.1245143577
-0.0263817935 -0.0347470730 -0.1383555642
0.2578116447 -0.3294913007 0.0935414302
-0.2904592433 -0.4365831973 -0.1106538716
0.2477503258 -0.3219749343 0.0937621764
0.2441958045 -0.2516354401 0.1388786121
-0.2081744350 -0.4278870205 -0.1857429698
0.3194792710 0.4167678851 -0.0831458190
-0.1142881409 -0.1295747872 -0.2081310309
-0.2691526299 0.0411287354 0.1297795399
-0.1926100572 -0.3552920580 -0.1258807978
-0.0300588835 -0.1540114325 -0.1156086062
0.2593096580 0.0402612260 0.0937986589
0.1518728469 -0.0527238756 0.1532280707
0.0415151902 0.0263893157 -0.1320213969
0.0938097370 -0.1879488330 -0.0665167728
0.1572560623 -0.2377098402 -0.1145466161
-0.3141023229 0.0807760161 -0.0391682582
-0.0561908627 0.0490478026 -0.1358107303
-0.0373772986 -0.2150719001 0.1241175488
0.2825354614 0.3001468784 -0.0887782470
0.3141655409 0.1537506346 -0.1018245997
-0.2524370177 -0.4025218605 -0.2087241656
-0.1277306170 -0.4663206632 0.1819982647
-0.0216919354 -0.4481795905 0.1432927824
0.3232593424 0.4782976449 -0.1211115753
0.3488470949 0.1512459021 -0.0870008535
-0.1647717108 -0.4876137146 -0.1732409287
0.2556305086 -0.2446067251 0.0942958509
-0.1907929778 -0.4077129282 0.1372968111
-0.3700636210 -0.3909934593 -0.0328988897
0.4914632895 0.0780415125 0.0254665830
-0.0815365105 -0.4232743820 0.1954780156
0.2698737922 0.4080745326 0.1201330664
0.3356927623 -0.2594796088 0.1120801579
0.0926770577 -0.0120226785 -0.1373231773
0.4505799306 0.0437753587 -0.0240544974
-0.2400477935 -0.4761487220 -0.1889142714
0.2295942648 0.1660372322 0.0599984365
-0.1650629590 -0.4878783481 0.1728359762
0.2803390210 -0.3113628309 0.1390810042
0.2732622018 0.1887195212 0.0960305545
0.3129558565 0.4863541994 0.1345042347
0.4889023711 0.1074532825 0.0116052574
-0.3120577585 -0.4181194332 -0.1702397814
-0.0091181033 -0.2148927460 -0.0790426536
0.2836929232 0.0251743132 0.0626178430
0.2568150552 -0.3257162598 0.1241524990
-0.0203097471 -0.4269770320 0.1490190162
0.2667684388 0.3360749030 -0.0789850784
0.4252596479 0.0849994229 0.0720193218
0.3772339253 0.2030684967 0.0354952549
0.2876096716 -0.3123078773 0.0808362662
-0.0363907068 -0.4388442050 0.1872835810
-0.0685329941 0.0011703851 0.1540730973
0.2557431295 -0.3295386950 0.1159549212
-0.1529657799 -0.2880211318 -0.0750482654
-0.0540628643 -0.4025098982 -0.1801322205
-0.2383411195 -0.3525509788 -0.2098955895
0.3077243559 0.4853974349 -0.1461950137
0.3794685304 0.1713261824 0.0784260522
-0.1402771598 -0.3646953337 -0.1839509226
-0.2386941323 -0.3528717327 0.2095733867
-0.1146386464 -0.1298932628 0.2083585191
0.2771437356 0.2024043899 -0.0625688465
-0.0543659779 -0.4027853128 0.1800438570
0.1396877893 0.1294862631 -0.0932061464
-0.3135115346 -0.4713058848 0.1600338767
-0.0534005660 -0.2258272212 -0.1331938201
0.3446516162 0.2015164038 0.0566691473
-0.0475251206 0.1162201163 -0.0466694521
-0.4538974681 -0.1034798812 -0.0806993385
-0.1122707910 -0.4133059325 0.1758157161
-0.2389538727 -0.4360568275 -0.1971895764
-0.1077441081 -0.4057942016 -0.1655175136
-0.0200588697 -0.4267490802 -0.1490871357
0.3349694829 -0.2702016927 0.0977637077
-0.4082978853 -0.0366148738 -0.0941190511
0.0223509641 -0.2091643544 -0.0533667400
-0.4871611343 -0.3936084985 0.0246489703
0.0697344317 0.1451884167 0.0247847506
-0.3864752826 -0.3932835909 -0.0194378239
0.3246743191 -0.3110513073 0.1262529650
-0.1273965564 -0.3288759860 0.0259695890
0.0277646211 0.0892368901 -0.0955180556
0.3317523783 -0.3072018139 0.0907307733
-0.4755083344 -0.3261660276 0.0420662063
0.2647290899 0.3185214798 0.1431459245
-0.1719773092 -0.4535523993 -0.1885773669
-0.1274240281 -0.4660420910 -0.1823072727
0.2907221874 0.0889747706 -0.1048582768
-0.1149269881 -0.1883434228 -0.2136735374
-0.3132416454 -0.4710606586 -0.1606631443
0.2512336456 0.3051548653 0.1112164292
-0.0683956974 0.1262717137 0.0307353403
0.2676147264 0.1322182320 -0.1046956793
-0.4649150178 -0.3057475409 0.0339447011
0.2922360443 0.2270713577 0.0244119359
0.3083093540 0.1990856022 0.0297672467
-0.2174068401 -0.4523878093 0.1165743039
0.1992227023 0.1097249447 0.1135558341
-0.1761261415 -0.3344704385 -0.1212175762
-0.1540594901 -0.3818034778 -0.1905841444
0.2503060639 0.2754506720 -0.1080271991
0.3959321520 0.1506926478 0.0567688788
-0.1354364528 -0.4138722894 0.1382744515
0.3059454658 0.4185163426 -0.0811295473
0.3243879879 0.4075399749 0.0867005369
0.2663538674 0.3147853543 -0.1079091272
-0.1308707717 -0.3310824601 0.1331273940
-0.4605998215 -0.0971938069 -0.0301759091
0.0309396430 0.0567879915 -0.1241973814
0.2868521887 0.1943590728 0.0592163157
0.2875079202 0.1260086344 0.1163718951
0.2564087264 0.1910209285 -0.0780944623
0.2025680153 -0.1732440269 0.1527200057
0.3055794177 0.4510387236 -0.1021375588
0.2384299988 -0.2797709770 -0.1362727936
-0.1965082401 -0.4721701888 0.1882080887
0.2663332749 0.2067586962 0.0617411437
-0.3286066725 -0.4147231378 -0.1268717077
0.4049270109 0.1722267964 0.0580324530
0.2249166864 -0.2053624689 -0.1315344826
-0.1153939735 -0.4066258682 0.1464638433
0.2668839689 -0.0088353223 -0.0450910151
0.0391487006 -0.2214604815 0.0354494297
-0.4335655670 -0.0481907589 -0.0380382545
-0.0696814499 -0.3988263337 0.1611825441
0.2371906574 -0.2852518348 0.0814523331
0.3365780365 -0.3010224389 -0.0900979632
-0.1149350199 -0.2283924569 -0.2196959665
0.3199539250 -0.2605497309 -0.1180410233
0.3967056639 0.1682745751 0.0600814252
-0.2496772622 0.0878686397 -0.0716985703
-0.4078757283 -0.3702106552 -0.0454405535
0.3031024531 0.1393742895 0.1120481275
0.4050159160 0.1441351477 -0.0640281516
0.3206746045 -0.2816290253 0.1514434457
-0.4468144501 -0.1784496320 -0.1351600170
-0.0993810860 -0.4594074614 -0.1160133687
0.2088917988 -0.0451165319 0.0783078705
0.1579538993 -0.1647523494 0.0430893611
-0.3543893148 -0.2821228352 0.1966854816
-0.2642595210 -0.3393252658 0.0816326077
0.2155327172 -0.0962731338 -0.0771834972
0.2095331079 -0.0944617839 0.0189777021
-0.4413072440 -0.2493014610 -0.1395299027
0.2083007601 -0.1735505650 0.0761979700
-0.3952715873 -0.3640571663 -0.0799879803
0.3143052272 -0.3128688848 -0.1418625649
0.0525650650 -0.0284563256 0.1342790129
0.2884056483 0.4064554227 0.1203592513
-0.2771223783 -0.0111016339 -0.1818081392
0.2375279187 -0.2327261933 -0.0883204192
0.2117290781 -0.0276934303 0.0925986350
-0.3069612813 -0.3689166635 0.0896665385
0.1775042217 0.1476290271 0.0378802399
0.2343869918 0.0007384786 -0.0941036329
-0.4049881838 -0.3098233759 0.1736524400
0.3162245801 0.1949555453 0.0587410201
-0.0619816088 -0.4346890535 -0.1174795357
-0.0588940296 -0.4106981726 0.1335682006
0.4010290143 0.1565275126 0.0535687980
0.1707001734 0.0721435973 0.1288419383
-0.0558675682 0.0855364685 0.0890335381
-0.1892617557 -0.2937425143 0.2206251656
0.2551869139 0.2610169724 0.1100628560
0.3705464089 0.1661810900 0.0704594529
-0.1689440323 -0.0256410842 0.1897110116
-0.1863454088 -0.4344712550 0.1925122722
0.3871672903 0.1697626159 -0.0704563704
0.1189510510 -0.0802255762 -0.1509247035
-0.1820293510 -0.4217419215 0.1857204005
-0.0179064070 -0.4383693361 -0.1503513225
-0.2618032741 -0.3862086858 -0.1146578513
0.4768612803 0.0785957846 0.0449800589
0.3911624057 0.0304482373 -0.0451111840
-0.0879179666 -0.2359964144 0.1663511170
-0.2619959125 -0.3863837206 0.1142455129
-0.0733062387 -0.4680428531 0.1708787614
0.2136967107 -0.0756730597 -0.0291031529
0.2630817985 0.2659183788 0.0970854514
0.2464954621 0.1811033273 -0.0478738111
0.2788972045 0.4163676099 0.1048861370
0.2808898917 0.4442412061 0.1247976008
0.3579376956 0.0138510979 -0.0158033032
-0.2749944279 -0.4909808742 -0.1250285038
0.3356959625 -0.2678880186 -0.1220348244
-0.1305545774 0.0886896102 0.0922238266
0.2383924802 -0.2655115947 -0.0801032893
-0.1074157191 -0.2752285920 0.2079438711
-0.0970629642 -0.2470363187 -0.2107415286
-0.2805767425 -0.2093658153 -0.2108730989
-0.2043867981 -0.4140931808 0.1933529968
0.4011178874 0.1566082643 -0.0520350390
0.4628288311 0.1046334170 0.0387788313
0.2541014419 -0.2405289314 -0.1225562728
-0.4555788024 -0.3554546029 -0.0568720003
-0.4489568457 -0.4281659712 0.0180135671
0.2373787050 -0.2328617715 0.0889833184
-0.1052735763 -0.2893006551 0.1413152798
0.0152281469 -0.1694640629 -0.0803189116
-0.1893641562 -0.4167106339 0.1321339573
-0.4347921542 -0.3101194549 -0.0945111039
0.4848800920 0.1151084791 0.0187679487
0.3958594361 0.1706838763 0.0683449775
0.3706637420 0.1662877011 -0.0689621932
0.4746761117 0.0565562733 -0.0254571885
0.4491937622 0.1315747945 -0.0414363320
-0.4596802165 -0.4112812569 0.0360169408
0.3220887638 0.4984245690 0.1578931323
-0.1364516025 -0.4863164188 0.1399942906
-0.1762635994 -0.2097806953 -0.2266844196
0.2775196754 0.3443449845 0.1555776335
-0.0995761417 -0.4595846926 0.1157624608
-0.1717520112 -0.2455518128 0.2264810474
-0.1546973980 0.0656671759 -0.1225439600
0.2652187230 -0.3317955270 0.1086438226
-0.0967926373 -0.2183817143 0.2092090487
0.2739736343 -0.3262137992 0.0874261898
0.3197546065 -0.2607308353 0.1188000287
0.3376287176 -0.2851681777 0.0906396701
0.1917360081 -0.2800712427 0.0753251014
0.2032332667 -0.0761275153 -0.0509910230
0.2095643536 -0.0944333934 -0.0181501926
0.3100189960 -0.2746043222 0.1519019123
0.3869029706 0.1586727212 -0.0711680596
0.4058840372 0.1407939717 0.0494313877
-0.4558102121 -0.2502987244 0.0942176831
0.2695226923 0.3084708174 -0.0679492854
0.4050233713 0.1723143511 -0.0564681122
0.2260577485 -0.2998935199 0.0963923503
-0.1211243016 -0.4533312874 0.1128172810
0.2734635370 -0.2864199503 0.1354001189
0.3054059715 0.4508811272 0.1039606652
0.3143186992 0.4750685333 0.1673020244
0.3265754992 -0.3078056050 0.1431007957
-0.4160360142 -0.3478310204 0.0715320228
0.3451941360 0.1751018126 0.0817346265
0.2663440010 0.2277650118 0.1007776359
0.2562761524 0.1909004693 0.0794372165
0.2208538030 -0.1829536692 -0.1153683656
-0.2862719390 -0.4647155936 -0.1800559537
-0.1086166051 -0.3226908972 -0.1911648126
-0.1793379774 0.0817639724 -0.0947948864
-0.1558367169 -0.3606471301 -0.2102579799
0.2657443433 -0.3210662751 -0.0809479463
0.2192947313 -0.2207839848 -0.1372982720
-0.3175613312 -0.3632815786 -0.1909306965
0.2984186789 0.2031406959 -0.0109739636
0.2021879540 -0.1408619449 0.1520356412
0.3333285891 -0.2650117637 0.1352911230
-0.4220945732 -0.4205607385 0.0353920280
-0.2172102602 -0.4522091933 -0.1170125288
-0.2369033782 -0.4945176894 -0.1254041840
0.2922759056 0.2271075765 -0.0229534812
-0.0850355245 -0.2510516147 -0.1357420849
0.2763261602 -0.2948256496 0.0803966981
-0.1951696449 -0.0562844680 0.2041314400
-0.2212752292 -0.3818973924 -0.1302211666
0.4680204693 0.1521517849 0.0134130828
-0.1352035143 -0.4136606372 -0.1385157497
0.2698723088 0.4019183543 0.1408874169
-0.3282010679 -0.3320711229 -0.1994640574
0.3193189116 -0.2690119664 -0.1419913616
0.4281072716 0.0396588503 -0.0437916114
-0.3066548999 0.0304173933 0.1272048462
0.0276031756 0.0890901978 0.0963202635
-0.0562576992 -0.4406354360 0.1920094885
-0.0469840095 -0.0491452323 0.1473255003
0.2498484487 0.2214290163 0.0989921308
-0.0143172253 -0.1835985582 0.1015141409
-0.0437905513 -0.4047088228 0.1510041993
-0.0679408887 -0.4124198432 0.1883712874
-0.3865074667 -0.3933128339 0.0188050715
0.2370334124 0.1037329240 -0.1129544085
0.3853084222 0.1539444840 -0.0799417293
0.0947568293 -0.1893540668 0.0805212419
-0.2463021144 -0.4966608719 0.1623836902
-0.2556408241 -0.4928367119 -0.1785707510
-0.1918562061 -0.3169846530 0.2129212386
0.2554454684 0.1780742681 0.0948668128
0.2744169909 0.3604056528 0.1233278931
0.0589848122 -0.1595178401 0.0907188987
0.2051052867 -0.1460604765 0.0519690780
-0.0562363389 -0.3983207608 -0.1516547618
0.2077436888 -0.1978667334 -0.1473463220
0.4959614647 0.0988295392 0.0082025669
0.2517191601 0.1528245012 -0.0941601371
-0.2567158645 -0.4378337496 0.1979242321
0.4088097321 0.1693306563 0.0411071213
0.2969285374 0.4151304787 -0.1654753229
-0.0148055928 -0.1245613887 -0.1135166646
-0.3305108494 -0.4663428208 -0.1414257340
-0.2366905042 -0.4744625266 -0.1146413520
0.3247829936 0.4160857697 -0.0950146716
0.2920664644 0.4275942826 0.0957320601
0.0824568657 -0.0659977897 0.1394244911
0.2696298437 -0.3291426746 0.1233657298
0.4500800169 0.0628563278 0.0559581683
0.3236559034 0.4535968681 0.1065048956
0.2788157172 0.2375040687 -0.0531038174
0.3107116666 0.0075667608 0.0292061494
-0.1853080934 0.1043973588 0.0731090224
-0.1948953636 -0.4682942039 0.1093114579
-0.4540330414 -0.1036030655 0.0803961526
0.3583709789 0.1154668245 0.0927186175
0.2124468422 -0.1276434832 0.0611723947
0.2697583170 0.3147460432 0.1424535944
-0.4371437274 -0.4115336077 -0.0455142411
0.4007118190 0.1598294306 -0.0672402437
0.2755242017 0.3544899786 0.1075536549
-0.0712281540 -0.3977778108 0.1479533233
-0.1350810664 -0.4263937727 -0.1846247871
0.2968326291 0.2113740810 -0.0158910737
-0.1530920303 -0.2881358452 0.0749693793
0.2559378386 -0.3293617789 -0.1154088934
0.2813502088 0.1615840899 -0.0958685109
0.1827332825 -0.0755877309 0.1510205210
0.4253796335 0.0851084440 -0.0705541218
-0.4368859824 -0.2859681130 0.1221814823
0.4293811575 0.1429058806 -0.0453293905
0.3040713209 -0.2855788011 -0.1540302534
0.2685915781 0.2341903310 0.0797937683
0.1538544380 0.1029847288 0.1177350756
-0.2345668465 -0.3136530467 0.2109453175
-0.3701184882 -0.3910433126 0.0322972279
-0.4179586719 -0.2501711996 0.1651034839
-0.0589799558 -0.1874881083 -0.1556373073
0.0850585609 -0.2058850605 -0.0426351393
0.3117337771 -0.2855047189 0.0803265461
0.1338774233 -0.2108321138 -0.1187252507
0.3599611139 0.1589751538 0.0870385480
0.3433719299 -0.2934763411 -0.1116102073
0.2649374598 -0.2446736139 0.1065383951
0.4153107981 0.1267888049 -0.0593097051
-0.0463204804 -0.4266247796 0.1237911306
-0.0136016420 0.0035696062 -0.1367116753
0.3433969281 -0.2713643526 0.1135859490
-0.1364389817 -0.4842570366 0.1649379391
0.3050815967 0.2278007013 0.0385528722
0.3358807462 -0.2593088033 -0.1112924302
0.2706037341 -0.3072094878 0.1357693889
-0.1024317898 -0.3216845716 -0.1726466597
0.4691237790 0.0620087718 0.0424852795
-0.3781604935 0.0030154810 0.0882825338
-0.2295801522 -0.4482542845 0.1925700974
-0.4348661690 -0.3812556698 -0.0630475463
0.2116206042 -0.1438180657 0.1459483791
-0.0889472093 -0.4151765367 -0.1885490271
0.0757726537 -0.1771673855 -0.0806369818
0.1780533613 -0.2254060489 0.1361742162
-0.1914016690 -0.4952988504 -0.1144760132
-0.1356153527 -0.4125747633 0.1671268471
0.2139636464 -0.0882144542 -0.1037676164
-0.0801009891 -0.0579059342 0.1652845985
0.2020683482 -0.2072071235 0.0700624103
-0.0564199558 0.0488396445 0.1364100628
0.3044893088 0.2416358716 -0.0362504335
0.0936973679 -0.1880509336 0.0670063100
-0.3617461237 -0.3393875213 0.1740689288
0.0412923659 0.0261868535 0.1327505397
0.3995400409 0.1812188528 0.0454974224
-0.2348668044 -0.0124967228 -0.1834982903
0.0876245292 -0.1817111244 -0.0915325962
-0.1558456972 -0.4183359124 0.1255139734
0.2152135422 -0.1241323886 0.1253063269
0.2342244561 -0.0588712702 -0.0277764613
0.3391578196 0.0641064075 -0.0870360683
0.1325136878 0.1451411782 0.0800045495
0.3149202777 -0.3004368837 0.0859254092
-0.4034922027 -0.3404869401 0.1348996387
-0.1351572734 -0.4243957791 -0.1188705515
-0.0321592817 -0.4161720207 0.1741863269
-0.4534839972 -0.3966922642 0.0495250701
0.2889401914 0.4510496548 0.1164226241
0.4038200211 0.1519307073 0.0651913548
0.4310878807 0.1640761607 -0.0300474095
0.3759993953 0.1793702388 -0.0621122004
-0.2845144706 0.0520658076 -0.0955404265
-0.2025447498 -0.1638474107 -0.2205301723
0.1300541730 -0.1708760212 -0.1356871497
0.2595426255 0.3578878313 0.1218865266
0.0717448876 0.1328021492 -0.0828405241
-0.4593561861 -0.1911604181 -0.1155653314
0.1555105279 -0.2364450344 -0.0654730560
-0.4324572121 -0.3544996440 0.0575185464
-0.2375475545 -0.3392100992 0.0371353972
-0.3437083060 -0.3796269735 0.1156751777
0.3945366479 0.1567116008 -0.0709303579
-0.2186274093 -0.3223176504 -0.0733024497
-0.2748220708 0.0996881211 0.0368437295
0.2315224563 -0.0267077675 -0.0817851906
0.3874366019 0.1509662772 -0.0723560109
0.4116277611 0.1577323413 0.0414881978
-0.4765527532 -0.4141858173 -0.0054326343
0.2554962020 0.0084215403 -0.0761515031
0.2548118766 0.3203121529 0.0987623270
-0.2388477574 -0.2533139756 -0.2239125729
0.2972077084 -0.3193295435 -0.0907433320
0.2884588710 -0.2683348345 0.0870659673
-0.3559803412 -0.0547279141 0.1669112538
0.1833524339 -0.2617107534 -0.1012502723
0.2057052240 -0.2716311376 -0.1095817768
0.2633083475 0.2650455561 -0.1098678076
-0.1825663984 -0.4277799896 -0.1206798154
0.2913223776 0.0492013340 -0.0809587023
-0.4084694029 -0.3572132829 0.0845492740
-0.0465881016 0.1041882183 0.0768639107
0.2404078852 -0.2611244114 0.1424506075
-0.3249492039 -0.4643528271 -0.1258183470
0.2323395888 -0.3007121018 -0.0870860233
-0.2949060239 -0.3914717602 0.1084550213
0.2952014632 0.2663138119 0.0415954535
-0.1144997310 -0.2917627397 0.0645113132
0.2003810115 -0.2344260886 0.1327538113
-0.1168930364 -0.0087350019 -0.1740163785
0.2438464064 0.1425071030 -0.0980119820
0.3838787305 0.1631321869 -0.0680828985
-0.4203834417 -0.3968860517 -0.0539177934
-0.4227388161 -0.3238371929 0.1208119961
-0.0101865146 -0.0711154701 0.1267901083
0.2058474441 -0.0679148699 0.0913687828
0.3952213773 0.1453602366 -0.0677144992
0.1009921775 0.0799387458 -0.1221653972
-0.2067501863 -0.3417619674 0.0260070146
0.4083791644 0.1801142205 -0.0562055968
0.3278206096 -0.2573902748 -0.1091969333
0.1409063585 0.1586700810 0.0328648148
-0.3465390372 0.0556436947 -0.0476994981
-0.4862769084 -0.3642231711 -0.0351026396
0.1946301572 -0.2063494537 0.1495036205
0.3980824849 0.1827375791 0.0668430144
0.3730901756 0.1508497480 -0.0704850071
0.0848603405 -0.2144554895 -0.0236588895
0.2018952104 -0.2400557249 -0.0692415222
0.2170542731 -0.2005894830 -0.0821596135
0.1111796105 -0.1930033006 0.0680752074
-0.4947547853 -0.3444205968 -0.0208940668
0.3406222259 -0.2783862602 -0.1336612654
-0.0751342424 -0.2611763124 -0.0988393453
0.0352954733 -0.0737876121 0.1256822420
0.1031007341 -0.1918081128 0.1043453011
0.3922733283 0.1628406854 -0.0713058387
-0.0293711348 -0.4510118319 -0.1315720275
-0.1106050261 -0.3189643279 0.1461543148
0.1602221272 -0.2146136309 -0.0541359398
-0.3249153963 -0.4003942683 0.1185475822
0.3270394927 0.4973340673 0.1449598791
0.2971215593 -0.2638579952 -0.1035456261
0.2417866125 -0.3149725391 -0.1173371938
0.2402352493 0.1701552027 -0.0315290425
-0.3140763500 -0.4630809864 -0.1186631320
-0.0443797874 -0.4567621214 -0.1817020014
-0.0949644838 -0.1958109840 0.1945035327
0.2465024426 -0.2265058231 -0.1118279052
-0.0690739546 -0.4164856566 0.1165904151
0.3123922312 0.3837583902 -0.0708584619
0.3025655685 0.2065721841 0.0320156002
0.2499654258 0.1819399065 0.0633867136
0.2912568794 0.2752273873 0.0482971099
0.0710539964 -0.2016140729 -0.0521421276
0.3377604192 -0.3004036970 -0.1274502315
-0.3411411943 0.0084227576 0.1262209133
0.4794504727 0.1070683378 0.0186804149
0.2105434634 0.0671817473 0.1222608063
-0.4499556384 -0.3182809672 -0.0517014527
-0.0593172345 -0.4239572812 0.1926458373
-0.0901124641 -0.2441558926 -0.1999527559
0.1759813396 -0.2012755308 -0.0502926064
0.3975859216 0.1133527450 0.0790743502
0.1362536795 -0.1273799179 0.1511478091
-0.0291182309 -0.4146406199 -0.1519478441
0.3170064881 -0.2599585562 0.1315335400
0.2684567019 0.1980782429 -0.0344157676
0.4833730479 0.1317527855 -0.0075441872
-0.1288714807 -0.1548871417 -0.2172640100
0.3979945192 0.1353123834 0.0565214211
0.3837811643 0.1847574255 0.0565472685
0.3984842779 0.1782028459 0.0596086653
0.2938462093 0.3921482381 -0.1050102311
0.2824937371 0.2026097445 -0.0105641173
0.2799554741 0.3832208292 0.1604488458
-0.0395155054 -0.2866148271 0.0354206983
0.3823493876 0.1389499091 -0.0660973025
0.3230228332 0.3518999292 0.0729369614
-0.0589928749 -0.4236625621 -0.1927758120
0.2481891527 0.1644777470 0.0789609464
0.3148685946 0.2763858173 -0.0550514470
0.4266311837 0.0304012429 -0.0306387171
-0.4105955000 -0.4111374682 0.0377425011
0.2394404743 -0.2217803638 0.0986956754
-0.2451136891 -0.3668859319 0.1089032988
-0.3089935727 0.0640891785 -0.0723497791
0.2628594135 0.2866900738 -0.1204883829
0.3283032152 0.4790131532 -0.1271392012
0.2086967985 -0.1035455086 -0.0388948358
-0.1697075936 0.1211265944 0.0334359781
-0.3691281709 -0.3666500292 -0.1265105728
-0.0870813070 -0.3089794475 -0.0315540215
-0.1103589807 -0.3187407665 -0.1462101653
0.1836468311 0.0092012016 -0.1449223925
0.4280388255 0.0265707415 0.0172289791
0.3988599851 0.0907855953 -0.0817419065
-0.2721097866 -0.4925712148 0.1629109607
0.1879844148 0.1579045393 -0.0154241626
-0.3170665451 -0.4774472585 0.1248954733
0.0413135081 -0.1816686532 -0.0675023886
-0.2761022681 -0.4480326898 -0.1907305120
0.2151428223 -0.1886932525 0.1371843970
0.3298510477 -0.2682676469 -0.0855010169
0.2817679214 -0.2721404855 0.1303237005
-0.2424262492 -0.4101258951 -0.1226650363
0.2689723274 0.2108597266 -0.0790033190
0.0265628932 -0.1371215686 -0.0954884758
0.0128731409 0.1286186201 0.0314084210
-0.2245657540 -0.4615604396 -0.1931019553
0.2880120048 0.3667556861 -0.0695837739
0.2931437925 -0.3137438187 0.1367552057
0.4926558367 0.1142102632 -0.0136636791
0.3925130781 0.1662528900 0.0718048236
0.3237874757 -0.2640813899 -0.0971499194
0.2025384031 -0.0844520555 0.1309696822
0.3201668430 0.1734464595 0.0801666587
0.2482412624 0.2598778142 -0.0983026161
-0.2693552927 -0.3597740220 0.1006410444
-0.0849960419 -0.2245803086 0.1672689722
-0.4577391208 -0.2919365293 -0.0344390774
0.0145500995 -0.0382229795 0.1325600658
0.1716009144 -0.2650986500 -0.0718781391
0.2394627687 0.0321747086 0.1122443056
0.2237052824 -0.1933166444 -0.0961371930
0.4094042640 0.1526679882 0.0569109183
-0.1141090107 -0.3393231024 0.1758719052
-0.1074757761 -0.4468147425 0.1941195032
-0.0198856140 -0.4389542687 -0.1694752570
0.2406471251 -0.2609070337 -0.1418272076
0.4039891792 0.1638640810 -0.0634855257
-0.4577965827 -0.2919887401 0.0338401685
-0.2691855754 -0.3596198137 -0.1010262737
0.2480745991 0.2597263810 0.0997357122
0.3203005778 0.1735679733 -0.0787442225
0.2027581449 -0.0842523940 -0.1301395119
0.3416785218 -0.2883704183 0.1268816918
0.3236233200 -0.2642305448 0.0979088663
0.1533694136 -0.0893084087 -0.1559729171
-0.1087372197 -0.2707976972 0.1037970303
0.2933734389 -0.3135351577 -0.1361231819
-0.4161741916 -0.0965967601 -0.1456718431
0.2878934855 0.3666479972 0.0712473356
-0.0981105212 -0.1630476721 -0.1986994789
0.4094987564 0.1527538457 -0.0553701204
0.2235428819 -0.1934642045 0.0968359129
0.2396507907 0.0323455488 -0.1111736739
0.1714795115 -0.2652089589 0.0723794444
-0.1357781555 -0.4480853664 0.1856507250
-0.4206318618 -0.2884364415 -0.1504614186
-0.0941831814 -0.4759266080 -0.1593133891
-0.1591721438 -0.0980726270 -0.2129552862
-0.0944511023 -0.4761700458 0.1590448073
-0.2764228465 -0.4483239732 0.1901981964
0.0411995473 -0.1817722000 0.0679120054
-0.3168557851 -0.4772557582 -0.1255409059
0.0585702631 -0.0861516927 -0.1271605540
0.2177345590 -0.1677201988 -0.0988577756
0.1879574641 0.1578800515 0.0166001015
0.3987212001 0.0906594927 0.0831699598
-0.0904490906 -0.2444617576 0.2000451419
0.4280666636 0.0265960357 -0.0158497637
0.0129253017 0.1286660144 -0.0305718855
0.0264017915 -0.1372679485 0.0959413201
0.2688381813 0.2107378390 0.0803963934
0.2452634224 -0.3112329490 0.0830314552
-0.2426323605 -0.4103131716 0.1222475502
0.2819867053 -0.2719416944 -0.1296472152
-0.2518702726 -0.0466319663 -0.2014690541
0.1901011070 -0.0524667724 -0.1427024542
-0.1895814778 -0.4101163818 0.1798453135
0.2396060190 -0.2216299469 -0.0980134976
-0.4105313836 -0.4110792108 -0.0384441717
0.4265784509 0.0303533289 0.0320212976
-0.0201707916 -0.4392133862 0.1693882450
-0.3556993516 -0.0544726018 -0.1669758300
0.3147746135 0.2763004244 0.0566220443
0.2483209716 0.1645975200 -0.0776733779
-0.0283775118 -0.4506127870 -0.1698785431
-0.3693406312 -0.3668430745 0.1259463088
-0.1913289579 -0.4967702879 0.1671889976
-0.1696517519 0.1211773332 -0.0329182040
-0.1910471655 -0.4965142462 -0.1676520055
0.2086306505 -0.1036056118 0.0397057321
0.1919823055 0.1414516482 -0.0775150238
0.2118656211 -0.1435954388 -0.1451940229
-0.1071488389 -0.4465176814 -0.1943650227
-0.1138129157 -0.3390540651 -0.1759642462
-0.0798231240 -0.0576534609 -0.1648898122
-0.1804899051 -0.3935886280 0.2025578757
0.2802241219 0.3834649275 -0.1587730688
0.2824747752 0.2025925153 0.0119675101
-0.2978299127 -0.3974849290 0.1856961973
0.2936680213 0.3919863333 0.1067223546
-0.2248903796 -0.4618554003 0.1926358047
0.3985832936 0.1782928133 -0.0580471890
0.3980883945 0.1353976802 -0.0550263708
0.3838750397 0.1848427224 -0.0550005234
-0.4706137044 -0.3978011462 -0.0408949885
-0.1903781266 -0.4159568416 0.1767593726
0.4833589755 0.1317399991 0.0091773320
0.2683976200 0.1980245600 0.0357885423
0.3172272428 -0.2597579745 -0.1307791100
0.2852216178 0.4433172410 -0.1439445454
-0.1357088353 -0.3172120248 -0.2096854758
0.3841874046 0.1707871262 0.0719176727
0.3977177856 0.1134725590 -0.0776135128
-0.1595307459 -0.0983984594 0.2131551604
0.3231441657 0.3520101741 -0.0712368224
-0.2433713801 -0.3458144513 -0.1042773134
0.3822368961 0.1388476972 0.0675712658
-0.0394559828 -0.2865607437 -0.0353073593
-0.1801487303 -0.3932786303 -0.2028446332
0.2913368832 0.2753000802 -0.0467677589
0.2500710061 0.1820358387 -0.0620694902
0.1531062668 -0.0895475086 0.1567123930
0.3026182406 0.2066200429 -0.0305722537
-0.3424443446 0.0372312909 0.0831699403
0.3122715100 0.3836487006 0.0725890584
0.2463136428 -0.2266773700 0.1125141981
-0.3142755558 -0.4632619884 0.1180440733
-0.4775795562 -0.4126794693 0.0096388048
0.2401811021 0.1701060036 0.0328116205
0.2415886604 -0.3151524020 0.1178802402
0.2969466762 -0.2640168973 0.1042600155
-0.3247154088 -0.4002125560 -0.1190884024
0.3104360521 0.4547498828 0.1292532660
-0.4500421323 -0.3183595572 0.0510753105
-0.1171862735 -0.0090014424 0.1744237926
-0.1354654308 -0.4478012190 -0.1859457300
0.2107483405 0.0673679023 -0.1211852865
0.4794805774 0.1070956915 -0.0170915552
-0.3409287947 0.0086157478 -0.1261638074
0.3375452907 -0.3005991667 0.1281770696
0.1834021143 0.0089788475 0.1458633955
-0.0984451316 -0.1633517053 0.1989027968
0.0709658726 -0.2016941438 0.0525713383
0.3403966110 -0.2785912580 0.1344265762
-0.0693407905 -0.4663871510 -0.1252079051
-0.1176506679 -0.3198871841 -0.2044371679
-0.0901328700 -0.2814238651 0.1785318207
0.4962660227 0.1107378210 0.0092675731
0.1112937613 -0.1928995811 -0.0675649801
0.2169154176 -0.2007156497 0.0828360524
-0.2522094768 -0.0469401734 0.2015917204
0.1032759424 -0.1916489154 -0.1038467500
0.1559499914 -0.2521961468 0.0922054404
0.0355065388 -0.0735958341 -0.1251172690
-0.0753006804 -0.2613275410 0.0989312898
0.1898601967 -0.0526856679 0.1435602484
-0.0232119478 -0.4284320017 0.1743788508
-0.3162203487 -0.0225874414 -0.1761516758
3 139 630 409
3 725 1135 367
3 231 142 1106
3 142 231 548
3 231 725 548
3 725 231 512
3 725 512 1135
3 969 1118 312
3 305 312 1118
3 1135 175 367
3 717 725 437
3 367 437 725
3 175 194 367
3 437 367 194
3 89 45 827
3 229 518 765
3 518 671 872
3 671 518 229
3 623 671 821
3 623 821 59
3 821 1087 59
3 765 582 483
3 1031 582 765
3 483 582 753
3 989 1141 872
3 1141 518 872
3 518 1141 765
3 1031 1141 989
3 1141 1031 765
3 229 821 671
3 858 616 821
3 821 616 1087
3 227 931 183
3 931 873 183
3 667 668 1215
3 892 667 1215
3 931 227 718
3 951 840 523
3 840 951 69
3 238 668 606
3 77 238 1
3 238 77 1224
3 1136 238 1224
3 653 387 537
3 387 892 537
3 387 653 335
3 840 335 523
3 387 840 269
3 840 69 269
3 840 387 335
3 931 718 1224
3 931 77 1
3 77 931 1224
3 951 523 227
3 117 309 835
3 1161 194 771
3 194 1161 437
3 1161 1154 1237
3 771 1154 1161
3 977 771 194
3 959 1154 771
3 959 771 977
3 1154 959 38
3 959 1137 38
3 175 89 194
3 842 194 89
3 194 842 977
3 791 959 977
3 670 1055 791
3 1137 959 1055
3 791 1055 959
3 977 842 234
3 428 791 977
3 234 428 977
3 670 791 709
3 428 709 791
3 496 428 234
3 709 428 1190
3 496 1190 428
3 827 842 89
3 842 827 234
3 116 496 234
3 1190 496 116
3 1077 45 89
3 637 116 234
3 827 637 234
3 824 637 1198
3 116 637 824
3 1190 116 824
3 623 45 699
3 827 45 623
3 59 827 623
3 601 827 59
3 637 827 601
3 1198 601 557
3 601 1198 637
3 872 671 699
3 671 623 699
3 557 310 652
3 310 557 601
3 1087 310 59
3 310 601 59
3 635 370 309
3 571 333 1047
3 670 709 333
3 770 333 709
3 117 1047 770
3 333 770 1047
3 1190 770 709
3 770 1190 379
3 770 379 117
3 942 731 1154
3 731 1237 1154
3 38 346 942
3 442 346 38
3 38 942 1154
3 1137 587 442
3 1137 442 38
3 1055 587 1137
3 670 1129 1055
3 587 1055 1129
3 1129 590 587
3 670 279 1129
3 80 907 279
3 279 907 1129
3 907 590 1129
3 647 907 80
3 835 647 80
3 647 451 907
3 1127 717 437
3 1127 437 1161
3 822 117 379
3 1225 379 1190
3 822 922 117
3 1225 822 379
3 922 1079 309
3 117 922 309
3 835 309 370
3 80 571 835
3 835 571 117
3 1047 117 571
3 279 571 80
3 670 333 279
3 571 279 333
3 680 510 360
3 510 1079 360
3 1195 969 680
3 510 680 969
3 510 309 1079
3 510 635 309
3 1211 45 305
3 45 1211 699
3 1225 824 822
3 824 1225 1190
3 1173 822 640
3 824 640 822
3 922 822 1173
3 1173 640 502
3 922 1173 1079
3 1173 502 1079
3 1079 502 360
3 753 425 838
3 502 838 425
3 589 502 425
3 680 360 502
3 425 1195 589
3 589 680 502
3 1195 680 589
3 32 1118 753
3 1118 425 753
3 1118 32 1211
3 1118 1211 305
3 1118 1195 425
3 1198 557 24
3 681 1198 24
3 681 824 1198
3 419 502 681
3 681 502 640
3 681 640 824
3 681 24 419
3 502 419 838
3 419 1091 838
3 1091 419 269
3 483 1091 269
3 483 753 1091
3 838 1091 753
3 32 582 1211
3 582 1031 1211
3 582 32 753
3 699 989 872
3 1031 989 1211
3 989 699 1211
3 652 585 557
3 557 585 24
3 58 24 585
3 419 24 269
3 269 24 58
3 739 227 464
3 718 227 739
3 1224 718 739
3 238 1168 1
3 1168 238 606
3 417 384 1172
3 668 416 1172
3 416 417 1172
3 668 1136 416
3 892 384 928
3 384 1065 67
3 984 69 951
3 892 281 538
3 1172 384 892
3 928 537 892
3 1032 416 1164
3 1032 1164 568
3 858 821 229
3 616 310 1087
3 652 310 37
3 37 585 652
3 281 585 538
3 585 37 538
3 585 281 58
3 984 832 269
3 183 832 984
3 832 183 873
3 269 832 483
3 832 873 483
3 833 873 931
3 765 873 833
3 873 765 483
3 931 1 833
3 1 197 833
3 833 197 765
3 765 197 229
3 858 197 1168
3 423 616 858
3 229 197 858
3 1095 616 423
3 538 37 1095
3 37 310 1095
3 1095 310 616
3 606 423 1168
3 1168 423 858
3 667 1095 423
3 892 538 667
3 1095 667 538
3 668 667 606
3 606 667 423
3 1215 1172 892
3 1172 1215 668
3 1 1168 197
3 416 1136 1224
3 238 1136 668
3 1114 1164 429
3 17 418 568
3 1114 17 1164
3 17 568 1164
3 418 636 568
3 636 1065 568
3 67 1065 636
3 417 568 1065
3 1065 384 417
3 417 1032 568
3 1032 417 416
3 67 928 384
3 503 653 928
3 636 503 67
3 67 503 928
3 928 653 537
3 387 269 58
3 281 387 58
3 387 281 892
3 984 269 69
3 523 335 382
3 864 298 382
3 382 298 523
3 464 523 298
3 654 1023 115
3 115 464 298
3 739 115 1023
3 739 464 115
3 1224 739 1023
3 118 115 298
3 1051 115 118
3 1051 654 115
3 654 752 1023
3 118 298 864
3 752 429 1023
3 1224 1023 416
3 1114 429 752
3 416 1023 1164
3 1023 429 1164
3 418 654 1051
3 752 654 1114
3 17 1114 654
3 17 654 418
3 118 536 636
3 1051 118 418
3 118 636 418
3 382 503 536
3 636 536 503
3 653 382 335
3 503 382 653
3 382 536 864
3 536 118 864
3 183 984 951
3 183 951 227
3 464 227 523
3 635 969 3
3 370 635 30
3 159 46 141
3 3 159 130
3 3 368 635
3 368 30 635
3 368 3 130
3 312 305 141
3 46 312 141
3 46 3 969
3 3 46 159
3 370 1019 835
3 1019 533 647
3 835 1019 647
3 647 533 451
3 30 1019 370
3 1078 1019 30
3 1078 533 1019
3 368 1078 30
3 1078 368 130
3 130 164 1078
3 1197 533 1078
3 1197 1078 164
3 635 510 969
3 1118 969 1195
3 969 312 46
3 141 305 609
3 45 609 305
3 141 609 146
3 45 1077 609
3 297 1216 349
3 1216 854 349
3 597 295 795
3 795 295 285
3 396 1003 614
3 1080 1003 396
3 1080 297 1003
3 517 660 727
3 609 727 660
3 609 660 146
3 132 352 129
3 352 469 1106
3 129 352 1106
3 136 511 121
3 1009 511 372
3 136 372 511
3 372 1184 1009
3 974 372 136
3 974 246 372
3 255 246 974
3 246 1184 372
3 158 255 974
3 942 346 795
3 442 995 346
3 442 1174 995
3 587 1174 442
3 587 590 1174
3 203 907 451
3 203 451 624
3 907 203 590
3 624 451 577
3 451 533 577
3 1197 164 149
3 577 533 1197
3 1197 169 577
3 169 1197 149
3 823 285 185
3 285 529 185
3 285 823 795
3 995 795 346
3 185 712 823
3 958 823 712
3 823 958 444
3 823 444 795
3 444 942 795
3 712 1072 958
3 958 1072 301
3 1218 207 301
3 958 301 207
3 958 207 444
3 731 207 1237
3 207 1218 1237
3 942 444 731
3 207 731 444
3 127 201 162
3 1167 148 162
3 185 529 1167
3 42 201 127
3 162 201 1167
3 1167 201 185
3 712 185 201
3 712 201 42
3 127 122 42
3 596 42 122
3 1008 596 154
3 596 122 154
3 596 1072 42
3 1072 712 42
3 1072 596 1008
3 1072 1008 301
3 123 1008 154
3 151 656 123
3 123 656 86
3 1008 123 301
3 123 86 301
3 705 656 151
3 125 689 151
3 705 151 689
3 689 650 705
3 705 650 457
3 705 457 656
3 717 457 650
3 457 717 1127
3 656 457 1127
3 1127 1218 656
3 86 656 1218
3 301 86 1218
3 1218 1127 1161
3 1218 1161 1237
3 142 129 1106
3 125 142 548
3 650 125 548
3 689 125 650
3 469 231 1106
3 725 963 548
3 963 650 548
3 963 717 650
3 725 717 963
3 517 62 512
3 512 175 1135
3 62 175 512
3 727 62 517
3 1077 62 727
3 89 175 62
3 1077 89 62
3 609 1077 727
3 782 545 225
3 512 782 225
3 517 512 225
3 713 225 545
3 660 517 713
3 713 517 225
3 545 551 713
3 998 713 551
3 660 713 1158
3 1158 713 998
3 146 660 163
3 551 926 998
3 499 660 1158
3 660 499 163
3 459 132 152
3 380 352 459
3 1045 776 551
3 776 926 551
3 1045 352 380
3 776 1045 380
3 1045 551 545
3 459 352 132
3 782 469 1045
3 545 782 1045
3 1045 469 352
3 231 469 512
3 512 469 782
3 152 1017 459
3 121 1017 152
3 1009 380 1017
3 1017 380 459
3 776 1009 1184
3 776 1184 76
3 1009 776 380
3 776 76 926
3 1017 121 511
3 1017 511 1009
3 1184 246 76
3 888 76 246
3 553 888 255
3 888 246 255
3 216 888 553
3 1158 998 216
3 888 216 998
3 76 888 926
3 888 998 926
3 135 553 158
3 553 255 158
3 553 135 499
3 553 499 216
3 163 499 135
3 216 499 1158
3 156 153 15
3 649 1148 356
3 356 1148 150
3 896 867 674
3 867 996 674
3 1030 304 403
3 600 233 896
3 319 600 896
3 674 319 896
3 1120 233 600
3 996 403 1170
3 385 350 300
3 1030 1084 304
3 1170 403 304
3 147 1084 1030
3 147 1030 131
3 1084 147 156
3 294 296 1074
3 205 294 1074
3 325 296 294
3 296 325 1059
3 1074 296 874
3 296 1059 874
3 383 211 870
3 195 870 211
3 195 211 325
3 294 195 325
3 292 290 75
3 192 75 695
3 192 695 685
3 192 292 75
3 435 290 292
3 555 254 435
3 254 555 16
3 254 1189 290
3 254 290 435
3 340 233 1120
3 643 233 340
3 108 1092 643
3 1092 233 643
3 1092 401 233
3 401 1092 222
3 896 233 401
3 272 1092 108
3 983 222 272
3 272 222 1092
3 308 222 983
3 222 308 401
3 682 204 308
3 204 212 401
3 308 204 401
3 401 212 896
3 212 867 896
3 1103 204 682
3 693 212 1103
3 1103 212 204
3 867 212 1163
3 693 1163 212
3 403 996 1163
3 1163 996 867
3 340 1120 300
3 643 340 1202
3 350 1202 340
3 350 340 300
3 111 108 643
3 1202 111 643
3 258 111 1067
3 193 258 1067
3 108 111 258
3 599 108 258
3 1059 599 258
3 193 1059 258
3 599 1059 166
3 108 599 166
3 1059 193 874
3 166 1059 325
3 325 211 166
3 211 687 166
3 1073 983 272
3 687 1073 272
3 166 687 108
3 687 272 108
3 78 211 383
3 1073 687 78
3 211 78 687
3 282 78 383
3 682 1073 78
3 308 983 1073
3 16 282 383
3 282 16 682
3 282 682 78
3 682 308 1073
3 555 357 16
3 682 16 357
3 357 1103 682
3 435 55 555
3 555 55 357
3 55 1103 357
3 292 55 435
3 292 628 55
3 1103 55 808
3 628 808 55
3 192 1096 292
3 1096 192 685
3 628 292 1096
3 1096 808 628
3 1096 1199 808
3 1103 338 693
3 338 1103 808
3 31 834 880
3 1199 31 880
3 808 1199 880
3 338 808 880
3 1163 693 338
3 834 1060 1053
3 761 1200 338
3 880 1053 338
3 338 1200 1163
3 1200 403 1163
3 1030 1053 131
3 1053 1060 131
3 1053 1030 761
3 1053 761 338
3 403 1200 761
3 403 761 1030
3 834 111 893
3 880 834 1053
3 165 1060 126
3 131 1060 165
3 111 1202 893
3 828 893 1202
3 834 893 1060
3 828 1060 893
3 828 126 1060
3 828 350 155
3 126 828 155
3 350 828 1202
3 31 937 834
3 111 937 1067
3 937 111 834
3 1194 937 31
3 1067 1194 193
3 1194 1067 937
3 1036 1199 1096
3 1199 1036 31
3 1036 1194 31
3 1096 685 1036
3 1036 685 586
3 586 362 1036
3 362 1194 1036
3 193 1194 874
3 362 874 1194
3 604 188 695
3 685 695 586
3 695 188 586
3 188 362 586
3 188 604 1074
3 874 362 1074
3 188 1074 362
3 400 695 75
3 290 638 75
3 400 75 638
3 695 400 604
3 205 604 400
3 294 205 638
3 205 400 638
3 604 205 1074
3 1189 638 290
3 254 566 1189
3 556 1189 566
3 1189 556 638
3 556 294 638
3 566 870 556
3 195 556 870
3 556 195 294
3 16 1176 254
3 1176 566 254
3 1176 16 383
3 1176 870 566
3 870 1176 383
3 569 160 786
3 786 160 134
3 87 786 278
3 515 87 189
3 569 786 87
3 139 409 1005
3 773 365 531
3 715 531 365
3 855 715 365
3 365 805 855
3 997 855 805
3 101 855 997
3 393 101 997
3 997 324 393
3 12 393 324
3 1005 12 324
3 324 773 1005
3 531 1005 773
3 531 715 914
3 531 914 900
3 715 576 914
3 715 855 576
3 576 101 605
3 855 101 576
3 101 223 605
3 393 223 101
3 531 956 1005
3 956 524 1005
3 900 956 531
3 900 914 247
3 914 576 1192
3 576 182 1192
3 576 605 182
3 605 319 182
3 605 600 319
3 605 1120 600
3 605 223 1120
3 223 300 1120
3 300 223 385
3 393 385 223
3 12 385 393
3 385 12 409
3 409 12 1005
3 139 1005 524
3 579 1143 170
3 170 723 579
3 170 208 491
3 170 1143 330
3 170 330 208
3 535 755 257
3 140 181 145
3 181 436 145
3 341 674 573
3 1084 15 304
3 381 63 708
3 28 768 420
3 213 768 28
3 978 63 381
3 408 105 63
3 408 213 105
3 825 408 241
3 990 363 468
3 228 468 1029
3 895 468 455
3 1029 468 895
3 1029 895 412
3 1126 402 190
3 472 728 1126
3 412 190 402
3 901 1153 226
3 901 402 728
3 567 196 901
3 1153 479 467
3 1153 467 1115
3 226 1153 1115
3 728 369 100
3 472 369 728
3 901 728 100
3 97 479 1028
3 775 479 97
3 97 1034 775
3 28 97 1028
3 420 97 28
3 97 420 1034
3 467 479 775
3 1006 1100 1028
3 377 1006 920
3 1100 1006 377
3 1100 377 1089
3 1028 1100 1089
3 1089 28 1028
3 113 912 253
3 113 253 377
3 708 1089 253
3 708 105 1089
3 408 63 978
3 63 105 708
3 920 113 377
3 253 1089 377
3 253 912 708
3 381 912 369
3 912 381 708
3 978 242 241
3 241 408 978
3 241 455 825
3 241 242 455
3 363 825 468
3 468 825 455
3 228 990 468
3 251 990 228
3 1014 768 345
3 251 345 990
3 768 213 345
3 732 768 1014
3 420 768 732
3 825 363 345
3 363 990 345
3 213 825 345
3 825 213 408
3 105 213 28
3 1089 105 28
3 1110 732 1015
3 1157 732 1110
3 1034 420 1157
3 1157 420 732
3 701 775 1034
3 701 826 775
3 826 1115 467
3 826 467 775
3 826 29 1115
3 696 1115 29
3 982 29 981
3 251 982 981
3 982 696 29
3 982 473 696
3 696 473 1029
3 412 696 1029
3 110 696 412
3 696 226 1115
3 402 110 412
3 226 696 110
3 402 226 110
3 901 226 402
3 251 228 473
3 251 473 982
3 473 228 1029
3 455 242 895
3 190 242 472
3 895 190 412
3 190 895 242
3 978 381 472
3 190 472 1126
3 1041 100 369
3 100 371 1018
3 371 100 1041
3 1018 567 100
3 567 217 843
3 1018 217 567
3 901 100 567
3 402 1126 728
3 196 567 843
3 479 196 1188
3 1188 196 843
3 196 479 1153
3 196 1153 901
3 1188 843 217
3 217 766 1188
3 766 710 1188
3 710 479 1188
3 710 1028 479
3 920 710 766
3 710 1006 1028
3 1006 710 920
3 766 371 113
3 920 766 113
3 371 1041 912
3 113 371 912
3 912 1041 369
3 472 381 369
3 472 242 978
3 371 766 1018
3 766 217 1018
3 981 1108 251
3 981 595 286
3 286 1108 981
3 910 1231 595
3 286 595 1231
3 286 1231 943
3 943 526 286
3 526 1108 286
3 1108 526 964
3 1108 964 1025
3 330 1015 91
3 559 330 91
3 559 91 1048
3 91 1014 1048
3 1048 1014 1025
3 251 1025 1014
3 732 91 1015
3 91 732 1014
3 345 251 1014
3 1025 251 1108
3 1143 820 1110
3 1110 1015 330
3 1110 1034 1157
3 820 1034 1110
3 701 1034 820
3 414 701 820
3 60 826 865
3 701 414 865
3 826 701 865
3 82 29 60
3 29 826 60
3 595 981 82
3 981 29 82
3 595 82 910
3 60 293 220
3 220 960 60
3 960 82 60
3 910 960 209
3 960 910 82
3 306 250 293
3 1124 293 250
3 750 220 1124
3 293 1124 220
3 1142 960 220
3 750 1142 220
3 1142 209 960
3 209 210 1231
3 943 1231 210
3 209 1231 910
3 210 929 943
3 198 943 929
3 1228 198 594
3 198 929 594
3 526 943 198
3 964 526 1228
3 526 198 1228
3 594 504 1228
3 1048 1025 315
3 504 315 1025
3 504 1025 1228
3 1228 1025 964
3 491 208 461
3 559 461 208
3 1048 315 559
3 461 559 315
3 908 504 594
3 1013 565 908
3 565 504 908
3 565 1013 128
3 128 1013 143
3 315 504 128
3 565 128 504
3 128 133 315
3 133 461 315
3 491 133 138
3 133 491 461
3 138 137 803
3 803 802 1075
3 138 803 1075
3 138 1075 491
3 759 802 803
3 316 500 802
3 802 500 723
3 723 1075 802
3 933 723 500
3 491 1075 723
3 525 500 316
3 307 525 316
3 1121 525 250
3 525 1155 250
3 500 525 933
3 525 1121 933
3 306 1121 250
3 933 1121 579
3 579 723 933
3 491 723 170
3 1171 1121 306
3 1171 579 1121
3 293 1171 306
3 1171 293 865
3 1171 865 414
3 1143 1171 820
3 60 865 293
3 820 1171 414
3 579 1171 1143
3 330 1143 1110
3 208 330 559
3 1155 525 307
3 307 736 1080
3 1080 736 547
3 396 1155 1080
3 250 1155 396
3 547 1216 1080
3 593 614 1003
3 750 396 614
3 396 750 1124
3 396 1124 250
3 327 191 614
3 614 191 750
3 191 1142 750
3 1142 191 327
3 394 1233 327
3 1233 1142 327
3 1233 209 1142
3 916 394 327
3 995 280 271
3 580 394 916
3 8 394 580
3 394 8 1233
3 1093 8 871
3 1233 1093 209
3 8 1093 1233
3 871 780 1093
3 1086 1093 780
3 657 1086 780
3 1093 210 209
3 1086 210 1093
3 1040 929 210
3 332 1086 657
3 1040 1086 332
3 1086 1040 210
3 594 929 1040
3 332 908 1040
3 594 1040 908
3 169 1013 332
3 1013 908 332
3 1013 169 143
3 143 169 149
3 137 759 803
3 946 971 316
3 316 759 946
3 759 316 802
3 759 137 946
3 307 316 971
3 307 971 736
3 1132 547 736
3 1132 173 547
3 1155 307 1080
3 854 1216 173
3 573 854 173
3 854 674 996
3 349 854 996
3 1080 1216 297
3 107 1003 297
3 297 349 107
3 645 1003 107
3 690 593 1003
3 327 614 593
3 597 916 690
3 916 327 593
3 690 916 593
3 663 597 690
3 271 916 597
3 995 271 597
3 280 580 271
3 1174 280 995
3 580 916 271
3 8 580 280
3 1174 871 280
3 871 8 280
3 590 871 1174
3 203 871 590
3 780 871 203
3 780 203 657
3 657 203 624
3 657 169 332
3 577 169 657
3 577 657 624
3 144 486 124
3 946 124 486
3 124 946 137
3 535 415 703
3 703 975 971
3 703 946 486
3 975 736 971
3 415 975 703
3 975 415 438
3 438 736 975
3 946 703 971
3 438 985 173
3 173 1132 438
3 736 438 1132
3 173 669 573
3 1216 547 173
3 319 674 341
3 674 854 573
3 64 1170 304
3 64 645 1170
3 996 1170 645
3 996 645 349
3 349 645 107
3 15 962 64
3 645 64 962
3 645 663 1003
3 15 153 962
3 490 962 153
3 663 645 962
3 1003 663 690
3 153 1148 490
3 490 663 962
3 1148 649 490
3 649 18 490
3 490 18 663
3 295 663 18
3 597 663 295
3 18 649 529
3 285 295 18
3 597 795 995
3 285 18 529
3 764 535 186
3 764 186 144
3 486 535 703
3 144 186 486
3 186 535 486
3 415 985 438
3 985 257 947
3 257 985 535
3 985 669 173
3 535 985 415
3 947 669 985
3 249 341 669
3 341 573 669
3 319 341 182
3 15 1084 156
3 304 15 64
3 153 150 1148
3 148 1167 356
3 150 148 356
3 529 649 356
3 356 1167 529
3 161 1147 144
3 1147 1068 764
3 1147 764 144
3 1068 535 764
3 844 755 1068
3 755 535 1068
3 755 844 249
3 947 755 249
3 257 755 947
3 249 669 947
3 1192 182 1082
3 341 249 1082
3 341 1082 182
3 900 554 956
3 554 540 524
3 524 956 554
3 630 155 409
3 385 409 155
3 155 350 385
3 844 515 189
3 87 494 189
3 898 189 494
3 249 844 189
3 249 189 898
3 247 898 494
3 898 1192 1082
3 898 1082 249
3 247 914 898
3 1192 898 914
3 787 900 247
3 261 554 787
3 900 787 554
3 554 1054 540
3 540 139 524
3 278 494 87
3 261 494 278
3 224 261 278
3 261 247 494
3 247 261 787
3 261 224 1217
3 261 1217 554
3 1054 554 267
3 482 540 1054
3 786 145 436
3 786 134 145
3 436 278 786
3 181 224 436
3 224 278 436
3 484 224 181
3 484 1217 224
3 181 399 484
3 554 1217 267
3 1098 1054 267
3 482 1054 1098
3 1147 161 157
3 569 157 160
3 569 615 157
3 157 615 1147
3 515 844 615
3 615 1068 1147
3 515 615 569
3 615 844 1068
3 515 569 87
3 399 1098 484
3 399 275 1098
3 275 181 140
3 181 275 399
3 140 482 275
3 482 1098 275
3 267 1217 484
3 484 1098 267
3 103 331 906
3 142 807 1117
3 807 142 475
3 331 807 475
3 807 331 899
3 899 331 103
3 1104 43 722
3 722 734 1104
3 737 103 906
3 331 317 546
3 546 906 331
3 721 737 906
3 906 546 721
3 967 939 351
3 404 1083 288
3 646 404 443
3 404 646 1083
3 646 314 94
3 94 314 1178
3 1139 94 1178
3 454 288 542
3 454 1206 288
3 454 542 757
3 1085 34 443
3 404 1085 443
3 1085 404 288
3 1085 1206 34
3 1206 1085 288
3 94 1083 646
3 376 274 94
3 376 94 1139
3 79 811 883
3 177 79 883
3 602 507 1134
3 507 21 1134
3 811 79 793
3 684 61 509
3 61 684 944
3 602 918 618
3 918 790 262
3 790 918 277
3 918 1138 277
3 932 519 651
3 21 932 651
3 519 932 702
3 702 684 509
3 684 932 781
3 944 684 781
3 932 684 702
3 793 79 277
3 790 79 262
3 79 790 277
3 509 61 811
3 779 1226 214
3 721 980 326
3 980 721 546
3 1230 980 5
3 1230 326 980
3 326 266 721
3 1230 321 326
3 326 321 266
3 321 1230 837
3 1193 321 837
3 939 737 721
3 721 27 939
3 27 721 266
3 321 244 266
3 256 552 244
3 321 1193 256
3 256 244 321
3 27 266 904
3 244 794 266
3 794 904 266
3 244 552 465
3 465 794 244
3 794 744 904
3 794 465 99
3 99 744 794
3 27 351 939
3 351 27 904
3 744 859 904
3 744 99 859
3 967 1165 939
3 859 641 904
3 641 351 904
3 641 112 1175
3 641 859 112
3 859 99 112
3 967 314 337
3 967 351 314
3 351 1178 314
3 351 448 1178
3 351 641 448
3 448 1175 772
3 1175 448 641
3 646 443 337
3 314 646 337
3 868 772 245
3 772 868 448
3 868 1139 1178
3 448 868 1178
3 1125 894 779
3 797 756 1146
3 465 552 797
3 797 378 465
3 1146 1226 378
3 378 797 1146
3 378 99 465
3 99 378 769
3 769 378 1226
3 184 19 1230
3 5 184 1230
3 747 837 19
3 747 477 837
3 19 837 1230
3 642 1193 477
3 477 1193 837
3 642 256 1193
3 1221 552 256
3 256 642 1221
3 439 1221 642
3 1033 552 1221
3 405 1105 1033
3 405 1033 1221
3 439 405 1221
3 405 388 1105
3 388 214 1105
3 598 388 405
3 317 65 546
3 546 65 980
3 1226 410 769
3 769 68 99
3 53 410 1226
3 410 68 769
3 1024 53 779
3 53 1226 779
3 779 214 1125
3 756 1105 214
3 756 214 1226
3 1226 1146 756
3 756 1033 1105
3 797 552 1033
3 1033 756 797
3 522 348 688
3 1024 522 688
3 43 329 348
3 348 522 43
3 779 522 1024
3 894 522 779
3 967 1026 734
3 1026 967 337
3 112 68 410
3 68 112 99
3 410 1112 392
3 392 112 410
3 410 53 1112
3 392 1112 430
3 1112 53 1024
3 430 1112 1024
3 430 1024 688
3 1071 757 219
3 219 430 1071
3 430 440 1071
3 688 348 430
3 329 1071 440
3 348 440 430
3 348 329 440
3 1104 991 757
3 1071 1104 757
3 991 1104 1026
3 1026 1104 734
3 329 1104 1071
3 772 1175 1156
3 1175 347 1156
3 112 347 1175
3 430 608 347
3 430 347 392
3 392 347 112
3 1156 347 608
3 608 430 219
3 1152 608 219
3 608 1152 781
3 1152 542 781
3 757 542 1152
3 1152 219 757
3 454 991 1026
3 1206 454 1026
3 991 454 757
3 34 337 443
3 34 1206 1026
3 337 34 1026
3 406 245 772
3 406 772 1156
3 1156 1185 406
3 1156 608 781
3 1156 781 1185
3 811 299 1035
3 811 793 299
3 793 277 299
3 1166 918 262
3 918 1166 618
3 611 847 1113
3 758 602 1113
3 847 758 1113
3 1138 602 758
3 611 21 303
3 1046 611 852
3 944 22 61
3 751 21 748
3 611 1113 21
3 651 303 21
3 758 202 36
3 36 202 632
3 94 274 1083
3 868 376 1139
3 868 245 925
3 406 925 245
3 406 751 748
3 925 406 748
3 751 406 1185
3 678 22 781
3 678 883 22
3 883 678 177
3 678 781 542
3 177 678 542
3 177 215 79
3 177 288 215
3 288 177 542
3 262 79 215
3 857 262 215
3 857 215 288
3 857 288 1083
3 857 274 1166
3 376 697 274
3 857 1083 274
3 376 1180 697
3 925 748 1180
3 868 925 1180
3 868 1180 376
3 697 618 1166
3 697 1166 274
3 1180 507 697
3 748 21 507
3 507 1180 748
3 507 602 618
3 507 618 697
3 1113 1134 21
3 1134 1113 602
3 1166 262 857
3 1138 758 277
3 1138 918 602
3 36 1160 603
3 952 1236 632
3 1236 1160 36
3 632 1236 36
3 644 952 632
3 1046 644 632
3 1046 852 644
3 632 847 1046
3 611 1046 847
3 202 847 632
3 847 202 758
3 303 852 611
3 519 528 303
3 528 644 852
3 528 852 303
3 519 303 651
3 781 932 1185
3 932 751 1185
3 751 932 21
3 781 22 944
3 702 509 891
3 740 96 891
3 740 891 509
3 509 1035 740
3 489 627 915
3 1035 915 740
3 915 299 489
3 1035 299 915
3 299 277 489
3 915 851 740
3 915 47 851
3 627 47 915
3 463 627 489
3 740 851 96
3 603 463 489
3 489 277 758
3 603 1160 463
3 489 758 36
3 603 489 36
3 627 952 47
3 627 463 1160
3 1160 1236 627
3 627 1236 952
3 706 851 644
3 851 47 952
3 644 851 952
3 528 891 706
3 706 644 528
3 891 519 702
3 891 528 519
3 706 891 96
3 851 706 96
3 22 883 61
3 61 883 811
3 811 1035 509
3 43 894 1004
3 894 1125 993
3 966 159 141
3 159 1004 130
3 662 1004 894
3 993 662 894
3 1004 662 130
3 734 722 141
3 722 966 141
3 1004 966 43
3 966 1004 159
3 1234 1125 214
3 516 1234 388
3 1234 214 388
3 516 388 598
3 1234 993 1125
3 1234 432 993
3 516 432 1234
3 432 662 993
3 662 432 130
3 164 130 432
3 516 1062 432
3 432 1062 164
3 522 894 43
3 43 1104 329
3 722 43 966
3 734 141 905
3 905 967 734
3 905 141 146
3 1165 967 905
3 1044 742 679
3 200 1044 679
3 743 936 243
3 743 243 767
3 498 592 434
3 498 1220 592
3 742 1220 498
3 905 986 328
3 986 905 853
3 853 905 146
3 675 132 129
3 558 675 1117
3 675 129 1117
3 520 136 121
3 520 13 658
3 658 136 520
3 320 658 13
3 658 1207 136
3 788 1207 658
3 788 777 1207
3 320 788 658
3 1207 974 136
3 777 158 974
3 1207 777 974
3 747 19 243
3 1214 477 747
3 934 477 1214
3 934 642 477
3 439 642 934
3 405 850 598
3 598 850 398
3 850 405 439
3 598 398 458
3 516 598 458
3 164 1062 149
3 516 458 1062
3 119 1062 458
3 1062 119 149
3 767 239 882
3 501 767 882
3 239 767 243
3 243 1214 747
3 323 882 239
3 239 71 323
3 71 239 588
3 588 239 243
3 19 588 243
3 424 323 71
3 424 71 1203
3 845 1042 1203
3 1203 71 845
3 845 71 588
3 845 184 5
3 1042 845 5
3 588 19 184
3 184 845 588
3 84 127 162
3 148 1076 162
3 501 882 1076
3 84 970 127
3 84 162 1076
3 84 1076 882
3 882 323 84
3 84 323 970
3 122 127 970
3 970 452 122
3 452 14 154
3 122 452 154
3 424 452 970
3 323 424 970
3 452 424 14
3 14 424 1203
3 14 123 154
3 375 151 123
3 123 14 375
3 375 14 924
3 924 14 1203
3 359 125 151
3 884 359 151
3 884 151 578
3 578 151 375
3 578 317 884
3 317 578 65
3 578 375 65
3 1042 65 375
3 375 924 1042
3 924 1203 1042
3 65 1042 980
3 980 1042 5
3 129 142 1117
3 142 125 475
3 125 884 475
3 125 359 884
3 807 558 1117
3 50 331 475
3 884 50 475
3 317 50 884
3 317 331 50
3 103 999 899
3 950 986 999
3 737 999 103
3 737 950 999
3 950 328 986
3 950 1165 328
3 737 939 950
3 939 1165 950
3 1165 905 328
3 478 268 816
3 268 999 816
3 999 986 816
3 816 322 478
3 986 853 322
3 986 322 816
3 965 478 322
3 322 9 965
3 322 853 1069
3 322 1069 9
3 853 146 163
3 85 965 9
3 853 530 1069
3 530 853 163
3 132 575 152
3 675 665 575
3 259 1213 965
3 85 259 965
3 675 1213 665
3 1213 259 665
3 965 1213 478
3 675 575 132
3 558 268 1213
3 268 478 1213
3 558 1213 675
3 999 268 899
3 558 807 899
3 558 899 268
3 474 152 575
3 474 121 152
3 665 13 474
3 665 474 575
3 13 259 320
3 320 259 953
3 259 13 665
3 953 259 85
3 121 474 520
3 520 474 13
3 788 320 953
3 953 168 788
3 168 471 777
3 788 168 777
3 168 831 471
3 9 1069 831
3 831 168 9
3 168 953 85
3 9 168 85
3 471 135 158
3 777 471 158
3 135 471 530
3 530 471 831
3 530 163 135
3 530 831 1069
3 153 156 659
3 1094 395 673
3 1094 673 150
3 180 174 354
3 513 180 354
3 735 1208 617
3 39 449 174
3 449 714 174
3 714 354 174
3 39 1102 449
3 617 513 343
3 677 648 738
3 1144 1208 735
3 617 343 735
3 1144 147 1208
3 1208 147 131
3 147 1144 156
3 1212 789 421
3 789 1027 421
3 1212 730 789
3 730 1212 1179
3 1212 421 176
3 1179 1212 176
3 861 792 445
3 445 814 861
3 861 814 730
3 814 789 730
3 763 762 954
3 954 875 813
3 813 875 364
3 762 875 954
3 763 612 762
3 841 961 612
3 961 841 81
3 102 841 763
3 763 841 612
3 39 691 1102
3 39 390 691
3 1150 902 390
3 39 1150 390
3 620 1150 39
3 1150 620 818
3 39 174 620
3 1150 760 902
3 818 23 760
3 818 760 1150
3 818 745 23
3 745 818 620
3 849 366 745
3 860 849 620
3 849 745 620
3 860 620 174
3 180 860 174
3 849 1119 366
3 860 819 1119
3 860 1119 849
3 860 180 1066
3 1066 819 860
3 513 617 1066
3 513 1066 180
3 1102 691 738
3 691 390 1037
3 1037 677 691
3 691 677 738
3 902 919 390
3 919 1037 390
3 919 6 1162
3 6 109 1162
3 919 902 6
3 902 450 6
3 450 1179 6
3 1179 109 6
3 1179 450 890
3 450 902 890
3 109 1179 176
3 1179 890 730
3 861 730 890
3 361 861 890
3 23 422 760
3 422 361 760
3 361 890 902
3 760 361 902
3 861 887 792
3 361 422 887
3 887 861 361
3 887 666 792
3 422 366 887
3 23 745 422
3 666 81 792
3 81 666 366
3 366 666 887
3 745 366 422
3 672 961 81
3 81 366 672
3 1119 672 366
3 976 612 961
3 976 961 672
3 1119 976 672
3 976 762 612
3 411 762 976
3 976 1119 230
3 230 411 976
3 1128 875 762
3 875 1128 364
3 762 411 1128
3 230 1128 411
3 1039 1128 230
3 698 1119 819
3 1119 698 230
3 676 992 187
3 992 1039 187
3 1039 230 187
3 230 698 187
3 819 1066 698
3 1177 676 1187
3 1038 291 698
3 1187 187 698
3 1038 698 1066
3 617 1038 1066
3 1187 1208 131
3 1177 1187 131
3 1208 1187 291
3 291 1187 698
3 1038 617 291
3 291 617 1208
3 919 676 120
3 676 187 1187
3 1177 165 126
3 1177 131 165
3 1037 919 120
3 120 218 1037
3 120 676 1177
3 1177 218 120
3 126 218 1177
3 677 218 155
3 218 126 155
3 218 677 1037
3 90 992 676
3 90 919 1162
3 919 90 676
3 90 1064 992
3 1064 1162 109
3 1162 1064 90
3 1039 1204 1128
3 1204 1039 992
3 1064 1204 992
3 364 1128 1204
3 364 1204 446
3 686 446 1204
3 1064 686 1204
3 1064 109 176
3 176 686 1064
3 879 427 813
3 813 364 446
3 879 813 446
3 686 879 446
3 427 879 421
3 686 176 421
3 421 879 686
3 813 621 954
3 441 763 954
3 954 621 441
3 621 813 427
3 427 1027 621
3 1027 789 441
3 621 1027 441
3 1027 427 421
3 441 102 763
3 431 841 102
3 102 386 431
3 386 102 441
3 789 386 441
3 445 431 386
3 386 814 445
3 814 386 789
3 1061 81 841
3 431 1061 841
3 81 1061 792
3 445 1061 431
3 1061 445 792
3 160 264 134
3 264 923 754
3 923 534 878
3 630 139 2
3 683 741 497
3 497 318 683
3 318 199 683
3 235 683 199
3 199 10 235
3 199 911 10
3 911 639 10
3 711 10 639
3 639 1011 711
3 1011 2 711
3 741 711 2
3 2 497 741
3 318 497 95
3 95 497 171
3 460 318 95
3 199 318 460
3 911 460 426
3 911 199 460
3 817 911 426
3 817 639 911
3 73 497 2
3 508 73 2
3 73 171 497
3 95 171 20
3 460 95 1049
3 885 460 1049
3 426 460 885
3 714 426 885
3 449 426 714
3 1102 426 449
3 817 426 1102
3 738 817 1102
3 817 738 648
3 648 639 817
3 648 1011 639
3 1011 648 630
3 1011 630 2
3 2 139 508
3 353 945 886
3 311 886 945
3 863 886 563
3 353 886 726
3 726 886 863
3 276 514 7
3 866 140 145
3 610 866 145
3 354 692 462
3 1007 1144 735
3 949 664 344
3 284 979 607
3 284 836 979
3 949 54 664
3 909 631 949
3 836 631 909
3 631 237 798
3 1151 33 583
3 583 810 1209
3 583 634 581
3 583 1209 634
3 634 1209 626
3 619 1097 877
3 407 550 1097
3 877 626 619
3 1090 283 812
3 619 283 407
3 804 716 283
3 544 1090 584
3 584 1090 988
3 1090 812 988
3 661 407 815
3 661 550 407
3 407 283 815
3 544 913 1210
3 544 260 913
3 1205 913 260
3 913 979 1210
3 913 607 979
3 607 913 1205
3 544 584 260
3 1123 0 1210
3 0 655 613
3 0 1123 655
3 655 1123 413
3 1123 1210 413
3 979 413 1210
3 98 917 800
3 800 917 655
3 413 344 800
3 909 344 413
3 949 631 54
3 909 949 344
3 917 613 655
3 413 800 655
3 98 800 344
3 98 664 661
3 664 98 344
3 796 54 798
3 631 798 54
3 581 798 237
3 796 798 581
3 237 1151 583
3 237 583 581
3 33 810 583
3 33 801 810
3 284 481 707
3 707 801 33
3 836 284 707
3 284 778 481
3 284 607 778
3 1151 237 707
3 33 1151 707
3 237 836 707
3 836 237 631
3 836 909 979
3 909 413 979
3 778 1131 1229
3 778 1070 1131
3 607 1205 1070
3 607 1070 778
3 260 336 1205
3 236 336 260
3 988 236 584
3 584 236 260
3 994 236 988
3 988 339 994
3 994 25 26
3 25 801 26
3 339 25 994
3 549 25 339
3 549 339 1209
3 339 626 1209
3 339 921 626
3 812 339 988
3 921 619 626
3 339 812 921
3 812 619 921
3 812 283 619
3 810 801 549
3 549 801 25
3 810 549 1209
3 796 581 634
3 796 877 550
3 877 634 626
3 634 877 796
3 664 54 550
3 550 877 1097
3 815 1219 661
3 1122 815 1223
3 815 1122 1219
3 716 1223 815
3 830 716 252
3 830 1223 716
3 815 283 716
3 1097 619 407
3 716 804 252
3 804 544 1052
3 804 1052 252
3 544 804 1090
3 1090 804 283
3 252 1052 830
3 287 830 1052
3 799 287 1052
3 544 799 1052
3 1210 799 544
3 799 613 287
3 0 799 1210
3 799 0 613
3 1122 287 917
3 287 613 917
3 1219 1122 98
3 1122 917 98
3 1219 98 661
3 664 550 661
3 796 550 54
3 287 1122 1223
3 830 287 1223
3 1133 26 801
3 453 26 1232
3 1133 1232 26
3 1021 104 453
3 453 1232 1021
3 1021 1232 70
3 505 70 1232
3 1133 505 1232
3 505 1133 48
3 48 1133 487
3 1229 726 935
3 726 495 935
3 935 495 447
3 481 935 447
3 481 447 487
3 487 801 481
3 935 778 1229
3 778 935 481
3 801 707 481
3 801 487 1133
3 221 353 1131
3 1229 1131 726
3 1205 1131 1070
3 1205 221 1131
3 1205 336 221
3 336 1088 221
3 236 1010 240
3 1088 336 240
3 336 236 240
3 994 930 1010
3 236 994 1010
3 26 453 930
3 994 26 930
3 930 453 104
3 694 1010 1050
3 52 1050 1010
3 930 52 1010
3 52 104 93
3 104 52 930
3 897 829 694
3 694 1201 897
3 1050 532 1201
3 1201 694 1050
3 52 355 1050
3 355 532 1050
3 93 355 52
3 862 93 1021
3 1021 70 862
3 1021 93 104
3 83 862 70
3 70 856 83
3 856 1016 938
3 83 856 938
3 70 505 856
3 505 48 1016
3 856 505 1016
3 527 938 1016
3 487 447 720
3 720 527 487
3 487 527 1016
3 487 1016 48
3 863 563 574
3 574 495 863
3 720 447 495
3 495 574 720
3 527 106 938
3 488 485 106
3 527 488 106
3 485 488 128
3 485 128 143
3 527 720 128
3 128 488 527
3 133 128 720
3 574 133 720
3 133 563 138
3 563 133 574
3 137 138 724
3 248 724 1169
3 724 138 1169
3 1169 138 563
3 248 273 724
3 1001 719 248
3 1001 248 311
3 1169 311 248
3 311 92 1001
3 1169 563 311
3 1001 506 719
3 506 733 719
3 506 1101 897
3 1235 506 897
3 506 1001 92
3 1101 506 92
3 1101 829 897
3 1101 92 945
3 311 945 92
3 311 563 886
3 1101 927 829
3 945 927 1101
3 927 694 829
3 694 927 240
3 240 927 1088
3 927 353 221
3 240 1010 694
3 927 221 1088
3 927 945 353
3 353 726 1131
3 726 863 495
3 506 1235 733
3 302 733 1220
3 302 1220 476
3 1235 592 1220
3 1235 897 592
3 1044 476 1220
3 434 940 498
3 592 532 434
3 532 592 1201
3 1201 592 897
3 876 729 434
3 876 434 532
3 355 876 532
3 876 355 729
3 1020 1107 729
3 355 1020 729
3 93 1020 355
3 1107 114 729
3 848 1214 633
3 1107 456 114
3 1107 1000 456
3 1000 1107 1020
3 1000 1149 178
3 1149 1020 93
3 1149 1000 1020
3 270 178 1149
3 1149 1140 270
3 1140 373 270
3 862 1149 93
3 862 1140 1149
3 83 1222 862
3 1140 704 373
3 1140 1222 704
3 1222 1140 862
3 83 938 1222
3 106 704 1222
3 1222 938 106
3 485 119 704
3 106 485 704
3 119 485 143
3 119 143 149
3 273 137 724
3 41 572 719
3 273 719 572
3 719 273 248
3 137 273 572
3 719 733 41
3 41 733 302
3 476 1109 302
3 172 1109 476
3 733 1235 1220
3 1044 200 172
3 200 462 172
3 354 200 513
3 200 679 513
3 1044 1220 742
3 498 903 742
3 679 742 903
3 498 389 903
3 940 342 498
3 434 729 940
3 114 936 342
3 729 114 940
3 114 342 940
3 936 846 342
3 114 633 936
3 633 1214 936
3 456 848 633
3 848 934 1214
3 114 456 633
3 456 1000 848
3 178 934 848
3 1000 178 848
3 178 439 934
3 178 850 439
3 178 270 850
3 850 270 373
3 850 373 398
3 119 373 704
3 119 458 373
3 373 458 398
3 539 144 124
3 124 572 539
3 572 124 137
3 625 514 334
3 56 334 41
3 572 334 539
3 302 56 41
3 56 625 334
3 625 56 591
3 302 591 56
3 334 572 41
3 521 591 172
3 1109 172 591
3 591 302 1109
3 358 172 462
3 476 1044 172
3 354 714 692
3 200 354 462
3 343 948 735
3 389 948 343
3 343 513 389
3 389 513 679
3 389 679 903
3 51 659 948
3 948 389 51
3 846 389 498
3 51 564 659
3 389 846 51
3 846 498 342
3 1094 659 564
3 846 564 51
3 395 1094 564
3 987 395 564
3 987 564 846
3 846 743 987
3 846 936 743
3 395 987 501
3 743 767 987
3 243 936 1214
3 987 767 501
3 514 289 881
3 881 289 144
3 514 539 334
3 881 144 539
3 514 881 539
3 521 625 591
3 7 521 66
3 521 7 514
3 358 521 172
3 521 514 625
3 358 66 521
3 692 35 358
3 462 692 358
3 692 714 885
3 156 1007 659
3 1144 1007 156
3 659 1007 948
3 1007 735 948
3 153 659 1094
3 150 153 1094
3 1076 148 673
3 148 150 673
3 395 501 673
3 1076 673 501
3 1081 161 144
3 1159 1081 289
3 289 1081 144
3 514 1159 289
3 276 206 1159
3 514 276 1159
3 206 276 35
3 276 66 35
3 276 7 66
3 358 35 66
3 885 1049 1145
3 35 692 1145
3 1145 692 885
3 470 171 73
3 839 470 508
3 73 508 470
3 839 508 540
3 630 648 155
3 677 155 648
3 433 157 1081
3 534 206 878
3 560 923 878
3 878 629 560
3 206 35 878
3 878 35 629
3 629 20 560
3 1049 629 1145
3 1145 629 35
3 95 20 629
3 629 1049 95
3 171 263 20
3 470 774 263
3 263 171 470
3 1186 470 839
3 139 540 508
3 560 754 923
3 560 774 754
3 774 49 754
3 20 774 560
3 774 20 263
3 49 774 1043
3 1043 774 470
3 470 1186 783
3 540 482 1186
3 1186 839 540
3 145 264 610
3 134 264 145
3 754 610 264
3 49 866 610
3 754 49 610
3 49 541 866
3 1043 541 49
3 622 866 541
3 1043 470 783
3 1186 391 783
3 1186 482 391
3 157 264 160
3 161 1081 157
3 433 264 157
3 206 534 433
3 1159 433 1081
3 433 534 264
3 206 433 1159
3 264 534 923
3 391 622 541
3 1227 622 391
3 866 1227 140
3 140 1227 482
3 1227 866 622
3 482 1227 391
3 1043 783 541
3 391 541 783
3 265 1022 889
3 1116 265 889
3 1022 968 889
3 1022 265 749
3 1116 1181 265
3 1181 1116 809
3 809 1116 570
3 570 1116 74
3 1116 889 74
3 1002 74 889
3 968 1002 889
3 1022 749 313
3 265 492 749
3 492 265 1181
3 809 570 480
3 570 1130 480
3 570 74 1130
3 1130 74 493
3 493 74 1002
3 968 972 1002
3 968 1022 972
3 1022 313 972
3 1099 784 167
3 784 374 167
3 44 1099 167
3 1058 374 784
3 374 1058 700
3 374 700 466
3 374 466 955
3 167 374 955
3 955 4 167
3 4 44 167
3 397 1099 44
3 1191 1099 397
3 1099 1191 561
3 561 784 1099
3 784 561 1058
3 466 700 543
3 1111 466 543
3 955 466 1111
3 955 1111 562
3 955 562 4
3 40 44 4
3 397 44 40
3 313 785 1012
3 313 749 785
3 785 749 957
3 492 957 749
3 1181 1183 492
3 1181 88 1183
3 1181 809 88
3 88 809 179
3 480 179 809
3 1130 57 480
3 1130 232 57
3 493 232 1130
3 1002 1182 493
3 1002 1063 1182
3 972 1063 1002
3 1063 972 1012
3 313 1012 972
3 492 1183 957
3 480 57 179
3 493 1182 232
3 746 397 11
3 1191 397 746
3 1191 746 72
3 72 561 1191
3 1057 1058 561
3 941 1058 1057
3 700 1058 941
3 700 941 869
3 869 543 700
3 973 1111 543
3 806 1111 973
3 806 562 1111
3 1056 4 562
3 1196 4 1056
3 1196 40 4
3 40 1196 11
3 11 397 40
3 1057 561 72
3 973 543 869
3 1056 562 806