OFF

235 470 0
-0.072048 0.167653 0.070607
-0.046323 0.169531 -0.043005
0.149307 0.276575 0.089824
0.141663 0.209258 0.026097
0.152218 0.242736 0.062900
0.154962 0.195171 0.108388
0.146844 0.241058 0.008846
0.124073 0.208419 0.080682
0.156303 0.267005 0.047103
0.153211 0.191632 0.105011
0.154583 0.279356 0.062176
-0.059545 0.207250 0.000982
0.155566 0.195172 0.105506
0.158695 0.272334 0.048456
0.149064 0.192495 0.009295
-0.054722 0.207257 -0.022022
-0.042143 0.187843 0.029243
0.147448 0.241059 0.005964
-0.036523 0.187853 0.002441
0.156298 0.279358 0.053995
0.123587 0.238904 0.097312
0.129984 0.209239 0.081800
0.149668 0.192496 0.006413
0.153119 0.242035 0.103505
-0.048310 0.208807 0.048054
0.126057 0.208423 0.071218
0.157545 0.280587 0.058527
0.150165 0.262603 0.073171
0.149233 0.255922 0.091010
0.127465 0.244281 0.099632
0.124506 0.240740 0.102019
0.133817 0.208435 0.034209
0.158661 0.262825 0.042557
0.155090 0.242579 0.041455
-0.055621 0.210384 -0.019318
0.150116 0.276855 0.081666
0.128162 0.193879 0.098256
0.125110 0.240741 0.099137
0.156583 0.257758 0.050427
0.159719 0.252593 0.028065
0.157694 0.197010 0.104448
0.163431 0.278082 0.030645
0.164969 0.264712 0.022385
0.135801 0.208439 0.024745
0.153414 0.257753 0.065543
0.160036 0.276871 0.034351
-0.036221 0.184877 0.002503
0.166692 0.246452 0.013010
0.139257 0.210904 0.036738
0.146676 0.242616 0.084029
0.130399 0.224172 0.072272
-0.042695 0.187843 0.031878
-0.037076 0.187852 0.005076
0.151750 0.192779 0.009858
0.141802 0.210908 0.024601
0.148324 0.269220 0.094070
0.149830 0.264687 0.094596
0.152354 0.192780 0.006976
0.151821 0.266998 0.068481
0.155897 0.191917 0.105575
-0.048862 0.208806 0.050690
0.149395 0.189240 0.009363
0.162136 0.259842 0.022911
0.150818 0.273689 0.093014
-0.052746 0.182086 -0.018725
0.127192 0.241025 0.102582
0.164563 0.276808 0.026972
-0.068927 0.210362 0.044149
-0.047846 0.167693 -0.044830
0.163247 0.273502 0.023820
-0.034618 0.208830 -0.017249
0.157425 0.268489 0.041002
0.129411 0.192462 0.103031
0.147447 0.259818 0.092973
0.127796 0.241026 0.099700
0.150398 0.268478 0.074519
0.149745 0.277852 0.086007
0.158693 0.276672 0.050876
0.130016 0.192463 0.100149
-0.042393 0.184867 0.031940
-0.035473 0.211805 -0.014676
0.148445 0.242568 0.073151
0.149295 0.252784 0.087696
0.155523 0.276667 0.065992
0.152352 0.273770 0.077978
0.128329 0.222518 0.082982
0.150227 0.242525 0.062483
0.155562 0.261887 0.047795
-0.066951 0.185192 0.047447
-0.062128 0.185200 0.024443
0.167023 0.243197 0.013078
0.139731 0.209255 0.035311
0.151653 0.257325 0.074156
0.169378 0.246736 0.013573
0.130873 0.222522 0.070845
0.152080 0.189524 0.009926
0.156704 0.272123 0.048038
0.167627 0.243198 0.010196
-0.066052 0.182064 0.044742
-0.046179 0.187837 0.048494
0.122515 0.223753 0.080361
0.155554 0.280376 0.058109
0.140146 0.224188 0.025784
-0.035171 0.208829 -0.014613
0.162984 0.255945 0.025424
0.132097 0.192747 0.103594
0.147644 0.246420 0.103863
0.153412 0.262091 0.067963
0.165370 0.269456 0.022683
0.132701 0.192748 0.100712
0.154592 0.257547 0.050010
0.147242 0.255711 0.090592
0.124499 0.223756 0.070897
0.128467 0.224168 0.081487
0.160603 0.273783 0.038623
0.161440 0.277871 0.030227
-0.069190 0.207234 0.046985
0.162979 0.264501 0.021968
0.156671 0.262614 0.042140
0.132259 0.223769 0.033887
0.130346 0.189208 0.100217
0.151423 0.257542 0.065126
-0.064367 0.207242 0.023981
-0.045876 0.184861 0.048556
0.154554 0.272327 0.068206
0.154428 0.242740 0.052356
0.171929 0.194918 0.014090
-0.046731 0.187836 0.051129
0.134243 0.223772 0.024423
0.147839 0.264476 0.094179
0.169709 0.243481 0.013641
-0.075355 0.222964 0.068429
0.172533 0.194919 0.011208
0.158430 0.257336 0.041833
-0.065266 0.210368 0.026684
0.138075 0.222534 0.036495
-0.038956 0.211799 0.001939
0.170313 0.243482 0.010759
0.159830 0.242845 0.031200
0.148827 0.273478 0.092596
-0.032487 0.187859 -0.016809
0.162572 0.276597 0.026555
0.140620 0.222538 0.024357
0.147371 0.243164 0.106813
-0.051756 0.223003 -0.044126
0.151298 0.276786 0.090241
-0.077812 0.224380 0.069418
0.147975 0.243165 0.103931
0.150330 0.246705 0.104426
0.143828 0.244028 0.008215
0.133032 0.189493 0.100780
0.158294 0.267216 0.047520
0.156574 0.279567 0.062594
0.147304 0.252573 0.087279
0.156702 0.276461 0.050459
0.152155 0.262814 0.073589
0.150361 0.273559 0.077561
0.158289 0.279569 0.054412
-0.044273 0.208814 0.028803
0.124986 0.222061 0.069432
0.126200 0.210118 0.069682
-0.038654 0.208823 0.002001
-0.053610 0.224420 -0.046019
0.153533 0.276456 0.065575
0.157081 0.242790 0.041872
0.149662 0.257114 0.073738
-0.062390 0.182070 0.027277
0.152107 0.277066 0.082083
0.122687 0.222057 0.080396
0.123901 0.210114 0.080646
0.142031 0.238935 0.009340
-0.045128 0.211789 0.031376
0.172259 0.191663 0.014158
0.131916 0.209242 0.072585
0.174614 0.195203 0.014653
-0.033040 0.187858 -0.014174
0.171563 0.242065 0.015533
0.152025 0.248714 0.057345
0.162027 0.277082 0.034768
0.161710 0.252804 0.028483
0.175219 0.195204 0.011771
-0.059282 0.210378 -0.001854
0.134730 0.222077 0.022958
0.124672 0.222060 0.070933
0.135943 0.210134 0.023208
0.125885 0.210118 0.071183
0.138214 0.224184 0.034998
0.152276 0.194886 0.107825
0.132431 0.222073 0.033923
0.146514 0.244313 0.008778
0.150057 0.243449 0.107377
0.146606 0.193910 0.010284
0.122373 0.222056 0.081897
0.150315 0.269431 0.094487
0.123586 0.210114 0.082147
0.133644 0.210130 0.034173
0.152880 0.194887 0.104943
0.160993 0.255734 0.025006
0.148667 0.242827 0.084446
0.158612 0.273572 0.038205
0.176138 0.197040 0.016477
0.150661 0.243450 0.104495
0.144158 0.240773 0.008283
0.151421 0.261880 0.067545
0.163379 0.269245 0.022265
-0.044826 0.208813 0.031439
-0.039207 0.208822 0.004637
0.153812 0.267209 0.068898
-0.032738 0.184883 -0.014112
0.134415 0.222076 0.024459
0.144763 0.240774 0.005401
0.135629 0.210134 0.024709
-0.057306 0.185208 0.001444
0.164126 0.260053 0.023328
0.152563 0.272116 0.067788
0.152438 0.242529 0.051939
-0.052483 0.185216 -0.021560
0.132116 0.222072 0.035424
0.133330 0.210130 0.035674
0.165238 0.273713 0.024237
0.150436 0.242779 0.073568
-0.056407 0.182080 -0.001261
0.149437 0.260029 0.093391
0.159416 0.268700 0.041420
0.124779 0.243996 0.099069
-0.069921 0.169492 0.069550
0.156439 0.257125 0.041415
0.152389 0.268689 0.074937
0.151736 0.278063 0.086424
0.129510 0.210888 0.083226
0.157839 0.242634 0.030782
0.174945 0.191948 0.014721
-0.048612 0.211783 0.047992
0.157553 0.262098 0.048213
0.132055 0.210892 0.071088
3 162 0 68
3 162 146 0
3 173 21 48
3 173 7 21
3 173 25 7
3 173 234 25
3 234 160 25
3 21 91 48
3 124 163 83
3 214 163 124
3 83 10 152
3 163 10 83
3 152 101 26
3 10 101 152
3 26 101 157
3 19 157 101
3 157 19 77
3 154 77 19
3 77 154 13
3 96 13 154
3 13 96 151
3 8 151 96
3 151 8 233
3 87 233 8
3 233 87 38
3 110 38 87
3 44 203 107
3 121 203 44
3 107 58 207
3 203 58 107
3 207 214 124
3 58 214 207
3 42 204 117
3 108 204 42
3 108 69 204
3 219 69 108
3 219 141 69
3 66 141 219
3 66 41 141
3 115 141 41
3 41 178 115
3 45 115 178
3 178 114 45
3 199 45 114
3 114 223 199
3 71 199 223
3 223 32 71
3 118 71 32
3 32 133 118
3 226 118 133
3 179 197 39
3 104 197 179
3 104 62 197
3 213 62 104
3 213 117 62
3 42 117 213
3 56 55 193
3 129 55 56
3 193 139 63
3 55 139 193
3 63 2 145
3 139 2 63
3 145 2 228
3 76 228 2
3 228 76 167
3 35 167 76
3 167 35 84
3 156 84 35
3 84 156 227
3 75 227 156
3 227 75 155
3 27 155 75
3 155 27 92
3 165 92 27
3 82 111 28
3 153 111 82
3 28 73 222
3 111 73 28
3 222 129 56
3 73 129 222
3 19 10 154
3 101 10 19
3 163 154 10
3 96 154 163
3 214 96 163
3 8 96 214
3 58 8 214
3 87 8 58
3 203 87 58
3 110 87 203
3 121 110 203
3 152 157 83
3 26 157 152
3 77 83 157
3 124 83 77
3 13 124 77
3 207 124 13
3 151 207 13
3 107 207 151
3 233 107 151
3 44 107 233
3 38 44 233
3 125 44 38
3 4 44 125
3 215 125 110
3 38 110 125
3 4 121 44
3 86 121 4
3 197 62 39
3 117 39 62
3 204 39 117
3 69 39 204
3 141 39 69
3 45 39 141
3 115 45 141
3 199 39 45
3 71 39 199
3 118 39 71
3 226 39 118
3 230 39 226
3 33 230 226
3 213 179 42
3 104 179 213
3 108 42 179
3 219 108 179
3 66 219 179
3 178 66 179
3 41 66 178
3 114 178 179
3 223 114 179
3 32 223 179
3 133 32 179
3 138 133 179
3 164 133 138
3 33 226 164
3 133 164 226
3 230 138 39
3 179 39 138
3 73 153 129
3 111 153 73
3 55 129 153
3 139 55 153
3 2 139 153
3 35 2 153
3 76 2 35
3 156 35 153
3 75 156 153
3 27 75 153
3 165 27 153
3 49 165 153
3 81 165 49
3 28 222 82
3 56 82 222
3 193 82 56
3 63 82 193
3 145 82 63
3 167 82 145
3 228 167 145
3 84 82 167
3 227 82 84
3 155 82 227
3 92 82 155
3 198 82 92
3 220 198 92
3 81 220 165
3 92 165 220
3 198 153 82
3 49 153 198
3 86 177 121
3 110 121 177
3 86 215 177
3 110 177 215
3 220 164 198
3 4 164 220
3 125 164 4
3 90 198 164
3 138 90 164
3 230 90 138
3 6 90 230
3 33 6 230
3 215 6 33
3 86 6 215
3 81 6 86
3 147 198 90
3 74 6 81
3 49 74 81
3 198 74 49
3 215 164 125
3 164 215 33
3 81 4 220
3 86 4 81
3 147 74 198
3 131 146 144
3 162 144 146
3 144 162 1
3 68 1 162
3 1 68 225
3 0 225 68
3 225 0 131
3 146 131 0
3 60 116 232
3 67 232 116
3 123 88 127
3 98 88 123
3 171 122 158
3 134 122 171
3 16 89 79
3 166 79 89
3 127 88 60
3 116 60 88
3 232 67 171
3 134 171 67
3 79 98 123
3 166 98 79
3 158 89 16
3 122 89 158
3 80 15 70
3 34 15 80
3 140 216 208
3 64 208 216
3 206 11 136
3 181 136 11
3 46 212 52
3 221 212 46
3 70 216 140
3 15 216 70
3 136 34 80
3 181 34 136
3 208 64 46
3 221 46 64
3 52 212 206
3 11 206 212
3 166 221 1
3 64 1 221
3 216 1 64
3 15 1 216
3 144 1 15
3 34 144 15
3 181 144 34
3 134 144 181
3 89 221 166
3 212 221 89
3 11 134 181
3 122 134 11
3 225 166 1
3 131 144 134
3 98 166 225
3 67 131 134
3 116 131 67
3 88 98 225
3 88 131 116
3 225 131 88
3 212 122 11
3 89 122 212
3 188 18 161
3 195 18 188
3 195 175 18
3 211 175 195
3 209 188 103
3 161 103 188
3 211 209 175
3 103 175 209
3 209 182 128
3 80 70 103
3 43 184 211
3 175 140 208
3 206 136 161
3 188 119 217
3 18 46 52
3 218 31 195
3 188 217 195
3 218 195 217
3 18 52 161
3 206 161 52
3 175 208 18
3 46 18 208
3 195 31 211
3 43 211 31
3 209 128 188
3 119 188 128
3 161 136 103
3 80 103 136
3 211 184 209
3 182 209 184
3 103 70 175
3 140 175 70
3 183 51 185
3 205 51 183
3 185 99 169
3 51 99 185
3 24 205 183
3 168 24 183
3 169 99 168
3 24 168 99
3 100 192 168
3 24 60 232
3 169 194 7
3 123 127 99
3 205 171 158
3 159 112 183
3 16 79 51
3 185 25 160
3 183 185 159
3 160 159 185
3 51 205 16
3 158 16 205
3 99 51 123
3 79 123 51
3 185 169 25
3 7 25 169
3 168 183 100
3 112 100 183
3 205 24 171
3 232 171 24
3 169 168 194
3 192 194 168
3 24 99 60
3 127 60 99
3 186 102 135
3 94 135 102
3 234 135 94
3 173 135 234
3 48 135 173
3 50 94 102
3 191 91 21
3 3 91 191
3 54 3 191
3 36 191 21
3 229 36 21
3 170 50 102
3 142 170 102
3 20 50 170
3 113 50 20
3 85 113 20
3 142 54 191
3 85 36 229
3 170 142 191
3 20 36 85
3 135 218 217
3 48 218 135
3 3 43 91
3 31 91 43
3 102 186 128
3 119 128 186
3 54 142 184
3 182 184 142
3 48 91 218
3 31 218 91
3 186 217 119
3 135 217 186
3 142 102 182
3 128 182 102
3 3 184 43
3 54 184 3
3 94 160 234
3 159 160 94
3 113 100 50
3 112 50 100
3 229 194 85
3 192 85 194
3 50 159 94
3 112 159 50
3 85 192 113
3 100 113 192
3 229 21 194
3 7 194 21
3 189 29 149
3 224 149 29
3 65 105 30
3 72 30 105
3 150 95 120
3 61 120 95
3 57 17 22
3 210 22 17
3 147 196 74
3 109 74 196
3 196 126 109
3 53 109 126
3 126 90 53
3 6 53 90
3 93 148 47
3 106 47 148
3 190 5 143
3 187 143 5
3 59 231 9
3 172 9 231
3 180 137 132
3 97 132 137
3 40 23 200
3 176 200 23
3 224 30 37
3 61 22 14
3 72 120 78
3 202 210 149
3 148 201 190
3 231 174 180
3 5 12 59
3 137 130 93
3 90 97 47
3 187 9 196
3 172 132 126
3 106 143 147
3 17 6 189
3 105 109 150
3 95 53 57
3 29 74 65
3 202 149 37
3 224 37 149
3 74 29 6
3 189 6 29
3 37 30 78
3 72 78 30
3 29 65 224
3 30 224 65
3 109 105 74
3 65 74 105
3 78 120 14
3 61 14 120
3 105 150 72
3 120 72 150
3 53 95 109
3 150 109 95
3 14 22 202
3 210 202 22
3 95 57 61
3 22 61 57
3 6 17 53
3 57 53 17
3 149 210 189
3 17 189 210
3 90 47 147
3 106 147 47
3 201 148 130
3 93 130 148
3 147 143 196
3 187 196 143
3 148 190 106
3 143 106 190
3 12 5 201
3 190 201 5
3 196 9 126
3 172 126 9
3 5 59 187
3 9 187 59
3 174 231 12
3 59 12 231
3 126 132 90
3 97 90 132
3 231 180 172
3 132 172 180
3 130 137 174
3 180 174 137
3 47 97 93
3 137 93 97
3 20 37 36
3 78 36 37
3 36 78 191
3 14 191 78
3 191 14 170
3 202 170 14
3 170 202 20
3 37 20 202
3 200 12 40
3 174 12 200
3 40 12 23
3 201 23 12
3 23 130 176
3 201 130 23
3 176 130 200
3 174 200 130
