OFF
1581 2191 0
0.4759490547 -0.1715664981 -0.0661119314
0.2511031078 -0.3300414256 0.0062428839
0.2706733868 -0.3046280386 -0.1232493208
0.4637174733 -0.1874499667 0.0148206529
0.3882471157 -0.2411434419 0.0444161885
0.3955859703 -0.2316134218 -0.0041433883
0.4073167745 -0.1439785893 0.0062383666
0.3596246125 -0.1748930791 -0.0070364928
0.3632940399 -0.1701280691 -0.0313162812
0.3608477550 -0.1733047425 -0.0151297556
0.4177993678 -0.1347972236 -0.0161450133
0.4153530829 -0.1379738970 0.0000415123
-0.0103085500 -0.2392922064 -0.0154545925
0.0092617291 -0.2138788194 -0.1449467972
-0.1707231815 -0.2052696473 -0.1618686653
-0.1890703181 -0.2290946976 -0.0404697234
-0.1902819914 -0.2179478444 -0.1673127559
-0.2086291280 -0.2417728948 -0.0459138140
0.3666462274 -0.0836779578 0.0119260397
0.3189540654 -0.1145924476 -0.0013488197
0.3226234928 -0.1098274375 -0.0256286081
0.3201772079 -0.1130041109 -0.0094420825
0.3771288207 -0.0744965920 -0.0104573402
0.3746825358 -0.0776732654 0.0057291854
0.1293025459 0.3219816867 0.0298989622
0.1244098191 0.3156282382 0.0622719697
0.0611708859 0.2778181298 0.0109348774
0.0587246011 0.2746414564 0.0271214030
0.0562783162 0.2714647831 0.0433079286
0.1156762139 0.3131489753 0.0261061453
0.1132299290 0.3099723019 0.0422926708
0.2969258250 0.0196937595 0.0216762615
0.2492336630 -0.0112207303 0.0084014021
0.2529030903 -0.0064557203 -0.0158783862
0.2504568055 -0.0096323936 0.0003081393
0.3074084183 0.0288751252 -0.0007071184
0.3049621334 0.0256984518 0.0154794072
0.3259756803 -0.0233773263 0.0176137128
0.2782835183 -0.0542918161 0.0043388534
0.2819529456 -0.0495268060 -0.0199409350
0.2795066608 -0.0527034794 -0.0037544094
0.3364582736 -0.0141959605 -0.0047696671
0.3340119887 -0.0173726339 0.0114168585
-0.2201315491 -0.1747736299 0.2111640074
-0.0660926573 -0.2691894062 0.3606235938
0.2562552779 0.0799943910 0.0273639346
0.2085631159 0.0490799012 0.0140890752
0.2122325432 0.0538449113 -0.0101907131
0.2097862583 0.0506682379 0.0059958124
0.2667378712 0.0891757568 0.0049805547
0.2642915863 0.0859990834 0.0211670803
0.2155847307 0.1402950226 0.0330516077
0.1678925688 0.1093805328 0.0197767483
0.1715619961 0.1141455428 -0.0045030400
0.1691157112 0.1109688694 0.0116834855
0.2260673241 0.1494763883 0.0106682278
0.2236210392 0.1462997149 0.0268547534
0.1458643283 0.2436667398 0.0428018296
0.0981721664 0.2127522500 0.0295269702
0.1018415937 0.2175172601 0.0052471818
0.0993953088 0.2143405867 0.0214337074
0.1563469216 0.2528481056 0.0204184497
0.1539006368 0.2496714322 0.0366049753
-0.0471421430 -0.1831828746 -0.1388571248
-0.0654892797 -0.2070079249 -0.0174581829
0.4546660124 -0.1604220160 -0.0156022953
0.4497732857 -0.1667754645 0.0167707122
0.3865343525 -0.2045855728 -0.0345663801
0.3840880676 -0.2077622462 -0.0183798545
0.3816417827 -0.2109389196 -0.0021933289
0.4410396804 -0.1692547273 -0.0193951122
0.4385933956 -0.1724314007 -0.0032085866
0.0333405508 -0.2830131606 -0.0174382829
0.0529108299 -0.2575997736 -0.1469304877
0.0585008534 -0.2547717546 -0.1369408164
0.0401537168 -0.2785968049 -0.0155418744
-0.2602421800 -0.2708096083 -0.0594127198
-0.2406719010 -0.2453962214 -0.1889049245
-0.4307952373 -0.0238218908 -0.0218571618
0.1308914490 0.1744461744 0.0011846331
0.1284451641 0.1712695010 0.0173711586
0.1853967769 0.2097770198 0.0163559009
0.1829504921 0.2066003465 0.0325424265
0.3898865400 -0.1181354615 0.0086759408
0.3421943781 -0.1490499513 -0.0045989186
0.3458638054 -0.1442849413 -0.0288787070
0.3434175205 -0.1474616146 -0.0126921814
0.4003691333 -0.1089540958 -0.0137074391
0.3979228485 -0.1121307692 0.0024790865
-0.4407313162 -0.2180854021 0.0892984478
0.3201661376 -0.0147637443 0.0184261626
0.2724739757 -0.0456782341 0.0051513032
0.2761434030 -0.0409132240 -0.0191284852
0.2736971181 -0.0440898974 -0.0029419596
0.3306487309 -0.0055823785 -0.0039572173
0.3282024460 -0.0087590519 0.0122293083
0.3492159929 -0.0578348300 0.0143636139
0.3015238310 -0.0887493198 0.0010887545
0.3051932583 -0.0839843097 -0.0231910339
0.3027469734 -0.0871609831 -0.0070045083
0.3596985862 -0.0486534642 -0.0080197660
0.3572523013 -0.0518301376 0.0081667596
-0.1251704100 -0.1910176015 0.2847840411
-0.2913772928 -0.1093677499 -0.3330778005
-0.2669144440 -0.0776010161 -0.4949430564
-0.3095452122 -0.1211443592 -0.3381347441
-0.2850823634 -0.0893776254 -0.5000000000
-0.3806070131 0.0132119977 -0.0218631420
-0.3610367341 0.0386253847 -0.1513553467
0.1226972665 0.3521861296 -0.0167105627
0.1104656851 0.3363026610 0.0642220216
0.0349953275 0.2826091858 0.0938175572
0.0423341821 0.2921392059 0.0452579804
0.2794955905 0.0455368873 0.0241138357
0.2318034285 0.0146223975 0.0108389763
0.2354728559 0.0193874075 -0.0134408121
0.2330265710 0.0162107342 0.0027457135
0.2899781838 0.0547182530 0.0017304558
0.2875318989 0.0515415796 0.0179169814
0.3847031290 -0.1990922119 -0.2485099297
0.4091659778 -0.1673254782 -0.4103751856
0.3665352096 -0.2108688212 -0.2535668733
0.3909980584 -0.1791020875 -0.4154321292
0.0469444898 0.3016893288 -0.2012752387
0.0714073387 0.3334560626 -0.3631404946
0.0287765705 0.2899127196 -0.2063321823
0.0532394193 0.3216794533 -0.3681974382
0.2388250434 0.1058375188 0.0298015088
0.1911328814 0.0749230290 0.0165266494
0.1948023087 0.0796880391 -0.0077531390
0.1923560239 0.0765113657 0.0084333866
0.2493076367 0.1150188846 0.0074181289
0.2468613518 0.1118422112 0.0236046545
-0.1210182348 -0.1947686730 0.2786021488
0.1337024897 -0.3510237143 -0.0156178442
0.1532727688 -0.3256103273 -0.1451100489
-0.4759490547 -0.1308896417 0.0127626196
0.1981544963 0.1661381504 0.0354891819
0.1504623343 0.1352236606 0.0222143225
0.1541317616 0.1399886706 -0.0020654659
0.1516854768 0.1368119972 0.0141210597
0.2086370896 0.1753195161 0.0131058020
0.2061908047 0.1721428427 0.0292923276
0.1284340938 0.2695098676 0.0452394038
0.0807419319 0.2385953778 0.0319645444
0.0844113592 0.2433603879 0.0076847560
0.0819650743 0.2401837145 0.0238712816
0.1389166872 0.2786912334 0.0228560239
0.1364704023 0.2755145600 0.0390425495
0.3691041180 -0.1787424450 -0.0321288059
0.3666578331 -0.1819191184 -0.0159422803
0.4236094460 -0.1434115995 -0.0169575380
0.4211631611 -0.1465882729 -0.0007710125
0.0669796011 0.2816615841 -0.2021778421
0.0425168932 0.2498950333 -0.0403135186
0.0397269372 0.2639961613 -0.2097634760
0.0152642293 0.2322296106 -0.0478991525
0.1574839491 0.2264387819 0.0411768550
0.1097917872 0.1955242921 0.0279019956
0.1134612145 0.2002893022 0.0036222072
0.1110149296 0.1971126288 0.0198087328
0.1679665425 0.2356201476 0.0187934751
0.1655202576 0.2324434743 0.0349800007
-0.4192659798 -0.1198737416 -0.1826718691
-0.4376131164 -0.1436987919 -0.0612729272
0.3724563055 -0.0922923337 0.0111135150
0.3247641436 -0.1232068235 -0.0021613444
0.3284335709 -0.1184418135 -0.0264411328
0.3259872860 -0.1216184868 -0.0102546072
0.3829388989 -0.0831109680 -0.0112698649
0.3804926140 -0.0862876414 0.0049166606
0.1110036987 0.2953532336 0.0476770004
0.0633115368 0.2644387438 0.0344021410
0.0669809641 0.2692037539 0.0101223526
0.0645346792 0.2660270805 0.0263088782
0.1214862920 0.3045345994 0.0252936205
0.1190400072 0.3013579260 0.0414801461
0.3027359031 0.0110793835 0.0208637368
0.2550437412 -0.0198351063 0.0075888774
0.2587131685 -0.0150700962 -0.0166909110
0.2562668836 -0.0182467696 -0.0005043854
0.3132184964 0.0202607493 -0.0015196431
0.3107722116 0.0170840759 0.0146668825
0.3317857584 -0.0319917022 0.0168011881
0.2840935965 -0.0629061920 0.0035263287
0.2877630238 -0.0581411819 -0.0207534597
0.2853167389 -0.0613178553 -0.0045669341
0.3422683517 -0.0228103364 -0.0055821918
0.3398220669 -0.0259870098 0.0106043337
-0.4586649693 -0.0794901189 -0.0180520934
0.2620653560 0.0713800151 0.0265514099
0.2143731941 0.0404655253 0.0132765505
0.2180426214 0.0452305353 -0.0110032379
0.2155963365 0.0420538620 0.0051832877
0.2725479493 0.0805613808 0.0041680300
0.2701016644 0.0773847074 0.0203545556
-0.3109900181 -0.1286830792 -0.3398326043
-0.3354527260 -0.1604496300 -0.1779682808
-0.2837373541 -0.1110176565 -0.3322469704
-0.3082000620 -0.1427842072 -0.1703826469
-0.4198241532 -0.0623976400 -0.1714763009
-0.4381712898 -0.0862226903 -0.0500773590
0.0998540721 -0.2961925950 -0.1388200787
0.0815069355 -0.3200176453 -0.0174211367
0.3923430677 -0.2007421185 -0.2476790996
0.3678803598 -0.2325086693 -0.0858147761
0.3495332232 -0.2563337196 0.0355841658
0.3650904037 -0.2184075413 -0.2552647335
0.3406276958 -0.2501740920 -0.0934004100
0.2648021819 -0.2993248745 -0.1145060382
0.2464550453 -0.3231499248 0.0068929037
0.0819064123 -0.2619954080 0.4556448780
0.2190504202 -0.1730974244 0.4938181826
0.2213948089 0.1316806466 0.0322390830
0.1737026469 0.1007661568 0.0189642236
0.1773720743 0.1055311669 -0.0053155648
0.1749257894 0.1023544935 0.0108709608
0.2318774022 0.1408620124 0.0098557031
0.2294311173 0.1376853390 0.0260422287
-0.0670208526 -0.2150034009 -0.0192587966
-0.0474505735 -0.1895900139 -0.1487510013
-0.4640431796 -0.1846257304 0.0421052232
0.1516744065 0.2350523639 0.0419893049
0.1039822445 0.2041378741 0.0287144455
0.1076516719 0.2089028841 0.0044346571
0.1052053870 0.2057262108 0.0206211827
0.1621569998 0.2442337296 0.0196059250
0.1597107149 0.2410570563 0.0357924506
-0.0702445789 -0.2654394946 0.3668072760
0.1807242618 0.1919812782 0.0379267561
0.1330320998 0.1610667884 0.0246518967
0.1367015272 0.1658317984 0.0003721083
0.1342552423 0.1626551250 0.0165586339
0.1912068551 0.2011626439 0.0155433762
0.1887605702 0.1979859705 0.0317299018
0.0288650560 -0.2854333162 0.4342431218
0.3956966182 -0.1267498375 0.0078634160
0.3480044562 -0.1576643273 -0.0054114434
0.3516738836 -0.1528993172 -0.0296912317
0.3492275987 -0.1560759906 -0.0135047062
0.4061792115 -0.1175684717 -0.0145199639
0.4037329266 -0.1207451451 0.0016665617
-0.4365802119 -0.2218348857 0.0831167053
0.3550260711 -0.0664492059 0.0135510891
0.3073339091 -0.0973636957 0.0002762297
0.3110033364 -0.0925986857 -0.0240035586
0.3085570516 -0.0957753590 -0.0078170331
0.3655086644 -0.0572678402 -0.0088322908
0.3630623795 -0.0604445136 0.0073542348
0.2853056686 0.0369225113 0.0233013110
0.2376135067 0.0060080215 0.0100264516
0.2412829340 0.0107730316 -0.0142533368
0.2388366491 0.0075963582 0.0019331888
0.2957882620 0.0461038771 0.0009179311
0.2933419771 0.0429272037 0.0171044567
0.1948427782 -0.3521861296 -0.0066057836
0.2144130572 -0.3267727426 -0.1360979883
-0.3981740550 -0.0097177978 -0.1578656617
-0.4165211916 -0.0335428481 -0.0364667198
0.2006123869 0.0710736631 -0.0085656637
0.1981661020 0.0678969898 0.0076208619
0.2551177148 0.1064045086 0.0066056042
0.2526714300 0.1032278353 0.0227921298
-0.2690201946 -0.2019634036 0.1835802840
-0.2885790046 -0.2146416007 0.1781361934
0.0247142054 -0.2816849925 0.4404266543
0.1599418398 0.1313742947 -0.0028779906
0.1574955549 0.1281976213 0.0133085350
0.2144471677 0.1667051402 0.0122932773
0.2120008829 0.1635284668 0.0284798029
-0.0272566241 -0.2842101064 0.4070592895
-0.1281613905 -0.2138422883 -0.0282711506
-0.1085911114 -0.1884289013 -0.1577633553
0.0902214374 0.2347460119 0.0068722313
0.0877751525 0.2315693386 0.0230587569
0.1447267653 0.2700768574 0.0220434992
0.1422804804 0.2669001841 0.0382300247
0.4189369308 -0.1612073412 0.0046133171
0.3712447689 -0.1921218310 -0.0086615423
0.3749141962 -0.1873568209 -0.0329413307
0.3724679113 -0.1905334943 -0.0167548051
0.4294195241 -0.1520259755 -0.0177700628
0.4269732392 -0.1552026488 -0.0015835372
-0.3416214276 -0.2380803837 0.1567360835
0.1632940273 0.2178244060 0.0403643303
0.1156018654 0.1869099162 0.0270894709
0.1192712927 0.1916749262 0.0028096825
0.1168250078 0.1884982529 0.0189962081
0.1737766206 0.2270057717 0.0179809504
0.1713303357 0.2238290983 0.0341674760
-0.0231043079 -0.2879609949 0.4008764648
0.3782663837 -0.1009067097 0.0103009902
0.3305742218 -0.1318211995 -0.0029738692
0.3342436491 -0.1270561894 -0.0272536576
0.3317973642 -0.1302328628 -0.0110671320
0.3887489770 -0.0917253439 -0.0120823897
0.3863026921 -0.0949020173 0.0041041359
0.1168137769 0.2867388577 0.0468644757
0.0691216149 0.2558243679 0.0335896163
0.0727910423 0.2605893779 0.0093098279
0.0703447574 0.2574127046 0.0254963535
0.1272963702 0.2959202234 0.0244810958
0.1248500853 0.2927435500 0.0406676214
0.3085459813 0.0024650076 0.0200512121
0.2608538193 -0.0284494822 0.0067763527
0.2645232467 -0.0236844721 -0.0175034357
0.2620769618 -0.0268611455 -0.0013169101
0.3190285746 0.0116463733 -0.0023321678
0.3165822897 0.0084697000 0.0138543578
-0.0977084766 -0.2282285684 0.3257950113
-0.3847586867 0.0169619335 -0.0156804071
0.0308436539 0.2863591216 0.1000002920
-0.3552314216 -0.2148152798 -0.1916269400
-0.3735785582 -0.2386403301 -0.0702279981
0.3375958366 -0.0406060781 0.0159886633
0.2899036746 -0.0715205679 0.0027138039
0.2935731020 -0.0667555579 -0.0215659845
0.2911268171 -0.0699322312 -0.0053794589
0.3480784299 -0.0314247124 -0.0063947166
0.3456321450 -0.0346013858 0.0097918090
-0.3015037589 -0.2378266668 -0.1880231086
-0.3198508955 -0.2616517171 -0.0666241667
0.0769917570 -0.3267338911 -0.0194216113
0.0965620360 -0.3013205042 -0.1489138160
-0.1844222556 -0.2359861984 -0.0411197432
-0.1648519765 -0.2105728114 -0.1706119479
0.2678754342 0.0627656391 0.0257388852
-0.2039810655 -0.2486643955 -0.0465638338
-0.1844107864 -0.2232510085 -0.1760560385
0.2201832722 0.0318511493 0.0124640258
0.2238526995 0.0366161594 -0.0118157626
0.2214064147 0.0334394860 0.0043707630
0.2783580275 0.0719470049 0.0033555053
0.2759117426 0.0687703315 0.0195420309
-0.4456855621 -0.1451408166 -0.0627759269
-0.4261152831 -0.1197274297 -0.1922681316
-0.0935561605 -0.2319794569 0.3196121866
-0.1681604701 -0.1722472133 0.2445316656
0.2115035886 -0.3203028551 -0.1266781213
0.1931564520 -0.3441279055 -0.0052791794
0.2272048871 0.1230662707 0.0314265583
0.1795127251 0.0921517809 0.0181516989
0.1831821524 0.0969167909 -0.0061280895
0.1807358675 0.0937401176 0.0100584361
0.2376874804 0.1322476364 0.0090431784
0.2352411955 0.1290709631 0.0252297040
-0.3457719964 -0.2343316940 0.1629177512
-0.3977431077 -0.2368571738 0.1295522512
0.1865343399 0.1833669022 0.0371142314
0.1388421780 0.1524524124 0.0238393720
0.1425116053 0.1572174225 -0.0004404164
0.1400653204 0.1540407491 0.0157461092
0.1970169333 0.1925482680 0.0147308515
0.1945706484 0.1893715946 0.0309173771
-0.4266435637 -0.0275718266 -0.0280398966
-0.1640080131 -0.1759979189 0.2383479085
0.4015066963 -0.1353642134 0.0070508913
0.3538145344 -0.1662787032 -0.0062239681
0.3574839617 -0.1615136931 -0.0305037565
0.3550376768 -0.1646903665 -0.0143172309
0.4119892897 -0.1261828477 -0.0153324886
0.4095430048 -0.1293595210 0.0008540370
-0.2159799093 -0.1785239075 0.2049821900
0.0125537651 -0.2087509103 -0.1348530599
-0.0057933715 -0.2325759606 -0.0134541180
-0.1115005800 -0.1819590138 -0.1483434883
-0.1298477166 -0.2057840641 -0.0269445464
0.0777547726 -0.2582451305 0.4618266955
0.2148987805 -0.1693471468 0.5000000000
-0.4681949603 -0.1808756358 0.0482879730
0.3608361492 -0.0750635819 0.0127385644
0.3131439873 -0.1059780717 -0.0005362950
0.3168134146 -0.1012130616 -0.0248160834
0.3143671297 -0.1043897350 -0.0086295578
0.3713187425 -0.0658822161 -0.0096448155
0.3688724577 -0.0690588895 0.0065417101
0.2911157468 0.0283081354 0.0224887863
0.2434235849 -0.0026063544 0.0092139269
0.2470930122 0.0021586557 -0.0150658615
0.2446467273 -0.0010180177 0.0011206641
0.3015983401 0.0374895012 0.0001054064
0.2991520552 0.0343128278 0.0162919320
-0.4217444074 -0.2016366393 -0.0702452192
-0.4021741283 -0.1762232523 -0.1997374239
-0.3965841048 -0.1733952333 -0.1897477526
-0.4149312414 -0.1972202836 -0.0683488107
0.2504451997 0.0886087669 0.0281764594
0.2027530377 0.0576942771 0.0149016000
0.2064224651 0.0624592872 -0.0093781884
0.2039761802 0.0592826138 0.0068083372
0.2609277930 0.0977901327 0.0057930795
0.2584815081 0.0946134593 0.0219796051
-0.3037717692 -0.0909909438 -0.3313444643
-0.2793089204 -0.0592242101 -0.4932097202
-0.3219396886 -0.1027675531 -0.3364014079
-0.2974768398 -0.0710008194 -0.4982666638
0.3723086526 -0.1807154059 -0.2467765935
0.3967715014 -0.1489486722 -0.4086418494
0.3541407332 -0.1924920152 -0.2518335371
0.3786035820 -0.1607252815 -0.4136987930
0.0593392340 0.2833121258 -0.2030086123
0.0838020828 0.3150788596 -0.3648738682
0.0411713146 0.2715355165 -0.2080655559
0.0656341635 0.3033022503 -0.3699308118
0.2097746526 0.1489093985 0.0338641325
0.1620824906 0.1179949087 0.0205892731
0.1657519180 0.1227599187 -0.0036905153
0.1633056331 0.1195832454 0.0124960103
0.2202572459 0.1580907642 0.0114807526
0.2178109610 0.1549140909 0.0276672782
0.0483874046 0.3092275077 -0.1995777705
0.0239246967 0.2774609569 -0.0377134470
0.0055775601 0.2536359066 0.0836854950
0.0211347406 0.2915620849 -0.2071634044
-0.0033279673 0.2597955342 -0.0452990809
-0.3576118140 0.0301455473 -0.1439121037
-0.3759589506 0.0063204970 -0.0225131618
0.1400542502 0.2522811158 0.0436143543
0.0923620882 0.2213666260 0.0303394949
0.0960315155 0.2261316360 0.0060597065
0.0935852307 0.2229549626 0.0222462321
0.1505368435 0.2614624815 0.0212309744
0.1480905586 0.2582858081 0.0374175000
0.4247470090 -0.1698217171 0.0038007924
0.3770548470 -0.2007362069 -0.0094740670
0.3807242743 -0.1959711969 -0.0337538554
0.3782779895 -0.1991478703 -0.0175673298
0.4352296023 -0.1606403514 -0.0185825875
0.4327833174 -0.1638170248 -0.0023960619
-0.4628165358 -0.0757403419 -0.0118693736
0.1691041055 0.2092100300 0.0395518056
0.1214119435 0.1782955402 0.0262769462
0.1250813708 0.1830605503 0.0019971578
0.1226350860 0.1798838769 0.0181836834
0.1795866988 0.2183913958 0.0171684257
0.1771404139 0.2152147224 0.0333549513
-0.3295822682 -0.1011170762 -0.3372325252
-0.3540449761 -0.1328836270 -0.1753682017
-0.3023296042 -0.0834516535 -0.3296468913
-0.3267923121 -0.1152182042 -0.1677825678
-0.2731721162 -0.1982134920 0.1897639662
-0.2927309261 -0.2108916891 0.1843198756
-0.4462758015 -0.0844727267 -0.0509587638
-0.4267055224 -0.0590593397 -0.1804509685
0.3737508176 -0.1731761156 -0.2450790204
0.3492881097 -0.2049426663 -0.0832146970
0.3464981536 -0.1908415383 -0.2526646544
0.3220354457 -0.2226080891 -0.0908003309
0.3400537272 -0.1356705653 -0.0280661823
0.3376074424 -0.1388472387 -0.0118796567
0.3945590552 -0.1003397199 -0.0128949144
0.3921127703 -0.1035163932 0.0032916112
0.1226238550 0.2781244817 0.0460519510
0.0749316931 0.2472099919 0.0327770916
0.0786011204 0.2519750020 0.0084973032
0.0761548355 0.2487983286 0.0246838288
0.1331064484 0.2873058475 0.0236685711
0.1306601635 0.2841291741 0.0398550967
-0.3213824685 -0.2696471930 -0.0684247804
-0.3018121894 -0.2442338060 -0.1979169851
0.2703333248 -0.0322988481 -0.0183159604
0.2678870399 -0.0354755214 -0.0021294348
0.3248386528 0.0030319974 -0.0031446925
0.3223923679 -0.0001446760 0.0130418330
-0.3780937367 -0.2453565759 -0.0722284726
-0.3585234577 -0.2199431889 -0.2017206773
0.2993831801 -0.0753699338 -0.0223785092
0.2969368952 -0.0785466072 -0.0061919836
0.3538885081 -0.0400390883 -0.0072072413
0.3514422232 -0.0432157617 0.0089792843
0.2296627777 0.0280017835 -0.0126282873
0.2272164928 0.0248251101 0.0035582383
0.2841681056 0.0633326290 0.0025429806
0.2817218208 0.0601559556 0.0187295061
-0.2435819050 -0.2389255399 -0.1794849827
-0.2619290417 -0.2627505902 -0.0580860408
-0.3935918625 -0.2406064744 0.1233695762
0.2330149652 0.1144518947 0.0306140336
0.1853228033 0.0835374049 0.0173391742
0.1889922306 0.0883024150 -0.0069406142
0.1865459457 0.0851257416 0.0092459114
0.2434975585 0.1236332605 0.0082306537
0.2410512736 0.1204565871 0.0244171792
0.1535811993 -0.3192031881 -0.1352161724
0.1352340627 -0.3430282384 -0.0138172305
-0.4717971669 -0.1346398950 0.0065798548
0.1923444181 0.1747525263 0.0363017067
0.1446522562 0.1438380365 0.0230268473
0.1483216835 0.1486030466 -0.0012529411
0.1458753986 0.1454263732 0.0149335845
0.2028270114 0.1839338920 0.0139183268
0.2003807265 0.1807572187 0.0301048523
-0.4234237139 -0.0288667222 -0.0365921952
-0.4038534349 -0.0034533352 -0.1660843999
-0.1748816796 0.1497855597 0.0390685750
-0.1748816796 0.1497855597 0.0390685750
-0.0099768520 -0.2432368494 0.3938108534
-0.0237078187 -0.2246313660 0.3733053683
0.0448641852 -0.1801823741 0.3923920205
0.1298814829 -0.1747647605 0.4461960103
0.1463267765 -0.2137961386 0.4809133477
0.1038181277 -0.2165049455 0.4540113529
0.1723901317 -0.1720559536 0.4730980051
0.0613094789 -0.2192137523 0.4271093580
0.0873728340 -0.1774735673 0.4192940154
0.1038181277 -0.2165049455 0.4540113529
-0.0237078187 -0.2246313660 0.3733053683
-0.0401531124 -0.1855999878 0.3385880308
0.0023555364 -0.1828911810 0.3654900257
-0.0744391143 -0.2078244837 0.3290447047
0.0270234769 -0.2414382482 0.4175660319
0.0105781833 -0.2024068701 0.3828486944
0.0613094789 -0.2192137523 0.4271093580
0.1228712172 0.0585059874 0.3000001460
0.0448641852 -0.1801823741 0.3923920205
-0.0011495964 -0.0662558071 0.2923920936
0.0838677012 -0.0608381934 0.3461960833
0.0218572944 -0.1232190906 0.3423920571
0.0413590524 -0.0635470002 0.3192940884
0.0643659432 -0.1205102838 0.3692940519
0.0608608104 -0.0038749098 0.2961961198
0.1033694592 -0.0011661030 0.3230981146
0.0413590524 -0.0635470002 0.3192940884
-0.0401531124 -0.1855999878 0.3385880308
-0.0631600032 -0.1286367043 0.2885880673
-0.0206513544 -0.1259278974 0.3154900622
-0.0826617612 -0.1883087947 0.3116860360
0.0218572944 -0.1232190906 0.3423920571
0.0023555364 -0.1828911810 0.3654900257
-0.0206513544 -0.1259278974 0.3154900622
0.1688849988 -0.0554205797 0.4000000730
0.1298814829 -0.1747647605 0.4461960103
0.1068745920 -0.1178014769 0.3961960468
0.1493832408 -0.1150926701 0.4230980416
0.0873728340 -0.1774735673 0.4192940154
0.1918918896 -0.1123838632 0.4500000365
0.1723901317 -0.1720559536 0.4730980051
0.1493832408 -0.1150926701 0.4230980416
0.0838677012 -0.0608381934 0.3461960833
0.1458781080 0.0015427038 0.3500001095
0.1263763500 -0.0581293865 0.3730980781
0.1033694592 -0.0011661030 0.3230981146
0.1068745920 -0.1178014769 0.3961960468
0.0643659432 -0.1205102838 0.3692940519
0.1263763500 -0.0581293865 0.3730980781
-0.0471633780 0.0476707600 0.1923921666
0.0768574356 0.1724325545 0.2000002190
0.0378539196 0.0530883737 0.2461961563
0.0148470288 0.1100516573 0.1961961928
0.0573556776 0.1127604641 0.2230981877
-0.0046547292 0.0503795669 0.2192941614
0.0998643264 0.1154692709 0.2500001825
0.0803625684 0.0557971806 0.2730981512
0.0573556776 0.1127604641 0.2230981877
-0.0081598620 0.1670149408 0.1461962293
0.0538505448 0.2293958380 0.1500002555
0.0343487868 0.1697237476 0.1730982242
0.0113418959 0.2266870312 0.1230982607
0.0148470288 0.1100516573 0.1961961928
-0.0276616200 0.1073428504 0.1692941979
0.0343487868 0.1697237476 0.1730982242
-0.0011495964 -0.0662558071 0.2923920936
-0.0861668940 -0.0716734207 0.2385881038
-0.0241564872 -0.0092925235 0.2423921301
-0.0436582452 -0.0689646139 0.2654900987
-0.0666651360 -0.0120013303 0.2154901352
-0.0631600032 -0.1286367043 0.2885880673
-0.1056686520 -0.1313455111 0.2616860725
-0.0436582452 -0.0689646139 0.2654900987
0.0378539196 0.0530883737 0.2461961563
0.0608608104 -0.0038749098 0.2961961198
0.0183521616 -0.0065837167 0.2692941249
0.0803625684 0.0557971806 0.2730981512
-0.0241564872 -0.0092925235 0.2423921301
-0.0046547292 0.0503795669 0.2192941614
0.0183521616 -0.0065837167 0.2692941249
-0.0471633780 0.0476707600 0.1923921666
-0.0861668940 -0.0716734207 0.2385881038
-0.1056686520 -0.1313455111 0.2616860725
-0.1076619241 -0.0622882267 0.2184619161
-0.0686584081 0.0570559541 0.1722659788
-0.0081598620 0.1670149408 0.1461962293
-0.1184094391 -0.0575956296 0.2083988222
-0.0946439476 0.0557927458 0.1555821497
-0.0686584081 0.0570559541 0.1722659788
-0.1184094391 -0.0575956296 0.2083988222
-0.0319001468 0.1710759337 0.1277912209
-0.1573877483 -0.0594904420 0.1833730786
-0.1314022089 -0.0582272338 0.2000569077
-0.1887596487 -0.1171320360 0.1972685430
-0.0946439476 0.0557927458 0.1555821497
-0.3024451179 -0.0789058482 0.0977418001
-0.2397013171 0.0363773397 0.0699508713
-0.1985445327 -0.0115565512 0.1266619749
-0.2710732175 -0.0212642542 0.0838463357
-0.2191229249 0.0124103943 0.0983064231
-0.2504948253 -0.0452311997 0.1122018875
-0.1671726323 0.0460850428 0.1127665105
-0.1465942401 0.0221180973 0.1411220623
-0.2191229249 0.0124103943 0.0983064231
-0.3436019023 -0.0309719573 0.0410306965
-0.3122300019 0.0266696366 0.0271352321
-0.2916516097 0.0027026912 0.0554907839
-0.3641802945 -0.0070050119 0.0126751447
-0.2710732175 -0.0212642542 0.0838463357
-0.3230235101 -0.0549389027 0.0693862483
-0.2916516097 0.0027026912 0.0554907839
-0.1573877483 -0.0594904420 0.1833730786
-0.2612883335 -0.1268397390 0.1544529038
-0.2299164331 -0.0691981451 0.1405574394
-0.2093380409 -0.0931650905 0.1689129912
-0.2818667257 -0.1028727936 0.1260973520
-0.1887596487 -0.1171320360 0.1972685430
-0.2407099413 -0.1508066845 0.1828084556
-0.2093380409 -0.0931650905 0.1689129912
-0.1985445327 -0.0115565512 0.1266619749
-0.1260158479 -0.0018488481 0.1694776141
-0.1779661405 -0.0355234966 0.1550175268
-0.1465942401 0.0221180973 0.1411220623
-0.2299164331 -0.0691981451 0.1405574394
-0.2504948253 -0.0452311997 0.1122018875
-0.1779661405 -0.0355234966 0.1550175268
-0.1769575164 0.1516605276 0.0421599425
-0.0319001468 0.1710759337 0.1277912209
-0.1358007320 0.1037266367 0.0988710461
-0.1044288316 0.1613682306 0.0849755817
-0.0838504394 0.1374012852 0.1133311335
-0.1563791242 0.1276935821 0.0705154943
-0.0632720472 0.1134343398 0.1416866853
-0.1152223398 0.0797596913 0.1272265979
-0.0838504394 0.1374012852 0.1133311335
-0.0730569312 0.2190098246 0.0710801172
-0.0005282464 0.2287175276 0.1138957565
-0.0524785390 0.1950428791 0.0994356691
-0.0211066386 0.2526844731 0.0855402046
-0.1044288316 0.1613682306 0.0849755817
-0.1250072238 0.1853351761 0.0566200298
-0.0524785390 0.1950428791 0.0994356691
-0.2397013171 0.0363773397 0.0699508713
-0.2808581015 0.0843112306 0.0132397677
-0.2083294168 0.0940189336 0.0560554069
-0.2602797093 0.0603442851 0.0415953195
-0.2289078090 0.1179858791 0.0276998551
-0.3122300019 0.0266696366 0.0271352321
-0.3328083941 0.0506365820 -0.0012203197
-0.2602797093 0.0603442851 0.0415953195
-0.1358007320 0.1037266367 0.0988710461
-0.1671726323 0.0460850428 0.1127665105
-0.1877510245 0.0700519882 0.0844109587
-0.1152223398 0.0797596913 0.1272265979
-0.2083294168 0.0940189336 0.0560554069
-0.1563791242 0.1276935821 0.0705154943
-0.1877510245 0.0700519882 0.0844109587
-0.3024451179 -0.0789058482 0.0977418001
-0.2612883335 -0.1268397390 0.1544529038
-0.2407099413 -0.1508066845 0.1828084556
-0.2878086170 -0.1385596701 0.1437528832
-0.3289654014 -0.0906257792 0.0870417796
-0.3436019023 -0.0309719573 0.0410306965
-0.3010687588 -0.1444196356 0.1384028729
-0.3289654014 -0.0906257792 0.0870417796
-0.3387448064 -0.0969648778 0.0843197342
-0.3617630817 -0.1173567899 0.0812313569
-0.3847700219 -0.0603933843 0.0312312862
-0.3157378663 -0.1539282834 0.1343198049
-0.3847700219 -0.0603933843 0.0312312862
-0.3847643543 -0.0217157254 0.0077754396
-0.3617517466 -0.0400014721 0.0343196636
-0.3617630817 -0.1173567899 0.0812313569
-0.3777737310 -0.1433160155 0.0862252510
-0.4202951334 -0.1095281787 0.0371779387
-0.3272470039 -0.1641242395 0.1327756163
-0.3962791595 -0.0705893404 0.0296870976
-0.4122898088 -0.0965485659 0.0346809917
-0.4295478476 -0.0731648411 0.0089088620
-0.3777737310 -0.1433160155 0.0862252510
-0.3843399904 -0.1708906654 0.0985412476
-0.4202951334 -0.1095281787 0.0371779387
-0.3843399904 -0.1708906654 0.0985412476
-0.3804629432 -0.1958836625 0.1163039243
-0.4301445225 -0.1508901535 0.0556519336
-0.3804629432 -0.1958836625 0.1163039243
0.1249470540 0.0566310195 0.2969087786
0.1249470540 0.0566310195 0.2969087786
-0.0058248741 -0.2469874325 0.3876285323
-0.0195559112 -0.2283820405 0.3671235134
0.0490160927 -0.1839330487 0.3862101657
-0.0195559112 -0.2283820405 0.3671235134
0.0311752505 -0.2451887243 0.4113841957
0.0654612525 -0.2229642284 0.4209275219
0.0147300908 -0.2061575446 0.3766668396
-0.0360010710 -0.1893508609 0.3324061572
-0.0702870730 -0.2115753568 0.3228628311
0.0065075109 -0.1866419548 0.3593081615
0.1340332565 -0.1785152365 0.4400141741
0.0654612525 -0.2229642284 0.4209275219
0.1079698344 -0.2202553223 0.4478295261
0.0915246746 -0.1812241426 0.4131121699
0.1504784163 -0.2175464162 0.4747315303
0.1765418383 -0.1758063305 0.4669161784
0.1079698344 -0.2202553223 0.4478295261
0.1270228738 0.0547558807 0.2938178699
-0.0430114536 0.0439202564 0.1862098530
0.0030023195 -0.0700063962 0.2862100093
0.0420057101 0.0493380685 0.2400138614
-0.0200045670 -0.0130430699 0.2362099312
0.0225040148 -0.0103341638 0.2631119354
-0.0005028718 0.0466291625 0.2131118572
0.0650125967 -0.0076252577 0.2900139396
0.0845142920 0.0520469746 0.2669158657
0.0225040148 -0.0103341638 0.2631119354
-0.0820148442 -0.0754242083 0.2324060009
-0.0590079576 -0.1323875346 0.2824060791
-0.0395062623 -0.0727153022 0.2593080051
-0.1015165395 -0.1350964407 0.2555040748
-0.0200045670 -0.0130430699 0.2362099312
-0.0625131489 -0.0157519760 0.2093079269
-0.0395062623 -0.0727153022 0.2593080051
0.0810091007 0.1686825332 0.1938177135
-0.0040080631 0.1632647211 0.1400137051
0.0189988235 0.1063013948 0.1900137833
0.0385005188 0.1659736272 0.1669157093
-0.0235097583 0.1035924887 0.1631117790
0.0580022141 0.2256458595 0.1438176354
0.0154936322 0.2229369534 0.1169156311
0.0385005188 0.1659736272 0.1669157093
0.0420057101 0.0493380685 0.2400138614
0.1040159873 0.1117192070 0.2438177917
0.0615074054 0.1090103009 0.2169157875
0.0845142920 0.0520469746 0.2669158657
0.0189988235 0.1063013948 0.1900137833
-0.0005028718 0.0466291625 0.2131118572
0.0615074054 0.1090103009 0.2169157875
0.0490160927 -0.1839330487 0.3862101657
0.1730366470 -0.0591707718 0.3938180262
0.0880194833 -0.0645885840 0.3400140178
0.1110263699 -0.1215519103 0.3900140960
0.1305280652 -0.0618796779 0.3669160220
0.0685177880 -0.1242608163 0.3631120917
0.1500297604 -0.0022074456 0.3438179481
0.1075211786 -0.0049163516 0.3169159438
0.1305280652 -0.0618796779 0.3669160220
0.1340332565 -0.1785152365 0.4400141741
0.1960435336 -0.1161340981 0.4438181044
0.1535349517 -0.1188430042 0.4169161002
0.1765418383 -0.1758063305 0.4669161784
0.1110263699 -0.1215519103 0.3900140960
0.0915246746 -0.1812241426 0.4131121699
0.1535349517 -0.1188430042 0.4169161002
0.0030023195 -0.0700063962 0.2862100093
-0.0360010710 -0.1893508609 0.3324061572
0.0260092061 -0.1269697224 0.3362100875
-0.0164993757 -0.1296786285 0.3093080833
0.0065075109 -0.1866419548 0.3593081615
-0.0590079576 -0.1323875346 0.2824060791
-0.0785096529 -0.1920597669 0.3055041530
-0.0164993757 -0.1296786285 0.3093080833
0.0880194833 -0.0645885840 0.3400140178
0.0650125967 -0.0076252577 0.2900139396
0.0455109014 -0.0672974901 0.3131120136
0.1075211786 -0.0049163516 0.3169159438
0.0260092061 -0.1269697224 0.3362100875
0.0685177880 -0.1242608163 0.3631120917
0.0455109014 -0.0672974901 0.3131120136
-0.0430114536 0.0439202564 0.1862098530
-0.0645063428 0.0533056334 0.1660827328
-0.1142571779 -0.0613461427 0.2022153207
-0.0040080631 0.1632647211 0.1400137051
-0.0820148442 -0.0754242083 0.2324060009
-0.1035097334 -0.0660388313 0.2122788807
-0.1015165395 -0.1350964407 0.2555040748
-0.0904922909 0.0520426392 0.1493998736
-0.1532361001 -0.0632406342 0.1771910318
-0.1846080047 -0.1208822708 0.1910866109
-0.1272501520 -0.0619776399 0.1938738910
-0.0645063428 0.0533056334 0.1660827328
-0.0277484817 0.1673259125 0.1216087154
-0.1142571779 -0.0613461427 0.2022153207
-0.0904922909 0.0520426392 0.1493998736
-0.1728058428 0.1479105918 0.0359772076
-0.2355496520 0.0326273185 0.0637683658
-0.1316490669 0.0999766155 0.0926885406
-0.2041777474 0.0902689551 0.0498727867
-0.1835993594 0.0663019670 0.0782284532
-0.1522274548 0.1239436036 0.0643328741
-0.1630209715 0.0423349788 0.1065841197
-0.1110706789 0.0760096273 0.1210442071
-0.1835993594 0.0663019670 0.0782284532
-0.2767064280 0.0805612948 0.0070570328
-0.3080783326 0.0229196581 0.0209526119
-0.2561280400 0.0565943066 0.0354126993
-0.3286567206 0.0468866463 -0.0074030546
-0.2041777474 0.0902689551 0.0498727867
-0.2247561354 0.1142359433 0.0215171202
-0.2561280400 0.0565943066 0.0354126993
-0.0277484817 0.1673259125 0.1216087154
-0.0689052577 0.2152598888 0.0648973824
-0.1002771623 0.1576182521 0.0787929615
-0.0483268697 0.1912929006 0.0932530489
-0.1208555502 0.1815852403 0.0504372950
0.0036234229 0.2249675491 0.1077131363
-0.0169549651 0.2489345373 0.0793574698
-0.0483268697 0.1912929006 0.0932530489
-0.1316490669 0.0999766155 0.0926885406
-0.0591203863 0.1096842758 0.1355042945
-0.0796987743 0.1336512640 0.1071486280
-0.1110706789 0.0760096273 0.1210442071
-0.1002771623 0.1576182521 0.0787929615
-0.1522274548 0.1239436036 0.0643328741
-0.0796987743 0.1336512640 0.1071486280
-0.2982934612 -0.0826559549 0.0915595240
-0.1532361001 -0.0632406342 0.1771910318
-0.1943928761 -0.0153066579 0.1204796988
-0.2257647807 -0.0729482945 0.1343752779
-0.1738144881 -0.0392736460 0.1488353653
-0.2463431686 -0.0489813064 0.1060196114
-0.1218641955 -0.0055989975 0.1632954527
-0.1424425835 0.0183679906 0.1349397862
-0.1738144881 -0.0392736460 0.1488353653
-0.2571366853 -0.1305899312 0.1482708570
-0.1846080047 -0.1208822708 0.1910866109
-0.2051863927 -0.0969152827 0.1627309444
-0.2365582973 -0.1545569193 0.1766265235
-0.2257647807 -0.0729482945 0.1343752779
-0.2777150732 -0.1066229430 0.1199151905
-0.2051863927 -0.0969152827 0.1627309444
-0.2355496520 0.0326273185 0.0637683658
-0.3394502372 -0.0347219786 0.0348481910
-0.2669215566 -0.0250143182 0.0776639449
-0.2874999446 -0.0010473301 0.0493082784
-0.3188718492 -0.0586889667 0.0632038575
-0.3080783326 0.0229196581 0.0209526119
-0.3600286252 -0.0107549904 0.0064925245
-0.2874999446 -0.0010473301 0.0493082784
-0.1943928761 -0.0153066579 0.1204796988
-0.1630209715 0.0423349788 0.1065841197
-0.2149712640 0.0086603303 0.0921240323
-0.1424425835 0.0183679906 0.1349397862
-0.2669215566 -0.0250143182 0.0776639449
-0.2463431686 -0.0489813064 0.1060196114
-0.2149712640 0.0086603303 0.0921240323
-0.2982934612 -0.0826559549 0.0915595240
-0.3248136039 -0.0943757029 0.0808585710
-0.2969168993 -0.1481695533 0.1322194275
-0.3394502372 -0.0347219786 0.0348481910
-0.2571366853 -0.1305899312 0.1482708570
-0.2836568279 -0.1423096792 0.1375699040
-0.2365582973 -0.1545569193 0.1766265235
-0.3248136039 -0.0943757029 0.0808585710
-0.3345930088 -0.1007148015 0.0781365257
-0.3806182863 -0.0641433140 0.0250483145
-0.3576000110 -0.0437514019 0.0281366919
-0.3806126497 -0.0254656581 0.0015925863
-0.3576112842 -0.1211067136 0.0750481484
-0.3115860067 -0.1576782011 0.1281363596
-0.3806182863 -0.0641433140 0.0250483145
-0.3576112842 -0.1211067136 0.0750481484
-0.3921274239 -0.0743392701 0.0235041259
-0.4253961966 -0.0769146945 0.0027260162
-0.4081381267 -0.1002984163 0.0284980275
-0.3736219869 -0.1470658598 0.0800420500
-0.3230951444 -0.1678741572 0.1265921709
-0.4161434781 -0.1132779894 0.0309949783
-0.3736219869 -0.1470658598 0.0800420500
-0.4161434781 -0.1132779894 0.0309949783
-0.3801880857 -0.1746407479 0.0923580241
-0.3801880857 -0.1746407479 0.0923580241
-0.4259926263 -0.1546403215 0.0494689395
-0.3763110921 -0.1996336656 0.1101207083
-0.3763110921 -0.1996336656 0.1101207083
0.1616515177 -0.2770483146 -0.1257234273
0.2131906066 -0.2436402120 -0.1113777962
0.2905354832 -0.2380744406 -0.0985962862
0.3163412708 -0.2659167719 -0.1001604071
0.2518630449 -0.2408573263 -0.1049870412
0.1616515177 -0.2770483146 -0.1257234273
0.1358457300 -0.2492059833 -0.1241593063
0.2132268498 -0.2881865946 -0.1201147327
0.1902170625 -0.2206297898 -0.1103339180
0.2131906066 -0.2436402120 -0.1113777962
0.1013854138 -0.2146903500 -0.1225934890
0.1959025282 0.0224761438 -0.0617641115
0.1902170625 -0.2206297898 -0.1103339180
0.1042281467 -0.0931373832 -0.0983085857
0.1930597954 -0.0990768230 -0.0860490148
0.1472226046 -0.1568835865 -0.1043212519
0.1486439710 -0.0961071031 -0.0921788002
0.1916384289 -0.1598533064 -0.0981914664
0.1500653375 -0.0353306197 -0.0800363486
0.1944811618 -0.0383003396 -0.0739065631
0.1486439710 -0.0961071031 -0.0921788002
0.1013854138 -0.2146903500 -0.1225934890
0.0583909559 -0.1509441468 -0.1165808228
0.1028067802 -0.1539138666 -0.1104510373
0.0569695895 -0.2117206302 -0.1287232744
0.1472226046 -0.1568835865 -0.1043212519
0.1458012381 -0.2176600699 -0.1164637035
0.1028067802 -0.1539138666 -0.1104510373
0.2818914440 -0.1050162627 -0.0737894438
0.2790487111 -0.2265692295 -0.0980743470
0.2360542532 -0.1628230263 -0.0920616809
0.2804700776 -0.1657927461 -0.0859318954
0.2346328868 -0.2235995097 -0.1042041325
0.3248859019 -0.1687624660 -0.0798021099
0.3234645355 -0.2295389494 -0.0919445616
0.2804700776 -0.1657927461 -0.0859318954
0.1930597954 -0.0990768230 -0.0860490148
0.2388969861 -0.0412700595 -0.0677767777
0.2374756197 -0.1020465429 -0.0799192293
0.1944811618 -0.0383003396 -0.0739065631
0.2360542532 -0.1628230263 -0.0920616809
0.1916384289 -0.1598533064 -0.0981914664
0.2374756197 -0.1020465429 -0.0799192293
0.0182392309 0.0343550233 -0.0862832534
0.1099136125 0.1499685504 -0.0497387792
0.1070708796 0.0284155836 -0.0740236825
0.0640764217 0.0921617868 -0.0680110163
0.1084922460 0.0891920670 -0.0618812309
0.0626550552 0.0313853034 -0.0801534680
0.1529080703 0.0862223471 -0.0557514454
0.1514867039 0.0254458637 -0.0678938970
0.1084922460 0.0891920670 -0.0618812309
0.0210819638 0.1559079901 -0.0619983502
0.0669191546 0.2137147536 -0.0437261131
0.0654977881 0.1529382702 -0.0558685647
0.0225033302 0.2166844735 -0.0498558986
0.0640764217 0.0921617868 -0.0680110163
0.0196605973 0.0951315067 -0.0741408018
0.0654977881 0.1529382702 -0.0558685647
0.1042281467 -0.0931373832 -0.0983085857
0.0153964980 -0.0871979435 -0.1105681567
0.0612336888 -0.0293911800 -0.0922959196
0.0598123224 -0.0901676634 -0.1044383712
0.0168178645 -0.0264214601 -0.0984257051
0.0583909559 -0.1509441468 -0.1165808228
0.0139751316 -0.1479744269 -0.1227106083
0.0598123224 -0.0901676634 -0.1044383712
0.1070708796 0.0284155836 -0.0740236825
0.1500653375 -0.0353306197 -0.0800363486
0.1056495131 -0.0323608998 -0.0861661341
0.1514867039 0.0254458637 -0.0678938970
0.0612336888 -0.0293911800 -0.0922959196
0.0626550552 0.0313853034 -0.0801534680
0.1056495131 -0.0323608998 -0.0861661341
0.0182392309 0.0343550233 -0.0862832534
0.0153964980 -0.0871979435 -0.1105681567
0.0139751316 -0.1479744269 -0.1227106083
-0.0144514561 -0.0744139256 -0.1125701891
-0.0116087232 0.0471390412 -0.0882852859
0.0210819638 0.1559079901 -0.0619983502
-0.0293754331 -0.0680219167 -0.1135712054
-0.0437879417 0.0477509716 -0.0930284676
-0.0116087232 0.0471390412 -0.0882852859
-0.0293754331 -0.0680219167 -0.1135712054
-0.0099316225 0.1626059642 -0.0653709573
-0.0776442608 -0.0671040211 -0.1206859780
-0.0454650423 -0.0677159515 -0.1159427962
-0.0945724204 -0.1245315175 -0.1345147332
-0.0437879417 0.0477509716 -0.0930284676
-0.2345561970 -0.0759067332 -0.1461277960
-0.2006998778 0.0389482594 -0.1184702857
-0.1391720693 -0.0140778808 -0.1195781318
-0.2176280374 -0.0184792369 -0.1322990408
-0.1699359736 0.0124351893 -0.1190242087
-0.1868641332 -0.0449923070 -0.1328529639
-0.1222439097 0.0433496155 -0.1057493766
-0.0914800055 0.0168365454 -0.1063032997
-0.1699359736 0.0124351893 -0.1190242087
-0.2960840055 -0.0228805930 -0.1450199498
-0.2791558459 0.0345469034 -0.1311911947
-0.2483919417 0.0080338332 -0.1317451177
-0.3268479097 0.0036324772 -0.1444660268
-0.2176280374 -0.0184792369 -0.1322990408
-0.2653201012 -0.0493936631 -0.1455738729
-0.2483919417 0.0080338332 -0.1317451177
-0.0776442608 -0.0671040211 -0.1206859780
-0.1730283885 -0.1289328735 -0.1472356422
-0.1561002289 -0.0715053772 -0.1334068870
-0.1253363247 -0.0980184473 -0.1339608101
-0.2037922927 -0.1024198034 -0.1466817191
-0.0945724204 -0.1245315175 -0.1345147332
-0.1422644842 -0.1554459437 -0.1477895652
-0.1253363247 -0.0980184473 -0.1339608101
-0.1391720693 -0.0140778808 -0.1195781318
-0.0607161012 -0.0096765248 -0.1068572228
-0.1084081651 -0.0405909510 -0.1201320549
-0.0914800055 0.0168365454 -0.1063032997
-0.1561002289 -0.0715053772 -0.1334068870
-0.1868641332 -0.0449923070 -0.1328529639
-0.1084081651 -0.0405909510 -0.1201320549
-0.1668435587 0.1538032521 -0.0908127753
-0.0099316225 0.1626059642 -0.0653709573
-0.1053157502 0.1007771118 -0.0919206215
-0.0883875906 0.1582046082 -0.0780918663
-0.0576236863 0.1316915380 -0.0786457894
-0.1360796544 0.1272901820 -0.0913666984
-0.0268597821 0.1051784679 -0.0791997125
-0.0745518459 0.0742640417 -0.0924745446
-0.0576236863 0.1316915380 -0.0786457894
-0.0714594310 0.2156321045 -0.0642631111
0.0069965371 0.2200334606 -0.0515422021
-0.0406955267 0.1891190344 -0.0648170342
-0.0237673672 0.2465465307 -0.0509882790
-0.0883875906 0.1582046082 -0.0780918663
-0.1191514948 0.1847176783 -0.0775379432
-0.0406955267 0.1891190344 -0.0648170342
-0.2006998778 0.0389482594 -0.1184702857
-0.2622276863 0.0919743997 -0.1173624395
-0.1837717182 0.0963757558 -0.1046415305
-0.2314637821 0.0654613296 -0.1179163626
-0.2145356225 0.1228888259 -0.1040876074
-0.2791558459 0.0345469034 -0.1311911947
-0.3099197502 0.0610599735 -0.1306372716
-0.2314637821 0.0654613296 -0.1179163626
-0.1053157502 0.1007771118 -0.0919206215
-0.1222439097 0.0433496155 -0.1057493766
-0.1530078140 0.0698626856 -0.1051954536
-0.0745518459 0.0742640417 -0.0924745446
-0.1837717182 0.0963757558 -0.1046415305
-0.1360796544 0.1272901820 -0.0913666984
-0.1530078140 0.0698626856 -0.1051954536
-0.2345561970 -0.0759067332 -0.1461277960
-0.1730283885 -0.1289328735 -0.1472356422
-0.1422644842 -0.1554459437 -0.1477895652
-0.2026396892 -0.1405881903 -0.1539982307
-0.2641674977 -0.0875620500 -0.1528903845
-0.2960840055 -0.0228805930 -0.1450199498
-0.2174453396 -0.1464158487 -0.1573795249
-0.2641674977 -0.0875620500 -0.1528903845
-0.2739469027 -0.0939011486 -0.1556124298
-0.2321144471 -0.1559244965 -0.1614625929
-0.2378481760 -0.1974250182 -0.1704737878
-0.2587644039 -0.1664133442 -0.1675487062
-0.3005968595 -0.1043899963 -0.1616985432
-0.3157793583 -0.0318778006 -0.1497622667
-0.2587644039 -0.1664133442 -0.1675487062
-0.3005968595 -0.1043899963 -0.1616985432
-0.2720893823 -0.1716577681 -0.1705917629
-0.3295577864 -0.1038405597 -0.1659676062
-0.3295577864 -0.1038405597 -0.1659676062
-0.3155307727 -0.1708336132 -0.1769953574
-0.3564216178 -0.0923348662 -0.1677695218
-0.3564216178 -0.0923348662 -0.1677695218
-0.3558265197 -0.1535750730 -0.1796982309
-0.3770979594 -0.0716248430 -0.1668299281
-0.3770979594 -0.0716248430 -0.1668299281
0.1617921084 -0.2811139061 -0.1350899042
0.1399675580 -0.2592534290 -0.1340980590
0.2426053919 -0.1927226588 -0.1055293643
0.1399675580 -0.2592534290 -0.1340980590
0.2053204724 -0.2819407338 -0.1286736899
0.2566393894 -0.2486753487 -0.1143893425
0.1912864749 -0.2259880439 -0.1198137117
0.1259335605 -0.2033007391 -0.1252380808
0.0746146435 -0.2365661242 -0.1395224281
0.1912864749 -0.2259880439 -0.1198137117
0.3733112207 -0.2380972683 -0.0946806261
0.3592772233 -0.1821445784 -0.0858206478
0.3079583063 -0.2154099635 -0.1001049952
0.4246301377 -0.2048318832 -0.0803962787
0.3079583063 -0.2154099635 -0.1001049952
0.2566393894 -0.2486753487 -0.1143893425
0.3219923038 -0.2713626535 -0.1089649734
0.2993231606 0.0903098158 -0.0414112470
0.0659794978 0.0691536551 -0.0808286800
0.1542924448 -0.0617845018 -0.0931790221
0.1826513292 0.0797317354 -0.0611199635
0.1101359713 0.0036845766 -0.0870038510
0.1684718870 0.0089736168 -0.0771494928
0.1243154135 0.0744426953 -0.0709743217
0.2268078027 0.0142626570 -0.0672951346
0.2409872449 0.0850207756 -0.0512656053
0.1684718870 0.0089736168 -0.0771494928
0.0376206134 -0.0723625822 -0.1128877386
0.0817770870 -0.1378316606 -0.1190629097
0.0959565291 -0.0670735420 -0.1030333804
0.0234411713 -0.1431207008 -0.1289172679
0.1101359713 0.0036845766 -0.0870038510
0.0518000556 -0.0016044635 -0.0968582093
0.0959565291 -0.0670735420 -0.1030333804
0.2110102135 0.2212479727 -0.0290609049
0.0943383821 0.2106698924 -0.0487696213
0.1384948556 0.1452008139 -0.0549447924
0.1526742978 0.2159589325 -0.0389152631
0.0801589400 0.1399117737 -0.0647991506
0.1668537400 0.2867170512 -0.0228857338
0.1085178243 0.2814280110 -0.0327400920
0.1526742978 0.2159589325 -0.0389152631
0.1826513292 0.0797317354 -0.0611199635
0.2551666870 0.1557788942 -0.0352360759
0.1968307713 0.1504898541 -0.0450904342
0.2409872449 0.0850207756 -0.0512656053
0.1384948556 0.1452008139 -0.0549447924
0.1243154135 0.0744426953 -0.0709743217
0.1968307713 0.1504898541 -0.0450904342
0.2426053919 -0.1927226588 -0.1055293643
0.3876361076 -0.0406283411 -0.0537615892
0.2709642762 -0.0512064215 -0.0734703057
0.3151207497 -0.1166755000 -0.0796454768
0.3293001919 -0.0459173813 -0.0636159474
0.2567848340 -0.1219645401 -0.0894998350
0.3434796341 0.0248407373 -0.0475864181
0.2851437184 0.0195516971 -0.0574407763
0.3293001919 -0.0459173813 -0.0636159474
0.3592772233 -0.1821445784 -0.0858206478
0.4317925811 -0.1060974196 -0.0599367603
0.3734566654 -0.1113864598 -0.0697911185
0.4176131390 -0.1768555382 -0.0759662896
0.3151207497 -0.1166755000 -0.0796454768
0.3009413076 -0.1874336186 -0.0956750061
0.3734566654 -0.1113864598 -0.0697911185
0.1542924448 -0.0617845018 -0.0931790221
0.1259335605 -0.2033007391 -0.1252380808
0.1984489183 -0.1272535803 -0.0993541932
0.1401130027 -0.1325426205 -0.1092085515
0.1842694762 -0.1980116989 -0.1153837225
0.0817770870 -0.1378316606 -0.1190629097
0.0675976448 -0.2085897793 -0.1350924390
0.1401130027 -0.1325426205 -0.1092085515
0.2709642762 -0.0512064215 -0.0734703057
0.2268078027 0.0142626570 -0.0672951346
0.2126283605 -0.0564954617 -0.0833246639
0.2851437184 0.0195516971 -0.0574407763
0.1984489183 -0.1272535803 -0.0993541932
0.2567848340 -0.1219645401 -0.0894998350
0.2126283605 -0.0564954617 -0.0833246639
0.0659794978 0.0691536551 -0.0808286800
0.0376233465 0.0812980579 -0.0827307820
-0.0049136135 -0.0541459780 -0.1157408917
0.0092644621 -0.0602181794 -0.1147898406
0.0305329421 0.0075038386 -0.0982847858
0.0943383821 0.2106698924 -0.0487696213
0.0801603065 0.2167420938 -0.0497206723
0.0801589400 0.1399117737 -0.0647991506
0.0376206134 -0.0723625822 -0.1128877386
0.0092644621 -0.0602181794 -0.1147898406
-0.0049149801 -0.1309762980 -0.1308193700
0.0518000556 -0.0016044635 -0.0968582093
-0.0049149801 -0.1309762980 -0.1308193700
0.0021733745 -0.1724275587 -0.1378830836
0.0234411713 -0.1431207008 -0.1289172679
-0.1191697338 0.1954057572 -0.0840329547
-0.0833101537 0.0029078717 -0.1163919780
-0.2401032339 0.1170155710 -0.1176941507
-0.2221734439 0.0207666282 -0.1338736623
-0.1617066938 0.0599617213 -0.1170430643
-0.2311383389 0.0688910996 -0.1257839065
-0.1527417988 0.0118372499 -0.1251328202
-0.3005699840 0.0778204779 -0.1345247487
-0.2916050890 0.0296960065 -0.1426145045
-0.2311383389 0.0688910996 -0.1257839065
-0.1012399437 0.0991568144 -0.1002124663
-0.1796364839 0.1562106641 -0.1008635527
-0.1706715888 0.1080861927 -0.1089533085
-0.1102048388 0.1472812858 -0.0921227105
-0.1617066938 0.0599617213 -0.1170430643
-0.0922750487 0.0510323430 -0.1083022222
-0.1706715888 0.1080861927 -0.1089533085
-0.2042436538 -0.0754823146 -0.1500531740
-0.0653803636 -0.0933410711 -0.1325714897
-0.1437769037 -0.0362872214 -0.1332225760
-0.1348120087 -0.0844116928 -0.1413123318
-0.0743452586 -0.0452165997 -0.1244817338
-0.1258471137 -0.1325361642 -0.1494020877
-0.0564154686 -0.1414655425 -0.1406612455
-0.1348120087 -0.0844116928 -0.1413123318
-0.2221734439 0.0207666282 -0.1338736623
-0.2826401939 -0.0184284649 -0.1507042603
-0.2132085488 -0.0273578432 -0.1419634182
-0.2916050890 0.0296960065 -0.1426145045
-0.1437769037 -0.0362872214 -0.1332225760
-0.1527417988 0.0118372499 -0.1251328202
-0.2132085488 -0.0273578432 -0.1419634182
0.0376233465 0.0812980579 -0.0827307820
0.0017637663 0.2737959434 -0.0503717587
0.0196935564 0.1775470007 -0.0665512703
-0.0587029837 0.2346008503 -0.0672023567
-0.0497380887 0.1864763789 -0.0752921125
0.0107286614 0.2256714720 -0.0584615145
-0.0407731937 0.1383519075 -0.0833818683
0.0286584514 0.1294225293 -0.0746410262
-0.0497380887 0.1864763789 -0.0752921125
0.0801603065 0.2167420938 -0.0497206723
0.0622305164 0.3129910365 -0.0335411607
0.0711954114 0.2648665651 -0.0416309165
0.1014287865 0.2844641117 -0.0332156175
0.0196935564 0.1775470007 -0.0665512703
0.0588918265 0.1490200758 -0.0662257272
0.0107286614 0.2256714720 -0.0584615145
-0.0833101537 0.0029078717 -0.1163919780
-0.0049136135 -0.0541459780 -0.1157408917
-0.0228434036 0.0421029648 -0.0995613800
-0.0138785086 -0.0060215066 -0.1076511358
0.0163548665 0.0135760400 -0.0992358368
-0.0653803636 -0.0933410711 -0.1325714897
-0.0261820935 -0.1218679959 -0.1322459465
-0.0743452586 -0.0452165997 -0.1244817338
-0.1012399437 0.0991568144 -0.1002124663
-0.0228434036 0.0421029648 -0.0995613800
-0.0318082986 0.0902274362 -0.0914716242
-0.0922750487 0.0510323430 -0.1083022222
-0.0407731937 0.1383519075 -0.0833818683
-0.1102048388 0.1472812858 -0.0921227105
-0.0318082986 0.0902274362 -0.0914716242
-0.2042436538 -0.0754823146 -0.1500531740
-0.2348139227 -0.0749017583 -0.1545593510
-0.1258471137 -0.1325361642 -0.1494020877
-0.2348139227 -0.0749017583 -0.1545593510
-0.2629443553 -0.0859737133 -0.1609836473
-0.2138981659 -0.1482732624 -0.1657977976
-0.2979253284 -0.0181381868 -0.1529573488
-0.1717025171 -0.1316653298 -0.1561613531
-0.1998329496 -0.1427372848 -0.1625856494
-0.1401468142 -0.1600471155 -0.1569623542
-0.2629443553 -0.0859737133 -0.1609836473
-0.2727237603 -0.0923128119 -0.1637056926
-0.3008543175 -0.1033854183 -0.1701301356
-0.2566978306 -0.1688545166 -0.1763053086
-0.3168802472 -0.0268437136 -0.1575305196
-0.2566978306 -0.1688545166 -0.1763053086
-0.2205543085 -0.1960527626 -0.1761806735
-0.2285672733 -0.1577819102 -0.1698808656
-0.3008543175 -0.1033854183 -0.1701301356
-0.3309455258 -0.0323800168 -0.1607427411
-0.3673994803 -0.0179166760 -0.1634135705
-0.3523538762 -0.0534193768 -0.1681072678
-0.3222626679 -0.1244247783 -0.1774946622
-0.2707631093 -0.1743908198 -0.1795175301
-0.3630580514 -0.0639390568 -0.1717895311
-0.3222626679 -0.1244247783 -0.1774946622
-0.3528328121 -0.1238435706 -0.1820006925
-0.2814672844 -0.1849104998 -0.1831997934
-0.3528328121 -0.1238435706 -0.1820006925
-0.3811884463 -0.1116982621 -0.1839025386
-0.3273225008 -0.1840386883 -0.1899588388
-0.3811884463 -0.1116982621 -0.1839025386
0.3233445391 -0.2808274237 0.0010497478
0.3196751117 -0.2855924338 0.0253295362
0.3594652547 -0.2562204228 -0.0015468202
0.3331296786 -0.2681207302 -0.0636963545
0.2608882473 -0.3173347321 -0.0585032184
0.2921163932 -0.2990810779 -0.0287267353
0.3019015327 -0.2863743844 -0.0934728377
0.3233445391 -0.2808274237 0.0010497478
0.3643578245 -0.2498670760 -0.0339198714
0.2921163932 -0.2990810779 -0.0287267353
0.3733112207 -0.2380972683 -0.0946806261
0.3331296786 -0.2681207302 -0.0636963545
0.3643578245 -0.2498670760 -0.0339198714
0.3219923038 -0.2713626535 -0.1089649734
0.4246301377 -0.2048318832 -0.0803962787
0.3844485955 -0.2348553451 -0.0494120072
0.4357675125 -0.2015899599 -0.0351276598
0.4357675125 -0.2015899599 -0.0351276598
-0.1691364155 0.1526756018 0.0116974192
-0.0670705440 0.2176423938 0.0527574882
-0.0634011167 0.2224074039 0.0284776998
-0.0123681809 0.2548907999 0.0490077343
-0.1728058428 0.1479105918 0.0359772076
-0.2748717143 0.0829437998 -0.0050828614
-0.0670705440 0.2176423938 0.0527574882
-0.1593512760 0.1653822953 -0.0530486831
-0.1691364155 0.1526756018 0.0116974192
-0.2699791446 0.0892971465 -0.0374559126
-0.2146652103 0.1273397209 -0.0452522978
-0.1919008129 0.1400076614 -0.0167774393
-0.2195577800 0.1209863742 -0.0128792467
-0.2748717143 0.0829437998 -0.0050828614
-0.3252930788 0.0512545721 -0.0296595273
-0.2195577800 0.1209863742 -0.0128792467
-0.0585085469 0.2287607506 -0.0038953514
-0.0634011167 0.2224074039 0.0284776998
-0.1138224812 0.1907181762 0.0039010339
-0.0080871824 0.2604499783 0.0206813145
-0.1138224812 0.1907181762 0.0039010339
-0.1365868786 0.1780502358 -0.0245738246
-0.1089299114 0.1970715230 -0.0284720173
-0.2699791446 0.0892971465 -0.0374559126
-0.3155079393 0.0639612656 -0.0944056296
-0.3252930788 0.0512545721 -0.0296595273
-0.3480574762 0.0385866317 -0.0581343858
-0.2927435419 0.0766292061 -0.0659307711
-0.3708218736 0.0259186912 -0.0866092443
-0.3382723367 0.0512933252 -0.1228804882
-0.3480574762 0.0385866317 -0.0581343858
-0.2601940050 0.1020038400 -0.1022020149
-0.2146652103 0.1273397209 -0.0452522978
-0.2374296076 0.1146717805 -0.0737271564
-0.2097726405 0.1336930677 -0.0776253490
-0.3155079393 0.0639612656 -0.0944056296
-0.3106153696 0.0703146124 -0.1267786808
-0.2927435419 0.0766292061 -0.0659307711
-0.1191697338 0.1954057572 -0.0840329547
0.0017637663 0.2737959434 -0.0503717587
0.0622305164 0.3129910365 -0.0335411607
0.0825157243 0.3221626678 0.0142737089
0.0220489742 0.2829675747 -0.0025568891
-0.0384177758 0.2437724815 -0.0193874871
-0.0587029837 0.2346008503 -0.0672023567
0.0019582032 0.2679558437 0.0129352466
-0.1593512760 0.1653822953 -0.0530486831
-0.2401032339 0.1170155710 -0.1176941507
-0.1796364839 0.1562106641 -0.1008635527
-0.2601940050 0.1020038400 -0.1022020149
-0.0585085469 0.2287607506 -0.0038953514
-0.1089299114 0.1970715230 -0.0284720173
-0.0384177758 0.2437724815 -0.0193874871
0.0825157243 0.3221626678 0.0142737089
0.1922642753 0.0131377331 0.0647008615
0.1775553916 -0.0013489065 0.0596348304
0.0915664758 0.1261435001 0.0716601627
0.2708987493 -0.1215979933 0.0501425137
0.1136298014 0.1478734594 0.0792592093
0.0989209177 0.1333868198 0.0741931782
0.0743125645 0.2152413226 0.0865383833
0.2116212216 0.0207328719 0.0691168728
0.2999341686 -0.1102052850 0.0567665307
0.3440906422 -0.1756743635 0.0505913596
0.2805772224 -0.1178004238 0.0523505193
0.1922642753 0.0131377331 0.0647008615
0.1233082745 0.1516710289 0.0814672150
0.2708987493 -0.1215979933 0.0501425137
-0.1728058428 0.1479105918 0.0359772076
0.2327580825 -0.3284070841 -0.0649275522
0.2327580825 -0.3284070841 -0.0649275522
0.1740577735 -0.3388982285 -0.0758579162
0.1740577735 -0.3388982285 -0.0758579162
0.1151322629 -0.3261721092 -0.0822658301
0.1151322629 -0.3261721092 -0.0822658301
0.0649512934 -0.2921668324 -0.0831760495
0.0649512934 -0.2921668324 -0.0831760495
-0.2223264832 -0.2470303084 -0.1177343792
-0.2223264832 -0.2470303084 -0.1177343792
-0.2810271847 -0.2575217072 -0.1286648525
-0.2810271847 -0.2575217072 -0.1286648525
-0.3399529631 -0.2447951910 -0.1350727289
-0.3399529631 -0.2447951910 -0.1350727289
-0.3901339325 -0.2107899141 -0.1359829483
-0.3901339325 -0.2107899141 -0.1359829483
-0.4239298452 -0.1606820345 -0.1312566754
-0.4239298452 -0.1606820345 -0.1312566754
-0.4361955423 -0.1021000782 -0.1216134477
-0.4361955423 -0.1021000782 -0.1216134477
-0.4250646182 -0.0439630310 -0.1085215819
-0.4250646182 -0.0439630310 -0.1085215819
-0.3922302240 0.0048793313 -0.0939737709
-0.3922302240 0.0048793313 -0.0939737709
-0.1465066835 -0.2122075498 -0.0994415492
-0.1465066835 -0.2122075498 -0.0994415492
-0.0878059820 -0.2017161511 -0.0885110759
-0.0878059820 -0.2017161511 -0.0885110759
-0.0288795618 -0.2144411101 -0.0821027969
-0.0288795618 -0.2144411101 -0.0821027969
0.0213011400 -0.2484459900 -0.0811925401
0.0213011400 -0.2484459900 -0.0811925401
-0.1760171270 0.1418907270 -0.0301133044
-0.2759880388 0.0741056120 -0.0263132331
-0.2668144705 0.0860181371 -0.0870127040
-0.3167999264 0.0521255796 -0.0851126684
-0.2260025829 0.1079981695 -0.0282132687
-0.3167999264 0.0521255796 -0.0851126684
-0.3667853823 0.0182330222 -0.0832126327
-0.3259734947 0.0402130545 -0.0244131974
-0.1851906953 0.1299782018 0.0305861666
-0.0852197835 0.1977633168 0.0267860953
-0.1352052394 0.1638707593 0.0286861310
-0.0898065676 0.1918070542 0.0571358308
-0.2759880388 0.0741056120 -0.0263132331
-0.2805748229 0.0681493494 0.0040365024
-0.2260025829 0.1079981695 -0.0282132687
-0.1760171270 0.1418907270 -0.0301133044
-0.0852197835 0.1977633168 0.0267860953
-0.0306475434 0.2376121368 -0.0054636758
-0.0398211117 0.2256996117 0.0552357951
0.0147511284 0.2655484318 0.0229860240
-0.0760462151 0.2096758419 -0.0339133757
-0.1306184552 0.1698270219 -0.0016636045
-0.0306475434 0.2376121368 -0.0054636758
-0.1668435587 0.1538032521 -0.0908127753
-0.2668144705 0.0860181371 -0.0870127040
-0.2168290146 0.1199106946 -0.0889127397
-0.2622276863 0.0919743997 -0.1173624395
-0.0760462151 0.2096758419 -0.0339133757
-0.0714594310 0.2156321045 -0.0642631111
-0.1214448869 0.1817395470 -0.0623630755
0.1867289599 0.0105636187 -0.0010646406
0.1959025282 0.0224761438 -0.0617641115
0.1053268283 0.1440122878 -0.0193890438
0.1506146783 0.0832442158 -0.0405765776
0.1460278941 0.0772879532 -0.0102268422
0.1686718191 0.0469039172 -0.0208206091
0.1099136125 0.1499685504 -0.0497387792
0.0646257625 0.2107366224 -0.0285512454
0.1506146783 0.0832442158 -0.0405765776
0.2773046599 -0.1109725253 -0.0434397083
0.2818914440 -0.1050162627 -0.0737894438
0.2366035941 -0.0442481908 -0.0526019099
0.3225925098 -0.1717405973 -0.0646272422
0.2366035941 -0.0442481908 -0.0526019099
0.2116662770 -0.0168422861 -0.0268332752
0.2320168099 -0.0502044533 -0.0222521744
0.0961532600 0.1320997626 0.0413104272
0.1053268283 0.1440122878 -0.0193890438
0.0600389783 0.2047803598 0.0017984901
0.0780961192 0.1684400612 0.0215544587
0.0646257625 0.2107366224 -0.0285512454
0.1460278941 0.0772879532 -0.0102268422
0.1210905771 0.1046938579 0.0155417925
0.1414411100 0.0713316906 0.0201228933
0.0600389783 0.2047803598 0.0017984901
0.0147511284 0.2655484318 0.0229860240
0.0328082692 0.2292081332 0.0427419925
0.0419818375 0.2411206583 -0.0179574784
0.0508654100 0.1928678346 0.0624979611
0.0780961192 0.1684400612 0.0215544587
0.0328082692 0.2292081332 0.0427419925
0.1867289599 0.0105636187 -0.0010646406
0.1775553916 -0.0013489065 0.0596348304
0.2681310916 -0.1228850505 0.0172597626
0.2228432416 -0.0621169785 0.0384472965
0.2274300257 -0.0561607159 0.0080975610
0.2047861008 -0.0257766799 0.0186913280
0.2635443074 -0.1288413131 0.0476094981
0.3088321574 -0.1896093850 0.0264219642
0.2228432416 -0.0621169785 0.0384472965
0.0961532600 0.1320997626 0.0413104272
0.0915664758 0.1261435001 0.0716601627
0.1368543258 0.0653754281 0.0504726288
0.0508654100 0.1928678346 0.0624979611
0.1414411100 0.0713316906 0.0201228933
0.1368543258 0.0653754281 0.0504726288
0.1594982508 0.0349913921 0.0398788619
0.2773046599 -0.1109725253 -0.0434397083
0.2681310916 -0.1228850505 0.0172597626
0.3134189415 -0.1836531225 -0.0039277712
0.2953618007 -0.1473128239 -0.0236837398
0.3088321574 -0.1896093850 0.0264219642
0.2274300257 -0.0561607159 0.0080975610
0.2523673428 -0.0835666206 -0.0176710736
0.2320168099 -0.0502044533 -0.0222521744
0.3134189415 -0.1836531225 -0.0039277712
0.3587067915 -0.2444211945 -0.0251153051
0.3406496507 -0.2080808959 -0.0448712737
0.3314760824 -0.2199934210 0.0158281973
0.3225925098 -0.1717405973 -0.0646272422
0.2953618007 -0.1473128239 -0.0236837398
0.3406496507 -0.2080808959 -0.0448712737
-0.3870665028 -0.0016986504 -0.0901894117
-0.3870665028 -0.0016986504 -0.0901894117
-0.4181726724 -0.0479702441 -0.1039715103
-0.4181726724 -0.0479702441 -0.1039715103
-0.4287186348 -0.1030482160 -0.1163746140
-0.4287186348 -0.1030482160 -0.1163746140
-0.4170986106 -0.1585470126 -0.1255103399
-0.4170986106 -0.1585470126 -0.1255103399
-0.3850813315 -0.2060177817 -0.1299878753
-0.3850813315 -0.2060177817 -0.1299878753
-0.3375411586 -0.2382334984 -0.1291255534
-0.3375411586 -0.2382334984 -0.1291255534
-0.2817164003 -0.2502886285 -0.1230545747
-0.2817164003 -0.2502886285 -0.1230545747
-0.2261055165 -0.2403492173 -0.1126993984
-0.2261055165 -0.2403492173 -0.1126993984
0.3071677025 -0.2778292971 -0.0394609362
0.3163412708 -0.2659167719 -0.1001604071
0.3587067915 -0.2444211945 -0.0251153051
0.3071677025 -0.2778292971 -0.0394609362
0.2979941342 -0.2897418222 0.0212385348
0.2556286136 -0.3112373997 -0.0538065672
0.0700038944 -0.2873947000 -0.0771809766
0.0700038944 -0.2873947000 -0.0771809766
0.1175440674 -0.3196104167 -0.0763186546
0.1175440674 -0.3196104167 -0.0763186546
0.1733688257 -0.3316655468 -0.0702476759
0.1733688257 -0.3316655468 -0.0702476759
0.2289793169 -0.3217263900 -0.0598926088
0.2289793169 -0.3217263900 -0.0598926088
0.0263537410 -0.2436738576 -0.0751974672
0.0263537410 -0.2436738576 -0.0751974672
-0.0264677573 -0.2078794176 -0.0761556214
-0.0264677573 -0.2078794176 -0.0761556214
-0.0884949298 -0.1944834693 -0.0829008356
-0.0884949298 -0.1944834693 -0.0829008356
-0.1502854490 -0.2055268557 -0.0944066059
-0.1502854490 -0.2055268557 -0.0944066059
0.2886816395 0.0958820568 -0.0161564290
0.2919842791 0.0807798354 0.0071483335
0.2106434125 0.2013807610 0.0185236479
0.3716738259 -0.0322699796 -0.0158793621
0.2056894530 0.2240340932 -0.0164334958
0.2089920927 0.2089318718 0.0068712666
0.1641933597 0.2881101114 -0.0165720293
0.2993231606 0.0903098158 -0.0414112470
0.3876361076 -0.0406283411 -0.0537615892
0.4317925811 -0.1060974196 -0.0599367603
0.3769945865 -0.0350561001 -0.0285067711
0.2886816395 0.0958820568 -0.0161564290
0.2110102135 0.2212479727 -0.0290609049
0.3716738259 -0.0322699796 -0.0158793621
0.2214063343 0.0334396051 0.0043707742
0.1412886101 0.1556288675 0.0076528258
0.1388423253 0.1524521941 0.0238393514
0.0987834632 0.2135468253 0.0254803772
0.2238526192 0.0366162785 -0.0118157514
0.3039703434 -0.0855729838 -0.0150978029
0.1412886101 0.1556288675 0.0076528258
0.2214063343 0.0334396051 0.0043707742
0.3015240585 -0.0887496572 0.0010887226
0.3039703434 -0.0855729838 -0.0150978029
0.3440292055 -0.1466676150 -0.0167388287
0.2189600495 0.0302629317 0.0205572998
0.1388423253 0.1524521941 0.0238393514
0.3015240585 -0.0887496572 0.0010887226
0.2222627159 0.0151606706 0.0438620585
0.2189600495 0.0302629317 0.0205572998
0.3003009161 -0.0903379939 0.0091819854
0.1392705160 0.1433127268 0.0435849935
0.3052549158 -0.1129913857 0.0441391235
0.3019522493 -0.0978891245 0.0208343648
0.3467510157 -0.1770674138 0.0442776560
0.2116212216 0.0207328719 0.0691168728
0.1233082745 0.1516710289 0.0814672150
0.0791518010 0.2171401073 0.0876423861
0.1339497689 0.1460988275 0.0562124007
0.2222627159 0.0151606706 0.0438620585
0.2999341686 -0.1102052850 0.0567665307
0.1392705160 0.1433127268 0.0435849935
0.2579184492 0.0586980569 -0.0023337089
0.2238526192 0.0366162785 -0.0118157514
0.1595446676 0.1682580934 0.0043005842
0.1916986434 0.1024371859 -0.0037575836
0.1425117526 0.1572172042 -0.0004404370
0.3222264008 -0.0729437579 -0.0184500445
0.3051934859 -0.0839846472 -0.0231910657
0.2900724250 -0.0071228505 -0.0103918767
0.1936104975 0.1903398718 0.0137826266
0.1595446676 0.1682580934 0.0043005842
0.1273906917 0.2340790008 0.0123587520
0.2087315584 0.1134780751 0.0009834376
0.1273906917 0.2340790008 0.0123587520
0.1283466188 0.2780303437 0.0211288571
0.1614565217 0.2561607792 0.0218407944
0.2579184492 0.0586980569 -0.0023337089
0.2919842791 0.0807798354 0.0071483335
0.3562922308 -0.0508619795 -0.0089680021
0.3241382550 0.0149589279 -0.0009098343
0.3733251458 -0.0398210903 -0.0042269809
0.1936104975 0.1903398718 0.0137826266
0.2106434125 0.2013807610 0.0185236479
0.2427973883 0.1355598536 0.0104654801
0.3562922308 -0.0508619795 -0.0089680021
0.3714132917 -0.1277237762 -0.0217671911
0.4054791216 -0.1056419977 -0.0122851487
0.4130396520 -0.1440728961 -0.0186847432
0.3222264008 -0.0729437579 -0.0184500445
0.2900724250 -0.0071228505 -0.0103918767
0.3714132917 -0.1277237762 -0.0217671911
0.0411219152 0.2569455973 -0.1250384973
0.0411219152 0.2569455973 -0.1250384973
0.0181994849 0.2618958478 -0.1275312785
0.0181994849 0.2618958478 -0.1275312785
0.0225297186 0.2845115209 -0.1224384257
0.0225297186 0.2845115209 -0.1224384257
0.0454521489 0.2795612705 -0.1199456445
0.0454521489 0.2795612705 -0.1199456445
-0.3095950400 -0.1357336432 -0.2551076256
-0.3095950400 -0.1357336432 -0.2551076256
-0.3325174971 -0.1307833531 -0.2576004030
-0.3325174971 -0.1307833531 -0.2576004030
-0.3281872901 -0.1081676402 -0.2525075465
-0.3281872901 -0.1081676402 -0.2525075465
-0.3052648331 -0.1131179304 -0.2500147691
-0.3052648331 -0.1131179304 -0.2500147691
0.3664853818 -0.2254581053 -0.1705397548
0.3664853818 -0.2254581053 -0.1705397548
0.3435629247 -0.2205078152 -0.1730325322
0.3435629247 -0.2205078152 -0.1730325322
0.3478931317 -0.1978921023 -0.1679396757
0.3478931317 -0.1978921023 -0.1679396757
0.3708155887 -0.2028423924 -0.1654468983
0.3708155887 -0.2028423924 -0.1654468983
3 310 494 311
3 107 494 310
3 111 495 311
3 107 495 111
3 270 367 265
3 270 228 367
3 228 496 367
3 309 496 228
3 309 497 367
3 102 497 309
3 500 501 499
3 367 501 500
3 500 502 368
3 499 502 500
3 503 504 499
3 498 504 503
3 503 505 367
3 499 505 503
3 506 508 498
3 507 508 506
3 507 509 102
3 506 509 507
3 510 511 498
3 506 511 510
3 510 512 367
3 498 512 510
3 517 518 516
3 515 518 517
3 517 519 514
3 516 519 517
3 520 521 516
3 513 521 520
3 520 522 515
3 516 522 520
3 524 525 523
3 515 525 524
3 524 526 102
3 523 526 524
3 527 528 523
3 514 528 527
3 527 529 515
3 523 529 527
3 532 533 531
3 530 533 532
3 532 534 514
3 531 534 532
3 535 536 531
3 368 536 535
3 535 537 530
3 531 537 535
3 539 540 538
3 530 540 539
3 539 541 513
3 538 541 539
3 542 543 538
3 514 543 542
3 542 544 530
3 538 544 542
3 548 549 547
3 546 549 548
3 548 550 545
3 547 550 548
3 551 552 547
3 513 552 551
3 551 553 546
3 547 553 551
3 555 556 554
3 546 556 555
3 555 557 311
3 554 557 555
3 558 559 554
3 545 559 558
3 558 560 546
3 554 560 558
3 563 564 562
3 561 564 563
3 563 565 545
3 562 565 563
3 566 567 562
3 102 567 566
3 566 568 561
3 562 568 566
3 570 571 569
3 561 571 570
3 570 572 513
3 569 572 570
3 573 574 569
3 545 574 573
3 573 575 561
3 569 575 573
3 337 578 102
3 577 578 337
3 577 579 576
3 337 579 577
3 580 581 576
3 311 581 580
3 576 582 580
3 337 582 576
3 583 585 337
3 584 585 583
3 584 586 311
3 583 586 584
3 587 588 337
3 583 588 587
3 337 589 587
3 43 589 337
3 594 595 593
3 592 595 594
3 594 596 591
3 593 596 594
3 597 598 593
3 590 598 597
3 597 599 592
3 593 599 597
3 601 602 600
3 592 602 601
3 601 603 310
3 600 603 601
3 604 605 600
3 591 605 604
3 604 606 592
3 600 606 604
3 609 610 608
3 607 610 609
3 609 611 591
3 608 611 609
3 612 613 608
3 43 613 612
3 612 614 607
3 608 614 612
3 616 617 615
3 607 617 616
3 616 618 590
3 615 618 616
3 619 620 615
3 591 620 619
3 619 621 607
3 615 621 619
3 625 626 624
3 623 626 625
3 625 627 622
3 624 627 625
3 628 629 624
3 590 629 628
3 628 630 623
3 624 630 628
3 632 633 631
3 623 633 632
3 632 634 311
3 631 634 632
3 635 636 631
3 622 636 635
3 635 637 623
3 631 637 635
3 640 641 639
3 638 641 640
3 640 642 622
3 639 642 640
3 643 644 639
3 310 644 643
3 643 645 638
3 639 645 643
3 647 648 646
3 638 648 647
3 647 649 590
3 646 649 647
3 650 651 646
3 622 651 650
3 650 652 638
3 646 652 650
3 440 655 43
3 654 655 440
3 654 656 653
3 440 656 654
3 657 658 653
3 310 658 657
3 653 659 657
3 440 659 653
3 441 660 440
3 310 660 441
3 662 663 661
3 78 663 662
3 662 664 441
3 661 664 662
3 78 666 665
3 310 666 78
3 665 667 661
3 310 667 665
3 668 670 429
3 669 670 668
3 669 671 441
3 668 671 669
3 672 673 429
3 668 673 672
3 78 674 429
3 672 674 78
3 675 676 136
3 441 676 675
3 136 677 675
3 429 677 136
3 678 679 369
3 441 679 678
3 369 680 678
3 136 680 369
3 89 681 441
3 369 681 89
3 441 347 89
3 441 346 347
3 212 367 368
3 212 211 367
3 311 682 368
3 111 682 311
3 212 683 111
3 368 683 212
3 211 290 235
3 211 44 290
3 44 684 336
3 211 684 44
3 336 685 133
3 211 685 336
3 688 689 686
3 211 689 688
3 688 690 687
3 686 690 688
3 691 692 687
3 133 692 691
3 687 693 691
3 686 693 687
3 695 696 694
3 211 696 695
3 695 697 686
3 694 697 695
3 698 699 694
3 212 699 698
3 698 700 211
3 694 700 698
3 705 706 704
3 703 706 705
3 705 707 702
3 704 707 705
3 708 709 704
3 701 709 708
3 708 710 703
3 704 710 708
3 712 713 711
3 703 713 712
3 712 714 133
3 711 714 712
3 715 716 711
3 702 716 715
3 715 717 703
3 711 717 715
3 720 721 719
3 718 721 720
3 720 722 702
3 719 722 720
3 723 724 719
3 111 724 723
3 723 725 718
3 719 725 723
3 727 728 726
3 718 728 727
3 727 729 701
3 726 729 727
3 730 731 726
3 702 731 730
3 730 732 718
3 726 732 730
3 736 737 735
3 734 737 736
3 736 738 733
3 735 738 736
3 739 740 735
3 701 740 739
3 739 741 734
3 735 741 739
3 743 744 742
3 734 744 743
3 743 745 212
3 742 745 743
3 746 747 742
3 733 747 746
3 746 748 734
3 742 748 746
3 751 752 750
3 749 752 751
3 751 753 733
3 750 753 751
3 754 755 750
3 133 755 754
3 754 756 749
3 750 756 754
3 758 759 757
3 749 759 758
3 758 760 701
3 757 760 758
3 761 762 757
3 733 762 761
3 761 763 749
3 757 763 761
3 764 766 355
3 765 766 764
3 765 767 111
3 764 767 765
3 768 769 355
3 764 769 768
3 355 770 768
3 133 770 355
3 355 773 362
3 772 773 355
3 772 774 771
3 355 774 772
3 775 776 771
3 111 776 775
3 771 777 775
3 355 777 771
3 782 783 781
3 780 783 782
3 782 784 779
3 781 784 782
3 785 786 781
3 778 786 785
3 785 787 780
3 781 787 785
3 789 790 788
3 780 790 789
3 789 791 107
3 788 791 789
3 792 793 788
3 779 793 792
3 792 794 780
3 788 794 792
3 797 798 796
3 795 798 797
3 797 799 779
3 796 799 797
3 800 801 796
3 111 801 800
3 800 802 795
3 796 802 800
3 804 805 803
3 795 805 804
3 804 806 778
3 803 806 804
3 807 808 803
3 779 808 807
3 807 809 795
3 803 809 807
3 813 814 812
3 811 814 813
3 813 815 810
3 812 815 813
3 816 817 812
3 778 817 816
3 816 818 811
3 812 818 816
3 820 821 819
3 811 821 820
3 820 822 362
3 819 822 820
3 823 824 819
3 810 824 823
3 823 825 811
3 819 825 823
3 828 829 827
3 826 829 828
3 828 830 810
3 827 830 828
3 831 832 827
3 107 832 831
3 831 833 826
3 827 833 831
3 835 836 834
3 826 836 835
3 835 837 778
3 834 837 835
3 838 839 834
3 810 839 838
3 838 840 826
3 834 840 838
3 841 843 263
3 842 843 841
3 842 844 107
3 841 844 842
3 845 846 263
3 841 846 845
3 263 847 845
3 362 847 263
3 264 848 107
3 263 848 264
3 850 851 107
3 849 851 850
3 354 852 107
3 850 852 354
3 853 854 849
3 264 854 853
3 853 855 354
3 849 855 853
3 354 858 857
3 189 858 354
3 857 859 856
3 189 859 857
3 860 861 856
3 264 861 860
3 856 862 860
3 189 862 856
3 485 864 189
3 863 864 485
3 863 865 264
3 485 865 863
3 221 867 485
3 866 867 221
3 866 868 264
3 221 868 866
3 242 869 221
3 264 869 242
3 242 476 264
3 476 283 264
3 441 440 264
3 440 263 264
3 44 336 228
3 336 309 228
3 290 44 270
3 44 228 270
3 290 270 235
3 270 265 235
3 265 367 235
3 367 211 235
3 78 354 310
3 354 107 310
3 429 189 78
3 189 354 78
3 136 485 429
3 485 189 429
3 369 221 136
3 221 485 136
3 89 242 369
3 242 221 369
3 347 476 89
3 476 242 89
3 476 347 283
3 347 346 283
3 283 346 264
3 346 441 264
3 133 309 336
3 133 102 309
3 355 102 133
3 355 337 102
3 362 337 355
3 362 43 337
3 43 263 440
3 43 362 263
3 483 209 338
3 483 202 209
3 202 870 209
3 74 870 202
3 872 873 209
3 205 873 872
3 209 874 872
3 871 874 209
3 875 876 871
3 74 876 875
3 871 877 875
3 209 877 871
3 878 879 74
3 205 879 878
3 74 880 878
3 363 880 74
3 885 886 884
3 883 886 885
3 885 887 882
3 884 887 885
3 888 889 884
3 881 889 888
3 888 890 883
3 884 890 888
3 892 893 891
3 883 893 892
3 892 894 363
3 891 894 892
3 895 896 891
3 882 896 895
3 895 897 883
3 891 897 895
3 900 901 899
3 898 901 900
3 900 902 882
3 899 902 900
3 903 904 899
3 205 904 903
3 903 905 898
3 899 905 903
3 907 908 906
3 898 908 907
3 907 909 881
3 906 909 907
3 910 911 906
3 882 911 910
3 910 912 898
3 906 912 910
3 916 917 915
3 914 917 916
3 916 918 913
3 915 918 916
3 919 920 915
3 881 920 919
3 919 921 914
3 915 921 919
3 923 924 922
3 914 924 923
3 923 925 411
3 922 925 923
3 926 927 922
3 913 927 926
3 926 928 914
3 922 928 926
3 931 932 930
3 929 932 931
3 931 933 913
3 930 933 931
3 934 935 930
3 363 935 934
3 934 936 929
3 930 936 934
3 938 939 937
3 929 939 938
3 938 940 881
3 937 940 938
3 941 942 937
3 913 942 941
3 941 943 929
3 937 943 941
3 63 946 363
3 945 946 63
3 945 947 944
3 63 947 945
3 948 949 944
3 411 949 948
3 944 950 948
3 63 950 944
3 951 953 63
3 952 953 951
3 952 954 411
3 951 954 952
3 955 956 63
3 951 956 955
3 63 957 955
3 365 957 63
3 962 963 961
3 960 963 962
3 962 964 959
3 961 964 962
3 965 966 961
3 958 966 965
3 965 967 960
3 961 967 965
3 969 970 968
3 960 970 969
3 969 971 415
3 968 971 969
3 972 973 968
3 959 973 972
3 972 974 960
3 968 974 972
3 977 978 976
3 975 978 977
3 977 979 959
3 976 979 977
3 980 981 976
3 365 981 980
3 980 982 975
3 976 982 980
3 984 985 983
3 975 985 984
3 984 986 958
3 983 986 984
3 987 988 983
3 959 988 987
3 987 989 975
3 983 989 987
3 993 994 992
3 991 994 993
3 993 995 990
3 992 995 993
3 996 997 992
3 958 997 996
3 996 998 991
3 992 998 996
3 1000 1001 999
3 991 1001 1000
3 1000 1002 411
3 999 1002 1000
3 1003 1004 999
3 990 1004 1003
3 1003 1005 991
3 999 1005 1003
3 1008 1009 1007
3 1006 1009 1008
3 1008 1010 990
3 1007 1010 1008
3 1011 1012 1007
3 415 1012 1011
3 1011 1013 1006
3 1007 1013 1011
3 1015 1016 1014
3 1006 1016 1015
3 1015 1017 958
3 1014 1017 1015
3 1018 1019 1014
3 990 1019 1018
3 1018 1020 1006
3 1014 1020 1018
3 14 1023 365
3 1022 1023 14
3 1022 1024 1021
3 14 1024 1022
3 1025 1026 1021
3 415 1026 1025
3 1021 1027 1025
3 14 1027 1021
3 16 1028 14
3 415 1028 16
3 16 1031 1030
3 474 1031 16
3 1030 1032 1029
3 474 1032 1030
3 1033 1034 1029
3 415 1034 1033
3 1033 1035 474
3 1029 1035 1033
3 320 1037 474
3 1036 1037 320
3 1036 1038 415
3 320 1038 1036
3 312 1040 320
3 1039 1040 312
3 1039 1041 415
3 312 1041 1039
3 384 1043 312
3 1042 1043 384
3 1042 1044 415
3 384 1044 1042
3 163 1045 384
3 415 1045 163
3 163 200 415
3 200 257 415
3 256 323 135
3 256 2 323
3 323 1046 73
3 2 1046 323
3 73 1047 13
3 2 1047 73
3 1050 1051 1048
3 2 1051 1050
3 1050 1052 1049
3 1048 1052 1050
3 1053 1054 1049
3 13 1054 1053
3 1053 1055 1048
3 1049 1055 1053
3 1057 1058 1056
3 1048 1058 1057
3 1057 1059 0
3 1056 1059 1057
3 1060 1061 2
3 1048 1061 1060
3 1060 1062 1056
3 2 1062 1060
3 1067 1068 1066
3 1065 1068 1067
3 1067 1069 1064
3 1066 1069 1067
3 1070 1071 1066
3 1063 1071 1070
3 1070 1072 1065
3 1066 1072 1070
3 1074 1075 1073
3 1065 1075 1074
3 1074 1076 13
3 1073 1076 1074
3 1077 1078 1073
3 1064 1078 1077
3 1077 1079 1065
3 1073 1079 1077
3 1082 1083 1081
3 1080 1083 1082
3 1082 1084 1064
3 1081 1084 1082
3 1085 1086 1081
3 109 1086 1085
3 1085 1087 1080
3 1081 1087 1085
3 1089 1090 1088
3 1080 1090 1089
3 1089 1091 1063
3 1088 1091 1089
3 1092 1093 1088
3 1064 1093 1092
3 1092 1094 1080
3 1088 1094 1092
3 1098 1099 1097
3 1096 1099 1098
3 1098 1100 1095
3 1097 1100 1098
3 1101 1102 1097
3 1063 1102 1101
3 1101 1103 1096
3 1097 1103 1101
3 1105 1106 1104
3 1096 1106 1105
3 1105 1107 0
3 1104 1107 1105
3 1108 1109 1104
3 1095 1109 1108
3 1108 1110 1096
3 1104 1110 1108
3 1113 1114 1112
3 1111 1114 1113
3 1113 1115 1095
3 1112 1115 1113
3 1116 1117 1112
3 13 1117 1116
3 1116 1118 1111
3 1112 1118 1116
3 1120 1121 1119
3 1111 1121 1120
3 1120 1122 1063
3 1119 1122 1120
3 1123 1124 1119
3 1095 1124 1123
3 1123 1125 1111
3 1119 1125 1123
3 1128 1129 1126
3 220 1129 1128
3 1127 1130 1126
3 1128 1130 1127
3 1131 1132 1127
3 109 1132 1131
3 1127 1133 1131
3 1126 1133 1127
3 1135 1136 1134
3 220 1136 1135
3 1135 1137 1126
3 1134 1137 1135
3 220 1139 1138
3 13 1139 220
3 1138 1140 1134
3 13 1140 1138
3 1145 1146 1144
3 1143 1146 1145
3 1145 1147 1142
3 1144 1147 1145
3 1148 1149 1144
3 108 1149 1148
3 1148 1150 1143
3 1144 1150 1148
3 1152 1153 1151
3 1143 1153 1152
3 1152 1154 1141
3 1151 1154 1152
3 1155 1156 1151
3 1142 1156 1155
3 1155 1157 1143
3 1151 1157 1155
3 1160 1161 1159
3 1158 1161 1160
3 1160 1162 1142
3 1159 1162 1160
3 1163 1164 1159
3 220 1164 1163
3 1163 1165 1158
3 1159 1165 1163
3 1167 1168 1166
3 1158 1168 1167
3 1167 1169 108
3 1166 1169 1167
3 1170 1171 1166
3 1142 1171 1170
3 1170 1172 1158
3 1166 1172 1170
3 1176 1177 1175
3 1141 1177 1176
3 1176 1178 1174
3 1175 1178 1176
3 1179 1180 1175
3 1173 1180 1179
3 1179 1181 1141
3 1175 1181 1179
3 1174 1184 1183
3 1182 1184 1174
3 1183 1185 109
3 1182 1185 1183
3 1186 1187 1182
3 1173 1187 1186
3 1182 1188 1186
3 1174 1188 1182
3 1189 1192 1191
3 1190 1192 1189
3 1191 1193 1173
3 1190 1193 1191
3 1194 1195 1190
3 220 1195 1194
3 1190 1196 1194
3 1189 1196 1190
3 1198 1199 1197
3 1173 1199 1198
3 1198 1200 1189
3 1197 1200 1198
3 1201 1202 1197
3 1141 1202 1201
3 1201 1203 1173
3 1197 1203 1201
3 1204 1205 272
3 108 1205 1204
3 272 1206 1204
3 220 1206 272
3 1207 1209 325
3 1208 1209 1207
3 1208 1210 108
3 1207 1210 1208
3 1211 1212 325
3 1207 1212 1211
3 325 1213 1211
3 272 1213 325
3 328 1214 108
3 325 1214 328
3 1216 1217 1215
3 77 1217 1216
3 1216 1218 108
3 1215 1218 1216
3 77 1220 1219
3 328 1220 77
3 1219 1221 1215
3 328 1221 1219
3 108 1224 1223
3 493 1224 108
3 1223 1225 1222
3 493 1225 1223
3 1226 1227 1222
3 77 1227 1226
3 1222 1228 1226
3 493 1228 1222
3 1229 1230 459
3 493 1230 1229
3 459 1231 1229
3 77 1231 459
3 1232 1233 465
3 493 1233 1232
3 465 1234 1232
3 459 1234 465
3 383 1235 493
3 465 1235 383
3 493 443 383
3 443 335 383
3 1236 1237 4
3 1 1237 1236
3 4 1238 1236
3 5 1238 4
3 1240 1241 1239
3 1 1241 1240
3 1240 1242 2
3 1239 1242 1240
3 1243 1244 1239
3 5 1244 1243
3 1243 1245 1
3 1239 1245 1243
3 1246 1248 5
3 1247 1248 1246
3 1247 1249 2
3 1246 1249 1247
3 1250 1251 5
3 1246 1251 1250
3 1250 1252 0
3 5 1252 1250
3 3 1253 5
3 0 1253 3
3 1255 1256 112
3 1254 1256 1255
3 111 1257 112
3 1255 1257 111
3 1258 1259 1254
3 107 1259 1258
3 1258 1260 111
3 1254 1260 1258
3 1261 1265 1264
3 1262 1265 1261
3 1264 1266 1263
3 1262 1266 1264
3 1267 1268 1263
3 107 1268 1267
3 1267 1269 1262
3 1263 1269 1267
3 1271 1272 1270
3 1262 1272 1271
3 1271 1273 112
3 1270 1273 1271
3 1262 1275 1274
3 1261 1275 1262
3 1274 1276 1270
3 1261 1276 1274
3 1279 1280 1278
3 107 1280 1279
3 1279 1281 1277
3 1278 1281 1279
3 1282 1283 1278
3 108 1283 1282
3 1282 1284 107
3 1278 1284 1282
3 1277 1287 1286
3 1285 1287 1277
3 1286 1288 1261
3 1285 1288 1286
3 1289 1290 1285
3 108 1290 1289
3 1285 1291 1289
3 1277 1291 1285
3 1294 1295 112
3 109 1295 1294
3 1294 1296 1293
3 112 1296 1294
3 1297 1298 1293
3 1292 1298 1297
3 1293 1299 1297
3 112 1299 1293
3 1300 1302 1292
3 1301 1302 1300
3 1301 1303 108
3 1300 1303 1301
3 1292 1305 1300
3 1304 1305 1292
3 1304 1306 112
3 1292 1306 1304
3 110 1307 109
3 112 1307 110
3 1 206 4
3 1 210 206
3 1 339 210
3 1 255 339
3 255 484 339
3 255 134 484
3 134 203 484
3 134 322 203
3 322 75 203
3 322 72 75
3 72 12 75
3 12 364 75
3 12 219 364
3 219 64 364
3 219 271 64
3 271 366 64
3 271 324 366
3 324 15 366
3 324 17 15
3 324 327 17
3 327 475 17
3 327 76 475
3 76 321 475
3 76 458 321
3 458 313 321
3 458 464 313
3 464 385 313
3 464 382 385
3 1308 1310 412
3 1309 1310 1308
3 1309 1311 206
3 1308 1311 1309
3 1312 1313 412
3 1308 1313 1312
3 412 1314 1312
3 111 1314 412
3 206 1317 4
3 1316 1317 206
3 1316 1318 1315
3 206 1318 1316
3 1319 1320 1315
3 111 1320 1319
3 1315 1321 1319
3 206 1321 1315
3 412 1322 111
3 107 1322 412
3 412 416 107
3 416 258 107
3 258 492 107
3 258 201 492
3 201 442 492
3 201 164 442
3 164 334 442
3 164 385 334
3 385 382 334
3 325 328 324
3 328 327 324
3 256 1323 2
3 255 1323 256
3 1 1324 255
3 2 1324 1
3 255 1325 134
3 256 1325 255
3 135 1326 256
3 134 1326 135
3 322 1327 323
3 134 1327 322
3 135 1328 134
3 323 1328 135
3 323 1329 322
3 73 1329 323
3 72 1330 73
3 322 1330 72
3 77 1331 328
3 76 1331 77
3 327 1332 76
3 328 1332 327
3 458 1333 459
3 76 1333 458
3 77 1334 76
3 459 1334 77
3 464 1335 465
3 458 1335 464
3 459 1336 458
3 465 1336 459
3 382 1337 383
3 464 1337 382
3 465 1338 464
3 383 1338 465
3 334 1339 335
3 382 1339 334
3 383 1340 382
3 335 1340 383
3 442 1341 443
3 334 1341 442
3 335 1342 334
3 443 1342 335
3 492 1343 493
3 442 1343 492
3 443 1344 442
3 493 1344 443
3 493 1345 492
3 108 1345 493
3 107 1346 108
3 492 1346 107
3 324 1347 325
3 271 1347 324
3 272 1348 271
3 325 1348 272
3 271 1349 272
3 219 1349 271
3 220 1350 219
3 272 1350 220
3 219 1351 220
3 12 1351 219
3 13 1352 12
3 220 1352 13
3 73 1353 72
3 13 1353 73
3 12 1354 13
3 72 1354 12
3 1357 1358 1356
3 415 1358 1357
3 1357 1359 1355
3 1356 1359 1357
3 1360 1361 416
3 415 1361 1360
3 1360 1362 1356
3 416 1362 1360
3 1355 1365 1364
3 1363 1365 1355
3 1364 1366 412
3 1363 1366 1364
3 1367 1368 1363
3 416 1368 1367
3 1363 1369 1367
3 1355 1369 1363
3 1372 1373 412
3 1371 1373 1372
3 1372 1374 411
3 412 1374 1372
3 1375 1376 1371
3 1370 1376 1375
3 1375 1377 411
3 1371 1377 1375
3 1370 1380 1379
3 1378 1380 1370
3 1379 1381 415
3 1378 1381 1379
3 1382 1383 1378
3 411 1383 1382
3 1370 1384 1378
3 1382 1384 1370
3 1388 1389 1385
3 1387 1389 1388
3 1386 1390 1385
3 1388 1390 1386
3 1391 1392 1387
3 411 1392 1391
3 1391 1393 1386
3 1387 1393 1391
3 1395 1396 1394
3 1386 1396 1395
3 1395 1397 205
3 1394 1397 1395
3 1386 1399 1398
3 1385 1399 1386
3 1398 1400 1394
3 1385 1400 1398
3 1402 1404 1401
3 1403 1404 1402
3 1403 1405 411
3 1402 1405 1403
3 1402 1407 1406
3 1401 1407 1402
3 1406 1408 1385
3 1401 1408 1406
3 1410 1411 1409
3 412 1411 1410
3 1410 1412 411
3 1409 1412 1410
3 1413 1414 1409
3 1401 1414 1413
3 1413 1415 412
3 1409 1415 1413
3 1419 1420 1416
3 1418 1420 1419
3 1417 1421 1416
3 1419 1421 1417
3 1422 1423 1418
3 206 1423 1422
3 1422 1424 1417
3 1418 1424 1422
3 1426 1427 1425
3 1417 1427 1426
3 1426 1428 412
3 1425 1428 1426
3 1429 1430 1417
3 1425 1430 1429
3 1416 1431 1417
3 1429 1431 1416
3 1433 1435 1432
3 1434 1435 1433
3 1434 1436 206
3 1433 1436 1434
3 1433 1438 1437
3 1432 1438 1433
3 1437 1439 1416
3 1432 1439 1437
3 1441 1442 1440
3 205 1442 1441
3 1441 1443 206
3 1440 1443 1441
3 1444 1445 1440
3 1432 1445 1444
3 1444 1446 205
3 1440 1446 1444
3 17 14 15
3 17 16 14
3 415 1447 416
3 257 1447 415
3 258 1448 257
3 416 1448 258
3 257 1449 258
3 200 1449 257
3 201 1450 200
3 258 1450 201
3 200 1451 201
3 163 1451 200
3 164 1452 163
3 201 1452 164
3 163 1453 164
3 384 1453 163
3 385 1454 384
3 164 1454 385
3 384 1455 385
3 312 1455 384
3 313 1456 312
3 385 1456 313
3 321 1457 320
3 313 1457 321
3 312 1458 313
3 320 1458 312
3 475 1459 474
3 321 1459 475
3 320 1460 321
3 474 1460 320
3 474 1461 475
3 16 1461 474
3 17 1462 16
3 475 1462 17
3 1463 1464 205
3 209 1464 1463
3 1463 1465 206
3 205 1465 1463
3 1466 1467 210
3 206 1467 1466
3 1466 1468 209
3 210 1468 1466
3 202 1469 74
3 203 1469 202
3 75 1470 203
3 74 1470 75
3 483 1471 202
3 484 1471 483
3 203 1472 484
3 202 1472 203
3 338 1473 483
3 339 1473 338
3 484 1474 339
3 483 1474 484
3 339 1475 210
3 338 1475 339
3 209 1476 338
3 210 1476 209
3 364 1477 75
3 363 1477 364
3 74 1478 363
3 75 1478 74
3 64 1479 364
3 63 1479 64
3 363 1480 63
3 364 1480 363
3 366 1481 64
3 365 1481 366
3 63 1482 365
3 64 1482 63
3 15 1483 366
3 14 1483 15
3 365 1484 14
3 366 1484 365
3 1485 1487 24
3 1486 1487 1485
3 1486 1488 65
3 1485 1488 1486
3 1489 1490 24
3 1485 1490 1489
3 24 1491 1489
3 109 1491 24
3 65 1494 0
3 1493 1494 65
3 1493 1495 1492
3 65 1495 1493
3 1496 1497 1492
3 109 1497 1496
3 1492 1498 1496
3 65 1498 1492
3 0 3 65
3 24 110 109
3 24 25 110
3 3 66 65
3 25 112 110
3 25 28 112
3 24 28 25
3 24 26 28
3 1500 1501 28
3 1499 1501 1500
3 26 1502 28
3 1500 1502 26
3 1503 1504 1499
3 67 1504 1503
3 1503 1505 26
3 1499 1505 1503
3 1507 1508 67
3 1506 1508 1507
3 69 1509 67
3 1507 1509 69
3 1510 1511 1506
3 28 1511 1510
3 1510 1512 69
3 1506 1512 1510
3 1513 1515 69
3 1514 1515 1513
3 1514 1516 28
3 1513 1516 1514
3 1517 1518 69
3 1513 1518 1517
3 69 1519 1517
3 4 1519 69
3 28 1522 111
3 1521 1522 28
3 1521 1523 1520
3 28 1523 1521
3 1524 1525 1520
3 4 1525 1524
3 1520 1526 1524
3 28 1526 1520
3 69 5 4
3 111 112 28
3 1527 1530 1529
3 1528 1530 1527
3 1529 1531 26
3 1528 1531 1529
3 1532 1533 1528
3 67 1533 1532
3 1528 1534 1532
3 1527 1534 1528
3 1536 1537 1535
3 26 1537 1536
3 1535 1538 1536
3 1527 1538 1535
3 26 1540 1539
3 24 1540 26
3 1539 1541 1535
3 24 1541 1539
3 1542 1545 1544
3 1543 1545 1542
3 1544 1546 65
3 1543 1546 1544
3 1547 1548 1543
3 24 1548 1547
3 1542 1549 1543
3 1547 1549 1542
3 1551 1552 65
3 1550 1552 1551
3 67 1553 65
3 1551 1553 67
3 1550 1555 1542
3 1554 1555 1550
3 1554 1556 67
3 1550 1556 1554
3 3 69 66
3 3 5 69
3 69 65 66
3 69 67 65
3 155 1557 153
3 156 1557 155
3 154 1558 156
3 153 1558 154
3 413 1559 155
3 414 1559 413
3 156 1560 414
3 155 1560 156
3 123 413 125
3 123 410 413
3 400 410 123
3 400 153 410
3 155 400 402
3 155 153 400
3 125 155 402
3 125 413 155
3 410 1561 413
3 411 1561 410
3 414 1562 411
3 413 1562 414
3 153 1563 410
3 154 1563 153
3 411 1564 154
3 410 1564 411
3 414 154 156
3 414 411 154
3 402 401 403
3 402 400 401
3 402 126 125
3 402 403 126
3 401 126 403
3 401 124 126
3 123 126 124
3 123 125 126
3 400 124 401
3 400 123 124
3 196 1565 198
3 197 1565 196
3 199 1566 197
3 198 1566 199
3 436 1567 196
3 437 1567 436
3 197 1568 437
3 196 1568 197
3 438 394 392
3 438 436 394
3 103 438 392
3 103 198 438
3 105 198 103
3 105 196 198
3 394 196 105
3 394 436 196
3 438 1569 436
3 439 1569 438
3 437 1570 439
3 436 1570 437
3 198 1571 438
3 199 1571 198
3 439 1572 199
3 438 1572 439
3 437 199 197
3 437 439 199
3 105 104 106
3 105 103 104
3 105 395 394
3 105 106 395
3 104 395 106
3 104 393 395
3 392 395 393
3 392 394 395
3 103 393 104
3 103 392 393
3 207 1573 204
3 208 1573 207
3 205 1574 208
3 204 1574 205
3 446 1575 207
3 447 1575 446
3 208 1576 447
3 207 1576 208
3 396 446 398
3 396 444 446
3 119 444 396
3 119 204 444
3 207 119 121
3 207 204 119
3 446 121 398
3 446 207 121
3 444 1577 446
3 445 1577 444
3 447 1578 445
3 446 1578 447
3 205 1579 204
3 445 1579 205
3 444 1580 445
3 204 1580 444
3 447 205 208
3 447 445 205
3 121 120 122
3 121 119 120
3 398 122 399
3 398 121 122
3 120 399 122
3 120 397 399
3 396 399 397
3 396 398 399
3 119 397 120
3 119 396 397
3 42 37 95
3 90 37 95
3 241 236 88
3 83 236 88
3 50 45 391
3 45 386 391
3 353 348 234
3 348 229 234
3 297 302 176
3 171 297 176
3 33 36 34
3 33 35 36
3 179 34 180
3 179 33 34
3 36 180 34
3 36 182 180
3 181 180 182
3 181 179 180
3 182 35 36
3 35 181 182
3 179 35 33
3 179 181 35
3 139 142 140
3 141 139 142
3 266 140 267
3 266 139 140
3 142 267 140
3 142 269 267
3 267 268 269
3 266 268 267
3 269 141 142
3 268 141 269
3 266 141 139
3 268 266 141
3 226 222 227
3 224 222 226
3 223 222 224
3 223 159 158
3 224 159 223
3 158 222 223
3 157 222 158
3 226 159 224
3 159 161 226
3 162 226 161
3 227 162 226
3 157 161 162
3 159 161 157
3 158 159 157
3 157 227 222
3 162 227 157
3 421 417 422
3 419 417 421
3 418 417 419
3 418 59 58
3 419 59 418
3 58 417 418
3 57 417 58
3 421 59 419
3 61 59 421
3 421 62 61
3 422 62 421
3 57 61 62
3 61 59 57
3 58 59 57
3 57 422 417
3 62 422 57
3 456 452 457
3 454 452 456
3 453 452 454
3 453 145 144
3 454 145 453
3 144 452 453
3 143 452 144
3 456 145 454
3 147 145 456
3 456 148 147
3 457 148 456
3 143 147 148
3 147 145 143
3 144 145 143
3 143 457 452
3 148 457 143
3 276 273 274
3 273 275 276
3 274 419 420
3 273 419 274
3 420 276 274
3 422 276 420
3 420 421 422
3 421 419 420
3 422 275 276
3 275 421 422
3 275 419 273
3 421 419 275
3 62 59 60
3 61 59 62
3 60 224 225
3 59 224 60
3 225 62 60
3 227 62 225
3 225 226 227
3 224 226 225
3 227 61 62
3 61 226 227
3 61 224 59
3 226 224 61
3 148 145 146
3 147 145 148
3 146 273 274
3 145 273 146
3 274 148 146
3 276 148 274
3 275 274 276
3 273 275 274
3 276 147 148
3 275 147 276
3 147 273 145
3 275 273 147
3 302 299 300
3 299 301 302
3 300 454 455
3 299 454 300
3 455 302 300
3 302 457 455
3 455 456 457
3 456 454 455
3 301 457 302
3 301 456 457
3 301 454 299
3 456 454 301
3 175 171 176
3 173 171 175
3 172 171 173
3 172 299 298
3 173 299 172
3 298 171 172
3 297 171 298
3 175 299 173
3 301 299 175
3 302 175 301
3 176 302 175
3 297 301 302
3 299 301 297
3 298 299 297
3 30 26 27
3 29 26 30
3 27 173 174
3 26 173 27
3 174 30 27
3 176 30 174
3 174 175 176
3 173 175 174
3 176 29 30
3 29 175 176
3 29 173 26
3 175 173 29
3 229 233 234
3 229 231 233
3 229 230 231
3 350 230 349
3 350 231 230
3 229 349 230
3 229 348 349
3 350 233 231
3 350 352 233
3 353 233 352
3 353 234 233
3 352 348 353
3 350 352 348
3 350 349 348
3 486 490 491
3 486 488 490
3 486 487 488
3 139 487 138
3 139 488 487
3 486 138 487
3 486 137 138
3 139 490 488
3 139 141 490
3 490 142 141
3 142 491 490
3 141 137 142
3 141 139 137
3 139 138 137
3 491 137 486
3 491 142 137
3 284 288 289
3 284 286 288
3 284 285 286
3 432 285 431
3 432 286 285
3 284 431 285
3 284 430 431
3 432 288 286
3 434 432 288
3 435 288 434
3 435 289 288
3 434 430 435
3 434 432 430
3 432 431 430
3 289 430 284
3 289 435 430
3 350 353 351
3 350 352 353
3 488 351 489
3 488 350 351
3 353 489 351
3 353 491 489
3 490 489 491
3 490 488 489
3 352 491 353
3 490 352 491
3 488 352 350
3 488 490 352
3 82 79 80
3 79 81 82
3 80 231 232
3 79 231 80
3 82 232 80
3 82 234 232
3 232 233 234
3 231 233 232
3 81 234 82
3 81 233 234
3 81 231 79
3 231 233 81
3 435 432 433
3 434 432 435
3 433 79 80
3 432 79 433
3 80 435 433
3 82 435 80
3 80 81 82
3 79 81 80
3 82 434 435
3 434 81 82
3 434 79 432
3 81 79 434
3 162 159 160
3 161 159 162
3 160 286 287
3 159 286 160
3 287 162 160
3 289 162 287
3 287 288 289
3 286 288 287
3 289 161 162
3 161 288 289
3 161 286 159
3 286 288 161
3 262 259 260
3 259 261 262
3 388 260 389
3 388 259 260
3 262 389 260
3 262 391 389
3 389 390 391
3 388 390 389
3 261 391 262
3 261 390 391
3 388 261 259
3 388 390 261
3 404 408 409
3 404 406 408
3 404 405 406
3 53 405 52
3 53 406 405
3 404 52 405
3 404 51 52
3 53 408 406
3 53 55 408
3 56 408 55
3 56 409 408
3 51 55 56
3 55 53 51
3 53 52 51
3 409 51 404
3 409 56 51
3 217 213 218
3 215 213 217
3 214 213 215
3 214 342 341
3 215 342 214
3 341 213 214
3 340 213 341
3 217 342 215
3 342 344 217
3 217 345 344
3 218 345 217
3 344 340 345
3 342 344 340
3 341 342 340
3 340 218 213
3 345 218 340
3 481 477 482
3 479 477 481
3 478 477 479
3 478 129 128
3 479 129 478
3 128 477 478
3 127 477 128
3 129 481 479
3 131 129 481
3 481 132 131
3 482 132 481
3 131 127 132
3 131 129 127
3 128 129 127
3 127 482 477
3 132 482 127
3 266 269 267
3 268 266 269
3 406 267 407
3 406 266 267
3 269 407 267
3 269 409 407
3 408 407 409
3 406 408 407
3 268 409 269
3 408 268 409
3 406 268 266
3 406 408 268
3 53 56 54
3 53 55 56
3 215 54 216
3 215 53 54
3 56 216 54
3 56 218 216
3 216 217 218
3 215 217 216
3 55 218 56
3 55 217 218
3 215 55 53
3 215 217 55
3 345 342 343
3 344 342 345
3 343 479 480
3 342 479 343
3 480 345 343
3 482 345 480
3 481 480 482
3 479 481 480
3 482 344 345
3 481 344 482
3 344 479 342
3 481 479 344
3 129 132 130
3 129 131 132
3 259 130 260
3 259 129 130
3 132 260 130
3 262 132 260
3 260 261 262
3 259 261 260
3 131 262 132
3 131 261 262
3 259 131 129
3 259 261 131
3 386 390 391
3 386 388 390
3 386 387 388
3 47 387 46
3 47 388 387
3 386 46 387
3 386 45 46
3 47 390 388
3 47 49 390
3 50 390 49
3 50 391 390
3 49 45 50
3 47 49 45
3 47 46 45
3 194 190 195
3 192 190 194
3 191 190 192
3 191 330 329
3 192 330 191
3 329 190 191
3 326 190 329
3 330 194 192
3 330 332 194
3 194 333 332
3 195 333 194
3 326 332 333
3 330 332 326
3 329 330 326
3 195 326 333
3 190 326 195
3 113 117 118
3 113 115 117
3 113 114 115
3 251 114 250
3 251 115 114
3 113 250 114
3 113 249 250
3 251 117 115
3 251 253 117
3 254 117 253
3 254 118 117
3 249 253 254
3 253 251 249
3 251 250 249
3 249 118 254
3 249 113 118
3 376 380 381
3 376 378 380
3 376 377 378
3 33 377 32
3 33 378 377
3 376 32 377
3 376 31 32
3 380 33 378
3 33 35 380
3 36 380 35
3 381 36 380
3 35 31 36
3 35 33 31
3 33 32 31
3 31 381 36
3 31 376 381
3 47 50 48
3 47 49 50
3 192 48 193
3 192 47 48
3 50 193 48
3 50 195 193
3 194 193 195
3 194 192 193
3 49 195 50
3 194 49 195
3 192 49 47
3 192 194 49
3 330 333 331
3 330 332 333
3 470 331 471
3 470 330 331
3 333 471 331
3 333 473 471
3 471 472 473
3 472 470 471
3 332 473 333
3 332 472 473
3 470 332 330
3 470 472 332
3 470 473 471
3 472 470 473
3 115 471 116
3 470 115 471
3 473 116 471
3 473 118 116
3 117 116 118
3 115 117 116
3 472 118 473
3 117 472 118
3 115 472 470
3 115 117 472
3 251 254 252
3 251 253 254
3 378 252 379
3 378 251 252
3 254 379 252
3 254 381 379
3 380 379 381
3 380 378 379
3 253 381 254
3 253 380 381
3 378 253 251
3 378 380 253
3 87 83 88
3 85 83 87
3 84 83 85
3 84 238 237
3 85 238 84
3 237 83 84
3 236 83 237
3 238 87 85
3 238 240 87
3 241 87 240
3 241 88 87
3 240 236 241
3 238 240 236
3 237 238 236
3 466 469 467
3 468 466 469
3 467 98 99
3 466 98 467
3 99 469 467
3 101 469 99
3 99 100 101
3 98 100 99
3 101 468 469
3 100 468 101
3 468 98 466
3 100 98 468
3 94 90 95
3 92 90 94
3 91 90 92
3 91 39 38
3 92 39 91
3 38 90 91
3 37 90 38
3 94 39 92
3 39 41 94
3 42 94 41
3 42 95 94
3 41 37 42
3 39 41 37
3 38 39 37
3 187 183 188
3 185 183 187
3 184 183 185
3 184 316 315
3 185 316 184
3 315 183 184
3 314 183 315
3 316 187 185
3 316 318 187
3 187 319 318
3 188 319 187
3 314 318 319
3 316 318 314
3 315 316 314
3 188 314 319
3 183 314 188
3 177 181 182
3 177 179 181
3 177 178 179
3 305 178 304
3 305 179 178
3 177 304 178
3 177 303 304
3 181 305 179
3 307 305 181
3 308 181 307
3 182 308 181
3 307 303 308
3 307 305 303
3 305 304 303
3 303 182 308
3 303 177 182
3 39 42 40
3 41 39 42
3 185 40 186
3 185 39 40
3 42 186 40
3 42 188 186
3 187 186 188
3 187 185 186
3 41 188 42
3 41 187 188
3 185 41 39
3 185 187 41
3 319 316 317
3 318 316 319
3 317 466 467
3 316 466 317
3 467 319 317
3 319 469 467
3 468 467 469
3 466 468 467
3 318 469 319
3 468 318 469
3 318 466 316
3 468 466 318
3 305 308 306
3 305 307 308
3 460 306 461
3 460 305 306
3 308 461 306
3 308 463 461
3 462 461 463
3 462 460 461
3 463 307 308
3 307 462 463
3 460 307 305
3 460 462 307
3 463 460 461
3 460 462 463
3 461 92 93
3 92 460 461
3 93 463 461
3 95 463 93
3 93 94 95
3 92 94 93
3 95 462 463
3 94 462 95
3 462 92 460
3 92 94 462
3 100 96 101
3 98 96 100
3 97 96 98
3 97 245 244
3 98 245 97
3 244 96 97
3 243 96 244
3 245 100 98
3 245 247 100
3 248 100 247
3 248 101 100
3 247 243 248
3 245 247 243
3 244 245 243
3 243 101 248
3 96 243 101
3 374 370 375
3 372 370 374
3 371 370 372
3 371 20 19
3 372 20 371
3 19 370 371
3 18 370 19
3 20 374 372
3 20 22 374
3 374 23 22
3 23 375 374
3 18 22 23
3 20 22 18
3 19 20 18
3 375 18 23
3 370 18 375
3 165 169 170
3 167 165 169
3 165 166 167
3 293 166 292
3 293 167 166
3 165 292 166
3 165 291 292
3 293 169 167
3 293 295 169
3 296 169 295
3 296 170 169
3 295 291 296
3 295 293 291
3 293 292 291
3 291 170 296
3 291 165 170
3 248 245 246
3 247 245 248
3 246 372 373
3 245 372 246
3 373 248 246
3 375 248 373
3 373 374 375
3 372 374 373
3 247 375 248
3 374 247 375
3 247 372 245
3 374 372 247
3 20 23 21
3 22 20 23
3 167 21 168
3 167 20 21
3 23 168 21
3 23 170 168
3 169 168 170
3 169 167 168
3 22 170 23
3 22 169 170
3 167 22 20
3 167 169 22
3 296 293 294
3 293 295 296
3 294 448 449
3 293 448 294
3 449 296 294
3 451 296 449
3 449 450 451
3 448 450 449
3 451 295 296
3 450 295 451
3 295 448 293
3 448 450 295
3 448 451 449
3 450 448 451
3 449 85 86
3 448 85 449
3 86 451 449
3 88 451 86
3 86 87 88
3 85 87 86
3 88 450 451
3 87 450 88
3 450 85 448
3 87 85 450
3 360 356 361
3 358 356 360
3 356 357 358
3 8 357 7
3 8 358 357
3 356 7 357
3 356 6 7
3 8 360 358
3 8 10 360
3 11 360 10
3 11 361 360
3 10 6 11
3 10 8 6
3 8 7 6
3 361 6 356
3 361 11 6
3 281 277 282
3 279 277 281
3 277 278 279
3 425 278 424
3 425 279 278
3 277 424 278
3 277 423 424
3 425 281 279
3 425 427 281
3 428 281 427
3 428 282 281
3 427 423 428
3 427 425 423
3 425 424 423
3 282 423 277
3 282 428 423
3 241 238 239
3 240 238 241
3 239 358 359
3 238 358 239
3 359 241 239
3 361 241 359
3 359 360 361
3 358 360 359
3 240 361 241
3 360 240 361
3 240 358 238
3 360 358 240
3 11 8 9
3 10 8 11
3 9 149 150
3 8 149 9
3 150 11 9
3 11 152 150
3 151 150 152
3 149 151 150
3 10 152 11
3 151 10 152
3 10 149 8
3 151 149 10
3 149 152 150
3 151 149 152
3 150 279 280
3 149 279 150
3 280 152 150
3 282 152 280
3 280 281 282
3 279 281 280
3 282 151 152
3 281 151 282
3 151 279 149
3 281 279 151
3 428 425 426
3 427 425 428
3 426 67 68
3 425 67 426
3 68 428 426
3 71 428 68
3 68 70 71
3 67 70 68
3 427 71 428
3 70 427 71
3 427 67 425
3 70 67 427