OFF
1280 1300 0
-0.2265728886 0.0594040089 0.0356542951
-0.0238938570 0.1804047035 0.0557086171
0.0130187978 0.1674199061 -0.0427784946
0.2136459193 0.1890864587 0.0431379214
0.1635277234 0.2160858960 -0.1011581429
-0.2346722060 0.0745872236 0.0306865500
0.4338042295 0.0035272043 0.1722100163
0.4444054497 -0.2088478556 0.0006502667
-0.0126914481 -0.2013171779 -0.1468733396
-0.0200199956 0.1689016659 -0.1127054080
-0.0101732253 -0.2046773610 -0.1099247166
-0.0175017728 0.1655414828 -0.0757567850
0.2515993183 0.2340539710 -0.1152888674
0.0065537267 -0.1337979957 -0.0088088437
0.4244621656 -0.0019517003 0.1723620512
-0.0040243667 0.0650286737 0.0207471541
0.4109928108 0.1722062035 -0.0094490171
0.3997378089 -0.2067523149 -0.0464992788
0.1632266895 0.2308041746 -0.0997886604
0.4899502357 0.0056389263 0.1610548980
-0.4892399403 -0.0509937897 0.1466482624
-0.2092618200 -0.1611194859 0.0093288883
-0.2089197427 -0.1650377762 0.0129871007
0.3947189513 -0.2001247658 -0.1174118511
-0.1119492775 -0.1384948887 0.0013686580
-0.0601916644 0.0832208724 -0.0098350978
0.0664405406 0.1689248482 -0.0461456103
-0.0067916039 -0.1124487518 -0.1129176526
-0.0105145150 0.0756228735 -0.0955603015
0.0012666978 -0.1232013227 0.0053177760
-0.0024562133 0.0648703025 0.0226751270
-0.1160322293 0.0762146687 0.0214156199
-0.4890695460 0.0707972791 0.0618692452
-0.2267625485 -0.0420255845 0.1056487090
0.1010058107 0.1696959665 -0.0485682347
0.4589587167 -0.2311251483 -0.0152590208
0.1645042592 0.2002177534 -0.0926032313
0.1658302139 0.1840785090 -0.0787972753
0.4477444784 -0.0299937253 0.1186185040
-0.2305329230 -0.1430831714 0.0103633476
0.4326975637 0.0356070297 0.1676707969
0.4372407235 0.1672775331 0.0356097527
-0.2177157096 -0.1481228038 0.0229454862
-0.2192693341 -0.0419694709 0.1072697365
-0.0158264883 -0.2431065527 0.0163447871
0.0304994375 -0.2164727830 -0.0187279402
-0.1731987897 0.0801731140 -0.0025200804
0.1641985234 0.2151739007 -0.0912116915
0.1616334666 0.2470767088 -0.1176513878
0.4630678489 -0.0302028561 0.1226447995
-0.0133947163 -0.2072991555 -0.1145844132
-0.0208405263 0.1688434744 -0.0798697685
-0.0033218533 -0.2207398504 0.0332096660
-0.0107676632 0.1554027795 0.0679243107
-0.2048320732 -0.0431880712 0.1209358386
0.2550992218 0.1737310217 -0.0860679972
-0.2323217958 -0.1182827984 -0.0980772671
-0.2360447069 0.0697888268 -0.0807199161
-0.2242634941 -0.1290353693 0.0201581614
-0.2279864052 0.0590362559 0.0375155124
-0.2140958132 0.0929789724 0.0330352826
-0.4678219236 0.0909034609 -0.0892789119
-0.3563797836 0.0909137497 0.0453928330
-0.1029277278 0.0819908957 -0.0071440717
-0.4807150583 -0.0503042721 0.1417857513
0.4625589319 -0.0295257973 0.1152560582
0.2544899266 0.1869393961 -0.0900558869
0.1544275536 0.1712009086 -0.0519353504
-0.2263564857 -0.0425662054 0.1115596592
0.0169006450 0.1618897858 0.0163350599
0.4992008309 0.0418754529 0.1711452538
-0.3514777984 -0.1667380793 0.0213544718
-0.0138123727 0.0797474903 0.0109518358
-0.0120183457 -0.0108820108 0.0025875328
-0.0169254389 0.0389639331 -0.0523904268
-0.0187194659 0.1295934342 -0.0440261238
-0.0128953603 0.0335400907 0.0067226902
-0.0146894078 0.1241706261 0.0150870887
-0.0178424308 0.0851702984 -0.0481613767
-0.0160484038 -0.0054592028 -0.0565256797
0.4376667037 -0.1956310354 -0.1442652523
0.4302208937 0.1805115945 -0.1095506075
0.4477395667 -0.2090717303 0.0035288270
0.4402937568 0.1670708996 0.0382434717
-0.0117172878 -0.0421842510 0.1542496491
0.2657021872 0.1739563555 -0.0594056205
-0.2229958639 -0.1286519650 0.0180960663
0.4231554433 0.0406015568 0.1687732588
-0.2262607314 -0.1348781045 -0.1031313698
-0.2306578665 0.0872535327 -0.0826305803
-0.2285271305 -0.1318539416 -0.1363851098
-0.2329242656 0.0902776957 -0.1158843204
0.1630996530 0.1754078149 -0.1243196347
0.0839081046 -0.2152138072 -0.0223904641
-0.0122262751 -0.0415070983 0.1468598757
0.4898587670 0.0363965484 0.1712972887
0.2541882919 0.2016876774 -0.0886837395
-0.0007052912 -0.2200804187 0.0302788105
-0.2348597596 0.0719500008 0.0268628510
0.4332966763 0.0041877419 0.1648196797
-0.2043755697 -0.0437959975 0.1275868802
-0.0004473625 -0.1230262659 0.0031890207
-0.1304616900 0.0814031175 -0.0052111747
0.5000000000 -0.0000172666 0.1673437095
0.4893501572 0.0370580934 0.1639071157
0.0027136439 0.0805868858 0.0147855496
-0.2796595507 0.0962027293 -0.1011388319
-0.2247362601 -0.1362206008 -0.1076822229
-0.2292037412 0.0894647289 -0.0868534589
-0.2156706285 -0.1483172995 0.0253332535
-0.2201381095 0.0773680303 0.0461620175
0.0703224084 0.1633936937 0.0129678488
0.3107233377 -0.2088504387 -0.0403954036
0.4239545920 -0.0012901284 0.1649718100
0.2513034012 0.2485654446 -0.1139387500
0.1048876580 0.1641658462 0.0105453199
0.3057045032 -0.2022230211 -0.1113076758
0.3191239301 0.1754612976 -0.0627727362
-0.4987540074 0.0889706680 0.0564188996
0.3536892002 0.1762324159 -0.0651953605
-0.4953728012 -0.1432214649 -0.0898737399
-0.4998402823 0.0824638649 -0.0690449760
-0.4863071696 -0.1553181635 0.0431417365
-0.4907746506 0.0703671663 0.0639705004
-0.1763048612 0.0846272035 -0.0498081559
-0.4847761348 -0.1548707360 0.0408155371
-0.2308321232 -0.1397976578 0.0070921568
0.2525560715 0.2184452297 -0.1069484450
-0.4937845278 -0.1722355792 0.0320485102
0.0026337354 -0.0412261850 0.1482470573
0.4324342578 -0.1898026037 -0.1761635955
0.4251057103 0.1804162401 -0.1419956639
0.4349524806 -0.1931627868 -0.1392149725
0.4276239331 0.1770560570 -0.1050470409
0.2521269577 0.1777671312 -0.1301099718
0.0263170617 -0.2109498160 -0.0778216628
0.4713232959 0.0665105307 0.0510308486
0.4669996153 0.0965408983 -0.0028708484
0.4807514052 -0.0130722600 0.1630248120
0.4693506240 -0.0215961258 -0.0135844149
0.4715092497 0.0670226392 0.0540581196
0.4726967874 -0.0025078667 0.0447713918
0.4569314131 0.1097457929 -0.1506867940
0.4793778433 0.0559462313 0.1692832366
0.4729063442 -0.0031811996 0.0476913388
0.4670103522 0.0960019587 -0.0029195469
0.4592893699 -0.0087408461 -0.1614322105
0.4693576143 -0.0219457971 -0.0136156456
-0.2220096389 0.0775451979 0.0439992284
0.0106233014 -0.0360259224 0.0897477085
0.4510838484 0.1979027041 0.0290881435
-0.1060337993 0.0864449852 -0.0544321472
-0.0078700195 0.1560450734 0.0652383060
0.0068528566 -0.1370834154 -0.0055386850
0.4904578592 0.0049782948 0.1684462669
-0.2362873674 0.0706891523 -0.1067177903
-0.2326230916 -0.1144203731 -0.1238017657
-0.2342727850 0.0680010001 -0.0771588300
-0.2306085092 -0.1171085252 -0.0942428053
0.1583094214 0.1656697541 0.0071781087
0.1660708808 0.1713716785 -0.0802775919
0.2522550305 0.2331635177 -0.1055790657
0.1856698443 0.1747907011 -0.0856118106
0.1908033361 0.1674768785 -0.0074342883
0.4071109431 0.1777373580 -0.0685624762
-0.0237012883 0.1859213092 0.0606929931
0.2218261240 -0.2403483154 0.0032235223
0.2695840345 0.1684262352 -0.0002920659
0.1654615785 0.1845800624 -0.0842655848
-0.4933364658 -0.1417868571 -0.0855571958
-0.4977336009 0.0803447802 -0.0650564063
-0.4956028649 -0.1387626942 -0.1188109358
-0.5000000000 0.0833689431 -0.0983101464
0.0032802241 -0.0363447792 0.0923625272
-0.0137250326 0.0764464260 -0.1213628842
-0.0100607568 -0.1086630994 -0.1384468595
-0.0117104501 0.0737582738 -0.0918039238
-0.0080461743 -0.1113512515 -0.1088878992
0.2535326002 0.2025770965 -0.0983936366
0.2548585549 0.1864378522 -0.0845876807
0.2378440100 0.1688017287 -0.0103996106
0.4593768685 -0.2374545536 -0.0113767295
0.4332051168 0.0349464921 0.1750611336
0.2327105394 0.1761155232 -0.0885768232
-0.1335677961 0.0858582600 -0.0524993612
0.0797257308 -0.2096909437 -0.0814841963
0.4986932778 0.0425359905 0.1637549171
0.0110293642 -0.0365665433 0.0956586587
-0.2729864051 0.0866943186 0.0004921220
0.4342292280 0.0655509762 0.0534717203
0.4299055474 0.0955813437 -0.0004299767
0.4436573373 -0.0140318145 0.1654656837
0.4322565561 -0.0225556804 -0.0111435432
0.4344151818 0.0660630847 0.0564989913
0.4356027195 -0.0034674213 0.0472122635
0.4198373452 0.1087862384 -0.1482459223
0.4422837754 0.0549866768 0.1717241083
0.4358122763 -0.0041407542 0.0501322105
0.4299162843 0.0950424042 -0.0004786752
0.4221953020 -0.0097004007 -0.1589913388
0.4322635464 -0.0229053517 -0.0111747739
0.1625720066 0.2316946641 -0.1094986335
0.1651599509 0.1993283343 -0.0828933342
-0.4941259834 -0.1683172728 0.0283902568
-0.0632967342 0.0876760417 -0.0571233525
-0.4611482388 0.0813950354 0.0123523176
0.2506618076 0.2494360519 -0.1234417932
0.2532268645 0.2175332438 -0.0970020969
-0.2138897404 0.0961684576 0.0373575243
-0.0154082661 -0.2494360519 0.0202281106
0.3230057978 0.1699301431 -0.0036592771
0.4508913500 0.1923860045 0.0241047996
0.4994923560 0.0006443991 0.1599524361
0.0025260903 0.0779496629 0.0109618505
-0.4989602875 0.0857811775 0.0520966716
0.3575710475 0.1707022956 -0.0060818060
0.1622750532 0.2462061109 -0.1081484479
-0.4896964438 -0.0503858635 0.1399972208
-0.2136547368 -0.0435563425 0.1239157072
0.4236629965 0.0399410192 0.1761635955
0.4260504247 0.0429404715 -0.0797106577
0.4260504247 0.0429404715 -0.0797106577
0.4631445137 0.0438999979 -0.0821512198
0.4631445137 0.0438999979 -0.0821512198
-0.1097518146 -0.0898248104 0.0530104871
-0.1076635608 -0.0395663743 0.1036091590
0.0089411104 -0.0868249793 0.0450599868
-0.1097518146 -0.0898248104 0.0530104871
-0.1118400332 -0.1400832934 0.0024123313
-0.2284447043 -0.0928246884 0.0609615034
-0.1118214209 0.0190103402 0.0631726044
-0.1159792810 0.0775870547 0.0227360498
0.0068715041 0.0220101712 0.0552221041
-0.1118214209 0.0190103402 0.0631726044
-0.1076635608 -0.0395663743 0.1036091590
-0.2305143459 0.0160105091 0.0711231046
-0.0022358646 -0.0289987961 0.0119680874
-0.2247843762 -0.0346239780 0.0268751807
-0.1155275490 -0.1207420606 -0.0463797456
-0.1195566998 -0.1153657751 -0.1054974598
-0.1698955215 -0.1248887149 -0.0131107921
-0.1155275490 -0.1207420606 -0.0463797456
-0.1114983981 -0.1261183460 0.0127379687
-0.0611595765 -0.1165954062 -0.0796486991
-0.2301541005 -0.0296232713 -0.0302808774
-0.2341832513 -0.0242469858 -0.0893985916
-0.2320155560 0.0644125414 -0.0216022019
-0.2301541005 -0.0296232713 -0.0302808774
-0.2261249496 -0.0349995567 0.0288368369
-0.2282926449 -0.1236590839 -0.0389595529
-0.1192504601 0.0673295647 -0.0290223946
-0.1232796109 0.0727058502 -0.0881401088
-0.0608533367 0.0660999336 -0.0031736338
-0.1192504601 0.0673295647 -0.0290223946
-0.1152213092 0.0619532792 0.0300953197
-0.1776475835 0.0685591958 -0.0548711554
-0.0046239086 -0.0237892246 -0.0451212628
-0.0086530595 -0.0184129391 -0.1042389771
-0.0027624531 -0.1178250372 -0.0537999383
-0.0046239086 -0.0237892246 -0.0451212628
-0.0005947578 -0.0291655101 0.0139964515
-0.0064853642 0.0702465880 -0.0364425873
-0.3490798415 -0.1080157830 0.0798176815
-0.3468077550 -0.0473948936 0.1371175713
-0.2767277056 -0.0759058902 0.1037022808
-0.4191598909 -0.0795047863 0.1132329719
-0.2066476562 -0.1044168869 0.0702869904
-0.2789997921 -0.1365267796 0.0464023911
-0.2767277056 -0.0759058902 0.1037022808
-0.3490798415 -0.1080157830 0.0798176815
-0.3513521353 -0.1686366777 0.0225178054
-0.4214321847 -0.1401256811 0.0559330959
-0.2789997921 -0.1365267796 0.0464023911
-0.4915122341 -0.1116146844 0.0893483863
-0.4191598909 -0.0795047863 0.1132329719
-0.4214321847 -0.1401256811 0.0559330959
-0.3515647886 0.0225873353 0.0920028899
-0.3563218739 0.0925695628 0.0468882120
-0.2827272645 0.0593778964 0.0646802071
-0.4251593980 0.0557790017 0.0742108948
-0.2091326551 0.0261862300 0.0824722022
-0.2779701791 -0.0106043311 0.1097948850
-0.2827272645 0.0593778964 0.0646802071
-0.3515647886 0.0225873353 0.0920028899
-0.3468077550 -0.0473948936 0.1371175713
-0.4204023644 -0.0142032272 0.1193255761
-0.2779701791 -0.0106043311 0.1097948850
-0.4939969739 0.0189884392 0.1015335810
-0.4251593980 0.0557790017 0.0742108948
-0.4204023644 -0.0142032272 0.1193255761
-0.2198626743 -0.0352888030 0.0334723573
-0.4869228404 -0.0420367285 0.0513423912
-0.3555217148 -0.1457693822 -0.0322702432
-0.3600545307 -0.1397210328 -0.0987779814
-0.4209144422 -0.1505437728 0.0054357467
-0.3555217148 -0.1457693822 -0.0322702432
-0.3509888990 -0.1518177315 0.0342374950
-0.2901289875 -0.1409949915 -0.0699762330
-0.4930737259 -0.0364271493 -0.0129516197
-0.4976065417 -0.0303788000 -0.0794593579
-0.4953074664 0.0764155156 -0.0025372378
-0.4930737259 -0.0364271493 -0.0129516197
-0.4885409101 -0.0424754986 0.0535561185
-0.4908399854 -0.1492698142 -0.0233660017
-0.3599891959 0.0799159476 -0.0114414792
-0.3645220117 0.0859642969 -0.0779492175
-0.2900636527 0.0786419889 0.0173602691
-0.3599891959 0.0799159476 -0.0114414792
-0.3554563801 0.0738675983 0.0550662590
-0.4299147391 0.0811899062 -0.0402432276
-0.2224371848 -0.0294262853 -0.0307601027
-0.2269700006 -0.0233779360 -0.0972678409
-0.2202034443 -0.1422689501 -0.0411744847
-0.2224371848 -0.0294262853 -0.0307601027
-0.2179043690 -0.0354746346 0.0357476355
-0.2246709253 0.0834163796 -0.0203457207
0.2238297904 -0.1398194023 0.0714364598
0.2256752805 -0.0361935536 0.1384472243
0.3434488196 -0.0850111292 0.0970406296
0.2845620501 -0.0606023414 0.1177439270
0.3443715647 -0.0331982049 0.1305460119
0.1060562513 -0.0910018267 0.1128430545
0.1069789964 -0.0391889023 0.1463484367
0.1649430208 -0.1154106145 0.0921397571
0.3416033295 -0.1886369780 0.0300298652
0.3434488196 -0.0850111292 0.0970406296
0.4023355892 -0.1094199171 0.0763373323
0.2827165599 -0.1642281902 0.0507331625
0.4612223587 -0.1338287049 0.0556340350
0.4004900990 -0.2130457658 0.0093265678
0.4023355892 -0.1094199171 0.0763373323
0.2238297904 -0.1398194023 0.0714364598
0.2219843012 -0.2434453028 0.0044256905
0.1042107622 -0.1946277271 0.0458322852
0.1630975317 -0.2190365150 0.0251289879
0.1032880176 -0.2464406774 0.0123269006
0.3416033295 -0.1886369780 0.0300298652
0.3406805849 -0.2404499282 -0.0034755195
0.2827165599 -0.1642281902 0.0507331625
0.1060562513 -0.0910018267 0.1128430545
0.1042107622 -0.1946277271 0.0458322852
0.0453239926 -0.1702189393 0.0665355825
0.1649430208 -0.1154106145 0.0921397571
-0.0135627769 -0.1458101515 0.0872388799
0.0471694817 -0.0665930389 0.1335463518
0.0453239926 -0.1702189393 0.0665355825
0.2196832803 0.0778592265 0.0916688963
0.2136912800 0.1919120066 0.0448905683
0.3353835643 0.1378809653 0.0603785199
0.2775334223 0.1078700959 0.0760237081
0.3323875642 0.1949073554 0.0369893559
0.0979909960 0.1318902679 0.0761809447
0.0949949959 0.1889166579 0.0527917807
0.1558411380 0.1619011373 0.0605357565
0.3353835643 0.1378809653 0.0603785199
0.4570758486 0.0838499240 0.0758664715
0.3992257066 0.0538390546 0.0915116597
0.3932337064 0.1678918347 0.0447333317
0.3413755646 0.0238281852 0.1071568479
0.2775334223 0.1078700959 0.0760237081
0.3992257066 0.0538390546 0.0915116597
0.2196832803 0.0778592265 0.0916688963
0.2256752805 -0.0361935536 0.1384472243
0.1039829962 0.0178374878 0.1229592727
0.1618331383 0.0478483571 0.1073140845
0.1069789964 -0.0391889023 0.1463484367
0.3413755646 0.0238281852 0.1071568479
0.3443715647 -0.0331982049 0.1305460119
0.2835254226 -0.0061826842 0.1228020361
0.1039829962 0.0178374878 0.1229592727
-0.0177092880 0.0718685291 0.1074713211
0.0401408540 0.1018793985 0.0918261329
0.0461328542 -0.0121733816 0.1386044609
0.0979909960 0.1318902679 0.0761809447
0.1618331383 0.0478483571 0.1073140845
0.0401408540 0.1018793985 0.0918261329
0.2111305162 -0.1972399823 -0.1430441560
0.2111305162 -0.1972399823 -0.1430441560
-0.0150966105 -0.0178878475 -0.1113150623
-0.0150966105 -0.0178878475 -0.1113150623
0.2038019687 0.1729788615 -0.1088762245
0.2038019687 0.1729788615 -0.1088762245
0.4300290954 -0.0063732733 -0.1406053182
0.4300290954 -0.0063732733 -0.1406053182
0.2171724252 -0.2081854429 -0.0555277931
0.2121359937 -0.2014650954 -0.1294248327
0.1018888544 -0.2077422992 -0.0850561032
0.3274195644 -0.2019082391 -0.0998965227
0.1069252860 -0.2144626466 -0.0111590636
0.1018888544 -0.2077422992 -0.0850561032
0.0467652848 -0.2108809011 -0.0628717384
0.2171724252 -0.2081854429 -0.0555277931
0.2222088567 -0.2149057903 0.0183692465
0.3324559960 -0.2086285866 -0.0259994831
0.1069252860 -0.2144626466 -0.0111590636
0.3274195644 -0.2019082391 -0.0998965227
0.3324559960 -0.2086285866 -0.0259994831
0.3875795656 -0.2054899847 -0.0481838479
-0.0120811898 -0.0259481880 -0.0233300513
-0.0171176213 -0.0192278405 -0.0972270909
-0.0164608580 0.0714476432 -0.0515999099
-0.0127379530 -0.1166236717 -0.0689572322
-0.0114244265 0.0647272958 0.0222971297
-0.0164608580 0.0714476432 -0.0515999099
-0.0158040947 0.1621231270 -0.0059727289
-0.0120811898 -0.0259481880 -0.0233300513
-0.0070447582 -0.0326685354 0.0505669883
-0.0077015215 -0.1233440192 0.0049398074
-0.0114244265 0.0647272958 0.0222971297
-0.0127379530 -0.1166236717 -0.0689572322
-0.0077015215 -0.1233440192 0.0049398074
-0.0083582848 -0.2140195029 -0.0406873736
0.2097266153 0.1679571870 -0.0208131484
0.2046901837 0.1746775345 -0.0947101880
0.3199737545 0.1742343908 -0.0651818780
0.0944430445 0.1684003307 -0.0503414584
0.3250101860 0.1675140433 0.0087151616
0.3199737545 0.1742343908 -0.0651818780
0.3776155399 0.1740128189 -0.0504177229
0.2097266153 0.1679571870 -0.0208131484
0.2147630468 0.1612368396 0.0530838912
0.0994794760 0.1616799833 0.0235555812
0.3250101860 0.1675140433 0.0087151616
0.0944430445 0.1684003307 -0.0503414584
0.0994794760 0.1616799833 0.0235555812
0.0418376907 0.1619015551 0.0087914261
0.4389802302 -0.0142800679 -0.0530108903
0.4339437987 -0.0075597204 -0.1269079299
0.4383234669 -0.1049555516 -0.0986380713
0.4346005620 0.0831157633 -0.0812807489
0.4433598985 -0.1116758991 -0.0247410317
0.4383234669 -0.1049555516 -0.0986380713
0.4427031352 -0.2023513828 -0.0703682126
0.4389802302 -0.0142800679 -0.0530108903
0.4440166617 -0.0210004153 0.0208861493
0.4396369935 0.0763954159 -0.0073837093
0.4433598985 -0.1116758991 -0.0247410317
0.4346005620 0.0831157633 -0.0812807489
0.4396369935 0.0763954159 -0.0073837093
0.4352573253 0.1737912471 -0.0356535679
0.4408230866 -0.0207851613 0.0181300097
0.4460749641 -0.1194207905 0.0596343854
0.4424926009 0.0686419039 0.0771141284
-0.0042876553 -0.0320176726 0.0477585582
-0.0026181420 0.0574094442 0.1067426817
0.0009642221 -0.1306533018 0.0892629339
-0.3704038947 0.0887988824 -0.0443932572
-0.3704038947 0.0887988824 -0.0443932572
0.4434184802 0.1026635683 -0.0755583854
0.4434184802 0.1026635683 -0.0755583854
0.4310845469 0.0363379960 -0.0058023753
0.4272294242 -0.0163028762 -0.0850830563
0.4210163236 0.0495429188 -0.1536186305
0.4248714463 0.1021837910 -0.0743379495
0.4457764582 -0.0158230989 -0.0863034922
0.4457764582 -0.0158230989 -0.0863034922
0.4681786148 0.0372975506 -0.0082432470
0.4619655142 0.1031433456 -0.0767788212
0.4581103915 0.0505024734 -0.1560595022
0.4643234921 -0.0153433216 -0.0875239280
0.4310864202 0.0362433619 -0.0058111092
0.4681804881 0.0372029164 -0.0082519809
0.4389432475 0.0257596277 0.1094681859
0.4389432475 0.0257596277 0.1094681859
0.4760373505 0.0267191354 0.1070278303
0.4760373505 0.0267191354 0.1070278303
0.3527211561 -0.2044876680 -0.0789034773
0.3527211561 -0.2044876680 -0.0789034773
0.2068802122 0.2124219200 -0.1238806798
0.2068802122 0.2124219200 -0.1238806798
-0.0493612252 -0.0631956768 0.0743345729
-0.1680541501 -0.0661955079 0.0822850731
-0.0514494790 -0.1134541129 0.0237359010
-0.0493612252 -0.0631956768 0.0743345729
-0.1701423688 -0.1164539909 0.0316869174
-0.0514494790 -0.1134541129 0.0237359010
-0.1680541501 -0.0661955079 0.0822850731
-0.1701423688 -0.1164539909 0.0316869174
-0.0545538885 0.0497986130 0.0389790770
-0.1732468135 0.0467987819 0.0469295772
-0.0503960284 -0.0087781015 0.0794156315
-0.0545538885 0.0497986130 0.0389790770
-0.1690889533 -0.0117779326 0.0873661318
-0.0503960284 -0.0087781015 0.0794156315
-0.1732468135 0.0467987819 0.0469295772
-0.1690889533 -0.0117779326 0.0873661318
0.0014164308 -0.0796855226 0.0477757740
-0.0003720713 0.0143419472 0.0565548407
-0.2229211113 0.0087172690 0.0714620158
-0.2211325990 -0.0853107179 0.0626829014
-0.1739246724 -0.1195124295 -0.0722285064
-0.0611595765 -0.1165954062 -0.0796486991
-0.1739246724 -0.1195124295 -0.0722285064
-0.2282926449 -0.1236590839 -0.0389595529
-0.0571304256 -0.1219716916 -0.0205309848
-0.1698955215 -0.1248887149 -0.0131107921
-0.0571304256 -0.1219716916 -0.0205309848
-0.0027624531 -0.1178250372 -0.0537999383
-0.2330994037 0.0200827778 -0.0555003968
-0.2312379481 -0.0739530348 -0.0641790723
-0.2290702528 0.0147064923 0.0036173175
-0.2330994037 0.0200827778 -0.0555003968
-0.2272087973 -0.0793293203 -0.0050613580
-0.2290702528 0.0147064923 0.0036173175
-0.2312379481 -0.0739530348 -0.0641790723
-0.2272087973 -0.0793293203 -0.0050613580
-0.0648824876 0.0714762191 -0.0622913481
-0.1776475835 0.0685591958 -0.0548711554
-0.0648824876 0.0714762191 -0.0622913481
-0.0064853642 0.0702465880 -0.0364425873
-0.1736184326 0.0631829103 0.0042465589
-0.0608533367 0.0660999336 -0.0031736338
-0.1736184326 0.0631829103 0.0042465589
-0.2320155560 0.0644125414 -0.0216022019
-0.0057077563 -0.0681189882 -0.0790194577
-0.0075692118 0.0259168244 -0.0703407822
-0.0016786054 -0.0734952737 -0.0199017434
-0.0057077563 -0.0681189882 -0.0790194577
-0.0035400610 0.0205405390 -0.0112230679
-0.0016786054 -0.0734952737 -0.0199017434
-0.0075692118 0.0259168244 -0.0703407822
-0.0035400610 0.0205405390 -0.0112230679
-0.1203346330 -0.1128858123 -0.1163448324
-0.1203346330 -0.1128858123 -0.1163448324
-0.2334479383 -0.0232096865 -0.1004802978
-0.2334479383 -0.0232096865 -0.1004802978
-0.1239989088 0.0722237131 -0.0992608571
-0.1239989088 0.0722237131 -0.0992608571
-0.0108856035 -0.0174524128 -0.1151253917
-0.0108856035 -0.0174524128 -0.1151253917
-0.3479437983 -0.0777053383 0.1084676264
-0.2755916623 -0.0455954456 0.1323522257
-0.4180238477 -0.0491943417 0.1418829168
-0.3479437983 -0.0777053383 0.1084676264
-0.2778637489 -0.1062163349 0.0750523360
-0.2077836994 -0.1347273315 0.0416370456
-0.2055116129 -0.0741064422 0.0989369353
-0.2778637489 -0.1062163349 0.0750523360
-0.3502159884 -0.1383262303 0.0511677435
-0.4225683315 -0.1704361284 0.0272831578
-0.2801359390 -0.1668372270 0.0177524531
-0.3502159884 -0.1383262303 0.0511677435
-0.4202960378 -0.1098152337 0.0845830339
-0.4903760872 -0.0813042371 0.1179983243
-0.4926483810 -0.1419251318 0.0606984482
-0.4202960378 -0.1098152337 0.0845830339
-0.3539433312 0.0575784490 0.0694455509
-0.2851058072 0.0943690102 0.0421228681
-0.4275379407 0.0907701154 0.0516535558
-0.3539433312 0.0575784490 0.0694455509
-0.2803487218 0.0243867827 0.0872375461
-0.2067541124 -0.0088048837 0.1050295412
-0.2115111977 0.0611773438 0.0599148632
-0.2803487218 0.0243867827 0.0872375461
-0.3491862718 -0.0124037792 0.1145602306
-0.4180238477 -0.0491943417 0.1418829168
-0.2755916623 -0.0455954456 0.1323522257
-0.3491862718 -0.0124037792 0.1145602306
-0.4227808812 0.0207878872 0.0967682355
-0.4963754906 0.0539795536 0.0789762403
-0.4916184571 -0.0160026753 0.1240909217
-0.4227808812 0.0207878872 0.0967682355
-0.2156852232 -0.0958395732 0.0734305967
-0.2178321878 0.0169944277 0.0839574678
-0.4848923022 0.0102465035 0.1018274983
-0.4827455965 -0.1025875040 0.0913006442
-0.4254472580 -0.1444954235 -0.0610719915
-0.2901289875 -0.1409949915 -0.0699762330
-0.4254472580 -0.1444954235 -0.0610719915
-0.4908399854 -0.1492698142 -0.0233660017
-0.2855961717 -0.1470433408 -0.0034684948
-0.4209144422 -0.1505437728 0.0054357467
-0.2855961717 -0.1470433408 -0.0034684948
-0.2202034443 -0.1422689501 -0.0411744847
-0.4964570041 0.0230183578 -0.0409982979
-0.4942232636 -0.0898243071 -0.0514126798
-0.4919241883 0.0169700085 0.0255094403
-0.4964570041 0.0230183578 -0.0409982979
-0.4896904478 -0.0958726564 0.0150950584
-0.4919241883 0.0169700085 0.0255094403
-0.4942232636 -0.0898243071 -0.0514126798
-0.4896904478 -0.0958726564 0.0150950584
-0.2945964685 0.0846903382 -0.0491474691
-0.4299147391 0.0811899062 -0.0402432276
-0.2945964685 0.0846903382 -0.0491474691
-0.2246709253 0.0834163796 -0.0203457207
-0.4253819233 0.0751415569 0.0262645106
-0.2900636527 0.0786419889 0.0173602691
-0.4253819233 0.0751415569 0.0262645106
-0.4953074664 0.0764155156 -0.0025372378
-0.2235867225 -0.0828234431 -0.0692211628
-0.2258204630 0.0300192218 -0.0588067808
-0.2190539066 -0.0888717924 -0.0027134246
-0.2235867225 -0.0828234431 -0.0692211628
-0.2212876472 0.0239708725 0.0077009574
-0.2190539066 -0.0888717924 -0.0027134246
-0.2258204630 0.0300192218 -0.0588067808
-0.2212876472 0.0239708725 0.0077009574
-0.3609317982 -0.1368203993 -0.1109711528
-0.3609317982 -0.1368203993 -0.1109711528
-0.4966682329 -0.0292089570 -0.0919336711
-0.4966682329 -0.0292089570 -0.0919336711
-0.3653289332 0.0853112379 -0.0904703633
-0.3653289332 0.0853112379 -0.0904703633
-0.2295924985 -0.0223002044 -0.1095078451
-0.2295924985 -0.0223002044 -0.1095078451
0.2836393050 -0.1124152658 0.0842385447
0.2247525355 -0.0880064780 0.1049418421
0.4032583342 -0.0576069927 0.1098427146
0.2845620501 -0.0606023414 0.1177439270
0.1658657659 -0.0635976901 0.1256451394
0.0471694817 -0.0665930389 0.1335463518
0.1658657659 -0.0635976901 0.1256451394
0.2247525355 -0.0880064780 0.1049418421
0.3425260745 -0.1368240536 0.0635352474
0.4032583342 -0.0576069927 0.1098427146
0.2836393050 -0.1124152658 0.0842385447
0.3425260745 -0.1368240536 0.0635352474
0.4014128441 -0.1612328414 0.0428319501
0.4602996136 -0.1856416293 0.0221286527
0.4621451038 -0.0820157805 0.0891394172
0.4014128441 -0.1612328414 0.0428319501
0.1640202763 -0.1672235647 0.0586343725
0.2229070458 -0.1916323526 0.0379310752
0.0444012480 -0.2220318895 0.0330301979
0.1630975317 -0.2190365150 0.0251289879
0.2817938153 -0.2160411404 0.0172277778
0.4004900990 -0.2130457658 0.0093265678
0.2817938153 -0.2160411404 0.0172277778
0.2229070458 -0.1916323526 0.0379310752
0.1051335067 -0.1428147769 0.0793376698
0.0444012480 -0.2220318895 0.0330301979
0.1640202763 -0.1672235647 0.0586343725
0.1051335067 -0.1428147769 0.0793376698
0.0462467372 -0.1184059891 0.1000409672
-0.0126400324 -0.0939972013 0.1207442645
-0.0144855215 -0.1976231017 0.0537334952
0.0462467372 -0.1184059891 0.1000409672
0.2166872802 0.1348856166 0.0682797323
0.2745374222 0.1648964860 0.0526345441
0.3932337064 0.1678918347 0.0447333317
0.2745374222 0.1648964860 0.0526345441
0.1558411380 0.1619011373 0.0605357565
0.0371448539 0.1589057885 0.0684369689
0.2166872802 0.1348856166 0.0682797323
0.1588371381 0.1048747472 0.0839249205
0.3962297065 0.1108654446 0.0681224957
0.4600718487 0.0268235339 0.0992556355
0.4540798485 0.1408763140 0.0524773075
0.3962297065 0.1108654446 0.0681224957
0.3383795645 0.0808545753 0.0837676839
0.2805294224 0.0508437059 0.0994128721
0.4022217067 -0.0031873355 0.1149008237
0.3383795645 0.0808545753 0.0837676839
0.2226792804 0.0208328365 0.1150580603
0.1648291384 -0.0091780329 0.1307032485
0.0461328542 -0.0121733816 0.1386044609
0.1648291384 -0.0091780329 0.1307032485
0.2835254226 -0.0061826842 0.1228020361
0.4022217067 -0.0031873355 0.1149008237
0.2226792804 0.0208328365 0.1150580603
0.2805294224 0.0508437059 0.0994128721
0.0431368541 0.0448530084 0.1152152969
-0.0207052882 0.1288949191 0.0840821571
-0.0147132879 0.0148421390 0.1308604851
0.0431368541 0.0448530084 0.1152152969
0.1009869961 0.0748638778 0.0995701087
0.1588371381 0.1048747472 0.0839249205
0.0371448539 0.1589057885 0.0684369689
0.1009869961 0.0748638778 0.0995701087
0.2098714048 -0.1955598908 -0.1615184675
0.1004786455 -0.2009586717 -0.1264844363
0.2123896276 -0.1989200739 -0.1245698445
0.3217823870 -0.1935212930 -0.1596038758
-0.0163557219 -0.0162077560 -0.1297893738
-0.0162991917 0.0738268176 -0.0935359236
-0.0138374991 -0.0195679391 -0.0928407508
-0.0138940293 -0.1096025127 -0.1290942009
0.2025428573 0.1746589530 -0.1273505360
0.3157129509 0.1750174592 -0.1069616327
0.2050610801 0.1712987699 -0.0904019130
0.0918909865 0.1709402637 -0.1107908162
0.4287699840 -0.0046931818 -0.1590796297
0.4324907880 -0.0997680300 -0.1399101453
0.4312882068 -0.0080533649 -0.1221310067
0.4275674029 0.0870214834 -0.1413004911
0.1570124240 -0.2046036973 -0.1072404680
0.0993706387 -0.2043821255 -0.1220046230
0.3249013487 -0.1985480654 -0.1368450425
0.2722959948 -0.2050468410 -0.0777121579
0.0467652848 -0.2108809011 -0.0628717384
0.1595306398 -0.2079638710 -0.0702919482
-0.0083582848 -0.2140195029 -0.0406873736
0.0518017163 -0.2176012485 0.0110253012
0.2773324263 -0.2117671885 -0.0038151183
0.3349742117 -0.2119887603 0.0109490367
0.1094435017 -0.2178228204 0.0257894562
0.1620488556 -0.2113240448 -0.0333434284
0.3875795656 -0.2054899847 -0.0481838479
0.2748142106 -0.2084070147 -0.0407636381
0.4427031352 -0.2023513828 -0.0703682126
0.3825431340 -0.1987696373 -0.1220808875
-0.0167892397 0.0261099013 -0.0744135004
-0.0189790738 0.0748078169 -0.0885484297
-0.0152561688 -0.1132634980 -0.1059057520
-0.0124095714 -0.0712859299 -0.0461436417
-0.0161324764 0.1167853851 -0.0287863194
-0.0142710239 0.0227497276 -0.0374649806
-0.0110960448 0.1100650376 0.0451107202
-0.0161324764 0.1167853851 -0.0287863194
-0.0073731399 -0.0780062773 0.0277533979
-0.0051833057 -0.1267041929 0.0418883272
-0.0089062107 0.0613671220 0.0592456495
-0.0092345924 0.0160293802 0.0364320590
-0.0080299032 -0.1686817611 -0.0178737831
-0.0124095714 -0.0712859299 -0.0461436417
-0.0105481189 -0.1653215873 -0.0548223029
-0.0080299032 -0.1686817611 -0.0178737831
0.2623319691 0.1744559626 -0.0799460330
0.3174555387 0.1775945645 -0.1021303978
0.0919248287 0.1717605045 -0.0872899782
0.1520848299 0.1681787589 -0.0355773034
0.3776155399 0.1740128189 -0.0504177229
0.2648501849 0.1710957889 -0.0429975132
0.4352573253 0.1737912471 -0.0356535679
0.3826519714 0.1672924715 0.0234793167
0.1571212614 0.1614584114 0.0383197362
0.1019976918 0.1583198096 0.0605041010
0.3275284018 0.1641538696 0.0456636814
0.2673684006 0.1677356152 -0.0060489934
0.0418376907 0.1619015551 0.0087914261
0.1546030456 0.1648185852 0.0013712164
-0.0158040947 0.1621231270 -0.0059727289
0.0368012591 0.1686219026 -0.0651056135
0.4361336328 -0.0562576360 -0.1127730006
0.4358052512 -0.1015953779 -0.1355865911
0.4320823462 0.0864759371 -0.1182292687
0.4367903961 0.0344178477 -0.0671458196
0.4405133011 -0.1536534672 -0.0845031420
0.4386518486 -0.0596178098 -0.0758244808
0.4455497326 -0.1603738147 -0.0106061024
0.4405133011 -0.1536534672 -0.0845031420
0.4418268276 0.0276975003 0.0067512200
0.4421552093 0.0730352422 0.0295648105
0.4458781142 -0.1150360728 0.0122074881
0.4436882801 -0.0663381572 -0.0019274412
0.4374471594 0.1250933315 -0.0215186386
0.4367903961 0.0344178477 -0.0671458196
0.4349289436 0.1284535052 -0.0584671584
0.4374471594 0.1250933315 -0.0215186386
0.4434490253 -0.0701029759 0.0388821975
0.4426142682 -0.1148165084 0.0093901382
0.4390319051 0.0732461859 0.0268698812
0.4451185397 0.0193240893 0.0978663162
0.0000077967 0.0080916296 0.1274948695
-0.0060788374 0.0620137004 0.0564984321
-0.0024964733 -0.1260490456 0.0390186843
-0.0016617166 -0.0813354872 0.0685107461
-0.4191129092 0.0898511716 -0.0668360845
-0.3737407372 0.0935530951 -0.0952088719
-0.3250317227 0.0925008059 -0.0727660446
-0.3670673219 0.0840446770 0.0064222198
0.4291569856 0.0100175599 -0.0454427158
0.4279779860 0.0692609076 -0.0400703172
0.4241228633 0.0166200354 -0.1193509983
0.4291569856 0.0100175599 -0.0454427158
0.4229438849 0.0758633549 -0.1139782900
0.4241228633 0.0166200354 -0.1193509983
0.4279779860 0.0692609076 -0.0400703172
0.4229438849 0.0758633549 -0.1139782900
0.4650720645 0.0702204481 -0.0425110341
0.4662510640 0.0109771004 -0.0478834327
0.4600379634 0.0768228954 -0.1164190069
0.4650720645 0.0702204481 -0.0425110341
0.4612169418 0.0175795759 -0.1217917151
0.4600379634 0.0768228954 -0.1164190069
0.4662510640 0.0109771004 -0.0478834327
0.4612169418 0.0175795759 -0.1217917151
0.4333358690 0.0217537022 0.0226777241
0.4327508010 0.0511532233 0.0253439411
0.4333358690 0.0217537022 0.0226777241
0.4699583482 0.0464103795 0.0223858959
0.4705434162 0.0170108584 0.0197196789
0.4699583482 0.0464103795 0.0223858959
0.4568035357 0.0607486037 0.1113774784
0.4568035357 0.0607486037 0.1113774784
0.4429705564 0.0204774311 0.1685948960
0.4396300284 -0.0087496179 0.1063389736
0.4349159738 0.0310417774 0.0503419919
0.4382565017 0.0602688265 0.1125979143
0.4581770623 -0.0082698406 0.1051185377
0.4581770623 -0.0082698406 0.1051185377
0.4800646243 0.0214369857 0.1661540243
0.4753505696 0.0612283810 0.1101570426
0.4720100416 0.0320013320 0.0479011202
0.4767240963 -0.0077900634 0.1038981019
0.2117569377 0.1717962008 -0.0480055558
0.2117569377 0.1717962008 -0.0480055558
0.2090994374 0.1745694183 -0.1051938159
0.2090994374 0.1745694183 -0.1051938159
-0.1087076877 -0.0646955924 0.0783098230
-0.0483170983 -0.0380664588 0.0996339088
-0.1670100233 -0.0410662899 0.1075844091
-0.1087076877 -0.0646955924 0.0783098230
-0.0504053521 -0.0883248949 0.0490352370
0.0078969835 -0.1119541974 0.0197606509
0.0099852373 -0.0616957613 0.0703593228
-0.0504053521 -0.0883248949 0.0490352370
-0.1107959239 -0.1149540519 0.0277114092
-0.1711864781 -0.1415832324 0.0063878395
-0.0524935883 -0.1385833544 -0.0015631769
-0.1107959239 -0.1149540519 0.0277114092
-0.1690982595 -0.0913247494 0.0569859952
-0.2274005950 -0.0676954469 0.0862605813
-0.2294888137 -0.1179539299 0.0356624255
-0.1690982595 -0.0913247494 0.0569859952
-0.1139003510 0.0482986974 0.0429543271
-0.0566328186 0.0790869702 0.0187607997
-0.1753257435 0.0760871392 0.0267112999
-0.1139003510 0.0482986974 0.0429543271
-0.0524749584 0.0205102557 0.0591973543
0.0089504341 -0.0072781860 0.0754403814
0.0047925740 0.0512985285 0.0350038269
-0.0524749584 0.0205102557 0.0591973543
-0.1097424908 -0.0102780171 0.0833908817
-0.1670100233 -0.0410662899 0.1075844091
-0.0483170983 -0.0380664588 0.0996339088
-0.1097424908 -0.0102780171 0.0833908817
-0.1711678834 0.0175104247 0.0671478545
-0.2325932759 0.0452988664 0.0509048273
-0.2284354158 -0.0132778481 0.0913413819
-0.1711678834 0.0175104247 0.0671478545
0.0005221797 -0.0326717877 0.0521653073
-0.0013416135 -0.0760125310 0.0075785541
-0.0031301157 0.0180149388 0.0163576207
0.0005221797 -0.0326717877 0.0521653073
-0.2220268552 -0.0382967244 0.0670724586
-0.2256786324 0.0123900154 0.0312647379
-0.2238901201 -0.0816379715 0.0224856235
-0.2220268552 -0.0382967244 0.0670724586
-0.1467406861 -0.1174391023 -0.0888629831
-0.1759392478 -0.1168242867 -0.1017873635
-0.0631741519 -0.1139072634 -0.1092075562
-0.0883435627 -0.1186687334 -0.0630142223
-0.2011086586 -0.1215857567 -0.0555940296
-0.1427115353 -0.1228153878 -0.0297452688
-0.1990940832 -0.1242738994 -0.0260351725
-0.2011086586 -0.1215857567 -0.0555940296
-0.0863289873 -0.1213568761 -0.0334553652
-0.0551158502 -0.1246598344 0.0090278723
-0.1678809461 -0.1275768577 0.0164480650
-0.1427115353 -0.1228153878 -0.0297452688
-0.0299464393 -0.1198983644 -0.0371654616
-0.0863289873 -0.1213568761 -0.0334553652
-0.0319610148 -0.1172102217 -0.0667243187
-0.0299464393 -0.1198983644 -0.0371654616
-0.0940810493 0.0720910346 -0.0752157285
-0.0668970630 0.0741643618 -0.0918502052
-0.1796621589 0.0712473385 -0.0844300125
-0.1484490218 0.0679443802 -0.0419467750
-0.0356839259 0.0708614036 -0.0493669677
-0.0900518984 0.0667147492 -0.0160980142
-0.0336693504 0.0681732608 -0.0198081105
-0.0356839259 0.0708614036 -0.0493669677
-0.1464344464 0.0652562375 -0.0123879178
-0.1716038572 0.0604947676 0.0338054160
-0.0588387613 0.0634117909 0.0263852233
-0.0900518984 0.0667147492 -0.0160980142
-0.2028169943 0.0637977258 -0.0086778215
-0.1464344464 0.0652562375 -0.0123879178
-0.2048315698 0.0664858686 -0.0382366786
-0.2028169943 0.0637977258 -0.0086778215
-0.1213419242 -0.1115417362 -0.1311243126
-0.1754715711 -0.1149971687 -0.1052938189
-0.1193273417 -0.1142298883 -0.1015653522
-0.0651976949 -0.1107744558 -0.1273958460
-0.1250062000 0.0735677891 -0.1140403373
-0.0678546795 0.0729909934 -0.0955323905
-0.1229916176 0.0708796370 -0.0844813769
-0.1801431381 0.0714564327 -0.1029893237
-0.2167587055 -0.0394225727 0.0786940323
-0.2187891919 -0.0917058034 0.0282089217
-0.2209361566 0.0211281975 0.0387357928
-0.2167587055 -0.0394225727 0.0786940323
-0.4838189494 -0.0461705003 0.0965640713
-0.4879961932 0.0143802753 0.0566058182
-0.4858494876 -0.0984537322 0.0460789642
-0.4838189494 -0.0461705003 0.0965640713
-0.3927508943 -0.1421082282 -0.0799249865
-0.4277136659 -0.1414712488 -0.0943258606
-0.2923953954 -0.1379708168 -0.1032301021
-0.3228253512 -0.1433821868 -0.0511232381
-0.4581436217 -0.1468826188 -0.0422189966
-0.3904844864 -0.1451324028 -0.0466711174
-0.4558772138 -0.1499067935 -0.0089651275
-0.4581436217 -0.1468826188 -0.0422189966
-0.3182925353 -0.1494305361 0.0153845001
-0.2833297638 -0.1500675155 0.0297853743
-0.4186480343 -0.1535679475 0.0386896158
-0.3882180785 -0.1481565775 -0.0134172483
-0.2528998080 -0.1446561455 -0.0223214897
-0.3205589433 -0.1464063615 -0.0178693690
-0.2551662159 -0.1416319708 -0.0555753588
-0.2528998080 -0.1446561455 -0.0223214897
-0.4953401338 -0.0334029746 -0.0462054888
-0.4987234120 0.0260425325 -0.0742521670
-0.4964896715 -0.0868001324 -0.0846665489
-0.4953401338 -0.0334029746 -0.0462054888
-0.4941905962 0.0199941831 -0.0077444288
-0.4930410585 0.0733913409 0.0307166313
-0.4975738744 0.0794396902 -0.0357911069
-0.4941905962 0.0199941831 -0.0077444288
-0.4908073180 -0.0394513240 0.0203022494
-0.4874240398 -0.0988968311 0.0483489275
-0.4896577804 0.0139458338 0.0587633095
-0.4908073180 -0.0394513240 0.0203022494
-0.4919568557 -0.0928484817 -0.0181588107
-0.4931063933 -0.1462456395 -0.0566198708
-0.4885735775 -0.1522939888 0.0098878674
-0.4919568557 -0.0928484817 -0.0181588107
-0.3295592401 0.0853273176 -0.0635483433
-0.2968628764 0.0877145129 -0.0824013382
-0.4321811470 0.0842140809 -0.0734970967
-0.3949519675 0.0805529269 -0.0258423534
-0.2596336969 0.0840533589 -0.0347465949
-0.3272928322 0.0823031429 -0.0302944742
-0.2573672890 0.0810291843 -0.0014927258
-0.2596336969 0.0840533589 -0.0347465949
-0.3904191517 0.0745045776 0.0406653848
-0.4231155154 0.0721173823 0.0595183797
-0.2877972448 0.0756178143 0.0506141382
-0.3250264243 0.0792789683 0.0029593949
-0.4603446949 0.0757785362 0.0118636364
-0.3926855596 0.0775287522 0.0074115157
-0.4626111028 0.0788027109 -0.0213902327
-0.4603446949 0.0757785362 0.0118636364
-0.2247035927 -0.0264021106 -0.0640139718
-0.2258531304 -0.0797992684 -0.1024750319
-0.2280868709 0.0330433965 -0.0920606499
-0.2247035927 -0.0264021106 -0.0640139718
-0.2213203146 -0.0858476177 -0.0359672937
-0.2179370364 -0.1452931248 -0.0079206156
-0.2224698522 -0.1392447755 -0.0744283538
-0.2213203146 -0.0858476177 -0.0359672937
-0.2201707769 -0.0324504599 0.0024937664
-0.2190212393 0.0209466978 0.0409548265
-0.2167874987 -0.0918959670 0.0305404445
-0.2201707769 -0.0324504599 0.0024937664
-0.2235540551 0.0269950472 -0.0255529117
-0.2269373332 0.0864405542 -0.0535995898
-0.2224045174 0.0803922049 0.0129081484
-0.2235540551 0.0269950472 -0.0255529117
-0.3620649977 -0.1353083179 -0.1275980228
-0.4271341320 -0.1393036282 -0.0982641743
-0.3597985986 -0.1383324808 -0.0943442828
-0.2947294643 -0.1343371705 -0.1236781313
-0.4978014325 -0.0276968755 -0.1085605411
-0.4972009169 0.0255679116 -0.0784950387
-0.4955350333 -0.0307210385 -0.0753068010
-0.4961355489 -0.0839858256 -0.1053723035
-0.3664621328 0.0868233194 -0.1070972334
-0.2979933998 0.0862823853 -0.0865504718
-0.3641957337 0.0837991565 -0.0738434933
-0.4326644666 0.0843400905 -0.0943902548
-0.2307256980 -0.0207881230 -0.1261347151
-0.2279266149 -0.0785891545 -0.1063196074
-0.2284592989 -0.0238122859 -0.0928809750
-0.2312583820 0.0339887456 -0.1126960827
0.2541959202 -0.1002108719 0.0945901934
0.3140054348 -0.0728067353 0.1073922783
0.2551186653 -0.0483979475 0.1280955756
0.2541959202 -0.1002108719 0.0945901934
0.3738149495 -0.0454025988 0.1201943632
0.4037197068 -0.0317005305 0.1265954057
0.2850234226 -0.0346958792 0.1344966181
0.3140054348 -0.0728067353 0.1073922783
0.1364223811 -0.0513932962 0.1359967881
0.1663271385 -0.0376912279 0.1423978305
0.0476308543 -0.0406865767 0.1502990429
0.0766128665 -0.0787974328 0.1231947031
0.1953091507 -0.0758020840 0.1152934907
0.1354996361 -0.1032062206 0.1024914058
0.1943864056 -0.1276150084 0.0817881085
0.1953091507 -0.0758020840 0.1152934907
0.3728922044 -0.0972155231 0.0866889810
0.3719694593 -0.1490284475 0.0531835987
0.4327017190 -0.0698113866 0.0994910659
0.3728922044 -0.0972155231 0.0866889810
0.3130826898 -0.1246196597 0.0738868961
0.2532731751 -0.1520237962 0.0610848111
0.3121599447 -0.1764325841 0.0403815138
0.3130826898 -0.1246196597 0.0738868961
0.4308562289 -0.1734372353 0.0324803014
0.3710467142 -0.2008413719 0.0196782165
0.4299334838 -0.2252501597 -0.0010250808
0.4308562289 -0.1734372353 0.0324803014
0.4317789739 -0.1216243110 0.0659856836
0.4327017190 -0.0698113866 0.0994910659
0.3719694593 -0.1490284475 0.0531835987
0.4317789739 -0.1216243110 0.0659856836
0.1934636610 -0.1794279586 0.0482827238
0.1336541469 -0.2068321210 0.0354806365
0.1925409165 -0.2312409089 0.0147773392
0.1934636610 -0.1794279586 0.0482827238
0.0738446328 -0.2342362835 0.0226785492
0.0439398758 -0.2479383647 0.0162775056
0.1626361594 -0.2449429901 0.0083762956
0.1336541469 -0.2068321210 0.0354806365
0.3112372001 -0.2282455343 0.0068761292
0.2813324431 -0.2419476155 0.0004750855
0.4000287267 -0.2389522409 -0.0074261245
0.3710467142 -0.2008413719 0.0196782165
0.2523504306 -0.2038367465 0.0275794265
0.3121599447 -0.1764325841 0.0403815138
0.2532731751 -0.1520237962 0.0610848111
0.2523504306 -0.2038367465 0.0275794265
0.0747673774 -0.1824233332 0.0561839339
0.0756901219 -0.1306103830 0.0896893185
0.0149578633 -0.2098274956 0.0433818466
0.0747673774 -0.1824233332 0.0561839339
0.1345768915 -0.1550191708 0.0689860212
0.1943864056 -0.1276150084 0.0817881085
0.1354996361 -0.1032062206 0.1024914058
0.1345768915 -0.1550191708 0.0689860212
0.0168033524 -0.1062015952 0.1103926158
0.0766128665 -0.0787974328 0.1231947031
0.0177260970 -0.0543886449 0.1438980005
0.0168033524 -0.1062015952 0.1103926158
0.0158806078 -0.1580145454 0.0768872312
0.0149578633 -0.2098274956 0.0433818466
0.0756901219 -0.1306103830 0.0896893185
0.0158806078 -0.1580145454 0.0768872312
0.2456123512 0.1498910513 0.0604571382
0.2486083513 0.0928646612 0.0838463022
0.3064584933 0.1228755306 0.0682011140
0.2456123512 0.1498910513 0.0604571382
0.3643086353 0.1528864000 0.0525559258
0.3917357063 0.1964050297 0.0330387497
0.2730394221 0.1934096810 0.0409399621
0.3034624932 0.1799019207 0.0448119500
0.1269160670 0.1468957026 0.0683583506
0.1543431380 0.1904143323 0.0488411745
0.0356468538 0.1874189836 0.0567423869
0.0660699249 0.1739112232 0.0606143748
0.1877622092 0.1198801819 0.0761023264
0.1847662090 0.1769065720 0.0527131624
0.1269160670 0.1468957026 0.0683583506
0.1877622092 0.1198801819 0.0761023264
0.4281507776 0.0688444893 0.0836890656
0.3673046355 0.0958600100 0.0759450898
0.4311467777 0.0118180992 0.1070782296
0.4281507776 0.0688444893 0.0836890656
0.4251547775 0.1258708793 0.0602999016
0.4221587774 0.1828972694 0.0369107376
0.3643086353 0.1528864000 0.0525559258
0.4251547775 0.1258708793 0.0602999016
0.3094544934 0.0658491406 0.0915902780
0.3064584933 0.1228755306 0.0682011140
0.2486083513 0.0928646612 0.0838463022
0.3094544934 0.0658491406 0.0915902780
0.3703006356 0.0388336199 0.0993342538
0.4311467777 0.0118180992 0.1070782296
0.3673046355 0.0958600100 0.0759450898
0.3703006356 0.0388336199 0.0993342538
0.1937542094 0.0058274018 0.1228806544
0.1907582093 0.0628537918 0.0994914904
0.1329080673 0.0328429224 0.1151366786
0.1937542094 0.0058274018 0.1228806544
0.0750579252 0.0028320531 0.1307818668
0.0476308543 -0.0406865767 0.1502990429
0.1663271385 -0.0376912279 0.1423978305
0.1359040674 -0.0241834676 0.1385258426
0.3124504936 0.0088227505 0.1149794420
0.2850234226 -0.0346958792 0.1344966181
0.4037197068 -0.0317005305 0.1265954057
0.3732966357 -0.0181927702 0.1227234178
0.2516043514 0.0358382712 0.1072354662
0.2546003515 -0.0211881189 0.1306246302
0.3124504936 0.0088227505 0.1149794420
0.2516043514 0.0358382712 0.1072354662
0.0112157830 0.0868739638 0.0996487270
0.0720619251 0.0598584431 0.1073927028
0.0082197828 0.1439003538 0.0762595630
0.0112157830 0.0868739638 0.0996487270
0.0142117831 0.0298475737 0.1230378910
0.0172077832 -0.0271788163 0.1464270550
0.0750579252 0.0028320531 0.1307818668
0.0142117831 0.0298475737 0.1230378910
0.1299120671 0.0898693125 0.0917475146
0.1329080673 0.0328429224 0.1151366786
0.1907582093 0.0628537918 0.0994914904
0.1299120671 0.0898693125 0.0917475146
0.0690659250 0.1168848332 0.0840035388
0.0082197828 0.1439003538 0.0762595630
0.0720619251 0.0598584431 0.1073927028
0.0690659250 0.1168848332 0.0840035388
0.0992195341 -0.1992785801 -0.1449587478
0.3217823870 -0.1935212930 -0.1596038758
0.0992195341 -0.1992785801 -0.1449587478
0.0438935987 -0.2011379248 -0.1366788879
0.3230414984 -0.1952013846 -0.1411295643
0.1004786455 -0.2009586717 -0.1264844363
0.3230414984 -0.1952013846 -0.1411295643
0.3783674338 -0.1933420399 -0.1494094241
-0.0175583031 0.0755069092 -0.1120102352
-0.0138940293 -0.1096025127 -0.1290942009
-0.0175583031 0.0755069092 -0.1120102352
-0.0181595937 0.1213642418 -0.1031206658
-0.0126349179 -0.1112826043 -0.1106198894
-0.0162991917 0.0738268176 -0.0935359236
-0.0126349179 -0.1112826043 -0.1106198894
-0.0120336273 -0.1571399369 -0.1195094588
0.3144538395 0.1766975508 -0.1254359442
0.0918909865 0.1709402637 -0.1107908162
0.3144538395 0.1766975508 -0.1254359442
0.3704093306 0.1777168497 -0.1244786483
0.0931500979 0.1692601721 -0.0923165047
0.3157129509 0.1750174592 -0.1069616327
0.0931500979 0.1692601721 -0.0923165047
0.0371946068 0.1682408732 -0.0932738006
0.4312316766 -0.0980879385 -0.1583844568
0.4275674029 0.0870214834 -0.1413004911
0.4312316766 -0.0980879385 -0.1583844568
0.4324625229 -0.1447853169 -0.1580368704
0.4288265143 0.0853413919 -0.1228261796
0.4324907880 -0.0997680300 -0.1399101453
0.4288265143 0.0853413919 -0.1228261796
0.4275956680 0.1320387702 -0.1231737660
0.1595306398 -0.2079638710 -0.0702919482
0.1870924246 -0.2063945701 -0.0813841305
0.0442470691 -0.2075207273 -0.0998202582
0.1570124240 -0.2046036973 -0.1072404680
0.2697777790 -0.2016866673 -0.1146606777
0.3825431340 -0.1987696373 -0.1220808875
0.2697777790 -0.2016866673 -0.1146606777
0.2422159942 -0.2032559682 -0.1035684953
0.0768452854 -0.2126717739 -0.0370154010
0.0442470691 -0.2075207273 -0.0998202582
0.1332279629 -0.2112132588 -0.0407255059
0.1620488556 -0.2113240448 -0.0333434284
0.0217217158 -0.2158103757 -0.0148310362
0.0166852842 -0.2090900283 -0.0887280758
0.0768452854 -0.2126717739 -0.0370154010
0.0217217158 -0.2158103757 -0.0148310362
0.2748142106 -0.2084070147 -0.0407636381
0.2472524258 -0.2099763157 -0.0296714557
0.3900977813 -0.2088501584 -0.0112353281
0.2773324263 -0.2117671885 -0.0038151183
0.1645670713 -0.2146842185 0.0036050914
0.0518017163 -0.2176012485 0.0110253012
0.1645670713 -0.2146842185 0.0036050914
0.1921288562 -0.2131149176 -0.0074870909
0.3574995650 -0.2036991119 -0.0740401853
0.3900977813 -0.2088501584 -0.0112353281
0.3011168875 -0.2051576269 -0.0703300804
0.2722959948 -0.2050468410 -0.0777121579
0.4126231346 -0.2005605101 -0.0962245501
0.4176595661 -0.2072808575 -0.0223275105
0.3574995650 -0.2036991119 -0.0740401853
0.4126231346 -0.2005605101 -0.0962245501
-0.0142710239 0.0227497276 -0.0374649806
-0.0145994055 -0.0225880143 -0.0602785711
-0.0186506921 0.1201455588 -0.0657348392
-0.0167892397 0.0261099013 -0.0744135004
-0.0149277872 -0.0679257561 -0.0830921615
-0.0130663347 -0.1619614136 -0.0917708227
-0.0149277872 -0.0679257561 -0.0830921615
-0.0145994055 -0.0225880143 -0.0602785711
-0.0139426422 0.0680874695 -0.0146513901
-0.0186506921 0.1201455588 -0.0657348392
-0.0139426422 0.0680874695 -0.0146513901
-0.0117528081 0.0193895539 -0.0005164608
-0.0136142606 0.1134252114 0.0081622004
-0.0132858790 0.1587629533 0.0309757909
-0.0183223105 0.1654833007 -0.0429212487
-0.0136142606 0.1134252114 0.0081622004
-0.0098913556 -0.0746461036 -0.0091951219
-0.0095629740 -0.0293083617 0.0136184685
-0.0055116874 -0.1720419348 0.0190747367
-0.0073731399 -0.0780062773 0.0277533979
-0.0092345924 0.0160293802 0.0364320590
-0.0110960448 0.1100650376 0.0451107202
-0.0095629740 -0.0293083617 0.0136184685
-0.0117528081 0.0193895539 -0.0005164608
-0.0102197373 -0.1199838455 -0.0320087124
-0.0055116874 -0.1720419348 0.0190747367
-0.0098913556 -0.0746461036 -0.0091951219
-0.0102197373 -0.1199838455 -0.0320087124
-0.0108765006 -0.2106593292 -0.0776358934
-0.0130663347 -0.1619614136 -0.0917708227
-0.0058400690 -0.2173796767 -0.0037388538
-0.0105481189 -0.1653215873 -0.0548223029
0.2648501849 0.1710957889 -0.0429975132
0.2360292922 0.1712065748 -0.0503795907
0.3750973241 0.1773729927 -0.0873662427
0.2623319691 0.1744559626 -0.0799460330
0.1495666141 0.1715389326 -0.0725258232
0.0368012591 0.1686219026 -0.0651056135
0.1495666141 0.1715389326 -0.0725258232
0.1783875068 0.1714281467 -0.0651437457
0.3513128629 0.1707634311 -0.0208512806
0.3750973241 0.1773729927 -0.0873662427
0.2949301854 0.1693049161 -0.0171411758
0.2673684006 0.1677356152 -0.0060489934
0.4089546483 0.1705418593 -0.0060871256
0.4039182168 0.1772622067 -0.0799841652
0.3513128629 0.1707634311 -0.0208512806
0.4089546483 0.1705418593 -0.0060871256
0.1546030456 0.1648185852 0.0013712164
0.1834239383 0.1647077992 0.0087532939
0.0443559064 0.1585413814 0.0457399459
0.1571212614 0.1614584114 0.0383197362
0.2698866164 0.1643754415 0.0308995264
0.3826519714 0.1672924715 0.0234793167
0.2698866164 0.1643754415 0.0308995264
0.2410657237 0.1644862274 0.0235174489
0.0681403676 0.1651509429 -0.0207750162
0.0443559064 0.1585413814 0.0457399459
0.1245230451 0.1666094579 -0.0244851210
0.1520848299 0.1681787589 -0.0355773034
0.0104985822 0.1653725148 -0.0355391712
0.0155350137 0.1586521673 0.0383578684
0.0681403676 0.1651509429 -0.0207750162
0.0104985822 0.1653725148 -0.0355391712
0.4386518486 -0.0596178098 -0.0758244808
0.4364620145 -0.0109198942 -0.0899594101
0.4379950853 -0.1502932935 -0.1214516618
0.4361336328 -0.0562576360 -0.1127730006
0.4342721803 0.0377780215 -0.1040943394
0.4324107278 0.1318136789 -0.0954156782
0.4342721803 0.0377780215 -0.1040943394
0.4364620145 -0.0109198942 -0.0899594101
0.4408416827 -0.1083157254 -0.0616895515
0.4379950853 -0.1502932935 -0.1214516618
0.4408416827 -0.1083157254 -0.0616895515
0.4411700643 -0.0629779835 -0.0388759610
0.4430315168 -0.1570136410 -0.0475546222
0.4452213509 -0.2057115566 -0.0334196928
0.4401849194 -0.1989912091 -0.1073167325
0.4430315168 -0.1570136410 -0.0475546222
0.4393086119 0.0310576740 -0.0301972998
0.4414984460 -0.0176402416 -0.0160623705
0.4399653751 0.1217331578 0.0154298812
0.4418268276 0.0276975003 0.0067512200
0.4436882801 -0.0663381572 -0.0019274412
0.4455497326 -0.1603738147 -0.0106061024
0.4414984460 -0.0176402416 -0.0160623705
0.4411700643 -0.0629779835 -0.0388759610
0.4371187777 0.0797555896 -0.0443322291
0.4399653751 0.1217331578 0.0154298812
0.4393086119 0.0310576740 -0.0301972998
0.4371187777 0.0797555896 -0.0443322291
0.4327391095 0.1771514208 -0.0726020877
0.4324107278 0.1318136789 -0.0954156782
0.4377755410 0.1704310734 0.0012949519
0.4349289436 0.1284535052 -0.0584671584
0.4469097212 -0.0747072579 0.0891264447
0.4442837825 -0.0253894433 0.0683742569
0.4452402069 -0.1641343230 0.0301423260
0.4434490253 -0.0701029759 0.0388821975
0.4416578438 0.0239283713 0.0476220690
0.4398666622 0.1179597185 0.0563619405
0.4416578438 0.0239283713 0.0476220690
0.4442837825 -0.0253894433 0.0683742569
-0.0008269600 -0.0366219288 0.0980028078
-0.0034528987 0.0126958858 0.0772506199
-0.0052440808 0.1067272588 0.0859904938
-0.0034528987 0.0126958858 0.0772506199
-0.0016617166 -0.0813354872 0.0685107461
0.0001294655 -0.1753668602 0.0597708722
-0.0008269600 -0.0366219288 0.0980028078
0.0017989787 -0.0859397434 0.1187549956
-0.4157760668 0.0850969589 -0.0160204698
-0.4644850812 0.0861492481 -0.0384632972
-0.3250317227 0.0925008059 -0.0727660446
-0.4191129092 0.0898511716 -0.0668360845
-0.2763229779 0.0914485240 -0.0503233550
-0.3216951499 0.0877466005 -0.0219505676
-0.4157760668 0.0850969589 -0.0160204698
-0.3216951499 0.0877466005 -0.0219505676
3 70 212 103
3 70 186 212
3 186 19 212
3 186 104 19
3 104 154 19
3 104 95 154
3 95 103 154
3 95 70 103
3 103 113 14
3 103 212 113
3 212 99 113
3 212 19 99
3 19 6 99
3 19 154 6
3 154 14 6
3 154 103 14
3 14 87 219
3 14 113 87
3 113 40 87
3 113 99 40
3 99 182 40
3 99 6 182
3 6 219 182
3 6 14 219
3 219 186 70
3 219 87 186
3 87 104 186
3 87 40 104
3 40 95 104
3 40 182 95
3 182 70 95
3 182 219 70
3 190 448 137
3 195 448 190
3 142 449 195
3 137 449 142
3 450 762 220
3 200 762 450
3 450 763 190
3 220 763 450
3 451 764 220
3 199 764 451
3 451 765 200
3 220 765 451
3 452 766 221
3 195 766 452
3 452 767 199
3 221 767 452
3 453 768 221
3 190 768 453
3 453 769 195
3 221 769 453
3 147 454 200
3 146 454 147
3 199 455 146
3 200 455 199
3 456 770 222
3 137 770 456
3 456 771 147
3 222 771 456
3 457 772 222
3 142 772 457
3 457 773 137
3 222 773 457
3 458 774 223
3 146 774 458
3 458 775 142
3 223 775 458
3 459 776 223
3 147 776 459
3 459 777 146
3 223 777 459
3 140 193 198
3 140 198 145
3 197 778 193
3 192 778 197
3 198 779 460
3 193 779 198
3 460 780 192
3 193 780 460
3 197 144 139
3 197 139 192
3 140 781 144
3 145 781 140
3 139 782 461
3 144 782 139
3 461 783 145
3 144 783 461
3 196 784 143
3 189 784 196
3 136 785 189
3 143 785 136
3 462 786 191
3 196 786 462
3 462 787 194
3 191 787 462
3 463 788 189
3 194 788 463
3 463 789 196
3 189 789 463
3 138 790 191
3 141 790 138
3 194 791 141
3 191 791 194
3 464 792 143
3 138 792 464
3 464 793 136
3 143 793 464
3 465 794 141
3 136 794 465
3 465 795 138
3 141 795 465
3 191 143 138
3 196 143 191
3 167 85 117
3 167 117 210
3 215 119 164
3 215 164 16
3 115 34 67
3 115 67 159
3 69 2 26
3 69 26 111
3 72 78 75
3 72 75 77
3 73 79 74
3 73 74 76
3 162 796 163
3 183 796 162
3 180 797 183
3 163 797 180
3 23 466 17
3 116 466 23
3 112 467 116
3 17 467 112
3 93 185 135
3 93 135 45
3 37 168 66
3 37 66 179
3 168 202 96
3 168 96 66
3 202 36 178
3 202 178 96
3 36 47 207
3 36 207 178
3 47 4 127
3 47 127 207
3 4 18 161
3 4 161 127
3 18 201 12
3 18 12 161
3 201 216 114
3 201 114 12
3 216 48 206
3 216 206 114
3 92 468 48
3 134 468 92
3 206 469 134
3 48 469 206
3 160 798 92
3 55 798 160
3 134 799 55
3 92 799 134
3 160 37 179
3 160 179 55
3 160 168 37
3 92 168 160
3 216 92 48
3 201 92 216
3 4 201 18
3 4 92 201
3 4 168 92
3 36 4 47
3 36 168 4
3 36 202 168
3 55 179 66
3 134 55 66
3 114 206 134
3 12 114 134
3 127 161 12
3 127 12 134
3 127 134 66
3 178 207 127
3 178 127 66
3 178 66 96
3 470 800 225
3 224 800 470
3 470 801 187
3 225 801 470
3 471 802 225
3 68 802 471
3 471 803 224
3 225 803 471
3 472 804 226
3 224 804 472
3 472 805 153
3 226 805 472
3 473 806 226
3 187 806 473
3 473 807 224
3 226 807 473
3 474 808 228
3 227 808 474
3 474 809 39
3 228 809 474
3 475 810 228
3 153 810 475
3 475 811 227
3 228 811 475
3 476 812 229
3 227 812 476
3 476 813 68
3 229 813 476
3 477 814 229
3 39 814 477
3 477 815 227
3 229 815 477
3 39 33 68
3 39 126 33
3 13 187 149
3 13 153 187
3 478 816 231
3 230 816 478
3 478 817 105
3 231 817 478
3 479 818 231
3 5 818 479
3 479 819 230
3 231 819 479
3 480 820 232
3 230 820 480
3 480 821 187
3 232 821 480
3 481 822 232
3 105 822 481
3 481 823 230
3 232 823 481
3 482 824 234
3 233 824 482
3 482 825 68
3 234 825 482
3 483 826 234
3 187 826 483
3 483 827 233
3 234 827 483
3 484 828 235
3 233 828 484
3 484 829 5
3 235 829 484
3 485 830 235
3 68 830 485
3 485 831 233
3 235 831 485
3 68 98 5
3 68 33 98
3 149 105 213
3 149 187 105
3 24 39 153
3 24 126 39
3 24 13 126
3 24 153 13
3 31 105 5
3 31 5 98
3 31 98 213
3 31 213 105
3 486 832 236
3 173 832 486
3 486 833 101
3 236 833 486
3 487 834 236
3 15 834 487
3 487 835 173
3 236 835 487
3 488 836 237
3 43 836 488
3 488 837 0
3 237 837 488
3 489 838 237
3 86 838 489
3 489 839 43
3 237 839 489
3 238 840 490
3 239 840 238
3 490 841 56
3 239 841 490
3 491 842 239
3 27 842 491
3 239 843 491
3 238 843 239
3 492 844 240
3 56 844 492
3 492 845 238
3 240 845 492
3 58 846 493
3 240 846 58
3 493 847 56
3 240 847 493
3 242 848 241
3 494 848 242
3 494 849 29
3 242 849 494
3 495 850 242
3 58 850 495
3 242 851 495
3 241 851 242
3 496 852 243
3 29 852 496
3 243 853 496
3 241 853 243
3 27 854 497
3 243 854 27
3 497 855 29
3 243 855 497
3 245 498 244
3 57 498 245
3 245 499 56
3 244 499 245
3 246 500 244
3 59 500 246
3 246 501 57
3 244 501 246
3 248 502 247
3 58 502 248
3 248 503 59
3 247 503 248
3 249 504 247
3 56 504 249
3 249 505 58
3 247 505 249
3 250 856 506
3 251 856 250
3 506 857 28
3 251 857 506
3 507 858 251
3 57 858 507
3 251 859 507
3 250 859 251
3 508 860 252
3 28 860 508
3 508 861 250
3 252 861 508
3 30 862 509
3 252 862 30
3 509 863 28
3 252 863 509
3 254 864 253
3 510 864 254
3 510 865 59
3 254 865 510
3 511 866 254
3 30 866 511
3 254 867 511
3 253 867 254
3 512 868 255
3 59 868 512
3 255 869 512
3 253 869 255
3 57 870 513
3 255 870 57
3 513 871 59
3 255 871 513
3 257 514 256
3 27 514 257
3 257 515 28
3 256 515 257
3 258 516 256
3 29 516 258
3 258 517 27
3 256 517 258
3 260 518 259
3 30 518 260
3 260 519 29
3 259 519 260
3 261 520 259
3 28 520 261
3 261 521 30
3 259 521 261
3 522 872 156
3 175 872 522
3 156 873 522
3 158 873 156
3 523 874 177
3 158 874 523
3 177 875 523
3 175 875 177
3 155 524 156
3 157 524 155
3 158 525 157
3 156 525 158
3 526 876 174
3 155 876 526
3 174 877 526
3 176 877 174
3 527 878 157
3 176 878 527
3 157 879 527
3 155 879 157
3 175 528 174
3 177 528 175
3 176 529 177
3 174 529 176
3 264 530 263
3 262 530 264
3 264 531 100
3 263 531 264
3 265 532 263
3 20 532 265
3 265 533 262
3 263 533 265
3 267 534 266
3 262 534 267
3 267 535 22
3 266 535 267
3 268 536 266
3 100 536 268
3 268 537 262
3 266 537 268
3 271 538 270
3 269 538 271
3 271 539 128
3 270 539 271
3 272 540 270
3 22 540 272
3 272 541 269
3 270 541 272
3 274 542 273
3 269 542 274
3 274 543 20
3 273 543 274
3 275 544 273
3 128 544 275
3 275 545 269
3 273 545 275
3 128 217 20
3 128 203 217
3 21 100 54
3 21 22 100
3 278 546 277
3 276 546 278
3 278 547 208
3 277 547 278
3 279 548 277
3 118 548 279
3 279 549 276
3 277 549 279
3 281 550 280
3 276 550 281
3 281 551 100
3 280 551 281
3 282 552 280
3 208 552 282
3 282 553 276
3 280 553 282
3 285 554 284
3 283 554 285
3 285 555 20
3 284 555 285
3 286 556 284
3 100 556 286
3 286 557 283
3 284 557 286
3 288 558 287
3 283 558 288
3 288 559 118
3 287 559 288
3 289 560 287
3 20 560 289
3 289 561 283
3 287 561 289
3 20 214 118
3 20 217 214
3 54 208 60
3 54 100 208
3 71 128 22
3 71 203 128
3 71 21 203
3 71 22 21
3 62 208 118
3 62 118 214
3 62 214 60
3 62 60 208
3 562 880 290
3 218 880 562
3 562 881 42
3 290 881 562
3 563 882 290
3 148 882 563
3 563 883 218
3 290 883 563
3 564 884 291
3 64 884 564
3 564 885 32
3 291 885 564
3 565 886 291
3 125 886 565
3 565 887 64
3 291 887 565
3 292 888 566
3 293 888 292
3 566 889 120
3 293 889 566
3 567 890 293
3 107 890 567
3 293 891 567
3 292 891 293
3 568 892 294
3 120 892 568
3 294 893 568
3 292 893 294
3 122 894 569
3 294 894 122
3 569 895 120
3 294 895 569
3 295 896 570
3 296 896 295
3 570 897 109
3 296 897 570
3 571 898 296
3 122 898 571
3 296 899 571
3 295 899 296
3 572 900 297
3 109 900 572
3 297 901 572
3 295 901 297
3 107 902 573
3 297 902 107
3 573 903 109
3 297 903 573
3 574 904 299
3 298 904 574
3 574 905 121
3 299 905 574
3 575 906 299
3 120 906 575
3 575 907 298
3 299 907 575
3 576 908 300
3 298 908 576
3 576 909 123
3 300 909 576
3 577 910 300
3 121 910 577
3 577 911 298
3 300 911 577
3 578 912 302
3 301 912 578
3 578 913 122
3 302 913 578
3 579 914 302
3 123 914 579
3 579 915 301
3 302 915 579
3 580 916 303
3 301 916 580
3 580 917 120
3 303 917 580
3 581 918 303
3 122 918 581
3 581 919 301
3 303 919 581
3 304 920 582
3 305 920 304
3 582 921 108
3 305 921 582
3 583 922 305
3 121 922 583
3 305 923 583
3 304 923 305
3 584 924 306
3 108 924 584
3 306 925 584
3 304 925 306
3 110 926 585
3 306 926 110
3 585 927 108
3 306 927 585
3 307 928 586
3 308 928 307
3 586 929 123
3 308 929 586
3 587 930 308
3 110 930 587
3 308 931 587
3 307 931 308
3 588 932 309
3 123 932 588
3 309 933 588
3 307 933 309
3 121 934 589
3 309 934 121
3 589 935 123
3 309 935 589
3 590 936 311
3 310 936 590
3 590 937 107
3 311 937 590
3 591 938 311
3 108 938 591
3 591 939 310
3 311 939 591
3 592 940 312
3 310 940 592
3 592 941 109
3 312 941 592
3 593 942 312
3 107 942 593
3 593 943 310
3 312 943 593
3 594 944 314
3 313 944 594
3 594 945 110
3 314 945 594
3 595 946 314
3 109 946 595
3 595 947 313
3 314 947 595
3 596 948 315
3 313 948 596
3 596 949 108
3 315 949 596
3 597 950 315
3 110 950 597
3 597 951 313
3 315 951 597
3 598 952 171
3 90 952 598
3 171 953 598
3 169 953 171
3 599 954 88
3 169 954 599
3 88 955 599
3 90 955 88
3 600 956 172
3 171 956 600
3 172 957 600
3 170 957 172
3 601 958 169
3 170 958 601
3 169 959 601
3 171 959 169
3 602 960 91
3 172 960 602
3 91 961 602
3 89 961 91
3 603 962 170
3 89 962 603
3 170 963 603
3 172 963 170
3 604 964 90
3 91 964 604
3 90 965 604
3 88 965 90
3 605 966 89
3 88 966 605
3 89 967 605
3 91 967 89
3 606 968 319
3 316 968 606
3 606 969 318
3 319 969 606
3 607 970 319
3 317 970 607
3 607 971 316
3 319 971 607
3 318 972 608
3 320 972 318
3 608 973 49
3 320 973 608
3 609 974 320
3 317 974 609
3 320 975 609
3 318 975 320
3 321 976 610
3 322 976 321
3 610 977 317
3 322 977 610
3 611 978 322
3 84 978 611
3 322 979 611
3 321 979 322
3 612 980 323
3 317 980 612
3 612 981 321
3 323 981 612
3 613 982 323
3 316 982 613
3 613 983 317
3 323 983 613
3 614 984 326
3 325 984 614
3 614 985 324
3 326 985 614
3 615 986 326
3 49 986 615
3 615 987 325
3 326 987 615
3 616 988 327
3 325 988 616
3 616 989 316
3 327 989 616
3 617 990 327
3 324 990 617
3 617 991 325
3 327 991 617
3 618 992 329
3 328 992 618
3 618 993 324
3 329 993 618
3 619 994 329
3 181 994 619
3 619 995 328
3 329 995 619
3 620 996 330
3 328 996 620
3 620 997 49
3 330 997 620
3 621 998 330
3 324 998 621
3 621 999 328
3 330 999 621
3 622 1000 334
3 331 1000 622
3 622 1001 333
3 334 1001 622
3 623 1002 334
3 332 1002 623
3 623 1003 331
3 334 1003 623
3 333 1004 624
3 335 1004 333
3 624 1005 209
3 335 1005 624
3 625 1006 335
3 332 1006 625
3 335 1007 625
3 333 1007 335
3 336 1008 626
3 337 1008 336
3 626 1009 332
3 337 1009 626
3 627 1010 337
3 181 1010 627
3 337 1011 627
3 336 1011 337
3 628 1012 338
3 332 1012 628
3 628 1013 336
3 338 1013 628
3 629 1014 338
3 331 1014 629
3 629 1015 332
3 338 1015 629
3 630 1016 341
3 340 1016 630
3 630 1017 339
3 341 1017 630
3 631 1018 341
3 209 1018 631
3 631 1019 340
3 341 1019 631
3 632 1020 342
3 340 1020 632
3 632 1021 331
3 342 1021 632
3 633 1022 342
3 339 1022 633
3 633 1023 340
3 342 1023 633
3 634 1024 344
3 343 1024 634
3 634 1025 339
3 344 1025 634
3 635 1026 344
3 84 1026 635
3 635 1027 343
3 344 1027 635
3 636 1028 345
3 343 1028 636
3 636 1029 209
3 345 1029 636
3 637 1030 345
3 339 1030 637
3 637 1031 343
3 345 1031 637
3 209 94 84
3 209 44 94
3 35 49 65
3 35 181 49
3 638 1032 349
3 347 1032 638
3 638 1033 346
3 349 1033 638
3 639 1034 349
3 348 1034 639
3 639 1035 347
3 349 1035 639
3 350 1036 348
3 640 1036 350
3 640 1037 150
3 350 1037 640
3 641 1038 350
3 347 1038 641
3 348 1039 350
3 641 1039 348
3 352 1040 351
3 642 1040 352
3 642 1041 347
3 352 1041 642
3 643 1042 352
3 165 1042 643
3 351 1043 352
3 643 1043 351
3 644 1044 353
3 346 1044 644
3 644 1045 347
3 353 1045 644
3 645 1046 353
3 351 1046 645
3 645 1047 346
3 353 1047 645
3 646 1048 356
3 355 1048 646
3 646 1049 354
3 356 1049 646
3 647 1050 356
3 49 1050 647
3 647 1051 355
3 356 1051 647
3 648 1052 357
3 355 1052 648
3 648 1053 150
3 357 1053 648
3 649 1054 357
3 354 1054 649
3 649 1055 355
3 357 1055 649
3 650 1056 359
3 358 1056 650
3 650 1057 354
3 359 1057 650
3 651 1058 359
3 346 1058 651
3 651 1059 358
3 359 1059 651
3 652 1060 360
3 358 1060 652
3 652 1061 49
3 360 1061 652
3 653 1062 360
3 354 1062 653
3 653 1063 358
3 360 1063 653
3 654 1064 364
3 362 1064 654
3 654 1065 361
3 364 1065 654
3 655 1066 364
3 363 1066 655
3 655 1067 362
3 364 1067 655
3 365 1068 363
3 656 1068 365
3 656 1069 84
3 365 1069 656
3 657 1070 365
3 362 1070 657
3 363 1071 365
3 657 1071 363
3 367 1072 366
3 658 1072 367
3 658 1073 362
3 367 1073 658
3 659 1074 367
3 49 1074 659
3 366 1075 367
3 659 1075 366
3 660 1076 368
3 361 1076 660
3 660 1077 362
3 368 1077 660
3 661 1078 368
3 366 1078 661
3 661 1079 361
3 368 1079 661
3 662 1080 371
3 370 1080 662
3 662 1081 369
3 371 1081 662
3 663 1082 371
3 165 1082 663
3 663 1083 370
3 371 1083 663
3 664 1084 372
3 370 1084 664
3 664 1085 84
3 372 1085 664
3 665 1086 372
3 369 1086 665
3 665 1087 370
3 372 1087 665
3 666 1088 374
3 373 1088 666
3 666 1089 369
3 374 1089 666
3 667 1090 374
3 361 1090 667
3 667 1091 373
3 374 1091 667
3 668 1092 375
3 373 1092 668
3 668 1093 165
3 375 1093 668
3 669 1094 375
3 369 1094 669
3 669 1095 373
3 375 1095 669
3 84 1 165
3 84 94 1
3 65 150 211
3 65 49 150
3 166 209 181
3 166 44 209
3 166 35 44
3 166 181 35
3 3 150 165
3 3 165 1
3 3 1 211
3 3 211 150
3 670 1096 376
3 8 1096 670
3 670 1097 130
3 376 1097 670
3 671 1098 8
3 376 1098 671
3 10 1099 8
3 671 1099 10
3 672 1100 377
3 132 1100 672
3 672 1101 10
3 377 1101 672
3 673 1102 132
3 377 1102 673
3 130 1103 132
3 673 1103 130
3 674 1104 378
3 9 1104 674
3 674 1105 8
3 378 1105 674
3 675 1106 9
3 378 1106 675
3 11 1107 9
3 675 1107 11
3 676 1108 379
3 10 1108 676
3 676 1109 11
3 379 1109 676
3 677 1110 10
3 379 1110 677
3 8 1111 10
3 677 1111 8
3 678 1112 380
3 131 1112 678
3 678 1113 9
3 380 1113 678
3 679 1114 131
3 380 1114 679
3 133 1115 131
3 679 1115 133
3 680 1116 381
3 11 1116 680
3 680 1117 133
3 381 1117 680
3 681 1118 11
3 381 1118 681
3 9 1119 11
3 681 1119 9
3 682 1120 382
3 130 1120 682
3 682 1121 131
3 382 1121 682
3 683 1122 130
3 382 1122 683
3 132 1123 130
3 683 1123 132
3 684 1124 383
3 133 1124 684
3 684 1125 132
3 383 1125 684
3 685 1126 133
3 383 1126 685
3 131 1127 133
3 685 1127 131
3 686 1128 384
3 386 1128 686
3 385 1129 384
3 686 1129 385
3 687 1130 386
3 50 1130 687
3 687 1131 385
3 386 1131 687
3 688 1132 387
3 385 1132 688
3 688 1133 80
3 387 1133 688
3 689 1134 385
3 387 1134 689
3 384 1135 385
3 689 1135 384
3 389 1136 388
3 690 1136 389
3 690 1137 50
3 389 1137 690
3 389 1138 691
3 388 1138 389
3 691 1139 384
3 388 1139 691
3 692 1140 390
3 52 1140 692
3 692 1141 50
3 390 1141 692
3 693 1142 390
3 388 1142 693
3 693 1143 52
3 390 1143 693
3 694 1144 391
3 393 1144 694
3 392 1145 391
3 694 1145 392
3 695 1146 393
3 82 1146 695
3 695 1147 392
3 393 1147 695
3 696 1148 394
3 392 1148 696
3 696 1149 52
3 394 1149 696
3 697 1150 392
3 394 1150 697
3 391 1151 392
3 697 1151 391
3 396 1152 395
3 698 1152 396
3 698 1153 82
3 396 1153 698
3 396 1154 699
3 395 1154 396
3 699 1155 391
3 395 1155 699
3 700 1156 397
3 80 1156 700
3 700 1157 82
3 397 1157 700
3 701 1158 397
3 395 1158 701
3 701 1159 80
3 397 1159 701
3 702 1160 398
3 400 1160 702
3 702 1161 399
3 398 1161 702
3 703 1162 400
3 51 1162 703
3 703 1163 399
3 400 1163 703
3 704 1164 401
3 399 1164 704
3 704 1165 50
3 401 1165 704
3 705 1166 399
3 401 1166 705
3 705 1167 398
3 399 1167 705
3 706 1168 403
3 402 1168 706
3 706 1169 51
3 403 1169 706
3 707 1170 402
3 403 1170 707
3 707 1171 398
3 402 1171 707
3 708 1172 404
3 402 1172 708
3 708 1173 53
3 404 1173 708
3 709 1174 404
3 51 1174 709
3 709 1175 402
3 404 1175 709
3 710 1176 405
3 407 1176 710
3 710 1177 406
3 405 1177 710
3 711 1178 407
3 52 1178 711
3 711 1179 406
3 407 1179 711
3 712 1180 408
3 406 1180 712
3 712 1181 53
3 408 1181 712
3 713 1182 405
3 406 1182 713
3 713 1183 408
3 405 1183 713
3 714 1184 410
3 409 1184 714
3 714 1185 52
3 410 1185 714
3 715 1186 410
3 405 1186 715
3 715 1187 409
3 410 1187 715
3 716 1188 50
3 411 1188 716
3 716 1189 409
3 50 1189 716
3 717 1190 411
3 52 1190 717
3 717 1191 409
3 411 1191 717
3 718 1192 412
3 414 1192 718
3 413 1193 412
3 718 1193 413
3 719 1194 414
3 81 1194 719
3 719 1195 413
3 414 1195 719
3 720 1196 415
3 413 1196 720
3 720 1197 51
3 415 1197 720
3 721 1198 413
3 415 1198 721
3 412 1199 413
3 721 1199 412
3 417 1200 416
3 722 1200 417
3 722 1201 81
3 417 1201 722
3 417 1202 723
3 416 1202 417
3 723 1203 412
3 416 1203 723
3 724 1204 418
3 83 1204 724
3 724 1205 81
3 418 1205 724
3 725 1206 418
3 416 1206 725
3 725 1207 83
3 418 1207 725
3 726 1208 419
3 421 1208 726
3 420 1209 419
3 726 1209 420
3 727 1210 421
3 53 1210 727
3 727 1211 420
3 421 1211 727
3 728 1212 422
3 420 1212 728
3 728 1213 83
3 422 1213 728
3 729 1214 420
3 422 1214 729
3 419 1215 420
3 729 1215 419
3 424 1216 423
3 730 1216 424
3 730 1217 53
3 424 1217 730
3 424 1218 731
3 423 1218 424
3 731 1219 419
3 423 1219 731
3 732 1220 425
3 51 1220 732
3 732 1221 53
3 425 1221 732
3 733 1222 425
3 423 1222 733
3 733 1223 51
3 425 1223 733
3 734 1224 426
3 428 1224 734
3 734 1225 427
3 426 1225 734
3 735 1226 428
3 80 1226 735
3 735 1227 427
3 428 1227 735
3 736 1228 429
3 427 1228 736
3 736 1229 81
3 429 1229 736
3 737 1230 427
3 429 1230 737
3 737 1231 426
3 427 1231 737
3 738 1232 431
3 430 1232 738
3 738 1233 80
3 431 1233 738
3 739 1234 430
3 431 1234 739
3 739 1235 426
3 430 1235 739
3 740 1236 432
3 430 1236 740
3 740 1237 82
3 432 1237 740
3 741 1238 432
3 80 1238 741
3 741 1239 430
3 432 1239 741
3 742 1240 433
3 435 1240 742
3 742 1241 434
3 433 1241 742
3 743 1242 435
3 83 1242 743
3 743 1243 434
3 435 1243 743
3 744 1244 436
3 434 1244 744
3 744 1245 82
3 436 1245 744
3 745 1246 433
3 434 1246 745
3 745 1247 436
3 433 1247 745
3 746 1248 438
3 437 1248 746
3 746 1249 83
3 438 1249 746
3 747 1250 438
3 433 1250 747
3 747 1251 437
3 438 1251 747
3 748 1252 81
3 439 1252 748
3 748 1253 437
3 81 1253 748
3 749 1254 439
3 83 1254 749
3 749 1255 437
3 439 1255 749
3 750 1256 38
3 441 1256 750
3 750 1257 440
3 38 1257 750
3 751 1258 441
3 7 1258 751
3 751 1259 440
3 441 1259 751
3 752 1260 442
3 440 1260 752
3 752 1261 41
3 442 1261 752
3 753 1262 440
3 442 1262 753
3 753 1263 38
3 440 1263 753
3 754 1264 443
3 129 1264 754
3 754 1265 444
3 443 1265 754
3 755 1266 444
3 152 1266 755
3 755 1267 443
3 444 1267 755
3 756 1268 445
3 443 1268 756
3 756 1269 97
3 445 1269 756
3 757 1270 129
3 443 1270 757
3 757 1271 445
3 129 1271 757
3 46 124 184
3 46 184 102
3 63 151 204
3 63 204 25
3 758 1272 205
3 446 1272 758
3 758 1273 61
3 205 1273 758
3 759 1274 446
3 106 1274 759
3 759 1275 61
3 446 1275 759
3 760 1276 188
3 106 1276 760
3 760 1277 447
3 188 1277 760
3 761 1278 447
3 205 1278 761
3 761 1279 188
3 447 1279 761