OFF

773 1542 0
0.140228 -0.245282 -0.294195
0.159022 -0.162134 -0.377247
0.019574 -0.101343 -0.296866
-0.022798 -0.317937 -0.275617
-0.052345 0.020678 -0.190978
-0.026697 0.008876 -0.110884
-0.100801 0.291636 -0.258843
0.051362 -0.248116 -0.008701
-0.119012 -0.262767 -0.237417
-0.032561 -0.184401 -0.010287
0.052097 -0.223637 0.016434
-0.065124 0.187515 -0.208276
0.166490 -0.311171 -0.378482
0.122797 -0.427654 -0.336213
0.147188 -0.390901 -0.350576
-0.080825 0.113067 -0.152474
0.138031 -0.448532 -0.105382
0.074628 -0.440366 -0.180153
0.190806 -0.272719 -0.374562
0.042407 -0.408080 -0.153831
-0.016730 -0.371727 -0.251404
-0.139580 0.053129 -0.110030
-0.078887 -0.064987 -0.233535
-0.083112 -0.073223 -0.248461
-0.077989 -0.105710 -0.278417
-0.088170 -0.134637 -0.273021
0.016582 -0.273067 -0.340712
-0.058147 -0.205978 -0.286730
-0.135662 -0.194967 -0.248990
-0.052144 -0.315508 -0.175447
-0.080314 -0.144758 -0.034784
-0.087009 -0.232937 -0.075021
-0.109419 -0.115336 -0.046056
-0.109955 0.122527 -0.143575
-0.066451 -0.255804 -0.077505
0.211507 -0.455660 -0.162072
-0.246933 0.233362 -0.184254
-0.082239 -0.187377 -0.274200
-0.025326 -0.156241 -0.185701
0.140360 -0.426466 -0.109404
-0.097739 0.290656 -0.251359
-0.044917 0.253741 -0.220543
-0.192650 0.149610 -0.086438
-0.152429 -0.129187 -0.208918
0.086096 -0.235416 -0.023984
-0.117749 0.186967 -0.154618
-0.237328 0.192656 -0.145241
0.136878 -0.327115 -0.071955
0.016958 -0.164138 -0.038845
0.105632 -0.283609 0.005267
0.122745 -0.319071 -0.037591
0.119948 -0.193798 -0.101216
0.111730 -0.259365 -0.049021
-0.133125 0.204902 -0.171170
-0.184629 0.237379 -0.198053
0.155249 -0.342820 -0.134291
0.126906 -0.247269 -0.100453
-0.171807 0.222894 -0.185670
-0.126188 0.235944 -0.203832
-0.220037 0.230642 -0.187505
0.119382 -0.219817 -0.086203
0.097164 -0.233507 -0.045060
0.134441 -0.292822 -0.094113
0.162112 -0.379449 -0.110839
-0.149717 0.251203 -0.214519
-0.138929 0.218592 -0.186551
0.154578 -0.329041 -0.256223
0.111148 -0.285526 -0.017607
0.151606 -0.356476 -0.088626
0.136960 -0.354475 -0.057650
0.145041 -0.320116 -0.103130
-0.092640 0.004420 -0.075394
0.047564 -0.117266 -0.119472
0.009411 -0.138442 -0.048711
-0.231123 0.179958 -0.127909
-0.236617 0.218422 -0.173137
-0.225251 0.246907 -0.203177
-0.204798 0.276262 -0.227033
-0.156015 0.233252 -0.198653
0.136362 -0.209820 -0.200508
-0.060673 0.271375 -0.233812
-0.152823 0.121953 -0.088127
-0.169620 0.170823 -0.118371
-0.117540 0.089089 -0.088921
-0.057876 -0.112025 -0.018912
0.013246 -0.106778 -0.108710
0.116768 -0.312827 -0.018395
-0.016951 -0.127542 -0.225019
-0.018903 -0.140801 -0.177870
-0.038854 -0.069396 -0.104350
0.098550 -0.270460 0.015393
0.084079 -0.249541 0.024325
0.186555 -0.403966 -0.124262
0.222980 -0.419377 -0.164268
0.140681 -0.144977 -0.237755
-0.009235 -0.137022 -0.200497
0.146265 -0.284043 -0.316434
0.122835 -0.337633 -0.039294
0.129229 -0.378656 -0.062040
0.135605 -0.238930 -0.158868
0.142849 -0.287671 -0.160598
0.139893 -0.229296 -0.246258
0.116170 -0.143697 -0.162103
0.127121 -0.220386 -0.115863
0.116447 -0.243094 -0.068799
0.013067 -0.107612 -0.075850
-0.048493 -0.114577 -0.059307
-0.120192 0.043189 -0.071575
-0.159380 0.281733 -0.241806
-0.216187 0.202702 -0.158857
-0.199629 0.252287 -0.209305
-0.147528 0.151211 -0.104528
-0.161164 0.208831 -0.172154
-0.023384 -0.130245 -0.201721
0.010013 -0.127808 -0.185377
0.032529 -0.117549 -0.187549
-0.072969 0.256672 -0.217480
-0.138605 0.192183 -0.152507
-0.054767 0.019871 -0.099022
-0.088974 0.096036 -0.109373
-0.059188 -0.072159 -0.076872
0.078129 -0.147781 -0.097765
0.134453 -0.163615 -0.197494
0.064499 -0.160530 -0.065742
0.053443 -0.113944 -0.152205
0.121132 -0.280021 -0.062511
0.033755 -0.130850 -0.054588
0.223994 -0.422091 -0.264754
0.169186 -0.366386 -0.258510
0.145351 -0.293524 -0.206684
0.074969 -0.234941 0.005972
0.170457 -0.379673 -0.300080
0.139423 -0.191000 -0.241619
0.178727 -0.363281 -0.181815
0.188480 -0.407926 -0.261816
0.200235 -0.387716 -0.211211
0.225933 -0.416449 -0.190189
0.200333 -0.427129 -0.137124
0.208686 -0.395260 -0.155425
0.125400 -0.369261 -0.044679
0.165390 -0.406606 -0.106283
0.103313 -0.395603 -0.081526
0.063510 -0.217761 -0.011141
-0.018378 -0.099781 -0.103159
0.118146 -0.165036 -0.113839
0.043685 -0.169493 -0.039375
0.044251 -0.125951 -0.084201
-0.146448 0.088882 -0.078057
-0.042114 0.069171 -0.112013
-0.087932 0.155058 -0.135213
-0.063793 -0.027425 -0.089513
-0.086801 0.051018 -0.088821
-0.028094 -0.119929 -0.226062
0.012335 -0.117546 -0.214561
-0.008664 -0.106528 -0.178665
-0.185643 0.186203 -0.141414
-0.122944 0.260889 -0.223995
-0.170194 0.259468 -0.220909
-0.089556 0.179344 -0.165424
-0.198243 0.226598 -0.186202
-0.130565 0.176655 -0.127261
-0.031708 -0.154679 -0.036818
-0.050006 -0.152347 -0.087161
0.128633 -0.306755 -0.055084
-0.060753 0.109723 -0.139411
-0.028782 -0.148728 -0.066570
-0.002148 -0.130987 -0.156388
0.023365 -0.119116 -0.165685
0.097612 -0.254979 -0.015752
0.137151 -0.278329 -0.116698
0.077435 -0.202449 -0.050628
0.084575 -0.131246 -0.135446
0.151368 -0.333080 -0.162135
0.110307 -0.418544 -0.105645
0.170687 -0.429737 -0.126822
0.226810 -0.451818 -0.188787
0.192448 -0.477115 -0.258128
0.173933 -0.487468 -0.249754
0.135890 -0.406985 -0.085909
0.144657 -0.295889 -0.254956
0.169339 -0.375265 -0.137607
0.129635 -0.186856 -0.156943
0.161851 -0.331009 -0.303456
0.180137 -0.307053 -0.352590
0.136715 -0.275836 -0.351650
0.191611 -0.356967 -0.348462
0.228798 -0.340608 -0.342891
0.212084 -0.288355 -0.357658
0.255952 -0.274225 -0.349400
0.286869 -0.271693 -0.343410
0.283692 -0.278360 -0.344609
0.278108 -0.282573 -0.346594
0.248187 -0.299358 -0.362475
0.140028 -0.251605 -0.202961
0.157227 -0.360224 -0.210257
0.185011 -0.351457 -0.205808
0.197797 -0.361196 -0.189707
0.193942 -0.378162 -0.129378
0.245682 -0.441728 -0.233670
0.241129 -0.451586 -0.227214
0.218213 -0.462623 -0.230197
0.189030 -0.477207 -0.224113
0.200429 -0.467304 -0.185501
0.169264 -0.484917 -0.212615
0.156847 -0.387409 -0.073187
0.105440 -0.379298 -0.068255
0.114473 -0.336883 -0.018118
0.123552 -0.385097 -0.052046
0.110052 -0.361512 -0.027529
0.103568 -0.328576 -0.005392
0.098226 -0.345854 -0.020288
0.114577 -0.195972 -0.073947
0.105559 -0.186147 -0.073649
0.134301 -0.112990 -0.193921
-0.005659 -0.146762 -0.175886
-0.014650 -0.151598 -0.154509
0.013866 -0.094602 -0.138768
0.013329 -0.097105 -0.040188
-0.018655 -0.096778 -0.068750
-0.061816 -0.111525 -0.110911
-0.067509 -0.117977 -0.118646
-0.050344 -0.107962 -0.101960
-0.119369 0.127367 -0.099886
-0.094733 0.140836 -0.098215
-0.092319 0.158395 -0.102205
-0.099439 0.166662 -0.106498
-0.110117 0.158803 -0.106383
-0.099607 0.213692 -0.188847
-0.085291 0.241220 -0.201835
-0.088699 0.275057 -0.230062
-0.036475 -0.324052 -0.245386
-0.213749 0.298523 -0.239386
-0.230449 0.270795 -0.220803
-0.200325 0.274141 -0.238602
-0.183293 0.233296 -0.206240
0.118077 -0.406201 -0.057869
0.104879 -0.383491 -0.042732
0.094899 -0.327036 -0.009066
-0.027782 -0.327922 -0.263657
-0.112961 -0.095054 -0.242364
-0.147374 -0.109974 -0.216860
-0.117922 -0.154391 -0.249216
0.008383 -0.096833 -0.292447
0.002869 -0.258832 -0.319370
-0.064500 -0.285359 -0.273150
0.090839 -0.261559 0.043915
-0.155361 0.161170 -0.121098
-0.136136 -0.141709 -0.231244
-0.078246 0.031136 -0.162076
-0.069179 0.057136 -0.162631
-0.158385 -0.150934 -0.124609
0.088228 -0.391478 -0.067418
0.044454 -0.294844 -0.040460
0.065393 -0.407939 -0.352798
0.098043 -0.428011 -0.118662
-0.136166 -0.212476 -0.233359
-0.151846 -0.164262 -0.216287
0.061253 -0.415084 -0.143114
-0.137930 -0.039239 -0.107103
-0.174136 0.186867 -0.190040
0.048049 -0.229097 -0.348531
-0.090255 -0.275593 -0.153077
0.082168 -0.467625 -0.292678
0.239649 -0.251942 -0.364536
-0.157483 -0.148401 -0.200976
-0.075254 0.003162 -0.184949
-0.040898 -0.276689 -0.277026
-0.000112 -0.271136 -0.308564
-0.032847 -0.255600 -0.059957
0.249808 -0.255724 -0.366248
0.036314 -0.391485 -0.136176
-0.137129 0.162014 -0.156446
0.001843 -0.324859 -0.301827
-0.122350 0.101894 -0.129147
0.086881 -0.293311 -0.003296
-0.070384 -0.299296 -0.148160
-0.230126 0.168906 -0.118957
-0.023611 -0.215128 -0.015688
0.086177 -0.254927 0.045520
-0.027200 -0.321112 -0.246969
-0.102305 -0.250040 -0.118991
0.070142 -0.246570 0.024770
-0.006717 -0.344393 -0.128669
0.116706 -0.472884 -0.287463
-0.153001 0.074257 -0.092247
0.048858 -0.405494 -0.343082
-0.198006 0.214393 -0.199188
-0.059177 0.227950 -0.211784
-0.069483 0.029305 -0.171924
-0.088763 0.273454 -0.239581
-0.134881 -0.208560 -0.135893
0.109023 -0.445466 -0.323236
-0.014804 -0.368150 -0.158669
-0.164267 -0.126552 -0.194391
-0.093337 0.163677 -0.200329
0.119086 -0.484416 -0.263919
-0.095698 0.210332 -0.208414
0.119486 -0.466411 -0.304794
0.013988 -0.156300 -0.319377
-0.104714 0.073208 -0.135644
-0.126651 -0.227912 -0.228632
0.198784 -0.291040 -0.376148
-0.137776 -0.102245 -0.082344
0.011042 -0.132669 -0.310461
0.064983 -0.473935 -0.252499
-0.087508 0.041647 -0.151353
-0.138206 -0.214115 -0.171536
0.006157 -0.222109 -0.322772
-0.125980 0.014607 -0.130775
0.000172 -0.242923 -0.322714
-0.116149 -0.231859 -0.116695
-0.057746 -0.298260 -0.121744
-0.115893 0.170313 -0.199320
-0.106698 -0.139799 -0.053538
-0.002537 -0.282220 -0.066187
-0.066224 0.270655 -0.234986
0.050962 -0.237609 -0.353744
-0.161815 -0.093926 -0.199332
-0.140001 -0.061411 -0.194542
-0.153589 0.174931 -0.181171
-0.050178 -0.311742 -0.123593
0.086219 -0.353817 -0.027896
0.081073 -0.313911 -0.021665
0.068265 -0.283112 -0.018308
-0.130168 -0.102514 -0.229612
-0.167165 -0.105619 -0.150737
0.011922 -0.306313 -0.323655
0.231079 -0.270909 -0.373815
-0.210342 0.249232 -0.215968
-0.095050 -0.260423 -0.123527
0.067520 -0.384266 -0.087103
0.076104 -0.411611 -0.107321
-0.018224 -0.341631 -0.202814
-0.000440 -0.324848 -0.097660
-0.145638 -0.179694 -0.231276
0.068237 -0.470108 -0.228931
-0.133870 0.090356 -0.117182
-0.159096 -0.083513 -0.170249
-0.062097 -0.306337 -0.186058
-0.039669 -0.310912 -0.247943
-0.120227 0.196210 -0.203248
0.025035 -0.207325 -0.331190
0.074361 -0.380240 -0.367100
-0.096972 0.101038 -0.143705
-0.020272 -0.155374 -0.308782
0.008605 -0.400442 -0.201599
-0.119418 -0.215438 -0.106666
-0.094978 0.053397 -0.143566
-0.212907 0.174848 -0.149197
0.089250 -0.372756 -0.049137
-0.027911 -0.352339 -0.181181
0.011464 -0.401858 -0.229098
-0.017814 -0.307952 -0.287577
0.040072 -0.440390 -0.239076
0.067615 -0.302113 -0.023172
0.040551 -0.436278 -0.212634
-0.118604 0.255954 -0.230931
-0.145392 -0.199299 -0.159326
0.172737 -0.456804 -0.134802
-0.021194 -0.327320 -0.216031
0.025496 -0.431732 -0.262191
-0.021360 -0.258439 -0.056793
-0.158010 0.171035 -0.162304
0.020347 -0.361116 -0.114926
-0.111820 0.164607 -0.172930
0.054035 -0.463095 -0.241399
0.081708 -0.330613 -0.024126
0.016190 -0.197485 -0.331920
-0.030261 -0.124154 -0.296859
-0.127638 -0.081000 -0.064292
-0.110428 -0.254440 -0.176851
0.015476 -0.246408 -0.329469
0.064938 -0.455405 -0.295062
0.159614 -0.299014 -0.377473
-0.044915 -0.307282 -0.233899
-0.158067 -0.111811 -0.114962
0.128817 -0.480401 -0.276138
0.211004 -0.468770 -0.272363
-0.168342 -0.141292 -0.172933
-0.017297 -0.268019 -0.280902
-0.124548 -0.118382 -0.236804
-0.160307 -0.095182 -0.180102
0.027318 -0.425239 -0.312244
0.024413 -0.265168 -0.037444
0.124104 -0.400393 -0.353554
-0.172753 0.116347 -0.080995
-0.021235 -0.368934 -0.198592
0.043912 -0.192540 -0.339608
-0.205672 0.226650 -0.201288
0.039832 -0.456082 -0.253866
0.009048 -0.376735 -0.308024
0.144070 -0.483557 -0.274941
0.115987 -0.433934 -0.104928
-0.057720 -0.311858 -0.144001
-0.144757 0.182089 -0.198082
-0.037583 -0.212677 -0.301843
-0.151564 -0.177756 -0.151730
-0.049243 -0.250460 -0.064079
0.003679 -0.394589 -0.283807
-0.121374 -0.032827 -0.172370
0.026167 -0.393775 -0.153332
-0.150092 -0.165216 -0.131147
0.119520 -0.405768 -0.351732
-0.018431 -0.343971 -0.234987
-0.040053 -0.323054 -0.197046
-0.128880 -0.233361 -0.151116
-0.111098 -0.251931 -0.137427
-0.072050 -0.297167 -0.196669
0.006972 -0.261645 -0.046642
-0.003094 -0.283441 -0.297759
0.138018 -0.401652 -0.346932
0.023484 -0.339449 -0.334200
-0.006929 -0.367218 -0.285925
-0.228052 0.220004 -0.196336
-0.081750 -0.290624 -0.231673
-0.014709 -0.314984 -0.101827
-0.150317 -0.127326 -0.100615
0.243009 -0.456079 -0.265492
0.008490 -0.342926 -0.107998
0.218213 -0.268843 -0.372806
0.077989 -0.436025 -0.329334
-0.101309 -0.088520 -0.024160
0.004880 -0.382266 -0.155376
-0.120670 -0.247625 -0.193573
0.214590 -0.346460 -0.359949
0.175015 -0.393419 -0.337332
0.029167 -0.254880 -0.027671
0.048349 -0.310915 -0.043048
-0.155312 0.202511 -0.196246
0.063786 -0.232083 0.044810
-0.078407 0.235614 -0.215186
-0.113507 0.154774 -0.149361
0.114968 -0.357948 -0.374008
-0.156315 -0.170980 -0.195277
-0.078117 -0.271885 -0.104003
-0.132249 0.028825 -0.117209
-0.010559 -0.210111 -0.312812
-0.190985 0.145692 -0.086485
-0.059924 0.043859 -0.169591
0.043173 -0.447053 -0.271574
0.026812 -0.175605 -0.330418
-0.037416 -0.330922 -0.170744
-0.052192 -0.139856 -0.290909
0.098625 -0.307394 0.008540
0.214268 -0.277271 -0.374007
-0.037907 -0.303545 -0.103065
-0.155511 0.262466 -0.237126
-0.117595 -0.243622 -0.224101
-0.228702 0.246281 -0.209246
0.021805 -0.433160 -0.291517
-0.162265 -0.143623 -0.141838
-0.018508 -0.356122 -0.211433
-0.131780 -0.167042 -0.240246
0.034848 -0.281031 -0.041145
0.054393 -0.353762 -0.362730
-0.006862 -0.249397 -0.308118
0.137639 -0.476593 -0.288269
-0.100246 -0.268995 -0.173157
-0.215387 0.272468 -0.229703
-0.097202 -0.121798 -0.262801
-0.024001 -0.195212 -0.313262
0.120948 -0.283421 -0.369027
-0.222099 0.284659 -0.230095
-0.009991 -0.385738 -0.193600
-0.070005 -0.195891 -0.279824
-0.152380 -0.071645 -0.181420
0.019903 -0.377616 -0.136338
0.027467 -0.341093 -0.087493
-0.179608 -0.125020 -0.154994
-0.147969 0.013052 -0.081100
0.255909 -0.350401 -0.341387
-0.066833 -0.279412 -0.114373
-0.108167 0.024631 -0.141369
-0.249197 0.185335 -0.143148
-0.006547 -0.309027 -0.306950
-0.123588 -0.115493 -0.063665
-0.046325 -0.198921 -0.301046
-0.145243 -0.066859 -0.155239
0.087709 -0.399615 -0.360112
-0.103338 -0.282794 -0.227211
0.107199 -0.294842 0.018016
0.086946 -0.424200 -0.343791
-0.021528 -0.357645 -0.262376
-0.153668 0.145486 -0.112238
-0.098592 -0.141806 -0.259188
-0.043201 -0.288095 -0.095032
-0.091537 0.135192 -0.148815
-0.042720 -0.321023 -0.134012
-0.015825 -0.339913 -0.288191
-0.104951 -0.257741 -0.141863
-0.165889 0.207204 -0.196673
-0.097458 0.243260 -0.218544
-0.073263 -0.297959 -0.259220
-0.183692 0.278387 -0.245999
-0.127249 -0.221207 -0.127113
-0.139596 0.245087 -0.218777
-0.143402 -0.197610 -0.233404
0.177309 -0.485367 -0.277908
0.048692 -0.174807 -0.334830
-0.092773 0.162097 -0.171388
-0.074889 -0.295928 -0.170751
-0.193427 0.191179 -0.191088
-0.076709 0.161388 -0.188579
0.016019 -0.396065 -0.170487
0.117958 -0.430234 -0.083902
-0.138674 -0.019299 -0.110848
-0.107562 -0.138094 -0.256009
0.034925 -0.372966 -0.117299
-0.050866 -0.271429 -0.082688
-0.144275 -0.151971 -0.102429
0.053091 -0.377916 -0.358945
0.046445 -0.339261 -0.066987
0.148906 -0.410537 -0.336773
-0.017803 -0.241311 -0.299998
0.034787 -0.370091 -0.347183
0.068517 -0.334191 -0.039185
-0.067667 0.091658 -0.157048
-0.113627 0.269959 -0.241840
-0.129343 -0.042886 -0.158816
-0.115444 -0.014547 -0.156128
-0.061615 -0.299767 -0.217884
0.071576 -0.399466 -0.092105
0.135917 -0.490747 -0.256675
-0.123378 0.143362 -0.138338
-0.116973 0.230707 -0.210498
-0.005172 -0.368662 -0.139933
-0.069536 -0.178376 -0.286949
0.076225 -0.261130 0.004694
-0.101579 -0.232398 -0.095858
0.112086 -0.484138 -0.241543
-0.124484 -0.078881 -0.217357
-0.082223 -0.285574 -0.161762
-0.139700 -0.180640 -0.119401
-0.158045 -0.164000 -0.162842
-0.096989 -0.269589 -0.190880
-0.124686 -0.049629 -0.196039
0.082951 -0.376857 -0.062959
-0.138469 -0.042136 -0.087484
-0.144290 0.038816 -0.098621
0.128391 -0.314353 -0.375517
-0.144342 -0.070822 -0.133562
-0.114830 0.060939 -0.126760
0.141744 -0.466942 -0.300481
-0.026617 -0.314301 -0.230282
-0.058950 -0.189231 -0.294395
-0.143896 -0.190809 -0.140061
0.094827 -0.402834 -0.074987
0.104813 -0.227264 -0.365835
0.050303 -0.460770 -0.279723
-0.247061 0.243329 -0.202524
0.027179 -0.348248 -0.098959
-0.003585 -0.092815 -0.290289
0.134064 -0.484396 -0.220485
-0.131122 0.115110 -0.123140
-0.001353 -0.154868 -0.313545
0.047973 -0.371594 -0.100243
0.021173 -0.322397 -0.073886
-0.018791 -0.370613 -0.220052
-0.136544 -0.211338 -0.153714
-0.157843 0.121297 -0.100128
0.053733 -0.354742 -0.075087
0.108195 -0.371583 -0.369406
0.097228 -0.465879 -0.309107
-0.125789 -0.062661 -0.208011
-0.197441 0.178969 -0.165063
-0.205717 0.170135 -0.125082
-0.127776 0.081834 -0.122368
0.155460 -0.499831 -0.247242
-0.024436 -0.367639 -0.177406
-0.094598 0.085477 -0.144529
-0.124537 -0.130689 -0.070824
-0.130973 -0.240914 -0.210259
-0.240282 0.179533 -0.157102
0.067424 -0.468160 -0.270568
0.005173 -0.286154 -0.318448
0.100710 -0.280885 0.021177
-0.139741 -0.221717 -0.213013
0.102256 -0.478084 -0.271163
0.013741 -0.291850 -0.061683
-0.017010 -0.166220 -0.312706
-0.134746 -0.034609 -0.125445
-0.136487 0.218155 -0.202451
0.028082 -0.233984 -0.339567
-0.165607 -0.106115 -0.138989
0.053524 -0.323144 -0.047543
-0.079550 0.079471 -0.155796
0.104719 -0.412367 -0.076314
-0.113178 0.041408 -0.130072
-0.098064 -0.154215 -0.054273
0.091360 -0.418534 -0.094759
0.030540 -0.403988 -0.334120
-0.115168 -0.253320 -0.206296
-0.117003 -0.071083 -0.035450
-0.236263 0.191778 -0.171803
0.075780 -0.341726 -0.368146
-0.150045 0.054671 -0.096882
-0.153672 -0.188778 -0.181645
0.084546 -0.475550 -0.261412
0.060525 -0.446709 -0.199676
-0.171923 -0.114725 -0.172733
0.217522 -0.358134 -0.352350
-0.046790 -0.311940 -0.206318
0.042400 -0.338478 -0.350476
-0.032666 -0.177573 -0.311867
-0.112200 0.219761 -0.210743
0.060848 -0.404689 -0.119882
-0.001985 -0.180437 -0.323531
-0.127758 -0.172156 -0.096582
0.001809 -0.348248 -0.309696
-0.119082 -0.037883 -0.186731
-0.111747 -0.082987 -0.042925
0.061022 -0.370223 -0.083186
-0.131390 -0.050205 -0.140229
-0.059254 0.214836 -0.209954
-0.007878 -0.133175 -0.305697
0.233784 -0.342593 -0.354467
-0.033439 -0.331059 -0.147824
-0.159240 0.099454 -0.086908
-0.122515 -0.232610 -0.133905
-0.141328 0.000739 -0.116797
-0.013543 -0.281986 -0.278189
-0.153158 -0.180728 -0.208052
-0.253571 0.230266 -0.191202
0.055789 -0.384027 -0.340699
-0.113119 0.089010 -0.134936
-0.146417 -0.201847 -0.218342
0.024685 -0.386632 -0.330591
-0.140053 -0.016648 -0.093953
0.218006 -0.461919 -0.274529
-0.170612 0.139014 -0.093964
-0.146671 0.102730 -0.106927
-0.134685 -0.031315 -0.055960
-0.078544 -0.277503 -0.133725
-0.157077 0.058579 -0.082097
-0.079699 -0.126458 -0.029038
0.140825 -0.499261 -0.228531
-0.101812 0.012297 -0.153320
-0.022052 -0.327299 -0.121433
0.250045 -0.327053 -0.356584
-0.025117 -0.311884 -0.108284
0.145313 -0.323075 -0.370868
-0.094227 -0.289694 -0.254234
0.043514 -0.312228 -0.345491
0.006904 -0.312533 -0.078054
-0.137147 -0.231616 -0.199058
-0.020222 -0.292882 -0.084626
-0.080999 -0.286216 -0.209082
-0.114852 -0.255059 -0.160199
-0.171825 0.171741 -0.137904
-0.061046 0.251734 -0.222789
0.013816 -0.408882 -0.257234
-0.133249 0.131950 -0.127315
-0.001401 -0.392956 -0.220951
-0.031512 -0.150773 -0.302427
-0.172532 0.258468 -0.230153
-0.143642 0.128000 -0.112761
0.106798 -0.287751 0.028920
-0.126792 -0.174679 -0.249103
-0.052721 -0.307523 -0.265605
-0.097257 0.000738 -0.164925
-0.009316 -0.384480 -0.239364
0.114567 -0.339567 -0.370919
-0.093110 0.258357 -0.229063
-0.154740 0.047399 -0.068833
0.020275 -0.356390 -0.331264
-0.163838 0.077905 -0.070108
0.032122 -0.412429 -0.179796
0.028229 -0.422021 -0.231937
0.016993 -0.418764 -0.286025
-0.014219 -0.256040 -0.293706
0.051358 -0.425026 -0.333927
-0.079043 0.014752 -0.174256
0.033200 -0.444366 -0.294450
-0.079363 -0.287526 -0.263692
-0.115815 -0.163673 -0.073762
0.083822 -0.356059 -0.370971
-0.082417 0.202572 -0.207078
-0.125486 -0.145885 -0.077983
-0.105539 -0.106039 -0.253156
-0.070572 0.255557 -0.224468
0.103152 -0.398840 -0.062644
-0.021924 -0.345859 -0.149340
0.014789 -0.400371 -0.309672
0.087659 -0.446268 -0.307514
-0.055145 -0.168371 -0.299156
-0.010939 -0.110493 -0.294653
0.152322 -0.500000 -0.265625
0.026693 -0.322508 -0.337135
-0.032108 -0.306009 -0.275263
0.066332 -0.346539 -0.047442
0.088535 -0.479037 -0.247021
-0.097467 0.139929 -0.145726
0.078343 -0.244353 -0.360907
-0.161444 0.239192 -0.212509
0.057589 -0.438322 -0.196394
-0.093512 -0.248149 -0.100555
-0.260081 0.217203 -0.179880
0.020644 -0.306576 -0.062612
0.033909 -0.251008 -0.349993
-0.127947 -0.052792 -0.049713
0.083532 -0.261345 0.024305
0.046423 -0.453052 -0.219198
-0.155362 0.039935 -0.085830
-0.002555 -0.384002 -0.174488
-0.187569 0.165622 -0.116277
-0.143084 0.159884 -0.135653
-0.136953 -0.121410 -0.082140
-0.148002 -0.206378 -0.202114
-0.018115 -0.274870 -0.070837
-0.148373 0.009100 -0.099135
-0.066304 -0.303893 -0.157376
-0.112448 -0.102006 -0.043913
-0.063212 -0.300263 -0.237515
0.060239 -0.393565 -0.355516
0.045867 -0.353570 -0.089919
-0.233721 0.175363 -0.137340
-0.118574 0.001203 -0.143762
0.110172 -0.301430 -0.366565
0.196037 -0.344990 -0.364148
-0.007365 -0.302668 -0.082221
0.170245 -0.276994 -0.370847
-0.151209 -0.084904 -0.213157
-0.154722 -0.086218 -0.146479
0.084487 -0.281999 0.001435
0.012590 -0.336264 -0.323970
-0.124762 -0.092616 -0.062635
-0.135844 -0.018877 -0.051201
-0.235426 0.203348 -0.185560
-0.107277 -0.071421 -0.230108
-0.157642 0.227541 -0.203305
0.001085 -0.396945 -0.258898
-0.005079 -0.231642 -0.312373
-0.219364 0.183548 -0.169589
0.162265 -0.480362 -0.283207
-0.008423 -0.383428 -0.259273
0.138836 -0.345013 -0.376511
0.014331 -0.289686 -0.332130
-0.033316 -0.334167 -0.187775
-0.097467 -0.272277 -0.210200
-0.262377 0.206255 -0.164418
-0.177726 0.175002 -0.163683
-0.130468 -0.239147 -0.183264
-0.131569 -0.059277 -0.066394
0.097167 -0.329691 -0.373561
0.073620 -0.362020 -0.055541
-0.185180 0.211515 -0.197721
-0.023107 -0.335947 -0.249322
-0.039685 -0.290462 -0.275906
0.051776 -0.439390 -0.315852
-0.026035 -0.230420 -0.299040
-0.126579 -0.025664 -0.142710
0.001659 -0.355794 -0.123966
-0.119373 -0.123013 -0.241478
-0.141432 -0.013996 -0.077058
-0.172058 -0.129051 -0.134266
-0.090509 0.178914 -0.203798
-0.130867 0.167117 -0.174472
-0.212718 0.195490 -0.192136
-0.132262 -0.011474 -0.128955
0.055252 -0.388057 -0.108653
-0.127460 -0.202957 -0.115601
-0.088573 -0.281572 -0.189865
-0.191437 0.253850 -0.223060
0.038751 -0.420825 -0.190179
-0.160361 -0.154951 -0.183235
0.123425 -0.305480 -0.370347
-0.192366 0.173294 -0.143550
-0.133932 -0.133732 -0.083047
0.023396 -0.416024 -0.204895
-0.147566 0.017005 -0.063065
-0.128479 0.200925 -0.204412
-0.264673 0.195307 -0.148956
0.055537 -0.271081 -0.018225
3 263 189 269
3 263 1 189
3 1 188 189
3 1 187 188
3 1 184 187
3 1 94 184
3 1 213 94
3 1 2 213
3 94 0 184
3 189 191 269
3 2 153 213
3 2 87 153
3 94 132 0
3 1 498 2
3 1 547 498
3 547 387 498
3 547 260 387
3 547 316 260
3 547 692 316
3 1 720 547
3 1 18 720
3 720 461 547
3 132 101 0
3 720 373 461
3 373 765 461
3 765 717 461
3 316 698 260
3 269 419 263
3 438 152 4
3 152 551 4
3 152 242 551
3 438 516 152
3 516 164 152
3 516 15 164
3 15 486 164
3 486 499 164
3 499 502 164
3 152 2 242
3 438 249 516
3 551 22 4
3 249 585 516
3 3 238 688
3 2 152 87
3 164 148 152
3 148 5 152
3 153 102 213
3 502 11 164
3 11 613 164
3 613 41 164
3 5 154 152
3 5 216 154
3 153 115 102
3 41 158 164
3 41 228 158
3 228 227 158
3 5 143 216
3 115 124 102
3 5 89 143
3 152 38 87
3 498 303 2
3 498 298 303
3 498 440 298
3 124 171 102
3 5 150 89
3 143 85 216
3 148 118 5
3 260 582 387
3 303 614 2
3 440 606 298
3 493 231 108
3 108 6 493
3 108 40 6
3 493 233 231
3 6 446 493
3 6 517 446
3 108 156 40
3 156 229 40
3 517 356 446
3 446 654 493
3 356 495 446
3 48 10 145
3 48 9 10
3 9 429 10
3 9 277 429
3 10 142 145
3 277 7 429
3 7 281 429
3 48 161 9
3 277 426 7
3 142 170 145
3 277 408 426
3 277 361 408
3 277 268 361
3 277 397 268
3 268 508 361
3 244 673 266
3 673 379 266
3 673 641 379
3 641 8 379
3 8 447 379
3 447 27 379
3 447 464 27
3 447 300 464
3 300 28 464
3 300 255 28
3 28 37 464
3 27 749 379
3 749 513 379
3 513 669 379
3 28 657 37
3 657 241 37
3 241 484 37
3 484 25 37
3 613 287 41
3 287 649 41
3 649 80 41
3 551 23 22
3 649 315 80
3 735 14 432
3 735 718 14
3 718 424 14
3 424 600 14
3 600 425 14
3 14 561 432
3 14 384 561
3 384 402 561
3 402 478 561
3 402 481 478
3 481 253 478
3 478 342 561
3 316 26 698
3 316 736 26
3 316 642 736
3 316 717 642
3 717 743 642
3 743 594 642
3 594 602 642
3 594 454 602
3 316 692 717
3 692 461 717
3 692 547 461
3 665 147 437
3 665 663 147
3 663 769 147
3 769 107 147
3 769 726 107
3 726 699 107
3 699 71 107
3 699 592 71
3 592 421 71
3 421 84 71
3 84 120 71
3 120 150 71
3 726 631 699
3 84 106 120
3 769 753 726
3 147 42 437
3 258 540 537
3 540 742 537
3 540 302 742
3 302 369 742
3 258 612 540
3 258 580 612
3 540 375 302
3 540 583 375
3 540 722 583
3 375 416 302
3 583 754 375
3 315 40 80
3 315 6 40
3 551 24 23
3 551 368 24
3 368 442 24
3 442 25 24
3 442 37 25
3 442 526 37
3 641 479 8
3 502 294 11
3 27 395 749
3 486 691 499
3 691 431 499
3 442 684 526
3 158 149 164
3 22 265 4
3 22 728 265
3 728 563 265
3 563 535 265
3 535 609 265
3 152 113 38
3 315 289 6
3 38 95 87
3 728 530 563
3 609 659 265
3 609 399 659
3 649 679 315
3 231 77 108
3 24 678 23
3 659 671 265
3 24 459 678
3 298 554 303
3 530 721 563
3 486 33 691
3 659 248 671
3 535 318 609
3 613 676 287
3 649 430 679
3 638 327 192
3 638 301 327
3 638 718 301
3 718 12 301
3 718 640 12
3 718 735 640
3 127 131 134
3 127 185 131
3 127 470 185
3 127 417 470
3 470 186 185
3 417 628 470
3 628 600 470
3 628 425 600
3 628 512 425
3 628 542 512
3 542 13 512
3 542 297 13
3 297 291 13
3 297 562 291
3 628 733 542
3 291 481 13
3 481 402 13
3 127 198 417
3 733 456 542
3 291 420 481
3 425 410 14
3 504 16 173
3 16 39 173
3 16 358 39
3 16 203 358
3 16 552 203
3 16 17 552
3 17 529 552
3 17 335 529
3 335 690 529
3 203 202 358
3 202 35 358
3 17 598 335
3 552 635 203
3 16 392 17
3 392 254 17
3 358 174 39
3 598 701 335
3 254 257 17
3 257 694 17
3 257 763 694
3 257 19 763
3 19 666 763
3 335 304 690
3 254 331 257
3 331 605 257
3 35 137 358
3 763 355 694
3 35 93 137
3 254 589 331
3 666 768 763
3 184 183 187
3 263 18 1
3 642 687 736
3 687 326 736
3 20 403 482
3 20 557 403
3 566 21 336
3 21 284 336
3 42 276 437
3 42 771 276
3 771 473 276
3 473 715 276
3 437 385 665
3 421 634 84
3 634 161 84
3 42 74 771
3 276 704 437
3 704 629 437
3 704 246 629
3 246 483 629
3 276 565 704
3 147 81 42
3 634 9 161
3 634 30 9
3 30 277 9
3 30 674 277
3 674 31 277
3 31 397 277
3 31 34 397
3 421 711 634
3 711 32 634
3 674 528 31
3 674 346 528
3 674 607 346
3 385 617 665
3 607 760 346
3 74 46 771
3 161 106 84
3 42 82 74
3 82 155 74
3 31 695 34
3 695 434 34
3 607 532 760
3 695 329 434
3 434 508 34
3 704 648 246
3 42 111 82
3 32 313 634
3 346 310 528
3 711 475 32
3 726 753 631
3 760 290 346
3 441 616 29
3 616 393 29
3 622 36 549
3 36 76 549
3 43 264 293
3 126 145 123
3 224 226 223
3 227 228 58
3 222 83 119
3 159 57 54
3 65 57 112
3 206 97 50
3 98 139 207
3 171 121 144
3 49 67 168
3 278 245 91
3 207 139 236
3 169 62 70
3 62 125 163
3 168 91 90
3 125 52 67
3 155 82 117
3 232 77 462
3 77 157 108
3 129 179 193
3 99 193 79
3 194 129 172
3 159 109 112
3 64 156 108
3 112 53 65
3 473 771 715
3 212 211 51
3 51 103 144
3 172 55 180
3 90 49 168
3 181 79 122
3 135 138 136
3 504 173 39
3 38 88 214
3 83 151 119
3 112 117 53
3 77 231 462
3 157 110 54
3 131 128 134
3 90 91 245
3 207 205 98
3 79 193 101
3 92 138 197
3 206 208 97
3 62 56 125
3 103 169 99
3 129 100 172
3 214 88 215
3 126 73 48
3 162 161 165
3 150 118 71
3 73 218 165
3 588 674 30
3 42 81 111
3 76 232 549
3 159 110 59
3 57 159 112
3 41 80 116
3 115 153 114
3 96 182 183
3 152 154 113
3 77 110 157
3 149 225 223
3 83 147 107
3 83 81 147
3 209 210 206
3 91 130 429
3 105 143 218
3 151 83 107
3 44 170 142
3 161 48 73
3 61 211 170
3 130 142 10
3 141 235 98
3 174 358 137
3 182 96 179
3 123 121 146
3 166 114 214
3 167 115 114
3 101 179 0
3 183 185 186
3 204 98 178
3 125 67 163
3 39 178 504
3 236 139 208
3 100 70 172
3 132 94 122
3 183 182 185
3 212 51 144
3 172 133 194
3 167 114 154
3 60 104 56
3 216 124 167
3 67 52 168
3 209 443 237
3 125 104 52
3 219 143 221
3 165 161 73
3 222 119 223
3 78 57 65
3 36 622 696
3 59 76 36
3 53 117 45
3 223 225 224
3 160 149 45
3 160 226 149
3 85 72 216
3 146 85 105
3 214 215 166
3 111 226 160
3 110 159 54
3 160 117 82
3 65 53 227
3 104 125 56
3 102 181 122
3 72 121 171
3 217 73 105
3 169 103 56
3 178 140 204
3 206 86 209
3 221 143 89
3 182 179 66
3 196 195 197
3 196 197 138
3 70 68 55
3 62 169 56
3 86 67 443
3 192 186 638
3 130 168 44
3 91 168 130
3 63 92 180
3 92 174 137
3 138 135 196
3 39 140 178
3 200 198 175
3 138 137 93
3 103 181 144
3 136 93 175
3 443 209 86
3 443 67 49
3 97 208 139
3 180 55 63
3 39 174 140
3 51 60 103
3 105 218 217
3 120 106 221
3 220 218 143
3 72 146 121
3 212 170 211
3 126 146 105
3 170 123 145
3 106 162 165
3 150 120 89
3 164 149 223
3 46 109 75
3 224 225 226
3 116 228 41
3 218 221 106
3 106 165 218
3 167 154 216
3 88 113 154
3 167 124 115
3 122 94 213
3 88 166 215
3 696 75 36
3 110 76 59
3 155 117 112
3 82 111 160
3 65 58 78
3 222 111 81
3 161 162 106
3 105 73 126
3 85 146 72
3 121 123 212
3 193 100 129
3 95 214 114
3 120 221 89
3 118 151 71
3 73 217 218
3 221 220 219
3 214 95 38
3 99 100 193
3 144 181 102
3 179 101 193
3 208 210 321
3 366 237 515
3 100 99 169
3 60 211 104
3 79 181 99
3 95 153 87
3 60 51 211
3 92 63 140
3 133 172 180
3 209 237 210
3 138 92 137
3 203 201 202
3 176 377 200
3 133 196 135
3 203 635 567
3 680 251 235
3 210 237 321
3 235 504 178
3 198 200 199
3 103 60 56
3 170 212 123
3 97 69 47
3 188 187 192
3 195 196 133
3 194 135 128
3 188 190 189
3 12 327 301
3 184 96 183
3 98 69 139
3 99 181 103
3 122 79 132
3 98 205 141
3 35 202 175
3 177 567 686
3 176 201 177
3 200 202 201
3 177 203 567
3 203 177 201
3 138 93 136
3 175 198 136
3 204 68 98
3 50 86 206
3 62 47 70
3 169 70 100
3 429 278 91
3 140 174 92
3 656 49 90
3 235 207 236
3 589 586 235
3 235 141 205
3 49 480 443
3 90 245 656
3 61 52 104
3 349 744 236
3 148 151 118
3 47 68 70
3 166 88 114
3 130 10 429
3 656 480 49
3 44 168 61
3 72 171 124
3 216 72 124
3 245 527 700
3 119 151 148
3 222 223 226
3 45 117 160
3 156 58 228
3 58 64 78
3 78 157 54
3 229 156 228
3 109 155 112
3 227 58 65
3 75 739 46
3 45 227 53
3 229 228 116
3 102 171 144
3 66 128 182
3 101 132 79
3 0 96 184
3 183 186 187
3 95 114 153
3 154 114 88
3 129 194 66
3 182 131 185
3 180 197 133
3 133 197 195
3 68 204 63
3 205 207 235
3 85 143 105
3 130 44 142
3 123 146 126
3 61 168 52
3 108 157 64
3 119 164 223
3 64 58 156
3 102 122 213
3 164 119 148
3 46 74 109
3 59 36 75
3 159 59 109
3 232 76 110
3 458 232 233
3 144 121 212
3 306 558 290
3 63 204 140
3 387 341 307
3 63 55 68
3 47 163 97
3 86 50 163
3 50 97 163
3 497 177 686
3 134 128 135
3 198 199 417
3 70 55 172
3 61 104 211
3 220 143 219
3 176 177 497
3 377 176 497
3 417 199 200
3 377 417 200
3 68 47 69
3 163 67 86
3 188 192 327
3 186 192 187
3 188 327 269
3 69 98 68
3 109 59 75
3 696 739 75
3 771 46 739
3 149 226 225
3 188 191 190
3 189 190 191
3 321 236 208
3 163 47 62
3 226 111 222
3 129 66 179
3 66 194 128
3 74 155 109
3 220 221 218
3 38 113 88
3 222 81 83
3 304 529 690
3 176 200 201
3 182 128 131
3 78 54 57
3 157 78 64
3 40 229 80
3 638 615 600
3 158 227 45
3 175 93 35
3 180 92 197
3 0 179 96
3 118 150 5
3 139 69 97
3 178 98 235
3 61 170 44
3 200 175 202
3 80 229 116
3 110 77 232
3 208 206 210
3 158 45 149
3 135 194 133
3 134 135 127
3 191 188 269
3 470 638 186
3 198 135 136
3 127 135 198
3 71 151 107
3 126 48 145
3 234 693 495
3 234 413 388
3 757 286 234
3 384 14 410
3 384 410 402
3 555 611 507
3 611 560 511
3 238 230 543
3 403 238 746
3 712 543 374
3 543 230 279
3 279 230 238
3 714 418 550
3 418 525 751
3 624 343 15
3 475 706 416
3 570 475 677
3 239 247 380
3 324 239 240
3 452 241 334
3 506 459 241
3 242 685 368
3 579 603 554
3 603 614 344
3 371 243 582
3 267 243 409
3 673 244 641
3 266 379 244
3 407 338 29
3 556 719 643
3 719 637 415
3 729 259 490
3 280 406 695
3 288 671 438
3 295 577 522
3 299 541 569
3 610 302 725
3 618 310 405
3 755 11 312
3 723 323 575
3 325 468 722
3 329 647 489
3 451 557 332
3 365 389 335
3 355 17 694
3 743 373 539
3 710 393 500
3 770 604 394
3 737 601 404
3 426 408 7
3 664 687 411
3 491 581 524
3 597 548 573
3 357 545 396
3 357 396 596
3 596 396 533
3 533 396 401
3 396 545 401
3 401 545 532
3 532 545 290
3 545 357 290
3 290 357 306
3 357 596 306
3 306 596 707
3 596 533 433
3 596 433 621
3 621 707 596
3 707 621 625
3 707 625 576
3 707 576 644
3 644 306 707
3 306 644 741
3 558 405 290
3 558 306 405
3 741 405 306
3 741 644 571
3 644 576 571
3 741 571 423
3 741 423 370
3 741 370 647
3 647 405 741
3 290 405 494
3 405 647 406
3 494 405 310
3 618 406 310
3 618 405 406
3 290 494 346
3 494 310 346
3 760 532 290
3 401 532 509
3 607 509 532
3 607 674 509
3 401 509 250
3 401 250 450
3 450 533 401
3 433 533 764
3 764 533 378
3 450 378 533
3 433 764 264
3 764 378 264
3 621 433 256
3 264 256 433
3 621 256 334
3 334 625 621
3 625 334 496
3 625 496 255
3 255 576 625
3 576 255 300
3 300 571 576
3 370 423 591
3 423 571 591
3 571 300 447
3 447 591 571
3 647 370 457
3 457 370 534
3 591 534 370
3 591 447 8
3 534 591 738
3 8 738 591
3 406 647 329
3 406 329 695
3 280 310 406
3 280 695 310
3 528 695 31
3 528 310 695
3 647 457 261
3 489 261 329
3 489 647 261
3 457 534 761
3 534 738 761
3 261 457 531
3 761 531 457
3 434 329 471
3 632 329 261
3 632 471 329
3 531 761 500
3 261 531 275
3 531 500 275
3 632 275 471
3 632 261 275
3 434 471 508
3 471 275 311
3 471 311 485
3 485 508 471
3 268 397 508
3 34 508 397
3 361 508 408
3 708 508 485
3 708 408 508
3 311 275 393
3 275 500 393
3 311 393 320
3 311 320 445
3 445 485 311
3 708 314 408
3 708 485 314
3 645 485 445
3 645 314 485
3 383 408 314
3 383 7 408
3 450 250 416
3 250 509 416
3 677 674 313
3 677 509 674
3 767 416 509
3 767 475 416
3 767 677 475
3 767 509 677
3 570 313 475
3 570 677 313
3 588 313 674
3 588 30 313
3 32 475 313
3 634 313 30
3 383 453 7
3 383 314 453
3 772 7 453
3 772 527 7
3 527 281 7
3 645 719 314
3 645 445 719
3 578 314 719
3 578 453 314
3 772 323 527
3 772 453 323
3 578 697 453
3 578 719 697
3 252 453 697
3 252 323 453
3 429 281 278
3 281 527 278
3 278 527 245
3 723 527 323
3 723 575 527
3 700 575 245
3 700 527 575
3 575 323 274
3 252 427 323
3 252 697 427
3 354 323 427
3 354 274 323
3 445 320 639
3 639 719 445
3 639 320 487
3 393 487 320
3 427 697 556
3 697 719 556
3 719 639 637
3 639 487 637
3 415 333 719
3 415 637 333
3 643 333 556
3 643 719 333
3 738 8 479
3 738 479 646
3 646 761 738
3 761 646 407
3 407 500 761
3 500 407 29
3 710 29 393
3 710 500 29
3 637 487 616
3 487 393 616
3 407 646 414
3 646 479 414
3 407 414 520
3 407 520 601
3 338 601 29
3 338 407 601
3 441 29 737
3 601 737 29
3 637 616 681
3 616 441 681
3 441 737 350
3 350 681 441
3 350 737 332
3 332 737 359
3 404 359 737
3 404 601 359
3 601 520 712
3 520 414 712
3 359 601 543
3 374 601 712
3 374 543 601
3 712 414 641
3 414 479 641
3 255 496 28
3 496 334 28
3 712 641 492
3 492 641 244
3 712 492 658
3 492 244 658
3 339 712 658
3 339 543 712
3 334 256 247
3 256 264 247
3 657 334 241
3 657 28 334
3 452 247 241
3 452 334 247
3 658 244 747
3 747 244 379
3 395 27 476
3 27 464 544
3 544 476 27
3 464 37 526
3 526 544 464
3 476 544 684
3 544 526 684
3 476 684 603
3 395 476 460
3 603 460 476
3 395 460 436
3 436 749 395
3 513 749 731
3 436 731 749
3 513 731 455
3 455 669 513
3 731 436 307
3 731 307 309
3 309 455 731
3 747 379 620
3 379 669 620
3 669 455 243
3 455 309 243
3 620 669 409
3 267 669 243
3 267 409 669
3 747 620 688
3 688 658 747
3 688 620 352
3 409 352 620
3 409 243 574
3 409 574 474
3 474 352 409
3 436 460 606
3 460 603 606
3 307 436 367
3 606 367 436
3 243 309 582
3 309 307 582
3 574 243 26
3 371 26 243
3 371 582 26
3 574 26 736
3 574 736 326
3 326 474 574
3 26 582 698
3 307 367 387
3 341 582 307
3 341 387 582
3 260 698 582
3 498 387 367
3 440 367 606
3 440 498 367
3 579 606 603
3 579 554 606
3 298 606 554
3 653 603 684
3 653 614 603
3 303 554 614
3 344 554 603
3 344 614 554
3 653 368 614
3 653 684 368
3 442 368 684
3 685 614 368
3 685 242 614
3 2 614 242
3 551 242 368
3 25 484 459
3 484 241 459
3 241 247 752
3 506 752 459
3 506 241 752
3 264 378 293
3 43 293 240
3 43 247 264
3 43 240 247
3 459 752 678
3 678 752 239
3 752 247 239
3 380 240 239
3 380 247 240
3 450 416 754
3 450 754 468
3 468 378 450
3 378 468 599
3 599 293 378
3 706 302 416
3 706 475 302
3 375 754 416
3 583 468 754
3 583 722 468
3 325 599 468
3 325 722 599
3 369 302 610
3 725 475 610
3 725 302 475
3 711 610 475
3 711 421 610
3 369 610 592
3 610 421 592
3 369 592 742
3 293 599 381
3 381 599 337
3 722 337 599
3 477 722 612
3 477 337 722
3 540 612 722
3 293 381 317
3 317 240 293
3 381 337 465
3 465 317 381
3 465 337 518
3 477 518 337
3 477 612 518
3 518 612 750
3 580 750 612
3 240 317 721
3 317 465 318
3 318 721 317
3 465 518 399
3 399 318 465
3 399 518 519
3 750 519 518
3 535 721 318
3 609 318 399
3 399 519 659
3 580 258 505
3 258 537 505
3 750 580 758
3 505 758 580
3 519 750 716
3 758 716 750
3 519 716 636
3 636 659 519
3 530 240 721
3 324 530 239
3 324 240 530
3 728 239 530
3 563 721 535
3 659 636 248
3 671 248 438
3 265 671 4
3 288 4 671
3 288 438 4
3 248 636 305
3 636 716 472
3 472 305 636
3 472 716 308
3 758 308 716
3 308 758 619
3 505 619 758
3 438 248 249
3 305 249 248
3 249 305 347
3 305 472 347
3 472 308 587
3 587 347 472
3 587 308 435
3 619 435 308
3 435 619 709
3 619 505 709
3 627 537 753
3 627 505 537
3 627 709 505
3 627 753 709
3 537 742 631
3 631 753 537
3 699 742 592
3 699 631 742
3 469 753 769
3 469 709 753
3 435 709 538
3 538 709 702
3 469 702 709
3 469 769 702
3 702 769 663
3 25 459 24
3 239 23 678
3 22 23 239
3 728 22 239
3 249 347 585
3 347 587 541
3 587 435 541
3 435 538 21
3 21 541 435
3 585 347 569
3 299 347 541
3 299 569 347
3 569 541 624
3 624 541 566
3 21 566 541
3 538 702 595
3 595 21 538
3 702 663 633
3 633 595 702
3 21 595 284
3 595 633 284
3 566 336 273
3 273 624 566
3 336 284 630
3 273 336 553
3 630 553 336
3 585 569 15
3 569 624 15
3 624 273 33
3 273 553 33
3 343 33 15
3 343 624 33
3 284 633 665
3 633 663 665
3 630 284 617
3 665 617 284
3 33 553 651
3 651 553 655
3 630 655 553
3 655 630 559
3 617 559 630
3 385 559 617
3 658 688 238
3 688 352 3
3 339 238 543
3 339 658 238
3 332 359 403
3 359 543 403
3 279 403 543
3 279 238 403
3 352 474 272
3 474 326 272
3 352 272 488
3 3 488 238
3 3 352 488
3 333 418 556
3 333 637 418
3 282 637 681
3 282 418 637
3 746 482 403
3 746 238 482
3 488 482 238
3 681 350 568
3 282 525 418
3 282 681 525
3 292 681 568
3 292 525 681
3 568 350 386
3 332 386 350
3 386 332 557
3 451 403 557
3 451 332 403
3 568 386 463
3 386 557 463
3 292 422 525
3 292 568 422
3 703 568 463
3 703 422 568
3 557 20 660
3 557 660 652
3 652 463 557
3 463 652 345
3 703 503 422
3 703 463 503
3 345 503 463
3 427 556 584
3 584 556 511
3 467 556 418
3 467 511 556
3 467 714 511
3 467 418 714
3 751 363 418
3 751 525 363
3 550 363 714
3 550 418 363
3 363 507 714
3 363 525 507
3 466 525 422
3 466 507 525
3 660 20 734
3 20 482 734
3 482 488 412
3 412 734 482
3 488 272 608
3 608 412 488
3 608 272 724
3 326 724 272
3 724 326 687
3 466 270 507
3 466 422 270
3 400 422 503
3 400 270 422
3 345 652 351
3 652 660 351
3 345 351 768
3 345 768 666
3 666 503 345
3 503 666 19
3 400 19 270
3 400 503 19
3 511 714 611
3 714 507 611
3 507 270 759
3 555 759 611
3 555 507 759
3 427 584 322
3 354 322 274
3 354 427 322
3 245 575 656
3 656 575 480
3 274 480 575
3 480 274 443
3 322 443 274
3 322 584 515
3 511 515 584
3 322 515 237
3 237 443 322
3 366 321 237
3 366 515 321
3 689 515 511
3 689 321 515
3 560 744 511
3 560 611 744
3 689 744 321
3 689 511 744
3 759 270 605
3 19 605 270
3 611 759 330
3 330 759 521
3 605 521 759
3 536 330 236
3 536 611 330
3 251 330 521
3 251 236 330
3 349 321 744
3 349 236 321
3 536 744 611
3 536 236 744
3 257 605 19
3 331 521 605
3 331 589 521
3 546 589 235
3 546 521 589
3 680 236 251
3 680 235 236
3 546 251 521
3 546 235 251
3 586 504 235
3 586 589 504
3 504 589 392
3 254 392 589
3 763 768 355
3 355 768 667
3 351 667 768
3 660 734 730
3 730 351 660
3 351 730 650
3 650 667 351
3 650 730 398
3 730 734 398
3 412 398 734
3 398 412 390
3 608 390 412
3 608 724 664
3 724 687 664
3 664 390 608
3 411 602 664
3 411 687 602
3 642 602 687
3 598 355 701
3 598 17 355
3 701 355 353
3 667 353 355
3 353 667 360
3 650 360 667
3 360 650 668
3 398 668 650
3 398 390 682
3 682 668 398
3 682 390 626
3 664 626 390
3 626 664 514
3 602 514 664
3 701 353 389
3 353 360 389
3 389 360 439
3 360 668 449
3 449 439 360
3 439 449 672
3 672 449 382
3 449 668 382
3 682 382 668
3 514 602 454
3 765 743 717
3 682 626 590
3 590 382 682
3 590 626 623
3 514 623 626
3 623 514 510
3 454 510 514
3 594 675 454
3 594 743 675
3 675 510 454
3 510 675 342
3 510 342 713
3 713 623 510
3 623 713 285
3 285 590 623
3 285 713 253
3 713 342 253
3 590 285 670
3 285 253 670
3 670 382 590
3 382 670 748
3 748 672 382
3 720 18 373
3 765 373 743
3 539 640 743
3 539 373 640
3 661 743 640
3 661 675 743
3 661 432 675
3 661 640 432
3 432 342 675
3 640 373 12
3 735 432 640
3 561 342 432
3 478 253 342
3 481 670 253
3 670 481 420
3 420 748 670
3 389 439 548
3 439 672 548
3 548 672 372
3 748 372 672
3 372 748 683
3 420 683 748
3 365 701 389
3 365 335 701
3 335 389 304
3 548 304 389
3 548 372 262
3 372 683 262
3 304 548 597
3 573 262 597
3 573 548 262
3 597 262 577
3 304 597 529
3 597 577 529
3 504 392 16
3 291 683 420
3 262 683 562
3 291 562 683
3 577 262 283
3 562 283 262
3 577 283 376
3 577 376 522
3 295 529 577
3 295 522 529
3 552 529 635
3 522 635 529
3 516 585 15
3 486 15 33
3 691 33 431
3 523 33 651
3 523 431 33
3 651 655 483
3 655 559 483
3 651 483 705
3 523 705 431
3 523 651 705
3 483 559 629
3 385 629 559
3 705 483 246
3 431 705 271
3 705 246 648
3 271 705 362
3 648 362 705
3 431 271 756
3 271 362 756
3 364 431 756
3 364 499 431
3 502 499 294
3 294 499 312
3 364 312 499
3 364 756 312
3 756 362 319
3 756 319 394
3 394 312 756
3 394 319 259
3 319 362 259
3 740 648 564
3 740 362 648
3 740 259 362
3 740 564 259
3 766 564 648
3 766 348 564
3 766 565 348
3 766 648 565
3 704 565 648
3 629 385 437
3 522 376 391
3 391 376 456
3 283 456 376
3 456 283 542
3 297 283 562
3 297 542 283
3 733 391 456
3 635 522 567
3 567 522 686
3 391 686 522
3 391 733 497
3 497 686 391
3 497 733 377
3 377 733 628
3 402 410 13
3 512 410 425
3 512 13 410
3 377 628 417
3 615 470 600
3 615 638 470
3 424 638 600
3 424 718 638
3 373 18 419
3 373 419 444
3 444 12 373
3 12 444 327
3 444 419 269
3 269 327 444
3 294 312 11
3 755 676 11
3 755 312 676
3 676 312 296
3 340 312 394
3 340 296 312
3 340 604 296
3 340 394 604
3 770 581 604
3 770 394 581
3 428 394 259
3 428 581 394
3 565 276 715
3 715 348 565
3 348 715 572
3 564 348 732
3 572 732 348
3 732 572 593
3 564 732 757
3 732 593 757
3 501 564 757
3 501 259 564
3 428 729 581
3 428 259 729
3 501 745 259
3 501 757 745
3 490 745 729
3 490 259 745
3 745 234 729
3 745 757 234
3 581 729 495
3 729 234 495
3 604 581 491
3 524 495 491
3 524 581 495
3 296 604 430
3 491 430 604
3 676 296 287
3 430 287 296
3 491 495 356
3 649 287 430
3 679 430 491
3 662 356 289
3 662 491 356
3 315 679 289
3 662 679 491
3 662 289 679
3 517 289 356
3 446 495 654
3 693 654 495
3 693 234 654
3 517 6 289
3 757 593 727
3 757 727 413
3 286 413 234
3 286 757 413
3 762 234 328
3 762 654 234
3 388 328 234
3 388 413 328
3 493 654 233
3 762 233 654
3 762 328 233
3 593 572 771
3 572 715 771
3 413 727 696
3 727 593 696
3 739 593 771
3 739 696 593
3 448 413 549
3 448 328 413
3 622 413 696
3 622 549 413
3 448 232 328
3 448 549 232
3 458 328 232
3 458 233 328
3 462 233 232
3 462 231 233
3 613 11 676
3 263 419 18
