OFF

101 198 0
-0.099418 -0.181906 0.043486
-0.014458 -0.064257 0.152502
-0.067825 -0.145800 0.162260
-0.064160 -0.218074 -0.265580
-0.087563 -0.202627 -0.206048
-0.151468 -0.226424 -0.228226
-0.190290 -0.095146 -0.334276
-0.183420 -0.238323 -0.239315
-0.037797 -0.194420 0.131411
-0.209591 -0.173334 -0.136075
-0.224952 -0.111731 -0.177628
-0.183158 -0.059780 -0.126063
-0.029432 -0.177619 0.099626
-0.211735 -0.054954 -0.172623
-0.112363 -0.100677 0.025574
0.011310 -0.104635 0.099929
-0.192881 -0.142303 -0.111153
-0.147717 -0.031048 -0.228565
-0.163292 -0.056815 -0.303361
-0.126822 -0.091686 -0.067941
-0.188303 -0.034306 -0.245813
-0.026188 -0.068299 0.097758
-0.204055 -0.085755 -0.151846
-0.088025 -0.066320 0.060581
-0.232632 -0.080929 -0.198405
0.017987 -0.093251 0.145295
-0.004879 -0.132726 0.083885
-0.001574 -0.084446 0.126216
-0.133504 -0.117812 -0.052307
-0.212482 -0.211778 -0.193240
-0.068607 -0.188163 0.087449
-0.028492 -0.175355 0.169839
-0.031894 -0.200879 -0.177865
-0.004216 -0.200635 -0.103670
-0.063687 -0.031963 0.095588
-0.168532 -0.142595 -0.083472
-0.196374 -0.116557 -0.131069
-0.144563 -0.063006 -0.093120
-0.039073 -0.048110 0.124045
-0.104987 -0.208454 -0.138095
-0.130229 -0.175649 -0.000476
-0.077129 -0.164865 0.123832
-0.138751 -0.152351 0.035907
-0.050951 -0.206257 -0.220239
-0.036525 -0.203801 -0.088738
-0.158888 -0.180528 -0.084900
-0.119515 -0.214525 -0.217137
-0.124044 -0.213832 -0.180469
-0.003939 -0.130463 0.154098
-0.217271 -0.142532 -0.156852
-0.128621 -0.111763 -0.033333
-0.096677 -0.206183 0.015765
-0.187949 -0.237630 -0.202647
-0.186272 -0.113915 -0.108650
-0.144457 -0.209022 -0.116726
-0.051957 -0.027921 0.150331
-0.230069 -0.111522 -0.313363
-0.114413 -0.117993 0.070914
-0.027342 -0.044068 0.178788
-0.071016 -0.055778 0.128126
-0.104283 -0.077406 0.001673
0.001102 -0.190839 -0.189854
-0.101418 -0.116712 0.167003
-0.090075 -0.083636 0.105920
-0.250820 -0.096331 -0.273092
-0.079945 -0.043048 0.036680
-0.049450 -0.191871 -0.121300
-0.059285 -0.051737 0.182869
-0.147677 -0.117141 -0.075706
-0.198810 -0.080509 -0.299724
-0.185058 -0.199186 -0.145482
-0.078344 -0.079594 0.160664
-0.068506 -0.197249 -0.163674
-0.088920 -0.192439 -0.099931
-0.011352 -0.092111 0.074929
-0.161040 -0.169392 -0.044439
-0.097403 -0.107452 0.138458
-0.107940 -0.158608 0.079870
-0.189387 -0.168050 -0.091237
-0.014339 -0.209887 -0.234429
-0.165417 -0.088460 -0.100885
-0.071693 -0.211166 -0.066628
-0.174956 -0.196544 -0.123063
-0.219561 -0.065319 -0.259453
-0.013243 -0.149528 0.115670
-0.116462 -0.135309 0.116253
-0.155996 -0.225731 -0.191558
-0.160525 -0.225038 -0.154889
-0.048850 -0.055775 0.072758
-0.136702 -0.135035 -0.009432
-0.127488 -0.199926 -0.028198
-0.016453 -0.181831 -0.133289
-0.118554 -0.040353 -0.167435
-0.128389 -0.193007 -0.078563
-0.167552 -0.049497 -0.286085
-0.130563 -0.048437 -0.138125
-0.159140 -0.043611 -0.184684
-0.119247 -0.053306 -0.107548
-0.171149 -0.051695 -0.155374
-0.111163 -0.211734 -0.045260
-0.199726 -0.046869 -0.201933
3 6 3 18
3 3 79 18
3 79 61 18
3 61 17 18
3 61 92 17
3 61 91 92
3 17 94 18
3 91 33 92
3 33 97 92
3 33 65 97
3 33 74 65
3 33 26 74
3 33 12 26
3 33 30 12
3 33 51 30
3 33 44 51
3 44 81 51
3 65 19 97
3 19 37 97
3 26 15 74
3 81 99 51
3 30 8 12
3 6 7 3
3 17 20 94
3 65 60 19
3 99 90 51
3 97 95 92
3 74 88 65
3 60 50 19
3 50 28 19
3 51 0 30
3 92 96 17
3 74 21 88
3 61 32 91
3 28 68 19
3 90 40 51
3 99 93 90
3 50 75 28
3 94 69 18
3 9 29 10
3 29 64 10
3 29 56 64
3 29 7 56
3 7 6 56
3 29 52 7
3 64 24 10
3 64 13 24
3 64 100 13
3 64 83 100
3 83 20 100
3 7 5 3
3 5 46 3
3 46 4 3
3 12 84 26
3 5 86 46
3 86 47 46
3 25 31 58
3 31 67 58
3 31 62 67
3 25 48 31
3 31 2 62
3 67 55 58
3 58 1 25
3 62 71 67
3 87 70 9
3 9 10 49
3 27 15 1
3 85 76 71
3 16 36 78
3 54 82 93
3 54 87 82
3 45 82 78
3 45 93 82
3 18 69 6
3 56 6 69
3 83 64 69
3 56 69 64
3 94 20 69
3 83 69 20
3 80 37 68
3 80 11 37
3 19 68 37
3 35 53 68
3 35 78 53
3 80 53 11
3 80 68 53
3 82 9 78
3 82 87 9
3 41 2 8
3 41 85 2
3 31 8 2
3 73 39 93
3 73 66 39
3 54 39 87
3 54 93 39
3 22 36 10
3 22 11 36
3 49 36 9
3 49 10 36
3 24 13 10
3 22 13 11
3 22 10 13
3 52 29 87
3 70 29 9
3 70 87 29
3 47 39 4
3 47 87 39
3 72 39 66
3 72 4 39
3 38 21 1
3 38 34 21
3 27 21 15
3 27 1 21
3 58 55 1
3 38 55 34
3 38 1 55
3 90 75 40
3 51 40 0
3 72 32 4
3 72 66 32
3 43 32 79
3 43 4 32
3 60 65 14
3 23 65 34
3 23 14 65
3 89 50 14
3 89 75 50
3 60 14 50
3 95 97 11
3 98 13 96
3 98 11 13
3 100 96 13
3 92 95 96
3 98 95 11
3 98 96 95
3 88 34 65
3 35 75 78
3 35 68 75
3 28 75 68
3 90 93 75
3 91 66 33
3 16 9 36
3 16 78 9
3 53 36 11
3 53 78 36
3 86 87 47
3 46 47 4
3 7 52 5
3 86 52 87
3 86 5 52
3 61 79 32
3 91 32 66
3 62 85 71
3 62 2 85
3 25 1 15
3 44 66 81
3 45 75 93
3 45 78 75
3 31 48 8
3 84 48 15
3 84 8 48
3 43 3 4
3 43 79 3
3 74 15 21
3 88 21 34
3 57 42 14
3 57 85 42
3 89 42 75
3 89 14 42
3 23 63 14
3 23 34 63
3 57 63 85
3 57 14 63
3 44 33 66
3 99 81 93
3 73 81 66
3 73 93 81
3 59 55 71
3 59 34 55
3 67 71 55
3 76 63 71
3 76 85 63
3 59 63 34
3 59 71 63
3 41 30 85
3 41 8 30
3 77 30 0
3 77 85 30
3 40 42 0
3 40 75 42
3 77 42 85
3 77 0 42
3 25 15 48
3 12 8 84
3 26 84 15
3 100 20 96
3 17 96 20
3 37 11 97
