OFF
1532 1706 0
-0.1223805550 -0.0005513895 -0.4176108232
-0.1171215516 -0.0383206449 -0.4123438428
-0.0768696264 -0.0442720678 0.0164645115
-0.1228421146 -0.0766867470 -0.3039627331
0.1785242285 -0.1034883276 0.4879549199
0.1644996691 -0.0277440778 0.4651823917
-0.0336148433 0.0267776480 -0.3706707677
-0.1442648541 -0.0007651613 -0.4918362381
-0.1528408902 -0.0017272906 -0.4656892670
-0.1420779000 0.0272108922 -0.4733426615
-0.0453700555 0.0249473206 -0.3980778554
-0.1145780597 -0.0346073918 -0.4186939892
-0.1505746458 -0.0044582481 -0.4660269336
0.1337810055 -0.0161792651 0.3777712615
0.1728181504 -0.0938074500 0.4820215923
-0.0335396163 0.0036082703 -0.3756851940
0.2024670290 -0.0106150354 0.0133981678
-0.0705258383 -0.0845866876 -0.2302045042
0.0785270050 0.0165131902 0.0409845532
-0.1294146231 -0.0213593707 -0.4474128798
-0.1307473714 0.0414200420 -0.4225000031
0.0792060210 -0.0096056276 -0.1072765221
-0.0460027903 0.0006742053 -0.4121505959
-0.1352648025 0.0940903503 -0.2162462806
-0.1438295385 0.0662782365 -0.3178019645
-0.1019052902 0.0392065864 -0.4343177718
-0.1160937881 0.0476359570 -0.4097815351
-0.1438005338 0.0099729593 -0.4996724880
-0.1445068692 0.0099816192 -0.5000000000
-0.1490178685 0.0099458159 -0.4995201117
0.1961514436 -0.0067503271 0.0123273319
-0.1471809950 0.0279324663 -0.4632415597
0.1698854998 0.0458916123 0.4809451368
-0.1244713826 0.0792351464 -0.2306708836
-0.1268648000 0.0791733809 -0.2292091196
0.1896368268 -0.0096317620 0.0152039125
0.1082297166 -0.0169381306 0.2118476951
0.1238253131 -0.0096598900 0.0082561129
-0.0999094185 -0.0262027851 -0.4366813008
-0.1394614363 -0.0116891369 -0.4664725109
-0.1427186663 -0.0086878422 -0.4793364623
-0.1330664173 0.0765462725 -0.2334740099
0.2024078998 -0.0119753064 0.0051673562
-0.1357625152 0.0135857738 -0.4919452167
-0.1524255121 0.0041686165 -0.4708814837
-0.1593999224 0.0265103581 -0.3157880212
-0.1662099349 -0.1430395987 -0.1918428439
0.0936289108 -0.0159864708 0.0279003987
-0.1438564909 0.0002061046 -0.4951879712
-0.1441377801 0.0019540857 -0.4971251138
-0.1431116914 0.0150538131 -0.4915463279
0.1565111442 -0.0211818920 0.4460584747
-0.0857530998 0.0097229056 -0.4547188007
-0.1439923922 -0.0024163552 -0.4607492169
0.1225922637 -0.0172229205 -0.0114788040
-0.1446006977 0.0102189368 -0.4984329187
0.1872815399 0.0871220814 0.5000000000
-0.1332054323 0.0801226756 -0.2256809397
-0.1338092599 0.0800086095 -0.2225324914
-0.1166530589 0.0461945378 -0.4157807970
-0.1156562773 0.0460456527 -0.4114613040
0.1753762725 -0.0069305375 -0.0316472566
0.1017489489 -0.0088971811 0.0151995568
-0.1049523878 -0.0522308756 -0.3871301996
-0.1744281837 0.1498286015 -0.2404484774
0.1020893688 0.0063380935 0.3930805834
0.0766470155 0.0100507616 0.2852987418
-0.1508298461 -0.0067967712 -0.4156023215
0.0976555457 0.0013334535 -0.0099168115
-0.1294914376 0.0775409614 -0.2300606508
-0.0986529681 0.0028574451 -0.4566724877
0.1406573624 -0.0173976046 0.4461354739
0.0490700363 0.0040993011 -0.1713820741
-0.0637319627 0.0772045520 -0.2905147259
-0.1440480049 0.0027379707 -0.4974827364
-0.1252442886 0.0093782521 -0.4185689698
0.1795548434 -0.1029215237 0.4875964179
-0.1370994320 -0.0781035124 -0.2501339715
-0.1363597921 -0.0002112599 -0.4910219007
-0.1165200532 0.0473377004 -0.4169629563
-0.1445914306 0.0093261928 -0.4970602151
0.2023872796 -0.0070277879 0.0053426466
-0.1559905331 0.0089649388 -0.4882048582
-0.1292870375 -0.0815173187 -0.2305460186
-0.1337173285 0.0185686841 -0.4925258401
0.0314477284 -0.0695458773 -0.0132593701
-0.1565166740 -0.1280923743 -0.2863296639
-0.1221892680 -0.0288026662 -0.4336368033
-0.1048738193 0.0594396239 -0.3848563375
-0.1173140103 0.0508614446 -0.4077606503
0.0250457001 -0.0131041860 0.2647380073
0.1600790828 -0.0193990414 0.4582929939
-0.1867208272 0.1804140446 -0.1293981086
-0.1815465005 -0.1625132168 -0.1722283443
-0.0744222896 -0.0230280086 -0.4300874052
-0.1262118677 0.0797752362 -0.2306013652
-0.1154284997 0.0456444997 -0.4156615670
-0.1187023436 0.0453810111 -0.4086097985
-0.1255890288 0.0047869401 -0.4133229283
0.1694508054 -0.0855740122 0.4784059311
-0.1525358643 0.0158291346 -0.4640336830
-0.1213240177 0.0426492311 -0.4094992370
-0.1187721623 0.0431493145 -0.4233137567
-0.1486490060 0.0565293367 -0.1985472007
-0.1432567919 0.0257288254 -0.4782361978
-0.1486578523 0.0143081189 -0.4983319949
-0.1446638259 0.0143350653 -0.4986227141
-0.1644827349 0.0026906752 -0.1722946792
0.1688118444 -0.0595180267 0.4730757139
-0.1438628473 0.0129281128 -0.4969389920
-0.0679961758 0.0241959025 0.0165733393
-0.1220686824 0.0600436162 -0.3722946363
-0.1254817664 0.0209403484 -0.4186766269
-0.1434755100 -0.0639915241 -0.3229336757
-0.1864340104 -0.1817873575 -0.1880887486
-0.2007134464 -0.1826749997 -0.1647150670
-0.1131827535 0.0098643633 -0.4464199433
-0.1393937532 0.0204420806 -0.4839344095
0.1608891294 -0.1152321822 0.4600226030
-0.0813544855 -0.0042374003 0.0193897765
-0.1159626312 -0.0255345061 -0.4108459396
-0.1158743525 -0.0254293144 -0.4138045583
-0.1301990193 0.0780987472 -0.2303690893
-0.1224744924 0.0219875523 -0.4168122694
-0.1149363660 0.0217433346 -0.4090325517
-0.1133555715 -0.0189545503 -0.4098194994
-0.1271400660 -0.0836342316 -0.2378521683
-0.1181045709 0.0314919752 -0.4204359504
-0.0792429326 0.0821881620 -0.1533603643
-0.1227280323 0.0326293866 -0.4116698871
-0.0315895465 -0.0232067641 -0.3578682500
0.1631292337 -0.0926434180 0.4752076325
-0.1247103507 0.0666789280 -0.3423804200
0.1086793432 -0.0406007191 0.4136931279
-0.1225218021 -0.0120784523 -0.4185365283
-0.1976812895 -0.1700369785 -0.1559696725
0.0868097134 0.0055134922 -0.0825872475
-0.1250664198 -0.0441849442 -0.3981765069
-0.1452059743 -0.0651716655 -0.1500081589
-0.0715886006 -0.0471794249 -0.3850520649
-0.1337638561 -0.0164208911 -0.4526643751
-0.1132350359 0.0515426728 -0.4109901520
-0.2024670290 -0.1775313485 -0.1508551069
-0.1512648144 -0.0060258758 -0.4839975284
0.1893102829 -0.1273799806 0.4955012993
-0.1101461468 0.0297297798 -0.4163794238
0.0826894888 -0.0219210791 -0.0855238013
-0.1253488772 -0.0109445224 -0.4198063066
-0.1446088402 0.0011420524 -0.4990901420
-0.1370859851 0.0011257343 -0.4977446219
0.1643791873 -0.0124552563 0.4647677541
-0.1433493645 0.0200314979 -0.4883606344
0.0902984003 0.0028352347 0.0244837739
-0.1347804086 -0.0159860577 -0.4566239116
-0.1178702063 0.0361327407 -0.4115726522
-0.1491941953 -0.0017478101 -0.4957487483
-0.1218766943 0.0384904554 -0.4284301246
-0.1066514321 -0.0590045466 -0.3661549959
0.0977471946 -0.0206563804 -0.0106959104
0.1877469890 -0.1196270765 0.4939923928
-0.1447958417 -0.0087262761 -0.4536356625
-0.1933492755 0.1826749997 -0.1474068768
-0.1381656171 -0.0251054100 -0.4410870176
-0.0545510091 0.0510759363 -0.3442962907
-0.0751219374 0.0421934722 -0.3914670965
-0.0843028910 0.0683220879 -0.3376855317
-0.1532904587 0.0272214122 -0.3895147905
-0.1532904587 0.0272214122 -0.3895147905
0.0077275965 0.0154384746 -0.2710264209
-0.0129436234 0.0211080613 -0.3208485943
-0.0486734030 0.0519911000 -0.3305927468
-0.0280021831 0.0463215133 -0.2807705734
-0.0073309632 0.0406519265 -0.2309484000
0.0283988164 0.0097688878 -0.2212042475
-0.0280021831 0.0463215133 -0.2807705734
-0.1450736469 0.0339652000 -0.3691440121
0.0077652100 0.0038537857 -0.2735336340
-0.1591288611 0.1080534190 -0.2791252209
-0.1494497831 0.1145318739 -0.2355596805
-0.1341504605 0.0727566914 -0.2742364241
-0.1609928149 0.1372521974 -0.1728221946
-0.1805745054 0.1651213230 -0.1849232930
-0.1548464931 0.1219594759 -0.2283473790
-0.1591288611 0.1080534190 -0.2791252209
-0.1395471705 0.0801842934 -0.2670241225
-0.1548464931 0.1219594759 -0.2283473790
-0.1609928149 0.1372521974 -0.1728221946
-0.1548464931 0.1219594759 -0.2283473790
-0.1805745054 0.1651213230 -0.1849232930
-0.1445260248 -0.1098631728 -0.2479027885
-0.1786150602 -0.1553836870 -0.2255223654
-0.1613633045 -0.1355659865 -0.2390862539
-0.1516546835 -0.1105715556 -0.2209884077
-0.1468080530 -0.1030979434 -0.2682318177
-0.1499960920 -0.0960419492 -0.3046316698
-0.1443407422 -0.0645815948 -0.2364709173
-0.1445260248 -0.1098631728 -0.2479027885
-0.1613633045 -0.1355659865 -0.2390862539
-0.1336840697 -0.0932749599 -0.2759327608
-0.1714753422 -0.1549398659 -0.2372092062
-0.0966839765 -0.0806367173 -0.2670836186
0.0255499711 -0.0225639216 -0.2216960257
0.0087402449 -0.0095537315 -0.2646251621
0.0541197300 -0.0222425003 -0.1536099135
0.0077652100 0.0038537857 -0.2735336340
0.0087402449 -0.0095537315 -0.2646251621
-0.0128872031 0.0037310280 -0.3246094140
-0.1480179102 -0.0359842183 -0.2828052402
-0.1494238781 -0.0213904948 -0.3492037808
-0.1443407422 -0.0645815948 -0.2364709173
-0.1471526780 -0.0353941477 -0.3692679986
-0.0885886352 -0.0717956171 -0.2981797500
0.0055504441 -0.0345502520 -0.2352879331
0.0060818253 -0.0532538833 -0.1578641527
-0.0322220065 -0.0689202854 -0.1940343285
-0.0324876971 -0.0595684698 -0.2327462186
0.0058161347 -0.0439020676 -0.1965760429
0.0441199664 -0.0282356655 -0.1604058672
0.0443856570 -0.0375874812 -0.1216939770
0.0248352053 -0.0313929587 -0.1978469002
-0.0330190783 -0.0408648384 -0.3101699990
-0.0517724583 -0.0627257630 -0.2701872516
-0.0137343171 -0.0377075452 -0.2727289661
-0.0324876971 -0.0595684698 -0.2327462186
-0.0710572195 -0.0658830562 -0.3076282846
-0.0523038394 -0.0440221316 -0.3476110320
-0.0517724583 -0.0627257630 -0.2701872516
-0.1480179102 -0.0359842183 -0.2828052402
-0.1466119423 -0.0505779419 -0.2164066995
-0.1548443546 -0.0312404952 -0.1611514190
-0.1562503226 -0.0166467716 -0.2275499597
-0.1576562905 -0.0020530480 -0.2939485003
-0.1494238781 -0.0213904948 -0.3492037808
-0.1610695127 0.0003188136 -0.2331215898
-0.0877391131 -0.0684087816 -0.3086673519
-0.0963457504 -0.0603198286 -0.3478987757
-0.0710572195 -0.0658830562 -0.3076282846
0.0055504441 -0.0345502520 -0.2352879331
-0.0330190783 -0.0408648384 -0.3101699990
0.0255499711 -0.0225639216 -0.2216960257
-0.1018571576 0.0807116542 -0.1920156240
-0.1541561367 0.0344844558 -0.2450483218
-0.1593194358 0.0185875655 -0.2086715005
-0.1462392722 0.0614037866 -0.2581745826
-0.0714874476 0.0796963570 -0.2219375451
-0.0941016727 0.0782198492 -0.2605928048
-0.1018571576 0.0807116542 -0.1920156240
-0.0073309632 0.0406519265 -0.2309484000
-0.0714874476 0.0796963570 -0.2219375451
-0.0432869479 0.0614200443 -0.1921543822
-0.0355314630 0.0589282393 -0.2607315630
-0.0150864482 0.0431437315 -0.1623712192
0.0208695365 0.0223756138 -0.2011652371
-0.0432869479 0.0614200443 -0.1921543822
-0.1576562905 -0.0020530480 -0.2939485003
-0.1619413287 0.0146005166 -0.2440413502
-0.1542430683 -0.0044249096 -0.3547754109
-0.1341504605 0.0727566914 -0.2742364241
-0.0941016727 0.0782198492 -0.2605928048
-0.1037807506 0.0717413942 -0.3041583452
-0.1541561367 0.0344844558 -0.2450483218
-0.1489928376 0.0503813461 -0.2814251432
-0.1619413287 0.0146005166 -0.2440413502
0.1347842363 -0.0779164506 0.4368578654
0.1456476903 -0.0495491713 0.4414581701
0.1587001368 -0.0682070371 0.4530405388
0.0668625216 -0.0268524525 0.3392155676
0.0877709324 -0.0337265858 0.3764543477
0.0635675344 -0.0033830462 0.3289092954
0.1310842258 -0.0065304739 0.4256867887
0.1359874343 0.0261148529 0.4370128601
0.1649822913 0.0132462855 0.4696190653
0.1310842258 -0.0065304739 0.4256867887
0.1446854544 0.0467300875 0.4465402917
0.1446854544 0.0467300875 0.4465402917
0.1359874343 0.0261148529 0.4370128601
0.1451460749 -0.0186805785 0.4119148681
0.0635675344 -0.0033830462 0.3289092954
0.0893681922 0.0081944276 0.3391896626
0.0443066173 -0.0082436161 0.2968236513
0.1084545299 -0.0287694249 0.3127704115
0.1210053611 -0.0165586979 0.2948094783
0.1085669365 -0.0346850720 0.3632317697
-0.0012979585 0.0461194618 0.0659691887
-0.0270986163 0.0345419880 0.0556888215
-0.0010264581 0.0107189010 0.1602134144
0.0118738708 0.0165076379 0.1653535980
-0.0140625372 0.0226304445 0.1079511180
-0.0402704456 0.0641538119 -0.0436955878
-0.0531707744 0.0583650750 -0.0488357714
-0.0207842020 0.0551366368 0.0111368005
0.0376745285 0.0280851117 0.1756339652
0.0118738708 0.0165076379 0.1653535980
0.0184597854 0.0017017259 0.2150458027
0.0181882850 0.0371022868 0.1208015770
0.0571607720 0.0190679367 0.2304663535
0.0313601143 0.0074904628 0.2201859863
0.0508463578 -0.0015267122 0.2750183745
0.1210053611 -0.0165586979 0.2948094783
0.0924383661 -0.0034436845 0.2485732185
0.1052140105 -0.0030642518 0.3315350017
0.1052140105 -0.0030642518 0.3315350017
0.0700635358 -0.0550732982 0.2002168789
0.0893714395 -0.0478370086 0.3069550034
0.0668625216 -0.0268524525 0.3392155676
0.0459541109 -0.0199783193 0.3019767875
0.0990253913 -0.0442188638 0.3603240656
0.0797174877 -0.0514551534 0.2535859411
0.0572085698 -0.0304705973 0.2858465053
0.0475546179 -0.0340887421 0.2324774431
0.0282467143 -0.0413250316 0.1257393186
0.0507556321 -0.0623095877 0.0934787544
0.0604095840 -0.0586914429 0.1468478166
0.0298472213 -0.0554354545 0.0562399742
0.0266462072 -0.0272146088 0.1952386629
0.0491551250 -0.0481991649 0.1629780987
0.0475546179 -0.0340887421 0.2324774431
0.0700635358 -0.0550732982 0.2002168789
0.0698387225 -0.0432420040 0.0992941625
0.0890342195 -0.0300900673 0.1555709288
0.0986319680 -0.0235140990 0.1837093120
0.0699511292 -0.0491576511 0.1497555207
0.0507556321 -0.0623095877 0.0934787544
0.0506432255 -0.0563939406 0.0430173962
0.0604095840 -0.0586914429 0.1468478166
0.0893714395 -0.0478370086 0.3069550034
0.0797174877 -0.0514551534 0.2535859411
0.0939736021 -0.0341966420 0.2327168181
0.0988005780 -0.0323875696 0.2594013493
0.1084545299 -0.0287694249 0.3127704115
0.0990253913 -0.0442188638 0.3603240656
0.0988005780 -0.0323875696 0.2594013493
0.0775870103 0.0132819759 0.1631416475
0.0771170129 0.0116663688 0.2242201946
0.0933783608 -0.0002124702 0.1264161242
-0.0012979585 0.0461194618 0.0659691887
0.0775870103 0.0132819759 0.1631416475
0.0381445259 0.0297007188 0.1145554181
0.0780570076 0.0148975830 0.1020631003
0.0386145232 0.0313163260 0.0534768710
0.0376745285 0.0280851117 0.1756339652
0.0771170129 0.0116663688 0.2242201946
0.0381445259 0.0297007188 0.1145554181
-0.0003579638 0.0493506761 -0.0561879056
-0.0402704456 0.0641538119 -0.0436955878
-0.0008279612 0.0477350689 0.0048906416
-0.0398004482 0.0657694190 -0.1047741349
0.0390845206 0.0329319331 -0.0076016762
-0.0008279612 0.0477350689 0.0048906416
0.0386145232 0.0313163260 0.0534768710
0.1290328807 -0.0144258083 -0.0585855289
0.1365617336 -0.0137934589 -0.0211715835
0.0902183417 -0.0212887297 -0.0481098559
0.0570686086 -0.0457334782 -0.0493915857
0.0902183417 -0.0212887297 -0.0481098559
0.0645974615 -0.0451011288 -0.0119776403
0.0625383196 -0.0427661741 0.0073205143
0.0698387225 -0.0432420040 0.0992941625
0.0506432255 -0.0563939406 0.0430173962
0.0625383196 -0.0427661741 0.0073205143
0.0817338166 -0.0296142374 0.0635972806
0.1009293137 -0.0164623007 0.1198740469
0.0890342195 -0.0300900673 0.1555709288
0.0972791122 -0.0162243858 0.0738872228
0.0282467143 -0.0413250316 0.1257393186
-0.0259119632 -0.0286881269 0.1406012594
-0.0243114561 -0.0427985497 0.0711019150
0.0019676291 -0.0420617907 0.0984206168
-0.0513907948 -0.0364800973 0.0785328854
0.0266462072 -0.0272146088 0.1952386629
-0.0004331316 -0.0208961565 0.2026696334
0.0003671220 -0.0279513679 0.1679199612
-0.0243114561 -0.0427985497 0.0711019150
-0.0227109490 -0.0569089725 0.0016025707
0.0035681362 -0.0561722135 0.0289212725
-0.0505905413 -0.0435353087 0.0437832133
0.0298472213 -0.0554354545 0.0562399742
0.0019676291 -0.0420617907 0.0984206168
0.0035681362 -0.0561722135 0.0289212725
-0.0195390549 -0.0770662824 -0.1217319372
-0.0568791229 -0.0673587714 -0.0816337645
-0.0823725146 -0.0711189740 -0.1358700480
-0.0509557848 -0.0740926282 -0.1288009926
-0.1010425486 -0.0662652184 -0.1158209617
0.0059543367 -0.0733060798 -0.0674956536
-0.0127156973 -0.0684523243 -0.0474465673
-0.0254623931 -0.0703324256 -0.0745647091
-0.0823725146 -0.0711189740 -0.1358700480
-0.1078659063 -0.0748791765 -0.1901063315
-0.0764491765 -0.0778528308 -0.1830372761
-0.1137892445 -0.0681453197 -0.1429391035
-0.0450324466 -0.0808264850 -0.1759682207
-0.0509557848 -0.0740926282 -0.1288009926
-0.0764491765 -0.0778528308 -0.1830372761
-0.1078659063 -0.0748791765 -0.1901063315
-0.0195390549 -0.0770662824 -0.1217319372
0.0060818253 -0.0532538833 -0.1578641527
0.0315752169 -0.0494936807 -0.1036278692
0.0060180810 -0.0632799816 -0.1126799032
0.0443856570 -0.0375874812 -0.1216939770
-0.0450324466 -0.0808264850 -0.1759682207
-0.0322220065 -0.0689202854 -0.1940343285
-0.0194753107 -0.0670401842 -0.1669161867
0.0315752169 -0.0494936807 -0.1036278692
0.0570686086 -0.0457334782 -0.0493915857
0.0315114727 -0.0595197790 -0.0584436197
0.0571323529 -0.0357073799 -0.0945758353
0.0059543367 -0.0733060798 -0.0674956536
0.0060180810 -0.0632799816 -0.1126799032
0.0315114727 -0.0595197790 -0.0584436197
0.0992640584 -0.0070514480 0.1181657345
-0.1150017457 0.0261459682 -0.0895787121
-0.1318253759 0.0413376524 -0.1440629564
-0.1565658705 0.0296100059 -0.1854209399
-0.1397422403 0.0144183217 -0.1309366956
-0.1229186102 -0.0007733626 -0.0764524513
-0.0981781156 0.0109542839 -0.0350944678
-0.1437006726 0.0009586563 -0.1243735653
0.1599883784 -0.0082051085 0.0102917224
-0.1229186102 -0.0007733626 -0.0764524513
-0.1437006726 0.0009586563 -0.1243735653
-0.1548443546 -0.0312404952 -0.1611514190
-0.1340622923 -0.0329725140 -0.1132303051
-0.1132802299 -0.0347045329 -0.0653091912
-0.1021365478 -0.0025053815 -0.0285313374
-0.1340622923 -0.0329725140 -0.1132303051
0.0037833904 0.0438508271 -0.1179738059
0.0452965519 0.0246821597 -0.1002805267
0.0679398748 0.0048063967 -0.1269846608
0.0264267133 0.0239750641 -0.1446779400
-0.0150864482 0.0431437315 -0.1623712192
-0.0377297711 0.0630194945 -0.1356670851
0.0264267133 0.0239750641 -0.1446779400
-0.0003579638 0.0493506761 -0.0561879056
0.0390845206 0.0329319331 -0.0076016762
0.0826683592 0.0110133412 -0.0208013471
0.0629471170 0.0192227127 -0.0450944618
0.0588057628 0.0247225617 0.0166914385
0.0432258748 0.0274320842 -0.0693875765
0.0193632784 0.0411413046 -0.0318947909
0.0629471170 0.0192227127 -0.0450944618
0.0037833904 0.0438508271 -0.1179738059
-0.0398004482 0.0657694190 -0.1047741349
-0.0200792060 0.0575600476 -0.0804810202
-0.0377297711 0.0630194945 -0.1356670851
0.0432258748 0.0274320842 -0.0693875765
0.0452965519 0.0246821597 -0.1002805267
0.0235046326 0.0356414556 -0.0936806912
0.0992640584 -0.0070514480 0.1181657345
0.1310929929 -0.0007085227 -0.0571172520
0.1053175132 -0.0020731989 -0.0371655673
0.1274591530 -0.0051842063 -0.0244305696
-0.1083225909 0.0403626196 -0.0909869307
-0.0736195542 0.0531920322 -0.0683935125
-0.0764312434 0.0676900971 -0.1108769384
-0.0881593834 0.0322792610 -0.0372067957
-0.1284857985 0.0484459781 -0.1447670657
-0.0937827618 0.0612753908 -0.1221736475
-0.1139459693 0.0693587493 -0.1759537825
-0.0259119632 -0.0286881269 0.1406012594
-0.0281543927 -0.0086707932 0.1420638919
-0.0536332243 -0.0164627636 0.0799955180
-0.0004331316 -0.0208961565 0.2026696334
-0.0536332243 -0.0164627636 0.0799955180
-0.0652514254 -0.0303674157 0.0482300147
-0.0513907948 -0.0364800973 0.0785328854
-0.1150017457 0.0261459682 -0.0895787121
-0.0981781156 0.0109542839 -0.0350944678
-0.1083225909 0.0403626196 -0.0909869307
-0.1132802299 -0.0347045329 -0.0653091912
-0.1110378004 -0.0547218666 -0.0667718237
-0.0973173577 -0.0194709666 -0.0229597073
-0.0568791229 -0.0673587714 -0.0816337645
-0.0227109490 -0.0569089725 0.0016025707
-0.0668743747 -0.0558154196 -0.0325846265
-0.0127156973 -0.0684523243 -0.0474465673
-0.1110378004 -0.0547218666 -0.0667718237
-0.1010425486 -0.0662652184 -0.1158209617
-0.0668743747 -0.0558154196 -0.0325846265
-0.0214752379 0.0055458582 0.1406556733
-0.0514148617 0.0006542289 0.0800227249
-0.0281543927 -0.0086707932 0.1420638919
-0.0270986163 0.0345419880 0.0556888215
-0.0531707744 0.0583650750 -0.0488357714
-0.0736195542 0.0531920322 -0.0683935125
-0.0401346953 0.0464535315 0.0034265251
-0.0214752379 0.0055458582 0.1406556733
-0.0010264581 0.0107189010 0.1602134144
-0.0447357069 0.0148708803 0.0786145063
-0.0525641084 -0.0217855773 -0.3803686294
-0.1346183404 0.0034809484 -0.4396590934
-0.1342709649 -0.0540882342 -0.3605550913
-0.1184977018 -0.0125385254 -0.4672129614
-0.0587956954 -0.0232526098 -0.3986013304
-0.1316160184 -0.0346451771 -0.4196317622
-0.1510473302 -0.0064113235 -0.4497999250
-0.0525641084 -0.0217855773 -0.3803686294
-0.0857490096 -0.0366911050 -0.4108666829
-0.1176860107 -0.0094691514 -0.4400283733
-0.1306690653 0.0134006593 -0.4474513178
-0.1306690653 0.0134006593 -0.4474513178
-0.0658779450 0.0051985554 -0.4334346983
-0.0797124142 0.0552577801 -0.3645763141
-0.0499605323 0.0380116284 -0.3711870731
-0.0591414859 0.0641402441 -0.3174055083
-0.0797124142 0.0552577801 -0.3645763141
-0.0793025457 0.0382449967 -0.4045340037
-0.0655615776 0.0173351131 -0.4263983281
-0.1450736469 0.0339652000 -0.3691440121
-0.1502357269 0.0275769392 -0.4263781751
-0.1407343024 0.0432769871 -0.3440413288
-0.1502357269 0.0275769392 -0.4263781751
-0.1551148843 0.0098567934 -0.3656951714
-0.1534101896 0.0010840838 -0.4519035899
-0.0929003225 0.0686240841 -0.3314046811
-0.0655615776 0.0173351131 -0.4263983281
-0.0545510091 0.0510759363 -0.3442962907
-0.0383377930 0.0491563066 -0.3056816601
-0.0232792333 0.0239428546 -0.3457596810
-0.0026080134 0.0182732679 -0.2959375076
-0.0383377930 0.0491563066 -0.3056816601
0.0180632064 0.0126036812 -0.2461153342
0.0208695365 0.0223756138 -0.2011652371
-0.0355314630 0.0589282393 -0.2607315630
-0.0176665732 0.0434867199 -0.2558594867
-0.1407343024 0.0432769871 -0.3440413288
-0.1379105092 0.0376926210 -0.3958220076
-0.0793025457 0.0382449967 -0.4045340037
-0.0843028910 0.0683220879 -0.3376855317
-0.1178113093 0.0288876352 -0.4634218059
-0.0128872031 0.0037310280 -0.3246094140
0.0077275965 0.0154384746 -0.2710264209
-0.1117508591 0.0053876147 -0.4130994616
-0.1304250312 0.0351801033 -0.4483282091
-0.1264424898 0.0077529588 -0.4385299310
-0.1395471705 0.0801842934 -0.2670241225
-0.1494497831 0.1145318739 -0.2355596805
-0.1418001218 0.0936442827 -0.2548980523
-0.1667785224 0.1289410102 -0.2597868491
-0.1514791998 0.0871658277 -0.2984635927
-0.1418001218 0.0936442827 -0.2548980523
-0.1677104993 0.1435403995 -0.2066353360
-0.1738568210 0.1588331210 -0.1511101516
-0.1481288087 0.1156712739 -0.1945342376
-0.1677104993 0.1435403995 -0.2066353360
-0.1471968318 0.1010718846 -0.2476857507
-0.1514791998 0.0871658277 -0.2984635927
-0.1667785224 0.1289410102 -0.2597868491
-0.1471968318 0.1010718846 -0.2476857507
-0.1677104993 0.1435403995 -0.2066353360
-0.1481288087 0.1156712739 -0.1945342376
-0.1738568210 0.1588331210 -0.1511101516
-0.1677104993 0.1435403995 -0.2066353360
-0.1336840697 -0.0932749599 -0.2759327608
-0.1466750004 -0.1133369152 -0.2148475061
-0.1499960920 -0.0960419492 -0.3046316698
-0.1896642533 -0.1690293434 -0.1951187162
-0.1613633045 -0.1355659865 -0.2390862539
-0.1786150602 -0.1553836870 -0.2255223654
-0.1492313682 -0.1068347495 -0.2446101127
-0.1637866197 -0.1393027926 -0.2154645489
-0.1589399892 -0.1318291804 -0.2627079589
-0.1492313682 -0.1068347495 -0.2446101127
-0.1468080530 -0.1030979434 -0.2682318177
-0.1402874710 -0.0710475183 -0.2865338236
-0.1589399892 -0.1318291804 -0.2627079589
-0.1553679798 -0.1264513858 -0.2198728162
-0.1505213494 -0.1189777736 -0.2671162262
-0.1396793943 -0.1023895606 -0.2951461985
-0.1613633045 -0.1355659865 -0.2390862539
-0.1789546763 -0.1683636117 -0.2126489774
-0.0988329521 -0.0841104596 -0.2340283362
-0.1249910903 -0.0801604893 -0.2709074507
0.0289051406 -0.0027272152 -0.2180036181
-0.0030197877 -0.0228853428 -0.2897821379
0.0398348506 -0.0224032109 -0.1876529696
0.0658797625 -0.0089108890 -0.1284529377
-0.0114246508 -0.0163802478 -0.3112467061
0.0284176231 0.0039765434 -0.2224578541
-0.0119121683 -0.0096764892 -0.3157009420
-0.0232134097 0.0036696492 -0.3501473040
-0.1471526780 -0.0353941477 -0.3692679986
-0.1487208942 -0.0286873566 -0.3160045105
-0.1466119423 -0.0505779419 -0.2164066995
-0.1439081261 -0.0642865595 -0.2797022965
-0.1489912621 -0.0210954594 -0.3924351600
-0.1342709649 -0.0540882342 -0.3605550913
-0.1147467733 -0.0678456468 -0.3350588645
-0.0966839765 -0.0806367173 -0.2670836186
-0.0976200336 -0.0654000818 -0.3321673730
-0.0133357812 -0.0517352687 -0.2146611308
-0.0513739224 -0.0767534865 -0.2121194163
-0.0130700906 -0.0610870844 -0.1759492406
-0.0133357812 -0.0517352687 -0.2146611308
0.0252337411 -0.0454206823 -0.1397790649
0.0634047276 -0.0250783723 -0.1229648342
0.0154585153 -0.0423234210 -0.1778555264
0.0058161347 -0.0439020676 -0.1965760429
-0.0231110071 -0.0486380075 -0.2527375924
-0.0423957683 -0.0517953007 -0.2901786253
-0.0611491483 -0.0736562253 -0.2501958779
-0.0231110071 -0.0486380075 -0.2527375924
-0.0616805294 -0.0549525939 -0.3276196583
-0.0713229100 -0.0565312405 -0.3463401747
-0.0707915289 -0.0752348719 -0.2689163944
-0.0423957683 -0.0517953007 -0.2901786253
-0.1555473386 -0.0239436334 -0.1943506894
-0.1459089583 -0.0578748037 -0.1832074292
-0.1473149262 -0.0432810801 -0.2496059699
-0.1555473386 -0.0239436334 -0.1943506894
-0.1487208942 -0.0286873566 -0.3160045105
-0.1542430683 -0.0044249096 -0.3547754109
-0.1545437115 -0.0178327024 -0.2579634150
-0.1562503226 -0.0166467716 -0.2275499597
-0.0839671755 -0.0537496267 -0.3664754203
-0.0796638568 -0.0577941032 -0.3468597084
-0.0791324757 -0.0764977346 -0.2694359280
-0.0796638568 -0.0577941032 -0.3468597084
-0.0523038394 -0.0440221316 -0.3476110320
-0.0130195512 -0.0288785080 -0.2965780916
0.0441199664 -0.0282356655 -0.1604058672
-0.0030197877 -0.0228853428 -0.2897821379
-0.1252530818 0.0686204954 -0.1952814123
-0.1139459693 0.0693587493 -0.1759537825
-0.1565658705 0.0296100059 -0.1854209399
-0.1514025714 0.0455068962 -0.2217977613
-0.1489928376 0.0503813461 -0.2814251432
-0.1474441391 0.0589665616 -0.2283608916
-0.1462392722 0.0614037866 -0.2581745826
-0.0979794151 0.0794657517 -0.2263042144
-0.0676097052 0.0784504545 -0.2562261355
-0.0753651901 0.0809422595 -0.1876489547
-0.0979794151 0.0794657517 -0.2263042144
-0.0394092054 0.0601741418 -0.2264429726
-0.0753651901 0.0809422595 -0.1876489547
-0.0676097052 0.0784504545 -0.2562261355
-0.0394092054 0.0601741418 -0.2264429726
-0.0112087057 0.0418978290 -0.1966598096
0.0169917940 0.0236215163 -0.1668766467
-0.0471646904 0.0626659468 -0.1578657918
-0.0112087057 0.0418978290 -0.1966598096
-0.1606706256 0.0205554374 -0.2799146857
-0.1610695127 0.0003188136 -0.2331215898
-0.1559496794 -0.0032389788 -0.3243619556
-0.1551148843 0.0098567934 -0.3656951714
-0.0989412116 0.0749806217 -0.2823755750
-0.1293109216 0.0759959189 -0.2524536538
-0.1389899995 0.0695174639 -0.2960191943
-0.0989412116 0.0749806217 -0.2823755750
-0.1541963800 0.0384458521 -0.2986065822
-0.1567780296 0.0304974069 -0.2804181715
-0.1593194358 0.0185875655 -0.2086715005
-0.1606706256 0.0205554374 -0.2799146857
-0.1037807506 0.0717413942 -0.3041583452
0.1387455938 -0.0500593729 0.4433844209
0.1390650743 -0.0630873657 0.4460495295
0.1587001368 -0.0682070371 0.4530405388
0.1217317897 -0.0592585849 0.4252754967
0.1325952437 -0.0308913055 0.4298758013
0.1478366828 -0.0965743164 0.4484402342
0.1456476903 -0.0495491713 0.4414581701
0.1347842363 -0.0779164506 0.4368578654
0.1213733656 -0.0055297555 0.4196080287
0.1053843560 -0.0171313128 0.4033868557
0.0844759452 -0.0102571795 0.3661480755
0.0459541109 -0.0199783193 0.3019767875
0.0828284516 0.0014775236 0.3609949394
0.1469300441 -0.0177891532 0.4180321277
0.1324326157 -0.0113548695 0.4017290251
0.1480332585 0.0033579058 0.4476529270
0.1529364670 0.0360032326 0.4589789984
0.1190384016 0.0162264732 0.4150467218
0.1480332585 0.0033579058 0.4476529270
0.1359874343 0.0261148529 0.4370128601
0.1659834972 0.0669260844 0.4732701459
0.1552714311 0.0142470039 0.4635403054
0.1659834972 0.0669260844 0.4732701459
0.1359874343 0.0261148529 0.4370128601
0.1213733656 -0.0055297555 0.4196080287
0.1552714311 0.0142470039 0.4635403054
0.1325952437 -0.0308913055 0.4298758013
0.1212301744 -0.0283899921 0.3957321947
0.0830076039 0.0091225946 0.3122442022
0.0828284516 0.0014775236 0.3609949394
0.0701072750 0.0033338577 0.3071040186
0.0508463578 -0.0015267122 0.2750183745
0.1273931833 -0.0163689815 0.3362903699
0.1083421232 -0.0228537778 0.2623090533
0.1211177677 -0.0224743450 0.3452708365
0.1086231399 -0.0376428955 0.3884624488
0.0052879561 0.0313135498 0.1156613934
0.0120096210 -0.0011926425 0.2124757109
-0.0011622083 0.0284191814 0.1130913016
-0.0205805767 0.0285862162 0.0818199697
-0.0401346953 0.0464535315 0.0034265251
-0.0597566891 0.0731709869 -0.0985279760
-0.0336845309 0.0493478999 0.0059966169
-0.0110410803 0.0506280493 0.0385529946
0.0313601143 0.0074904628 0.2201859863
0.0151668281 0.0091046819 0.1901997003
0.0052879561 0.0313135498 0.1156613934
0.0279314068 0.0325936992 0.1482177711
0.0411032361 0.0029818753 0.2476021804
0.0474176503 0.0235765242 0.2030501594
0.0669038938 0.0145593491 0.2578825476
0.0411032361 0.0029818753 0.2476021804
0.1067218636 -0.0100011912 0.2716913484
0.1146175388 -0.0167484143 0.2533285867
0.1273931833 -0.0163689815 0.3362903699
0.0909305130 0.0034932549 0.3084168717
0.0893681922 0.0081944276 0.3391896626
0.1036516897 0.0016369209 0.3623077925
0.0572085698 -0.0304705973 0.2858465053
0.0676627752 -0.0339076640 0.3044658954
0.0877709324 -0.0337265858 0.3764543477
0.0941984154 -0.0460279362 0.3336395345
0.0523815939 -0.0322796697 0.2591619742
0.0845444636 -0.0496460810 0.2802704723
0.0748905117 -0.0532642258 0.2269014100
0.0523815939 -0.0322796697 0.2591619742
0.0491551250 -0.0481991649 0.1629780987
0.0555826080 -0.0605005153 0.1201632855
0.0411016803 -0.0659277325 0.0401096921
0.0290469678 -0.0483802431 0.0909896464
0.0483548715 -0.0411439535 0.1977277709
0.0274464607 -0.0342698202 0.1604889908
0.0258459536 -0.0201593974 0.2299883351
0.0483548715 -0.0411439535 0.1977277709
0.0891466262 -0.0360057144 0.2060322870
0.0795488777 -0.0425816827 0.1778939039
0.0794364710 -0.0366660356 0.1274325457
0.0795488777 -0.0425816827 0.1778939039
0.0602409740 -0.0498179723 0.0711557793
0.0411016803 -0.0659277325 0.0401096921
0.0555826080 -0.0605005153 0.1201632855
0.0699511292 -0.0491576511 0.1497555207
0.0748905117 -0.0532642258 0.2269014100
0.0891466262 -0.0360057144 0.2060322870
0.0845444636 -0.0496460810 0.2802704723
0.0939736021 -0.0341966420 0.2327168181
0.0941984154 -0.0460279362 0.3336395345
0.1085669365 -0.0346850720 0.3632317697
0.1083421232 -0.0228537778 0.2623090533
0.1036275540 -0.0305784972 0.2860858804
0.0924383661 -0.0034436845 0.2485732185
0.0929083634 -0.0018280774 0.1874946713
0.0780570076 0.0148975830 0.1020631003
0.1008040387 -0.0085753004 0.1691319097
0.0583357654 0.0231069545 0.0777699856
0.0578657681 0.0214913474 0.1388485328
0.0184232837 0.0379100903 0.0902623034
0.0583357654 0.0231069545 0.0777699856
0.0573957707 0.0198757402 0.1999270799
0.0571607720 0.0190679367 0.2304663535
0.0181882850 0.0371022868 0.1208015770
0.0578657681 0.0214913474 0.1388485328
-0.0205492034 0.0559444404 -0.0194024731
-0.0207842020 0.0551366368 0.0111368005
-0.0597566891 0.0731709869 -0.0985279760
-0.0200792060 0.0575600476 -0.0804810202
0.0188932810 0.0395256975 0.0291837563
0.0193632784 0.0411413046 -0.0318947909
0.0588057628 0.0247225617 0.0166914385
0.0188932810 0.0395256975 0.0291837563
0.1625000817 -0.0145991135 -0.0031557239
0.1561145452 -0.0134273413 0.0018625542
0.1133900376 -0.0175410943 -0.0346407197
0.1522045766 -0.0106781729 -0.0451163928
0.1058611847 -0.0181734437 -0.0720546651
0.1133900376 -0.0175410943 -0.0346407197
0.1272911468 -0.0082680826 -0.0694618894
0.0774079016 -0.0331949293 -0.0300437481
0.0698790487 -0.0338272786 -0.0674576935
0.0442581685 -0.0576396777 -0.0313254779
0.0774079016 -0.0331949293 -0.0300437481
0.0645974615 -0.0451011288 -0.0119776403
0.0780836152 -0.0293763224 0.0176104565
0.0721360681 -0.0361902057 0.0354588975
0.0410454769 -0.0629699089 0.0148790130
0.0602409740 -0.0498179723 0.0711557793
0.0721360681 -0.0361902057 0.0354588975
0.0794364710 -0.0366660356 0.1274325457
0.1045795151 -0.0167002157 0.1658608710
0.0835589174 -0.0297331949 0.0865906927
0.0817338166 -0.0296142374 0.0635972806
0.0011673755 -0.0350065793 0.1331702890
-0.0251117096 -0.0357433383 0.1058515872
-0.0505905413 -0.0435353087 0.0437832133
-0.0251117096 -0.0357433383 0.1058515872
0.0003671220 -0.0279513679 0.1679199612
0.0258459536 -0.0201593974 0.2299883351
0.0011673755 -0.0350065793 0.1331702890
0.0274464607 -0.0342698202 0.1604889908
-0.0235112025 -0.0498537611 0.0363522429
0.0043683897 -0.0632274249 -0.0058283997
-0.0497902877 -0.0505905202 0.0090335411
-0.0235112025 -0.0498537611 0.0363522429
0.0027678826 -0.0491170021 0.0636709446
0.0290469678 -0.0483802431 0.0909896464
0.0306474749 -0.0624906659 0.0214903020
0.0027678826 -0.0491170021 0.0636709446
-0.0382090889 -0.0722125269 -0.1016828508
-0.0696258188 -0.0692388727 -0.1087519063
-0.1137892445 -0.0681453197 -0.1429391035
-0.0696258188 -0.0692388727 -0.1087519063
-0.0254623931 -0.0703324256 -0.0745647091
0.0187010326 -0.0714259786 -0.0403775119
-0.0382090889 -0.0722125269 -0.1016828508
-0.0067923591 -0.0751861811 -0.0946137954
-0.0951192105 -0.0729990752 -0.1629881898
-0.0891958723 -0.0797329320 -0.2101554179
-0.1265359403 -0.0700254210 -0.1700572452
-0.0951192105 -0.0729990752 -0.1629881898
-0.0637024806 -0.0759727295 -0.1559191343
-0.0322857508 -0.0789463837 -0.1488500789
-0.0577791425 -0.0827065863 -0.2030863624
-0.0637024806 -0.0759727295 -0.1559191343
-0.1372465059 -0.0733444921 -0.1902770887
-0.0999064379 -0.0830520031 -0.2303752614
-0.0067286148 -0.0651600829 -0.1397980449
0.0188285211 -0.0513737820 -0.1307460110
0.0571323529 -0.0357073799 -0.0945758353
0.0188285211 -0.0513737820 -0.1307460110
-0.0194753107 -0.0670401842 -0.1669161867
-0.0577791425 -0.0827065863 -0.2030863624
-0.0067286148 -0.0651600829 -0.1397980449
-0.0322857508 -0.0789463837 -0.1488500789
0.0443219128 -0.0476135795 -0.0765097275
0.0442581685 -0.0576396777 -0.0313254779
0.0698790487 -0.0338272786 -0.0674576935
0.0443219128 -0.0476135795 -0.0765097275
0.0187647768 -0.0613998803 -0.0855617614
-0.0067923591 -0.0751861811 -0.0946137954
0.0187010326 -0.0714259786 -0.0403775119
0.0187647768 -0.0613998803 -0.0855617614
0.1009293137 -0.0164623007 0.1198740469
0.0947812293 -0.0021081066 0.0713247542
0.1272911468 -0.0082680826 -0.0694618894
0.0679398748 0.0048063967 -0.1269846608
-0.1481540554 0.0220141638 -0.1581788178
-0.1402371909 0.0489334946 -0.1713050785
-0.1234135608 0.0337418103 -0.1168208342
-0.1481540554 0.0220141638 -0.1581788178
-0.1065899307 0.0185501260 -0.0623365899
-0.1021365478 -0.0025053815 -0.0285313374
-0.1333096414 0.0000926469 -0.1004130083
-0.1397422403 0.0144183217 -0.1309366956
0.1857638581 -0.0068404323 -0.0096599623
0.1496007928 -0.0082952138 -0.0116955718
-0.1444533235 -0.0321065046 -0.1371908621
-0.1540917038 0.0018246657 -0.1483341222
-0.1333096414 0.0000926469 -0.1004130083
-0.1444533235 -0.0321065046 -0.1371908621
-0.1125275790 -0.0016393720 -0.0524918944
-0.0973173577 -0.0194709666 -0.0229597073
-0.1292431021 -0.0499380992 -0.1076586750
-0.1236712611 -0.0338385235 -0.0892697482
0.0471832941 0.0143907304 -0.1358313004
0.0660531326 0.0150978260 -0.0914338871
0.0245399711 0.0342664934 -0.1091271663
0.0471832941 0.0143907304 -0.1358313004
-0.0169731904 0.0534351608 -0.1268204455
-0.0471646904 0.0626659468 -0.1578657918
0.0169917940 0.0236215163 -0.1668766467
0.0056701326 0.0335593978 -0.1535245796
0.0826683592 0.0110133412 -0.0208013471
0.0608764399 0.0219726372 -0.0142015117
0.0847390363 0.0082634167 -0.0516942973
0.0805976821 0.0137632657 0.0100916030
0.0608764399 0.0219726372 -0.0142015117
0.0411551977 0.0301820086 -0.0384946264
0.0214339555 0.0383913801 -0.0627877410
0.0650177941 0.0164727882 -0.0759874120
0.0411551977 0.0301820086 -0.0384946264
0.0017127133 0.0466007516 -0.0870808557
-0.0180085289 0.0548101231 -0.1113739704
-0.0595216904 0.0739787905 -0.1290672496
-0.0180085289 0.0548101231 -0.1113739704
0.0235046326 0.0356414556 -0.0936806912
0.0650177941 0.0164727882 -0.0759874120
0.0017127133 0.0466007516 -0.0870808557
0.0214339555 0.0383913801 -0.0627877410
0.0947812293 -0.0021081066 0.0713247542
0.0933783608 -0.0002124702 0.1264161242
0.1274591530 -0.0051842063 -0.0244305696
0.1089513531 0.0024024848 -0.0698522497
0.1496007928 -0.0082952138 -0.0116955718
0.1532346327 -0.0038195301 -0.0443822543
0.1053175132 -0.0020731989 -0.0371655673
-0.0937827618 0.0612753908 -0.1221736475
-0.0923769172 0.0540263583 -0.1009319346
-0.0708078650 0.0386939673 -0.0259100866
-0.0982409872 0.0363209403 -0.0640968632
-0.1038643655 0.0653170701 -0.1490637150
-0.1184041947 0.0444042988 -0.1178769982
-0.1385674022 0.0524876574 -0.1716571332
-0.1038643655 0.0653170701 -0.1490637150
-0.0397725938 -0.0225754453 0.1102983887
-0.0547544391 -0.0064540968 0.0807268342
-0.0015543463 -0.0108874896 0.2034009496
-0.0142937621 -0.0147834748 0.1723667626
-0.0674938549 -0.0103500820 0.0496926472
-0.0733029554 -0.0173024080 0.0338098956
-0.0397725938 -0.0225754453 0.1102983887
-0.0652514254 -0.0303674157 0.0482300147
-0.0830871457 0.0175750932 -0.0092605643
-0.0914989608 0.0251709353 -0.0365026864
-0.1318253759 0.0413376524 -0.1440629564
-0.0914989608 0.0251709353 -0.0365026864
-0.0939537134 -0.0494969672 -0.0251536561
-0.1292431021 -0.0499380992 -0.1076586750
-0.0950749282 -0.0394883003 -0.0244223399
-0.0870934921 -0.0318715172 -0.0032475979
-0.0397950360 -0.0621338719 -0.0400155969
-0.0497902877 -0.0505905202 0.0090335411
0.0043683897 -0.0632274249 -0.0058283997
-0.0397950360 -0.0621338719 -0.0400155969
-0.0839584617 -0.0610403190 -0.0742027941
-0.1281218874 -0.0599467661 -0.1083899913
-0.0939537134 -0.0494969672 -0.0251536561
-0.0839584617 -0.0610403190 -0.0742027941
-0.0447357069 0.0148708803 0.0786145063
-0.0597055188 0.0124250657 0.0482980321
0.0017852311 -0.0037791639 0.2026968403
-0.0514148617 0.0006542289 0.0800227249
-0.0708078650 0.0386939673 -0.0259100866
-0.0662068535 0.0702766185 -0.1010980679
-0.0605834751 0.0412804887 -0.0161312161
-0.0475473960 0.0293689452 0.0361310804
-0.0140625372 0.0226304445 0.1079511180
0.0017852311 -0.0037791639 0.2026968403
-0.0242869271 0.0200439231 0.0981722474
-0.0563659414 0.0195333914 0.0475939228
-0.0587956954 -0.0232526098 -0.3986013304
-0.0492834494 -0.0105556860 -0.3962596127
-0.1237167783 -0.0097122071 -0.4261028865
-0.1330908301 -0.0156095107 -0.4471930101
-0.1296686923 -0.0491365892 -0.3793657991
-0.1250634710 -0.0614980354 -0.3445443358
-0.1178694766 0.0019915897 -0.4772085548
-0.1092035602 -0.0193706553 -0.4519471311
-0.1196854274 -0.0189459610 -0.4515769059
-0.1218829547 -0.0129983403 -0.4659346360
-0.0730054451 -0.0351037168 -0.4075697351
-0.0602125399 -0.0111769017 -0.4211190006
-0.0857490096 -0.0366911050 -0.4108666829
-0.0865376288 -0.0100852818 -0.4433799465
-0.1534101896 0.0010840838 -0.4519035899
-0.0325645814 -0.0097992469 -0.3667767220
-0.0515890736 -0.0351930945 -0.3714601575
-0.1024309032 -0.0392168304 -0.4119057502
-0.1381656171 -0.0251054100 -0.4410870176
-0.0953506987 -0.0444609903 -0.3989984412
-0.1024309032 -0.0392168304 -0.4119057502
-0.0877391131 -0.0684087816 -0.3086673519
-0.1247712728 0.0048265517 -0.4687209220
-0.1138804066 -0.0123715143 -0.4325569662
-0.1185628170 -0.0035296658 -0.4213346775
-0.1350723594 -0.0098353993 -0.4367209845
-0.1413591141 0.0070198443 -0.4723543544
-0.1413591141 0.0070198443 -0.4723543544
-0.1325667431 0.0321096404 -0.4533331612
-0.1262728798 0.0259455573 -0.4379407212
-0.1323528625 -0.0011554424 -0.4425207404
-0.0602125399 -0.0111769017 -0.4211190006
-0.0800876947 -0.0066525515 -0.4424031030
-0.0397712033 0.0021412378 -0.3939178949
-0.0648364732 0.0466347042 -0.3678816936
-0.0899978783 0.0508165481 -0.3881617170
-0.0602459964 0.0335703964 -0.3947724759
-0.0648364732 0.0466347042 -0.3678816936
-0.0694269500 0.0596990121 -0.3409909112
-0.0740174268 0.0727633199 -0.3141001288
-0.0945883551 0.0638808559 -0.3612709346
-0.0694269500 0.0596990121 -0.3409909112
-0.1178694766 0.0019915897 -0.4772085548
-0.1304250312 0.0351801033 -0.4483282091
-0.1178113093 0.0288876352 -0.4634218059
-0.0736376728 0.0320769535 -0.4161978136
-0.0906039179 0.0387257915 -0.4194258877
-0.0837334339 0.0282708497 -0.4303580499
-0.0736376728 0.0320769535 -0.4161978136
-0.1379105092 0.0376926210 -0.3958220076
-0.1563451906 0.0268658851 -0.3526514058
-0.1420189151 0.0343207271 -0.4060073968
-0.1389641832 0.0346762541 -0.4428707814
-0.1420551366 0.0465946430 -0.3290842206
-0.1314014924 0.0516603016 -0.3581679826
-0.1490054206 0.0105678475 -0.4394219406
-0.1520601524 0.0102123205 -0.4025585560
-0.1563451906 0.0268658851 -0.3526514058
-0.1529723652 0.0015300111 -0.3906487464
-0.1490054206 0.0105678475 -0.4394219406
-0.1547003613 0.0050245113 -0.4700542241
-0.1074845025 0.0643338501 -0.3518496587
-0.0942211567 0.0719417400 -0.3164475730
-0.0486734030 0.0519911000 -0.3305927468
-0.0499605323 0.0380116284 -0.3711870731
-0.0308085132 0.0365495806 -0.3257206706
-0.0562026828 0.0645978260 -0.3105537364
-0.0411441231 0.0393843740 -0.3506317573
-0.0308085132 0.0365495806 -0.3257206706
-0.0204729032 0.0337147873 -0.3008095839
-0.0101372933 0.0308799939 -0.2758984972
-0.0458670729 0.0617630326 -0.2856426497
-0.0204729032 0.0337147873 -0.3008095839
0.0001983166 0.0280452005 -0.2509874105
0.0105339266 0.0252104072 -0.2260763238
0.0387344263 0.0069340945 -0.1962931608
0.0105339266 0.0252104072 -0.2260763238
-0.0176665732 0.0434867199 -0.2558594867
-0.0458670729 0.0617630326 -0.2856426497
0.0001983166 0.0280452005 -0.2509874105
-0.0101372933 0.0308799939 -0.2758984972
-0.1314014924 0.0516603016 -0.3581679826
-0.1522367847 0.0302377791 -0.3424660167
-0.1299895958 0.0488681186 -0.3840583220
-0.1264080269 0.0507318291 -0.3973973197
-0.0920881825 0.0488423103 -0.3946951706
-0.0751219374 0.0421934722 -0.3914670965
-0.0945883551 0.0638808559 -0.3612709346
-0.0929003225 0.0686240841 -0.3314046811
-0.1002791291 0.0210320157 -0.4454951297
-0.1161851483 0.0107130646 -0.4745991639
-0.0232510232 0.0152543380 -0.3476400908
-0.0129248166 0.0153157169 -0.3221022009
0.0284176231 0.0039765434 -0.2224578541
-0.0129436234 0.0211080613 -0.3208485943
-0.1276303267 0.0185376277 -0.4598813024
-0.1159774579 0.0265068389 -0.4348668500
-0.1201469194 0.0013446545 -0.4270363768
-0.1351388041 0.0061070362 -0.4361561447
-0.1201469194 0.0013446545 -0.4270363768
-0.1243158789 -0.0105248537 -0.4360833671
-0.1805745054 0.1651213230 -0.1849232930
-0.1542893221 0.1112926465 -0.2573424507
-0.1369605829 0.0968835101 -0.2331152820
-0.1619389834 0.1321802377 -0.2380040789
-0.1542893221 0.1112926465 -0.2573424507
-0.1466396608 0.0904050552 -0.2766808225
-0.1389899995 0.0695174639 -0.2960191943
-0.1293109216 0.0759959189 -0.2524536538
-0.1466396608 0.0904050552 -0.2766808225
-0.1707836601 0.1511867602 -0.1788727438
-0.1775013445 0.1574749623 -0.2126858852
-0.1836476663 0.1727676838 -0.1571607008
-0.1707836601 0.1511867602 -0.1788727438
-0.1579196540 0.1296058367 -0.2005847868
-0.1450556478 0.1080249131 -0.2222968298
-0.1646373384 0.1358940387 -0.2343979282
-0.1579196540 0.1296058367 -0.2005847868
-0.1493380158 0.0941188562 -0.2730746717
-0.1374059865 0.0871373219 -0.2416352016
-0.1416883545 0.0732312649 -0.2924130435
-0.1493380158 0.0941188562 -0.2730746717
-0.1569876771 0.1150064474 -0.2537362999
-0.1646373384 0.1358940387 -0.2343979282
-0.1450556478 0.1080249131 -0.2222968298
-0.1569876771 0.1150064474 -0.2537362999
-0.1579196540 0.1296058367 -0.2005847868
-0.1646373384 0.1358940387 -0.2343979282
-0.1450556478 0.1080249131 -0.2222968298
-0.1579196540 0.1296058367 -0.2005847868
-0.1707836601 0.1511867602 -0.1788727438
-0.1836476663 0.1727676838 -0.1571607008
-0.1775013445 0.1574749623 -0.2126858852
-0.1707836601 0.1511867602 -0.1788727438
-0.1805745054 0.1651213230 -0.1849232930
-0.1516546835 -0.1105715556 -0.2209884077
-0.1249910903 -0.0801604893 -0.2709074507
-0.1304120678 -0.0884545958 -0.2568924645
-0.1553679798 -0.1264513858 -0.2198728162
-0.1369075332 -0.0984855734 -0.2263498372
-0.1467358010 -0.0800167367 -0.3137826727
-0.1396793943 -0.1023895606 -0.2951461985
-0.1834616907 -0.1628572992 -0.1782789554
-0.1724124976 -0.1492116429 -0.2086826047
-0.1675658671 -0.1417380306 -0.2559260146
-0.1637866197 -0.1393027926 -0.2154645489
-0.1834616907 -0.1628572992 -0.1782789554
-0.1435477620 -0.0870727308 -0.2773828206
-0.1532563830 -0.1120671617 -0.2954806668
-0.1467358010 -0.0800167367 -0.3137826727
-0.1435477620 -0.0870727308 -0.2773828206
-0.1439081261 -0.0642865595 -0.2797022965
-0.1411527032 -0.0716375890 -0.2000710652
-0.1637866197 -0.1393027926 -0.2154645489
-0.1639960081 -0.1415161201 -0.2617694350
-0.1688426386 -0.1489897323 -0.2145260251
-0.1763219727 -0.1624134781 -0.1899657962
-0.1411527032 -0.0716375890 -0.2000710652
-0.1119120212 -0.0821354744 -0.2524678935
-0.0836049074 -0.0826117024 -0.2486440614
-0.1097630455 -0.0786617321 -0.2855231758
-0.1119120212 -0.0821354744 -0.2524678935
0.0373100037 -0.0092323102 -0.1965390499
0.0188226927 -0.0061404733 -0.2413143901
-0.0114246508 -0.0163802478 -0.3112467061
0.0112650917 -0.0227246322 -0.2557390818
0.0373100037 -0.0092323102 -0.1965390499
0.0469772903 -0.0223228556 -0.1706314415
0.0684046094 -0.0220817897 -0.1195668574
0.0574748994 -0.0024057939 -0.1499175059
-0.1453140940 -0.0496928359 -0.3461008371
-0.1501268621 -0.0140936330 -0.3824030512
-0.1464496941 -0.0426910095 -0.3360687283
-0.1457467101 -0.0499878712 -0.3028694579
-0.1473149262 -0.0432810801 -0.2496059699
-0.1447733582 -0.0648766301 -0.1932395381
-0.1461793262 -0.0502829066 -0.2596380787
-0.1457467101 -0.0499878712 -0.3028694579
-0.1379481329 -0.0254908577 -0.4068894142
-0.1361095489 -0.0397895459 -0.3837222527
-0.1453140940 -0.0496928359 -0.3461008371
-0.1296686923 -0.0491365892 -0.3793657991
-0.1187944440 -0.0722661969 -0.3195107988
-0.1250634710 -0.0614980354 -0.3445443358
-0.1097630455 -0.0786617321 -0.2855231758
-0.0795572367 -0.0781911523 -0.2641921271
-0.1102310741 -0.0710434144 -0.3180650530
-0.1147467733 -0.0678456468 -0.3350588645
-0.0323548518 -0.0642443776 -0.2133902736
-0.0134686265 -0.0470593609 -0.2340170759
-0.0515067677 -0.0720775787 -0.2314753614
-0.0323548518 -0.0642443776 -0.2133902736
-0.0132029359 -0.0564111765 -0.1953051857
0.0059489800 -0.0485779755 -0.1772200978
0.0056832894 -0.0392261598 -0.2159319880
-0.0132029359 -0.0564111765 -0.1953051857
0.0251008958 -0.0407447744 -0.1591350100
0.0442528117 -0.0329115734 -0.1410499221
0.0635375729 -0.0297542801 -0.1036088891
0.0537623470 -0.0266570189 -0.1416853507
0.0344775859 -0.0298143121 -0.1791263837
0.0251008958 -0.0407447744 -0.1591350100
0.0151928247 -0.0329716053 -0.2165674166
0.0154585153 -0.0423234210 -0.1778555264
-0.0327533877 -0.0502166541 -0.2714581088
-0.0040919365 -0.0361288986 -0.2540084496
-0.0233766977 -0.0392861918 -0.2914494825
-0.0327533877 -0.0502166541 -0.2714581088
-0.0421300777 -0.0611471164 -0.2514667351
-0.0515067677 -0.0720775787 -0.2314753614
-0.0134686265 -0.0470593609 -0.2340170759
-0.0421300777 -0.0611471164 -0.2514667351
-0.0426614589 -0.0424434850 -0.3288905155
-0.0520381489 -0.0533739473 -0.3088991418
-0.0619462200 -0.0456007782 -0.3663315485
-0.0616805294 -0.0549525939 -0.3276196583
-0.0614148389 -0.0643044096 -0.2889077681
-0.0611491483 -0.0736562253 -0.2501958779
-0.0614148389 -0.0643044096 -0.2889077681
-0.0520381489 -0.0533739473 -0.3088991418
-0.1507281485 -0.0409092185 -0.1887790593
-0.1596635448 -0.0142749100 -0.1667230491
-0.1500251645 -0.0482060803 -0.1555797890
-0.1507281485 -0.0409092185 -0.1887790593
-0.1514311324 -0.0336123568 -0.2219783296
-0.1521341164 -0.0263154950 -0.2551775999
-0.1603665288 -0.0069780482 -0.1999223194
-0.1514311324 -0.0336123568 -0.2219783296
-0.1528371004 -0.0190186332 -0.2883768703
-0.1535400843 -0.0117217714 -0.3215761406
-0.1501268621 -0.0140936330 -0.3824030512
-0.1559496794 -0.0032389788 -0.3243619556
-0.1593629016 -0.0008671172 -0.2635350451
-0.1561000010 -0.0099428752 -0.2759559577
-0.1627761238 0.0015047444 -0.2027081345
-0.1545437115 -0.0178327024 -0.2579634150
-0.0515890736 -0.0351930945 -0.3714601575
-0.0323043124 -0.0320358012 -0.3340191245
-0.0137343171 -0.0377075452 -0.2727289661
-0.0223045489 -0.0260426360 -0.3272231708
0.0248352053 -0.0313929587 -0.1978469002
0.0541197300 -0.0222425003 -0.1536099135
0.0112650917 -0.0227246322 -0.2557390818
-0.0130195512 -0.0288785080 -0.2965780916
-0.1131642701 0.0799734003 -0.2113432538
-0.1365601943 0.0678822415 -0.2146090421
-0.0905500451 0.0814499081 -0.1726879941
-0.1252530818 0.0686204954 -0.1952814123
-0.1474441391 0.0589665616 -0.2283608916
-0.1384479779 0.0714122545 -0.2756379872
-0.0827945602 0.0789581031 -0.2412651750
-0.1092865276 0.0787274978 -0.2456318442
-0.0789168177 0.0777122006 -0.2755537654
-0.0827945602 0.0789581031 -0.2412651750
-0.0866723026 0.0802040056 -0.2069765845
-0.0905500451 0.0814499081 -0.1726879941
-0.1131642701 0.0799734003 -0.2113432538
-0.0866723026 0.0802040056 -0.2069765845
-0.0573871978 0.0705582006 -0.2070459636
-0.0253089556 0.0510359854 -0.2115513911
-0.0612649402 0.0718041031 -0.1727573732
-0.0573871978 0.0705582006 -0.2070459636
-0.0535094553 0.0693122981 -0.2413345541
-0.0496317128 0.0680663956 -0.2756231445
-0.0214312131 0.0497900829 -0.2458399815
-0.0535094553 0.0693122981 -0.2413345541
0.0028915442 0.0327596727 -0.1817682282
0.0067692867 0.0315137702 -0.2160568186
0.0349697864 0.0132374575 -0.1862736556
0.0028915442 0.0327596727 -0.1817682282
-0.0291866980 0.0522818879 -0.1772628007
-0.0612649402 0.0718041031 -0.1727573732
-0.0253089556 0.0510359854 -0.2115513911
-0.0291866980 0.0522818879 -0.1772628007
-0.1600352740 0.0235328977 -0.2978513535
-0.1597988096 0.0062737343 -0.2689949253
-0.1632120318 0.0086455959 -0.2081680147
-0.1593629016 -0.0008671172 -0.2635350451
-0.1585281065 0.0122286550 -0.3048682608
-0.1568214954 0.0110427242 -0.3352817161
-0.1525364572 -0.0056108404 -0.3851888662
-0.1572574034 0.0181835758 -0.3407415963
-0.1141260666 0.0754882703 -0.2674146144
-0.0789168177 0.0777122006 -0.2755537654
-0.1092865276 0.0787274978 -0.2456318442
-0.1141260666 0.0754882703 -0.2674146144
-0.1189656056 0.0722490428 -0.2891973846
-0.1238051445 0.0690098153 -0.3109801549
-0.0837563566 0.0744729731 -0.2973365356
-0.1189656056 0.0722490428 -0.2891973846
-0.1420551366 0.0465946430 -0.3290842206
-0.0942211567 0.0719417400 -0.3164475730
-0.1142455506 0.0692101611 -0.3232693826
0.1743180592 -0.1174296294 0.4770074979
0.1537787191 -0.0547886998 0.4582300674
0.1365895062 -0.0341723984 0.4394377598
0.1542579399 -0.0743306889 0.4622277303
0.1387455938 -0.0500593729 0.4433844209
0.1390650743 -0.0630873657 0.4460495295
0.1365895062 -0.0341723984 0.4394377598
0.1750997061 -0.1213060814 0.4777619512
0.1629809748 -0.0533779521 0.4622322029
0.1597946331 -0.0917196096 0.4565315709
0.1478366828 -0.0965743164 0.4484402342
0.1359042884 -0.0666220685 0.4444503802
0.1053843560 -0.0171313128 0.4033868557
0.1246683528 -0.0289991618 0.4299143009
0.0949301506 -0.0136942461 0.3847674656
0.0982251378 -0.0371636524 0.3950737378
0.0773167270 -0.0302895192 0.3578349577
0.0949301506 -0.0136942461 0.3847674656
0.0564083162 -0.0234153859 0.3205961775
0.0443066173 -0.0082436161 0.2968236513
0.0748454866 -0.0126874645 0.3501052535
0.0844759452 -0.0102571795 0.3661480755
0.1324326157 -0.0113548695 0.4017290251
0.1455816543 -0.0129647576 0.4419898913
0.1179351872 -0.0049205858 0.3854259225
0.1165867973 -0.0000961902 0.4093836860
0.1529364670 0.0360032326 0.4589789984
0.1233874116 0.0265340905 0.4198104376
0.1572854771 0.0463108499 0.4637427143
0.1785835198 0.0665068468 0.4904725684
0.1479643967 -0.0015753004 0.4548378897
0.1671323435 0.0167181780 0.4728564454
0.1785835198 0.0665068468 0.4904725684
0.1572854771 0.0463108499 0.4637427143
0.1233874116 0.0265340905 0.4198104376
0.1529364670 0.0360032326 0.4589789984
0.1383223983 0.0043586242 0.4415741670
0.1190384016 0.0162264732 0.4150467218
0.1529364670 0.0360032326 0.4589789984
0.1383223983 0.0043586242 0.4415741670
0.1211177677 -0.0224743450 0.3452708365
0.1241992722 -0.0164638397 0.3155499241
0.1146175388 -0.0167484143 0.2533285867
0.1083983265 -0.0258116013 0.2875397324
0.1274493866 -0.0193268050 0.3615210490
0.1085107332 -0.0317272484 0.3380010906
0.1212020727 -0.0269110803 0.3831168552
0.1212301744 -0.0283899921 0.3957321947
0.0845426908 0.0033035385 0.2669359801
0.0988261883 -0.0032539681 0.2900541101
0.1003340413 -0.0101909076 0.2302104568
0.1067218636 -0.0100011912 0.2716913484
0.1131096858 -0.0098114748 0.3131722400
0.1194975080 -0.0096217584 0.3546531316
0.1131096858 -0.0098114748 0.3131722400
0.0988261883 -0.0032539681 0.2900541101
0.1036516897 0.0016369209 0.3623077925
0.0909305130 0.0034932549 0.3084168717
0.1179351872 -0.0049205858 0.3854259225
0.1194975080 -0.0096217584 0.3546531316
0.0676627752 -0.0339076640 0.3044658954
0.0354999055 -0.0165412527 0.2833573974
0.0781169806 -0.0373447306 0.3230852855
0.0564083162 -0.0234153859 0.3205961775
0.0773167270 -0.0302895192 0.3578349577
0.1038523673 -0.0424097915 0.3870085968
0.0829439565 -0.0355356582 0.3497698166
0.0781169806 -0.0373447306 0.3230852855
0.0684630287 -0.0409628754 0.2697162232
0.0411271349 -0.0217873917 0.2752922563
0.0732900046 -0.0391538030 0.2964007544
0.0684630287 -0.0409628754 0.2697162232
0.0636360528 -0.0427719477 0.2430316921
0.0588090769 -0.0445810201 0.2163471610
0.0363001590 -0.0235964641 0.2486077252
0.0636360528 -0.0427719477 0.2430316921
0.0387009196 -0.0447620983 0.1443587087
0.0652365599 -0.0568823706 0.1735323477
0.0443281491 -0.0500082373 0.1362935676
0.0395011732 -0.0518173097 0.1096090365
0.0459286562 -0.0641186601 0.0667942232
0.0306474749 -0.0624906659 0.0214903020
0.0403014267 -0.0588725211 0.0748593643
0.0395011732 -0.0518173097 0.1096090365
0.0379006661 -0.0377068869 0.1791083808
0.0596093304 -0.0516362315 0.1815974888
0.0387009196 -0.0447620983 0.1443587087
0.0379006661 -0.0377068869 0.1791083808
0.0371004126 -0.0306516755 0.2138580530
0.0363001590 -0.0235964641 0.2486077252
0.0588090769 -0.0445810201 0.2163471610
0.0371004126 -0.0306516755 0.2138580530
0.0926733647 -0.0026358809 0.2180339449
0.0768820142 0.0108585652 0.2547594682
0.0773520116 0.0124741723 0.1936809210
0.0926733647 -0.0026358809 0.2180339449
0.0778220089 0.0140897795 0.1326023739
0.0859526829 0.0081503600 0.0837003387
0.0970911997 -0.0043938853 0.1477740169
0.0929083634 -0.0018280774 0.1874946713
0.0581007667 0.0222991509 0.1083092592
0.0782920063 0.0157053866 0.0715238268
0.0778220089 0.0140897795 0.1326023739
0.0581007667 0.0222991509 0.1083092592
0.0383795245 0.0305085224 0.0840161445
0.0186582824 0.0387178939 0.0597230298
0.0585707641 0.0239147581 0.0472307121
0.0383795245 0.0305085224 0.0840161445
0.0773520116 0.0124741723 0.1936809210
0.0576307694 0.0206835438 0.1693878064
0.0768820142 0.0108585652 0.2547594682
0.0573957707 0.0198757402 0.1999270799
0.0379095272 0.0288929153 0.1450946917
0.0184232837 0.0379100903 0.0902623034
0.0379095272 0.0288929153 0.1450946917
0.0576307694 0.0206835438 0.1693878064
-0.0005929625 0.0485428725 -0.0256486320
-0.0203142047 0.0567522440 -0.0499417467
-0.0010629598 0.0469272654 0.0354299152
-0.0205492034 0.0559444404 -0.0194024731
-0.0400354469 0.0649616155 -0.0742348614
-0.0595216904 0.0739787905 -0.1290672496
-0.0400354469 0.0649616155 -0.0742348614
-0.0203142047 0.0567522440 -0.0499417467
0.0191282797 0.0403335010 -0.0013555173
-0.0010629598 0.0469272654 0.0354299152
-0.0005929625 0.0485428725 -0.0256486320
0.0191282797 0.0403335010 -0.0013555173
0.0388495219 0.0321241296 0.0229375974
0.0585707641 0.0239147581 0.0472307121
0.0186582824 0.0387178939 0.0597230298
0.0388495219 0.0321241296 0.0229375974
0.1489842681 -0.0120767290 -0.0215630303
0.1888920862 -0.0094529220 -0.0132399502
0.1290328807 -0.0144258083 -0.0585855289
0.1032485839 -0.0089368551 -0.0883692057
0.0565907725 -0.0495800573 0.0251689552
0.0780836152 -0.0293763224 0.0176104565
0.0469930240 -0.0561560257 -0.0029694279
0.0565907725 -0.0495800573 0.0251689552
0.0661885210 -0.0430040890 0.0533073384
0.0757862696 -0.0364281207 0.0814457216
0.0876813637 -0.0228003541 0.0457488397
0.0661885210 -0.0430040890 0.0533073384
0.0853840181 -0.0298521524 0.1095841047
0.0949817666 -0.0232761840 0.1377224879
0.0986319680 -0.0235140990 0.1837093120
0.1027544144 -0.0165812582 0.1428674590
0.0991042129 -0.0163433433 0.0968806349
0.0853840181 -0.0298521524 0.1095841047
0.0954540115 -0.0161054283 0.0508938108
0.0835589174 -0.0297331949 0.0865906927
-0.0119721671 -0.0353749588 0.1195109381
0.0151071717 -0.0416934112 0.1120799677
-0.0111719135 -0.0424301702 0.0847612659
-0.0119721671 -0.0353749588 0.1195109381
-0.0374509987 -0.0431669292 0.0574425642
-0.0641302106 -0.0403760826 0.0474986985
-0.0386513790 -0.0325841121 0.1095670724
-0.0382512522 -0.0361117178 0.0921922363
0.0135066646 -0.0275829884 0.1815793121
-0.0131725474 -0.0247921417 0.1716354464
0.0123062843 -0.0170001712 0.2337038203
0.0127064110 -0.0205277770 0.2163289842
0.0143069181 -0.0346381998 0.1468296399
-0.0127724206 -0.0283197474 0.1542606103
0.0135066646 -0.0275829884 0.1815793121
0.0143069181 -0.0346381998 0.1468296399
-0.0095714064 -0.0565405930 0.0152619216
-0.0103716600 -0.0494853816 0.0500115937
0.0175079323 -0.0628590454 0.0078309512
-0.0095714064 -0.0565405930 0.0152619216
-0.0366507451 -0.0502221406 0.0226928920
-0.0637300839 -0.0439036883 0.0301238624
-0.0374509987 -0.0431669292 0.0574425642
-0.0366507451 -0.0502221406 0.0226928920
0.0159074252 -0.0487486226 0.0773302955
-0.0111719135 -0.0424301702 0.0847612659
0.0151071717 -0.0416934112 0.1120799677
0.0159074252 -0.0487486226 0.0773302955
0.0167076788 -0.0558038340 0.0425806233
0.0175079323 -0.0628590454 0.0078309512
-0.0103716600 -0.0494853816 0.0500115937
0.0167076788 -0.0558038340 0.0425806233
-0.1185764719 -0.0781982476 -0.2103261751
-0.1265359403 -0.0700254210 -0.1700572452
-0.0891958723 -0.0797329320 -0.2101554179
-0.1185764719 -0.0781982476 -0.2103261751
0.0972791122 -0.0162243858 0.0738872228
0.1037468875 -0.0119947893 0.1650067148
0.0964464846 -0.0115189594 0.0730330666
0.0925398148 0.0003635640 0.0479042641
0.1032485839 -0.0089368551 -0.0883692057
0.1310929929 -0.0007085227 -0.0571172520
-0.1492725136 -0.0151409194 -0.1427624922
-0.1500251645 -0.0482060803 -0.1555797890
-0.1596635448 -0.0142749100 -0.1667230491
-0.1492725136 -0.0151409194 -0.1427624922
-0.1388814824 -0.0160069289 -0.1188019352
-0.1284904512 -0.0168729383 -0.0948413782
-0.1396341333 -0.0490720898 -0.1316192320
-0.1388814824 -0.0160069289 -0.1188019352
-0.1180994201 -0.0177389477 -0.0708808213
-0.1077083889 -0.0186049572 -0.0469202643
-0.0917455167 -0.0033713909 -0.0045707805
-0.1077083889 -0.0186049572 -0.0469202643
-0.1236712611 -0.0338385235 -0.0892697482
-0.1396341333 -0.0490720898 -0.1316192320
-0.1180994201 -0.0177389477 -0.0708808213
-0.1284904512 -0.0168729383 -0.0948413782
0.0566182133 0.0147442782 -0.1136325937
0.0585049555 0.0044528489 -0.1491833675
0.0773747941 0.0051599445 -0.1047859541
0.0566182133 0.0147442782 -0.1136325937
0.0358616326 0.0243286119 -0.1224792333
0.0151050519 0.0339129456 -0.1313258730
0.0377483748 0.0140371826 -0.1580300071
0.0358616326 0.0243286119 -0.1224792333
-0.0056515289 0.0434972793 -0.1401725126
-0.0264081096 0.0530816130 -0.1490191522
-0.0584863518 0.0726038283 -0.1445137247
-0.0264081096 0.0530816130 -0.1490191522
0.0056701326 0.0335593978 -0.1535245796
0.0377483748 0.0140371826 -0.1580300071
-0.0056515289 0.0434972793 -0.1401725126
0.0151050519 0.0339129456 -0.1313258730
0.0805976821 0.0137632657 0.0100916030
0.0922326295 0.0034234729 -0.0462520295
0.0925398148 0.0003635640 0.0479042641
0.0888955317 0.0047308711 0.0795751439
0.1037468875 -0.0119947893 0.1650067148
0.0859526829 0.0081503600 0.0837003387
0.0922326295 0.0034234729 -0.0462520295
0.1145714132 -0.0058665444 -0.0144547272
-0.0923769172 0.0540263583 -0.1009319346
-0.0778370880 0.0749391295 -0.1321186514
-0.0909710726 0.0467773259 -0.0796902216
-0.0750253988 0.0604410647 -0.0896352255
-0.0722137096 0.0459429998 -0.0471517996
-0.0780777796 0.0282375817 -0.0103167282
-0.0808894688 0.0427356466 -0.0528001541
-0.0909710726 0.0467773259 -0.0796902216
-0.1111342801 0.0548606845 -0.1334703566
-0.0865128472 0.0717317764 -0.1377670059
-0.1010526763 0.0508190052 -0.1065802891
-0.1111342801 0.0548606845 -0.1334703566
-0.1212158839 0.0589023637 -0.1603604241
-0.1312974877 0.0629440430 -0.1872504916
-0.0965944509 0.0757734557 -0.1646570734
-0.1212158839 0.0589023637 -0.1603604241
-0.0897663005 0.0033584418 -0.0078523456
-0.0822208156 0.0066688464 0.0050646061
-0.1065899307 0.0185501260 -0.0623365899
-0.0830871457 0.0175750932 -0.0092605643
-0.1234135608 0.0337418103 -0.1168208342
-0.1284857985 0.0484459781 -0.1447670657
-0.0881593834 0.0322792610 -0.0372067957
-0.0999107759 0.0327667774 -0.0637448086
-0.0950749282 -0.0394883003 -0.0244223399
-0.1036169717 -0.0421007501 -0.0452314236
-0.1281218874 -0.0599467661 -0.1083899913
-0.1212616660 -0.0423213160 -0.0864839331
-0.0870934921 -0.0318715172 -0.0032475979
-0.1052987938 -0.0270877498 -0.0441344493
-0.0791120560 -0.0242547341 0.0179271440
-0.0893359216 -0.0118541835 -0.0017849654
-0.0447926619 -0.0563621961 -0.0154910279
-0.0618767488 -0.0615870955 -0.0571091955
-0.0718720006 -0.0500437437 -0.0080600575
-0.0447926619 -0.0563621961 -0.0154910279
-0.0177133231 -0.0626806484 -0.0229219983
0.0093660156 -0.0689991008 -0.0303529687
-0.0347974101 -0.0679055478 -0.0645401659
-0.0177133231 -0.0626806484 -0.0229219983
-0.1060401745 -0.0604935425 -0.0912963927
-0.0789608358 -0.0668119949 -0.0987273631
-0.1231242615 -0.0657184420 -0.1329145603
-0.1060401745 -0.0604935425 -0.0912963927
-0.0889560875 -0.0552686431 -0.0496782251
-0.0718720006 -0.0500437437 -0.0080600575
-0.0618767488 -0.0615870955 -0.0571091955
-0.0889560875 -0.0552686431 -0.0496782251
-0.0597055188 0.0124250657 0.0482980321
-0.0364450498 0.0031000436 0.1103391991
-0.0705300021 0.0040938327 0.0338439043
-0.0663846736 -0.0017915857 0.0497062507
-0.0131845808 -0.0062249785 0.1723803661
-0.0015543463 -0.0108874896 0.2034009496
-0.0547544391 -0.0064540968 0.0807268342
-0.0364450498 0.0031000436 0.1103391991
-0.0605834751 0.0412804887 -0.0161312161
-0.0722137096 0.0459429998 -0.0471517996
-0.0764312434 0.0676900971 -0.1108769384
-0.0596888140 0.0643208467 -0.0749669196
-0.0540654356 0.0353247170 0.0099999322
-0.0466527349 0.0524093032 -0.0227046232
-0.0336166558 0.0404977597 0.0295576733
-0.0540654356 0.0353247170 0.0099999322
-0.0242869271 0.0200439231 0.0981722474
-0.0075444976 0.0166746727 0.1340822662
0.0120096210 -0.0011926425 0.2124757109
-0.0098450034 0.0008833472 0.1716762568
-0.0256927717 0.0272929555 0.0769305344
-0.0331054724 0.0102083693 0.1096350898
-0.0359171616 0.0247064342 0.0671516639
-0.0475473960 0.0293689452 0.0361310804
3 43 78 116
3 101 97 129
3 10 6 15
3 124 26 145
3 489 933 22
3 139 933 489
3 15 934 22
3 489 934 15
3 153 140 19
3 153 19 140
3 98 87 75
3 55 7 40
3 7 53 40
3 53 87 40
3 490 935 87
3 75 935 490
3 490 936 53
3 87 936 490
3 74 40 48
3 40 74 55
3 27 149 49
3 29 148 155
3 48 148 74
3 157 937 137
3 491 937 157
3 491 938 113
3 157 938 491
3 137 87 1
3 87 63 1
3 149 38 48
3 492 939 70
3 149 939 492
3 70 940 492
3 38 940 70
3 87 941 38
3 39 941 87
3 49 149 48
3 148 48 155
3 48 40 155
3 39 942 38
3 48 942 39
3 493 943 94
3 139 943 493
3 493 944 22
3 94 944 493
3 94 945 38
3 139 945 94
3 38 946 94
3 70 946 38
3 67 494 137
3 162 494 67
3 162 495 143
3 67 495 162
3 143 947 82
3 67 947 143
3 496 948 130
3 15 948 496
3 496 949 139
3 130 949 496
3 63 137 1
3 87 950 63
3 38 950 87
3 40 143 155
3 87 143 40
3 87 951 143
3 137 951 87
3 63 157 137
3 139 952 497
3 63 952 139
3 497 953 38
3 63 953 497
3 157 954 17
3 63 954 157
3 43 80 78
3 120 124 125
3 120 125 1
3 39 955 78
3 116 955 39
3 78 80 7
3 78 7 39
3 116 87 11
3 125 956 11
3 116 956 125
3 125 11 1
3 39 498 116
3 87 498 39
3 1 11 87
3 48 39 7
3 49 48 7
3 7 80 49
3 147 0 160
3 0 147 134
3 0 134 87
3 87 98 0
3 87 121 1
3 121 124 120
3 1 121 120
3 12 160 8
3 44 160 12
3 121 957 124
3 87 957 121
3 100 44 8
3 44 12 8
3 100 8 160
3 87 958 160
3 147 958 87
3 87 134 147
3 75 53 39
3 129 98 75
3 7 39 53
3 7 55 39
3 55 959 39
3 104 959 55
3 499 960 104
3 39 960 499
3 499 961 156
3 104 961 499
3 102 156 104
3 156 102 79
3 156 97 101
3 156 101 129
3 156 79 97
3 97 79 89
3 75 962 156
3 500 962 75
3 500 963 39
3 75 963 500
3 129 75 156
3 109 104 55
3 155 143 82
3 29 155 82
3 501 964 94
3 22 964 501
3 501 965 52
3 94 965 501
3 94 70 52
3 29 28 148
3 80 27 49
3 74 148 28
3 28 55 74
3 55 28 106
3 106 109 55
3 28 29 106
3 29 105 106
3 27 84 149
3 10 966 22
3 15 966 10
3 27 80 109
3 82 105 29
3 109 106 104
3 79 59 26
3 102 59 79
3 26 89 79
3 111 89 20
3 25 102 79
3 89 79 20
3 102 20 79
3 502 967 164
3 163 967 502
3 502 968 88
3 164 968 502
3 503 969 164
3 10 969 503
3 503 970 163
3 164 970 503
3 504 971 165
3 163 971 504
3 504 972 73
3 165 972 504
3 505 973 165
3 88 973 505
3 505 974 163
3 165 974 505
3 141 25 79
3 109 151 84
3 84 975 149
3 70 975 84
3 25 976 102
3 9 976 25
3 9 977 84
3 25 977 9
3 105 104 106
3 102 104 20
3 9 84 151
3 506 978 25
3 10 978 506
3 141 979 25
3 506 979 141
3 52 980 507
3 25 980 52
3 507 981 10
3 25 981 507
3 166 982 20
3 508 982 166
3 508 983 45
3 166 983 508
3 509 984 20
3 166 984 509
3 509 985 31
3 20 985 509
3 510 986 132
3 45 986 510
3 132 987 510
3 111 987 132
3 511 988 67
3 31 988 511
3 511 989 167
3 67 989 511
3 512 990 167
3 45 990 512
3 167 991 512
3 67 991 167
3 513 992 31
3 67 992 513
3 31 993 513
3 82 993 31
3 109 84 27
3 132 994 111
3 514 994 132
3 514 995 73
3 132 995 514
3 70 25 52
3 22 515 10
3 52 515 22
3 516 996 6
3 73 996 516
3 6 997 516
3 10 997 6
3 517 998 170
3 169 998 517
3 517 999 73
3 170 999 517
3 518 1000 170
3 6 1000 518
3 518 1001 169
3 170 1001 518
3 519 1002 171
3 169 1002 519
3 519 1003 168
3 171 1003 519
3 520 1004 171
3 73 1004 520
3 520 1005 169
3 171 1005 520
3 521 1006 172
3 168 1006 521
3 521 1007 173
3 172 1007 521
3 522 1008 173
3 72 1008 522
3 522 1009 172
3 173 1009 522
3 523 1010 174
3 172 1010 523
3 523 1011 73
3 174 1011 523
3 524 1012 168
3 172 1012 524
3 524 1013 174
3 168 1013 524
3 175 1014 111
3 525 1014 175
3 525 1015 45
3 175 1015 525
3 175 1016 526
3 111 1016 175
3 526 1017 20
3 111 1017 526
3 111 88 141
3 141 89 111
3 141 1018 527
3 88 1018 141
3 527 1019 10
3 88 1019 527
3 105 82 31
3 104 105 31
3 31 20 104
3 111 1020 88
3 528 1020 111
3 528 1021 73
3 111 1021 528
3 141 79 89
3 529 1022 70
3 25 1022 529
3 529 1023 84
3 70 1023 529
3 15 1024 530
3 6 1024 15
3 530 1025 176
3 6 1025 530
3 531 1026 176
3 72 1026 531
3 176 1027 531
3 6 1027 176
3 145 125 124
3 116 532 145
3 125 532 116
3 97 26 124
3 97 89 26
3 533 1028 116
3 9 1028 533
3 533 1029 102
3 116 1029 533
3 43 117 50
3 50 80 43
3 9 50 117
3 116 145 96
3 60 26 96
3 145 60 96
3 60 145 26
3 9 117 116
3 117 43 116
3 26 59 96
3 102 96 59
3 151 50 9
3 109 50 151
3 96 102 116
3 109 80 50
3 124 1030 127
3 87 1030 124
3 112 153 160
3 0 1031 160
3 112 1031 0
3 100 160 153
3 123 112 0
3 98 129 123
3 123 0 98
3 154 129 97
3 154 127 129
3 97 124 154
3 39 160 44
3 39 153 160
3 127 154 124
3 87 160 153
3 534 1032 87
3 127 1032 534
3 153 1033 87
3 534 1033 153
3 39 44 100
3 39 100 153
3 112 127 153
3 112 123 129
3 112 129 127
3 23 57 58
3 41 122 57
3 161 1034 92
3 64 1034 161
3 41 535 24
3 23 535 41
3 41 57 23
3 58 34 23
3 34 58 122
3 95 34 122
3 33 23 34
3 34 95 33
3 23 536 64
3 33 536 23
3 57 122 58
3 537 1035 178
3 177 1035 537
3 537 1036 33
3 178 1036 537
3 538 1037 178
3 64 1037 538
3 538 1038 177
3 178 1038 538
3 539 1039 179
3 177 1039 539
3 539 1040 24
3 179 1040 539
3 540 1041 179
3 33 1041 540
3 540 1042 177
3 179 1042 540
3 541 1043 181
3 180 1043 541
3 541 1044 64
3 181 1044 541
3 542 1045 181
3 92 1045 542
3 542 1046 180
3 181 1046 542
3 543 1047 182
3 180 1047 543
3 543 1048 23
3 182 1048 543
3 544 1049 182
3 64 1049 544
3 544 1050 180
3 182 1050 544
3 545 1051 184
3 183 1051 545
3 545 1052 23
3 184 1052 545
3 546 1053 184
3 24 1053 546
3 546 1054 183
3 184 1054 546
3 547 1055 185
3 183 1055 547
3 547 1056 64
3 185 1056 547
3 548 1057 185
3 23 1057 548
3 548 1058 183
3 185 1058 548
3 549 1059 187
3 186 1059 549
3 549 1060 64
3 187 1060 549
3 550 1061 187
3 23 1061 550
3 550 1062 186
3 187 1062 550
3 551 1063 188
3 186 1063 551
3 551 1064 92
3 188 1064 551
3 552 1065 188
3 64 1065 552
3 552 1066 186
3 188 1066 552
3 161 1067 64
3 92 1067 161
3 114 142 115
3 114 93 135
3 93 46 135
3 135 142 114
3 126 1068 46
3 77 1068 126
3 83 126 46
3 46 126 83
3 553 1069 126
3 3 1069 553
3 189 1070 126
3 553 1070 189
3 554 1071 189
3 46 1071 554
3 189 1072 554
3 126 1072 189
3 3 1073 113
3 555 1073 3
3 555 1074 86
3 3 1074 555
3 556 1075 46
3 115 1075 556
3 556 1076 190
3 46 1076 556
3 557 1077 190
3 86 1077 557
3 190 1078 557
3 46 1078 190
3 135 1079 115
3 46 1079 135
3 114 558 86
3 115 558 114
3 192 559 191
3 77 559 192
3 192 560 46
3 191 560 192
3 193 561 191
3 86 561 193
3 193 562 77
3 191 562 193
3 563 1080 194
3 77 1080 563
3 563 1081 86
3 194 1081 563
3 564 1082 194
3 113 1082 564
3 564 1083 77
3 194 1083 564
3 77 1084 113
3 195 1084 77
3 195 1085 138
3 77 1085 195
3 142 135 115
3 196 565 86
3 197 565 196
3 197 566 46
3 196 566 197
3 198 567 86
3 196 567 198
3 198 568 3
3 86 568 198
3 199 1086 46
3 569 1086 199
3 569 1087 86
3 199 1087 569
3 570 1088 46
3 199 1088 570
3 570 1089 114
3 46 1089 570
3 46 93 114
3 126 1090 77
3 138 1090 126
3 83 138 126
3 571 1091 200
3 126 1091 571
3 571 1092 17
3 200 1092 571
3 572 1093 200
3 3 1093 572
3 572 1094 126
3 200 1094 572
3 126 17 83
3 573 1095 201
3 72 1095 573
3 201 1096 573
3 202 1096 201
3 574 1097 202
3 130 1097 574
3 202 1098 574
3 201 1098 202
3 575 1099 72
3 201 1099 575
3 72 1100 575
3 203 1100 72
3 576 1101 203
3 146 1101 576
3 203 1102 576
3 72 1102 203
3 204 577 130
3 205 577 204
3 205 578 72
3 204 578 205
3 206 579 130
3 204 579 206
3 130 580 206
3 15 580 130
3 208 1103 113
3 581 1103 208
3 581 1104 67
3 208 1104 581
3 582 1105 113
3 208 1105 582
3 582 1106 207
3 113 1106 582
3 209 1107 207
3 583 1107 209
3 583 1108 138
3 209 1108 583
3 584 1109 207
3 209 1109 584
3 584 1110 113
3 207 1110 584
3 585 1111 137
3 67 1111 585
3 585 1112 210
3 137 1112 585
3 586 1113 210
3 113 1113 586
3 210 1114 586
3 137 1114 210
3 113 1115 3
3 587 1115 113
3 587 1116 157
3 113 1116 587
3 211 1117 3
3 588 1117 211
3 588 1118 17
3 211 1118 588
3 211 1119 589
3 3 1119 211
3 589 1120 157
3 3 1120 589
3 590 1121 215
3 214 1121 590
3 590 1122 212
3 215 1122 590
3 591 1123 215
3 17 1123 591
3 591 1124 214
3 215 1124 591
3 592 1125 216
3 214 1125 592
3 592 1126 213
3 216 1126 592
3 593 1127 216
3 212 1127 593
3 593 1128 214
3 216 1128 593
3 594 1129 217
3 213 1129 594
3 594 1130 218
3 217 1130 594
3 595 1131 218
3 146 1131 595
3 218 1132 595
3 217 1132 218
3 596 1133 217
3 219 1133 596
3 596 1134 213
3 217 1134 596
3 597 1135 219
3 212 1135 597
3 597 1136 213
3 219 1136 597
3 598 1137 222
3 221 1137 598
3 598 1138 212
3 222 1138 598
3 599 1139 222
3 220 1139 599
3 599 1140 221
3 222 1140 599
3 600 1141 223
3 221 1141 600
3 600 1142 17
3 223 1142 600
3 601 1143 223
3 212 1143 601
3 601 1144 221
3 223 1144 601
3 602 1145 220
3 225 1145 602
3 602 1146 224
3 220 1146 602
3 603 1147 225
3 139 1147 603
3 603 1148 224
3 225 1148 603
3 604 1149 226
3 224 1149 604
3 604 1150 17
3 226 1150 604
3 605 1151 224
3 226 1151 605
3 605 1152 220
3 224 1152 605
3 606 1153 229
3 228 1153 606
3 606 1154 107
3 229 1154 606
3 607 1155 229
3 138 1155 607
3 607 1156 228
3 229 1156 607
3 608 1157 230
3 228 1157 608
3 608 1158 227
3 230 1158 608
3 609 1159 230
3 107 1159 609
3 609 1160 228
3 230 1160 609
3 610 1161 231
3 227 1161 610
3 610 1162 232
3 231 1162 610
3 611 1163 232
3 67 1163 611
3 232 1164 611
3 231 1164 232
3 612 1165 231
3 233 1165 612
3 227 1166 231
3 612 1166 227
3 613 1167 233
3 107 1167 613
3 613 1168 227
3 233 1168 613
3 63 614 235
3 139 614 63
3 235 615 234
3 139 615 235
3 236 616 234
3 17 616 236
3 236 617 139
3 234 617 236
3 618 1169 130
3 139 1169 618
3 618 1170 238
3 130 1170 618
3 619 1171 238
3 237 1171 619
3 238 1172 619
3 130 1172 238
3 239 1173 237
3 620 1173 239
3 620 1174 146
3 239 1174 620
3 237 1175 239
3 621 1175 237
3 621 1176 130
3 237 1176 621
3 33 69 103
3 103 69 41
3 622 1177 33
3 240 1177 622
3 622 1178 103
3 33 1178 622
3 623 1179 240
3 128 1179 623
3 623 1180 103
3 240 1180 623
3 69 33 95
3 95 122 69
3 242 624 103
3 107 624 242
3 242 625 241
3 103 625 242
3 243 626 241
3 24 626 243
3 241 627 243
3 103 627 241
3 41 1181 103
3 628 1181 41
3 628 1182 24
3 41 1182 628
3 41 69 122
3 629 1183 245
3 244 1183 629
3 629 1184 33
3 245 1184 629
3 630 1185 245
3 73 1185 630
3 630 1186 244
3 245 1186 630
3 631 1187 246
3 244 1187 631
3 631 1188 128
3 246 1188 631
3 632 1189 246
3 33 1189 632
3 632 1190 244
3 246 1190 632
3 633 1191 249
3 248 1191 633
3 633 1192 247
3 249 1192 633
3 634 1193 249
3 128 1193 634
3 634 1194 248
3 249 1194 634
3 635 1195 250
3 248 1195 635
3 635 1196 73
3 250 1196 635
3 636 1197 250
3 247 1197 636
3 636 1198 248
3 250 1198 636
3 637 1199 252
3 251 1199 637
3 637 1200 247
3 252 1200 637
3 638 1201 252
3 72 1201 638
3 638 1202 251
3 252 1202 638
3 639 1203 253
3 251 1203 639
3 639 1204 128
3 253 1204 639
3 640 1205 253
3 247 1205 640
3 640 1206 251
3 253 1206 640
3 254 1207 45
3 641 1207 254
3 641 1208 255
3 254 1208 641
3 642 1209 255
3 107 1209 642
3 255 1210 642
3 254 1210 255
3 643 1211 45
3 254 1211 643
3 643 1212 256
3 45 1212 643
3 644 1213 256
3 67 1213 644
3 256 1214 644
3 45 1214 256
3 645 1215 258
3 257 1215 645
3 645 1216 73
3 258 1216 645
3 646 1217 258
3 33 1217 646
3 646 1218 257
3 258 1218 646
3 647 1219 259
3 257 1219 647
3 647 1220 24
3 259 1220 647
3 648 1221 259
3 73 1221 648
3 648 1222 257
3 259 1222 648
3 24 649 261
3 45 649 24
3 261 650 260
3 45 650 261
3 262 651 260
3 107 651 262
3 260 652 262
3 45 652 260
3 24 1223 45
3 132 1223 24
3 653 1224 132
3 73 1224 653
3 24 1225 132
3 653 1225 24
3 159 4 144
3 51 91 5
3 5 91 71
3 14 1226 118
3 159 1226 14
3 4 76 14
3 99 131 14
3 76 4 159
3 14 76 159
3 5 1227 108
3 654 1227 5
3 654 1228 133
3 5 1228 654
3 108 1229 99
3 655 1229 108
3 655 1230 133
3 108 1230 655
3 131 1231 133
3 99 1231 131
3 14 131 118
3 118 4 14
3 118 99 14
3 51 5 108
3 108 99 51
3 71 1232 5
3 133 1232 71
3 4 1233 144
3 118 1233 4
3 159 144 118
3 656 1234 99
3 51 1234 656
3 99 1235 656
3 118 1235 99
3 264 657 133
3 263 657 264
3 264 658 51
3 133 658 264
3 265 659 263
3 118 659 265
3 265 660 51
3 263 660 265
3 131 1236 118
3 661 1236 131
3 661 1237 133
3 131 1237 661
3 13 91 51
3 662 1238 133
3 65 1238 662
3 662 1239 71
3 133 1239 662
3 663 1240 267
3 65 1240 663
3 663 1241 133
3 267 1241 663
3 664 1242 267
3 266 1242 664
3 664 1243 65
3 267 1243 664
3 268 1244 266
3 665 1244 268
3 665 1245 90
3 268 1245 665
3 268 1246 666
3 266 1246 268
3 666 1247 65
3 266 1247 666
3 667 1248 269
3 13 1248 667
3 667 1249 91
3 269 1249 667
3 668 1250 65
3 13 1250 668
3 668 1251 269
3 65 1251 668
3 71 91 150
3 271 669 270
3 91 669 271
3 271 670 32
3 270 670 271
3 272 671 270
3 65 671 272
3 272 672 91
3 270 672 272
3 273 1252 32
3 673 1252 273
3 673 1253 65
3 273 1253 673
3 674 1254 32
3 273 1254 674
3 674 1255 56
3 32 1255 674
3 150 1256 71
3 675 1256 150
3 675 1257 32
3 150 1257 675
3 676 1258 32
3 56 1258 676
3 676 1259 274
3 32 1259 676
3 677 1260 274
3 65 1260 677
3 274 1261 677
3 32 1261 274
3 150 91 32
3 678 1262 275
3 71 1262 678
3 678 1263 65
3 275 1263 678
3 679 1264 275
3 32 1264 679
3 679 1265 71
3 275 1265 679
3 276 680 133
3 51 680 276
3 276 681 13
3 133 681 276
3 277 682 66
3 278 682 277
3 278 683 65
3 277 683 278
3 279 684 66
3 277 684 279
3 279 685 90
3 66 685 279
3 686 1266 280
3 13 1266 686
3 280 1267 686
3 281 1267 280
3 687 1268 281
3 36 1268 687
3 281 1269 687
3 280 1269 281
3 282 1270 13
3 688 1270 282
3 688 1271 280
3 282 1271 688
3 282 1272 689
3 13 1272 282
3 689 1273 133
3 13 1273 689
3 285 690 283
3 286 690 285
3 286 691 90
3 285 691 286
3 287 692 283
3 285 692 287
3 283 693 287
3 284 693 283
3 288 694 284
3 289 694 288
3 289 695 128
3 288 695 289
3 290 696 284
3 288 696 290
3 284 697 290
3 283 697 284
3 293 698 291
3 90 698 293
3 291 699 293
3 292 699 291
3 294 700 292
3 283 700 294
3 292 701 294
3 291 701 292
3 296 702 295
3 90 702 296
3 296 703 291
3 295 703 296
3 297 704 295
3 66 704 297
3 297 705 90
3 295 705 297
3 706 1274 66
3 299 1274 706
3 706 1275 298
3 66 1275 706
3 707 1276 299
3 36 1276 707
3 707 1277 298
3 299 1277 707
3 708 1278 300
3 298 1278 708
3 708 1279 13
3 300 1279 708
3 709 1280 298
3 300 1280 709
3 709 1281 66
3 298 1281 709
3 710 1282 301
3 65 1282 710
3 710 1283 66
3 301 1283 710
3 711 1284 13
3 65 1284 711
3 711 1285 301
3 13 1285 711
3 712 1286 305
3 303 1286 712
3 712 1287 90
3 305 1287 712
3 713 1288 304
3 303 1288 713
3 713 1289 305
3 304 1289 713
3 306 1290 304
3 714 1290 306
3 714 1291 133
3 306 1291 714
3 715 1292 304
3 306 1292 715
3 715 1293 303
3 304 1293 715
3 716 1294 308
3 307 1294 716
3 716 1295 90
3 308 1295 716
3 717 1296 308
3 303 1296 717
3 717 1297 307
3 308 1297 717
3 718 1298 309
3 307 1298 718
3 718 1299 302
3 309 1299 718
3 719 1300 309
3 90 1300 719
3 719 1301 307
3 309 1301 719
3 312 1302 310
3 720 1302 312
3 720 1303 302
3 312 1303 720
3 721 1304 310
3 312 1304 721
3 721 1305 311
3 310 1305 721
3 313 1306 311
3 722 1306 313
3 722 1307 85
3 313 1307 722
3 723 1308 311
3 313 1308 723
3 723 1309 310
3 311 1309 723
3 724 1310 315
3 314 1310 724
3 724 1311 302
3 315 1311 724
3 725 1312 315
3 310 1312 725
3 725 1313 314
3 315 1313 725
3 726 1314 316
3 314 1314 726
3 726 1315 90
3 316 1315 726
3 727 1316 316
3 302 1316 727
3 727 1317 314
3 316 1317 727
3 320 728 317
3 36 728 320
3 320 729 319
3 317 729 320
3 321 730 319
3 318 730 321
3 321 731 317
3 319 731 321
3 322 732 318
3 323 732 322
3 323 733 85
3 322 733 323
3 318 734 322
3 324 734 318
3 324 735 317
3 318 735 324
3 327 736 317
3 326 736 327
3 327 737 36
3 317 737 327
3 328 738 326
3 325 738 328
3 328 739 36
3 326 739 328
3 329 740 325
3 330 740 329
3 330 741 133
3 329 741 330
3 331 742 329
3 36 742 331
3 325 743 329
3 331 743 325
3 744 1318 333
3 36 1318 744
3 744 1319 66
3 333 1319 744
3 745 1320 333
3 332 1320 745
3 745 1321 36
3 333 1321 745
3 334 1322 332
3 746 1322 334
3 746 1323 18
3 334 1323 746
3 332 1324 334
3 747 1324 332
3 747 1325 36
3 332 1325 747
3 748 1326 338
3 337 1326 748
3 748 1327 18
3 338 1327 748
3 749 1328 338
3 336 1328 749
3 749 1329 337
3 338 1329 749
3 750 1330 339
3 337 1330 750
3 750 1331 335
3 339 1331 750
3 751 1332 339
3 18 1332 751
3 751 1333 337
3 339 1333 751
3 752 1334 336
3 341 1334 752
3 752 1335 340
3 336 1335 752
3 753 1336 341
3 66 1336 753
3 753 1337 340
3 341 1337 753
3 754 1338 342
3 340 1338 754
3 754 1339 335
3 342 1339 754
3 755 1340 340
3 342 1340 755
3 755 1341 336
3 340 1341 755
3 756 1342 343
3 345 1342 756
3 756 1343 344
3 343 1343 756
3 757 1344 345
3 335 1344 757
3 757 1345 344
3 345 1345 757
3 758 1346 346
3 344 1346 758
3 758 1347 128
3 346 1347 758
3 759 1348 344
3 346 1348 759
3 759 1349 343
3 344 1349 759
3 760 1350 348
3 347 1350 760
3 760 1351 335
3 348 1351 760
3 761 1352 348
3 343 1352 761
3 761 1353 347
3 348 1353 761
3 762 1354 349
3 347 1354 762
3 762 1355 18
3 349 1355 762
3 763 1356 349
3 335 1356 763
3 763 1357 347
3 349 1357 763
3 16 54 42
3 54 16 35
3 764 1358 61
3 54 1358 764
3 764 1359 42
3 61 1359 764
3 37 765 35
3 54 765 37
3 158 37 62
3 146 72 21
3 351 766 350
3 158 766 351
3 351 767 61
3 350 767 351
3 352 768 350
3 146 768 352
3 352 769 158
3 350 769 352
3 770 1360 146
3 61 1360 770
3 146 1361 770
3 21 1361 146
3 354 771 353
3 158 771 354
3 354 772 146
3 353 772 354
3 355 773 353
3 85 773 355
3 355 774 158
3 353 774 355
3 356 775 158
3 85 775 356
3 158 776 356
3 47 776 158
3 158 61 54
3 37 158 54
3 777 1362 359
3 358 1362 777
3 777 1363 47
3 359 1363 777
3 778 1364 359
3 85 1364 778
3 778 1365 358
3 359 1365 778
3 779 1366 360
3 358 1366 779
3 779 1367 357
3 360 1367 779
3 780 1368 360
3 47 1368 780
3 780 1369 358
3 360 1369 780
3 781 1370 361
3 357 1370 781
3 781 1371 362
3 361 1371 781
3 782 1372 362
3 36 1372 782
3 362 1373 782
3 361 1373 362
3 783 1374 361
3 363 1374 783
3 783 1375 357
3 361 1375 783
3 784 1376 363
3 47 1376 784
3 784 1377 357
3 363 1377 784
3 62 47 158
3 785 1378 367
3 365 1378 785
3 785 1379 364
3 367 1379 785
3 786 1380 367
3 366 1380 786
3 786 1381 365
3 367 1381 786
3 368 1382 366
3 787 1382 368
3 787 1383 2
3 368 1383 787
3 788 1384 368
3 365 1384 788
3 366 1385 368
3 788 1385 366
3 370 1386 369
3 789 1386 370
3 789 1387 365
3 370 1387 789
3 790 1388 370
3 90 1388 790
3 369 1389 370
3 790 1389 369
3 791 1390 371
3 364 1390 791
3 791 1391 365
3 371 1391 791
3 792 1392 371
3 369 1392 792
3 792 1393 364
3 371 1393 792
3 793 1394 374
3 373 1394 793
3 793 1395 372
3 374 1395 793
3 794 1396 374
3 85 1396 794
3 794 1397 373
3 374 1397 794
3 795 1398 375
3 373 1398 795
3 795 1399 2
3 375 1399 795
3 796 1400 375
3 372 1400 796
3 796 1401 373
3 375 1401 796
3 797 1402 377
3 376 1402 797
3 797 1403 372
3 377 1403 797
3 798 1404 377
3 364 1404 798
3 798 1405 376
3 377 1405 798
3 799 1406 378
3 376 1406 799
3 799 1407 85
3 378 1407 799
3 800 1408 378
3 372 1408 800
3 800 1409 376
3 378 1409 800
3 382 801 380
3 379 801 382
3 382 802 381
3 380 802 382
3 383 803 381
3 138 803 383
3 383 804 380
3 381 804 383
3 385 805 384
3 380 805 385
3 385 806 85
3 384 806 385
3 386 807 379
3 380 807 386
3 386 808 384
3 379 808 386
3 389 809 388
3 387 809 389
3 389 810 17
3 388 810 389
3 390 811 388
3 138 811 390
3 390 812 387
3 388 812 390
3 392 813 391
3 387 813 392
3 392 814 379
3 391 814 392
3 393 815 391
3 17 815 393
3 393 816 387
3 391 816 393
3 817 1410 394
3 83 1410 817
3 817 1411 138
3 394 1411 817
3 818 1412 394
3 17 1412 818
3 818 1413 83
3 394 1413 818
3 398 819 396
3 395 819 398
3 398 820 397
3 396 820 398
3 399 821 397
3 146 821 399
3 399 822 396
3 397 822 399
3 401 823 400
3 396 823 401
3 401 824 17
3 400 824 401
3 402 825 395
3 396 825 402
3 402 826 400
3 395 826 402
3 405 827 404
3 403 827 405
3 405 828 85
3 404 828 405
3 406 829 404
3 146 829 406
3 406 830 403
3 404 830 406
3 408 831 407
3 403 831 408
3 408 832 395
3 407 832 408
3 409 833 407
3 85 833 409
3 409 834 403
3 407 834 409
3 410 1414 47
3 835 1414 410
3 835 1415 36
3 410 1415 835
3 836 1416 47
3 410 1416 836
3 47 1417 836
3 152 1417 47
3 152 47 62
3 16 42 81
3 136 1418 21
3 837 1418 136
3 837 1419 61
3 136 1419 837
3 61 81 42
3 21 838 136
3 72 838 21
3 413 839 412
3 107 839 413
3 413 840 103
3 412 840 413
3 414 841 412
3 411 841 414
3 414 842 107
3 412 842 414
3 415 843 411
3 416 843 415
3 416 844 119
3 415 844 416
3 411 845 415
3 417 845 411
3 417 846 107
3 411 846 417
3 81 30 16
3 81 61 30
3 35 16 30
3 37 35 30
3 418 847 61
3 30 847 418
3 418 848 37
3 61 848 418
3 62 37 68
3 68 152 62
3 849 1420 421
3 420 1420 849
3 849 1421 138
3 421 1421 849
3 850 1422 421
3 107 1422 850
3 850 1423 420
3 421 1423 850
3 851 1424 422
3 420 1424 851
3 851 1425 419
3 422 1425 851
3 852 1426 422
3 138 1426 852
3 852 1427 420
3 422 1427 852
3 853 1428 423
3 419 1428 853
3 853 1429 424
3 423 1429 853
3 854 1430 424
3 119 1430 854
3 854 1431 423
3 424 1431 854
3 855 1432 425
3 423 1432 855
3 855 1433 138
3 425 1433 855
3 856 1434 419
3 423 1434 856
3 856 1435 425
3 419 1435 856
3 857 1436 428
3 427 1436 857
3 857 1437 72
3 428 1437 857
3 858 1438 428
3 136 1438 858
3 858 1439 427
3 428 1439 858
3 859 1440 429
3 427 1440 859
3 859 1441 426
3 429 1441 859
3 860 1442 429
3 72 1442 860
3 860 1443 427
3 429 1443 860
3 861 1444 430
3 426 1444 861
3 861 1445 431
3 430 1445 861
3 862 1446 431
3 128 1446 862
3 862 1447 430
3 431 1447 862
3 863 1448 432
3 430 1448 863
3 863 1449 72
3 432 1449 863
3 864 1450 426
3 430 1450 864
3 864 1451 432
3 426 1451 864
3 68 1452 18
3 865 1452 68
3 865 1453 136
3 68 1453 865
3 436 866 435
3 434 866 436
3 436 867 136
3 435 867 436
3 437 868 435
3 18 868 437
3 437 869 434
3 435 869 437
3 439 870 438
3 434 870 439
3 439 871 433
3 438 871 439
3 440 872 438
3 136 872 440
3 440 873 434
3 438 873 440
3 443 874 441
3 433 874 443
3 443 875 442
3 441 875 443
3 444 876 442
3 128 876 444
3 444 877 441
3 442 877 444
3 446 878 445
3 441 878 446
3 446 879 136
3 445 879 446
3 447 880 433
3 441 880 447
3 447 881 445
3 433 881 447
3 18 1454 152
3 882 1454 18
3 882 1455 448
3 18 1455 882
3 883 1456 448
3 36 1456 883
3 448 1457 883
3 18 1457 448
3 450 884 449
3 37 884 450
3 450 885 136
3 449 885 450
3 451 886 61
3 37 886 451
3 451 887 449
3 61 887 451
3 888 1458 68
3 136 1458 888
3 68 1459 888
3 37 1459 68
3 152 68 18
3 889 1460 454
3 452 1460 889
3 889 1461 128
3 454 1461 889
3 890 1462 453
3 452 1462 890
3 890 1463 454
3 453 1463 890
3 455 1464 453
3 891 1464 455
3 891 1465 110
3 455 1465 891
3 892 1466 453
3 455 1466 892
3 892 1467 452
3 453 1467 892
3 893 1468 457
3 456 1468 893
3 893 1469 128
3 457 1469 893
3 894 1470 457
3 452 1470 894
3 894 1471 456
3 457 1471 894
3 895 1472 458
3 456 1472 895
3 895 1473 103
3 458 1473 895
3 896 1474 458
3 128 1474 896
3 896 1475 456
3 458 1475 896
3 460 897 459
3 461 897 460
3 461 898 119
3 460 898 461
3 462 899 460
3 90 899 462
3 459 900 460
3 462 900 459
3 464 901 119
3 463 901 464
3 2 902 119
3 464 902 2
3 465 903 463
3 459 903 465
3 465 904 2
3 463 904 465
3 905 1476 119
3 467 1476 905
3 110 1477 119
3 905 1477 110
3 906 1478 467
3 466 1478 906
3 906 1479 110
3 467 1479 906
3 468 1480 466
3 907 1480 468
3 907 1481 103
3 468 1481 907
3 908 1482 468
3 110 1482 908
3 466 1483 468
3 908 1483 466
3 909 1484 469
3 2 1484 909
3 470 1485 469
3 909 1485 470
3 910 1486 470
3 138 1486 910
3 470 1487 910
3 469 1487 470
3 911 1488 471
3 2 1488 911
3 911 1489 469
3 471 1489 911
3 912 1490 119
3 2 1490 912
3 912 1491 471
3 119 1491 912
3 913 1492 474
3 473 1492 913
3 913 1493 472
3 474 1493 913
3 914 1494 474
3 2 1494 914
3 914 1495 473
3 474 1495 914
3 915 1496 475
3 473 1496 915
3 915 1497 85
3 475 1497 915
3 916 1498 475
3 472 1498 916
3 916 1499 473
3 475 1499 916
3 917 1500 477
3 476 1500 917
3 917 1501 472
3 477 1501 917
3 918 1502 477
3 138 1502 918
3 918 1503 476
3 477 1503 918
3 919 1504 478
3 476 1504 919
3 919 1505 2
3 478 1505 919
3 920 1506 478
3 472 1506 920
3 920 1507 476
3 478 1507 920
3 921 1508 480
3 110 1508 921
3 921 1509 479
3 480 1509 921
3 110 1510 922
3 119 1510 110
3 922 1511 480
3 119 1511 922
3 479 1512 923
3 481 1512 479
3 923 1513 90
3 481 1513 923
3 924 1514 481
3 119 1514 924
3 481 1515 924
3 479 1515 481
3 925 1516 483
3 110 1516 925
3 483 1517 925
3 484 1517 483
3 926 1518 484
3 128 1518 926
3 484 1519 926
3 483 1519 484
3 927 1520 485
3 110 1520 927
3 927 1521 483
3 485 1521 927
3 928 1522 485
3 482 1522 928
3 928 1523 110
3 485 1523 928
3 929 1524 486
3 482 1524 929
3 486 1525 929
3 487 1525 486
3 930 1526 487
3 90 1526 930
3 487 1527 930
3 486 1527 487
3 488 1528 482
3 931 1528 488
3 931 1529 486
3 488 1529 931
3 932 1530 482
3 488 1530 932
3 932 1531 110
3 482 1531 932