OFF

83 162 0
-0.255334 -0.386293 0.092610
0.210255 -0.412565 -0.092610
0.210255 -0.412565 0.092610
0.043935 -0.479530 -0.000000
0.090278 -0.473000 -0.000000
-0.216957 -0.450207 -0.000000
-0.143055 -0.440401 -0.092610
-0.143055 -0.440401 0.092610
0.272940 -0.373672 -0.000000
-0.071229 -0.457223 -0.000000
0.030239 -0.383823 -0.092610
0.137826 -0.388801 0.092610
-0.200376 -0.458198 -0.092610
-0.200376 -0.458198 0.092610
0.147557 -0.477831 -0.092610
0.147557 -0.477831 0.092610
0.264416 -0.402446 -0.000000
-0.046535 -0.497926 -0.092610
-0.046535 -0.497926 0.092610
0.087955 -0.492300 -0.092610
0.087955 -0.492300 0.092610
-0.028157 -0.498963 -0.000000
-0.229882 -0.423122 -0.000000
-0.107135 -0.488486 -0.092610
-0.107135 -0.488486 0.092610
0.109164 -0.449678 -0.000000
-0.009778 -0.500000 -0.092610
-0.009778 -0.500000 0.092610
-0.104875 -0.398953 -0.092610
0.179334 -0.426914 -0.092610
0.179334 -0.426914 0.092610
-0.124958 -0.483883 -0.000000
0.036368 -0.461622 -0.092610
0.036368 -0.461622 0.092610
0.180822 -0.446298 -0.000000
0.286703 -0.363618 -0.092610
-0.187721 -0.443440 -0.000000
0.224098 -0.426214 -0.000000
-0.142780 -0.479280 0.092610
-0.142780 -0.479280 -0.092610
0.069728 -0.494869 -0.000000
0.182309 -0.465682 -0.092610
0.182309 -0.465682 0.092610
0.001921 -0.385009 0.092610
-0.088070 -0.454599 -0.092610
-0.088070 -0.454599 0.092610
-0.050461 -0.478886 -0.000000
-0.175067 -0.428682 -0.092610
-0.175067 -0.428682 0.092610
-0.240779 -0.395161 -0.000000
0.136642 -0.461744 -0.000000
0.042055 -0.406204 -0.092610
0.051501 -0.497437 -0.092610
0.051501 -0.497437 0.092610
-0.003733 -0.481523 -0.000000
0.019340 -0.462335 -0.000000
0.194795 -0.419739 -0.000000
0.259176 -0.383725 0.092610
0.259176 -0.383725 -0.092610
0.092602 -0.453699 0.092610
0.092602 -0.453699 -0.092610
-0.142918 -0.459840 -0.000000
-0.233539 -0.442216 -0.092610
-0.233539 -0.442216 0.092610
-0.054388 -0.459846 -0.092610
-0.054388 -0.459846 0.092610
0.016476 -0.393877 -0.092610
0.016476 -0.393877 0.092610
-0.159061 -0.434541 -0.000000
0.015685 -0.374955 0.092610
0.164933 -0.471756 -0.000000
-0.226225 -0.404029 0.092610
0.237942 -0.439864 -0.092610
0.237942 -0.439864 0.092610
0.253798 -0.430515 -0.000000
0.269655 -0.421167 -0.092610
0.269655 -0.421167 0.092610
-0.097603 -0.471543 -0.000000
0.002312 -0.463047 0.092610
0.002312 -0.463047 -0.092610
0.125727 -0.445657 0.092610
0.125727 -0.445657 -0.092610
-0.007985 -0.408297 0.092610
3 0 69 49
3 69 57 49
3 57 8 49
3 8 35 49
3 35 10 49
3 10 28 49
3 28 62 49
3 28 47 62
3 10 66 28
3 62 22 49
3 22 71 49
3 10 58 66
3 71 67 57
3 57 67 11
3 0 43 57
3 55 78 79
3 55 33 78
3 55 32 33
3 55 79 32
3 54 27 26
3 54 78 27
3 54 79 78
3 54 26 79
3 21 18 17
3 21 27 18
3 21 26 27
3 21 17 26
3 46 65 64
3 46 18 65
3 46 17 18
3 46 64 17
3 9 45 44
3 9 65 45
3 9 64 65
3 9 44 64
3 77 24 23
3 77 45 24
3 77 44 45
3 77 23 44
3 31 38 39
3 31 24 38
3 31 23 24
3 31 39 23
3 61 7 6
3 61 38 7
3 61 39 38
3 61 6 39
3 68 48 47
3 68 7 48
3 68 6 7
3 68 47 6
3 36 13 12
3 36 48 13
3 36 47 48
3 36 12 47
3 5 63 62
3 5 13 63
3 5 12 13
3 5 62 12
3 22 63 71
3 22 62 63
3 49 71 0
3 8 57 58
3 8 58 35
3 16 76 75
3 16 57 76
3 16 58 57
3 16 75 58
3 74 73 72
3 74 76 73
3 74 75 76
3 74 72 75
3 37 2 1
3 37 73 2
3 37 72 73
3 37 1 72
3 56 30 29
3 56 2 30
3 56 1 2
3 56 29 1
3 34 42 41
3 34 30 42
3 34 29 30
3 34 41 29
3 70 15 14
3 70 42 15
3 70 41 42
3 70 14 41
3 50 80 81
3 50 15 80
3 50 14 15
3 50 81 14
3 25 59 60
3 25 80 59
3 25 81 80
3 25 60 81
3 4 20 19
3 4 59 20
3 4 60 59
3 4 19 60
3 40 53 52
3 40 20 53
3 40 19 20
3 40 52 19
3 3 33 32
3 3 53 33
3 3 52 53
3 3 32 52
3 65 18 27
3 69 0 57
3 43 71 57
3 43 0 71
3 11 2 57
3 11 67 2
3 82 67 71
3 82 2 67
3 2 76 57
3 76 2 73
3 63 13 71
3 13 48 71
3 82 48 2
3 82 71 48
3 2 48 30
3 48 7 30
3 7 80 30
3 80 42 30
3 42 80 15
3 38 24 7
3 24 45 7
3 45 80 7
3 80 45 59
3 78 65 27
3 65 78 33
3 45 65 59
3 65 33 59
3 33 20 59
3 20 33 53
3 12 62 47
3 28 66 47
3 51 66 58
3 51 47 66
3 10 35 58
3 23 39 44
3 39 6 44
3 6 29 44
3 29 6 1
3 6 47 1
3 51 1 47
3 51 58 1
3 58 72 1
3 72 58 75
3 26 17 79
3 17 64 79
3 64 60 79
3 60 64 81
3 64 44 81
3 44 29 81
3 29 14 81
3 14 29 41
3 79 60 32
3 60 52 32
3 52 60 19
