OFF
1142 1144 0
0.4994854186 0.1909506825 -0.0345785932
-0.2169443268 0.1488023905 0.1764066481
0.0460585206 0.1498715164 0.1990186737
-0.4515999935 -0.1660397696 -0.1602318965
0.2751460764 0.2096970521 -0.0266817957
0.2812205820 0.2051259819 -0.1742272944
-0.2035181127 0.1424557836 -0.1182744249
-0.3704908300 0.2186574493 -0.0451977749
-0.3638023210 0.2136243411 -0.2076569865
-0.4520635243 0.1658790318 -0.1705340736
-0.2774059446 0.1448371448 -0.0372769240
-0.2704983742 0.1396391927 -0.2050569829
-0.2099689922 0.1452927188 -0.0363161340
-0.2032804833 0.1402596106 -0.1987753456
-0.2775284358 0.2189995465 -0.0395795738
-0.2706208655 0.2138015944 -0.2073596327
0.5000000000 -0.1775237521 -0.0231417934
0.2419068597 0.2063928987 -0.1311318028
0.2395076101 0.2081983359 -0.0728557060
0.4060225448 0.2078045944 -0.0952039540
0.2752624211 0.1452052444 -0.0246790012
0.2813369267 0.1406341742 -0.1722244998
-0.2720048999 0.2246390340 -0.0481856795
0.4823797510 -0.1607413943 -0.1219437346
0.4745530022 -0.1554689820 0.0482766632
-0.4994087626 -0.2094970865 -0.0440981224
0.1857849172 -0.2076663820 -0.0159451485
-0.2932521242 -0.1927122813 -0.1528863187
0.1905513419 -0.1914196523 -0.1330079883
0.1791056430 -0.1843936711 0.0938722751
-0.2921010953 -0.1854676144 0.0804728609
-0.4607286650 -0.1862374484 0.0632572444
-0.2101026225 0.2191511753 -0.0386098260
-0.2034141136 0.2141180671 -0.2010690376
0.2408907381 -0.1331679741 -0.0091271423
0.4012790367 -0.1327394477 -0.0025371697
0.2475792471 -0.1382010823 -0.1715863539
0.4079675456 -0.1377725559 -0.1649963813
0.3081798328 -0.1326631166 -0.0045709634
0.2411995735 -0.1354502951 -0.0913554860
0.2588860686 -0.1337007601 -0.0357841909
0.2633943677 -0.1370932587 -0.1452876277
0.3150874032 -0.1378610687 -0.1723510223
0.3660015736 -0.1328231853 -0.0123297057
0.4077135077 -0.1359113096 -0.1137006374
0.3720760792 -0.1373942555 -0.1598752043
0.4053142581 -0.1341058724 -0.0554245407
0.3082583336 -0.1971551306 -0.0025697205
0.2409804264 -0.1973907459 -0.0071337802
0.4013687249 -0.1969622195 -0.0005438076
0.2412896377 -0.1999422782 -0.0893537680
0.2589761329 -0.1981927432 -0.0337824729
0.2634844320 -0.2015852418 -0.1432859097
0.3151659039 -0.2023530827 -0.1703497794
0.3660916379 -0.1973151684 -0.0103279877
0.4078035720 -0.2004032927 -0.1116989195
0.2476689354 -0.2024238541 -0.1695929918
0.4080572339 -0.2019953277 -0.1630030192
0.3721661435 -0.2018862386 -0.1578734863
0.4054043224 -0.1985978555 -0.0534228227
0.4819255170 0.1645203167 -0.1320392873
0.4740987682 0.1697927290 0.0381811104
0.3838277392 0.2094402131 -0.0412710584
0.3883360383 0.2060477145 -0.1507744952
-0.3343945797 0.1443471897 -0.0497522340
-0.3283200741 0.1397761195 -0.1972977326
-0.2165556591 -0.1295095026 0.1850449609
0.0464471884 -0.1284403767 0.2076569865
-0.3345286344 0.2185095605 -0.0520553590
-0.3284541288 0.2139384903 -0.1996008576
0.2391838808 0.2098449409 -0.0198242117
0.2458723898 0.2048118327 -0.1822834233
-0.2258469701 0.2182516698 -0.0666445890
-0.2213386710 0.2148591712 -0.1761480258
0.3839440839 0.1449484054 -0.0392682639
0.3884523830 0.1415559067 -0.1487717007
-0.5000000000 0.2138681628 -0.0572386368
0.1851936798 0.2156988674 -0.0290856630
-0.2655410610 -0.2246390340 -0.0340005892
0.3321462750 0.2101870381 -0.0142060106
0.3390538453 0.2049890860 -0.1819860695
-0.3676337964 0.1410430363 -0.1542022411
-0.3700330460 0.1428484734 -0.0959261443
-0.3677678511 0.2152054070 -0.1565053660
-0.3701671007 0.2170108442 -0.0982292693
-0.2036521660 0.2166171028 -0.1205775173
0.2392998495 0.1456223445 -0.0178297730
0.2459883585 0.1405892363 -0.1802889846
0.2420232029 0.1419021426 -0.1291290409
0.2396239533 0.1437075798 -0.0708529441
0.4061388880 0.1433138383 -0.0932011921
0.3322510562 0.1456951995 -0.0122036912
0.3391586265 0.1404972474 -0.1799837501
-0.3013764677 -0.2154149667 -0.0271029191
-0.3686543749 -0.2156505819 -0.0316669788
-0.2082660764 -0.2152220555 -0.0250770062
-0.3683451636 -0.2182021142 -0.1138869666
-0.3506586685 -0.2164525792 -0.0583156715
-0.3461503693 -0.2198450778 -0.1678191083
-0.2944688974 -0.2206129187 -0.1948829780
-0.2435431634 -0.2155750044 -0.0348611863
-0.2018301781 -0.2186631259 -0.1362320749
-0.3619658659 -0.2206836901 -0.1941261904
-0.2015775674 -0.2202551637 -0.1875362178
-0.2374686578 -0.2201460746 -0.1824066849
-0.2042294277 -0.2168576887 -0.0779559781
0.3995720883 0.2103386670 -0.0132362628
0.4062605972 0.2053055587 -0.1756954744
-0.2937831789 0.1875581297 -0.1646892449
0.1900202872 0.1888507587 -0.1448109146
0.1785745883 0.1958767398 0.0820693488
-0.2926321500 0.1948027966 0.0686699346
-0.4612597196 0.1940329625 0.0514543181
-0.3014684733 -0.1412525887 -0.0294043131
-0.3684487327 -0.1440397672 -0.1161888357
-0.3507622375 -0.1422902322 -0.0606175406
-0.3462539384 -0.1456827308 -0.1701209774
-0.2945609030 -0.1464505408 -0.1971843720
-0.2436467325 -0.1414126573 -0.0371630554
-0.2019337472 -0.1445007789 -0.1385339440
-0.2375722269 -0.1459837275 -0.1847085540
-0.2043329968 -0.1426953417 -0.0802578472
-0.3687575195 -0.1417921491 -0.0339594149
-0.2083692210 -0.1413636227 -0.0273694423
-0.3620690106 -0.1468252574 -0.1964186265
-0.2016807121 -0.1463967310 -0.1898286539
-0.2257129169 0.1440903507 -0.0643414967
-0.2212046177 0.1406978520 -0.1738449335
0.3996880570 0.1461160705 -0.0112418241
0.4063765660 0.1410829623 -0.1737010357
-0.3703571997 0.1447989928 -0.0429040829
-0.3636686907 0.1397658846 -0.2053632945
-0.3860024500 0.2192535984 -0.0527121581
-0.0542947496 0.2016284985 -0.0968874540
-0.0518814458 0.1882044442 -0.1547500798
0.0654494651 0.2086636830 -0.0629865585
-0.0542947496 0.2016284985 -0.0968874540
-0.0434056101 0.2201689507 -0.0386356712
-0.1740389642 0.1945933141 -0.1307883494
0.3447528529 0.1899007206 -0.0896947539
0.3447528529 0.1899007206 -0.0896947539
-0.3963160750 0.2043354797 0.0057156489
-0.0467151558 0.2102578869 0.0169418347
-0.0434056101 0.2201689507 -0.0386356712
0.0692392620 0.2129783772 -0.0060719141
-0.0570287808 0.1953397682 0.0753696417
-0.1645168404 0.2099894011 0.0135919811
-0.0467151558 0.2102578869 0.0169418347
0.3423395492 0.2033247749 -0.0318321281
0.3296462240 0.1927457982 0.0045477237
0.3340823341 -0.1842038881 -0.0689444415
0.3340823341 -0.1842038881 -0.0689444415
-0.0513503912 -0.1920659668 -0.1429471535
-0.1584457261 -0.2083525004 -0.0884738713
-0.0374948596 -0.2080293431 -0.0835042887
-0.0374948596 -0.2080293431 -0.0835042887
-0.0398780719 -0.2161527080 -0.0249728688
0.0765282412 -0.1997244977 -0.1082561385
-0.3824749118 -0.2170680603 -0.0390493558
0.3395528215 -0.1809587116 0.0353652409
0.3395528215 -0.1809587116 0.0353652409
-0.0531580891 -0.1965669982 0.0322638562
-0.0398780719 -0.2161527080 -0.0249728688
-0.1726295922 -0.1910173063 0.0563683585
-0.0531580891 -0.1965669982 0.0322638562
-0.0564977261 -0.1849306428 0.0871725680
0.0663134141 -0.2021166901 0.0081593538
-0.3824749118 -0.2170680603 -0.0390493558
-0.3631348630 -0.2054382412 0.0146283276
-0.0570287808 0.1953397682 0.0753696417
0.0607729038 0.1956082540 0.0787194953
-0.1232868147 0.1723371565 0.1338443041
-0.1232868147 0.1723371565 0.1338443041
-0.0564977261 -0.1849306428 0.0871725680
-0.1742994107 -0.1851991286 0.0838227144
-0.0187250080 -0.1569515869 0.1394586180
-0.0187250080 -0.1569515869 0.1394586180
0.1788401157 0.0057415343 0.0879708120
0.1126436520 -0.0613494212 0.1478138993
0.1125108884 0.0337181816 0.1448631677
0.1125108884 0.0337181816 0.1448631677
0.0462528545 0.0107155699 0.2033378301
0.1455427383 0.1147974607 0.1134662583
0.3266022056 -0.0073004711 0.0660266928
0.1788401157 0.0057415343 0.0879708120
0.2525883970 0.0942881344 0.0740480208
0.2528539243 -0.0958470711 0.0799494839
0.3263366783 0.1828347344 0.0601252296
0.4003504869 0.0812461290 0.0521039016
0.2525883970 0.0942881344 0.0740480208
0.3266022056 -0.0073004711 0.0660266928
0.4743258852 0.0071618735 0.0432288868
0.4005776039 -0.0813847265 0.0571516780
0.4003504869 0.0812461290 0.0521039016
0.3268293226 -0.1699313266 0.0710744691
0.2528539243 -0.0958470711 0.0799494839
0.4005776039 -0.0813847265 0.0571516780
0.4909627585 -0.0065017177 -0.0775905403
0.4997427093 0.0067134652 -0.0288601933
0.4997427093 0.0067134652 -0.0288601933
0.4870192104 0.0177408502 0.0068490350
-0.0852485692 0.0101810069 0.1920318173
-0.2167499929 0.0096464439 0.1807258045
-0.0854429031 0.1493369534 0.1877126609
-0.0852485692 0.0101810069 0.1920318173
0.0462528545 0.0107155699 0.2033378301
-0.0850542354 -0.1289749396 0.1963509737
-0.2923666226 0.0046675911 0.0745713977
-0.2546554747 0.0767349908 0.1254890229
-0.2545227110 -0.0183326120 0.1284397545
-0.2545227110 -0.0183326120 0.1284397545
-0.3766804075 0.0042826741 0.0659635895
-0.4609941923 0.0038977570 0.0573557813
-0.3346562787 0.0995427353 0.0673167620
-0.3766804075 0.0042826741 0.0659635895
-0.2923666226 0.0046675911 0.0745713977
-0.4187045362 -0.0909773872 0.0646104169
-0.4757999968 0.0239141966 -0.1087352666
-0.4997043813 0.0021855381 -0.0506683796
-0.4995565719 -0.1036557742 -0.0473832510
-0.4757999968 0.0239141966 -0.1087352666
-0.4997043813 0.0021855381 -0.0506683796
-0.4804820505 0.0981092503 0.0003929693
-0.4803342411 -0.0077320620 0.0036780979
-0.4803342411 -0.0077320620 0.0036780979
-0.4609941923 0.0038977570 0.0573557813
-0.4898715018 -0.1086145743 -0.0202100122
0.3245188302 -0.1996930368 -0.0850683997
0.3245188302 -0.1996930368 -0.0850683997
0.3244291419 -0.1354702650 -0.0870617618
0.3244291419 -0.1354702650 -0.0870617618
-0.2869524718 0.2163877582 -0.1231334063
-0.2869524718 0.2163877582 -0.1231334063
-0.2868188415 0.1425293017 -0.1208397143
-0.2868188415 0.1425293017 -0.1208397143
-0.2851159711 -0.2179528728 -0.1096015983
-0.2851159711 -0.2179528728 -0.1096015983
-0.2852191158 -0.1440944400 -0.1118940344
-0.2852191158 -0.1440944400 -0.1118940344
0.3227222390 0.2075752498 -0.0977598430
0.3227222390 0.2075752498 -0.0977598430
0.3228382078 0.1433526534 -0.0957654043
0.3228382078 0.1433526534 -0.0957654043
-0.3620342121 0.1952590329 -0.1093598766
-0.4190329871 0.1925663151 -0.1116231159
-0.3620342121 0.1952590329 -0.1093598766
0.0678627688 0.1952396286 -0.1208491843
-0.1740389642 0.1945933141 -0.1307883494
0.0678627688 0.1952396286 -0.1208491843
0.1277348762 0.1987572208 -0.1038987365
-0.1577052550 0.2224039924 -0.0434106754
0.0654494651 0.2086636830 -0.0629865585
-0.1631498248 0.2131337663 -0.0725365667
-0.2230219321 0.2096161741 -0.0894870145
0.3359729021 0.1766855377 -0.1384251010
0.4221191358 0.1904257015 -0.0621366736
0.3423395492 0.2033247749 -0.0318321281
0.2649732664 0.2027997940 -0.0593902084
-0.3860024500 0.2192535984 -0.0527121581
-0.3341604875 0.2144872569 -0.0212350153
-0.3963160750 0.2043354797 0.0057156489
0.0692392620 0.2129783772 -0.0060719141
-0.1593600279 0.2174484605 -0.0156219224
0.1239069252 0.2044275585 0.0379987174
0.0659297163 0.2030673134 0.0495055918
-0.1748304654 0.1950712824 0.0720197881
-0.2285744952 0.2023960988 0.0411309578
0.0607729038 0.1956082540 0.0787194953
-0.1645168404 0.2099894011 0.0135919811
0.4209124839 0.1971377287 -0.0332053607
0.3296462240 0.1927457982 0.0045477237
0.3263366783 0.1828347344 0.0601252296
0.2541104062 0.1943112690 0.0433085363
0.3364655464 -0.1760805233 -0.1274758614
0.2599336256 -0.1959351350 -0.0424447950
0.3428924586 -0.1925950670 -0.0195434709
0.4170411670 -0.1808638201 -0.0460431174
-0.1723012577 -0.1923891240 -0.1479167361
-0.2258489252 -0.2005323908 -0.1206800950
0.0696004754 -0.1917428095 -0.1379775709
-0.1584457261 -0.2083525004 -0.0884738713
0.0741450288 -0.2078478626 -0.0497247186
-0.1515179603 -0.2163341886 -0.0587524390
0.0741450288 -0.2078478626 -0.0497247186
0.1311565792 -0.2036954398 -0.0621006435
-0.3963304434 -0.2011046839 -0.0984922205
-0.3378635180 -0.2048901708 -0.0959678372
-0.3963304434 -0.2011046839 -0.0984922205
0.3428924586 -0.1925950670 -0.0195434709
0.2593292323 -0.1826761914 0.0646187580
-0.1527095665 -0.2203958710 -0.0294867290
0.0663134141 -0.2021166901 0.0081593538
-0.1593495751 -0.2106030161 -0.0008683665
-0.2190853266 -0.2078281701 0.0111838847
0.0629737770 -0.1904803347 0.0630680657
-0.1726295922 -0.1910173063 0.0563683585
0.0629737770 -0.1904803347 0.0630680657
0.1227095285 -0.1932551806 0.0510158145
-0.4216017884 -0.2016527543 0.0121039443
-0.3631348630 -0.2054382412 0.0146283276
0.1123165545 0.1728741281 0.1405440113
-0.0054851301 0.1726056423 0.1371941577
-0.1748304654 0.1950712824 0.0720197881
-0.0386141470 0.1611043364 0.1664314889
-0.0854429031 0.1493369534 0.1877126609
-0.2079594823 0.1835699765 0.1012571194
-0.2543283772 -0.1574885585 0.1327589109
-0.1365266926 -0.1572200727 0.1361087645
0.0613039584 -0.1846621569 0.0905224216
-0.1176403336 -0.1432305447 0.1622517895
-0.0850542354 -0.1289749396 0.1963509737
0.0801903175 -0.1706726290 0.1166654466
0.1789728793 -0.0893260684 0.0909215436
0.1127764157 -0.1564170239 0.1507646308
0.1787073520 0.1008091371 0.0850200804
0.1126436520 -0.0613494212 0.1478138993
0.0792847045 0.0917948490 0.1719409207
0.0794790384 -0.0473610975 0.1762600771
0.0792847045 0.0917948490 0.1719409207
0.1123165545 0.1728741281 0.1405440113
0.2527211606 -0.0007794684 0.0769987524
0.1787073520 0.1008091371 0.0850200804
0.1789728793 -0.0893260684 0.0909215436
0.2527211606 -0.0007794684 0.0769987524
0.3264694419 0.0877671317 0.0630759612
0.4002177232 0.1763137317 0.0491531700
0.2524556333 0.1893557371 0.0710972892
0.3264694419 0.0877671317 0.0630759612
0.4004640454 -0.0000692988 0.0546277898
0.4744394437 -0.0741535543 0.0457527750
0.4742123267 0.0884773012 0.0407049986
0.4004640454 -0.0000692988 0.0546277898
0.3267157641 -0.0886158988 0.0685505810
0.2529674828 -0.1771624989 0.0824733721
0.4006911624 -0.1627001543 0.0596755662
0.3267157641 -0.0886158988 0.0685505810
0.4821526340 0.0018894612 -0.1269915109
0.4954813792 -0.0920127349 -0.0503661669
0.4908341131 0.0856168910 -0.0804497403
0.4909627585 -0.0065017177 -0.0775905403
0.4998713547 -0.0854051434 -0.0260009933
0.4870192104 0.0177408502 0.0068490350
0.4743258852 0.0071618735 0.0432288868
0.4932523145 0.1043457663 -0.0138647791
-0.1510964480 0.0794916987 0.1842192327
-0.1509021141 -0.0596642478 0.1885383891
-0.0195950243 0.0800262617 0.1955252455
-0.1510964480 0.0794916987 0.1842192327
-0.0194006904 -0.0591296849 0.1998444019
-0.0195950243 0.0800262617 0.1955252455
-0.1509021141 -0.0596642478 0.1885383891
-0.0194006904 -0.0591296849 0.1998444019
-0.2924993863 0.0997351938 0.0716206661
-0.2547882384 0.1718025935 0.1225382914
-0.2922338590 -0.0904000116 0.0775221293
-0.2546554747 0.0767349908 0.1254890229
-0.2167499929 0.0096464439 0.1807258045
-0.2733119032 -0.1019001132 0.1044563077
-0.4189700635 0.0991578183 0.0587089538
-0.4187045362 -0.0909773872 0.0646104169
-0.4189700635 0.0991578183 0.0587089538
-0.3769459348 0.1944178795 0.0600621263
-0.3343907514 -0.0905924702 0.0732182252
-0.3346562787 0.0995427353 0.0673167620
-0.3343907514 -0.0905924702 0.0732182252
-0.3764148801 -0.1858525314 0.0718650526
-0.4518317589 -0.0000803689 -0.1653829851
-0.4878999984 0.1188911797 -0.0829869517
-0.4755782827 -0.1348477719 -0.1038075737
-0.4756521874 -0.0819271157 -0.1054501380
-0.4998521906 0.1080268505 -0.0539535082
-0.4756521874 -0.0819271157 -0.1054501380
-0.4998521906 0.1080268505 -0.0539535082
-0.4902410252 0.1559887066 -0.0284228338
-0.4995565719 -0.1036557742 -0.0473832510
-0.4804820505 0.0981092503 0.0003929693
0.3278630847 -0.2022095909 -0.1662980055
0.2443246809 -0.1999073000 -0.0883633860
0.3211745757 -0.1971764827 -0.0038387939
0.4047129794 -0.1994787736 -0.0817734134
0.2442349926 -0.1356845282 -0.0903567481
0.3277733964 -0.1379868191 -0.1682913676
0.4046232911 -0.1352560018 -0.0837667755
0.3210848874 -0.1329537109 -0.0058321560
-0.2836082173 0.2138712041 -0.2043630121
-0.2067583680 0.2166346212 -0.1198394318
-0.2902967262 0.2189043123 -0.0419038005
-0.3671465755 0.2161408952 -0.1264273807
-0.2066247377 0.1427761647 -0.1175457398
-0.2834745870 0.1400127476 -0.2020693201
-0.3670129452 0.1422824387 -0.1241336887
-0.2901630960 0.1450458558 -0.0396101085
-0.2817717167 -0.2204694269 -0.1908312041
-0.3653101204 -0.2181671360 -0.1128965846
-0.2884602256 -0.2154363187 -0.0283719925
-0.2049218219 -0.2177386096 -0.1063066120
-0.3654132651 -0.1443087033 -0.1151890207
-0.2818748613 -0.1466109942 -0.1931236402
-0.2050249665 -0.1438801768 -0.1085990481
-0.2885633703 -0.1415778859 -0.0306644286
0.3260664935 0.2050586957 -0.1789894488
0.4029163428 0.2078221128 -0.0944658686
0.3193779845 0.2100918039 -0.0165302372
0.2425281353 0.2073283868 -0.1010538175
0.4030323115 0.1435995164 -0.0924714299
0.3261824622 0.1408360993 -0.1769950101
0.2426441040 0.1431057904 -0.0990593788
0.3194939533 0.1458692075 -0.0145357985
-0.3729233516 0.1767185807 -0.1676116593
-0.2828940394 0.2060985818 -0.1064374622
-0.4430012250 0.2165608806 -0.0549753975
-0.4760317621 0.1898735973 -0.1138863552
-0.3290036750 0.2219463162 -0.0504489188
-0.4190329871 0.1925663151 -0.1116231159
0.0079906615 0.1917220364 -0.1377996320
0.0690694207 0.1885276014 -0.1497804972
-0.1728323124 0.1878812869 -0.1597196624
-0.1141668569 0.1981109063 -0.1138379017
0.1277348762 0.1987572208 -0.1038987365
0.0067840096 0.1984340636 -0.1088683191
0.1876069835 0.2022748130 -0.0869482888
0.1253215724 0.2121812752 -0.0460361107
-0.1631498248 0.2131337663 -0.0725365667
-0.1060000023 0.2120162454 -0.0701490647
0.0708940348 0.2179339091 -0.0338606671
0.0055773578 0.2051460908 -0.0799370062
-0.2230219321 0.2096161741 -0.0894870145
-0.1141668569 0.1981109063 -0.1138379017
-0.2828940394 0.2060985818 -0.1064374622
-0.2339110716 0.1910757219 -0.1477387972
0.4089492095 0.1706029272 -0.1352321941
0.2673865701 0.1893757396 -0.1172528342
0.4133391850 0.1772105186 -0.1108670206
0.4907054678 0.1777354996 -0.0833089403
0.2649732664 0.2027997940 -0.0593902084
0.4221191358 0.1904257015 -0.0621366736
0.1876069835 0.2022748130 -0.0869482888
0.2673865701 0.1893757396 -0.1172528342
-0.3341604875 0.2144872569 -0.0212350153
-0.4481580375 0.2091018213 -0.0257614940
-0.2823185250 0.2097209153 0.0102421275
-0.3444741125 0.1995691381 0.0371927917
-0.3769459348 0.1944178795 0.0600621263
-0.4481580375 0.2091018213 -0.0257614940
-0.2285744952 0.2023960988 0.0411309578
-0.1107728106 0.2026645846 0.0444808114
-0.2823185250 0.2097209153 0.0102421275
-0.2182608702 0.2173142175 -0.0172968492
0.0070288740 0.2029330704 0.0478306650
0.0659297163 0.2030673134 0.0495055918
-0.1593600279 0.2174484605 -0.0156219224
-0.1107728106 0.2026645846 0.0444808114
0.2541104062 0.1943112690 0.0433085363
0.4018724961 0.1812692636 0.0213644171
0.1818841341 0.2057878036 0.0264918429
0.2574199519 0.2042223328 -0.0122689696
0.2623168380 -0.1878117702 -0.1009762149
0.4082310425 -0.1724726412 -0.0954440881
0.2623168380 -0.1878117702 -0.1009762149
0.1881681295 -0.1995430171 -0.0744765684
0.4170411670 -0.1808638201 -0.0460431174
0.2599336256 -0.1959351350 -0.0424447950
0.4497104590 -0.1708026072 -0.0839934260
0.4082310425 -0.1724726412 -0.0954440881
-0.2258489252 -0.2005323908 -0.1206800950
-0.1048980586 -0.2002092336 -0.1157105124
-0.2793965926 -0.2086756576 -0.0934434539
-0.2119933936 -0.2164957672 -0.0612372303
0.0160528079 -0.1998860763 -0.1107409298
0.0765282412 -0.1997244977 -0.1082561385
-0.1515179603 -0.2163341886 -0.0587524390
-0.1048980586 -0.2002092336 -0.1157105124
-0.3724260589 -0.1793760254 -0.1565591076
-0.4755043781 -0.1877684281 -0.1021650094
-0.3240079864 -0.2208535471 -0.0365249725
-0.2793965926 -0.2086756576 -0.0934434539
-0.4409418372 -0.2132825734 -0.0415737391
-0.3378635180 -0.2048901708 -0.0959678372
0.2626688693 -0.1943125468 0.0097100462
0.4197764108 -0.1792412318 0.0061117238
0.2626688693 -0.1943125468 0.0097100462
0.1824452801 -0.1960300266 0.0389635633
0.3268293226 -0.1699313266 0.0710744691
0.4197764108 -0.1792412318 0.0061117238
-0.1593495751 -0.2106030161 -0.0008683665
-0.1029338278 -0.2084814346 0.0013885636
0.0729534226 -0.2119095450 -0.0204590087
0.0065776625 -0.1993418441 0.0202116050
-0.2190853266 -0.2078281701 0.0111838847
-0.1128938406 -0.1937921522 0.0443161073
-0.2788210782 -0.2050533242 0.0232361358
-0.2323653437 -0.1882424603 0.0684206097
-0.3764148801 -0.1858525314 0.0718650526
-0.2788210782 -0.2050533242 0.0232361358
0.0534157122 0.1727398852 0.1388690845
0.1196737461 0.1957424969 0.0803944221
0.0018720615 0.1954740111 0.0770445685
0.0534157122 0.1727398852 0.1388690845
-0.1159296231 0.1952055253 0.0736947149
-0.2079594823 0.1835699765 0.1012571194
-0.0478214639 0.1782220523 0.1209005653
-0.0054851301 0.1726056423 0.1371941577
-0.1511936149 0.1490696719 0.1820596545
-0.0386141470 0.1611043364 0.1664314889
-0.1701155707 0.1605697735 0.1551254761
-0.2547882384 0.1718025935 0.1225382914
-0.1954275349 -0.1573543156 0.1344338377
-0.2332002530 -0.1853333715 0.0821477876
-0.1153985684 -0.1850648857 0.0854976412
-0.1954275349 -0.1573543156 0.1344338377
0.0024031161 -0.1847963998 0.0888474948
0.0801903175 -0.1706726290 0.1166654466
-0.0870690299 -0.1640805937 0.1247121787
-0.1365266926 -0.1572200727 0.1361087645
-0.0193035235 -0.1287076581 0.2020039801
-0.1176403336 -0.1432305447 0.1622517895
0.0633187529 -0.1495565028 0.1621612165
0.1127764157 -0.1564170239 0.1507646308
0.1458746475 -0.1228715461 0.1208430872
0.1457418838 -0.0278039434 0.1178923556
0.0795454202 -0.0948948989 0.1777354429
0.1458746475 -0.1228715461 0.1208430872
0.1456091202 0.0672636593 0.1149416240
0.1455427383 0.1147974607 0.1134662583
0.0794790384 -0.0473610975 0.1762600771
0.1457418838 -0.0278039434 0.1178923556
0.2157142563 0.0500148343 0.0810094164
0.2895953013 0.0434938316 0.0700373568
0.2155814927 0.1450824371 0.0780586848
0.2157142563 0.0500148343 0.0810094164
0.2158470200 -0.0450527684 0.0839601480
0.2159797837 -0.1401203711 0.0869108795
0.2897280650 -0.0515737711 0.0729880884
0.2158470200 -0.0450527684 0.0839601480
0.3633435826 0.1320404317 0.0561145656
0.3634763463 0.0369728289 0.0590652972
0.4372246276 0.1255194290 0.0451425060
0.3633435826 0.1320404317 0.0561145656
0.2894625376 0.1385614344 0.0670866252
0.2155814927 0.1450824371 0.0780586848
0.2895953013 0.0434938316 0.0700373568
0.2894625376 0.1385614344 0.0670866252
0.4822661925 -0.0794259665 -0.1244676228
0.4864441377 0.0790092995 -0.1048149138
0.4866712547 -0.0836215560 -0.0997671375
0.4911898755 -0.1691325732 -0.0725427640
0.4996140640 0.0988320738 -0.0317193933
0.4951597659 0.1382837867 -0.0575141668
0.4998713547 -0.0854051434 -0.0260009933
0.4908341131 0.0856168910 -0.0804497403
0.4872121784 -0.1204370627 0.0111378349
0.4871478558 -0.0743777584 0.0097082349
0.4996140640 0.0988320738 -0.0317193933
0.4871478558 -0.0743777584 0.0097082349
-0.1509992811 0.0099137254 0.1863788109
-0.2168471599 0.0792244172 0.1785662263
-0.2166528260 -0.0599315293 0.1828853827
-0.1509992811 0.0099137254 0.1863788109
-0.0853457361 0.0797589802 0.1898722391
-0.0196921912 0.1496042349 0.1933656673
-0.1511936149 0.1490696719 0.1820596545
-0.0853457361 0.0797589802 0.1898722391
-0.0194978574 0.0104482884 0.1976848237
0.0463500214 -0.0588624034 0.2054974083
0.0461556876 0.0802935431 0.2011782519
-0.0194978574 0.0104482884 0.1976848237
-0.0851514023 -0.0593969664 0.1941913955
-0.1508049472 -0.1292422211 0.1906979673
-0.0193035235 -0.1287076581 0.2020039801
-0.0851514023 -0.0593969664 0.1941913955
-0.2166528260 -0.0599315293 0.1828853827
-0.2357335189 0.0652348893 0.1524232013
-0.2355391851 -0.0739210573 0.1567423577
-0.2543283772 -0.1574885585 0.1327589109
-0.4399821279 0.0515277877 0.0580323675
-0.4611269560 0.0989653598 0.0544050497
-0.4608614286 -0.0911698457 0.0603065128
-0.3976924718 -0.0433473566 0.0652870032
-0.3979579992 0.1467878489 0.0593855401
-0.3978252355 0.0517202462 0.0623362716
-0.3558011068 0.1469803074 0.0636894442
-0.3979579992 0.1467878489 0.0593855401
-0.3133786870 -0.0429624395 0.0738948114
-0.2922338590 -0.0904000116 0.0775221293
-0.2924993863 0.0997351938 0.0716206661
-0.3556683431 0.0519127047 0.0666401758
-0.3554028158 -0.1382225008 0.0725416389
-0.3555355794 -0.0431548980 0.0695909073
-0.3975597082 -0.1384149593 0.0682377348
-0.3554028158 -0.1382225008 0.0725416389
-0.4519476416 0.0828993314 -0.1679585294
-0.4636999952 -0.0710627865 -0.1344835816
-0.4639317605 0.0948966142 -0.1396346701
-0.4760317621 0.1898735973 -0.1138863552
-0.4608614286 -0.0911698457 0.0603065128
-0.4707969804 0.0931504502 0.0275662080
-0.4705314530 -0.0969847552 0.0334676711
-0.4753000834 -0.1474260114 0.0215236161
-0.3279086955 0.1914085813 -0.1370245608
-0.4070488682 0.1805690323 -0.1399469751
-0.3170195560 0.2099490334 -0.0787727780
-0.3279086955 0.1914085813 -0.1370245608
0.3048630596 0.1963502573 -0.0745424812
0.2637666145 0.2095118212 -0.0304588955
0.4209124839 0.1971377287 -0.0332053607
0.3822293425 0.1968752382 -0.0469844008
0.2274967768 0.1958252763 -0.1021005615
0.2250834731 0.2092493307 -0.0442379357
0.3048630596 0.1963502573 -0.0745424812
0.2274967768 0.1958252763 -0.1021005615
0.0112620531 0.2116181320 0.0054349603
0.0708940348 0.2179339091 -0.0338606671
-0.1577052550 0.2224039924 -0.0434106754
-0.1013828190 0.2188087056 -0.0271287968
0.1272164709 0.2143386223 -0.0175787886
0.1818841341 0.2057878036 0.0264918429
0.0112620531 0.2116181320 0.0054349603
0.1239069252 0.2044275585 0.0379987174
0.4475056261 0.1834652288 0.0024878749
0.4082191587 0.1865587520 0.0031744911
0.2637666145 0.2095118212 -0.0304588955
0.4082191587 0.1865587520 0.0031744911
0.0171334784 -0.2120002853 -0.0373487937
0.0729534226 -0.2119095450 -0.0204590087
-0.1527095665 -0.2203958710 -0.0294867290
-0.0945064099 -0.2121817659 -0.0711283638
0.1311565792 -0.2036954398 -0.0621006435
0.0195166908 -0.2038769204 -0.0958802136
0.1881681295 -0.1995430171 -0.0744765684
0.1335397915 -0.1955720750 -0.1206320634
-0.4239652185 -0.1835722268 -0.1293620585
-0.3447912838 -0.1969084826 -0.1256892696
-0.4478696030 -0.2053008852 -0.0712951714
-0.4239652185 -0.1835722268 -0.1293620585
0.4006911624 -0.1627001543 0.0596755662
0.2593292323 -0.1826761914 0.0646187580
0.4070529119 -0.1682138468 0.0418209520
0.4598882054 -0.1783824920 -0.0085150348
0.0032380254 -0.1877054887 0.0751203168
0.0613039584 -0.1846621569 0.0905224216
-0.1742994107 -0.1851991286 0.0838227144
-0.1128938406 -0.1937921522 0.0443161073
0.1227095285 -0.1932551806 0.0510158145
0.0065776625 -0.1993418441 0.0202116050
0.1824452801 -0.1960300266 0.0389635633
0.1260491656 -0.2048915360 -0.0038928973
-0.4409418372 -0.2132825734 -0.0415737391
-0.4800687138 -0.1978672675 0.0095795610
-0.3240079864 -0.2208535471 -0.0365249725
-0.4216017884 -0.2016527543 0.0121039443
-0.3276179791 -0.1954529278 0.0475505942
-0.4119317640 -0.1958378448 0.0389427860
-0.3143379620 -0.2150386376 -0.0096861308
-0.3276179791 -0.1954529278 0.0475505942
0.0627687795 0.0512552094 0.1876393754
0.0461556876 0.0802935431 0.2011782519
0.0463500214 -0.0588624034 0.2054974083
0.0959949634 -0.0068214580 0.1605616224
0.0958006295 0.1323344885 0.1562424660
0.1290268133 0.0742578211 0.1291647130
0.1620586633 0.1553371002 0.0977678036
0.0958006295 0.1323344885 0.1562424660
0.4374517446 -0.0371114265 0.0501902824
0.3635899048 -0.0443425988 0.0615891854
0.4375653031 -0.1184268543 0.0527141706
0.4374517446 -0.0371114265 0.0501902824
0.4373381861 0.0442040012 0.0476663942
0.4372246276 0.1255194290 0.0451425060
0.3634763463 0.0369728289 0.0590652972
0.4373381861 0.0442040012 0.0476663942
0.2898416235 -0.1328891988 0.0755119765
0.2897280650 -0.0515737711 0.0729880884
0.2159797837 -0.1401203711 0.0869108795
0.2898416235 -0.1328891988 0.0755119765
0.3637034633 -0.1256580266 0.0641130736
0.4375653031 -0.1184268543 0.0527141706
0.3635899048 -0.0443425988 0.0615891854
0.3637034633 -0.1256580266 0.0641130736
0.4742123267 0.0884773012 0.0407049986
0.4807861063 -0.0688640659 0.0275628491
0.4805589893 0.0937667896 0.0225150727
0.4963688666 0.1476482244 -0.0242216862
-0.2736438123 0.1357688937 0.0970794787
-0.2735110487 0.0407012909 0.1000302103
-0.2357999008 0.1127686906 0.1509478355
-0.2736438123 0.1357688937 0.0970794787
-0.2733782850 -0.0543663118 0.1029809419
-0.2733119032 -0.1019001132 0.1044563077
-0.2357335189 0.0652348893 0.1524232013
-0.2735110487 0.0407012909 0.1000302103
-0.4639317605 0.0948966142 -0.1396346701
-0.4638738192 0.0534067640 -0.1383468980
-0.4517158762 -0.0830600693 -0.1628074408
-0.4697499960 -0.0235742949 -0.1216094241
-0.4699817613 0.1423851058 -0.1267605127
-0.4818499976 0.0714026882 -0.0958611092
-0.4939499992 0.1663796713 -0.0701127943
-0.4699817613 0.1423851058 -0.1267605127
-0.4994826673 -0.1565764304 -0.0457406867
-0.4755043781 -0.1877684281 -0.1021650094
-0.4996304766 -0.0507351180 -0.0490258153
-0.4755782827 -0.1348477719 -0.1038075737
-0.4997782860 0.0551061943 -0.0523109439
-0.4878999984 0.1188911797 -0.0829869517
-0.4636999952 -0.0710627865 -0.1344835816
-0.4757260921 -0.0290064596 -0.1070927023
-0.4902410252 0.1559887066 -0.0284228338
-0.4900932159 0.0501473942 -0.0251377052
-0.4806298598 0.2039505627 -0.0028921594
-0.4708708850 0.1460711064 0.0259236437
-0.4899454065 -0.0556939181 -0.0218525765
-0.4898715018 -0.1086145743 -0.0202100122
-0.4707969804 0.0931504502 0.0275662080
-0.4900932159 0.0501473942 -0.0251377052
-0.4705314530 -0.0969847552 0.0334676711
-0.4705978349 -0.0494509539 0.0319923054
-0.4611269560 0.0989653598 0.0544050497
-0.4755656107 0.0427091941 0.0156221529
-0.4753000834 -0.1474260114 0.0215236161
-0.4851028715 -0.0581733182 -0.0082659572
-0.4800687138 -0.1978672675 0.0095795610
-0.4946401322 -0.1590558304 -0.0321540673
0.2860938828 -0.2010584455 -0.1273306957
0.3662880320 -0.2008441823 -0.1240357094
0.2827496283 -0.1985418913 -0.0461010899
0.2860938828 -0.2010584455 -0.1273306957
0.3629437776 -0.1983276281 -0.0428061036
0.2827496283 -0.1985418913 -0.0461010899
0.3662880320 -0.2008441823 -0.1240357094
0.3629437776 -0.1983276281 -0.0428061036
0.2860041945 -0.1368356737 -0.1293240579
0.2826599400 -0.1343191195 -0.0480944521
0.3661983438 -0.1366214104 -0.1260290716
0.2860041945 -0.1368356737 -0.1293240579
0.3628540893 -0.1341048563 -0.0447994658
0.3661983438 -0.1366214104 -0.1260290716
0.2826599400 -0.1343191195 -0.0480944521
0.3628540893 -0.1341048563 -0.0447994658
-0.2451832927 0.2152529126 -0.1621012219
-0.3253773964 0.2150060496 -0.1653951964
-0.2485275471 0.2177694667 -0.0808716161
-0.2451832927 0.2152529126 -0.1621012219
-0.3287216509 0.2175226037 -0.0841655906
-0.2485275471 0.2177694667 -0.0808716161
-0.3253773964 0.2150060496 -0.1653951964
-0.3287216509 0.2175226037 -0.0841655906
-0.2450496624 0.1413944561 -0.1598075299
-0.2483939168 0.1439110103 -0.0785779241
-0.3252437661 0.1411475931 -0.1631015044
-0.2450496624 0.1413944561 -0.1598075299
-0.3285880206 0.1436641473 -0.0818718986
-0.3252437661 0.1411475931 -0.1631015044
-0.2483939168 0.1439110103 -0.0785779241
-0.3285880206 0.1436641473 -0.0818718986
-0.3235409185 -0.2193182815 -0.1518638943
-0.2433467693 -0.2191040183 -0.1485689080
-0.3268851730 -0.2168017274 -0.0706342885
-0.3235409185 -0.2193182815 -0.1518638943
-0.2466910237 -0.2165874642 -0.0673393022
-0.3268851730 -0.2168017274 -0.0706342885
-0.2433467693 -0.2191040183 -0.1485689080
-0.2466910237 -0.2165874642 -0.0673393022
-0.3236440632 -0.1454598487 -0.1541563305
-0.3269883177 -0.1429432946 -0.0729267247
-0.2434499139 -0.1452455855 -0.1508613442
-0.3236440632 -0.1454598487 -0.1541563305
-0.2467941684 -0.1427290314 -0.0696317384
-0.2434499139 -0.1452455855 -0.1508613442
-0.3269883177 -0.1429432946 -0.0729267247
-0.2467941684 -0.1427290314 -0.0696317384
0.3644914181 0.2064404043 -0.1367276587
0.2842973144 0.2061935413 -0.1400216332
0.3611471637 0.2089569584 -0.0554980529
0.3644914181 0.2064404043 -0.1367276587
0.2809530599 0.2087100954 -0.0587920274
0.3611471637 0.2089569584 -0.0554980529
0.2842973144 0.2061935413 -0.1400216332
0.2809530599 0.2087100954 -0.0587920274
0.3646073869 0.1422178078 -0.1347332200
0.3612631324 0.1447343620 -0.0535036142
0.2844132831 0.1419709448 -0.1380271945
0.3646073869 0.1422178078 -0.1347332200
0.2810690286 0.1444874989 -0.0567975887
0.2844132831 0.1419709448 -0.1380271945
0.3612631324 0.1447343620 -0.0535036142
0.2810690286 0.1444874989 -0.0567975887
-0.4595164936 0.2032172390 -0.0844308764
-0.4025177186 0.2059099568 -0.0821676370
-0.4355482557 0.1792226734 -0.1410785948
-0.4595164936 0.2032172390 -0.0844308764
-0.3455189435 0.2086026746 -0.0799043977
-0.3170195560 0.2099490334 -0.0787727780
-0.4070488682 0.1805690323 -0.1399469751
-0.4025177186 0.2059099568 -0.0821676370
0.0067840096 0.1984340636 -0.1088683191
-0.0231520440 0.1966752675 -0.1173435430
0.1289415280 0.1920451936 -0.1328300494
0.0079906615 0.1917220364 -0.1377996320
-0.1129602050 0.1913988791 -0.1427692146
-0.2339110716 0.1910757219 -0.1477387972
-0.1129602050 0.1913988791 -0.1427692146
-0.0830241514 0.1931576752 -0.1342939907
0.0965921706 0.2037104519 -0.0834426475
0.1289415280 0.1920451936 -0.1328300494
0.0361167374 0.2035488733 -0.0859274388
0.0055773578 0.2051460908 -0.0799370062
0.1564642780 0.2072280441 -0.0664921997
0.1588775817 0.1938039897 -0.1243548255
0.0965921706 0.2037104519 -0.0834426475
0.1564642780 0.2072280441 -0.0664921997
0.4133391850 0.1772105186 -0.1108670206
0.3768510312 0.1802518239 -0.1124634740
0.2629965947 0.1827681482 -0.1416180078
0.3060697115 0.1896382301 -0.1034737941
0.4520223264 0.1774730091 -0.0970879805
0.3834359944 0.1901632110 -0.0759157137
0.4608022772 0.1906881920 -0.0483576334
0.4520223264 0.1774730091 -0.0970879805
-0.4191028272 0.1942254210 0.0557582222
-0.3444741125 0.1995691381 0.0371927917
-0.4287878973 0.1991842211 0.0285849835
-0.4806298598 0.2039505627 -0.0028921594
-0.1965456678 0.2061927500 0.0273614695
-0.2337313077 0.1949370395 0.0703448614
-0.1159296231 0.1952055253 0.0736947149
-0.1428016380 0.1988679335 0.0582502998
-0.2502896976 0.2135175664 -0.0035273608
-0.2606033226 0.1985994477 0.0549004462
-0.1965456678 0.2061927500 0.0273614695
-0.2502896976 0.2135175664 -0.0035273608
0.0018720615 0.1954740111 0.0770445685
-0.0249999534 0.1991364193 0.0616001533
0.1196737461 0.1957424969 0.0803944221
0.0070288740 0.2029330704 0.0478306650
-0.1056159981 0.2101236440 0.0152669079
-0.2182608702 0.2173142175 -0.0172968492
-0.1056159981 0.2101236440 0.0152669079
-0.0787439832 0.2064612358 0.0307113230
0.2918783151 0.1935285336 0.0239281300
0.2524556333 0.1893557371 0.0710972892
0.4002177232 0.1763137317 0.0491531700
0.3641045872 0.1820519990 0.0407448233
0.2196520430 0.2050050682 0.0071114367
0.2163424973 0.1950940044 0.0626889426
0.2918783151 0.1935285336 0.0239281300
0.2196520430 0.2050050682 0.0071114367
0.2993911922 -0.1819461467 -0.1142260382
0.2635084442 -0.1837500878 -0.1302419249
0.4094226487 -0.1684109588 -0.1247097980
0.3711566883 -0.1783382647 -0.0821942648
0.2252424838 -0.1936773937 -0.0877263917
0.2970079798 -0.1900695116 -0.0556946183
0.2228592714 -0.2018007585 -0.0291949718
0.2252424838 -0.1936773937 -0.0877263917
0.3755617506 -0.1825338541 -0.0574937795
0.4214462293 -0.1850594096 -0.0213426321
0.2643386879 -0.2001307245 -0.0177443097
0.3014130421 -0.1942651010 -0.0309941330
0.4585205835 -0.1791937861 -0.0345924554
0.4911898755 -0.1691325732 -0.0725427640
0.3755617506 -0.1825338541 -0.0574937795
0.4497104590 -0.1708026072 -0.0839934260
-0.1921473256 -0.2044424456 -0.1045769832
-0.2327766910 -0.1925507026 -0.1504015274
-0.1118258244 -0.1922275454 -0.1454319448
-0.1385996582 -0.1962991788 -0.1318136242
-0.2456949931 -0.2125857124 -0.0773403421
-0.2595505247 -0.1966223360 -0.1367832068
-0.1921473256 -0.2044424456 -0.1045769832
-0.2456949931 -0.2125857124 -0.0773403421
0.0091250421 -0.1919043881 -0.1404623622
-0.0176487916 -0.1959760215 -0.1268440416
0.1300759086 -0.1915812309 -0.1354927796
0.0160528079 -0.1998860763 -0.1107409298
-0.0979702928 -0.2081909218 -0.0859890800
-0.2119933936 -0.2164957672 -0.0612372303
-0.0979702928 -0.2081909218 -0.0859890800
-0.0711964591 -0.2041192884 -0.0996074006
-0.3017022895 -0.2147646024 -0.0649842132
-0.3601692149 -0.2109791155 -0.0675085965
-0.3155578211 -0.1988012260 -0.1244270779
-0.3017022895 -0.2147646024 -0.0649842132
-0.4186361403 -0.2071936287 -0.0700329798
-0.4478696030 -0.2053008852 -0.0712951714
-0.3447912838 -0.1969084826 -0.1256892696
-0.3601692149 -0.2109791155 -0.0675085965
0.3027806640 -0.1934538069 -0.0049167124
0.2643386879 -0.2001307245 -0.0177443097
0.4214462293 -0.1850594096 -0.0213426321
0.3796646161 -0.1800999717 0.0207384823
0.2225570747 -0.1951712867 0.0243368048
0.2994410269 -0.1818174515 0.0499919994
0.2192174376 -0.1835349313 0.0792455166
0.2225570747 -0.1951712867 0.0243368048
0.0865447291 0.1842411910 0.1096317533
0.0791875376 0.1613728222 0.1697813425
0.1454455714 0.1843754339 0.1113066801
0.0865447291 0.1842411910 0.1096317533
0.0276438868 0.1841069481 0.1079568265
-0.0312569554 0.1839727052 0.1062818997
0.0202866953 0.1612385793 0.1681064157
0.0276438868 0.1841069481 0.1079568265
-0.0901577977 0.1838384623 0.1046069729
-0.1490586400 0.1837042194 0.1029320461
-0.2337313077 0.1949370395 0.0703448614
-0.1656231485 0.1779535665 0.1175507117
-0.0809504808 0.1667207465 0.1501378965
-0.0901577977 0.1838384623 0.1046069729
0.0037221868 0.1554879264 0.1827250813
-0.0478214639 0.1782220523 0.1209005653
-0.1701155707 0.1605697735 0.1551254761
-0.1043648589 0.1608370550 0.1607784825
-0.0196921912 0.1496042349 0.1933656673
-0.0809504808 0.1667207465 0.1501378965
-0.2124519046 0.1661861835 0.1388318837
-0.1656231485 0.1779535665 0.1175507117
-0.2502958161 0.1891863865 0.0849635270
-0.2124519046 0.1661861835 0.1388318837
0.0138610902 -0.1426959818 0.1735578023
-0.0518896217 -0.1429632632 0.1679047959
-0.1508049472 -0.1292422211 0.1906979673
-0.0681826708 -0.1500910658 0.1508552038
0.0307326547 -0.1638121079 0.1280620323
0.0138610902 -0.1426959818 0.1735578023
0.1296479802 -0.1775331501 0.1052688609
0.0633187529 -0.1495565028 0.1621612165
0.1458082657 -0.0753377448 0.1193677214
0.1790392612 -0.1368598698 0.0923969093
0.1789064975 -0.0417922670 0.0894461778
0.1458082657 -0.0753377448 0.1193677214
0.1127100339 -0.1088832225 0.1492892650
0.0796118020 -0.1424287003 0.1792108087
0.1459410293 -0.1704053475 0.1223184530
0.1127100339 -0.1088832225 0.1492892650
0.1787737338 0.0532753357 0.0864954462
0.1456755020 0.0197298580 0.1164169898
0.1786409702 0.1483429384 0.0835447146
0.1456091202 0.0672636593 0.1149416240
0.1125772702 -0.0138156198 0.1463385335
0.0795454202 -0.0948948989 0.1777354429
0.1125772702 -0.0138156198 0.1463385335
0.1456755020 0.0197298580 0.1164169898
0.2526547788 0.0467543330 0.0755233866
0.2157806382 0.0024810330 0.0824847822
0.2896616831 -0.0040399697 0.0715127226
0.2526547788 0.0467543330 0.0755233866
0.2156478745 0.0975486357 0.0795340506
0.1786409702 0.1483429384 0.0835447146
0.1787737338 0.0532753357 0.0864954462
0.2156478745 0.0975486357 0.0795340506
0.2159134018 -0.0925865698 0.0854355138
0.1789064975 -0.0417922670 0.0894461778
0.1790392612 -0.1368598698 0.0923969093
0.2159134018 -0.0925865698 0.0854355138
0.2527875425 -0.0483132697 0.0784741182
0.2896616831 -0.0040399697 0.0715127226
0.2157806382 0.0024810330 0.0824847822
0.2527875425 -0.0483132697 0.0784741182
0.3634099644 0.0845066303 0.0575899314
0.3264030601 0.1353009330 0.0616005954
0.3265358238 0.0402333303 0.0645513270
0.3634099644 0.0845066303 0.0575899314
0.4002841051 0.1287799303 0.0506285358
0.4371582457 0.1730532303 0.0436671402
0.3632772008 0.1795742330 0.0546391998
0.4002841051 0.1287799303 0.0506285358
0.2525220151 0.1418219357 0.0725726550
0.2893961558 0.1860952357 0.0656112594
0.2155151108 0.1926162384 0.0765833190
0.2525220151 0.1418219357 0.0725726550
0.2895289195 0.0910276330 0.0685619910
0.3265358238 0.0402333303 0.0645513270
0.3264030601 0.1353009330 0.0616005954
0.2895289195 0.0910276330 0.0685619910
0.4866712547 -0.0836215560 -0.0997671375
0.4866144755 -0.0429638421 -0.1010290815
0.4820390755 0.0832048890 -0.1295153991
0.4887034481 0.0362537909 -0.0912027271
0.4889305651 -0.1263770646 -0.0861549507
0.4932220689 -0.0492572263 -0.0639783536
0.4977406896 -0.1347682435 -0.0367539801
0.4889305651 -0.1263770646 -0.0861549507
0.4951597659 0.1382837867 -0.0575141668
0.4952884112 0.0461651781 -0.0546549668
0.4907054678 0.1777354996 -0.0833089403
0.4863798151 0.1250686038 -0.1062445138
0.4954170566 -0.0459534306 -0.0517957668
0.4954813792 -0.0920127349 -0.0503661669
0.4864441377 0.0790092995 -0.1048149138
0.4952884112 0.0461651781 -0.0546549668
0.4999356773 -0.1314644478 -0.0245713933
0.4872765011 -0.1664963670 0.0125674349
0.4998070320 -0.0393458391 -0.0274305933
0.4872121784 -0.1204370627 0.0111378349
0.4996783866 0.0527727695 -0.0302897933
0.4932523145 0.1043457663 -0.0138647791
0.4807861063 -0.0688640659 0.0275628491
0.4870835331 -0.0283184541 0.0082786349
-0.1839232205 0.0445690713 0.1824725186
-0.1181725086 0.0448363528 0.1881255250
-0.1840203874 0.1141470446 0.1803129404
-0.1839232205 0.0445690713 0.1824725186
-0.1838260535 -0.0250089020 0.1846320968
-0.1837288866 -0.0945868752 0.1867916750
-0.1180753417 -0.0247416205 0.1902851032
-0.1838260535 -0.0250089020 0.1846320968
-0.0525189637 0.1146816075 0.1916189532
-0.0524217968 0.0451036343 0.1937785314
0.0132317482 0.1149488890 0.1972719596
-0.0525189637 0.1146816075 0.1916189532
-0.1182696755 0.1144143261 0.1859659468
-0.1840203874 0.1141470446 0.1803129404
-0.1181725086 0.0448363528 0.1881255250
-0.1182696755 0.1144143261 0.1859659468
0.0134260820 -0.0242070575 0.2015911160
-0.0523246298 -0.0244743390 0.1959381096
0.0135232490 -0.0937850308 0.2037506942
0.0134260820 -0.0242070575 0.2015911160
0.0133289151 0.0453709158 0.1994315378
0.0132317482 0.1149488890 0.1972719596
-0.0524217968 0.0451036343 0.1937785314
0.0133289151 0.0453709158 0.1994315378
-0.1179781748 -0.0943195937 0.1924446814
-0.1180753417 -0.0247416205 0.1902851032
-0.1837288866 -0.0945868752 0.1867916750
-0.1179781748 -0.0943195937 0.1924446814
-0.0522274629 -0.0940523122 0.1980976878
0.0135232490 -0.0937850308 0.2037506942
-0.0523246298 -0.0244743390 0.1959381096
-0.0522274629 -0.0940523122 0.1980976878
-0.2355391851 -0.0739210573 0.1567423577
-0.2355877685 -0.0391320706 0.1556625686
-0.2168471599 0.0792244172 0.1785662263
-0.2451281150 0.0234511386 0.1404314779
-0.2449337811 -0.1157048079 0.1447506343
-0.2639173071 -0.0601163626 0.1164480311
-0.2827064992 -0.1436838638 0.0924645843
-0.2449337811 -0.1157048079 0.1447506343
-0.3978252355 0.0517202462 0.0623362716
-0.4188372999 0.0040902156 0.0616596854
-0.4401148916 0.1465953904 0.0550816360
-0.4399821279 0.0515277877 0.0580323675
-0.4398493642 -0.0435398151 0.0609830991
-0.4397166006 -0.1386074178 0.0639338307
-0.4398493642 -0.0435398151 0.0609830991
-0.4188372999 0.0040902156 0.0616596854
-0.3768131711 0.0993502768 0.0630128579
-0.4401148916 0.1465953904 0.0550816360
-0.3768131711 0.0993502768 0.0630128579
-0.3556683431 0.0519127047 0.0666401758
-0.3347890424 0.1946103380 0.0643660305
-0.3136442143 0.1471727659 0.0679933483
-0.4191028272 0.1942254210 0.0557582222
-0.3558011068 0.1469803074 0.0636894442
-0.3555355794 -0.0431548980 0.0695909073
-0.3345235150 0.0044751326 0.0702674936
-0.3132459233 -0.1380300423 0.0768455430
-0.3133786870 -0.0429624395 0.0738948114
-0.3135114507 0.0521051632 0.0709440799
-0.3136442143 0.1471727659 0.0679933483
-0.3135114507 0.0521051632 0.0709440799
-0.3345235150 0.0044751326 0.0702674936
-0.3765476438 -0.0907849287 0.0689143211
-0.3132459233 -0.1380300423 0.0768455430
-0.3765476438 -0.0907849287 0.0689143211
-0.3976924718 -0.0433473566 0.0652870032
-0.4185717725 -0.1860449899 0.0675611485
-0.4397166006 -0.1386074178 0.0639338307
-0.3342579877 -0.1856600729 0.0761689567
-0.3975597082 -0.1384149593 0.0682377348
0.2500878532 -0.1668215192 -0.0625689794
0.2500878532 -0.1668215192 -0.0625689794
0.2835722011 -0.1654279454 -0.0191769557
0.2835722011 -0.1654279454 -0.0191769557
0.3371357354 -0.1649891425 -0.0074494755
0.3371357354 -0.1649891425 -0.0074494755
0.3857029480 -0.1657105204 -0.0328762642
0.3857029480 -0.1657105204 -0.0328762642
0.4065589150 -0.1672545826 -0.0835617301
0.4065589150 -0.1672545826 -0.0835617301
0.3899398256 -0.1688987741 -0.1357870619
0.3899398256 -0.1688987741 -0.1357870619
0.3436209916 -0.1698736691 -0.1651124919
0.3436209916 -0.1698736691 -0.1651124919
0.2892859176 -0.1697231553 -0.1578184660
0.2892859176 -0.1697231553 -0.1578184660
0.2523420027 -0.1685177685 -0.1173206978
0.2523420027 -0.1685177685 -0.1173206978
-0.2146825414 0.1803537267 -0.0924595070
-0.2146825414 0.1803537267 -0.0924595070
-0.2516206763 0.1815449486 -0.0519605353
-0.2516206763 0.1815449486 -0.0519605353
-0.3059672895 0.1816733526 -0.0446661415
-0.3059672895 0.1816733526 -0.0446661415
-0.3522808402 0.1806790170 -0.0739907516
-0.3522808402 0.1806790170 -0.0739907516
-0.3689004486 0.1790269402 -0.1262157552
-0.3689004486 0.1790269402 -0.1262157552
-0.3480439626 0.1774907633 -0.1769015493
-0.3480439626 0.1774907633 -0.1769015493
-0.2994704698 0.1767888569 -0.2023286827
-0.2994704698 0.1767888569 -0.2023286827
-0.2459185226 0.1772491820 -0.1906025043
-0.2459185226 0.1772491820 -0.1906025043
-0.2124283919 0.1786574774 -0.1472112254
-0.2124283919 0.1786574774 -0.1472112254
-0.3595537006 -0.1802461732 -0.0872522536
-0.3595537006 -0.1802461732 -0.0872522536
-0.3260693526 -0.1788525994 -0.0438602299
-0.3260693526 -0.1788525994 -0.0438602299
-0.2725058184 -0.1784137965 -0.0321327497
-0.2725058184 -0.1784137965 -0.0321327497
-0.2239380801 -0.1791351730 -0.0575595168
-0.2239380801 -0.1791351730 -0.0575595168
-0.2030815875 -0.1806792338 -0.1082449610
-0.2030815875 -0.1806792338 -0.1082449610
-0.2197012025 -0.1823234267 -0.1604703145
-0.2197012025 -0.1823234267 -0.1604703145
-0.2660205621 -0.1832983231 -0.1897957660
-0.2660205621 -0.1832983231 -0.1897957660
-0.3203556362 -0.1831478093 -0.1825017402
-0.3203556362 -0.1831478093 -0.1825017402
-0.3572995510 -0.1819424225 -0.1420039720
-0.3572995510 -0.1819424225 -0.1420039720
0.3949833136 0.1763770257 -0.0672361253
0.3949833136 0.1763770257 -0.0672361253
0.3580451794 0.1775677217 -0.0267371372
0.3580451794 0.1775677217 -0.0267371372
0.3036985663 0.1776961258 -0.0194427434
0.3036985663 0.1776961258 -0.0194427434
0.2573850156 0.1767017901 -0.0487673536
0.2573850156 0.1767017901 -0.0487673536
0.2407654065 0.1750502392 -0.1009923735
0.2407654065 0.1750502392 -0.1009923735
0.2616218925 0.1735140622 -0.1516781676
0.2616218925 0.1735140622 -0.1516781676
0.3101953860 0.1728116301 -0.1771052847
0.3101953860 0.1728116301 -0.1771052847
0.3637473324 0.1732724809 -0.1653791226
0.3637473324 0.1732724809 -0.1653791226
0.3972374639 0.1746802506 -0.1219878274
0.3972374639 0.1746802506 -0.1219878274
3 408 598 243
3 108 598 408
3 408 599 9
3 243 599 408
3 409 600 243
3 22 600 409
3 409 601 108
3 243 601 409
3 410 786 244
3 76 786 410
3 410 787 132
3 244 787 410
3 411 788 244
3 9 788 411
3 411 789 76
3 244 789 411
3 132 790 412
3 245 790 132
3 412 791 22
3 245 791 412
3 413 792 245
3 9 792 413
3 245 793 413
3 132 793 245
3 414 794 133
3 246 794 414
3 134 795 133
3 414 795 134
3 415 796 246
3 109 796 415
3 415 797 134
3 246 797 415
3 416 798 247
3 134 798 416
3 416 799 108
3 247 799 416
3 417 800 134
3 247 800 417
3 133 801 134
3 417 801 133
3 248 802 135
3 418 802 248
3 418 803 109
3 248 803 418
3 248 804 419
3 135 804 248
3 419 805 133
3 135 805 419
3 420 806 249
3 77 806 420
3 420 807 109
3 249 807 420
3 421 808 249
3 135 808 421
3 421 809 77
3 249 809 421
3 250 422 136
3 22 422 250
3 137 423 136
3 250 423 137
3 251 424 137
3 77 424 251
3 137 425 251
3 136 425 137
3 252 426 138
3 22 426 252
3 252 427 136
3 138 427 252
3 253 428 108
3 22 428 253
3 253 429 138
3 108 429 253
3 430 810 139
3 60 810 430
3 254 811 139
3 430 811 254
3 431 812 254
3 109 812 431
3 254 813 431
3 139 813 254
3 432 814 255
3 60 814 432
3 432 815 139
3 255 815 432
3 433 816 255
3 0 816 433
3 433 817 60
3 255 817 433
3 256 602 140
3 434 602 256
3 434 603 77
3 256 603 434
3 435 604 256
3 0 604 435
3 140 605 256
3 435 605 140
3 436 606 257
3 109 606 436
3 436 607 77
3 257 607 436
3 437 608 257
3 140 608 437
3 437 609 109
3 257 609 437
3 258 438 141
3 22 438 258
3 258 439 76
3 141 439 258
3 259 440 111
3 22 440 259
3 259 441 141
3 111 441 259
3 260 818 112
3 442 818 260
3 442 819 111
3 260 819 442
3 443 820 112
3 260 820 443
3 443 821 76
3 112 821 443
3 143 610 142
3 261 610 143
3 261 611 77
3 143 611 261
3 262 612 143
3 22 612 262
3 142 613 143
3 262 613 142
3 263 614 77
3 144 614 263
3 263 615 110
3 77 615 263
3 264 616 144
3 142 616 264
3 264 617 110
3 144 617 264
3 265 822 146
3 444 822 265
3 444 823 111
3 265 823 444
3 445 824 265
3 145 824 445
3 146 825 265
3 445 825 146
3 446 826 266
3 22 826 446
3 446 827 111
3 266 827 446
3 447 828 266
3 146 828 447
3 447 829 22
3 266 829 447
3 448 830 145
3 267 830 448
3 147 831 145
3 448 831 147
3 449 832 267
3 110 832 449
3 449 833 147
3 267 833 449
3 450 834 268
3 147 834 450
3 450 835 22
3 268 835 450
3 451 836 147
3 268 836 451
3 145 837 147
3 451 837 145
3 0 618 269
3 61 618 0
3 269 619 148
3 61 619 269
3 270 620 148
3 77 620 270
3 270 621 61
3 148 621 270
3 271 838 149
3 452 838 271
3 452 839 110
3 271 839 452
3 453 840 271
3 61 840 453
3 149 841 271
3 453 841 149
3 454 842 272
3 77 842 454
3 454 843 110
3 272 843 454
3 455 844 272
3 149 844 455
3 455 845 77
3 272 845 455
3 150 846 456
3 273 846 150
3 456 847 28
3 273 847 456
3 457 848 273
3 23 848 457
3 273 849 457
3 150 849 273
3 458 850 274
3 28 850 458
3 458 851 150
3 274 851 458
3 459 852 274
3 26 852 459
3 459 853 28
3 274 853 459
3 275 854 151
3 460 854 275
3 460 855 16
3 275 855 460
3 461 856 275
3 26 856 461
3 151 857 275
3 461 857 151
3 462 858 16
3 276 858 462
3 462 859 23
3 16 859 462
3 463 860 276
3 151 860 463
3 463 861 23
3 276 861 463
3 277 862 153
3 464 862 277
3 464 863 27
3 277 863 464
3 465 864 277
3 152 864 465
3 153 865 277
3 465 865 153
3 466 866 278
3 78 866 466
3 466 867 27
3 278 867 466
3 467 868 278
3 153 868 467
3 467 869 78
3 278 869 467
3 468 870 152
3 279 870 468
3 154 871 152
3 468 871 154
3 469 872 279
3 28 872 469
3 469 873 154
3 279 873 469
3 470 874 280
3 154 874 470
3 470 875 78
3 280 875 470
3 471 876 154
3 280 876 471
3 152 877 154
3 471 877 152
3 155 622 281
3 156 622 155
3 281 623 26
3 156 623 281
3 282 624 156
3 78 624 282
3 156 625 282
3 155 625 156
3 283 626 157
3 26 626 283
3 283 627 155
3 157 627 283
3 284 628 28
3 26 628 284
3 284 629 157
3 28 629 284
3 472 630 285
3 3 630 472
3 472 631 27
3 285 631 472
3 473 632 285
3 25 632 473
3 473 633 3
3 285 633 473
3 474 878 286
3 78 878 474
3 474 879 158
3 286 879 474
3 475 880 286
3 27 880 475
3 475 881 78
3 286 881 475
3 158 882 476
3 287 882 158
3 476 883 25
3 287 883 476
3 477 884 287
3 27 884 477
3 287 885 477
3 158 885 287
3 159 886 478
3 288 886 159
3 478 887 26
3 288 887 478
3 479 888 288
3 16 888 479
3 288 889 479
3 159 889 288
3 480 890 289
3 26 890 480
3 480 891 159
3 289 891 480
3 481 892 289
3 29 892 481
3 481 893 26
3 289 893 481
3 160 634 24
3 482 634 160
3 482 635 29
3 160 635 482
3 483 636 24
3 160 636 483
3 24 637 483
3 16 637 24
3 290 484 161
3 78 484 290
3 162 485 161
3 290 485 162
3 291 486 162
3 26 486 291
3 162 487 291
3 161 487 162
3 292 488 163
3 78 488 292
3 292 489 161
3 163 489 292
3 293 490 30
3 78 490 293
3 293 491 163
3 30 491 293
3 164 638 294
3 165 638 164
3 294 639 29
3 165 639 294
3 295 640 165
3 30 640 295
3 165 641 295
3 164 641 165
3 296 642 166
3 29 642 296
3 296 643 164
3 166 643 296
3 297 644 26
3 29 644 297
3 297 645 166
3 26 645 297
3 298 646 25
3 167 646 298
3 298 647 31
3 25 647 298
3 299 648 167
3 78 648 299
3 299 649 31
3 167 649 299
3 492 650 168
3 30 650 492
3 492 651 31
3 168 651 492
3 493 652 168
3 78 652 493
3 493 653 30
3 168 653 493
3 494 894 300
3 170 894 494
3 494 895 2
3 300 895 494
3 495 896 300
3 110 896 495
3 495 897 170
3 300 897 495
3 496 898 301
3 170 898 496
3 496 899 169
3 301 899 496
3 497 900 301
3 2 900 497
3 497 901 170
3 301 901 497
3 498 902 171
3 169 902 498
3 498 903 302
3 171 903 498
3 499 904 302
3 111 904 499
3 302 905 499
3 171 905 302
3 500 906 171
3 303 906 500
3 500 907 169
3 171 907 500
3 501 908 303
3 2 908 501
3 501 909 169
3 303 909 501
3 502 910 172
3 1 910 502
3 502 911 304
3 172 911 502
3 503 912 304
3 2 912 503
3 304 913 503
3 172 913 304
3 504 914 305
3 1 914 504
3 504 915 172
3 305 915 504
3 505 916 305
3 111 916 505
3 505 917 1
3 305 917 505
3 306 506 174
3 66 506 306
3 306 507 30
3 174 507 306
3 307 508 174
3 173 508 307
3 307 509 66
3 174 509 307
3 175 510 173
3 308 510 175
3 308 511 29
3 175 511 308
3 175 512 309
3 173 512 175
3 309 513 66
3 173 513 309
3 514 918 176
3 67 918 514
3 514 919 310
3 176 919 514
3 515 920 310
3 66 920 515
3 310 921 515
3 176 921 310
3 516 922 176
3 311 922 516
3 516 923 67
3 176 923 516
3 517 924 311
3 29 924 517
3 517 925 67
3 311 925 517
3 518 926 312
3 178 926 518
3 518 927 29
3 312 927 518
3 519 928 312
3 177 928 519
3 519 929 178
3 312 929 519
3 520 930 313
3 178 930 520
3 520 931 67
3 313 931 520
3 521 932 313
3 29 932 521
3 521 933 178
3 313 933 521
3 522 934 177
3 314 934 522
3 522 935 179
3 177 935 522
3 523 936 314
3 110 936 523
3 523 937 179
3 314 937 523
3 524 938 315
3 179 938 524
3 524 939 67
3 315 939 524
3 525 940 179
3 315 940 525
3 525 941 177
3 179 941 525
3 180 654 316
3 181 654 180
3 316 655 2
3 181 655 316
3 317 656 181
3 67 656 317
3 181 657 317
3 180 657 181
3 318 658 182
3 2 658 318
3 318 659 180
3 182 659 318
3 319 660 182
3 110 660 319
3 319 661 2
3 182 661 319
3 526 942 320
3 185 942 526
3 526 943 184
3 320 943 526
3 527 944 320
3 183 944 527
3 527 945 185
3 320 945 527
3 528 946 321
3 185 946 528
3 528 947 110
3 321 947 528
3 529 948 321
3 184 948 529
3 529 949 185
3 321 949 529
3 530 950 322
3 186 950 530
3 530 951 184
3 322 951 530
3 531 952 322
3 29 952 531
3 531 953 186
3 322 953 531
3 532 954 323
3 186 954 532
3 532 955 183
3 323 955 532
3 533 956 323
3 184 956 533
3 533 957 186
3 323 957 533
3 534 958 324
3 188 958 534
3 534 959 187
3 324 959 534
3 535 960 324
3 183 960 535
3 535 961 188
3 324 961 535
3 536 962 325
3 188 962 536
3 536 963 61
3 325 963 536
3 537 964 325
3 187 964 537
3 537 965 188
3 325 965 537
3 538 966 326
3 189 966 538
3 538 967 187
3 326 967 538
3 539 968 326
3 110 968 539
3 539 969 189
3 326 969 539
3 540 970 327
3 189 970 540
3 540 971 183
3 327 971 540
3 541 972 327
3 187 972 541
3 541 973 189
3 327 973 541
3 328 662 192
3 191 662 328
3 328 663 190
3 192 663 328
3 329 664 192
3 24 664 329
3 329 665 191
3 192 665 329
3 330 666 193
3 191 666 330
3 330 667 61
3 193 667 330
3 331 668 193
3 190 668 331
3 331 669 191
3 193 669 331
3 332 670 195
3 194 670 332
3 332 671 190
3 195 671 332
3 333 672 195
3 29 672 333
3 333 673 194
3 195 673 333
3 334 674 196
3 194 674 334
3 334 675 24
3 196 675 334
3 335 676 196
3 190 676 335
3 335 677 194
3 196 677 335
3 542 974 197
3 23 974 542
3 336 975 197
3 542 975 336
3 543 976 336
3 60 976 543
3 336 977 543
3 197 977 336
3 544 978 337
3 23 978 544
3 544 979 197
3 337 979 544
3 545 980 337
3 16 980 545
3 545 981 23
3 337 981 545
3 546 982 338
3 0 982 546
3 546 983 198
3 338 983 546
3 547 984 60
3 0 984 547
3 547 985 338
3 60 985 547
3 198 986 548
3 339 986 198
3 548 987 16
3 339 987 548
3 549 988 339
3 60 988 549
3 339 989 549
3 198 989 339
3 550 990 16
3 340 990 550
3 550 991 24
3 16 991 550
3 551 992 340
3 199 992 551
3 551 993 24
3 340 993 551
3 341 994 199
3 552 994 341
3 552 995 0
3 341 995 552
3 553 996 341
3 24 996 553
3 199 997 341
3 553 997 199
3 200 678 61
3 342 678 200
3 342 679 24
3 200 679 342
3 343 680 61
3 200 680 343
3 61 681 343
3 0 681 61
3 554 998 344
3 202 998 554
3 554 999 201
3 344 999 554
3 555 1000 344
3 1 1000 555
3 555 1001 202
3 344 1001 555
3 556 1002 345
3 202 1002 556
3 556 1003 66
3 345 1003 556
3 557 1004 345
3 201 1004 557
3 557 1005 202
3 345 1005 557
3 558 1006 346
3 203 1006 558
3 558 1007 201
3 346 1007 558
3 559 1008 346
3 2 1008 559
3 559 1009 203
3 346 1009 559
3 560 1010 347
3 203 1010 560
3 560 1011 1
3 347 1011 560
3 561 1012 347
3 201 1012 561
3 561 1013 203
3 347 1013 561
3 562 1014 348
3 205 1014 562
3 562 1015 204
3 348 1015 562
3 563 1016 348
3 67 1016 563
3 563 1017 205
3 348 1017 563
3 564 1018 349
3 205 1018 564
3 564 1019 2
3 349 1019 564
3 565 1020 349
3 204 1020 565
3 565 1021 205
3 349 1021 565
3 566 1022 350
3 206 1022 566
3 566 1023 204
3 350 1023 566
3 567 1024 350
3 66 1024 567
3 567 1025 206
3 350 1025 567
3 568 1026 351
3 206 1026 568
3 568 1027 67
3 351 1027 568
3 569 1028 351
3 204 1028 569
3 569 1029 206
3 351 1029 569
3 352 682 208
3 111 682 352
3 352 683 207
3 208 683 352
3 353 684 208
3 1 684 353
3 353 685 111
3 208 685 353
3 207 686 354
3 209 686 207
3 354 687 30
3 209 687 354
3 355 688 209
3 1 688 355
3 209 689 355
3 207 689 209
3 570 1030 210
3 66 1030 570
3 356 1031 210
3 570 1031 356
3 571 1032 356
3 1 1032 571
3 356 1033 571
3 210 1033 356
3 572 1034 357
3 66 1034 572
3 572 1035 210
3 357 1035 572
3 573 1036 357
3 30 1036 573
3 573 1037 66
3 357 1037 573
3 574 1038 211
3 358 1038 574
3 574 1039 212
3 211 1039 574
3 575 1040 358
3 112 1040 575
3 575 1041 212
3 358 1041 575
3 576 1042 359
3 212 1042 576
3 576 1043 31
3 359 1043 576
3 577 1044 212
3 359 1044 577
3 577 1045 211
3 212 1045 577
3 578 1046 360
3 213 1046 578
3 578 1047 112
3 360 1047 578
3 579 1048 213
3 360 1048 579
3 579 1049 211
3 213 1049 579
3 580 1050 111
3 361 1050 580
3 580 1051 213
3 111 1051 580
3 581 1052 361
3 112 1052 581
3 581 1053 213
3 361 1053 581
3 582 1054 214
3 362 1054 582
3 582 1055 215
3 214 1055 582
3 583 1056 362
3 30 1056 583
3 583 1057 215
3 362 1057 583
3 584 1058 363
3 215 1058 584
3 584 1059 111
3 363 1059 584
3 585 1060 215
3 363 1060 585
3 585 1061 214
3 215 1061 585
3 586 1062 364
3 216 1062 586
3 586 1063 30
3 364 1063 586
3 587 1064 216
3 364 1064 587
3 587 1065 214
3 216 1065 587
3 588 1066 31
3 365 1066 588
3 588 1067 216
3 31 1067 588
3 589 1068 365
3 30 1068 589
3 589 1069 216
3 365 1069 589
3 590 690 217
3 9 690 590
3 366 691 217
3 590 691 366
3 591 692 366
3 3 692 591
3 366 693 591
3 217 693 366
3 592 694 367
3 9 694 592
3 592 695 217
3 367 695 592
3 593 696 367
3 76 696 593
3 593 697 9
3 367 697 593
3 368 698 25
3 219 698 368
3 368 699 3
3 25 699 368
3 369 700 219
3 218 700 369
3 369 701 3
3 219 701 369
3 220 702 218
3 370 702 220
3 370 703 76
3 220 703 370
3 371 704 220
3 3 704 371
3 218 705 220
3 371 705 218
3 372 706 222
3 76 706 372
3 372 707 221
3 222 707 372
3 373 708 112
3 76 708 373
3 373 709 222
3 112 709 373
3 221 710 374
3 223 710 221
3 374 711 25
3 223 711 374
3 375 712 223
3 112 712 375
3 223 713 375
3 221 713 223
3 594 714 224
3 31 714 594
3 225 715 224
3 594 715 225
3 595 716 225
3 112 716 595
3 225 717 595
3 224 717 225
3 596 718 226
3 31 718 596
3 596 719 224
3 226 719 596
3 597 720 25
3 31 720 597
3 597 721 226
3 25 721 597
3 50 1070 51
3 39 1070 50
3 40 1071 39
3 51 1071 40
3 51 1072 47
3 40 1072 51
3 38 1073 40
3 47 1073 38
3 47 1074 54
3 38 1074 47
3 43 1075 38
3 54 1075 43
3 54 1076 59
3 43 1076 54
3 46 1077 43
3 59 1077 46
3 59 1078 55
3 46 1078 59
3 44 1079 46
3 55 1079 44
3 55 1080 58
3 44 1080 55
3 45 1081 44
3 58 1081 45
3 58 1082 53
3 45 1082 58
3 42 1083 45
3 53 1083 42
3 53 1084 52
3 42 1084 53
3 41 1085 42
3 52 1085 41
3 52 1086 50
3 41 1086 52
3 39 1087 41
3 50 1087 39
3 376 722 227
3 56 722 376
3 376 723 57
3 227 723 376
3 377 724 227
3 48 724 377
3 377 725 56
3 227 725 377
3 378 726 228
3 49 726 378
3 378 727 48
3 228 727 378
3 379 728 228
3 57 728 379
3 379 729 49
3 228 729 379
3 380 730 229
3 36 730 380
3 380 731 34
3 229 731 380
3 381 732 229
3 37 732 381
3 381 733 36
3 229 733 381
3 382 734 230
3 35 734 382
3 382 735 37
3 230 735 382
3 383 736 230
3 34 736 383
3 383 737 35
3 230 737 383
3 85 1088 72
3 6 1088 85
3 126 1089 6
3 72 1089 126
3 72 1090 14
3 126 1090 72
3 10 1091 126
3 14 1091 10
3 14 1092 68
3 10 1092 14
3 64 1093 10
3 68 1093 64
3 68 1094 84
3 64 1094 68
3 82 1095 64
3 84 1095 82
3 84 1096 83
3 82 1096 84
3 81 1097 82
3 83 1097 81
3 83 1098 69
3 81 1098 83
3 65 1099 81
3 69 1099 65
3 69 1100 15
3 65 1100 69
3 11 1101 65
3 15 1101 11
3 15 1102 73
3 11 1102 15
3 127 1103 11
3 73 1103 127
3 73 1104 85
3 127 1104 73
3 6 1105 127
3 85 1105 6
3 384 738 231
3 33 738 384
3 384 739 8
3 231 739 384
3 385 740 231
3 32 740 385
3 385 741 33
3 231 741 385
3 386 742 232
3 7 742 386
3 386 743 32
3 232 743 386
3 387 744 232
3 8 744 387
3 387 745 7
3 232 745 387
3 388 746 233
3 13 746 388
3 388 747 12
3 233 747 388
3 389 748 233
3 131 748 389
3 389 749 13
3 233 749 389
3 390 750 234
3 130 750 390
3 390 751 131
3 234 751 390
3 391 752 234
3 12 752 391
3 391 753 130
3 234 753 391
3 96 1106 97
3 114 1106 96
3 115 1107 114
3 97 1107 115
3 97 1108 93
3 115 1108 97
3 113 1109 115
3 93 1109 113
3 93 1110 100
3 113 1110 93
3 118 1111 113
3 100 1111 118
3 100 1112 105
3 118 1112 100
3 121 1113 118
3 105 1113 121
3 105 1114 101
3 121 1114 105
3 119 1115 121
3 101 1115 119
3 101 1116 104
3 119 1116 101
3 120 1117 119
3 104 1117 120
3 104 1118 99
3 120 1118 104
3 117 1119 120
3 99 1119 117
3 99 1120 98
3 117 1120 99
3 116 1121 117
3 98 1121 116
3 98 1122 96
3 116 1122 98
3 114 1123 116
3 96 1123 114
3 392 754 235
3 102 754 392
3 392 755 103
3 235 755 392
3 393 756 235
3 94 756 393
3 393 757 102
3 235 757 393
3 394 758 236
3 95 758 394
3 394 759 94
3 236 759 394
3 395 760 236
3 103 760 395
3 395 761 95
3 236 761 395
3 396 762 237
3 124 762 396
3 396 763 122
3 237 763 396
3 397 764 237
3 125 764 397
3 397 765 124
3 237 765 397
3 398 766 238
3 123 766 398
3 398 767 125
3 238 767 398
3 399 768 238
3 122 768 399
3 399 769 123
3 238 769 399
3 19 1124 62
3 90 1124 19
3 74 1125 90
3 62 1125 74
3 62 1126 79
3 74 1126 62
3 91 1127 74
3 79 1127 91
3 79 1128 4
3 91 1128 79
3 20 1129 91
3 4 1129 20
3 4 1130 18
3 20 1130 4
3 89 1131 20
3 18 1131 89
3 18 1132 17
3 89 1132 18
3 88 1133 89
3 17 1133 88
3 17 1134 5
3 88 1134 17
3 21 1135 88
3 5 1135 21
3 5 1136 80
3 21 1136 5
3 92 1137 21
3 80 1137 92
3 80 1138 63
3 92 1138 80
3 75 1139 92
3 63 1139 75
3 63 1140 19
3 75 1140 63
3 90 1141 75
3 19 1141 90
3 400 770 239
3 107 770 400
3 400 771 71
3 239 771 400
3 401 772 239
3 106 772 401
3 401 773 107
3 239 773 401
3 402 774 240
3 70 774 402
3 402 775 106
3 240 775 402
3 403 776 240
3 71 776 403
3 403 777 70
3 240 777 403
3 404 778 241
3 129 778 404
3 404 779 128
3 241 779 404
3 405 780 241
3 87 780 405
3 405 781 129
3 241 781 405
3 406 782 242
3 86 782 406
3 406 783 87
3 242 783 406
3 407 784 242
3 128 784 407
3 407 785 86
3 242 785 407