OFF

658 1312 0
-0.055625 -0.066517 -0.427908
0.081813 -0.036770 -0.313549
-0.301967 0.220619 -0.363223
-0.199426 0.147079 -0.392267
0.062500 -0.000000 -0.314368
0.120635 -0.245001 -0.370341
0.266875 -0.147079 -0.355789
0.322696 0.280111 -0.303331
-0.322696 -0.280111 -0.330709
-0.160092 -0.073539 -0.407295
0.413627 -0.073540 -0.299473
-0.005768 0.148736 -0.409096
0.353946 0.257386 -0.302005
0.002829 0.237978 -0.383687
0.142582 -0.192529 -0.377758
-0.260196 -0.325561 -0.328058
0.164529 -0.140057 -0.385175
-0.412920 -0.073538 -0.351233
-0.306173 -0.110308 -0.371750
-0.226127 -0.073539 -0.326613
-0.120440 0.133034 -0.322129
-0.197696 -0.371011 -0.325406
-0.369380 0.110310 -0.357735
0.019313 -0.297473 -0.316200
-0.199427 -0.147078 -0.392267
0.135194 -0.416462 -0.311285
0.028969 -0.446209 -0.315791
0.247916 0.110308 -0.364941
-0.136927 -0.192528 -0.389615
-0.077256 -0.475956 -0.320297
-0.135196 -0.416461 -0.322755
-0.452255 -0.147077 -0.336205
-0.345508 -0.183847 -0.356722
-0.074427 -0.237978 -0.386964
-0.240881 0.266068 -0.327239
0.151690 -0.110309 -0.310585
0.385196 0.257386 -0.300679
0.157850 0.363989 -0.335369
0.288627 0.073538 -0.304776
-0.196987 0.371012 -0.342073
0.219287 -0.318540 -0.307717
-0.365174 0.220619 -0.349208
0.220350 0.318539 -0.332717
0.395374 0.036768 -0.325292
-0.028618 -0.446209 -0.326582
-0.384842 -0.257386 -0.341694
-0.054405 0.178484 -0.402811
-0.351127 0.073540 -0.331915
-0.025789 -0.208231 -0.393249
-0.037212 0.356967 -0.351992
0.282849 0.273089 -0.330066
0.079534 0.126011 -0.313646
0.476127 -0.073541 -0.296822
0.020019 -0.416462 -0.332867
-0.156787 0.363990 -0.323671
0.098847 -0.185506 -0.312826
0.182940 -0.110309 -0.309259
-0.180662 -0.199550 -0.324684
0.022848 -0.178484 -0.399534
0.303381 -0.220619 -0.304150
0.083423 0.126011 -0.405313
-0.163627 -0.073539 -0.323961
-0.266839 0.036770 -0.386778
0.069366 0.327220 -0.355819
-0.118162 -0.245000 -0.322032
0.068657 -0.386715 -0.339152
0.333581 -0.036771 -0.344610
0.390462 0.147077 -0.317153
-0.389755 -0.147077 -0.333554
-0.260708 -0.213595 -0.369821
0.347628 -0.183849 -0.327318
0.117294 -0.356967 -0.345437
-0.262633 0.147079 -0.378251
0.139241 -0.304495 -0.352855
0.191035 -0.000001 -0.392399
0.351127 0.073538 -0.302124
-0.094446 0.297473 -0.371117
0.161188 -0.252023 -0.360272
-0.198208 -0.259045 -0.367170
-0.280727 0.273091 -0.353974
-0.409067 0.183849 -0.334373
-0.077253 0.475956 -0.320297
0.183135 -0.199551 -0.367689
-0.005061 0.089242 -0.425763
0.096569 0.297472 -0.312923
-0.288627 0.073540 -0.329264
-0.135708 -0.304495 -0.364518
0.205082 -0.147079 -0.375107
0.038628 0.356967 -0.315381
-0.262474 0.213596 -0.328155
0.125000 -0.000000 -0.311717
-0.067596 0.327220 -0.319887
0.385549 0.257386 -0.309013
0.245440 -0.110310 -0.306608
-0.057940 0.178484 -0.319478
0.159068 0.252022 -0.310272
0.029325 0.446209 -0.324124
0.365881 -0.220619 -0.301498
0.197694 -0.371012 -0.308633
0.221568 0.206572 -0.307621
-0.101127 -0.073539 -0.321310
0.186123 0.110308 -0.384259
0.252818 0.183847 -0.306295
-0.038627 -0.118989 -0.318658
0.135903 0.416461 -0.327951
0.019313 -0.178484 -0.316200
-0.178380 0.311518 -0.324587
-0.327255 -0.147078 -0.330903
0.077254 -0.237978 -0.313743
-0.028971 -0.267725 -0.318249
0.086910 -0.386715 -0.313333
0.198403 0.371011 -0.325300
-0.134487 0.416462 -0.339422
-0.456814 -0.036768 -0.336399
0.281787 -0.273091 -0.305066
-0.019315 -0.416462 -0.317839
-0.160092 0.073540 -0.407295
0.333581 0.036769 -0.344610
0.413627 0.073538 -0.299473
-0.353239 -0.257386 -0.348701
0.260903 0.325561 -0.322649
-0.178186 0.199551 -0.383017
-0.346567 0.183849 -0.331722
-0.125539 -0.446208 -0.322345
0.284068 0.183847 -0.304969
-0.412920 0.073540 -0.351233
0.161347 -0.140057 -0.310175
-0.321989 -0.280111 -0.347376
-0.226127 0.073540 -0.326613
0.187500 -0.000001 -0.309066
0.414334 -0.073540 -0.316140
0.323403 0.280111 -0.319997
0.176103 0.423483 -0.309549
0.354653 0.257386 -0.318672
-0.259489 -0.325561 -0.344724
0.061476 0.178483 -0.397895
0.307940 -0.110310 -0.303956
0.238603 0.378033 -0.306898
0.428381 -0.220619 -0.298847
-0.196989 -0.371011 -0.342073
0.123976 0.133033 -0.395244
-0.408714 0.183849 -0.342707
0.135901 -0.416462 -0.327951
0.301103 0.332584 -0.304247
0.328669 0.147078 -0.336471
0.271788 -0.036770 -0.363929
0.155226 0.110308 -0.393918
0.157848 -0.363990 -0.335369
-0.281789 -0.273089 -0.328974
0.179794 -0.311518 -0.342786
-0.134489 -0.416461 -0.339422
-0.264755 -0.147078 -0.328251
0.363602 0.287134 -0.301595
0.201741 -0.259046 -0.350203
0.285835 -0.183849 -0.346636
-0.079534 0.126012 -0.320394
0.176100 -0.423484 -0.309549
-0.218227 0.318540 -0.351323
0.223688 -0.206574 -0.357621
-0.394314 -0.036768 -0.333747
-0.219289 -0.318539 -0.326322
-0.028971 -0.208231 -0.318249
-0.085852 -0.386714 -0.345707
0.476127 0.073538 -0.296822
-0.075645 0.126012 -0.412061
-0.404508 0.294158 -0.334180
-0.284067 0.183849 -0.329071
-0.156789 -0.363989 -0.323671
-0.203632 -0.036769 -0.400793
-0.310379 0.000001 -0.380277
0.346568 0.183847 -0.302318
-0.199974 0.259046 -0.325503
-0.163627 0.073540 -0.323961
-0.456813 0.036771 -0.336399
0.260194 -0.325563 -0.305982
-0.037214 -0.356967 -0.351992
0.250000 -0.000001 -0.306414
0.021436 0.297473 -0.366201
0.370440 -0.110310 -0.301305
0.096569 0.416461 -0.312923
-0.349713 -0.073538 -0.365249
-0.456460 -0.036768 -0.344732
-0.034385 -0.118989 -0.418659
-0.242966 -0.110308 -0.385765
-0.009656 0.386714 -0.317430
-0.115880 0.356967 -0.321936
0.011423 -0.327220 -0.358277
-0.306173 0.110310 -0.371750
0.000001 0.237978 -0.317020
-0.252817 0.183849 -0.327745
0.139754 -0.192529 -0.311091
0.057941 0.178483 -0.314562
0.176456 0.423483 -0.317883
-0.389048 -0.147077 -0.350221
0.254938 -0.183849 -0.356295
-0.282301 -0.183847 -0.370737
-0.202255 -0.147078 -0.325600
0.009657 0.089242 -0.316610
-0.125183 0.446209 -0.330679
0.060061 -0.297473 -0.364562
0.120441 0.133033 -0.311911
0.151691 0.110308 -0.310585
-0.115686 0.245001 -0.380366
0.238956 0.378033 -0.315231
-0.331814 -0.036769 -0.331096
0.271788 0.036769 -0.363929
-0.139755 -0.192528 -0.322948
-0.428382 -0.220616 -0.335192
-0.018605 0.416462 -0.334506
0.301456 0.332584 -0.312580
-0.077255 -0.237978 -0.320297
0.409068 0.183847 -0.299666
-0.394313 0.036771 -0.333747
-0.101127 0.073540 -0.321310
0.154507 -0.475957 -0.310465
0.352541 -0.073540 -0.335458
0.038626 -0.356967 -0.315381
0.363956 0.287134 -0.309929
0.312500 -0.000001 -0.303763
-0.067599 -0.386714 -0.319887
0.176454 -0.423484 -0.317883
0.182941 0.110308 -0.309259
0.087973 0.386714 -0.338333
0.366588 -0.220619 -0.318165
0.432940 -0.110310 -0.298654
0.102030 0.185506 -0.387827
0.198401 -0.371012 -0.325300
0.220348 -0.318540 -0.332717
-0.203632 0.036770 -0.400793
-0.158166 -0.140056 -0.398865
0.242295 -0.266068 -0.340135
-0.221567 0.206574 -0.326419
0.164529 0.140056 -0.385175
0.266876 0.147078 -0.355789
0.209995 -0.036770 -0.383247
0.238601 -0.378035 -0.306898
0.264241 -0.213596 -0.347552
-0.095666 -0.185506 -0.396213
-0.456460 0.036771 -0.344732
0.137475 0.304495 -0.311188
-0.155726 0.363990 -0.348671
0.199975 0.259045 -0.308537
-0.342007 0.339608 -0.331529
-0.048283 0.208231 -0.319068
0.009657 0.148736 -0.316610
-0.269314 -0.036769 -0.328445
0.414334 0.073538 -0.316140
-0.137474 0.304495 -0.322852
0.118160 -0.245001 -0.312007
-0.060221 -0.066517 -0.319574
0.262475 0.213595 -0.305885
-0.365882 -0.220617 -0.332541
0.322694 -0.280113 -0.303330
-0.452254 0.147080 -0.336205
-0.331813 0.036771 -0.331096
0.375000 -0.000001 -0.301112
-0.067598 -0.327220 -0.319887
0.245441 0.110308 -0.306608
0.202254 -0.147079 -0.308440
0.409422 0.183847 -0.308000
0.154510 0.475956 -0.310465
0.048285 0.446209 -0.314972
0.217010 0.430506 -0.307814
0.057942 0.297472 -0.314562
-0.250697 -0.183847 -0.377745
-0.057939 0.416462 -0.319478
-0.239466 0.266068 -0.360572
-0.219447 -0.206572 -0.376419
0.433294 -0.110310 -0.306987
-0.096885 0.073540 -0.421310
-0.048283 0.267725 -0.319068
0.209995 0.036769 -0.383247
-0.206814 -0.036769 -0.325793
0.279510 0.385056 -0.305163
-0.026495 0.267725 -0.376582
-0.038627 0.118989 -0.318658
0.353944 -0.257388 -0.302005
-0.303382 -0.220617 -0.329890
-0.156947 -0.252022 -0.373768
0.217007 -0.430507 -0.307814
-0.349713 0.073540 -0.365249
0.019314 0.059494 -0.316201
0.342009 0.339606 -0.302511
0.050564 0.036769 -0.314875
-0.389754 0.147080 -0.333554
-0.432941 -0.110308 -0.335386
0.238954 -0.378035 -0.315231
-0.269313 0.036770 -0.328445
0.260901 -0.325563 -0.322649
-0.363601 0.287136 -0.332445
0.080083 0.237978 -0.380409
-0.240882 -0.266067 -0.327238
0.290748 -0.073540 -0.354776
-0.094448 -0.297472 -0.371116
0.404509 0.294156 -0.299860
0.437500 -0.000001 -0.298460
0.282848 -0.273091 -0.330066
0.144313 -0.036770 -0.310898
-0.159067 0.252023 -0.323768
0.304795 -0.220619 -0.337483
0.096567 -0.297473 -0.312923
0.142583 0.192528 -0.377758
-0.178382 -0.311517 -0.324587
0.307941 0.110308 -0.303956
0.264754 -0.147079 -0.305788
-0.045810 -0.267725 -0.377402
-0.009658 -0.327220 -0.317429
0.106223 -0.446209 -0.312514
0.148202 -0.036770 -0.402565
-0.115882 -0.356967 -0.321936
0.301101 -0.332585 -0.304246
0.385194 -0.257388 -0.300679
-0.345507 0.183849 -0.356722
0.205083 0.147078 -0.375107
-0.000001 -0.475956 -0.317020
-0.279507 0.385057 -0.328877
0.081814 0.036769 -0.313549
0.002827 -0.237978 -0.383687
-0.136926 0.192529 -0.389615
-0.066536 0.386715 -0.344888
0.180660 -0.199551 -0.309356
0.048636 -0.446209 -0.323305
-0.144314 -0.036769 -0.323142
0.352541 0.073538 -0.335458
0.022849 0.178483 -0.399534
0.051465 -0.208231 -0.389972
0.040042 0.356967 -0.348715
0.098848 0.185506 -0.312827
-0.247172 0.000001 -0.394292
0.097274 -0.416462 -0.329590
-0.280728 -0.273089 -0.353974
-0.327254 0.147079 -0.330903
-0.140425 -0.036769 -0.414809
-0.370441 -0.110308 -0.332735
-0.206813 0.036770 -0.325793
-0.500000 0.000001 -0.338231
0.161348 0.140056 -0.310175
-0.161348 -0.140056 -0.323864
0.500000 -0.000001 -0.295809
-0.218228 -0.318539 -0.351322
0.206813 -0.036770 -0.308246
-0.393253 -0.036768 -0.358747
-0.060220 0.066517 -0.319575
0.370441 0.110308 -0.301305
0.327254 -0.147079 -0.303137
-0.179759 -0.110308 -0.399781
-0.286506 -0.073538 -0.379264
-0.098848 -0.185506 -0.321213
-0.242966 0.110310 -0.385765
-0.155729 -0.363989 -0.348671
0.347629 0.183847 -0.327318
0.144314 0.036769 -0.310898
-0.325841 -0.147078 -0.364236
-0.432587 -0.110308 -0.343719
-0.176966 0.311518 -0.357921
-0.180660 0.199551 -0.324684
-0.034385 0.118989 -0.418659
-0.363247 0.287136 -0.340778
-0.025788 0.208231 -0.393249
0.371501 -0.110310 -0.326305
0.148202 0.036769 -0.402565
-0.081814 -0.036769 -0.320490
0.279507 -0.385057 -0.305162
0.000001 0.475956 -0.317020
0.385548 -0.257388 -0.309012
-0.365175 -0.220617 -0.349208
0.301454 -0.332585 -0.312580
-0.385194 0.257388 -0.333361
0.323401 -0.280113 -0.319997
-0.301101 0.332585 -0.329793
0.115882 0.356967 -0.312104
-0.106223 0.446209 -0.321526
0.009658 0.327220 -0.316610
-0.264754 0.147079 -0.328251
-0.307941 -0.110308 -0.330083
0.178382 0.311517 -0.309453
0.228955 -0.073540 -0.374094
-0.096567 0.297473 -0.321116
0.120636 0.245000 -0.370341
0.159067 -0.252023 -0.310272
-0.144313 0.036770 -0.323142
-0.437500 0.000001 -0.335579
0.106579 0.446209 -0.320847
-0.404509 -0.294156 -0.334180
0.240882 0.266067 -0.306801
0.363601 -0.287136 -0.301595
0.269313 -0.036770 -0.305595
0.183136 0.199550 -0.367689
0.432941 0.110308 -0.298654
0.389754 -0.147080 -0.300486
-0.050564 -0.036769 -0.319165
-0.342009 -0.339606 -0.331528
-0.019314 -0.059494 -0.317839
-0.140425 0.036770 -0.414809
-0.217007 0.430507 -0.326226
0.303382 0.220617 -0.304150
-0.353944 0.257388 -0.332035
0.038627 -0.118989 -0.315381
-0.074425 0.237978 -0.386964
-0.260706 0.213596 -0.369821
-0.279510 -0.385056 -0.328877
-0.065829 0.327220 -0.361554
0.206814 0.036769 -0.308246
0.048283 -0.267725 -0.314971
-0.393253 0.036771 -0.358747
0.057939 -0.416462 -0.314562
-0.057942 -0.297472 -0.319478
-0.217010 -0.430506 -0.326226
-0.048285 -0.446209 -0.319068
0.290748 0.073538 -0.354776
0.354651 -0.257388 -0.318671
-0.154510 -0.475956 -0.323574
-0.389047 0.147080 -0.350221
-0.202254 0.147079 -0.325600
-0.245441 -0.110308 -0.327432
-0.081813 0.036770 -0.320491
0.438207 -0.000001 -0.315127
-0.105872 -0.446209 -0.329859
-0.375000 0.000001 -0.332928
0.331813 -0.036771 -0.302944
0.452254 -0.147080 -0.297834
-0.148156 -0.110308 -0.406788
-0.114466 0.356967 -0.355269
-0.322694 0.280113 -0.330709
-0.116906 -0.133033 -0.405463
-0.300747 0.332585 -0.338127
0.285836 0.183847 -0.346636
0.365882 0.220617 -0.301499
-0.262475 -0.213595 -0.328154
-0.057235 -0.416461 -0.336144
-0.384841 0.257388 -0.341694
0.060221 0.066517 -0.314465
-0.118160 0.245001 -0.322032
0.137474 -0.304495 -0.311188
-0.158165 0.140057 -0.398865
0.269314 0.036769 -0.305595
-0.054406 -0.178483 -0.402811
-0.009657 -0.148736 -0.317429
0.048283 -0.208231 -0.314971
-0.050563 0.036770 -0.319165
0.342007 -0.339608 -0.302511
-0.199975 -0.259045 -0.325503
0.363954 -0.287136 -0.309928
0.309708 -0.110310 -0.345623
-0.008597 -0.386714 -0.342429
-0.007888 0.327220 -0.359096
-0.137475 -0.304495 -0.322852
0.433295 0.110308 -0.306987
-0.238601 0.378035 -0.327142
-0.005769 -0.148736 -0.409096
0.221567 -0.206574 -0.307620
-0.286506 0.073540 -0.379264
0.167162 -0.073540 -0.393412
0.040040 -0.356967 -0.348715
0.098690 0.297472 -0.362923
-0.432940 0.110310 -0.335386
-0.182941 -0.110308 -0.324780
0.042869 -0.118989 -0.415381
0.161190 0.252022 -0.360272
0.067599 0.386714 -0.314152
-0.312500 0.000001 -0.330277
0.064816 -0.066517 -0.422799
-0.038626 0.356967 -0.318659
-0.154507 0.475957 -0.323574
0.088678 -0.327220 -0.355000
0.394313 -0.036771 -0.300292
0.223689 0.206572 -0.357621
-0.409068 -0.183847 -0.334373
0.077255 0.237978 -0.313743
0.254939 0.183847 -0.356295
-0.282300 0.183849 -0.370737
-0.198206 0.259046 -0.367170
0.428382 0.220616 -0.298847
-0.055624 0.066517 -0.427908
0.139755 0.192528 -0.311091
-0.047929 0.446209 -0.327402
0.331814 0.036769 -0.302944
-0.151691 -0.110308 -0.323455
-0.120441 -0.133033 -0.322129
-0.178187 -0.199550 -0.383017
-0.009657 -0.089242 -0.317429
0.202255 0.147078 -0.308440
0.228955 0.073539 -0.374094
0.058649 0.416461 -0.331229
-0.057941 -0.178483 -0.319478
-0.115687 -0.245000 -0.380366
-0.139754 0.192529 -0.322948
0.252817 -0.183849 -0.306295
-0.000001 -0.237978 -0.317020
-0.183965 0.000001 -0.408307
0.115880 -0.356967 -0.312104
0.009656 -0.386714 -0.316610
0.376414 -0.000001 -0.334445
-0.096569 -0.416461 -0.321116
-0.370440 0.110310 -0.332735
-0.436793 0.000001 -0.352246
-0.330046 -0.036769 -0.372763
-0.250000 0.000001 -0.327625
-0.260194 0.325563 -0.328058
0.456813 -0.036771 -0.297641
-0.223299 -0.073539 -0.393279
-0.238247 0.378035 -0.335475
0.163627 -0.073540 -0.310078
0.390461 -0.147080 -0.317152
0.199974 -0.259046 -0.308536
-0.346568 -0.183847 -0.331722
-0.353237 0.257388 -0.348702
-0.095665 0.185506 -0.396213
0.156789 0.363989 -0.310369
0.284067 -0.183849 -0.304969
-0.179759 0.110309 -0.399781
0.404508 -0.294158 -0.299860
-0.476127 -0.073538 -0.337218
-0.369380 -0.110308 -0.357735
0.028971 0.208231 -0.315791
-0.262634 -0.147078 -0.378251
0.219289 0.318539 -0.307717
0.394314 0.036768 -0.300292
-0.432587 0.110310 -0.343719
0.247915 -0.110310 -0.364941
-0.176100 0.423484 -0.324490
0.079534 -0.126012 -0.313646
-0.363602 -0.287134 -0.332444
0.264755 0.147078 -0.305789
0.371502 0.110308 -0.326305
0.281789 0.273089 -0.305066
-0.408715 -0.183847 -0.342707
0.061475 -0.178484 -0.397895
-0.301968 -0.220617 -0.363223
0.083422 -0.126012 -0.405313
-0.301103 -0.332584 -0.329793
-0.428381 0.220619 -0.335193
0.139243 0.304495 -0.352855
-0.239468 -0.266067 -0.360572
-0.238603 -0.378033 -0.327142
-0.307940 0.110310 -0.330083
0.201743 0.259045 -0.350203
-0.176103 -0.423483 -0.324490
-0.187500 0.000001 -0.324974
-0.176968 -0.311517 -0.357920
0.226127 -0.073540 -0.307427
-0.161347 0.140057 -0.323864
-0.135706 0.304495 -0.364519
-0.077218 0.036770 -0.428824
0.264243 0.213595 -0.347552
-0.284068 -0.183847 -0.329070
-0.321987 0.280113 -0.347376
-0.055819 0.297473 -0.369478
-0.114468 -0.356967 -0.355269
0.366589 0.220617 -0.318165
-0.250696 0.183849 -0.377745
0.125539 0.446208 -0.311694
0.346567 -0.183849 -0.302318
-0.413627 -0.073538 -0.334567
-0.330046 0.036771 -0.372763
0.019315 0.416462 -0.316201
-0.281787 0.273091 -0.328974
0.456814 0.036768 -0.297641
-0.086910 0.386715 -0.320707
0.028971 0.267725 -0.315791
0.050759 0.267725 -0.373305
-0.065831 -0.327220 -0.361554
0.064816 0.066517 -0.422799
0.167162 0.073539 -0.393412
-0.077254 0.237978 -0.320297
0.327255 0.147078 -0.303137
0.457167 -0.036771 -0.305974
0.178380 -0.311518 -0.309453
-0.019313 0.178484 -0.317839
0.038627 0.118989 -0.315381
-0.252818 -0.183847 -0.327745
0.101127 0.073539 -0.312730
-0.017193 -0.297473 -0.367839
-0.325840 0.147079 -0.364236
-0.221568 -0.206572 -0.326419
-0.197694 0.371012 -0.325406
-0.365881 0.220619 -0.332541
0.314621 -0.000001 -0.353763
-0.159068 -0.252022 -0.323768
0.057940 -0.178484 -0.314562
-0.245440 0.110310 -0.327432
-0.175747 0.423484 -0.332824
-0.363249 -0.287134 -0.340778
0.067596 -0.327220 -0.314152
-0.125000 0.000000 -0.322323
0.262474 -0.213596 -0.305885
-0.095860 0.416462 -0.337783
0.031444 -0.267725 -0.374124
-0.038628 -0.356967 -0.318658
-0.219446 0.206574 -0.376419
0.288627 -0.073540 -0.304776
0.328668 -0.147079 -0.336471
-0.096569 -0.297472 -0.321116
-0.300749 -0.332584 -0.338126
0.077253 -0.475956 -0.313742
-0.148155 0.110309 -0.406788
0.409067 -0.183849 -0.299666
0.080082 -0.237978 -0.380409
-0.351127 -0.073538 -0.331915
0.010718 0.386714 -0.341610
-0.238249 -0.378033 -0.335475
0.102029 -0.185506 -0.387827
0.186122 -0.110309 -0.384259
0.125890 -0.446209 -0.320028
0.123975 -0.133034 -0.395244
0.309709 0.110308 -0.345623
0.389755 0.147077 -0.300486
-0.175749 -0.423483 -0.332824
0.118162 0.245000 -0.312007
0.117296 0.356967 -0.345437
-0.005061 -0.089242 -0.425763
-0.223299 0.073540 -0.393279
0.163627 0.073539 -0.310078
-0.303381 0.220619 -0.329890
0.179796 0.311517 -0.342786
0.180662 0.199550 -0.309356
0.457167 0.036768 -0.305974
-0.182940 0.110309 -0.324781
-0.259487 0.325563 -0.344725
-0.098847 0.185506 -0.321213
0.156787 -0.363990 -0.310369
-0.476127 0.073541 -0.337218
-0.079534 -0.126011 -0.320394
0.242296 0.266067 -0.340135
-0.062500 0.000000 -0.319671
-0.116905 0.133034 -0.405463
0.351127 -0.073540 -0.302124
0.304796 0.220617 -0.337483
-0.075646 -0.126011 -0.412061
-0.219287 0.318540 -0.326322
0.042870 0.118989 -0.415381
-0.288627 -0.073538 -0.329264
0.051466 0.208231 -0.389972
-0.385196 -0.257386 -0.333360
-0.151690 0.110309 -0.323455
0.240881 -0.266068 -0.306801
0.155226 -0.110309 -0.393918
0.395374 -0.036771 -0.325292
0.452255 0.147077 -0.297834
0.135196 0.416461 -0.311285
0.077256 0.475956 -0.313743
-0.028969 0.446209 -0.318249
0.086912 0.327220 -0.313333
-0.135194 0.416462 -0.322755
0.409421 -0.183849 -0.308000
-0.019313 0.297473 -0.317839
0.197696 0.371011 -0.308633
-0.120758 0.000000 -0.422323
0.120440 -0.133034 -0.311910
0.226127 0.073539 -0.307427
0.252828 -0.000001 -0.373081
0.260196 0.325561 -0.305982
-0.353946 -0.257386 -0.332035
-0.373586 0.000001 -0.366261
-0.156946 0.252023 -0.373768
0.098688 -0.297473 -0.362923
-0.266839 -0.036769 -0.386778
-0.413627 0.073540 -0.334567
3 543 0 473
3 0 610 473
3 610 83 473
3 610 461 83
3 461 562 83
3 461 360 562
3 461 308 360
3 543 647 0
3 308 74 360
3 562 630 83
3 610 457 461
3 647 332 0
3 0 182 610
3 83 356 473
3 473 269 543
3 332 9 0
3 9 421 0
3 421 424 0
3 424 628 0
3 360 563 562
3 563 146 562
3 146 140 562
3 140 60 562
3 461 452 308
3 461 636 452
3 461 604 636
3 461 529 604
3 60 630 562
3 461 457 529
3 628 182 0
3 283 439 281
3 283 624 439
3 283 390 624
3 283 4 390
3 4 392 390
3 4 1 392
3 1 480 392
3 1 397 480
3 1 521 397
3 1 648 521
3 1 35 648
3 1 502 35
3 1 297 502
3 439 342 281
3 342 197 281
3 342 275 197
3 1 90 297
3 439 213 342
3 480 103 392
3 197 569 281
3 399 2 589
3 470 72 2
3 434 3 625
3 510 116 3
3 357 165 546
3 430 41 165
3 576 367 165
3 289 423 165
3 89 231 613
3 613 373 166
3 413 172 617
3 413 541 20
3 392 249 100
3 415 213 624
3 624 100 361
3 627 233 426
3 627 544 466
3 140 313 232
3 313 563 101
3 294 549 92
3 217 131 294
3 7 152 294
3 36 427 294
3 523 395 124
3 395 99 250
3 612 481 221
3 481 200 336
3 431 571 281
3 4 571 316
3 154 6 299
3 236 299 158
3 602 452 87
3 16 87 604
3 97 311 511
3 511 385 252
3 511 368 442
3 364 223 511
3 59 304 509
3 59 585 450
3 258 502 56
3 258 126 648
3 528 515 195
3 528 69 267
3 424 24 229
3 24 9 345
3 383 365 45
3 582 127 383
3 8 522 383
3 633 251 383
3 151 277 545
3 277 574 428
3 61 196 456
3 196 478 337
3 401 76 49
3 597 58 325
3 71 199 464
3 438 105 108
3 123 411 493
3 260 179 551
3 463 586 198
3 214 329 603
3 243 568 564
3 592 588 256
3 370 263 642
3 324 290 632
3 159 598 553
3 159 418 598
3 333 598 107
3 333 553 598
3 113 381 553
3 113 335 381
3 159 381 418
3 159 553 381
3 204 460 631
3 204 418 460
3 245 460 497
3 245 631 460
3 374 598 631
3 374 107 598
3 204 598 418
3 204 631 598
3 467 68 251
3 467 31 68
3 505 68 107
3 505 251 68
3 633 207 251
3 633 383 207
3 467 207 31
3 467 251 207
3 285 512 553
3 285 31 512
3 113 512 335
3 113 553 512
3 333 68 553
3 333 107 68
3 285 68 31
3 285 553 68
3 272 538 61
3 272 497 538
3 322 538 584
3 322 61 538
3 456 19 61
3 456 196 19
3 272 19 497
3 272 61 19
3 361 584 624
3 361 100 584
3 390 100 624
3 477 61 100
3 477 196 61
3 322 100 61
3 322 584 100
3 545 107 151
3 545 277 107
3 570 151 196
3 570 277 151
3 652 251 277
3 652 383 251
3 505 277 251
3 505 107 277
3 414 151 631
3 414 196 151
3 374 151 107
3 374 631 151
3 245 19 631
3 245 497 19
3 414 19 196
3 414 631 19
3 183 500 346
3 183 24 500
3 656 500 328
3 656 346 500
3 18 515 346
3 18 352 515
3 183 515 24
3 183 346 515
3 32 528 352
3 32 365 528
3 119 365 383
3 119 528 365
3 264 515 528
3 264 24 515
3 195 352 528
3 195 515 352
3 421 9 24
3 168 500 9
3 168 328 500
3 345 500 24
3 345 9 500
3 332 489 9
3 332 647 489
3 168 489 328
3 168 9 489
3 353 193 17
3 353 31 193
3 513 193 352
3 513 17 193
3 181 512 17
3 181 335 512
3 353 512 31
3 353 17 512
3 526 207 365
3 526 31 207
3 45 207 383
3 45 365 207
3 32 193 365
3 32 352 193
3 526 193 31
3 526 365 193
3 496 180 346
3 496 653 180
3 18 180 352
3 18 346 180
3 656 169 346
3 656 328 169
3 496 169 653
3 496 346 169
3 341 495 17
3 341 653 495
3 181 495 335
3 181 17 495
3 513 180 17
3 513 352 180
3 341 180 653
3 341 17 180
3 57 206 578
3 57 196 206
3 64 206 210
3 64 578 206
3 441 574 578
3 441 291 574
3 57 574 196
3 57 578 574
3 148 277 291
3 148 8 277
3 652 8 383
3 652 277 8
3 570 574 277
3 570 196 574
3 428 291 277
3 428 574 291
3 622 100 103
3 622 478 100
3 477 478 196
3 477 100 478
3 390 392 100
3 249 103 100
3 249 392 103
3 347 206 478
3 347 210 206
3 337 206 196
3 337 478 206
3 622 484 478
3 622 103 484
3 347 484 210
3 347 478 484
3 534 15 21
3 534 400 15
3 160 15 291
3 160 21 15
3 537 407 21
3 537 411 407
3 534 407 400
3 534 21 407
3 530 391 8
3 530 400 391
3 522 391 383
3 522 8 391
3 148 15 8
3 148 291 15
3 530 15 400
3 530 8 15
3 446 302 578
3 446 309 302
3 441 302 291
3 441 578 302
3 64 592 578
3 64 210 592
3 446 592 309
3 446 578 592
3 167 30 21
3 167 309 30
3 537 30 411
3 537 21 30
3 160 302 21
3 160 291 302
3 167 302 309
3 167 21 302
3 349 539 139
3 349 548 539
3 339 539 533
3 339 139 539
3 607 150 139
3 607 411 150
3 349 150 548
3 349 139 150
3 86 293 278
3 86 548 293
3 485 293 33
3 485 278 293
3 78 539 278
3 78 533 539
3 86 539 548
3 86 278 539
3 593 134 127
3 593 400 134
3 330 134 533
3 330 127 134
3 582 391 127
3 582 383 391
3 593 391 400
3 593 127 391
3 600 407 139
3 600 400 407
3 607 407 411
3 607 139 407
3 339 134 139
3 339 533 134
3 600 134 400
3 600 139 134
3 237 436 424
3 237 33 436
3 628 436 182
3 628 424 436
3 229 28 424
3 229 24 28
3 237 28 33
3 237 424 28
3 421 24 424
3 69 533 267
3 69 528 533
3 264 267 24
3 264 528 267
3 119 127 528
3 119 383 127
3 330 528 127
3 330 533 528
3 479 267 278
3 479 24 267
3 78 267 533
3 78 278 267
3 485 28 278
3 485 33 28
3 479 28 24
3 479 278 28
3 109 488 23
3 109 210 488
3 403 488 108
3 403 23 488
3 306 406 23
3 306 588 406
3 109 406 210
3 109 23 406
3 219 309 588
3 219 493 309
3 30 493 411
3 30 309 493
3 256 309 592
3 256 588 309
3 406 592 210
3 406 588 592
3 161 484 105
3 161 210 484
3 437 484 103
3 437 105 484
3 438 488 105
3 438 108 488
3 161 488 210
3 161 105 488
3 480 397 103
3 579 105 397
3 579 108 105
3 437 397 105
3 437 103 397
3 26 115 405
3 26 314 115
3 491 115 588
3 491 405 115
3 307 594 405
3 307 214 594
3 26 594 314
3 26 405 594
3 408 29 493
3 408 314 29
3 123 29 411
3 123 493 29
3 219 115 493
3 219 588 115
3 408 115 314
3 408 493 115
3 583 216 23
3 583 490 216
3 306 216 588
3 306 23 216
3 403 300 23
3 403 108 300
3 583 300 490
3 583 23 300
3 110 25 405
3 110 490 25
3 307 25 214
3 307 405 25
3 491 216 405
3 491 588 216
3 110 216 490
3 110 405 216
3 587 317 572
3 587 597 317
3 305 317 33
3 305 572 317
3 186 199 572
3 186 453 199
3 587 199 597
3 587 572 199
3 65 71 453
3 65 329 71
3 142 329 214
3 142 71 329
3 655 199 71
3 655 597 199
3 464 453 71
3 464 199 453
3 449 457 182
3 449 58 457
3 527 58 597
3 527 457 58
3 610 182 457
3 48 317 58
3 48 33 317
3 325 317 597
3 325 58 317
3 449 436 58
3 449 182 436
3 48 436 33
3 48 58 436
3 44 53 429
3 44 314 53
3 444 53 453
3 444 429 53
3 417 29 429
3 417 411 29
3 44 29 314
3 44 429 29
3 321 594 329
3 321 314 594
3 603 594 214
3 603 329 594
3 65 53 329
3 65 453 53
3 321 53 314
3 321 329 53
3 561 175 572
3 561 548 175
3 186 175 453
3 186 572 175
3 305 293 572
3 305 33 293
3 561 293 548
3 561 572 293
3 162 150 429
3 162 548 150
3 417 150 411
3 417 429 150
3 444 175 429
3 444 453 175
3 162 175 548
3 162 429 175
3 620 567 98
3 620 490 567
3 40 567 635
3 40 98 567
3 156 25 98
3 156 214 25
3 620 25 490
3 620 98 25
3 433 300 379
3 433 490 300
3 248 300 108
3 248 379 300
3 504 567 379
3 504 635 567
3 433 567 490
3 433 379 567
3 310 174 252
3 310 362 174
3 114 174 635
3 114 252 174
3 385 440 252
3 385 511 440
3 310 440 362
3 310 252 440
3 235 279 98
3 235 362 279
3 156 279 214
3 156 98 279
3 40 174 98
3 40 635 174
3 235 174 362
3 235 98 174
3 55 579 648
3 55 108 579
3 521 579 397
3 521 648 579
3 126 190 648
3 126 258 190
3 55 190 108
3 55 648 190
3 35 258 648
3 585 635 450
3 585 59 635
3 487 450 258
3 487 59 450
3 276 252 59
3 276 511 252
3 114 59 252
3 114 635 59
3 320 450 379
3 320 258 450
3 504 450 635
3 504 379 450
3 248 190 379
3 248 108 190
3 320 190 258
3 320 379 190
3 82 14 77
3 82 87 14
3 5 14 597
3 5 77 14
3 153 158 77
3 153 230 158
3 82 158 87
3 82 77 158
3 296 299 230
3 296 368 299
3 410 368 511
3 410 299 368
3 194 158 299
3 194 87 158
3 236 230 299
3 236 158 230
3 636 604 87
3 601 14 604
3 601 597 14
3 16 14 87
3 16 604 14
3 529 527 604
3 529 457 527
3 601 527 597
3 601 604 527
3 286 288 226
3 286 362 288
3 227 288 230
3 227 226 288
3 220 279 226
3 220 214 279
3 286 279 362
3 286 226 279
3 366 440 368
3 366 362 440
3 442 440 511
3 442 368 440
3 296 288 368
3 296 230 288
3 366 288 362
3 366 368 288
3 73 149 77
3 73 71 149
3 153 149 230
3 153 77 149
3 5 655 77
3 5 597 655
3 73 655 71
3 73 77 655
3 147 142 226
3 147 71 142
3 220 142 214
3 220 226 142
3 227 149 226
3 227 230 149
3 147 149 71
3 147 226 149
3 93 540 590
3 93 258 540
3 386 540 176
3 386 590 540
3 136 304 590
3 136 344 304
3 93 304 258
3 93 590 304
3 552 59 344
3 552 97 59
3 276 97 511
3 276 59 97
3 487 304 59
3 487 258 304
3 509 344 59
3 509 304 344
3 35 502 258
3 1 4 90
3 340 540 502
3 340 176 540
3 56 540 258
3 56 502 540
3 297 129 502
3 297 90 129
3 340 129 176
3 340 502 129
3 224 389 10
3 224 420 389
3 178 389 344
3 178 10 389
3 499 52 10
3 499 338 52
3 224 52 420
3 224 10 52
3 596 138 97
3 596 420 138
3 311 138 511
3 311 97 138
3 552 389 97
3 552 344 389
3 596 389 420
3 596 97 389
3 419 626 590
3 419 255 626
3 136 626 344
3 136 590 626
3 386 218 590
3 386 176 218
3 419 218 255
3 419 590 218
3 465 295 10
3 465 255 295
3 499 295 338
3 499 10 295
3 178 626 10
3 178 344 626
3 465 626 255
3 465 10 626
3 637 215 130
3 637 492 215
3 359 215 591
3 359 130 215
3 566 416 130
3 566 338 416
3 637 416 492
3 637 130 416
3 66 577 292
3 66 492 577
3 145 577 650
3 145 292 577
3 443 215 292
3 443 591 215
3 66 215 492
3 66 292 215
3 644 503 223
3 644 420 503
3 70 503 591
3 70 223 503
3 364 138 223
3 364 511 138
3 644 138 420
3 644 223 138
3 268 52 130
3 268 420 52
3 566 52 338
3 566 130 52
3 359 503 130
3 359 591 503
3 268 503 420
3 268 130 503
3 234 74 452
3 234 650 74
3 308 452 74
3 602 376 452
3 602 87 376
3 234 376 650
3 234 452 376
3 636 87 452
3 154 591 6
3 154 299 591
3 194 6 87
3 194 299 6
3 410 223 299
3 410 511 223
3 70 299 223
3 70 591 299
3 519 6 292
3 519 87 6
3 443 6 591
3 443 292 6
3 145 376 292
3 145 650 376
3 519 376 87
3 519 292 376
3 517 75 118
3 517 255 75
3 343 75 565
3 343 118 75
3 557 295 118
3 557 338 295
3 517 295 255
3 517 118 295
3 476 218 38
3 476 255 218
3 435 218 176
3 435 38 218
3 303 75 38
3 303 565 75
3 476 75 255
3 476 38 75
3 211 606 427
3 211 638 606
3 170 606 565
3 170 427 606
3 36 472 427
3 36 294 472
3 211 472 638
3 211 427 472
3 388 163 118
3 388 638 163
3 557 163 338
3 557 118 163
3 343 606 118
3 343 565 606
3 388 606 638
3 388 118 606
3 402 129 612
3 402 176 129
3 351 129 90
3 351 612 129
3 221 649 612
3 221 481 649
3 402 649 176
3 402 612 649
3 316 90 4
3 316 571 90
3 283 571 4
3 201 612 571
3 201 481 612
3 351 571 612
3 351 90 571
3 124 565 523
3 124 395 565
3 102 523 481
3 102 395 523
3 12 427 395
3 12 294 427
3 170 395 427
3 170 565 395
3 257 523 38
3 257 481 523
3 303 523 565
3 303 38 523
3 435 649 38
3 435 176 649
3 257 649 481
3 257 38 649
3 27 482 409
3 27 313 482
3 205 482 650
3 205 409 482
3 605 233 409
3 605 144 233
3 27 233 313
3 27 409 233
3 350 627 144
3 350 549 627
3 133 549 294
3 133 627 549
3 469 233 627
3 469 313 233
3 426 144 627
3 426 233 144
3 146 563 313
3 271 482 563
3 271 650 482
3 101 482 313
3 101 563 482
3 360 74 563
3 271 74 650
3 271 563 74
3 447 67 246
3 447 638 67
3 524 67 144
3 524 246 67
3 616 163 246
3 616 338 163
3 447 163 638
3 447 246 163
3 259 472 549
3 259 638 472
3 92 472 294
3 92 549 472
3 350 67 549
3 350 144 67
3 259 67 638
3 259 549 67
3 117 323 409
3 117 492 323
3 605 323 144
3 605 409 323
3 205 577 409
3 205 650 577
3 117 577 492
3 117 409 577
3 43 416 246
3 43 492 416
3 616 416 338
3 616 246 416
3 524 323 246
3 524 144 323
3 43 323 492
3 43 246 323
3 615 474 95
3 615 481 474
3 608 474 468
3 608 95 474
3 241 99 95
3 241 384 99
3 615 99 481
3 615 95 99
3 525 395 384
3 525 7 395
3 12 7 294
3 12 395 7
3 102 99 395
3 102 481 99
3 250 384 395
3 250 99 384
3 51 571 569
3 51 200 571
3 201 200 481
3 201 571 200
3 283 281 571
3 431 569 571
3 431 281 569
3 327 474 200
3 327 468 474
3 336 474 481
3 336 200 474
3 51 191 200
3 51 569 191
3 327 191 468
3 327 200 191
3 137 651 646
3 137 273 651
3 516 651 384
3 516 646 651
3 132 262 646
3 132 260 262
3 137 262 273
3 137 646 262
3 143 282 7
3 143 273 282
3 152 282 294
3 152 7 282
3 525 651 7
3 525 384 651
3 143 651 273
3 143 7 651
3 239 375 95
3 239 370 375
3 241 375 384
3 241 95 375
3 608 84 95
3 608 468 84
3 239 84 370
3 239 95 84
3 508 639 646
3 508 370 639
3 132 639 260
3 132 646 639
3 516 375 646
3 516 384 375
3 508 375 370
3 508 646 375
3 37 614 111
3 37 609 614
3 42 614 623
3 42 111 614
3 192 104 111
3 192 260 104
3 37 104 609
3 37 111 104
3 532 454 458
3 532 609 454
3 378 454 290
3 378 458 454
3 536 614 458
3 536 623 614
3 532 614 609
3 532 458 614
3 209 120 131
3 209 273 120
3 50 120 623
3 50 131 120
3 217 282 131
3 217 294 282
3 209 282 273
3 209 131 282
3 203 262 111
3 203 273 262
3 192 262 260
3 192 111 262
3 42 120 111
3 42 623 120
3 203 120 273
3 203 111 120
3 225 135 140
3 225 290 135
3 60 135 630
3 60 140 135
3 232 301 140
3 232 313 301
3 225 301 290
3 225 140 301
3 146 313 140
3 544 623 466
3 544 627 623
3 469 466 313
3 469 627 466
3 133 131 627
3 133 294 131
3 50 627 131
3 50 623 627
3 387 466 458
3 387 313 466
3 536 466 623
3 536 458 466
3 378 301 458
3 378 290 301
3 387 301 313
3 387 458 301
3 559 188 645
3 559 468 188
3 270 188 564
3 270 645 188
3 372 263 645
3 372 88 263
3 559 263 468
3 559 645 263
3 459 370 88
3 459 179 370
3 639 179 260
3 639 370 179
3 84 263 370
3 84 468 263
3 642 88 370
3 642 263 88
3 514 191 568
3 514 468 191
3 244 191 569
3 244 568 191
3 243 188 568
3 243 564 188
3 514 188 468
3 514 568 188
3 197 275 569
3 94 568 275
3 94 564 568
3 244 275 568
3 244 569 275
3 641 555 265
3 641 363 555
3 184 555 88
3 184 265 555
3 371 81 265
3 371 463 81
3 641 81 363
3 641 265 81
3 261 640 179
3 261 363 640
3 551 640 260
3 551 179 640
3 459 555 179
3 459 88 555
3 261 555 363
3 261 179 555
3 91 462 645
3 91 185 462
3 372 462 88
3 372 645 462
3 270 377 645
3 270 564 377
3 91 377 185
3 91 645 377
3 558 643 265
3 558 185 643
3 371 643 463
3 371 265 643
3 184 462 265
3 184 88 462
3 558 462 185
3 558 265 462
3 274 13 177
3 274 398 13
3 560 13 290
3 560 177 13
3 445 547 177
3 445 49 547
3 274 547 398
3 274 177 547
3 319 422 49
3 319 586 422
3 112 586 463
3 112 422 586
3 401 422 76
3 401 49 422
3 547 76 398
3 547 49 76
3 358 46 324
3 358 398 46
3 11 46 356
3 11 324 46
3 632 13 324
3 632 290 13
3 358 13 398
3 358 324 13
3 83 630 356
3 135 324 630
3 135 290 324
3 11 630 324
3 11 356 630
3 96 208 483
3 96 363 208
3 599 208 49
3 599 483 208
3 382 640 483
3 382 260 640
3 96 640 363
3 96 483 640
3 475 81 586
3 475 363 81
3 198 81 463
3 198 586 81
3 319 208 586
3 319 49 208
3 475 208 363
3 475 586 208
3 63 326 177
3 63 609 326
3 445 326 49
3 445 177 326
3 560 454 177
3 560 290 454
3 63 454 609
3 63 177 454
3 222 104 483
3 222 609 104
3 382 104 260
3 382 483 104
3 599 326 483
3 599 49 326
3 222 326 609
3 222 483 326
3 54 106 575
3 54 185 106
3 629 106 34
3 629 575 106
3 520 643 575
3 520 463 643
3 54 643 185
3 54 575 643
3 247 377 298
3 247 185 377
3 432 377 564
3 432 298 377
3 171 106 298
3 171 34 106
3 247 106 185
3 247 298 106
3 369 498 423
3 369 315 498
3 556 498 34
3 556 423 498
3 289 242 423
3 289 165 242
3 369 242 315
3 369 423 242
3 448 394 575
3 448 315 394
3 520 394 463
3 520 575 394
3 629 498 575
3 629 34 498
3 448 498 315
3 448 575 498
3 619 94 20
3 619 564 94
3 155 94 275
3 155 20 94
3 541 486 20
3 541 413 486
3 619 486 564
3 619 20 486
3 342 213 275
3 634 20 213
3 634 413 20
3 155 213 20
3 155 275 213
3 89 34 231
3 89 613 34
3 189 231 413
3 189 613 231
3 396 423 613
3 396 165 423
3 556 613 423
3 556 34 613
3 355 231 298
3 355 413 231
3 171 231 34
3 171 298 231
3 432 486 298
3 432 564 486
3 355 486 413
3 355 298 486
3 121 318 654
3 121 3 318
3 202 318 398
3 202 654 318
3 471 589 654
3 471 266 589
3 121 589 3
3 121 654 589
3 79 2 266
3 79 546 2
3 506 546 165
3 506 2 546
3 550 589 2
3 550 3 589
3 399 266 2
3 399 589 266
3 164 269 356
3 164 625 269
3 595 625 3
3 595 269 625
3 473 356 269
3 507 318 625
3 507 398 318
3 434 318 3
3 434 625 318
3 164 46 625
3 164 356 46
3 507 46 398
3 507 625 46
3 501 618 39
3 501 315 618
3 157 618 266
3 157 39 618
3 581 394 39
3 581 463 394
3 501 394 315
3 501 39 394
3 425 242 546
3 425 315 242
3 357 242 165
3 357 546 242
3 79 618 546
3 79 266 618
3 425 618 315
3 425 546 618
3 542 354 654
3 542 422 354
3 471 354 266
3 471 654 354
3 202 76 654
3 202 398 76
3 542 76 422
3 542 654 76
3 240 112 39
3 240 422 112
3 581 112 463
3 581 39 112
3 157 354 39
3 157 266 354
3 240 354 422
3 240 39 354
3 580 128 85
3 580 413 128
3 287 128 497
3 287 85 128
3 535 373 85
3 535 331 373
3 580 373 413
3 580 85 373
3 122 613 331
3 122 576 613
3 396 576 165
3 396 613 576
3 189 373 613
3 189 413 373
3 166 331 613
3 166 373 331
3 380 213 584
3 380 172 213
3 634 172 413
3 634 213 172
3 439 624 213
3 415 584 213
3 415 624 584
3 334 128 172
3 334 497 128
3 617 128 413
3 617 172 128
3 380 538 172
3 380 584 538
3 334 538 497
3 334 172 538
3 455 284 657
3 455 253 284
3 494 284 331
3 494 657 284
3 173 621 657
3 173 335 621
3 455 621 253
3 455 657 621
3 80 531 576
3 80 253 531
3 367 531 165
3 367 576 531
3 122 284 576
3 122 331 284
3 80 284 253
3 80 576 284
3 254 47 85
3 254 418 47
3 535 47 331
3 535 85 47
3 287 460 85
3 287 497 460
3 254 460 418
3 254 85 460
3 212 381 657
3 212 418 381
3 173 381 335
3 173 657 381
3 494 47 657
3 494 331 47
3 212 47 418
3 212 657 47
3 404 280 125
3 404 653 280
3 22 280 573
3 22 125 280
3 238 495 125
3 238 335 495
3 404 495 653
3 404 125 495
3 554 169 451
3 554 653 169
3 62 169 328
3 62 451 169
3 187 280 451
3 187 573 280
3 554 280 653
3 554 451 280
3 141 412 41
3 141 253 412
3 312 412 573
3 312 41 412
3 430 531 41
3 430 165 531
3 141 531 253
3 141 41 531
3 518 621 125
3 518 253 621
3 238 621 335
3 238 125 621
3 22 412 125
3 22 573 412
3 518 412 253
3 518 125 412
3 228 489 116
3 228 328 489
3 393 489 647
3 393 116 489
3 510 611 116
3 510 3 611
3 228 611 328
3 228 116 611
3 543 269 647
3 595 116 269
3 595 3 116
3 393 269 116
3 393 647 269
3 470 573 72
3 470 2 573
3 550 72 3
3 550 2 72
3 506 41 2
3 506 165 41
3 312 2 41
3 312 573 2
3 348 72 451
3 348 3 72
3 187 72 573
3 187 451 72
3 62 611 451
3 62 328 611
3 348 611 3
3 348 451 611
