OFF

38 72 0
-0.016584 0.220194 -0.209286
-0.016678 0.221442 -0.212308
-0.500000 0.185387 -0.213906
-0.499951 0.184738 -0.210635
-0.016515 0.219271 -0.207900
-0.258268 0.202466 -0.217888
0.225098 0.237922 -0.219311
-0.258339 0.203414 -0.214742
-0.258268 0.202466 -0.209960
-0.258339 0.203414 -0.213107
-0.016411 0.217888 -0.220912
0.466643 0.257498 -0.217250
0.225099 0.237922 -0.208611
0.466594 0.258146 -0.213980
-0.016654 0.221118 -0.217213
-0.016703 0.221766 -0.213943
-0.499951 0.184737 -0.217177
0.466643 0.257498 -0.210709
-0.016585 0.220194 -0.218600
0.225289 0.235387 -0.221394
0.466782 0.255650 -0.220023
-0.016654 0.221118 -0.210672
0.224982 0.239470 -0.216414
0.467481 0.246363 -0.221875
-0.016515 0.219270 -0.219986
-0.499813 0.182891 -0.219949
0.467235 0.249624 -0.222526
0.224983 0.239470 -0.211508
-0.016062 0.213244 -0.222490
0.225525 0.232249 -0.222345
0.466990 0.252886 -0.221876
-0.016185 0.214874 -0.222164
-0.016307 0.216505 -0.221839
-0.016679 0.221442 -0.215578
0.466783 0.255650 -0.207936
-0.499605 0.180125 -0.221802
-0.258112 0.200389 -0.220431
0.467236 0.249624 -0.213980
3 3 28 35
3 3 4 28
3 4 23 28
3 4 37 23
3 4 34 37
3 35 25 3
3 25 2 3
3 3 8 4
3 23 26 28
3 8 0 4
3 28 31 35
3 28 29 31
3 6 18 20
3 19 10 30
3 22 33 11
3 7 33 2
3 17 1 27
3 2 1 9
3 2 25 16
3 34 0 12
3 3 0 8
3 10 25 36
3 18 16 5
3 26 29 28
3 26 23 37
3 34 17 37
3 17 13 37
3 13 11 37
3 11 20 37
3 20 30 37
3 30 26 37
3 21 0 3
3 21 17 0
3 15 1 2
3 15 13 1
3 9 3 2
3 9 1 3
3 14 33 16
3 14 11 33
3 7 16 33
3 7 2 16
3 24 18 25
3 24 20 18
3 5 25 18
3 5 16 25
3 32 10 35
3 32 30 10
3 36 35 10
3 36 25 35
3 32 31 30
3 32 35 31
3 29 30 31
3 29 26 30
3 24 10 20
3 24 25 10
3 19 20 10
3 19 30 20
3 14 18 11
3 14 16 18
3 6 11 18
3 6 20 11
3 15 33 13
3 15 2 33
3 22 13 33
3 22 11 13
3 21 1 17
3 21 3 1
3 27 13 17
3 27 1 13
3 4 0 34
3 12 17 34
3 12 0 17
