OFF

121 238 0
0.363388 -0.018343 0.015917
0.397084 -0.025377 0.033145
0.390350 -0.024450 0.032605
0.436766 -0.028824 0.038562
0.448968 -0.019126 0.043239
0.448470 0.025798 0.038163
0.433584 -0.030497 0.036400
0.412413 0.026567 0.034464
0.422930 0.008392 0.043225
0.367954 -0.013366 0.035784
0.458775 0.003922 0.039234
0.402875 0.018868 0.038062
0.412447 -0.025685 0.035843
0.425226 0.026252 0.032727
0.395157 0.001949 0.048012
0.361308 0.002118 0.041534
0.394099 0.026081 0.031249
0.394652 -0.006889 0.046578
0.435513 0.024221 0.037725
0.411720 0.018554 0.038574
0.363559 0.002275 0.045967
0.422813 0.027307 0.032713
0.406060 0.005680 0.048960
0.447906 0.009950 0.044703
0.381958 0.017091 0.036565
0.389658 -0.015061 0.038480
0.392594 0.013375 0.038825
0.448502 -0.024064 0.039479
0.434852 -0.000817 0.046178
0.390319 0.025246 0.031293
0.428230 -0.001209 0.046227
0.437878 -0.023195 0.038962
0.409506 0.003354 0.048445
0.459546 0.010850 0.038491
0.383143 0.023616 0.030823
0.382091 0.000219 0.048136
0.403009 -0.017319 0.039016
0.423988 -0.026613 0.034129
0.368090 0.014258 0.032829
0.394269 -0.000358 0.048078
0.393309 0.007285 0.046212
0.411746 -0.016896 0.040065
0.376515 0.002097 0.045894
0.420563 -0.017118 0.037794
0.407645 -0.000677 0.053013
0.426722 -0.024944 0.034069
0.437454 0.026597 0.037095
0.391947 -0.017866 0.039653
0.437533 0.020959 0.040581
0.429945 0.018393 0.036243
0.382148 -0.001193 0.048173
0.411590 0.006918 0.043888
0.405935 -0.025551 0.034765
0.370884 0.015152 0.035014
0.367184 0.023764 0.003100
0.361309 0.000789 0.041569
0.377112 0.009331 0.044031
0.381979 -0.015929 0.037436
0.454729 0.018776 0.033303
0.375039 -0.019195 0.029776
0.375458 0.020329 0.028731
0.364105 -0.007215 0.043432
0.390980 0.015320 0.038783
0.363560 0.000919 0.046002
0.432495 0.006991 0.043205
0.400383 -0.001060 0.047503
0.447136 0.000965 0.045501
0.432503 -0.005111 0.043524
0.400826 -0.002875 0.046992
0.435629 0.000990 0.046125
0.421024 0.018292 0.036856
0.458776 0.001838 0.039289
0.405846 0.026646 0.033388
0.365206 0.008906 0.043000
0.376516 0.000996 0.045923
0.370912 -0.016961 0.028073
0.434961 0.002285 0.046095
0.402800 0.009273 0.043323
0.439915 0.000974 0.046657
0.428873 0.001073 0.046163
0.407252 0.009234 0.043853
0.406343 -0.005770 0.048705
0.458774 0.005405 0.039195
0.447134 -0.000907 0.044995
0.368163 -0.012146 0.033526
0.440841 -0.022619 0.041711
0.447917 -0.008117 0.045180
0.362413 -0.006985 0.039543
0.439748 -0.000772 0.046704
0.428310 0.002677 0.046124
0.364415 0.021528 0.004846
0.376573 -0.000554 0.045963
0.439802 0.002218 0.046625
0.395161 -0.004734 0.048188
0.412211 -0.007163 0.044256
0.382530 -0.005950 0.046626
0.382146 0.001227 0.048109
0.407208 -0.010444 0.044372
0.409564 -0.005060 0.048111
0.403312 -0.010461 0.043840
0.397050 0.026264 0.031782
0.380313 0.024634 0.004112
0.362403 0.008357 0.039138
0.447132 0.002279 0.044911
0.435399 0.007402 0.045401
0.383173 -0.023078 0.032056
0.361310 -0.001156 0.041620
0.394132 -0.025227 0.032603
0.403696 -0.001017 0.053045
0.448942 0.020953 0.042181
0.382466 0.006212 0.046306
0.393559 -0.017031 0.039622
0.363561 -0.001005 0.046053
0.432210 0.031428 0.034774
0.400768 0.000210 0.046911
0.376788 -0.006179 0.044442
0.436631 -0.006162 0.045752
0.388695 0.013010 0.037745
0.429691 -0.018184 0.037210
0.371223 0.018560 0.027134
0.422784 -0.006949 0.043631
3 3 27 6
3 27 71 6
3 71 33 6
3 33 58 6
3 58 5 6
3 5 113 6
3 113 101 6
3 101 54 6
3 54 90 6
3 90 0 6
3 0 107 6
3 107 1 6
3 1 52 6
3 52 12 6
3 12 37 6
3 113 21 101
3 0 2 107
3 0 105 2
3 27 4 71
3 90 87 0
3 90 106 87
3 90 15 106
3 90 102 15
3 15 55 106
3 21 7 101
3 7 72 101
3 72 100 101
3 100 16 101
3 113 13 21
3 37 45 6
3 0 59 105
3 4 86 71
3 16 29 101
3 5 46 113
3 58 109 5
3 29 34 101
3 0 75 59
3 90 38 102
3 34 60 101
3 82 33 71
3 10 82 71
3 40 110 117
3 14 96 110
3 39 35 96
3 93 95 50
3 17 25 95
3 47 25 17
3 48 18 113
3 104 64 18
3 85 31 67
3 3 6 31
3 3 85 4
3 85 116 86
3 116 88 83
3 88 78 66
3 99 68 81
3 93 39 65
3 105 57 25
3 57 115 95
3 115 91 50
3 91 74 35
3 74 42 96
3 42 56 110
3 56 24 117
3 24 34 29
3 39 14 114
3 68 65 108
3 78 92 103
3 92 104 23
3 104 48 109
3 48 46 5
3 14 40 77
3 65 114 22
3 114 77 80
3 40 26 11
3 59 9 57
3 9 61 115
3 61 112 91
3 112 63 74
3 63 20 42
3 20 73 56
3 73 53 24
3 53 60 34
3 26 100 72
3 77 11 19
3 32 51 8
3 11 72 7
3 45 118 31
3 118 120 67
3 30 79 69
3 75 84 9
3 84 87 61
3 87 106 112
3 106 55 63
3 55 15 20
3 15 102 73
3 102 38 53
3 38 119 60
3 119 54 101
3 66 103 82
3 103 23 33
3 23 109 58
3 28 69 78
3 76 64 104
3 94 98 30
3 107 47 111
3 52 36 41
3 67 28 88
3 69 76 92
3 120 30 28
3 98 44 79
3 79 89 76
3 89 8 64
3 12 41 43
3 41 97 94
3 97 81 98
3 81 108 44
3 108 22 32
3 22 80 51
3 80 19 70
3 19 7 21
3 86 83 71
3 44 32 89
3 111 17 99
3 17 93 68
3 36 99 97
3 1 111 36
3 117 29 16
3 49 13 113
3 62 16 100
3 83 66 10
3 8 49 18
3 2 25 47
3 26 117 62
3 26 40 117
3 40 14 110
3 14 39 96
3 39 50 35
3 39 93 50
3 93 17 95
3 111 47 17
3 46 48 113
3 48 104 18
3 116 85 67
3 85 3 31
3 27 3 4
3 4 85 86
3 86 116 83
3 83 88 66
3 97 99 81
3 68 93 65
3 2 105 25
3 25 57 95
3 95 115 50
3 50 91 35
3 35 74 96
3 96 42 110
3 110 56 117
3 117 24 29
3 65 39 114
3 81 68 108
3 66 78 103
3 103 92 23
3 23 104 109
3 109 48 5
3 114 14 77
3 108 65 22
3 22 114 80
3 77 40 11
3 105 59 57
3 57 9 115
3 115 61 91
3 91 112 74
3 74 63 42
3 42 20 56
3 56 73 24
3 24 53 34
3 11 26 72
3 80 77 19
3 89 32 8
3 19 11 7
3 6 45 31
3 31 118 67
3 28 30 69
3 59 75 9
3 9 84 61
3 61 87 112
3 112 106 63
3 63 55 20
3 20 15 73
3 73 102 53
3 53 38 60
3 60 119 101
3 10 66 82
3 82 103 33
3 33 23 58
3 88 28 78
3 92 76 104
3 51 70 8
3 75 0 84
3 84 0 87
3 38 90 119
3 119 90 54
3 120 43 94
3 120 94 30
3 1 107 111
3 12 52 41
3 116 67 88
3 78 69 92
3 67 120 28
3 30 98 79
3 69 79 76
3 76 89 64
3 37 12 43
3 43 41 94
3 94 97 98
3 98 81 44
3 44 108 32
3 32 22 51
3 51 80 70
3 70 19 21
3 79 44 89
3 36 111 99
3 99 17 68
3 41 36 97
3 52 1 36
3 62 117 16
3 18 49 113
3 26 62 100
3 71 83 10
3 64 8 18
3 107 2 47
3 13 70 21
3 49 70 13
3 49 8 70
3 118 43 120
3 118 37 43
3 45 37 118
