OFF

128 252 0
0.092526 0.007308 0.320079
0.119319 -0.000001 0.431099
0.103724 -0.010336 0.415745
0.103724 0.010336 0.415745
0.283282 -0.010336 0.380752
0.283282 0.010336 0.380752
0.233498 -0.007308 0.488565
0.233498 0.007308 0.488565
0.274593 -0.000001 0.400839
0.092526 -0.007308 0.320079
0.095498 -0.000001 0.319500
0.230538 0.010336 0.481883
0.277619 -0.007308 0.400935
0.277619 0.007308 0.400935
0.230538 -0.010336 0.481883
0.226353 -0.000001 0.472432
0.111924 -0.000001 0.459148
0.096551 -0.007308 0.417143
0.096551 0.007308 0.417143
0.093579 -0.000001 0.417722
0.273137 -0.000001 0.382729
0.129483 -0.007308 0.473469
0.129483 0.007308 0.473469
0.172934 -0.000001 0.476729
0.268724 0.007308 0.462268
0.268724 -0.007308 0.462268
0.190913 -0.000001 0.479339
0.281083 -0.007308 0.443925
0.281083 0.007308 0.443925
0.254403 -0.000001 0.479827
0.110897 -0.007308 0.414347
0.110897 0.007308 0.414347
0.113870 -0.000001 0.413768
0.263159 -0.010336 0.457531
0.263159 0.010336 0.457531
0.109868 0.010336 0.435283
0.172166 -0.007308 0.479658
0.172166 0.007308 0.479658
0.109868 -0.010336 0.435283
0.120206 0.010336 0.452965
0.120206 -0.010336 0.452965
0.243849 0.007308 0.465688
0.243849 -0.007308 0.465688
0.126063 -0.007308 0.448593
0.126063 0.007308 0.448593
0.281982 -0.010336 0.421438
0.281982 0.010336 0.421438
0.209022 -0.000001 0.477882
0.140919 -0.000001 0.460032
0.190350 -0.007308 0.496974
0.190350 0.007308 0.496974
0.190253 -0.000001 0.500000
0.242036 -0.000001 0.463262
0.168460 -0.007308 0.493797
0.168460 0.007308 0.493797
0.268123 -0.007308 0.437166
0.268123 0.007308 0.437166
0.147826 -0.007308 0.485829
0.147826 0.007308 0.485829
0.116550 -0.007308 0.432325
0.116550 0.007308 0.432325
0.190583 -0.010336 0.489669
0.190583 0.010336 0.489669
0.134220 -0.010336 0.467903
0.134220 0.010336 0.467903
0.209601 -0.007308 0.480853
0.209601 0.007308 0.480853
0.271984 -0.000001 0.418818
0.295254 -0.000001 0.401498
0.170313 -0.010336 0.486727
0.170313 0.010336 0.486727
0.146426 -0.000001 0.488513
0.234723 -0.000001 0.491334
0.167692 -0.000001 0.496726
0.190816 -0.007308 0.482364
0.190816 0.007308 0.482364
0.248219 -0.010336 0.471545
0.248219 0.010336 0.471545
0.210999 -0.010336 0.488027
0.210999 0.010336 0.488027
0.127521 -0.000001 0.475775
0.284925 -0.010336 0.401168
0.284925 0.010336 0.401168
0.100418 -0.000001 0.439468
0.103185 -0.007308 0.438243
0.103185 0.007308 0.438243
0.114349 -0.007308 0.457337
0.114349 0.007308 0.457337
0.276108 0.007308 0.382150
0.276108 -0.007308 0.382150
0.227578 -0.007308 0.475200
0.227578 0.007308 0.475200
0.291980 -0.000001 0.424059
0.212397 0.007308 0.495201
0.283768 -0.000001 0.445325
0.212397 -0.007308 0.495201
0.271029 -0.000001 0.464230
0.155985 -0.000001 0.470185
0.085352 -0.010336 0.321477
0.085352 0.010336 0.321477
0.252592 -0.007308 0.477401
0.252592 0.007308 0.477401
0.255288 -0.000001 0.450832
0.289052 -0.007308 0.423291
0.289052 0.007308 0.423291
0.290455 -0.007308 0.379354
0.290455 0.007308 0.379354
0.293427 -0.000001 0.378775
0.274603 0.010336 0.440545
0.274603 -0.010336 0.440545
0.274913 -0.007308 0.419585
0.274913 0.007308 0.419585
0.154585 -0.007308 0.472869
0.154585 0.007308 0.472869
0.292229 -0.007308 0.401402
0.292229 0.007308 0.401402
0.151206 -0.010336 0.479349
0.151206 0.010336 0.479349
0.138957 -0.007308 0.462338
0.138957 0.007308 0.462338
0.075208 -0.000001 0.323454
0.078180 -0.007308 0.322875
0.078180 0.007308 0.322875
0.128489 -0.000001 0.446782
0.212977 -0.000001 0.498172
0.265439 -0.000001 0.435766
0.257592 -0.007308 0.452795
0.257592 0.007308 0.452795
3 9 120 98
3 9 122 120
3 9 0 122
3 10 32 31
3 0 31 3
3 99 3 18
3 122 18 19
3 120 19 17
3 121 17 2
3 98 2 30
3 9 30 32
3 9 10 0
3 120 121 98
3 0 99 122
3 60 31 32
3 60 35 3
3 85 18 3
3 83 19 18
3 83 84 17
3 84 38 2
3 59 30 2
3 59 1 32
3 123 44 60
3 44 39 35
3 87 85 35
3 16 83 85
3 16 86 84
3 86 40 38
3 43 59 38
3 123 1 59
3 48 119 44
3 119 64 39
3 64 22 87
3 22 80 16
3 21 86 16
3 21 63 40
3 118 43 40
3 48 123 43
3 97 113 119
3 113 117 64
3 117 58 22
3 58 71 80
3 57 21 80
3 57 116 63
3 112 118 63
3 112 97 48
3 23 37 113
3 70 117 113
3 54 58 117
3 73 71 58
3 53 57 71
3 53 69 116
3 69 36 112
3 23 97 112
3 26 75 37
3 75 62 70
3 62 50 54
3 51 73 54
3 51 49 53
3 61 69 53
3 74 36 69
3 26 23 36
3 47 66 75
3 79 62 75
3 79 93 50
3 93 124 51
3 95 49 51
3 78 61 49
3 78 65 74
3 47 26 74
3 91 66 47
3 91 11 79
3 11 7 93
3 72 124 93
3 72 6 95
3 14 78 95
3 14 90 65
3 90 15 47
3 41 91 15
3 77 11 91
3 101 7 11
3 101 29 72
3 100 6 72
3 100 76 14
3 76 42 90
3 52 15 90
3 127 41 52
3 127 34 77
3 34 24 101
3 24 96 29
3 96 25 100
3 33 76 100
3 33 126 42
3 102 52 42
3 56 127 102
3 108 34 127
3 28 24 34
3 94 96 24
3 94 27 25
3 109 33 25
3 109 55 126
3 125 102 126
3 67 111 56
3 46 108 56
3 104 28 108
3 92 94 28
3 92 103 27
3 103 45 109
3 45 110 55
3 67 125 55
3 8 13 111
3 82 46 111
3 82 115 104
3 115 68 92
3 114 103 92
3 81 45 103
3 81 12 110
3 8 67 110
3 88 13 8
3 5 82 13
3 5 106 115
3 106 107 68
3 105 114 68
3 4 81 114
3 4 89 12
3 89 20 8
3 107 106 88
3 88 89 4
3 106 5 88
3 4 105 107
3 88 20 89
3 31 0 10
3 3 99 0
3 18 122 99
3 19 120 122
3 17 121 120
3 2 98 121
3 30 9 98
3 32 10 9
3 60 32 1
3 3 31 60
3 85 3 35
3 83 18 85
3 17 19 83
3 2 17 84
3 59 2 38
3 32 30 59
3 60 1 123
3 35 60 44
3 87 35 39
3 16 85 87
3 84 83 16
3 38 84 86
3 43 38 40
3 123 59 43
3 44 123 48
3 39 44 119
3 87 39 64
3 16 87 22
3 21 16 80
3 40 86 21
3 118 40 63
3 48 43 118
3 119 48 97
3 64 119 113
3 22 64 117
3 80 22 58
3 57 80 71
3 63 21 57
3 112 63 116
3 48 118 112
3 113 97 23
3 70 113 37
3 54 117 70
3 73 58 54
3 53 71 73
3 116 57 53
3 112 116 69
3 23 112 36
3 37 23 26
3 70 37 75
3 54 70 62
3 51 54 50
3 53 73 51
3 61 53 49
3 74 69 61
3 26 36 74
3 75 26 47
3 79 75 66
3 50 62 79
3 51 50 93
3 95 51 124
3 78 49 95
3 74 61 78
3 47 74 65
3 91 47 15
3 79 66 91
3 93 79 11
3 72 93 7
3 95 124 72
3 14 95 6
3 65 78 14
3 47 65 90
3 41 15 52
3 77 91 41
3 101 11 77
3 72 7 101
3 100 72 29
3 14 6 100
3 90 14 76
3 52 90 42
3 127 52 102
3 77 41 127
3 101 77 34
3 29 101 24
3 100 29 96
3 33 100 25
3 42 76 33
3 102 42 126
3 56 102 125
3 108 127 56
3 28 34 108
3 94 24 28
3 25 96 94
3 109 25 27
3 126 33 109
3 125 126 55
3 56 125 67
3 46 56 111
3 104 108 46
3 92 28 104
3 27 94 92
3 109 27 103
3 55 109 45
3 67 55 110
3 111 67 8
3 82 111 13
3 104 46 82
3 92 104 115
3 114 92 68
3 81 103 114
3 110 45 81
3 8 110 12
3 88 8 20
3 5 13 88
3 115 82 5
3 68 115 106
3 105 68 107
3 4 114 105
3 12 81 4
3 8 12 89
3 4 107 88
