OFF

352 700 0
-0.005002 -0.080758 -0.473125
0.133734 -0.070500 -0.486460
0.132882 -0.069103 -0.486350
0.131919 -0.067858 -0.486825
-0.003739 -0.022189 -0.480903
0.038981 -0.038756 -0.475884
-0.002650 -0.077864 -0.476000
-0.006372 -0.079263 -0.480292
-0.004669 -0.038997 -0.480819
-0.008525 -0.068412 -0.479683
0.039363 -0.071445 -0.475975
0.132434 -0.072391 -0.493621
0.132959 -0.033441 -0.497918
-0.005202 -0.031129 -0.481358
-0.009718 -0.023377 -0.480790
-0.000320 -0.036033 -0.481325
-0.009080 -0.079924 -0.473291
0.135765 -0.039771 -0.492040
-0.010102 -0.077835 -0.476105
0.039130 -0.032658 -0.475413
-0.000453 -0.072785 -0.478844
0.015214 -0.033747 -0.480401
0.139123 -0.039976 -0.499675
-0.002962 -0.077395 -0.478950
-0.009669 -0.026269 -0.485829
-0.007821 -0.073387 -0.476281
-0.003633 -0.032093 -0.483135
-0.004841 -0.040433 -0.484712
0.038948 -0.032414 -0.479810
0.139451 -0.065650 -0.488581
-0.006689 -0.074768 -0.482692
0.130998 -0.066959 -0.487816
-0.004989 -0.073402 -0.476242
-0.000274 -0.034333 -0.488042
0.039055 -0.031938 -0.478345
-0.003136 -0.033386 -0.485763
-0.009669 -0.076356 -0.473756
-0.003748 -0.073820 -0.480453
-0.007644 -0.037134 -0.486482
0.039209 -0.035085 -0.473927
-0.003205 -0.031425 -0.483308
0.130217 -0.037235 -0.498304
-0.000420 -0.066316 -0.482468
-0.004326 -0.038665 -0.487016
-0.006438 -0.081042 -0.473106
-0.006968 -0.070483 -0.482878
-0.008860 -0.025482 -0.486734
-0.000453 -0.070700 -0.477043
-0.007682 -0.036352 -0.481308
-0.007734 -0.028121 -0.480145
-0.006743 -0.073937 -0.475405
-0.007813 -0.081490 -0.476451
-0.003184 -0.031842 -0.486080
-0.007657 -0.028449 -0.481770
-0.009290 -0.074650 -0.481643
0.015780 -0.070548 -0.470022
0.038843 -0.033376 -0.480975
-0.006384 -0.081797 -0.476462
0.141806 -0.066176 -0.490738
-0.002939 -0.026183 -0.480342
-0.000292 -0.040357 -0.484460
-0.004631 -0.039785 -0.486034
-0.006259 -0.021313 -0.484491
-0.003737 -0.027331 -0.480221
0.131072 -0.035907 -0.498780
-0.007687 -0.074389 -0.474003
0.141415 -0.039813 -0.494240
-0.005063 -0.065404 -0.479953
-0.000445 -0.073227 -0.479862
0.139060 -0.039759 -0.492021
0.015798 -0.071467 -0.471175
-0.006072 -0.070719 -0.475675
0.129864 -0.039066 -0.492823
0.038700 -0.036122 -0.481770
-0.003612 -0.032519 -0.485935
-0.002672 -0.077283 -0.473553
0.015084 -0.039309 -0.478359
-0.006241 -0.024758 -0.487527
0.133704 -0.032684 -0.496709
-0.009193 -0.031256 -0.482174
-0.009955 -0.027190 -0.484752
-0.009021 -0.080628 -0.476376
0.039481 -0.072070 -0.474600
-0.008890 -0.022421 -0.484102
0.039750 -0.069428 -0.469733
-0.003968 -0.032020 -0.487262
-0.003760 -0.078381 -0.479641
-0.002744 -0.073124 -0.479243
0.139515 -0.067438 -0.496027
0.039427 -0.064929 -0.472448
-0.000281 -0.040286 -0.485923
0.039186 -0.036516 -0.474040
-0.004927 -0.028118 -0.480125
-0.004930 -0.021406 -0.481016
-0.010088 -0.076199 -0.478247
-0.004989 -0.033268 -0.480944
-0.008878 -0.075175 -0.473907
0.015594 -0.065589 -0.470648
0.140857 -0.065863 -0.489441
0.015553 -0.064985 -0.471991
-0.004111 -0.069665 -0.483210
-0.007789 -0.079026 -0.480152
-0.004467 -0.068165 -0.483101
-0.009976 -0.031434 -0.483357
-0.003783 -0.074068 -0.476679
-0.004881 -0.074385 -0.473983
0.133837 -0.066166 -0.490798
-0.009955 -0.031851 -0.486129
-0.003366 -0.033603 -0.481629
-0.003033 -0.072965 -0.477850
-0.000404 -0.068592 -0.484244
-0.003504 -0.071645 -0.476580
-0.003076 -0.032881 -0.484397
0.140465 -0.039781 -0.492906
0.015734 -0.071243 -0.475477
-0.003012 -0.073285 -0.480639
-0.004943 -0.074214 -0.475653
0.130256 -0.066536 -0.489173
-0.009328 -0.074062 -0.476493
-0.008207 -0.037123 -0.482410
-0.006018 -0.071559 -0.483030
0.141446 -0.039903 -0.497412
-0.005938 -0.034267 -0.480513
-0.004026 -0.036134 -0.480143
-0.007779 -0.069506 -0.482186
-0.002977 -0.075059 -0.477348
0.134152 -0.032410 -0.495207
-0.003465 -0.072244 -0.481807
-0.002808 -0.023573 -0.483565
-0.007958 -0.032147 -0.488078
-0.000304 -0.032912 -0.484136
0.134101 -0.073712 -0.491260
0.015543 -0.066268 -0.476102
-0.003327 -0.034389 -0.486832
-0.009996 -0.024768 -0.480607
0.015745 -0.069306 -0.469334
-0.010244 -0.031643 -0.484743
-0.004006 -0.031249 -0.482137
0.132038 -0.034577 -0.498644
-0.007817 -0.068911 -0.476987
0.015264 -0.032352 -0.477812
-0.004377 -0.037636 -0.480203
0.133513 -0.066533 -0.492341
-0.009947 -0.077748 -0.473574
-0.000401 -0.070073 -0.484358
-0.002938 -0.079371 -0.476159
-0.010111 -0.074199 -0.477681
-0.005122 -0.071795 -0.475831
0.015202 -0.037337 -0.473516
0.137468 -0.039991 -0.500000
-0.010091 -0.074515 -0.480466
0.129411 -0.039344 -0.494321
0.133121 -0.039893 -0.495881
0.141838 -0.066917 -0.493823
0.131526 -0.037175 -0.490901
0.137803 -0.065574 -0.488285
0.015197 -0.038583 -0.474199
-0.000293 -0.032841 -0.485595
-0.002518 -0.024990 -0.483019
-0.003691 -0.075169 -0.473870
-0.008186 -0.037545 -0.485211
-0.000311 -0.038859 -0.482002
0.015146 -0.036389 -0.481189
-0.002613 -0.030412 -0.484912
0.132484 -0.035849 -0.490767
-0.005152 -0.032143 -0.488058
-0.008869 -0.027656 -0.482091
-0.004812 -0.066231 -0.477205
-0.004277 -0.073367 -0.481718
0.131467 -0.071138 -0.494100
-0.009970 -0.025051 -0.483111
0.141759 -0.039857 -0.495822
-0.002910 -0.071842 -0.479281
0.039315 -0.064839 -0.473984
-0.006271 -0.029557 -0.481890
-0.004827 -0.024930 -0.487295
0.133456 -0.039933 -0.497463
0.015108 -0.038897 -0.475412
-0.010380 -0.074359 -0.479073
-0.005004 -0.065535 -0.478503
0.039261 -0.070365 -0.476976
-0.006232 -0.028717 -0.481641
0.038713 -0.038555 -0.480263
-0.000265 -0.037152 -0.488727
-0.002933 -0.076354 -0.475847
0.142150 -0.066546 -0.492276
0.015697 -0.067928 -0.469211
0.129993 -0.068388 -0.493301
0.015796 -0.071923 -0.472617
0.135812 -0.039988 -0.499694
-0.009668 -0.079139 -0.473387
0.015246 -0.032817 -0.479253
-0.009000 -0.075050 -0.475800
0.137860 -0.067509 -0.496344
-0.004315 -0.072772 -0.476519
0.134550 -0.073580 -0.489738
0.137412 -0.039756 -0.491715
-0.005884 -0.035371 -0.487833
-0.000268 -0.035673 -0.488659
-0.004773 -0.066828 -0.482445
0.129803 -0.066659 -0.490692
-0.009681 -0.026464 -0.482561
-0.000454 -0.067808 -0.477369
0.134240 -0.032666 -0.493640
-0.002963 -0.078724 -0.473368
-0.000283 -0.033341 -0.486965
0.039190 -0.069000 -0.477452
0.133848 -0.066906 -0.493879
-0.006368 -0.073910 -0.475642
-0.007018 -0.069705 -0.476081
0.039646 -0.066639 -0.470083
0.134637 -0.072924 -0.488293
-0.004517 -0.067380 -0.476255
-0.003739 -0.075071 -0.475725
-0.000449 -0.066671 -0.478311
-0.002843 -0.028047 -0.483588
0.015090 -0.039369 -0.476848
0.039154 -0.067560 -0.477329
-0.003293 -0.072611 -0.477684
-0.003621 -0.035746 -0.487448
0.133360 -0.073293 -0.492625
-0.005034 -0.072743 -0.475895
-0.009678 -0.028106 -0.483672
-0.006834 -0.036374 -0.487405
-0.000272 -0.039650 -0.487245
0.015530 -0.064900 -0.473501
-0.003759 -0.071095 -0.482757
-0.004983 -0.065861 -0.481337
-0.008920 -0.027338 -0.480258
0.039740 -0.070721 -0.470430
0.039152 -0.032016 -0.476811
0.136204 -0.067433 -0.496047
-0.007870 -0.080748 -0.473164
-0.004957 -0.081504 -0.476408
-0.008884 -0.028877 -0.482748
-0.008144 -0.073968 -0.475693
-0.003972 -0.037249 -0.487512
-0.009798 -0.077369 -0.479046
0.039223 -0.065307 -0.475450
0.015195 -0.033628 -0.474857
-0.000446 -0.072013 -0.477709
0.015630 -0.068898 -0.476923
-0.008385 -0.037541 -0.483780
-0.004921 -0.040509 -0.483257
-0.002553 -0.027129 -0.484660
-0.007791 -0.074204 -0.475697
0.140520 -0.039946 -0.498762
-0.009813 -0.076328 -0.475943
0.015093 -0.038719 -0.479717
-0.002830 -0.026213 -0.485744
-0.000385 -0.073130 -0.481476
0.015526 -0.065348 -0.474945
-0.003800 -0.073422 -0.481823
-0.006406 -0.073160 -0.476102
-0.002799 -0.026409 -0.482476
-0.004140 -0.033286 -0.487038
-0.003272 -0.072937 -0.480513
-0.008992 -0.078360 -0.479716
-0.000410 -0.067275 -0.483579
0.039541 -0.065563 -0.471079
0.133442 -0.039844 -0.494295
0.015641 -0.066623 -0.469670
-0.004831 -0.021585 -0.484361
-0.004808 -0.028422 -0.481731
-0.008346 -0.068458 -0.478252
-0.000318 -0.034638 -0.481829
0.039684 -0.071680 -0.471599
-0.004179 -0.032504 -0.481864
0.130605 -0.038306 -0.491623
-0.002686 -0.076228 -0.478143
-0.003605 -0.027612 -0.482025
-0.009639 -0.026275 -0.480421
0.015682 -0.070210 -0.476459
0.134348 -0.071845 -0.487143
-0.007686 -0.029385 -0.482122
0.134402 -0.039970 -0.498804
-0.004854 -0.029363 -0.482087
-0.000408 -0.072615 -0.482961
-0.003649 -0.028833 -0.482683
-0.009014 -0.074047 -0.476753
0.015582 -0.067515 -0.476797
0.015270 -0.032421 -0.476304
0.140912 -0.067232 -0.495137
0.039167 -0.066262 -0.476627
0.039185 -0.033729 -0.474410
-0.004939 -0.034290 -0.487705
-0.000267 -0.038547 -0.488231
-0.003434 -0.032097 -0.484566
0.039132 -0.037816 -0.474729
-0.007745 -0.021467 -0.481033
-0.003618 -0.022378 -0.484040
-0.003748 -0.080650 -0.476305
-0.008326 -0.068778 -0.481065
-0.000402 -0.071482 -0.483906
-0.003779 -0.079946 -0.473216
-0.006308 -0.021167 -0.481054
-0.008922 -0.022196 -0.480941
-0.003262 -0.072645 -0.479244
0.015774 -0.071846 -0.474126
0.133335 -0.034529 -0.491239
-0.007657 -0.024952 -0.487330
-0.007683 -0.021608 -0.484400
0.134794 -0.067220 -0.495184
0.038779 -0.039170 -0.478877
-0.002947 -0.023368 -0.480741
-0.000441 -0.065987 -0.479614
0.038755 -0.034680 -0.481663
-0.009693 -0.023632 -0.483649
-0.003671 -0.034718 -0.480643
0.129712 -0.067307 -0.492142
-0.003838 -0.072829 -0.476674
-0.004862 -0.040005 -0.481891
0.015180 -0.035005 -0.481082
-0.002898 -0.076347 -0.473708
0.134763 -0.065855 -0.489483
-0.004954 -0.079040 -0.480113
0.136156 -0.065646 -0.488602
0.015111 -0.037696 -0.480709
-0.005072 -0.072573 -0.482624
-0.009813 -0.075033 -0.477444
0.038686 -0.037481 -0.481276
-0.003157 -0.032958 -0.482947
0.039718 -0.067997 -0.469612
-0.009823 -0.079345 -0.476254
-0.008008 -0.031133 -0.481379
-0.000430 -0.065862 -0.481075
-0.000313 -0.033544 -0.482815
0.039593 -0.072152 -0.473065
-0.003809 -0.070316 -0.475918
-0.004165 -0.068815 -0.475806
-0.004985 -0.073512 -0.482623
-0.006285 -0.074110 -0.474030
0.129600 -0.038355 -0.497291
-0.006554 -0.032186 -0.488344
0.134372 -0.039805 -0.492944
-0.006607 -0.031090 -0.481092
0.015201 -0.034656 -0.473872
-0.003768 -0.073500 -0.477640
0.130611 -0.069733 -0.493987
-0.003628 -0.025438 -0.486668
-0.000456 -0.069222 -0.476920
0.133952 -0.033412 -0.492248
-0.000302 -0.039855 -0.483082
-0.002668 -0.024759 -0.480554
0.038874 -0.039239 -0.477340
-0.000318 -0.037515 -0.481389
-0.006331 -0.028396 -0.480099
0.015204 -0.035956 -0.473405
-0.008095 -0.074741 -0.482425
-0.009155 -0.032027 -0.487300
-0.006884 -0.035352 -0.480640
0.129316 -0.039097 -0.495890
3 75 204 313
3 204 294 313
3 294 0 313
3 0 44 313
3 44 232 313
3 232 16 313
3 16 190 313
3 190 143 313
3 143 159 313
3 143 36 159
3 36 105 159
3 36 96 105
3 96 65 105
3 65 331 105
3 322 210 84
3 210 259 84
3 259 31 84
3 31 3 84
3 3 2 84
3 2 1 84
3 1 273 84
3 3 155 2
3 271 134 228
3 134 14 228
3 14 296 228
3 296 289 228
3 289 295 228
3 295 93 228
3 93 4 228
3 4 304 228
3 304 343 228
3 343 59 228
3 59 49 228
3 59 346 49
3 59 92 346
3 59 63 92
3 284 154 39
3 284 164 154
3 284 299 164
3 118 319 146
3 118 279 319
3 221 147 194
3 194 310 221
3 35 205 157
3 112 157 130
3 321 130 326
3 108 326 265
3 308 265 15
3 123 15 345
3 141 345 161
3 8 161 342
3 311 342 60
3 243 60 90
3 27 90 224
3 61 224 286
3 43 286 183
3 236 183 198
3 33 205 35
3 198 33 133
3 74 35 112
3 255 133 35
3 285 219 133
3 85 255 74
3 26 287 112
3 267 26 321
3 95 267 108
3 122 95 308
3 350 122 123
3 48 350 141
3 119 48 8
3 242 119 311
3 160 242 243
3 38 160 27
3 223 38 61
3 197 223 43
3 285 197 236
3 165 285 255
3 163 52 74
3 40 163 287
3 137 40 26
3 13 137 267
3 335 13 95
3 324 335 122
3 79 324 350
3 103 79 48
3 136 103 119
3 107 136 242
3 349 107 160
3 129 349 38
3 333 129 223
3 165 333 197
3 53 49 346
3 181 346 92
3 263 92 63
3 270 63 59
3 254 59 343
3 158 343 304
3 128 304 4
3 290 4 93
3 262 93 295
3 62 295 289
3 301 289 296
3 83 296 14
3 307 14 134
3 170 134 271
3 228 49 53
3 271 228 166
3 274 53 181
3 234 166 53
3 222 201 166
3 79 234 274
3 276 174 181
3 278 276 263
3 215 278 270
3 244 215 254
3 249 244 158
3 339 249 128
3 175 339 290
3 77 175 262
3 300 77 62
3 46 300 301
3 24 46 83
3 80 24 307
3 222 80 170
3 103 222 234
3 335 324 274
3 13 335 174
3 137 13 276
3 40 137 278
3 163 40 215
3 52 163 244
3 85 52 249
3 165 85 339
3 333 165 175
3 129 333 77
3 349 129 300
3 107 349 46
3 136 107 24
3 103 136 80
3 172 68 250
3 218 20 68
3 111 240 20
3 328 47 240
3 329 340 47
3 212 202 340
3 167 214 202
3 179 305 214
3 67 325 305
3 227 42 325
3 199 258 42
3 102 110 258
3 100 144 110
3 226 293 144
3 127 256 250
3 226 127 277
3 297 172 256
3 37 256 127
3 168 127 226
3 115 37 168
3 218 172 297
3 111 218 337
3 328 111 194
3 329 328 147
3 212 329 71
3 167 212 209
3 179 167 139
3 67 179 264
3 227 67 9
3 199 227 292
3 102 199 124
3 100 102 45
3 226 100 120
3 252 168 318
3 297 37 115
3 337 297 87
3 194 337 109
3 71 147 221
3 209 71 50
3 139 209 235
3 264 139 118
3 9 264 146
3 292 9 178
3 124 292 150
3 45 124 54
3 120 45 348
3 318 120 30
3 208 331 65
3 116 105 331
3 213 159 105
3 184 313 159
3 6 75 313
3 145 204 75
3 291 294 204
3 233 0 294
3 57 44 0
3 51 232 44
3 81 16 232
3 323 190 16
3 18 143 190
3 247 36 143
3 192 245 65
3 247 192 96
3 253 208 245
3 25 245 192
3 279 192 247
3 235 25 279
3 116 208 253
3 213 116 32
3 184 213 104
3 6 184 125
3 145 6 269
3 291 145 23
3 233 291 86
3 57 233 315
3 51 57 7
3 81 51 101
3 323 81 257
3 18 323 237
3 247 18 94
3 253 25 235
3 32 253 50
3 104 32 221
3 125 104 310
3 269 125 109
3 23 269 87
3 86 23 115
3 315 86 252
3 7 315 330
3 101 7 30
3 257 101 348
3 237 257 54
3 94 237 150
3 319 94 178
3 347 15 265
3 148 345 15
3 156 161 345
3 177 342 161
3 216 60 342
3 76 90 60
3 248 224 90
3 317 286 224
3 162 183 286
3 312 198 183
3 21 33 198
3 191 205 33
3 140 157 205
3 281 130 157
3 55 240 47
3 70 20 240
3 260 106 142
3 334 314 106
3 17 316 314
3 196 155 316
3 69 29 155
3 113 98 29
3 66 58 98
3 268 334 260
3 176 152 142
3 275 176 207
3 189 275 302
3 149 189 231
3 22 149 193
3 246 22 88
3 121 246 282
3 171 121 153
3 66 171 185
3 154 17 334
3 164 196 17
3 299 69 196
3 341 113 69
3 203 66 113
3 91 154 268
3 151 72 260
3 351 151 152
3 332 351 176
3 41 332 275
3 64 41 189
3 138 64 149
3 12 138 22
3 78 12 246
3 126 78 121
3 203 126 171
3 19 341 299
3 230 203 341
3 347 39 91
3 5 288 268
3 344 5 72
3 303 344 151
3 182 303 351
3 320 182 332
3 73 320 41
3 306 73 64
3 56 306 138
3 28 56 12
3 34 28 78
3 230 34 126
3 336 284 39
3 239 19 284
3 281 230 19
3 239 336 265
3 281 239 326
3 156 148 91
3 177 156 288
3 216 177 5
3 76 216 344
3 248 76 303
3 317 248 182
3 162 317 320
3 312 162 73
3 21 312 306
3 191 21 56
3 140 191 28
3 281 140 34
3 117 106 314
3 31 314 316
3 3 316 155
3 2 155 29
3 1 29 98
3 273 98 58
3 142 106 117
3 207 142 200
3 302 207 309
3 231 302 187
3 193 231 338
3 88 193 169
3 282 88 11
3 153 282 220
3 185 153 131
3 58 185 195
3 229 273 211
3 261 210 322
3 117 31 259
3 200 117 89
3 309 200 173
3 187 309 238
3 338 187 283
3 169 338 217
3 11 169 206
3 220 11 180
3 131 220 10
3 195 131 82
3 211 195 327
3 186 322 84
3 135 84 229
3 55 229 266
3 186 135 47
3 259 210 261
3 89 259 97
3 173 89 99
3 238 173 225
3 283 238 251
3 217 283 132
3 206 217 280
3 180 206 241
3 10 180 272
3 82 10 114
3 327 82 298
3 266 327 188
3 261 186 340
3 97 261 202
3 99 97 214
3 225 99 305
3 251 225 325
3 132 251 42
3 280 132 258
3 241 280 110
3 272 241 144
3 114 272 293
3 298 114 277
3 188 298 250
3 70 188 68
3 112 35 157
3 321 112 130
3 108 321 326
3 308 108 265
3 123 308 15
3 141 123 345
3 8 141 161
3 311 8 342
3 243 311 60
3 27 243 90
3 61 27 224
3 43 61 286
3 236 43 183
3 219 236 198
3 133 33 35
3 219 198 133
3 287 74 112
3 74 255 35
3 255 285 133
3 52 85 74
3 321 26 112
3 108 267 321
3 308 95 108
3 123 122 308
3 141 350 123
3 8 48 141
3 311 119 8
3 243 242 311
3 27 160 243
3 61 38 27
3 43 223 61
3 236 197 43
3 219 285 236
3 85 165 255
3 287 163 74
3 26 40 287
3 267 137 26
3 95 13 267
3 122 335 95
3 350 324 122
3 48 79 350
3 119 103 48
3 242 136 119
3 160 107 242
3 38 349 160
3 223 129 38
3 197 333 223
3 285 165 197
3 181 53 346
3 263 181 92
3 270 263 63
3 254 270 59
3 158 254 343
3 128 158 304
3 290 128 4
3 262 290 93
3 62 262 295
3 301 62 289
3 83 301 296
3 307 83 14
3 170 307 134
3 201 170 271
3 166 228 53
3 201 271 166
3 174 274 181
3 274 234 53
3 234 222 166
3 324 79 274
3 263 276 181
3 270 278 263
3 254 215 270
3 158 244 254
3 128 249 158
3 290 339 128
3 262 175 290
3 62 77 262
3 301 300 62
3 83 46 301
3 307 24 83
3 170 80 307
3 201 222 170
3 79 103 234
3 174 335 274
3 276 13 174
3 278 137 276
3 215 40 278
3 244 163 215
3 249 52 244
3 339 85 249
3 175 165 339
3 77 333 175
3 300 129 77
3 46 349 300
3 24 107 46
3 80 136 24
3 222 103 80
3 256 172 250
3 172 218 68
3 218 111 20
3 111 328 240
3 328 329 47
3 329 212 340
3 212 167 202
3 167 179 214
3 179 67 305
3 67 227 325
3 227 199 42
3 199 102 258
3 102 100 110
3 100 226 144
3 277 127 250
3 293 226 277
3 37 297 256
3 168 37 127
3 318 168 226
3 252 115 168
3 337 218 297
3 194 111 337
3 147 328 194
3 71 329 147
3 209 212 71
3 139 167 209
3 264 179 139
3 9 67 264
3 292 227 9
3 124 199 292
3 45 102 124
3 120 100 45
3 318 226 120
3 330 252 318
3 87 297 115
3 109 337 87
3 310 194 109
3 50 71 221
3 235 209 50
3 118 139 235
3 146 264 118
3 178 9 146
3 150 292 178
3 54 124 150
3 348 45 54
3 30 120 348
3 330 318 30
3 245 208 65
3 208 116 331
3 116 213 105
3 213 184 159
3 184 6 313
3 6 145 75
3 145 291 204
3 291 233 294
3 233 57 0
3 57 51 44
3 51 81 232
3 81 323 16
3 323 18 190
3 18 247 143
3 96 192 65
3 36 247 96
3 25 253 245
3 279 25 192
3 319 279 247
3 118 235 279
3 32 116 253
3 104 213 32
3 125 184 104
3 269 6 125
3 23 145 269
3 86 291 23
3 315 233 86
3 7 57 315
3 101 51 7
3 257 81 101
3 237 323 257
3 94 18 237
3 319 247 94
3 50 253 235
3 221 32 50
3 310 104 221
3 109 125 310
3 87 269 109
3 115 23 87
3 252 86 115
3 330 315 252
3 30 7 330
3 348 101 30
3 54 257 348
3 150 237 54
3 178 94 150
3 146 319 178
3 336 347 265
3 347 148 15
3 148 156 345
3 156 177 161
3 177 216 342
3 216 76 60
3 76 248 90
3 248 317 224
3 317 162 286
3 162 312 183
3 312 21 198
3 21 191 33
3 191 140 205
3 140 281 157
3 135 55 47
3 55 70 240
3 152 260 142
3 260 334 106
3 334 17 314
3 17 196 316
3 196 69 155
3 69 113 29
3 113 66 98
3 72 268 260
3 207 176 142
3 302 275 207
3 231 189 302
3 193 149 231
3 88 22 193
3 282 246 88
3 153 121 282
3 185 171 153
3 58 66 185
3 268 154 334
3 154 164 17
3 164 299 196
3 299 341 69
3 341 203 113
3 288 91 268
3 152 151 260
3 176 351 152
3 275 332 176
3 189 41 275
3 149 64 189
3 22 138 149
3 246 12 22
3 121 78 246
3 171 126 121
3 66 203 171
3 91 39 154
3 284 19 299
3 19 230 341
3 148 347 91
3 72 5 268
3 151 344 72
3 351 303 151
3 332 182 351
3 41 320 332
3 64 73 41
3 138 306 64
3 12 56 138
3 78 28 12
3 126 34 78
3 203 230 126
3 347 336 39
3 336 239 284
3 239 281 19
3 326 239 265
3 130 281 326
3 288 156 91
3 5 177 288
3 344 216 5
3 303 76 344
3 182 248 303
3 320 317 182
3 73 162 320
3 306 312 73
3 56 21 306
3 28 191 56
3 34 140 28
3 230 281 34
3 31 117 314
3 3 31 316
3 1 2 29
3 273 1 98
3 211 273 58
3 200 142 117
3 309 207 200
3 187 302 309
3 338 231 187
3 169 193 338
3 11 88 169
3 220 282 11
3 131 153 220
3 195 185 131
3 211 58 195
3 229 84 273
3 266 229 211
3 186 261 322
3 89 117 259
3 173 200 89
3 238 309 173
3 283 187 238
3 217 338 283
3 206 169 217
3 180 11 206
3 10 220 180
3 82 131 10
3 327 195 82
3 266 211 327
3 135 186 84
3 55 135 229
3 70 55 266
3 340 186 47
3 97 259 261
3 99 89 97
3 225 173 99
3 251 238 225
3 132 283 251
3 280 217 132
3 241 206 280
3 272 180 241
3 114 10 272
3 298 82 114
3 188 327 298
3 70 266 188
3 202 261 340
3 214 97 202
3 305 99 214
3 325 225 305
3 42 251 325
3 258 132 42
3 110 280 258
3 144 241 110
3 293 272 144
3 277 114 293
3 250 298 277
3 68 188 250
3 20 70 68
