OFF
1062 1102 0
0.0487163623 -0.4448485277 -0.1765117952
0.0491803264 -0.4448510443 -0.1345462963
-0.4711402015 -0.4466897842 -0.1707644509
-0.4706762374 -0.4466923009 -0.1287989520
0.0455706899 0.4435689601 -0.1764237393
0.0460346541 0.4435664435 -0.1344582404
-0.4742858739 0.4417277036 -0.1706763950
-0.4738219097 0.4417251870 -0.1287108962
-0.4959904293 0.4803752806 0.1952354844
-0.5000000000 0.4803970294 -0.1674296844
0.4712074637 0.4838009552 0.1845424977
0.4671978931 0.4838227040 -0.1781226711
0.1016375436 0.4699667278 -0.0902771726
0.3148675579 0.4707219576 -0.0926345658
0.0711125190 -0.4617836768 0.1127329620
0.0679450380 -0.4617664957 -0.1737652989
-0.4685833016 -0.4636952011 0.1186996419
-0.4717507826 -0.4636780200 -0.1677986190
0.3302199819 0.4839051457 0.1955326083
0.3260022971 0.4839280233 -0.1859564543
-0.4827728939 -0.4685233251 -0.1950571894
-0.4823268057 -0.4685257448 -0.1547085749
0.0620013817 -0.4665938136 -0.2010800148
0.0624474699 -0.4665962333 -0.1607314003
0.4452774035 -0.4986357833 -0.1930537054
0.4496211386 -0.4986593447 0.1998365969
0.3417508362 -0.4990024594 -0.1919091535
0.3460945713 -0.4990260208 0.2009811488
0.4956562649 -0.4984573487 -0.1936106757
0.5000000000 -0.4984809101 0.1992796266
0.4417455551 0.4988475861 -0.1929548394
0.4460892903 0.4988240248 0.1999354629
0.3382189878 0.4984809101 -0.1918102875
0.3425627229 0.4984573487 0.2010800148
0.4921244165 0.4990260208 -0.1935118097
0.4964681516 0.4990024594 0.1993784926
0.0535965054 0.4550390468 -0.1771943182
0.0535275202 0.4550394210 -0.1834340220
-0.4802974665 0.4531480718 -0.1712917815
-0.4803664517 0.4531484460 -0.1775314852
0.0678508039 0.4594072296 0.1128242663
0.0646833229 0.4594244107 -0.1736739947
-0.4718450167 0.4574957053 0.1187909461
-0.4750124977 0.4575128864 -0.1677073148
-0.4860691862 0.4624330485 -0.1949649172
-0.4856230980 0.4624306288 -0.1546163028
0.0587050894 0.4643625600 -0.2009877426
0.0591511776 0.4643601403 -0.1606391282
0.1115442045 -0.4371311225 -0.1984842265
0.3089886966 -0.4364318028 -0.2006671006
0.3336490862 -0.4845606975 0.1954366184
0.3294314014 -0.4845378199 -0.1860524442
-0.4925656067 -0.4868812978 0.1951396143
-0.4965751774 -0.4868595490 -0.1675255545
0.4746322863 -0.4834556232 0.1844466277
0.4706227156 -0.4834338744 -0.1782185411
0.1084558184 0.4351072900 -0.1983977742
0.3059003105 0.4358066098 -0.2005806484
0.0568274842 -0.4574711294 -0.1772847621
0.0567584990 -0.4574707552 -0.1835244658
-0.4770664877 -0.4593621044 -0.1713822253
-0.4771354729 -0.4593617302 -0.1776219291
0.1049730283 -0.4720585613 -0.0903705419
0.3182030425 -0.4713033315 -0.0927279350
-0.2118039764 -0.0021611546 -0.1805279755
0.0551430096 -0.0012156671 -0.1834792439
-0.2101884870 -0.4584162427 -0.1805731974
-0.2118039764 -0.0021611546 -0.1805279755
-0.4787509623 -0.0031066421 -0.1775767072
-0.2134194657 0.4540939335 -0.1804827536
-0.2117349912 -0.0021615288 -0.1742882718
0.0552119948 -0.0012160413 -0.1772395401
-0.2133504805 0.4540935593 -0.1742430498
-0.2117349912 -0.0021615288 -0.1742882718
-0.4786819771 -0.0031070163 -0.1713370034
-0.2101195018 -0.4584166169 -0.1743334937
0.4709150897 0.0001835404 0.0031619783
0.4689103043 0.0001944148 -0.1781706061
0.4710612767 0.2419922478 0.0938522380
0.4709150897 0.0001835404 0.0031619783
0.4729198750 0.0001726660 0.1844945627
0.4707689027 -0.2416251670 -0.0875282814
-0.4962828034 -0.0032421342 0.0138549649
-0.4944242051 -0.2450617160 0.1044972896
-0.4942780180 -0.0032530086 0.1951875493
-0.4962828034 -0.0032421342 0.0138549649
-0.4981414017 0.2385774476 -0.0767873597
-0.4982875887 -0.0032312598 -0.1674776195
-0.0109714456 -0.4851575861 0.0084605366
0.2318304204 -0.4843066047 0.0964535821
-0.0089666602 -0.4851684605 0.1897931210
-0.0109714456 -0.4851575861 0.0084605366
-0.2537733115 -0.4860085676 -0.0795325089
-0.0129762309 -0.4851467117 -0.1728720478
-0.0106790715 -0.0015401713 0.1898410560
0.4729198750 0.0001726660 0.1844945627
0.2302641961 0.2411303919 0.1871917769
0.2319766074 -0.2424978973 0.1871438419
-0.0123914828 0.4820881179 0.1898889911
-0.2533347504 0.2394175546 0.1925382702
0.2302641961 0.2411303919 0.1871917769
-0.0106790715 -0.0015401713 0.1898410560
-0.4942780180 -0.0032530086 0.1951875493
-0.2516223391 -0.2442107346 0.1924903352
-0.2533347504 0.2394175546 0.1925382702
-0.0089666602 -0.4851684605 0.1897931210
0.2319766074 -0.2424978973 0.1871438419
-0.2516223391 -0.2442107346 0.1924903352
-0.0143962681 0.4820989923 0.0085564067
0.2264008125 0.4829608481 -0.0847831322
-0.0164010535 0.4821098667 -0.1727761777
-0.0143962681 0.4820989923 0.0085564067
-0.2551933487 0.4812371364 0.1018959455
-0.0123914828 0.4820881179 0.1898889911
0.2676530193 -0.0120047319 -0.1759462679
0.3674254562 0.2359089861 -0.1770344695
0.4689103043 0.0001944148 -0.1781706061
0.2676530193 -0.0120047319 -0.1759462679
0.3691378675 -0.2477193031 -0.1770824045
0.0663141805 -0.0011710425 -0.1737196468
-0.2003662488 -0.0021439858 0.1157619541
-0.2019971064 0.4584514674 0.1158076062
0.0694816615 -0.0011882236 0.1127786142
-0.2003662488 -0.0021439858 0.1157619541
-0.1987353913 -0.4627394390 0.1157163020
-0.4702141592 -0.0030997479 0.1187452940
0.0678979210 -0.0011796331 -0.0304705163
0.0678979210 -0.0011796331 -0.0304705163
-0.2003191318 -0.4627308484 -0.0275328285
-0.4717978996 -0.0030911574 -0.0245038364
-0.2003191318 -0.4627308484 -0.0275328285
-0.4717978996 -0.0030911574 -0.0245038364
-0.2035808469 0.4584600580 -0.0274415243
-0.2035808469 0.4584600580 -0.0274415243
0.2099202931 -0.0006683019 -0.0915025538
0.2099202931 -0.0006683019 -0.0915025538
0.2087222575 -0.0006622564 -0.1995324374
0.2087222575 -0.0006622564 -0.1995324374
0.4960622083 0.0002725554 0.0028839084
0.4938903407 0.0002843360 -0.1935612427
0.4962651799 0.2496375074 0.1011312005
0.4960622083 0.0002725554 0.0028839084
0.4982340758 0.0002607747 0.1993290596
0.4958592366 -0.2490923967 -0.0953633836
0.3298256916 -0.0003163371 0.0047400821
0.3317373889 -0.2424385173 0.1000883503
0.3319345340 -0.0003277759 0.1954846134
0.3298256916 -0.0003163371 0.0047400821
0.3279139944 0.2418058431 -0.0906081861
0.3277168493 -0.0003048983 -0.1860044492
-0.0775227387 -0.2298159549 -0.1820262207
-0.0791382281 0.2264391332 -0.1819809988
-0.3444697247 -0.2307614424 -0.1790749523
-0.0775227387 -0.2298159549 -0.1820262207
-0.3460852140 0.2254936457 -0.1790297304
-0.3444697247 -0.2307614424 -0.1790749523
-0.0791382281 0.2264391332 -0.1819809988
-0.3460852140 0.2254936457 -0.1790297304
-0.0790692429 0.2264387590 -0.1757412950
-0.0774537535 -0.2298163291 -0.1757865169
-0.3460162288 0.2254932715 -0.1727900266
-0.0790692429 0.2264387590 -0.1757412950
-0.3444007394 -0.2307618166 -0.1728352485
-0.3460162288 0.2254932715 -0.1727900266
-0.0774537535 -0.2298163291 -0.1757865169
-0.3444007394 -0.2307618166 -0.1728352485
0.4690564914 0.2420031222 -0.0874803464
0.4707689027 -0.2416251670 -0.0875282814
0.4690564914 0.2420031222 -0.0874803464
0.4691295849 0.3629074759 -0.0421352165
0.4727736880 -0.2416360414 0.0938043030
0.4710612767 0.2419922478 0.0938522380
0.4727736880 -0.2416360414 0.0938043030
0.4727005945 -0.3625403951 0.0484591731
-0.4964289904 -0.2450508416 -0.0768352948
-0.4954996912 -0.3659606325 -0.0315141324
-0.4961366164 0.2385665732 0.1045452247
-0.4944242051 -0.2450617160 0.1044972896
-0.4961366164 0.2385665732 0.1045452247
-0.4970659155 0.3594763641 0.0592240623
-0.4964289904 -0.2450508416 -0.0768352948
-0.4981414017 0.2385774476 -0.0767873597
0.2298256350 -0.4842957303 -0.0848790023
0.3512265680 -0.4838702395 -0.0408824795
-0.2517685262 -0.4860194420 0.1018000755
0.2318304204 -0.4843066047 0.0964535821
-0.2517685262 -0.4860194420 0.1018000755
-0.3731694591 -0.4864449327 0.0578035527
0.2298256350 -0.4842957303 -0.0848790023
-0.2537733115 -0.4860085676 -0.0795325089
0.2311204018 -0.0006837527 0.1871678094
0.4720636694 0.2419868106 0.1845185302
0.4737760807 -0.2416414786 0.1844705952
0.2311204018 -0.0006837527 0.1871678094
-0.0115352772 0.2402739733 0.1898650235
-0.2541909561 0.4812316992 0.1925622377
0.2294079905 0.4829445365 0.1872157444
-0.0115352772 0.2402739733 0.1898650235
-0.2524785448 -0.0023965900 0.1925143027
-0.4934218124 -0.2450671532 0.1951635818
-0.4951342237 0.2385611360 0.1952115169
-0.2524785448 -0.0023965900 0.1925143027
-0.0098228659 -0.2433543159 0.1898170885
0.2328328130 -0.4843120418 0.1871198743
-0.2507661335 -0.4860248792 0.1924663677
-0.0098228659 -0.2433543159 0.1898170885
0.2284055978 0.4829499737 0.0965494522
0.3488041381 0.4833809017 0.0498796828
-0.2571981341 0.4812480108 -0.0794366389
0.2264008125 0.4829608481 -0.0847831322
-0.2571981341 0.4812480108 -0.0794366389
-0.3775966744 0.4808170829 -0.0327668695
0.2284055978 0.4829499737 0.0965494522
-0.2551933487 0.4812371364 0.1018959455
0.1661681711 0.2237098394 -0.1748101313
0.2659406080 0.4716235573 -0.1758983329
0.3691378675 -0.2477193031 -0.1770824045
0.3674254562 0.2359089861 -0.1770344695
0.2692838768 -0.4726001851 -0.1759919200
0.1677990287 -0.2368856138 -0.1748557834
0.1661681711 0.2237098394 -0.1748101313
0.1677990287 -0.2368856138 -0.1748557834
-0.0662577225 0.2286316219 0.1142931102
-0.3361056328 0.2276758597 0.1172764501
-0.0646268649 -0.2319638313 0.1142474581
-0.0662577225 0.2286316219 0.1142931102
-0.3344747752 -0.2329195935 0.1172307980
-0.0646268649 -0.2319638313 0.1142474581
-0.3361056328 0.2276758597 0.1172764501
-0.3344747752 -0.2329195935 0.1172307980
0.0694816615 -0.0011882236 0.1127786142
0.0662906219 0.2291223888 -0.1020722555
0.0663141805 -0.0011710425 -0.1737196468
0.0695052200 -0.2314816550 0.0411312229
-0.1987353913 -0.4627394390 0.1157163020
-0.0661870469 -0.4622486721 -0.1006490637
-0.4702141592 -0.0030997479 0.1187452940
-0.4717743411 -0.2333845887 -0.0961512277
-0.2019028723 -0.4627222579 -0.1707819590
-0.3344512167 -0.4632130248 0.0455834067
-0.4733816401 -0.0030825668 -0.1677529669
-0.4718214582 0.2272022739 0.0471435549
-0.2019971064 0.4584514674 0.1158076062
-0.3392966723 0.4579864722 -0.0975744195
-0.2051645874 0.4584686485 -0.1706906547
-0.0678650215 0.4589336438 0.0426913710
0.3119281273 0.0171450774 -0.1466508332
0.3165353002 -0.0002906870 -0.0926812504
0.1033052860 -0.0010459167 -0.0903238572
0.1065908741 0.0164178026 -0.1443806995
0.3165353002 -0.0002906870 -0.0926812504
0.1557789184 0.2346492130 -0.0908898632
0.1033052860 -0.0010459167 -0.0903238572
0.2640616678 -0.2359858167 -0.0921152444
0.3074445036 -0.0003125965 -0.2006238745
0.1601332310 -0.2188966895 -0.1990083319
0.1100000115 -0.0010119163 -0.1984410003
0.2573112840 0.2175721767 -0.2000565429
0.4940933124 0.2496492881 -0.0953139506
0.4958592366 -0.2490923967 -0.0953633836
0.4940933124 0.2496492881 -0.0953139506
0.4942962841 0.4990142401 0.0029333414
0.4980311041 -0.2491041774 0.1010817675
0.4962651799 0.2496375074 0.1011312005
0.4980311041 -0.2491041774 0.1010817675
0.4978281324 -0.4984691294 0.0028344754
0.3296285465 -0.2424270785 -0.0906561811
0.3315402438 -0.4845492587 0.0046920871
0.3300228368 0.2417944043 0.1001363452
0.3317373889 -0.2424385173 0.1000883503
0.3300228368 0.2417944043 0.1001363452
0.3281111395 0.4839165845 0.0047880770
0.3296285465 -0.2424270785 -0.0906561811
0.3279139944 0.2418058431 -0.0906081861
0.3960919308 -0.0001009980 0.2004583058
0.3960919308 -0.0001009980 0.2004583058
0.3917481957 -0.0000774366 -0.1924319964
0.3917481957 -0.0000774366 -0.1924319964
-0.0783304834 -0.0016884108 -0.1820036097
0.0559507543 -0.2293432111 -0.1835018549
0.0543352649 0.2269118769 -0.1834566329
-0.0783304834 -0.0016884108 -0.1820036097
-0.2109962317 -0.2302886986 -0.1805505865
-0.3436619800 -0.4588889864 -0.1790975633
-0.0767149940 -0.4579434989 -0.1820488316
-0.2109962317 -0.2302886986 -0.1805505865
-0.3452774693 -0.0026338983 -0.1790523413
-0.4795587070 0.2250209019 -0.1775540962
-0.4779432176 -0.2312341861 -0.1775993181
-0.3452774693 -0.0026338983 -0.1790523413
-0.2126117211 0.2259663894 -0.1805053646
-0.0799459728 0.4545666772 -0.1819583878
-0.3468929587 0.4536211897 -0.1790071194
-0.2126117211 0.2259663894 -0.1805053646
-0.0782614982 -0.0016887850 -0.1757639059
0.0544042501 0.2269115028 -0.1772169292
0.0560197395 -0.2293435853 -0.1772621511
-0.0782614982 -0.0016887850 -0.1757639059
-0.2125427358 0.2259660153 -0.1742656608
-0.3468239735 0.4536208155 -0.1727674157
-0.0798769876 0.4545663030 -0.1757186840
-0.2125427358 0.2259660153 -0.1742656608
-0.3452084841 -0.0026342725 -0.1728126376
-0.4778742324 -0.2312345603 -0.1713596143
-0.4794897218 0.2250205278 -0.1713143924
-0.3452084841 -0.0026342725 -0.1728126376
-0.2109272465 -0.2302890728 -0.1743108827
-0.0766460088 -0.4579438731 -0.1758091279
-0.3435929948 -0.4588893606 -0.1728578595
-0.2109272465 -0.2302890728 -0.1743108827
0.3515920356 0.1206515290 0.1858431698
0.1097925623 0.1197951103 0.1885164165
0.3507358299 0.3624656736 0.1858671373
0.3515920356 0.1206515290 0.1858431698
0.3524482412 -0.1211626156 0.1858192023
0.3533044468 -0.3629767602 0.1857952348
0.1106487679 -0.1220190343 0.1884924489
0.3524482412 -0.1211626156 0.1858192023
-0.1328631166 0.3607528363 0.1912136306
-0.1320069110 0.1189386917 0.1911896631
-0.3746625899 0.3598964176 0.1938868773
-0.1328631166 0.3607528363 0.1912136306
0.1089363567 0.3616092549 0.1885403840
0.3507358299 0.3624656736 0.1858671373
0.1097925623 0.1197951103 0.1885164165
0.1089363567 0.3616092549 0.1885403840
-0.3729501786 -0.1237318716 0.1938389423
-0.1311507053 -0.1228754529 0.1911656956
-0.3720939729 -0.3655460162 0.1938149747
-0.3729501786 -0.1237318716 0.1938389423
-0.3738063842 0.1180822730 0.1938629098
-0.3746625899 0.3598964176 0.1938868773
-0.1320069110 0.1189386917 0.1911896631
-0.3738063842 0.1180822730 0.1938629098
0.1115049736 -0.3638331789 0.1884684814
0.1106487679 -0.1220190343 0.1884924489
0.3533044468 -0.3629767602 0.1857952348
0.1115049736 -0.3638331789 0.1884684814
-0.1302944997 -0.3646895975 0.1911417281
-0.3720939729 -0.3655460162 0.1938149747
-0.1311507053 -0.1228754529 0.1911656956
-0.1302944997 -0.3646895975 0.1911417281
0.2160543895 0.3476666984 -0.1753542321
0.3175392377 0.1119521271 -0.1764903687
0.4173116746 0.3598658450 -0.1775785703
0.2160543895 0.3476666984 -0.1753542321
0.4190240859 -0.1237624442 -0.1776265053
0.4697665100 -0.2416197298 -0.1781945736
0.4680540987 0.2420085594 -0.1781466386
0.3175392377 0.1119521271 -0.1764903687
0.2185414527 -0.3547428994 -0.1754238517
0.4198802915 -0.3655765888 -0.1776504728
0.3183954434 -0.1298620175 -0.1765143362
0.2185414527 -0.3547428994 -0.1754238517
0.2169105952 0.1058525538 -0.1753781996
0.0654987517 0.2291266841 -0.1736968207
0.0671296093 -0.2314687691 -0.1737424728
0.1170566046 -0.1190283282 -0.1742877151
-0.2011816776 0.2281537408 0.1157847801
-0.0670731513 0.4589293485 0.1143159362
-0.3369210616 0.4579735863 0.1172992762
-0.2011816776 0.2281537408 0.1157847801
-0.0654422937 -0.0016661047 0.1142702841
0.0702970902 -0.2314859502 0.1127557881
0.0686662327 0.2291095030 0.1128014402
-0.0654422937 -0.0016661047 0.1142702841
-0.1995508201 -0.2324417124 0.1157391280
-0.3336593464 -0.4632173201 0.1172079719
-0.0638114361 -0.4622615579 0.1142246320
-0.1995508201 -0.2324417124 0.1157391280
-0.3352902040 -0.0026218669 0.1172536241
-0.4710295879 0.2271979787 0.1187681201
-0.4693987304 -0.2333974745 0.1187224680
-0.3352902040 -0.0026218669 0.1172536241
0.0678743624 0.2291137982 0.0411768750
0.0695052200 -0.2314816550 0.0411312229
0.0678743624 0.2291137982 0.0411768750
0.0670707129 0.3442648092 0.0053760054
0.0679214795 -0.2314730644 -0.1021179076
0.0662906219 0.2291223888 -0.1020722555
0.0679214795 -0.2314730644 -0.1021179076
0.0687251290 -0.3466240753 -0.0663170380
-0.4701906006 -0.2333931793 0.0470979027
-0.4718214582 0.2272022739 0.0471435549
-0.4701906006 -0.2333931793 0.0470979027
-0.4701788214 -0.3485398949 0.0112742071
-0.4734051987 0.2272108645 -0.0961055756
-0.4717743411 -0.2333845887 -0.0961512277
-0.4734051987 0.2272108645 -0.0961055756
-0.4734169779 0.3423575802 -0.0602818800
0.3074445036 -0.0003125965 -0.2006238745
0.3133978426 0.2439335175 -0.1196426995
0.3173691714 -0.2357970092 -0.0927045927
0.3119281273 0.0171450774 -0.1466508332
0.1065908741 0.0164178026 -0.1443806995
0.1041391571 -0.2365522390 -0.0903471995
0.1041142089 0.2431922652 -0.1173289361
0.1100000115 -0.0010119163 -0.1984410003
0.2623939255 0.2350268279 -0.0920685598
0.2640616678 -0.2359858167 -0.0921152444
0.2623939255 0.2350268279 -0.0920685598
0.2353232381 0.3526855853 -0.0917622145
0.1574466607 -0.2363634316 -0.0909365478
0.1557789184 0.2346492130 -0.0908898632
0.1574466607 -0.2363634316 -0.0909365478
0.1845173480 -0.3540221890 -0.0912428931
0.4939918265 0.1249668120 -0.1444375966
0.4930073786 0.2496551784 -0.1935365262
0.4947733028 -0.2490865063 -0.1935859592
0.4959607224 -0.1244099207 -0.0462397376
0.4941947982 0.3743317641 -0.0461903046
0.4950777603 0.1249609217 -0.0462150211
0.4952807320 0.3743258737 0.0520322710
0.4941947982 0.3743317641 -0.0461903046
0.4981325900 -0.1244217013 0.1502054135
0.4991170379 -0.2491100677 0.1993043431
0.4973511137 0.2496316170 0.1993537761
0.4961636941 0.1249550314 0.0520075545
0.4979296183 -0.3737866534 0.0519581215
0.4970466562 -0.1244158110 0.0519828380
0.4968436845 -0.3737807630 -0.0462644541
0.4979296183 -0.3737866534 0.0519581215
0.3305843952 -0.3634881686 -0.0429820470
0.3297271191 -0.1213717078 -0.0429580495
0.3316388163 -0.3634938880 0.0523902187
0.3305843952 -0.3634881686 -0.0429820470
0.3309786854 0.1207333142 0.1478104793
0.3310772579 0.2417886849 0.1955086109
0.3327918101 -0.2424442367 0.1954606159
0.3307815403 -0.1213774272 0.0524142162
0.3290669881 0.3628554944 0.0524622111
0.3299242642 0.1207390336 0.0524382136
0.3280125669 0.3628612138 -0.0429100545
0.3290669881 0.3628554944 0.0524622111
0.3286726979 -0.1213659884 -0.1383303151
0.3285741253 -0.2424213591 -0.1860284467
0.3268595732 0.2418115625 -0.1859804517
0.3288698430 0.1207447530 -0.0429340520
0.4730446451 0.0001715574 0.1996075447
0.4730446451 0.0001715574 0.1996075447
0.4478552145 0.0000823400 0.1998860299
0.3693273269 0.2491781753 0.2007691603
0.3443286471 -0.0002843360 0.2010305818
0.4228565347 -0.2493801713 0.2001474513
0.4687009100 0.0001951187 -0.1932827575
0.4687009100 0.0001951187 -0.1932827575
0.4435114793 0.0001059014 -0.1930042724
0.3667495159 -0.2495399480 -0.1921705749
0.3399849120 -0.0002607747 -0.1918597205
0.4167468754 0.2493850748 -0.1926934179
-0.0111898646 -0.1155158110 -0.1827527323
-0.1446633575 -0.1159885547 -0.1812770981
-0.0103821199 -0.3436433550 -0.1827753432
-0.0111898646 -0.1155158110 -0.1827527323
-0.0119976092 0.1126117331 -0.1827301213
-0.0128053539 0.3407392771 -0.1827075104
-0.1454711022 0.1121389893 -0.1812544871
-0.0119976092 0.1126117331 -0.1827301213
-0.2773291058 -0.3445888425 -0.1798240749
-0.2781368505 -0.1164612985 -0.1798014639
-0.4108025988 -0.3450615863 -0.1783484407
-0.2773291058 -0.3445888425 -0.1798240749
-0.1438556128 -0.3441160988 -0.1812997091
-0.0103821199 -0.3436433550 -0.1827753432
-0.1446633575 -0.1159885547 -0.1812770981
-0.1438556128 -0.3441160988 -0.1812997091
-0.4124180882 0.1111935018 -0.1783032188
-0.2789445952 0.1116662456 -0.1797788530
-0.4132258329 0.3393210458 -0.1782806078
-0.4124180882 0.1111935018 -0.1783032188
-0.4116103435 -0.1169340422 -0.1783258297
-0.4108025988 -0.3450615863 -0.1783484407
-0.2781368505 -0.1164612985 -0.1798014639
-0.4116103435 -0.1169340422 -0.1783258297
-0.1462788469 0.3402665333 -0.1812318762
-0.1454711022 0.1121389893 -0.1812544871
-0.0128053539 0.3407392771 -0.1827075104
-0.1462788469 0.3402665333 -0.1812318762
-0.2797523399 0.3397937896 -0.1797562420
-0.4132258329 0.3393210458 -0.1782806078
-0.2789445952 0.1116662456 -0.1797788530
-0.2797523399 0.3397937896 -0.1797562420
-0.0119286240 0.1126113589 -0.1764904176
-0.1454021170 0.1121386151 -0.1750147834
-0.0127363687 0.3407389029 -0.1764678066
-0.0119286240 0.1126113589 -0.1764904176
-0.0111208793 -0.1155161852 -0.1765130285
-0.0103131347 -0.3436437292 -0.1765356395
-0.1445943723 -0.1159889289 -0.1750373943
-0.0111208793 -0.1155161852 -0.1765130285
-0.2796833547 0.3397934154 -0.1735165382
-0.2788756100 0.1116658714 -0.1735391492
-0.4131568476 0.3393206716 -0.1720409040
-0.2796833547 0.3397934154 -0.1735165382
-0.1462098617 0.3402661591 -0.1749921724
-0.0127363687 0.3407389029 -0.1764678066
-0.1454021170 0.1121386151 -0.1750147834
-0.1462098617 0.3402661591 -0.1749921724
-0.4115413583 -0.1169344164 -0.1720861260
-0.2780678653 -0.1164616727 -0.1735617601
-0.4107336136 -0.3450619605 -0.1721087369
-0.4115413583 -0.1169344164 -0.1720861260
-0.4123491030 0.1111931276 -0.1720635150
-0.4131568476 0.3393206716 -0.1720409040
-0.2788756100 0.1116658714 -0.1735391492
-0.4123491030 0.1111931276 -0.1720635150
-0.1437866276 -0.3441164730 -0.1750600053
-0.1445943723 -0.1159889289 -0.1750373943
-0.0103131347 -0.3436437292 -0.1765356395
-0.1437866276 -0.3441164730 -0.1750600053
-0.2772601206 -0.3445892167 -0.1735843711
-0.4107336136 -0.3450619605 -0.1721087369
-0.2780678653 -0.1164616727 -0.1735617601
-0.2772601206 -0.3445892167 -0.1735843711
0.4689833979 0.1210987685 -0.1328254762
0.4680540987 0.2420085594 -0.1781466386
0.4697665100 -0.2416197298 -0.1781945736
0.4698396035 -0.1207153761 -0.1328494438
0.4691295849 0.3629074759 -0.0421352165
0.4699857905 0.1210933313 -0.0421591840
0.4692026784 0.4838118296 0.0032099133
0.4711343702 0.3628966015 0.1391973679
0.4728467815 -0.1207316877 0.1391494329
0.4737760807 -0.2416414786 0.1844705952
0.4720636694 0.2419868106 0.1845185302
0.4709881832 0.1210878941 0.0485071082
0.4727005945 -0.3625403951 0.0484591731
0.4718443888 -0.1207262505 0.0484831407
0.4726275010 -0.4834447488 0.0031140433
0.4706958091 -0.3625295207 -0.1328734113
-0.4954996912 -0.3659606325 -0.0315141324
-0.4963558969 -0.1241464879 -0.0314901649
-0.4945703921 -0.4868704234 0.0138070299
-0.4934949059 -0.3659715069 0.1498184520
-0.4952073172 0.1176567823 0.1498663870
-0.4951342237 0.2385611360 0.1952115169
-0.4934218124 -0.2450671532 0.1951635818
-0.4953535042 -0.1241519251 0.0591761273
-0.4970659155 0.3594763641 0.0592240623
-0.4962097099 0.1176622195 0.0592000948
-0.4979952147 0.4803861550 0.0139029000
-0.4990707008 0.3594872385 -0.1221085221
-0.4973582896 -0.1241410507 -0.1221564571
-0.4974313831 -0.2450454044 -0.1675015870
-0.4991437944 0.2385828848 -0.1674536519
-0.4982144952 0.1176730939 -0.1221324896
0.3512265680 -0.4838702395 -0.0408824795
0.1094270947 -0.4847266582 -0.0382092328
0.4726275010 -0.4834447488 0.0031140433
0.3532313533 -0.4838811139 0.1404501049
-0.1303675932 -0.4855939512 0.1457965982
-0.2507661335 -0.4860248792 0.1924663677
0.2328328130 -0.4843120418 0.1871198743
0.1104294874 -0.4847320954 0.0524570594
-0.3731694591 -0.4864449327 0.0578035527
-0.1313699859 -0.4855885140 0.0551303060
-0.4945703921 -0.4868704234 0.0138070299
-0.3751742445 -0.4864340583 -0.1235290317
0.1084247021 -0.4847212210 -0.1288755250
0.2288232424 -0.4842902931 -0.1755452945
-0.2547757042 -0.4860031304 -0.1701988011
-0.1323723785 -0.4855830768 -0.0355359862
0.3488041381 0.4833809017 0.0498796828
0.1070046648 0.4825244830 0.0525529294
0.4692026784 0.4838118296 0.0032099133
0.3467993528 0.4833917761 -0.1314529016
-0.1367995938 0.4816789388 -0.1261064083
-0.2582005267 0.4812534480 -0.1701029311
0.2253984198 0.4829662853 -0.1754494244
0.1060022722 0.4825299202 -0.0381133628
-0.3775966744 0.4808170829 -0.0327668695
-0.1357972011 0.4816735016 -0.0354401161
-0.4979952147 0.4803861550 0.0139029000
-0.3755918890 0.4808062085 0.1485657149
0.1080070575 0.4825190458 0.1432192216
0.2294079905 0.4829445365 0.1872157444
-0.2541909561 0.4812316992 0.1925622377
-0.1347948084 0.4816680644 0.0552261761
-0.1341274144 0.3435415447 0.1150503582
-0.1333119857 0.1132438181 0.1150275321
0.0007965407 0.3440194257 0.1135586882
-0.1341274144 0.3435415447 0.1150503582
-0.2690513696 0.3430636636 0.1165420282
-0.4039753248 0.3425857825 0.1180336981
-0.2682359408 0.1127659370 0.1165192021
-0.2690513696 0.3430636636 0.1165420282
0.0024273983 -0.1165760275 0.1135130361
-0.1324965569 -0.1170539086 0.1150047061
0.0032428271 -0.3468737541 0.1134902100
0.0024273983 -0.1165760275 0.1135130361
0.0016119695 0.1137216991 0.1135358622
0.0007965407 0.3440194257 0.1135586882
-0.1333119857 0.1132438181 0.1150275321
0.0016119695 0.1137216991 0.1135358622
-0.2666050833 -0.3478295162 0.1164735500
-0.2674205120 -0.1175317896 0.1164963760
-0.4015290384 -0.3483073973 0.1179652199
-0.2666050833 -0.3478295162 0.1164735500
-0.1316811281 -0.3473516352 0.1149818800
0.0032428271 -0.3468737541 0.1134902100
-0.1324965569 -0.1170539086 0.1150047061
-0.1316811281 -0.3473516352 0.1149818800
-0.4031598960 0.1122880559 0.1180108721
-0.2682359408 0.1127659370 0.1165192021
-0.4039753248 0.3425857825 0.1180336981
-0.4031598960 0.1122880559 0.1180108721
-0.4023444672 -0.1180096707 0.1179880460
-0.4015290384 -0.3483073973 0.1179652199
-0.2674205120 -0.1175317896 0.1164963760
-0.4023444672 -0.1180096707 0.1179880460
0.0686780119 0.1139627873 0.0769777446
0.0686662327 0.2291095030 0.1128014402
0.0702970902 -0.2314859502 0.1127557881
0.0687015705 -0.1163306440 0.0053303533
0.0670707129 0.3442648092 0.0053760054
0.0678861417 0.1139670826 0.0053531793
0.0662670634 0.4594158201 -0.0304248642
0.0654869724 0.3442733997 -0.1378731251
0.0671178300 -0.1163220535 -0.1379187772
0.0671296093 -0.2314687691 -0.1737424728
0.0654987517 0.2291266841 -0.1736968207
0.0670942715 0.1139713779 -0.0662713859
0.0687251290 -0.3466240753 -0.0663170380
0.0679097002 -0.1163263487 -0.0662942120
0.0695287785 -0.4617750863 -0.0305161684
0.0703088695 -0.3466326659 0.0769320924
-0.0646033064 -0.4622572626 0.0426000668
-0.3344512167 -0.4632130248 0.0455834067
-0.0646033064 -0.4622572626 0.0426000668
0.0695287785 -0.4617750863 -0.0305161684
-0.4702023799 -0.1182464636 0.0829215984
-0.4693987304 -0.2333974745 0.1187224680
-0.4710295879 0.2271979787 0.1187681201
-0.4718096789 0.1120555583 0.0113198592
-0.4701788214 -0.3485398949 0.0112742071
-0.4709942501 -0.1182421683 0.0112970331
-0.4701670421 -0.4636866106 -0.0245494886
-0.4717625618 -0.3485313044 -0.1319749234
-0.3360349572 -0.4632044342 -0.0976657238
-0.0661870469 -0.4622486721 -0.1006490637
-0.3360349572 -0.4632044342 -0.0976657238
-0.4701670421 -0.4636866106 -0.0245494886
-0.4733934194 0.1120641488 -0.1319292713
-0.4741970689 0.2272151598 -0.1677301408
-0.4725662114 -0.2333802934 -0.1677757930
-0.4717861204 -0.1182378730 -0.0603275321
-0.4734169779 0.3423575802 -0.0602818800
-0.4726015492 0.1120598536 -0.0603047060
-0.4734287572 0.4575042958 -0.0244581843
-0.4718332375 0.3423489896 0.0829672505
-0.3377129318 0.4579778816 0.0456747109
-0.0678650215 0.4589336438 0.0426913710
-0.3377129318 0.4579778816 0.0456747109
-0.4734287572 0.4575042958 -0.0244581843
-0.0694487620 0.4589422343 -0.1005577595
-0.3392966723 0.4579864722 -0.0975744195
-0.0694487620 0.4589422343 -0.1005577595
0.0662670634 0.4594158201 -0.0304248642
0.0605762797 -0.0011168367 -0.1808595715
0.0605762797 -0.0011168367 -0.1808595715
-0.4841979959 -0.0030463481 -0.1748367461
-0.4841979959 -0.0030463481 -0.1748367461
0.0473755082 -0.0006410421 -0.1554850178
0.0473755082 -0.0006410421 -0.1554850178
-0.4724810556 -0.0024822986 -0.1497376735
-0.4724810556 -0.0024822986 -0.1497376735
0.2588554771 -0.2185470296 -0.2000997690
0.2573112840 0.2175721767 -0.2000565429
0.2588554771 -0.2185470296 -0.2000997690
0.2345609638 -0.3276642461 -0.1998377163
0.1585890380 0.2172225168 -0.1989651058
0.1601332310 -0.2188966895 -0.1990083319
0.1585890380 0.2172225168 -0.1989651058
0.1828835512 0.3263397334 -0.1992271585
0.3956859874 -0.4988309020 0.0039637217
0.3956859874 -0.4988309020 0.0039637217
0.3921541390 0.4986524674 0.0040625877
0.3921541390 0.4986524674 0.0040625877
0.4699857905 0.1210933313 -0.0421591840
0.4699492438 0.0606411544 -0.0648317490
0.4681271922 0.3629129131 -0.1328015087
0.4689833979 0.1210987685 -0.1328254762
0.4698396035 -0.1207153761 -0.1328494438
0.4706958091 -0.3625295207 -0.1328734113
0.4703773466 -0.0602659179 -0.0648437327
0.4708419962 -0.1207208133 -0.0421831515
0.4700954308 0.3024498618 0.0258585108
0.4681271922 0.3629129131 -0.1328015087
0.4705235336 0.1815427895 0.0258465270
0.4709881832 0.1210878941 0.0485071082
0.4701685243 0.4233542155 0.0712036406
0.4681637390 0.4233650899 -0.1101289438
0.4700954308 0.3024498618 0.0258585108
0.4701685243 0.4233542155 0.0712036406
0.4718443888 -0.1207262505 0.0484831407
0.4718809356 -0.0602740736 0.0711557056
0.4737029871 -0.3625458323 0.1391254653
0.4728467815 -0.1207316877 0.1391494329
0.4719905759 0.1210824569 0.1391734004
0.4711343702 0.3628966015 0.1391973679
0.4719905759 0.1210824569 0.1391734004
0.4719540291 0.0606302801 0.1165008354
0.4717347486 -0.3020827810 -0.0195345541
0.4737029871 -0.3625458323 0.1391254653
0.4713066457 -0.1811757087 -0.0195225704
0.4708419962 -0.1207208133 -0.0421831515
0.4716616551 -0.4229871347 -0.0648796840
0.4736664404 -0.4229980091 0.1164529004
0.4717347486 -0.3020827810 -0.0195345541
0.4716616551 -0.4229871347 -0.0648796840
-0.4949619482 -0.3055111743 0.0364915786
-0.4965020839 -0.3659551953 -0.1221804246
-0.4953900510 -0.1846041020 0.0365035624
-0.4953535042 -0.1241519251 0.0591761273
-0.4940326490 -0.4264209652 0.0818127409
-0.4960374343 -0.4264100908 -0.0995198435
-0.4949619482 -0.3055111743 0.0364915786
-0.4940326490 -0.4264209652 0.0818127409
-0.4962097099 0.1176622195 0.0592000948
-0.4957450603 0.0572073240 0.0818606760
-0.4960635228 0.3594709269 0.1498903545
-0.4952073172 0.1176567823 0.1498663870
-0.4943511116 -0.1241573623 0.1498424195
-0.4934949059 -0.3659715069 0.1498184520
-0.4943511116 -0.1241573623 0.1498424195
-0.4948157611 -0.0637024669 0.1271818383
-0.4976036586 0.2990269058 -0.0087816487
-0.4960635228 0.3594709269 0.1498903545
-0.4971755558 0.1781198335 -0.0087936325
-0.4972121025 0.1176676567 -0.0314661974
-0.4985329578 0.4199366967 -0.0541028111
-0.4965281724 0.4199258223 0.1272297733
-0.4976036586 0.2990269058 -0.0087816487
-0.4985329578 0.4199366967 -0.0541028111
-0.4963558969 -0.1241464879 -0.0314901649
-0.4968205465 -0.0636915925 -0.0541507461
-0.4965020839 -0.3659551953 -0.1221804246
-0.4973582896 -0.1241410507 -0.1221564571
-0.4982144952 0.1176730939 -0.1221324896
-0.4990707008 0.3594872385 -0.1221085221
-0.4972486493 0.0572154798 -0.0541387623
-0.4972121025 0.1176676567 -0.0314661974
0.2915284942 -0.4840884221 0.0277855513
0.3502241753 -0.4838648023 -0.1315487717
0.1706287576 -0.4845166314 0.0291221747
0.1104294874 -0.4847320954 0.0524570594
0.4129294272 -0.4836629314 0.0717820741
0.4109246418 -0.4836520570 -0.1095505103
0.2915284942 -0.4840884221 0.0277855513
0.4129294272 -0.4836629314 0.0717820741
-0.1313699859 -0.4855885140 0.0551303060
-0.0706695194 -0.4853757687 0.0771285674
-0.3721670665 -0.4864503699 0.1484698449
-0.1303675932 -0.4855939512 0.1457965982
0.1114318801 -0.4847375326 0.1431233516
0.3532313533 -0.4838811139 0.1404501049
0.1114318801 -0.4847375326 0.1431233516
0.0507314136 -0.4849502779 0.1211250902
-0.3134713853 -0.4862267501 -0.0108644781
-0.3721670665 -0.4864503699 0.1484698449
-0.1925716487 -0.4857985408 -0.0122011015
-0.1323723785 -0.4855830768 -0.0355359862
-0.4348723183 -0.4866522409 -0.0548610009
-0.4328675329 -0.4866631153 0.1264715835
-0.3134713853 -0.4862267501 -0.0108644781
-0.4348723183 -0.4866522409 -0.0548610009
0.1094270947 -0.4847266582 -0.0382092328
0.0487266283 -0.4849394035 -0.0602074942
0.3502241753 -0.4838648023 -0.1315487717
0.1084247021 -0.4847212210 -0.1288755250
-0.1333747712 -0.4855776396 -0.1262022784
-0.3751742445 -0.4864340583 -0.1235290317
-0.1333747712 -0.4855776396 -0.1262022784
-0.0726743047 -0.4853648943 -0.1042040170
0.2306922989 0.1202233196 0.1871797931
0.3520201384 -0.0002555433 0.1858311860
0.1102206651 -0.0011119620 0.1885044327
0.2306922989 0.1202233196 0.1871797931
0.3511639327 0.2415586013 0.1858551536
0.4716355665 0.3628938829 0.1845305140
0.4724917722 0.1210797383 0.1845065465
0.3511639327 0.2415586013 0.1858551536
0.3528763440 -0.2420696879 0.1858072185
0.4733479778 -0.1207344063 0.1844825790
0.4742041835 -0.3625485509 0.1844586114
0.3528763440 -0.2420696879 0.1858072185
0.2315485046 -0.1215908250 0.1871558256
0.1102206651 -0.0011119620 0.1885044327
0.3520201384 -0.0002555433 0.1858311860
0.2315485046 -0.1215908250 0.1871558256
-0.1324350138 0.2398457640 0.1912016469
-0.0119633800 0.3611810456 0.1898770073
-0.0111071743 0.1193669010 0.1898530398
-0.1324350138 0.2398457640 0.1912016469
-0.2537628532 0.3603246269 0.1925502540
-0.3750906927 0.4808034899 0.1938988610
-0.1332912194 0.4816599086 0.1912256144
-0.2537628532 0.3603246269 0.1925502540
0.2298360933 0.3620374642 0.1872037606
0.1085082538 0.4825163272 0.1885523677
0.3503077271 0.4833727459 0.1858791211
0.2298360933 0.3620374642 0.1872037606
0.1093644595 0.2407021826 0.1885284002
-0.0111071743 0.1193669010 0.1898530398
-0.0119633800 0.3611810456 0.1898770073
0.1093644595 0.2407021826 0.1885284002
-0.2520504420 -0.1233036623 0.1925023189
-0.3733782814 -0.0028247993 0.1938509260
-0.1315788081 -0.0019683806 0.1911776794
-0.2520504420 -0.1233036623 0.1925023189
-0.3725220758 -0.2446389439 0.1938269585
-0.4929937096 -0.3659742255 0.1951515981
-0.4938499152 -0.1241600809 0.1951755656
-0.3725220758 -0.2446389439 0.1938269585
-0.3742344871 0.2389893453 0.1938748935
-0.4947061209 0.1176540637 0.1951995331
-0.4955623265 0.3594682083 0.1952235006
-0.3742344871 0.2389893453 0.1938748935
-0.2529066476 0.1185104823 0.1925262864
-0.1315788081 -0.0019683806 0.1911776794
-0.3733782814 -0.0028247993 0.1938509260
-0.2529066476 0.1185104823 0.1925262864
0.1110768708 -0.2429261066 0.1884804652
-0.0093947630 -0.3642613882 0.1898051048
-0.0102509687 -0.1224472436 0.1898290723
0.1110768708 -0.2429261066 0.1884804652
0.2324047102 -0.3634049696 0.1871318581
0.3537325497 -0.4838838325 0.1857832510
0.1119330764 -0.4847402512 0.1884564977
0.2324047102 -0.3634049696 0.1871318581
-0.2511942363 -0.3651178069 0.1924783514
-0.1298663969 -0.4855966698 0.1911297443
-0.3716658701 -0.4864530885 0.1938029910
-0.2511942363 -0.3651178069 0.1924783514
-0.1307226025 -0.2437825252 0.1911537118
-0.0102509687 -0.1224472436 0.1898290723
-0.0093947630 -0.3642613882 0.1898051048
-0.1307226025 -0.2437825252 0.1911537118
0.2876024753 0.4831708749 -0.0174517247
0.3498065308 0.4833754645 0.1405459750
0.1667027386 0.4827426656 -0.0161151014
0.1060022722 0.4825299202 -0.0381133628
0.4080010156 0.4836018028 -0.0641214941
0.4100058009 0.4835909284 0.1172110903
0.2876024753 0.4831708749 -0.0174517247
0.4080010156 0.4836018028 -0.0641214941
-0.1357972011 0.4816735016 -0.0354401161
-0.0755979310 0.4818889655 -0.0587750008
-0.3785990670 0.4808225201 -0.1234331617
-0.1367995938 0.4816789388 -0.1261064083
0.1049998795 0.4825353574 -0.1287796550
0.3467993528 0.4833917761 -0.1314529016
0.1049998795 0.4825353574 -0.1287796550
0.0448006093 0.4823198934 -0.1054447703
-0.3163950115 0.4810271097 0.0345645380
-0.3785990670 0.4808225201 -0.1234331617
-0.1954952749 0.4814553190 0.0332279147
-0.1347948084 0.4816680644 0.0552261761
-0.4367935518 0.4805961817 0.0812343075
-0.4387983372 0.4806070561 -0.1000982769
-0.3163950115 0.4810271097 0.0345645380
-0.4367935518 0.4805961817 0.0812343075
0.1070046648 0.4825244830 0.0525529294
0.0468053947 0.4823090190 0.0758878141
0.3498065308 0.4833754645 0.1405459750
0.1080070575 0.4825190458 0.1432192216
-0.1337924158 0.4816626272 0.1458924683
-0.3755918890 0.4808062085 0.1485657149
-0.1337924158 0.4816626272 0.1458924683
-0.0735931456 0.4818780911 0.1225575836
0.2667968136 0.2298094127 -0.1759223004
0.1154257470 0.3415671251 -0.1742420630
0.2169105952 0.1058525538 -0.1753781996
0.2667968136 0.2298094127 -0.1759223004
0.3166830321 0.3537662717 -0.1764664012
0.3665692505 0.4777231307 -0.1770105020
0.1653119655 0.4655239840 -0.1747861638
0.3166830321 0.3537662717 -0.1764664012
0.3183954434 -0.1298620175 -0.1765143362
0.3682816618 -0.0059051585 -0.1770584370
0.4198802915 -0.3655765888 -0.1776504728
0.4190240859 -0.1237624442 -0.1776265053
0.4181678803 0.1180517004 -0.1776025378
0.4173116746 0.3598658450 -0.1775785703
0.4181678803 0.1180517004 -0.1776025378
0.3682816618 -0.0059051585 -0.1770584370
-0.0129762309 -0.4851467117 -0.1728720478
0.3192108721 -0.3601597441 -0.1765371623
0.1686144574 -0.4671833404 -0.1748786095
0.3699532962 -0.4780170297 -0.1771052306
0.3192108721 -0.3601597441 -0.1765371623
0.2684684481 -0.2423024585 -0.1759690939
0.2177260240 -0.1244451728 -0.1754010256
0.1178720334 -0.3493260548 -0.1743105411
0.2684684481 -0.2423024585 -0.1759690939
0.1669835999 -0.0065878872 -0.1748329573
0.1162411758 0.1112693984 -0.1742648890
0.1154257470 0.3415671251 -0.1742420630
0.1162411758 0.1112693984 -0.1742648890
0.1170566046 -0.1190283282 -0.1742877151
0.1178720334 -0.3493260548 -0.1743105411
0.1669835999 -0.0065878872 -0.1748329573
0.2177260240 -0.1244451728 -0.1754010256
-0.4982875887 -0.0032312598 -0.1674776195
-0.0164010535 0.4821098667 -0.1727761777
-0.4858753913 0.0083595047 -0.1676141517
-0.2101627120 -0.4675597792 -0.1778942948
-0.2101627120 -0.4675597792 -0.1778942948
-0.2134590043 0.4633965944 -0.1778020227
-0.2134590043 0.4633965944 -0.1778020227
0.0607993237 -0.0011180465 -0.1606852643
0.0542410620 -0.0115148949 -0.1475948204
-0.4839749519 -0.0030475580 -0.1546624388
-0.4781496677 0.0078691640 -0.1417076274
0.0603532356 -0.0011156268 -0.2010338787
0.0537860358 -0.0115124267 -0.1887518770
-0.4844210400 -0.0030451383 -0.1950110533
-0.4785293839 -0.0133978107 -0.1828667922
-0.2109799375 -0.4457704143 -0.1526553736
-0.2109799375 -0.4457704143 -0.1526553736
-0.2141256099 0.4426470736 -0.1525673177
-0.2141256099 0.4426470736 -0.1525673177
0.3066724070 0.2177470066 -0.2006022614
0.3104584119 -0.2096433627 -0.1736589669
0.3089142189 0.2264758436 -0.1736157408
0.3141327002 0.3573277375 -0.1061386326
0.3177861070 -0.3535501704 -0.0927162639
0.3127619984 -0.2183612449 -0.1466741755
0.3157014290 0.2352156353 -0.0926579081
0.3104584119 -0.2096433627 -0.1736589669
0.1090675393 -0.2103566600 -0.1714324630
0.1024714148 0.2344604055 -0.0903005149
0.1074247453 -0.2190885196 -0.1444040418
0.1045560927 -0.3543054001 -0.0903588707
0.1028758762 0.3565794965 -0.1038030543
0.1075233462 0.2257625463 -0.1713892369
0.1090675393 -0.2103566600 -0.1714324630
0.1092279149 0.2170476869 -0.1984193872
0.2069808625 -0.4542451820 -0.1455188213
0.2069808625 -0.4542451820 -0.1455188213
0.2894646128 0.1173680704 -0.0923749051
0.3157014290 0.2352156353 -0.0926579081
0.3173691714 -0.2357970092 -0.0927045927
0.2369909804 -0.1183270593 -0.0918088991
0.2353232381 0.3526855853 -0.0917622145
0.2361571093 0.1171792630 -0.0917855568
0.2082525508 0.4703443427 -0.0914558692
0.1287082310 0.3523079704 -0.0905835179
0.1303759733 -0.1187046742 -0.0906302025
0.1041391571 -0.2365522390 -0.0903471995
0.1024714148 0.2344604055 -0.0903005149
0.1828496057 0.1169904556 -0.0911962085
0.1845173480 -0.3540221890 -0.0912428931
0.1836834769 -0.1185158667 -0.0912195508
0.2115880354 -0.4716809464 -0.0915492384
0.2911323552 -0.3536445741 -0.0924215897
0.2116616881 0.4529146238 -0.1455161700
0.2116616881 0.4529146238 -0.1455161700
0.2831499903 -0.1094298130 -0.2003618218
0.3082166001 -0.2183721997 -0.2006454876
0.3066724070 0.2177470066 -0.2006022614
0.2330167708 0.1084549602 -0.1997944901
0.2345609638 -0.3276642461 -0.1998377163
0.2337888673 -0.1096046430 -0.1998161032
0.2102664506 -0.4367814627 -0.1995756636
0.1358387178 -0.3280139060 -0.1987462792
0.1342945247 0.1081053003 -0.1987030531
0.1092279149 0.2170476869 -0.1984193872
0.1107721080 -0.2190715194 -0.1984626134
0.1844277443 -0.1097794729 -0.1992703847
0.1828835512 0.3263397334 -0.1992271585
0.1836556477 0.1082801302 -0.1992487716
0.2071780645 0.4354569499 -0.1994892113
0.2816057973 0.3266893932 -0.2003185956
0.4950777603 0.1249609217 -0.0462150211
0.4949762745 0.0002784457 -0.0953386671
0.4931088644 0.3743376544 -0.1444128801
0.4939918265 0.1249668120 -0.1444375966
0.4948747886 -0.1244040303 -0.1444623131
0.4957577507 -0.3737748727 -0.1444870296
0.4948747886 -0.1244040303 -0.1444623131
0.4949762745 0.0002784457 -0.0953386671
0.4951792462 0.2496433977 0.0029086249
0.4931088644 0.3743376544 -0.1444128801
0.4951792462 0.2496433977 0.0029086249
0.4961636941 0.1249550314 0.0520075545
0.4953822179 0.4990083497 0.1011559170
0.4963666658 0.3743199834 0.1502548465
0.4932103503 0.4990201304 -0.0952892341
0.4952807320 0.3743258737 0.0520322710
0.4970466562 -0.1244158110 0.0519828380
0.4971481420 0.0002666650 0.1011064840
0.4990155521 -0.3737925437 0.1501806970
0.4981325900 -0.1244217013 0.1502054135
0.4972496279 0.1249491410 0.1502301300
0.4963666658 0.3743199834 0.1502548465
0.4972496279 0.1249491410 0.1502301300
0.4971481420 0.0002666650 0.1011064840
0.4969451703 -0.2490982870 0.0028591919
0.4990155521 -0.3737925437 0.1501806970
0.4969451703 -0.2490982870 0.0028591919
0.4959607224 -0.1244099207 -0.0462397376
0.4967421987 -0.4984632390 -0.0953881001
0.4957577507 -0.3737748727 -0.1444870296
0.4989140662 -0.4984750197 0.1010570510
0.4968436845 -0.3737807630 -0.0462644541
0.3306829677 -0.2424327979 0.0047160846
0.3295299740 -0.3634824492 -0.1383543126
0.3306829677 -0.2424327979 0.0047160846
0.3307815403 -0.1213774272 0.0524142162
0.3325946650 -0.4845549781 0.1000643528
0.3326932375 -0.3634996074 0.1477624843
0.3304858226 -0.4845435393 -0.0906801785
0.3316388163 -0.3634938880 0.0523902187
0.3299242642 0.1207390336 0.0524382136
0.3308801128 -0.0003220565 0.1001123477
0.3301214093 0.3628497750 0.1478344768
0.3309786854 0.1207333142 0.1478104793
0.3318359615 -0.1213831466 0.1477864818
0.3326932375 -0.3634996074 0.1477624843
0.3318359615 -0.1213831466 0.1477864818
0.3308801128 -0.0003220565 0.1001123477
0.3289684156 0.2418001237 0.0047640796
0.3301214093 0.3628497750 0.1478344768
0.3289684156 0.2418001237 0.0047640796
0.3288698430 0.1207447530 -0.0429340520
0.3270567183 0.4839223039 -0.0905841886
0.3269581457 0.3628669332 -0.1382823202
0.3291655607 0.4839108651 0.1001603427
0.3280125669 0.3628612138 -0.0429100545
0.3297271191 -0.1213717078 -0.0429580495
0.3287712704 -0.0003106177 -0.0906321836
0.3295299740 -0.3634824492 -0.1383543126
0.3286726979 -0.1213659884 -0.1383303151
0.3278154218 0.1207504724 -0.1383063177
0.3269581457 0.3628669332 -0.1382823202
0.3278154218 0.1207504724 -0.1383063177
0.3287712704 -0.0003106177 -0.0906321836
0.4982340758 0.0002607747 0.1993290596
0.4595669677 0.2494977911 0.1997715038
0.4478552145 0.0000823400 0.1998860299
0.4865223226 -0.2491546763 0.1994435856
0.4210906105 0.2493615134 0.2001968843
0.4228565347 -0.2493801713 0.2001474513
0.4210906105 0.2493615134 0.2001968843
0.4077083086 0.3740011001 0.2003523116
0.3710932510 -0.2495635094 0.2007197273
0.3693273269 0.2491781753 0.2007691603
0.3710932510 -0.2495635094 0.2007197273
0.3844755530 -0.3742030960 0.2005643001
0.4938903407 0.0002843360 -0.1935612427
0.4569891568 -0.2492203323 -0.1931682315
0.4435114793 0.0001059014 -0.1930042724
0.4804126633 0.2496105697 -0.1933972836
0.4185127996 -0.2493566100 -0.1927428509
0.4167468754 0.2493850748 -0.1926934179
0.4185127996 -0.2493566100 -0.1927428509
0.4060134597 -0.3740878656 -0.1926121402
0.3649835917 0.2492017367 -0.1921211419
0.3667495159 -0.2495399480 -0.1921705749
0.3649835917 0.2492017367 -0.1921211419
0.3774829316 0.3739329924 -0.1922518527
3 278 450 150
3 65 450 278
3 278 451 64
3 150 451 278
3 279 452 150
3 59 452 279
3 279 453 65
3 150 453 279
3 280 454 151
3 65 454 280
3 280 455 37
3 151 455 280
3 281 456 151
3 64 456 281
3 281 457 65
3 151 457 281
3 282 458 152
3 66 458 282
3 282 459 64
3 152 459 282
3 283 460 152
3 61 460 283
3 283 461 66
3 152 461 283
3 284 462 153
3 66 462 284
3 284 463 59
3 153 463 284
3 285 464 153
3 64 464 285
3 285 465 66
3 153 465 285
3 286 466 154
3 68 466 286
3 286 467 67
3 154 467 286
3 287 468 154
3 39 468 287
3 287 469 68
3 154 469 287
3 288 470 155
3 68 470 288
3 288 471 61
3 155 471 288
3 289 472 155
3 67 472 289
3 289 473 68
3 155 473 289
3 290 474 156
3 69 474 290
3 290 475 67
3 156 475 290
3 291 476 156
3 37 476 291
3 291 477 69
3 156 477 291
3 292 478 157
3 69 478 292
3 292 479 39
3 157 479 292
3 293 480 157
3 67 480 293
3 293 481 69
3 157 481 293
3 294 482 158
3 71 482 294
3 294 483 70
3 158 483 294
3 295 484 158
3 36 484 295
3 295 485 71
3 158 485 295
3 296 486 159
3 71 486 296
3 296 487 58
3 159 487 296
3 297 488 159
3 70 488 297
3 297 489 71
3 159 489 297
3 298 490 160
3 72 490 298
3 298 491 70
3 160 491 298
3 299 492 160
3 38 492 299
3 299 493 72
3 160 493 299
3 300 494 161
3 72 494 300
3 300 495 36
3 161 495 300
3 301 496 161
3 70 496 301
3 301 497 72
3 161 497 301
3 302 498 162
3 74 498 302
3 302 499 73
3 162 499 302
3 303 500 162
3 60 500 303
3 303 501 74
3 162 501 303
3 304 502 163
3 74 502 304
3 304 503 38
3 163 503 304
3 305 504 163
3 73 504 305
3 305 505 74
3 163 505 305
3 306 506 164
3 75 506 306
3 306 507 73
3 164 507 306
3 307 508 164
3 58 508 307
3 307 509 75
3 164 509 307
3 308 510 165
3 75 510 308
3 308 511 60
3 165 511 308
3 309 512 165
3 73 512 309
3 309 513 75
3 165 513 309
3 514 678 76
3 166 678 514
3 77 679 76
3 514 679 77
3 515 680 166
3 11 680 515
3 515 681 77
3 166 681 515
3 516 682 167
3 77 682 516
3 516 683 55
3 167 683 516
3 77 684 517
3 76 684 77
3 517 685 167
3 76 685 517
3 168 686 78
3 518 686 168
3 518 687 11
3 168 687 518
3 168 688 519
3 78 688 168
3 519 689 76
3 78 689 519
3 520 690 169
3 10 690 520
3 520 691 11
3 169 691 520
3 521 692 169
3 78 692 521
3 521 693 10
3 169 693 521
3 522 694 79
3 170 694 522
3 80 695 79
3 522 695 80
3 523 696 170
3 54 696 523
3 523 697 80
3 170 697 523
3 524 698 171
3 80 698 524
3 524 699 10
3 171 699 524
3 525 700 80
3 171 700 525
3 79 701 80
3 525 701 79
3 172 702 81
3 526 702 172
3 526 703 54
3 172 703 526
3 172 704 527
3 81 704 172
3 527 705 79
3 81 705 527
3 528 706 173
3 55 706 528
3 528 707 54
3 173 707 528
3 529 708 173
3 81 708 529
3 529 709 55
3 173 709 529
3 174 710 83
3 530 710 174
3 530 711 53
3 174 711 530
3 174 712 531
3 83 712 174
3 531 713 82
3 83 713 531
3 532 714 175
3 52 714 532
3 532 715 53
3 175 715 532
3 533 716 175
3 83 716 533
3 533 717 52
3 175 717 533
3 534 718 82
3 176 718 534
3 84 719 82
3 534 719 84
3 535 720 176
3 8 720 535
3 535 721 84
3 176 721 535
3 536 722 177
3 84 722 536
3 536 723 52
3 177 723 536
3 537 724 84
3 177 724 537
3 82 725 84
3 537 725 82
3 178 726 86
3 538 726 178
3 538 727 8
3 178 727 538
3 178 728 539
3 86 728 178
3 539 729 85
3 86 729 539
3 540 730 179
3 9 730 540
3 540 731 8
3 179 731 540
3 541 732 179
3 86 732 541
3 541 733 9
3 179 733 541
3 542 734 85
3 180 734 542
3 87 735 85
3 542 735 87
3 543 736 180
3 53 736 543
3 543 737 87
3 180 737 543
3 544 738 181
3 87 738 544
3 544 739 9
3 181 739 544
3 87 740 545
3 85 740 87
3 545 741 181
3 85 741 545
3 182 742 89
3 546 742 182
3 546 743 55
3 182 743 546
3 182 744 547
3 89 744 182
3 547 745 88
3 89 745 547
3 548 746 183
3 54 746 548
3 548 747 55
3 183 747 548
3 549 748 183
3 89 748 549
3 549 749 54
3 183 749 549
3 550 750 88
3 184 750 550
3 90 751 88
3 550 751 90
3 551 752 184
3 52 752 551
3 551 753 90
3 184 753 551
3 552 754 185
3 90 754 552
3 552 755 54
3 185 755 552
3 553 756 90
3 185 756 553
3 88 757 90
3 553 757 88
3 186 758 92
3 554 758 186
3 554 759 52
3 186 759 554
3 186 760 555
3 92 760 186
3 555 761 91
3 92 761 555
3 556 762 187
3 53 762 556
3 556 763 52
3 187 763 556
3 557 764 187
3 92 764 557
3 557 765 53
3 187 765 557
3 558 766 91
3 188 766 558
3 93 767 91
3 558 767 93
3 559 768 188
3 55 768 559
3 559 769 93
3 188 769 559
3 560 770 189
3 93 770 560
3 560 771 53
3 189 771 560
3 561 772 93
3 189 772 561
3 91 773 93
3 561 773 91
3 310 774 190
3 96 774 310
3 310 775 95
3 190 775 310
3 311 776 190
3 94 776 311
3 311 777 96
3 190 777 311
3 312 778 191
3 96 778 312
3 312 779 10
3 191 779 312
3 313 780 191
3 95 780 313
3 313 781 96
3 191 781 313
3 314 782 192
3 97 782 314
3 314 783 95
3 192 783 314
3 315 784 192
3 54 784 315
3 315 785 97
3 192 785 315
3 316 786 193
3 97 786 316
3 316 787 94
3 193 787 316
3 317 788 193
3 95 788 317
3 317 789 97
3 193 789 317
3 318 790 194
3 99 790 318
3 318 791 98
3 194 791 318
3 319 792 194
3 94 792 319
3 319 793 99
3 194 793 319
3 320 794 195
3 99 794 320
3 320 795 8
3 195 795 320
3 321 796 195
3 98 796 321
3 321 797 99
3 195 797 321
3 322 798 196
3 100 798 322
3 322 799 98
3 196 799 322
3 323 800 196
3 10 800 323
3 323 801 100
3 196 801 323
3 324 802 197
3 100 802 324
3 324 803 94
3 197 803 324
3 325 804 197
3 98 804 325
3 325 805 100
3 197 805 325
3 326 806 198
3 103 806 326
3 326 807 102
3 198 807 326
3 327 808 198
3 101 808 327
3 327 809 103
3 198 809 327
3 328 810 199
3 103 810 328
3 328 811 52
3 199 811 328
3 329 812 199
3 102 812 329
3 329 813 103
3 199 813 329
3 330 814 200
3 104 814 330
3 330 815 102
3 200 815 330
3 331 816 200
3 8 816 331
3 331 817 104
3 200 817 331
3 332 818 201
3 104 818 332
3 332 819 101
3 201 819 332
3 333 820 201
3 102 820 333
3 333 821 104
3 201 821 333
3 334 822 202
3 106 822 334
3 334 823 105
3 202 823 334
3 335 824 202
3 101 824 335
3 335 825 106
3 202 825 335
3 336 826 203
3 106 826 336
3 336 827 54
3 203 827 336
3 337 828 203
3 105 828 337
3 337 829 106
3 203 829 337
3 338 830 204
3 107 830 338
3 338 831 105
3 204 831 338
3 339 832 204
3 52 832 339
3 339 833 107
3 204 833 339
3 340 834 205
3 107 834 340
3 340 835 101
3 205 835 340
3 341 836 205
3 105 836 341
3 341 837 107
3 205 837 341
3 206 838 109
3 562 838 206
3 562 839 10
3 206 839 562
3 206 840 563
3 109 840 206
3 563 841 108
3 109 841 563
3 564 842 207
3 11 842 564
3 564 843 10
3 207 843 564
3 565 844 207
3 109 844 565
3 565 845 11
3 207 845 565
3 566 846 108
3 208 846 566
3 110 847 108
3 566 847 110
3 567 848 208
3 9 848 567
3 567 849 110
3 208 849 567
3 568 850 209
3 110 850 568
3 568 851 11
3 209 851 568
3 569 852 110
3 209 852 569
3 108 853 110
3 569 853 108
3 210 854 112
3 570 854 210
3 570 855 9
3 210 855 570
3 210 856 571
3 112 856 210
3 571 857 111
3 112 857 571
3 572 858 211
3 8 858 572
3 572 859 9
3 211 859 572
3 573 860 211
3 112 860 573
3 573 861 8
3 211 861 573
3 574 862 111
3 212 862 574
3 113 863 111
3 574 863 113
3 575 864 212
3 10 864 575
3 575 865 113
3 212 865 575
3 576 866 213
3 113 866 576
3 576 867 8
3 213 867 576
3 577 868 113
3 213 868 577
3 111 869 113
3 577 869 111
3 342 870 214
3 115 870 342
3 342 871 41
3 214 871 342
3 343 872 214
3 114 872 343
3 343 873 115
3 214 873 343
3 344 874 215
3 115 874 344
3 344 875 11
3 215 875 344
3 345 876 215
3 41 876 345
3 345 877 115
3 215 877 345
3 346 878 114
3 216 878 346
3 346 879 116
3 114 879 346
3 347 880 216
3 55 880 347
3 347 881 116
3 216 881 347
3 348 882 217
3 116 882 348
3 348 883 11
3 217 883 348
3 349 884 116
3 217 884 349
3 349 885 114
3 116 885 349
3 15 886 53
3 55 886 15
3 350 887 218
3 118 887 350
3 350 888 15
3 218 888 350
3 351 889 218
3 55 889 351
3 351 890 118
3 218 890 351
3 352 891 219
3 118 891 352
3 352 892 117
3 219 892 352
3 353 893 219
3 15 893 353
3 353 894 118
3 219 894 353
3 354 895 119
3 117 895 354
3 354 896 220
3 119 896 354
3 355 897 220
3 41 897 355
3 355 898 119
3 220 898 355
3 356 899 221
3 119 899 356
3 356 900 15
3 221 900 356
3 357 901 117
3 119 901 357
3 357 902 221
3 117 902 357
3 17 903 9
3 53 903 17
3 15 53 17
3 41 904 11
3 9 904 41
3 43 905 9
3 17 905 43
3 9 41 43
3 358 578 222
3 121 578 358
3 358 579 120
3 222 579 358
3 359 580 222
3 40 580 359
3 359 581 121
3 222 581 359
3 360 582 223
3 121 582 360
3 360 583 42
3 223 583 360
3 361 584 223
3 120 584 361
3 361 585 121
3 223 585 361
3 362 586 224
3 122 586 362
3 362 587 120
3 224 587 362
3 363 588 224
3 14 588 363
3 363 589 122
3 224 589 363
3 364 590 225
3 122 590 364
3 364 591 40
3 225 591 364
3 365 592 225
3 120 592 365
3 365 593 122
3 225 593 365
3 366 594 226
3 124 594 366
3 366 595 123
3 226 595 366
3 367 596 226
3 16 596 367
3 367 597 124
3 226 597 367
3 368 598 227
3 124 598 368
3 368 599 14
3 227 599 368
3 369 600 227
3 123 600 369
3 369 601 124
3 227 601 369
3 370 602 228
3 125 602 370
3 370 603 123
3 228 603 370
3 371 604 228
3 42 604 371
3 371 605 125
3 228 605 371
3 372 606 229
3 125 606 372
3 372 607 16
3 229 607 372
3 373 608 229
3 123 608 373
3 373 609 125
3 229 609 373
3 126 610 374
3 230 610 126
3 374 611 40
3 230 611 374
3 375 612 230
3 14 612 375
3 230 613 375
3 126 613 230
3 376 614 231
3 40 614 376
3 231 615 376
3 126 615 231
3 377 616 41
3 40 616 377
3 377 617 231
3 41 617 377
3 127 618 378
3 232 618 127
3 378 619 15
3 232 619 378
3 379 620 232
3 41 620 379
3 232 621 379
3 127 621 232
3 380 622 233
3 15 622 380
3 233 623 380
3 127 623 233
3 381 624 14
3 15 624 381
3 381 625 233
3 14 625 381
3 234 626 128
3 14 626 234
3 234 627 16
3 128 627 234
3 235 628 14
3 128 628 235
3 235 629 15
3 14 629 235
3 129 630 382
3 236 630 129
3 382 631 16
3 236 631 382
3 383 632 236
3 42 632 383
3 236 633 383
3 129 633 236
3 384 634 237
3 16 634 384
3 237 635 384
3 129 635 237
3 385 636 17
3 16 636 385
3 385 637 237
3 17 637 385
3 238 638 130
3 17 638 238
3 238 639 15
3 130 639 238
3 239 640 17
3 130 640 239
3 239 641 16
3 17 641 239
3 131 642 386
3 240 642 131
3 386 643 43
3 240 643 386
3 387 644 240
3 17 644 387
3 240 645 387
3 131 645 240
3 388 646 241
3 43 646 388
3 241 647 388
3 131 647 241
3 389 648 42
3 43 648 389
3 389 649 241
3 42 649 389
3 242 650 132
3 42 650 242
3 242 651 40
3 132 651 242
3 243 652 42
3 132 652 243
3 243 653 43
3 42 653 243
3 244 654 133
3 41 654 244
3 244 655 43
3 133 655 244
3 245 656 41
3 133 656 245
3 245 657 40
3 41 657 245
3 46 658 22
3 47 658 46
3 23 659 47
3 22 659 23
3 21 660 20
3 45 660 21
3 44 661 45
3 20 661 44
3 23 906 22
3 21 906 23
3 20 907 21
3 22 907 20
3 46 908 47
3 44 908 46
3 45 909 44
3 47 909 45
3 5 910 47
3 23 910 5
3 47 45 5
3 1 911 5
3 23 911 1
3 21 23 1
3 3 912 21
3 45 912 3
3 7 913 3
3 45 913 7
3 5 45 7
3 1 3 21
3 4 914 22
3 46 914 4
3 22 20 0
3 0 915 22
3 4 915 0
3 2 0 20
3 44 46 4
3 6 916 44
3 20 916 6
3 2 917 6
3 20 917 2
3 4 6 44
3 1 662 0
3 5 662 1
3 4 663 5
3 0 663 4
3 3 918 2
3 1 918 3
3 0 919 1
3 2 919 0
3 2 664 3
3 6 664 2
3 7 665 6
3 3 665 7
3 7 920 5
3 6 920 7
3 4 921 6
3 5 921 4
3 246 922 57
3 390 922 246
3 390 923 49
3 246 923 390
3 391 924 57
3 246 924 391
3 57 925 391
3 13 925 57
3 49 926 63
3 392 926 49
3 392 927 247
3 49 927 392
3 393 928 247
3 13 928 393
3 247 929 393
3 49 929 247
3 248 930 48
3 394 930 248
3 394 931 12
3 248 931 394
3 395 932 48
3 248 932 395
3 48 933 395
3 62 933 48
3 56 934 12
3 396 934 56
3 396 935 249
3 56 935 396
3 397 936 249
3 48 936 397
3 249 937 397
3 56 937 249
3 63 938 49
3 62 938 63
3 48 939 62
3 49 939 48
3 134 940 398
3 250 940 134
3 398 941 13
3 250 941 398
3 399 942 250
3 63 942 399
3 250 943 399
3 134 943 250
3 400 944 251
3 13 944 400
3 251 945 400
3 134 945 251
3 401 946 12
3 13 946 401
3 401 947 251
3 12 947 401
3 135 948 402
3 252 948 135
3 402 949 62
3 252 949 402
3 403 950 252
3 12 950 403
3 252 951 403
3 135 951 252
3 404 952 253
3 62 952 404
3 253 953 404
3 135 953 253
3 405 954 63
3 62 954 405
3 405 955 253
3 63 955 405
3 57 956 13
3 56 956 57
3 12 957 56
3 13 957 12
3 136 958 666
3 254 958 136
3 666 959 49
3 254 959 666
3 667 960 254
3 57 960 667
3 254 961 667
3 136 961 254
3 668 962 255
3 49 962 668
3 255 963 668
3 136 963 255
3 669 964 48
3 49 964 669
3 669 965 255
3 48 965 669
3 137 966 670
3 256 966 137
3 670 967 56
3 256 967 670
3 671 968 256
3 48 968 671
3 256 969 671
3 137 969 256
3 672 970 257
3 56 970 672
3 257 971 672
3 137 971 257
3 673 972 57
3 56 972 673
3 673 973 257
3 57 973 673
3 406 974 138
3 258 974 406
3 406 975 139
3 138 975 406
3 407 976 258
3 34 976 407
3 407 977 139
3 258 977 407
3 408 978 259
3 139 978 408
3 408 979 28
3 259 979 408
3 409 980 139
3 259 980 409
3 409 981 138
3 139 981 409
3 410 982 260
3 140 982 410
3 410 983 34
3 260 983 410
3 411 984 140
3 260 984 411
3 411 985 138
3 140 985 411
3 412 986 35
3 261 986 412
3 412 987 140
3 35 987 412
3 413 988 261
3 34 988 413
3 413 989 140
3 261 989 413
3 414 990 141
3 262 990 414
3 414 991 142
3 141 991 414
3 415 992 262
3 29 992 415
3 415 993 142
3 262 993 415
3 416 994 263
3 142 994 416
3 416 995 35
3 263 995 416
3 417 996 142
3 263 996 417
3 417 997 141
3 142 997 417
3 418 998 264
3 143 998 418
3 418 999 29
3 264 999 418
3 419 1000 143
3 264 1000 419
3 419 1001 141
3 143 1001 419
3 420 1002 28
3 265 1002 420
3 420 1003 143
3 28 1003 420
3 421 1004 265
3 29 1004 421
3 421 1005 143
3 265 1005 421
3 422 1006 266
3 145 1006 422
3 422 1007 51
3 266 1007 422
3 423 1008 145
3 266 1008 423
3 423 1009 144
3 145 1009 423
3 424 1010 50
3 267 1010 424
3 424 1011 145
3 50 1011 424
3 425 1012 267
3 51 1012 425
3 425 1013 145
3 267 1013 425
3 426 1014 144
3 268 1014 426
3 426 1015 146
3 144 1015 426
3 427 1016 268
3 18 1016 427
3 427 1017 146
3 268 1017 427
3 428 1018 269
3 146 1018 428
3 428 1019 50
3 269 1019 428
3 429 1020 146
3 269 1020 429
3 429 1021 144
3 146 1021 429
3 430 1022 270
3 148 1022 430
3 430 1023 18
3 270 1023 430
3 431 1024 148
3 270 1024 431
3 431 1025 147
3 148 1025 431
3 432 1026 19
3 271 1026 432
3 432 1027 148
3 19 1027 432
3 433 1028 271
3 18 1028 433
3 433 1029 148
3 271 1029 433
3 434 1030 147
3 272 1030 434
3 434 1031 149
3 147 1031 434
3 435 1032 272
3 51 1032 435
3 435 1033 149
3 272 1033 435
3 436 1034 273
3 149 1034 436
3 436 1035 19
3 273 1035 436
3 437 1036 149
3 273 1036 437
3 437 1037 147
3 149 1037 437
3 28 29 25
3 25 24 28
3 25 674 24
3 27 674 25
3 26 675 27
3 24 675 26
3 26 27 50
3 50 51 26
3 438 1038 35
3 29 1038 438
3 35 1039 438
3 31 1039 35
3 439 1040 25
3 31 1040 439
3 25 1041 439
3 29 1041 25
3 440 1042 274
3 31 1042 440
3 440 1043 25
3 274 1043 440
3 441 1044 31
3 274 1044 441
3 33 1045 31
3 441 1045 33
3 442 1046 275
3 27 1046 442
3 442 1047 33
3 275 1047 442
3 443 1048 27
3 275 1048 443
3 25 1049 27
3 443 1049 25
3 27 33 18
3 18 50 27
3 35 34 30
3 30 31 35
3 30 676 31
3 32 676 30
3 33 677 32
3 31 677 33
3 33 32 19
3 19 18 33
3 444 1050 28
3 34 1050 444
3 28 1051 444
3 24 1051 28
3 445 1052 30
3 24 1052 445
3 30 1053 445
3 34 1053 30
3 446 1054 276
3 24 1054 446
3 446 1055 30
3 276 1055 446
3 447 1056 24
3 276 1056 447
3 26 1057 24
3 447 1057 26
3 448 1058 277
3 32 1058 448
3 448 1059 26
3 277 1059 448
3 449 1060 32
3 277 1060 449
3 30 1061 32
3 449 1061 30
3 32 26 51
3 51 19 32