OFF
1003 1136 0
0.4606056148 -0.0869297513 -0.2054152977
0.4606103453 -0.1101947384 -0.2137316261
-0.4976623084 -0.2267835249 0.1271837844
-0.4976573707 -0.2214012701 0.1121268916
0.3875498362 -0.1215974886 -0.1106760427
0.3874781122 -0.2329175561 0.1151606096
-0.4289136578 -0.2355384463 0.1209446462
-0.4389639639 -0.2339297791 0.1186145192
0.4999960932 -0.2151062006 0.1176050492
0.4180664660 -0.1418593039 -0.0524782253
0.4180857678 -0.1208195805 -0.1113369882
-0.2762160152 -0.0282521879 0.0677424670
-0.4411976092 0.0473432371 0.1942830696
-0.4411594851 -0.2193434721 0.1442795184
-0.1278036213 -0.0304690559 -0.0141216869
-0.1278514690 0.2048520228 0.0699964503
-0.1278232956 -0.0519148134 0.0458729591
-0.1278711433 0.1834062653 0.1299910962
-0.4212470464 -0.0636635371 0.1591495935
-0.3874197084 -0.2318415042 0.1152497811
0.4976977484 -0.2267015063 0.1275205130
0.4977026857 -0.2213196057 0.1124646113
0.4235713255 -0.0635990354 0.1594496956
-0.4163875728 0.1194717925 0.0944109946
-0.4163952975 0.0916404476 0.1221385740
-0.4163529797 -0.2093730725 0.0677071641
-0.4162961764 -0.1215131955 -0.1110839005
-0.4163677591 0.2330590800 0.0142199126
-0.4163905314 0.2082364368 0.0836614182
-0.4163872693 0.1850530450 0.0794610155
0.4164825252 -0.1214439442 -0.1108039339
0.4164257222 -0.2093034668 0.0679861395
0.1387493527 0.2090979758 0.0815670290
0.1388006271 -0.0430760001 -0.0085753637
0.1387351010 0.1935630969 0.1250259536
0.1387863754 -0.0586108790 0.0348835608
-0.4389720406 -0.0712013566 0.0767440871
0.3199701726 -0.1246652606 0.1358174027
0.1197848854 -0.0339676199 -0.0265430962
0.1197238981 -0.2400905717 0.1894450986
0.1197160737 -0.1906965140 0.2008551625
0.4682838414 -0.2216790814 0.0944547191
0.4893946308 -0.2193716033 0.1444416027
0.4239940892 -0.2317637382 0.1136925561
0.4239530298 0.0572392636 0.1671629010
0.4608493699 -0.2216796490 0.0944520782
0.4609146235 -0.1214405518 -0.1107881505
-0.4033235781 -0.0419565718 0.1817439022
-0.1390544158 0.2090767656 0.0814683457
-0.1390031414 -0.0430972103 -0.0086740471
-0.1390686675 0.1935418867 0.1249272702
-0.1390173931 -0.0586320892 0.0347848775
0.4999605532 0.0569290262 0.1680740264
0.4999581028 0.0542495617 0.1755479562
0.4605002661 0.2323887190 0.0165940286
0.4605672427 -0.0970109352 -0.1011535418
0.4605049963 0.2091249213 0.0082781254
0.4605719730 -0.1202750302 -0.1094695513
0.4605316311 0.2665777824 -0.0790500982
0.4605363613 0.2433139847 -0.0873660014
-0.1188133321 -0.1906037588 0.2008168037
-0.1187949590 -0.0892085797 0.1273015416
-0.1188054937 -0.2399688018 0.1893612203
-0.1187444857 -0.0341896134 -0.0266112465
-0.1187984683 -0.2603781888 0.1739703883
-0.1187078832 -0.1216343993 -0.1108563741
-0.1188063273 -0.1327799347 0.1686694657
-0.1387417954 0.2090767894 0.0814684567
-0.1386905210 -0.0430971865 -0.0086739360
-0.1387560471 0.1935419105 0.1249273813
-0.1387047727 -0.0586320654 0.0347849886
-0.4608483595 0.0452955553 0.1999877876
-0.4608165133 0.1194684004 0.0943952123
-0.4607966996 0.2330556879 0.0142041302
-0.4608194719 0.2082330446 0.0836456359
-0.4608111606 -0.2145875411 0.1511262965
-0.4608162098 0.1850496528 0.0794452332
-0.4608314539 0.0694494146 0.1472053386
-0.3977687230 0.0110929498 0.0687052094
-0.4415694024 -0.1711901047 0.1515168960
0.3020253422 -0.1029610339 0.1583989700
0.4814443797 -0.2354636261 0.1212531622
0.3822042817 0.0328563976 0.0915718466
-0.0000056361 -0.2447701927 0.2026067984
0.0000016574 -0.2665777824 0.1867619940
0.0000596950 -0.0341815340 -0.0265693984
-0.0000134736 -0.1953978697 0.2140582772
-0.0000061896 -0.1389491555 0.1814205087
0.0000059682 -0.0927457528 0.1372643839
0.0000962976 -0.1216267163 -0.1108146677
0.4390234697 -0.2342458387 0.1189101875
0.4390964174 -0.1215918111 -0.1106582271
0.2997063013 -0.1195876330 0.1595049521
-0.3873917377 -0.0342100528 -0.0267100050
0.4390097782 -0.2219091067 0.1399857017
0.4390206223 -0.0711315594 0.0770513720
0.4390083953 -0.1169926535 0.1213287410
0.4390545516 -0.0341473800 -0.0264121102
0.4214015824 0.0630369820 0.1509860713
0.5000000000 -0.2177092707 0.1249453226
0.4911868243 0.0622909000 0.1531098090
0.4893543816 0.0474660131 0.1944689155
0.4056296529 -0.0418948085 0.1820312641
-0.4239494402 -0.2318348559 0.1134091850
-0.4239904986 0.0571692087 0.1668765564
-0.2546735571 -0.1216437469 -0.1109031856
-0.2547505677 -0.2395982574 0.1312418410
-0.2547592062 -0.2250060430 0.1524238473
-0.4679259376 0.0694488730 0.1472028184
0.3926284589 0.0396811867 0.0802656455
-0.4168550265 0.2090555556 0.0813696634
-0.4168037521 -0.0431184203 -0.0087727293
-0.4168692782 0.1935206767 0.1248285880
-0.4168180038 -0.0586532992 0.0346861953
-0.4912143266 0.0622098707 0.1527776837
-0.4214278131 0.0629669634 0.1507025345
-0.4894088988 0.0473856159 0.1941370913
0.4168615312 0.2091192096 0.0816658219
0.4169128056 -0.0430547663 -0.0084765708
0.4168472795 0.1935843307 0.1251247464
0.4168985539 -0.0585896452 0.0349823537
0.4296483862 -0.0598683291 0.1752029459
-0.3902614919 0.0396214133 0.0799875420
-0.3873519770 -0.1216548806 -0.1109562644
-0.4179840401 0.2118077143 0.0736698379
-0.4179121162 -0.1419231306 -0.0527751873
-0.4179647383 0.2328474377 0.0148110750
-0.4178928144 -0.1208834072 -0.1116339502
0.4906721908 -0.2259374713 0.1022200143
0.4906650607 -0.2337095168 0.1239623618
0.1198224900 -0.1214021077 -0.1106481679
0.1197319217 -0.2605661946 0.1742217377
0.2786010236 -0.0282098278 0.0679395529
-0.4389861270 -0.1156827394 0.1215146487
0.2547834545 -0.1180896156 0.1242833288
0.2547956814 -0.0722164840 0.0800035559
0.2547840049 -0.2239252845 0.1454811557
0.2548305998 -0.0341310690 -0.0264812248
0.2547761698 -0.1745488385 0.1569251657
-0.4906260248 -0.2337889745 0.1236311623
-0.4906188941 -0.2260162205 0.1018868325
0.1188113255 -0.0891629418 0.1272996420
0.1187999584 -0.1328031225 0.1686787339
-0.3874379589 -0.1130913506 0.1144352619
-0.3874254423 -0.0686545707 0.0696487560
-0.3874452429 -0.1695400649 0.1470730305
-0.2696664069 -0.0314247867 0.0525740367
-0.4814037842 -0.2355424539 0.1209260003
0.4289536217 -0.2354676338 0.1212345160
-0.4179664201 -0.0485867372 0.1867086961
0.4202689236 -0.0485227382 0.1870064597
0.4679017178 0.0695263464 0.1475183996
0.1499990946 -0.0304478457 -0.0140230039
0.1499512469 0.2048732330 0.0700951332
0.1499794203 -0.0518936032 0.0459716420
0.1499315726 0.1834274754 0.1300897792
-0.3996308337 0.0282743908 0.0681773681
0.2965437486 -0.0499130635 0.0453583391
-0.4999643131 -0.2177912866 0.1246059673
0.2720616254 -0.0313834259 0.0527664730
-0.2547618648 -0.1191832639 0.1312370617
-0.2547122644 -0.0341990034 -0.0266591916
-0.2547691489 -0.1756332246 0.1638755025
-0.2547493685 -0.0746463756 0.0864863406
0.4057152304 -0.0304283218 -0.0139321667
0.4056673827 0.2048927568 0.0701859705
0.4056955561 -0.0518740794 0.0460624792
0.4056477084 0.1834469993 0.1301806164
-0.3874237218 -0.2189120895 0.1356216628
-0.2973713344 -0.1196332197 0.1592928542
0.4355032636 0.2323868104 0.0165851490
0.4355702402 -0.0970128438 -0.1011624214
0.4355079938 0.2091230128 0.0082692458
0.4355749705 -0.1202769387 -0.1094784309
0.4355346286 0.2665758738 -0.0790589778
0.4356065071 -0.0869316600 -0.2054241780
0.4356112376 -0.1101966470 -0.2137405064
0.4355393588 0.2433120762 -0.0873748810
-0.2790357485 -0.0427691181 0.0407625891
-0.4389366337 -0.0342152620 -0.0267310061
-0.4389682186 -0.2206003386 0.1401723230
0.4414576826 -0.1724930166 0.1513161387
-0.4607918441 -0.2217556850 0.0941405453
-0.4607265905 -0.1215165877 -0.1110996833
-0.4273357620 -0.0599337596 0.1748985222
0.4960550005 -0.2295567864 0.1301076535
-0.3798443077 0.0327982154 0.0913011465
0.2548703523 -0.1215744588 -0.1107046137
0.2547953124 -0.2365624278 0.1252551115
-0.3067406764 -0.1309792509 0.1474830346
0.1390609205 0.2090979996 0.0815671397
0.1391121949 -0.0430759763 -0.0085752531
0.1390466688 0.1935631207 0.1250260642
0.1390979432 -0.0586108552 0.0348836715
-0.1498870436 -0.0304707419 -0.0141295315
-0.1499348913 0.2048503368 0.0699886057
-0.1499067179 -0.0519164995 0.0458651144
-0.1499545656 0.1834045792 0.1299832516
-0.5000000000 0.0541675463 0.1752086030
-0.4999975496 0.0568470108 0.1677346733
-0.4354528070 0.2323203132 0.0162757621
-0.4353858304 -0.0970791428 -0.1014717375
-0.4354480768 0.2090565156 0.0079598589
-0.4353811001 -0.1203434360 -0.1097878179
-0.4354214420 0.2665093766 -0.0793683647
-0.4353495635 -0.0869981573 -0.2057335649
-0.4354167118 0.2432455790 -0.0876842680
-0.4353448333 -0.1102617567 -0.2140493973
0.4608192162 0.2083094347 0.0839561767
0.4608224783 0.1851260429 0.0797557740
0.4608419881 0.2331317236 0.0145156622
0.4608072342 0.0695258047 0.1475158794
0.4607903286 0.0453719454 0.2002983284
0.4608275272 -0.2145115053 0.1514378285
0.4608221745 0.1195444361 0.0947067443
-0.4960225418 -0.2296385545 0.1297720909
-0.4388969790 -0.1216603028 -0.1109751060
0.4179966472 0.2118715412 0.0739668006
0.4180159491 0.2329112646 0.0151080377
0.3874784764 -0.0685968242 0.0699279873
0.3874662494 -0.1144579183 0.1142053563
0.3874589650 -0.1709064913 0.1468442932
0.3875100758 -0.0341523065 -0.0264307745
0.3874668029 -0.2202789555 0.1353916461
-0.3176175961 -0.1247139402 0.1355909144
0.3090847111 -0.1309322328 0.1477017922
-0.4999559046 -0.2151882156 0.1172656982
-0.4604507568 0.2323184046 0.0162668822
-0.4603837802 -0.0970810514 -0.1014806174
-0.4604460266 0.2090546070 0.0079509789
-0.4603790499 -0.1203453446 -0.1097966978
-0.4604193918 0.2665074680 -0.0793772447
-0.4603475133 -0.0870000659 -0.2057424449
-0.4604146616 0.2432436704 -0.0876931479
-0.4603427831 -0.1102636652 -0.2140582772
0.1279146197 -0.0304495318 -0.0140308489
0.1278667720 0.2048715468 0.0700872883
0.1278949454 -0.0518952894 0.0459637970
0.1278470977 0.1834257893 0.1300819342
0.4163902757 0.2083060426 0.0839403943
0.4163935378 0.1851226507 0.0797399916
0.4164130476 0.2331283315 0.0144998799
0.4163855090 0.0917093448 0.1224195324
0.4163932340 0.1195410440 0.0946909619
-0.2996942330 -0.1030069750 0.1581852231
0.2814421409 -0.0427263258 0.0409616858
-0.4056052845 -0.0304902659 -0.0142203694
-0.4056531323 0.2048308127 0.0698977677
-0.4056249589 -0.0519360235 0.0457742765
-0.4056728066 0.1833850552 0.1298924136
-0.4893722280 -0.2194516465 0.1441087861
0.4001459547 0.0111538704 0.0689886501
-0.4682255788 -0.2217562525 0.0941379046
-0.2941393785 -0.0499581619 0.0451485126
0.4020068690 0.0283355956 0.0684621312
0.4411815530 -0.2192700824 0.1445760997
0.4411434289 0.0474166268 0.1945796509
0.3421148120 -0.0350523182 0.1249854083
0.3421148120 -0.0350523182 0.1249854083
0.3600580637 -0.0567556951 0.1024030264
0.3600580637 -0.0567556951 0.1024030264
-0.3397692704 -0.0351043798 0.1247431848
-0.3397692704 -0.0351043798 0.1247431848
-0.3576931595 -0.0568104952 0.1021480619
-0.3576931595 -0.0568104952 0.1021480619
0.4239735595 -0.0872622373 0.1404277286
-0.4239699694 -0.0873328236 0.1401428707
0.0000615673 0.0560139287 -0.0482629562
0.0000964767 -0.1208514938 -0.1114854692
0.2090736676 -0.0324028259 -0.0797999722
0.1045850721 -0.0766271599 -0.0956427207
0.1045676175 0.0118055514 -0.0640314642
0.0000790220 -0.0324187826 -0.0798742127
0.2090911222 -0.1208355371 -0.1114112287
0.3135797177 -0.0766112032 -0.0955684802
0.1045850721 -0.0766271599 -0.0956427207
-0.2089156235 -0.0324347392 -0.0799484532
-0.2088981688 -0.1208674505 -0.1115597097
-0.1044095734 -0.0766431165 -0.0957169612
-0.3134042190 -0.0766590732 -0.0957912017
-0.1044270281 0.0117895947 -0.0641057047
-0.1044095734 -0.0766431165 -0.0957169612
0.0000790220 -0.0324187826 -0.0798742127
0.2090387582 0.1444625967 -0.0165774592
0.2090736676 -0.0324028259 -0.0797999722
0.3135622630 0.0118215081 -0.0639572237
0.2090562129 0.0560298854 -0.0481887157
0.3135797177 -0.0766112032 -0.0955684802
0.1045501628 0.1002382627 -0.0324202077
0.1045676175 0.0118055514 -0.0640314642
0.2090562129 0.0560298854 -0.0481887157
0.4180508584 0.0560458421 -0.0481144752
0.3135273536 0.1886869306 -0.0007347108
0.3135448083 0.1002542194 -0.0323459672
0.4180334037 0.1444785533 -0.0165032188
0.3135622630 0.0118215081 -0.0639572237
0.4180683131 -0.0323868692 -0.0797257317
0.3135448083 0.1002542194 -0.0323459672
0.0000615673 0.0560139287 -0.0482629562
0.0000256054 0.2328793512 0.0149595564
-0.2089515855 0.1444306832 -0.0167259406
-0.1044629900 0.1886550172 -0.0008831921
-0.1044450091 0.1002223060 -0.0324944484
0.0000435864 0.1444466399 -0.0166516999
-0.2089695665 0.2328633944 0.0148853157
-0.3134581619 0.1886390605 -0.0009574328
-0.1044629900 0.1886550172 -0.0008831921
0.2090387582 0.1444625967 -0.0165774592
0.2090207772 0.2328953079 0.0150337971
0.1045321818 0.1886709739 -0.0008089514
0.3135273536 0.1886869306 -0.0007347108
0.1045501628 0.1002382627 -0.0324202077
0.1045321818 0.1886709739 -0.0008089514
0.0000435864 0.1444466399 -0.0166516999
-0.2089156235 -0.0324347392 -0.0799484532
-0.2089515855 0.1444306832 -0.0167259406
-0.3134401809 0.1002063492 -0.0325686891
-0.2089336045 0.0559979720 -0.0483371969
-0.3134581619 0.1886390605 -0.0009574328
-0.1044450091 0.1002223060 -0.0324944484
-0.2089336045 0.0559979720 -0.0483371969
-0.1044270281 0.0117895947 -0.0641057047
-0.4179287763 0.0559820153 -0.0484114376
-0.3134221999 0.0117736380 -0.0641799454
-0.4179107954 -0.0324506960 -0.0800226939
-0.3134042190 -0.0766590732 -0.0957912017
-0.3134401809 0.1002063492 -0.0325686891
-0.4179467573 0.1444147265 -0.0168001813
-0.3134221999 0.0117736380 -0.0641799454
0.0000412129 0.0349742052 0.0105958063
0.0000771749 -0.1418912173 -0.0526267063
-0.2089354517 -0.0534744627 -0.0210896905
-0.1044471194 -0.0092501288 -0.0052469421
0.0000591939 -0.0534585060 -0.0210154500
-0.1044291384 -0.0976828400 -0.0368581984
-0.2089174707 -0.1419071739 -0.0527009468
-0.3134237839 -0.0976987967 -0.0369324389
-0.1044291384 -0.0976828400 -0.0368581984
0.2090538394 -0.0534425494 -0.0209412095
0.2090718204 -0.1418752606 -0.0525524658
0.1045655072 -0.0976668833 -0.0367839579
0.3135601527 -0.0976509266 -0.0367097174
0.1045475262 -0.0092341721 -0.0051727016
0.1045655072 -0.0976668833 -0.0367839579
0.0000591939 -0.0534585060 -0.0210154500
-0.2089714136 0.1233909597 0.0421328221
-0.2089354517 -0.0534744627 -0.0210896905
-0.3134417649 -0.0092660854 -0.0053211826
-0.2089534326 0.0349582485 0.0105215658
-0.3134237839 -0.0976987967 -0.0369324389
-0.1044471194 -0.0092501288 -0.0052469421
-0.2089534326 0.0349582485 0.0105215658
-0.1044651003 0.0791825825 0.0263643142
-0.4179480782 0.0349422918 0.0104473253
-0.3134597459 0.0791666258 0.0262900737
-0.4179660592 0.1233750031 0.0420585816
-0.3134777269 0.1675993370 0.0579013300
-0.3134417649 -0.0092660854 -0.0053211826
-0.4179300972 -0.0534904194 -0.0211639310
-0.3134597459 0.0791666258 0.0262900737
0.0000412129 0.0349742052 0.0105958063
0.0000063036 0.2118396277 0.0738183193
0.2090189301 0.1234228732 0.0422813035
0.1045300715 0.0791985392 0.0264385549
0.0000237582 0.1234069165 0.0422070628
0.1045126168 0.1676312505 0.0580498114
0.2090014754 0.2118555845 0.0738925600
0.3135077887 0.1676472072 0.0581240520
0.1045126168 0.1676312505 0.0580498114
-0.2089714136 0.1233909597 0.0421328221
-0.2089888683 0.2118236710 0.0737440786
-0.1044825550 0.1676152937 0.0579755707
-0.3134777269 0.1675993370 0.0579013300
-0.1044825550 0.1676152937 0.0579755707
0.0000237582 0.1234069165 0.0422070628
-0.1044651003 0.0791825825 0.0263643142
0.2090189301 0.1234228732 0.0422813035
0.4180315566 0.0350061186 0.0107442876
0.3135426980 -0.0092182154 -0.0050984609
0.3135252433 0.0792144959 0.0265127956
0.4180490113 -0.0534265926 -0.0208669688
0.3135077887 0.1676472072 0.0581240520
0.4180141019 0.1234388299 0.0423555441
0.3135252433 0.0792144959 0.0265127956
0.2090538394 -0.0534425494 -0.0209412095
0.1045300715 0.0791985392 0.0264385549
0.2090363848 0.0349901619 0.0106700470
0.1045475262 -0.0092341721 -0.0051727016
0.3135426980 -0.0092182154 -0.0050984609
0.3135601527 -0.0976509266 -0.0367097174
0.2090363848 0.0349901619 0.0106700470
0.2778135643 0.0657766980 0.0880761292
0.4056716322 0.0657864600 0.0881215478
0.3417545602 0.0069513093 0.0670693042
0.3417306363 0.1246118487 0.1091283728
0.2778374882 -0.0518838413 0.0460170606
0.2138964923 0.0069415474 0.0670238856
0.3417545602 0.0069513093 0.0670693042
0.2778135643 0.0657766980 0.0880761292
0.1499554964 0.0657669361 0.0880307106
0.2138725684 0.1246020867 0.1090829542
0.2138964923 0.0069415474 0.0670238856
0.2777896405 0.1834372374 0.1301351978
0.3417306363 0.1246118487 0.1091283728
0.2138725684 0.1246020867 0.1090829542
0.0000119010 0.0657554880 0.0879774466
0.1278710215 0.0657652500 0.0880228656
0.0639534232 0.0069300993 0.0669706218
0.0639294994 0.1245906386 0.1090296904
0.0000358249 -0.0519050514 0.0459183780
-0.0639056973 0.0069203373 0.0669252028
0.0639534232 0.0069300993 0.0669706218
0.0000119010 0.0657554880 0.0879774466
-0.1278472195 0.0657457259 0.0879320276
-0.0639296211 0.1245808766 0.1089842714
-0.0639056973 0.0069203373 0.0669252028
-0.0000120228 0.1834160273 0.1300365152
0.0639294994 0.1245906386 0.1090296904
-0.0639296211 0.1245808766 0.1089842714
-0.2777897622 0.0657342779 0.0878787640
-0.4056488827 0.0657245159 0.0878333451
-0.3417312844 0.1245596665 0.1088855888
-0.3417073606 0.0068991272 0.0668265203
-0.2778136861 0.1833948172 0.1299378326
-0.2138721639 0.1245694285 0.1089310078
-0.3417312844 0.1245596665 0.1088855888
-0.2777897622 0.0657342779 0.0878787640
-0.1499306417 0.0657440399 0.0879241830
-0.2138482401 0.0069088892 0.0668719392
-0.2138721639 0.1245694285 0.1089310078
-0.2777658384 -0.0519262615 0.0458196955
-0.3417073606 0.0068991272 0.0668265203
-0.2138482401 0.0069088892 0.0668719392
0.0000868258 -0.1313713555 -0.0820560878
0.2090862968 -0.1260954680 -0.0966965380
0.2090766459 -0.1366153297 -0.0672671565
0.3135763814 -0.1339773860 -0.0745873817
0.0000964767 -0.1208514938 -0.1114854692
-0.2089029943 -0.1261273814 -0.0968450190
0.2090862968 -0.1260954680 -0.0966965380
0.0000868258 -0.1313713555 -0.0820560878
-0.2089126452 -0.1366472431 -0.0674156375
-0.2089029943 -0.1261273814 -0.0968450190
-0.3134027298 -0.1287653251 -0.0895247939
0.0000771749 -0.1418912173 -0.0526267063
0.2090766459 -0.1366153297 -0.0672671565
-0.2089126452 -0.1366472431 -0.0674156375
0.0000159545 0.2223594894 0.0443889378
-0.2089743919 0.2276034636 0.0296000064
-0.2089840428 0.2170836019 0.0590293879
-0.3134792160 0.2197055889 0.0516349222
0.0000256054 0.2328793512 0.0149595564
0.2090159518 0.2276353770 0.0297484878
-0.2089743919 0.2276034636 0.0296000064
0.0000159545 0.2223594894 0.0443889378
0.2090063009 0.2171155153 0.0591778692
0.2090159518 0.2276353770 0.0297484878
0.3135111250 0.2250133900 0.0371429535
0.0000063036 0.2118396277 0.0738183193
-0.2089840428 0.2170836019 0.0590293879
0.2090063009 0.2171155153 0.0591778692
0.2777983161 0.2013411533 0.1033458877
0.2777983161 0.2013411533 0.1033458877
-0.0000038735 0.2013199431 0.1032472049
-0.0000038735 0.2013199431 0.1032472049
-0.2778055368 0.2012987330 0.1031485224
-0.2778055368 0.2012987330 0.1031485224
0.4168800425 0.0752647822 0.0583240878
0.4168800425 0.0752647822 0.0583240878
-0.4168365151 0.0752011282 0.0580279294
-0.4168365151 0.0752011282 0.0580279294
0.4386622567 0.0558438897 -0.0481441359
0.4386622567 0.0558438897 -0.0481441359
-0.4385464380 0.0557712462 -0.0484398851
-0.4385464380 0.0557712462 -0.0484398851
0.4608357722 -0.0510676065 0.0945794112
0.4608359241 -0.0182768031 0.0871039261
0.4608685509 0.0318427455 -0.0155161882
0.4608752738 -0.0698586774 -0.0118421122
0.4608292012 0.0834246199 0.0834298500
0.4608819967 -0.1715601004 -0.0081680362
0.4608426470 -0.1199782260 0.0907780021
0.4608752738 -0.0698586774 -0.0118421122
0.4608669198 0.0434344414 -0.0134159869
0.4608544540 0.1382830825 0.0005498377
0.4608783058 0.0558455859 -0.0481362441
0.4164096300 -0.0120904081 0.0738630656
0.4164460776 -0.0667671761 -0.0184704342
0.4164176761 -0.1106969375 0.0709246025
0.4164541237 -0.1653737055 -0.0214088972
0.4164380315 0.0318393533 -0.0155319711
0.4164015839 0.0865161213 0.0768015286
0.4164460776 -0.0667671761 -0.0184704342
0.4164364005 0.0434310492 -0.0134317698
0.4164477864 0.0558421937 -0.0481520270
0.4164247240 0.1382796903 0.0005340550
-0.4608041787 -0.0511436423 0.0942678788
-0.4608040269 -0.0183530161 0.0867928892
-0.4607592173 -0.1716361364 -0.0084795690
-0.4607653087 -0.0699348019 -0.0121533971
-0.4607979355 -0.1200543505 0.0904667173
-0.4607714001 0.0317665325 -0.0158272251
-0.4608101184 0.0833483184 0.0831190612
-0.4607653087 -0.0699348019 -0.0121533971
-0.4607730312 0.0433582284 -0.0137270237
-0.4607616451 0.0557695501 -0.0484477765
-0.4607848654 0.1382069582 0.0002385533
-0.4163701245 -0.0121600137 0.0735840898
-0.4163417228 0.0317699247 -0.0158114425
-0.4163331504 -0.0668366046 -0.0187499053
-0.4163786969 0.0864465156 0.0765225527
-0.4163331504 -0.0668366046 -0.0187499053
-0.4163245780 -0.1654431340 -0.0216883682
-0.4163615521 -0.1107665431 0.0706456270
-0.4163433539 0.0433616206 -0.0137112411
-0.4163555565 0.1382103503 0.0002543357
-0.4163319678 0.0557729423 -0.0484319939
0.0594355102 -0.0616722379 0.0503651218
0.0594355102 -0.0616722379 0.0503651218
-0.0593692587 -0.0634676831 0.0553265687
-0.0593692587 -0.0634676831 0.0553265687
-0.1867469271 -0.0544179945 0.0299375470
-0.1867469271 -0.0544179945 0.0299375470
-0.3210688533 -0.0514267870 0.0214947822
-0.3210688533 -0.0514267870 0.0214947822
0.1872902834 -0.0530920520 0.0267302298
0.1872902834 -0.0530920520 0.0267302298
0.3211528786 -0.0531843953 0.0267863907
0.3211528786 -0.0531843953 0.0267863907
-0.4131583437 -0.1767509035 0.0021373375
-0.4131583437 -0.1767509035 0.0021373375
0.4132866529 -0.1779216637 0.0041170724
0.4132866529 -0.1779216637 0.0041170724
0.0599120737 -0.1939899450 0.0380569130
0.0299568655 -0.2302838637 0.1124094535
0.1197772059 -0.1909841511 0.0317867849
0.0599120737 -0.1939899450 0.0380569130
0.0300041856 -0.1578083306 -0.0363788773
0.0000489775 -0.1941022493 0.0379736632
-0.0593510853 -0.1910024526 0.0315778603
-0.0296747140 -0.2287901175 0.1091699271
0.0000489775 -0.1941022493 0.0379736632
-0.0593510853 -0.1910024526 0.0315778603
-0.0890294843 -0.1563184259 -0.0396392569
-0.1187531757 -0.1910062941 0.0315570071
-0.1867360127 -0.1910109679 0.0315336013
-0.1187531757 -0.1910062941 0.0315570071
-0.1527219479 -0.1563226836 -0.0396613864
-0.1867360127 -0.1910109679 0.0315336013
-0.2547120624 -0.1806210021 0.0101693277
-0.1527672405 -0.2256945784 0.1027519948
-0.3210512724 -0.1806265690 0.0101427883
-0.3873858427 -0.1767481924 0.0021467583
-0.2879009200 -0.2101124132 0.0706923146
-0.3210512724 -0.1806265690 0.0101427883
-0.2547120624 -0.1806210021 0.0101693277
-0.3542016247 -0.1511407248 -0.0504067381
0.1873011370 -0.1910703267 0.0317585620
0.2210857447 -0.1563223927 -0.0394730258
0.1197772059 -0.1909841511 0.0317867849
0.1873011370 -0.1910703267 0.0317585620
0.1535165294 -0.2258182606 0.1029901499
0.2548328324 -0.1790684433 0.0072752489
0.3211742323 -0.1772460074 0.0022279980
0.2548328324 -0.1790684433 0.0072752489
0.2879847723 -0.2069042176 0.0637415547
0.3211742323 -0.1772460074 0.0022279980
0.3875139742 -0.1772575223 0.0022422835
0.3543620342 -0.1494217480 -0.0542240224
0.2903131829 -0.0655854308 0.1131692614
0.3304026526 0.0023232849 0.0797556997
0.3939169673 -0.0045192055 0.1368015553
0.3538274976 -0.0724279212 0.1702151170
0.3717707490 -0.0941321480 0.1476335492
0.4118586401 -0.0262225825 0.1142191729
0.3483448516 -0.0193795965 0.0571734946
0.3082569606 -0.0872891620 0.0905878709
-0.3280301615 0.0022730137 0.0795218068
-0.2879551241 -0.0656295814 0.1129638451
-0.3515089056 -0.0724817734 0.1699645627
-0.3915839429 -0.0045791782 0.1365225244
-0.4095078847 -0.0262852936 0.1139274015
-0.3694323213 -0.0941887387 0.1473702540
-0.3058784873 -0.0873360511 0.0903697135
-0.3459540507 -0.0194326061 0.0569268610
0.4680927796 -0.0760763675 0.1209865593
0.4909295075 -0.0818232857 0.1276649116
-0.4909166103 -0.0819031749 0.1273322581
-0.4680757582 -0.0761536898 0.1206703615
0.4239838243 -0.1595129877 0.1270601423
0.4201893760 -0.0760321016 0.1175745203
0.4164056156 -0.0587970610 0.0952028360
0.4325672914 -0.0810154094 0.1558695003
0.4239735595 -0.0872622373 0.1404277286
-0.4201717391 -0.0761019319 0.1172918603
-0.4239597048 -0.1595838397 0.1267760278
-0.4163741386 -0.0588663124 0.0949228690
-0.4325735247 -0.0922458094 0.1538461273
-0.4239699694 -0.0873328236 0.1401428707
0.4750924797 -0.0869998290 0.1723699656
0.4750924797 -0.0869998290 0.1723699656
-0.4751102938 -0.0870780456 0.1720482869
-0.4751102938 -0.0870780456 0.1720482869
0.0523233197 -0.0103066156 -0.0719528385
0.1568293698 -0.0545149929 -0.0877213465
0.0523407744 -0.0987393268 -0.1035640950
0.0523233197 -0.0103066156 -0.0719528385
0.2613354200 -0.0987233702 -0.1034898545
0.3135884450 -0.1208275588 -0.1113741085
0.1045937995 -0.1208435155 -0.1114483490
0.1568293698 -0.0545149929 -0.0877213465
-0.1566538711 -0.0987552835 -0.1036383355
-0.1044008461 -0.1208594722 -0.1115225895
-0.3133954916 -0.1208754289 -0.1115968299
-0.2611599212 -0.0545469062 -0.0878698275
-0.0521652757 -0.0545309496 -0.0877955870
-0.1566713258 -0.0103225723 -0.0720270790
-0.0521827304 0.0339017617 -0.0561843305
-0.0521652757 -0.0545309496 -0.0877955870
0.2613179653 -0.0102906589 -0.0718785980
0.2613005106 0.0781420524 -0.0402673415
0.3658240154 -0.0544990362 -0.0876471060
0.2613179653 -0.0102906589 -0.0718785980
0.1568119152 0.0339177184 -0.0561100900
0.0523058651 0.0781260957 -0.0403415820
0.1567944605 0.1223504297 -0.0244988335
0.1568119152 0.0339177184 -0.0561100900
0.3657891060 0.1223663864 -0.0244245930
0.2612830559 0.1665747636 -0.0086560850
0.3657716514 0.2107990976 0.0071866635
0.3657891060 0.1223663864 -0.0244245930
0.3658065607 0.0339336751 -0.0560358495
0.3658240154 -0.0544990362 -0.0876471060
0.2613005106 0.0781420524 -0.0402673415
0.3658065607 0.0339336751 -0.0560358495
-0.0522007114 0.1223344729 -0.0245730742
-0.1566982973 0.1223264946 -0.0246101945
-0.0522186923 0.2107671842 0.0070381821
-0.0522007114 0.1223344729 -0.0245730742
-0.2612138642 0.2107512275 0.0069639415
-0.3134671524 0.2328554161 0.0148481954
-0.1044719805 0.2328713728 0.0149224360
-0.1567162783 0.2107592058 0.0070010618
0.1567764795 0.2107831409 0.0071124228
0.1045231913 0.2328873295 0.0149966767
0.3135183631 0.2329032862 0.0150709174
0.2612740654 0.2107911193 0.0071495432
0.0522878841 0.1665588069 -0.0087303257
0.1567854700 0.1665667853 -0.0086932053
0.0523058651 0.0781260957 -0.0403415820
0.0522878841 0.1665588069 -0.0087303257
-0.2611868927 0.0781021606 -0.0404529430
-0.2611779022 0.0338858050 -0.0562585712
-0.3657024596 0.1665268935 -0.0088788070
-0.2612048737 0.1665348718 -0.0088416867
-0.1566803163 0.0338937834 -0.0562214508
-0.1566893068 0.0781101390 -0.0404158227
-0.0521917209 0.0781181173 -0.0403787023
-0.1566803163 0.0338937834 -0.0562214508
-0.3656575072 -0.0545548846 -0.0879069478
-0.3656664977 -0.0103385290 -0.0721013196
-0.2611689117 -0.0103305506 -0.0720641993
-0.3656575072 -0.0545548846 -0.0879069478
-0.3656844786 0.0780941822 -0.0404900633
-0.3657024596 0.1665268935 -0.0088788070
-0.2611779022 0.0338858050 -0.0562585712
-0.3656844786 0.0780941822 -0.0404900633
-0.0521849723 -0.0755706730 -0.0289368242
-0.0521939627 -0.0313543174 -0.0131311961
-0.1566912855 -0.0313622957 -0.0131683163
-0.0521849723 -0.0755706730 -0.0289368242
-0.2611706273 -0.1198029853 -0.0448166929
-0.3134147934 -0.1419151523 -0.0527380671
-0.1044201479 -0.1418991956 -0.0526638266
-0.1566733045 -0.1197950070 -0.0447795726
0.1568186638 -0.1197710719 -0.0446682119
0.1045744976 -0.1418832389 -0.0525895861
0.3135691432 -0.1418672822 -0.0525153456
0.2613069961 -0.0755467380 -0.0288254635
0.0523123505 -0.0755626947 -0.0288997040
0.1568006828 -0.0313383607 -0.0130569556
0.0523033600 -0.0313463391 -0.0130940758
0.0523123505 -0.0755626947 -0.0288997040
-0.2611975988 0.0128460815 0.0026001916
-0.2612065893 0.0570624371 0.0184058198
-0.3656769406 -0.0755946080 -0.0290481849
-0.2611886083 -0.0313702741 -0.0132054366
-0.1567092665 0.0570704155 0.0184429400
-0.1567002760 0.0128540599 0.0026373118
-0.0522119437 0.0570783938 0.0184800602
-0.1567092665 0.0570704155 0.0184429400
-0.3657218930 0.1454871700 0.0499799558
-0.3657039120 0.0570544588 0.0183686995
-0.2612245702 0.1454951484 0.0500170761
-0.3657218930 0.1454871700 0.0499799558
-0.3656859311 -0.0313782524 -0.0132425568
-0.3656769406 -0.0755946080 -0.0290481849
-0.2612065893 0.0570624371 0.0184058198
-0.3657039120 0.0570544588 0.0183686995
0.0522681875 0.1455190835 0.0501284371
0.0522856422 0.0570863722 0.0185171806
0.1567745008 0.1013107062 0.0343599292
0.0522681875 0.1455190835 0.0501284371
0.2612633594 0.1455350402 0.0502026778
0.3134990613 0.2118635628 0.0739296803
0.1045038895 0.2118476061 0.0738554396
0.1567570461 0.1897434175 0.0659711857
-0.1567269843 0.1455031267 0.0500541964
-0.1044912824 0.2118316494 0.0737811989
-0.3134864542 0.2118156926 0.0737069583
-0.2612332976 0.1897115040 0.0658227043
-0.0522206711 0.1012947495 0.0342856885
-0.0522381257 0.1897274607 0.0658969450
-0.1567269843 0.1455031267 0.0500541964
-0.0522206711 0.1012947495 0.0342856885
0.3657871273 0.0128939516 0.0028229134
0.2612808140 0.0571023289 0.0185914213
0.3658045820 -0.0755387596 -0.0287883431
0.3657871273 0.0128939516 0.0028229134
0.3657696726 0.1013266629 0.0344341698
0.3657522179 0.1897593742 0.0660454263
0.2612633594 0.1455350402 0.0502026778
0.3657696726 0.1013266629 0.0344341698
0.1567919555 0.0128779949 0.0027486727
0.1567745008 0.1013107062 0.0343599292
0.0522856422 0.0570863722 0.0185171806
0.1567919555 0.0128779949 0.0027486727
0.2612982687 -0.0313303824 -0.0130198352
0.3658045820 -0.0755387596 -0.0287883431
0.2612808140 0.0571023289 0.0185914213
0.2612982687 -0.0313303824 -0.0130198352
0.3417425983 0.0657815790 0.0880988385
0.4056835941 0.0069561903 0.0670920135
0.4056596703 0.1246167296 0.1091510821
0.3417425983 0.0657815790 0.0880988385
0.2778255262 0.0069464284 0.0670465949
0.2139084542 -0.0518887223 0.0459943513
0.3417665221 -0.0518789603 0.0460397699
0.2778255262 0.0069464284 0.0670465949
0.2138845304 0.0657718171 0.0880534199
0.1499435345 0.1245972058 0.1090602449
0.1499674583 0.0069366664 0.0670011763
0.2138845304 0.0657718171 0.0880534199
0.2778016024 0.1246069677 0.1091056635
0.3417186744 0.1834421183 0.1301579071
0.2138606065 0.1834323564 0.1301124885
0.2778016024 0.1246069677 0.1091056635
0.0639414613 0.0657603690 0.0880001561
0.1278829835 0.0069349803 0.0669933313
0.1278590596 0.1245955196 0.1090523999
0.0639414613 0.0657603690 0.0880001561
0.0000238630 0.0069252183 0.0669479123
-0.0638937354 -0.0519099324 0.0458956686
0.0639653851 -0.0519001704 0.0459410875
0.0000238630 0.0069252183 0.0669479123
-0.0639176592 0.0657506070 0.0879547371
-0.1278591814 0.1245759956 0.1089615619
-0.1278352575 0.0069154563 0.0669024934
-0.0639176592 0.0657506070 0.0879547371
-0.0000000609 0.1245857576 0.1090069809
0.0639175374 0.1834209083 0.1300592247
-0.0639415831 0.1834111463 0.1300138057
-0.0000000609 0.1245857576 0.1090069809
-0.3417193225 0.0657293969 0.0878560545
-0.4056608447 0.1245547855 0.1088628793
-0.4056369208 0.0068942462 0.0668038108
-0.3417193225 0.0657293969 0.0878560545
-0.2778017242 0.1245645475 0.1089082983
-0.2138841259 0.1833996982 0.1299605421
-0.3417432463 0.1833899362 0.1299151231
-0.2778017242 0.1245645475 0.1089082983
-0.2138602020 0.0657391589 0.0879014735
-0.1499186798 0.0069137702 0.0668946487
-0.1499426037 0.1245743096 0.1089537173
-0.2138602020 0.0657391589 0.0879014735
-0.2777778003 0.0069040082 0.0668492298
-0.3416953986 -0.0519311425 0.0457969860
-0.2138362781 -0.0519213805 0.0458424050
-0.2777778003 0.0069040082 0.0668492298
0.3135763814 -0.1339773860 -0.0745873817
0.1045817358 -0.1339933426 -0.0746616222
0.3658310746 -0.1273984832 -0.0929621849
0.3135860323 -0.1234575242 -0.1040167631
-0.1044032588 -0.1234894376 -0.1041652441
-0.2088981688 -0.1208674505 -0.1115597097
0.2090911222 -0.1208355371 -0.1114112287
0.1045865613 -0.1287334118 -0.0893763129
-0.3134027298 -0.1287653251 -0.0895247939
-0.1044080843 -0.1287493685 -0.0894505534
-0.3656574230 -0.1353442279 -0.0711499906
-0.3134123807 -0.1392851869 -0.0600954124
0.1045769104 -0.1392532735 -0.0599469314
0.2090718204 -0.1418752606 -0.0525524658
-0.2089174707 -0.1419071739 -0.0527009468
-0.1044129097 -0.1340092993 -0.0747358626
-0.3134792160 0.2197055889 0.0516349222
-0.1044840442 0.2197215457 0.0517091628
-0.3657219772 0.2262765133 0.0332229986
-0.3134695651 0.2302254506 0.0222055407
0.1045207786 0.2302573641 0.0223540221
0.2090207772 0.2328953079 0.0150337971
-0.2089695665 0.2328633944 0.0148853157
-0.1044792187 0.2249814765 0.0369944721
0.3135111250 0.2250133900 0.0371429535
0.1045159531 0.2249974332 0.0370687128
0.3657538861 0.2184424656 0.0555548771
0.3135014740 0.2144935282 0.0665723349
-0.1044888696 0.2144616148 0.0664238536
-0.2089888683 0.2118236710 0.0737440786
0.2090014754 0.2118555845 0.0738925600
0.1045111277 0.2197375024 0.0517834035
0.2777911902 0.1935737138 0.1250753500
0.2082738344 0.2052195645 0.0924564584
0.2778054419 0.2091085927 0.0816164254
0.3473227978 0.1974627420 0.1142353171
-0.0000109993 0.1935525037 0.1249766672
-0.0695291446 0.2051983543 0.0923577753
0.0000032523 0.2090873826 0.0815177427
0.0695213977 0.1974415319 0.1141366346
-0.2778126626 0.1935312936 0.1248779846
-0.3473302816 0.2051771443 0.0922590929
-0.2777984109 0.2090661725 0.0814190601
-0.2082807919 0.1974203218 0.1140379518
0.4497884401 -0.0327983310 -0.0794661432
0.4608783058 0.0558455859 -0.0481362441
0.4497521224 0.1444878067 -0.0168142368
0.4164477864 0.0558421937 -0.0481520270
-0.4607616451 0.0557695501 -0.0484477765
-0.4496365143 -0.0328726708 -0.0797697842
-0.4163319678 0.0557729423 -0.0484319939
-0.4496715688 0.1444134670 -0.0171178774
0.4227180734 -0.1784557890 0.0052152910
0.4386659476 -0.1715617966 -0.0081759279
-0.4226049171 -0.1785258209 0.0049303729
-0.4385440102 -0.1716344402 -0.0084716776
0.4608283020 -0.0760769222 0.1209839788
0.4608289733 0.0342384148 0.0946430777
0.4608522375 0.0067829712 0.0357938689
0.4608915872 -0.0447989031 -0.0631521694
0.4608455146 0.1084843942 0.0321197929
0.4608522375 0.0067829712 0.0357938689
0.4608589604 -0.0949184517 0.0394679450
0.4608656833 -0.1966198747 0.0431420210
0.4608983101 -0.1465003261 -0.0594780933
0.4608589604 -0.0949184517 0.0394679450
0.4608430680 0.1258719381 0.0352700949
0.4608368351 0.1732962586 0.0422530072
0.4608907717 -0.0390030552 -0.0621020687
0.4608544540 0.1382830825 0.0005498377
0.4164094781 -0.0448812114 0.0813385507
0.4164096300 -0.0120904081 0.0738630656
0.4164358999 -0.1380353215 0.0247578527
0.4164278538 -0.0394287921 0.0276963157
0.4164643014 -0.0941055601 -0.0646371841
0.4164358999 -0.1380353215 0.0247578527
0.4164198077 0.0591777373 0.0306347787
0.4164157847 0.1084810020 0.0321040103
0.4164602784 -0.0448022954 -0.0631679525
0.4164278538 -0.0394287921 0.0276963157
0.4164247240 0.1382796903 0.0005340550
0.4164594628 -0.0390064475 -0.0621178519
0.4164074999 0.1732928664 0.0422372247
0.4164133381 0.1258685459 0.0352543123
-0.4608103460 0.0341623790 0.0943315455
-0.4608116490 -0.0761531352 0.1206729419
-0.4607816221 -0.0949945762 0.0391566601
-0.4607429039 -0.1465763620 -0.0597896262
-0.4607755307 -0.1966959107 0.0428304881
-0.4607816221 -0.0949945762 0.0391566601
-0.4607877135 0.0067067582 0.0354828321
-0.4607938050 0.1084080927 0.0318090041
-0.4607489953 -0.0448750276 -0.0634634542
-0.4607877135 0.0067067582 0.0354828321
-0.4607848654 0.1382069582 0.0002385533
-0.4607498109 -0.0390791796 -0.0624133535
-0.4608021687 0.1732200014 0.0419420946
-0.4607962516 0.1257956365 0.0349593061
-0.4163702762 -0.0449506400 0.0810590794
-0.4163701245 -0.0121600137 0.0735840898
-0.4163516375 -0.0394983092 0.0274170923
-0.4163189496 -0.0448716354 -0.0634476715
-0.4163644961 0.1084114849 0.0318247865
-0.4163602099 0.0591082202 0.0303555551
-0.4163430651 -0.1381048385 0.0244786294
-0.4163146634 -0.0941749001 -0.0649169029
-0.4163516375 -0.0394983092 0.0274170923
-0.4163430651 -0.1381048385 0.0244786294
-0.4163669427 0.1257990287 0.0349750885
-0.4163730440 0.1732233935 0.0419578770
-0.4163197651 -0.0390757874 -0.0623975708
-0.4163555565 0.1382103503 0.0002543357
0.0599222902 -0.0340745769 -0.0265562473
0.1192981054 -0.0615652808 0.0503782729
0.0594086468 -0.0909543473 0.1322820129
0.0000328316 -0.0634636434 0.0553474927
-0.0593423954 -0.0341855737 -0.0265903225
0.0000328316 -0.0634636434 0.0553474927
-0.0593944954 -0.0909771662 0.1322829627
-0.1187697224 -0.0616990966 0.0503451475
-0.1187697224 -0.0616990966 0.0503451475
-0.1867721638 -0.0819274777 0.1068939411
-0.2547308164 -0.0544226895 0.0299135745
-0.1867283750 -0.0341943084 -0.0266352191
-0.3874085900 -0.0514323118 0.0214693755
-0.3210520010 -0.0342045281 -0.0266845983
-0.2547308164 -0.0544226895 0.0299135745
-0.3210874054 -0.0716504732 0.0780675483
0.1868035034 -0.0806897129 0.1036515989
0.1192981054 -0.0615652808 0.0503782729
0.1873077426 -0.0340493444 -0.0265121605
0.2548131406 -0.0531737765 0.0267611656
0.2548131406 -0.0531737765 0.0267611656
0.3211703378 -0.0341416877 -0.0264559996
0.3874942761 -0.0513745654 0.0217486064
0.3211370789 -0.0704066541 0.0749657716
0.0594029633 -0.1127744376 0.1529715589
0.0594029633 -0.1127744376 0.1529715589
-0.0594005743 -0.1140788676 0.1543610251
-0.0594005743 -0.1140788676 0.1543610251
-0.1867778479 -0.1037131551 0.1275779031
-0.1867778479 -0.1037131551 0.1275779031
-0.3210936637 -0.0938688631 0.1004608013
-0.3210936637 -0.0938688631 0.1004608013
0.1867917064 -0.1254463691 0.1464810314
0.1868035034 -0.0806897129 0.1036515989
0.3211309654 -0.0933432199 0.0971056581
0.3211309654 -0.0933432199 0.0971056581
0.0598549420 -0.1648228347 0.1911378356
0.0598549420 -0.1648228347 0.1911378356
-0.0594099004 -0.1640889022 0.1913638715
-0.0594099004 -0.1640889022 0.1913638715
-0.1867877381 -0.1542065796 0.1662724841
-0.1867877381 -0.1542065796 0.1662724841
-0.3211035539 -0.1443616644 0.1391550461
-0.3211035539 -0.1443616644 0.1391550461
0.1872461218 -0.1826226763 0.1788901641
0.1867917064 -0.1254463691 0.1464810314
0.3211212096 -0.1445033784 0.1355652610
0.3211212096 -0.1445033784 0.1355652610
-0.1867862691 -0.2078049009 0.1766203255
-0.1867862691 -0.2078049009 0.1766203255
-0.3210964354 -0.1972726570 0.1497485827
-0.3210964354 -0.1972726570 0.1497485827
0.1872500393 -0.2073108992 0.1731681591
0.1872500393 -0.2073108992 0.1731681591
0.3211214850 -0.1974158879 0.1461627244
0.3211214850 -0.1974158879 0.1461627244
-0.3873858427 -0.1767481924 0.0021467583
-0.4260276614 -0.1492056032 -0.0544188842
-0.4389304715 -0.1777950410 0.0038197066
-0.4260611538 -0.2053403413 0.0603759284
0.4390599435 -0.1779188249 0.0041259802
0.4261915352 -0.1497567374 -0.0532705773
0.3875139742 -0.1772575223 0.0022422835
0.4261550613 -0.2060837512 0.0615136300
0.0598667896 -0.2635719885 0.1804918659
0.0898219977 -0.2272780698 0.1061393254
0.0898672818 -0.1576960263 -0.0362956275
0.0898219977 -0.2272780698 0.1061393254
0.0898672818 -0.1576960263 -0.0362956275
0.0749133378 -0.1396052192 -0.0735135226
0.0299568655 -0.2302838637 0.1124094535
0.0300041856 -0.1578083306 -0.0363788773
-0.0890747768 -0.2256903207 0.1027741243
-0.0593984054 -0.2634779856 0.1803661911
-0.0296273939 -0.1563145844 -0.0396184037
-0.0296747140 -0.2287901175 0.1091699271
-0.0296273939 -0.1563145844 -0.0396184037
-0.0444665933 -0.1389725711 -0.0752269623
-0.0890747768 -0.2256903207 0.1027741243
-0.0890294843 -0.1563184259 -0.0396392569
-0.1527219479 -0.1563226836 -0.0396613864
-0.1527672405 -0.2256945784 0.1027519948
-0.1866907201 -0.1216390731 -0.1108797798
-0.2207047849 -0.1563273574 -0.0396847921
-0.2547313150 -0.2101096298 0.0707055844
-0.2207047849 -0.1563273574 -0.0396847921
-0.2207432902 -0.2153046126 0.0813877212
-0.1867745180 -0.2499882231 0.1526061146
-0.3542354904 -0.2062340366 0.0626962847
-0.3542016247 -0.1511407248 -0.0504067381
-0.3542354904 -0.2062340366 0.0626962847
-0.3210851380 -0.2357198808 0.1232458110
-0.2878624147 -0.1511351580 -0.0503801986
-0.2879009200 -0.2101124132 0.0706923146
-0.2878624147 -0.1511351580 -0.0503801986
-0.3210127671 -0.1216493138 -0.1109297250
0.1873464212 -0.1214882832 -0.1106763908
0.1535618135 -0.1562362172 -0.0394448030
0.1535165294 -0.2258182606 0.1029901499
0.1535618135 -0.1562362172 -0.0394448030
0.1872636171 -0.2485643112 0.1497384246
0.2210482247 -0.2138163772 0.0785068368
0.2210857447 -0.1563223927 -0.0394730258
0.2548140724 -0.2078154356 0.0662651802
0.2879847723 -0.2069042176 0.0637415547
0.2880222923 -0.1494102331 -0.0542383078
0.3211367123 -0.2347399919 0.1202078605
0.3543261722 -0.2050817817 0.0586943038
0.3543620342 -0.1494217480 -0.0542240224
0.3543261722 -0.2050817817 0.0586943038
0.3212100942 -0.1215859737 -0.1106903282
0.2880222923 -0.1494102331 -0.0542383078
3 257 569 132
3 80 569 257
3 257 570 82
3 132 570 257
3 258 571 102
3 82 571 258
3 258 572 80
3 102 572 258
3 259 573 22
3 37 573 259
3 259 574 251
3 22 574 259
3 260 575 157
3 251 575 260
3 260 576 37
3 157 576 260
3 109 82 159
3 132 159 82
3 159 132 92
3 80 92 132
3 92 80 150
3 102 150 80
3 150 102 109
3 82 109 102
3 254 251 121
3 22 121 251
3 121 22 225
3 37 225 22
3 225 37 245
3 157 245 37
3 245 157 254
3 251 254 157
3 254 109 245
3 245 109 159
3 225 92 121
3 121 92 150
3 245 159 225
3 225 159 92
3 121 150 254
3 254 150 109
3 261 577 11
3 186 577 261
3 261 578 244
3 11 578 261
3 262 579 47
3 244 579 262
3 262 580 186
3 47 580 262
3 263 581 18
3 78 581 263
3 263 582 224
3 18 582 263
3 264 583 253
3 224 583 264
3 264 584 78
3 253 584 264
3 122 146 186
3 11 186 146
3 146 169 11
3 244 11 169
3 169 149 244
3 47 244 149
3 149 122 47
3 186 47 122
3 156 184 78
3 18 78 184
3 184 189 18
3 224 18 189
3 189 178 224
3 253 224 178
3 178 156 253
3 78 253 156
3 156 178 122
3 178 146 122
3 189 184 169
3 184 149 169
3 178 189 146
3 189 169 146
3 184 156 149
3 156 122 149
3 59 177 56
3 172 56 177
3 174 58 170
3 54 170 58
3 206 233 202
3 229 202 233
3 231 204 227
3 200 227 204
3 177 174 172
3 170 172 174
3 58 59 54
3 56 54 59
3 233 231 229
3 227 229 231
3 204 206 200
3 202 200 206
3 1 176 57
3 173 57 176
3 175 0 171
3 55 171 0
3 207 234 203
3 230 203 234
3 232 205 228
3 201 228 205
3 176 175 173
3 171 173 175
3 0 1 55
3 57 55 1
3 234 232 230
3 228 230 232
3 205 207 201
3 203 201 207
3 211 45 151
3 41 151 45
3 100 585 41
3 151 585 100
3 41 586 100
3 128 586 41
3 77 108 182
3 252 182 108
3 252 587 140
3 114 587 252
3 114 588 108
3 252 588 114
3 53 42 101
3 53 99 42
3 99 20 42
3 20 185 42
3 8 99 52
3 53 52 99
3 100 8 52
3 100 21 8
3 100 128 21
3 99 8 20
3 21 20 8
3 129 185 128
3 185 20 128
3 20 21 128
3 2 158 215
3 158 250 215
3 158 116 250
3 158 198 116
3 226 199 158
3 198 158 199
3 140 226 3
3 140 199 226
3 140 114 199
3 158 2 226
3 3 226 2
3 140 215 139
3 140 3 215
3 3 2 215
3 31 589 43
3 265 589 31
3 265 590 44
3 31 590 265
3 31 98 44
3 98 591 242
3 31 591 98
3 256 592 44
3 255 592 256
3 255 593 44
3 43 593 255
3 255 148 43
3 266 594 25
3 104 594 266
3 25 595 266
3 103 595 25
3 104 115 25
3 115 596 25
3 24 596 115
3 6 13 103
3 13 597 103
3 12 597 13
3 12 598 103
3 104 598 12
3 213 599 42
3 212 599 213
3 101 600 212
3 42 600 101
3 255 256 213
3 212 213 256
3 213 42 255
3 42 185 255
3 185 129 255
3 129 81 255
3 81 148 255
3 75 601 71
3 250 601 75
3 116 602 250
3 71 602 116
3 13 75 12
3 71 12 75
3 139 215 6
3 215 250 6
3 250 13 6
3 250 75 13
3 271 603 270
3 267 603 271
3 271 604 269
3 270 604 271
3 272 605 270
3 268 605 272
3 272 606 267
3 270 606 272
3 269 607 274
3 273 607 269
3 274 608 10
3 273 608 274
3 275 609 273
3 268 609 275
3 273 610 275
3 269 610 273
3 276 611 278
3 277 611 276
3 278 612 268
3 277 612 278
3 279 613 277
3 127 613 279
3 277 614 279
3 276 614 277
3 281 615 280
3 268 615 281
3 281 616 276
3 280 616 281
3 282 617 280
3 267 617 282
3 282 618 268
3 280 618 282
3 286 619 285
3 284 619 286
3 286 620 283
3 285 620 286
3 287 621 285
3 10 621 287
3 287 622 284
3 285 622 287
3 289 623 288
3 284 623 289
3 289 624 267
3 288 624 289
3 290 625 288
3 283 625 290
3 290 626 284
3 288 626 290
3 293 627 292
3 291 627 293
3 293 628 283
3 292 628 293
3 294 629 292
3 218 629 294
3 294 630 291
3 292 630 294
3 296 631 295
3 291 631 296
3 296 632 10
3 295 632 296
3 297 633 295
3 283 633 297
3 297 634 291
3 295 634 297
3 302 635 301
3 298 635 302
3 301 636 302
3 300 636 301
3 303 637 301
3 299 637 303
3 303 638 298
3 301 638 303
3 300 639 305
3 304 639 300
3 305 640 126
3 304 640 305
3 306 641 304
3 299 641 306
3 300 642 304
3 306 642 300
3 307 643 309
3 308 643 307
3 309 644 299
3 308 644 309
3 310 645 308
3 218 645 310
3 307 646 308
3 310 646 307
3 312 647 311
3 299 647 312
3 311 648 312
3 307 648 311
3 313 649 311
3 298 649 313
3 313 650 299
3 311 650 313
3 315 651 317
3 316 651 315
3 317 652 314
3 316 652 317
3 318 653 316
3 126 653 318
3 316 654 318
3 315 654 316
3 320 655 319
3 314 655 320
3 315 656 319
3 320 656 315
3 321 657 319
3 298 657 321
3 321 658 314
3 319 658 321
3 324 659 323
3 127 659 324
3 322 660 323
3 324 660 322
3 325 661 323
3 314 661 325
3 325 662 127
3 323 662 325
3 327 663 326
3 322 663 327
3 327 664 126
3 326 664 327
3 328 665 326
3 314 665 328
3 328 666 322
3 326 666 328
3 333 667 332
3 330 667 333
3 329 668 332
3 333 668 329
3 334 669 332
3 331 669 334
3 334 670 330
3 332 670 334
3 331 671 336
3 335 671 331
3 336 672 125
3 335 672 336
3 337 673 335
3 330 673 337
3 331 674 335
3 337 674 331
3 338 675 340
3 339 675 338
3 340 676 330
3 339 676 340
3 341 677 339
3 9 677 341
3 339 678 341
3 338 678 339
3 343 679 342
3 330 679 343
3 343 680 338
3 342 680 343
3 329 681 344
3 342 681 329
3 344 682 330
3 342 682 344
3 346 683 348
3 347 683 346
3 348 684 345
3 347 684 348
3 349 685 347
3 125 685 349
3 349 686 346
3 347 686 349
3 351 687 350
3 345 687 351
3 346 688 350
3 351 688 346
3 350 689 329
3 352 689 350
3 352 690 345
3 350 690 352
3 355 691 354
3 124 691 355
3 355 692 353
3 354 692 355
3 354 693 345
3 356 693 354
3 356 694 124
3 354 694 356
3 353 695 358
3 357 695 353
3 358 696 125
3 357 696 358
3 359 697 357
3 345 697 359
3 357 698 359
3 353 698 357
3 364 699 363
3 361 699 364
3 364 700 360
3 363 700 364
3 365 701 363
3 362 701 365
3 365 702 361
3 363 702 365
3 366 703 362
3 367 703 366
3 367 704 217
3 366 704 367
3 368 705 366
3 361 705 368
3 362 706 366
3 368 706 362
3 370 707 369
3 371 707 370
3 371 708 361
3 370 708 371
3 372 709 370
3 124 709 372
3 369 710 370
3 372 710 369
3 374 711 373
3 360 711 374
3 374 712 361
3 373 712 374
3 375 713 373
3 369 713 375
3 375 714 360
3 373 714 375
3 379 715 378
3 377 715 379
3 379 716 376
3 378 716 379
3 380 717 378
3 9 717 380
3 380 718 377
3 378 718 380
3 382 719 381
3 377 719 382
3 382 720 217
3 381 720 382
3 383 721 381
3 376 721 383
3 383 722 377
3 381 722 383
3 386 723 385
3 384 723 386
3 386 724 376
3 385 724 386
3 387 725 385
3 360 725 387
3 387 726 384
3 385 726 387
3 389 727 388
3 384 727 389
3 389 728 9
3 388 728 389
3 390 729 388
3 376 729 390
3 390 730 384
3 388 730 390
3 166 120 154
3 35 154 120
3 154 35 155
3 34 155 35
3 393 731 392
3 391 731 393
3 393 732 166
3 392 732 393
3 394 733 392
3 167 733 394
3 394 734 391
3 392 734 394
3 396 735 395
3 391 735 396
3 396 736 154
3 395 736 396
3 397 737 395
3 166 737 397
3 397 738 391
3 395 738 397
3 400 739 399
3 398 739 400
3 400 740 155
3 399 740 400
3 401 741 399
3 154 741 401
3 401 742 398
3 399 742 401
3 403 743 402
3 398 743 403
3 403 744 167
3 402 744 403
3 404 745 402
3 155 745 404
3 404 746 398
3 402 746 404
3 155 34 167
3 119 167 34
3 167 119 166
3 120 166 119
3 165 117 153
3 32 153 117
3 164 118 165
3 117 165 118
3 153 32 152
3 33 152 32
3 237 193 16
3 51 16 193
3 16 51 17
3 50 17 51
3 407 747 406
3 405 747 407
3 407 748 237
3 406 748 407
3 408 749 406
3 238 749 408
3 408 750 405
3 406 750 408
3 410 751 409
3 405 751 410
3 410 752 16
3 409 752 410
3 411 753 409
3 237 753 411
3 411 754 405
3 409 754 411
3 414 755 413
3 412 755 414
3 414 756 17
3 413 756 414
3 415 757 413
3 16 757 415
3 415 758 412
3 413 758 415
3 417 759 416
3 412 759 417
3 417 760 238
3 416 760 417
3 418 761 416
3 17 761 418
3 418 762 412
3 416 762 418
3 17 50 238
3 192 238 50
3 238 192 237
3 193 237 192
3 236 190 15
3 48 15 190
3 235 191 236
3 190 236 191
3 15 48 14
3 49 14 48
3 196 70 248
3 113 248 70
3 197 69 196
3 70 196 69
3 421 763 420
3 419 763 421
3 421 764 249
3 420 764 421
3 422 765 420
3 248 765 422
3 422 766 419
3 420 766 422
3 424 767 423
3 419 767 424
3 424 768 197
3 423 768 424
3 425 769 423
3 249 769 425
3 425 770 419
3 423 770 425
3 428 771 427
3 426 771 428
3 428 772 196
3 427 772 428
3 429 773 427
3 197 773 429
3 429 774 426
3 427 774 429
3 431 775 430
3 426 775 431
3 431 776 248
3 430 776 431
3 432 777 430
3 196 777 432
3 432 778 426
3 430 778 432
3 249 112 197
3 69 197 112
3 248 113 249
3 112 249 113
3 195 67 247
3 110 247 67
3 247 110 246
3 111 246 110
3 194 68 195
3 67 195 68
3 435 779 434
3 9 779 435
3 434 780 435
3 433 780 434
3 9 781 436
3 10 781 9
3 436 782 434
3 10 782 436
3 433 783 438
3 437 783 433
3 438 784 127
3 437 784 438
3 439 785 437
3 10 785 439
3 437 786 439
3 433 786 437
3 442 787 441
3 127 787 442
3 441 788 442
3 440 788 441
3 127 789 443
3 125 789 127
3 443 790 441
3 125 790 443
3 440 791 445
3 444 791 440
3 445 792 9
3 444 792 445
3 446 793 444
3 125 793 446
3 444 794 446
3 440 794 444
3 449 795 448
3 124 795 449
3 448 796 449
3 447 796 448
3 124 797 450
3 126 797 124
3 450 798 448
3 126 798 450
3 447 799 452
3 451 799 447
3 452 800 218
3 451 800 452
3 453 801 451
3 126 801 453
3 451 802 453
3 447 802 451
3 456 803 455
3 218 803 456
3 455 804 456
3 454 804 455
3 218 805 457
3 217 805 218
3 457 806 455
3 217 806 457
3 454 807 459
3 458 807 454
3 459 808 124
3 458 808 459
3 460 809 458
3 217 809 460
3 458 810 460
3 454 810 458
3 461 811 34
3 119 811 461
3 34 812 461
3 32 812 34
3 462 813 117
3 32 813 462
3 117 814 462
3 119 814 117
3 463 815 50
3 192 815 463
3 50 816 463
3 48 816 50
3 464 817 190
3 48 817 464
3 190 818 464
3 192 818 190
3 465 819 112
3 69 819 465
3 112 820 465
3 110 820 112
3 466 821 67
3 110 821 466
3 67 822 466
3 69 822 67
3 119 467 120
3 117 467 119
3 118 468 117
3 120 468 118
3 113 469 112
3 111 469 113
3 110 470 111
3 112 470 110
3 239 241 208
3 210 208 241
3 28 74 27
3 73 27 74
3 243 240 214
3 209 214 240
3 240 239 209
3 208 209 239
3 23 72 29
3 76 29 72
3 29 76 28
3 74 28 76
3 30 823 471
3 46 823 30
3 471 824 210
3 46 824 471
3 241 825 210
3 472 825 241
3 472 826 30
3 241 826 472
3 473 827 183
3 73 827 473
3 26 828 183
3 473 828 26
3 474 829 27
3 26 829 474
3 27 830 474
3 73 830 27
3 148 41 45
3 148 81 41
3 81 128 41
3 31 43 30
3 43 148 30
3 45 831 148
3 30 831 45
3 46 832 45
3 30 832 46
3 81 129 128
3 182 252 6
3 252 147 6
3 252 140 147
3 26 103 25
3 26 6 103
3 182 833 26
3 6 833 182
3 183 834 26
3 182 834 183
3 147 139 6
3 139 147 140
3 475 835 211
3 45 835 475
3 211 836 475
3 214 836 211
3 214 209 45
3 478 837 477
3 476 837 478
3 478 838 46
3 477 838 478
3 479 839 477
3 209 839 479
3 479 840 476
3 477 840 479
3 481 841 480
3 476 841 481
3 481 842 45
3 480 842 481
3 482 843 480
3 46 843 482
3 482 844 476
3 480 844 482
3 208 46 209
3 484 845 208
3 483 845 484
3 210 846 208
3 484 846 210
3 485 847 483
3 46 847 485
3 485 848 210
3 483 848 485
3 242 849 243
3 31 849 242
3 243 850 240
3 31 850 243
3 488 851 487
3 31 851 488
3 488 852 486
3 487 852 488
3 489 853 487
3 30 853 489
3 489 854 31
3 487 854 489
3 486 855 491
3 490 855 486
3 491 856 240
3 490 856 491
3 492 857 490
3 30 857 492
3 490 858 492
3 486 858 490
3 240 30 239
3 494 859 493
3 241 859 494
3 494 860 30
3 493 860 494
3 241 861 495
3 239 861 241
3 495 862 493
3 239 862 495
3 77 863 72
3 496 863 77
3 496 864 182
3 77 864 496
3 182 76 72
3 499 865 498
3 497 865 499
3 499 866 183
3 498 866 499
3 500 867 498
3 182 867 500
3 500 868 497
3 498 868 500
3 502 869 501
3 497 869 502
3 502 870 76
3 501 870 502
3 503 871 501
3 183 871 503
3 503 872 497
3 501 872 503
3 76 183 74
3 505 873 504
3 73 873 505
3 505 874 183
3 504 874 505
3 73 875 506
3 74 875 73
3 506 876 504
3 74 876 506
3 24 877 25
3 23 877 24
3 23 878 25
3 29 878 23
3 508 879 507
3 509 879 508
3 509 880 26
3 508 880 509
3 510 881 508
3 29 881 510
3 507 882 508
3 510 882 507
3 512 883 511
3 25 883 512
3 512 884 26
3 511 884 512
3 513 885 511
3 507 885 513
3 513 886 25
3 511 886 513
3 28 26 29
3 515 887 28
3 514 887 515
3 27 888 28
3 515 888 27
3 516 889 514
3 26 889 516
3 516 890 27
3 514 890 516
3 243 98 242
3 243 211 98
3 243 214 211
3 211 151 98
3 151 100 98
3 115 108 77
3 115 114 108
3 24 115 23
3 115 77 23
3 77 72 23
3 98 256 44
3 98 212 256
3 98 101 212
3 98 100 101
3 100 52 101
3 52 53 101
3 104 12 115
3 12 71 115
3 71 116 115
3 116 114 115
3 116 199 114
3 116 198 199
3 144 36 93
3 179 93 36
3 95 219 97
3 222 97 219
3 517 891 38
3 85 891 517
3 517 892 141
3 38 892 517
3 518 893 88
3 141 893 518
3 518 894 85
3 88 894 518
3 519 895 85
3 63 895 519
3 519 896 88
3 85 896 519
3 520 897 61
3 88 897 520
3 520 898 63
3 61 898 520
3 521 899 61
3 63 899 521
3 521 900 163
3 61 900 521
3 522 901 161
3 163 901 522
3 522 902 63
3 161 902 522
3 523 903 93
3 144 903 523
3 523 904 161
3 93 904 523
3 524 905 163
3 161 905 524
3 524 906 144
3 163 906 524
3 525 907 141
3 135 907 525
3 525 908 38
3 141 908 525
3 526 909 137
3 38 909 526
3 526 910 135
3 137 910 526
3 527 911 137
3 135 911 527
3 527 912 222
3 137 912 527
3 528 913 219
3 222 913 528
3 528 914 135
3 219 914 528
3 143 133 144
3 36 144 133
3 96 220 95
3 219 95 220
3 87 915 142
3 88 915 87
3 141 916 88
3 142 916 141
3 66 917 87
3 61 917 66
3 88 918 61
3 87 918 88
3 160 919 66
3 163 919 160
3 61 920 163
3 66 920 61
3 144 921 143
3 163 921 144
3 160 922 163
3 143 922 160
3 141 923 142
3 134 923 141
3 134 924 135
3 141 924 134
3 135 925 134
3 219 925 135
3 220 926 219
3 134 926 220
3 145 79 143
3 133 143 79
3 181 221 96
3 220 96 221
3 142 927 87
3 40 927 142
3 86 928 40
3 87 928 86
3 87 929 66
3 86 929 87
3 60 930 86
3 66 930 60
3 60 931 66
3 162 931 60
3 160 932 162
3 66 932 160
3 143 933 145
3 160 933 143
3 162 934 160
3 145 934 162
3 142 935 40
3 138 935 142
3 138 936 134
3 142 936 138
3 134 937 138
3 220 937 134
3 221 938 220
3 138 938 221
3 168 180 145
3 79 145 180
3 94 223 181
3 221 181 223
3 40 39 86
3 83 86 39
3 86 83 60
3 62 60 83
3 62 939 60
3 107 939 62
3 162 940 107
3 60 940 162
3 145 941 168
3 162 941 145
3 107 942 162
3 168 942 107
3 39 943 136
3 40 943 39
3 138 944 40
3 136 944 138
3 138 945 136
3 221 945 138
3 223 946 221
3 136 946 223
3 19 7 168
3 180 168 7
3 90 5 94
3 223 94 5
3 39 131 83
3 84 83 131
3 83 84 62
3 64 62 84
3 64 106 62
3 107 62 106
3 168 107 19
3 106 19 107
3 131 39 188
3 136 188 39
3 136 223 188
3 5 188 223
3 529 947 123
3 19 947 529
3 123 948 529
3 216 948 123
3 530 949 7
3 216 949 530
3 19 950 7
3 530 950 19
3 531 951 91
3 90 951 531
3 4 952 91
3 531 952 4
3 532 953 5
3 4 953 532
3 5 954 532
3 90 954 5
3 534 955 131
3 84 955 534
3 534 956 533
3 131 956 534
3 535 957 533
3 130 957 535
3 535 958 131
3 533 958 535
3 537 959 130
3 536 959 537
3 89 960 130
3 537 960 89
3 538 961 536
3 84 961 538
3 538 962 89
3 536 962 538
3 540 963 64
3 539 963 540
3 540 964 84
3 64 964 540
3 541 965 539
3 89 965 541
3 541 966 84
3 539 966 541
3 543 967 89
3 542 967 543
3 65 968 89
3 543 968 65
3 544 969 542
3 64 969 544
3 544 970 65
3 542 970 544
3 546 971 545
3 65 971 546
3 546 972 64
3 545 972 546
3 547 973 105
3 65 973 547
3 547 974 545
3 105 974 547
3 548 975 106
3 549 975 548
3 549 976 105
3 548 976 549
3 550 977 106
3 548 977 550
3 550 978 64
3 106 978 550
3 552 979 551
3 19 979 552
3 552 980 123
3 551 980 552
3 553 981 19
3 551 981 553
3 553 982 106
3 19 982 553
3 555 983 554
3 105 983 555
3 555 984 106
3 554 984 555
3 556 985 105
3 554 985 556
3 556 986 123
3 105 986 556
3 558 987 130
3 187 987 558
3 558 988 557
3 130 988 558
3 559 989 557
3 131 989 559
3 559 990 130
3 557 990 559
3 561 991 188
3 131 991 561
3 561 992 560
3 188 992 561
3 562 993 560
3 187 993 562
3 560 994 562
3 188 994 560
3 564 995 563
3 188 995 564
3 564 996 187
3 563 996 564
3 565 997 5
3 188 997 565
3 565 998 563
3 5 998 565
3 567 999 566
3 4 999 567
3 567 1000 5
3 566 1000 567
3 568 1001 187
3 4 1001 568
3 568 1002 566
3 187 1002 568