OFF
1544 2002 0
-0.3233810623 0.0983720582 -0.2302109138
0.1004018378 -0.1428236179 -0.2483043837
-0.3365739514 0.0753217193 -0.2319396435
0.0872089487 -0.1658739569 -0.2500331134
-0.2030630801 0.4474234673 -0.2707574025
0.3362964293 0.1404474625 -0.2937854319
0.0666167780 0.2939354060 -0.2822714216
-0.4229479096 0.0632453082 -0.2995700023
0.1164115998 -0.2437306966 -0.3225980317
-0.1532680515 -0.0902427530 -0.3110840214
-0.0874828127 0.3557643840 0.0693393100
0.2207226508 0.1803495074 0.0561804349
-0.2633905583 0.0484220630 0.0462892457
0.0448149052 -0.1269928137 0.0331303705
-0.0693663942 0.3369844963 0.1814880618
0.2026069157 0.1821911189 0.1698761235
0.2388390693 0.1615696196 0.1683291866
0.0847358205 0.2492773522 0.1749086463
0.0485047010 0.2698982630 0.1764555390
-0.1055985478 0.3576059956 0.1830349987
-0.2452741398 0.0296421753 0.1584379974
0.0266991702 -0.1251512021 0.1468260591
0.0629313238 -0.1457727014 0.1452791222
-0.0911719251 -0.0580649688 0.1518585819
-0.1274030445 -0.0374440580 0.1534054746
-0.2815062934 0.0502636746 0.1599849343
-0.1804129247 0.3854029276 0.3833491800
0.3136574785 0.1042031790 0.3622547753
-0.2257029616 0.4111797135 0.3852828444
0.3589463779 0.0784270406 0.3603211594
0.0892667266 0.2319149841 0.3718351697
0.0439767931 0.2576917111 0.3737688297
-0.4002977542 0.0012247686 0.3545365802
0.0937726490 -0.2799749800 0.3334421755
-0.4455877911 0.0270015544 0.3564702446
0.1390615484 -0.3057511185 0.3315085596
-0.1306181029 -0.1522631749 0.3430225699
-0.1759080364 -0.1264864479 0.3449562299
-0.0393798295 0.1054024985 -0.0124073762
-0.0239695047 0.0966317252 -0.0130653222
-0.0187003893 0.1415331824 -0.0096976466
-0.0032900644 0.1327624091 -0.0103555926
-0.0504850227 0.1195554532 0.0359296082
-0.0030565473 0.0925615769 0.0339046429
-0.0411632555 0.0938782728 0.0340036880
-0.0299669337 0.0875058958 0.0335256595
-0.0396132218 0.1385504356 0.0373541942
0.0078152536 0.1115565592 0.0353292289
-0.0127012112 0.1436065592 0.0377332108
-0.0015048894 0.1372341822 0.0372551823
0.1934686067 -0.3406679663 0.3818685956
-0.4999939447 0.0540156534 0.4114760759
0.2154570897 -0.3022501504 0.3847498556
-0.4780054618 0.0924334693 0.4143573358
-0.0874841583 0.3690352749 -0.1076003135
0.2207213052 0.1936203983 -0.1207591887
0.0666180564 0.2813281309 -0.1141797291
-0.2633919039 0.0616929539 -0.1306503779
0.0448135596 -0.1137219227 -0.1438092531
-0.1092896892 -0.0260141901 -0.1372297934
-0.0693677398 0.3502553872 0.0045484382
0.2026055701 0.1954620099 -0.0070635001
0.2388377237 0.1748405105 -0.0086104370
-0.1055998934 0.3708768865 0.0060953751
-0.2452754854 0.0429130662 -0.0185016262
0.0266978245 -0.1118803112 -0.0301135645
0.0629299781 -0.1325018105 -0.0316605013
-0.2815076390 0.0635345655 -0.0169546893
-0.0308589431 0.1199361641 0.0499091084
-0.0118106151 0.1090948244 0.0490958374
0.3729395157 0.0953442091 0.0279635995
-0.1664208211 0.4023206847 0.0509916642
0.2996592947 0.1370515843 0.0310923088
-0.2397007318 0.4440278834 0.0541203602
0.1530546862 -0.2888339500 -0.0008490003
-0.3863056506 0.0181425256 0.0221790644
0.0797744652 -0.2471265747 0.0022797090
-0.4595855613 0.0598497243 0.0253077604
-0.0209092112 0.0829174105 0.0255826099
-0.0502210928 0.0996002429 0.0268340847
0.0075528330 0.1326456969 0.0293121327
-0.0217590485 0.1493285293 0.0305636075
-0.0874846966 0.3743435423 -0.1783749756
0.2207207669 0.1989286656 -0.1915338508
0.0666175181 0.2866363982 -0.1849543912
-0.2633924421 0.0670012213 -0.2014250400
0.0448130214 -0.1084136554 -0.2145839152
-0.1092902274 -0.0207059228 -0.2080044555
-0.2030610617 0.4275172021 -0.0053489170
0.3362984478 0.1205411974 -0.0283769464
-0.4229458912 0.0433390430 -0.0341615168
0.1164136183 -0.2636369617 -0.0571895462
0.2500355257 0.1538701535 0.1855451205
0.0959322769 0.2415778861 0.1921245801
0.1914117626 0.1872358183 0.1880480702
-0.0581699378 0.3292850302 0.1987039957
0.0373085138 0.2749435509 0.1946275299
-0.1167947350 0.3626512835 0.2012069895
0.0741277801 -0.1534721675 0.1624950561
-0.0799754687 -0.0657644349 0.1690745158
0.0155040170 -0.1201065027 0.1649980058
-0.2340776834 0.0219427092 0.1756539313
-0.1385992318 -0.0323987701 0.1715774655
-0.2927024806 0.0553089625 0.1781569252
-0.2457233277 0.4885839230 -0.3232744460
0.3899508157 0.1267905265 -0.3504146421
-0.2567178938 0.4693744479 -0.3247151185
0.3789562496 0.1075810514 -0.3518553146
-0.0115019252 0.0862316391 0.0304591897
-0.0518467389 0.1091938555 0.0321817172
0.0091775151 0.1223623230 0.0331689194
-0.0311672987 0.1453245394 0.0348914468
0.2500341801 0.1671410444 0.0086054969
0.1914104170 0.2005067092 0.0111084466
-0.0581712835 0.3425559211 0.0217643721
-0.1167960807 0.3759221744 0.0242673659
0.0741264345 -0.1402012766 -0.0144445675
0.0155026714 -0.1068356118 -0.0119416178
-0.2340790290 0.0352136001 -0.0012856923
-0.2927038262 0.0685798534 0.0012173016
0.1053767840 -0.2169124321 0.2577011889
-0.3569319284 0.0462101772 0.2774395238
-0.2030587068 0.4042931430 0.3042954243
0.3363008026 0.0973171382 0.2812673949
0.0666211513 0.2508050818 0.2927814052
-0.4229435363 0.0201149839 0.2754828245
0.1164159731 -0.2868610208 0.2524547951
-0.1532636782 -0.1333730773 0.2639688054
0.3032733076 0.1288482204 0.2836325520
-0.1590354048 0.3919708297 0.3033708868
0.3142672834 0.1480566643 0.2850731471
-0.1480414289 0.4111792736 0.3048114820
0.0943825720 -0.2361212885 0.2562605628
-0.3679261403 0.0270013208 0.2759988977
-0.1804152796 0.4086268977 0.0737060260
0.3136551237 0.1274271491 0.0526116213
-0.2257053164 0.4344036836 0.0756396905
0.3589440231 0.1016510107 0.0506780055
-0.4003001091 0.0244487386 0.0448934262
0.0937702942 -0.2567510100 0.0237990216
-0.4455901459 0.0502255245 0.0468270907
0.1390591936 -0.2825271484 0.0218654057
-0.0545019096 0.4293157270 -0.1386651880
0.2537035539 0.2539008503 -0.1518240632
-0.0874844275 0.3716893641 -0.1429870509
0.2207210361 0.1962744874 -0.1561459261
0.0666177872 0.2839822200 -0.1495664664
-0.0764904516 0.3908978080 -0.1415464557
0.2317150119 0.2154829313 -0.1547053309
-0.2633921730 0.0643470431 -0.1660371153
0.0448132905 -0.1110678336 -0.1791959905
-0.1092899583 -0.0233601010 -0.1726165308
0.5000000000 -0.4501661071 0.0489229179
0.4614741878 -0.4282391740 0.0505677828
0.4780115171 -0.4885839230 0.0460416579
0.4394857048 -0.4666569899 0.0476865228
-0.0177129122 0.0999862939 0.0467565955
-0.0358284719 0.1102967493 0.0475300419
-0.0068411113 0.1189812763 0.0481811815
-0.0249566710 0.1292917316 0.0489546279
-0.2030634165 0.4507411811 -0.3149921897
0.3362960929 0.1437651763 -0.3380202190
0.0666164416 0.2972531199 -0.3265062088
-0.4229482460 0.0665630220 -0.3438047895
0.1164112634 -0.2404129827 -0.3668328188
-0.1532683879 -0.0869250392 -0.3553188086
-0.0075477395 0.1471655896 0.0285648493
-0.0016615786 0.1438154862 0.0283135389
-0.0410077430 0.0887049736 0.0241804191
-0.0351215822 0.0853548702 0.0239291086
-0.2030580340 0.3976577866 0.3927640487
0.3363014754 0.0906817818 0.3697360194
0.0666218241 0.2441697254 0.3812500296
-0.4229428635 0.0134796275 0.3639514489
0.1164166459 -0.2934963772 0.3409234196
-0.1532630054 -0.1400084337 0.3524374298
-0.0075478977 0.1487256451 0.0077647666
-0.0016617368 0.1453755416 0.0075134561
-0.0410079012 0.0902650291 0.0033803364
-0.0351217404 0.0869149257 0.0031290259
-0.0177133990 0.1047877524 -0.0172608300
-0.0358289588 0.1150982078 -0.0164873836
-0.0068415981 0.1237827348 -0.0158362440
-0.0249571579 0.1340931902 -0.0150627976
-0.0123099495 0.1511380039 0.0119409738
0.0031003754 0.1423672306 0.0112830278
-0.0457699530 0.0926773879 0.0075565436
-0.0303596281 0.0839066147 0.0068985976
-0.1804158239 0.4139950986 0.0021322741
0.3136545794 0.1327953500 -0.0189621306
-0.2257058608 0.4397718845 0.0040659385
0.3589434788 0.1070192116 -0.0208957464
-0.4003006534 0.0298169396 -0.0266803257
0.0937697499 -0.2513828090 -0.0477747304
-0.4455906903 0.0555937254 -0.0247466613
0.1390586493 -0.2771589475 -0.0497083462
0.2500356920 0.1522297709 0.2074161973
0.0959324432 0.2399375036 0.2139956569
0.1914119289 0.1855954357 0.2099191470
-0.0581697715 0.3276446476 0.2205750725
0.0373086801 0.2733031683 0.2164986067
-0.1167945687 0.3610109009 0.2230780663
0.0741279465 -0.1551125501 0.1843661329
-0.0799753024 -0.0674048174 0.1909455926
0.0155041834 -0.1217468853 0.1868690826
-0.2340775171 0.0203023266 0.1975250081
-0.1385990654 -0.0340391527 0.1934485423
-0.2927023143 0.0536685799 0.2000280020
0.2500343464 0.1655006619 0.0304765737
0.1914105833 0.1988663266 0.0329795234
-0.0581711171 0.3409155385 0.0436354489
-0.1167959143 0.3742817919 0.0461384427
0.0741266008 -0.1418416591 0.0074265093
0.0155028377 -0.1084759944 0.0099294590
-0.2340788627 0.0335732175 0.0205853845
-0.2927036599 0.0669394709 0.0230883784
0.0789443039 -0.1705379723 0.2166958413
-0.3063127840 0.0487307706 0.2331444464
0.0877398387 -0.1551705985 0.2178483639
-0.2975172492 0.0640981445 0.2342969689
-0.1804176344 0.4318508678 -0.2359371279
0.3136527689 0.1506511192 -0.2570315326
-0.2257076713 0.4576276536 -0.2340034635
0.3589416682 0.1248749807 -0.2589651485
0.0892620169 0.2783629242 -0.2474511382
0.0439720835 0.3041396512 -0.2455174782
-0.4003024639 0.0476727087 -0.2647497277
0.0937679394 -0.2335270399 -0.2858441324
-0.4455925008 0.0734494946 -0.2628160633
0.1390568387 -0.2593031783 -0.2877777483
-0.1306228126 -0.1058152348 -0.2762637380
-0.1759127460 -0.0800385078 -0.2743300780
-0.0693659587 0.3326899355 0.2387470633
0.2026073512 0.1778965582 0.2271351250
0.2388395048 0.1572750589 0.2255881882
0.0847362560 0.2449827915 0.2321676478
0.0485051365 0.2656037022 0.2337145405
-0.1055981123 0.3533114348 0.2402940002
-0.2452737043 0.0253476145 0.2156969990
0.0266996056 -0.1294457628 0.2040850606
0.0629317592 -0.1500672622 0.2025381238
-0.0911714896 -0.0623595295 0.2091175835
-0.1274026091 -0.0417386188 0.2106644761
-0.2815058579 0.0459691138 0.2172439358
-0.0693690854 0.3635261891 -0.1723899980
0.2026042245 0.2087328117 -0.1840019364
0.2388363781 0.1881113124 -0.1855488732
0.0847331293 0.2758190450 -0.1789694135
0.0485020098 0.2964399558 -0.1774225209
-0.1056012390 0.3841476884 -0.1708430612
-0.2452768310 0.0561838681 -0.1954400624
0.0266964789 -0.0986095093 -0.2070520007
0.0629286325 -0.1192310086 -0.2085989376
-0.0911746163 -0.0315232760 -0.2020194779
-0.1274057358 -0.0109023652 -0.2004725852
-0.2815089846 0.0768053674 -0.1938931256
-0.1804134690 0.3907710395 0.3117766154
0.3136569342 0.1095712909 0.2906822107
-0.2257035059 0.4165478254 0.3137102798
0.3589458336 0.0837951525 0.2887485949
0.0892661823 0.2372830960 0.3002626051
0.0439762488 0.2630598230 0.3021962652
-0.4002982985 0.0065928805 0.2829640156
0.0937721047 -0.2746068681 0.2618696109
-0.4455883354 0.0323696663 0.2848976800
0.1390610041 -0.3003830066 0.2599359951
-0.1306186472 -0.1468950631 0.2714500053
-0.1759085807 -0.1211183361 0.2733836654
0.2500330008 0.1787715528 -0.1464630499
0.0959297519 0.2664792854 -0.1398835902
0.1914092377 0.2121372176 -0.1439601002
-0.0581724628 0.3541864295 -0.1333041747
0.0373059889 0.2998449502 -0.1373806405
-0.1167972600 0.3875526828 -0.1308011808
0.0741252552 -0.1285707682 -0.1695131143
-0.0799779936 -0.0408630356 -0.1629336546
0.0155014921 -0.0952051035 -0.1670101646
-0.2340802083 0.0468441085 -0.1563542391
-0.1386017567 -0.0074973708 -0.1604307049
-0.2927050055 0.0802103618 -0.1538512452
0.0789409399 -0.1373608341 -0.2256520303
-0.3063161481 0.0819079089 -0.2092034253
0.0877364747 -0.1219934602 -0.2244995077
-0.2975206132 0.0972752828 -0.2080509027
-0.0209093972 0.0847513974 0.0011302235
-0.0502212787 0.1014342298 0.0023816984
0.0075526471 0.1344796838 0.0048597464
-0.0217592345 0.1511625162 0.0061112212
-0.0308594550 0.1249846596 -0.0174020395
-0.0118111270 0.1141433200 -0.0182153105
-0.2030603889 0.4208817567 0.0831208948
0.3362991206 0.1139057519 0.0600928654
-0.4229452184 0.0367035976 0.0543082950
0.1164142911 -0.2702724072 0.0312802656
-0.0693673044 0.3459608265 0.0618074397
0.2026060056 0.1911674491 0.0501955014
0.2388381591 0.1705459498 0.0486485646
-0.1055994580 0.3665823258 0.0633543766
-0.2452750499 0.0386185054 0.0387573754
0.0266982600 -0.1161748719 0.0271454370
0.0629304136 -0.1367963712 0.0255985002
-0.2815072035 0.0592400048 0.0403043122
-0.0874820053 0.3478018495 0.1755030842
0.2207234582 0.1723869728 0.1623442090
0.0666202094 0.2600947054 0.1689236687
-0.2633897509 0.0404595285 0.1524530198
0.0448157126 -0.1349553482 0.1392941446
-0.1092875362 -0.0472476156 0.1458736043
-0.2030583704 0.4009755093 0.3485291428
0.3363011390 0.0939995046 0.3255011135
0.0666214877 0.2474874481 0.3370151237
-0.4229431999 0.0167973503 0.3197165431
0.1164163095 -0.2901786545 0.2966885137
-0.1532633418 -0.1366907110 0.3082025239
-0.2457177770 0.4338416494 0.4065994828
0.3899563663 0.0720482529 0.3794592868
-0.2567123431 0.4146321742 0.4051588103
0.3789618003 0.0528387777 0.3780186142
0.1934625514 -0.2809491352 -0.4143573358
-0.5000000000 0.1137344844 -0.3847498556
0.2154510344 -0.2425313193 -0.4114760759
-0.4780115171 0.1521523003 -0.3818685956
0.2500328344 0.1804118463 -0.1683329394
0.0959295856 0.2681195789 -0.1617534797
0.1914090714 0.2137775111 -0.1658299896
-0.0581726291 0.3558267230 -0.1551740642
0.0373058225 0.3014852437 -0.1592505300
-0.1167974263 0.3891929763 -0.1526710703
0.0741250889 -0.1269304747 -0.1913830037
-0.0799781599 -0.0392227421 -0.1848035441
0.0155013258 -0.0935648099 -0.1888800540
-0.2340803746 0.0484844020 -0.1782241286
-0.1386019230 -0.0058570773 -0.1823005943
-0.2927051718 0.0818506553 -0.1757211347
-0.0504853236 0.1225229248 -0.0036354310
-0.0030568482 0.0955290485 -0.0056603963
-0.0411635563 0.0968457445 -0.0055613512
-0.0299672345 0.0904733675 -0.0060393797
-0.0396135227 0.1415179072 -0.0022108450
0.0078149527 0.1145240309 -0.0042358103
-0.0127015121 0.1465740309 -0.0018318284
-0.0015051903 0.1402016539 -0.0023098569
-0.0693686500 0.3592317174 -0.1151321838
0.2026046599 0.2044383400 -0.1267441222
0.2388368135 0.1838168407 -0.1282910590
0.0847335647 0.2715245733 -0.1217115994
0.0485024452 0.2921454841 -0.1201647067
-0.1056008036 0.3798532167 -0.1135852470
-0.2452763956 0.0518893964 -0.1381822482
0.0266969144 -0.1029039810 -0.1497941866
0.0629290680 -0.1235254803 -0.1513411234
-0.0911741808 -0.0358177477 -0.1447616637
-0.1274053003 -0.0151968369 -0.1432147710
-0.2815085491 0.0725108957 -0.1366353114
-0.0874833510 0.3610727404 -0.0014365394
0.2207221126 0.1856578637 -0.0145954146
-0.2633910965 0.0537304194 -0.0244866038
0.0448143670 -0.1216844573 -0.0376454790
-0.0393794154 0.1013181062 0.0420494678
-0.0239690905 0.0925473329 0.0413915218
-0.0186999752 0.1374487901 0.0447591974
-0.0032896503 0.1286780168 0.0441012515
-0.1804181787 0.4372190687 -0.3075108798
0.3136522246 0.1560193201 -0.3286052845
-0.2257082156 0.4629958546 -0.3055772154
0.3589411239 0.1302431817 -0.3305389004
0.0892614726 0.2837311252 -0.3190248901
0.0439715391 0.3095078522 -0.3170912301
-0.4003030082 0.0530409096 -0.3363234796
0.0937673951 -0.2281588390 -0.3574178843
-0.4455930451 0.0788176955 -0.3343898152
0.1390562944 -0.2539349774 -0.3593515002
-0.1306233569 -0.1004470339 -0.3478374899
-0.1759132904 -0.0746703069 -0.3459038299
-0.0123098517 0.1501738116 0.0247964650
0.0031004732 0.1414030383 0.0241385190
-0.0457698553 0.0917131956 0.0204120348
-0.0303595304 0.0829424224 0.0197540888
-0.3233773618 0.0618771972 0.2563718637
0.1004055383 -0.1793184789 0.2382783938
-0.3365702509 0.0388268583 0.2546431340
0.0872126492 -0.2023688179 0.2365496641
0.3729416626 0.0741707173 0.3102679074
-0.1664186742 0.3811471929 0.3332959721
0.2996614417 0.1158780925 0.3133966167
0.1032620113 0.2276586608 0.3217819177
-0.2396985849 0.4228543915 0.3364246681
0.0299817903 0.2693660360 0.3249106270
0.1530568331 -0.3100074418 0.2814553076
-0.3863035037 -0.0030309662 0.3044833723
0.0797766122 -0.2683000666 0.2845840169
-0.1166228182 -0.1565194983 0.2929693179
-0.4595834144 0.0386762324 0.3076120683
-0.1899030392 -0.1148121231 0.2960980272
-0.0544992184 0.4027740342 0.2152128718
0.2537062451 0.2273591575 0.2020539966
-0.0874817362 0.3451476713 0.2108910089
0.2207237273 0.1697327946 0.1977321337
0.0666204785 0.2574405272 0.2043115934
-0.0764877603 0.3643561152 0.2123316041
0.2317177032 0.1889412385 0.1991727289
-0.2633894818 0.0378053503 0.1878409446
0.0448159817 -0.1376095264 0.1746820694
-0.1092872671 -0.0499017938 0.1812615290
-0.0462693657 0.1296711297 0.0377115631
0.0035996121 0.1012882435 0.0355824002
0.1053727471 -0.1770998484 -0.2731164945
-0.3569359652 0.0860227609 -0.2533781596
-0.2030627437 0.4441057267 -0.2265222591
0.3362967658 0.1371297220 -0.2495502885
0.0666171144 0.2906176655 -0.2380362782
-0.4229475732 0.0599275677 -0.2553348589
0.1164119363 -0.2470484371 -0.2783628883
-0.1532677151 -0.0935604936 -0.2668488780
0.3032692707 0.1686608041 -0.2471851315
-0.1590394416 0.4317834134 -0.2274467966
0.3142632466 0.1878692480 -0.2457445363
-0.1480454657 0.4509918573 -0.2260062014
0.0943785351 -0.1963087048 -0.2745571206
-0.3679301772 0.0668139045 -0.2548187858
-0.0389258686 0.0863054068 0.0135418848
-0.2030607253 0.4241994794 0.0388859889
-0.0874830818 0.3584185622 0.0339513853
0.3362987842 0.1172234746 0.0158579595
0.2207223817 0.1830036855 0.0207925101
-0.4229455548 0.0400213203 0.0100733891
0.1164139547 -0.2669546844 -0.0129546403
0.0094856147 0.0994981955 0.0145310070
-0.0521556848 0.1345812886 0.0171627909
-0.0566089489 0.1131663588 0.0155566543
-0.0067399711 0.0847834726 0.0134274913
-0.0037442014 0.1477740773 0.0181519131
0.0025409461 0.0908594185 0.0138831311
-0.0560828170 0.1242250832 0.0163860808
-0.0359295087 0.1492970427 0.0182663839
0.0139394691 0.1209141565 0.0161372210
-0.2633908274 0.0510762412 0.0109013210
0.0448146361 -0.1243386355 -0.0022575542
-0.0174502023 0.0818656591 0.0132087299
-0.0536813218 0.1024865698 0.0147556226
0.0134127470 0.1098544009 0.0153077171
-0.0452110161 0.1432200656 0.0178106668
-0.0141289021 0.1516912355 0.0184457882
0.0049194259 0.1408498958 0.0176325172
-0.0475889057 0.0932306195 0.0140613580
-0.0285405777 0.0823892798 0.0132480870
0.0110118420 0.1315939455 0.0169382527
-0.0252192775 0.1522148562 0.0184851454
0.3729418705 0.0721202390 0.3376067535
-0.1664184663 0.3790967146 0.3606348182
0.2996616496 0.1138276143 0.3407354627
0.1032622192 0.2256081826 0.3491207637
-0.2396983769 0.4208039133 0.3637635142
0.0299819983 0.2673155578 0.3522494730
0.1530570410 -0.3120579200 0.3087941537
-0.3863032958 -0.0050814444 0.3318222184
0.0797768201 -0.2703505448 0.3119228629
-0.1166226103 -0.1585699765 0.3203081639
-0.4595832064 0.0366257542 0.3349509144
-0.1899028312 -0.1168626013 0.3234368732
-0.0462696821 0.1327912406 -0.0038886023
0.0035992957 0.1044083544 -0.0060177652
-0.0115021811 0.0887558869 -0.0031963842
-0.0518469949 0.1117181032 -0.0014738568
0.0091772591 0.1248865708 -0.0004866546
-0.0311675547 0.1478487871 0.0012358729
0.4999996636 -0.4468484735 0.0046891993
0.4614738514 -0.4249215403 0.0063340643
0.4780111807 -0.4852662894 0.0018079394
0.4394853684 -0.4633393562 0.0034528043
0.3729393077 0.0973946873 0.0006247535
-0.1664210290 0.4043711629 0.0236528182
0.2996590868 0.1391020625 0.0037534627
-0.2397009397 0.4460783616 0.0267815142
0.1530544782 -0.2867834717 -0.0281878463
-0.3863058585 0.0201930039 -0.0051597816
0.0797742573 -0.2450760965 -0.0250591370
-0.4595857692 0.0619002025 -0.0020310856
0.3729371608 0.1185682682 -0.2816807418
-0.1664231759 0.4255447438 -0.2586526771
0.2996569399 0.1602756435 -0.2785520325
0.1032575095 0.2720562117 -0.2701667315
-0.2397030866 0.4672519425 -0.2555239811
0.0299772886 0.3137635870 -0.2670380223
0.1530523313 -0.2656098908 -0.3104933416
-0.3863080054 0.0413665848 -0.2874652769
0.0797721104 -0.2239025156 -0.3073646323
-0.1166273200 -0.1121219473 -0.2989793313
-0.4595879161 0.0830737834 -0.2843365809
-0.1899075409 -0.0704145721 -0.2958506221
-0.0874814671 0.3424934931 0.2462789336
0.2207239964 0.1670786164 0.2331200585
0.0666207476 0.2547863490 0.2396995181
-0.2633892126 0.0351511721 0.2232288693
0.0448162509 -0.1402637046 0.2100699941
-0.1092869979 -0.0525559720 0.2166494538
0.3729369529 0.1206187108 -0.3090191128
-0.1664233838 0.4275951864 -0.2859910481
0.2996567320 0.1623260860 -0.3058904036
0.1032573016 0.2741066543 -0.2975051026
-0.2397032945 0.4693023851 -0.2828623522
0.0299770807 0.3158140296 -0.2943763933
0.1530521234 -0.2635594482 -0.3378317126
-0.3863082133 0.0434170274 -0.3148036479
0.0797719025 -0.2218520730 -0.3347030034
-0.1166275279 -0.1100715047 -0.3263177024
-0.4595881240 0.0851242260 -0.3116749519
-0.1899077488 -0.0683641295 -0.3231889931
-0.2512178354 0.4516080486 0.0409421822
-0.2512178354 0.4516080486 0.0409421822
0.0611219532 0.2611066128 0.0266517479
0.3789590249 0.0802099146 0.0130816498
0.2200391014 0.1843438321 -0.1626017834
0.2200404891 0.1706582637 0.0198666988
0.2994990632 0.1322768734 -0.0747600668
0.2200397952 0.1775010479 -0.0713675423
0.2994997570 0.1254340891 0.0164741743
0.1405805273 0.2227252225 -0.0679750177
0.1405812211 0.2158824383 0.0232592234
0.2200397952 0.1775010479 -0.0713675423
0.3789576372 0.0938954830 -0.1693868324
0.2994976755 0.1459624418 -0.2572285490
0.2994983693 0.1391196576 -0.1659943079
0.3789569434 0.1007382672 -0.2606210735
0.2994990632 0.1322768734 -0.0747600668
0.3789583311 0.0870526988 -0.0781525913
0.2994983693 0.1391196576 -0.1659943079
0.2200418767 0.1569726953 0.2023351810
0.3789604126 0.0665243462 0.1955501320
0.2995004508 0.1185913049 0.1077084154
0.2995011447 0.1117485207 0.1989426565
0.3789597187 0.0733671304 0.1043158909
0.2995018385 0.1049057365 0.2901768976
0.3789611064 0.0596815620 0.2867843731
0.2995011447 0.1117485207 0.1989426565
0.2200404891 0.1706582637 0.0198666988
0.1405819150 0.2090396541 0.1144934645
0.2200411829 0.1638154795 0.1111009399
0.1405812211 0.2158824383 0.0232592234
0.2995004508 0.1185913049 0.1077084154
0.2994997570 0.1254340891 0.0164741743
0.2200411829 0.1638154795 0.1111009399
0.0611191779 0.2884777497 -0.3382852165
-0.0977979703 0.3652405304 -0.1490316853
0.0611205656 0.2747921812 -0.1558167343
-0.0183393962 0.3268591400 -0.2436584509
-0.0183387024 0.3200163558 -0.1524242098
0.0611198717 0.2816349655 -0.2470509754
-0.0183380085 0.3131735716 -0.0611899687
0.0611212594 0.2679493970 -0.0645824932
-0.0183387024 0.3200163558 -0.1524242098
-0.0977993580 0.3789260988 -0.3315001675
-0.1772579320 0.4173074891 -0.2368734019
-0.0977986641 0.3720833146 -0.2402659264
-0.1772586259 0.4241502734 -0.3281076430
-0.0183393962 0.3268591400 -0.2436584509
-0.0183400900 0.3337019242 -0.3348926920
-0.0977986641 0.3720833146 -0.2402659264
0.2200391014 0.1843438321 -0.1626017834
0.2200377137 0.1980294005 -0.3450702656
0.1405791396 0.2364107909 -0.2504435000
0.2200384076 0.1911866163 -0.2538360245
0.1405784458 0.2432535751 -0.3416777411
0.2994976755 0.1459624418 -0.2572285490
0.2994969817 0.1528052260 -0.3484627901
0.2200384076 0.1911866163 -0.2538360245
0.0611205656 0.2747921812 -0.1558167343
0.1405805273 0.2227252225 -0.0679750177
0.1405798335 0.2295680067 -0.1592092589
0.0611212594 0.2679493970 -0.0645824932
0.1405791396 0.2364107909 -0.2504435000
0.0611198717 0.2816349655 -0.2470509754
0.1405798335 0.2295680067 -0.1592092589
0.0611219532 0.2611066128 0.0266517479
-0.2567151185 0.4420033111 0.0402218459
-0.0977951949 0.3378693935 0.2159052791
-0.0977965826 0.3515549620 0.0334367969
-0.1772551567 0.3899363523 0.1280635625
-0.0977958888 0.3447121777 0.1246710380
-0.1772558505 0.3967791365 0.0368293214
-0.0183366209 0.2994880032 0.1212785135
-0.0183373147 0.3063307874 0.0300442724
-0.0977958888 0.3447121777 0.1246710380
-0.2567137308 0.4283177427 0.2226903281
-0.1772537690 0.3762507839 0.3105320447
-0.1772544629 0.3830935681 0.2192978036
-0.2567130370 0.4214749584 0.3139245692
-0.1772551567 0.3899363523 0.1280635625
-0.2567144246 0.4351605269 0.1314560870
-0.1772544629 0.3830935681 0.2192978036
-0.0977979703 0.3652405304 -0.1490316853
-0.2567165061 0.4556888795 -0.1422466363
-0.1772565444 0.4036219207 -0.0544049197
-0.1772572382 0.4104647049 -0.1456391608
-0.2567158123 0.4488460953 -0.0510123952
-0.1772579320 0.4173074891 -0.2368734019
-0.2567172000 0.4625316637 -0.2334808774
-0.1772572382 0.4104647049 -0.1456391608
-0.0977965826 0.3515549620 0.0334367969
-0.0183380085 0.3131735716 -0.0611899687
-0.0977972764 0.3583977462 -0.0577974442
-0.0183373147 0.3063307874 0.0300442724
-0.1772565444 0.4036219207 -0.0544049197
-0.1772558505 0.3967791365 0.0368293214
-0.0977972764 0.3583977462 -0.0577974442
0.0611247286 0.2337354760 0.3915887123
0.2200418767 0.1569726953 0.2023351810
0.0611233409 0.2474210444 0.2091202301
0.1405833027 0.1953540856 0.2969619467
0.1405826088 0.2021968699 0.2057277056
0.0611240347 0.2405782602 0.3003544712
0.1405819150 0.2090396541 0.1144934645
0.0611226471 0.2542638286 0.1178859890
0.1405826088 0.2021968699 0.2057277056
0.2200432644 0.1432871269 0.3848036633
0.2995018385 0.1049057365 0.2901768976
0.2200425706 0.1501299111 0.2935694222
0.2995025323 0.0980629523 0.3814111387
0.1405833027 0.1953540856 0.2969619467
0.1405839965 0.1885113014 0.3881961878
0.2200425706 0.1501299111 0.2935694222
-0.0977951949 0.3378693935 0.2159052791
-0.0977938073 0.3241838251 0.3983737613
-0.0183352332 0.2858024348 0.3037469957
-0.0977945011 0.3310266093 0.3071395202
-0.0183345394 0.2789596506 0.3949812368
-0.1772537690 0.3762507839 0.3105320447
-0.1772530752 0.3694079997 0.4017662858
-0.0977945011 0.3310266093 0.3071395202
0.0611233409 0.2474210444 0.2091202301
-0.0183366209 0.2994880032 0.1212785135
-0.0183359270 0.2926452190 0.2125127546
0.0611226471 0.2542638286 0.1178859890
-0.0183352332 0.2858024348 0.3037469957
0.0611240347 0.2405782602 0.3003544712
-0.0183359270 0.2926452190 0.2125127546
0.0666164609 0.2980824872 -0.3375648803
0.0666164609 0.2980824872 -0.3375648803
0.0721165193 0.2803160880 0.0280924204
0.0721137440 0.3076872248 -0.3368445440
0.2310336675 0.2035533072 -0.1611611108
0.0721151317 0.2940016564 -0.1543760618
0.1515737057 0.2556202660 -0.2490028274
0.1515743996 0.2487774818 -0.1577685863
0.0721144378 0.3008444406 -0.2456103029
0.1515750934 0.2419346976 -0.0665343452
0.0721158255 0.2871588722 -0.0631418207
0.1515743996 0.2487774818 -0.1577685863
0.2310322798 0.2172388757 -0.3436295930
0.3104922416 0.1651719169 -0.2557878765
0.2310329737 0.2103960915 -0.2523953519
0.3104915477 0.1720147011 -0.3470221176
0.1515737057 0.2556202660 -0.2490028274
0.1515730119 0.2624630502 -0.3402370685
0.2310329737 0.2103960915 -0.2523953519
-0.0868034042 0.3844500055 -0.1475910128
-0.0868047919 0.3981355739 -0.3300594950
-0.0073448301 0.3460686151 -0.2422177784
-0.0868040980 0.3912927897 -0.2388252539
-0.0073455239 0.3529113994 -0.3334520195
-0.1662633659 0.4365169643 -0.2354327294
-0.1662640598 0.4433597485 -0.3266669705
-0.0868040980 0.3912927897 -0.2388252539
0.0721151317 0.2940016564 -0.1543760618
-0.0073434424 0.3323830467 -0.0597492962
-0.0073441363 0.3392258309 -0.1509835373
0.0721158255 0.2871588722 -0.0631418207
-0.0073448301 0.3460686151 -0.2422177784
0.0721144378 0.3008444406 -0.2456103029
-0.0073441363 0.3392258309 -0.1509835373
0.3899535910 0.0994193897 0.0145223223
0.2310364428 0.1761821704 0.2037758536
0.2310350552 0.1898677388 0.0213073714
0.3104950169 0.1378007801 0.1091490880
0.2310357490 0.1830249546 0.1125416125
0.3104943231 0.1446435643 0.0179148469
0.1515764811 0.2282491292 0.1159341370
0.1515757872 0.2350919134 0.0246998959
0.2310357490 0.1830249546 0.1125416125
0.3899549787 0.0857338213 0.1969908046
0.3104964046 0.1241152116 0.2916175702
0.3104957108 0.1309579959 0.2003833291
0.3899556725 0.0788910371 0.2882250457
0.3104950169 0.1378007801 0.1091490880
0.3899542848 0.0925766055 0.1057565635
0.3104957108 0.1309579959 0.2003833291
0.2310336675 0.2035533072 -0.1611611108
0.3899522033 0.1131049581 -0.1679461599
0.3104936293 0.1514863485 -0.0733193942
0.3104929354 0.1583291327 -0.1645536353
0.3899528972 0.1062621739 -0.0767119188
0.3104922416 0.1651719169 -0.2557878765
0.3899515095 0.1199477423 -0.2591804010
0.3104929354 0.1583291327 -0.1645536353
0.2310350552 0.1898677388 0.0213073714
0.1515750934 0.2419346976 -0.0665343452
0.2310343613 0.1967105230 -0.0699268697
0.1515757872 0.2350919134 0.0246998959
0.3104936293 0.1514863485 -0.0733193942
0.3104943231 0.1446435643 0.0179148469
0.2310343613 0.1967105230 -0.0699268697
0.0721165193 0.2803160880 0.0280924204
0.0721192947 0.2529449511 0.3930293848
-0.0868006289 0.3570788687 0.2173459516
0.0721179070 0.2666305195 0.2105609026
-0.0073406671 0.3050119099 0.3051876682
-0.0073413609 0.3118546941 0.2139534271
0.0721186008 0.2597877353 0.3017951437
-0.0073420548 0.3186974783 0.1227191860
0.0721172132 0.2734733037 0.1193266615
-0.0073413609 0.3118546941 0.2139534271
-0.0867992412 0.3433933002 0.3998144338
-0.1662592029 0.3954602590 0.3119727172
-0.0867999350 0.3502360844 0.3085801927
-0.1662585091 0.3886174748 0.4032069583
-0.0073406671 0.3050119099 0.3051876682
-0.0073399733 0.2981691257 0.3964219093
-0.0867999350 0.3502360844 0.3085801927
0.2310364428 0.1761821704 0.2037758536
0.2310378305 0.1624966020 0.3862443358
0.1515778687 0.2145635608 0.2984026192
0.2310371367 0.1693393862 0.2950100947
0.1515785626 0.2077207766 0.3896368603
0.3104964046 0.1241152116 0.2916175702
0.3104970984 0.1172724274 0.3828518113
0.2310371367 0.1693393862 0.2950100947
0.0721179070 0.2666305195 0.2105609026
0.1515764811 0.2282491292 0.1159341370
0.1515771749 0.2214063450 0.2071683781
0.0721172132 0.2734733037 0.1193266615
0.1515778687 0.2145635608 0.2984026192
0.0721186008 0.2597877353 0.3017951437
0.1515771749 0.2214063450 0.2071683781
-0.2457205524 0.4612127862 0.0416625184
-0.0868034042 0.3844500055 -0.1475910128
-0.0868020165 0.3707644371 0.0348774694
-0.1662619783 0.4228313958 -0.0529642472
-0.0868027104 0.3776072213 -0.0563567717
-0.1662612844 0.4159886116 0.0382699939
-0.0073434424 0.3323830467 -0.0597492962
-0.0073427486 0.3255402625 0.0314849449
-0.0868027104 0.3776072213 -0.0563567717
-0.2457219400 0.4748983546 -0.1408059638
-0.1662633659 0.4365169643 -0.2354327294
-0.1662626721 0.4296741801 -0.1441984883
-0.2457226339 0.4817411388 -0.2320402049
-0.1662619783 0.4228313958 -0.0529642472
-0.2457212462 0.4680555704 -0.0495717227
-0.1662626721 0.4296741801 -0.1441984883
-0.0868006289 0.3570788687 0.2173459516
-0.2457191647 0.4475272178 0.2241310006
-0.1662605906 0.4091458274 0.1295042350
-0.1662598968 0.4023030432 0.2207384761
-0.2457198585 0.4543700020 0.1328967595
-0.1662592029 0.3954602590 0.3119727172
-0.2457184709 0.4406844336 0.3153652417
-0.1662598968 0.4023030432 0.2207384761
-0.0868020165 0.3707644371 0.0348774694
-0.0073420548 0.3186974783 0.1227191860
-0.0868013227 0.3639216529 0.1261117105
-0.0073427486 0.3255402625 0.0314849449
-0.1662605906 0.4091458274 0.1295042350
-0.1662612844 0.4159886116 0.0382699939
-0.0868013227 0.3639216529 0.1261117105
0.0666220116 0.2433402136 0.3923090485
0.0666220116 0.2433402136 0.3923090485
0.3844563080 0.0898146521 0.0138019861
0.3844563080 0.0898146521 0.0138019861
0.0721169330 0.2803158169 0.0280928777
0.3032712891 0.1487545123 0.0182237102
0.1876931018 0.2244883105 -0.1095461269
0.1876941111 0.2145351646 0.0231582940
0.2454821955 0.1866214114 -0.0456612083
0.1299050174 0.2524020637 -0.0407266246
0.3032702799 0.1587076582 -0.1144807106
0.2454811863 0.1965745573 -0.1783656292
0.2454821955 0.1866214114 -0.0456612083
0.1876951203 0.2045820187 0.1558627148
0.3032722984 0.1388013663 0.1509281311
0.2454832047 0.1766682655 0.0870432125
0.2454842139 0.1667151195 0.2197476334
0.1876941111 0.2145351646 0.0231582940
0.1299060266 0.2424489178 0.0919777962
0.2454832047 0.1766682655 0.0870432125
0.0721149145 0.3002221088 -0.2373159640
-0.0434612543 0.3560496152 -0.0996769595
0.0721159238 0.2902689628 -0.1046115432
0.0143268301 0.3281358620 -0.1684964618
0.0143278393 0.3181827160 -0.0357920409
-0.0434622635 0.3660027611 -0.2323813803
-0.1012503480 0.3939165143 -0.1635618780
0.0143268301 0.3281358620 -0.1684964618
0.1876931018 0.2244883105 -0.1095461269
0.1876920926 0.2344414564 -0.2422505478
0.1299040082 0.2623552096 -0.1734310455
0.2454811863 0.1965745573 -0.1783656292
0.0721159238 0.2902689628 -0.1046115432
0.1299050174 0.2524020637 -0.0407266246
0.1299040082 0.2623552096 -0.1734310455
0.0721169330 0.2803158169 0.0280928777
-0.1590374232 0.4118771215 0.0379620451
-0.0434592359 0.3361433233 0.1657318822
-0.0434602451 0.3460964692 0.0330274614
-0.1012483295 0.3740102224 0.1018469637
0.0143288485 0.3082295701 0.0969123800
-0.1590364140 0.4019239756 0.1706664660
-0.1012473203 0.3640570765 0.2345513845
-0.1012483295 0.3740102224 0.1018469637
-0.0434612543 0.3560496152 -0.0996769595
-0.1590384324 0.4218302675 -0.0947423758
-0.1012493388 0.3839633684 -0.0308574572
-0.1012503480 0.3939165143 -0.1635618780
-0.0434602451 0.3460964692 0.0330274614
0.0143278393 0.3181827160 -0.0357920409
-0.1012493388 0.3839633684 -0.0308574572
0.0721189514 0.2604095250 0.2935017194
0.1876951203 0.2045820187 0.1558627148
0.0721179422 0.2703626710 0.1607972985
0.1299070358 0.2324957718 0.2246822171
0.1299060266 0.2424489178 0.0919777962
0.1876961295 0.1946288727 0.2885671357
0.2454842139 0.1667151195 0.2197476334
0.1299070358 0.2324957718 0.2246822171
-0.0434592359 0.3361433233 0.1657318822
-0.0434582267 0.3261901774 0.2984363031
0.0143298578 0.2982764242 0.2296168008
-0.1012473203 0.3640570765 0.2345513845
0.0721179422 0.2703626710 0.1607972985
0.0143288485 0.3082295701 0.0969123800
0.0143298578 0.2982764242 0.2296168008
0.0831109088 0.2995242608 0.0295334729
0.0831088904 0.3194305527 -0.2358753689
0.1986870777 0.2436967544 -0.1081055317
0.0831098996 0.3094774067 -0.1031709480
0.1408979841 0.2815636535 -0.1719904503
0.1408989933 0.2716105076 -0.0392860294
0.1986860685 0.2536499004 -0.2408099526
0.2564751622 0.2157830012 -0.1769250340
0.1408979841 0.2815636535 -0.1719904503
-0.0324672785 0.3752580591 -0.0982363643
-0.0324682877 0.3852112050 -0.2309407851
0.0253208060 0.3473443059 -0.1670558666
-0.0902563721 0.4131249582 -0.1621212829
0.0831098996 0.3094774067 -0.1031709480
0.0253218152 0.3373911599 -0.0343514457
0.0253208060 0.3473443059 -0.1670558666
0.3142652650 0.1679629562 0.0196643054
0.1986890961 0.2237904626 0.1573033100
0.1986880869 0.2337436085 0.0245988891
0.2564771806 0.1958767094 0.0884838077
0.1409000025 0.2616573617 0.0934183914
0.3142662742 0.1580098102 0.1523687263
0.2564781898 0.1859235634 0.2211882286
0.2564771806 0.1958767094 0.0884838077
0.1986870777 0.2436967544 -0.1081055317
0.3142642558 0.1779161021 -0.1130401154
0.2564761714 0.2058298553 -0.0442206131
0.2564751622 0.2157830012 -0.1769250340
0.1986880869 0.2337436085 0.0245988891
0.1408989933 0.2716105076 -0.0392860294
0.2564761714 0.2058298553 -0.0442206131
0.0831109088 0.2995242608 0.0295334729
0.0831129273 0.2796179690 0.2949423146
-0.0324652600 0.3553517672 0.1671724774
0.0831119181 0.2895711149 0.1622378937
0.0253238336 0.3174848681 0.2310573960
0.0253228244 0.3274380140 0.0983529751
-0.0324642508 0.3453986213 0.2998768983
-0.0902533445 0.3832655204 0.2359919797
0.0253238336 0.3174848681 0.2310573960
0.1986890961 0.2237904626 0.1573033100
0.1986901054 0.2138373166 0.2900077309
0.1409010117 0.2517042158 0.2261228123
0.2564781898 0.1859235634 0.2211882286
0.0831119181 0.2895711149 0.1622378937
0.1409000025 0.2616573617 0.0934183914
0.1409010117 0.2517042158 0.2261228123
-0.1480434473 0.4310855655 0.0394026403
-0.0324672785 0.3752580591 -0.0982363643
-0.0324662692 0.3653049131 0.0344680566
-0.0902553629 0.4031718123 -0.0294168620
0.0253218152 0.3373911599 -0.0343514457
-0.1480444565 0.4410387114 -0.0933017806
-0.0902563721 0.4131249582 -0.1621212829
-0.0902553629 0.4031718123 -0.0294168620
-0.0324652600 0.3553517672 0.1671724774
-0.1480424381 0.4211324195 0.1721070611
-0.0902543537 0.3932186663 0.1032875589
-0.0902533445 0.3832655204 0.2359919797
-0.0324662692 0.3653049131 0.0344680566
0.0253228244 0.3274380140 0.0983529751
-0.0902543537 0.3932186663 0.1032875589
-0.0654948350 0.3968359211 0.0368332080
-0.0654948350 0.3968359211 0.0368332080
0.0776136258 0.2899195233 0.0288131366
0.2317163576 0.2022120849 0.0222336990
0.1546643189 0.2527012273 -0.0629460972
0.1546649917 0.2460658041 0.0255234178
0.2317156848 0.2088475081 -0.0662358160
0.1546656645 0.2394303809 0.1139929328
0.2317170304 0.1955766617 0.1107032140
0.1546649917 0.2460658041 0.0255234178
0.0776122802 0.3031903696 -0.1481258933
0.0005615871 0.3404086656 -0.0563666596
0.0776129530 0.2965549464 -0.0596563784
0.0005609143 0.3470440888 -0.1448361745
0.1546643189 0.2527012273 -0.0629460972
0.1546636461 0.2593366505 -0.1514156121
0.0776129530 0.2965549464 -0.0596563784
0.0776136258 0.2899195233 0.0288131366
-0.0764891060 0.3776269616 0.0353925742
0.0005629327 0.3271378192 0.1205723704
0.0005622599 0.3337732424 0.0321028554
-0.0764884332 0.3709915384 0.1238620892
0.0005615871 0.3404086656 -0.0563666596
-0.0764897788 0.3842623848 -0.0530769408
0.0005622599 0.3337732424 0.0321028554
0.0776149714 0.2766486769 0.2057521665
0.1546656645 0.2394303809 0.1139929328
0.0776142986 0.2832841001 0.1172826516
0.1546663373 0.2327949577 0.2024624477
0.0005629327 0.3271378192 0.1205723704
0.0005636055 0.3205023960 0.2090418853
0.0776142986 0.2832841001 0.1172826516
0.0886065512 0.3223993292 -0.1466852595
0.0886065512 0.3223993292 -0.1466852595
0.0996021678 0.3283374423 0.0316944043
0.0996008222 0.3416082887 -0.1452446256
0.1766528608 0.2911191463 -0.0600648294
0.0996014950 0.3349728655 -0.0567751106
0.1766521880 0.2977545695 -0.1485343444
0.0225501291 0.3788265846 -0.0534853919
0.0225494563 0.3854620078 -0.1419549068
0.0996014950 0.3349728655 -0.0567751106
0.2537048995 0.2406300039 0.0251149667
0.1766542065 0.2778482999 0.1168742005
0.1766535337 0.2844837231 0.0284046855
0.2537055723 0.2339945807 0.1135844817
0.1766528608 0.2911191463 -0.0600648294
0.2537042267 0.2472654271 -0.0633545482
0.1766535337 0.2844837231 0.0284046855
0.0996021678 0.3283374423 0.0316944043
0.0996035134 0.3150665959 0.2086334342
0.0225514747 0.3655557382 0.1234536381
0.0996028406 0.3217020191 0.1201639193
0.0225521475 0.3589203150 0.2119231530
0.1766542065 0.2778482999 0.1168742005
0.1766548793 0.2712128767 0.2053437154
0.0996028406 0.3217020191 0.1201639193
-0.0545005640 0.4160448806 0.0382738419
0.0225501291 0.3788265846 -0.0534853919
0.0225508019 0.3721911614 0.0349841231
-0.0545012368 0.4226803038 -0.0501956731
0.0225514747 0.3655557382 0.1234536381
-0.0544998912 0.4094094574 0.1267433569
0.0225508019 0.3721911614 0.0349841231
0.0886092424 0.2958576364 0.2071928004
0.0886092424 0.2958576364 0.2071928004
0.2427106285 0.2214210444 0.0236743329
0.2427106285 0.2214210444 0.0236743329
-0.1136859221 -0.0443150317 0.0037462080
0.0789426219 -0.1539494032 -0.0044780945
-0.0173724911 -0.0908379329 -0.1109529111
-0.0173716501 -0.0991322175 -0.0003659432
0.0789417809 -0.1456551186 -0.1150650624
-0.0173708091 -0.1074265020 0.1102210247
0.0789434629 -0.1622436878 0.1061088734
-0.0173716501 -0.0991322175 -0.0003659432
-0.1136876041 -0.0277264626 -0.2174277278
-0.2100010351 0.0187964386 -0.1027286086
-0.1136867631 -0.0360207471 -0.1068407599
-0.2100018761 0.0270907232 -0.2133155765
-0.0173724911 -0.0908379329 -0.1109529111
-0.0173733321 -0.0825436483 -0.2215398790
-0.1136867631 -0.0360207471 -0.1068407599
-0.1136859221 -0.0443150317 0.0037462080
-0.3063144660 0.0653193398 0.0119705105
-0.2099993530 0.0022078695 0.1184453272
-0.2100001941 0.0105021540 0.0078583593
-0.3063136250 0.0570250552 0.1225574784
-0.2100010351 0.0187964386 -0.1027286086
-0.3063153070 0.0736136243 -0.0986164574
-0.2100001941 0.0105021540 0.0078583593
-0.1136842400 -0.0609036008 0.2249201438
-0.0173708091 -0.1074265020 0.1102210247
-0.1136850811 -0.0526093163 0.1143331759
-0.0173699681 -0.1157207866 0.2208079926
-0.2099993530 0.0022078695 0.1184453272
-0.2099985120 -0.0060864151 0.2290322951
-0.1136850811 -0.0526093163 0.1143331759
-0.1048903872 -0.0289476579 0.0048987306
-0.1048920693 -0.0123590887 -0.2162752052
-0.0085769563 -0.0754705590 -0.1098003886
-0.1048912282 -0.0206533733 -0.1056882373
-0.0085777973 -0.0671762745 -0.2203873565
-0.2012055002 0.0341638125 -0.1015760861
-0.2012063412 0.0424580970 -0.2121630540
-0.1048912282 -0.0206533733 -0.1056882373
0.0877381567 -0.1385820293 -0.0033255719
-0.0085752742 -0.0920591282 0.1113735472
-0.0085761153 -0.0837648436 0.0007865793
0.0877389977 -0.1468763139 0.1072613960
-0.0085769563 -0.0754705590 -0.1098003886
0.0877373157 -0.1302877448 -0.1139125398
-0.0085761153 -0.0837648436 0.0007865793
-0.1048903872 -0.0289476579 0.0048987306
-0.1048887052 -0.0455362270 0.2260726664
-0.2012038182 0.0175752433 0.1195978497
-0.1048895462 -0.0372419424 0.1154856985
-0.2012029772 0.0092809588 0.2301848177
-0.0085752742 -0.0920591282 0.1113735472
-0.0085744332 -0.1003534127 0.2219605151
-0.1048895462 -0.0372419424 0.1154856985
-0.2975189312 0.0806867136 0.0131230331
-0.2012055002 0.0341638125 -0.1015760861
-0.2012046592 0.0258695279 0.0090108818
-0.2975197722 0.0889809982 -0.0974639348
-0.2012038182 0.0175752433 0.1195978497
-0.2975180902 0.0723924291 0.1237100010
-0.2012046592 0.0258695279 0.0090108818
-0.1246806511 -0.0635235493 0.0023050103
0.0872107990 -0.1841213874 -0.0067417247
-0.0187358512 -0.1146987531 -0.1238640516
-0.0187349261 -0.1238224683 -0.0022183572
0.0342374739 -0.1494100702 -0.0653028881
-0.0717082511 -0.0891111512 -0.0607795206
0.0872098739 -0.1749976721 -0.1283874191
0.0342365488 -0.1402863550 -0.1869485825
0.0342374739 -0.1494100702 -0.0653028881
-0.0187340009 -0.1329461836 0.1194273372
0.0872117241 -0.1932451026 0.1149039697
0.0342383990 -0.1585337855 0.0563428063
0.0342393241 -0.1676575007 0.1779885006
-0.0187349261 -0.1238224683 -0.0022183572
-0.0717073260 -0.0982348664 0.0608661738
0.0342383990 -0.1585337855 0.0563428063
-0.1246825013 -0.0452761188 -0.2409863785
-0.2306273012 0.0058990850 -0.1148173166
-0.1246815762 -0.0543998340 -0.1193406841
-0.1776549013 -0.0196885169 -0.1779018475
-0.1776539762 -0.0288122322 -0.0562561531
-0.2306282264 0.0150228002 -0.2364630110
-0.2836006263 0.0406104021 -0.1733784800
-0.1776549013 -0.0196885169 -0.1779018475
-0.0187358512 -0.1146987531 -0.1238640516
-0.0187367763 -0.1055750378 -0.2455097459
-0.0717091762 -0.0799874359 -0.1824252150
0.0342365488 -0.1402863550 -0.1869485825
-0.1246815762 -0.0543998340 -0.1193406841
-0.0717082511 -0.0891111512 -0.0607795206
-0.0717091762 -0.0799874359 -0.1824252150
-0.1246806511 -0.0635235493 0.0023050103
-0.3365721012 0.0570742888 0.0113517453
-0.2306254510 -0.0123483455 0.1284740722
-0.2306263761 -0.0032246303 0.0068283778
-0.2835987761 0.0223629716 0.0699129087
-0.1776530511 -0.0379359474 0.0653895412
-0.3365711760 0.0479505735 0.1329974397
-0.2835978510 0.0132392564 0.1915586031
-0.2835987761 0.0223629716 0.0699129087
-0.2306273012 0.0058990850 -0.1148173166
-0.3365730263 0.0661980040 -0.1102939491
-0.2835997012 0.0314866869 -0.0517327857
-0.2836006263 0.0406104021 -0.1733784800
-0.2306263761 -0.0032246303 0.0068283778
-0.1776539762 -0.0288122322 -0.0562561531
-0.2835997012 0.0314866869 -0.0517327857
-0.1246788009 -0.0817709798 0.2455963991
-0.0187340009 -0.1329461836 0.1194273372
-0.1246797260 -0.0726472645 0.1239507047
-0.0717064009 -0.1073585817 0.1825118681
-0.0717073260 -0.0982348664 0.0608661738
-0.0187330758 -0.1420698988 0.2410730316
0.0342393241 -0.1676575007 0.1779885006
-0.0717064009 -0.1073585817 0.1825118681
-0.2306254510 -0.0123483455 0.1284740722
-0.2306245259 -0.0214720608 0.2501197666
-0.1776521259 -0.0470596627 0.1870352356
-0.2835978510 0.0132392564 0.1915586031
-0.1246797260 -0.0726472645 0.1239507047
-0.1776530511 -0.0379359474 0.0653895412
-0.1776521259 -0.0470596627 0.1870352356
-0.1114877620 -0.0404732104 0.0040337400
-0.1114896122 -0.0222257799 -0.2392576488
-0.0055429621 -0.0916484142 -0.1221353219
-0.1114886871 -0.0313494951 -0.1176119544
-0.0585162872 -0.0569370970 -0.1806964853
-0.0585153620 -0.0660608123 -0.0590507909
-0.0055438872 -0.0825246989 -0.2437810163
0.0474294379 -0.1172360160 -0.1852198528
-0.0585162872 -0.0569370970 -0.1806964853
-0.2174344121 0.0289494239 -0.1130885869
-0.2174353373 0.0380731392 -0.2347342813
-0.1644620122 0.0033618220 -0.1761731178
-0.2704077372 0.0636607411 -0.1716497503
-0.1114886871 -0.0313494951 -0.1176119544
-0.1644610871 -0.0057618932 -0.0545274235
-0.1644620122 0.0033618220 -0.1761731178
0.1004036881 -0.1610710484 -0.0050129950
-0.0055411119 -0.1098958446 0.1211560669
-0.0055420370 -0.1007721294 -0.0004896275
0.0474312881 -0.1354834465 0.0580715360
-0.0585144369 -0.0751845275 0.0625949034
0.1004046132 -0.1701947637 0.1166326994
0.0474322132 -0.1446071618 0.1797172303
0.0474312881 -0.1354834465 0.0580715360
-0.0055429621 -0.0916484142 -0.1221353219
0.1004027630 -0.1519473332 -0.1266586894
0.0474303630 -0.1263597313 -0.0635741584
0.0474294379 -0.1172360160 -0.1852198528
-0.0055420370 -0.1007721294 -0.0004896275
-0.0585153620 -0.0660608123 -0.0590507909
0.0474303630 -0.1263597313 -0.0635741584
-0.1114877620 -0.0404732104 0.0040337400
-0.1114859118 -0.0587206409 0.2473251288
-0.2174325619 0.0107019934 0.1302028019
-0.1114868369 -0.0495969256 0.1256794344
-0.1644592368 -0.0240093237 0.1887639653
-0.1644601620 -0.0148856085 0.0671182709
-0.2174316368 0.0015782782 0.2518484962
-0.2704049619 0.0362895953 0.1932873328
-0.1644592368 -0.0240093237 0.1887639653
-0.0055411119 -0.1098958446 0.1211560669
-0.0055401867 -0.1190195599 0.2428017613
-0.0585135118 -0.0843082428 0.1842405978
0.0474322132 -0.1446071618 0.1797172303
-0.1114868369 -0.0495969256 0.1256794344
-0.0585144369 -0.0751845275 0.0625949034
-0.0585135118 -0.0843082428 0.1842405978
-0.3233792121 0.0801246277 0.0130804750
-0.2174344121 0.0289494239 -0.1130885869
-0.2174334870 0.0198257087 0.0085571075
-0.2704068121 0.0545370258 -0.0500040560
-0.1644610871 -0.0057618932 -0.0545274235
-0.3233801372 0.0892483429 -0.1085652194
-0.2704077372 0.0636607411 -0.1716497503
-0.2704068121 0.0545370258 -0.0500040560
-0.2174325619 0.0107019934 0.1302028019
-0.3233782870 0.0710009125 0.1347261694
-0.2704058870 0.0454133106 0.0716416384
-0.2704049619 0.0362895953 0.1932873328
-0.2174334870 0.0198257087 0.0085571075
-0.1644601620 -0.0148856085 0.0671182709
-0.2704058870 0.0454133106 0.0716416384
-0.1367738026 -0.0846536920 0.0007208885
0.0943805536 -0.2162149967 -0.0091482789
-0.0211976337 -0.1404811984 -0.1369181160
-0.0211966245 -0.1504343443 -0.0042136952
0.0365914599 -0.1783480975 -0.0730331975
-0.0789857182 -0.1125674452 -0.0680986138
0.0943795443 -0.2062618507 -0.1418526998
0.0365904507 -0.1683949516 -0.2057376183
0.0365914599 -0.1783480975 -0.0730331975
-0.0211956153 -0.1603874903 0.1284907257
0.0943815628 -0.2261681426 0.1235561420
0.0365924691 -0.1883012435 0.0596712234
0.0365934783 -0.1982543894 0.1923756442
-0.0211966245 -0.1504343443 -0.0042136952
-0.0789847090 -0.1225205911 0.0646058071
0.0365924691 -0.1883012435 0.0596712234
-0.1367758210 -0.0647474001 -0.2646879532
-0.2523519899 -0.0089198938 -0.1270489486
-0.1367748118 -0.0747005461 -0.1319835323
-0.1945639055 -0.0368336470 -0.1958684509
-0.1945628963 -0.0467867929 -0.0631640300
-0.2523529991 0.0010332522 -0.2597533695
-0.3101410836 0.0289470054 -0.1909338672
-0.1945639055 -0.0368336470 -0.1958684509
-0.0211976337 -0.1404811984 -0.1369181160
-0.0211986430 -0.1305280525 -0.2696225369
-0.0789867274 -0.1026142993 -0.2008030346
0.0365904507 -0.1683949516 -0.2057376183
-0.1367748118 -0.0747005461 -0.1319835323
-0.0789857182 -0.1125674452 -0.0680986138
-0.0789867274 -0.1026142993 -0.2008030346
-0.1367738026 -0.0846536920 0.0007208885
-0.3679281588 0.0469076126 0.0105900560
-0.2523499715 -0.0288261856 0.1383598931
-0.2523509807 -0.0188730397 0.0056554722
-0.3101390651 0.0090407135 0.0744749745
-0.1945618870 -0.0567399388 0.0695403908
-0.3679271496 0.0369544667 0.1432944768
-0.3101380559 -0.0009124324 0.2071793954
-0.3101390651 0.0090407135 0.0744749745
-0.2523519899 -0.0089198938 -0.1270489486
-0.3679291680 0.0568607586 -0.1221143649
-0.3101400743 0.0189938594 -0.0582294463
-0.3101410836 0.0289470054 -0.1909338672
-0.2523509807 -0.0188730397 0.0056554722
-0.1945628963 -0.0467867929 -0.0631640300
-0.3101400743 0.0189938594 -0.0582294463
-0.1367717842 -0.1045599839 0.2661297302
-0.0211956153 -0.1603874903 0.1284907257
-0.1367727934 -0.0946068379 0.1334253094
-0.0789836997 -0.1324737371 0.1973102280
-0.0789847090 -0.1225205911 0.0646058071
-0.0211946061 -0.1703406362 0.2611951465
0.0365934783 -0.1982543894 0.1923756442
-0.0789836997 -0.1324737371 0.1973102280
-0.2523499715 -0.0288261856 0.1383598931
-0.2523489623 -0.0387793315 0.2710643140
-0.1945608778 -0.0666930847 0.2022448117
-0.3101380559 -0.0009124324 0.2071793954
-0.1367727934 -0.0946068379 0.1334253094
-0.1945618870 -0.0567399388 0.0695403908
-0.1945608778 -0.0666930847 0.2022448117
-0.1257795906 -0.0654448356 0.0021615147
-0.1257816091 -0.0455385438 -0.2632473271
-0.0102034218 -0.1212723420 -0.1354774899
-0.1257805999 -0.0554916897 -0.1305429062
-0.0679925154 -0.0834054429 -0.1993624085
-0.0679915062 -0.0933585888 -0.0666579876
-0.0102044310 -0.1113191961 -0.2681819108
0.0475846627 -0.1491860952 -0.2042969922
-0.0679925154 -0.0834054429 -0.1993624085
-0.2413577779 0.0102889626 -0.1256083225
-0.2413587872 0.0202421086 -0.2583127433
-0.1835696935 -0.0176247906 -0.1944278248
-0.2991468716 0.0481558618 -0.1894932411
-0.1257805999 -0.0554916897 -0.1305429062
-0.1835686843 -0.0275779365 -0.0617234039
-0.1835696935 -0.0176247906 -0.1944278248
0.1053747655 -0.1970061403 -0.0077076528
-0.0102014033 -0.1411786339 0.1299313518
-0.0102024126 -0.1312254879 -0.0027730691
0.0475866811 -0.1690923871 0.0611118495
-0.0679904970 -0.1033117347 0.0660464332
0.1053757747 -0.2069592862 0.1249967681
0.0475876903 -0.1790455330 0.1938162704
0.0475866811 -0.1690923871 0.0611118495
-0.0102034218 -0.1212723420 -0.1354774899
0.1053737563 -0.1870529943 -0.1404120736
0.0475856719 -0.1591392411 -0.0715925713
0.0475846627 -0.1491860952 -0.2042969922
-0.0102024126 -0.1312254879 -0.0027730691
-0.0679915062 -0.0933585888 -0.0666579876
0.0475856719 -0.1591392411 -0.0715925713
-0.1257795906 -0.0654448356 0.0021615147
-0.1257775722 -0.0853511275 0.2675703564
-0.2413557595 -0.0096173292 0.1398005192
-0.1257785814 -0.0753979815 0.1348659355
-0.1835666659 -0.0474842284 0.2036854378
-0.1835676751 -0.0375310824 0.0709810169
-0.2413547503 -0.0195704752 0.2725049401
-0.2991438439 0.0182964240 0.2086200215
-0.1835666659 -0.0474842284 0.2036854378
-0.0102014033 -0.1411786339 0.1299313518
-0.0102003941 -0.1511317798 0.2626357727
-0.0679894878 -0.1132648807 0.1987508541
0.0475876903 -0.1790455330 0.1938162704
-0.1257785814 -0.0753979815 0.1348659355
-0.0679904970 -0.1033117347 0.0660464332
-0.0679894878 -0.1132648807 0.1987508541
-0.3569339468 0.0661164690 0.0120306821
-0.2413577779 0.0102889626 -0.1256083225
-0.2413567687 0.0003358167 0.0070960984
-0.2991458624 0.0382027158 -0.0567888202
-0.1835686843 -0.0275779365 -0.0617234039
-0.3569349560 0.0760696150 -0.1206737388
-0.2991468716 0.0481558618 -0.1894932411
-0.2991458624 0.0382027158 -0.0567888202
-0.2413557595 -0.0096173292 0.1398005192
-0.3569329376 0.0561633231 0.1447351029
-0.2991448532 0.0282495699 0.0759156007
-0.2991438439 0.0182964240 0.2086200215
-0.2413567687 0.0003358167 0.0070960984
-0.1835676751 -0.0375310824 0.0709810169
-0.2991448532 0.0282495699 0.0759156007
-0.4890027309 0.1030839769 0.0148037401
-0.4999969724 0.0838750689 0.0133631101
-0.4835071240 0.1276181386 -0.1835324278
-0.4890027309 0.1030839769 0.0148037401
-0.4780084894 0.1222928848 0.0162443701
-0.4944983378 0.0785498151 0.2131399080
-0.1532656966 -0.1134667409 -0.0014406300
0.1934655791 -0.3108085507 -0.0162443701
0.0200984274 -0.1972079381 -0.2078989829
0.0200999412 -0.2121376458 -0.0088425000
0.1067820032 -0.2540082444 -0.1120716765
0.0200991843 -0.2046727919 -0.1083707415
0.1067827602 -0.2614730983 -0.0125434351
-0.0665836346 -0.1553373395 -0.1046698065
-0.0665828777 -0.1628021934 -0.0051415650
0.0200991843 -0.2046727919 -0.1083707415
0.1934640653 -0.2958788430 -0.2153008530
0.1067804894 -0.2390785366 -0.3111281594
0.1067812463 -0.2465433905 -0.2115999179
0.1934633084 -0.2884139891 -0.3148290944
0.1067820032 -0.2540082444 -0.1120716765
0.1934648222 -0.3033436969 -0.1157726115
0.1067812463 -0.2465433905 -0.2115999179
0.0201014550 -0.2270673536 0.1902139828
0.1934670929 -0.3257382585 0.1828121128
0.1067835171 -0.2689379522 0.0869848064
0.1067842740 -0.2764028060 0.1865130478
0.1934663360 -0.3182734046 0.0832838713
0.1067850309 -0.2838676599 0.2860412892
0.1934678498 -0.3332031124 0.2823403542
0.1067842740 -0.2764028060 0.1865130478
0.0200999412 -0.2121376458 -0.0088425000
-0.0665821208 -0.1702670472 0.0943866764
0.0201006981 -0.2196024997 0.0906857414
-0.0665828777 -0.1628021934 -0.0051415650
0.1067835171 -0.2689379522 0.0869848064
0.1067827602 -0.2614730983 -0.0125434351
0.0201006981 -0.2196024997 0.0906857414
-0.1532687243 -0.0836073254 -0.3995535957
-0.3266328483 0.0001338718 -0.1930952428
-0.1532672105 -0.0985370331 -0.2004971129
-0.2399507863 -0.0417367268 -0.2963244193
-0.2399500294 -0.0492015807 -0.1967961778
-0.1532679674 -0.0910721793 -0.3000253543
-0.2399492725 -0.0566664346 -0.0972679364
-0.1532664535 -0.1060018870 -0.1009688714
-0.2399500294 -0.0492015807 -0.1967961778
-0.3266343621 0.0150635795 -0.3921517257
-0.4133164242 0.0569341781 -0.2889225492
-0.3266336052 0.0075987256 -0.2926234842
-0.4133171811 0.0643990320 -0.3884507906
-0.2399507863 -0.0417367268 -0.2963244193
-0.2399515432 -0.0342718729 -0.3958526607
-0.3266336052 0.0075987256 -0.2926234842
0.0200984274 -0.1972079381 -0.2078989829
0.0200969136 -0.1822782303 -0.4069554658
-0.0665851484 -0.1404076317 -0.3037262893
0.0200976705 -0.1897430842 -0.3074272243
-0.0665859053 -0.1329427778 -0.4032545308
0.1067804894 -0.2390785366 -0.3111281594
0.1067797325 -0.2316136828 -0.4106564008
0.0200976705 -0.1897430842 -0.3074272243
-0.1532672105 -0.0985370331 -0.2004971129
-0.0665836346 -0.1553373395 -0.1046698065
-0.0665843915 -0.1478724856 -0.2041980479
-0.1532664535 -0.1060018870 -0.1009688714
-0.0665851484 -0.1404076317 -0.3037262893
-0.1532679674 -0.0910721793 -0.3000253543
-0.0665843915 -0.1478724856 -0.2041980479
-0.1532656966 -0.1134667409 -0.0014406300
-0.4999969724 0.0838750689 0.0133631101
-0.3266298207 -0.0297255438 0.2050177229
-0.3266313345 -0.0147958360 0.0059612401
-0.4133133965 0.0270747626 0.1091904165
-0.3266305776 -0.0222606899 0.1054894815
-0.4133141534 0.0345396165 0.0096621751
-0.2399477587 -0.0715961423 0.1017885465
-0.2399485156 -0.0641312885 0.0022603050
-0.3266305776 -0.0222606899 0.1054894815
-0.4999954585 0.0689453612 0.2124195930
-0.4133118827 0.0121450548 0.3082468994
-0.4133126396 0.0196099087 0.2087186580
-0.4999947016 0.0614805073 0.3119478344
-0.4133133965 0.0270747626 0.1091904165
-0.4999962154 0.0764102150 0.1128913516
-0.4133126396 0.0196099087 0.2087186580
-0.3266328483 0.0001338718 -0.1930952428
-0.4999984862 0.0988047767 -0.1856933727
-0.4133149103 0.0420044703 -0.0898660663
-0.4133156672 0.0494693242 -0.1893943078
-0.4999977293 0.0913399228 -0.0861651313
-0.4133164242 0.0569341781 -0.2889225492
-0.4999992431 0.1062696306 -0.2852216142
-0.4133156672 0.0494693242 -0.1893943078
-0.3266313345 -0.0147958360 0.0059612401
-0.2399492725 -0.0566664346 -0.0972679364
-0.3266320914 -0.0073309821 -0.0935670014
-0.2399485156 -0.0641312885 0.0022603050
-0.4133149103 0.0420044703 -0.0898660663
-0.4133141534 0.0345396165 0.0096621751
-0.3266320914 -0.0073309821 -0.0935670014
-0.1532626690 -0.1433261564 0.3966723357
0.0201014550 -0.2270673536 0.1902139828
-0.1532641828 -0.1283964487 0.1976158529
-0.0665806070 -0.1851967550 0.2934431593
-0.0665813639 -0.1777319011 0.1939149179
-0.1532634259 -0.1358613026 0.2971440943
-0.0665821208 -0.1702670472 0.0943866764
-0.1532649397 -0.1209315948 0.0980876114
-0.0665813639 -0.1777319011 0.1939149179
0.0201029689 -0.2419970614 0.3892704657
0.1067850309 -0.2838676599 0.2860412892
0.0201022120 -0.2345322075 0.2897422243
0.1067857878 -0.2913325138 0.3855695307
-0.0665806070 -0.1851967550 0.2934431593
-0.0665798501 -0.1926616089 0.3929714007
0.0201022120 -0.2345322075 0.2897422243
-0.3266298207 -0.0297255438 0.2050177229
-0.3266283069 -0.0446552515 0.4040742058
-0.2399462448 -0.0865258501 0.3008450293
-0.3266290638 -0.0371903976 0.3045459644
-0.2399454879 -0.0939907040 0.4003732708
-0.4133118827 0.0121450548 0.3082468994
-0.4133111258 0.0046802009 0.4077751408
-0.3266290638 -0.0371903976 0.3045459644
-0.1532641828 -0.1283964487 0.1976158529
-0.2399477587 -0.0715961423 0.1017885465
-0.2399470017 -0.0790609962 0.2013167879
-0.1532649397 -0.1209315948 0.0980876114
-0.2399462448 -0.0865258501 0.3008450293
-0.1532634259 -0.1358613026 0.2971440943
-0.2399470017 -0.0790609962 0.2013167879
-0.1422744828 -0.0643984174 -0.3981129657
-0.3211372414 0.0246680335 -0.3914314107
-0.1532687243 -0.0836073254 -0.3995535957
-0.1422744828 -0.0643984174 -0.3981129657
0.0365882758 -0.1534648684 -0.4047945208
-0.1312802413 -0.0451895095 -0.3966723357
-0.1312772137 -0.0750489250 0.0014406300
-0.1312802413 -0.0451895095 -0.3966723357
0.0420869104 -0.1587901222 -0.2050177229
-0.1312787275 -0.0601192172 -0.1976158529
-0.0445966655 -0.1019898158 -0.3008450293
-0.0445959086 -0.1094546697 -0.2013167879
-0.1312794844 -0.0526543634 -0.2971440943
-0.0445951517 -0.1169195236 -0.1017885465
-0.1312779706 -0.0675840711 -0.0980876114
-0.0445959086 -0.1094546697 -0.2013167879
0.0420853965 -0.1438604144 -0.4040742058
0.1287689724 -0.2006607207 -0.3082468994
0.0420861534 -0.1513252683 -0.3045459644
0.1287682155 -0.1931958668 -0.4077751408
-0.0445966655 -0.1019898158 -0.3008450293
-0.0445974224 -0.0945249619 -0.4003732708
0.0420861534 -0.1513252683 -0.3045459644
-0.3046443654 0.0385516877 -0.1902139828
-0.3046458792 0.0534813954 -0.3892704657
-0.2179623033 -0.0033189109 -0.2934431593
-0.3046451223 0.0460165416 -0.2897422243
-0.2179630603 0.0041459430 -0.3929714007
-0.3913279412 0.0953519940 -0.2860412892
-0.3913286981 0.1028168479 -0.3855695307
-0.3046451223 0.0460165416 -0.2897422243
-0.1312787275 -0.0601192172 -0.1976158529
-0.2179607895 -0.0182486187 -0.0943866764
-0.2179615464 -0.0107837648 -0.1939149179
-0.1312779706 -0.0675840711 -0.0980876114
-0.2179623033 -0.0033189109 -0.2934431593
-0.1312794844 -0.0526543634 -0.2971440943
-0.2179615464 -0.0107837648 -0.1939149179
0.2154540620 -0.2723907348 -0.0133631101
0.0420899380 -0.1886495377 0.1930952428
0.0420884242 -0.1737198299 -0.0059612401
0.1287720000 -0.2305201363 0.0898660663
0.0420891811 -0.1811846838 0.0935670014
0.1287712431 -0.2230552824 -0.0096621751
-0.0445936378 -0.1318492313 0.0972679364
-0.0445943948 -0.1243843775 -0.0022603050
0.0420891811 -0.1811846838 0.0935670014
0.2154555759 -0.2873204426 0.1856933727
0.1287735138 -0.2454498440 0.2889225492
0.1287727569 -0.2379849901 0.1893943078
0.2154563328 -0.2947852965 0.2852216142
0.1287720000 -0.2305201363 0.0898660663
0.2154548189 -0.2798555887 0.0861651313
0.1287727569 -0.2379849901 0.1893943078
0.0420869104 -0.1587901222 -0.2050177229
0.2154525482 -0.2574610271 -0.2124195930
0.1287704862 -0.2155904285 -0.1091904165
0.1287697293 -0.2081255746 -0.2087186580
0.2154533051 -0.2649258809 -0.1128913516
0.1287689724 -0.2006607207 -0.3082468994
0.2154517913 -0.2499961732 -0.3119478344
0.1287697293 -0.2081255746 -0.2087186580
0.0420884242 -0.1737198299 -0.0059612401
-0.0445951517 -0.1169195236 -0.1017885465
0.0420876673 -0.1662549760 -0.1054894815
-0.0445943948 -0.1243843775 -0.0022603050
0.1287704862 -0.2155904285 -0.1091904165
0.1287712431 -0.2230552824 -0.0096621751
0.0420876673 -0.1662549760 -0.1054894815
-0.1312772137 -0.0750489250 0.0014406300
-0.1312741860 -0.1049083405 0.3995535957
-0.3046413377 0.0086922721 0.2078989829
-0.1312756999 -0.0899786328 0.2004971129
-0.2179577619 -0.0481080342 0.3037262893
-0.2179585188 -0.0406431803 0.2041980479
-0.1312749430 -0.0974434867 0.3000253543
-0.2179592757 -0.0331783264 0.1046698065
-0.1312764568 -0.0825137789 0.1009688714
-0.2179585188 -0.0406431803 0.2041980479
-0.3046398239 -0.0062374356 0.4069554658
-0.3913233997 0.0505628707 0.3111281594
-0.3046405808 0.0012274183 0.3074272243
-0.3913226428 0.0430980168 0.4106564008
-0.2179577619 -0.0481080342 0.3037262893
-0.2179570050 -0.0555728881 0.4032545308
-0.3046405808 0.0012274183 0.3074272243
0.0420899380 -0.1886495377 0.1930952428
0.0420914518 -0.2035792454 0.3921517257
-0.0445921240 -0.1467789391 0.2963244193
0.0420906949 -0.1961143916 0.2926234842
-0.0445913671 -0.1542437930 0.3958526607
0.1287735138 -0.2454498440 0.2889225492
0.1287742707 -0.2529146979 0.3884507906
0.0420906949 -0.1961143916 0.2926234842
-0.1312756999 -0.0899786328 0.2004971129
-0.0445936378 -0.1318492313 0.0972679364
-0.0445928809 -0.1393140852 0.1967961778
-0.1312764568 -0.0825137789 0.1009688714
-0.0445921240 -0.1467789391 0.2963244193
-0.1312749430 -0.0974434867 0.3000253543
-0.0445928809 -0.1393140852 0.1967961778
-0.4780084894 0.1222928848 0.0162443701
-0.3046443654 0.0385516877 -0.1902139828
-0.3046428515 0.0236219799 0.0088425000
-0.3913264274 0.0804222862 -0.0869848064
-0.3046436085 0.0310868338 -0.0906857414
-0.3913256705 0.0729574324 0.0125434351
-0.2179607895 -0.0182486187 -0.0943866764
-0.2179600326 -0.0257134725 0.0051415650
-0.3046436085 0.0310868338 -0.0906857414
-0.4780100032 0.1372225926 -0.1828121128
-0.3913279412 0.0953519940 -0.2860412892
-0.3913271843 0.0878871401 -0.1865130478
-0.4780107601 0.1446874465 -0.2823403542
-0.3913264274 0.0804222862 -0.0869848064
-0.4780092463 0.1297577387 -0.0832838713
-0.3913271843 0.0878871401 -0.1865130478
-0.3046413377 0.0086922721 0.2078989829
-0.4780069756 0.1073631771 0.2153008530
-0.3913249136 0.0654925785 0.1120716765
-0.3913241567 0.0580277246 0.2115999179
-0.4780077325 0.1148280309 0.1157726115
-0.3913233997 0.0505628707 0.3111281594
-0.4780062187 0.0998983232 0.3148290944
-0.3913241567 0.0580277246 0.2115999179
-0.3046428515 0.0236219799 0.0088425000
-0.2179592757 -0.0331783264 0.1046698065
-0.3046420946 0.0161571260 0.1083707415
-0.2179600326 -0.0257134725 0.0051415650
-0.3913249136 0.0654925785 0.1120716765
-0.3913256705 0.0729574324 0.0125434351
-0.3046420946 0.0161571260 0.1083707415
-0.1422684275 -0.1241172485 0.3981129657
0.0256000896 -0.2323926074 0.3899907807
-0.1532626690 -0.1433261564 0.3966723357
-0.1422684275 -0.1241172485 0.3981129657
-0.3101369446 -0.0158418896 0.4062351508
-0.1312741860 -0.1049083405 0.3995535957
0.2044598206 -0.2915996428 -0.0148037401
0.1989611860 -0.2862743890 -0.2145805380
0.1934655791 -0.3108085507 -0.0162443701
0.2044598206 -0.2915996428 -0.0148037401
0.2099584551 -0.2969248966 0.1849730578
0.2154540620 -0.2723907348 -0.0133631101
3 443 185 431
3 185 177 431
3 177 176 431
3 176 184 431
3 184 442 431
3 442 374 431
3 374 166 431
3 166 167 431
3 167 375 431
3 375 443 431
3 443 446 185
3 446 286 185
3 185 286 177
3 286 341 177
3 177 341 176
3 341 340 176
3 176 340 184
3 340 287 184
3 184 287 442
3 287 447 442
3 442 447 374
3 447 81 374
3 374 81 166
3 81 48 166
3 166 48 167
3 48 49 167
3 167 49 375
3 49 80 375
3 375 80 443
3 80 446 443
3 446 435 286
3 435 464 286
3 286 464 341
3 464 41 341
3 341 41 340
3 41 40 340
3 340 40 287
3 40 465 287
3 287 465 447
3 465 434 447
3 447 434 81
3 434 111 81
3 81 111 48
3 111 360 48
3 48 360 49
3 360 361 49
3 49 361 80
3 361 110 80
3 80 110 446
3 110 435 446
3 435 440 464
3 440 339 464
3 464 339 41
3 339 182 41
3 41 182 40
3 182 183 40
3 40 183 465
3 183 338 465
3 465 338 434
3 338 441 434
3 434 441 111
3 441 46 111
3 111 46 360
3 46 159 360
3 360 159 361
3 159 158 361
3 361 158 110
3 158 47 110
3 110 47 435
3 47 440 435
3 440 427 339
3 427 461 339
3 339 461 182
3 461 289 182
3 182 289 183
3 289 288 183
3 183 288 338
3 288 460 338
3 338 460 441
3 460 428 441
3 441 428 46
3 428 404 46
3 46 404 159
3 404 68 159
3 159 68 158
3 68 69 158
3 158 69 47
3 69 405 47
3 47 405 440
3 405 427 440
3 427 432 461
3 432 335 461
3 461 335 289
3 335 180 289
3 289 180 288
3 180 181 288
3 288 181 460
3 181 334 460
3 460 334 428
3 334 433 428
3 428 433 404
3 433 42 404
3 404 42 68
3 42 157 68
3 68 157 69
3 157 156 69
3 69 156 405
3 156 43 405
3 405 43 427
3 43 432 427
3 432 430 335
3 430 462 335
3 335 462 180
3 462 39 180
3 180 39 181
3 39 38 181
3 181 38 334
3 38 463 334
3 334 463 433
3 463 429 433
3 433 429 42
3 429 109 42
3 42 109 157
3 109 358 157
3 157 358 156
3 358 359 156
3 156 359 43
3 359 108 43
3 43 108 432
3 108 430 432
3 430 438 462
3 438 284 462
3 462 284 39
3 284 337 39
3 39 337 38
3 337 336 38
3 38 336 463
3 336 285 463
3 463 285 429
3 285 439 429
3 429 439 109
3 439 79 109
3 109 79 358
3 79 44 358
3 358 44 359
3 44 45 359
3 359 45 108
3 45 78 108
3 108 78 430
3 78 438 430
3 438 445 284
3 445 187 284
3 284 187 337
3 187 179 337
3 337 179 336
3 179 178 336
3 336 178 285
3 178 186 285
3 285 186 439
3 186 444 439
3 439 444 79
3 444 376 79
3 79 376 44
3 376 168 44
3 44 168 45
3 168 169 45
3 45 169 78
3 169 377 78
3 78 377 438
3 377 445 438
3 445 420 187
3 420 420 187
3 187 420 179
3 420 420 179
3 179 420 178
3 420 420 178
3 178 420 186
3 420 420 186
3 186 420 444
3 420 420 444
3 444 420 376
3 420 420 376
3 376 420 168
3 420 420 168
3 168 420 169
3 420 420 169
3 169 420 377
3 420 420 377
3 377 420 445
3 420 420 445
3 106 508 316
3 104 508 106
3 314 509 104
3 316 509 314
3 514 515 513
3 512 515 514
3 514 516 511
3 513 516 514
3 517 518 513
3 510 518 517
3 517 519 512
3 513 519 517
3 521 522 520
3 512 522 521
3 521 523 107
3 520 523 521
3 524 525 520
3 511 525 524
3 524 526 512
3 520 526 524
3 529 530 528
3 527 530 529
3 529 531 511
3 528 531 529
3 532 533 528
3 317 533 532
3 532 534 527
3 528 534 532
3 536 537 535
3 527 537 536
3 536 538 510
3 535 538 536
3 539 540 535
3 511 540 539
3 539 541 527
3 535 541 539
3 545 546 544
3 543 546 545
3 545 547 542
3 544 547 545
3 548 549 544
3 510 549 548
3 548 550 543
3 544 550 548
3 552 553 551
3 543 553 552
3 552 554 106
3 551 554 552
3 555 556 551
3 542 556 555
3 555 557 543
3 551 557 555
3 560 561 559
3 558 561 560
3 560 562 542
3 559 562 560
3 563 564 559
3 107 564 563
3 563 565 558
3 559 565 563
3 567 568 566
3 558 568 567
3 567 569 510
3 566 569 567
3 570 571 566
3 542 571 570
3 570 572 558
3 566 572 570
3 577 578 576
3 575 578 577
3 577 579 574
3 576 579 577
3 580 581 576
3 573 581 580
3 580 582 575
3 576 582 580
3 584 585 583
3 575 585 584
3 584 586 316
3 583 586 584
3 587 588 583
3 574 588 587
3 587 589 575
3 583 589 587
3 592 593 591
3 590 593 592
3 592 594 574
3 591 594 592
3 595 596 591
3 106 596 595
3 595 597 590
3 591 597 595
3 599 600 598
3 590 600 599
3 599 601 573
3 598 601 599
3 602 603 598
3 574 603 602
3 602 604 590
3 598 604 602
3 608 609 607
3 606 609 608
3 608 610 605
3 607 610 608
3 611 612 607
3 573 612 611
3 611 613 606
3 607 613 611
3 615 616 614
3 606 616 615
3 615 617 317
3 614 617 615
3 618 619 614
3 605 619 618
3 618 620 606
3 614 620 618
3 623 624 622
3 621 624 623
3 623 625 605
3 622 625 623
3 626 627 622
3 316 627 626
3 626 628 621
3 622 628 626
3 630 631 629
3 621 631 630
3 630 632 573
3 629 632 630
3 633 634 629
3 605 634 633
3 633 635 621
3 629 635 633
3 106 636 104
3 107 636 106
3 105 637 107
3 104 637 105
3 642 643 641
3 640 643 642
3 642 644 639
3 641 644 642
3 645 646 641
3 638 646 645
3 645 647 640
3 641 647 645
3 649 650 648
3 640 650 649
3 649 651 105
3 648 651 649
3 652 653 648
3 639 653 652
3 652 654 640
3 648 654 652
3 657 658 656
3 655 658 657
3 657 659 639
3 656 659 657
3 660 661 656
3 104 661 660
3 660 662 655
3 656 662 660
3 664 665 663
3 655 665 664
3 664 666 638
3 663 666 664
3 667 668 663
3 639 668 667
3 667 669 655
3 663 669 667
3 673 674 672
3 671 674 673
3 673 675 670
3 672 675 673
3 676 677 672
3 638 677 676
3 676 678 671
3 672 678 676
3 680 681 679
3 671 681 680
3 680 682 315
3 679 682 680
3 683 684 679
3 670 684 683
3 683 685 671
3 679 685 683
3 688 689 687
3 686 689 688
3 688 690 670
3 687 690 688
3 691 692 687
3 105 692 691
3 691 693 686
3 687 693 691
3 695 696 694
3 686 696 695
3 695 697 638
3 694 697 695
3 698 699 694
3 670 699 698
3 698 700 686
3 694 700 698
3 705 706 704
3 703 706 705
3 705 707 702
3 704 707 705
3 708 709 704
3 701 709 708
3 708 710 703
3 704 710 708
3 712 713 711
3 703 713 712
3 712 714 314
3 711 714 712
3 715 716 711
3 702 716 715
3 715 717 703
3 711 717 715
3 720 721 719
3 718 721 720
3 720 722 702
3 719 722 720
3 723 724 719
3 315 724 723
3 723 725 718
3 719 725 723
3 727 728 726
3 718 728 727
3 727 729 701
3 726 729 727
3 730 731 726
3 702 731 730
3 730 732 718
3 726 732 730
3 736 737 735
3 734 737 736
3 736 738 733
3 735 738 736
3 739 740 735
3 701 740 739
3 739 741 734
3 735 741 739
3 743 744 742
3 734 744 743
3 743 745 104
3 742 745 743
3 746 747 742
3 733 747 746
3 746 748 734
3 742 748 746
3 751 752 750
3 749 752 751
3 751 753 733
3 750 753 751
3 754 755 750
3 314 755 754
3 754 756 749
3 750 756 754
3 758 759 757
3 749 759 758
3 758 760 701
3 757 760 758
3 761 762 757
3 733 762 761
3 761 763 749
3 757 763 761
3 317 764 315
3 316 764 317
3 314 765 316
3 315 765 314
3 107 766 105
3 317 766 107
3 315 767 317
3 105 767 315
3 415 417 129
3 129 417 131
3 771 772 770
3 769 772 771
3 771 773 768
3 770 773 771
3 774 775 770
3 414 775 774
3 774 776 769
3 770 776 774
3 778 779 777
3 769 779 778
3 778 780 128
3 777 780 778
3 781 782 777
3 768 782 781
3 781 783 769
3 777 783 781
3 786 787 785
3 784 787 786
3 786 788 768
3 785 788 786
3 789 790 785
3 415 790 789
3 789 791 784
3 785 791 789
3 793 794 792
3 784 794 793
3 793 795 414
3 792 795 793
3 796 797 792
3 768 797 796
3 796 798 784
3 792 798 796
3 802 803 801
3 800 803 802
3 802 804 799
3 801 804 802
3 805 806 801
3 129 806 805
3 805 807 800
3 801 807 805
3 809 810 808
3 800 810 809
3 809 811 415
3 808 811 809
3 812 813 808
3 799 813 812
3 812 814 800
3 808 814 812
3 817 818 816
3 815 818 817
3 817 819 799
3 816 819 817
3 820 821 816
3 128 821 820
3 820 822 815
3 816 822 820
3 824 825 823
3 815 825 824
3 824 826 129
3 823 826 824
3 827 828 823
3 799 828 827
3 827 829 815
3 823 829 827
3 415 414 417
3 417 414 416
3 833 834 832
3 831 834 833
3 833 835 830
3 832 835 833
3 836 837 832
3 416 837 836
3 836 838 831
3 832 838 836
3 840 841 839
3 831 841 840
3 840 842 417
3 839 842 840
3 843 844 839
3 830 844 843
3 843 845 831
3 839 845 843
3 848 849 847
3 846 849 848
3 848 850 830
3 847 850 848
3 851 852 847
3 130 852 851
3 851 853 846
3 847 853 851
3 855 856 854
3 846 856 855
3 855 857 416
3 854 857 855
3 858 859 854
3 830 859 858
3 858 860 846
3 854 860 858
3 864 865 863
3 862 865 864
3 864 866 861
3 863 866 864
3 867 868 863
3 131 868 867
3 867 869 862
3 863 869 867
3 871 872 870
3 862 872 871
3 871 873 130
3 870 873 871
3 874 875 870
3 861 875 874
3 874 876 862
3 870 876 874
3 879 880 878
3 877 880 879
3 879 881 861
3 878 881 879
3 882 883 878
3 417 883 882
3 882 884 877
3 878 884 882
3 886 887 885
3 877 887 886
3 886 888 131
3 885 888 886
3 889 890 885
3 861 890 889
3 889 891 877
3 885 891 889
3 129 130 128
3 129 131 130
3 128 416 414
3 128 130 416
3 147 892 399
3 142 892 147
3 394 893 142
3 399 893 394
3 896 897 895
3 894 897 896
3 896 898 148
3 895 898 896
3 899 900 895
3 400 900 899
3 899 901 894
3 895 901 899
3 903 904 902
3 894 904 903
3 903 905 147
3 902 905 903
3 906 907 902
3 148 907 906
3 906 908 894
3 902 908 906
3 911 912 910
3 909 912 911
3 911 913 399
3 910 913 911
3 914 915 910
3 147 915 914
3 914 916 909
3 910 916 914
3 918 919 917
3 909 919 918
3 918 920 400
3 917 920 918
3 921 922 917
3 399 922 921
3 921 923 909
3 917 923 921
3 147 924 142
3 148 924 147
3 143 925 148
3 142 925 143
3 928 929 927
3 926 929 928
3 928 930 143
3 927 930 928
3 931 932 927
3 142 932 931
3 931 933 926
3 927 933 931
3 935 936 934
3 926 936 935
3 935 937 395
3 934 937 935
3 938 939 934
3 143 939 938
3 938 940 926
3 934 940 938
3 943 944 942
3 941 944 943
3 943 945 394
3 942 945 943
3 946 947 942
3 395 947 946
3 946 948 941
3 942 948 946
3 950 951 949
3 941 951 950
3 950 952 142
3 949 952 950
3 953 954 949
3 394 954 953
3 953 955 941
3 949 955 953
3 400 956 395
3 399 956 400
3 394 957 399
3 395 957 394
3 148 958 143
3 400 958 148
3 395 959 400
3 143 959 395
3 281 283 217
3 217 283 219
3 962 963 961
3 960 963 962
3 962 964 280
3 961 964 962
3 965 966 961
3 216 966 965
3 965 967 960
3 961 967 965
3 969 970 968
3 960 970 969
3 969 971 281
3 968 971 969
3 972 973 968
3 280 973 972
3 972 974 960
3 968 974 972
3 977 978 976
3 975 978 977
3 977 979 217
3 976 979 977
3 980 981 976
3 281 981 980
3 980 982 975
3 976 982 980
3 984 985 983
3 975 985 984
3 984 986 216
3 983 986 984
3 987 988 983
3 217 988 987
3 987 989 975
3 983 989 987
3 281 280 283
3 283 280 282
3 992 993 991
3 990 993 992
3 992 994 282
3 991 994 992
3 995 996 991
3 283 996 995
3 995 997 990
3 991 997 995
3 999 1000 998
3 990 1000 999
3 999 1001 218
3 998 1001 999
3 1002 1003 998
3 282 1003 1002
3 1002 1004 990
3 998 1004 1002
3 1007 1008 1006
3 1005 1008 1007
3 1007 1009 219
3 1006 1009 1007
3 1010 1011 1006
3 218 1011 1010
3 1010 1012 1005
3 1006 1012 1010
3 1014 1015 1013
3 1005 1015 1014
3 1014 1016 283
3 1013 1016 1014
3 1017 1018 1013
3 219 1018 1017
3 1017 1019 1005
3 1013 1019 1017
3 217 218 216
3 217 219 218
3 216 282 280
3 216 218 282
3 2 0 380
3 380 0 378
3 1023 1024 1022
3 1021 1024 1023
3 1023 1025 1020
3 1022 1025 1023
3 1026 1027 1022
3 3 1027 1026
3 1026 1028 1021
3 1022 1028 1026
3 1030 1031 1029
3 1021 1031 1030
3 1030 1032 381
3 1029 1032 1030
3 1033 1034 1029
3 1020 1034 1033
3 1033 1035 1021
3 1029 1035 1033
3 1038 1039 1037
3 1036 1039 1038
3 1038 1040 1020
3 1037 1040 1038
3 1041 1042 1037
3 2 1042 1041
3 1041 1043 1036
3 1037 1043 1041
3 1045 1046 1044
3 1036 1046 1045
3 1045 1047 3
3 1044 1047 1045
3 1048 1049 1044
3 1020 1049 1048
3 1048 1050 1036
3 1044 1050 1048
3 1054 1055 1053
3 1052 1055 1054
3 1054 1056 1051
3 1053 1056 1054
3 1057 1058 1053
3 380 1058 1057
3 1057 1059 1052
3 1053 1059 1057
3 1061 1062 1060
3 1052 1062 1061
3 1061 1063 2
3 1060 1063 1061
3 1064 1065 1060
3 1051 1065 1064
3 1064 1066 1052
3 1060 1066 1064
3 1069 1070 1068
3 1067 1070 1069
3 1069 1071 1051
3 1068 1071 1069
3 1072 1073 1068
3 381 1073 1072
3 1072 1074 1067
3 1068 1074 1072
3 1076 1077 1075
3 1067 1077 1076
3 1076 1078 380
3 1075 1078 1076
3 1079 1080 1075
3 1051 1080 1079
3 1079 1081 1067
3 1075 1081 1079
3 2 3 0
3 0 3 1
3 1085 1086 1084
3 1083 1086 1085
3 1085 1087 1082
3 1084 1087 1085
3 1088 1089 1084
3 1 1089 1088
3 1088 1090 1083
3 1084 1090 1088
3 1092 1093 1091
3 1083 1093 1092
3 1092 1094 0
3 1091 1094 1092
3 1095 1096 1091
3 1082 1096 1095
3 1095 1097 1083
3 1091 1097 1095
3 1100 1101 1099
3 1098 1101 1100
3 1100 1102 1082
3 1099 1102 1100
3 1103 1104 1099
3 379 1104 1103
3 1103 1105 1098
3 1099 1105 1103
3 1107 1108 1106
3 1098 1108 1107
3 1107 1109 1
3 1106 1109 1107
3 1110 1111 1106
3 1082 1111 1110
3 1110 1112 1098
3 1106 1112 1110
3 1116 1117 1115
3 1114 1117 1116
3 1116 1118 1113
3 1115 1118 1116
3 1119 1120 1115
3 378 1120 1119
3 1119 1121 1114
3 1115 1121 1119
3 1123 1124 1122
3 1114 1124 1123
3 1123 1125 379
3 1122 1125 1123
3 1126 1127 1122
3 1113 1127 1126
3 1126 1128 1114
3 1122 1128 1126
3 1131 1132 1130
3 1129 1132 1131
3 1131 1133 1113
3 1130 1133 1131
3 1134 1135 1130
3 0 1135 1134
3 1134 1136 1129
3 1130 1136 1134
3 1138 1139 1137
3 1129 1139 1138
3 1138 1140 378
3 1137 1140 1138
3 1141 1142 1137
3 1113 1142 1141
3 1141 1143 1129
3 1137 1143 1141
3 380 379 381
3 380 378 379
3 381 1 3
3 381 379 1
3 419 407 133
3 133 407 121
3 1147 1148 1146
3 1145 1148 1147
3 1147 1149 1144
3 1146 1149 1147
3 1150 1151 1146
3 418 1151 1150
3 1150 1152 1145
3 1146 1152 1150
3 1154 1155 1153
3 1145 1155 1154
3 1154 1156 132
3 1153 1156 1154
3 1157 1158 1153
3 1144 1158 1157
3 1157 1159 1145
3 1153 1159 1157
3 1162 1163 1161
3 1160 1163 1162
3 1162 1164 1144
3 1161 1164 1162
3 1165 1166 1161
3 419 1166 1165
3 1165 1167 1160
3 1161 1167 1165
3 1169 1170 1168
3 1160 1170 1169
3 1169 1171 418
3 1168 1171 1169
3 1172 1173 1168
3 1144 1173 1172
3 1172 1174 1160
3 1168 1174 1172
3 1178 1179 1177
3 1176 1179 1178
3 1178 1180 1175
3 1177 1180 1178
3 1181 1182 1177
3 133 1182 1181
3 1181 1183 1176
3 1177 1183 1181
3 1185 1186 1184
3 1176 1186 1185
3 1185 1187 419
3 1184 1187 1185
3 1188 1189 1184
3 1175 1189 1188
3 1188 1190 1176
3 1184 1190 1188
3 1193 1194 1192
3 1191 1194 1193
3 1193 1195 1175
3 1192 1195 1193
3 1196 1197 1192
3 132 1197 1196
3 1196 1198 1191
3 1192 1198 1196
3 1200 1201 1199
3 1191 1201 1200
3 1200 1202 133
3 1199 1202 1200
3 1203 1204 1199
3 1175 1204 1203
3 1203 1205 1191
3 1199 1205 1203
3 419 418 407
3 407 418 406
3 1209 1210 1208
3 1207 1210 1209
3 1209 1211 1206
3 1208 1211 1209
3 1212 1213 1208
3 406 1213 1212
3 1212 1214 1207
3 1208 1214 1212
3 1216 1217 1215
3 1207 1217 1216
3 1216 1218 407
3 1215 1218 1216
3 1219 1220 1215
3 1206 1220 1219
3 1219 1221 1207
3 1215 1221 1219
3 1224 1225 1223
3 1222 1225 1224
3 1224 1226 1206
3 1223 1226 1224
3 1227 1228 1223
3 120 1228 1227
3 1227 1229 1222
3 1223 1229 1227
3 1231 1232 1230
3 1222 1232 1231
3 1231 1233 406
3 1230 1233 1231
3 1234 1235 1230
3 1206 1235 1234
3 1234 1236 1222
3 1230 1236 1234
3 1240 1241 1239
3 1238 1241 1240
3 1240 1242 1237
3 1239 1242 1240
3 1243 1244 1239
3 121 1244 1243
3 1243 1245 1238
3 1239 1245 1243
3 1247 1248 1246
3 1238 1248 1247
3 1247 1249 120
3 1246 1249 1247
3 1250 1251 1246
3 1237 1251 1250
3 1250 1252 1238
3 1246 1252 1250
3 1255 1256 1254
3 1253 1256 1255
3 1255 1257 1237
3 1254 1257 1255
3 1258 1259 1254
3 407 1259 1258
3 1258 1260 1253
3 1254 1260 1258
3 1262 1263 1261
3 1253 1263 1262
3 1262 1264 121
3 1261 1264 1262
3 1265 1266 1261
3 1237 1266 1265
3 1265 1267 1253
3 1261 1267 1265
3 133 120 132
3 133 121 120
3 132 406 418
3 132 120 406
3 1268 1269 319
3 51 1269 1268
3 319 1270 1268
3 321 1270 319
3 1271 1272 53
3 321 1272 1271
3 53 1273 1271
3 51 1273 53
3 1278 1279 1277
3 1276 1279 1278
3 1278 1280 1275
3 1277 1280 1278
3 1281 1282 1277
3 1274 1282 1281
3 1281 1283 1276
3 1277 1283 1281
3 1285 1286 1284
3 1276 1286 1285
3 1285 1287 318
3 1284 1287 1285
3 1288 1289 1284
3 1275 1289 1288
3 1288 1290 1276
3 1284 1290 1288
3 1293 1294 1292
3 1291 1294 1293
3 1293 1295 1275
3 1292 1295 1293
3 1296 1297 1292
3 50 1297 1296
3 1296 1298 1291
3 1292 1298 1296
3 1300 1301 1299
3 1291 1301 1300
3 1300 1302 1274
3 1299 1302 1300
3 1303 1304 1299
3 1275 1304 1303
3 1303 1305 1291
3 1299 1305 1303
3 1309 1310 1308
3 1307 1310 1309
3 1309 1311 1306
3 1308 1311 1309
3 1312 1313 1308
3 1274 1313 1312
3 1312 1314 1307
3 1308 1314 1312
3 1316 1317 1315
3 1307 1317 1316
3 1316 1318 319
3 1315 1318 1316
3 1319 1320 1315
3 1306 1320 1319
3 1319 1321 1307
3 1315 1321 1319
3 1324 1325 1323
3 1322 1325 1324
3 1324 1326 1306
3 1323 1326 1324
3 1327 1328 1323
3 318 1328 1327
3 1327 1329 1322
3 1323 1329 1327
3 1331 1332 1330
3 1322 1332 1331
3 1331 1333 1274
3 1330 1333 1331
3 1334 1335 1330
3 1306 1335 1334
3 1334 1336 1322
3 1330 1336 1334
3 1341 1342 1340
3 1339 1342 1341
3 1341 1343 1338
3 1340 1343 1341
3 1344 1345 1340
3 1337 1345 1344
3 1344 1346 1339
3 1340 1346 1344
3 1348 1349 1347
3 1339 1349 1348
3 1348 1350 51
3 1347 1350 1348
3 1351 1352 1347
3 1338 1352 1351
3 1351 1353 1339
3 1347 1353 1351
3 1356 1357 1355
3 1354 1357 1356
3 1356 1358 1338
3 1355 1358 1356
3 1359 1360 1355
3 319 1360 1359
3 1359 1361 1354
3 1355 1361 1359
3 1363 1364 1362
3 1354 1364 1363
3 1363 1365 1337
3 1362 1365 1363
3 1366 1367 1362
3 1338 1367 1366
3 1366 1368 1354
3 1362 1368 1366
3 1372 1373 1371
3 1370 1373 1372
3 1372 1374 1369
3 1371 1374 1372
3 1375 1376 1371
3 1337 1376 1375
3 1375 1377 1370
3 1371 1377 1375
3 1379 1380 1378
3 1370 1380 1379
3 1379 1381 50
3 1378 1381 1379
3 1382 1383 1378
3 1369 1383 1382
3 1382 1384 1370
3 1378 1384 1382
3 1387 1388 1386
3 1385 1388 1387
3 1387 1389 1369
3 1386 1389 1387
3 1390 1391 1386
3 51 1391 1390
3 1390 1392 1385
3 1386 1392 1390
3 1394 1395 1393
3 1385 1395 1394
3 1394 1396 1337
3 1393 1396 1394
3 1397 1398 1393
3 1369 1398 1397
3 1397 1399 1385
3 1393 1399 1397
3 321 1401 1400
3 319 1401 321
3 1400 1402 318
3 319 1402 1400
3 318 1404 1403
3 320 1404 318
3 1403 1405 321
3 320 1405 1403
3 1410 1411 1409
3 1408 1411 1410
3 1410 1412 1407
3 1409 1412 1410
3 1413 1414 1409
3 1406 1414 1413
3 1413 1415 1408
3 1409 1415 1413
3 1417 1418 1416
3 1408 1418 1417
3 1417 1419 320
3 1416 1419 1417
3 1420 1421 1416
3 1407 1421 1420
3 1420 1422 1408
3 1416 1422 1420
3 1425 1426 1424
3 1423 1426 1425
3 1425 1427 1407
3 1424 1427 1425
3 1428 1429 1424
3 321 1429 1428
3 1428 1430 1423
3 1424 1430 1428
3 1432 1433 1431
3 1423 1433 1432
3 1432 1434 1406
3 1431 1434 1432
3 1435 1436 1431
3 1407 1436 1435
3 1435 1437 1423
3 1431 1437 1435
3 1441 1442 1440
3 1439 1442 1441
3 1441 1443 1438
3 1440 1443 1441
3 1444 1445 1440
3 1406 1445 1444
3 1444 1446 1439
3 1440 1446 1444
3 1448 1449 1447
3 1439 1449 1448
3 1448 1450 52
3 1447 1450 1448
3 1451 1452 1447
3 1438 1452 1451
3 1451 1453 1439
3 1447 1453 1451
3 1456 1457 1455
3 1454 1457 1456
3 1456 1458 1438
3 1455 1458 1456
3 1459 1460 1455
3 320 1460 1459
3 1459 1461 1454
3 1455 1461 1459
3 1463 1464 1462
3 1454 1464 1463
3 1463 1465 1406
3 1462 1465 1463
3 1466 1467 1462
3 1438 1467 1466
3 1466 1468 1454
3 1462 1468 1466
3 1473 1474 1472
3 1471 1474 1473
3 1473 1475 1470
3 1472 1475 1473
3 1476 1477 1472
3 1469 1477 1476
3 1476 1478 1471
3 1472 1478 1476
3 1480 1481 1479
3 1471 1481 1480
3 1480 1482 53
3 1479 1482 1480
3 1483 1484 1479
3 1470 1484 1483
3 1483 1485 1471
3 1479 1485 1483
3 1488 1489 1487
3 1486 1489 1488
3 1488 1490 1470
3 1487 1490 1488
3 1491 1492 1487
3 52 1492 1491
3 1491 1493 1486
3 1487 1493 1491
3 1495 1496 1494
3 1486 1496 1495
3 1495 1497 1469
3 1494 1497 1495
3 1498 1499 1494
3 1470 1499 1498
3 1498 1500 1486
3 1494 1500 1498
3 1504 1505 1503
3 1502 1505 1504
3 1504 1506 1501
3 1503 1506 1504
3 1507 1508 1503
3 1469 1508 1507
3 1507 1509 1502
3 1503 1509 1507
3 1511 1512 1510
3 1502 1512 1511
3 1511 1513 321
3 1510 1513 1511
3 1514 1515 1510
3 1501 1515 1514
3 1514 1516 1502
3 1510 1516 1514
3 1519 1520 1518
3 1517 1520 1519
3 1519 1521 1501
3 1518 1521 1519
3 1522 1523 1518
3 53 1523 1522
3 1522 1524 1517
3 1518 1524 1522
3 1526 1527 1525
3 1517 1527 1526
3 1526 1528 1469
3 1525 1528 1526
3 1529 1530 1525
3 1501 1530 1529
3 1529 1531 1517
3 1525 1531 1529
3 52 1533 1532
3 50 1533 52
3 1532 1534 51
3 50 1534 1532
3 51 1536 1535
3 53 1536 51
3 1535 1537 52
3 53 1537 1535
3 320 1539 1538
3 318 1539 320
3 1538 1540 50
3 318 1540 1538
3 50 1542 1541
3 52 1542 50
3 1541 1543 320
3 52 1543 1541
3 54 342 57
3 342 348 57
3 149 57 348
3 144 342 54
3 342 271 348
3 271 277 348
3 149 348 277
3 144 271 342
3 271 325 277
3 325 331 277
3 149 277 331
3 144 325 271
3 325 244 331
3 244 250 331
3 149 331 250
3 144 244 325
3 244 82 250
3 82 85 250
3 149 250 85
3 144 82 244
3 82 249 85
3 249 255 85
3 149 85 255
3 144 249 82
3 249 327 255
3 327 333 255
3 149 255 333
3 144 327 249
3 327 273 333
3 273 279 333
3 149 333 279
3 144 273 327
3 273 347 279
3 347 353 279
3 149 279 353
3 144 347 273
3 347 54 353
3 54 57 353
3 149 353 57
3 144 54 347
3 491 234 494
3 234 240 494
3 402 494 240
3 397 234 491
3 234 196 240
3 196 202 240
3 402 240 202
3 397 196 234
3 196 92 202
3 92 98 202
3 402 202 98
3 397 92 196
3 92 16 98
3 16 22 98
3 402 98 22
3 397 16 92
3 16 303 22
3 303 306 22
3 402 22 306
3 397 303 16
3 303 15 306
3 15 21 306
3 402 306 21
3 397 15 303
3 15 94 21
3 94 100 21
3 402 21 100
3 397 94 15
3 94 198 100
3 198 204 100
3 402 100 204
3 397 198 94
3 198 233 204
3 233 239 204
3 402 204 239
3 397 233 198
3 233 491 239
3 491 494 239
3 402 239 494
3 397 491 233
3 55 344 58
3 344 350 58
3 150 58 350
3 145 344 55
3 344 268 350
3 268 274 350
3 150 350 274
3 145 268 344
3 268 322 274
3 322 328 274
3 150 274 328
3 145 322 268
3 322 246 328
3 246 252 328
3 150 328 252
3 145 246 322
3 246 83 252
3 83 86 252
3 150 252 86
3 145 83 246
3 83 245 86
3 245 251 86
3 150 86 251
3 145 245 83
3 245 324 251
3 324 330 251
3 150 251 330
3 145 324 245
3 324 270 330
3 270 276 330
3 150 330 276
3 145 270 324
3 270 343 276
3 343 349 276
3 150 276 349
3 145 343 270
3 343 55 349
3 55 58 349
3 150 349 58
3 145 55 343
3 490 232 493
3 232 238 493
3 401 493 238
3 396 232 490
3 232 199 238
3 199 205 238
3 401 238 205
3 396 199 232
3 199 95 205
3 95 101 205
3 401 205 101
3 396 95 199
3 95 14 101
3 14 20 101
3 401 101 20
3 396 14 95
3 14 302 20
3 302 305 20
3 401 20 305
3 396 302 14
3 302 19 305
3 19 25 305
3 401 305 25
3 396 19 302
3 19 97 25
3 97 103 25
3 401 25 103
3 396 97 19
3 97 201 103
3 201 207 103
3 401 103 207
3 396 201 97
3 201 237 207
3 237 243 207
3 401 207 243
3 396 237 201
3 237 490 243
3 490 493 243
3 401 243 493
3 396 490 237
3 492 235 495
3 235 241 495
3 403 495 241
3 398 235 492
3 235 197 241
3 197 203 241
3 403 241 203
3 398 197 235
3 197 93 203
3 93 99 203
3 403 203 99
3 398 93 197
3 93 17 99
3 17 23 99
3 403 99 23
3 398 17 93
3 17 304 23
3 304 307 23
3 403 23 307
3 398 304 17
3 304 18 307
3 18 24 307
3 403 307 24
3 398 18 304
3 18 96 24
3 96 102 24
3 403 24 102
3 398 96 18
3 96 200 102
3 200 206 102
3 403 102 206
3 398 200 96
3 200 236 206
3 236 242 206
3 403 206 242
3 398 236 200
3 236 492 242
3 492 495 242
3 403 242 495
3 398 492 236
3 56 345 59
3 345 351 59
3 151 59 351
3 146 345 56
3 345 269 351
3 269 275 351
3 151 351 275
3 146 269 345
3 269 323 275
3 323 329 275
3 151 275 329
3 146 323 269
3 323 247 329
3 247 253 329
3 151 329 253
3 146 247 323
3 247 84 253
3 84 87 253
3 151 253 87
3 146 84 247
3 84 248 87
3 248 254 87
3 151 87 254
3 146 248 84
3 248 326 254
3 326 332 254
3 151 254 332
3 146 326 248
3 326 272 332
3 272 278 332
3 151 332 278
3 146 272 326
3 272 346 278
3 346 352 278
3 151 278 352
3 146 346 272
3 346 56 352
3 56 59 352
3 151 352 59
3 146 56 346
3 11 296 13
3 296 300 13
3 437 13 300
3 424 296 11
3 296 208 300
3 208 212 300
3 437 300 212
3 424 208 296
3 208 112 212
3 112 116 212
3 437 212 116
3 424 112 208
3 112 62 116
3 62 66 116
3 437 116 66
3 424 62 112
3 62 355 66
3 355 357 66
3 437 66 357
3 424 355 62
3 355 61 357
3 61 65 357
3 437 357 65
3 424 61 355
3 61 113 65
3 113 117 65
3 437 65 117
3 424 113 61
3 113 209 117
3 209 213 117
3 437 117 213
3 424 209 113
3 209 295 213
3 295 299 213
3 437 213 299
3 424 295 209
3 295 11 299
3 11 13 299
3 437 299 13
3 424 11 295
3 10 294 12
3 294 298 12
3 436 12 298
3 422 294 10
3 294 210 298
3 210 214 298
3 436 298 214
3 422 210 294
3 210 114 214
3 114 118 214
3 436 214 118
3 422 114 210
3 114 60 118
3 60 64 118
3 436 118 64
3 422 60 114
3 60 354 64
3 354 356 64
3 436 64 356
3 422 354 60
3 354 63 356
3 63 67 356
3 436 356 67
3 422 63 354
3 63 115 67
3 115 119 67
3 436 67 119
3 422 115 63
3 115 211 119
3 211 215 119
3 436 119 215
3 422 211 115
3 211 297 215
3 297 301 215
3 436 215 301
3 422 297 211
3 297 10 301
3 10 12 301
3 436 301 12
3 422 10 297
3 171 29 174
3 29 35 174
3 312 174 35
3 309 29 171
3 29 448 35
3 448 454 35
3 312 35 454
3 309 448 29
3 448 382 454
3 382 388 454
3 312 454 388
3 309 382 448
3 382 259 388
3 259 265 388
3 312 388 265
3 309 259 382
3 259 123 265
3 123 126 265
3 312 265 126
3 309 123 259
3 123 257 126
3 257 263 126
3 312 126 263
3 309 257 123
3 257 384 263
3 384 390 263
3 312 263 390
3 309 384 257
3 384 450 390
3 450 456 390
3 312 390 456
3 309 450 384
3 450 27 456
3 27 33 456
3 312 456 33
3 309 27 450
3 27 171 33
3 171 174 33
3 312 33 174
3 309 171 27
3 171 29 174
3 29 35 174
3 312 174 35
3 309 29 171
3 29 448 35
3 448 454 35
3 312 35 454
3 309 448 29
3 448 382 454
3 382 388 454
3 312 454 388
3 309 382 448
3 382 259 388
3 259 265 388
3 312 388 265
3 309 259 382
3 259 123 265
3 123 126 265
3 312 265 126
3 309 123 259
3 123 257 126
3 257 263 126
3 312 126 263
3 309 257 123
3 257 384 263
3 384 390 263
3 312 263 390
3 309 384 257
3 384 450 390
3 450 456 390
3 312 390 456
3 309 450 384
3 450 27 456
3 27 33 456
3 312 456 33
3 309 27 450
3 27 171 33
3 171 174 33
3 312 33 174
3 309 171 27
3 408 220 411
3 220 226 411
3 7 411 226
3 4 220 408
3 220 479 226
3 479 485 226
3 7 226 485
3 4 479 220
3 479 497 485
3 497 503 485
3 7 485 503
3 4 497 479
3 497 362 503
3 362 368 503
3 7 503 368
3 4 362 497
3 362 160 368
3 160 163 368
3 7 368 163
3 4 160 362
3 160 364 163
3 364 370 163
3 7 163 370
3 4 364 160
3 364 500 370
3 500 506 370
3 7 370 506
3 4 500 364
3 500 482 506
3 482 488 506
3 7 506 488
3 4 482 500
3 482 222 488
3 222 228 488
3 7 488 228
3 4 222 482
3 222 408 228
3 408 411 228
3 7 228 411
3 4 408 222
3 409 223 412
3 223 229 412
3 8 412 229
3 5 223 409
3 223 478 229
3 478 484 229
3 8 229 484
3 5 478 223
3 478 496 484
3 496 502 484
3 8 484 502
3 5 496 478
3 496 365 502
3 365 371 502
3 8 502 371
3 5 365 496
3 365 161 371
3 161 164 371
3 8 371 164
3 5 161 365
3 161 363 164
3 363 369 164
3 8 164 369
3 5 363 161
3 363 498 369
3 498 504 369
3 8 369 504
3 5 498 363
3 498 480 504
3 480 486 504
3 8 504 486
3 5 480 498
3 480 221 486
3 221 227 486
3 8 486 227
3 5 221 480
3 221 409 227
3 409 412 227
3 8 227 412
3 5 409 221
3 170 26 173
3 26 32 173
3 311 173 32
3 308 26 170
3 26 449 32
3 449 455 32
3 311 32 455
3 308 449 26
3 449 383 455
3 383 389 455
3 311 455 389
3 308 383 449
3 383 256 389
3 256 262 389
3 311 389 262
3 308 256 383
3 256 122 262
3 122 125 262
3 311 262 125
3 308 122 256
3 122 258 125
3 258 264 125
3 311 125 264
3 308 258 122
3 258 386 264
3 386 392 264
3 311 264 392
3 308 386 258
3 386 452 392
3 452 458 392
3 311 392 458
3 308 452 386
3 452 28 458
3 28 34 458
3 311 458 34
3 308 28 452
3 28 170 34
3 170 173 34
3 311 34 173
3 308 170 28
3 172 30 175
3 30 36 175
3 313 175 36
3 310 30 172
3 30 451 36
3 451 457 36
3 313 36 457
3 310 451 30
3 451 385 457
3 385 391 457
3 313 457 391
3 310 385 451
3 385 260 391
3 260 266 391
3 313 391 266
3 310 260 385
3 260 124 266
3 124 127 266
3 313 266 127
3 310 124 260
3 124 261 127
3 261 267 127
3 313 127 267
3 310 261 124
3 261 387 267
3 387 393 267
3 313 267 393
3 310 387 261
3 387 453 393
3 453 459 393
3 313 393 459
3 310 453 387
3 453 31 459
3 31 37 459
3 313 459 37
3 310 31 453
3 31 172 37
3 172 175 37
3 313 37 175
3 310 172 31
3 410 224 413
3 224 230 413
3 9 413 230
3 6 224 410
3 224 481 230
3 481 487 230
3 9 230 487
3 6 481 224
3 481 499 487
3 499 505 487
3 9 487 505
3 6 499 481
3 499 366 505
3 366 372 505
3 9 505 372
3 6 366 499
3 366 162 372
3 162 165 372
3 9 372 165
3 6 162 366
3 162 367 165
3 367 373 165
3 9 165 373
3 6 367 162
3 367 501 373
3 501 507 373
3 9 373 507
3 6 501 367
3 501 483 507
3 483 489 507
3 9 507 489
3 6 483 501
3 483 225 489
3 225 231 489
3 9 489 231
3 6 225 483
3 225 410 231
3 410 413 231
3 9 231 413
3 6 410 225
3 291 137 293
3 137 141 293
3 426 293 141
3 423 137 291
3 137 70 141
3 70 74 141
3 426 141 74
3 423 70 137
3 70 470 74
3 470 474 74
3 426 74 474
3 423 470 70
3 470 191 474
3 191 195 474
3 426 474 195
3 423 191 470
3 191 89 195
3 89 91 195
3 426 195 91
3 423 89 191
3 89 189 91
3 189 193 91
3 426 91 193
3 423 189 89
3 189 472 193
3 472 476 193
3 426 193 476
3 423 472 189
3 472 72 476
3 72 76 476
3 426 476 76
3 423 72 472
3 72 135 76
3 135 139 76
3 426 76 139
3 423 135 72
3 135 291 139
3 291 293 139
3 426 139 293
3 423 291 135
3 290 134 292
3 134 138 292
3 425 292 138
3 421 134 290
3 134 71 138
3 71 75 138
3 425 138 75
3 421 71 134
3 71 471 75
3 471 475 75
3 425 75 475
3 421 471 71
3 471 188 475
3 188 192 475
3 425 475 192
3 421 188 471
3 188 88 192
3 88 90 192
3 425 192 90
3 421 88 188
3 88 190 90
3 190 194 90
3 425 90 194
3 421 190 88
3 190 473 194
3 473 477 194
3 425 194 477
3 421 473 190
3 473 73 477
3 73 77 477
3 425 477 77
3 421 73 473
3 73 136 77
3 136 140 77
3 425 77 140
3 421 136 73
3 136 290 140
3 290 292 140
3 425 140 292
3 421 290 136
3 469 467 155
3 155 467 153
3 469 154 468
3 469 155 154
3 469 468 467
3 467 468 466
3 467 466 152
3 467 152 153
3 155 152 154
3 155 153 152
3 154 466 468
3 154 152 466