OFF
1047 1352 0
0.0466172203 -0.0665894009 0.0861601785
0.0701739994 -0.0665864623 0.0804229993
-0.0237877678 -0.0666217227 0.0331622651
0.0555974301 -0.0665954732 0.0625398627
-0.0319793246 -0.0666154372 0.0569325036
-0.2282824264 0.0440850675 -0.0065343429
-0.1115814423 0.0441166027 0.0156347790
0.0910694714 0.0441713636 0.0541313937
-0.0339115488 0.0441375909 0.0303893533
-0.1573869309 0.0167867108 -0.0743482495
-0.2024125952 0.0167718024 -0.0910707654
-0.0426744609 0.0798595727 0.0528149822
-0.0337691224 0.0798536172 0.0295887977
-0.2213655666 -0.0133296795 -0.0901690796
-0.2383568132 -0.0133219338 -0.0566332660
-0.1219020885 0.0421098881 0.0226615761
-0.1036158948 0.0421145552 0.0253182890
-0.2464184048 0.0420732252 -0.0099789524
0.0030079435 0.2082366810 -0.1039831466
-0.4132195829 0.2081499780 -0.1062562289
-0.2413691911 0.0043703031 0.0473628638
-0.2531972288 0.0043671069 0.0451159487
-0.2476514279 0.0043613403 0.0245195707
-0.2433137296 0.0043625124 0.0253435823
-0.2510966343 0.0043667150 0.0426555534
-0.2467589360 0.0043678871 0.0434795650
-0.2570810209 0.0043681137 0.0505054940
-0.2397333005 0.0043728014 0.0538009566
-0.2500543611 0.0043730282 0.0608270802
-0.2436909590 0.0043739252 0.0595849302
-0.2555189967 0.0043707290 0.0573380151
-0.0351970683 -0.0886963073 0.0330439509
-0.0411769123 -0.0886920288 0.0494729534
-0.2744533799 -0.0333691058 0.0194393129
-0.2972733902 0.0219942376 -0.0196336817
-0.0925578728 0.2716237314 -0.1041823705
-0.3177548605 0.2715767231 -0.1057052249
-0.1123873176 -0.0429677328 0.0200008820
0.2048183177 0.0124770751 0.0144760153
0.1638716800 0.0124406503 -0.0688734306
-0.0387728429 0.0678168132 0.0408964941
0.4078355845 0.2239835201 -0.0675252916
-0.0382543391 0.2238813452 -0.0975295366
0.1621235256 -0.0352727422 0.0586655476
-0.2535562193 -0.0353704005 0.0234096403
-0.2585620342 0.0199839115 -0.0535368558
0.2005402655 -0.0176119425 0.0434912430
0.0653192917 -0.0176535541 0.0026901904
-0.1645346748 -0.0177156658 -0.0409740568
-0.2197315015 -0.0177305813 -0.0514595312
-0.1073671914 -0.0177002179 -0.0301142263
-0.0253606239 -0.0176780579 -0.0145358349
0.0665925701 -0.0176555405 -0.0040125007
-0.1060939131 -0.0177022043 -0.0368169174
-0.0240873455 -0.0176800442 -0.0212385261
-0.1251966021 0.0377008005 0.0400105726
-0.1079986631 0.0377057219 0.0440945027
0.1708535200 0.0100585535 0.0018971636
0.0441850295 0.0835014875 0.0901470496
0.0339388597 0.0835015974 0.0967789394
0.0512865801 0.0835062852 0.1000744020
0.0409644952 0.0835065117 0.1071003310
0.0351055234 0.0835041060 0.1035363558
0.0473278973 0.0835074087 0.1058581811
0.0374272912 0.0835004839 0.0913142893
0.0496496652 0.0835037866 0.0936361147
-0.2817872030 -0.0000782885 -0.0301656649
-0.2413682797 -0.0000439255 0.0473643452
-0.2531963174 -0.0000471217 0.0451174300
-0.3005642578 -0.0000728072 -0.0022787595
-0.2900257850 -0.0000654358 0.0132032254
0.1148955072 -0.0000101638 -0.0712289411
-0.2522118627 -0.0000537097 0.0248799363
-0.2348641422 -0.0000490220 0.0281753989
-0.2738962571 -0.0000595694 0.0207606567
0.0844877555 0.0000372741 0.0888411356
-0.0404932647 0.0000035014 0.0650990952
-0.2476505165 -0.0000528884 0.0245210520
-0.2433128182 -0.0000517162 0.0253450636
-0.1558856367 -0.0000697639 -0.0822272691
-0.2335555302 -0.0000907520 -0.0969818434
-0.2539813217 -0.0000827005 -0.0604213750
-0.5000000000 -0.0001491803 -0.1071563544
0.1480962880 0.0000426736 0.0657945058
0.1627550858 0.0000436189 0.0595921890
0.0682365588 -0.0000001538 -0.0126917743
-0.1044499243 -0.0000468175 -0.0454961909
-0.0224433568 -0.0000246575 -0.0299177996
-0.2375681578 -0.0000888207 -0.0887577618
-0.2595910796 -0.0000818863 -0.0545435252
-0.2058866324 -0.0000862913 -0.1007131189
-0.2510957229 -0.0000475137 0.0426570347
-0.2467580246 -0.0000463415 0.0434810463
0.0898002893 -0.0000258552 -0.1025476763
0.1848168790 -0.0000001796 -0.0844978340
-0.2570801095 -0.0000461150 0.0505069753
-0.2397323891 -0.0000414272 0.0538024379
-0.2500534496 -0.0000412005 0.0608285615
0.2226308403 0.0000115464 -0.0728213279
-0.1741365103 -0.0000759296 -0.0893713981
0.5000000000 0.0000716931 -0.0642475439
0.2246924661 0.0000480187 0.0345945752
0.2304803710 0.0000151753 -0.0668370200
-0.1306856681 -0.0000722758 -0.1052173704
-0.2436900475 -0.0000403034 0.0595864116
-0.2555180853 -0.0000434996 0.0573394964
0.2298107998 0.0000191069 -0.0547093419
0.2003118891 0.0000463653 0.0446683260
0.2259015735 0.0000410802 0.0131744826
0.1338161467 -0.0000079299 -0.0762135144
-0.2972688328 -0.0000779482 -0.0196262747
-0.2508795735 -0.0097133170 -0.0573789584
-0.2050019953 -0.2946512225 -0.1049509433
0.1707987597 0.0257132564 0.0129112965
-0.1022428392 -0.0397493614 0.0354071762
0.1474666245 -0.0396879158 0.0648697452
-0.2842506075 -0.0398045756 -0.0171414910
0.2013923503 0.0156942468 0.0346568970
0.1182155468 0.0156421612 -0.0693771880
-0.0352300468 0.0710259984 0.0329903513
-0.0412098908 0.0710302770 0.0494193538
-0.2972642755 -0.0221501340 -0.0196188677
-0.0277123081 0.0613993170 0.0450420277
0.0516718850 0.0614255662 0.0744193284
0.2038985818 -0.0039788858 0.0085873036
0.0739681431 0.0790862594 0.0688459213
-0.0337717130 0.0790616692 0.0618591438
0.0449746134 0.0790874719 0.0902983512
0.0573296814 0.0790790216 0.0575153484
0.0834183417 0.0790938850 0.0857552260
-0.0403525078 0.0790531740 0.0405930827
-0.0220555360 0.0790527722 0.0281378532
0.0662448084 0.0790925342 0.0922965392
-0.0360080449 0.0413311444 0.0414295589
-0.2566689319 0.0412676786 -0.0119259576
-0.2661309524 0.0412651218 -0.0137234119
-0.0277195999 0.0967152313 0.0450301764
0.0516645932 0.0967414805 0.0744074771
0.1566245489 0.0313285052 0.0122587965
0.1548440016 -0.0340795916 0.0303222503
-0.2282641970 -0.0442036757 -0.0065047150
-0.1115632129 -0.0441721404 0.0156644069
0.0910877007 -0.0441173796 0.0541610217
-0.0338933195 -0.0441511523 0.0304189812
0.1843023185 0.3162340265 -0.0822389626
-0.2367808410 0.0015159027 -0.0886086746
0.0666300246 0.1123359514 -0.1033064827
-0.4768761473 0.1122226684 -0.1064740273
0.1668087678 0.0293302102 0.0317592150
0.0466223578 -0.0914713047 0.0861685284
0.0701791369 -0.0914683661 0.0804313491
-0.0237826303 -0.0915036265 0.0331706149
0.0556025676 -0.0914773770 0.0625482126
-0.0319741871 -0.0914973411 0.0569408534
-0.2346320125 -0.0361680634 0.0270048183
-0.1179310285 -0.0361365281 0.0491739403
0.0847198852 -0.0360817673 0.0876705550
-0.0402611350 -0.0361155400 0.0639285146
0.1030189877 -0.0361067062 0.0020955877
-0.2435489452 -0.0361952845 -0.0486254087
-0.2625081311 -0.0361988998 -0.0477338231
0.0441868524 0.0746730302 0.0901500122
0.0339406825 0.0746731401 0.0967819020
0.0512884029 0.0746778279 0.1000773646
0.0409663181 0.0746780544 0.1071032936
0.0351073462 0.0746756487 0.1035393184
0.0473297202 0.0746789514 0.1058611437
0.0374291141 0.0746720266 0.0913172520
0.0496514880 0.0746753294 0.0936390773
-0.1173469250 0.0369016529 0.0459952524
-0.0387778975 0.0922973288 0.0408882790
-0.3005604462 -0.0185335409 -0.0022725645
0.1046158367 0.0172635591 -0.0106878295
-0.2850980743 -0.0386026958 -0.0234301676
-0.2212252017 -0.0385962652 -0.0435668286
0.0981266961 -0.0385099691 0.0170989081
-0.0268543241 -0.0385437418 -0.0066431323
0.1542991951 -0.0128208835 -0.0012408023
-0.1278694057 -0.0405590629 0.0305392592
0.0669206866 0.0702630254 0.0887511931
0.0732959106 0.0702588536 0.0723971928
-0.2909898089 0.0324400905 0.0117850798
0.0669170407 0.0879209825 0.0887452674
0.0732922647 0.0879168108 0.0723912672
-0.2909763854 -0.0325733445 0.0118068970
0.0669496880 -0.0701968126 0.0887983285
0.0733249119 -0.0702009844 0.0724443283
-0.1278861435 0.0405057336 0.0305120554
0.1542938921 0.0128627543 -0.0012494212
-0.1071493121 0.1211298703 -0.1024164660
0.4758894195 0.1212630202 -0.0643704612
0.1046229626 -0.0172485361 -0.0106762480
-0.0387397815 -0.0923068808 0.0409502284
-0.1173316786 -0.0369402395 0.0460200322
-0.3005680693 0.0183868840 -0.0022849542
0.0442176765 -0.0746152651 0.0902001104
0.0339715067 -0.0746151551 0.0968320002
0.0513192271 -0.0746104674 0.1001274628
0.0409971422 -0.0746102409 0.1071533918
0.0351381704 -0.0746126466 0.1035894165
0.0473605443 -0.0746093438 0.1059112419
0.0374599382 -0.0746162687 0.0913673501
0.0496823122 -0.0746129659 0.0936891754
-0.2346469275 0.0360682758 0.0269805773
-0.1179459434 0.0360998110 0.0491496992
0.0847049703 0.0361545719 0.0876463139
-0.0402760499 0.0361207992 0.0639042735
0.1030040728 0.0361296330 0.0020713466
-0.2435638601 0.0360410547 -0.0486496498
-0.2625230460 0.0360374393 -0.0477580642
0.0465845733 0.0915273517 0.0861071178
0.0701413524 0.0915302903 0.0803699385
-0.0238204148 0.0914950299 0.0331092043
0.0555647831 0.0915212794 0.0624868019
-0.0320119716 0.0915013153 0.0568794428
0.1668208654 -0.0292610122 0.0317788770
0.0666764265 -0.1123987469 -0.1032310663
-0.4768297454 -0.1125120298 -0.1063986108
-0.2367801782 -0.0016941610 -0.0886075973
0.1844329067 -0.3162340265 -0.0820267191
0.1548299154 0.0341428646 0.0302993562
0.1566374752 -0.0312766001 0.0122798055
-0.0276796610 -0.0967174356 0.0450950885
0.0517045320 -0.0966911864 0.0744723892
-0.0359909757 -0.0413392052 0.0414573014
-0.2566518627 -0.0414026710 -0.0118982151
-0.2661138832 -0.0414052279 -0.0136956694
0.0740007901 -0.0790304932 0.0688989821
-0.0337390660 -0.0790550833 0.0619122046
0.0450072604 -0.0790292806 0.0903514120
0.0573623284 -0.0790377309 0.0575684092
0.0834509887 -0.0790228676 0.0858082868
-0.0403198608 -0.0790635786 0.0406461435
-0.0220228889 -0.0790639804 0.0281909139
0.0662774554 -0.0790242183 0.0923496000
0.2038969245 0.0040478375 0.0085846100
-0.0276869529 -0.0614015213 0.0450832372
0.0516972402 -0.0613752721 0.0744605378
-0.0352007140 -0.0710393928 0.0330380256
-0.0411805580 -0.0710351142 0.0494670281
0.2013988136 -0.0156088271 0.0346674017
0.1182220101 -0.0156609127 -0.0693666833
-0.1022592455 0.0397098819 0.0353805113
0.1474502183 0.0397713275 0.0648430802
-0.2842670137 0.0396546677 -0.0171681560
0.1708093660 -0.0256550619 0.0129285347
-0.2508835509 0.0095501933 -0.0573854228
0.0442194994 -0.0834437224 0.0902030730
0.0339733295 -0.0834436124 0.0968349628
0.0513210499 -0.0834389247 0.1001304254
0.0409989651 -0.0834386982 0.1071563544
0.0351399932 -0.0834411039 0.1035923792
0.0473623672 -0.0834378011 0.1059142045
0.0374617611 -0.0834447260 0.0913703128
0.0496841350 -0.0834414232 0.0936921381
-0.2051236347 0.2944751312 -0.1051486422
0.1708576632 -0.0100077334 0.0019038975
-0.1070992642 -0.1212627851 -0.1023351239
0.4759394673 -0.1211296352 -0.0642891191
-0.1251810241 -0.0377466450 0.0400358912
-0.1079830852 -0.0377417236 0.0441198214
0.2005329739 0.0177029293 0.0434793921
0.0653120001 0.0176613176 0.0026783394
-0.1645419664 0.0175992059 -0.0409859078
-0.2197387931 0.0175842905 -0.0514713822
-0.1073744830 0.0176146538 -0.0301260772
-0.0253679155 0.0176368139 -0.0145476859
0.0665852784 0.0176593312 -0.0040243517
-0.1061012047 0.0176126674 -0.0368287684
-0.0240946371 0.0176348275 -0.0212503770
-0.2585537481 -0.0201476198 -0.0535233885
0.1621089421 0.0353580438 0.0586418453
-0.2535708027 0.0352603855 0.0233859380
-0.0924456796 -0.2717529060 -0.1040000243
-0.3176426673 -0.2717999144 -0.1055228786
0.4079280570 -0.2238813658 -0.0673749972
-0.0381618666 -0.2239835407 -0.0973792422
0.3053566289 0.2925839259 -0.0743496209
0.0639715479 0.2925289791 -0.0895682563
-0.0387448361 -0.0678263653 0.0409420132
0.2048234550 -0.0124037862 0.0144843648
0.1638768172 -0.0124402110 -0.0688650811
-0.1124050499 0.0429137231 0.0199720619
-0.2744671346 0.0332477973 0.0194169576
-0.0352336925 0.0886829130 0.0329844260
-0.0412135365 0.0886871915 0.0494134285
0.0669533336 -0.0878537272 0.0888042538
0.0733285576 -0.0878578989 0.0724502536
-0.2413673680 -0.0044591967 0.0473658268
-0.2531954058 -0.0044623929 0.0451189117
-0.2476496048 -0.0044681596 0.0245225337
-0.2433119065 -0.0044669874 0.0253465453
-0.2510948113 -0.0044627849 0.0426585164
-0.2467571130 -0.0044616127 0.0434825280
-0.2570791978 -0.0044613862 0.0505084570
-0.2397314774 -0.0044566985 0.0538039196
-0.2500525380 -0.0044564717 0.0608300432
-0.2436891359 -0.0044555746 0.0595878933
-0.2555171737 -0.0044587708 0.0573409781
0.0030939529 -0.2083261735 -0.1038433565
-0.4131335734 -0.2084128765 -0.1061164388
-0.1218846877 -0.0421660147 0.0226898574
-0.1035984940 -0.0421613476 0.0253465703
-0.2464010040 -0.0422026776 -0.0099506711
-0.2213710354 0.0131567350 -0.0901779679
-0.2383622819 0.0131644807 -0.0566421543
-0.0426414824 -0.0798627330 0.0528685817
-0.0337361439 -0.0798686885 0.0296423973
-0.1573799708 -0.0169226078 -0.0743369374
-0.2024056351 -0.0169375161 -0.0910594532
-0.2851139836 0.0384492603 -0.0234560247
-0.2212411109 0.0384556909 -0.0435926857
0.0981107868 0.0385419870 0.0170730510
-0.0268702333 0.0385082143 -0.0066689894
0.0465897108 0.0666454479 0.0861154676
0.0701464899 0.0666483865 0.0803782883
-0.0238152773 0.0666131260 0.0331175541
0.0555699205 0.0666393756 0.0624951518
-0.0320068341 0.0666194115 0.0568877927
0.3054774396 -0.2925289619 -0.0741532688
0.0640923586 -0.2925839087 -0.0893719042
-0.1232929128 -0.0281371615 -0.0290513318
0.0321166883 -0.0413305607 0.0237589447
0.0221133102 -0.0180391329 0.0763848251
0.0254132829 -0.0401164598 0.0590447681
-0.1375626386 -0.0180822810 0.0460519568
-0.1663942073 -0.0413842028 -0.0139512108
0.0221058528 0.0180790367 0.0763727046
0.0320996190 0.0413397890 0.0237312022
-0.3095101029 -0.1042495839 -0.1034147789
-0.3931699241 -0.1083808069 -0.1049066949
-0.3613218382 -0.1563312302 -0.1047656088
-0.4449816594 -0.1604624532 -0.1062575248
-0.3413581889 -0.0562991605 -0.1035558649
-0.2576983677 -0.0521679376 -0.1020639489
-0.3931699241 -0.1083808069 -0.1049066949
-0.3095101029 -0.1042495839 -0.1034147789
-0.3413581889 -0.0562991605 -0.1035558649
-0.3931699241 -0.1083808069 -0.1049066949
-0.2576983677 -0.0521679376 -0.1020639489
-0.3931699241 -0.1083808069 -0.1049066949
-0.4449816594 -0.1604624532 -0.1062575248
-0.3613218382 -0.1563312302 -0.1047656088
-0.3095101029 -0.1042495839 -0.1034147789
-0.2617646499 -0.1359431028 -0.1031179988
-0.3135763851 -0.1880247491 -0.1044688288
-0.2576983677 -0.0521679376 -0.1020639489
-0.3135763851 -0.1880247491 -0.1044688288
-0.3653881204 -0.2401063954 -0.1058196587
-0.3613218382 -0.1563312302 -0.1047656088
-0.3095101029 -0.1042495839 -0.1034147789
-0.3135763851 -0.1880247491 -0.1044688288
-0.3613218382 -0.1563312302 -0.1047656088
-0.3653881204 -0.2401063954 -0.1058196587
-0.2617646499 -0.1359431028 -0.1031179988
-0.2576983677 -0.0521679376 -0.1020639489
-0.3135763851 -0.1880247491 -0.1044688288
0.2451471593 -0.1462645707 -0.0793255514
0.3265376081 -0.1850729683 -0.0733502743
0.2753122994 -0.2193967663 -0.0767394101
0.3160075239 -0.2388009651 -0.0737517716
0.2858423837 -0.1656687695 -0.0763379128
0.3567027483 -0.2582051638 -0.0707641330
0.3672328326 -0.2044771671 -0.0703626357
0.3160075239 -0.2388009651 -0.0737517716
0.2963724680 -0.1119407727 -0.0759364156
0.2149820191 -0.0731323752 -0.0819116927
0.2556772436 -0.0925365739 -0.0789240541
0.2405946735 -0.0559704762 -0.0802171248
0.3265376081 -0.1850729683 -0.0733502743
0.3521502625 -0.1679110693 -0.0716557064
0.2858423837 -0.1656687695 -0.0763379128
0.2451471593 -0.1462645707 -0.0793255514
0.2963724680 -0.1119407727 -0.0759364156
0.3265376081 -0.1850729683 -0.0733502743
0.2858423837 -0.1656687695 -0.0763379128
0.3521502625 -0.1679110693 -0.0716557064
0.2149820191 -0.0731323752 -0.0819116927
0.2405946735 -0.0559704762 -0.0802171248
0.2556772436 -0.0925365739 -0.0789240541
0.3265376081 -0.1850729683 -0.0733502743
0.3567027483 -0.2582051638 -0.0707641330
0.3160075239 -0.2388009651 -0.0737517716
0.3672328326 -0.2044771671 -0.0703626357
0.2753122994 -0.2193967663 -0.0767394101
0.2858423837 -0.1656687695 -0.0763379128
0.3160075239 -0.2388009651 -0.0737517716
0.0388588074 -0.0606314823 -0.0934164790
-0.0459134304 -0.0303518790 -0.0993169247
-0.0341202284 -0.0909471337 -0.0978758014
-0.0765063473 -0.0758073321 -0.1008260243
-0.0035273115 -0.0454916807 -0.0963667018
-0.1188924662 -0.0606675304 -0.1037762472
-0.0882995492 -0.0152120774 -0.1022671475
-0.0765063473 -0.0758073321 -0.1008260243
0.0270656054 -0.0000362277 -0.0948576022
0.1118378432 -0.0303158310 -0.0889571565
0.0694517243 -0.0151760293 -0.0919073793
0.1059412422 -0.0000182036 -0.0896777181
-0.0459134304 -0.0303518790 -0.0993169247
-0.0518100313 -0.0000542517 -0.1000374863
-0.0035273115 -0.0454916807 -0.0963667018
0.0388588074 -0.0606314823 -0.0934164790
0.0270656054 -0.0000362277 -0.0948576022
-0.0459134304 -0.0303518790 -0.0993169247
-0.0035273115 -0.0454916807 -0.0963667018
-0.0518100313 -0.0000542517 -0.1000374863
0.1118378432 -0.0303158310 -0.0889571565
0.1059412422 -0.0000182036 -0.0896777181
0.0694517243 -0.0151760293 -0.0919073793
-0.0459134304 -0.0303518790 -0.0993169247
-0.1188924662 -0.0606675304 -0.1037762472
-0.0765063473 -0.0758073321 -0.1008260243
-0.0882995492 -0.0152120774 -0.1022671475
-0.0341202284 -0.0909471337 -0.0978758014
-0.0035273115 -0.0454916807 -0.0963667018
-0.0765063473 -0.0758073321 -0.1008260243
0.0388588074 -0.0606314823 -0.0934164790
0.0733275062 -0.1119918601 -0.0909385381
0.0003484704 -0.1423075115 -0.0953978606
0.0196036389 -0.1014694969 -0.0944071698
0.0175828198 -0.1679877004 -0.0941588901
0.1118378432 -0.0303158310 -0.0889571565
0.1290721926 -0.0559960199 -0.0877181860
0.0925826747 -0.0711538455 -0.0899478473
0.0003484704 -0.1423075115 -0.0953978606
-0.0726305654 -0.1726231629 -0.0998571831
-0.0533753969 -0.1317851483 -0.0988664923
-0.0189066981 -0.1831455261 -0.0963885514
-0.0341202284 -0.0909471337 -0.0978758014
0.0196036389 -0.1014694969 -0.0944071698
-0.0533753969 -0.1317851483 -0.0988664923
0.0388588074 -0.0606314823 -0.0934164790
0.0003484704 -0.1423075115 -0.0953978606
-0.0341202284 -0.0909471337 -0.0978758014
-0.0533753969 -0.1317851483 -0.0988664923
0.0196036389 -0.1014694969 -0.0944071698
-0.0726305654 -0.1726231629 -0.0998571831
-0.0189066981 -0.1831455261 -0.0963885514
-0.0533753969 -0.1317851483 -0.0988664923
0.0733275062 -0.1119918601 -0.0909385381
0.1118378432 -0.0303158310 -0.0889571565
0.0925826747 -0.0711538455 -0.0899478473
0.1290721926 -0.0559960199 -0.0877181860
0.0003484704 -0.1423075115 -0.0953978606
0.0175828198 -0.1679877004 -0.0941588901
0.0196036389 -0.1014694969 -0.0944071698
0.2451471593 -0.1462645707 -0.0793255514
0.2147900330 -0.2312492986 -0.0806761352
0.2753122994 -0.2193967663 -0.0767394101
0.2601337363 -0.2618891302 -0.0774147020
0.2299685961 -0.1887569347 -0.0800008433
0.2449551732 -0.3043814942 -0.0780899940
0.1996114699 -0.2737416625 -0.0813514272
0.2601337363 -0.2618891302 -0.0774147020
0.1846248928 -0.1581171030 -0.0832622765
0.2149820191 -0.0731323752 -0.0819116927
0.1998034560 -0.1156247391 -0.0825869846
0.1847208859 -0.0790586413 -0.0838800552
0.2147900330 -0.2312492986 -0.0806761352
0.1845288998 -0.2371755647 -0.0826444978
0.2299685961 -0.1887569347 -0.0800008433
0.2451471593 -0.1462645707 -0.0793255514
0.1846248928 -0.1581171030 -0.0832622765
0.2147900330 -0.2312492986 -0.0806761352
0.2299685961 -0.1887569347 -0.0800008433
0.1845288998 -0.2371755647 -0.0826444978
0.2149820191 -0.0731323752 -0.0819116927
0.1847208859 -0.0790586413 -0.0838800552
0.1998034560 -0.1156247391 -0.0825869846
0.2147900330 -0.2312492986 -0.0806761352
0.2449551732 -0.3043814942 -0.0780899940
0.2601337363 -0.2618891302 -0.0774147020
0.1996114699 -0.2737416625 -0.0813514272
0.2753122994 -0.2193967663 -0.0767394101
0.2299685961 -0.1887569347 -0.0800008433
0.2601337363 -0.2618891302 -0.0774147020
-0.3095531076 0.1040318434 -0.1034846739
-0.2618207465 0.1357452159 -0.1032091719
-0.3136539841 0.1878042832 -0.1045949494
-0.2577198700 0.0519727760 -0.1020988964
-0.3136539841 0.1878042832 -0.1045949494
-0.3654872217 0.2398633505 -0.1059807269
-0.3613863452 0.1560909107 -0.1048704514
-0.3095531076 0.1040318434 -0.1034846739
-0.3136539841 0.1878042832 -0.1045949494
-0.3613863452 0.1560909107 -0.1048704514
-0.3654872217 0.2398633505 -0.1059807269
-0.2618207465 0.1357452159 -0.1032091719
-0.2577198700 0.0519727760 -0.1020988964
-0.3136539841 0.1878042832 -0.1045949494
-0.3095531076 0.1040318434 -0.1034846739
-0.3932146275 0.1081272559 -0.1049793506
-0.3613863452 0.1560909107 -0.1048704514
-0.4450478651 0.1601863232 -0.1063651281
-0.3413813898 0.0560681886 -0.1035935731
-0.2577198700 0.0519727760 -0.1020988964
-0.3932146275 0.1081272559 -0.1049793506
-0.3095531076 0.1040318434 -0.1034846739
-0.3413813898 0.0560681886 -0.1035935731
-0.3932146275 0.1081272559 -0.1049793506
-0.2577198700 0.0519727760 -0.1020988964
-0.3932146275 0.1081272559 -0.1049793506
-0.4450478651 0.1601863232 -0.1063651281
-0.3613863452 0.1560909107 -0.1048704514
-0.3529433162 -0.0001177358 -0.1039347367
-0.3413813898 0.0560681886 -0.1035935731
-0.4149097317 0.0560524663 -0.1052043820
-0.2794149743 -0.0001020135 -0.1023239278
-0.4149097317 0.0560524663 -0.1052043820
-0.4884380736 0.0560367441 -0.1068151908
-0.4264716581 -0.0001334580 -0.1055455455
-0.3529433162 -0.0001177358 -0.1039347367
-0.4149097317 0.0560524663 -0.1052043820
-0.4264716581 -0.0001334580 -0.1055455455
-0.4884380736 0.0560367441 -0.1068151908
-0.3413813898 0.0560681886 -0.1035935731
-0.2794149743 -0.0001020135 -0.1023239278
-0.4149097317 0.0560524663 -0.1052043820
-0.0580431715 -0.0000560733 -0.1016303976
0.0042934265 0.0561399391 -0.1024684402
0.0158785589 -0.0000409642 -0.1020890370
0.0782151570 0.0561550481 -0.1029270795
-0.0696283039 0.0561248300 -0.1020098008
-0.1319649020 -0.0000711823 -0.1011717583
0.0042934265 0.0561399391 -0.1024684402
-0.0580431715 -0.0000560733 -0.1016303976
-0.0696283039 0.0561248300 -0.1020098008
0.0042934265 0.0561399391 -0.1024684402
-0.1319649020 -0.0000711823 -0.1011717583
0.0042934265 0.0561399391 -0.1024684402
0.0782151570 0.0561550481 -0.1029270795
0.0158785589 -0.0000409642 -0.1020890370
-0.1014393445 0.1040751949 -0.1023481328
-0.0696283039 0.0561248300 -0.1020098008
-0.0174046599 0.1082055731 -0.1028273077
-0.1536629885 0.0519944518 -0.1015306258
-0.0174046599 0.1082055731 -0.1028273077
0.0348189840 0.1602863162 -0.1036448147
-0.0492157005 0.1561559379 -0.1031656397
-0.1014393445 0.1040751949 -0.1023481328
-0.0174046599 0.1082055731 -0.1028273077
-0.0492157005 0.1561559379 -0.1031656397
0.0348189840 0.1602863162 -0.1036448147
-0.0696283039 0.0561248300 -0.1020098008
-0.1536629885 0.0519944518 -0.1015306258
-0.0174046599 0.1082055731 -0.1028273077
-0.1014393445 0.1040751949 -0.1023481328
-0.0969986086 0.1878494631 -0.1032652517
-0.0492157005 0.1561559379 -0.1031656397
-0.0447749647 0.2399302062 -0.1040827586
-0.1492222526 0.1357687201 -0.1024477447
-0.1536629885 0.0519944518 -0.1015306258
-0.0969986086 0.1878494631 -0.1032652517
-0.1014393445 0.1040751949 -0.1023481328
-0.1492222526 0.1357687201 -0.1024477447
-0.0969986086 0.1878494631 -0.1032652517
-0.1536629885 0.0519944518 -0.1015306258
-0.0969986086 0.1878494631 -0.1032652517
-0.0447749647 0.2399302062 -0.1040827586
-0.0492157005 0.1561559379 -0.1031656397
-0.2055051335 0.1471944200 -0.1029308806
-0.1492222526 0.1357687201 -0.1024477447
-0.1490315032 0.2094090757 -0.1035566255
-0.2056958830 0.0735540643 -0.1018219997
-0.1490315032 0.2094090757 -0.1035566255
-0.1488407537 0.2830494313 -0.1046655064
-0.2053143841 0.2208347756 -0.1040397614
-0.2055051335 0.1471944200 -0.1029308806
-0.1490315032 0.2094090757 -0.1035566255
-0.2053143841 0.2208347756 -0.1040397614
-0.1488407537 0.2830494313 -0.1046655064
-0.1492222526 0.1357687201 -0.1024477447
-0.2056958830 0.0735540643 -0.1018219997
-0.1490315032 0.2094090757 -0.1035566255
-0.2055051335 0.1471944200 -0.1029308806
-0.2616299970 0.2093855715 -0.1043180527
-0.2053143841 0.2208347756 -0.1040397614
-0.2614392476 0.2830259271 -0.1054269335
-0.2618207465 0.1357452159 -0.1032091719
-0.2056958830 0.0735540643 -0.1018219997
-0.2616299970 0.2093855715 -0.1043180527
-0.2055051335 0.1471944200 -0.1029308806
-0.2618207465 0.1357452159 -0.1032091719
-0.2616299970 0.2093855715 -0.1043180527
-0.2056958830 0.0735540643 -0.1018219997
-0.2616299970 0.2093855715 -0.1043180527
-0.2614392476 0.2830259271 -0.1054269335
-0.2053143841 0.2208347756 -0.1040397614
0.3303531492 0.0606314203 -0.0744341476
0.3424084395 0.0000357568 -0.0743726889
0.4151765746 0.0303515567 -0.0693408457
0.3727648619 0.0454914885 -0.0718874967
0.4212042197 0.0000537250 -0.0693101164
0.2575850141 0.0303156203 -0.0794659908
0.2636126592 0.0000177886 -0.0794352614
0.2999967268 0.0151756886 -0.0769193399
0.4151765746 0.0303515567 -0.0693408457
0.4879447097 0.0606673567 -0.0643090025
0.4455329970 0.0758072885 -0.0668556535
0.4575882873 0.0152116249 -0.0667941948
0.4031212844 0.0909472202 -0.0694023044
0.3727648619 0.0454914885 -0.0718874967
0.4455329970 0.0758072885 -0.0668556535
0.3303531492 0.0606314203 -0.0744341476
0.4151765746 0.0303515567 -0.0693408457
0.4031212844 0.0909472202 -0.0694023044
0.4455329970 0.0758072885 -0.0668556535
0.3727648619 0.0454914885 -0.0718874967
0.4879447097 0.0606673567 -0.0643090025
0.4575882873 0.0152116249 -0.0667941948
0.4455329970 0.0758072885 -0.0668556535
0.3424084395 0.0000357568 -0.0743726889
0.2575850141 0.0303156203 -0.0794659908
0.2999967268 0.0151756886 -0.0769193399
0.2636126592 0.0000177886 -0.0794352614
0.4151765746 0.0303515567 -0.0693408457
0.4212042197 0.0000537250 -0.0693101164
0.3727648619 0.0454914885 -0.0718874967
0.2963262317 0.1119916702 -0.0760115628
0.3303531492 0.0606314203 -0.0744341476
0.3861078256 0.1166273452 -0.0701910120
0.3412170287 0.1143095077 -0.0731012874
0.4031212844 0.0909472202 -0.0694023044
0.2405715554 0.0559957453 -0.0802546984
0.2575850141 0.0303156203 -0.0794659908
0.2854623523 0.0583135828 -0.0773444230
0.3861078256 0.1166273452 -0.0701910120
0.4418625020 0.1726232701 -0.0659478764
0.3969717051 0.1703054326 -0.0688581518
0.4309986226 0.1189451827 -0.0672807366
0.3520809081 0.1679875951 -0.0717684272
0.3412170287 0.1143095077 -0.0731012874
0.3969717051 0.1703054326 -0.0688581518
0.2963262317 0.1119916702 -0.0760115628
0.3861078256 0.1166273452 -0.0701910120
0.3520809081 0.1679875951 -0.0717684272
0.3969717051 0.1703054326 -0.0688581518
0.3412170287 0.1143095077 -0.0731012874
0.4418625020 0.1726232701 -0.0659478764
0.4309986226 0.1189451827 -0.0672807366
0.3969717051 0.1703054326 -0.0688581518
0.3303531492 0.0606314203 -0.0744341476
0.2405715554 0.0559957453 -0.0802546984
0.2854623523 0.0583135828 -0.0773444230
0.2575850141 0.0303156203 -0.0794659908
0.3861078256 0.1166273452 -0.0701910120
0.4031212844 0.0909472202 -0.0694023044
0.3412170287 0.1143095077 -0.0731012874
0.2450867539 0.1462918732 -0.0794237274
0.2146945362 0.2312629498 -0.0808313450
0.2752216914 0.2194378995 -0.0768866742
0.2600255826 0.2619234379 -0.0775904830
0.2298906451 0.1887774115 -0.0801275362
0.2448294737 0.3044089762 -0.0782942918
0.1994984273 0.2737484881 -0.0815351538
0.2600255826 0.2619234379 -0.0775904830
0.1845595987 0.1581169234 -0.0833683983
0.2149518164 0.0731458468 -0.0819607807
0.1997557076 0.1156313851 -0.0826645895
0.1846882388 0.0790583719 -0.0839331161
0.2146945362 0.2312629498 -0.0808313450
0.1844309586 0.2371754749 -0.0828036804
0.2298906451 0.1887774115 -0.0801275362
0.2450867539 0.1462918732 -0.0794237274
0.1845595987 0.1581169234 -0.0833683983
0.2146945362 0.2312629498 -0.0808313450
0.2298906451 0.1887774115 -0.0801275362
0.1844309586 0.2371754749 -0.0828036804
0.2149518164 0.0731458468 -0.0819607807
0.1846882388 0.0790583719 -0.0839331161
0.1997557076 0.1156313851 -0.0826645895
0.2146945362 0.2312629498 -0.0808313450
0.2448294737 0.3044089762 -0.0782942918
0.2600255826 0.2619234379 -0.0775904830
0.1994984273 0.2737484881 -0.0815351538
0.2752216914 0.2194378995 -0.0768866742
0.2298906451 0.1887774115 -0.0801275362
0.2600255826 0.2619234379 -0.0775904830
0.1243942134 0.1462643997 -0.0870330451
0.1845595987 0.1581169234 -0.0833683983
0.1543482660 0.2312492131 -0.0846360039
0.1393712397 0.1887568064 -0.0858345245
0.1844309586 0.2371754749 -0.0828036804
0.1546055462 0.0731321101 -0.0857654395
0.1846882388 0.0790583719 -0.0839331161
0.1695825725 0.1156245167 -0.0845669189
0.1543482660 0.2312492131 -0.0846360039
0.1241369332 0.3043815028 -0.0859036094
0.1091599069 0.2618890961 -0.0871021301
0.1693252922 0.2737416198 -0.0834374832
0.0941828807 0.2193966894 -0.0883006507
0.1393712397 0.1887568064 -0.0858345245
0.1091599069 0.2618890961 -0.0871021301
0.1243942134 0.1462643997 -0.0870330451
0.1543482660 0.2312492131 -0.0846360039
0.0941828807 0.2193966894 -0.0883006507
0.1091599069 0.2618890961 -0.0871021301
0.1393712397 0.1887568064 -0.0858345245
0.1241369332 0.3043815028 -0.0859036094
0.1693252922 0.2737416198 -0.0834374832
0.1091599069 0.2618890961 -0.0871021301
0.1845595987 0.1581169234 -0.0833683983
0.1546055462 0.0731321101 -0.0857654395
0.1695825725 0.1156245167 -0.0845669189
0.1846882388 0.0790583719 -0.0839331161
0.1543482660 0.2312492131 -0.0846360039
0.1844309586 0.2371754749 -0.0828036804
0.1393712397 0.1887568064 -0.0858345245
0.1243942134 0.1462643997 -0.0870330451
0.0430699372 0.1850728725 -0.0922812909
0.0941828807 0.2193966894 -0.0883006507
0.0535207426 0.2388009258 -0.0909247736
0.0837320753 0.1656686361 -0.0896571680
0.0128586044 0.2582051621 -0.0935488964
0.0024077991 0.2044771088 -0.0949054137
0.0535207426 0.2388009258 -0.0909247736
0.0732812699 0.1119405828 -0.0910136853
0.1546055462 0.0731321101 -0.0857654395
0.1139434081 0.0925363464 -0.0883895624
0.1290490745 0.0559702016 -0.0877557596
0.0430699372 0.1850728725 -0.0922812909
0.0175134654 0.1679109640 -0.0942716110
0.0837320753 0.1656686361 -0.0896571680
0.1243942134 0.1462643997 -0.0870330451
0.0732812699 0.1119405828 -0.0910136853
0.0430699372 0.1850728725 -0.0922812909
0.0837320753 0.1656686361 -0.0896571680
0.0175134654 0.1679109640 -0.0942716110
0.1546055462 0.0731321101 -0.0857654395
0.1290490745 0.0559702016 -0.0877557596
0.1139434081 0.0925363464 -0.0883895624
0.0430699372 0.1850728725 -0.0922812909
0.0128586044 0.2582051621 -0.0935488964
0.0535207426 0.2388009258 -0.0909247736
0.0024077991 0.2044771088 -0.0949054137
0.0941828807 0.2193966894 -0.0883006507
0.0837320753 0.1656686361 -0.0896571680
0.0535207426 0.2388009258 -0.0909247736
0.0388337835 0.0605648454 -0.0934571500
0.0732812699 0.1119405828 -0.0910136853
0.0002897222 0.1422230953 -0.0954933433
0.0195617528 0.1013939703 -0.0944752466
0.0175134654 0.1679109640 -0.0942716110
0.1118253312 0.0302823329 -0.0889774920
0.1290490745 0.0559702016 -0.0877557596
0.0925533006 0.0711114578 -0.0899955886
0.0002897222 0.1422230953 -0.0954933433
-0.0727018256 0.1725056078 -0.0999730013
-0.0534297949 0.1316764828 -0.0989549047
-0.0189823084 0.1830522203 -0.0965114400
-0.0341577643 0.0908473578 -0.0979368080
0.0195617528 0.1013939703 -0.0944752466
-0.0534297949 0.1316764828 -0.0989549047
0.0388337835 0.0605648454 -0.0934571500
0.0002897222 0.1422230953 -0.0954933433
-0.0341577643 0.0908473578 -0.0979368080
-0.0534297949 0.1316764828 -0.0989549047
0.0195617528 0.1013939703 -0.0944752466
-0.0727018256 0.1725056078 -0.0999730013
-0.0189823084 0.1830522203 -0.0965114400
-0.0534297949 0.1316764828 -0.0989549047
0.0732812699 0.1119405828 -0.0910136853
0.1118253312 0.0302823329 -0.0889774920
0.0925533006 0.0711114578 -0.0899955886
0.1290490745 0.0559702016 -0.0877557596
0.0002897222 0.1422230953 -0.0954933433
0.0175134654 0.1679109640 -0.0942716110
0.0195617528 0.1013939703 -0.0944752466
0.0388337835 0.0605648454 -0.0934571500
-0.0459259423 0.0302462848 -0.0993372602
-0.0341577643 0.0908473578 -0.0979368080
-0.0765376272 0.0756880776 -0.1008768631
-0.0035460794 0.0454055651 -0.0963972051
-0.1189174901 0.0605287973 -0.1038169182
-0.0883058052 0.0150870045 -0.1022773153
-0.0765376272 0.0756880776 -0.1008768631
0.0270656054 -0.0000362277 -0.0948576022
0.1118253312 0.0302823329 -0.0889774920
0.0694454683 0.0151230526 -0.0919175471
0.1059412422 -0.0000182036 -0.0896777181
-0.0459259423 0.0302462848 -0.0993372602
-0.0518100313 -0.0000542517 -0.1000374863
-0.0035460794 0.0454055651 -0.0963972051
0.0388337835 0.0605648454 -0.0934571500
0.0270656054 -0.0000362277 -0.0948576022
-0.0459259423 0.0302462848 -0.0993372602
-0.0035460794 0.0454055651 -0.0963972051
-0.0518100313 -0.0000542517 -0.1000374863
0.1118253312 0.0302823329 -0.0889774920
0.1059412422 -0.0000182036 -0.0896777181
0.0694454683 0.0151230526 -0.0919175471
-0.0459259423 0.0302462848 -0.0993372602
-0.1189174901 0.0605287973 -0.1038169182
-0.0765376272 0.0756880776 -0.1008768631
-0.0883058052 0.0150870045 -0.1022773153
-0.0341577643 0.0908473578 -0.0979368080
-0.0035460794 0.0454055651 -0.0963972051
-0.0765376272 0.0756880776 -0.1008768631
0.2450867539 0.1462918732 -0.0794237274
0.3264611692 0.1851376966 -0.0734745095
0.2752216914 0.2194378995 -0.0768866742
0.3159088991 0.2388608113 -0.0739120652
0.2857739616 0.1657147849 -0.0764491185
0.3565961067 0.2582837230 -0.0709374563
0.3671483769 0.2045606083 -0.0704999006
0.3159088991 0.2388608113 -0.0739120652
0.2963262317 0.1119916702 -0.0760115628
0.2149518164 0.0731458468 -0.0819607807
0.2556390241 0.0925687585 -0.0789861717
0.2405715554 0.0559957453 -0.0802546984
0.3264611692 0.1851376966 -0.0734745095
0.3520809081 0.1679875951 -0.0717684272
0.2857739616 0.1657147849 -0.0764491185
0.2450867539 0.1462918732 -0.0794237274
0.2963262317 0.1119916702 -0.0760115628
0.3264611692 0.1851376966 -0.0734745095
0.2857739616 0.1657147849 -0.0764491185
0.3520809081 0.1679875951 -0.0717684272
0.2149518164 0.0731458468 -0.0819607807
0.2405715554 0.0559957453 -0.0802546984
0.2556390241 0.0925687585 -0.0789861717
0.3264611692 0.1851376966 -0.0734745095
0.3565961067 0.2582837230 -0.0709374563
0.3159088991 0.2388608113 -0.0739120652
0.3671483769 0.2045606083 -0.0704999006
0.2752216914 0.2194378995 -0.0768866742
0.2857739616 0.1657147849 -0.0764491185
0.3159088991 0.2388608113 -0.0739120652
0.1244546188 -0.1462920441 -0.0869348691
0.1846248928 -0.1581171030 -0.0832622765
0.1544437628 -0.2312630353 -0.0844807941
0.1394491908 -0.1887775397 -0.0857078316
0.1845288998 -0.2371755647 -0.0826444978
0.1546357489 -0.0731461119 -0.0857163515
0.1847208859 -0.0790586413 -0.0838800552
0.1696303209 -0.1156316074 -0.0844893140
0.1544437628 -0.2312630353 -0.0844807941
0.1242626327 -0.3044089676 -0.0856993116
0.1092680607 -0.2619234720 -0.0869263491
0.1694383347 -0.2737485309 -0.0832537566
0.0942734887 -0.2194379764 -0.0881533866
0.1394491908 -0.1887775397 -0.0857078316
0.1092680607 -0.2619234720 -0.0869263491
0.1244546188 -0.1462920441 -0.0869348691
0.1544437628 -0.2312630353 -0.0844807941
0.0942734887 -0.2194379764 -0.0881533866
0.1092680607 -0.2619234720 -0.0869263491
0.1394491908 -0.1887775397 -0.0857078316
0.1242626327 -0.3044089676 -0.0856993116
0.1694383347 -0.2737485309 -0.0832537566
0.1092680607 -0.2619234720 -0.0869263491
0.1846248928 -0.1581171030 -0.0832622765
0.1546357489 -0.0731461119 -0.0857163515
0.1696303209 -0.1156316074 -0.0844893140
0.1847208859 -0.0790586413 -0.0838800552
0.1544437628 -0.2312630353 -0.0844807941
0.1845288998 -0.2371755647 -0.0826444978
0.1394491908 -0.1887775397 -0.0857078316
0.1244546188 -0.1462920441 -0.0869348691
0.0431463761 -0.1851377924 -0.0921570556
0.0942734887 -0.2194379764 -0.0881533866
0.0536193673 -0.2388608505 -0.0907644799
0.0838004974 -0.1657149183 -0.0895459624
0.0129652460 -0.2582837247 -0.0933755732
0.0024922548 -0.2045606665 -0.0947681489
0.0536193673 -0.2388608505 -0.0907644799
0.0733275062 -0.1119918601 -0.0909385381
0.1546357489 -0.0731461119 -0.0857163515
0.1139816275 -0.0925689860 -0.0883274448
0.1290721926 -0.0559960199 -0.0877181860
0.0431463761 -0.1851377924 -0.0921570556
0.0175828198 -0.1679877004 -0.0941588901
0.0838004974 -0.1657149183 -0.0895459624
0.1244546188 -0.1462920441 -0.0869348691
0.0733275062 -0.1119918601 -0.0909385381
0.0431463761 -0.1851377924 -0.0921570556
0.0838004974 -0.1657149183 -0.0895459624
0.0175828198 -0.1679877004 -0.0941588901
0.1546357489 -0.0731461119 -0.0857163515
0.1290721926 -0.0559960199 -0.0877181860
0.1139816275 -0.0925689860 -0.0883274448
0.0431463761 -0.1851377924 -0.0921570556
0.0129652460 -0.2582837247 -0.0933755732
0.0536193673 -0.2388608505 -0.0907644799
0.0024922548 -0.2045606665 -0.0947681489
0.0942734887 -0.2194379764 -0.0881533866
0.0838004974 -0.1657149183 -0.0895459624
0.0536193673 -0.2388608505 -0.0907644799
0.2963724680 -0.1119407727 -0.0759364156
0.3303781731 -0.0605649074 -0.0743934765
0.3861559676 -0.1165352040 -0.0701127673
0.3412642178 -0.1142379883 -0.0730245915
0.4031588202 -0.0908472713 -0.0693412978
0.2405946735 -0.0559704762 -0.0802171248
0.2575975260 -0.0302825435 -0.0794456553
0.2854864233 -0.0582676918 -0.0773053007
0.3861559676 -0.1165352040 -0.0701127673
0.4419337622 -0.1725055005 -0.0658320581
0.3970420123 -0.1702082849 -0.0687438823
0.4310477175 -0.1188324196 -0.0672009432
0.3521502625 -0.1679110693 -0.0716557064
0.3412642178 -0.1142379883 -0.0730245915
0.3970420123 -0.1702082849 -0.0687438823
0.2963724680 -0.1119407727 -0.0759364156
0.3861559676 -0.1165352040 -0.0701127673
0.3521502625 -0.1679110693 -0.0716557064
0.3970420123 -0.1702082849 -0.0687438823
0.3412642178 -0.1142379883 -0.0730245915
0.4419337622 -0.1725055005 -0.0658320581
0.4310477175 -0.1188324196 -0.0672009432
0.3970420123 -0.1702082849 -0.0687438823
0.3303781731 -0.0605649074 -0.0743934765
0.2405946735 -0.0559704762 -0.0802171248
0.2854864233 -0.0582676918 -0.0773053007
0.2575975260 -0.0302825435 -0.0794456553
0.3861559676 -0.1165352040 -0.0701127673
0.4031588202 -0.0908472713 -0.0693412978
0.3412642178 -0.1142379883 -0.0730245915
0.3303781731 -0.0605649074 -0.0743934765
0.3424084395 0.0000357568 -0.0743726889
0.4151890866 -0.0302466071 -0.0693205102
0.3727836298 -0.0454057573 -0.0718569934
0.4212042197 0.0000537250 -0.0693101164
0.2575975260 -0.0302825435 -0.0794456553
0.2636126592 0.0000177886 -0.0794352614
0.3000029828 -0.0151233934 -0.0769091721
0.4151890866 -0.0302466071 -0.0693205102
0.4879697336 -0.0605289710 -0.0642683315
0.4455642769 -0.0756881212 -0.0668048147
0.4575945433 -0.0150874570 -0.0667840271
0.4031588202 -0.0908472713 -0.0693412978
0.3727836298 -0.0454057573 -0.0718569934
0.4455642769 -0.0756881212 -0.0668048147
0.3303781731 -0.0605649074 -0.0743934765
0.4151890866 -0.0302466071 -0.0693205102
0.4031588202 -0.0908472713 -0.0693412978
0.4455642769 -0.0756881212 -0.0668048147
0.3727836298 -0.0454057573 -0.0718569934
0.4879697336 -0.0605289710 -0.0642683315
0.4575945433 -0.0150874570 -0.0667840271
0.4455642769 -0.0756881212 -0.0668048147
0.3424084395 0.0000357568 -0.0743726889
0.2575975260 -0.0302825435 -0.0794456553
0.3000029828 -0.0151233934 -0.0769091721
0.2636126592 0.0000177886 -0.0794352614
0.4151890866 -0.0302466071 -0.0693205102
0.4212042197 0.0000537250 -0.0693101164
0.3727836298 -0.0454057573 -0.0718569934
-0.2054443139 -0.1473687569 -0.1028320311
-0.2615434906 -0.2095843356 -0.1041774549
-0.2052231546 -0.2210099897 -0.1038914872
-0.2613223313 -0.2832255684 -0.1052369109
-0.2617646499 -0.1359431028 -0.1031179988
-0.2056654732 -0.0737275241 -0.1017725750
-0.2615434906 -0.2095843356 -0.1041774549
-0.2054443139 -0.1473687569 -0.1028320311
-0.2617646499 -0.1359431028 -0.1031179988
-0.2615434906 -0.2095843356 -0.1041774549
-0.2056654732 -0.0737275241 -0.1017725750
-0.2615434906 -0.2095843356 -0.1041774549
-0.2613223313 -0.2832255684 -0.1052369109
-0.2052231546 -0.2210099897 -0.1038914872
-0.2054443139 -0.1473687569 -0.1028320311
-0.1491661560 -0.1359195986 -0.1023565716
-0.1489449967 -0.2095608314 -0.1034160277
-0.2056654732 -0.0737275241 -0.1017725750
-0.1489449967 -0.2095608314 -0.1034160277
-0.1487238374 -0.2832020642 -0.1044754838
-0.2052231546 -0.2210099897 -0.1038914872
-0.2054443139 -0.1473687569 -0.1028320311
-0.1489449967 -0.2095608314 -0.1034160277
-0.2052231546 -0.2210099897 -0.1038914872
-0.1487238374 -0.2832020642 -0.1044754838
-0.1491661560 -0.1359195986 -0.1023565716
-0.2056654732 -0.0737275241 -0.1017725750
-0.1489449967 -0.2095608314 -0.1034160277
-0.1013963398 -0.1042062324 -0.1022782377
-0.0969210097 -0.1879795692 -0.1031391310
-0.0491511934 -0.1562662030 -0.1030607971
-0.0446758633 -0.2400395397 -0.1039216904
-0.1491661560 -0.1359195986 -0.1023565716
-0.1536414861 -0.0521462618 -0.1014956783
-0.0969210097 -0.1879795692 -0.1031391310
-0.1013963398 -0.1042062324 -0.1022782377
-0.1491661560 -0.1359195986 -0.1023565716
-0.0969210097 -0.1879795692 -0.1031391310
-0.1536414861 -0.0521462618 -0.1014956783
-0.0969210097 -0.1879795692 -0.1031391310
-0.0446758633 -0.2400395397 -0.1039216904
-0.0491511934 -0.1562662030 -0.1030607971
-0.1013963398 -0.1042062324 -0.1022782377
-0.0696051029 -0.0562425191 -0.1019720926
-0.0173599566 -0.1083024896 -0.1027546520
-0.1536414861 -0.0521462618 -0.1014956783
-0.0173599566 -0.1083024896 -0.1027546520
0.0348851897 -0.1603624602 -0.1035372114
-0.0491511934 -0.1562662030 -0.1030607971
-0.1013963398 -0.1042062324 -0.1022782377
-0.0173599566 -0.1083024896 -0.1027546520
-0.0491511934 -0.1562662030 -0.1030607971
0.0348851897 -0.1603624602 -0.1035372114
-0.0696051029 -0.0562425191 -0.1019720926
-0.1536414861 -0.0521462618 -0.1014956783
-0.0173599566 -0.1083024896 -0.1027546520
-0.0580431715 -0.0000560733 -0.1016303976
0.0043166275 -0.0562274101 -0.1024307320
0.0158785589 -0.0000409642 -0.1020890370
0.0782383579 -0.0562123011 -0.1028893713
-0.0696051029 -0.0562425191 -0.1019720926
-0.1319649020 -0.0000711823 -0.1011717583
0.0043166275 -0.0562274101 -0.1024307320
-0.0580431715 -0.0000560733 -0.1016303976
-0.0696051029 -0.0562425191 -0.1019720926
0.0043166275 -0.0562274101 -0.1024307320
-0.1319649020 -0.0000711823 -0.1011717583
0.0043166275 -0.0562274101 -0.1024307320
0.0782383579 -0.0562123011 -0.1028893713
0.0158785589 -0.0000409642 -0.1020890370
-0.3529433162 -0.0001177358 -0.1039347367
-0.3413581889 -0.0562991605 -0.1035558649
-0.4148865308 -0.0563148828 -0.1051666738
-0.2794149743 -0.0001020135 -0.1023239278
-0.4148865308 -0.0563148828 -0.1051666738
-0.4884148727 -0.0563306050 -0.1067774826
-0.4264716581 -0.0001334580 -0.1055455455
-0.3529433162 -0.0001177358 -0.1039347367
-0.4148865308 -0.0563148828 -0.1051666738
-0.4264716581 -0.0001334580 -0.1055455455
-0.4884148727 -0.0563306050 -0.1067774826
-0.3413581889 -0.0562991605 -0.1035558649
-0.2794149743 -0.0001020135 -0.1023239278
-0.4148865308 -0.0563148828 -0.1051666738
0.1920549974 -0.0064008883 -0.0279750721
-0.1240556721 0.0384819526 -0.0251308375
0.2006669455 0.0050368644 -0.0324699282
-0.1232929128 -0.0281371615 -0.0290513318
0.0321166883 -0.0413305607 0.0237589447
0.0221133102 -0.0180391329 0.0763848251
-0.1376787035 -0.0000227603 0.0466372471
-0.1275763299 0.0412966409 -0.0066016662
-0.1275763299 0.0412966409 -0.0066016662
-0.1375626386 -0.0180822810 0.0460519568
-0.1275592606 -0.0413737087 -0.0065739237
0.0221058528 0.0180790367 0.0763727046
0.0320996190 0.0413397890 0.0237312022
0.0243484627 0.0387428582 0.0645379364
3 173 160 270
3 310 209 135
3 208 209 45
3 226 225 159
3 209 208 134
3 66 89 45
3 226 160 173
3 270 160 159
3 116 121 171
3 121 110 69
3 171 69 70
3 173 121 116
3 66 121 173
3 121 66 110
3 312 262 207
3 262 267 207
3 207 267 172
3 117 108 101
3 117 38 108
3 108 38 235
3 113 38 117
3 57 235 38
3 138 113 148
3 188 57 113
3 207 138 220
3 172 188 138
3 116 226 173
3 130 170 285
3 130 285 11
3 130 11 120
3 130 120 40
3 130 40 119
3 130 119 12
3 130 12 284
3 130 284 170
3 285 170 136
3 11 285 214
3 120 11 126
3 40 120 318
3 119 40 122
3 12 119 316
3 284 12 131
3 170 284 212
3 110 66 34
3 310 34 66
3 244 34 310
3 181 70 69
3 194 69 110
3 181 194 34
3 181 283 74
3 244 135 283
3 184 33 226
3 310 135 244
3 70 74 33
3 158 47 175
3 158 52 47
3 191 52 158
3 101 108 240
3 108 280 240
3 124 280 108
3 215 240 280
3 245 280 124
3 222 151 31
3 151 233 307
3 233 2 238
3 2 236 279
3 236 4 239
3 4 228 306
3 228 153 32
3 153 222 192
3 192 31 232
3 31 307 232
3 307 238 232
3 238 279 232
3 279 239 232
3 239 306 232
3 306 32 232
3 32 192 232
3 139 215 245
3 221 245 256
3 175 139 221
3 158 221 177
3 237 3 186
3 3 230 227
3 227 287 231
3 287 150 231
3 150 286 231
3 286 234 231
3 234 185 231
3 185 1 231
3 1 186 231
3 186 227 231
3 129 125 180
3 0 237 1
3 229 0 185
3 129 180 315
3 129 315 179
3 129 179 132
3 129 132 182
3 129 182 211
3 129 211 183
3 129 183 125
3 180 125 128
3 315 180 317
3 179 315 123
3 132 179 314
3 182 132 127
3 211 182 210
3 183 211 137
3 125 183 213
3 212 131 128
3 136 212 213
3 214 136 137
3 126 214 210
3 318 126 127
3 122 318 314
3 316 122 123
3 131 316 317
3 230 3 2
3 3 237 236
3 237 0 4
3 0 229 228
3 229 149 153
3 149 223 222
3 223 152 151
3 152 230 233
3 230 152 287
3 152 223 150
3 223 149 286
3 149 229 234
3 202 197 200
3 92 68 289
3 68 95 294
3 95 105 298
3 105 97 296
3 97 104 297
3 104 96 295
3 96 67 288
3 67 92 293
3 293 289 294
3 20 27 29
3 20 25 92
3 27 20 67
3 29 27 96
3 28 29 104
3 247 253 248
3 202 195 247
3 197 202 254
3 200 197 249
3 198 200 252
3 199 198 250
3 196 199 251
3 201 196 248
3 195 201 253
3 30 28 97
3 26 30 105
3 21 26 95
3 25 21 68
3 161 167 162
3 65 60 63
3 65 58 161
3 60 65 168
3 63 60 163
3 61 63 166
3 62 61 164
3 59 62 165
3 64 59 162
3 58 64 167
3 281 241 191
3 106 102 281
3 78 23 22
3 91 24 25
3 23 78 92
3 22 23 25
3 77 22 24
3 91 292 290
3 292 293 291
3 293 92 78
3 92 293 292
3 77 290 291
3 176 175 47
3 51 47 52
3 101 261 117
3 87 86 53
3 264 311 208
3 263 265 266
3 145 246 81
3 10 264 305
3 10 99 79
3 263 264 10
3 305 246 304
3 246 145 304
3 9 79 86
3 268 265 263
3 269 87 85
3 269 266 265
3 267 85 71
3 118 172 267
3 89 81 45
3 57 188 39
3 188 172 118
3 240 46 101
3 14 159 174
3 269 268 86
3 269 267 262
3 266 262 312
3 174 321 49
3 176 321 174
3 13 14 49
3 308 79 99
3 308 309 49
3 13 111 14
3 88 81 111
3 13 218 111
3 53 86 79
3 308 48 50
3 270 81 89
3 52 85 87
3 53 50 51
3 52 191 241
3 241 71 85
3 108 235 106
3 235 57 106
3 270 111 81
3 270 159 14
3 81 246 45
3 246 305 208
3 106 124 108
3 106 256 124
3 169 282 16
3 55 187 15
3 309 90 80
3 145 80 304
3 98 102 39
3 304 80 90
3 10 90 99
3 145 88 80
3 118 71 109
3 39 118 109
3 109 71 241
3 260 114 302
3 193 37 301
3 281 102 98
3 99 90 309
3 13 80 218
3 80 88 218
3 98 109 241
3 243 7 312
3 142 322 143
3 175 322 142
3 107 261 101
3 157 156 224
3 75 323 76
3 156 323 75
3 74 72 44
3 142 324 156
3 143 324 142
3 225 303 159
3 84 271 261
3 84 83 243
3 7 243 205
3 243 83 75
3 204 206 76
3 313 8 6
3 73 72 272
3 203 272 17
3 5 17 208
3 139 175 142
3 101 46 107
3 107 46 43
3 43 115 83
3 156 115 142
3 156 75 83
3 73 325 154
3 76 325 73
3 140 326 174
3 141 326 140
3 154 44 72
3 140 303 44
3 174 159 303
3 283 272 72
3 271 243 220
3 208 17 134
3 205 327 206
3 75 327 205
3 133 205 206
3 312 328 313
3 7 328 312
3 133 8 7
3 139 115 43
3 215 139 43
3 240 215 43
3 16 282 6
3 16 6 8
3 242 16 8
3 242 8 133
3 242 133 206
3 56 242 206
3 56 206 204
3 169 56 204
3 141 37 302
3 143 141 302
3 143 302 114
3 224 143 114
3 157 224 114
3 157 114 260
3 155 157 260
3 155 260 193
3 44 303 225
3 33 44 225
3 134 17 272
3 135 134 272
3 271 220 148
3 261 271 148
3 55 169 204
3 6 282 15
3 55 204 203
3 187 55 203
3 187 203 5
3 15 187 5
3 6 15 5
3 155 193 259
3 301 37 141
3 154 155 259
3 154 259 178
3 140 154 178
3 140 178 301
3 140 301 141
3 122 123 205
3 205 123 122
3 133 205 122
3 122 205 133
3 236 237 156
3 156 237 236
3 224 156 236
3 236 156 224
3 330 331 300
3 329 331 330
3 330 332 217
3 300 332 330
3 333 334 329
3 90 334 333
3 333 335 217
3 329 335 333
3 337 338 336
3 217 338 337
3 337 339 90
3 336 339 337
3 340 341 300
3 217 341 340
3 340 342 336
3 300 342 340
3 344 345 343
3 274 345 344
3 344 346 90
3 343 346 344
3 347 348 300
3 274 348 347
3 347 349 343
3 300 349 347
3 351 352 300
3 350 352 351
3 351 353 274
3 300 353 351
3 354 355 350
3 90 355 354
3 354 356 274
3 350 356 354
3 359 360 358
3 319 360 359
3 359 361 357
3 358 361 359
3 362 363 358
3 275 363 362
3 362 364 319
3 358 364 362
3 357 367 366
3 365 367 357
3 366 368 94
3 365 368 366
3 369 370 365
3 275 370 369
3 365 371 369
3 357 371 365
3 373 375 372
3 374 375 373
3 374 376 275
3 373 376 374
3 377 378 373
3 94 378 377
3 372 379 373
3 377 379 372
3 381 382 380
3 319 382 381
3 381 383 275
3 380 383 381
3 384 385 380
3 372 385 384
3 384 386 319
3 380 386 384
3 389 390 388
3 257 390 389
3 389 391 387
3 388 391 389
3 392 393 388
3 103 393 392
3 392 394 257
3 388 394 392
3 387 397 396
3 395 397 387
3 396 398 94
3 395 398 396
3 399 400 395
3 103 400 399
3 395 401 399
3 387 401 395
3 403 405 402
3 404 405 403
3 404 406 103
3 403 406 404
3 407 408 403
3 94 408 407
3 402 409 403
3 407 409 402
3 411 412 410
3 257 412 411
3 411 413 103
3 410 413 411
3 414 415 410
3 402 415 414
3 414 416 257
3 410 416 414
3 418 420 417
3 419 420 418
3 419 421 276
3 418 421 419
3 422 423 418
3 94 423 422
3 417 424 418
3 422 424 417
3 426 427 425
3 257 427 426
3 426 428 276
3 425 428 426
3 429 430 425
3 417 430 429
3 429 431 257
3 425 431 429
3 434 435 433
3 257 435 434
3 434 436 432
3 433 436 434
3 437 438 433
3 276 438 437
3 437 439 257
3 433 439 437
3 432 442 441
3 440 442 432
3 441 443 94
3 440 443 441
3 444 445 440
3 276 445 444
3 440 446 444
3 432 446 440
3 449 450 448
3 319 450 449
3 449 451 447
3 448 451 449
3 452 453 448
3 219 453 452
3 452 454 319
3 448 454 452
3 447 457 456
3 455 457 447
3 456 458 94
3 455 458 456
3 459 460 455
3 219 460 459
3 455 461 459
3 447 461 455
3 463 465 462
3 464 465 463
3 464 466 219
3 463 466 464
3 467 468 463
3 94 468 467
3 462 469 463
3 467 469 462
3 471 472 470
3 319 472 471
3 471 473 219
3 470 473 471
3 474 475 470
3 462 475 474
3 474 476 319
3 470 476 474
3 478 479 477
3 36 479 478
3 478 480 90
3 477 480 478
3 481 482 19
3 36 482 481
3 481 483 477
3 19 483 481
3 485 486 19
3 484 486 485
3 485 487 36
3 19 487 485
3 488 489 484
3 90 489 488
3 488 490 36
3 484 490 488
3 492 493 19
3 491 493 492
3 492 494 147
3 19 494 492
3 495 496 491
3 90 496 495
3 495 497 147
3 491 497 495
3 499 500 498
3 147 500 499
3 499 501 90
3 498 501 499
3 502 503 19
3 147 503 502
3 502 504 498
3 19 504 502
3 506 507 505
3 147 507 506
3 506 508 90
3 505 508 506
3 509 510 82
3 147 510 509
3 509 511 505
3 82 511 509
3 513 514 82
3 512 514 513
3 513 515 147
3 82 515 513
3 516 517 512
3 90 517 516
3 516 518 147
3 512 518 516
3 520 521 93
3 519 521 520
3 520 522 146
3 93 522 520
3 523 524 519
3 90 524 523
3 523 525 146
3 519 525 523
3 527 528 526
3 146 528 527
3 527 529 90
3 526 529 527
3 530 531 93
3 146 531 530
3 530 532 526
3 93 532 530
3 534 535 533
3 146 535 534
3 534 536 90
3 533 536 534
3 537 538 18
3 146 538 537
3 537 539 533
3 18 539 537
3 541 542 18
3 540 542 541
3 541 543 146
3 18 543 541
3 544 545 540
3 90 545 544
3 544 546 146
3 540 546 544
3 548 549 18
3 547 549 548
3 548 550 35
3 18 550 548
3 551 552 547
3 90 552 551
3 551 553 35
3 547 553 551
3 555 556 554
3 35 556 555
3 555 557 90
3 554 557 555
3 558 559 18
3 35 559 558
3 558 560 554
3 18 560 558
3 562 563 561
3 35 563 562
3 562 564 90
3 561 564 562
3 565 566 255
3 35 566 565
3 565 567 561
3 255 567 565
3 569 570 255
3 568 570 569
3 569 571 35
3 255 571 569
3 572 573 568
3 90 573 572
3 572 574 35
3 568 574 572
3 576 577 255
3 575 577 576
3 576 578 36
3 255 578 576
3 579 580 575
3 90 580 579
3 579 581 36
3 575 581 579
3 583 584 582
3 36 584 583
3 583 585 90
3 582 585 583
3 586 587 255
3 36 587 586
3 586 588 582
3 255 588 586
3 590 592 589
3 591 592 590
3 591 593 100
3 590 593 591
3 594 595 590
3 94 595 594
3 589 596 590
3 594 596 589
3 598 599 597
3 190 599 598
3 598 600 100
3 597 600 598
3 601 602 597
3 589 602 601
3 601 603 190
3 597 603 601
3 606 607 605
3 190 607 606
3 606 608 604
3 605 608 606
3 609 610 605
3 100 610 609
3 609 611 190
3 605 611 609
3 604 614 613
3 612 614 604
3 613 615 94
3 612 615 613
3 616 617 612
3 100 617 616
3 612 618 616
3 604 618 612
3 620 622 619
3 621 622 620
3 621 623 190
3 620 623 621
3 624 625 620
3 94 625 624
3 619 626 620
3 624 626 619
3 628 629 627
3 41 629 628
3 628 630 190
3 627 630 628
3 631 632 627
3 619 632 631
3 631 633 41
3 627 633 631
3 636 637 635
3 41 637 636
3 636 638 634
3 635 638 636
3 639 640 635
3 190 640 639
3 639 641 41
3 635 641 639
3 634 644 643
3 642 644 634
3 643 645 94
3 642 645 643
3 646 647 642
3 190 647 646
3 642 648 646
3 634 648 642
3 651 652 650
3 277 652 651
3 651 653 649
3 650 653 651
3 654 655 650
3 144 655 654
3 654 656 277
3 650 656 654
3 649 659 658
3 657 659 649
3 658 660 94
3 657 660 658
3 661 662 657
3 144 662 661
3 657 663 661
3 649 663 657
3 665 667 664
3 666 667 665
3 666 668 144
3 665 668 666
3 669 670 665
3 94 670 669
3 664 671 665
3 669 671 664
3 673 674 672
3 277 674 673
3 673 675 144
3 672 675 673
3 676 677 672
3 664 677 676
3 676 678 277
3 672 678 676
3 680 682 679
3 681 682 680
3 681 683 144
3 680 683 681
3 684 685 680
3 94 685 684
3 679 686 680
3 684 686 679
3 688 689 687
3 278 689 688
3 688 690 144
3 687 690 688
3 691 692 687
3 679 692 691
3 691 693 278
3 687 693 691
3 696 697 695
3 278 697 696
3 696 698 694
3 695 698 696
3 699 700 695
3 144 700 699
3 699 701 278
3 695 701 699
3 694 704 703
3 702 704 694
3 703 705 94
3 702 705 703
3 706 707 702
3 144 707 706
3 702 708 706
3 694 708 702
3 711 712 710
3 278 712 711
3 711 713 709
3 710 713 711
3 714 715 710
3 42 715 714
3 714 716 278
3 710 716 714
3 709 719 718
3 717 719 709
3 718 720 94
3 717 720 718
3 721 722 717
3 42 722 721
3 717 723 721
3 709 723 717
3 725 727 724
3 726 727 725
3 726 728 42
3 725 728 726
3 729 730 725
3 94 730 729
3 724 731 725
3 729 731 724
3 733 734 732
3 278 734 733
3 733 735 42
3 732 735 733
3 736 737 732
3 724 737 736
3 736 738 278
3 732 738 736
3 740 742 739
3 741 742 740
3 741 743 42
3 740 743 741
3 744 745 740
3 94 745 744
3 739 746 740
3 744 746 739
3 748 749 747
3 189 749 748
3 748 750 42
3 747 750 748
3 751 752 747
3 739 752 751
3 751 753 189
3 747 753 751
3 756 757 755
3 189 757 756
3 756 758 754
3 755 758 756
3 759 760 755
3 42 760 759
3 759 761 189
3 755 761 759
3 754 764 763
3 762 764 754
3 763 765 94
3 762 765 763
3 766 767 762
3 42 767 766
3 762 768 766
3 754 768 762
3 771 772 770
3 189 772 771
3 771 773 769
3 770 773 771
3 774 775 770
3 103 775 774
3 774 776 189
3 770 776 774
3 769 779 778
3 777 779 769
3 778 780 94
3 777 780 778
3 781 782 777
3 103 782 781
3 777 783 781
3 769 783 777
3 785 787 784
3 786 787 785
3 786 788 103
3 785 788 786
3 789 790 785
3 94 790 789
3 784 791 785
3 789 791 784
3 793 794 792
3 189 794 793
3 793 795 103
3 792 795 793
3 796 797 792
3 784 797 796
3 796 798 189
3 792 798 796
3 801 802 800
3 277 802 801
3 801 803 799
3 800 803 801
3 804 805 800
3 41 805 804
3 804 806 277
3 800 806 804
3 799 809 808
3 807 809 799
3 808 810 94
3 807 810 808
3 811 812 807
3 41 812 811
3 807 813 811
3 799 813 807
3 815 817 814
3 816 817 815
3 816 818 41
3 815 818 816
3 819 820 815
3 94 820 819
3 814 821 815
3 819 821 814
3 823 824 822
3 277 824 823
3 823 825 41
3 822 825 823
3 826 827 822
3 814 827 826
3 826 828 277
3 822 828 826
3 830 832 829
3 831 832 830
3 831 833 219
3 830 833 831
3 834 835 830
3 94 835 834
3 829 836 830
3 834 836 829
3 838 839 837
3 320 839 838
3 838 840 219
3 837 840 838
3 841 842 837
3 829 842 841
3 841 843 320
3 837 843 841
3 846 847 845
3 320 847 846
3 846 848 844
3 845 848 846
3 849 850 845
3 219 850 849
3 849 851 320
3 845 851 849
3 844 854 853
3 852 854 844
3 853 855 94
3 852 855 853
3 856 857 852
3 219 857 856
3 852 858 856
3 844 858 852
3 861 862 860
3 320 862 861
3 861 863 859
3 860 863 861
3 864 865 860
3 276 865 864
3 864 866 320
3 860 866 864
3 859 869 868
3 867 869 859
3 868 870 94
3 867 870 868
3 871 872 867
3 276 872 871
3 867 873 871
3 859 873 867
3 875 877 874
3 876 877 875
3 876 878 276
3 875 878 876
3 879 880 875
3 94 880 879
3 874 881 875
3 879 881 874
3 883 884 882
3 320 884 883
3 883 885 276
3 882 885 883
3 886 887 882
3 874 887 886
3 886 888 320
3 882 888 886
3 890 892 889
3 891 892 890
3 891 893 258
3 890 893 891
3 894 895 890
3 94 895 894
3 889 896 890
3 894 896 889
3 898 899 897
3 275 899 898
3 898 900 258
3 897 900 898
3 901 902 897
3 889 902 901
3 901 903 275
3 897 903 901
3 906 907 905
3 275 907 906
3 906 908 904
3 905 908 906
3 909 910 905
3 258 910 909
3 909 911 275
3 905 911 909
3 904 914 913
3 912 914 904
3 913 915 94
3 912 915 913
3 916 917 912
3 258 917 916
3 912 918 916
3 904 918 912
3 920 922 919
3 921 922 920
3 921 923 100
3 920 923 921
3 924 925 920
3 94 925 924
3 919 926 920
3 924 926 919
3 928 929 927
3 258 929 928
3 928 930 100
3 927 930 928
3 931 932 927
3 919 932 931
3 931 933 258
3 927 933 931
3 936 937 935
3 258 937 936
3 936 938 934
3 935 938 936
3 939 940 935
3 100 940 939
3 939 941 258
3 935 941 939
3 934 944 943
3 942 944 934
3 943 945 94
3 942 945 943
3 946 947 942
3 100 947 946
3 942 948 946
3 934 948 942
3 950 951 112
3 949 951 950
3 950 952 274
3 112 952 950
3 953 954 949
3 90 954 953
3 953 955 274
3 949 955 953
3 957 958 956
3 274 958 957
3 957 959 90
3 956 959 957
3 960 961 112
3 274 961 960
3 960 962 956
3 112 962 960
3 964 965 963
3 273 965 964
3 964 966 90
3 963 966 964
3 967 968 112
3 273 968 967
3 967 969 963
3 112 969 967
3 971 972 112
3 970 972 971
3 971 973 273
3 112 973 971
3 974 975 970
3 90 975 974
3 974 976 273
3 970 976 974
3 978 979 299
3 977 979 978
3 978 980 273
3 299 980 978
3 981 982 977
3 90 982 981
3 981 983 273
3 977 983 981
3 985 986 984
3 273 986 985
3 985 987 90
3 984 987 985
3 988 989 299
3 273 989 988
3 988 990 984
3 299 990 988
3 992 993 991
3 216 993 992
3 992 994 90
3 991 994 992
3 995 996 299
3 216 996 995
3 995 997 991
3 299 997 995
3 999 1000 299
3 998 1000 999
3 999 1001 216
3 299 1001 999
3 1002 1003 998
3 90 1003 1002
3 1002 1004 216
3 998 1004 1002
3 1006 1007 93
3 1005 1007 1006
3 1006 1008 216
3 93 1008 1006
3 1009 1010 1005
3 90 1010 1009
3 1009 1011 216
3 1005 1011 1009
3 1013 1014 1012
3 216 1014 1013
3 1013 1015 90
3 1012 1015 1013
3 1016 1017 93
3 216 1017 1016
3 1016 1018 1012
3 93 1018 1016
3 1020 1021 1019
3 217 1021 1020
3 1020 1022 90
3 1019 1022 1020
3 1023 1024 82
3 217 1024 1023
3 1023 1025 1019
3 82 1025 1023
3 1027 1028 82
3 1026 1028 1027
3 1027 1029 217
3 82 1029 1027
3 1030 1031 1026
3 90 1031 1030
3 1030 1032 217
3 1026 1032 1030
3 173 270 89
3 173 89 66
3 226 159 160
3 209 134 135
3 66 45 209
3 66 209 310
3 116 171 184
3 121 69 171
3 171 70 184
3 113 117 148
3 57 38 113
3 138 148 220
3 188 113 138
3 207 220 312
3 172 138 207
3 285 136 214
3 11 214 126
3 120 126 318
3 40 318 122
3 119 122 316
3 12 316 131
3 284 131 212
3 170 212 136
3 181 69 194
3 194 110 34
3 181 34 244
3 181 74 70
3 244 283 181
3 184 226 116
3 70 33 184
3 215 280 245
3 245 124 256
3 222 31 192
3 151 307 31
3 233 238 307
3 2 279 238
3 236 239 279
3 4 306 239
3 228 32 306
3 153 192 32
3 139 245 221
3 221 256 177
3 175 221 158
3 158 177 191
3 237 186 1
3 3 227 186
3 0 1 185
3 229 185 234
3 180 128 317
3 315 317 123
3 179 123 314
3 132 314 127
3 182 127 210
3 211 210 137
3 183 137 213
3 125 213 128
3 212 128 213
3 136 213 137
3 214 137 210
3 126 210 127
3 318 127 314
3 122 314 123
3 316 123 317
3 131 317 128
3 230 2 233
3 3 236 2
3 237 4 236
3 0 228 4
3 229 153 228
3 149 222 153
3 223 151 222
3 152 233 151
3 230 287 227
3 152 150 287
3 223 286 150
3 149 234 286
3 202 200 198
3 202 198 199
3 202 199 196
3 202 196 201
3 202 201 195
3 92 289 293
3 68 294 289
3 95 298 294
3 105 296 298
3 97 297 296
3 104 295 297
3 96 288 295
3 67 293 288
3 293 294 298
3 293 298 296
3 293 296 297
3 293 297 295
3 293 295 288
3 20 29 28
3 20 28 30
3 20 30 26
3 20 26 21
3 20 21 25
3 20 92 67
3 27 67 96
3 29 96 104
3 28 104 97
3 247 248 251
3 247 251 250
3 247 250 252
3 247 252 249
3 247 249 254
3 202 247 254
3 197 254 249
3 200 249 252
3 198 252 250
3 199 250 251
3 196 251 248
3 201 248 253
3 195 253 247
3 30 97 105
3 26 105 95
3 21 95 68
3 25 68 92
3 161 162 165
3 161 165 164
3 161 164 166
3 161 166 163
3 161 163 168
3 65 63 61
3 65 61 62
3 65 62 59
3 65 59 64
3 65 64 58
3 65 161 168
3 60 168 163
3 63 163 166
3 61 166 164
3 62 164 165
3 59 165 162
3 64 162 167
3 58 167 161
3 281 191 177
3 281 1033 106
3 177 1033 281
3 106 177 256
3 78 22 77
3 91 25 92
3 23 92 25
3 22 25 24
3 77 24 91
3 91 290 77
3 292 291 290
3 293 78 291
3 92 292 91
3 77 291 78
3 176 47 51
3 51 52 54
3 87 53 54
3 264 208 305
3 263 266 313
3 263 1034 311
3 313 1034 263
3 263 311 264
3 145 81 88
3 10 305 304
3 10 79 9
3 263 10 9
3 9 86 268
3 268 263 9
3 269 85 267
3 269 265 268
3 267 71 118
3 39 1035 57
3 102 1035 39
3 57 102 106
3 188 118 39
3 14 174 49
3 269 86 87
3 269 262 266
3 266 312 313
3 51 1036 176
3 49 1036 51
3 49 51 50
3 49 50 48
3 13 49 309
3 308 99 309
3 308 49 48
3 88 111 218
3 53 79 308
3 308 50 53
3 52 87 54
3 53 51 54
3 241 85 52
3 270 14 111
3 246 208 45
3 169 16 242
3 169 242 56
3 55 15 282
3 55 282 169
3 309 80 13
3 304 90 10
3 39 109 98
3 260 302 37
3 260 37 193
3 193 301 178
3 193 178 259
3 98 241 281
3 243 312 220
3 176 1037 175
3 143 1037 176
3 157 1038 156
3 76 1038 157
3 74 44 33
3 156 143 224
3 84 261 107
3 84 243 271
3 243 75 205
3 204 1039 73
3 76 1039 204
3 204 73 203
3 6 1040 313
3 5 1040 6
3 311 1041 5
3 313 1041 311
3 73 272 203
3 203 17 5
3 5 208 311
3 139 142 115
3 107 43 84
3 43 83 84
3 156 83 115
3 157 1042 76
3 154 1042 157
3 154 157 155
3 174 141 143
3 176 1043 143
3 174 1043 176
3 154 72 73
3 140 44 154
3 174 303 140
3 283 72 74
3 76 1044 75
3 206 1044 76
3 8 1045 7
3 313 1045 8
3 7 1046 133
3 205 1046 7
3 240 43 46
3 33 225 226
3 135 272 283
3 261 148 117