OFF

264 524 0
-0.054295 0.201628 -0.096887
-0.074634 0.037995 -0.040893
0.156464 0.207228 -0.066492
0.490705 0.177735 -0.083309
0.326829 -0.169931 0.071074
0.046059 0.149872 0.199019
0.112317 0.172874 0.140544
0.145875 -0.122872 0.120843
0.437225 0.125519 0.045143
0.363344 0.132040 0.056115
0.487148 -0.074378 0.009708
0.409362 0.141922 -0.103841
0.075756 -0.097219 0.020864
0.390367 -0.052022 -0.103811
0.202422 -0.121073 0.005934
0.499807 -0.039346 -0.027431
-0.084254 -0.006294 0.002481
-0.065315 0.134362 -0.116922
0.344958 -0.022472 -0.107799
0.211416 0.021456 -0.115860
-0.037904 0.004321 -0.021829
0.273694 -0.100512 -0.044496
0.288295 0.070549 -0.123249
0.243031 -0.011327 -0.107522
0.302781 0.005550 -0.112812
0.012934 -0.058189 0.009672
0.263837 0.032043 -0.118848
0.342255 0.073393 -0.122320
0.288523 -0.035666 -0.097671
0.152884 -0.062578 -0.059072
0.335585 0.125530 -0.127823
0.198330 0.132263 -0.135489
0.130533 0.038954 -0.105536
0.116174 -0.020033 -0.075400
-0.001372 0.028043 -0.049027
0.229693 -0.073291 -0.066416
0.440134 -0.019088 -0.124458
0.193676 0.062681 -0.122686
0.416708 0.038618 -0.121791
0.044693 -0.027606 -0.031906
0.031816 -0.093887 0.036492
0.145500 0.112187 -0.133429
0.332851 -0.096914 -0.065050
0.355983 0.020273 -0.121916
-0.035772 0.102173 -0.094380
0.258793 0.106212 -0.128580
0.179495 -0.092602 -0.028149
0.069365 0.035032 -0.077132
-0.108668 -0.034997 0.072111
-0.037707 -0.053075 0.024432
0.102422 -0.064774 -0.043019
0.176734 -0.030357 -0.106048
0.146384 0.085685 -0.143411
0.461489 0.065174 -0.091188
0.440090 0.071607 -0.076009
0.411989 0.093693 -0.116465
0.457714 0.085232 -0.130580
-0.064493 -0.040089 0.063302
-0.057029 0.195340 0.075370
-0.110773 0.202665 0.044481
-0.123287 0.172337 0.133844
0.178575 0.195877 0.082069
0.481926 0.164520 -0.132039
0.499743 0.006713 -0.028860
0.487019 0.017741 0.006849
-0.292632 0.194803 0.068670
0.487084 -0.028318 0.008279
0.006784 0.198434 -0.108868
0.363410 0.084507 0.057590
0.289728 -0.051574 0.072988
-0.334789 0.194610 0.064366
0.095995 -0.006821 0.160562
-0.184020 0.114147 0.180313
-0.216750 0.009646 0.180726
0.495288 0.046165 -0.054655
0.326536 0.040233 0.064551
0.062769 0.051255 0.187639
0.252854 -0.095847 0.079949
0.480786 -0.068864 0.027563
0.490834 0.085617 -0.080450
-0.216847 0.079224 0.178566
-0.228574 0.202396 0.041131
0.289662 -0.004040 0.071513
0.129027 0.074258 0.129165
0.036117 0.203549 -0.085927
0.215980 -0.140120 0.086911
-0.142802 0.198868 0.058250
-0.090158 0.183838 0.104607
0.486380 0.125069 -0.106245
0.095801 0.132334 0.156242
-0.195428 -0.157354 0.134434
-0.216944 0.148802 0.176407
0.326469 0.087767 0.063076
0.252788 -0.048313 0.078474
0.123907 0.204428 0.037999
0.289595 0.043494 0.070037
0.215913 -0.092587 0.085436
-0.355801 0.146980 0.063689
0.474212 0.088477 0.040705
0.326403 0.135301 0.061601
-0.250296 0.189186 0.084964
0.065449 0.208664 -0.062987
0.252721 -0.000779 0.076999
-0.254655 0.076735 0.125489
0.452022 0.177473 -0.097088
0.437338 0.044204 0.047666
-0.023152 0.196675 -0.117344
0.289529 0.091028 0.068562
0.011262 0.211618 0.005435
0.486444 0.079009 -0.104815
0.215847 -0.045053 0.083960
-0.031257 0.183973 0.106282
-0.136527 -0.157220 0.136109
0.400464 -0.000069 0.054628
0.252655 0.046754 0.075523
0.001872 0.195474 0.077045
0.178973 -0.089326 0.090922
0.495417 -0.045953 -0.051796
0.289463 0.138561 0.067087
0.363590 -0.044343 0.061589
0.215781 0.002481 0.082485
0.096592 0.203710 -0.083443
-0.282319 0.209721 0.010242
-0.101383 0.218809 -0.027129
-0.254788 0.171803 0.122538
0.252588 0.094288 0.074048
0.326716 -0.088616 0.068551
-0.038614 0.161104 0.166431
-0.196546 0.206193 0.027361
0.178907 -0.041792 0.089446
0.145808 -0.075338 0.119368
0.112710 -0.108883 0.149289
0.079612 -0.142429 0.179211
-0.005485 0.172606 0.137194
0.289396 0.186095 0.065611
0.215714 0.050015 0.081009
0.289842 -0.132889 0.075512
-0.157705 0.222404 -0.043411
0.027644 0.184107 0.107957
-0.025000 0.199136 0.061600
0.252522 0.141822 0.072573
0.060773 0.195608 0.078719
0.145742 -0.027804 0.117892
0.178840 0.005742 0.087971
-0.292499 0.099735 0.071621
0.112644 -0.061349 0.147814
0.079545 -0.094895 0.177735
0.046447 -0.128440 0.207657
0.215648 0.097549 0.079534
-0.165623 0.177954 0.117551
0.046350 -0.058862 0.205497
-0.104365 0.160837 0.160778
0.252456 0.189356 0.071097
0.013861 -0.142696 0.173558
0.181884 0.205788 0.026492
0.178774 0.053275 0.086495
0.145675 0.019730 0.116417
0.020287 0.161239 0.168106
0.112577 -0.013816 0.146339
-0.376946 0.194418 0.060062
0.079479 -0.047361 0.176260
-0.235539 -0.073921 0.156742
0.053416 0.172740 0.138869
0.482039 0.083205 -0.129515
0.046253 0.010716 0.203338
0.013523 -0.093785 0.203751
0.215581 0.145082 0.078059
-0.235588 -0.039132 0.155663
0.086545 0.184241 0.109632
0.474326 0.007162 0.043229
0.119674 0.195743 0.080394
0.178707 0.100809 0.085020
0.145609 0.067264 0.114942
0.013426 -0.024207 0.201591
-0.019304 -0.128708 0.202004
0.046156 0.080294 0.201178
0.112511 0.033718 0.144863
0.219652 0.205005 0.007111
-0.250290 0.213518 -0.003527
0.437452 -0.037111 0.050190
0.069239 0.212978 -0.006072
0.079285 0.091795 0.171941
0.215515 0.192616 0.076583
-0.235734 0.065235 0.152423
-0.019401 -0.059130 0.199844
-0.170116 0.160570 0.155125
0.013329 0.045371 0.199432
-0.164517 0.209989 0.013592
-0.051890 -0.142963 0.167905
0.400578 -0.081385 0.057152
0.178641 0.148343 0.083545
-0.078744 0.206461 0.030711
-0.019498 0.010448 0.197685
-0.052227 -0.094052 0.198098
0.013232 0.114949 0.197272
0.007029 0.202933 0.047831
0.005577 0.205146 -0.079937
-0.235800 0.112769 0.150948
0.363703 -0.125658 0.064113
0.257420 0.204222 -0.012269
-0.043406 0.220169 -0.038636
-0.085054 -0.128975 0.196351
-0.052325 -0.024474 0.195938
-0.019595 0.080026 0.195525
-0.233731 0.194937 0.070345
-0.080950 0.166721 0.150138
-0.313644 0.147173 0.067993
-0.052422 0.045104 0.193779
-0.085151 -0.059397 0.194191
0.125322 0.212181 -0.046036
-0.019692 0.149604 0.193366
-0.047821 0.178222 0.120901
-0.244934 -0.115705 0.144751
-0.273511 0.040701 0.100030
-0.106000 0.212016 -0.070149
-0.105616 0.210124 0.015267
-0.085249 0.010181 0.192032
-0.117978 -0.094320 0.192445
-0.052519 0.114682 0.191619
0.495160 0.138284 -0.057514
0.488703 0.036254 -0.091203
0.216342 0.195094 0.062689
0.065930 0.203067 0.049506
-0.344474 0.199569 0.037193
-0.150805 -0.129242 0.190698
-0.085346 0.079759 0.189872
-0.118075 -0.024742 0.190285
-0.260603 0.198599 0.054900
-0.207959 0.183570 0.101257
-0.245128 0.023451 0.140431
-0.218261 0.217314 -0.017297
-0.118173 0.044836 0.188126
-0.150902 -0.059664 0.188538
-0.085443 0.149337 0.187713
0.499678 0.052773 -0.030290
0.482153 0.001889 -0.126992
0.254110 0.194311 0.043309
-0.273644 0.135769 0.097079
0.063319 -0.149557 0.162161
-0.046715 0.210258 0.016942
-0.183729 -0.094587 0.186792
-0.118270 0.114414 0.185966
-0.150999 0.009914 0.186379
0.474439 -0.074154 0.045753
0.400350 0.081246 0.052104
0.127216 0.214339 -0.017579
-0.216556 -0.129510 0.185045
0.437565 -0.118427 0.052714
-0.151096 0.079492 0.184219
-0.183826 -0.025009 0.184632
0.363476 0.036973 0.059065
-0.419103 0.194225 0.055758
0.291878 0.193529 0.023928
-0.212452 0.166186 0.138832
0.070894 0.217934 -0.033861
0.003722 0.155488 0.182725
0.400284 0.128780 0.050629
0.400691 -0.162700 0.059676
0.326602 -0.007300 0.066027
-0.216653 -0.059932 0.182885
-0.159360 0.217448 -0.015622
-0.115930 0.195206 0.073695
-0.183923 0.044569 0.182473
-0.151194 0.149070 0.182060
3 97 122 251
3 97 144 122
3 122 223 251
3 251 159 97
3 144 213 122
3 213 212 122
3 213 161 212
3 213 167 161
3 97 206 144
3 223 159 251
3 212 178 122
3 212 230 178
3 212 137 230
3 212 48 137
3 212 90 48
3 90 112 48
3 112 57 48
3 112 238 57
3 238 7 57
3 238 132 7
3 48 16 137
3 16 1 137
3 1 17 137
3 17 0 137
3 17 106 0
3 7 40 57
3 40 49 57
3 7 85 40
3 85 14 40
3 85 4 14
3 212 246 90
3 1 44 17
3 7 116 85
3 213 229 167
3 213 103 229
3 103 183 229
3 122 65 223
3 229 73 167
3 167 259 161
3 17 67 106
3 17 84 67
3 17 101 84
3 17 121 101
3 17 2 121
3 17 31 2
3 31 199 2
3 31 30 199
3 30 11 199
3 11 104 199
3 104 3 199
3 3 219 199
3 17 41 31
3 219 8 199
3 219 98 8
3 17 52 41
3 17 44 52
3 44 47 52
3 47 32 52
3 199 177 2
3 11 62 104
3 30 55 11
3 219 234 98
3 219 79 234
3 79 74 234
3 44 34 47
3 2 209 121
3 30 27 55
3 137 260 230
3 234 64 98
3 74 63 234
3 67 0 106
3 4 257 14
3 257 247 14
3 247 243 14
3 243 10 14
3 10 42 14
3 10 117 42
3 117 13 42
3 117 36 13
3 117 235 36
3 14 12 40
3 8 252 199
3 42 21 14
3 8 134 252
3 10 15 117
3 112 188 238
3 188 153 238
3 8 256 134
3 256 9 134
3 243 78 10
3 112 201 188
3 112 224 201
3 31 45 30
3 9 99 134
3 85 136 4
3 132 131 7
3 177 209 2
3 177 245 209
3 177 154 245
3 14 46 12
3 46 50 12
3 134 152 252
3 152 236 252
3 117 220 235
3 117 63 220
3 63 74 220
3 112 246 224
3 238 147 132
3 99 118 134
3 188 174 153
3 74 79 220
3 79 109 220
3 85 77 136
3 243 169 78
3 245 254 209
3 245 180 254
3 154 94 245
3 132 146 131
3 254 101 209
3 190 6 61
3 190 171 6
3 171 172 6
3 172 83 6
3 83 89 6
3 89 5 6
3 6 170 61
3 5 162 6
3 83 181 89
3 172 176 83
3 81 128 204
3 128 228 204
3 128 86 228
3 86 149 228
3 128 187 86
3 86 261 149
3 261 60 149
3 86 59 261
3 15 63 117
3 43 18 13
3 12 39 25
3 235 53 38
3 22 24 27
3 32 47 33
3 48 57 16
3 35 14 21
3 27 43 38
3 26 37 19
3 26 22 45
3 19 32 51
3 33 39 50
3 27 24 43
3 28 21 42
3 31 41 37
3 46 35 29
3 39 33 47
3 26 45 37
3 50 29 33
3 25 49 40
3 20 34 1
3 44 1 34
3 23 24 26
3 22 27 30
3 35 46 14
3 56 53 163
3 35 21 28
3 51 33 29
3 18 43 24
3 51 32 33
3 51 23 19
3 19 37 32
3 57 49 16
3 55 54 56
3 13 36 43
3 38 43 36
3 23 26 19
3 20 39 34
3 55 38 54
3 37 41 52
3 22 26 24
3 56 62 11
3 28 18 24
3 23 35 28
3 51 29 35
3 30 45 22
3 36 235 38
3 28 42 18
3 37 45 31
3 39 47 34
3 27 38 55
3 54 53 56
3 79 88 62
3 50 39 12
3 20 49 25
3 56 163 62
3 46 29 50
3 20 1 16
3 20 16 49
3 25 39 20
3 53 54 38
3 56 11 55
3 53 235 163
3 51 35 23
3 23 28 24
3 25 40 12
3 52 32 37
3 18 42 13
3 214 137 0
3 61 152 182
3 160 71 176
3 58 139 195
3 10 64 66
3 236 61 221
3 84 101 67
3 127 255 5
3 5 133 157
3 133 58 111
3 65 228 100
3 70 159 65
3 227 81 65
3 151 60 233
3 191 59 239
3 164 181 76
3 197 91 103
3 123 260 200
3 206 65 144
3 206 97 65
3 70 97 159
3 70 65 97
3 212 161 246
3 229 183 73
3 80 183 91
3 80 73 183
3 167 73 259
3 161 259 246
3 183 103 91
3 237 124 103
3 237 65 124
3 197 124 91
3 197 103 124
3 213 144 103
3 237 144 65
3 237 103 144
3 193 208 184
3 193 201 208
3 202 208 216
3 202 184 208
3 165 174 184
3 165 147 174
3 193 174 201
3 193 184 174
3 217 224 232
3 217 201 224
3 240 224 246
3 240 232 224
3 226 208 232
3 226 216 208
3 217 208 201
3 217 232 208
3 186 192 203
3 186 164 192
3 207 192 216
3 207 203 192
3 194 175 203
3 194 5 175
3 186 175 164
3 186 203 175
3 173 150 184
3 173 164 150
3 165 150 147
3 165 184 150
3 202 192 184
3 202 216 192
3 173 192 164
3 173 184 192
3 241 225 248
3 241 233 225
3 231 225 216
3 231 248 225
3 72 263 248
3 72 91 263
3 241 263 233
3 241 248 263
3 218 210 203
3 218 233 210
3 194 210 5
3 194 203 210
3 207 225 203
3 207 216 225
3 218 225 233
3 218 203 225
3 249 242 232
3 249 73 242
3 226 242 216
3 226 232 242
3 240 259 232
3 240 246 259
3 249 259 73
3 249 232 259
3 262 80 248
3 262 73 80
3 72 80 91
3 72 248 80
3 231 242 248
3 231 216 242
3 262 242 73
3 262 248 242
3 78 169 64
3 98 64 169
3 66 63 10
3 66 64 63
3 78 64 10
3 234 63 64
3 15 10 63
3 109 79 62
3 88 219 62
3 88 79 219
3 3 62 219
3 220 109 235
3 163 109 62
3 163 235 109
3 198 126 189
3 198 4 126
3 119 126 258
3 119 189 126
3 247 257 189
3 198 257 4
3 198 189 257
3 69 126 77
3 69 258 126
3 136 126 4
3 136 77 126
3 105 113 244
3 105 169 113
3 250 113 258
3 250 244 113
3 8 98 244
3 105 98 169
3 105 244 98
3 179 243 189
3 179 169 243
3 247 189 243
3 119 113 189
3 119 258 113
3 179 113 169
3 179 189 113
3 107 118 92
3 107 125 118
3 99 92 118
3 75 95 92
3 75 258 95
3 107 95 125
3 107 92 95
3 140 166 152
3 140 125 166
3 182 166 61
3 182 152 166
3 134 118 152
3 140 118 125
3 140 152 118
3 256 244 9
3 256 8 244
3 68 250 92
3 68 244 250
3 75 250 258
3 75 92 250
3 99 9 92
3 68 9 244
3 68 92 9
3 93 110 102
3 93 77 110
3 120 110 143
3 120 102 110
3 82 69 102
3 82 258 69
3 93 69 77
3 93 102 69
3 96 85 116
3 96 77 85
3 129 110 116
3 129 143 110
3 96 110 77
3 96 116 110
3 148 135 171
3 148 125 135
3 155 135 143
3 155 171 135
3 190 166 171
3 190 61 166
3 148 166 125
3 148 171 166
3 114 95 102
3 114 125 95
3 82 95 258
3 82 102 95
3 120 135 102
3 120 143 135
3 114 135 125
3 114 102 135
3 83 176 181
3 89 181 5
3 71 164 176
3 71 160 164
3 150 160 147
3 150 164 160
3 175 181 164
3 175 5 181
3 76 176 164
3 76 181 176
3 156 142 176
3 156 143 142
3 158 142 145
3 158 176 142
3 146 160 145
3 146 147 160
3 158 160 176
3 158 145 160
3 156 172 143
3 156 176 172
3 155 172 171
3 155 143 172
3 131 145 7
3 132 147 146
3 131 146 145
3 130 142 116
3 130 145 142
3 129 142 143
3 129 116 142
3 130 7 145
3 130 116 7
3 153 147 238
3 188 201 174
3 153 174 147
3 90 246 112
3 253 124 228
3 253 91 124
3 100 124 65
3 100 228 124
3 149 185 228
3 149 60 185
3 253 185 91
3 253 228 185
3 205 233 60
3 205 127 233
3 210 127 5
3 210 233 127
3 151 263 60
3 151 233 263
3 185 263 91
3 185 60 263
3 211 133 127
3 211 58 133
3 255 133 5
3 255 127 133
3 87 211 60
3 87 58 211
3 205 211 127
3 205 60 211
3 204 228 65
3 87 261 58
3 87 60 261
3 138 162 133
3 138 141 162
3 157 162 5
3 157 133 162
3 111 115 133
3 111 58 115
3 138 115 141
3 138 133 115
3 168 170 6
3 168 141 170
3 168 162 141
3 168 6 162
3 177 199 236
3 252 236 199
3 221 154 236
3 221 61 154
3 177 236 154
3 152 61 236
3 191 58 59
3 191 239 58
3 215 59 187
3 215 239 59
3 230 260 187
3 215 260 239
3 215 187 260
3 195 222 141
3 195 239 222
3 170 222 61
3 170 141 222
3 139 239 195
3 139 58 239
3 115 195 141
3 115 58 195
3 178 230 81
3 128 230 187
3 128 81 230
3 227 122 81
3 227 65 122
3 178 81 122
3 86 187 59
3 261 59 58
3 204 65 81
3 94 222 180
3 94 61 222
3 108 222 239
3 108 180 222
3 154 61 94
3 245 94 180
3 123 239 260
3 123 200 239
3 137 200 260
3 254 180 200
3 108 200 180
3 108 239 200
3 223 65 159
3 104 62 3
3 196 200 0
3 196 101 200
3 254 200 101
3 214 200 137
3 214 0 200
3 121 209 101
3 196 67 101
3 196 0 67
