OFF

40 76 0
0.098192 0.271430 -0.066253
0.235648 0.180004 -0.027855
0.242350 0.177713 -0.025336
0.130253 0.273501 -0.019509
0.156442 0.226654 0.014946
0.228475 0.115825 -0.076432
0.182613 0.207488 0.007617
0.213041 0.195370 -0.001617
0.218742 0.196849 0.002138
0.225045 0.123670 -0.084875
0.133812 0.247714 0.000495
0.185665 0.211427 0.011969
0.126124 0.274688 -0.015506
0.094181 0.274666 -0.064819
0.158393 0.229385 0.009263
0.137309 0.251733 0.003740
0.155503 0.224523 0.006093
0.183231 0.202291 0.011873
0.232280 0.175256 -0.023022
0.236998 0.152419 -0.055952
0.112908 0.280281 -0.043797
0.233010 0.148406 -0.050290
0.126601 0.269498 -0.022030
0.100881 0.275439 -0.068019
0.221544 0.120456 -0.077943
0.153479 0.221796 0.011687
0.096870 0.278675 -0.066586
0.109398 0.283052 -0.040250
0.214525 0.201032 -0.006079
0.186104 0.206241 0.016370
0.109793 0.275590 -0.043049
0.238983 0.172963 -0.020502
0.243630 0.148266 -0.054478
0.141068 0.252291 -0.001396
0.106380 0.278470 -0.039576
0.220372 0.202506 -0.002145
0.232143 0.118797 -0.083507
0.137643 0.248267 -0.004551
0.239634 0.144138 -0.048814
0.122394 0.270920 -0.017957
3 13 26 0
3 26 23 0
3 36 5 9
3 5 24 9
3 30 0 20
3 20 0 23
3 20 23 27
3 23 26 27
3 27 26 34
3 26 13 34
3 34 13 30
3 30 13 0
3 3 20 12
3 12 20 27
3 12 27 39
3 27 34 39
3 39 34 22
3 34 30 22
3 22 30 3
3 3 30 20
3 15 12 10
3 12 39 10
3 37 10 39
3 22 37 39
3 37 22 33
3 33 22 3
3 33 3 15
3 12 15 3
3 16 25 10
3 37 16 10
3 16 37 14
3 14 37 33
3 33 4 14
3 15 4 33
3 4 15 25
3 15 10 25
3 6 17 25
3 25 16 6
3 6 16 11
3 11 16 14
3 14 29 11
3 29 14 4
3 29 4 17
3 4 25 17
3 28 6 35
3 35 6 11
3 11 8 35
3 29 8 11
3 8 29 7
3 29 17 7
3 28 7 17
3 28 17 6
3 2 1 28
3 2 28 35
3 35 31 2
3 8 31 35
3 8 18 31
3 7 18 8
3 1 18 7
3 28 1 7
3 2 38 32
3 31 38 2
3 31 21 38
3 18 21 31
3 19 21 18
3 1 19 18
3 32 19 1
3 2 32 1
3 32 5 36
3 38 5 32
3 38 24 5
3 21 24 38
3 9 24 21
3 19 9 21
3 36 9 19
3 32 36 19
