OFF
1626 2048 0
0.0021805649 0.1777595905 0.0099335935
0.0007662112 0.0143768516 0.0099875818
0.0021259445 0.1740650802 0.0099345172
-0.0035123190 0.2109491657 0.0098441374
0.0125871356 0.1397561507 0.0100870535
0.0218885336 0.1090725741 0.0102227579
0.0213315640 0.1168830355 0.0102119795
0.0135569348 0.0829943811 0.0101249874
0.0115995819 0.1462334384 0.0100712158
0.0125995173 0.0833135934 0.0101122798
-0.0032803227 0.2039625411 0.0098502848
0.0080653713 0.0530682448 0.0100662006
0.0226472465 0.1090914572 0.0102327075
0.0226154952 0.1168861689 0.0102288294
0.0005944256 0.0187250954 0.0099833962
-0.0019918365 0.1089127770 0.0093704796
-0.0020239050 0.1167853727 0.0093665629
-0.0158407741 0.2282678243 0.1038515834
-0.0130112138 0.5000000000 0.1037680560
-0.0238757244 0.4999556731 0.1036254811
-0.0224978908 0.1617077042 0.1037937665
-0.0140433581 0.3668519850 0.1038136348
0.0013755595 -0.0485246209 -0.0027327745
-0.0109199255 0.4420838443 -0.0031120089
-0.0025524067 0.1856119226 -0.0028882985
-0.0051021892 0.2343892691 -0.0029434238
-0.0099002594 0.4420880045 -0.0030986279
-0.0038815433 -0.2258666050 -0.0027230229
-0.0096559526 -0.4624392845 -0.0026937590
-0.0014792560 0.0997835842 -0.0028361008
0.0003275916 -0.0546797273 -0.0027437957
0.0000237334 0.0199152220 -0.0027809082
-0.0092191032 -0.4624375022 -0.0026880262
-0.0033742859 -0.2603045566 -0.0027010728
0.0008771402 -0.0737930546 -0.0027280955
0.0002623516 0.0751694744 -0.0028023125
-0.0011572478 -0.1398375325 -0.0027254689
-0.0019281189 0.1089106212 0.0045157392
-0.0019601875 0.1167832169 0.0045118224
0.0114784532 0.1089653197 0.0046916736
0.0114463846 0.1168379154 0.0046877568
0.0122548033 -0.1359051837 0.0020917709
0.0122868762 -0.1437788318 0.0020956882
-0.0133825309 0.2281846534 -0.0834458401
-0.0105529705 0.4999168291 -0.0835293674
-0.0214174812 0.4998725022 -0.0836719424
-0.0200396475 0.1616245333 -0.0835036569
-0.0115851149 0.3667688141 -0.0834837887
0.0022549596 0.1777570735 0.0042653446
0.0008406059 0.0143743346 0.0043193329
0.0022003392 0.1740625632 0.0042662683
-0.0034379243 0.2109466486 0.0041758885
0.0126615303 0.1397536337 0.0044188046
0.0219629283 0.1090700570 0.0045545090
0.0214059587 0.1168805185 0.0045437306
0.0136313295 0.0829918641 0.0044567386
0.0116739766 0.1462309214 0.0044029669
0.0126739120 0.0833110764 0.0044440309
-0.0032059280 0.2039600241 0.0041820359
0.0081397660 0.0530657278 0.0043979518
0.0227216412 0.1090889401 0.0045644586
0.0226898898 0.1168836519 0.0045605805
0.0006688203 0.0187225784 0.0043151474
0.0124319341 -0.1733363957 0.0028222653
-0.0029233720 -0.2383732464 0.0026496099
-0.0027270915 -0.2309596631 0.0026488940
0.0027875117 -0.2050361039 0.0027097606
0.0014366452 -0.2059688710 0.0026924449
0.0083667950 -0.1823055765 0.0027728939
0.0226159671 -0.1438163257 0.0029428202
0.0237745408 -0.1438094938 0.0029580232
0.0141896929 -0.1099167967 -0.0032457199
0.0087933198 -0.0800971806 -0.0033297879
0.0016293171 -0.0415458394 -0.0034409331
0.0221419999 -0.1358717166 -0.0031298219
0.0144354812 -0.1137269092 -0.0032408021
0.0014972792 -0.0460510933 -0.0034406655
0.0229373681 -0.1358863641 -0.0031193763
-0.0009912234 0.1089088079 -0.0067998904
-0.0010232920 0.1167814036 -0.0068038072
-0.0024387708 0.1089130237 0.0135254848
-0.0024708393 0.1167856194 0.0135215680
-0.0208582186 0.1088378728 0.0132837664
-0.0208902872 0.1167104685 0.0132798496
0.0211757224 0.1090093701 0.0138353777
0.0211436538 0.1168819658 0.0138314609
-0.0033834010 0.1089091696 0.0135130884
-0.0034154696 0.1167817653 0.0135091716
-0.0014942458 0.1089168773 0.0135378798
-0.0015263143 0.1167894730 0.0135339630
-0.0192052209 0.1088446170 0.0133054586
-0.0192372895 0.1167172127 0.0133015419
0.0183540644 0.1089973980 0.0128741791
0.0183219958 0.1168699937 0.0128702623
0.0154593236 0.1089821690 0.0059649137
0.0154272550 0.1168547647 0.0059609969
-0.0023959361 0.1089026169 -0.0077424945
-0.0024280046 0.1167752126 -0.0077464113
0.0152112966 0.1089785308 0.0006829428
0.0151792280 0.1168511265 0.0006790261
0.0214457312 0.1090002348 -0.0067370191
0.0214136627 0.1168728305 -0.0067409359
-0.0033495498 0.1088990707 -0.0070624075
-0.0033816183 0.1167716664 -0.0070663243
0.0140171320 -0.1099109583 0.0099019655
0.0086207589 -0.0800913423 0.0098178974
0.0014567563 -0.0415400011 0.0097067522
0.0219694390 -0.1358658783 0.0100178635
0.0142629203 -0.1137210709 0.0099068833
0.0013247183 -0.0460452550 0.0097070199
0.0227648072 -0.1358805257 0.0100283090
0.0136849277 0.1089765356 0.0091699078
0.0136528592 0.1168491313 0.0091659910
-0.0009348060 -0.1359574871 0.0049532875
-0.0009027331 -0.1438311353 0.0049572048
0.0124717661 -0.1359027887 0.0051292219
0.0125038390 -0.1437764369 0.0051331393
0.0013145907 -0.0485225581 0.0019125375
0.0022869910 0.1777559897 0.0018248193
-0.0109808943 0.4420859070 0.0015333031
-0.0026133756 0.1856139854 0.0017570136
0.0008726373 0.0143732508 0.0018788076
0.0022323706 0.1740614794 0.0018257430
-0.0034058928 0.2109455649 0.0017353632
0.0126935617 0.1397525500 0.0019782793
0.0219949597 0.1090689733 0.0021139837
0.0214379901 0.1168794347 0.0021032053
0.0136633610 0.0829907803 0.0020162133
-0.0051631580 0.2343913319 0.0017018882
0.0117060080 0.1462298376 0.0019624416
0.0127059434 0.0833099927 0.0020035056
-0.0099612283 0.4420900673 0.0015466842
-0.0039425121 -0.2258645423 0.0019222891
-0.0097169214 -0.4624372217 0.0019515531
-0.0015402248 0.0997856470 0.0018092112
0.0002666228 -0.0546776645 0.0019015164
-0.0000372354 0.0199172848 0.0018644038
-0.0031738965 0.2039589404 0.0017415106
-0.0092800720 -0.4624354394 0.0019572858
0.0081717975 0.0530646441 0.0019574265
-0.0034352547 -0.2603024938 0.0019442392
0.0008161714 -0.0737909918 0.0019172165
0.0002013827 0.0751715372 0.0018429996
-0.0012182167 -0.1398354697 0.0019198431
0.0227536726 0.1090878564 0.0021239333
0.0227219213 0.1168825681 0.0021200553
0.0007008517 0.0187214946 0.0018746221
0.0145632602 -0.1358979448 -0.0022587958
0.0145953331 -0.1437715930 -0.0022548785
0.0140853387 -0.1099132660 0.0047051936
0.0086889656 -0.0800936499 0.0046211256
0.0015249629 -0.0415423088 0.0045099804
0.0220376457 -0.1358681859 0.0048210916
0.0143311269 -0.1137233785 0.0047101115
0.0013929250 -0.0460475627 0.0045102480
0.0228330139 -0.1358828334 0.0048315372
0.0114753089 0.1089677163 0.0095345779
0.0114432403 0.1168403120 0.0095306612
-0.0014454578 -0.1359550847 0.0139630331
-0.0014133850 -0.1438287329 0.0139669504
-0.0198649057 -0.1360302355 0.0137213147
-0.0198328328 -0.1439038837 0.0137252320
0.0221690353 -0.1358587382 0.0142729261
0.0222011082 -0.1437323864 0.0142768434
-0.0023900881 -0.1359589387 0.0139506367
-0.0023580152 -0.1438325869 0.0139545540
-0.0005009328 -0.1359512310 0.0139754281
-0.0004688600 -0.1438248792 0.0139793454
-0.0182119080 -0.1360234913 0.0137430070
-0.0181798351 -0.1438971395 0.0137469243
0.0012731805 -0.0485211570 0.0050676452
-0.0110223045 0.4420873081 0.0046884108
-0.0026547858 0.1856153865 0.0049121213
-0.0052045682 0.2343927329 0.0048569959
-0.0100026385 0.4420914683 0.0047017919
-0.0039839223 -0.2258631412 0.0050773969
-0.0097583316 -0.4624358207 0.0051066608
-0.0015816350 0.0997870480 0.0049643189
0.0002252126 -0.0546762634 0.0050566241
-0.0000786456 0.0199186859 0.0050195115
-0.0093214822 -0.4624340384 0.0051123935
-0.0034766649 -0.2603010927 0.0050993470
0.0007747612 -0.0737895907 0.0050723242
0.0001599725 0.0751729382 0.0049981073
-0.0012596269 -0.1398340686 0.0050749508
0.0238436516 -0.1358616830 -0.0053568681
0.0238757244 -0.1437353312 -0.0053529508
-0.0012124335 -0.1359601238 0.0019266188
-0.0011803606 -0.1438337720 0.0019305361
0.0163164387 0.1089824045 -0.0005793405
0.0162843702 0.1168550002 -0.0005832573
0.0224390442 -0.1358678736 -0.0062994708
0.0224711170 -0.1437415217 -0.0062955534
-0.0023562368 -0.1359690376 -0.0066248592
-0.0023241640 -0.1438426858 -0.0066209419
-0.0042762046 -0.1359667493 0.0136943164
-0.0042441317 -0.1438403974 0.0136982337
-0.0167919238 -0.1360178130 0.0135300726
-0.0167598510 -0.1438914612 0.0135339899
0.0146782407 -0.1358915727 0.0096074562
0.0147103135 -0.1437652209 0.0096113735
-0.0196379882 -0.4999027051 0.1095585427
-0.0208913804 -0.1922041964 0.1094054563
-0.0137230568 -0.3864186898 0.1095857816
-0.0089330572 -0.4993075174 0.1096987786
0.0125104588 -0.1733390524 -0.0031606525
-0.0028448474 -0.2383759032 -0.0033333078
-0.0026485669 -0.2309623199 -0.0033340237
0.0028660363 -0.2050387606 -0.0032731572
0.0015151698 -0.2059715278 -0.0032904728
0.0084453197 -0.1823082333 -0.0032100238
0.0226944918 -0.1438189825 -0.0030400976
0.0238530654 -0.1438121505 -0.0030248945
0.0164185470 -0.1358847860 0.0089997955
0.0164506199 -0.1437584342 0.0090037128
0.0125042707 -0.1733388431 -0.0026891754
-0.0028510354 -0.2383756938 -0.0028618308
-0.0026547549 -0.2309621105 -0.0028625467
0.0028598483 -0.2050385513 -0.0028016801
0.0015089818 -0.2059713184 -0.0028189958
0.0084391316 -0.1823080239 -0.0027385467
0.0226883037 -0.1438187731 -0.0025686205
0.0238468774 -0.1438119412 -0.0025534175
0.0141173701 -0.1099143497 0.0022646684
0.0087209970 -0.0800947337 0.0021806003
0.0015569943 -0.0415433925 0.0020694551
0.0220696771 -0.1358692697 0.0023805664
0.0143631584 -0.1137244623 0.0022695862
0.0014249564 -0.0460486464 0.0020697228
0.0228650453 -0.1358839171 0.0023910119
-0.0195918581 -0.1360394736 -0.0070826110
-0.0195597852 -0.1439131218 -0.0070786937
-0.0002278852 -0.1359604692 -0.0068284976
-0.0001958124 -0.1438341174 -0.0068245803
-0.0165219150 -0.1360269484 -0.0070423242
-0.0164898422 -0.1439005966 -0.0070384069
-0.0009362527 -0.1359633593 -0.0068377935
-0.0009041798 -0.1438370075 -0.0068338762
0.0135699335 0.1089701640 -0.0026952917
0.0135378649 0.1168427597 -0.0026992085
0.0022487577 0.1777572833 0.0047378741
0.0008344040 0.0143745444 0.0047918624
0.0021941373 0.1740627730 0.0047387978
-0.0034441261 0.2109468585 0.0046484180
0.0126553284 0.1397538435 0.0048913341
0.0219567264 0.1090702669 0.0050270385
0.0213997568 0.1168807283 0.0050162601
0.0136251277 0.0829920739 0.0049292680
0.0116677747 0.1462311312 0.0048754964
0.0126677101 0.0833112862 0.0049165604
-0.0032121298 0.2039602339 0.0046545654
0.0081335642 0.0530659376 0.0048704812
0.0227154393 0.1090891500 0.0050369880
0.0226836880 0.1168838617 0.0050331100
0.0006626184 0.0187227882 0.0047876768
0.0123378979 -0.1733332141 0.0099870329
0.0124686218 -0.1359003920 0.0099721263
0.0125006947 -0.1437740402 0.0099760436
-0.0030174082 -0.2383700649 0.0098143775
-0.0028211278 -0.2309564816 0.0098136616
0.0026934755 -0.2050329223 0.0098745282
0.0013426090 -0.2059656894 0.0098572125
0.0082727588 -0.1823023949 0.0099376615
0.0225219309 -0.1438131441 0.0101075878
0.0236805046 -0.1438063122 0.0101227908
0.0141834911 -0.1099165868 -0.0027731904
0.0087871179 -0.0800969708 -0.0028572584
0.0016231153 -0.0415456296 -0.0029684036
0.0221357980 -0.1358715068 -0.0026572924
0.0144292793 -0.1137266994 -0.0027682726
0.0014910773 -0.0460508835 -0.0029681360
0.0229311662 -0.1358861542 -0.0026468469
-0.0176996640 -0.1360318688 -0.0072893486
-0.0176675912 -0.1439055169 -0.0072854313
0.0162387266 -0.1358907319 -0.0014789471
0.0162707995 -0.1437643801 -0.0014750298
0.0023593276 0.1777535423 -0.0036866213
0.0009449739 0.0143708035 -0.0036326331
0.0023047072 0.1740590320 -0.0036856976
-0.0033335562 0.2109431175 -0.0037760774
0.0127658983 0.1397501026 -0.0035331613
0.0220672963 0.1090665259 -0.0033974570
0.0215103268 0.1168769873 -0.0034082354
0.0137356976 0.0829883329 -0.0034952274
0.0117783446 0.1462273902 -0.0035489991
0.0127782800 0.0833075453 -0.0035079351
-0.0031015599 0.2039564930 -0.0037699301
0.0082441341 0.0530621967 -0.0035540142
0.0228260092 0.1090854090 -0.0033875074
0.0227942579 0.1168801207 -0.0033913854
0.0007731883 0.0187190472 -0.0036368186
0.0173097517 -0.1358857039 -0.0001417922
0.0173418245 -0.1437593521 -0.0001378749
0.0012122116 -0.0485190942 0.0097129573
-0.0110832734 0.4420893709 0.0093337228
-0.0027157546 0.1856174493 0.0095574333
-0.0052655370 0.2343947957 0.0095023079
-0.0100636073 0.4420935311 0.0093471039
-0.0040448912 -0.2258610784 0.0097227089
-0.0098193004 -0.4624337579 0.0097519728
-0.0016426038 0.0997891108 0.0096096309
0.0001642438 -0.0546742006 0.0097019361
-0.0001396145 0.0199207486 0.0096648236
-0.0093824511 -0.4624319756 0.0097577056
-0.0035376337 -0.2602990299 0.0097446590
0.0007137923 -0.0737875280 0.0097176363
0.0000990037 0.0751750010 0.0096434193
-0.0013205957 -0.1398320058 0.0097202629
0.0228503248 0.1090064258 -0.0057933640
0.0228182563 0.1168790215 -0.0057972808
-0.0022057602 0.1089079850 0.0014901229
-0.0022378288 0.1167805807 0.0014862061
-0.0052695313 0.1089013595 0.0132578205
-0.0053015999 0.1167739553 0.0132539037
-0.0177852506 0.1088502958 0.0130935767
-0.0178173191 0.1167228915 0.0130896599
0.0124061046 -0.1733355218 0.0047902611
-0.0029492016 -0.2383723725 0.0046176057
-0.0027529211 -0.2309587892 0.0046168898
0.0027616821 -0.2050352300 0.0046777564
0.0014108156 -0.2059679971 0.0046604407
0.0083409654 -0.1823047026 0.0047408897
0.0225901375 -0.1438154518 0.0049108160
0.0237487112 -0.1438086199 0.0049260190
0.0140109302 -0.1099107485 0.0103744949
0.0086145571 -0.0800911324 0.0102904269
0.0014505544 -0.0415397913 0.0101792817
0.0219632372 -0.1358656684 0.0104903929
0.0142567184 -0.1137208610 0.0103794128
0.0013185165 -0.0460450452 0.0101795493
0.0227586054 -0.1358803159 0.0105008385
-0.0021420426 0.1089058292 -0.0033646176
-0.0021741112 0.1167784249 -0.0033685343
0.0112645295 0.1089605276 -0.0031886831
0.0112324609 0.1168331233 -0.0031925999
0.0021867667 0.1777593807 0.0094610640
0.0007724130 0.0143766418 0.0095150523
0.0021321464 0.1740648704 0.0094619877
-0.0035061171 0.2109489558 0.0093716079
0.0125933374 0.1397559409 0.0096145240
0.0218947354 0.1090723642 0.0097502284
0.0213377659 0.1168828257 0.0097394500
0.0135631367 0.0829941712 0.0096524580
0.0116057837 0.1462332286 0.0095986863
0.0126057192 0.0833133836 0.0096397503
-0.0032741208 0.2039623313 0.0093777553
0.0080715732 0.0530680350 0.0095936712
0.0226534483 0.1090912473 0.0097601780
0.0226216970 0.1168859591 0.0097563000
0.0006006274 0.0187248856 0.0095108668
0.0154252203 0.1089833228 0.0085632996
0.0153931517 0.1168559185 0.0085593828
-0.0167622866 -0.5000000000 -0.1095456921
-0.0180156788 -0.1923014913 -0.1096987786
-0.0108473552 -0.3865159847 -0.1095184533
-0.0060573556 -0.4994048123 -0.1094054563
0.0022807891 0.1777561996 0.0022973488
0.0008664354 0.0143734607 0.0023513371
0.0022261688 0.1740616892 0.0022982725
-0.0034120947 0.2109457747 0.0022078927
0.0126873598 0.1397527598 0.0024508088
0.0219887579 0.1090691831 0.0025865132
0.0214317883 0.1168796446 0.0025757348
0.0136571591 0.0829909901 0.0024887428
0.0116998062 0.1462300475 0.0024349711
0.0126997416 0.0833102025 0.0024760351
-0.0031800984 0.2039591502 0.0022140401
0.0081655956 0.0530648539 0.0024299560
0.0227474707 0.1090880662 0.0025964628
0.0227157194 0.1168827780 0.0025925847
0.0006946498 0.0187217045 0.0023471515
0.0195474735 0.1089928350 -0.0060682761
0.0195154049 0.1168654308 -0.0060721929
0.0221449962 0.1090034329 -0.0060341888
0.0221129276 0.1168760286 -0.0060381056
0.0117545897 0.1089610403 -0.0061705421
0.0117225211 0.1168336360 -0.0061744589
-0.0016857874 -0.1359557913 0.0145103814
-0.0016537146 -0.1438294395 0.0145142987
-0.0205851848 0.1088286352 -0.0075191070
-0.0206172534 0.1167012309 -0.0075230238
-0.0012212120 0.1089076396 -0.0072649936
-0.0012532806 0.1167802353 -0.0072689104
-0.0175152418 0.1088411604 -0.0074788201
-0.0175473103 0.1167137561 -0.0074827369
-0.0019295794 0.1089047495 -0.0072742895
-0.0019616480 0.1167773452 -0.0072782063
0.0140791368 -0.1099130562 0.0051777231
0.0086827637 -0.0800934401 0.0050936551
0.0015187610 -0.0415420989 0.0049825099
0.0220314438 -0.1358679761 0.0052936211
0.0143249251 -0.1137231687 0.0051826409
0.0013867231 -0.0460473528 0.0049827775
0.0228268120 -0.1358826236 0.0053040667
-0.0186929908 0.1088362400 -0.0077258445
-0.0187250594 0.1167088358 -0.0077297613
-0.0017213008 0.1089156058 0.0128412463
-0.0017533694 0.1167882015 0.0128373295
0.0226015598 0.1090148424 0.0131604352
0.0225694912 0.1168874381 0.0131565184
0.0216570348 0.1090109887 0.0131480402
0.0216249662 0.1168835845 0.0131441234
0.0147771839 -0.1358931527 0.0056215610
0.0148092568 -0.1437668009 0.0056254783
0.0124381360 -0.1733366055 0.0023497358
-0.0029171702 -0.2383734563 0.0021770804
-0.0027208897 -0.2309598730 0.0021763645
0.0027937135 -0.2050363137 0.0022372311
0.0014428470 -0.2059690808 0.0022199154
0.0083729969 -0.1823057863 0.0023003644
0.0226221690 -0.1438165355 0.0024702907
0.0237807426 -0.1438097036 0.0024854937
0.0152453999 0.1089773769 -0.0019154431
0.0152133313 0.1168499726 -0.0019193598
0.0134710040 0.1089717436 0.0012895511
0.0134389355 0.1168443393 0.0012856343
-0.0009985097 -0.1359553318 0.0098069756
-0.0009664369 -0.1438289800 0.0098108929
0.0165302572 0.1089871961 0.0073010148
0.0164981886 0.1168597918 0.0072970981
-0.0011487297 -0.1359622792 -0.0029270692
-0.0011166569 -0.1438359273 -0.0029231519
0.0122578424 -0.1359075807 -0.0027511348
0.0122899152 -0.1437812289 -0.0027472175
0.0205407864 -0.1358752733 -0.0056307278
0.0205728593 -0.1437489215 -0.0056268105
0.0231383091 -0.1358646755 -0.0055966405
0.0231703819 -0.1437383237 -0.0055927232
0.0127479026 -0.1359070680 -0.0057329938
0.0127799755 -0.1437807162 -0.0057290765
-0.0026791142 0.1089123175 0.0140738855
-0.0027111828 0.1167849132 0.0140699687
0.0141111682 -0.1099141399 0.0027371978
0.0087147951 -0.0800945238 0.0026531298
0.0015507925 -0.0415431827 0.0025419846
0.0220634752 -0.1358690598 0.0028530958
0.0143569565 -0.1137242524 0.0027421157
0.0014187545 -0.0460484366 0.0025422522
0.0228588434 -0.1358837073 0.0028635414
0.0112614904 0.1089629247 0.0016542226
0.0112294218 0.1168355204 0.0016503058
0.0123316960 -0.1733330043 0.0104595624
-0.0030236101 -0.2383698550 0.0102869070
-0.0028273296 -0.2309562717 0.0102861911
0.0026872736 -0.2050327125 0.0103470577
0.0013364071 -0.2059654796 0.0103297420
0.0082665569 -0.1823021851 0.0104101910
0.0225157290 -0.1438129343 0.0105801173
0.0236743027 -0.1438061024 0.0105953203
-0.0007279879 -0.1359525025 0.0132787946
-0.0006959150 -0.1438261507 0.0132827120
0.0235948727 -0.1358532660 0.0135979835
0.0236269456 -0.1437269141 0.0136019008
0.0226503477 -0.1358571196 0.0135855885
0.0226824206 -0.1437307678 0.0135895058
0.0137838572 0.1089749561 0.0051850650
0.0137517886 0.1168475518 0.0051811482
0.0023531258 0.1777537522 -0.0032140918
0.0009387721 0.0143710133 -0.0031601036
0.0022985054 0.1740592419 -0.0032131682
-0.0033397581 0.2109433273 -0.0033035480
0.0127596965 0.1397503124 -0.0030606319
0.0220610945 0.1090667357 -0.0029249275
0.0215041249 0.1168771972 -0.0029357059
0.0137294957 0.0829885427 -0.0030226979
0.0117721428 0.1462276001 -0.0030764696
0.0127720782 0.0833077551 -0.0030354056
-0.0031077618 0.2039567028 -0.0032974006
0.0082379322 0.0530624065 -0.0030814847
0.0228198073 0.1090856188 -0.0029149779
0.0227880560 0.1168803306 -0.0029188559
0.0007669865 0.0187192571 -0.0031642891
0.0000021033 -0.1359593009 -0.0063633945
0.0000341762 -0.1438329491 -0.0063594772
0.0144643170 -0.1358963648 0.0017270994
0.0144963898 -0.1437700130 0.0017310167
-0.0014026093 -0.1359654919 -0.0073059986
-0.0013705365 -0.1438391401 -0.0073020812
0.0193473911 -0.1358707108 0.0133106750
0.0193794640 -0.1437443590 0.0133145923
0.0164526503 -0.1358859398 0.0064014096
0.0164847232 -0.1437595880 0.0064053269
0.0162046233 -0.1358895780 0.0011194388
0.0162366962 -0.1437632262 0.0011233561
0.0123999027 -0.1733353119 0.0052627906
-0.0029554035 -0.2383721627 0.0050901352
-0.0027591230 -0.2309585794 0.0050894193
0.0027554802 -0.2050350201 0.0051502858
0.0014046138 -0.2059677873 0.0051329702
0.0083347636 -0.1823044928 0.0052134192
0.0225839357 -0.1438152420 0.0053833454
0.0237425094 -0.1438084100 0.0053985485
0.0175235701 -0.1358809122 0.0077385632
0.0175556430 -0.1437545604 0.0077424805
-0.0062568175 0.3138509950 -0.0006708072
-0.0062568175 0.3138509950 -0.0006708072
-0.0012790572 -0.1670477742 -0.0003919281
-0.0012790572 -0.1670477742 -0.0003919281
-0.0063271789 -0.3613699980 -0.0003718935
-0.0063271789 -0.3613699980 -0.0003718935
-0.0067992324 -0.3441519134 -0.0003857349
-0.0067992324 -0.3441519134 -0.0003857349
-0.0080415417 0.3382375881 -0.0007050604
-0.0080415417 0.3382375881 -0.0007050604
-0.0063591965 0.3138544588 0.0071296126
-0.0063591965 0.3138544588 0.0071296126
-0.0013814363 -0.1670443103 0.0074084916
-0.0013814363 -0.1670443103 0.0074084916
-0.0064295580 -0.3613665342 0.0074285263
-0.0064295580 -0.3613665342 0.0074285263
-0.0069016114 -0.3441484496 0.0074146848
-0.0069016114 -0.3441484496 0.0074146848
-0.0081439208 0.3382410519 0.0070953594
-0.0081439208 0.3382410519 0.0070953594
-0.0138048209 -0.4432579923 -0.1095320727
-0.0173889827 -0.3461507457 -0.1096222354
-0.0170756346 -0.4230753728 -0.1095839638
-0.0144315170 -0.2894087380 -0.1096086159
-0.0188268335 -0.3461020982 -0.0000701179
-0.0194535296 -0.1922528439 -0.0001466612
-0.0198591070 -0.2691531473 0.0546676692
-0.0191401815 -0.2691774710 -0.0001083896
-0.0196563183 -0.2307029956 0.0272605040
-0.0194996443 -0.2691653092 0.0272796398
-0.0193982499 -0.2499402333 0.0135760572
-0.0197577126 -0.2499280714 0.0409640866
-0.0192968556 -0.2307151574 -0.0001275254
-0.0195549239 -0.2114779197 0.0135569214
-0.0193982499 -0.2499402333 0.0135760572
-0.0193429702 -0.3076276227 0.0272987756
-0.0189835075 -0.3076397846 -0.0000892538
-0.0192415759 -0.2884025469 0.0135951930
-0.0190849019 -0.3268648605 0.0136143288
-0.0194996443 -0.2691653092 0.0272796398
-0.0196010386 -0.2883903850 0.0409832224
-0.0192415759 -0.2884025469 0.0135951930
-0.0201724550 -0.1922285201 0.0546293975
-0.0203752437 -0.2306786718 0.0820365627
-0.0200157810 -0.2306908337 0.0546485333
-0.0202738493 -0.2114535960 0.0683329801
-0.0201171753 -0.2499159096 0.0683521159
-0.0205319177 -0.1922163583 0.0820174269
-0.0206333120 -0.2114414341 0.0957210095
-0.0202738493 -0.2114535960 0.0683329801
-0.0196563183 -0.2307029956 0.0272605040
-0.0198129923 -0.1922406820 0.0272413682
-0.0199143866 -0.2114657578 0.0409449508
-0.0195549239 -0.2114779197 0.0135569214
-0.0200157810 -0.2306908337 0.0546485333
-0.0197577126 -0.2499280714 0.0409640866
-0.0199143866 -0.2114657578 0.0409449508
-0.0184212561 -0.2692017948 -0.0548844483
-0.0187346042 -0.1922771676 -0.0549227199
-0.0189373929 -0.2307273193 -0.0275155547
-0.0185779302 -0.2307394812 -0.0549035841
-0.0188359985 -0.2115022435 -0.0412191373
-0.0186793245 -0.2499645570 -0.0412000015
-0.0190940669 -0.1922650057 -0.0275346905
-0.0191954612 -0.2114900816 -0.0138311080
-0.0188359985 -0.2115022435 -0.0412191373
-0.0182184674 -0.2307516430 -0.0822916134
-0.0183751415 -0.1922893295 -0.0823107493
-0.0184765358 -0.2115144053 -0.0686071667
-0.0181170731 -0.2115265672 -0.0959951960
-0.0185779302 -0.2307394812 -0.0549035841
-0.0183198618 -0.2499767189 -0.0685880309
-0.0184765358 -0.2115144053 -0.0686071667
-0.0191401815 -0.2691774710 -0.0001083896
-0.0186240448 -0.3076519465 -0.0274772831
-0.0187807188 -0.2691896329 -0.0274964189
-0.0188821132 -0.2884147088 -0.0137928363
-0.0185226505 -0.2884268706 -0.0411808657
-0.0189835075 -0.3076397846 -0.0000892538
-0.0187254392 -0.3268770223 -0.0137737005
-0.0188821132 -0.2884147088 -0.0137928363
-0.0189373929 -0.2307273193 -0.0275155547
-0.0192968556 -0.2307151574 -0.0001275254
-0.0190387872 -0.2499523952 -0.0138119721
-0.0191954612 -0.2114900816 -0.0138311080
-0.0187807188 -0.2691896329 -0.0274964189
-0.0186793245 -0.2499645570 -0.0412000015
-0.0190387872 -0.2499523952 -0.0138119721
-0.0202646843 -0.3460534507 0.1094819995
-0.0192324109 -0.4230024016 0.0547442124
-0.0195457589 -0.3460777745 0.0547059408
-0.0197485476 -0.3845279262 0.0821131059
-0.0193890849 -0.3845400880 0.0547250766
-0.0196471533 -0.3653028503 0.0684095233
-0.0194904792 -0.4037651639 0.0684286592
-0.0199052216 -0.3460656126 0.0820939701
-0.0200066160 -0.3652906884 0.0957975527
-0.0196471533 -0.3653028503 0.0684095233
-0.0190296222 -0.3845522499 0.0273370472
-0.0191862962 -0.3460899363 0.0273179114
-0.0192876906 -0.3653150122 0.0410214940
-0.0189282278 -0.3653271741 0.0136334646
-0.0193890849 -0.3845400880 0.0547250766
-0.0191310165 -0.4037773258 0.0410406298
-0.0192876906 -0.3653150122 0.0410214940
-0.0199513363 -0.4229780779 0.1095202711
-0.0194351996 -0.4614525533 0.0821513775
-0.0195918736 -0.4229902398 0.0821322417
-0.0196932679 -0.4422153156 0.0958358243
-0.0193338052 -0.4422274775 0.0684477950
-0.0197946623 -0.4614403915 0.1095394069
-0.0195365939 -0.4806776292 0.0958549601
-0.0196932679 -0.4422153156 0.0958358243
-0.0197485476 -0.3845279262 0.0821131059
-0.0201080103 -0.3845157643 0.1095011353
-0.0198499419 -0.4037530020 0.0958166885
-0.0200066160 -0.3652906884 0.0957975527
-0.0195918736 -0.4229902398 0.0821322417
-0.0194904792 -0.4037651639 0.0684286592
-0.0198499419 -0.4037530020 0.0958166885
-0.0198591070 -0.2691531473 0.0546676692
-0.0205780324 -0.2691288236 0.1094437279
-0.0200618956 -0.3076032990 0.0820748343
-0.0202185697 -0.2691409854 0.0820556985
-0.0203199640 -0.2883660613 0.0957592811
-0.0199605013 -0.2883782231 0.0683712517
-0.0204213583 -0.3075911371 0.1094628637
-0.0201632900 -0.3268283749 0.0957784169
-0.0203199640 -0.2883660613 0.0957592811
-0.0203752437 -0.2306786718 0.0820365627
-0.0207347064 -0.2306665100 0.1094245921
-0.0204766380 -0.2499037477 0.0957401453
-0.0206333120 -0.2114414341 0.0957210095
-0.0202185697 -0.2691409854 0.0820556985
-0.0201171753 -0.2499159096 0.0683521159
-0.0204766380 -0.2499037477 0.0957401453
-0.0195457589 -0.3460777745 0.0547059408
-0.0193429702 -0.3076276227 0.0272987756
-0.0197024329 -0.3076154609 0.0546868050
-0.0194443646 -0.3268526986 0.0410023582
-0.0196010386 -0.2883903850 0.0409832224
-0.0191862962 -0.3460899363 0.0273179114
-0.0190849019 -0.3268648605 0.0136143288
-0.0194443646 -0.3268526986 0.0410023582
-0.0200618956 -0.3076032990 0.0820748343
-0.0199052216 -0.3460656126 0.0820939701
-0.0198038273 -0.3268405367 0.0683903875
-0.0201632900 -0.3268283749 0.0957784169
-0.0197024329 -0.3076154609 0.0546868050
-0.0199605013 -0.2883782231 0.0683712517
-0.0198038273 -0.3268405367 0.0683903875
-0.0188268335 -0.3461020982 -0.0000701179
-0.0182001374 -0.4999513525 0.0000064253
-0.0177945601 -0.4230510491 -0.0548079050
-0.0185134855 -0.4230267254 -0.0000318463
-0.0179973487 -0.4615012008 -0.0274007399
-0.0181540228 -0.4230388872 -0.0274198757
-0.0182554171 -0.4422639631 -0.0137162931
-0.0178959544 -0.4422761250 -0.0411043225
-0.0183568114 -0.4614890389 -0.0000127105
-0.0180987431 -0.4807262767 -0.0136971573
-0.0182554171 -0.4422639631 -0.0137162931
-0.0183106968 -0.3845765736 -0.0274390115
-0.0186701595 -0.3845644118 -0.0000509821
-0.0184120911 -0.4038016495 -0.0137354289
-0.0185687651 -0.3653393359 -0.0137545647
-0.0181540228 -0.4230388872 -0.0274198757
-0.0180526284 -0.4038138114 -0.0411234583
-0.0184120911 -0.4038016495 -0.0137354289
-0.0174812120 -0.4999756763 -0.0547696334
-0.0172784233 -0.4615255245 -0.0821767986
-0.0176378860 -0.4615133627 -0.0547887692
-0.0173798177 -0.4807506004 -0.0684732160
-0.0175364917 -0.4422882868 -0.0684923518
-0.0171217493 -0.4999878381 -0.0821576628
-0.0170203550 -0.4807627623 -0.0958612454
-0.0173798177 -0.4807506004 -0.0684732160
-0.0179973487 -0.4615012008 -0.0274007399
-0.0178406747 -0.4999635144 -0.0273816041
-0.0177392804 -0.4807384385 -0.0410851867
-0.0180987431 -0.4807262767 -0.0136971573
-0.0176378860 -0.4615133627 -0.0547887692
-0.0178959544 -0.4422761250 -0.0411043225
-0.0177392804 -0.4807384385 -0.0410851867
-0.0192324109 -0.4230024016 0.0547442124
-0.0189190628 -0.4999270288 0.0547824840
-0.0187162741 -0.4614768771 0.0273753188
-0.0190757369 -0.4614647152 0.0547633482
-0.0188176685 -0.4807019529 0.0410789014
-0.0189743425 -0.4422396393 0.0410597656
-0.0185596001 -0.4999391907 0.0273944546
-0.0184582058 -0.4807141148 0.0136908721
-0.0188176685 -0.4807019529 0.0410789014
-0.0194351996 -0.4614525533 0.0821513775
-0.0192785255 -0.4999148669 0.0821705134
-0.0191771312 -0.4806897911 0.0684669308
-0.0195365939 -0.4806776292 0.0958549601
-0.0190757369 -0.4614647152 0.0547633482
-0.0193338052 -0.4422274775 0.0684477950
-0.0191771312 -0.4806897911 0.0684669308
-0.0185134855 -0.4230267254 -0.0000318463
-0.0190296222 -0.3845522499 0.0273370472
-0.0188729482 -0.4230145635 0.0273561830
-0.0187715538 -0.4037894876 0.0136526004
-0.0191310165 -0.4037773258 0.0410406298
-0.0186701595 -0.3845644118 -0.0000509821
-0.0189282278 -0.3653271741 0.0136334646
-0.0187715538 -0.4037894876 0.0136526004
-0.0187162741 -0.4614768771 0.0273753188
-0.0183568114 -0.4614890389 -0.0000127105
-0.0186148798 -0.4422518012 0.0136717362
-0.0184582058 -0.4807141148 0.0136908721
-0.0188729482 -0.4230145635 0.0273561830
-0.0189743425 -0.4422396393 0.0410597656
-0.0186148798 -0.4422518012 0.0136717362
-0.0173889827 -0.3461507457 -0.1096222354
-0.0184212561 -0.2692017948 -0.0548844483
-0.0181079081 -0.3461264219 -0.0548461767
-0.0179051194 -0.3076762702 -0.0822533418
-0.0182645821 -0.3076641083 -0.0548653125
-0.0180065137 -0.3269013461 -0.0685497592
-0.0181631878 -0.2884390325 -0.0685688951
-0.0177484454 -0.3461385838 -0.0822342060
-0.0176470510 -0.3269135079 -0.0959377886
-0.0180065137 -0.3269013461 -0.0685497592
-0.0186240448 -0.3076519465 -0.0274772831
-0.0184673708 -0.3461142601 -0.0274581473
-0.0183659765 -0.3268891842 -0.0411617299
-0.0187254392 -0.3268770223 -0.0137737005
-0.0182645821 -0.3076641083 -0.0548653125
-0.0185226505 -0.2884268706 -0.0411808657
-0.0183659765 -0.3268891842 -0.0411617299
-0.0177023307 -0.2692261185 -0.1096605070
-0.0182184674 -0.2307516430 -0.0822916134
-0.0180617934 -0.2692139566 -0.0822724776
-0.0179603991 -0.2499888808 -0.0959760602
-0.0183198618 -0.2499767189 -0.0685880309
-0.0178590047 -0.2307638049 -0.1096796428
-0.0181170731 -0.2115265672 -0.0959951960
-0.0179603991 -0.2499888808 -0.0959760602
-0.0179051194 -0.3076762702 -0.0822533418
-0.0175456567 -0.3076884321 -0.1096413712
-0.0178037251 -0.2884511944 -0.0959569244
-0.0176470510 -0.3269135079 -0.0959377886
-0.0180617934 -0.2692139566 -0.0822724776
-0.0181631878 -0.2884390325 -0.0685688951
-0.0178037251 -0.2884511944 -0.0959569244
-0.0177945601 -0.4230510491 -0.0548079050
-0.0170756346 -0.4230753728 -0.1095839638
-0.0175917714 -0.3846008974 -0.0822150702
-0.0174350973 -0.4230632110 -0.0821959344
-0.0173337030 -0.4038381351 -0.0958995170
-0.0176931657 -0.4038259732 -0.0685114876
-0.0172323087 -0.3846130592 -0.1096030996
-0.0174903770 -0.3653758215 -0.0959186528
-0.0173337030 -0.4038381351 -0.0958995170
-0.0172784233 -0.4615255245 -0.0821767986
-0.0169189606 -0.4615376864 -0.1095648280
-0.0171770290 -0.4423004487 -0.0958803812
-0.0170203550 -0.4807627623 -0.0958612454
-0.0174350973 -0.4230632110 -0.0821959344
-0.0175364917 -0.4422882868 -0.0684923518
-0.0171770290 -0.4423004487 -0.0958803812
-0.0181079081 -0.3461264219 -0.0548461767
-0.0183106968 -0.3845765736 -0.0274390115
-0.0179512341 -0.3845887355 -0.0548270409
-0.0182093024 -0.3653514978 -0.0411425941
-0.0180526284 -0.4038138114 -0.0411234583
-0.0184673708 -0.3461142601 -0.0274581473
-0.0185687651 -0.3653393359 -0.0137545647
-0.0182093024 -0.3653514978 -0.0411425941
-0.0175917714 -0.3846008974 -0.0822150702
-0.0177484454 -0.3461385838 -0.0822342060
-0.0178498397 -0.3653636597 -0.0685306234
-0.0174903770 -0.3653758215 -0.0959186528
-0.0179512341 -0.3845887355 -0.0548270409
-0.0176931657 -0.4038259732 -0.0685114876
-0.0178498397 -0.3653636597 -0.0685306234
-0.0166805225 -0.4431606974 0.1095721622
-0.0202646843 -0.3460534507 0.1094819995
-0.0173072186 -0.2893114431 0.1094956189
-0.0199513363 -0.4229780779 0.1095202711
-0.0158693678 -0.2893600905 -0.0000564985
-0.0122852060 -0.3864673372 0.0000336642
-0.0147962123 -0.3378893901 0.0547646416
-0.0140772869 -0.3379137139 -0.0000114172
-0.0135407091 -0.3621783637 0.0273991529
-0.0144367496 -0.3379015520 0.0273766122
-0.0131812464 -0.3621905256 0.0000111235
-0.0153327900 -0.3136247403 0.0273540715
-0.0149733273 -0.3136369022 -0.0000339578
-0.0144367496 -0.3379015520 0.0273766122
-0.0130041314 -0.3864430135 0.0548097229
-0.0142596346 -0.3621540400 0.0821752116
-0.0139001719 -0.3621662018 0.0547871822
-0.0133635941 -0.3864308516 0.0821977522
-0.0135407091 -0.3621783637 0.0273991529
-0.0126446687 -0.3864551754 0.0274216935
-0.0139001719 -0.3621662018 0.0547871822
-0.0133583615 -0.3379380376 -0.0547874759
-0.0115662806 -0.3864916610 -0.0547423945
-0.0128217837 -0.3622026874 -0.0273769059
-0.0124623210 -0.3622148493 -0.0547649352
-0.0119257433 -0.3864794991 -0.0273543652
-0.0121028583 -0.3622270112 -0.0821529646
-0.0112068179 -0.3865038228 -0.0821304239
-0.0124623210 -0.3622148493 -0.0547649352
-0.0140772869 -0.3379137139 -0.0000114172
-0.0146138646 -0.3136490641 -0.0274219872
-0.0137178242 -0.3379258758 -0.0273994465
-0.0149733273 -0.3136369022 -0.0000339578
-0.0128217837 -0.3622026874 -0.0273769059
-0.0131812464 -0.3621905256 0.0000111235
-0.0137178242 -0.3379258758 -0.0273994465
-0.0173072186 -0.2893114431 0.1094956189
-0.0183803741 -0.2407821435 0.0546744789
-0.0165882932 -0.2893357668 0.0547195602
-0.0178437964 -0.2650467933 0.0820850489
-0.0174843336 -0.2650589551 0.0546970195
-0.0169477559 -0.2893236049 0.0821075896
-0.0171248709 -0.2650711170 0.0273089902
-0.0162288305 -0.2893479287 0.0273315309
-0.0174843336 -0.2650589551 0.0546970195
-0.0190992995 -0.2407578197 0.1094505376
-0.0196358773 -0.2164931699 0.0820399676
-0.0187398368 -0.2407699816 0.0820625082
-0.0199953400 -0.2164810081 0.1094279969
-0.0178437964 -0.2650467933 0.0820850489
-0.0182032591 -0.2650346314 0.1094730783
-0.0187398368 -0.2407699816 0.0820625082
-0.0147962123 -0.3378893901 0.0547646416
-0.0155151377 -0.3378650664 0.1095407003
-0.0160517155 -0.3136004166 0.0821301302
-0.0151556750 -0.3378772283 0.0821526709
-0.0164111782 -0.3135882547 0.1095181596
-0.0142596346 -0.3621540400 0.0821752116
-0.0146190973 -0.3621418781 0.1095632409
-0.0151556750 -0.3378772283 0.0821526709
-0.0165882932 -0.2893357668 0.0547195602
-0.0153327900 -0.3136247403 0.0273540715
-0.0156922527 -0.3136125785 0.0547421009
-0.0162288305 -0.2893479287 0.0273315309
-0.0160517155 -0.3136004166 0.0821301302
-0.0169477559 -0.2893236049 0.0821075896
-0.0156922527 -0.3136125785 0.0547421009
-0.0158693678 -0.2893600905 -0.0000564985
-0.0194535296 -0.1922528439 -0.0001466612
-0.0169425233 -0.2408307909 -0.0548776386
-0.0176614487 -0.2408064672 -0.0001015798
-0.0181980264 -0.2165418174 -0.0275121499
-0.0173019860 -0.2408186291 -0.0274896092
-0.0185574891 -0.2165296555 -0.0001241205
-0.0164059455 -0.2650954407 -0.0274670685
-0.0167654082 -0.2650832789 -0.0000790392
-0.0173019860 -0.2408186291 -0.0274896092
-0.0187346042 -0.1922771676 -0.0549227199
-0.0174791010 -0.2165661411 -0.0822882086
-0.0178385637 -0.2165539793 -0.0549001792
-0.0183751415 -0.1922893295 -0.0823107493
-0.0181980264 -0.2165418174 -0.0275121499
-0.0190940669 -0.1922650057 -0.0275346905
-0.0178385637 -0.2165539793 -0.0549001792
-0.0183803741 -0.2407821435 0.0546744789
-0.0201724550 -0.1922285201 0.0546293975
-0.0189169518 -0.2165174937 0.0272639088
-0.0192764145 -0.2165053318 0.0546519382
-0.0198129923 -0.1922406820 0.0272413682
-0.0196358773 -0.2164931699 0.0820399676
-0.0205319177 -0.1922163583 0.0820174269
-0.0192764145 -0.2165053318 0.0546519382
-0.0176614487 -0.2408064672 -0.0001015798
-0.0171248709 -0.2650711170 0.0273089902
-0.0180209114 -0.2407943053 0.0272864495
-0.0167654082 -0.2650832789 -0.0000790392
-0.0189169518 -0.2165174937 0.0272639088
-0.0185574891 -0.2165296555 -0.0001241205
-0.0180209114 -0.2407943053 0.0272864495
-0.0144315170 -0.2894087380 -0.1096086159
-0.0133583615 -0.3379380376 -0.0547874759
-0.0151504424 -0.2893844143 -0.0548325572
-0.0138949392 -0.3136733878 -0.0821980459
-0.0142544019 -0.3136612259 -0.0548100165
-0.0147909797 -0.2893965761 -0.0822205866
-0.0146138646 -0.3136490641 -0.0274219872
-0.0155099051 -0.2893722524 -0.0274445279
-0.0142544019 -0.3136612259 -0.0548100165
-0.0126394361 -0.3379623614 -0.1095635346
-0.0121028583 -0.3622270112 -0.0821529646
-0.0129988988 -0.3379501995 -0.0821755052
-0.0117433956 -0.3622391730 -0.1095409939
-0.0138949392 -0.3136733878 -0.0821980459
-0.0135354765 -0.3136855497 -0.1095860753
-0.0129988988 -0.3379501995 -0.0821755052
-0.0169425233 -0.2408307909 -0.0548776386
-0.0162235979 -0.2408551147 -0.1096536973
-0.0156870201 -0.2651197645 -0.0822431272
-0.0165830606 -0.2408429528 -0.0822656679
-0.0153275574 -0.2651319263 -0.1096311566
-0.0174791010 -0.2165661411 -0.0822882086
-0.0171196383 -0.2165783030 -0.1096762379
-0.0165830606 -0.2408429528 -0.0822656679
-0.0151504424 -0.2893844143 -0.0548325572
-0.0164059455 -0.2650954407 -0.0274670685
-0.0160464828 -0.2651076026 -0.0548550979
-0.0155099051 -0.2893722524 -0.0274445279
-0.0156870201 -0.2651197645 -0.0822431272
-0.0147909797 -0.2893965761 -0.0822205866
-0.0160464828 -0.2651076026 -0.0548550979
-0.0098902062 -0.4429117510 0.0000901627
-0.0074952064 -0.4993561649 0.0001466612
-0.0094116317 -0.4711096342 0.0548944706
-0.0084534191 -0.4852328995 0.0275205659
-0.0096509190 -0.4570106926 0.0274923167
-0.0091718126 -0.4640723253 0.0138053643
-0.0089325254 -0.4781712669 0.0412075183
-0.0086927063 -0.4711339579 0.0001184119
-0.0085730627 -0.4781834287 0.0138194889
-0.0091718126 -0.4640723253 0.0138053643
-0.0082141318 -0.4993318411 0.0549227199
-0.0091723445 -0.4852085758 0.0822966246
-0.0092919881 -0.4781591050 0.0685955476
-0.0085735945 -0.4993196793 0.0823107493
-0.0084534191 -0.4852328995 0.0275205659
-0.0078546691 -0.4993440030 0.0275346905
-0.0089325254 -0.4781712669 0.0412075183
-0.0079737809 -0.4711582817 -0.0546576468
-0.0067762810 -0.4993804886 -0.0546293975
-0.0077344937 -0.4852572233 -0.0272554928
-0.0078541373 -0.4782077525 -0.0409565698
-0.0071357437 -0.4993683267 -0.0272413682
-0.0070155682 -0.4852815470 -0.0820315515
-0.0064168183 -0.4993926505 -0.0820174269
-0.0074946746 -0.4782199143 -0.0683445992
-0.0077344937 -0.4852572233 -0.0272554928
-0.0086927063 -0.4711339579 0.0001184119
-0.0088123499 -0.4640844872 -0.0135826651
-0.0082136000 -0.4781955906 -0.0135685404
-0.0089319935 -0.4570350164 -0.0272837421
-0.0078541373 -0.4782077525 -0.0409565698
-0.0088123499 -0.4640844872 -0.0135826651
-0.0118066315 -0.4146652204 0.0548379721
-0.0094116317 -0.4711096342 0.0548944706
-0.0103698444 -0.4569863689 0.0822683754
-0.0106091316 -0.4428874273 0.0548662214
-0.0104894880 -0.4499368981 0.0685672984
-0.0110882379 -0.4358257946 0.0685531738
-0.0091723445 -0.4852085758 0.0822966246
-0.0096514508 -0.4781469431 0.0959835770
-0.0092919881 -0.4781591050 0.0685955476
-0.0108484189 -0.4287884857 0.0274640674
-0.0096509190 -0.4570106926 0.0274923167
-0.0101300253 -0.4499490600 0.0411792690
-0.0103693125 -0.4358501184 0.0137771150
-0.0106091316 -0.4428874273 0.0548662214
-0.0107287752 -0.4358379565 0.0411651444
-0.0101300253 -0.4499490600 0.0411792690
-0.0113280570 -0.4428631036 0.1096422801
-0.0115673443 -0.4287641620 0.0822401261
-0.0125255569 -0.4146408967 0.1096140309
-0.0126452005 -0.4075914259 0.0959129539
-0.0114477006 -0.4358136328 0.0959412031
-0.0127648442 -0.4005419551 0.0822118769
-0.0122857378 -0.4076035877 0.0685249245
-0.0126452005 -0.4075914259 0.0959129539
-0.0103698444 -0.4569863689 0.0822683754
-0.0101305571 -0.4710853105 0.1096705294
-0.0102502007 -0.4640358397 0.0959694524
-0.0096514508 -0.4781469431 0.0959835770
-0.0115673443 -0.4287641620 0.0822401261
-0.0110882379 -0.4358257946 0.0685531738
-0.0114477006 -0.4358136328 0.0959412031
-0.0098902062 -0.4429117510 0.0000901627
-0.0122852060 -0.3864673372 0.0000336642
-0.0103687807 -0.4147138679 -0.0547141453
-0.0113269933 -0.4005906025 -0.0273402406
-0.0101294934 -0.4288128095 -0.0273119913
-0.0106085998 -0.4217511768 -0.0136250389
-0.0102491371 -0.4217633387 -0.0410130683
-0.0110877061 -0.4146895441 0.0000619134
-0.0118060997 -0.3935289699 -0.0136532882
-0.0106085998 -0.4217511768 -0.0136250389
-0.0115662806 -0.3864916610 -0.0547423945
-0.0106080679 -0.4006149263 -0.0821162993
-0.0110871743 -0.3935532936 -0.0684293469
-0.0112068179 -0.3865038228 -0.0821304239
-0.0113269933 -0.4005906025 -0.0273402406
-0.0119257433 -0.3864794991 -0.0273543652
-0.0114466370 -0.3935411318 -0.0410413175
-0.0118066315 -0.4146652204 0.0548379721
-0.0130041314 -0.3864430135 0.0548097229
-0.0120459187 -0.4005662788 0.0274358182
-0.0125250251 -0.3935046462 0.0411227705
-0.0126446687 -0.3864551754 0.0274216935
-0.0127648442 -0.4005419551 0.0822118769
-0.0133635941 -0.3864308516 0.0821977522
-0.0128844878 -0.3934924843 0.0685107999
-0.0108484189 -0.4287884857 0.0274640674
-0.0120459187 -0.4005662788 0.0274358182
-0.0115668124 -0.4076279115 0.0137488658
-0.0119262751 -0.4076157496 0.0411368951
-0.0110877061 -0.4146895441 0.0000619134
-0.0103693125 -0.4358501184 0.0137771150
-0.0115668124 -0.4076279115 0.0137488658
-0.0103687807 -0.4147138679 -0.0547141453
-0.0084523554 -0.4429603985 -0.1094619548
-0.0082130681 -0.4570593401 -0.0820598008
-0.0094105680 -0.4288371332 -0.0820880500
-0.0089314617 -0.4358987659 -0.0957750024
-0.0092909244 -0.4358866040 -0.0683869730
-0.0072548555 -0.4711826054 -0.1094337055
-0.0071352119 -0.4782320762 -0.0957326285
-0.0077339618 -0.4641209728 -0.0957467531
-0.0094105680 -0.4288371332 -0.0820880500
-0.0106080679 -0.4006149263 -0.0821162993
-0.0101289616 -0.4076765589 -0.0958032516
-0.0104884243 -0.4076643971 -0.0684152223
-0.0096498553 -0.4147381916 -0.1094902040
-0.0089314617 -0.4358987659 -0.0957750024
-0.0101289616 -0.4076765589 -0.0958032516
-0.0079737809 -0.4711582817 -0.0546576468
-0.0101294934 -0.4288128095 -0.0273119913
-0.0091712808 -0.4429360748 -0.0546858960
-0.0090516372 -0.4499855456 -0.0409848190
-0.0096503871 -0.4358744421 -0.0409989437
-0.0089319935 -0.4570350164 -0.0272837421
-0.0100098498 -0.4358622802 -0.0136109143
-0.0090516372 -0.4499855456 -0.0409848190
-0.0082130681 -0.4570593401 -0.0820598008
-0.0070155682 -0.4852815470 -0.0820315515
-0.0074946746 -0.4782199143 -0.0683445992
-0.0071352119 -0.4782320762 -0.0957326285
-0.0091712808 -0.4429360748 -0.0546858960
-0.0092909244 -0.4358866040 -0.0683869730
-0.0086921745 -0.4499977074 -0.0683728484
-0.0128476719 -0.4996537587 0.0000765432
-0.0182001374 -0.4999513525 0.0000064253
-0.0108903646 -0.4994806380 0.0548876609
-0.0128476719 -0.4996537587 0.0000765432
-0.0074952064 -0.4993561649 0.0001466612
-0.0148049793 -0.4998268793 -0.0547345745
-0.0177545523 0.3308538521 0.1037809113
-0.0182706245 0.2642798446 0.1038037006
-0.0177545523 0.3308538521 0.1037809113
-0.0231868076 0.3308316886 0.1037096238
-0.0208151384 0.4154047626 0.1037031962
-0.0201262215 0.2462807781 0.1037873389
-0.0153828830 0.4154269260 0.1037744837
-0.0208151384 0.4154047626 0.1037031962
-0.0196293037 0.4576912996 0.1036999824
-0.0219576860 0.3307901032 0.0100609121
-0.0209986668 0.2462073182 -0.0367213724
-0.0222277884 0.2462489037 0.0569273393
-0.0217482788 0.2039575112 0.0335361971
-0.0216132276 0.2462281109 0.0101029834
-0.0219880336 0.2251032074 0.0452317682
-0.0216807532 0.2250928111 0.0218195902
-0.0219205080 0.2462385073 0.0335151614
-0.0213734728 0.2250824147 -0.0015925877
-0.0213059472 0.2462177146 -0.0133091945
-0.0216807532 0.2250928111 0.0218195902
-0.0223628396 0.2039783039 0.0803605529
-0.0221230848 0.1828326077 0.0686649818
-0.0220555592 0.2039679075 0.0569483750
-0.0224303652 0.1828430040 0.0920771597
-0.0222953140 0.2251136038 0.0686439461
-0.0220555592 0.2039679075 0.0569483750
-0.0219880336 0.2251032074 0.0452317682
-0.0214781764 0.2884987107 -0.0133302302
-0.0220927372 0.2885195034 0.0334941257
-0.0218529824 0.2673738072 0.0217985546
-0.0217854568 0.2885091071 0.0100819478
-0.0221602628 0.2673842035 0.0452107325
-0.0217179312 0.3096444069 -0.0016346591
-0.0220252116 0.3096548033 0.0217775189
-0.0217854568 0.2885091071 0.0100819478
-0.0216132276 0.2462281109 0.0101029834
-0.0215457020 0.2673634108 -0.0016136234
-0.0213059472 0.2462177146 -0.0133091945
-0.0212384216 0.2673530145 -0.0250258013
-0.0218529824 0.2673738072 0.0217985546
-0.0219205080 0.2462385073 0.0335151614
-0.0215457020 0.2673634108 -0.0016136234
-0.0212687692 0.1616661187 0.0101450548
-0.0211337180 0.2039367185 -0.0132881588
-0.0206542084 0.1616453260 -0.0366793011
-0.0205866828 0.1827806259 -0.0483959079
-0.0208939632 0.1827910222 -0.0249837299
-0.0203469279 0.1616349296 -0.0600914790
-0.0212012436 0.1828014186 -0.0015715520
-0.0209614888 0.1616557223 -0.0132671231
-0.0208939632 0.1827910222 -0.0249837299
-0.0205191571 0.2039159257 -0.0601125147
-0.0207589120 0.2250616220 -0.0484169436
-0.0210661924 0.2250720183 -0.0250047656
-0.0208264376 0.2039263221 -0.0367003368
-0.0205866828 0.1827806259 -0.0483959079
-0.0202794023 0.1827702295 -0.0718080858
-0.0208264376 0.2039263221 -0.0367003368
-0.0217482788 0.2039575112 0.0335361971
-0.0218833300 0.1616869114 0.0569694107
-0.0218158044 0.1828222113 0.0452528039
-0.0215760496 0.1616765151 0.0335572327
-0.0215085240 0.1828118149 0.0218406259
-0.0221230848 0.1828326077 0.0686649818
-0.0221906104 0.1616973078 0.0803815886
-0.0218158044 0.1828222113 0.0452528039
-0.0211337180 0.2039367185 -0.0132881588
-0.0213734728 0.2250824147 -0.0015925877
-0.0214409984 0.2039471148 0.0101240191
-0.0210661924 0.2250720183 -0.0250047656
-0.0212012436 0.1828014186 -0.0015715520
-0.0214409984 0.2039471148 0.0101240191
-0.0215085240 0.1828118149 0.0218406259
-0.0207285644 0.3307485177 -0.0835877997
-0.0216875836 0.4153313027 -0.0368055152
-0.0212080740 0.3730399102 -0.0601966574
-0.0218226348 0.3730607029 -0.0133723015
-0.0215828800 0.3519150067 -0.0250678727
-0.0215153544 0.3730503066 -0.0367844795
-0.0218901604 0.3519254031 -0.0016556947
-0.0217551092 0.3941960028 -0.0250889084
-0.0215153544 0.3730503066 -0.0367844795
-0.0214478288 0.3941856065 -0.0485010863
-0.0213431252 0.3307693105 -0.0367634438
-0.0209683192 0.3518942140 -0.0718922285
-0.0212755996 0.3519046103 -0.0484800506
-0.0210358448 0.3307589141 -0.0601756217
-0.0215828800 0.3519150067 -0.0250678727
-0.0216504056 0.3307797068 -0.0133512659
-0.0212755996 0.3519046103 -0.0484800506
-0.0210730228 0.4153105100 -0.0836298710
-0.0215525324 0.4576019025 -0.0602387288
-0.0213127776 0.4364562062 -0.0719342999
-0.0216200580 0.4364666026 -0.0485221220
-0.0213803032 0.4153209063 -0.0602176931
-0.0212452520 0.4575915061 -0.0836509067
-0.0214850068 0.4787372023 -0.0719553356
-0.0213127776 0.4364562062 -0.0719342999
-0.0212080740 0.3730399102 -0.0601966574
-0.0209007936 0.3730295139 -0.0836088353
-0.0211405484 0.3941752101 -0.0719132642
-0.0209683192 0.3518942140 -0.0718922285
-0.0214478288 0.3941856065 -0.0485010863
-0.0211405484 0.3941752101 -0.0719132642
-0.0213803032 0.4153209063 -0.0602176931
-0.0209986668 0.2462073182 -0.0367213724
-0.0203841059 0.2461865255 -0.0835457283
-0.0208636156 0.2884779180 -0.0601545860
-0.0206238608 0.2673322217 -0.0718501572
-0.0209311412 0.2673426181 -0.0484379792
-0.0206913864 0.2461969219 -0.0601335504
-0.0205563351 0.2884675216 -0.0835667640
-0.0207960900 0.3096132179 -0.0718711929
-0.0206238608 0.2673322217 -0.0718501572
-0.0205191571 0.2039159257 -0.0601125147
-0.0202118767 0.2039055294 -0.0835246926
-0.0204516315 0.2250512256 -0.0718291215
-0.0202794023 0.1827702295 -0.0718080858
-0.0204516315 0.2250512256 -0.0718291215
-0.0206913864 0.2461969219 -0.0601335504
-0.0207589120 0.2250616220 -0.0484169436
-0.0214781764 0.2884987107 -0.0133302302
-0.0208636156 0.2884779180 -0.0601545860
-0.0211033704 0.3096236142 -0.0484590149
-0.0211708960 0.2884883143 -0.0367424081
-0.0207960900 0.3096132179 -0.0718711929
-0.0209311412 0.2673426181 -0.0484379792
-0.0211708960 0.2884883143 -0.0367424081
-0.0212384216 0.2673530145 -0.0250258013
-0.0213431252 0.3307693105 -0.0367634438
-0.0217179312 0.3096444069 -0.0016346591
-0.0214106508 0.3096340106 -0.0250468370
-0.0216504056 0.3307797068 -0.0133512659
-0.0211033704 0.3096236142 -0.0484590149
-0.0210358448 0.3307589141 -0.0601756217
-0.0214106508 0.3096340106 -0.0250468370
-0.0219576860 0.3307901032 0.0100609121
-0.0229167052 0.4153728881 0.0568431966
-0.0216875836 0.4153313027 -0.0368055152
-0.0221670932 0.4576226952 -0.0134143729
-0.0223021444 0.4153520954 0.0100188407
-0.0222346188 0.4364873953 -0.0016977661
-0.0219948640 0.4153416991 -0.0133933372
-0.0219273384 0.4364769989 -0.0251099440
-0.0225418992 0.4364977917 0.0217144118
-0.0226094248 0.4153624918 0.0334310186
-0.0222346188 0.4364873953 -0.0016977661
-0.0215525324 0.4576019025 -0.0602387288
-0.0217922872 0.4787475987 -0.0485431577
-0.0218598128 0.4576122988 -0.0368265508
-0.0214850068 0.4787372023 -0.0719553356
-0.0216200580 0.4364666026 -0.0485221220
-0.0218598128 0.4576122988 -0.0368265508
-0.0219273384 0.4364769989 -0.0251099440
-0.0218226348 0.3730607029 -0.0133723015
-0.0223021444 0.4153520954 0.0100188407
-0.0223696700 0.3942167955 0.0217354475
-0.0220623896 0.3942063992 -0.0016767304
-0.0226094248 0.4153624918 0.0334310186
-0.0220623896 0.3942063992 -0.0016767304
-0.0217551092 0.3941960028 -0.0250889084
-0.0219948640 0.4153416991 -0.0133933372
-0.0224371956 0.3730814957 0.0334520543
-0.0218901604 0.3519254031 -0.0016556947
-0.0221299152 0.3730710993 0.0100398764
-0.0221974408 0.3519357994 0.0217564832
-0.0223696700 0.3942167955 0.0217354475
-0.0226769504 0.3942271919 0.0451476254
-0.0221299152 0.3730710993 0.0100398764
-0.0226466028 0.4999140877 0.0099767693
-0.0227816540 0.4576434879 0.0334099830
-0.0232611636 0.4999348804 0.0568011252
-0.0233286892 0.4787995805 0.0685177320
-0.0230214088 0.4787891841 0.0451055541
-0.0235684440 0.4999452767 0.0802133031
-0.0230214088 0.4787891841 0.0451055541
-0.0227141284 0.4787787878 0.0216933762
-0.0229538832 0.4999244840 0.0333889473
-0.0233962148 0.4576642806 0.0802343388
-0.0231564600 0.4365185844 0.0685387677
-0.0228491796 0.4365081880 0.0451265898
-0.0230889344 0.4576538843 0.0568221609
-0.0233286892 0.4787995805 0.0685177320
-0.0236359696 0.4788099769 0.0919299100
-0.0230889344 0.4576538843 0.0568221609
-0.0221670932 0.4576226952 -0.0134143729
-0.0220320420 0.4998932949 -0.0368475865
-0.0224068480 0.4787683914 -0.0017188018
-0.0220995676 0.4787579951 -0.0251309797
-0.0223393224 0.4999036913 -0.0134354086
-0.0217922872 0.4787475987 -0.0485431577
-0.0217247616 0.4998828986 -0.0602597645
-0.0220995676 0.4787579951 -0.0251309797
-0.0227816540 0.4576434879 0.0334099830
-0.0225418992 0.4364977917 0.0217144118
-0.0224743736 0.4576330915 0.0099978050
-0.0228491796 0.4365081880 0.0451265898
-0.0224068480 0.4787683914 -0.0017188018
-0.0227141284 0.4787787878 0.0216933762
-0.0224743736 0.4576330915 0.0099978050
-0.0231868076 0.3308316886 0.1037096238
-0.0222277884 0.2462489037 0.0569273393
-0.0227072980 0.2885402961 0.0803184816
-0.0220927372 0.2885195034 0.0334941257
-0.0223324920 0.3096651997 0.0451896968
-0.0224000176 0.2885298998 0.0569063036
-0.0220252116 0.3096548033 0.0217775189
-0.0221602628 0.2673842035 0.0452107325
-0.0224000176 0.2885298998 0.0569063036
-0.0224675432 0.2673945999 0.0686229104
-0.0225722468 0.3308108959 0.0568852679
-0.0226397724 0.3096755960 0.0686018747
-0.0228795272 0.3308212923 0.0802974459
-0.0229470528 0.3096859924 0.0920140527
-0.0223324920 0.3096651997 0.0451896968
-0.0222649664 0.3308004995 0.0334730900
-0.0226397724 0.3096755960 0.0686018747
-0.0228423492 0.2462696964 0.1037516952
-0.0223628396 0.2039783039 0.0803605529
-0.0222953140 0.2251136038 0.0686439461
-0.0225350688 0.2462593000 0.0803395172
-0.0226025944 0.2251240001 0.0920561240
-0.0226701200 0.2039887003 0.1037727309
-0.0224303652 0.1828430040 0.0920771597
-0.0226025944 0.2251240001 0.0920561240
-0.0227072980 0.2885402961 0.0803184816
-0.0230145784 0.2885506925 0.1037306595
-0.0227748236 0.2674049963 0.0920350884
-0.0229470528 0.3096859924 0.0920140527
-0.0224675432 0.2673945999 0.0686229104
-0.0227748236 0.2674049963 0.0920350884
-0.0225350688 0.2462593000 0.0803395172
-0.0229167052 0.4153728881 0.0568431966
-0.0235312660 0.4153936809 0.1036675524
-0.0230517564 0.3731022884 0.0802764102
-0.0229842308 0.3942375883 0.0685598034
-0.0232239856 0.4153832845 0.0802553745
-0.0232915112 0.3942479846 0.0919719813
-0.0233590368 0.3731126847 0.1036885881
-0.0231192820 0.3519669885 0.0919930170
-0.0232915112 0.3942479846 0.0919719813
-0.0233962148 0.4576642806 0.0802343388
-0.0237034952 0.4576746770 0.1036465168
-0.0234637404 0.4365289807 0.0919509456
-0.0236359696 0.4788099769 0.0919299100
-0.0231564600 0.4365185844 0.0685387677
-0.0234637404 0.4365289807 0.0919509456
-0.0232239856 0.4153832845 0.0802553745
-0.0224371956 0.3730814957 0.0334520543
-0.0230517564 0.3731022884 0.0802764102
-0.0228120016 0.3519565921 0.0685808391
-0.0227444760 0.3730918920 0.0568642323
-0.0231192820 0.3519669885 0.0919930170
-0.0229842308 0.3942375883 0.0685598034
-0.0227444760 0.3730918920 0.0568642323
-0.0226769504 0.3942271919 0.0451476254
-0.0225722468 0.3308108959 0.0568852679
-0.0225047212 0.3519461958 0.0451686611
-0.0222649664 0.3308004995 0.0334730900
-0.0221974408 0.3519357994 0.0217564832
-0.0228120016 0.3519565921 0.0685808391
-0.0228795272 0.3308212923 0.0802974459
-0.0225047212 0.3519461958 0.0451686611
-0.0174000060 0.3640285778 -0.0835588912
-0.0124838229 0.2974767338 -0.0834648144
-0.0194087436 0.4319505400 -0.0836154168
-0.0165012980 0.4333206582 -0.0835778656
-0.0110690427 0.4333428216 -0.0835065781
-0.0135271343 0.4666187436 -0.0835536165
-0.0207285644 0.3307485177 -0.0835877997
-0.0203841059 0.2461865255 -0.0835457283
-0.0174000060 0.3640285778 -0.0835588912
-0.0179402108 0.1949461788 0.0101739632
-0.0146116525 0.2282262389 0.0102028717
-0.0156613708 0.2115654161 -0.0366359384
-0.0151365117 0.2198958275 -0.0132165334
-0.0168007908 0.2032557975 -0.0132309876
-0.0165383612 0.2074210031 -0.0015212851
-0.0139970917 0.2282054462 -0.0366214842
-0.0145219508 0.2198750348 -0.0600408893
-0.0151365117 0.2198958275 -0.0132165334
-0.0168904925 0.2116070016 0.0570127733
-0.0152262133 0.2282470316 0.0570272275
-0.0157510725 0.2199166202 0.0336078225
-0.0163656333 0.2199374129 0.0804321783
-0.0157510725 0.2199166202 0.0336078225
-0.0168456417 0.2074313995 0.0218908929
-0.0174153516 0.2032765902 0.0335933683
-0.0189899292 0.1782853560 -0.0366648469
-0.0156613708 0.2115654161 -0.0366359384
-0.0161862300 0.2032350047 -0.0600553435
-0.0175880796 0.1907601804 -0.0483600952
-0.0145219508 0.2198750348 -0.0600408893
-0.0184650700 0.1866157674 -0.0132454418
-0.0168007908 0.2032557975 -0.0132309876
-0.0170632204 0.1990905918 -0.0249406901
-0.0161862300 0.2032350047 -0.0600553435
-0.0167110892 0.1949045934 -0.0834747485
-0.0181129388 0.1824297690 -0.0717795002
-0.0147843804 0.2157098291 -0.0717505918
-0.0195147884 0.1699549446 -0.0600842519
-0.0175880796 0.1907601804 -0.0483600952
-0.0181129388 0.1824297690 -0.0717795002
-0.0179402108 0.1949461788 0.0101739632
-0.0212687692 0.1616661187 0.0101450548
-0.0202190508 0.1783269415 0.0569838649
-0.0207439100 0.1699965301 0.0335644598
-0.0190796308 0.1866365601 0.0335789141
-0.0193420604 0.1824713544 0.0218692115
-0.0218833300 0.1616869114 0.0569694107
-0.0213584708 0.1700173228 0.0803888157
-0.0207439100 0.1699965301 0.0335644598
-0.0189899292 0.1782853560 -0.0366648469
-0.0206542084 0.1616453260 -0.0366793011
-0.0201293492 0.1699757374 -0.0132598960
-0.0195147884 0.1699549446 -0.0600842519
-0.0184650700 0.1866157674 -0.0132454418
-0.0201293492 0.1699757374 -0.0132598960
-0.0198669196 0.1741409431 -0.0015501935
-0.0202190508 0.1783269415 0.0569838649
-0.0180299125 0.2032973829 0.0804177241
-0.0213584708 0.1700173228 0.0803888157
-0.0202639016 0.1825025435 0.0921057453
-0.0191244816 0.1908121622 0.0687007945
-0.0191693325 0.1949877642 0.1038226750
-0.0169353433 0.2157826036 0.0921346538
-0.0202639016 0.1825025435 0.0921057453
-0.0168904925 0.2116070016 0.0570127733
-0.0190796308 0.1866365601 0.0335789141
-0.0179850616 0.1991217808 0.0452958437
-0.0174153516 0.2032765902 0.0335933683
-0.0180299125 0.2032973829 0.0804177241
-0.0163656333 0.2199374129 0.0804321783
-0.0191244816 0.1908121622 0.0687007945
-0.0137129445 0.2975183192 0.0101838973
-0.0128142365 0.3668103995 0.0101649230
-0.0126490297 0.3321435666 -0.0366499457
-0.0132635905 0.3321643594 0.0101744102
-0.0127316331 0.3494769831 -0.0132425113
-0.0129563101 0.3321539630 -0.0132377678
-0.0130389135 0.3494873794 0.0101696666
-0.0131809871 0.3148309429 -0.0132330242
-0.0134882675 0.3148413393 0.0101791538
-0.0129563101 0.3321539630 -0.0132377678
-0.0121996757 0.3667896068 -0.0366594328
-0.0121170723 0.3494561904 -0.0600668672
-0.0124243527 0.3494665867 -0.0366546893
-0.0118923953 0.3667792104 -0.0600716108
-0.0127316331 0.3494769831 -0.0132425113
-0.0125069561 0.3668000032 -0.0132472549
-0.0124243527 0.3494665867 -0.0366546893
-0.0138781513 0.3321851521 0.0569987660
-0.0134287973 0.3668311922 0.0569892789
-0.0133461939 0.3494977758 0.0335818445
-0.0136534743 0.3495081722 0.0569940225
-0.0131215169 0.3668207959 0.0335771010
-0.0139607547 0.3495185685 0.0804062004
-0.0137360777 0.3668415886 0.0804014568
-0.0136534743 0.3495081722 0.0569940225
-0.0132635905 0.3321643594 0.0101744102
-0.0137955479 0.3148517356 0.0335913317
-0.0135708709 0.3321747557 0.0335865881
-0.0134882675 0.3148413393 0.0101791538
-0.0133461939 0.3494977758 0.0335818445
-0.0130389135 0.3494873794 0.0101696666
-0.0135708709 0.3321747557 0.0335865881
-0.0124838229 0.2974767338 -0.0834648144
-0.0135477377 0.2628514863 -0.0366309714
-0.0130983837 0.2974975265 -0.0366404585
-0.0130157803 0.2801641100 -0.0600478929
-0.0133230607 0.2801745064 -0.0366357150
-0.0127911033 0.2974871301 -0.0600526365
-0.0136303411 0.2801849028 -0.0132235370
-0.0134056641 0.2975079228 -0.0132282806
-0.0133230607 0.2801745064 -0.0366357150
-0.0129331769 0.2628306936 -0.0834553272
-0.0134651343 0.2455180699 -0.0600384057
-0.0132404573 0.2628410900 -0.0600431493
-0.0131578539 0.2455076735 -0.0834505837
-0.0130157803 0.2801641100 -0.0600478929
-0.0127084999 0.2801537137 -0.0834600708
-0.0132404573 0.2628410900 -0.0600431493
-0.0126490297 0.3321435666 -0.0366499457
-0.0120344689 0.3321227739 -0.0834743016
-0.0125664263 0.3148101502 -0.0600573800
-0.0123417493 0.3321331703 -0.0600621236
-0.0122591459 0.3147997538 -0.0834695580
-0.0121170723 0.3494561904 -0.0600668672
-0.0118097919 0.3494457940 -0.0834790451
-0.0123417493 0.3321331703 -0.0600621236
-0.0130983837 0.2974975265 -0.0366404585
-0.0131809871 0.3148309429 -0.0132330242
-0.0128737067 0.3148205466 -0.0366452021
-0.0134056641 0.2975079228 -0.0132282806
-0.0125664263 0.3148101502 -0.0600573800
-0.0127911033 0.2974871301 -0.0600526365
-0.0128737067 0.3148205466 -0.0366452021
-0.0137129445 0.2975183192 0.0101838973
-0.0146116525 0.2282262389 0.0102028717
-0.0147768593 0.2628930718 0.0570177404
-0.0141622985 0.2628722790 0.0101933845
-0.0146942559 0.2455596553 0.0336103060
-0.0144695789 0.2628826754 0.0336055624
-0.0143869755 0.2455492590 0.0101981281
-0.0142449019 0.2802056955 0.0336008189
-0.0139376215 0.2801952991 0.0101886409
-0.0144695789 0.2628826754 0.0336055624
-0.0152262133 0.2282470316 0.0570272275
-0.0153088167 0.2455804480 0.0804346619
-0.0150015363 0.2455700517 0.0570224839
-0.0155334937 0.2282574280 0.0804394055
-0.0146942559 0.2455596553 0.0336103060
-0.0149189329 0.2282366352 0.0336150496
-0.0150015363 0.2455700517 0.0570224839
-0.0135477377 0.2628514863 -0.0366309714
-0.0139970917 0.2282054462 -0.0366214842
-0.0140796951 0.2455388626 -0.0132140499
-0.0137724147 0.2455284662 -0.0366262278
-0.0143043721 0.2282158425 -0.0132093063
-0.0134651343 0.2455180699 -0.0600384057
-0.0136898113 0.2281950498 -0.0600336621
-0.0137724147 0.2455284662 -0.0366262278
-0.0141622985 0.2628722790 0.0101933845
-0.0136303411 0.2801849028 -0.0132235370
-0.0138550181 0.2628618827 -0.0132187934
-0.0139376215 0.2801952991 0.0101886409
-0.0140796951 0.2455388626 -0.0132140499
-0.0143869755 0.2455492590 0.0101981281
-0.0138550181 0.2628618827 -0.0132187934
-0.0149420661 0.2975599046 0.1038326091
-0.0138781513 0.3321851521 0.0569987660
-0.0143275053 0.2975391119 0.0570082532
-0.0144101087 0.3148725284 0.0804156876
-0.0141028283 0.3148621320 0.0570035096
-0.0146347857 0.2975495083 0.0804204311
-0.0137955479 0.3148517356 0.0335913317
-0.0140202249 0.2975287156 0.0335960753
-0.0141028283 0.3148621320 0.0570035096
-0.0144927121 0.3322059448 0.1038231219
-0.0139607547 0.3495185685 0.0804062004
-0.0141854317 0.3321955484 0.0804109440
-0.0142680351 0.3495289649 0.1038183783
-0.0144101087 0.3148725284 0.0804156876
-0.0147173891 0.3148829247 0.1038278655
-0.0141854317 0.3321955484 0.0804109440
-0.0147768593 0.2628930718 0.0570177404
-0.0153914201 0.2629138645 0.1038420962
-0.0148594627 0.2802264882 0.0804251747
-0.0150841397 0.2629034681 0.0804299183
-0.0151667431 0.2802368846 0.1038373527
-0.0153088167 0.2455804480 0.0804346619
-0.0156160971 0.2455908444 0.1038468398
-0.0150841397 0.2629034681 0.0804299183
-0.0143275053 0.2975391119 0.0570082532
-0.0142449019 0.2802056955 0.0336008189
-0.0145521823 0.2802160918 0.0570129968
-0.0140202249 0.2975287156 0.0335960753
-0.0148594627 0.2802264882 0.0804251747
-0.0146347857 0.2975495083 0.0804204311
-0.0145521823 0.2802160918 0.0570129968
-0.0122981643 0.4333844070 0.0101421337
-0.0117820921 0.4999584146 0.0101193443
-0.0114255674 0.4666506181 -0.0366936169
-0.0120401282 0.4666714108 0.0101307390
-0.0116038298 0.4833045163 -0.0132871363
-0.0117328478 0.4666610144 -0.0132814389
-0.0119111102 0.4833149127 0.0101250416
-0.0118618659 0.4500175126 -0.0132757416
-0.0121691463 0.4500279089 0.0101364363
-0.0117328478 0.4666610144 -0.0132814389
-0.0111675313 0.4999376218 -0.0367050116
-0.0109892690 0.4832837236 -0.0601114922
-0.0112965494 0.4832941200 -0.0366993142
-0.0108602509 0.4999272255 -0.0601171895
-0.0116038298 0.4833045163 -0.0132871363
-0.0114748117 0.4999480182 -0.0132928336
-0.0112965494 0.4832941200 -0.0366993142
-0.0126546890 0.4666922035 0.0569550949
-0.0123966530 0.4999792073 0.0569437002
-0.0122183906 0.4833253090 0.0335372196
-0.0125256710 0.4833357054 0.0569493975
-0.0120893725 0.4999688109 0.0335315222
-0.0128329514 0.4833461018 0.0803615754
-0.0127039334 0.4999896036 0.0803558781
-0.0125256710 0.4833357054 0.0569493975
-0.0120401282 0.4666714108 0.0101307390
-0.0124764267 0.4500383053 0.0335486143
-0.0123474086 0.4666818072 0.0335429169
-0.0121691463 0.4500279089 0.0101364363
-0.0122183906 0.4833253090 0.0335372196
-0.0119111102 0.4833149127 0.0101250416
-0.0123474086 0.4666818072 0.0335429169
-0.0110690427 0.4333428216 -0.0835065781
-0.0119416396 0.4000766106 -0.0366708275
-0.0116836035 0.4333636143 -0.0366822222
-0.0115053411 0.4167097161 -0.0600887028
-0.0118126216 0.4167201124 -0.0366765249
-0.0113763231 0.4333532180 -0.0600944001
-0.0121199020 0.4167305088 -0.0132643469
-0.0119908839 0.4333740107 -0.0132700443
-0.0118126216 0.4167201124 -0.0366765249
-0.0113270788 0.4000558178 -0.0834951834
-0.0117633772 0.3834227123 -0.0600773081
-0.0116343592 0.4000662142 -0.0600830055
-0.0114560968 0.3834123160 -0.0834894861
-0.0115053411 0.4167097161 -0.0600887028
-0.0111980607 0.4166993197 -0.0835008807
-0.0116343592 0.4000662142 -0.0600830055
-0.0114255674 0.4666506181 -0.0366936169
-0.0108110066 0.4666298254 -0.0835179728
-0.0112473051 0.4499967198 -0.0601000975
-0.0111182870 0.4666402217 -0.0601057948
-0.0109400246 0.4499863235 -0.0835122754
-0.0109892690 0.4832837236 -0.0601114922
-0.0106819885 0.4832733272 -0.0835236701
-0.0111182870 0.4666402217 -0.0601057948
-0.0116836035 0.4333636143 -0.0366822222
-0.0118618659 0.4500175126 -0.0132757416
-0.0115545855 0.4500071162 -0.0366879195
-0.0119908839 0.4333740107 -0.0132700443
-0.0112473051 0.4499967198 -0.0601000975
-0.0113763231 0.4333532180 -0.0600944001
-0.0115545855 0.4500071162 -0.0366879195
-0.0122981643 0.4333844070 0.0101421337
-0.0128142365 0.3668103995 0.0101649230
-0.0131707612 0.4001181960 0.0569778842
-0.0125562004 0.4000974033 0.0101535283
-0.0129924989 0.3834642978 0.0335714036
-0.0128634808 0.4001077996 0.0335657063
-0.0126852185 0.3834539014 0.0101592257
-0.0127344628 0.4167513015 0.0335600089
-0.0124271824 0.4167409052 0.0101478310
-0.0128634808 0.4001077996 0.0335657063
-0.0134287973 0.3668311922 0.0569892789
-0.0136070597 0.3834850905 0.0803957595
-0.0132997793 0.3834746941 0.0569835816
-0.0137360777 0.3668415886 0.0804014568
-0.0129924989 0.3834642978 0.0335714036
-0.0131215169 0.3668207959 0.0335771010
-0.0132997793 0.3834746941 0.0569835816
-0.0119416396 0.4000766106 -0.0366708275
-0.0121996757 0.3667896068 -0.0366594328
-0.0123779381 0.3834435050 -0.0132529523
-0.0120706576 0.3834331087 -0.0366651302
-0.0125069561 0.3668000032 -0.0132472549
-0.0117633772 0.3834227123 -0.0600773081
-0.0118923953 0.3667792104 -0.0600716108
-0.0120706576 0.3834331087 -0.0366651302
-0.0125562004 0.4000974033 0.0101535283
-0.0121199020 0.4167305088 -0.0132643469
-0.0122489200 0.4000870069 -0.0132586496
-0.0124271824 0.4167409052 0.0101478310
-0.0123779381 0.3834435050 -0.0132529523
-0.0126852185 0.3834539014 0.0101592257
-0.0122489200 0.4000870069 -0.0132586496
-0.0135272860 0.4334259925 0.1037908454
-0.0126546890 0.4666922035 0.0569550949
-0.0129127251 0.4334051998 0.0569664895
-0.0130909875 0.4500590980 0.0803729701
-0.0127837071 0.4500487016 0.0569607922
-0.0132200055 0.4334155961 0.0803786675
-0.0124764267 0.4500383053 0.0335486143
-0.0126054447 0.4333948034 0.0335543116
-0.0127837071 0.4500487016 0.0569607922
-0.0132692499 0.4667129962 0.1037794507
-0.0128329514 0.4833461018 0.0803615754
-0.0129619695 0.4667025999 0.0803672728
-0.0131402318 0.4833564981 0.1037737534
-0.0130909875 0.4500590980 0.0803729701
-0.0133982679 0.4500694944 0.1037851481
-0.0129619695 0.4667025999 0.0803672728
-0.0131707612 0.4001181960 0.0569778842
-0.0137853220 0.4001389887 0.1038022401
-0.0133490236 0.4167720942 0.0803843648
-0.0134780416 0.4001285924 0.0803900621
-0.0136563040 0.4167824906 0.1037965427
-0.0136070597 0.3834850905 0.0803957595
-0.0139143401 0.3834954868 0.1038079374
-0.0134780416 0.4001285924 0.0803900621
-0.0129127251 0.4334051998 0.0569664895
-0.0127344628 0.4167513015 0.0335600089
-0.0130417432 0.4167616979 0.0569721869
-0.0126054447 0.4333948034 0.0335543116
-0.0133490236 0.4167720942 0.0803843648
-0.0132200055 0.4334155961 0.0803786675
-0.0130417432 0.4167616979 0.0569721869
-0.0172143475 0.4999362511 0.0100480568
-0.0226466028 0.4999140877 0.0099767693
-0.0138836590 0.4999265401 -0.0367406553
-0.0172143475 0.4999362511 0.0100480568
-0.0117820921 0.4999584146 0.0101193443
-0.0205450359 0.4999459621 0.0568367690
3 334 333 331
3 331 332 334
3 332 331 310
3 310 311 332
3 311 310 439
3 439 440 311
3 440 439 414
3 414 415 440
3 415 414 98
3 98 99 415
3 99 98 189
3 189 190 99
3 190 189 412
3 412 413 190
3 413 412 238
3 238 239 413
3 90 314 379
3 314 312 379
3 312 86 379
3 86 430 379
3 430 80 379
3 80 88 379
3 88 396 379
3 396 92 111
3 92 84 189
3 84 400 189
3 400 398 189
3 398 308 189
3 308 373 371
3 373 100 371
3 371 375 308
3 375 78 379
3 78 381 102
3 381 385 102
3 385 96 102
3 102 383 379
3 383 394 379
3 379 82 90
3 37 39 414
3 39 455 98
3 455 94 189
3 94 418 189
3 418 350 92
3 350 111 92
3 111 156 396
3 156 15 396
3 15 37 379
3 331 333 379
3 333 238 308
3 238 412 308
3 412 189 308
3 189 98 455
3 98 414 39
3 414 439 37
3 439 310 37
3 310 331 379
3 396 15 379
3 78 102 379
3 37 310 379
3 333 375 379
3 333 308 375
3 189 418 92
3 38 37 15
3 15 16 38
3 16 15 156
3 156 157 16
3 157 156 111
3 111 112 157
3 112 111 350
3 350 351 112
3 351 350 418
3 418 419 351
3 419 418 94
3 94 95 419
3 95 94 455
3 455 456 95
3 456 455 39
3 39 40 456
3 40 39 37
3 37 38 40
3 379 380 83
3 83 82 379
3 394 395 380
3 380 379 394
3 383 384 395
3 395 394 383
3 102 103 384
3 384 383 102
3 96 97 103
3 103 102 96
3 385 386 97
3 97 96 385
3 381 382 386
3 386 385 381
3 78 79 382
3 382 381 78
3 375 376 79
3 79 78 375
3 371 372 376
3 376 375 371
3 100 101 372
3 372 371 100
3 373 374 101
3 101 100 373
3 308 309 374
3 374 373 308
3 398 399 309
3 309 308 398
3 400 401 399
3 399 398 400
3 84 85 401
3 401 400 84
3 92 93 85
3 85 84 92
3 396 397 93
3 93 92 396
3 88 89 397
3 397 396 88
3 80 81 89
3 89 88 80
3 430 431 81
3 81 80 430
3 86 87 431
3 431 430 86
3 312 313 87
3 87 86 312
3 314 315 313
3 313 312 314
3 90 91 315
3 315 314 90
3 82 83 91
3 91 90 82
3 239 238 333
3 333 334 239
3 395 384 83
3 384 103 83
3 103 97 83
3 97 386 83
3 386 382 83
3 382 79 83
3 79 376 239
3 376 372 413
3 372 101 419
3 101 374 419
3 374 309 419
3 309 399 419
3 399 401 93
3 401 85 93
3 93 397 157
3 397 89 313
3 89 81 313
3 81 431 87
3 87 313 81
3 313 315 397
3 315 91 83
3 83 380 395
3 16 157 83
3 157 112 399
3 112 351 399
3 351 419 399
3 419 95 415
3 95 456 440
3 456 40 311
3 40 38 311
3 38 16 83
3 311 440 456
3 440 415 95
3 415 99 419
3 99 190 419
3 190 413 372
3 413 239 376
3 239 334 79
3 334 332 79
3 332 311 83
3 79 332 83
3 157 397 315
3 157 315 83
3 157 399 93
3 419 190 372
3 311 38 83
3 422 423 421
3 421 420 422
3 420 421 188
3 188 187 420
3 187 188 42
3 42 41 187
3 41 42 475
3 475 474 41
3 474 475 483
3 483 482 474
3 482 483 292
3 292 291 482
3 291 292 275
3 275 274 291
3 274 275 148
3 148 147 274
3 169 198 231
3 198 196 231
3 196 165 231
3 165 378 231
3 378 159 231
3 159 167 231
3 167 450 231
3 450 479 200
3 479 163 292
3 163 454 292
3 454 452 292
3 452 186 292
3 186 427 425
3 427 192 425
3 425 429 186
3 429 473 231
3 473 233 194
3 233 237 194
3 237 477 194
3 194 235 231
3 235 273 231
3 231 161 169
3 114 116 475
3 116 403 483
3 403 481 292
3 481 493 292
3 493 214 479
3 214 200 479
3 200 257 450
3 257 417 450
3 417 114 231
3 421 423 231
3 423 148 186
3 148 275 186
3 275 292 186
3 292 483 403
3 483 475 116
3 475 42 114
3 42 188 114
3 188 421 231
3 450 417 231
3 473 194 231
3 114 188 231
3 423 429 231
3 423 186 429
3 292 493 479
3 113 114 417
3 417 416 113
3 416 417 257
3 257 256 416
3 256 257 200
3 200 199 256
3 199 200 214
3 214 213 199
3 213 214 493
3 493 492 213
3 492 493 481
3 481 480 492
3 480 481 403
3 403 402 480
3 402 403 116
3 116 115 402
3 115 116 114
3 114 113 115
3 231 230 160
3 160 161 231
3 273 272 230
3 230 231 273
3 235 234 272
3 272 273 235
3 194 193 234
3 234 235 194
3 477 476 193
3 193 194 477
3 237 236 476
3 476 477 237
3 233 232 236
3 236 237 233
3 473 472 232
3 232 233 473
3 429 428 472
3 472 473 429
3 425 424 428
3 428 429 425
3 192 191 424
3 424 425 192
3 427 426 191
3 191 192 427
3 186 185 426
3 426 427 186
3 452 451 185
3 185 186 452
3 454 453 451
3 451 452 454
3 163 162 453
3 453 454 163
3 479 478 162
3 162 163 479
3 450 449 478
3 478 479 450
3 167 166 449
3 449 450 167
3 159 158 166
3 166 167 159
3 378 377 158
3 158 159 378
3 165 164 377
3 377 378 165
3 196 195 164
3 164 165 196
3 198 197 195
3 195 196 198
3 169 168 197
3 197 198 169
3 161 160 168
3 168 169 161
3 147 148 423
3 423 422 147
3 272 234 160
3 234 193 160
3 193 476 160
3 476 236 160
3 236 232 160
3 232 472 160
3 472 428 147
3 428 424 274
3 424 191 492
3 191 426 492
3 426 185 492
3 185 451 492
3 451 453 478
3 453 162 478
3 478 449 256
3 449 166 195
3 166 158 195
3 158 377 164
3 164 195 158
3 195 197 449
3 197 168 160
3 160 230 272
3 416 256 160
3 256 199 451
3 199 213 451
3 213 492 451
3 492 480 474
3 480 402 41
3 402 115 187
3 115 113 187
3 113 416 160
3 187 41 402
3 41 474 480
3 474 482 492
3 482 291 492
3 291 274 424
3 274 147 428
3 147 422 472
3 422 420 472
3 420 187 160
3 472 420 160
3 256 449 197
3 256 197 160
3 256 451 478
3 492 291 424
3 187 113 160
3 26 494 131
3 24 494 26
3 120 495 24
3 131 495 120
3 120 24 35
3 35 142 120
3 35 22 117
3 117 142 35
3 117 22 34
3 34 141 117
3 34 496 141
3 33 496 34
3 140 497 33
3 141 497 140
3 32 498 33
3 138 498 32
3 140 499 138
3 33 499 140
3 28 133 138
3 138 32 28
3 132 500 27
3 133 500 132
3 28 501 133
3 27 501 28
3 36 143 132
3 132 27 36
3 30 135 143
3 143 36 30
3 31 136 135
3 135 30 31
3 29 134 136
3 136 31 29
3 25 128 134
3 134 29 25
3 119 502 23
3 128 502 119
3 25 503 128
3 23 503 25
3 33 34 28
3 34 22 28
3 22 35 30
3 35 24 31
3 24 26 29
3 26 23 25
3 25 29 26
3 29 31 24
3 31 30 35
3 30 36 22
3 36 27 28
3 28 32 33
3 22 36 28
3 26 131 119
3 119 23 26
3 138 133 141
3 133 132 143
3 143 135 141
3 135 136 141
3 136 134 120
3 134 128 131
3 128 119 131
3 131 120 134
3 120 142 136
3 142 117 141
3 141 140 138
3 133 143 141
3 136 142 141
3 174 504 297
3 172 504 174
3 295 505 172
3 297 505 295
3 295 172 183
3 183 306 295
3 183 170 293
3 293 306 183
3 293 170 182
3 182 305 293
3 182 506 305
3 181 506 182
3 304 507 181
3 305 507 304
3 180 508 181
3 303 508 180
3 304 509 303
3 181 509 304
3 176 299 303
3 303 180 176
3 298 510 175
3 299 510 298
3 176 511 299
3 175 511 176
3 184 307 298
3 298 175 184
3 178 301 307
3 307 184 178
3 179 302 301
3 301 178 179
3 177 300 302
3 302 179 177
3 173 296 300
3 300 177 173
3 294 512 171
3 296 512 294
3 173 513 296
3 171 513 173
3 181 182 176
3 182 170 176
3 170 183 178
3 183 172 179
3 172 174 177
3 174 171 173
3 173 177 174
3 177 179 172
3 179 178 183
3 178 184 170
3 184 175 176
3 176 180 181
3 170 184 176
3 174 297 294
3 294 171 174
3 303 299 305
3 299 298 307
3 307 301 305
3 301 302 305
3 302 300 295
3 300 296 297
3 296 294 297
3 297 295 300
3 295 306 302
3 306 293 305
3 305 304 303
3 299 307 305
3 302 306 305
3 355 514 352
3 354 514 355
3 354 516 352
3 515 516 354
3 515 517 353
3 354 517 515
3 523 524 522
3 521 524 523
3 523 525 520
3 522 525 523
3 526 527 522
3 519 527 526
3 526 528 521
3 522 528 526
3 530 531 529
3 521 531 530
3 530 532 518
3 529 532 530
3 533 534 529
3 520 534 533
3 533 535 521
3 529 535 533
3 538 539 537
3 536 539 538
3 538 540 520
3 537 540 538
3 541 542 537
3 202 542 541
3 541 543 536
3 537 543 541
3 545 546 544
3 536 546 545
3 545 547 519
3 544 547 545
3 548 549 544
3 520 549 548
3 548 550 536
3 544 550 548
3 554 555 553
3 552 555 554
3 554 556 551
3 553 556 554
3 557 558 553
3 519 558 557
3 557 559 552
3 553 559 557
3 561 562 560
3 552 562 561
3 561 563 353
3 560 563 561
3 564 565 560
3 551 565 564
3 564 566 552
3 560 566 564
3 569 570 568
3 567 570 569
3 569 571 551
3 568 571 569
3 572 573 568
3 518 573 572
3 572 574 567
3 568 574 572
3 576 577 575
3 567 577 576
3 576 578 519
3 575 578 576
3 579 580 575
3 551 580 579
3 579 581 567
3 575 581 579
3 586 587 585
3 584 587 586
3 586 588 583
3 585 588 586
3 589 590 585
3 582 590 589
3 589 591 584
3 585 591 589
3 593 594 592
3 584 594 593
3 593 595 518
3 592 595 593
3 596 597 592
3 583 597 596
3 596 598 584
3 592 598 596
3 601 602 600
3 599 602 601
3 601 603 583
3 600 603 601
3 604 605 600
3 201 605 604
3 604 606 599
3 600 606 604
3 608 609 607
3 599 609 608
3 608 610 582
3 607 610 608
3 611 612 607
3 583 612 611
3 611 613 599
3 607 613 611
3 617 618 616
3 615 618 617
3 617 619 614
3 616 619 617
3 620 621 616
3 582 621 620
3 620 622 615
3 616 622 620
3 624 625 623
3 615 625 624
3 624 626 202
3 623 626 624
3 627 628 623
3 614 628 627
3 627 629 615
3 623 629 627
3 632 633 631
3 630 633 632
3 632 634 614
3 631 634 632
3 635 636 631
3 518 636 635
3 635 637 630
3 631 637 635
3 639 640 638
3 630 640 639
3 639 641 582
3 638 641 639
3 642 643 638
3 614 643 642
3 642 644 630
3 638 644 642
3 650 651 649
3 648 651 650
3 650 652 647
3 649 652 650
3 653 654 649
3 646 654 653
3 653 655 648
3 649 655 653
3 657 658 656
3 648 658 657
3 657 659 645
3 656 659 657
3 660 661 656
3 647 661 660
3 660 662 648
3 656 662 660
3 665 666 664
3 663 666 665
3 665 667 647
3 664 667 665
3 668 669 664
3 352 669 668
3 668 670 663
3 664 670 668
3 672 673 671
3 663 673 672
3 672 674 646
3 671 674 672
3 675 676 671
3 647 676 675
3 675 677 663
3 671 677 675
3 681 682 680
3 679 682 681
3 681 683 678
3 680 683 681
3 684 685 680
3 646 685 684
3 684 686 679
3 680 686 684
3 688 689 687
3 679 689 688
3 688 690 201
3 687 690 688
3 691 692 687
3 678 692 691
3 691 693 679
3 687 693 691
3 696 697 695
3 694 697 696
3 696 698 678
3 695 698 696
3 699 700 695
3 645 700 699
3 699 701 694
3 695 701 699
3 703 704 702
3 694 704 703
3 703 705 646
3 702 705 703
3 706 707 702
3 678 707 706
3 706 708 694
3 702 708 706
3 713 714 712
3 711 714 713
3 713 715 710
3 712 715 713
3 716 717 712
3 709 717 716
3 716 718 711
3 712 718 716
3 720 721 719
3 711 721 720
3 720 722 645
3 719 722 720
3 723 724 719
3 710 724 723
3 723 725 711
3 719 725 723
3 728 729 727
3 726 729 728
3 728 730 710
3 727 730 728
3 731 732 727
3 353 732 731
3 731 733 726
3 727 733 731
3 735 736 734
3 726 736 735
3 735 737 709
3 734 737 735
3 738 739 734
3 710 739 738
3 738 740 726
3 734 740 738
3 744 745 743
3 742 745 744
3 744 746 741
3 743 746 744
3 747 748 743
3 709 748 747
3 747 749 742
3 743 749 747
3 751 752 750
3 742 752 751
3 751 753 352
3 750 753 751
3 754 755 750
3 741 755 754
3 754 756 742
3 750 756 754
3 759 760 758
3 757 760 759
3 759 761 741
3 758 761 759
3 762 763 758
3 645 763 762
3 762 764 757
3 758 764 762
3 766 767 765
3 757 767 766
3 766 768 709
3 765 768 766
3 769 770 765
3 741 770 769
3 769 771 757
3 765 771 769
3 204 772 203
3 201 772 204
3 773 774 203
3 202 774 773
3 203 775 773
3 201 775 203
3 780 781 779
3 778 781 780
3 780 782 777
3 779 782 780
3 783 784 779
3 776 784 783
3 783 785 778
3 779 785 783
3 787 788 786
3 778 788 787
3 787 789 203
3 786 789 787
3 790 791 786
3 777 791 790
3 790 792 778
3 786 792 790
3 795 796 794
3 793 796 795
3 795 797 777
3 794 797 795
3 798 799 794
3 354 799 798
3 798 800 793
3 794 800 798
3 802 803 801
3 793 803 802
3 802 804 776
3 801 804 802
3 805 806 801
3 777 806 805
3 805 807 793
3 801 807 805
3 811 812 810
3 809 812 811
3 811 813 808
3 810 813 811
3 814 815 810
3 776 815 814
3 814 816 809
3 810 816 814
3 818 819 817
3 809 819 818
3 818 820 202
3 817 820 818
3 821 822 817
3 808 822 821
3 821 823 809
3 817 823 821
3 826 827 825
3 824 827 826
3 826 828 808
3 825 828 826
3 829 830 825
3 203 830 829
3 829 831 824
3 825 831 829
3 833 834 832
3 824 834 833
3 833 835 776
3 832 835 833
3 836 837 832
3 808 837 836
3 836 838 824
3 832 838 836
3 843 844 842
3 841 844 843
3 843 845 840
3 842 845 843
3 846 847 842
3 839 847 846
3 846 848 841
3 842 848 846
3 850 851 849
3 841 851 850
3 850 852 353
3 849 852 850
3 853 854 849
3 840 854 853
3 853 855 841
3 849 855 853
3 858 859 857
3 856 859 858
3 858 860 840
3 857 860 858
3 861 862 857
3 202 862 861
3 861 863 856
3 857 863 861
3 865 866 864
3 856 866 865
3 865 867 839
3 864 867 865
3 868 869 864
3 840 869 868
3 868 870 856
3 864 870 868
3 874 875 873
3 872 875 874
3 874 876 871
3 873 876 874
3 877 878 873
3 839 878 877
3 877 879 872
3 873 879 877
3 881 882 880
3 872 882 881
3 881 883 354
3 880 883 881
3 884 885 880
3 871 885 884
3 884 886 872
3 880 886 884
3 889 890 888
3 887 890 889
3 889 891 871
3 888 891 889
3 892 893 888
3 353 893 892
3 892 894 887
3 888 894 892
3 896 897 895
3 887 897 896
3 896 898 839
3 895 898 896
3 899 900 895
3 871 900 899
3 899 901 887
3 895 901 899
3 906 907 905
3 902 907 906
3 906 908 904
3 905 908 906
3 903 910 909
3 905 910 903
3 909 911 902
3 905 911 909
3 912 914 904
3 913 914 912
3 913 915 204
3 912 915 913
3 916 917 912
3 903 917 916
3 912 918 916
3 904 918 912
3 920 922 919
3 921 922 920
3 921 923 903
3 920 923 921
3 924 925 920
3 355 925 924
3 920 926 924
3 919 926 920
3 928 929 927
3 902 929 928
3 903 930 927
3 928 930 903
3 931 932 927
3 919 932 931
3 931 933 902
3 927 933 931
3 935 938 937
3 936 938 935
3 937 939 934
3 936 939 937
3 940 941 936
3 204 941 940
3 936 942 940
3 935 942 936
3 944 945 943
3 935 945 944
3 944 946 902
3 943 946 944
3 934 948 947
3 943 948 934
3 947 949 935
3 943 949 947
3 952 953 951
3 203 953 952
3 952 954 950
3 951 954 952
3 951 956 934
3 955 956 951
3 955 957 203
3 951 957 955
3 950 960 959
3 958 960 950
3 959 961 204
3 958 961 959
3 962 963 958
3 934 963 962
3 958 964 962
3 950 964 958
3 969 970 968
3 965 970 969
3 968 971 969
3 967 971 968
3 972 973 968
3 966 973 972
3 972 974 965
3 968 974 972
3 967 977 976
3 975 977 967
3 976 978 354
3 975 978 976
3 979 980 975
3 966 980 979
3 967 981 975
3 979 981 967
3 982 985 984
3 983 985 982
3 984 986 966
3 983 986 984
3 987 988 983
3 203 988 987
3 982 989 983
3 987 989 982
3 991 992 990
3 966 992 991
3 990 993 991
3 982 993 990
3 994 995 990
3 965 995 994
3 994 996 966
3 990 996 994
3 999 1001 998
3 1000 1001 999
3 1000 1002 997
3 999 1002 1000
3 1003 1004 999
3 355 1004 1003
3 998 1005 999
3 1003 1005 998
3 1007 1008 1006
3 354 1008 1007
3 1006 1009 1007
3 997 1009 1006
3 1010 1011 1006
3 998 1011 1010
3 1010 1012 354
3 1006 1012 1010
3 1015 1016 1014
3 1013 1016 1015
3 997 1017 1014
3 1015 1017 997
3 1018 1019 1014
3 965 1019 1018
3 1018 1020 1013
3 1014 1020 1018
3 1021 1023 1013
3 1022 1023 1021
3 1022 1024 355
3 1021 1024 1022
3 1025 1026 1021
3 997 1026 1025
3 1013 1027 1021
3 1025 1027 1013
3 1028 1029 201
3 352 1029 1028
3 201 1030 1028
3 204 1030 201
3 1031 1032 355
3 204 1032 1031
3 355 1033 1031
3 352 1033 355
3 21 1034 18
3 20 1034 21
3 17 1035 21
3 20 1035 17
3 1037 1038 1036
3 19 1038 1037
3 1037 1039 20
3 1036 1039 1037
3 1040 1041 19
3 1036 1041 1040
3 18 1042 19
3 1040 1042 18
3 1048 1049 1047
3 1046 1049 1048
3 1048 1050 1045
3 1047 1050 1048
3 1051 1052 1047
3 1044 1052 1051
3 1051 1053 1046
3 1047 1053 1051
3 1055 1056 1054
3 1046 1056 1055
3 1055 1057 20
3 1054 1057 1055
3 1058 1059 1046
3 1054 1059 1058
3 1058 1060 1045
3 1046 1060 1058
3 1063 1064 1062
3 1061 1064 1063
3 1063 1065 1045
3 1062 1065 1063
3 1066 1067 1062
3 1043 1067 1066
3 1066 1068 1061
3 1062 1068 1066
3 1070 1071 1044
3 1069 1071 1070
3 1070 1072 1061
3 1044 1072 1070
3 1073 1074 1069
3 1045 1074 1073
3 1073 1075 1061
3 1069 1075 1073
3 1079 1080 1078
3 1077 1080 1079
3 1079 1081 46
3 1078 1081 1079
3 1082 1083 1078
3 1076 1083 1082
3 1082 1084 1077
3 1078 1084 1082
3 1086 1087 1077
3 1044 1087 1086
3 1086 1088 1085
3 1077 1088 1086
3 1089 1090 1085
3 46 1090 1089
3 1089 1091 1077
3 1085 1091 1089
3 1094 1095 1076
3 1093 1095 1094
3 1094 1096 1092
3 1076 1096 1094
3 1097 1098 1093
3 20 1098 1097
3 1097 1099 1092
3 1093 1099 1097
3 1101 1102 1100
3 1092 1102 1101
3 1101 1103 1044
3 1100 1103 1101
3 1104 1105 1092
3 1100 1105 1104
3 1104 1106 1076
3 1092 1106 1104
3 1111 1112 1110
3 1109 1112 1111
3 1111 1113 1043
3 1110 1113 1111
3 1114 1115 1109
3 1110 1115 1114
3 1114 1116 1108
3 1109 1116 1114
3 1118 1119 1117
3 1109 1119 1118
3 1118 1120 1107
3 1117 1120 1118
3 1121 1122 1117
3 1043 1122 1121
3 1121 1123 1109
3 1117 1123 1121
3 1126 1127 1108
3 1125 1127 1126
3 1126 1128 1124
3 1108 1128 1126
3 1129 1130 1125
3 45 1130 1129
3 1129 1131 1124
3 1125 1131 1129
3 1133 1134 1132
3 1124 1134 1133
3 1133 1135 1107
3 1132 1135 1133
3 1136 1137 1124
3 1132 1137 1136
3 1136 1138 1108
3 1124 1138 1136
3 1142 1143 1139
3 1141 1143 1142
3 1142 1144 1140
3 1139 1144 1142
3 1145 1146 1141
3 1107 1146 1145
3 1145 1147 1140
3 1141 1147 1145
3 1149 1150 1148
3 1140 1150 1149
3 1149 1151 46
3 1148 1151 1149
3 1152 1153 1139
3 1140 1153 1152
3 1152 1154 1148
3 1139 1154 1152
3 1157 1158 1156
3 1155 1158 1157
3 1157 1159 1107
3 1156 1159 1157
3 1160 1161 1155
3 1156 1161 1160
3 1160 1162 1139
3 1155 1162 1160
3 1164 1165 1163
3 1155 1165 1164
3 1164 1166 1043
3 1163 1166 1164
3 1167 1168 1163
3 1107 1168 1167
3 1167 1169 1155
3 1163 1169 1167
3 1175 1176 1172
3 1174 1176 1175
3 1175 1177 1173
3 1172 1177 1175
3 1178 1179 1174
3 1171 1179 1178
3 1178 1180 1173
3 1174 1180 1178
3 1182 1183 1181
3 1173 1183 1182
3 1182 1184 45
3 1181 1184 1182
3 1185 1186 1173
3 1181 1186 1185
3 1185 1187 1172
3 1173 1187 1185
3 1190 1191 1189
3 1188 1191 1190
3 1190 1192 1171
3 1189 1192 1190
3 1193 1194 1172
3 1188 1194 1193
3 1193 1195 1189
3 1172 1195 1193
3 1197 1198 1196
3 1188 1198 1197
3 1197 1199 1170
3 1196 1199 1197
3 1200 1201 1196
3 1171 1201 1200
3 1200 1202 1188
3 1196 1202 1200
3 1206 1207 1205
3 1204 1207 1206
3 1206 1208 19
3 1205 1208 1206
3 1209 1210 1203
3 1204 1210 1209
3 1209 1211 1205
3 1203 1211 1209
3 1213 1214 1204
3 1171 1214 1213
3 1213 1215 1212
3 1204 1215 1213
3 1216 1217 1212
3 19 1217 1216
3 1216 1218 1204
3 1212 1218 1216
3 1221 1222 1220
3 1219 1222 1221
3 1221 1223 1203
3 1220 1223 1221
3 1224 1225 1220
3 45 1225 1224
3 1224 1226 1219
3 1220 1226 1224
3 1228 1229 1227
3 1219 1229 1228
3 1228 1230 1171
3 1227 1230 1228
3 1231 1232 1227
3 1203 1232 1231
3 1231 1233 1219
3 1227 1233 1231
3 1238 1239 1237
3 1236 1239 1238
3 1238 1240 1170
3 1237 1240 1238
3 1241 1242 1236
3 1237 1242 1241
3 1241 1243 1235
3 1236 1243 1241
3 1245 1246 1234
3 1244 1246 1245
3 1245 1247 1236
3 1234 1247 1245
3 1248 1249 1244
3 1170 1249 1248
3 1248 1250 1236
3 1244 1250 1248
3 1253 1254 1251
3 1235 1254 1253
3 1253 1255 1252
3 1251 1255 1253
3 1256 1257 1252
3 20 1257 1256
3 1256 1258 1251
3 1252 1258 1256
3 1260 1261 1259
3 1251 1261 1260
3 1260 1262 1234
3 1259 1262 1260
3 1263 1264 1251
3 1259 1264 1263
3 1263 1265 1235
3 1251 1265 1263
3 1269 1270 1267
3 1266 1270 1269
3 1269 1271 1268
3 1267 1271 1269
3 1272 1273 1268
3 1234 1273 1272
3 1272 1274 1267
3 1268 1274 1272
3 1276 1277 1275
3 1267 1277 1276
3 1276 1278 19
3 1275 1278 1276
3 1279 1280 1267
3 1275 1280 1279
3 1279 1281 1266
3 1267 1281 1279
3 1284 1285 1283
3 1282 1285 1284
3 1284 1286 1234
3 1283 1286 1284
3 1287 1288 1282
3 1283 1288 1287
3 1287 1289 1266
3 1282 1289 1287
3 1291 1292 1170
3 1290 1292 1291
3 1291 1293 1282
3 1170 1293 1291
3 1294 1295 1290
3 1234 1295 1294
3 1294 1296 1282
3 1290 1296 1294
3 1297 1298 47
3 43 1298 1297
3 47 1299 1297
3 45 1299 47
3 1300 1301 44
3 47 1301 1300
3 45 1302 44
3 1300 1302 45
3 43 1304 46
3 1303 1304 43
3 1303 1305 45
3 43 1305 1303
3 1309 1310 1306
3 1308 1310 1309
3 1307 1311 1306
3 1309 1311 1307
3 1312 1313 1308
3 43 1313 1312
3 1312 1314 1307
3 1308 1314 1312
3 1316 1317 1315
3 1307 1317 1316
3 1316 1318 17
3 1315 1318 1316
3 1307 1320 1319
3 1306 1320 1307
3 1319 1321 1315
3 1306 1321 1319
3 1323 1325 1322
3 1324 1325 1323
3 1324 1326 43
3 1323 1326 1324
3 1327 1328 1323
3 1306 1328 1327
3 1322 1329 1323
3 1327 1329 1322
3 1331 1332 1330
3 46 1332 1331
3 1331 1333 43
3 1330 1333 1331
3 1334 1335 1330
3 1322 1335 1334
3 1334 1336 46
3 1330 1336 1334
3 1340 1341 1337
3 1339 1341 1340
3 1338 1342 1337
3 1340 1342 1338
3 1343 1344 1339
3 20 1344 1343
3 1343 1345 1338
3 1339 1345 1343
3 1347 1348 1346
3 1338 1348 1347
3 1347 1349 46
3 1346 1349 1347
3 1350 1351 1338
3 1346 1351 1350
3 1337 1352 1338
3 1350 1352 1337
3 1355 1356 1354
3 20 1356 1355
3 1355 1357 1353
3 1354 1357 1355
3 1358 1359 1354
3 17 1359 1358
3 1358 1360 20
3 1354 1360 1358
3 1353 1363 1362
3 1361 1363 1353
3 1362 1364 1337
3 1361 1364 1362
3 1365 1366 1361
3 17 1366 1365
3 1361 1367 1365
3 1353 1367 1361
3 1372 1373 1371
3 1370 1373 1372
3 1372 1374 1369
3 1371 1374 1372
3 1375 1376 1371
3 1368 1376 1375
3 1375 1377 1370
3 1371 1377 1375
3 1379 1380 1378
3 1370 1380 1379
3 1379 1381 47
3 1378 1381 1379
3 1382 1383 1378
3 1369 1383 1382
3 1382 1384 1370
3 1378 1384 1382
3 1387 1388 1386
3 1385 1388 1387
3 1387 1389 1369
3 1386 1389 1387
3 1390 1391 1386
3 21 1391 1390
3 1390 1392 1385
3 1386 1392 1390
3 1394 1395 1393
3 1385 1395 1394
3 1394 1396 1368
3 1393 1396 1394
3 1397 1398 1393
3 1369 1398 1397
3 1397 1399 1385
3 1393 1399 1397
3 1403 1404 1402
3 1401 1404 1403
3 1403 1405 1400
3 1402 1405 1403
3 1406 1407 1402
3 1368 1407 1406
3 1406 1408 1401
3 1402 1408 1406
3 1410 1411 1409
3 1401 1411 1410
3 1410 1412 43
3 1409 1412 1410
3 1413 1414 1409
3 1400 1414 1413
3 1413 1415 1401
3 1409 1415 1413
3 1418 1419 1417
3 1416 1419 1418
3 1418 1420 1400
3 1417 1420 1418
3 1421 1422 1417
3 47 1422 1421
3 1421 1423 1416
3 1417 1423 1421
3 1425 1426 1424
3 1416 1426 1425
3 1425 1427 1368
3 1424 1427 1425
3 1428 1429 1424
3 1400 1429 1428
3 1428 1430 1416
3 1424 1430 1428
3 1435 1436 1434
3 1433 1436 1435
3 1435 1437 1432
3 1434 1437 1435
3 1438 1439 1434
3 1431 1439 1438
3 1438 1440 1433
3 1434 1440 1438
3 1442 1443 1441
3 1433 1443 1442
3 1442 1444 17
3 1441 1444 1442
3 1445 1446 1441
3 1432 1446 1445
3 1445 1447 1433
3 1441 1447 1445
3 1450 1451 1449
3 1448 1451 1450
3 1450 1452 1432
3 1449 1452 1450
3 1453 1454 1449
3 43 1454 1453
3 1453 1455 1448
3 1449 1455 1453
3 1457 1458 1456
3 1448 1458 1457
3 1457 1459 1431
3 1456 1459 1457
3 1460 1461 1456
3 1432 1461 1460
3 1460 1462 1448
3 1456 1462 1460
3 1466 1467 1465
3 1464 1467 1466
3 1466 1468 1463
3 1465 1468 1466
3 1469 1470 1465
3 1431 1470 1469
3 1469 1471 1464
3 1465 1471 1469
3 1473 1474 1472
3 1464 1474 1473
3 1473 1475 21
3 1472 1475 1473
3 1476 1477 1472
3 1463 1477 1476
3 1476 1478 1464
3 1472 1478 1476
3 1481 1482 1480
3 1479 1482 1481
3 1481 1483 1463
3 1480 1483 1481
3 1484 1485 1480
3 17 1485 1484
3 1484 1486 1479
3 1480 1486 1484
3 1488 1489 1487
3 1479 1489 1488
3 1488 1490 1431
3 1487 1490 1488
3 1491 1492 1487
3 1463 1492 1491
3 1491 1493 1479
3 1487 1493 1491
3 1498 1499 1497
3 1496 1499 1498
3 1498 1500 1495
3 1497 1500 1498
3 1501 1502 1497
3 1494 1502 1501
3 1501 1503 1496
3 1497 1503 1501
3 1505 1506 1504
3 1496 1506 1505
3 1505 1507 44
3 1504 1507 1505
3 1508 1509 1504
3 1495 1509 1508
3 1508 1510 1496
3 1504 1510 1508
3 1513 1514 1512
3 1511 1514 1513
3 1513 1515 1495
3 1512 1515 1513
3 1516 1517 1512
3 18 1517 1516
3 1516 1518 1511
3 1512 1518 1516
3 1520 1521 1519
3 1511 1521 1520
3 1520 1522 1494
3 1519 1522 1520
3 1523 1524 1519
3 1495 1524 1523
3 1523 1525 1511
3 1519 1525 1523
3 1529 1530 1528
3 1527 1530 1529
3 1529 1531 1526
3 1528 1531 1529
3 1532 1533 1528
3 1494 1533 1532
3 1532 1534 1527
3 1528 1534 1532
3 1536 1537 1535
3 1527 1537 1536
3 1536 1538 47
3 1535 1538 1536
3 1539 1540 1535
3 1526 1540 1539
3 1539 1541 1527
3 1535 1541 1539
3 1544 1545 1543
3 1542 1545 1544
3 1544 1546 1526
3 1543 1546 1544
3 1547 1548 1543
3 44 1548 1547
3 1547 1549 1542
3 1543 1549 1547
3 1551 1552 1550
3 1542 1552 1551
3 1551 1553 1494
3 1550 1553 1551
3 1554 1555 1550
3 1526 1555 1554
3 1554 1556 1542
3 1550 1556 1554
3 1561 1562 1560
3 1559 1562 1561
3 1561 1563 1558
3 1560 1563 1561
3 1564 1565 1560
3 1557 1565 1564
3 1564 1566 1559
3 1560 1566 1564
3 1568 1569 1567
3 1559 1569 1568
3 1568 1570 21
3 1567 1570 1568
3 1571 1572 1567
3 1558 1572 1571
3 1571 1573 1559
3 1567 1573 1571
3 1576 1577 1575
3 1574 1577 1576
3 1576 1578 1558
3 1575 1578 1576
3 1579 1580 1575
3 47 1580 1579
3 1579 1581 1574
3 1575 1581 1579
3 1583 1584 1582
3 1574 1584 1583
3 1583 1585 1557
3 1582 1585 1583
3 1586 1587 1582
3 1558 1587 1586
3 1586 1588 1574
3 1582 1588 1586
3 1592 1593 1591
3 1590 1593 1592
3 1592 1594 1589
3 1591 1594 1592
3 1595 1596 1591
3 1557 1596 1595
3 1595 1597 1590
3 1591 1597 1595
3 1599 1600 1598
3 1590 1600 1599
3 1599 1601 18
3 1598 1601 1599
3 1602 1603 1598
3 1589 1603 1602
3 1602 1604 1590
3 1598 1604 1602
3 1607 1608 1606
3 1605 1608 1607
3 1607 1609 1589
3 1606 1609 1607
3 1610 1611 1606
3 21 1611 1610
3 1610 1612 1605
3 1606 1612 1610
3 1614 1615 1613
3 1605 1615 1614
3 1614 1616 1557
3 1613 1616 1614
3 1617 1618 1613
3 1589 1618 1617
3 1617 1619 1605
3 1613 1619 1617
3 1620 1621 45
3 19 1621 1620
3 45 1622 1620
3 44 1622 45
3 1623 1624 18
3 44 1624 1623
3 18 1625 1623
3 19 1625 18
3 244 246 54
3 54 52 244
3 50 52 48
3 52 54 56
3 54 61 56
3 56 48 52
3 48 51 50
3 51 58 50
3 51 243 250
3 250 58 51
3 48 240 243
3 243 51 48
3 56 248 240
3 240 48 56
3 61 253 248
3 248 56 61
3 58 250 242
3 242 50 58
3 253 61 54
3 54 246 253
3 244 242 248
3 242 250 240
3 250 243 240
3 240 248 242
3 248 253 244
3 253 246 244
3 50 242 244
3 244 52 50
3 254 62 57
3 57 249 254
3 57 53 245
3 245 249 57
3 53 60 252
3 252 245 53
3 252 60 55
3 55 247 252
3 247 55 59
3 59 251 247
3 251 59 49
3 49 241 251
3 57 62 55
3 62 49 55
3 49 59 55
3 55 60 57
3 60 53 57
3 241 49 62
3 62 254 241
3 249 245 247
3 245 252 247
3 247 251 241
3 241 254 249
3 249 247 241
3 154 392 391
3 391 153 154
3 391 390 152
3 152 153 391
3 390 393 155
3 155 152 390
3 155 393 387
3 387 149 155
3 149 387 388
3 388 150 149
3 150 388 389
3 389 151 150
3 391 392 387
3 392 389 387
3 389 388 387
3 387 393 391
3 393 390 391
3 151 389 392
3 392 154 151
3 153 152 149
3 152 155 149
3 149 150 151
3 151 154 153
3 153 149 151
3 321 489 488
3 488 320 321
3 488 486 318
3 318 320 488
3 485 317 318
3 318 486 485
3 487 319 317
3 317 485 487
3 484 316 319
3 319 487 484
3 491 323 316
3 316 484 491
3 323 491 490
3 490 322 323
3 488 489 487
3 489 490 484
3 490 491 484
3 484 487 489
3 487 485 488
3 485 486 488
3 322 490 489
3 489 321 322
3 321 320 316
3 320 318 319
3 318 317 319
3 319 316 320
3 316 323 321
3 323 322 321
3 4 6 341
3 341 339 4
3 337 339 335
3 339 341 343
3 341 348 343
3 343 335 339
3 335 338 337
3 338 345 337
3 338 3 10
3 10 345 338
3 335 0 3
3 3 338 335
3 343 8 0
3 0 335 343
3 348 13 8
3 8 343 348
3 345 10 2
3 2 337 345
3 13 348 341
3 341 6 13
3 4 2 8
3 2 10 0
3 10 3 0
3 0 8 2
3 8 13 4
3 13 6 4
3 337 2 4
3 4 339 337
3 14 349 344
3 344 9 14
3 344 340 5
3 5 9 344
3 340 347 12
3 12 5 340
3 12 347 342
3 342 7 12
3 7 342 346
3 346 11 7
3 11 346 336
3 336 1 11
3 344 349 342
3 349 336 342
3 336 346 342
3 342 347 344
3 347 340 344
3 1 336 349
3 349 14 1
3 9 5 7
3 5 12 7
3 7 11 1
3 1 14 9
3 9 7 1
3 109 329 328
3 328 108 109
3 328 327 107
3 107 108 328
3 327 330 110
3 110 107 327
3 110 330 324
3 324 104 110
3 104 324 325
3 325 105 104
3 105 325 326
3 326 106 105
3 328 329 324
3 329 326 324
3 326 325 324
3 324 330 328
3 330 327 328
3 106 326 329
3 329 109 106
3 108 107 104
3 107 110 104
3 104 105 106
3 106 109 108
3 108 104 106
3 262 446 445
3 445 261 262
3 445 443 259
3 259 261 445
3 442 258 259
3 259 443 442
3 444 260 258
3 258 442 444
3 441 255 260
3 260 444 441
3 448 264 255
3 255 441 448
3 264 448 447
3 447 263 264
3 445 446 444
3 446 447 441
3 447 448 441
3 441 444 446
3 444 442 445
3 442 443 445
3 263 447 446
3 446 262 263
3 262 261 255
3 261 259 260
3 259 258 260
3 260 255 261
3 255 264 262
3 264 263 262
3 360 362 126
3 126 124 360
3 122 124 118
3 124 126 129
3 126 145 129
3 129 118 124
3 118 123 122
3 123 137 122
3 123 359 366
3 366 137 123
3 118 356 359
3 359 123 118
3 129 364 356
3 356 118 129
3 145 369 364
3 364 129 145
3 137 366 358
3 358 122 137
3 369 145 126
3 126 362 369
3 360 358 364
3 358 366 356
3 366 359 356
3 356 364 358
3 364 369 360
3 369 362 360
3 122 358 360
3 360 124 122
3 370 146 130
3 130 365 370
3 130 125 361
3 361 365 130
3 125 144 368
3 368 361 125
3 368 144 127
3 127 363 368
3 363 127 139
3 139 367 363
3 367 139 121
3 121 357 367
3 130 146 127
3 146 121 127
3 121 139 127
3 127 144 130
3 144 125 130
3 357 121 146
3 146 370 357
3 365 361 363
3 361 368 363
3 363 367 357
3 357 370 365
3 365 363 357
3 228 437 436
3 436 227 228
3 436 435 226
3 226 227 436
3 435 438 229
3 229 226 435
3 229 438 432
3 432 223 229
3 223 432 433
3 433 224 223
3 224 433 434
3 434 225 224
3 436 437 432
3 437 434 432
3 434 433 432
3 432 438 436
3 438 435 436
3 225 434 437
3 437 228 225
3 227 226 223
3 226 229 223
3 223 224 225
3 225 228 227
3 227 223 225
3 409 68 67
3 67 408 409
3 67 65 406
3 406 408 67
3 64 405 406
3 406 65 64
3 66 407 405
3 405 64 66
3 63 404 407
3 407 66 63
3 70 411 404
3 404 63 70
3 411 70 69
3 69 410 411
3 67 68 66
3 68 69 63
3 69 70 63
3 63 66 68
3 66 64 67
3 64 65 67
3 410 69 68
3 68 409 410
3 409 408 404
3 408 406 407
3 406 405 407
3 407 404 408
3 404 411 409
3 411 410 409
3 461 463 282
3 282 280 461
3 278 280 276
3 280 282 284
3 282 289 284
3 284 276 280
3 276 279 278
3 279 286 278
3 279 460 467
3 467 286 279
3 276 457 460
3 460 279 276
3 284 465 457
3 457 276 284
3 289 470 465
3 465 284 289
3 286 467 459
3 459 278 286
3 470 289 282
3 282 463 470
3 461 459 465
3 459 467 457
3 467 460 457
3 457 465 459
3 465 470 461
3 470 463 461
3 278 459 461
3 461 280 278
3 471 290 285
3 285 466 471
3 285 281 462
3 462 466 285
3 281 288 469
3 469 462 281
3 469 288 283
3 283 464 469
3 464 283 287
3 287 468 464
3 468 287 277
3 277 458 468
3 285 290 283
3 290 277 283
3 277 287 283
3 283 288 285
3 288 281 285
3 458 277 290
3 290 471 458
3 466 462 464
3 462 469 464
3 464 468 458
3 458 471 466
3 466 464 458
3 76 270 269
3 269 75 76
3 269 268 74
3 74 75 269
3 268 271 77
3 77 74 268
3 77 271 265
3 265 71 77
3 71 265 266
3 266 72 71
3 72 266 267
3 267 73 72
3 269 270 265
3 270 267 265
3 267 266 265
3 265 271 269
3 271 268 269
3 73 267 270
3 270 76 73
3 75 74 71
3 74 77 71
3 71 72 73
3 73 76 75
3 75 71 73
3 210 220 219
3 219 209 210
3 219 217 207
3 207 209 219
3 216 206 207
3 207 217 216
3 218 208 206
3 206 216 218
3 215 205 208
3 208 218 215
3 222 212 205
3 205 215 222
3 212 222 221
3 221 211 212
3 219 220 218
3 220 221 215
3 221 222 215
3 215 218 220
3 218 216 219
3 216 217 219
3 211 221 220
3 220 210 211
3 210 209 205
3 209 207 208
3 207 206 208
3 208 205 209
3 205 212 210
3 212 211 210