OFF

113 222 0
0.237648 -0.019278 -0.183388
0.403683 -0.065990 -0.264002
0.343639 -0.006481 -0.201825
0.319920 -0.020468 -0.187615
0.338239 -0.052056 -0.193025
0.303518 -0.034346 -0.218646
0.330296 -0.010234 -0.234773
0.347103 -0.052578 -0.239987
0.403200 -0.057850 -0.270463
0.266368 0.003719 -0.191681
0.308987 -0.005583 -0.220409
0.287678 -0.000932 -0.206045
0.382523 -0.059183 -0.213751
0.405788 -0.057510 -0.224666
0.417421 -0.056674 -0.230124
0.284465 -0.002475 -0.212327
0.349842 -0.029823 -0.244339
0.293955 -0.044929 -0.172300
0.303025 -0.046627 -0.215400
0.317220 -0.043256 -0.183215
0.328853 -0.042419 -0.188673
0.314471 -0.049247 -0.185828
0.352118 -0.040746 -0.199588
0.407693 -0.036903 -0.272673
0.363751 -0.039910 -0.205046
0.375384 -0.039073 -0.210503
0.248298 -0.029977 -0.187100
0.304011 -0.022064 -0.221892
0.398649 -0.037400 -0.221419
0.261530 -0.030808 -0.158679
0.355503 -0.057885 -0.212883
0.421914 -0.035727 -0.232334
0.369388 -0.049413 -0.253904
0.308061 -0.027462 -0.180510
0.258947 -0.040676 -0.190812
0.354592 -0.024116 -0.202341
0.285249 -0.016821 -0.172889
0.331779 -0.013474 -0.194720
0.262437 -0.006179 -0.165268
0.259933 -0.016113 -0.197305
0.316030 -0.021385 -0.227780
0.373881 -0.028466 -0.256114
0.270583 -0.026812 -0.201017
0.281233 -0.037511 -0.204729
0.393427 -0.048055 -0.265680
0.426807 -0.066311 -0.234476
0.282218 -0.012948 -0.211222
0.419890 -0.066978 -0.254861
0.347596 -0.040296 -0.243233
0.410600 -0.065323 -0.243618
0.401310 -0.063669 -0.232375
0.340069 -0.020028 -0.239556
0.292868 -0.023647 -0.214934
0.361504 -0.050383 -0.203941
0.394393 -0.064336 -0.252759
0.384770 -0.048710 -0.214856
0.397920 -0.027109 -0.267890
0.408035 -0.047037 -0.225771
0.385103 -0.062681 -0.241516
0.379271 -0.060693 -0.220081
0.431300 -0.045364 -0.236687
0.375812 -0.061027 -0.230273
0.359615 -0.039618 -0.249121
0.424383 -0.046031 -0.257071
0.272936 -0.036129 -0.162490
0.352089 -0.019350 -0.245444
0.296202 -0.034456 -0.173405
0.353773 -0.058051 -0.217980
0.319467 -0.032782 -0.184320
0.417466 -0.046698 -0.277456
0.290703 -0.046439 -0.178630
0.342732 -0.031109 -0.195236
0.273390 -0.023814 -0.165784
0.314168 -0.045044 -0.222358
0.365998 -0.029436 -0.206151
0.389263 -0.027763 -0.217066
0.250577 -0.013173 -0.158164
0.306257 -0.011591 -0.222997
0.412528 -0.026090 -0.227982
0.435794 -0.024417 -0.238897
0.366451 -0.017122 -0.209446
0.297108 -0.009827 -0.179994
0.411026 -0.020100 -0.234725
0.421680 -0.022425 -0.241907
0.389716 -0.015449 -0.220361
0.320373 -0.008154 -0.190909
0.386258 -0.015783 -0.230553
0.428876 -0.025084 -0.259281
0.274296 0.000814 -0.172373
0.364948 -0.011132 -0.216189
0.407567 -0.020433 -0.244917
0.260426 -0.003832 -0.200551
0.297561 0.002487 -0.183289
0.350835 -0.009140 -0.219199
0.318871 -0.002164 -0.197653
0.361490 -0.011465 -0.226381
0.329525 -0.004489 -0.204835
0.393454 -0.018442 -0.247927
0.372144 -0.013791 -0.233563
0.414763 -0.023092 -0.262292
0.272793 0.006805 -0.179117
0.325803 -0.031180 -0.232563
0.315412 -0.002497 -0.207845
0.358031 -0.011799 -0.236573
0.294103 0.002154 -0.193481
0.336722 -0.007148 -0.222209
0.400650 -0.021101 -0.265302
0.379341 -0.016450 -0.250938
0.421959 -0.025751 -0.279666
0.391181 -0.058529 -0.264575
0.383654 -0.038261 -0.260897
0.336453 -0.041879 -0.236275
0.376128 -0.017992 -0.257220
3 91 9 0
3 9 76 0
3 9 100 76
3 100 38 76
3 76 29 0
3 29 26 0
3 29 34 26
3 29 64 34
3 64 70 34
3 70 21 34
3 21 4 34
3 4 18 34
3 64 17 70
3 100 88 38
3 4 67 18
3 67 7 18
3 67 32 7
3 67 58 32
3 58 109 32
3 58 54 109
3 54 1 109
3 1 8 109
3 1 69 8
3 1 47 69
3 7 73 18
3 67 61 58
3 7 111 73
3 18 43 34
3 4 30 67
3 111 101 73
3 91 15 9
3 0 39 91
3 100 92 88
3 15 11 9
3 47 63 69
3 8 44 109
3 73 5 18
3 29 72 64
3 30 59 67
3 52 5 46
3 96 2 102
3 37 3 2
3 66 33 3
3 71 53 22
3 80 71 35
3 20 4 68
3 21 70 4
3 32 62 16
3 10 11 6
3 51 16 6
3 111 7 101
3 77 101 40
3 45 57 14
3 55 74 25
3 79 90 83
3 98 86 103
3 105 89 93
3 107 108 106
3 51 101 16
3 51 6 101
3 65 16 41
3 65 6 16
3 56 112 41
3 56 108 112
3 65 112 6
3 65 41 112
3 77 15 46
3 77 6 15
3 91 46 15
3 40 6 77
3 40 101 6
3 27 77 46
3 27 101 77
3 23 56 44
3 23 108 56
3 110 56 41
3 110 44 56
3 8 69 44
3 23 69 108
3 23 44 69
3 62 41 16
3 62 32 41
3 48 16 101
3 48 32 16
3 109 44 32
3 110 32 44
3 110 41 32
3 73 101 5
3 18 5 43
3 48 7 32
3 48 101 7
3 26 34 39
3 42 34 43
3 42 39 34
3 26 39 0
3 52 43 5
3 52 46 43
3 27 5 101
3 27 46 5
3 91 39 46
3 42 46 39
3 42 43 46
3 24 53 71
3 24 55 53
3 22 4 71
3 22 53 4
3 13 12 55
3 13 45 12
3 53 12 4
3 53 55 12
3 19 17 66
3 19 4 17
3 64 66 17
3 19 68 4
3 19 66 68
3 20 71 4
3 20 68 71
3 28 55 75
3 28 57 55
3 13 57 45
3 13 55 57
3 24 74 55
3 24 71 74
3 25 75 55
3 25 74 75
3 31 60 57
3 31 79 60
3 14 60 45
3 14 57 60
3 28 78 57
3 28 75 78
3 31 78 79
3 31 57 78
3 81 66 36
3 66 72 36
3 72 66 64
3 66 3 68
3 3 71 68
3 66 81 33
3 81 3 33
3 72 76 38
3 76 72 29
3 72 88 36
3 88 81 36
3 88 72 38
3 71 80 74
3 80 75 74
3 71 2 35
3 2 80 35
3 75 84 78
3 84 79 78
3 2 84 80
3 84 75 80
3 81 92 85
3 92 2 85
3 92 81 88
3 2 3 85
3 3 81 85
3 2 71 37
3 71 3 37
3 95 89 105
3 95 86 89
3 93 2 105
3 93 89 2
3 82 84 86
3 82 79 84
3 89 84 2
3 89 86 84
3 94 92 104
3 94 2 92
3 100 104 92
3 94 102 2
3 94 104 102
3 96 105 2
3 96 102 105
3 97 86 107
3 97 90 86
3 82 90 79
3 82 86 90
3 95 103 86
3 95 105 103
3 98 107 86
3 98 103 107
3 99 87 90
3 99 108 87
3 83 87 79
3 83 90 87
3 97 106 90
3 97 107 106
3 99 106 108
3 99 90 106
3 9 104 100
3 104 11 102
3 11 105 102
3 11 104 9
3 105 6 103
3 6 107 103
3 108 107 112
3 107 6 112
3 6 11 15
3 6 105 10
3 105 11 10
3 49 47 54
3 49 45 47
3 1 54 47
3 58 50 54
3 58 61 50
3 49 50 45
3 49 54 50
3 67 59 61
3 50 59 45
3 50 61 59
3 17 4 70
3 12 59 4
3 12 45 59
3 30 4 59
3 108 63 87
3 63 79 87
3 63 108 69
3 45 63 47
3 79 63 60
3 63 45 60
