OFF
1247 2490 0
-0.2786409738 -0.3589274751 0.1853584620
-0.4556403946 0.2073417096 0.0144020299
0.1543927621 -0.4091267110 0.1373639964
-0.2906858278 0.3511057029 0.0140576633
0.4415580406 -0.0533066553 0.1841531664
-0.0276218565 -0.3348838881 0.1300492082
-0.1537044425 -0.2987565417 0.1301772171
-0.2563078825 -0.3548036211 0.1853260434
0.1697583607 -0.3950947336 0.1251611962
-0.4274328196 0.0612073419 0.1318488274
0.4277325613 -0.0609894953 0.1308668483
-0.1036805252 -0.0463328070 -0.1712630325
-0.1033119099 -0.0460662661 0.1165807317
0.0630613801 -0.0941105594 -0.1714323219
0.0634299954 -0.0938440184 0.1164114424
-0.1694744658 0.3953007125 0.1248637211
0.2567445704 0.3551200827 0.1840116404
0.1540003520 0.2989712083 0.1292296766
0.0279177660 0.3350985547 0.1293576855
-0.4411213527 0.0536231168 0.1851845174
0.2906854226 -0.3511052977 0.0139633957
-0.1540776969 0.4093552288 0.1370011190
0.4556395842 -0.2073411883 0.0136190295
-0.2679341226 -0.2269317616 0.1441012210
0.1073374762 -0.3344610205 0.1437202161
-0.1070061086 0.3347013263 0.1433750676
0.2682654901 0.2271720674 0.1429940626
-0.4210096491 -0.0985362105 0.0146409218
0.2093485210 0.2632133490 0.1291919088
-0.0379684896 0.3340788634 0.1294430042
0.3009579991 -0.3077218568 0.0139100678
-0.0862975505 -0.4480211037 0.1459670451
-0.0786376690 0.4425354737 0.0137014494
-0.2893187362 0.3362172939 0.0140696991
0.0612480191 0.4276918531 0.1308836568
-0.2729199735 0.3424726657 0.1847016450
0.2008176041 -0.3802500869 0.1847642077
0.4073823668 0.2909255508 0.0132194373
-0.2605887588 0.3451830291 0.1846833437
0.2751027554 0.3576019428 0.1839858326
-0.3812106773 -0.1987864235 0.0990390126
0.1860873472 0.3017995665 0.1841514991
0.0023009029 0.3544612127 0.1843380934
-0.3801895870 -0.2004406567 0.1853417486
-0.4313724004 0.0711633946 0.1376693878
-0.4279644845 0.0370894011 0.1494798719
0.3347465992 0.1072915905 0.1430199347
-0.2268864598 0.2682203334 0.1435901483
-0.0946484565 -0.2267543707 0.0124207149
-0.0398052768 -0.2424689798 0.0123650338
-0.4321925017 0.0368036566 0.1851886577
0.0100206717 0.4314986243 0.0913799838
0.3480916868 0.2542820489 0.1839880357
0.3450387726 -0.2988306481 0.1452765229
-0.0309171568 0.1213382148 0.1277102916
0.0906981513 0.0864909095 0.1275868183
0.2668544411 0.3398576036 0.1307016891
0.3534522778 -0.2620549127 0.0138005560
-0.4087239118 -0.1742096977 0.1853540003
0.4252389701 -0.0714606352 0.0135321366
-0.3371263793 -0.1079144472 0.1541333886
0.2290793083 -0.2701534182 0.1535585325
0.2291613395 -0.2702436841 0.1561828872
-0.3372388418 -0.1079489835 0.1567579408
0.0969078265 -0.4895664148 0.1307561610
-0.3552608732 0.2671293855 0.1848768587
0.1631692668 -0.2938569657 0.1297668888
-0.2938160359 -0.1629136940 0.1302308559
0.3511048156 0.2906855251 0.0132917291
0.2893698015 -0.3439178951 0.0139584250
-0.4345221237 0.0425474865 0.1851863223
0.4358882838 -0.0445208605 0.1841522916
-0.4305198036 0.0597708590 0.0145065096
-0.0044749036 0.4427481152 0.0799369775
-0.2893703431 0.3439293010 0.0140626240
-0.1681780997 -0.3982205094 0.1852533873
0.4892330433 -0.1067748893 0.1565441045
-0.4006966779 -0.1607688426 0.1320201370
-0.4027575291 -0.1661528445 0.0146801604
-0.3894093110 0.1822061507 0.1849992277
0.1507334517 -0.4039974976 0.0141915972
-0.0262481083 -0.4300240984 0.1851010804
0.2657217838 0.3452722561 0.0133505245
-0.1804420310 0.3978496107 0.1845319383
0.3677790085 -0.3396910906 0.1845128381
-0.1718955950 0.4169380471 0.1845033179
-0.0643720816 -0.4252137574 0.0144867093
-0.3369247598 -0.3699428621 0.1578457809
0.3860003009 0.1923279085 0.1839968586
0.2991201374 0.3449923506 0.1447391519
-0.4211327803 -0.0982849858 0.0146408469
0.2382304762 0.3594735937 0.1840313184
-0.3148365283 0.1622999498 0.1564790039
0.3532788085 -0.0291399228 0.1558006812
0.1493580047 -0.4312144721 0.1456496997
0.1686147005 0.3985366670 0.1840842969
0.3458570877 0.0698245418 0.1557185452
-0.2561293681 0.2423160325 0.1563297287
0.2740291891 0.3330253597 0.0133512265
-0.3756753601 -0.3285651037 0.0591167948
0.4100680133 0.1741620165 0.1839828588
0.3425841055 -0.2672836343 0.0138193156
0.2415687899 -0.0847015195 0.0137796072
-0.2497689678 0.0560850073 0.0142784515
0.2745056061 0.3325380780 0.0133510676
0.2162183579 -0.3784464390 0.0857235914
-0.0252680647 -0.4286141296 0.0625626517
0.0597699199 0.4305199011 0.0135353297
-0.0726331173 0.1046903968 -0.1850950845
0.1166801905 0.0504450988 -0.1852872901
-0.2384053063 -0.0594902974 0.0124499260
0.1707183312 -0.1767194235 0.0120345519
-0.2073409721 -0.4556395166 0.0146979705
0.4301526185 0.0105153695 0.1841086737
0.3383486374 -0.2771803600 0.1370062397
-0.0931586304 0.3407227445 0.1560299032
0.2597320077 0.2396064625 0.1556716211
0.4169977931 0.1722717428 0.1839757348
-0.3855724601 0.2174574728 0.0806336317
-0.4576185772 0.2028540978 0.0576073935
0.0299604649 0.4310571574 0.1842317451
-0.4207725404 -0.2711974802 0.0148005011
-0.4325390972 0.1630605408 0.0144134501
-0.4311679240 -0.1490675363 0.1461318606
0.4404104208 0.0775197629 0.1840334919
-0.0943696980 -0.0819260667 0.1279797705
0.0368750757 -0.1195325717 0.1278465206
0.3248970526 -0.0268166367 0.1273918229
-0.2895835994 0.1492549055 0.1280156915
-0.3443487308 0.2575469774 0.1252152255
-0.3285501090 0.3757736951 0.0584042339
0.1744245113 0.3941723230 0.1840808982
0.4093981595 0.1543490634 0.1365156604
0.0166990025 0.4299013300 0.1842497981
-0.2573015312 -0.3443875183 0.1256611384
0.2205195117 0.0549067430 -0.1854243991
-0.1583522470 0.1634675816 -0.1850397390
-0.4150630789 -0.1125762834 0.0146463076
-0.1741500012 0.4091008533 0.1845134621
-0.1531660799 -0.4225655779 0.0145979675
-0.1207906589 0.0323039599 0.1279078294
0.1197818764 -0.0366290117 0.1276635814
-0.4190289676 0.0967774517 0.0144575265
-0.0999861465 0.2244485890 0.0120097402
0.2036752923 0.1374383021 0.0117014395
0.0624221478 0.2185574750 -0.1853734775
0.0626406944 0.2187155032 -0.0147151650
-0.3293685089 -0.2904176648 0.0147012460
-0.0863729653 0.4308723739 0.0137221552
0.0273075220 -0.1105582882 -0.1713713047
0.0276761373 -0.1102917473 0.1164724595
-0.0820627851 -0.0792196308 -0.1712602635
-0.0816941698 -0.0789530898 0.1165835008
-0.3890868026 -0.1819313397 0.1496328962
0.3553687204 -0.2645022678 0.1844591066
0.1465125327 0.4186657886 0.0134352231
0.2594394060 -0.3455433428 0.1846569979
-0.1750709406 0.4036720671 0.0138609298
0.4045331250 0.2949909250 0.0564179964
-0.2022600991 -0.1045989371 -0.0114516412
0.1161241098 -0.1958278448 -0.0117748897
-0.0651695253 0.4331805372 0.1843516032
0.0536826857 0.4414980367 0.1841916980
0.2256407677 0.0290610862 -0.0147482860
-0.1760637444 0.1441643572 -0.0143404443
0.0392793955 -0.3426902739 0.1354734697
-0.2145774667 -0.2699508490 0.1357312049
0.2790389648 -0.3416633299 0.1846283057
0.1719514172 -0.3096158542 0.1536682329
-0.3095664332 -0.1716430958 0.1541571073
0.3427546792 0.2872512970 0.1839643411
0.3145000428 -0.2933259171 0.0138793952
-0.3572262769 0.2750444768 0.1848720463
-0.4112781463 -0.1257021003 0.0146536150
-0.2287997886 -0.4452508299 0.0147158310
-0.2182596858 -0.1128667059 0.0124735535
0.1253621104 -0.2113271203 0.0121246819
0.3786041140 0.2161929942 0.0849650076
-0.2771365768 -0.3380766494 0.1378508250
0.4272936370 -0.1587236646 0.0136103102
0.1082631535 -0.3372891288 0.1563997940
-0.2701932800 -0.2288472963 0.1567840324
-0.4036717016 -0.1750701252 0.0146895885
0.1026869058 -0.3200111004 0.1298685616
-0.2563627003 -0.2171300452 0.1302330967
-0.0924421373 -0.3230288198 0.1301212399
0.0294535951 0.3532298982 0.1558613034
0.1623495396 0.3151502714 0.1557263770
0.2121953853 0.1431877611 0.0136061995
-0.1041648732 0.2338367318 0.0139273930
0.4897535036 0.0967569292 0.0576146743
0.2174800471 0.3857187182 0.0797055488
0.4427710534 0.0046207455 0.0797699327
0.2206109929 0.2773616351 0.1530623827
-0.0399842667 0.3520318613 0.1533269593
0.0106604436 0.2302642523 -0.0019815696
0.1128729763 0.2009765632 -0.0020853437
0.4297712719 -0.0183597393 0.0978333883
-0.0637928164 0.0939526943 -0.1714440163
-0.0634242011 0.0942192352 0.1163997480
0.1035204142 0.0460112360 -0.1716138857
0.1038890295 0.0462777769 0.1162298786
0.3239089014 0.0370568098 0.1273339421
-0.2549186188 0.2029124049 0.1279216128
-0.1761544078 0.1442441527 -0.0117154990
0.2257648578 0.0290793469 -0.0121235588
0.3440030365 -0.0283924454 0.1347922007
-0.3066109036 0.1580326266 0.1354527546
-0.0383728413 -0.2337051216 0.0068534308
-0.0912325902 -0.2185588391 0.0069070981
0.3330251492 -0.2740296912 0.0138378037
-0.3950554199 -0.1695130215 0.1256756149
0.2241562173 -0.3669972610 0.1847220480
0.1720140419 -0.3097202903 0.1562926255
-0.3096699385 -0.1716999295 0.1567816686
-0.0531350730 0.4293617181 0.1843397279
0.1581485624 -0.1637622158 -0.0118583990
-0.2209257939 -0.0551433255 -0.0114735332
0.1793603216 -0.3994811189 0.1848094938
-0.2184862900 -0.2748730241 0.1440822909
0.0400039801 -0.3489400925 0.1438198514
0.4169727982 0.1067754828 0.0133776771
0.0714600739 0.4252393556 0.0135252489
0.3563745067 -0.2477824790 0.1844423362
0.3687662339 -0.2242334630 0.0915277736
0.0969389661 0.3378554922 0.1431109730
-0.1596653981 -0.4075435855 0.1852511190
0.2481575214 0.3563145291 0.1840215311
-0.4289849121 -0.0531946981 0.1852678878
0.0156614794 -0.2271717297 -0.1849008538
0.0158800260 -0.2270137015 -0.0142425414
-0.1339670037 -0.1842976088 -0.1847489393
-0.1337484571 -0.1841395806 -0.0140906269
-0.4157436863 0.1100379165 0.0144410403
0.0383243118 -0.1216293801 -0.1850276074
-0.0972965709 -0.0827689573 -0.1848899145
-0.0505644514 -0.4269559964 0.1254728468
0.0448955399 0.4358273627 0.1842082019
-0.3420956331 -0.2729797876 0.1853601358
-0.3772940928 0.2061561732 0.1849615353
0.4425265560 0.0786428263 0.0133710034
-0.4186657985 0.1465134917 0.0144110063
-0.4452515348 0.2288004642 0.0143688552
0.2146907873 -0.0753168761 -0.0146376102
-0.2220529858 0.0498264452 -0.0141941939
0.0244790217 -0.5000000000 0.0144421772
-0.3930683112 -0.3099926126 0.0148009468
0.3077213795 0.3009581572 0.0133377739
0.0626774355 0.2188344275 -0.0120904192
0.3299595349 0.2902365452 0.0133192237
0.4401170615 -0.0514687561 0.1841533099
0.1321041407 0.4143756175 0.0134576473
-0.2831885450 -0.3236581083 0.0146728879
-0.0905826381 -0.4921355377 0.1852409824
-0.3553979347 0.2680971043 0.1848761381
-0.2699229942 0.3427330968 0.1846975659
-0.4352179172 -0.0703952592 0.1852917974
0.4161935111 -0.1400335297 0.0136072182
0.2234762992 -0.0783683067 0.0063742638
-0.2310818839 0.0518795051 0.0068357667
-0.3521228906 0.2462065999 0.1491891077
0.1087799085 -0.0314672111 -0.1715488767
0.1091485237 -0.0312006701 0.1162948876
-0.1092860556 0.0310167915 -0.1713274791
-0.1089174404 0.0312833324 0.1165162851
-0.2928071728 0.3215944201 0.0140877071
0.2702184283 -0.2146204438 0.1350591355
-0.3426465076 -0.0390118643 0.1356813637
-0.2103730517 -0.1087890718 0.0069580245
0.1208214056 -0.2036885917 0.0066217701
-0.2273837407 -0.1175853292 0.0144106021
0.1306062798 -0.2201627738 0.0140471428
-0.4561194696 -0.0750545865 0.0146641400
-0.0868256100 0.4304518022 0.0137231243
-0.1563975866 -0.4122178329 0.1852512625
0.3551800709 -0.2563695300 0.1844518174
-0.4834645100 -0.1288744801 0.1854077337
-0.2459082934 -0.3521701889 0.1496071803
-0.1919517161 0.3859405665 0.1845577054
-0.3994206369 -0.1789833430 0.1853465068
0.3585173447 -0.2410500324 0.1844333579
0.4285486715 0.0462986440 0.1840775927
0.4079201903 -0.1597260573 0.1842947869
0.0967765117 0.4190290168 0.0134985792
0.2107431222 -0.2485649734 0.1277433466
-0.3101880720 -0.0992988273 0.1282722365
0.3452720309 -0.2657222972 0.0138144276
0.4054553369 -0.1614499669 0.1842995397
-0.0369377677 0.4286097559 0.1843196818
-0.1151994277 -0.0551843316 -0.1848925311
0.0681190160 -0.1077118782 -0.1850786502
-0.3574832901 -0.2930591388 0.0147396960
0.3420394403 0.2789785554 0.1839729175
0.4371248388 -0.0502203670 0.0134972471
-0.2956836162 0.3155687381 0.0140969705
0.2671889727 0.3556372705 0.1839977863
0.3429558616 -0.2670229433 0.0138185981
0.1251695623 0.4138734768 0.0134669928
-0.0982858519 0.4211330616 0.0137464294
-0.3439178226 -0.2893695069 0.0147189074
-0.2289256368 -0.3637699253 0.1852992802
0.4359568076 -0.0020181175 0.0850936229
0.2129667425 0.0803668645 -0.0121546612
-0.1381369844 0.1809711300 -0.0117981934
-0.1832171658 0.1500657505 0.0066835510
0.2348734430 0.0302672539 0.0062590729
-0.0986038424 -0.2362348099 0.0143555538
-0.0414672575 -0.2526065648 0.0142975443
0.0544503733 0.4420999647 0.1841901575
0.3427927556 0.2702992684 0.1839799897
0.2173855524 -0.2564036798 0.1296627775
-0.3199702320 -0.1024312783 0.1302083429
-0.0927819825 0.4249129215 0.0137358810
0.3535522980 -0.0260980209 0.1842406724
-0.3134031674 0.1650095055 0.1849178175
-0.3937958007 0.1743649335 0.1850121060
-0.1481738176 0.4782572162 0.1844161586
0.3518276023 -0.2456093057 0.0742054888
0.1854103738 0.4649956096 0.0133425092
-0.2047904161 0.0995254124 -0.1849210600
-0.2045718695 0.0996834406 -0.0142627475
0.2260476359 -0.0239257003 -0.1853584803
0.2262661825 -0.0237676722 -0.0147001679
-0.2236883347 -0.0558262434 -0.0014165431
0.1601490920 -0.1658099304 -0.0018062447
-0.2026609731 -0.2549584185 0.1282786758
0.0370971197 -0.3236580220 0.1280352547
0.0914354367 -0.0668305005 -0.1714939191
0.0918040520 -0.0665639595 0.1163498452
-0.1133016290 -0.0081657227 -0.1712860540
-0.1129330137 -0.0078991817 0.1165577102
0.2244045711 0.3687389346 0.0911635569
-0.4225612442 0.1531576053 0.0144098424
-0.1630452752 0.4027682570 0.0138463666
-0.2249460444 0.0504920356 -0.0015133823
0.2175211118 -0.0762912477 -0.0019626094
0.0502198870 0.4371255581 0.0135414428
-0.3981601361 0.1685551256 0.1850230748
0.3629895108 -0.2307218423 0.0981155552
0.2904179417 -0.3293685770 0.0139436102
0.3765199742 -0.2196724420 0.0853712843
0.0985366712 -0.4210095255 0.0142741938
0.4275351884 -0.0368209215 0.0739152007
0.4898229923 0.0968664057 0.1297099584
-0.2203258535 -0.2771948852 0.1567649412
0.0403585491 -0.3518906541 0.1565002741
-0.1577647708 -0.3066534092 0.1356924363
-0.0283494537 -0.3437357069 0.1355610438
0.0222065076 -0.4293391137 0.1850383947
-0.2021554392 -0.1045457234 -0.0140767275
0.1160585876 -0.1957258676 -0.0143998032
-0.3338233995 -0.0380087300 0.1301664287
0.2632541157 -0.2090936268 0.1295602291
0.2148871796 0.2701746935 0.1346810769
-0.0389696826 0.3429141184 0.1349388122
-0.0364253096 -0.4322522205 0.1851161766
-0.4038290053 -0.1513918904 0.0146678641
-0.1610327165 -0.4724071846 0.0589751181
0.2990118953 -0.1537454786 0.1294631855
-0.3348431685 0.0278775526 0.1301067245
0.0834188639 0.4218909835 0.0135130349
-0.4308721029 -0.0863720830 0.0146422879
-0.3284847362 0.3757999469 0.1304996004
0.3250015515 0.3810967532 0.1839001758
-0.1513927152 0.4038293428 0.0138304617
-0.1863482635 -0.1601579008 0.0124764787
0.0732481897 -0.2345419319 0.0122129162
0.2873117041 -0.3423785789 0.1846183739
0.1717659902 -0.4208856067 0.1848390396
-0.1103196140 -0.4880827433 0.1852625049
0.4783169664 0.1485498835 0.1839191752
0.3398989951 -0.2665960097 0.1311697186
0.1618259108 0.4053948867 0.1840866401
0.3811566973 -0.3246254395 0.1844817559
-0.3784886897 -0.2070484780 0.0924688017
0.4978184616 0.0532356129 0.0565223978
-0.3155682640 -0.2956829525 0.0146884489
0.1915392381 -0.1228058867 -0.0145639877
-0.2275643589 -0.0027171314 -0.0141384811
-0.1528790696 -0.4197393883 0.1852537215
0.1070898296 0.4891823760 0.1564816290
-0.0974127914 -0.3404702033 0.1566661301
-0.0973763670 -0.3404438653 0.1851092173
-0.4254233361 0.0708056341 0.0144897649
-0.2306918128 -0.3628032391 0.0989981350
0.3125322985 -0.1606829764 0.1432965247
-0.3499599410 0.0291456699 0.1439691384
0.4332404034 0.0655456122 0.1840537619
0.4954034178 0.0719265744 0.0133095080
-0.0795784106 -0.4384576105 0.1425172949
-0.1578925885 0.2850839658 0.1277212702
0.2851236073 0.1581433623 0.1272714857
-0.4649956475 0.1854114030 0.0144343176
-0.4295246066 0.0166394054 0.1852039131
-0.3325382735 0.2745065130 0.0141821901
-0.3284271274 -0.1051364480 0.1357243850
0.2231368291 -0.2631800188 0.1351643944
-0.1815711014 0.3031301702 0.1561779354
0.3148194413 0.1608958327 0.1556739611
0.4315256448 -0.0098495541 0.0912488856
0.3673734265 0.2240957564 0.1839912956
-0.0932647651 0.0653276394 -0.1713797677
-0.0928961498 0.0655941803 0.1164639966
0.1133605106 0.0061218193 -0.1715895497
0.1137291259 0.0063883602 0.1162542145
0.3593042400 -0.2787016219 0.1844672153
-0.4287785103 -0.0514835451 0.1852660390
-0.0703356348 0.4355947460 0.1843559834
0.4039971608 0.1507334368 0.0133535892
0.1010967760 -0.0774178397 -0.1851489339
-0.1271294595 -0.0120225419 -0.1849172208
0.2933254294 0.3145002233 0.0133436697
-0.1726030063 -0.1483405662 -0.0140740190
0.0677973210 -0.2172241938 -0.0143180921
0.0558219160 0.1142375758 -0.1852684258
0.0127739706 0.1265724119 -0.1852247202
0.4249122400 0.0927815149 0.0133804681
0.0951931249 0.3317921245 0.1347773010
-0.3522533007 -0.2462453454 0.1853483879
-0.3153367921 -0.2958391627 0.0146882971
-0.1406354826 -0.4163322938 0.0145761487
-0.4831793448 0.1302544295 0.1851674173
-0.3533688341 0.3545232145 0.1847935098
-0.1818842778 0.3893849633 0.1488385167
0.0167866291 -0.1967951324 -0.1849304232
-0.1188342535 -0.1579347096 -0.1847927303
-0.0290823133 -0.3528466766 0.1539657099
-0.1619336863 -0.3147798212 0.1541005909
-0.1254483537 -0.4138538115 0.0145544049
0.1674859570 -0.3016231321 0.1352712594
-0.3015802427 -0.1672182343 0.1357474919
0.0995502063 -0.3102282517 0.1279428409
-0.2485246859 -0.2104918598 0.1282962336
0.1754581005 -0.4066192479 0.1848211009
0.3050265959 -0.3031668136 0.0139006396
-0.4195254077 -0.1501104409 0.1426856270
0.4143756120 -0.1321047998 0.0136022043
-0.4282329695 -0.0369973873 0.1852519263
-0.1661536623 0.4027578837 0.0138503568
0.2958394209 -0.3153368611 0.0139236741
0.4425348022 0.0786371750 0.0133709981
0.4925120275 -0.0906433705 0.1841224878
0.3150879115 -0.1619832193 0.1533482244
-0.3527974770 0.0293907646 0.1540263137
0.2648773049 0.3553087226 0.1840010509
0.0574858163 0.4318751553 0.0135369998
-0.2539057872 0.3480320110 0.1846721473
0.4303284863 -0.0601827136 0.0135151756
0.4304005362 -0.0263087420 0.1841424550
-0.1160160147 -0.4144968467 0.0145429212
0.0705117475 0.2460844192 0.0136923593
0.4304511257 0.0868251335 0.0133788905
0.4070783099 0.1387015524 0.0133607848
0.2704610622 0.2290299813 0.1530432990
-0.1078657088 0.3374346606 0.1534274058
-0.2196469103 -0.3763617815 0.0862798339
0.0158915462 -0.2271319937 -0.0116175436
-0.1338159500 -0.1842352326 -0.0114655489
0.0498308819 0.1019914852 -0.1715969677
0.0501994972 0.1022580261 0.1162467966
0.0496059985 0.1020559227 -0.1715967393
0.0499746138 0.1023224636 0.1162470249
0.0116209680 0.1129400455 -0.1715581740
0.0119895833 0.1132065864 0.1162855903
0.0113960846 0.1130044830 -0.1715579457
0.0117646999 0.1132710239 0.1162858186
-0.4144975312 0.1160166387 0.0144339082
-0.2670228374 -0.3429556791 0.0146700553
-0.3971241260 0.1699331993 0.1850204720
-0.1531569572 -0.4225605188 0.0145979511
-0.2252061783 0.3811599007 0.0802766781
-0.4479752337 0.0865882472 0.1459351689
0.2950062030 -0.4044383110 0.0572059232
0.1269751641 0.0068639263 -0.1852601182
-0.1044460361 0.0731747002 -0.1850251613
0.4999997753 0.0244788436 0.0133475581
-0.1817156183 0.3886845122 0.0743013982
0.1604616616 0.1741646448 0.0062211175
-0.0438904686 0.2327191243 0.0064285917
0.2545902950 -0.0267091167 0.0137092313
-0.2301022603 0.1121733126 0.0142013289
-0.0101393005 0.4300926858 0.1842839903
-0.1387019808 0.4070790389 0.0138112006
0.4725989435 -0.1609341276 0.1299707368
-0.1298772307 -0.4832394928 0.1852830658
0.3641466294 -0.2289862712 0.1844149780
-0.0973827726 -0.3403561398 0.1540416099
0.0719267285 -0.4954036969 0.0143771591
-0.3590971607 0.2381708822 0.1849085868
-0.0750555032 0.4561197370 0.0136842831
-0.3974726662 -0.1805017432 0.1853454182
0.0074394001 -0.1798973322 -0.1712816540
0.0078080154 -0.1796307913 0.1165621102
-0.1019309070 -0.1485586748 -0.1711706128
-0.1015622917 -0.1482921339 0.1166731515
-0.1400333866 -0.4161935079 0.0145752491
-0.4318750545 0.0574867561 0.0145103602
0.4272008264 -0.0506039356 0.1245125175
-0.4715209914 -0.1673518675 0.1854280685
0.0021756792 0.4359319763 0.0852435887
-0.1894740087 0.3881990065 0.1845524411
-0.3541461689 -0.3534289693 0.1854500631
0.4506266112 -0.0617991781 0.1841494172
-0.1517582633 0.4771154884 0.1568242860
0.3522042810 0.0403081206 0.1557377489
-0.2771450114 0.2206400808 0.1563767133
-0.4880228741 0.1106968980 0.1851917301
-0.3439288233 -0.2893696432 0.0147189216
0.3333662827 -0.1204523742 0.1843538941
-0.3462495088 0.0742828061 0.1850438930
0.2414257976 0.3584560727 0.1840281687
0.0712061288 0.4316442765 0.1366919790
0.3882587429 0.1898501975 0.1839962608
0.0327826795 -0.1161467696 -0.1781825044
-0.0896794867 -0.0810568080 -0.1780581713
0.3452426980 0.2609650264 0.1839854958
0.1993802704 -0.1277954468 0.0064508905
-0.2368185150 -0.0028082847 0.0068937535
-0.4138543049 0.1254489226 0.0144243503
0.4125944320 -0.1564582501 0.1842857750
0.3930191732 0.1846276820 0.1839950005
0.2711978731 -0.4207726214 0.0140528630
0.2634470817 0.2230940313 0.1346624870
-0.1050942236 0.3286948111 0.1350366588
0.0552208519 0.1124849924 0.1276081805
0.0129427775 0.1245992318 0.1276511045
-0.4027679060 -0.1630444561 0.0146772954
-0.2461855538 0.3526303055 0.1846580027
-0.0933668295 0.3418846417 0.1844722521
0.2605773162 0.2404664906 0.1841129005
-0.0761880110 0.4494091020 0.0136919474
0.1677289361 -0.4715814878 0.1848911534
0.1085226965 -0.0335660950 -0.1715466037
0.1088913118 -0.0332995540 0.1162971605
-0.1101794242 0.0291001900 -0.1713245603
-0.1098108089 0.0293667310 0.1165192040
0.4138732607 -0.1251701602 0.0135964262
-0.3517236547 -0.0400329612 0.1540892243
0.2774108842 -0.2203033866 0.1534504780
-0.4163325002 0.1406359733 0.0144134608
0.1503933214 -0.4195707353 0.1422053020
0.1634976616 -0.4027254966 0.0141740733
0.3031663333 0.3050267609 0.0133398397
-0.1987572890 0.3813972024 0.0982681160
0.3099929575 -0.3930684274 0.0139775278
0.2263908298 -0.0237780713 -0.0120754149
-0.2046771706 0.0997389302 -0.0116377611
0.1203281581 0.2142296966 0.0117370663
0.0113812801 0.2454470259 0.0118476777
0.2028683895 0.4577138377 0.0565255700
0.1742225476 -0.4096918053 0.1848255283
-0.1067759354 0.4169734932 0.0137611536
-0.4723915752 0.1611310511 0.0587871959
-0.2881829403 -0.3398280600 0.1426931056
-0.4027255504 -0.1634972480 0.0146776604
0.3492257454 0.0399580509 0.1430637428
-0.2748276449 0.2187725383 0.1436973304
0.2062157581 0.3776705710 0.1840554665
0.2620543911 0.3534525106 0.0133476462
-0.2070216684 0.3786607165 0.0917068577
0.4494084307 0.0761875079 0.0133644640
-0.2677189901 -0.3554581595 0.1853412627
-0.1818290717 -0.3894694620 0.1852627655
-0.3550837974 0.2542393507 0.1848885680
-0.2072353030 0.1010012182 -0.0015828339
0.2292471191 -0.0240672164 -0.0020259848
-0.0421705248 -0.4345828632 0.1851256921
-0.1587235010 -0.4272936159 0.0146094625
0.0899055772 0.3133650726 0.1273777496
-0.4218909174 0.0834198020 0.0144735606
-0.1127458314 -0.0539120594 0.1279773624
0.0672986346 -0.1055014897 0.1277945673
0.4472166943 -0.0591778735 0.1841513566
0.1257025389 -0.4112780511 0.0142303937
0.3811826012 0.2253521795 0.0796444079
-0.2902368229 0.3299604134 0.0140766687
0.3758402881 0.3287413032 0.1296412115
-0.1490034537 -0.2896234763 0.1282420611
-0.0267763007 -0.3246460978 0.1281179665
0.3236583175 -0.2831886344 0.0138582800
0.3215935418 0.2928069060 0.0133275571
0.3362164140 0.2893184507 0.0133120612
-0.1619854103 -0.3148854730 0.1567251311
-0.0290894659 -0.3529650998 0.1565902048
-0.4196794950 0.1532562602 0.1850647993
0.0815152476 0.0787777825 -0.1716160472
0.0818838629 0.0790443235 0.1162277170
-0.0277740205 0.1100932193 -0.1715050883
-0.0274054052 0.1103597602 0.1163386760
0.0463993732 -0.3511272140 0.1849349895
-0.2249923143 -0.2733634100 0.1852105275
0.0786429151 -0.4425268224 0.0143195948
0.3702587953 -0.3369756571 0.1569096280
0.2930594481 -0.3574833723 0.0139662615
0.3401107105 -0.2882284415 0.1418407263
0.0824492696 -0.4358303797 0.0143085195
0.1610281936 -0.4007382336 0.1315229968
0.2909255149 -0.4073828712 0.0140152008
0.0652242007 0.2276573681 0.0062935456
0.4387399751 -0.0796239472 0.1415212548
-0.1125771368 0.4150633748 0.0137703515
-0.4065587678 -0.1750811120 0.1853520345
-0.1702202544 0.3073645387 0.1434813338
0.3074097473 0.1705057934 0.1429964067
0.0482580278 -0.4982668268 0.0144101207
0.4319673360 0.0628203245 0.1840579158
0.1883631263 0.1270928139 -0.1854500631
0.1885816729 0.1272508421 -0.0147917506
-0.0928464426 0.2076698058 -0.1851645572
-0.0926278960 0.2078278340 -0.0145062448
-0.4358305166 -0.0824487850 0.0146450047
-0.2455877724 -0.3516941304 0.0750687779
0.4225655942 -0.1531662357 0.0136112188
0.1561822853 0.1695232878 -0.0021116806
-0.0427341504 0.2265202388 -0.0019097251
0.1940659951 -0.1244035852 -0.0018880209
-0.2305300237 -0.0027410469 -0.0014569380
-0.3534002798 -0.0219431609 0.1851421548
0.2884715724 -0.2058632999 0.1844904765
-0.1135180963 -0.0107421485 -0.1712833911
-0.1131494810 -0.0104756076 0.1165603732
0.0902546047 -0.0691306000 -0.1714902770
0.0906232199 -0.0688640590 0.1163534873
0.3887051646 0.1818485468 0.0737624407
-0.2538622553 -0.3551437483 0.1853232265
-0.0288594067 -0.3500055744 0.1439090251
-0.1606370122 -0.3122463933 0.1440428160
-0.0708909765 -0.4314154548 0.1376731360
0.0621750493 0.4505660943 0.1841724257
0.0708046967 0.4254234186 0.0135259178
0.0518436309 0.4400568429 0.1841953877
0.4982665746 0.0482578610 0.0133277584
-0.1436692543 0.1882702699 0.0065975286
0.2215595796 0.0836186363 0.0062267198
0.4421608946 -0.0540757052 0.1841531066
0.4771654483 0.1520734353 0.1563198670
0.4212618133 0.1717054449 0.1839707986
0.3459194748 0.2593789843 0.1839860977
-0.0369124209 -0.2246831441 -0.0115521899
-0.0877279596 -0.2101226038 -0.0115005981
-0.4306804494 0.0299008743 0.1851931133
-0.2672835287 -0.3425839226 0.0146700449
0.2672831235 0.3425843278 0.0133510140
0.4311171373 -0.0295844127 0.1841445706
-0.3454827869 -0.2590625228 0.1853515861
-0.4208251254 -0.1713889833 0.1853668852
-0.4767994435 -0.1518080838 0.1578229146
-0.4417239028 0.0543920797 0.1851845770
0.3400669804 0.3677182309 0.1838932712
-0.0591159038 -0.4468395013 0.1851587421
-0.4982668785 -0.0482574848 0.0146933004
0.3232840912 -0.0924831782 0.1293753739
-0.3375696382 0.0968938736 0.1438905370
0.3407839980 -0.0974632603 0.1558799490
-0.3315246771 0.0951509826 0.1355428873
0.3406641435 -0.0974323107 0.1532556977
-0.3131140066 0.0898660434 0.1281008183
0.3134049969 -0.0896549339 0.1274647275
-0.3403070262 0.0976912358 0.1539470726
0.3318346802 -0.0949261251 0.1348693932
-0.3404201590 0.0977270457 0.1565715605
0.3379010057 -0.0966535678 0.1432047466
-0.3229881816 0.0926978448 0.1300315198
0.1531566390 0.4225612279 0.0134231075
0.2542989432 0.3554602098 0.1840144574
-0.3885508263 -0.1817362486 0.0750944781
-0.1288148900 0.4838414270 0.1843861964
0.2155233503 -0.1381279049 0.0138624336
-0.2559699690 -0.0030275472 0.0143411303
-0.4225661007 0.1531666699 0.0144098403
0.2457421107 0.3518064286 0.0737881409
0.4358301114 0.0824491902 0.0133760542
0.0923360959 -0.2080381327 -0.1850167615
-0.1888734730 -0.1274611408 -0.1847312557
-0.4315306481 -0.0625038630 0.1852797681
-0.3070783797 -0.1702654876 0.1440988770
0.1705516220 -0.3071242329 0.1436139498
0.4069954557 0.1753975736 0.1839856494
0.1125767316 -0.4150629696 0.0142507075
-0.2246521090 -0.2730011070 0.1567665981
0.0462492922 -0.3506244258 0.1564915579
-0.4384122443 0.0798613164 0.1424968617
-0.0624442373 0.4319074661 0.1843492920
0.1609683797 0.3124866991 0.1430524676
0.0291907742 0.3502458802 0.1431862585
0.1160156966 0.4144975558 0.0134781374
0.0967727838 -0.4896560115 0.0586609424
0.2148089009 -0.0753539031 -0.0120128241
-0.2221678595 0.0498561777 -0.0115691713
-0.1607280468 0.4009559641 0.1311926785
-0.0824496748 0.4358307849 0.0137125395
-0.3397832836 0.2884658978 0.1421773905
-0.2930598533 0.3574837775 0.0140547975
-0.3698930943 0.3372410957 0.1572331539
-0.0786433203 0.4425272276 0.0137014642
0.4201159803 -0.1529397406 0.1842728847
-0.3447634378 0.0739769670 0.1565991149
0.3318903764 -0.1199094966 0.1559121233
-0.1695561450 -0.3971843959 0.1852541926
-0.3362168192 -0.2893180455 0.0147089978
-0.3215939470 -0.2928065008 0.0146935019
-0.3236587227 0.2831890396 0.0141627790
-0.2909259201 0.4073832764 0.0140058582
-0.1900852409 0.1557019894 0.0121887807
0.2436945287 0.0314079652 0.0117483737
0.1699927748 0.3975006548 0.1840834915
0.0270672910 0.3248572073 0.1274475793
0.1492944440 0.2898345858 0.1273234848
0.1963017749 0.1324627964 0.0062138359
-0.0963768461 0.2163260979 0.0065109860
-0.3755425263 -0.3285252973 0.1312120624
0.2902364177 -0.3299600082 0.0139443903
-0.3810131195 -0.2252289313 0.0810377169
-0.1257029441 0.4112784563 0.0137906653
-0.4467805129 0.0594944802 0.1851863278
0.4218902083 -0.0834193098 0.0135474987
-0.0896145869 -0.3131539631 0.1281877962
-0.0966597318 0.4897382955 0.0580017428
-0.0482584620 0.4982671307 0.0136109384
0.2681556780 0.3557746211 0.1839964212
-0.1630601092 -0.4325391744 0.0146198733
0.2538875364 0.0327242309 0.0136550964
-0.1980307995 0.1622156284 0.0141139191
-0.4494088359 -0.0761871027 0.0146565950
0.2072204789 -0.3785162610 0.0918775151
-0.2620547963 -0.3534521054 0.0146734128
0.2751590124 -0.2185322326 0.1433979532
-0.3488943778 -0.0397177451 0.1440315408
0.4027251452 0.1634976532 0.0133433986
0.2885103672 0.3400655163 0.1413250112
0.4725049891 -0.1610486515 0.0578754887
-0.3245647475 -0.3807798864 0.1854375076
0.1292515198 -0.4835251680 0.1849514877
0.1067755302 -0.4169730880 0.0142599053
-0.1737858597 0.4100082668 0.1845121555
0.3555204853 -0.2539228892 0.1844491159
0.0595525337 0.4471557603 0.1841789420
0.1851686841 0.3004080937 0.1557108058
0.0022898772 0.3528096681 0.1558964786
-0.0648606735 0.0934661530 -0.1714421982
-0.0644920582 0.0937326939 0.1164015660
0.1041685591 0.0450329963 -0.1716138099
0.1045371744 0.0452995373 0.1162299544
-0.2128875163 0.1037704816 0.0067644162
0.2355238545 -0.0247160401 0.0063091541
-0.3099933627 0.3930688326 0.0140435312
0.1989729379 -0.3812405712 0.0984649753
-0.3031667385 -0.3050263557 0.0146812193
-0.2276833079 -0.0027169236 -0.0115134259
0.1916451725 -0.1228701164 -0.0119391608
-0.1634980668 0.4027259018 0.0138469857
-0.1500658945 0.4198081917 0.1418128148
0.4163322976 -0.1406356261 0.0136075980
-0.2770537668 0.2205623118 0.1537522923
0.3520807721 0.0402918864 0.1531135460
-0.4138734633 0.1251705073 0.0144246326
-0.2027581537 -0.4576334295 0.0578926229
-0.1672922481 0.4718979493 0.1844465304
0.0761876058 -0.4494086968 0.0143291116
0.2466222417 -0.3523138439 0.1846796811
0.4027675008 0.1630448613 0.0133437636
0.1054042268 -0.3284699536 0.1353756217
-0.2631370786 -0.2228691739 0.1357497936
-0.2711982783 0.4207730266 0.0139681960
-0.3925824853 -0.1843112204 0.1853426833
-0.4121574402 0.1567746246 0.1850519085
0.4138537984 -0.1254484883 0.0135967088
-0.3448060101 -0.2606485649 0.1853521881
0.2318704789 -0.0813035552 0.0118678856
-0.2397464250 0.0538322141 0.0123467078
-0.3878220550 -0.1895337359 0.1853414231
0.1107563890 0.4883995088 0.1840751786
0.1822657306 0.3897858223 0.1840749185
0.4884592581 -0.1103803494 0.1841459541
-0.1854106629 -0.4649947992 0.0146785493
-0.0938250082 0.2105637126 -0.0018295221
0.1910698117 0.1289307593 -0.0021187695
0.2775088504 -0.2203762954 0.1560747962
-0.3518404420 -0.0400443351 0.1567137606
0.1521242681 -0.4768501369 0.1573184956
-0.4501894168 0.0621154945 0.1851882662
0.1899106966 -0.3878825450 0.1847852428
0.4719576793 0.1676683290 0.1839096154
0.0604984579 -0.4256555511 0.1849859467
-0.4269173366 0.0508100306 0.1255124003
0.4318749532 -0.0574864380 0.0135106985
0.3979093541 0.1808182048 0.1839922657
-0.2409891097 -0.3581396112 0.1853095152
0.3439284181 0.2893700484 0.0133021374
0.1254479775 0.4138543180 0.0134666540
0.0977398900 0.3406150649 0.1531611604
-0.3637099415 0.2293027327 0.1849227058
0.1303139186 0.4835559544 0.1840546181
-0.4723016882 0.1611502786 0.1308825375
0.1387015757 -0.4070786337 0.0142098584
0.1533158155 0.4200560524 0.1840839621
0.1818699566 -0.3885722140 0.0745555206
-0.4999997753 -0.0244785545 0.0146735005
0.0185453626 0.4297419093 0.0979450695
-0.0373629900 -0.2274962830 -0.0014961879
-0.0888167113 -0.2127528798 -0.0014439481
-0.2948959672 0.4045187192 0.0572122697
0.4483110462 -0.0863443182 0.1449475109
0.2253756600 -0.3810366525 0.0804054467
0.3975610165 -0.1696167958 0.1843172116
0.1587230377 0.4272938185 0.0134115968
-0.0709397145 0.1031068663 0.1277784269
0.1149922388 0.0498304520 0.1275896543
0.0750550980 -0.4561193318 0.0143367759
0.3595338486 -0.2378544207 0.1844290970
-0.0455302033 0.2414567274 0.0119242540
0.1664892344 0.1807052794 0.0117089954
0.1630595589 0.4325390731 0.0134011863
0.2670224322 0.3429560843 0.0133510036
0.4144968221 -0.1160161464 0.0135871511
0.0634783581 0.2215939993 -0.0020411801
0.1082228262 -0.3371757355 0.1537753645
-0.2701039449 -0.2287710561 0.1541594713
-0.4070787151 -0.1387011472 0.0146602742
-0.4304515309 -0.0868247283 0.0146421685
-0.1398585884 0.1832553990 -0.0017452838
0.2156556890 0.0813873469 -0.0021062296
-0.4299638483 0.0266252036 0.1851952289
-0.4303289928 0.0601831478 0.0145058835
0.2543424751 -0.3477155495 0.1846655365
0.1400329523 0.4161938117 0.0134458100
-0.3336501345 -0.1162469998 0.1567610289
0.2217226575 -0.2753819436 0.1561971712
-0.1423504138 -0.3226644830 0.1567071897
-0.0498645936 -0.3491651075 0.1566132909
-0.3396304086 -0.3674021745 0.1854444131
0.2192454630 0.0546911639 -0.0147638293
-0.1570654616 0.1625182283 -0.0143817692
0.1661532571 -0.4027574785 0.0141707022
0.4286696574 0.0373138489 0.1840857576
-0.4143756120 0.1321050889 0.0144188543
0.4198528346 0.1503478972 0.1413324898
-0.3050270011 0.3031672188 0.0141204194
-0.1750214126 0.4069357094 0.1845165830
0.2488156762 0.2107029693 0.1272693122
-0.0992592160 0.3104393612 0.1276227049
0.3018902459 0.1674430918 0.1346647886
-0.1671759538 0.3018479895 0.1351410212
-0.2644406170 -0.3549922610 0.1853366330
0.3531545944 -0.0291318395 0.1531764566
-0.3147307941 0.1622421444 0.1538545459
-0.4920753396 0.0909598321 0.1852151961
-0.4425352074 -0.0786367698 0.0146500609
-0.2958398261 0.3153372663 0.0140973848
-0.0719271627 0.4954040008 0.0136439000
0.1822295225 -0.3891346231 0.1490931320
0.3538058259 -0.3542068401 0.1845441738
0.4836160327 -0.1299379680 0.1841702666
0.0508484624 0.4271623805 0.1245520700
0.3153363869 0.2958395679 0.0133327619
0.3526899886 0.2465618070 0.1839892960
-0.0948831218 -0.3315672670 0.1356349796
-0.4249126452 -0.0927811097 0.0146405909
-0.2933258346 -0.3144998181 0.0146773893
0.1129816280 0.0077222539 -0.1715905465
0.1133502433 0.0079887949 0.1162532177
-0.0920958017 0.0664845587 -0.1713823360
-0.0917271865 0.0667510996 0.1164614283
0.1622908037 0.3150387463 0.1531021794
0.0294394307 0.3531056017 0.1532370605
-0.3669367386 -0.2237792949 0.1853463883
-0.3521208200 -0.0219486435 0.1566973631
0.2873299905 -0.2051750641 0.1560481429
-0.4313268342 0.0099940097 0.0923354871
-0.1443905450 -0.1988147879 0.0124585432
0.0171851206 -0.2451122206 0.0122944990
-0.2228268260 0.2634048763 0.1352478862
0.3287371306 0.1053613054 0.1346878955
0.3325378683 -0.2745061078 0.0138388688
0.4299612945 -0.0163229438 0.1841337707
0.4649948371 -0.1854108817 0.0135867418
-0.2848326170 -0.1579322528 0.1282940601
0.1581835788 -0.2848728563 0.1278442756
-0.4954037217 -0.0719261982 0.0147115509
-0.4328037155 -0.0652291506 0.1852839220
0.3502913085 -0.0289053641 0.1431261452
-0.3122009309 0.1609232822 0.1437987589
0.2309074617 0.3629598702 0.0977349563
-0.3343243473 -0.1165278473 0.1852053106
0.2221981863 -0.2759922348 0.1846402856
0.4254234374 -0.0708053740 0.0135312936
0.0996871643 -0.0757489251 0.1277255396
-0.1244628067 -0.0115216285 0.1279531141
-0.4039975660 -0.1507330316 0.0146674698
0.4292151982 0.0518000066 0.1840716449
-0.3588679573 0.2790181995 0.1848704690
-0.0771436799 0.4403505716 0.1843602980
0.2443697166 -0.0256388201 0.0118003339
-0.2208694137 0.1076694801 0.0122726809
0.3155678588 0.2956833577 0.0133326101
-0.4977085297 -0.0531551176 0.0578957955
-0.1552843018 0.2035111868 0.0140209382
0.2394974492 0.0903915442 0.0136201250
0.3786875003 0.2071929335 0.0911155710
-0.0617385066 -0.4502501392 0.1851652588
-0.1941381215 -0.1668537307 0.0144136496
0.0763135130 -0.2443481745 0.0141390660
-0.3132018940 0.1648295578 0.1564745682
0.3532328954 -0.0261287755 0.1557979517
-0.1842515009 0.3929594325 0.1845413450
-0.3807204146 0.3249420172 0.1848559284
0.0820833417 0.0783617900 -0.1716163895
0.0824519570 0.0786283310 0.1162273747
-0.0284762135 0.1100412112 -0.1715041409
-0.0281075982 0.1103077522 0.1163396234
-0.0514070881 -0.4397408879 0.1851422968
0.0977766304 0.3407339887 0.1557853794
0.0978130549 0.3407603268 0.1842284666
-0.2904369047 -0.2024592046 0.1852286797
0.1394631202 -0.3256415378 0.1847922117
-0.3395988483 0.2668137401 0.1315459566
-0.4778802785 -0.1482334219 0.1854185087
-0.1713293023 0.4212020683 0.1844986443
0.2198299310 0.3764946590 0.0850198972
-0.0926736628 0.2079418997 -0.0118813888
0.1886858284 0.1273219496 -0.0121670469
-0.2868750161 0.3426950405 0.1847193100
-0.0474302632 0.2515555677 0.0138383307
0.1734538340 0.1882640653 0.0136140719
0.1513923100 -0.4038289376 0.0141905973
0.3287824980 -0.3755839410 0.1303536734
0.4308716977 0.0863724882 0.0133787711
-0.2572971957 0.2435106480 0.1847732763
0.3475337309 0.0702041107 0.1841592049
0.3545827698 0.3537451269 0.1838876212
0.4038286001 0.1513922956 0.0133531949
-0.1233909922 0.0326006811 -0.1849633291
0.1215576521 -0.0375862083 -0.1852120200
-0.2629582061 0.2093082933 0.1298466646
0.3341193090 0.0382233965 0.1292404650
0.3351390780 -0.0276628861 0.1293001692
-0.2987159857 0.1539601451 0.1299437082
0.0426070676 0.4348988183 0.1842119924
-0.4273808501 0.0369332197 0.0749417181
-0.0985370764 0.4210099307 0.0137468652
0.0369537185 0.4275142919 0.0739854123
-0.3763366929 0.2198054640 0.0859284463
-0.2904183469 0.3293689822 0.0140774488
0.1406350194 0.4163324964 0.0134449105
0.1542307047 0.1674113080 -0.0121600457
-0.0422160658 0.2237006081 -0.0119605977
-0.3627738619 0.2308784734 0.0986175361
0.3985971279 -0.1682387511 0.1843146087
0.1630448700 -0.4027678518 0.0141746924
0.4225605351 -0.1531571130 0.0136112169
-0.2242057606 -0.3685944791 0.0924208159
0.0286594568 0.3439605644 0.1348512367
0.1580747739 0.3068782667 0.1347198442
-0.0399947101 0.3521544396 0.1559512353
0.2206896924 0.2774586706 0.1556865682
-0.4895255344 -0.0966503128 0.1311433157
-0.0459225592 0.4284887806 0.1843312999
-0.2265579826 0.0235573734 -0.1848228385
0.2042800694 -0.0998937393 -0.1852602588
-0.3516732640 0.2457216039 0.0746514300
0.1486105055 -0.4779407547 0.1849215253
0.3942325899 -0.1740485010 0.1843255778
0.1778591681 -0.1841079202 0.0139532438
-0.2483718136 -0.0619769042 0.0143859867
0.1327704762 0.1828426196 -0.0147717559
-0.0158460317 0.2254267720 -0.0146208688
0.0927815773 -0.4249125163 0.0142851780
0.3202661416 0.1026459448 0.1291985508
-0.2170896428 0.2566183463 0.1297441162
-0.3423560677 -0.2699828068 0.1853576941
0.0687025842 -0.2200585109 -0.0016389038
-0.1748481363 -0.1502721786 -0.0013916321
0.2073406830 0.4556403270 0.0133230879
-0.0368061294 0.3238691315 0.1275302911
0.2029519634 0.2551695280 0.1272868700
0.0368619685 0.4325685807 0.1842215074
-0.3429562668 0.2670233485 0.0142024609
0.1253620684 0.2231912190 0.0136433164
0.0118607956 0.2557135517 0.0137585518
-0.2667522848 -0.3553208089 0.1853398975
0.2956832110 -0.3155683329 0.0139240885
-0.4371254466 0.0502208302 0.0145238121
-0.3416027524 -0.2786620938 0.1853647664
0.3574828849 0.2930595440 0.0132813630
-0.4050183451 0.1617663414 0.1850381439
-0.3452724361 0.2657227024 0.0142066314
0.3104790623 0.0995099368 0.1272933094
-0.2104521319 0.2487760829 0.1278221993
0.2287994415 0.4452514377 0.0133052277
-0.4357737288 0.0021511975 0.0862061080
0.2293623247 0.3640863869 0.1840384037
0.3439174174 0.2893699121 0.0133021516
0.0982854467 -0.4211326564 0.0142746295
-0.4281119836 -0.0459821825 0.1852600912
-0.3580806568 0.2413664940 0.1849043260
0.1114594021 0.1984736545 -0.0121340359
0.0105151306 0.2273979396 -0.0120315494
0.3998573249 0.1792998046 0.1839911771
-0.1380658755 0.1808728221 -0.0144230964
0.2128494356 0.0803225447 -0.0147793729
-0.1028662613 -0.0492791144 -0.1712613470
-0.1024976460 -0.0490125734 0.1165824172
0.0608103418 -0.0961785437 -0.1714275242
0.0611789571 -0.0959120028 0.1164162400
0.1923884040 -0.3856241050 0.1847799785
0.2462535381 0.3524205291 0.1483244683
0.4839014005 0.1291908836 0.1839299500
-0.3547433830 0.2566859915 0.1848858665
0.0868252048 -0.4304513971 0.0142979347
0.4561190644 0.0750549917 0.0133569190
0.0919279543 -0.2064750307 -0.0143589477
-0.1873792228 -0.1264431448 -0.0140753733
0.3429575237 0.0392364315 0.1347309158
-0.2699074121 0.2148450110 0.1353531440
0.2928067676 -0.3215940149 0.0139333519
-0.0873333286 -0.4210975733 0.0145123021
-0.4074832998 0.1600424608 0.1850428968
0.0799057505 0.4386947630 0.1415008223
0.1387509144 -0.3241051383 0.1563485428
-0.2890724848 -0.2015178356 0.1567829025
-0.4161938150 0.1400339059 0.0144138407
0.4356546051 0.0707117208 0.1840458864
0.2703596821 -0.3424166353 0.1846401180
0.3558346226 -0.2677806428 0.1844615457
0.0322518962 -0.1149508716 0.1221475962
-0.0880323455 -0.0804849663 0.1222697181
-0.2297894705 -0.0573436705 0.0069352514
0.1645364358 -0.1703326967 0.0065349010
0.0910193260 0.4924519993 0.1840967015
0.2831881398 0.3236585135 0.0133481711
-0.4396807788 0.0517853338 0.1851843744
-0.3299599401 -0.2902361400 0.0147018353
-0.3077217847 -0.3009577520 0.0146832850
0.3930679060 0.3099930178 0.0132201122
0.4452509270 -0.2288000009 0.0136522040
0.3524681353 -0.2459562597 0.1487425409
0.3372908517 0.3702085176 0.1562970003
0.3777317937 -0.2058400019 0.1843761475
0.3425323210 0.2732962492 0.1839775481
0.4157429772 -0.1100374243 0.0135800190
0.1334566570 0.1839292819 -0.1854323795
-0.0161718261 0.2268034028 -0.1852804650
-0.1726923408 -0.1484168059 -0.0114489310
0.0678376490 -0.2173375866 -0.0116931357
0.4294216001 0.0535111596 0.1840697961
-0.1613893100 -0.4050787290 0.1852510442
-0.0609477562 -0.4274737175 0.1318320180
-0.2477208335 -0.3559980675 0.1853161528
0.0866338844 0.4482653218 0.1449156338
-0.0966075986 -0.3376151865 0.1439843107
-0.3685674233 0.2243779186 0.0920565992
-0.0110028500 -0.4298552418 0.0801021403
-0.3559378188 0.2480989406 0.1848953476
0.4186655959 -0.1465131445 0.0136100525
-0.4425269612 -0.0786424211 0.0146500556
0.1611905333 0.4725585659 0.1297829202
-0.1789236337 0.3997975805 0.1845281900
0.3100337775 0.1719637149 0.1556698409
-0.1716502029 0.3099840757 0.1561588839
-0.2237195294 0.3673137225 0.1846156358
0.3953393148 0.1697190004 0.1243493024
-0.3330255544 0.2740300964 0.0141832553
0.3069209068 -0.1578077692 0.1349595259
-0.3436930334 0.0286173029 0.1356200798
0.2552096091 -0.2027012954 0.1276439330
-0.3236179111 -0.0368457003 0.1282316038
0.0161050391 -0.2299764683 -0.0015623629
-0.1354845891 -0.1865404064 -0.0014084574
-0.4295556230 0.0185163705 0.0988997030
0.2286144150 0.0294553062 -0.0020747360
-0.1783535836 0.1460667616 -0.0016615504
-0.1820917635 0.3039628673 0.1846209893
0.3157554561 0.1613111378 0.1841155361
-0.0540137435 -0.4417837058 0.1851475266
0.0403413841 -0.3517729361 0.1538758110
-0.2202538755 -0.2771027100 0.1541403876
0.2790777778 0.3592443418 0.1839792213
-0.4426015716 -0.0044974972 0.0809121921
-0.4169732034 -0.1067750776 0.0146433818
-0.0396726126 0.3491803983 0.1432754322
0.2188176576 0.2751133298 0.1430129928
0.1611457395 0.4724893673 0.0576875672
0.0371363312 0.4282624006 0.1485220368
0.1531657037 0.4225660844 0.0134230914
-0.0966099776 0.4897827246 0.1300971124
-0.2047876137 -0.1059038545 -0.0013943761
0.1175958725 -0.1982787038 -0.0017216849
0.0927380469 0.3232434863 0.1292856538
-0.1428459312 -0.3239819792 0.1851522025
-0.0500886301 -0.3505603930 0.1850580280
0.2566586099 0.2173447117 0.1291737970
-0.1023909962 0.3202257669 0.1295383321
0.4036712964 0.1750705304 0.0133314705
0.2705571190 0.2291110817 0.1556674770
-0.1078993146 0.3375529142 0.1560517155
-0.1067239409 -0.4889174297 0.1576611531
-0.4272938396 0.1587240117 0.0144107486
0.2774516420 0.3383051672 0.1365142904
-0.3784210353 -0.2160599142 0.0863347233
-0.4896401909 -0.0966745007 0.0590480104
-0.1251700256 -0.4138732742 0.0145540665
0.3576629648 -0.2747280153 0.1844656376
-0.3145004480 0.2933263223 0.0141416638
-0.3423179913 -0.2869348355 0.1853733428
0.3099235505 0.1719020209 0.1530456630
-0.1715942998 0.3098747793 0.1535345374
-0.0251644137 -0.4289033230 0.1696155205
-0.2786022769 0.3419797915 0.1847093782
-0.0532459978 -0.4411815751 0.1851459858
-0.4044228892 -0.2949105167 0.0580001965
0.4112777411 0.1257025055 0.0133674440
0.1750705354 -0.4036716620 0.0141601291
-0.2590027181 0.3458598043 0.1846806859
-0.3549320325 0.2648187294 0.1848785772
0.3894320473 0.1821816798 0.1482987524
0.0109626440 0.2365647967 0.0063547853
0.1159689981 0.2064765740 0.0062481746
0.0863725601 -0.4308719687 0.0142989038
0.3293681037 0.2904180700 0.0133198130
-0.0629324945 -0.2189258019 -0.1848078413
0.4190284611 -0.0967770175 0.0135635326
0.0532510961 -0.4977233974 0.0576018982
0.1745866891 -0.4087843917 0.1848242218
0.4150626737 0.1125766886 0.0133747514
0.1578419003 -0.1638359085 -0.1851415798
0.1580604468 -0.1636778803 -0.0144832673
-0.2210298584 -0.0552750699 -0.1847569196
-0.2208113119 -0.0551170417 -0.0140986072
0.2575854261 0.3445934972 0.1243637789
-0.0162623146 -0.4295848684 0.1850878857
-0.4090830943 -0.1541205457 0.1378494550
0.1846884790 -0.3926419579 0.1847963376
-0.4399737329 -0.0772033013 0.1853041920
0.4315041418 0.1493113491 0.1447508188
-0.0444589100 -0.4355111038 0.1851294822
0.4325391985 -0.1630602807 0.0136076083
0.4207721352 0.2711978854 0.0132205579
-0.0295237770 -0.4307406959 0.1851059388
0.1601020279 0.4078598445 0.1840865652
0.4577288129 -0.2027736896 0.0568107995
0.0919436928 0.0877727290 -0.1852901774
-0.0318819555 0.1232533789 -0.1851644600
0.3857422457 -0.2173343116 0.0800484928
-0.4165611052 -0.1719552812 0.1853619491
-0.3380335722 0.2774088778 0.1373588757
-0.4297159306 -0.0101989079 0.1852290102
0.3286632190 -0.3756912085 0.0582584510
0.3446326257 -0.2573409984 0.1248096918
0.2898745897 -0.1490437960 0.1275498543
-0.3246060623 0.0270277462 0.1281737229
0.1568341875 0.4125339906 0.1840864218
-0.2160352791 0.3785795191 0.0855761395
-0.2745060113 -0.3325376729 0.0146699914
0.2298815168 0.0867625519 0.0117148049
-0.1490530471 0.1953413865 0.0120995287
-0.3425845107 0.2672840395 0.0142017434
-0.4096313254 -0.1738455550 0.1853548251
0.3757884701 0.3286475903 0.0575458901
-0.2740295943 -0.3330249545 0.0146698325
0.1100369753 0.4157437184 0.0134846399
-0.1490217870 0.4314582850 0.1452329797
-0.3529159826 0.0294039985 0.1566508293
0.3151993542 -0.1620358741 0.1559725066
-0.2377937883 -0.3591571322 0.1853063654
0.4211323751 0.0982853910 0.0133802121
-0.2987839197 -0.3447485377 0.1461435275
-0.3855636130 -0.1920114470 0.1853408253
0.1113969039 0.1983643029 -0.0147587576
0.0105053078 0.2272734946 -0.0146563246
0.0705910980 -0.2260641620 0.0067068151
-0.1796149549 -0.1543708296 0.0069608438
0.1723322829 -0.4166215855 0.1848343659
0.1251028215 0.0070288669 0.1276163405
-0.1021833610 0.0721548046 0.1278470991
-0.3673419154 0.3400074361 0.1848248453
0.1808787189 -0.3975331492 0.1848057456
-0.2657221890 -0.3452718509 0.0146705345
0.0266847963 0.4303405600 0.1842366035
-0.1507338569 0.4039979028 0.0138294618
-0.2248093240 0.0235542956 -0.0141663363
0.2031153740 -0.0990620330 -0.0146007988
-0.1739878524 -0.3938559627 0.1852567858
0.2068704178 -0.1325850486 0.0119473871
-0.2456982565 -0.0029073050 0.0124068701
0.4027571239 0.1661532497 0.0133408985
0.4009968247 0.1609865730 0.1306955383
0.0676792774 0.2362060052 0.0117841391
-0.4888666333 0.1070401247 0.1575986767
0.2893699379 -0.3439288958 0.0139584350
0.4305189932 -0.0597703377 0.0135145498
-0.4354511907 0.0448372060 0.1851853919
0.4349593181 -0.0422311701 0.1841513610
-0.1100372934 -0.4157430094 0.0145364187
-0.2057793605 -0.3773551224 0.1852822187
-0.2893702067 0.3439183003 0.0140626340
-0.3511052208 -0.2906851200 0.0147293299
0.2941119455 0.1631283605 0.1291760378
-0.1628733573 0.2940716323 0.1296400049
0.3556975611 -0.2668129239 0.1844608252
0.3898461002 -0.1818897182 0.1843384561
-0.4252392740 0.0714610113 0.0144889223
0.4091605997 0.1745261592 0.1839836836
-0.3534526830 0.2620553179 0.0142205030
-0.1465129959 -0.4186655860 0.0145858361
-0.0368958619 -0.2245663207 -0.0141772223
-0.0622904624 -0.2172898239 -0.0141514398
-0.0876850629 -0.2100133271 -0.0141256572
-0.2665542943 -0.3396398731 0.1320139861
-0.3447025549 0.2990744609 0.1456061566
-0.3476549989 -0.2539655873 0.1853496482
-0.1321046620 -0.4143756175 0.0145634122
0.4326293922 -0.0364872531 0.1841490259
-0.2173106525 -0.3855957738 0.0809765764
-0.1156188648 -0.1560849087 0.1280756529
0.0156259090 -0.1936914137 0.1279424029
0.2272178273 -0.2679800276 0.1435051354
-0.3344152316 -0.1070512847 0.1440753490
0.4283094253 -0.0368389738 0.1484517770
-0.0244795430 0.5000000000 0.0135788823
0.4316871617 -0.0709347897 0.1366957278
-0.1608926264 -0.4723420535 0.1310703529
0.3376026808 0.1082127689 0.1556935687
-0.2287975005 0.2705074695 0.1562686223
-0.2287221910 0.2704123433 0.1536442378
0.3374834966 0.1081733724 0.1530693817
0.0601822087 0.4303290898 0.0135349784
0.3814263263 0.1989430546 0.0976940787
-0.2746660674 -0.3572854812 0.1853518513
-0.1391748294 -0.1916293472 0.0069435569
0.0165558945 -0.2362519869 0.0067854469
0.2610254467 -0.3448665675 0.1846543401
0.0179062672 -0.2553604659 0.0142240602
-0.1504260295 -0.2071270072 0.0143949642
-0.0514239204 0.4291553141 0.1843377277
-0.4073827720 -0.2909251456 0.0148016217
-0.2003809162 0.3805665485 0.1845734762
0.1541457843 0.1673193428 -0.0147847548
-0.0421976614 0.2235790365 -0.0145854117
0.2733566614 -0.3421562041 0.1846360389
0.2893183310 -0.3362168887 0.0139513598
0.0786372638 -0.4425350686 0.0143196096
-0.3009584043 0.3077222620 0.0141109912
0.0382643992 -0.3338641969 0.1299638895
-0.2090526114 -0.2629986825 0.1302149849
0.4210092439 0.0985366157 0.0133801372
0.3806262749 0.2007571183 0.1839959353
-0.0531407733 0.4978041095 0.0568162944
3 421 1187 793
3 793 1187 552
3 793 552 119
3 119 552 1
3 119 1 242
3 846 1187 506
3 506 1187 421
3 552 392 1
3 276 646 955
3 955 646 1099
3 955 1099 895
3 895 1099 650
3 895 650 797
3 498 646 916
3 916 646 276
3 1099 878 650
3 501 87 710
3 710 87 99
3 710 99 1109
3 1109 99 1234
3 1109 1234 121
3 731 87 830
3 830 87 501
3 99 246 1234
3 434 30 1147
3 1147 30 371
3 1147 371 1035
3 1035 371 280
3 1035 280 809
3 439 980 371
3 371 980 1014
3 371 1014 114
3 114 1014 339
3 114 339 711
3 711 1239 114
3 114 1239 594
3 114 594 1198
3 1198 594 1023
3 593 53 20
3 20 53 594
3 20 594 1188
3 1188 594 69
3 53 405 594
3 594 405 1101
3 594 1101 1023
3 1198 154 114
3 114 154 275
3 114 275 735
3 114 735 371
3 371 735 223
3 371 223 280
3 809 485 1035
3 1239 69 594
3 30 439 371
3 472 803 925
3 925 803 367
3 925 367 851
3 1111 803 521
3 521 803 472
3 592 53 1146
3 1146 53 593
3 1146 593 544
3 405 53 373
3 373 53 592
3 779 94 686
3 686 94 808
3 686 808 487
3 368 94 531
3 531 94 779
3 666 503 1084
3 1084 503 717
3 1084 717 1246
3 1246 717 718
3 1246 718 1218
3 757 503 316
3 316 503 666
3 717 849 718
3 422 693 362
3 362 693 130
3 362 130 801
3 801 130 702
3 801 702 763
3 905 693 1174
3 1174 693 422
3 130 745 702
3 792 380 1055
3 1055 380 1081
3 1055 1081 549
3 549 1081 972
3 549 972 988
3 1028 380 771
3 771 380 792
3 1081 318 972
3 947 340 804
3 804 340 224
3 804 224 961
3 961 224 338
3 961 338 1199
3 947 287 340
3 340 287 282
3 340 282 519
3 57 340 1142
3 1142 340 519
3 1142 519 695
3 57 286 340
3 340 286 296
3 340 296 101
3 340 101 224
3 224 101 210
3 224 210 873
3 338 224 317
3 317 224 873
3 317 873 579
3 747 1032 134
3 134 1032 1207
3 134 1207 277
3 277 1207 787
3 277 787 1163
3 419 376 1207
3 1207 376 700
3 1207 700 178
3 178 700 147
3 178 147 1031
3 1031 699 178
3 178 699 553
3 178 553 979
3 979 553 561
3 291 1165 1195
3 1195 1165 553
3 1195 553 507
3 507 553 299
3 1165 0 553
3 553 0 1227
3 553 1227 561
3 979 843 178
3 178 843 7
3 178 7 624
3 178 624 1207
3 1207 624 1047
3 1207 1047 787
3 1163 300 277
3 699 299 553
3 1032 419 1207
3 732 779 64
3 64 779 686
3 64 686 1121
3 1121 686 604
3 1121 604 245
3 531 779 960
3 960 779 732
3 686 487 604
3 851 592 925
3 925 592 1146
3 925 1146 472
3 472 1146 597
3 472 597 521
3 373 592 84
3 84 592 851
3 1146 544 597
3 783 1051 348
3 348 1051 106
3 348 106 1129
3 1129 106 1106
3 1192 236 1015
3 1015 236 1106
3 1015 1106 86
3 86 1106 106
3 678 8 573
3 573 8 850
3 573 850 794
3 794 850 796
3 759 746 212
3 212 746 796
3 212 796 36
3 36 796 850
3 418 40 865
3 865 40 665
3 865 665 43
3 43 665 153
3 137 211 173
3 173 211 153
3 173 153 818
3 818 153 665
3 747 134 858
3 858 134 277
3 858 277 252
3 252 277 611
3 562 384 1193
3 1193 384 611
3 1193 611 300
3 300 611 277
3 1109 712 710
3 710 712 1103
3 710 1103 501
3 182 712 121
3 121 712 1109
3 87 1165 99
3 99 1165 291
3 99 291 246
3 0 1165 731
3 731 1165 87
3 895 1077 955
3 955 1077 1132
3 955 1132 276
3 981 1077 797
3 797 1077 895
3 646 123 1099
3 1099 123 272
3 1099 272 878
3 645 123 498
3 498 123 646
3 119 118 793
3 793 118 584
3 793 584 421
3 1202 118 242
3 242 118 119
3 515 177 637
3 637 177 898
3 637 898 52
3 52 898 1226
3 52 1226 855
3 515 309 177
3 177 309 1038
3 177 1038 292
3 1092 177 574
3 574 177 292
3 574 292 170
3 1092 1184 177
3 177 1184 728
3 177 728 760
3 177 760 898
3 898 760 930
3 898 930 408
3 1226 898 623
3 623 898 408
3 623 408 452
3 1230 105 156
3 156 105 724
3 156 724 824
3 824 724 746
3 824 746 759
3 1230 1022 105
3 105 1022 1238
3 105 1238 167
3 1111 105 803
3 803 105 167
3 803 167 367
3 1111 833 105
3 105 833 541
3 105 541 948
3 105 948 724
3 724 948 924
3 724 924 80
3 746 724 796
3 796 724 80
3 796 80 794
3 137 1078 211
3 211 1078 77
3 211 77 153
3 153 77 770
3 153 770 1166
3 27 90 77
3 77 90 857
3 77 857 1130
3 1130 857 819
3 1130 819 361
3 361 610 1130
3 1130 610 435
3 1130 435 58
3 58 435 1156
3 272 123 723
3 723 123 435
3 723 435 847
3 847 435 1054
3 123 645 435
3 435 645 1143
3 435 1143 1156
3 58 601 1130
3 1130 601 279
3 1130 279 490
3 1130 490 77
3 77 490 764
3 77 764 770
3 1166 43 153
3 610 1054 435
3 1078 27 77
3 215 499 1233
3 1233 499 51
3 1233 51 956
3 956 51 798
3 956 798 288
3 215 682 499
3 499 682 161
3 499 161 407
3 336 499 73
3 73 499 407
3 73 407 891
3 336 445 499
3 499 445 107
3 499 107 1225
3 499 1225 51
3 51 1225 629
3 51 629 222
3 798 51 940
3 940 51 222
3 940 222 360
3 542 247 1128
3 1128 247 56
3 1128 56 1005
3 1005 56 510
3 1005 510 91
3 854 894 56
3 56 894 580
3 56 580 1097
3 1097 580 1118
3 1097 1118 249
3 249 581 1097
3 1097 581 729
3 1097 729 295
3 295 729 719
3 983 89 68
3 68 89 729
3 68 729 788
3 788 729 991
3 89 1076 729
3 729 1076 39
3 729 39 719
3 295 444 1097
3 1097 444 16
3 1097 16 664
3 1097 664 56
3 56 664 227
3 56 227 510
3 91 990 1005
3 581 991 729
3 247 854 56
3 1044 301 889
3 889 301 399
3 889 399 281
3 281 399 197
3 281 197 834
3 1044 605 301
3 301 605 387
3 301 387 1021
3 293 301 192
3 192 301 1021
3 192 1021 124
3 293 785 301
3 301 785 1189
3 301 1189 447
3 301 447 399
3 399 447 885
3 399 885 59
3 197 399 342
3 342 399 59
3 342 59 715
3 1039 814 497
3 497 814 10
3 497 10 1217
3 1217 10 643
3 1217 643 448
3 536 766 10
3 10 766 436
3 10 436 1219
3 1219 436 257
3 1219 257 752
3 752 1053 1219
3 1219 1053 599
3 1219 599 4
3 4 599 634
3 1135 802 179
3 179 802 599
3 179 599 612
3 612 599 949
3 802 502 599
3 599 502 572
3 599 572 634
3 4 250 1219
3 1219 250 71
3 1219 71 1191
3 1219 1191 10
3 10 1191 1211
3 10 1211 643
3 448 874 1217
3 1053 949 599
3 814 536 10
3 484 1095 1220
3 1220 1095 357
3 1220 357 756
3 756 357 112
3 756 112 174
3 253 1095 369
3 369 1095 484
3 357 774 112
3 852 76 483
3 483 76 730
3 483 730 1139
3 1139 730 22
3 1139 22 1034
3 441 76 773
3 773 76 852
3 730 875 22
3 1006 635 343
3 343 635 190
3 343 190 375
3 375 190 631
3 375 631 475
3 782 635 370
3 370 635 1006
3 190 388 631
3 929 1036 576
3 576 1036 1157
3 576 1157 158
3 158 1157 37
3 158 37 1136
3 363 1036 648
3 648 1036 929
3 1157 1033 37
3 837 1241 129
3 129 1241 915
3 129 915 260
3 260 915 994
3 260 994 488
3 848 294 915
3 915 294 265
3 915 265 1144
3 1144 265 942
3 1144 942 575
3 575 33 1144
3 1144 33 691
3 1144 691 65
3 65 691 254
3 692 1208 3
3 3 1208 691
3 3 691 74
3 74 691 1194
3 1208 890 691
3 691 890 172
3 691 172 254
3 65 1113 1144
3 1144 1113 1007
3 1144 1007 563
3 1144 563 915
3 915 563 1052
3 915 1052 994
3 488 791 260
3 33 1194 691
3 1241 848 915
3 600 551 15
3 15 551 689
3 15 689 423
3 423 689 500
3 423 500 278
3 939 298 689
3 689 298 312
3 689 312 21
3 21 312 273
3 21 273 148
3 148 690 21
3 21 690 751
3 21 751 138
3 138 751 734
3 489 1160 530
3 530 1160 751
3 530 751 32
3 32 751 694
3 1160 917 751
3 751 917 85
3 751 85 734
3 138 838 21
3 21 838 1056
3 21 1056 83
3 21 83 689
3 689 83 904
3 689 904 500
3 278 1235 423
3 690 694 751
3 551 939 689
3 1159 685 853
3 853 685 34
3 853 34 1082
3 1082 34 120
3 1082 120 1177
3 297 789 34
3 34 789 251
3 34 251 511
3 511 251 825
3 511 825 943
3 943 155 511
3 511 155 1017
3 511 1017 162
3 162 1017 308
3 812 1048 805
3 805 1048 1017
3 805 1017 1083
3 1083 1017 663
3 1048 628 1017
3 1017 628 736
3 1017 736 308
3 162 630 511
3 511 630 237
3 511 237 937
3 511 937 34
3 34 937 975
3 34 975 120
3 1177 133 1082
3 155 663 1017
3 685 297 34
3 492 494 491
3 491 494 493
3 151 493 152
3 152 493 494
3 954 737 41
3 41 737 187
3 41 187 912
3 912 187 911
3 912 911 186
3 1093 116 529
3 529 116 954
3 529 954 41
3 504 96 928
3 928 96 1221
3 928 1221 1072
3 1072 1221 398
3 1072 398 1057
3 1057 1093 1072
3 1072 1093 529
3 93 903 313
3 313 903 504
3 313 504 928
3 1162 697 508
3 508 697 653
3 508 653 313
3 313 653 93
3 777 867 618
3 618 867 1162
3 618 1162 508
3 180 1018 914
3 914 1018 213
3 914 213 884
3 884 213 827
3 884 827 62
3 62 777 884
3 884 777 618
3 345 680 589
3 589 680 180
3 589 180 914
3 381 829 1089
3 1089 829 583
3 1089 583 589
3 589 583 345
3 582 828 1088
3 1088 828 381
3 1088 381 382
3 382 381 1089
3 214 1019 913
3 913 1019 181
3 913 181 590
3 590 181 679
3 590 679 344
3 344 582 590
3 590 582 1088
3 63 826 883
3 883 826 214
3 883 214 913
3 1161 866 617
3 617 866 778
3 617 778 883
3 883 778 63
3 660 696 509
3 509 696 1161
3 509 1161 617
3 1222 97 927
3 927 97 505
3 927 505 314
3 314 505 902
3 314 902 92
3 92 660 314
3 314 660 509
3 1058 397 1071
3 1071 397 1222
3 1071 1222 927
3 953 115 528
3 528 115 1094
3 528 1094 1071
3 1071 1094 1058
3 186 738 42
3 42 738 953
3 42 953 528
3 186 42 912
3 228 989 406
3 406 989 868
3 406 868 993
3 993 868 1068
3 993 1068 437
3 228 674 989
3 989 674 879
3 989 879 256
3 981 989 1077
3 1077 989 256
3 1077 256 1132
3 981 496 989
3 989 496 72
3 989 72 823
3 989 823 868
3 868 823 383
3 868 383 1200
3 1068 868 938
3 938 868 1200
3 938 1200 569
3 1121 1051 64
3 64 1051 783
3 64 783 732
3 86 106 245
3 245 106 1051
3 245 1051 1121
3 756 1212 1220
3 1220 1212 379
3 1220 379 484
3 725 1212 174
3 174 1212 756
3 1095 31 357
3 357 31 720
3 357 720 774
3 899 31 253
3 253 31 1095
3 922 810 978
3 978 810 548
3 978 548 1186
3 1186 548 1115
3 1186 1115 598
3 598 1115 195
3 598 195 815
3 815 195 996
3 815 996 248
3 248 996 146
3 248 146 1167
3 1167 964 995
3 995 964 944
3 995 944 613
3 613 944 776
3 613 776 708
3 708 776 633
3 708 633 1153
3 1153 633 704
3 1153 704 721
3 721 704 892
3 721 892 479
3 479 892 102
3 964 1236 944
3 944 1236 920
3 944 920 776
3 776 920 821
3 776 821 633
3 633 821 305
3 633 305 704
3 704 305 892
3 667 102 768
3 768 102 892
3 768 892 744
3 744 892 305
3 744 305 1069
3 1069 305 821
3 1069 821 302
3 302 821 920
3 302 920 999
3 999 920 607
3 999 831 302
3 302 831 205
3 302 205 1069
3 1069 205 565
3 1069 565 744
3 744 565 258
3 744 258 768
3 768 258 1182
3 768 1182 667
3 667 1182 111
3 667 111 962
3 962 111 271
3 831 163 205
3 205 163 322
3 205 322 545
3 545 322 687
3 545 687 335
3 335 687 615
3 335 615 516
3 516 615 1027
3 516 1027 111
3 111 1027 176
3 111 176 271
3 271 176 901
3 243 1180 687
3 687 1180 749
3 687 749 615
3 615 749 324
3 615 324 1027
3 1027 324 269
3 1027 269 176
3 176 269 366
3 176 366 901
3 901 366 1231
3 1180 377 749
3 749 377 216
3 749 216 324
3 324 216 1086
3 324 1086 269
3 269 1086 1169
3 269 1169 366
3 366 1169 870
3 366 870 1231
3 1231 870 49
3 1231 49 307
3 307 49 306
3 377 1125 216
3 216 1125 160
3 216 160 1086
3 1086 160 970
3 1086 970 1169
3 1169 970 1229
3 1169 1229 870
3 870 1229 49
3 350 1010 160
3 160 1010 1043
3 160 1043 970
3 970 1043 1066
3 970 1066 1229
3 1229 1066 208
3 1229 208 49
3 49 208 48
3 49 48 306
3 306 48 1232
3 1010 413 1043
3 1043 413 456
3 1043 456 1066
3 1066 456 799
3 1066 799 208
3 208 799 209
3 208 209 48
3 48 209 869
3 48 869 1232
3 1232 869 900
3 413 230 456
3 456 230 638
3 456 638 799
3 799 638 800
3 799 800 209
3 209 800 1228
3 209 1228 869
3 869 1228 365
3 869 365 900
3 900 365 175
3 900 175 270
3 270 175 110
3 270 110 963
3 963 110 668
3 1204 1205 638
3 638 1205 639
3 638 639 800
3 800 639 1067
3 800 1067 1228
3 1228 1067 1170
3 1228 1170 365
3 365 1170 175
3 1205 1206 639
3 639 1206 232
3 639 232 457
3 457 232 412
3 457 412 1042
3 1042 412 1011
3 1042 1011 159
3 159 1011 349
3 159 349 1127
3 378 748 1127
3 1127 748 217
3 1127 217 159
3 159 217 323
3 159 323 1085
3 1085 323 1026
3 1085 1026 268
3 268 1026 110
3 268 110 175
3 668 1183 769
3 769 1183 517
3 769 517 259
3 259 517 616
3 259 616 334
3 334 616 748
3 334 748 688
3 688 748 1179
3 688 1179 244
3 103 769 893
3 893 769 259
3 893 259 743
3 743 259 334
3 743 334 564
3 564 334 688
3 564 688 546
3 546 688 244
3 546 244 320
3 922 189 810
3 810 189 143
3 810 143 709
3 709 143 632
3 709 632 820
3 820 632 1070
3 820 1070 204
3 204 1070 546
3 204 546 164
3 164 546 320
3 164 832 204
3 204 832 303
3 204 303 820
3 820 303 775
3 820 775 709
3 709 775 478
3 709 478 810
3 810 478 548
3 832 998 303
3 303 998 609
3 303 609 919
3 919 609 1237
3 919 1237 945
3 945 1237 965
3 945 965 996
3 996 965 1168
3 996 1168 146
3 1167 995 248
3 248 995 196
3 248 196 815
3 815 196 1116
3 815 1116 598
3 598 1116 547
3 598 547 1186
3 1186 547 450
3 1186 450 978
3 111 1182 516
3 516 1182 258
3 516 258 335
3 335 258 565
3 335 565 545
3 545 565 205
3 159 1085 1042
3 1042 1085 971
3 1042 971 457
3 457 971 1067
3 457 1067 639
3 668 110 1183
3 1183 110 1026
3 1183 1026 517
3 517 1026 323
3 517 323 616
3 616 323 217
3 616 217 748
3 996 195 945
3 945 195 614
3 945 614 919
3 919 614 775
3 919 775 303
3 995 613 196
3 196 613 477
3 196 477 1116
3 1116 477 811
3 1116 811 547
3 547 811 977
3 547 977 450
3 1085 268 971
3 971 268 1170
3 971 1170 1067
3 546 1070 564
3 564 1070 304
3 564 304 743
3 743 304 703
3 743 703 893
3 893 703 480
3 893 480 103
3 195 1115 614
3 614 1115 478
3 614 478 775
3 613 708 477
3 477 708 144
3 477 144 811
3 811 144 923
3 811 923 977
3 1070 632 304
3 304 632 1154
3 304 1154 703
3 703 1154 722
3 703 722 480
3 923 144 188
3 188 144 1153
3 188 1153 897
3 897 1153 721
3 189 896 143
3 143 896 1154
3 143 1154 632
3 748 378 1179
3 1170 268 175
3 478 1115 548
3 1154 896 722
3 769 103 668
3 1153 144 708
3 230 1204 638
3 1125 350 160
3 322 243 687
3 1236 607 920
3 1236 964 1040
3 1040 964 1167
3 1040 1167 145
3 145 1167 146
3 145 146 1168
3 999 607 606
3 606 607 1236
3 606 1236 1040
3 163 831 135
3 135 831 999
3 135 999 606
3 243 322 321
3 321 322 163
3 321 163 135
3 377 1180 958
3 958 1180 243
3 958 243 321
3 350 1125 1124
3 1124 1125 377
3 1124 377 958
3 413 1010 672
3 672 1010 350
3 672 350 1124
3 1204 230 229
3 229 230 413
3 229 413 672
3 1206 1205 1119
3 1119 1205 1204
3 1119 1204 229
3 412 232 231
3 231 232 1206
3 231 1206 1119
3 349 1011 673
3 673 1011 412
3 673 412 231
3 378 1127 1126
3 1126 1127 349
3 1126 349 673
3 244 1179 957
3 957 1179 378
3 957 378 1126
3 164 320 319
3 319 320 244
3 319 244 957
3 998 832 136
3 136 832 164
3 136 164 319
3 1237 609 608
3 608 609 998
3 608 998 136
3 1168 965 1041
3 1041 965 1237
3 1041 1237 608
3 1168 1041 145
3 1119 229 424
3 424 229 672
3 424 672 290
3 290 672 1124
3 290 1124 409
3 409 1124 958
3 409 958 932
3 932 958 321
3 932 321 473
3 473 321 135
3 473 135 109
3 109 135 606
3 109 606 1140
3 1140 606 1040
3 1140 1040 414
3 414 1040 145
3 414 145 415
3 415 145 1041
3 415 1041 1141
3 1141 1041 608
3 1141 608 108
3 108 608 136
3 108 136 474
3 474 136 319
3 474 319 931
3 931 319 957
3 931 957 410
3 410 957 1126
3 410 1126 289
3 289 1126 673
3 289 673 425
3 425 673 231
3 425 231 1119
3 290 234 424
3 425 235 289
3 1119 424 425
3 424 234 491
3 491 234 513
3 491 513 149
3 151 152 1000
3 1000 152 1001
3 1000 1001 11
3 11 1001 12
3 11 12 619
3 619 12 620
3 619 620 329
3 329 620 330
3 329 330 534
3 534 330 535
3 534 535 263
3 263 535 264
3 263 264 401
3 401 264 402
3 401 402 861
3 861 402 862
3 861 862 739
3 739 862 740
3 739 740 198
3 198 740 199
3 198 199 908
3 908 199 909
3 908 909 587
3 587 909 588
3 587 588 464
3 464 588 465
3 464 465 462
3 462 465 463
3 462 463 461
3 150 149 1003
3 1003 149 1002
3 1003 1002 14
3 14 1002 13
3 14 13 622
3 622 13 621
3 622 621 328
3 328 621 327
3 328 327 533
3 533 327 532
3 533 532 262
3 262 532 261
3 262 261 404
3 404 261 403
3 404 403 860
3 860 403 859
3 860 859 742
3 742 859 741
3 742 741 201
3 201 741 200
3 201 200 907
3 907 200 906
3 907 906 586
3 586 906 585
3 586 585 459
3 459 585 458
3 459 458 461
3 461 458 460
3 461 460 462
3 150 492 149
3 149 492 491
3 707 1087 17
3 17 1087 417
3 17 417 952
3 952 417 225
3 952 225 683
3 683 225 790
3 683 790 863
3 863 790 911
3 863 911 187
3 187 737 863
3 863 737 193
3 863 193 1080
3 1080 193 26
3 1080 26 522
3 522 26 841
3 522 841 1196
3 1196 841 967
3 1196 967 391
3 391 967 986
3 202 986 934
3 934 986 967
3 934 967 872
3 872 967 841
3 872 841 603
3 603 841 26
3 603 26 453
3 453 26 193
3 453 193 116
3 116 193 954
3 1093 1057 453
3 453 1057 1104
3 453 1104 603
3 603 1104 46
3 603 46 872
3 872 46 1012
3 872 1012 934
3 934 1012 935
3 934 935 127
3 127 935 651
3 127 651 657
3 657 651 1148
3 1057 398 1104
3 1104 398 1224
3 1104 1224 46
3 46 1224 555
3 46 555 1012
3 1012 555 206
3 1012 206 935
3 935 206 651
3 431 877 66
3 66 877 284
3 66 284 310
3 310 284 1064
3 310 1064 352
3 352 1064 1148
3 352 1148 358
3 358 1148 651
3 358 651 659
3 659 651 206
3 659 206 880
3 880 206 555
3 880 555 754
3 754 555 1224
3 754 1224 96
3 96 1224 1221
3 352 358 1062
3 1062 358 659
3 1062 659 661
3 661 659 880
3 661 880 844
3 844 880 754
3 844 754 903
3 903 754 504
3 93 653 655
3 655 653 697
3 655 697 442
3 442 697 1162
3 442 1162 867
3 876 432 184
3 184 432 325
3 184 325 1243
3 1243 325 577
3 1243 577 6
3 6 577 716
3 6 716 185
3 185 716 578
3 185 578 5
3 5 578 326
3 5 326 1242
3 1242 326 431
3 1242 431 183
3 183 431 66
3 183 66 429
3 429 66 396
3 429 396 1215
3 1215 396 726
3 1215 726 538
3 538 726 442
3 538 442 867
3 777 62 538
3 538 62 61
3 538 61 1215
3 1215 61 676
3 1215 676 429
3 429 676 761
3 429 761 183
3 183 761 1242
3 62 827 61
3 61 827 168
3 61 168 676
3 676 168 24
3 676 24 761
3 761 24 165
3 761 165 1242
3 1242 165 5
3 185 5 347
3 347 5 165
3 347 165 220
3 220 165 24
3 220 24 816
3 816 24 168
3 816 168 1018
3 1018 168 213
3 6 185 856
3 856 185 347
3 856 347 625
3 625 347 220
3 625 220 1074
3 1074 220 816
3 1074 816 680
3 680 816 180
3 345 583 426
3 426 583 829
3 426 829 486
3 486 829 381
3 486 381 828
3 285 876 67
3 67 876 184
3 67 184 762
3 762 184 166
3 762 166 219
3 219 166 626
3 219 626 427
3 427 626 486
3 427 486 828
3 582 344 427
3 427 344 1075
3 427 1075 219
3 219 1075 23
3 219 23 762
3 762 23 430
3 762 430 67
3 67 430 311
3 67 311 285
3 285 311 1065
3 344 679 1075
3 1075 679 817
3 1075 817 23
3 23 817 675
3 23 675 430
3 430 675 395
3 430 395 311
3 311 395 351
3 311 351 1065
3 1065 351 359
3 1065 359 1149
3 1149 359 662
3 1149 662 656
3 656 662 936
3 656 936 128
3 128 936 933
3 128 933 203
3 203 933 968
3 203 968 987
3 987 968 1197
3 987 1197 390
3 390 1197 1091
3 390 1091 840
3 840 1091 29
3 840 29 973
3 973 29 18
3 973 18 706
3 706 18 568
3 181 1019 817
3 817 1019 169
3 817 169 675
3 675 169 1216
3 675 1216 395
3 395 1216 267
3 395 267 351
3 351 267 359
3 662 359 1063
3 1063 359 267
3 1063 267 727
3 727 267 1216
3 727 1216 60
3 60 1216 169
3 60 169 826
3 826 169 214
3 63 778 60
3 60 778 537
3 60 537 727
3 727 537 386
3 727 386 1063
3 1063 386 654
3 1063 654 662
3 662 654 936
3 778 866 537
3 537 866 443
3 537 443 386
3 386 443 652
3 386 652 654
3 654 652 207
3 654 207 936
3 936 207 933
3 968 933 1013
3 1013 933 207
3 1013 207 881
3 881 207 652
3 881 652 658
3 658 652 443
3 658 443 696
3 696 443 1161
3 660 92 845
3 845 92 902
3 845 902 753
3 753 902 505
3 753 505 97
3 968 1013 871
3 871 1013 556
3 871 556 47
3 47 556 753
3 47 753 1223
3 1223 753 97
3 1223 97 1222
3 18 29 354
3 354 29 523
3 354 523 25
3 25 523 602
3 25 602 1105
3 1105 602 1223
3 1105 1223 397
3 397 1223 1222
3 1058 1094 454
3 454 1094 115
3 454 115 194
3 194 115 953
3 194 953 738
3 18 354 951
3 951 354 1079
3 951 1079 684
3 684 1079 194
3 684 194 864
3 864 194 738
3 864 738 186
3 568 18 1087
3 1087 18 951
3 1087 951 417
3 417 951 684
3 417 684 225
3 225 684 864
3 225 864 790
3 790 864 186
3 790 186 911
3 310 352 266
3 266 352 1062
3 266 1062 385
3 385 1062 661
3 385 661 655
3 655 661 844
3 655 844 93
3 93 844 903
3 66 310 396
3 396 310 266
3 396 266 726
3 726 266 385
3 726 385 442
3 442 385 655
3 1243 6 346
3 346 6 856
3 346 856 1049
3 1049 856 625
3 1049 625 426
3 426 625 1074
3 426 1074 345
3 345 1074 680
3 184 1243 166
3 166 1243 346
3 166 346 626
3 626 346 1049
3 626 1049 486
3 486 1049 426
3 696 660 658
3 658 660 845
3 658 845 881
3 881 845 556
3 881 556 1013
3 397 1058 1105
3 1105 1058 454
3 1105 454 25
3 25 454 1079
3 25 1079 354
3 863 1080 683
3 683 1080 353
3 683 353 952
3 952 353 28
3 952 28 17
3 17 28 707
3 1223 602 47
3 47 602 842
3 47 842 871
3 871 842 1197
3 871 1197 968
3 1080 522 353
3 353 522 1090
3 353 1090 28
3 28 1090 839
3 28 839 974
3 1197 842 1091
3 1091 842 523
3 1091 523 29
3 522 1196 1090
3 1090 1196 391
3 1090 391 839
3 845 753 556
3 454 194 1079
3 28 974 707
3 127 202 934
3 707 568 1087
3 523 842 602
3 866 1161 443
3 826 63 60
3 1019 214 169
3 679 181 817
3 828 582 427
3 1018 180 816
3 827 213 168
3 867 777 538
3 96 504 754
3 398 1221 1224
3 116 1093 453
3 737 954 193
3 375 192 343
3 343 192 124
3 343 124 1006
3 293 192 475
3 475 192 375
3 1139 1142 483
3 483 1142 695
3 483 695 852
3 57 1142 1034
3 1034 1142 1139
3 76 802 730
3 730 802 1135
3 730 1135 875
3 502 802 441
3 441 802 76
3 327 621 409
3 409 621 13
3 409 13 290
3 290 13 1002
3 290 1002 513
3 513 1002 149
3 859 403 473
3 473 403 261
3 473 261 932
3 932 261 532
3 932 532 327
3 585 906 1140
3 1140 906 200
3 1140 200 109
3 109 200 741
3 109 741 859
3 460 458 414
3 414 458 585
3 414 585 1140
3 460 414 462
3 462 414 415
3 462 415 464
3 464 415 587
3 198 908 1141
3 1141 908 587
3 1141 587 415
3 861 739 108
3 108 739 198
3 108 198 1141
3 263 401 474
3 474 401 861
3 474 861 108
3 329 534 931
3 931 534 263
3 931 263 474
3 11 619 410
3 410 619 329
3 410 329 931
3 514 1000 289
3 289 1000 11
3 289 11 410
3 327 409 932
3 859 473 109
3 289 235 514
3 514 151 1000
3 513 234 290
3 233 466 784
3 784 466 9
3 784 9 45
3 45 9 640
3 45 640 822
3 755 518 9
3 9 518 835
3 9 835 44
3 44 835 1020
3 44 1020 539
3 539 241 44
3 44 241 681
3 44 681 19
3 19 681 647
3 122 471 1096
3 1096 471 681
3 1096 681 669
3 669 681 332
3 471 780 681
3 681 780 714
3 681 714 647
3 19 1030 44
3 44 1030 1190
3 44 1190 70
3 44 70 9
3 9 70 50
3 9 50 640
3 822 393 45
3 241 332 681
3 466 755 9
3 95 918 705
3 705 918 331
3 705 331 131
3 131 331 882
3 131 882 772
3 95 372 918
3 918 372 1138
3 918 1138 1150
3 558 918 191
3 191 918 1150
3 191 1150 795
3 558 82 918
3 918 82 813
3 918 813 642
3 918 642 331
3 331 642 98
3 331 98 104
3 882 331 670
3 670 331 104
3 670 104 1029
3 503 1160 717
3 717 1160 489
3 717 489 849
3 917 1160 757
3 757 1160 503
3 549 191 1055
3 1055 191 795
3 1055 795 792
3 558 191 988
3 988 191 549
3 380 1048 1081
3 1081 1048 812
3 1081 812 318
3 628 1048 1028
3 1028 1048 380
3 150 1024 492
3 492 1024 126
3 492 126 1214
3 1213 125 494
3 494 125 1025
3 494 1025 152
3 1123 221 1060
3 1060 221 1185
3 1060 1185 1114
3 1114 1185 512
3 1114 512 88
3 1244 1164 1185
3 1185 1164 416
3 1185 416 132
3 132 416 451
3 132 451 926
3 926 671 132
3 132 671 836
3 132 836 1201
3 1201 836 100
3 1009 1133 560
3 560 1133 836
3 560 836 440
3 440 836 240
3 1133 636 836
3 836 636 117
3 836 117 100
3 1201 677 132
3 132 677 997
3 132 997 786
3 132 786 1185
3 1185 786 520
3 1185 520 512
3 88 1245 1114
3 671 240 836
3 221 1244 1185
3 1187 471 552
3 552 471 122
3 552 122 392
3 780 471 846
3 846 471 1187
3 158 574 576
3 576 574 170
3 576 170 929
3 1092 574 1136
3 1136 574 158
3 1036 89 1157
3 1157 89 983
3 1157 983 1033
3 1076 89 363
3 363 89 1036
3 635 1133 190
3 190 1133 1009
3 190 1009 388
3 636 1133 782
3 782 1133 635
3 75 455 698
3 698 455 950
3 698 950 1181
3 1181 950 384
3 1181 384 562
3 75 1045 455
3 455 1045 226
3 455 226 274
3 725 455 1212
3 1212 455 274
3 1212 274 379
3 725 1176 455
3 455 1176 467
3 455 467 641
3 455 641 950
3 950 641 1158
3 950 1158 1152
3 384 950 611
3 611 950 1152
3 611 1152 252
3 843 979 590
3 590 979 561
3 590 561 1227
3 910 1108 1089
3 1089 1108 1073
3 1089 1073 649
3 601 58 883
3 883 58 1156
3 883 1156 1143
3 1030 19 509
3 509 19 647
3 509 647 714
3 1113 65 927
3 927 65 254
3 927 254 172
3 281 834 928
3 928 834 113
3 928 113 313
3 313 113 874
3 313 874 448
3 1045 75 382
3 382 75 698
3 382 698 1088
3 1088 698 1181
3 1088 1181 562
3 1227 0 590
3 590 0 731
3 590 731 830
3 1047 624 590
3 590 624 7
3 590 7 843
3 238 969 590
3 590 969 767
3 590 767 913
3 913 767 644
3 913 644 1209
3 674 228 883
3 883 228 406
3 883 406 617
3 617 406 993
3 617 993 437
3 421 509 506
3 506 509 780
3 506 780 846
3 337 468 509
3 509 468 315
3 509 315 314
3 314 315 79
3 314 79 239
3 422 927 1174
3 1174 927 890
3 1174 890 905
3 444 295 529
3 529 295 719
3 529 719 39
3 961 1199 508
3 508 1199 1037
3 508 1037 618
3 618 1037 485
3 618 485 809
3 355 566 1089
3 1089 566 1134
3 1089 1134 910
3 379 274 1089
3 1089 274 226
3 1089 226 382
3 382 226 1045
3 300 590 1193
3 1193 590 1088
3 1193 1088 562
3 1143 645 883
3 883 645 498
3 883 498 916
3 764 490 883
3 883 490 279
3 883 279 601
3 50 70 509
3 509 70 1190
3 509 1190 1030
3 1052 563 927
3 927 563 1007
3 927 1007 1113
3 38 1112 927
3 927 1112 446
3 927 446 1071
3 1071 446 527
3 1071 527 1059
3 838 138 528
3 528 138 734
3 528 734 85
3 705 131 912
3 912 131 772
3 912 772 41
3 41 772 557
3 41 557 990
3 929 529 648
3 648 529 1076
3 648 1076 363
3 52 855 529
3 529 855 400
3 529 400 1072
3 1072 400 1245
3 1072 1245 88
3 605 1044 928
3 928 1044 889
3 928 889 281
3 250 4 508
3 508 4 634
3 508 634 572
3 484 379 369
3 369 379 1089
3 369 1089 253
3 253 1089 899
3 300 1163 590
3 590 1163 787
3 590 787 1047
3 666 528 316
3 316 528 917
3 316 917 757
3 630 162 912
3 912 162 308
3 912 308 736
3 1138 372 912
3 912 372 95
3 912 95 705
3 227 664 529
3 529 664 16
3 529 16 444
3 677 1201 928
3 928 1201 100
3 928 100 117
3 441 773 502
3 502 773 695
3 502 695 572
3 572 695 508
3 287 947 508
3 508 947 804
3 508 804 961
3 373 84 405
3 405 84 367
3 405 367 1101
3 1101 367 167
3 1101 167 1023
3 1023 167 1198
3 1022 884 1238
3 1238 884 618
3 1238 618 167
3 167 618 154
3 167 154 1198
3 1175 218 914
3 914 218 433
3 914 433 783
3 783 433 1122
3 783 1122 550
3 824 759 884
3 884 759 212
3 884 212 914
3 914 212 36
3 914 36 1004
3 1129 81 1089
3 1089 81 1137
3 1089 1137 355
3 1129 1089 348
3 348 1089 589
3 348 589 783
3 783 589 914
3 830 1103 590
3 590 1103 982
3 590 982 238
3 43 1166 883
3 883 1166 770
3 883 770 764
3 43 883 865
3 865 883 913
3 865 913 418
3 418 913 1209
3 916 1132 883
3 883 1132 256
3 883 256 879
3 437 1145 617
3 617 1145 393
3 617 393 509
3 509 393 822
3 509 822 640
3 765 1016 509
3 509 1016 984
3 509 984 337
3 239 791 314
3 314 791 488
3 314 488 927
3 927 488 994
3 927 994 1052
3 904 83 528
3 528 83 1056
3 528 1056 838
3 215 1233 528
3 528 1233 956
3 528 956 42
3 42 956 288
3 42 288 481
3 792 912 771
3 771 912 628
3 771 628 1028
3 227 529 510
3 510 529 41
3 510 41 91
3 91 41 990
3 309 515 529
3 529 515 637
3 529 637 52
3 782 370 636
3 636 370 124
3 636 124 117
3 117 124 928
3 124 1021 928
3 928 1021 387
3 928 387 605
3 1211 1191 508
3 508 1191 71
3 508 71 250
3 223 735 618
3 618 735 275
3 618 275 154
3 531 960 368
3 368 960 783
3 368 783 1171
3 1171 783 550
3 584 509 421
3 1107 35 927
3 927 35 255
3 927 255 38
3 975 937 912
3 912 937 237
3 912 237 630
3 792 795 912
3 912 795 1150
3 912 1150 1138
3 520 786 928
3 928 786 997
3 928 997 677
3 223 618 280
3 280 618 809
3 695 519 508
3 508 519 282
3 508 282 287
3 1022 1230 884
3 884 1230 156
3 884 156 824
3 921 927 422
3 1059 1235 1071
3 1071 1235 278
3 1071 278 528
3 528 278 500
3 528 500 904
3 481 133 42
3 42 133 1177
3 42 1177 912
3 912 1177 120
3 912 120 975
3 170 292 529
3 529 292 1038
3 529 1038 309
3 88 512 1072
3 1072 512 520
3 1072 520 928
3 448 643 313
3 313 643 1211
3 313 1211 508
3 1004 781 914
3 914 781 1131
3 914 1131 1175
3 407 161 528
3 528 161 682
3 528 682 215
3 407 528 891
3 891 528 666
3 509 714 780
3 927 172 890
3 529 39 1076
3 528 85 917
3 830 501 1103
3 879 674 883
3 916 276 1132
3 640 50 509
3 912 736 628
3 84 851 367
3 584 765 509
3 921 1107 927
3 529 929 170
3 649 899 1089
3 773 852 695
3 370 1006 124
3 960 732 783
3 434 1147 171
3 171 1147 1035
3 171 1035 579
3 579 1035 317
3 1199 338 1037
3 1037 338 317
3 1037 317 485
3 485 317 1035
3 1039 497 1120
3 1120 497 1217
3 1120 1217 715
3 715 1217 342
3 834 197 113
3 113 197 342
3 113 342 874
3 874 342 1217
3 855 1226 400
3 400 1226 623
3 400 623 1245
3 1245 623 1114
3 1123 1060 1110
3 1110 1060 1114
3 1110 1114 452
3 452 1114 623
3 542 1128 411
3 411 1128 1005
3 411 1005 1029
3 1029 1005 670
3 772 882 557
3 557 882 670
3 557 670 990
3 990 670 1005
3 151 514 493
3 493 514 235
3 493 235 425
3 425 424 493
3 493 424 491
3 337 941 468
3 468 941 1050
3 468 1050 315
3 315 1050 946
3 315 946 79
3 337 984 941
3 941 984 1016
3 941 1016 765
3 1202 941 118
3 118 941 765
3 118 765 584
3 1202 985 941
3 941 985 976
3 941 976 1155
3 941 1155 1050
3 1050 1155 1061
3 1050 1061 394
3 946 1050 959
3 959 1050 394
3 959 394 701
3 288 798 481
3 481 798 940
3 481 940 133
3 133 940 1082
3 1159 853 283
3 283 853 1082
3 283 1082 360
3 360 1082 940
3 600 15 713
3 713 15 423
3 713 423 482
3 482 423 476
3 527 543 1059
3 1059 543 476
3 1059 476 1235
3 1235 476 423
3 837 129 1102
3 1102 129 260
3 1102 260 701
3 701 260 959
3 79 946 239
3 239 946 959
3 239 959 791
3 791 959 260
3 233 784 142
3 142 784 45
3 142 45 569
3 569 45 938
3 437 1068 1145
3 1145 1068 938
3 1145 938 393
3 393 938 45
3 330 620 887
3 887 620 12
3 887 12 570
3 570 12 1001
3 570 1001 1025
3 1025 1001 152
3 862 402 1173
3 1173 402 264
3 1173 264 140
3 140 264 535
3 140 535 330
3 588 909 54
3 54 909 199
3 54 199 806
3 806 199 740
3 806 740 862
3 459 461 524
3 524 461 463
3 524 463 525
3 525 463 465
3 525 465 588
3 459 524 586
3 586 524 55
3 586 55 907
3 907 55 201
3 860 742 807
3 807 742 201
3 807 201 55
3 262 404 1172
3 1172 404 860
3 1172 860 807
3 328 533 141
3 141 533 262
3 141 262 1172
3 14 622 886
3 886 622 328
3 886 328 141
3 1024 1003 571
3 571 1003 14
3 571 14 886
3 330 887 140
3 862 1173 806
3 588 54 525
3 571 126 1024
3 1024 150 1003
3 1025 125 570
3 492 1214 494
3 494 1214 1213
3 38 1151 1112
3 1112 1151 559
3 1112 559 446
3 446 559 543
3 446 543 527
3 38 255 1151
3 1151 255 35
3 1151 35 1107
3 157 1151 470
3 470 1151 1107
3 470 1107 921
3 157 438 1151
3 1151 438 750
3 1151 750 333
3 1151 333 559
3 559 333 364
3 559 364 1178
3 543 559 476
3 476 559 1178
3 476 1178 482
3 1192 449 236
3 236 449 1046
3 236 1046 1106
3 1106 1046 1137
3 1106 1137 81
3 1100 428 1046
3 1046 428 1210
3 1046 1210 627
3 627 1210 495
3 627 495 420
3 420 1203 627
3 627 1203 389
3 627 389 1108
3 1108 389 1073
3 720 31 567
3 567 31 389
3 567 389 139
3 139 389 469
3 31 899 389
3 389 899 649
3 389 649 1073
3 1108 910 627
3 627 910 1134
3 627 1134 566
3 627 566 1046
3 1046 566 355
3 1046 355 1137
3 81 1129 1106
3 1203 469 389
3 449 1100 1046
3 801 470 362
3 362 470 921
3 362 921 422
3 157 470 763
3 763 470 801
3 693 1208 130
3 130 1208 692
3 130 692 745
3 890 1208 905
3 905 1208 693
3 1246 73 1084
3 1084 73 891
3 1084 891 666
3 336 73 1218
3 1218 73 1246
3 1241 837 896
3 896 837 1102
3 896 1102 722
3 722 1102 701
3 722 701 394
3 265 294 896
3 896 294 848
3 896 848 1241
3 814 1039 102
3 102 1039 1120
3 102 1120 479
3 479 1120 715
3 479 715 59
3 518 755 480
3 480 755 466
3 480 466 103
3 103 466 233
3 103 233 142
3 980 439 271
3 271 439 30
3 271 30 962
3 962 30 434
3 962 434 171
3 33 575 896
3 896 575 942
3 896 942 265
3 3 74 896
3 896 74 1194
3 896 1194 33
3 90 27 668
3 668 27 1078
3 668 1078 963
3 963 1078 137
3 963 137 173
3 992 341 1231
3 1231 341 733
3 1231 733 901
3 901 733 678
3 901 678 573
3 436 766 102
3 102 766 536
3 102 536 814
3 221 1123 721
3 721 1123 1110
3 721 1110 897
3 897 1110 452
3 897 452 408
3 789 297 977
3 977 297 685
3 977 685 450
3 450 685 1159
3 450 1159 283
3 711 339 271
3 271 339 1014
3 271 1014 980
3 597 593 521
3 521 593 20
3 521 20 271
3 271 20 1188
3 271 1188 69
3 539 1020 480
3 480 1020 835
3 480 835 518
3 1 122 242
3 242 122 1096
3 242 1096 480
3 480 1096 669
3 361 819 668
3 668 819 857
3 668 857 90
3 650 272 797
3 797 272 723
3 797 723 668
3 668 723 847
3 668 847 1054
3 1032 747 900
3 900 747 858
3 900 858 1232
3 1232 858 252
3 1232 252 1152
3 1239 271 69
3 962 171 667
3 667 171 579
3 667 579 873
3 286 57 667
3 667 57 1053
3 667 1053 102
3 102 1053 752
3 102 752 257
3 179 612 57
3 57 612 1053
3 416 1164 721
3 721 1164 1244
3 721 1244 221
3 894 854 188
3 188 854 247
3 188 247 923
3 923 247 542
3 923 542 411
3 943 825 977
3 977 825 251
3 977 251 789
3 972 812 988
3 988 812 805
3 988 805 977
3 977 805 1083
3 551 600 922
3 922 600 713
3 922 713 189
3 189 713 482
3 189 482 1178
3 157 763 189
3 189 763 702
3 189 702 896
3 896 702 745
3 896 745 692
3 976 985 480
3 480 985 1202
3 480 1202 242
3 1155 480 1061
3 1061 480 722
3 1061 722 394
3 241 480 669
3 610 668 1054
3 963 173 270
3 270 173 818
3 270 818 888
3 1231 307 86
3 86 307 306
3 86 306 1015
3 1015 306 1192
3 495 1210 1232
3 1232 1210 428
3 1232 428 306
3 306 428 1100
3 306 1100 449
3 1117 1008 1231
3 1231 1008 966
3 1231 966 992
3 604 808 245
3 245 808 758
3 245 758 1231
3 1231 758 1240
3 1231 1240 591
3 210 101 667
3 667 101 296
3 667 296 286
3 1034 22 57
3 57 22 1135
3 57 1135 179
3 1189 785 479
3 479 785 293
3 479 293 475
3 59 885 479
3 479 885 447
3 479 447 1189
3 813 82 977
3 977 82 558
3 977 558 988
3 411 1029 923
3 923 1029 104
3 923 104 977
3 977 104 98
3 977 98 642
3 155 977 1083
3 72 496 668
3 668 496 981
3 668 981 797
3 142 569 103
3 103 569 1200
3 103 1200 668
3 668 1200 383
3 668 383 823
3 299 699 182
3 182 699 270
3 182 270 78
3 78 270 554
3 888 356 270
3 270 356 526
3 270 526 554
3 700 376 900
3 900 376 419
3 900 419 1032
3 595 1231 591
3 671 926 721
3 721 926 451
3 721 451 416
3 560 440 721
3 721 440 240
3 721 240 671
3 450 283 978
3 978 283 360
3 978 360 222
3 312 298 922
3 922 298 939
3 922 939 551
3 291 1195 182
3 182 1195 507
3 182 507 299
3 246 291 1234
3 1234 291 182
3 1234 182 121
3 725 139 1203
3 725 1203 1232
3 1232 1203 420
3 1232 420 495
3 541 833 271
3 271 833 1111
3 271 1111 521
3 573 794 901
3 901 794 80
3 901 80 271
3 271 80 924
3 271 924 948
3 249 1118 188
3 188 1118 580
3 188 580 894
3 37 983 1136
3 1136 983 68
3 1136 68 188
3 188 68 788
3 188 788 991
3 694 690 336
3 336 690 978
3 336 978 445
3 445 978 107
3 222 629 978
3 978 629 1225
3 978 1225 107
3 699 1031 900
3 900 1031 147
3 900 147 700
3 581 188 991
3 489 530 336
3 336 530 32
3 336 32 694
3 849 489 718
3 718 489 336
3 718 336 1218
3 690 148 922
3 922 148 273
3 922 273 312
3 641 467 1232
3 1232 467 1176
3 1232 1176 725
3 1152 1158 1232
3 1232 1158 641
3 388 721 631
3 631 721 479
3 631 479 475
3 560 721 1009
3 1009 721 388
3 728 1184 188
3 188 1184 1092
3 188 1092 1136
3 760 188 930
3 930 188 897
3 930 897 408
3 333 750 189
3 189 750 438
3 189 438 157
3 1178 364 189
3 189 364 333
3 567 725 720
3 720 725 112
3 720 112 774
3 1239 711 271
3 257 436 102
3 692 3 896
3 241 539 480
3 610 361 668
3 306 449 1192
3 597 544 593
3 22 875 1135
3 155 943 977
3 1155 976 480
3 1 392 122
3 650 878 272
3 595 1117 1231
3 873 210 667
3 642 813 977
3 972 318 812
3 823 72 668
3 604 487 808
3 948 541 271
3 581 249 188
3 699 900 270
3 725 174 112
3 37 1033 983
3 725 567 139
3 760 728 188
3 690 922 978
3 86 245 1231
3 678 733 8
3 8 733 596
3 8 596 850
3 850 596 781
3 850 781 1004
3 341 992 596
3 596 992 966
3 596 966 2
3 2 966 1008
3 2 1008 1117
3 1117 595 2
3 2 595 540
3 2 540 1122
3 1122 540 550
3 808 94 758
3 758 94 540
3 758 540 1240
3 1240 540 591
3 94 368 540
3 540 368 1171
3 540 1171 550
3 1122 433 2
3 2 433 218
3 2 218 1175
3 2 1175 596
3 596 1175 1131
3 596 1131 781
3 1004 36 850
3 595 591 540
3 733 341 596
3 767 1098 644
3 644 1098 374
3 644 374 1209
3 1209 374 40
3 1209 40 418
3 767 969 1098
3 1098 969 238
3 1098 238 982
3 182 1098 712
3 712 1098 982
3 712 982 1103
3 182 78 1098
3 1098 78 554
3 1098 554 526
3 1098 526 374
3 374 526 356
3 374 356 888
3 40 374 665
3 665 374 888
3 665 888 818
3 285 1065 887
3 887 1065 1149
3 887 1149 140
3 140 1149 656
3 140 656 128
3 140 128 1173
3 1173 128 203
3 1173 203 987
3 1214 431 1213
3 1213 431 432
3 1213 432 125
3 125 432 876
3 125 876 570
3 570 876 285
3 570 285 887
3 1173 987 806
3 806 987 390
3 806 390 54
3 54 390 840
3 54 840 973
3 568 707 524
3 524 707 974
3 524 974 55
3 55 974 839
3 55 839 391
3 55 391 807
3 807 391 986
3 807 986 1172
3 1172 986 202
3 1172 202 127
3 54 973 525
3 525 973 706
3 525 706 568
3 1148 1064 886
3 886 1064 284
3 886 284 571
3 571 284 877
3 571 877 126
3 126 877 431
3 126 431 1214
3 127 657 141
3 141 657 1148
3 141 1148 886
3 716 577 578
3 578 577 325
3 578 325 326
3 326 325 432
3 326 432 431
3 568 524 525
3 127 141 1172