OFF

985 1966 0
0.349619 -0.056718 -0.026161
0.339625 -0.020725 -0.053887
0.330705 0.007223 -0.053061
0.324043 0.028095 -0.040969
0.319863 0.041189 -0.017847
0.325074 0.024850 0.043419
0.333195 -0.000597 0.054845
0.342974 -0.031343 0.049697
0.349643 -0.056800 0.026030
0.348805 0.097796 0.000103
0.468221 0.033455 -0.012212
0.406006 0.094848 0.000083
0.387692 -0.019789 0.092554
0.469158 0.031420 0.057052
0.466038 0.042691 0.012311
0.481180 0.063348 -0.030068
0.406805 0.092342 0.019701
0.478479 0.064668 -0.034070
0.479859 0.066670 -0.021203
0.367849 0.019662 -0.091890
0.498401 0.001447 -0.014608
0.478784 -0.008630 -0.038987
0.463304 -0.005833 0.054629
0.354363 -0.143219 -0.006056
0.348078 -0.022958 -0.099866
0.480527 0.016033 0.003127
0.352827 -0.137968 0.015336
0.339238 -0.018489 -0.066200
0.322248 0.046834 -0.069410
0.412101 0.071403 -0.056592
0.477783 0.072978 -0.005603
0.321165 0.068986 0.069865
0.364155 -0.084661 0.069610
0.359127 -0.031896 -0.100392
0.470748 0.025535 0.008240
0.490783 0.032824 0.033929
0.436014 -0.004479 -0.072434
0.314261 0.071626 0.034439
0.362284 -0.111347 0.048328
0.363607 -0.109594 -0.050001
0.415580 0.034601 -0.060201
0.464850 0.051446 0.004202
0.397722 0.054034 0.074705
0.377421 -0.067648 0.077618
0.388132 -0.011127 -0.073542
0.356705 -0.142773 -0.001827
0.465695 0.082107 -0.016793
0.350433 -0.071575 0.013531
0.331712 0.006307 -0.069027
0.468785 0.039115 0.017274
0.346276 -0.005602 -0.104817
0.464435 0.045317 -0.003765
0.318313 0.081987 0.051959
0.353841 -0.138118 -0.017658
0.411610 -0.022447 -0.080741
0.480558 0.015938 -0.002330
0.314826 0.085245 0.040747
0.315039 0.088186 0.036328
0.434581 0.027833 0.065485
0.360986 -0.057460 -0.089223
0.358247 0.068225 -0.070994
0.356562 -0.126832 0.031692
0.323157 0.031880 0.052567
0.477251 0.074202 0.018299
0.388426 -0.011338 0.072746
0.383665 -0.120155 0.012603
0.467597 0.039257 -0.015423
0.317535 0.074606 -0.058803
0.321882 0.072017 0.067338
0.351393 -0.141782 -0.001761
0.360702 -0.099914 0.053439
0.350275 -0.057534 -0.045157
0.476667 0.026470 0.018451
0.411853 -0.007476 0.061916
0.402363 0.022260 0.055881
0.478431 0.064809 0.033995
0.352612 -0.143283 0.004040
0.372475 -0.003608 -0.093465
0.362780 -0.080695 -0.071166
0.422080 0.041736 0.066208
0.438684 0.014975 0.066770
0.376464 0.026145 0.073020
0.346529 0.033568 0.096585
0.470413 0.034013 0.017865
0.481577 0.032332 0.048942
0.471447 0.030779 -0.017362
0.465070 0.050758 -0.006296
0.332731 0.027206 -0.096871
0.427838 -0.047231 -0.056484
0.453433 0.080708 -0.029841
0.398674 -0.087547 -0.044932
0.491400 0.021612 0.023677
0.480446 0.064189 0.031130
0.318339 0.071859 0.062432
0.436375 0.083073 0.033022
0.367606 0.011724 0.095479
0.357947 -0.126138 0.033832
0.413010 0.017028 0.054953
0.347861 0.001540 0.104620
0.315402 0.075226 0.046568
0.351506 0.085015 0.049271
0.426921 -0.065226 -0.039767
0.480195 0.017077 -0.007402
0.419408 0.055999 -0.067433
0.386681 0.043624 0.074933
0.480553 0.055606 -0.025487
0.492444 0.020900 -0.037779
0.354970 -0.130607 -0.026557
0.470344 0.067544 -0.038268
0.386640 0.016053 0.061491
0.491679 0.029728 -0.037442
0.476096 0.077824 -0.007758
0.353078 -0.081029 0.036114
0.363684 -0.076480 -0.075904
0.345472 -0.008740 0.104107
0.314673 0.090969 -0.028500
0.467523 -0.018088 0.043320
0.489211 0.031044 -0.041736
0.351752 -0.137945 -0.011264
0.381310 0.010248 -0.066793
0.458041 -0.038911 0.032984
0.351227 -0.069770 0.031513
0.478487 0.042014 0.049215
0.485458 0.048482 0.038900
0.429829 -0.007311 0.068252
0.353006 -0.141064 -0.011777
0.334907 0.031232 -0.097935
0.444194 -0.035814 0.051294
0.483044 0.056760 0.030200
0.428759 0.042638 -0.071406
0.374556 -0.056469 0.085711
0.465055 0.047402 -0.009227
0.330148 0.057042 0.083254
0.321792 0.083246 -0.051695
0.395940 0.011711 -0.057810
0.370990 0.023586 -0.082131
0.381691 0.085412 0.044100
0.472192 0.024854 0.012611
0.415266 0.009050 -0.056380
0.311849 0.090539 0.007980
0.376108 -0.028638 0.095485
0.317845 0.081034 -0.053043
0.386729 -0.118921 0.006172
0.491840 -0.001119 -0.028277
0.482796 0.048580 -0.028988
0.355057 -0.141158 -0.012695
0.361918 -0.125606 0.034043
0.405911 -0.019528 -0.075244
0.370404 0.011627 0.081790
0.480505 0.065764 0.024985
0.464704 0.051903 0.000196
0.421543 -0.086251 0.010927
0.369774 0.027397 -0.089063
0.464174 0.049798 0.000435
0.421763 0.041872 -0.066633
0.358861 -0.118850 0.040206
0.361908 -0.055940 0.090285
0.364670 -0.088096 -0.067269
0.423079 -0.030858 -0.070557
0.455867 0.025997 -0.064448
0.431460 0.012346 0.061343
0.319883 0.041121 0.019934
0.383558 -0.015790 -0.087922
0.350910 -0.030825 0.098649
0.489964 0.036353 0.036531
0.330225 0.040594 0.092828
0.361839 -0.117537 -0.042971
0.487696 0.033227 -0.029632
0.435508 0.036051 -0.071262
0.499894 0.004524 0.005466
0.475853 0.030676 0.020559
0.316657 0.083114 0.048285
0.474914 0.019916 -0.008468
0.379372 -0.125681 -0.000145
0.358531 -0.006422 0.103179
0.341356 0.021921 0.101317
0.471000 0.060792 -0.000866
0.415389 -0.018556 0.073364
0.386604 0.016185 -0.062068
0.480346 -0.017833 -0.027343
0.473301 0.021743 0.009426
0.399256 0.004226 0.057716
0.472666 0.021923 0.007517
0.397556 -0.067866 0.064343
0.355951 -0.063258 -0.069001
0.352126 -0.143150 -0.002301
0.341748 0.020728 -0.101659
0.331677 0.028432 -0.094899
0.406449 0.006288 -0.056625
0.349963 0.094173 -0.026794
0.460153 0.059655 -0.050540
0.360054 -0.077392 -0.067048
0.349814 0.094630 0.024891
0.485778 0.041800 -0.042731
0.466243 0.043861 -0.013229
0.452716 -0.052973 -0.018435
0.358388 -0.043662 -0.096619
0.378878 -0.001129 -0.074199
0.439995 0.071744 -0.047790
0.470974 0.029038 -0.015406
0.337414 0.016511 0.101615
0.348045 -0.018850 0.102642
0.492888 -0.005656 -0.020533
0.357315 -0.044386 -0.096060
0.451572 -0.054057 0.018658
0.356166 -0.137891 0.019021
0.332010 0.031919 -0.096199
0.444222 0.058502 -0.057645
0.383314 -0.016832 -0.094781
0.365113 -0.019101 -0.100860
0.469400 0.033971 -0.016419
0.470534 0.047344 0.017803
0.391850 -0.034966 -0.086704
0.473780 0.019881 0.005133
0.322650 0.080540 0.056356
0.371203 0.023754 0.081355
0.495391 0.017809 -0.024779
0.353304 -0.031686 -0.100723
0.491060 0.022686 -0.024561
0.384958 -0.001183 -0.067967
0.423678 0.011965 0.057459
0.326047 0.053713 -0.084234
0.321616 0.071658 -0.067547
0.499905 0.002834 -0.005236
0.360356 -0.117707 -0.042490
0.494782 0.011020 -0.003324
0.481693 0.031986 -0.048905
0.498893 0.008338 -0.013823
0.354064 -0.140564 0.013755
0.362822 -0.138286 -0.006782
0.480840 -0.007061 0.037982
0.353063 -0.080898 -0.036301
0.434328 0.002503 -0.066399
0.477663 0.074902 -0.007863
0.341476 -0.013572 0.089036
0.318078 0.094872 0.016997
0.377127 -0.080266 0.068685
0.477853 0.003910 0.047475
0.378945 0.094021 0.022381
0.393570 0.019138 -0.058576
0.339900 0.002668 -0.101058
0.490730 0.031442 -0.032292
0.492724 0.025717 0.036606
0.451444 0.006121 -0.066032
0.442044 0.011177 -0.071426
0.381784 0.031290 -0.069802
0.357589 -0.133435 0.025649
0.477525 0.075161 0.004466
0.398357 0.004139 -0.058624
0.471847 0.062821 0.041845
0.493684 0.023446 -0.034675
0.444324 -0.007887 -0.066769
0.312925 0.093260 -0.012867
0.315756 0.088389 -0.037130
0.313153 0.090500 -0.024250
0.418822 0.027181 0.057446
0.365510 -0.132151 -0.019890
0.420197 -0.088931 -0.000118
0.320374 0.071485 -0.066789
0.498509 0.008607 -0.008868
0.376001 0.007886 -0.073273
0.356391 -0.129671 -0.029567
0.468670 0.072777 0.033074
0.356084 -0.134161 -0.024680
0.465547 -0.004858 -0.053438
0.477446 0.065336 0.014359
0.354405 -0.136221 0.020525
0.319033 0.091878 0.030362
0.407719 0.032696 -0.058845
0.346870 0.032532 -0.096992
0.401273 0.051098 0.075620
0.479348 0.069626 -0.021036
0.478134 0.038440 -0.024420
0.379342 0.038917 0.078914
0.349377 -0.015353 0.104235
0.314159 0.095012 0.005537
0.465726 0.041273 -0.009685
0.497296 0.013368 0.022847
0.362458 -0.077646 0.073188
0.439322 0.030431 0.071141
0.488592 0.038140 -0.033510
0.367023 -0.133490 -0.013276
0.498952 0.006768 0.016435
0.430895 0.036253 -0.067472
0.352377 -0.125956 0.019654
0.379395 0.038775 -0.078819
0.479084 0.069287 0.017451
0.313496 0.094653 -0.005262
0.369342 0.003043 0.096856
0.358926 -0.128757 0.031408
0.372332 0.005613 -0.080514
0.366030 -0.079708 0.074034
0.480119 0.017314 0.008072
0.324962 0.049441 0.083262
0.351292 -0.093593 -0.019633
0.357497 -0.129374 -0.030675
0.480899 0.057074 0.038937
0.346704 0.007030 -0.104113
0.380811 -0.007186 -0.077073
0.372550 -0.130799 0.006427
0.384505 0.022740 0.063672
0.355229 -0.136963 0.020397
0.327107 0.054427 0.084490
0.367371 0.017383 -0.097920
0.486099 0.046488 -0.039286
0.422862 0.011785 -0.057822
0.403959 0.045387 0.067411
0.478163 0.072795 0.018342
0.350452 -0.018687 -0.103819
0.333505 0.046523 0.090643
0.471343 0.023674 -0.005474
0.316102 0.083934 -0.046155
0.429922 -0.062932 0.038990
0.312771 0.091688 0.018260
0.493006 0.016582 0.018232
0.313465 0.085483 -0.033282
0.421226 0.019648 0.056652
0.493643 -0.009592 -0.009409
0.317443 0.084729 -0.046762
0.356921 -0.104254 -0.041807
0.381326 0.044475 -0.084414
0.405863 0.039420 0.062197
0.376167 -0.009704 -0.097962
0.340166 0.011104 -0.103323
0.407412 0.006439 0.055896
0.491362 0.000657 0.030495
0.476207 0.027918 -0.019198
0.478849 0.019639 -0.012048
0.489460 0.035943 0.039471
0.403907 0.014252 -0.055768
0.358944 -0.135620 -0.021442
0.492640 0.027866 -0.033935
0.350452 -0.006545 -0.104729
0.472682 0.043932 -0.020594
0.327881 0.040325 -0.089138
0.419142 -0.019656 -0.077543
0.349147 -0.018695 0.103492
0.319005 0.077400 -0.059065
0.363726 -0.118457 0.041284
0.426185 0.028876 0.060534
0.409222 0.084764 0.038820
0.381164 -0.007457 0.076151
0.398288 -0.020449 0.079028
0.468732 0.052991 0.011937
0.467580 0.039668 0.015523
0.352285 -0.032101 -0.099800
0.330133 0.089722 0.039628
0.410505 0.024879 0.055781
0.499050 -0.000931 -0.004123
0.390370 -0.018139 -0.082212
0.362200 -0.094616 -0.059567
0.433639 0.091651 0.000072
0.372379 0.005441 0.079923
0.405367 -0.014924 0.068439
0.423748 -0.017445 0.075667
0.395634 -0.012106 -0.069586
0.410873 -0.007573 -0.062659
0.356501 -0.025534 0.102255
0.357198 -0.047308 -0.094043
0.485661 0.042153 0.042804
0.369714 -0.084975 -0.068906
0.377570 -0.112309 0.036988
0.456971 -0.039725 -0.033383
0.376777 -0.008312 -0.086867
0.493490 0.023953 0.029797
0.382411 -0.012199 -0.081947
0.494718 0.011217 0.005049
0.435093 -0.006775 0.072428
0.467229 0.043990 0.015097
0.483262 0.049669 0.041636
0.484458 0.053079 -0.036063
0.374381 -0.000832 0.080681
0.349669 -0.054974 0.047194
0.360933 -0.065488 0.082301
0.450709 -0.059033 -0.000095
0.463197 0.046186 0.056319
0.374078 -0.057430 -0.085503
0.405554 0.039482 -0.062715
0.475291 0.018732 0.005826
0.486596 0.046704 -0.036977
0.406191 -0.101546 0.005761
0.470509 0.047429 -0.017727
0.393890 -0.047261 -0.080264
0.357958 -0.076311 0.060823
0.335704 0.015813 -0.098908
0.482602 0.057432 0.035706
0.431182 0.012359 -0.061818
0.368359 -0.068215 0.081548
0.369286 0.003251 -0.097451
0.493820 0.016544 0.034959
0.476391 0.068643 -0.002237
0.456782 0.027093 0.063914
0.312311 0.093379 -0.001766
0.362835 -0.138293 0.006567
0.421239 -0.082475 0.021943
0.478537 0.069643 -0.013957
0.352777 -0.139379 -0.013834
0.363306 -0.068567 0.081933
0.488500 0.033257 0.042185
0.430196 -0.012383 0.073641
0.392646 -0.021806 -0.090074
0.312713 0.076696 0.017370
0.496214 0.008875 0.027693
0.338469 0.018825 0.101885
0.360470 -0.130748 0.028049
0.334130 0.028358 0.098412
0.497317 0.010795 0.012572
0.475209 0.074914 -0.022257
0.469362 0.030802 -0.057011
0.388192 0.038890 0.068790
0.405963 -0.101733 -0.005938
0.497399 0.010983 0.024881
0.434597 0.002517 0.065884
0.393317 0.047438 -0.074494
0.408697 -0.000756 -0.058879
0.415566 0.009020 0.055795
0.357984 -0.139055 0.015036
0.340315 -0.017815 -0.076235
0.476786 0.077112 -0.001598
0.489360 0.036268 -0.039526
0.375323 -0.028463 -0.095860
0.420018 -0.004930 0.061830
0.450989 -0.057699 0.009357
0.439976 0.071790 0.047783
0.313552 0.085198 0.033971
0.321465 0.061462 -0.073855
0.331969 0.051365 -0.087437
0.368792 0.016706 -0.086478
0.357119 -0.141620 0.008302
0.373093 -0.105879 0.048345
0.469789 0.030941 -0.014648
0.360426 -0.123494 0.037068
0.377504 -0.112322 -0.037081
0.370961 0.001215 0.088380
0.394830 -0.009611 0.066699
0.404863 0.014428 0.055055
0.481849 0.061732 -0.029323
0.353632 -0.135336 -0.020158
0.353053 -0.065467 0.051511
0.402251 -0.023434 -0.085208
0.319848 0.070021 -0.067151
0.411649 0.046919 -0.068956
0.342496 0.000274 0.103887
0.478527 0.070211 -0.024781
0.312178 0.091592 -0.012516
0.464447 0.049488 -0.005038
0.412709 0.017061 -0.055519
0.481591 -0.023382 -0.014655
0.357899 -0.124263 -0.035535
0.471953 0.025610 -0.013237
0.483160 0.050003 -0.041585
0.485472 0.020121 0.045619
0.359077 -0.135359 0.021680
0.473115 0.022329 -0.010279
0.335510 0.065715 0.075767
0.350235 -0.108757 0.007967
0.356489 -0.124888 -0.032991
0.390007 0.033203 0.063820
0.314321 0.094508 -0.012405
0.433601 0.027772 -0.065267
0.322845 0.060629 -0.077245
0.367592 0.011693 -0.095532
0.475150 0.032886 -0.021053
0.480593 0.063195 0.023800
0.422289 -0.051374 0.057851
0.378886 -0.118740 -0.025569
0.385304 0.070211 -0.064158
0.494102 0.013149 0.011999
0.379078 0.093610 -0.024089
0.395834 0.042716 0.067483
0.324635 0.062201 -0.077780
0.401412 -0.002531 0.059862
0.491319 0.024426 0.039582
0.500000 0.002516 0.002527
0.498705 0.007684 0.002122
0.440559 0.004710 -0.071628
0.469597 0.033346 0.016396
0.396517 -0.014898 0.071187
0.391935 -0.000518 -0.063088
0.329801 0.083606 0.052360
0.475552 0.017914 0.001620
0.478355 0.070208 0.012533
0.344127 -0.010577 -0.101321
0.486419 0.047402 0.036049
0.327925 0.051895 -0.086323
0.366596 -0.107678 -0.050821
0.391223 0.026492 -0.060955
0.353251 -0.139848 0.013967
0.328531 0.042296 0.090689
0.495146 0.018113 0.032106
0.497135 0.005831 -0.023522
0.314400 0.086839 -0.037092
0.406877 -0.019659 0.074408
0.496977 0.013220 -0.019548
0.415098 -0.021789 0.079038
0.365585 -0.132065 0.019876
0.351208 -0.069663 -0.031674
0.365823 -0.056309 0.089339
0.421759 -0.086027 -0.010989
0.361717 -0.126113 -0.033620
0.469213 0.051486 -0.013972
0.348190 -0.034242 -0.085154
0.353617 -0.028638 0.101817
0.331439 0.007139 0.068813
0.337596 0.021593 -0.101163
0.379201 -0.001306 0.073249
0.397608 -0.103255 -0.024048
0.357098 -0.141619 -0.008495
0.318606 0.093224 -0.025440
0.352903 -0.143785 -0.001652
0.358217 0.068294 0.070977
0.322830 0.063792 -0.075362
0.354413 -0.031099 -0.101165
0.451470 0.086849 0.014694
0.316558 0.064337 0.048375
0.358686 -0.055482 -0.088679
0.413807 -0.013601 0.067116
0.366074 -0.084778 -0.070111
0.492901 -0.005705 0.020472
0.352250 -0.012212 0.104387
0.480736 -0.027139 -0.000069
0.348376 -0.019853 -0.102505
0.465084 0.084016 0.009571
0.334780 0.075179 -0.065158
0.323521 0.077829 -0.060753
0.324983 0.038239 0.075903
0.348840 -0.045437 0.066217
0.474769 0.020367 0.009380
0.334593 0.075743 0.064439
0.484141 0.054060 0.035618
0.351792 -0.142331 0.003805
0.478965 0.022584 0.016241
0.349360 -0.019327 -0.103410
0.319241 0.077047 0.059656
0.350232 -0.110740 -0.008199
0.368588 0.008572 -0.090558
0.365370 -0.099427 0.058367
0.499859 0.004638 -0.006418
0.439031 0.030339 -0.071291
0.338113 -0.013773 0.070005
0.323440 0.035037 0.062528
0.317674 0.049072 -0.030344
0.386495 -0.119102 -0.006368
0.418001 0.048412 -0.072287
0.495646 0.016550 -0.030819
0.364615 -0.068233 0.082414
0.478808 0.061065 0.020732
0.417975 0.027096 -0.057773
0.326698 0.093341 -0.028603
0.499752 0.005619 0.001116
0.398220 0.051002 -0.076456
0.397733 0.036765 0.062283
0.317311 0.077967 -0.055887
0.396026 -0.023047 0.088252
0.350893 -0.033326 -0.095850
0.421674 -0.011029 -0.067681
0.352926 -0.143026 -0.006285
0.472608 0.016717 -0.054898
0.472828 0.026446 0.015550
0.373564 0.016356 0.074991
0.481719 0.061810 0.030668
0.484474 0.051044 -0.031739
0.379670 -0.013857 0.096473
0.480759 -0.026399 0.007456
0.376255 0.040000 0.087841
0.476576 0.068062 0.006694
0.405941 -0.023667 0.083275
0.468251 0.054501 -0.009133
0.353325 -0.143635 0.003720
0.391428 -0.035036 0.086847
0.497399 0.010541 -0.011842
0.468566 0.039806 -0.017113
0.319940 0.089047 -0.038996
0.392068 0.026746 0.060117
0.323936 0.064364 0.075714
0.315524 0.055803 0.005263
0.423684 0.035852 -0.063200
0.394252 0.047672 0.073913
0.438399 -0.021253 0.065077
0.339452 0.005614 0.101793
0.322436 0.059435 0.076837
0.372400 -0.130902 -0.006635
0.390773 -0.018691 0.081986
0.328739 0.041675 -0.091025
0.465154 0.047271 0.009679
0.354769 -0.042312 -0.095129
0.350412 -0.073263 -0.013472
0.412819 -0.013670 -0.067859
0.400496 -0.002562 -0.060768
0.311799 0.090698 -0.005600
0.476543 0.070735 -0.028284
0.326540 0.093829 0.026571
0.315516 0.080305 -0.048041
0.330357 0.089035 -0.041445
0.401986 -0.104137 0.011837
0.491163 0.032057 0.037184
0.457105 -0.025999 -0.047252
0.373321 0.016282 -0.075875
0.363309 -0.068743 -0.081860
0.351134 -0.129029 0.012250
0.472547 0.044017 0.020481
0.319277 0.073344 0.063667
0.464675 0.046962 0.007311
0.355289 -0.126647 0.029221
0.496245 0.016408 -0.027557
0.397460 -0.088648 0.044906
0.340763 0.056408 0.083613
0.422340 -0.081518 -0.021736
0.365982 -0.056803 -0.089092
0.396820 0.011859 0.056914
0.368644 0.008472 0.089861
0.401415 0.022062 -0.056574
0.487431 0.043143 -0.034650
0.349959 -0.117458 -0.000128
0.429332 -0.012637 -0.074072
0.357931 -0.139095 -0.015129
0.420395 0.019515 -0.056991
0.480869 0.062872 -0.032151
0.477682 0.072317 0.003919
0.331330 0.033281 0.095255
0.353876 -0.143891 -0.000270
0.371112 0.032627 -0.092250
0.466139 0.047405 0.012117
0.322702 0.061051 0.076897
0.323552 0.034705 -0.062701
0.391971 -0.000652 0.062472
0.384304 -0.119601 -0.012679
0.351538 -0.097327 0.020350
0.470164 0.027370 -0.010005
0.367349 -0.133261 0.013157
0.312317 0.092870 0.008380
0.324978 0.026191 -0.056756
0.441799 -0.009136 0.067840
0.456447 0.071265 -0.041900
0.370659 -0.044736 0.092781
0.312432 0.088712 0.020975
0.498667 0.008473 -0.017988
0.371622 0.033478 0.091777
0.370357 0.011803 -0.082366
0.368127 0.008736 -0.099341
0.446891 -0.016696 -0.061544
0.467286 0.055866 0.002193
0.431943 0.036098 0.067654
0.366645 -0.126417 -0.028688
0.312258 0.078125 -0.006172
0.467038 0.037160 0.011875
0.429045 -0.007587 -0.068727
0.360414 -0.123285 -0.037403
0.472562 0.027285 -0.016051
0.482572 0.049272 0.028753
0.354935 -0.036839 0.099093
0.489274 0.037989 -0.038229
0.326834 0.067427 0.073642
0.316433 0.087880 0.039094
0.478371 0.062443 -0.018908
0.467238 0.043968 -0.015111
0.384094 -0.016638 0.088584
0.368452 -0.068522 -0.081391
0.356753 -0.048939 0.091981
0.351838 -0.028685 0.101278
0.413455 0.071500 0.056173
0.315855 0.079521 0.049885
0.377481 -0.067803 -0.077558
0.451558 0.086580 -0.015812
0.317214 0.062604 -0.051791
0.409668 -0.000630 0.058140
0.498682 0.000435 0.011496
0.414368 0.041133 0.063602
0.493670 -0.009737 0.008809
0.337289 0.034664 0.096810
0.356961 -0.131461 0.028019
0.484244 0.019297 -0.015203
0.417528 0.001963 -0.058648
0.475463 0.051490 0.047214
0.472217 0.040414 0.020492
0.355033 -0.141328 0.012094
0.467865 0.036966 0.014879
0.314703 0.090866 0.028763
0.484482 0.023247 -0.046953
0.342345 0.004275 -0.104224
0.360319 -0.131056 -0.027809
0.473912 0.078977 -0.012622
0.325391 0.051920 -0.084161
0.317014 0.078878 0.054275
0.361835 -0.109097 -0.049922
0.489796 0.036718 -0.036114
0.479377 0.019636 0.012467
0.487564 0.043334 0.038247
0.351454 -0.128735 -0.014418
0.341974 0.045457 0.090987
0.494156 0.022896 0.032771
0.496166 0.014401 0.019487
0.480742 -0.024299 0.014862
0.339844 0.006880 -0.102795
0.464214 0.048407 -0.003312
0.376465 -0.080309 -0.069122
0.344171 -0.006676 -0.103580
0.342960 0.044784 -0.091256
0.363394 -0.097294 0.059368
0.476853 0.075454 -0.015542
0.357229 -0.064214 0.072544
0.424987 0.045349 0.071501
0.371381 -0.044558 -0.092602
0.345208 -0.006318 -0.104446
0.399073 -0.108392 -0.000133
0.328342 0.038848 0.089996
0.369699 -0.085217 0.068657
0.387722 0.070412 0.063486
0.366607 -0.107889 0.050553
0.493831 -0.010781 -0.000055
0.442122 0.021263 0.071177
0.464411 0.049597 0.004530
0.374712 -0.001842 -0.081862
0.391175 0.049283 0.079317
0.351283 -0.139406 0.006556
0.388797 0.009294 0.060778
0.363524 -0.104037 -0.054583
0.353722 -0.036884 0.098174
0.358566 -0.118059 -0.040468
0.348106 -0.033994 0.085277
0.378552 0.018890 -0.068949
0.374148 0.033397 0.082430
0.382791 -0.012555 0.081084
0.357962 -0.042344 0.097140
0.357424 -0.085608 0.051502
0.356825 0.008007 0.102178
0.434319 0.089520 0.016759
0.473643 0.020312 -0.006297
0.362352 -0.043976 -0.095919
0.365237 -0.137030 -0.000153
0.497185 0.013166 0.025147
0.325572 0.071404 -0.069147
0.477962 0.003567 -0.047272
0.403499 -0.009071 0.063468
0.378984 -0.118581 0.025660
0.381736 0.044770 0.084164
0.367536 0.018919 0.097476
0.395074 -0.045925 0.080179
0.317821 0.095683 -0.010926
0.352046 -0.141558 -0.007830
0.497645 0.010210 -0.023918
0.356090 -0.130896 0.027901
0.369973 0.027606 0.088397
0.488801 0.037475 0.033442
0.328371 0.027651 -0.081761
0.326735 0.051531 0.085925
0.358855 -0.128782 -0.031519
0.312348 0.088983 -0.019753
0.425776 0.057278 0.064618
0.478906 0.070471 -0.022186
0.385868 0.043273 -0.075619
0.333465 0.030474 -0.097591
0.320558 0.087099 0.043647
0.475891 0.078467 0.000471
0.425044 0.004948 -0.060011
0.348405 -0.046469 -0.059225
0.442168 0.009686 0.071266
0.368435 0.025329 -0.095473
0.313599 0.089337 0.029284
0.464401 0.045422 0.003186
0.374028 0.033066 -0.082527
0.324456 0.051053 -0.082000
0.473784 0.035504 0.020968
0.428111 0.021982 -0.060249
0.394431 0.019341 0.057703
0.441779 0.020932 -0.071341
0.475939 0.072617 0.025696
0.327974 0.096493 0.013382
0.485294 0.040754 -0.030388
0.325642 0.051350 0.084784
0.488849 0.009333 0.039147
0.450874 0.088719 0.000063
0.474242 0.077937 0.015686
0.337285 0.018507 -0.101560
0.332126 0.026991 0.095456
0.389176 0.032907 -0.064614
0.362460 -0.067882 0.082011
0.362227 -0.116058 0.044197
0.463313 -0.045263 -0.008684
0.363837 -0.117708 -0.042100
0.340907 0.055985 -0.083873
0.372751 -0.004396 0.093966
0.425886 0.028952 -0.060967
0.372843 -0.105832 -0.048622
0.470023 0.035241 -0.017872
0.357514 -0.133493 -0.025725
0.438814 -0.000635 0.071717
0.428400 0.021934 0.059802
0.347950 -0.048382 0.037125
0.466383 0.079945 0.022042
0.458780 0.060028 0.050865
0.371765 -0.002607 -0.099386
0.419717 -0.004895 -0.062451
0.359582 -0.122331 0.038077
0.409436 0.084108 -0.040014
0.480967 0.056874 -0.039033
0.434419 0.089212 -0.018035
0.362662 -0.089710 0.063743
0.313569 0.092795 0.018611
0.352916 0.020162 -0.100347
0.499077 -0.001029 0.004097
0.408025 0.032647 0.058313
0.325463 0.097208 0.000109
0.471088 0.028494 0.015033
0.335541 0.065641 -0.075787
0.427950 -0.001421 0.063249
0.473392 0.080602 0.004196
0.402183 -0.103945 -0.011916
0.398947 0.029794 -0.059075
0.385228 -0.001317 0.067157
0.317726 0.050111 0.035762
0.313817 0.073243 -0.030451
0.331543 0.017685 0.085639
0.388674 0.048410 -0.080446
0.354030 -0.133872 0.021934
0.394898 0.042485 -0.068094
0.464834 0.084802 -0.003409
0.465528 0.041891 0.009335
0.478169 0.023426 -0.016654
0.413491 0.041148 -0.063935
0.354823 -0.137915 -0.018992
0.467568 0.076239 -0.028557
0.412541 0.046858 0.068604
0.427156 -0.001670 -0.063680
0.378037 0.096868 0.000093
0.473794 0.023420 0.013261
0.485616 0.048622 0.033577
0.336967 0.000469 0.088992
0.341040 0.007924 0.103723
0.323507 0.061647 0.077499
0.497763 0.003693 0.019906
0.397691 -0.103123 0.024140
0.421977 -0.011070 0.067044
0.378780 0.018888 0.068192
0.356759 -0.044199 0.095878
0.345006 -0.001657 0.104756
0.477442 0.075057 -0.013101
0.369564 -0.115557 0.040472
0.361730 -0.070284 -0.078891
0.346683 -0.019160 0.099958
0.370531 0.002481 -0.088824
0.483274 0.055339 -0.036693
0.352455 -0.141415 0.009308
0.467343 0.055689 -0.003502
0.487137 0.014873 -0.042958
0.357424 -0.085358 -0.051771
0.336496 0.014752 0.100169
0.368842 0.016521 0.085913
0.407060 0.050940 -0.074138
0.450478 0.042884 -0.063155
0.328642 0.061787 -0.079141
0.354368 -0.143253 0.005690
0.471728 0.029892 0.017129
0.353139 0.084225 -0.050562
0.342832 -0.017660 -0.088717
0.498867 0.008302 0.013262
0.396795 0.036540 -0.062922
0.495147 0.012332 -0.031436
0.453273 0.081197 0.028953
0.317662 0.096177 0.003502
0.404416 -0.014843 -0.069309
0.472596 0.039232 -0.020676
0.373020 -0.004916 0.099024
0.354132 -0.140141 -0.014879
0.356137 -0.137836 -0.019282
0.328005 0.096400 -0.014309
0.359465 -0.053103 0.091453
0.376120 -0.006283 0.083863
0.335631 0.039892 -0.094319
0.367846 0.019641 0.091937
0.473372 0.080667 -0.004466
0.499105 0.005474 -0.015137
0.350487 -0.131275 0.006075
0.406922 0.091981 -0.021203
0.335498 0.005320 -0.088499
0.423992 0.035746 0.062774
0.414392 -0.018596 -0.074100
0.456430 0.071305 0.041895
0.362086 -0.056528 -0.089982
0.354928 -0.134382 -0.023425
0.319588 0.060988 0.065356
0.315678 0.059371 -0.030969
0.477650 0.044655 -0.048787
0.465316 0.049987 0.008224
0.435901 0.049884 0.065684
0.358930 -0.124178 -0.036326
0.490224 0.004742 -0.035094
0.471613 0.015904 0.055404
0.384468 0.022877 -0.064233
0.377418 -0.091563 -0.059058
0.499627 0.003753 0.010133
0.413163 0.049996 0.072914
0.467684 0.054620 0.007559
0.360212 -0.117250 0.042658
0.381934 0.084667 -0.045459
0.492859 0.017049 -0.018795
0.377638 -0.011010 -0.092118
0.377410 -0.091857 0.058754
0.376248 0.026109 -0.073728
0.370401 0.050237 0.083403
0.354125 -0.116934 -0.029058
0.361515 -0.006655 -0.102363
0.484782 0.042347 0.030335
0.489456 0.027710 -0.027723
0.477035 0.066627 -0.011505
0.381824 0.031141 0.069260
0.410201 0.024918 -0.056329
0.495590 0.017373 0.024549
0.466135 0.044196 0.013025
0.368548 0.007043 0.099431
0.398141 -0.019962 -0.079078
0.381555 0.010193 0.066002
0.468961 0.031134 0.011900
0.350408 -0.132244 -0.003823
0.470303 0.051381 0.015522
0.494136 0.013045 -0.011700
0.437808 0.014590 -0.066615
0.369510 -0.115523 -0.040612
0.342743 -0.005444 0.101965
0.464594 0.045741 -0.055868
0.387371 0.038562 -0.069533
0.355312 -0.100523 0.037477
0.399918 -0.066042 -0.064054
0.320192 0.068184 0.068938
0.445680 -0.063025 -0.009721
0.314655 0.093456 0.019011
0.492928 0.024554 -0.029158
0.476559 0.076950 0.009190
0.368092 0.049111 -0.084579
0.362355 -0.044025 0.095868
0.403645 0.045462 -0.067918
0.360660 -0.034901 0.099286
0.330524 0.043720 0.091699
0.480402 0.056072 0.025187
0.481738 0.060784 -0.027312
0.478528 0.072189 0.016440
0.314040 0.092950 -0.019874
0.353403 -0.142393 0.009026
0.335859 0.019416 -0.100313
0.473702 0.023712 -0.013465
0.368873 0.026692 0.094907
0.402565 -0.009045 -0.064364
0.354079 -0.067614 -0.053799
0.333993 0.025181 0.098549
0.471665 0.022665 0.001537
0.353723 -0.141822 -0.010958
0.352520 0.021371 0.100044
0.356859 -0.142614 0.003229
0.313088 0.094304 0.005180
0.478973 0.069383 0.025156
0.331535 0.040583 -0.093421
0.466045 0.047703 -0.011692
0.354568 -0.019440 -0.103478
0.436557 0.082516 -0.034036
0.313884 0.064986 0.010002
0.473989 0.019227 -0.001878
0.416443 0.034634 0.059875
0.330089 0.082722 -0.053976
0.344563 0.011872 0.103569
0.329564 0.042695 -0.091618
0.318474 0.069794 -0.063221
0.377475 -0.010528 0.089897
0.388762 0.009424 -0.061371
0.364616 -0.018915 0.101013
0.364721 -0.068590 -0.082226
0.417828 0.001933 0.058045
0.434900 0.037132 0.071126
0.489331 0.028094 0.027826
0.473907 0.056380 -0.045350
0.399890 0.030008 0.058407
0.334364 0.031687 0.097645
0.364613 -0.093217 0.063263
0.376282 0.007843 0.072330
0.475484 0.018128 -0.003376
0.480750 -0.026388 -0.007487
0.481413 -0.016893 0.026926
0.366746 -0.126270 0.028739
0.415457 -0.034634 0.073525
0.347356 -0.046216 -0.039084
0.486948 0.035561 0.030088
0.424704 -0.016374 -0.075512
0.375759 0.039497 -0.088201
0.360118 -0.112818 -0.045748
0.474184 0.018978 0.002016
0.425848 0.005164 0.059618
3 0 8 978
3 8 788 978
3 788 7 978
3 7 1 978
3 7 2 1
3 7 3 2
3 7 4 3
3 7 6 4
3 6 5 4
3 5 161 4
3 0 47 8
3 0 586 47
3 162 896 363
3 349 162 365
3 910 349 44
3 147 910 355
3 876 147 860
3 980 876 587
3 365 363 712
3 44 365 298
3 587 860 941
3 555 587 356
3 646 555 792
3 712 77 840
3 44 298 197
3 355 44 219
3 941 355 478
3 356 941 588
3 792 356 414
3 823 792 672
3 232 823 754
3 414 588 248
3 672 414 188
3 754 672 138
3 386 754 305
3 197 712 290
3 219 197 260
3 478 219 119
3 248 478 962
3 188 248 134
3 138 188 329
3 305 138 446
3 386 305 616
3 916 386 763
3 134 962 178
3 329 134 239
3 446 329 611
3 616 446 906
3 763 616 547
3 459 763 782
3 290 840 535
3 260 290 638
3 119 260 597
3 178 119 720
3 239 178 888
3 611 239 486
3 906 611 808
3 547 906 268
3 782 547 40
3 459 782 576
3 888 720 898
3 486 888 245
3 808 486 775
3 268 808 856
3 40 268 377
3 576 40 819
3 597 638 427
3 898 597 135
3 856 775 920
3 377 856 815
3 819 377 930
3 245 898 760
3 920 245 285
3 815 920 750
3 427 535 461
3 135 427 19
3 760 135 152
3 722 656 582
3 867 961 722
3 64 582 342
3 477 342 492
3 353 492 177
3 516 177 354
3 433 781 867
3 341 722 64
3 434 477 353
3 733 353 516
3 73 516 832
3 421 832 124
3 371 867 341
3 505 341 64
3 809 64 434
3 625 434 733
3 471 733 73
3 665 73 421
3 965 421 805
3 984 805 412
3 181 471 665
3 324 665 965
3 415 965 984
3 220 984 160
3 352 371 505
3 972 505 809
3 911 809 625
3 715 625 181
3 609 181 324
3 435 324 415
3 97 415 220
3 316 220 160
3 787 160 80
3 109 715 609
3 764 609 435
3 74 435 97
3 347 97 316
3 255 316 787
3 339 787 58
3 610 433 352
3 148 352 972
3 559 972 911
3 833 911 109
3 300 109 764
3 573 764 74
3 969 74 347
3 801 347 255
3 956 255 339
3 875 339 58
3 81 833 300
3 905 300 573
3 457 573 969
3 551 969 801
3 321 801 956
3 667 956 875
3 847 148 559
3 215 559 81
3 409 457 551
3 469 551 321
3 306 321 667
3 721 81 905
3 273 905 409
3 104 409 469
3 95 610 847
3 869 847 215
3 742 215 721
3 983 955 213
3 480 983 213
3 480 955 983
3 366 25 292
3 25 366 225
3 169 549 855
3 668 563 520
3 422 563 692
3 374 520 563
3 151 422 204
3 257 374 422
3 594 151 394
3 173 704 142
3 142 380 594
3 729 173 299
3 299 142 65
3 393 299 629
3 530 76 842
3 69 185 530
3 814 266 741
3 26 487 266
3 487 228 301
3 228 675 205
3 266 301 670
3 301 205 246
3 185 509 76
3 509 620 568
3 568 620 851
3 76 568 937
3 842 937 228
3 937 851 675
3 455 872 599
3 613 913 872
3 47 455 627
3 527 213 180
3 549 474 406
3 467 292 686
3 292 467 366
3 282 855 277
3 890 169 282
3 61 741 96
3 155 893 971
3 155 96 893
3 793 431 777
3 893 793 38
3 741 670 96
3 670 246 289
3 96 670 793
3 793 289 431
3 627 284 921
3 180 182 137
3 855 406 691
3 277 855 907
3 314 686 531
3 686 314 467
3 411 282 730
3 120 975 116
3 312 120 127
3 605 312 464
3 70 698 797
3 121 112 438
3 8 121 372
3 825 180 137
3 277 907 364
3 91 531 72
3 531 91 314
3 489 730 690
3 116 230 237
3 127 116 22
3 32 971 397
3 372 438 526
3 558 137 803
3 690 364 35
3 72 967 91
3 967 72 170
3 242 690 595
3 22 237 887
3 737 977 566
3 569 634 130
3 373 776 866
3 658 866 834
3 866 156 723
3 7 372 539
3 852 803 476
3 164 35 483
3 762 979 967
3 328 595 687
3 595 690 164
3 931 140 963
3 163 659 201
3 839 201 918
3 336 502 274
3 201 336 114
3 717 650 659
3 650 723 502
3 49 476 344
3 483 743 826
3 674 902 979
3 123 687 529
3 687 164 483
3 391 13 375
3 174 862 725
3 918 114 442
3 579 442 200
3 114 274 835
3 6 539 503
3 344 676 14
3 560 826 128
3 649 600 211
3 529 483 560
3 774 943 619
3 774 619 488
3 619 405 165
3 165 970 932
3 405 403 970
3 6 503 62
3 368 344 908
3 560 128 149
3 149 128 463
3 933 211 914
3 385 529 560
3 748 790 423
3 705 488 769
3 293 769 580
3 580 769 623
3 769 745 829
3 829 302 574
3 488 165 745
3 745 932 302
3 622 908 584
3 584 14 602
3 149 463 286
3 343 265 546
3 949 149 935
3 92 560 949
3 423 877 858
3 660 423 94
3 707 660 340
3 510 707 136
3 580 623 923
3 93 601 683
3 601 68 533
3 683 533 171
3 623 829 31
3 923 31 601
3 31 574 68
3 62 540 810
3 5 62 810
3 711 602 153
3 883 584 711
3 641 565 265
3 927 935 247
3 63 307 927
3 94 858 513
3 340 94 726
3 136 340 16
3 100 136 238
3 661 683 56
3 424 56 758
3 758 57 677
3 57 653 677
3 56 171 57
3 171 52 653
3 161 810 575
3 150 711 153
3 935 481 618
3 176 390 565
3 418 247 233
3 753 927 418
3 726 513 771
3 16 726 351
3 238 16 11
3 192 238 824
3 635 758 313
3 139 630 392
3 139 313 630
3 313 798 948
3 798 925 275
3 758 677 798
3 176 641 843
3 150 153 445
3 233 247 30
3 247 618 30
3 111 418 836
3 351 771 663
3 11 351 796
3 824 11 873
3 9 824 468
3 444 392 252
3 589 392 444
3 747 444 254
3 444 252 254
3 252 458 936
3 254 936 115
3 392 948 287
3 948 275 287
3 392 287 252
3 575 954 881
3 4 575 541
3 86 445 131
3 445 694 131
3 233 30 271
3 699 836 749
3 836 233 271
3 796 663 89
3 873 796 953
3 468 873 794
3 189 468 894
3 315 254 491
3 592 311 552
3 311 253 318
3 311 318 141
3 491 115 253
3 491 253 311
3 951 131 194
3 271 18 934
3 443 749 15
3 749 271 436
3 953 89 633
3 794 953 198
3 894 794 29
3 853 894 466
3 960 67 440
3 67 552 440
3 425 440 460
3 960 440 425
3 440 258 511
3 511 222 470
3 552 141 337
3 552 337 258
3 541 881 624
3 4 541 631
3 381 105 654
3 617 15 370
3 198 633 190
3 29 198 207
3 761 682 583
3 682 221 959
3 959 484 950
3 460 511 221
3 221 470 484
3 655 194 66
3 436 934 561
3 333 144 105
3 370 15 379
3 207 190 919
3 334 583 87
3 384 87 938
3 87 206 938
3 938 751 773
3 751 126 504
3 583 959 751
3 751 950 126
3 631 624 48
3 2 631 48
3 272 861 462
3 571 66 210
3 379 15 612
3 15 561 612
3 272 768 144
3 304 379 651
3 304 370 379
3 849 919 408
3 297 639 901
3 384 938 693
3 240 693 696
3 693 679 703
3 938 773 323
3 773 504 323
3 693 323 679
3 2 48 27
3 85 210 199
3 685 280 241
3 462 167 768
3 419 651 110
3 651 685 331
3 159 408 557
3 482 696 521
3 24 521 345
3 521 532 217
3 532 308 512
3 696 703 532
3 703 50 308
3 648 199 449
3 199 430 449
3 331 241 926
3 818 218 903
3 326 903 167
3 250 331 604
3 243 557 264
3 980 251 640
3 212 54 158
3 420 400 212
3 702 212 382
3 33 420 702
3 515 358 113
3 358 203 59
3 203 196 878
3 113 59 598
3 345 217 203
3 217 512 196
3 27 417 755
3 1 27 755
3 671 818 327
3 939 449 453
3 604 331 216
3 331 926 216
3 604 216 493
3 671 895 218
3 544 250 604
3 264 732 21
3 640 264 596
3 113 598 157
3 978 755 71
3 172 453 727
3 895 671 102
3 636 604 227
3 740 604 636
3 596 21 179
3 88 596 362
3 922 88 101
3 684 716 224
3 942 191 845
3 71 942 231
3 978 71 496
3 973 727 955
3 227 493 259
3 915 102 55
3 871 636 537
3 718 982 448
3 982 224 448
3 982 684 224
3 107 261 879
3 456 448 261
3 448 885 295
3 885 647 746
3 261 295 263
3 295 746 785
3 224 39 166
3 224 166 647
3 549 259 474
3 225 55 25
3 223 537 169
3 537 227 549
3 317 974 447
3 974 317 709
3 778 974 520
3 195 447 974
3 924 778 374
3 498 924 374
3 607 195 924
3 626 807 542
3 542 410 704
3 281 626 581
3 581 542 173
3 229 581 729
3 396 53 125
3 437 53 396
3 437 879 53
3 739 556 185
3 739 125 556
3 125 863 945
3 125 945 556
3 945 145 23
3 185 556 509
3 509 23 620
3 879 263 820
3 263 785 864
3 53 820 863
3 863 864 145
3 534 688 913
3 534 913 613
3 586 534 613
3 910 147 439
3 750 285 320
3 388 639 461
3 322 77 896
3 400 162 349
3 400 349 910
3 54 147 876
3 335 876 980
3 614 980 555
3 614 555 646
3 36 646 232
3 475 232 916
3 765 916 459
3 168 459 283
3 129 283 154
3 848 441 930
3 543 154 441
3 813 413 750
3 550 930 413
3 621 760 152
3 981 285 760
3 303 19 461
3 757 152 19
3 791 388 77
3 896 208 322
3 162 400 208
3 910 439 400
3 147 54 439
3 876 335 54
3 646 36 614
3 232 475 36
3 916 244 475
3 916 765 244
3 459 538 765
3 459 168 538
3 283 129 168
3 154 543 129
3 441 848 543
3 930 550 848
3 413 813 550
3 750 320 813
3 285 981 320
3 760 621 981
3 152 757 621
3 19 303 757
3 461 639 303
3 388 791 639
3 77 322 791
3 162 208 896
3 363 896 77
3 365 162 363
3 44 349 365
3 355 910 44
3 860 147 355
3 587 876 860
3 555 980 587
3 712 363 77
3 298 365 712
3 941 860 355
3 356 587 941
3 792 555 356
3 823 646 792
3 232 646 823
3 77 388 840
3 197 298 712
3 219 44 197
3 478 355 219
3 588 941 478
3 414 356 588
3 672 792 414
3 754 823 672
3 386 232 754
3 916 232 386
3 248 588 478
3 188 414 248
3 138 672 188
3 305 754 138
3 290 712 840
3 260 197 290
3 119 219 260
3 962 478 119
3 134 248 962
3 329 188 134
3 446 138 329
3 616 305 446
3 763 386 616
3 459 916 763
3 178 962 119
3 239 134 178
3 611 329 239
3 906 446 611
3 547 616 906
3 782 763 547
3 840 388 535
3 638 290 535
3 597 260 638
3 720 119 597
3 888 178 720
3 486 239 888
3 808 611 486
3 268 906 808
3 40 547 268
3 576 782 40
3 283 459 576
3 898 720 597
3 245 888 898
3 775 486 245
3 856 808 775
3 377 268 856
3 819 40 377
3 154 576 819
3 154 283 576
3 427 638 535
3 135 597 427
3 920 775 245
3 815 856 920
3 930 377 815
3 441 819 930
3 441 154 819
3 760 898 135
3 285 245 760
3 750 920 285
3 413 815 750
3 413 930 815
3 535 388 461
3 19 427 461
3 152 135 19
3 566 492 342
3 735 273 104
3 637 742 721
3 736 95 869
3 656 961 562
3 582 656 12
3 342 582 553
3 177 492 494
3 832 354 399
3 124 832 399
3 412 124 786
3 80 412 756
3 58 80 710
3 642 58 966
3 79 642 701
3 306 822 891
3 822 79 701
3 104 577 713
3 577 306 270
3 721 273 564
3 869 742 940
3 288 95 909
3 781 288 862
3 781 562 961
3 562 12 656
3 12 553 582
3 553 566 342
3 566 494 492
3 494 354 177
3 399 367 124
3 367 786 124
3 786 756 412
3 756 710 80
3 710 279 58
3 279 966 58
3 966 701 642
3 701 891 822
3 891 270 306
3 270 713 577
3 713 735 104
3 735 564 273
3 564 637 721
3 637 940 742
3 940 736 869
3 736 909 95
3 909 862 288
3 862 562 781
3 722 961 656
3 867 781 961
3 64 722 582
3 477 64 342
3 353 477 492
3 516 353 177
3 832 516 354
3 433 288 781
3 341 867 722
3 434 64 477
3 733 434 353
3 73 733 516
3 421 73 832
3 805 421 124
3 805 124 412
3 371 433 867
3 505 371 341
3 809 505 64
3 625 809 434
3 471 625 733
3 665 471 73
3 965 665 421
3 984 965 805
3 160 984 412
3 160 412 80
3 181 625 471
3 324 181 665
3 415 324 965
3 220 415 984
3 352 433 371
3 972 352 505
3 911 972 809
3 715 911 625
3 609 715 181
3 435 609 324
3 97 435 415
3 316 97 220
3 787 316 160
3 58 787 80
3 109 911 715
3 764 109 609
3 74 764 435
3 347 74 97
3 255 347 316
3 339 255 787
3 610 288 433
3 148 610 352
3 559 148 972
3 833 559 911
3 300 833 109
3 573 300 764
3 969 573 74
3 801 969 347
3 956 801 255
3 875 956 339
3 642 875 58
3 81 559 833
3 905 81 300
3 457 905 573
3 551 457 969
3 321 551 801
3 667 321 956
3 79 667 875
3 875 642 79
3 847 610 148
3 215 847 559
3 409 905 457
3 469 409 551
3 306 469 321
3 822 306 667
3 667 79 822
3 721 215 81
3 273 721 905
3 104 273 409
3 577 104 469
3 469 306 577
3 95 288 610
3 869 95 847
3 742 869 215
3 34 310 912
3 759 310 51
3 628 10 310
3 10 276 310
3 276 51 310
3 759 817 310
3 817 645 310
3 645 912 310
3 34 944 310
3 637 82 946
3 621 799 269
3 578 632 354
3 884 748 891
3 637 946 940
3 799 621 757
3 159 244 765
3 243 251 36
3 158 335 980
3 158 54 335
3 944 213 955
3 944 182 213
3 34 137 182
3 34 803 137
3 354 977 578
3 494 566 977
3 12 140 569
3 912 476 803
3 710 756 391
3 562 963 140
3 645 676 476
3 710 391 279
3 909 725 862
3 736 946 725
3 645 14 676
3 701 966 884
3 82 637 899
3 564 899 637
3 270 748 42
3 713 42 899
3 82 899 689
3 817 602 14
3 759 153 602
3 759 694 153
3 51 131 694
3 276 194 131
3 276 66 194
3 543 103 207
3 848 550 103
3 813 928 550
3 129 207 849
3 697 928 621
3 981 621 928
3 621 269 697
3 10 210 66
3 765 538 159
3 168 849 538
3 303 639 799
3 10 430 210
3 322 209 901
3 208 420 209
3 628 449 430
3 614 251 980
3 243 640 251
3 439 54 212
3 208 400 420
3 628 453 449
3 310 727 453
3 944 955 727
3 140 12 562
3 569 553 12
3 569 566 553
3 977 354 494
3 632 399 354
3 632 367 399
3 632 786 367
3 884 891 701
3 748 270 891
3 42 713 270
3 899 735 713
3 899 564 735
3 946 736 940
3 725 909 736
3 963 562 862
3 901 791 322
3 901 639 791
3 799 757 303
3 928 320 981
3 928 813 320
3 103 543 848
3 207 129 543
3 849 168 129
3 243 475 244
3 243 36 475
3 251 614 36
3 212 400 439
3 209 322 208
3 727 310 944
3 453 628 310
3 430 10 628
3 66 276 10
3 131 51 276
3 694 759 51
3 602 817 759
3 14 645 817
3 476 912 645
3 803 34 912
3 182 944 34
3 480 25 55
3 25 480 378
3 378 480 213
3 474 225 366
3 800 668 709
3 800 709 348
3 666 668 800
3 890 666 800
3 890 800 473
3 890 473 169
3 473 800 348
3 709 668 520
3 692 563 668
3 204 422 692
3 422 374 563
3 394 151 204
3 151 257 422
3 380 257 151
3 380 151 594
3 257 380 704
3 594 394 831
3 65 142 594
3 831 65 594
3 142 704 380
3 629 299 65
3 734 629 65
3 65 831 734
3 299 173 142
3 947 729 393
3 947 393 428
3 729 947 45
3 428 393 629
3 428 629 416
3 416 629 495
3 416 495 452
3 452 495 976
3 452 976 404
3 734 495 629
3 495 734 976
3 393 729 299
3 714 872 913
3 714 913 69
3 714 599 872
3 599 714 26
3 842 714 530
3 842 26 714
3 26 842 487
3 530 714 69
3 530 185 76
3 26 284 599
3 284 26 814
3 814 603 284
3 603 814 61
3 61 814 741
3 814 26 266
3 266 487 301
3 301 228 205
3 741 266 670
3 670 301 246
3 205 452 246
3 246 452 404
3 675 416 205
3 205 416 452
3 76 509 568
3 842 76 937
3 487 842 228
3 228 937 675
3 937 568 851
3 851 428 675
3 675 428 416
3 620 45 947
3 620 947 851
3 851 947 428
3 455 613 872
3 599 284 627
3 599 627 455
3 47 613 455
3 378 292 25
3 292 378 527
3 527 378 213
3 180 213 182
3 406 366 467
3 366 406 474
3 855 549 406
3 666 518 668
3 830 518 666
3 282 830 666
3 666 890 282
3 282 169 855
3 518 975 692
3 518 692 668
3 204 975 120
3 975 204 692
3 204 120 312
3 312 394 204
3 831 312 605
3 312 831 394
3 605 361 734
3 361 605 429
3 605 734 831
3 404 976 146
3 146 976 837
3 146 837 338
3 338 837 429
3 338 429 708
3 837 361 429
3 976 734 361
3 976 361 837
3 61 70 603
3 70 61 155
3 155 61 96
3 698 70 155
3 698 155 971
3 893 96 793
3 971 893 38
3 38 793 777
3 777 338 708
3 431 338 777
3 793 670 289
3 289 146 431
3 431 146 338
3 246 404 289
3 289 404 146
3 603 921 284
3 921 603 70
3 112 627 921
3 627 112 121
3 627 121 47
3 47 121 8
3 527 686 292
3 686 527 825
3 825 527 180
3 691 467 314
3 467 691 406
3 907 855 691
3 830 325 518
3 325 830 402
3 830 282 411
3 411 402 830
3 730 282 277
3 325 230 975
3 325 975 518
3 116 975 230
3 127 120 116
3 464 312 127
3 183 605 464
3 897 605 183
3 897 183 236
3 605 897 429
3 897 708 429
3 708 897 706
3 706 897 236
3 797 698 32
3 32 698 971
3 971 536 291
3 536 706 291
3 38 536 971
3 536 38 777
3 536 708 706
3 708 536 777
3 797 383 724
3 797 724 70
3 70 724 921
3 724 438 112
3 724 112 921
3 438 724 383
3 372 121 438
3 788 8 372
3 825 531 686
3 558 72 531
3 558 531 825
3 558 825 137
3 907 314 91
3 314 907 691
3 690 277 364
3 91 364 907
3 402 770 325
3 770 402 389
3 690 730 277
3 411 389 402
3 389 411 489
3 489 411 730
3 770 237 230
3 770 230 325
3 22 116 237
3 578 127 22
3 578 464 127
3 464 578 977
3 977 183 464
3 183 977 737
3 43 183 737
3 43 737 130
3 183 43 236
3 706 236 43
3 706 43 387
3 387 43 130
3 387 130 497
3 278 32 776
3 32 278 797
3 373 700 278
3 776 373 278
3 397 545 156
3 545 387 497
3 545 497 156
3 971 291 397
3 776 32 397
3 397 291 545
3 291 706 387
3 291 387 545
3 278 700 383
3 278 383 797
3 700 526 438
3 700 438 383
3 7 788 372
3 852 170 72
3 72 558 852
3 852 558 803
3 364 91 967
3 967 35 364
3 389 451 770
3 451 389 472
3 389 489 242
3 242 472 389
3 242 489 690
3 451 887 237
3 451 237 770
3 786 22 887
3 22 786 632
3 22 632 578
3 569 737 566
3 737 569 130
3 140 634 569
3 497 130 634
3 497 634 929
3 929 634 931
3 931 634 140
3 658 373 866
3 163 373 658
3 163 658 717
3 717 658 834
3 834 866 723
3 717 834 650
3 650 834 723
3 723 929 931
3 866 776 397
3 866 397 156
3 156 497 929
3 156 929 723
3 719 373 163
3 373 719 700
3 719 526 700
3 539 372 526
3 170 852 83
3 83 762 170
3 83 852 476
3 164 690 35
3 979 743 35
3 35 967 979
3 483 35 743
3 170 762 967
3 398 84 451
3 398 451 472
3 687 595 164
3 242 398 472
3 398 242 328
3 328 242 595
3 84 13 887
3 84 887 451
3 391 887 13
3 756 887 391
3 887 756 786
3 174 963 862
3 357 931 963
3 519 963 174
3 963 519 357
3 839 163 201
3 163 717 659
3 918 201 114
3 114 336 274
3 274 357 519
3 357 274 502
3 659 650 502
3 201 659 336
3 336 659 502
3 502 931 357
3 931 502 723
3 234 719 839
3 163 839 719
3 234 539 526
3 234 526 719
3 6 7 539
3 762 83 49
3 49 674 762
3 344 476 676
3 49 83 476
3 743 979 902
3 826 902 649
3 902 826 743
3 674 600 902
3 649 902 600
3 762 674 979
3 359 122 84
3 359 84 398
3 369 673 122
3 369 122 359
3 123 369 359
3 529 687 483
3 328 359 398
3 359 328 123
3 123 328 687
3 122 375 13
3 122 13 84
3 375 122 673
3 279 391 375
3 279 375 966
3 98 174 725
3 174 98 519
3 958 725 946
3 958 946 175
3 725 958 98
3 579 918 442
3 846 774 579
3 846 579 200
3 200 442 828
3 200 828 403
3 403 958 175
3 958 403 828
3 828 98 958
3 98 828 835
3 442 114 835
3 828 442 835
3 835 519 98
3 519 835 274
3 579 812 827
3 579 827 918
3 812 579 774
3 918 827 234
3 918 234 839
3 827 503 539
3 827 539 234
3 503 827 812
3 49 600 674
3 368 211 600
3 600 49 368
3 368 49 344
3 560 483 826
3 649 128 826
3 128 649 933
3 933 649 211
3 673 369 296
3 296 249 673
3 123 296 369
3 296 123 385
3 385 123 529
3 673 790 375
3 790 673 249
3 884 375 790
3 884 790 748
3 375 884 966
3 175 946 82
3 175 82 669
3 669 82 689
3 669 689 309
3 774 846 943
3 943 846 200
3 705 774 488
3 619 943 405
3 165 405 970
3 488 619 165
3 932 669 309
3 669 932 970
3 943 200 405
3 405 200 403
3 970 175 669
3 175 970 403
3 774 525 812
3 525 774 705
3 812 540 503
3 540 812 525
3 62 503 540
3 5 6 62
3 622 914 211
3 622 211 368
3 622 368 908
3 908 344 14
3 463 933 546
3 933 463 128
3 546 933 914
3 75 249 296
3 75 262 249
3 385 75 296
3 75 385 92
3 92 385 560
3 249 877 790
3 877 249 262
3 423 790 877
3 748 423 660
3 42 660 707
3 660 42 748
3 42 707 899
3 899 707 510
3 606 899 510
3 606 510 454
3 899 606 689
3 309 689 606
3 309 606 132
3 132 606 454
3 132 454 652
3 293 705 769
3 580 880 293
3 623 769 829
3 829 745 302
3 574 132 652
3 132 574 302
3 745 165 932
3 769 488 745
3 302 309 132
3 309 302 932
3 293 880 525
3 525 705 293
3 540 525 880
3 622 343 914
3 343 622 883
3 883 622 584
3 584 908 14
3 935 149 286
3 286 546 265
3 546 286 463
3 914 343 546
3 766 262 75
3 766 789 262
3 766 949 63
3 63 949 307
3 307 949 935
3 92 766 75
3 766 92 949
3 949 560 149
3 262 858 877
3 858 262 789
3 94 423 858
3 340 660 94
3 136 707 340
3 100 510 136
3 528 510 100
3 528 100 479
3 510 528 454
3 652 454 528
3 652 528 68
3 214 528 479
3 528 214 68
3 880 580 93
3 93 923 601
3 93 580 923
3 93 99 880
3 99 93 661
3 661 93 683
3 683 601 533
3 171 533 52
3 214 52 533
3 533 68 214
3 923 623 31
3 31 829 574
3 601 31 68
3 652 68 574
3 99 514 880
3 514 810 540
3 514 540 880
3 161 5 810
3 883 892 343
3 641 343 892
3 892 883 41
3 41 883 711
3 711 584 602
3 265 481 286
3 935 286 481
3 481 265 565
3 343 641 265
3 772 789 766
3 772 522 789
3 772 63 927
3 927 307 935
3 63 772 766
3 789 513 858
3 513 789 522
3 726 94 513
3 16 340 726
3 238 136 16
3 192 100 238
3 346 100 192
3 346 192 591
3 100 346 479
3 752 479 346
3 479 752 214
3 267 346 591
3 346 267 752
3 99 661 424
3 424 661 56
3 635 424 758
3 758 56 57
3 267 677 653
3 653 752 267
3 56 683 171
3 57 171 653
3 752 653 52
3 52 214 752
3 424 401 37
3 424 37 99
3 99 37 514
3 37 954 810
3 37 810 514
3 954 37 401
3 575 810 954
3 641 41 150
3 41 641 892
3 150 41 711
3 247 935 618
3 565 618 481
3 618 565 390
3 641 176 565
3 806 522 772
3 806 816 522
3 418 927 247
3 927 806 772
3 806 927 753
3 522 771 513
3 771 522 816
3 351 726 771
3 11 16 351
3 824 238 11
3 9 192 824
3 767 192 9
3 767 9 802
3 192 767 591
3 235 591 767
3 591 235 267
3 859 767 802
3 767 859 235
3 139 635 313
3 589 139 392
3 630 313 948
3 948 798 275
3 392 630 948
3 275 235 859
3 235 275 925
3 313 758 798
3 798 677 925
3 925 267 235
3 267 925 677
3 139 644 401
3 139 401 635
3 635 401 424
3 954 401 644
3 4 161 575
3 843 150 86
3 150 843 641
3 86 150 445
3 445 153 694
3 390 30 618
3 30 390 904
3 176 843 390
3 904 390 843
3 870 816 806
3 681 46 816
3 681 816 870
3 111 681 870
3 681 111 699
3 699 111 836
3 836 418 233
3 753 870 806
3 870 753 111
3 111 753 418
3 816 663 771
3 663 816 46
3 796 351 663
3 873 11 796
3 468 824 873
3 189 9 468
3 865 9 189
3 865 189 548
3 9 865 802
3 738 802 865
3 802 738 859
3 508 865 548
3 865 508 738
3 747 589 444
3 315 747 254
3 254 252 936
3 508 115 936
3 936 738 508
3 738 936 458
3 252 287 458
3 738 458 287
3 287 859 738
3 859 287 275
3 747 811 644
3 747 644 589
3 589 644 139
3 644 881 954
3 881 644 811
3 541 575 881
3 86 567 843
3 567 86 951
3 951 86 131
3 271 30 395
3 904 395 30
3 18 271 395
3 395 904 654
3 654 904 567
3 843 567 904
3 407 821 46
3 407 46 681
3 699 407 681
3 407 699 443
3 443 699 749
3 749 836 271
3 46 89 663
3 89 46 821
3 953 796 89
3 794 873 953
3 894 468 794
3 853 189 894
3 593 189 853
3 593 853 957
3 189 593 548
3 572 548 593
3 548 572 508
3 133 593 957
3 593 133 572
3 592 315 491
3 592 491 311
3 552 311 141
3 133 141 318
3 318 572 133
3 572 318 253
3 491 254 115
3 253 508 572
3 508 253 115
3 592 664 811
3 592 811 315
3 315 811 747
3 881 811 664
3 951 500 567
3 654 18 395
3 436 271 934
3 567 500 654
3 821 407 590
3 590 108 821
3 108 590 17
3 443 17 590
3 17 443 617
3 617 443 15
3 15 749 436
3 443 590 407
3 821 633 89
3 633 821 108
3 198 953 633
3 29 794 198
3 466 894 29
3 60 853 466
3 523 853 60
3 523 60 804
3 853 523 957
3 524 957 523
3 524 523 731
3 957 524 133
3 731 523 804
3 731 804 850
3 67 960 592
3 67 592 552
3 511 258 222
3 460 440 511
3 470 731 850
3 731 470 222
3 440 552 258
3 258 337 222
3 222 524 731
3 524 222 337
3 337 133 524
3 133 337 141
3 425 28 664
3 425 664 960
3 960 664 592
3 664 624 881
3 624 664 28
3 631 541 624
3 3 4 631
3 951 381 500
3 381 951 655
3 655 951 194
3 934 654 105
3 654 934 18
3 500 381 654
3 17 968 108
3 968 17 795
3 617 795 17
3 795 617 841
3 841 617 370
3 108 190 633
3 190 108 968
3 207 198 190
3 103 29 207
3 550 466 29
3 550 29 103
3 928 60 466
3 928 466 550
3 780 60 928
3 780 928 697
3 60 780 804
3 850 804 780
3 850 780 426
3 426 780 697
3 426 697 868
3 761 425 682
3 682 425 460
3 334 761 583
3 583 682 959
3 959 221 484
3 950 426 868
3 426 950 484
3 221 511 470
3 682 460 221
3 484 850 426
3 850 484 470
3 334 744 28
3 334 28 761
3 761 28 425
3 624 28 744
3 2 3 631
3 655 333 381
3 333 655 571
3 571 861 333
3 571 655 66
3 561 105 144
3 105 561 934
3 15 436 561
3 381 333 105
3 450 882 968
3 450 968 795
3 841 450 795
3 450 841 304
3 304 841 370
3 968 919 190
3 919 968 882
3 849 207 919
3 868 697 269
3 868 269 126
3 186 269 799
3 269 186 126
3 187 334 87
3 87 583 206
3 384 187 87
3 938 206 751
3 773 751 504
3 504 126 186
3 206 583 751
3 751 959 950
3 868 126 950
3 384 874 744
3 384 744 187
3 187 744 334
3 744 48 624
3 48 744 874
3 272 333 861
3 861 571 784
3 784 462 861
3 784 571 210
3 612 144 768
3 144 612 561
3 685 379 612
3 768 280 612
3 333 272 144
3 193 882 450
3 193 226 882
3 193 304 419
3 419 304 651
3 651 379 685
3 304 193 450
3 882 408 919
3 408 882 226
3 159 849 408
3 538 849 159
3 799 297 186
3 332 297 901
3 297 799 639
3 240 384 693
3 482 240 696
3 696 693 703
3 703 679 50
3 50 297 332
3 297 50 679
3 693 938 323
3 297 679 323
3 323 186 297
3 186 323 504
3 482 854 874
3 482 874 240
3 240 874 384
3 874 417 48
3 417 874 854
3 27 48 417
3 1 2 27
3 462 784 85
3 85 326 462
3 199 210 430
3 85 784 210
3 685 612 280
3 280 768 167
3 167 241 280
3 272 462 768
3 117 226 193
3 117 678 226
3 117 419 110
3 110 651 331
3 419 117 193
3 226 557 408
3 557 226 678
3 244 159 557
3 244 557 243
3 952 901 209
3 901 952 332
3 209 33 952
3 33 209 420
3 24 482 521
3 585 554 345
3 554 24 345
3 345 521 217
3 217 532 512
3 512 952 33
3 952 512 308
3 521 696 532
3 532 703 308
3 308 332 952
3 332 308 50
3 554 501 854
3 554 854 24
3 24 854 482
3 417 854 501
3 326 85 648
3 939 818 326
3 939 326 648
3 939 648 449
3 648 85 199
3 331 685 241
3 903 926 241
3 241 167 903
3 926 903 218
3 326 818 903
3 462 326 167
3 106 844 678
3 106 678 117
3 544 106 250
3 110 106 117
3 106 110 250
3 250 110 331
3 844 732 557
3 844 557 678
3 264 557 732
3 640 243 264
3 158 980 640
3 382 212 158
3 376 702 382
3 420 212 702
3 728 33 702
3 608 702 376
3 702 608 728
3 554 585 515
3 515 585 358
3 585 345 358
3 515 838 554
3 59 203 878
3 358 59 113
3 878 728 608
3 728 878 196
3 358 345 203
3 203 217 196
3 196 33 728
3 33 196 512
3 184 501 838
3 554 838 501
3 501 755 417
3 755 501 184
3 978 1 755
3 939 327 818
3 926 218 216
3 216 218 895
3 818 671 218
3 857 886 844
3 857 844 106
3 740 857 544
3 740 544 604
3 544 857 106
3 886 21 732
3 886 732 844
3 596 264 21
3 640 596 88
3 640 88 158
3 158 88 922
3 158 922 382
3 662 382 922
3 662 922 695
3 382 662 376
3 657 376 662
3 376 657 608
3 360 662 695
3 662 360 657
3 191 838 78
3 113 838 515
3 78 113 157
3 113 78 838
3 517 157 598
3 598 964 517
3 517 657 360
3 657 517 964
3 598 878 964
3 878 598 59
3 964 608 657
3 608 964 878
3 942 184 191
3 184 838 191
3 184 942 755
3 71 755 942
3 172 327 939
3 102 671 327
3 172 939 453
3 227 604 493
3 216 895 493
3 493 895 915
3 915 895 102
3 490 143 886
3 490 886 857
3 490 202 143
3 871 490 740
3 871 740 636
3 740 490 857
3 143 179 21
3 143 21 886
3 179 143 202
3 362 596 179
3 101 88 362
3 90 922 101
3 889 922 90
3 889 90 783
3 922 889 695
3 360 695 889
3 889 783 485
3 889 485 360
3 78 350 191
3 157 350 78
3 718 319 350
3 982 718 350
3 157 982 350
3 982 157 684
3 716 517 39
3 716 39 224
3 39 360 485
3 360 39 517
3 684 157 716
3 517 716 157
3 350 319 845
3 350 845 191
3 845 231 942
3 231 845 319
3 496 71 231
3 0 978 496
3 172 102 327
3 973 102 172
3 973 172 727
3 259 493 570
3 915 570 493
3 570 915 225
3 225 915 55
3 20 202 490
3 20 317 202
3 537 636 227
3 871 20 490
3 202 447 179
3 447 202 317
3 195 362 179
3 195 179 447
3 195 101 362
3 607 101 195
3 506 90 101
3 506 101 607
3 90 465 432
3 465 90 506
3 90 432 783
3 779 783 917
3 783 779 485
3 499 917 643
3 917 499 779
3 643 680 499
3 643 432 465
3 432 643 917
3 917 783 432
3 456 319 718
3 456 900 319
3 107 900 456
3 107 456 261
3 456 718 448
3 261 448 295
3 295 885 746
3 879 261 263
3 263 295 785
3 746 499 680
3 680 785 746
3 647 779 499
3 499 746 647
3 448 224 885
3 885 224 647
3 779 647 166
3 39 485 779
3 779 166 39
3 294 900 688
3 231 900 294
3 900 231 319
3 294 496 231
3 496 294 586
3 586 0 496
3 973 55 102
3 480 55 973
3 480 973 955
3 549 227 259
3 225 259 570
3 259 225 474
3 348 317 20
3 348 709 317
3 348 223 473
3 473 223 169
3 169 537 549
3 223 348 20
3 223 20 871
3 223 871 537
3 520 974 709
3 374 778 520
3 778 195 974
3 924 195 778
3 257 498 374
3 498 607 924
3 807 607 498
3 410 498 257
3 410 257 704
3 498 410 807
3 807 506 607
3 626 506 807
3 173 542 704
3 542 807 410
3 281 465 626
3 729 581 173
3 581 626 542
3 626 465 506
3 330 643 256
3 643 330 680
3 615 256 281
3 256 615 330
3 507 281 229
3 281 507 615
3 45 229 729
3 229 45 507
3 229 281 581
3 465 281 256
3 465 256 643
3 437 688 900
3 437 900 107
3 118 688 437
3 118 437 396
3 437 107 879
3 118 913 688
3 69 913 118
3 739 69 118
3 69 739 185
3 118 396 739
3 739 396 125
3 556 945 23
3 509 556 23
3 23 507 45
3 45 620 23
3 145 615 507
3 507 23 145
3 53 879 820
3 820 263 864
3 125 53 863
3 945 863 145
3 863 820 864
3 864 330 615
3 615 145 864
3 785 680 330
3 330 864 785
3 294 688 534
3 586 294 534
3 47 586 613
