OFF

5 6 0
-0.221474 -0.204130 -0.002366
-0.213072 -0.198738 -0.002345
-0.199750 -0.203036 -0.002380
-0.196268 -0.187954 -0.002302
-0.212631 -0.191159 -0.002304
3 4 1 0
3 4 3 1
3 2 0 1
3 3 2 1
3 3 4 2
3 4 0 2
