OFF

44 84 0
0.114956 -0.067730 0.038115
0.288538 -0.052388 0.086988
-0.086566 -0.074964 -0.019873
0.282888 -0.036220 0.097992
0.066581 -0.052973 0.029822
-0.198507 -0.112579 -0.089108
-0.080586 -0.081821 -0.034973
-0.204157 -0.096411 -0.078104
0.202194 -0.062373 0.057327
0.196544 -0.046205 0.068331
0.023194 -0.073005 0.018720
-0.312345 -0.121016 -0.117468
0.245696 -0.048069 0.068061
-0.080256 -0.072509 -0.039070
0.289199 -0.033765 0.078794
0.017544 -0.056838 0.029723
-0.038604 -0.082629 -0.008137
-0.317995 -0.104849 -0.106465
-0.044254 -0.066461 0.002866
-0.197846 -0.093956 -0.097302
0.202855 -0.043750 0.049133
0.023855 -0.054382 0.010526
-0.163693 -0.098023 -0.065860
-0.311684 -0.102394 -0.125662
-0.083742 -0.083048 -0.025375
0.158905 -0.055740 0.043624
0.069405 -0.061056 0.024320
-0.163363 -0.088712 -0.069957
0.063425 -0.054200 0.039420
-0.037943 -0.064006 -0.016331
0.242541 -0.049297 0.077660
-0.263904 -0.115414 -0.100827
-0.123229 -0.099635 -0.053616
-0.314008 -0.109419 -0.116532
0.242871 -0.039985 0.073563
0.109306 -0.051562 0.049118
-0.128879 -0.083467 -0.042613
-0.269553 -0.099246 -0.089824
0.115617 -0.049107 0.029921
0.155750 -0.056968 0.053223
-0.122568 -0.081013 -0.061809
-0.263243 -0.096792 -0.109021
-0.160538 -0.096795 -0.075459
0.156081 -0.047656 0.049125
3 0 26 25
3 26 35 25
3 25 38 0
3 25 43 38
3 35 39 25
3 39 8 25
3 25 20 43
3 26 10 35
3 22 32 42
3 42 5 22
3 18 36 2
3 40 29 13
3 28 15 35
3 14 1 3
3 30 9 3
3 30 8 9
3 30 1 8
3 30 3 1
3 12 8 1
3 12 20 8
3 12 14 20
3 12 1 14
3 34 20 14
3 34 9 20
3 34 3 9
3 34 14 3
3 39 35 9
3 39 9 8
3 25 8 20
3 43 35 38
3 43 9 35
3 43 20 9
3 28 10 15
3 28 35 10
3 26 21 10
3 26 38 21
3 26 0 38
3 4 21 38
3 4 15 21
3 4 35 15
3 4 38 35
3 18 15 16
3 15 10 16
3 16 10 29
3 10 21 29
3 29 21 18
3 21 15 18
3 24 36 18
3 24 32 36
3 24 16 32
3 24 18 16
3 6 32 16
3 6 40 32
3 6 29 40
3 6 16 29
3 13 36 40
3 13 29 36
3 2 29 18
3 2 36 29
3 22 7 36
3 22 5 7
3 22 36 32
3 42 19 5
3 42 40 19
3 42 32 40
3 27 19 40
3 27 7 19
3 27 36 7
3 27 40 36
3 37 7 31
3 7 5 31
3 31 5 41
3 5 19 41
3 41 19 37
3 19 7 37
3 17 37 11
3 37 31 11
3 11 31 23
3 31 41 23
3 23 41 17
3 41 37 17
3 17 11 33
3 11 23 33
3 23 17 33
