OFF

1401 2798 0
0.470720 -0.132824 0.191018
0.020756 0.002303 0.049140
-0.003976 -0.018355 0.035885
-0.003976 0.018356 0.035885
-0.063593 -0.058037 0.011793
0.019663 -0.020515 0.061762
0.019663 0.020517 0.061762
-0.181345 0.292572 -0.349704
-0.018084 0.017605 0.013985
-0.018084 -0.017605 0.013985
-0.493146 0.079955 -0.026365
-0.032174 -0.060507 -0.019369
0.101225 0.011879 0.076389
0.101225 -0.011877 0.076389
0.264545 0.000001 0.216960
-0.063593 0.058039 0.011793
-0.028749 -0.059553 -0.005921
0.370417 0.227386 0.288195
0.091249 0.011879 0.067176
0.091249 -0.011877 0.067176
-0.040090 0.000001 0.020658
-0.032174 0.060507 -0.019369
-0.134917 0.249143 -0.399979
0.470720 0.132824 0.191018
0.234145 0.011505 0.249879
0.234145 -0.011505 0.249879
0.240883 -0.178363 0.428462
-0.022318 0.000001 -0.112974
0.293653 0.033956 0.325565
-0.028749 0.059554 -0.005921
0.008753 0.015118 -0.015075
0.008753 -0.015117 -0.015075
0.040210 -0.045427 0.062389
0.030239 -0.011877 0.096064
0.061760 -0.008680 0.016177
0.103119 -0.023894 0.065758
0.040210 0.045427 0.062389
-0.189002 0.290910 -0.355709
-0.432579 -0.212541 -0.086232
0.061760 0.008682 0.016177
0.103119 0.023895 0.065758
0.024520 -0.026368 0.005029
-0.055378 0.000001 -0.486109
0.271102 -0.025479 0.284213
-0.318495 0.304985 -0.209768
0.030308 -0.018355 -0.001239
0.024520 0.026369 0.005029
0.232269 0.002993 0.251911
0.232269 -0.002992 0.251911
0.271102 0.025480 0.284213
0.059574 -0.016815 0.018545
0.339635 -0.038219 0.275772
0.030308 0.018356 -0.001239
-0.059284 -0.022317 0.027144
0.240883 0.178363 0.428462
0.018837 0.011879 0.085533
0.014986 -0.016622 0.029651
0.190636 0.055284 0.474294
0.059574 0.016816 0.018545
-0.070725 0.000001 0.022377
-0.051633 -0.051188 0.001702
-0.322747 -0.315813 -0.210883
-0.059284 0.022318 0.027144
0.014986 0.016624 0.029651
0.275850 -0.029920 0.279071
-0.051633 0.051189 0.001702
0.275850 0.029921 0.279071
0.493105 -0.057568 0.155341
0.264543 -0.012172 0.291315
0.264543 0.012174 0.291315
0.060841 -0.012849 0.017173
0.060841 0.012850 0.017173
0.007928 0.002303 0.037293
0.478613 -0.111518 0.171034
0.042207 -0.012575 0.025912
0.015140 0.000001 0.066660
0.076854 0.005026 0.102780
0.042207 0.012576 0.025912
-0.061849 -0.007598 0.029922
-0.061849 0.007598 0.029922
0.080625 -0.028258 0.061520
0.066878 0.005026 0.093567
0.082629 0.000001 0.016454
-0.078533 -0.027728 0.027971
0.187085 -0.027861 0.478139
-0.082122 0.000001 0.031857
0.009022 -0.018585 -0.032523
0.009022 0.018587 -0.032523
0.080625 0.028260 0.061520
0.017137 -0.030677 0.013024
-0.206960 -0.307520 -0.321966
0.389520 0.220157 0.267510
0.337905 -0.001803 0.317681
0.337905 0.001805 0.317681
-0.032996 -0.026409 0.012976
0.337608 -0.001661 0.318002
0.337608 0.001662 0.318002
0.017137 0.030679 0.013024
0.317962 -0.221971 0.356433
0.011948 -0.003222 -0.018535
0.011948 0.003224 -0.018535
0.478613 0.111519 0.171034
-0.322747 0.315814 -0.210883
-0.116124 -0.026375 -0.011395
0.297424 -0.027919 0.255710
0.054462 -0.018355 0.089851
0.054462 0.018356 0.089851
-0.044882 -0.060496 -0.088540
-0.116124 0.026376 -0.011395
0.297424 0.027921 0.255710
0.300153 -0.041882 0.318527
-0.069432 0.015078 0.020977
0.003986 0.021717 -0.009914
0.003986 -0.021715 -0.009914
-0.044882 0.060497 -0.088540
0.300153 0.041882 0.318527
0.013189 -0.012738 0.003000
0.013189 0.012740 0.003000
0.009506 -0.015724 0.006989
0.020657 0.000001 0.049248
0.006451 -0.029206 -0.061195
0.098873 0.015572 0.078937
0.098873 -0.015570 0.078937
0.078620 -0.023010 0.020795
0.078620 0.023012 0.020795
0.009506 0.015725 0.006989
0.088896 0.015572 0.069724
0.088896 -0.015570 0.069724
-0.498278 0.040295 -0.020807
0.006451 0.029208 -0.061195
0.317962 0.221971 0.356433
0.008651 0.022318 -0.063576
0.008650 -0.022317 -0.063576
0.213934 0.136064 0.457644
-0.125470 -0.212540 -0.418787
0.100127 0.013834 0.077578
0.100127 -0.013833 0.077578
0.468045 -0.136063 0.182477
-0.206960 0.307519 -0.321966
0.090151 0.013834 0.068365
0.090151 -0.013833 0.068365
-0.074997 -0.077212 -0.473442
0.082957 -0.026368 0.058995
-0.015227 -0.071637 -0.040581
0.005335 -0.016500 0.011504
-0.006459 0.025669 0.001396
-0.006459 -0.025668 0.001396
0.088745 -0.018355 0.052727
0.082957 0.026369 0.058995
0.183939 0.000001 0.490125
0.047829 -0.043218 0.077016
0.005335 0.016502 0.011504
0.088745 0.018356 0.052727
-0.067876 -0.071508 -0.063641
0.267251 0.019437 0.288382
0.267251 -0.019436 0.288382
0.047829 0.043220 0.077016
0.292334 -0.031450 0.261221
0.486341 -0.027861 0.154086
0.337754 0.001746 0.317844
0.337754 -0.001746 0.317844
-0.074997 0.077213 -0.473442
-0.015227 0.071639 -0.040581
0.029379 -0.012575 0.014065
0.292334 0.031451 0.261221
0.486341 0.027862 0.154086
0.019766 -0.007598 -0.058456
0.019766 0.007598 -0.058456
0.468045 0.136065 0.182477
-0.004825 0.004112 0.022507
-0.004825 -0.004111 0.022507
0.029379 0.012576 0.014065
0.021532 0.006764 0.048299
0.021532 -0.006762 0.048299
0.078119 -0.009735 0.101410
-0.125470 0.212542 -0.418787
-0.018460 -0.060507 -0.017063
-0.060882 -0.015076 0.028874
0.078119 0.009737 0.101410
0.021827 -0.023010 0.082295
0.021827 0.023012 0.082295
-0.452224 -0.190057 -0.056380
0.068142 -0.009735 0.092197
0.068142 0.009737 0.092197
0.204148 0.083187 0.479679
-0.018460 0.060507 -0.017063
0.026133 -0.029471 0.054757
-0.142837 -0.247725 -0.405699
0.035456 0.018046 0.033222
0.035456 -0.018045 0.033222
-0.018818 -0.037896 -0.002376
0.026133 0.029473 0.054757
-0.091625 -0.064829 -0.037924
-0.018818 0.037897 -0.002376
-0.027939 -0.032574 0.007501
0.262541 0.011505 0.219130
0.262541 -0.011505 0.219130
-0.079792 0.004835 -0.016421
-0.079792 -0.004834 -0.016421
0.026443 -0.015511 0.042982
0.026443 0.015512 0.042982
-0.027939 0.032575 0.007501
0.029220 0.000001 0.097167
-0.091625 0.064831 -0.037924
0.203367 0.111519 0.469087
0.075574 -0.030677 0.066989
-0.034227 -0.075174 -0.020007
-0.016486 -0.019816 0.012255
0.075574 0.030679 0.066989
0.283994 -0.033003 0.270253
0.012053 0.004835 -0.035805
0.012053 -0.004834 -0.035805
-0.090731 -0.154887 -0.462123
-0.016486 0.019818 0.012255
0.007829 0.000001 0.037401
0.029476 -0.005986 0.096890
0.283994 0.033004 0.270253
0.032338 -0.018335 0.036598
-0.034227 0.075175 -0.020007
0.090294 -0.034287 0.079646
0.059592 -0.047671 0.064278
-0.349278 0.305772 -0.182153
0.240579 -0.171285 0.420212
0.188875 0.057569 0.484780
0.032338 0.018336 0.036598
0.226507 0.158463 0.444030
0.008942 -0.041502 -0.046736
-0.005401 -0.015045 0.037429
0.090294 0.034288 0.079646
0.059592 0.047671 0.064278
-0.494121 0.000001 -0.011012
-0.142837 0.247727 -0.405699
0.018074 0.005986 0.086359
0.026601 -0.032696 0.077125
-0.013335 -0.059553 -0.022613
0.084370 -0.034837 0.086061
-0.005401 0.015046 0.037429
0.015115 0.009719 0.000915
0.015115 -0.009717 0.000915
0.026601 0.032698 0.077125
0.084370 0.034838 0.086061
-0.214471 0.305774 -0.328130
-0.030599 -0.029726 0.010381
-0.090731 0.154888 -0.462123
-0.013335 0.059554 -0.022613
-0.157204 -0.273010 -0.375845
-0.030599 0.029727 0.010381
-0.414581 -0.249142 -0.097142
0.040971 -0.036803 0.084443
0.056085 0.023895 0.022323
0.056085 -0.023894 0.022323
0.092171 -0.009735 0.066178
0.102147 -0.009735 0.075391
0.102147 0.009737 0.075391
0.240579 0.171285 0.420213
0.008704 0.006764 0.036453
0.008704 -0.006762 0.036453
0.044263 -0.040329 0.080878
0.092171 0.009737 0.066178
0.005177 -0.046714 -0.042658
0.040971 0.036804 0.084443
0.044263 0.040331 0.080878
-0.487226 0.080413 -0.018477
0.062362 0.004375 0.109893
0.062362 -0.004373 0.109893
0.075774 -0.031584 0.095370
0.075774 0.031585 0.095370
0.281199 -0.032482 0.273280
0.007261 0.022677 -0.030616
0.007261 -0.022675 -0.030616
0.022628 0.018046 0.021375
0.022628 -0.018045 0.021375
-0.038251 -0.014201 0.018667
-0.038251 0.014203 0.018667
0.296733 -0.038219 0.322230
0.009196 -0.030677 0.021622
0.281199 0.032484 0.273280
0.080139 0.013834 0.099223
0.080139 -0.013833 0.099223
0.245307 -0.023459 0.237792
0.009196 0.030679 0.021622
0.070162 0.013834 0.090010
0.070162 -0.013833 0.090010
-0.449441 -0.182498 -0.067972
0.245307 0.023459 0.237792
-0.079068 -0.118353 -0.474753
-0.233643 -0.317617 -0.293073
0.337345 -0.001414 0.318287
0.337345 0.001416 0.318287
0.013615 -0.015511 0.031136
0.013615 0.015512 0.031136
0.041065 -0.014154 0.027148
-0.062868 -0.035635 0.013868
0.089273 -0.020169 0.089332
0.089273 0.020169 0.089332
0.041065 0.014156 0.027148
-0.483051 0.077213 -0.031577
0.079297 -0.020169 0.080119
-0.062868 0.035636 0.013868
-0.079068 0.118355 -0.474753
0.019510 -0.018335 0.024752
0.079297 0.020169 0.080119
0.019510 0.018336 0.024752
0.031496 -0.017583 0.094702
-0.478714 0.119032 -0.027695
0.010860 -0.009466 -0.017357
0.226773 0.152175 0.435162
0.487010 -0.085214 0.161941
0.023038 0.010798 0.046669
0.023038 -0.010798 0.046669
0.006234 -0.051562 -0.063820
0.010860 0.009468 -0.017357
-0.189002 -0.290909 -0.355710
0.080354 0.017584 0.018918
0.080354 -0.017583 0.018918
0.286895 -0.018259 0.332883
-0.070783 0.119032 -0.469427
-0.008022 0.000001 0.040267
0.286895 0.018261 0.332883
-0.085949 -0.068142 -0.044070
-0.076761 -0.018585 -0.019704
0.487010 0.085216 0.161941
0.006234 0.051563 -0.063820
-0.076761 0.018587 -0.019704
0.194589 -0.028321 0.490030
-0.344117 -0.295289 -0.182023
-0.083171 0.114298 -0.464591
-0.233643 0.317619 -0.293073
0.020094 0.017584 0.084171
-0.085949 0.068144 -0.044070
0.053036 -0.015045 0.091395
0.349474 -0.018259 0.265119
0.234932 -0.154690 0.446344
0.001813 -0.026368 0.029617
-0.047260 0.046714 0.014123
0.053036 0.015046 0.091395
0.349474 0.018261 0.265119
0.051613 -0.045427 0.072919
0.001813 0.026369 0.029617
0.003938 -0.016240 0.013018
-0.005089 0.002072 0.022792
-0.005089 -0.002071 0.022792
0.432848 -0.171285 0.212012
0.003938 0.016241 0.013018
0.051613 0.045427 0.072919
-0.051025 -0.041502 0.018201
-0.474877 0.114297 -0.040428
0.016904 0.004112 -0.001023
0.016904 -0.004111 -0.001023
0.278470 0.031451 0.276235
0.278470 -0.031450 0.276235
0.458727 -0.130664 0.183989
0.030239 0.011879 0.096063
-0.042680 -0.034907 -0.056609
0.028237 -0.014154 0.015301
0.303553 0.019437 0.249073
0.303553 -0.019436 0.249073
0.006744 0.016502 0.009979
0.006744 -0.016500 0.009979
-0.101913 -0.055206 -0.026784
-0.042680 0.034908 -0.056609
0.085896 -0.019219 0.092988
0.028237 0.014156 0.015301
0.070879 -0.036802 0.029178
0.255901 -0.187694 0.403621
0.432848 0.171286 0.212012
-0.344117 0.295289 -0.182023
0.094370 -0.019219 0.083812
0.094370 0.019220 0.083812
0.085896 0.019220 0.092988
0.070879 0.036804 0.029178
-0.374747 -0.290910 -0.154573
-0.101913 0.055207 -0.026783
-0.025059 -0.034907 0.004382
0.084394 -0.019219 0.074599
0.084394 0.019220 0.074599
0.075920 -0.019219 0.083775
0.075920 0.019220 0.083775
-0.118010 -0.017817 -0.009352
-0.118010 0.017819 -0.009352
0.458727 0.130666 0.183989
0.067633 -0.030677 0.075588
0.004145 -0.028258 0.027091
0.407857 -0.209454 0.247652
-0.025059 0.034908 0.004382
0.067633 0.030679 0.075588
0.004145 0.028260 0.027091
0.389520 -0.220155 0.267509
0.002574 -0.015724 0.014495
0.093174 -0.033197 0.076527
0.010210 0.010798 0.034823
0.010210 -0.010798 0.034823
0.002574 0.015725 0.014495
0.338932 -0.001414 0.316568
0.093175 0.033198 0.076527
0.044043 -0.008850 0.023924
0.045487 0.002303 0.022360
0.045487 -0.002302 0.022360
-0.027650 0.000001 -0.072884
0.375417 -0.221971 0.294218
-0.432578 0.212541 -0.086232
-0.023623 -0.060507 -0.011472
0.455473 -0.158463 0.196091
0.011836 -0.031170 0.018764
0.338932 0.001416 0.316568
0.044043 0.008851 0.023924
0.094032 0.000001 0.026985
0.073847 -0.032696 0.025965
0.236532 -0.016347 0.247295
0.011836 0.031170 0.018764
-0.004390 0.006086 0.022035
-0.004390 -0.006086 0.022035
0.073847 0.032698 0.025965
0.236532 0.016349 0.247295
-0.023623 0.060507 -0.011472
0.407857 0.209456 0.247652
-0.110253 -0.042114 -0.017752
0.043260 -0.034287 0.036211
-0.002137 -0.011317 0.019596
-0.110253 0.042115 -0.017752
0.070762 -0.026894 0.100797
0.043260 0.034288 0.036211
-0.078532 0.027729 0.027970
0.014216 -0.011317 0.001887
0.014216 0.011319 0.001887
0.425140 -0.195449 0.228938
-0.002137 0.011319 0.019596
0.050415 0.000001 0.094233
0.070762 0.026896 0.100797
0.019682 -0.009439 -0.078382
-0.032995 0.026411 0.012975
0.190634 -0.055283 0.474296
0.037336 -0.034837 0.042626
0.019682 0.009441 -0.078382
0.016469 -0.006086 -0.000552
-0.080516 -0.018731 0.030118
0.375417 0.221971 0.294218
0.037336 0.034838 0.042626
-0.039943 -0.055206 -0.093888
0.016469 0.006086 -0.000552
-0.043081 -0.051188 0.009599
0.090023 -0.023010 0.031326
0.060250 -0.026368 0.083583
-0.039943 0.055207 -0.093888
-0.062174 0.000001 0.030273
-0.342537 -0.307521 -0.175155
-0.488009 -0.038913 -0.026208
0.090023 0.023012 0.031326
0.011436 -0.009593 -0.035138
0.060250 0.026369 0.083583
0.021049 0.004569 0.048823
0.021049 -0.004567 0.048823
-0.043081 0.051189 0.009599
0.011436 0.009595 -0.035138
0.090993 -0.020169 0.087469
-0.057108 -0.040525 -0.484236
-0.022676 -0.003222 0.018957
0.347674 -0.023895 0.267067
-0.097274 -0.190057 -0.440741
0.081017 -0.020169 0.078256
0.425140 0.195451 0.228938
0.090993 0.020169 0.087469
-0.057108 0.040527 -0.484236
0.347674 0.023897 0.267067
0.011539 0.000001 -0.066704
0.081017 0.020169 0.078256
0.064021 -0.043218 0.036604
-0.029488 -0.014201 -0.070894
0.019713 -0.029702 0.010234
0.015328 0.004375 0.066457
0.015328 -0.004373 0.066457
-0.074999 -0.022675 -0.021611
0.064021 0.043220 0.036604
0.028739 -0.031584 0.051934
-0.029488 0.014203 -0.070894
0.336892 0.000001 0.318778
0.019713 0.029703 0.010234
-0.012272 -0.038503 -0.009465
-0.074999 0.022677 -0.021611
0.028739 0.031585 0.051934
0.109538 0.000001 0.058808
0.257025 -0.020164 0.225104
0.257025 0.020165 0.225104
-0.012272 0.038505 -0.009465
0.031215 -0.008850 0.012077
0.032659 0.002303 0.010514
0.032659 -0.002302 0.010514
-0.097274 0.190059 -0.440741
0.031215 0.008851 0.012077
-0.239554 -0.304985 -0.295250
0.249360 -0.023834 0.233403
-0.055907 -0.068142 -0.076602
0.033230 -0.023010 0.092825
-0.342537 0.307519 -0.175155
0.062583 -0.028258 0.081057
0.062583 0.028260 0.081057
0.249360 0.023836 0.233403
0.033230 0.023012 0.092825
-0.489671 0.000001 -0.024409
-0.037140 -0.029725 -0.062608
-0.022701 0.008981 -0.112559
-0.022701 -0.008978 -0.112559
0.008142 0.016241 0.008466
0.008142 -0.016240 0.008466
0.264418 0.002993 0.217098
0.264418 -0.002992 0.217098
0.185895 0.000001 0.479427
-0.055907 0.068144 -0.076602
-0.070041 -0.038913 -0.478809
0.017168 -0.002071 -0.001309
0.017168 0.002073 -0.001309
-0.440880 0.220088 -0.082961
-0.037140 0.029727 -0.062608
0.095970 -0.018285 0.082079
-0.003637 -0.063597 -0.053131
-0.061913 -0.036691 -0.035783
-0.060881 0.015078 0.028873
-0.070041 0.038915 -0.478809
0.085994 -0.018285 0.072867
0.070273 -0.031170 0.072730
0.095970 0.018286 0.082079
-0.061913 0.036693 -0.035783
-0.048122 0.000001 -0.039276
0.337470 -0.001550 0.318151
0.337470 0.001551 0.318151
0.085994 0.018286 0.072867
0.070273 0.031170 0.072730
-0.003637 0.063598 -0.053131
-0.000340 -0.024063 0.031948
0.338523 0.001746 0.317012
0.338523 -0.001746 0.317012
-0.214471 -0.305773 -0.328131
-0.000340 0.024065 0.031948
-0.458341 -0.188977 -0.064053
0.015003 -0.029206 -0.053298
0.017202 -0.022317 -0.055679
-0.019481 -0.015117 0.015497
-0.466984 0.155773 -0.040397
0.008221 -0.004567 0.036976
0.015003 0.029208 -0.053298
0.336216 -0.041882 0.279475
0.017202 0.022318 -0.055679
-0.019481 0.015118 0.015497
0.008221 0.004569 0.036976
-0.007356 -0.007765 0.039546
0.498039 0.000001 0.149999
0.336216 0.041882 0.279475
-0.083171 -0.114296 -0.464591
-0.144754 -0.239232 -0.397905
-0.045736 -0.036691 -0.053300
-0.239554 0.304986 -0.295250
-0.007356 0.007767 0.039546
0.029477 0.005986 0.096889
0.038004 -0.032696 0.087655
-0.045736 0.036693 -0.053300
-0.039799 -0.032574 -0.059728
-0.048921 -0.037896 -0.049851
0.198196 -0.056196 0.486124
-0.420912 0.247727 -0.104584
0.038004 0.032698 0.087655
0.336902 0.000230 0.318767
0.336902 -0.000230 0.318767
0.007356 -0.017605 -0.013563
-0.039799 0.032575 -0.059728
-0.048921 0.037898 -0.049851
-0.005178 0.000001 0.022889
0.007356 0.017605 -0.013563
-0.122869 -0.220088 -0.427323
0.000390 0.041503 -0.054631
-0.047106 -0.054856 -0.003200
0.204146 -0.083185 0.479681
-0.063751 0.000001 -0.491339
-0.047105 0.054858 -0.003200
0.337063 -0.225527 0.335750
0.033903 0.018336 0.034904
0.033903 -0.018335 0.034904
-0.028330 -0.034516 -0.106463
-0.113525 -0.034516 -0.014210
-0.021587 -0.009466 0.017779
-0.144754 0.239233 -0.397905
0.078150 -0.029702 0.064200
0.203365 -0.111519 0.469089
-0.028330 0.034517 -0.106463
-0.113525 0.034517 -0.014210
0.289606 -0.032482 0.264175
-0.021587 0.009468 0.017779
-0.016882 -0.057659 -0.035928
0.078150 0.029703 0.064200
0.292458 -0.220156 0.372614
0.338372 -0.001803 0.317175
0.338372 0.001805 0.317175
0.338669 -0.001661 0.316854
0.338669 0.001662 0.316854
0.400928 -0.201142 0.246577
0.289606 0.032484 0.264175
-0.484681 0.118355 -0.035530
-0.042303 -0.057659 -0.008401
0.226505 -0.158463 0.444032
0.039799 -0.015511 0.028519
0.264037 0.005939 0.217511
0.264037 -0.005939 0.217511
0.100952 -0.026894 0.068105
-0.016882 0.057660 -0.035928
-0.368152 -0.292572 -0.147418
-0.122869 0.220088 -0.427323
0.039799 0.015512 0.028519
0.100952 0.026896 0.068105
-0.315854 -0.317617 -0.204049
-0.042303 0.057660 -0.008401
-0.075800 -0.036287 0.025012
0.046140 -0.033197 0.033092
0.446655 -0.152175 0.197061
-0.012080 -0.054856 -0.041128
0.296733 0.038220 0.322229
0.060238 -0.045427 0.040701
0.002064 -0.023271 -0.007833
0.002064 0.023273 -0.007833
0.337064 0.225526 0.335750
0.046140 0.033198 0.033092
0.060238 0.045427 0.040701
0.290958 -0.029156 0.328483
0.081394 0.015572 0.097864
0.081394 -0.015570 0.097864
-0.108609 -0.182498 -0.437045
-0.414581 0.249143 -0.097142
-0.012079 0.054858 -0.041128
0.307132 0.008224 0.245197
0.307132 -0.008223 0.245197
0.400928 0.201144 0.246577
0.290958 0.029157 0.328483
-0.003035 0.009719 0.020568
-0.003035 -0.009717 0.020568
0.078539 -0.033197 0.092375
0.071417 0.015572 0.088651
0.071417 -0.015570 0.088651
0.091757 -0.017583 0.029449
-0.189336 0.280935 -0.349629
0.058098 -0.024063 0.085914
0.078539 0.033198 0.092375
0.351837 0.000001 0.262559
0.091757 0.017584 0.029449
-0.082513 -0.155772 -0.456726
-0.059575 0.041502 0.010303
0.023727 -0.026894 0.057362
-0.241002 -0.315813 -0.299401
-0.368713 -0.280935 -0.155389
0.446655 0.152175 0.197061
-0.487228 -0.080412 -0.018475
0.058098 0.024065 0.085914
-0.068379 0.000001 -0.480609
0.342716 0.033956 0.272436
0.023727 0.026896 0.057362
0.243337 -0.022713 0.239926
0.286811 -0.033003 0.267202
0.028612 0.021380 0.000598
0.031497 0.017584 0.094702
-0.134916 -0.249142 -0.399980
-0.119154 -0.008979 -0.008114
-0.108609 0.182499 -0.437045
0.243337 0.022714 0.239926
-0.392293 -0.273010 -0.121277
0.286811 0.033004 0.267202
-0.094435 -0.149576 -0.452394
0.013764 -0.036287 -0.071974
-0.315854 0.317619 -0.204049
-0.119154 0.008980 -0.008114
0.051081 -0.007765 0.093512
0.051081 0.007767 0.093512
0.013764 0.036289 -0.071974
0.021075 0.018336 0.023057
0.021075 -0.018335 0.023057
0.303855 -0.044883 0.314517
0.068594 -0.023894 0.103145
-0.079999 0.000001 -0.016198
-0.082513 0.155773 -0.456725
0.468875 -0.107093 0.172999
0.045585 0.000001 0.022254
0.068594 0.023895 0.103145
-0.073980 0.071508 -0.057031
0.311561 -0.227386 0.351928
0.093436 -0.005025 0.064808
0.093436 0.005026 0.064808
-0.010756 0.024461 0.006050
-0.010756 -0.024460 0.006050
0.303855 0.044883 0.314517
0.103412 -0.005025 0.074021
0.103412 0.005026 0.074021
0.056296 -0.046919 0.044970
-0.094435 0.149577 -0.452394
0.026971 -0.015511 0.016673
0.076440 -0.028075 0.023156
0.056296 0.046920 0.044970
-0.483053 -0.077212 -0.031575
0.045193 0.004569 0.022678
0.045193 -0.004567 0.022678
0.026971 0.015512 0.016673
-0.015558 -0.038503 -0.005906
0.468875 0.107095 0.172999
0.076440 0.028076 0.023156
-0.241002 0.315814 -0.299401
-0.413295 -0.239232 -0.107112
0.005759 -0.019816 -0.011833
-0.054317 -0.035635 0.021765
0.262967 0.000001 0.293022
-0.015558 0.038505 -0.005906
0.281414 -0.204466 0.396010
-0.392293 0.273010 -0.121277
0.234932 0.154690 0.446343
0.194968 -0.085216 0.478181
0.082282 -0.036802 0.039708
0.005759 0.019818 -0.011833
-0.500000 0.000001 -0.018942
-0.054317 0.035636 0.021765
0.103735 -0.002532 0.073671
0.103735 0.002533 0.073671
0.017256 0.000001 -0.001404
0.062504 0.000001 0.015372
0.082282 0.036804 0.039708
0.500000 0.000001 0.159312
0.093759 -0.002532 0.064458
0.093759 0.002533 0.064458
0.067588 -0.040329 0.032742
-0.096974 -0.060496 -0.032132
0.103843 0.000001 0.073555
-0.039267 0.009595 0.019766
-0.039267 -0.009593 0.019766
0.067588 0.040331 0.032742
0.093866 0.000001 0.064342
0.428837 -0.190795 0.236372
0.098546 -0.029471 0.070711
0.241445 -0.021609 0.241974
0.241445 0.021609 0.241974
-0.096974 0.060497 -0.032132
0.098546 0.029473 0.070711
0.281414 0.204467 0.396010
-0.493147 -0.079955 -0.026363
-0.434664 -0.221345 -0.075395
-0.065637 -0.029206 0.016867
0.022199 -0.008850 0.047578
0.022199 0.008851 0.047578
-0.295571 -0.320874 -0.240310
-0.070783 -0.119031 -0.469428
0.085249 -0.032696 0.036495
0.009926 0.012391 -0.016346
0.009926 -0.012389 -0.016346
0.020755 -0.002302 0.049141
-0.065637 0.029208 0.016867
0.005165 -0.026409 -0.028347
0.085249 0.032698 0.036495
-0.001110 -0.012738 0.018484
-0.001110 0.012740 0.018484
-0.474879 -0.114296 -0.040426
0.052259 -0.047671 0.049341
-0.031602 -0.042113 -0.102921
-0.030888 -0.018585 -0.069378
-0.030888 0.018587 -0.069378
0.005165 0.026411 -0.028347
0.394065 -0.214914 0.274025
-0.004269 -0.025668 -0.000975
0.079041 0.011879 0.100411
0.079041 -0.011877 0.100411
0.010246 -0.015076 -0.065304
0.010246 0.015078 -0.065304
-0.072905 -0.026409 -0.023880
-0.031602 0.042115 -0.102921
0.428837 0.190796 0.236372
0.069065 0.011879 0.091198
0.069065 -0.011877 0.091198
-0.004269 0.025669 -0.000975
0.082374 -0.005986 0.016730
0.052259 0.047671 0.049342
-0.268179 0.320874 -0.269972
-0.058400 -0.063597 0.006169
0.032757 0.000001 0.010408
0.273381 -0.027919 0.281745
0.350780 -0.012335 0.263704
0.350780 0.012336 0.263704
0.082374 0.005986 0.016730
0.087049 0.021380 0.054563
-0.058400 0.063598 0.006169
0.273381 0.027921 0.281745
-0.374747 0.290910 -0.154574
0.032365 0.004569 0.010832
0.032365 -0.004567 0.010832
-0.463612 0.149577 -0.052626
0.095940 -0.031584 0.073533
0.187086 0.027862 0.478138
0.095940 0.031585 0.073533
0.109352 0.004375 0.059010
0.109352 -0.004373 0.059010
-0.080516 0.018733 0.030118
-0.014713 -0.021715 0.010335
0.076423 0.000001 0.103247
-0.023845 -0.017817 -0.111320
0.001264 0.014961 0.015914
0.001263 -0.014959 0.015914
0.338216 -0.001831 0.317344
0.338216 0.001833 0.317344
0.394065 0.214913 0.274025
0.066446 0.000001 0.094034
-0.014713 0.021717 0.010335
-0.023845 0.017819 -0.111320
0.308453 -0.218362 0.346714
0.476940 -0.081833 0.164267
0.075424 -0.043218 0.047134
0.306262 -0.012172 0.246139
0.311879 -0.048725 0.305829
0.233279 -0.008790 0.250817
0.075424 0.043220 0.047134
-0.473017 0.154888 -0.048161
0.306262 0.012174 0.246139
-0.022675 0.003224 0.018956
-0.002279 -0.021378 0.034049
0.337230 0.001257 0.318411
0.337230 -0.001256 0.318411
0.233279 0.008792 0.250817
0.294954 -0.029920 0.258384
0.087344 -0.034837 0.082841
-0.007553 -0.051188 -0.046030
0.265742 -0.015930 0.290017
0.476940 0.081835 0.164267
0.311879 0.048726 0.305829
0.261452 -0.014036 0.220310
0.294954 0.029921 0.258384
0.087344 0.034838 0.082841
0.009371 -0.008850 0.035731
0.009371 0.008851 0.035731
-0.007553 0.051189 -0.046030
0.265742 0.015932 0.290017
-0.119538 0.000001 -0.007698
0.261452 0.014038 0.220310
0.007927 -0.002302 0.037295
0.081420 -0.034287 0.089256
0.053918 0.026896 0.024670
0.053918 -0.026894 0.024670
-0.492389 0.040526 -0.012887
0.081420 0.034288 0.089256
0.299703 -0.025479 0.253242
0.258672 -0.018401 0.223321
0.258672 0.018402 0.223321
0.043204 0.010798 0.024832
0.043204 -0.010798 0.024832
0.299703 0.025480 0.253242
0.308453 0.218362 0.346714
0.487530 0.000001 0.152799
0.018480 -0.018731 -0.077080
0.018480 0.018733 -0.077080
-0.081719 -0.009439 0.031421
0.038427 -0.016622 0.030005
0.038427 0.016624 0.030005
0.031505 -0.033197 0.048940
-0.070603 -0.079955 -0.483919
-0.081719 0.009441 0.031421
-0.058727 -0.037896 -0.039232
0.031505 0.033198 0.048940
-0.058727 0.037897 -0.039232
0.025177 -0.014154 0.044353
0.025177 0.014156 0.044353
-0.067849 -0.032574 -0.029355
-0.067849 0.032575 -0.029355
0.284796 -0.006216 0.335155
0.284796 0.006218 0.335155
0.020085 0.000001 -0.078818
-0.070603 0.079957 -0.483919
0.213933 -0.136063 0.457645
0.320296 -0.049505 0.296714
-0.027856 0.004835 -0.072661
-0.027856 -0.004834 -0.072661
0.320296 0.049506 0.296714
0.222660 -0.132824 0.459632
0.481036 -0.108863 0.179848
0.065105 -0.016815 0.106923
-0.498279 -0.040293 -0.020805
0.196487 -0.081833 0.467958
-0.035493 -0.049046 -0.098707
0.032867 0.011497 -0.004010
0.032867 -0.011496 -0.004010
0.316072 -0.049505 0.301288
0.065105 0.016816 0.106923
-0.265798 -0.309873 -0.266831
0.020090 0.000001 -0.058807
0.062919 -0.008680 0.109290
0.062919 0.008682 0.109290
-0.007855 -0.003913 0.040086
0.316072 0.049506 0.301288
-0.035493 0.049048 -0.098707
0.021559 0.023895 0.059709
0.021559 -0.023894 0.059709
-0.452222 0.190057 -0.056382
0.481036 0.108863 0.179848
-0.007855 0.003914 0.040086
-0.022813 0.000001 0.019106
0.185179 0.029013 0.488782
0.082787 0.017063 0.096355
0.082787 -0.017061 0.096355
-0.070508 0.029727 -0.026475
-0.070508 -0.029726 -0.026475
0.072811 0.017063 0.087142
0.072811 -0.017061 0.087142
-0.458341 0.188978 -0.064053
0.339345 0.000457 0.316121
0.339345 -0.000456 0.316121
0.256839 -0.195450 0.411184
0.255241 -0.021609 0.227035
0.003683 -0.035635 -0.058197
0.034188 -0.003913 -0.005440
0.034188 0.003914 -0.005440
0.105015 -0.020515 0.063705
0.030376 0.010798 0.012986
0.030376 -0.010798 0.012986
0.033689 -0.007765 -0.004900
0.033689 0.007767 -0.004900
0.255241 0.021609 0.227035
0.003683 0.035636 -0.058197
-0.006534 -0.011496 0.038656
-0.065470 -0.040293 -0.489477
0.105015 0.020517 0.063705
0.056158 -0.021378 0.088014
-0.008633 -0.025263 0.003751
-0.006534 0.011497 0.038656
0.025599 -0.016622 0.018158
0.025599 0.016624 0.018158
-0.065470 0.040295 -0.489477
-0.032649 -0.022675 -0.067472
-0.008633 0.025264 0.003751
-0.032649 0.022677 -0.067471
0.327244 -0.221861 0.326366
-0.265798 0.309872 -0.266831
0.307785 -0.047175 0.310261
-0.078160 -0.014201 -0.018189
-0.078160 0.014203 -0.018189
0.000030 -0.013959 0.017250
0.417525 -0.187693 0.228605
-0.166155 -0.262151 -0.374731
0.012349 -0.014154 0.032507
0.012349 0.014156 0.032507
0.256839 0.195451 0.411184
0.000030 0.013960 0.017250
0.071641 -0.045427 0.051231
0.001556 -0.058037 -0.058754
0.337131 0.001080 0.318519
0.337131 -0.001078 0.318519
0.307660 -0.004144 0.244626
0.307660 0.004145 0.244626
0.081612 -0.011877 0.017556
0.051511 -0.029471 0.027275
0.307785 0.047176 0.310261
-0.003375 0.046714 -0.050554
0.274121 -0.209455 0.392470
0.001556 0.058039 -0.058754
0.087503 -0.017061 0.071233
0.081612 0.011879 0.017556
0.051511 0.029473 0.027275
0.097479 0.017063 0.080446
0.097479 -0.017061 0.080446
0.071641 0.045427 0.051231
0.087503 0.017063 0.071233
0.188873 -0.057568 0.484781
0.092702 0.019851 0.085619
0.092702 -0.019851 0.085619
-0.114835 0.221346 -0.421725
-0.068271 -0.051562 0.016858
0.339383 0.000001 0.316080
0.030786 0.018046 0.038279
0.030786 -0.018045 0.038279
0.417525 0.187694 0.228605
-0.003790 0.007965 0.021386
-0.003790 -0.007964 0.021386
0.082726 0.019851 0.076406
0.082726 -0.019851 0.076406
0.327244 0.221861 0.326366
-0.075800 0.036288 0.025011
0.011537 -0.006394 -0.018090
0.011537 0.006396 -0.018090
-0.039883 0.004835 0.020434
-0.039883 -0.004834 0.020434
-0.050231 -0.064830 -0.082748
-0.068271 0.051563 0.016858
0.292459 0.220156 0.372613
0.008941 0.041503 -0.046734
0.006619 -0.029702 0.024412
-0.038554 -0.054856 0.004697
0.044710 0.006764 0.023202
0.044710 -0.006762 0.023202
-0.050231 0.064831 -0.082748
-0.166155 0.262151 -0.374731
0.253350 -0.022712 0.229083
0.342717 -0.033955 0.272436
-0.391893 -0.262151 -0.130288
0.006619 0.029703 0.024412
0.015869 -0.007964 0.000098
0.274121 0.209456 0.392470
0.253350 0.022714 0.229083
0.048905 -0.031584 0.030097
0.338060 -0.001831 0.317513
0.338060 0.001833 0.317513
0.248967 -0.174115 0.431146
0.383318 -0.211420 0.265646
0.062317 -0.004373 0.015574
0.204551 -0.107093 0.459226
-0.105409 0.188978 -0.446229
-0.038554 0.054858 0.004697
0.015869 0.007965 0.000098
0.091304 0.011497 0.049956
0.091304 -0.011496 0.049956
0.048905 0.031585 0.030097
0.028612 -0.021378 0.000597
0.062317 0.004375 0.015574
-0.368152 0.292572 -0.147418
0.050582 -0.003913 0.094052
0.050582 0.003914 0.094052
-0.008331 -0.057659 -0.028031
0.067698 -0.046919 0.055500
-0.033752 -0.057659 -0.000504
0.290109 -0.211420 0.366579
0.077386 0.007440 0.102204
0.077386 -0.007438 0.102204
-0.073980 -0.071508 -0.057031
0.204551 0.107095 0.459226
0.336980 0.000676 0.318682
0.336980 -0.000675 0.318682
-0.008331 0.057660 -0.028031
0.087843 -0.028075 0.033686
0.067698 0.046920 0.055500
-0.033752 0.057660 -0.000504
0.263144 -0.004144 0.292830
0.263144 0.004145 0.292830
-0.055811 -0.046714 0.006227
0.067409 0.007440 0.092991
0.067409 -0.007438 0.092991
0.194590 0.028322 0.490029
0.087843 0.028076 0.033686
0.092625 -0.003913 0.048525
0.092625 0.003914 0.048525
0.040309 -0.034837 0.039406
0.092126 -0.007765 0.049066
0.092126 0.007767 0.049066
-0.003528 -0.054856 -0.033231
0.383318 0.211420 0.265646
-0.391893 0.262151 -0.130288
-0.037300 -0.059553 -0.013818
0.051903 -0.011496 0.092621
0.337046 0.000885 0.318610
0.337046 -0.000884 0.318610
-0.368712 0.280935 -0.155390
0.040309 0.034838 0.039406
0.051903 0.011497 0.092621
-0.164998 -0.271458 -0.381703
0.017958 -0.018045 0.026433
0.034385 -0.034287 0.045821
-0.478716 -0.119031 -0.027693
-0.003528 0.054858 -0.033231
0.290109 0.211420 0.366579
0.226772 -0.152175 0.435164
-0.292250 -0.309873 -0.238187
-0.037300 0.059554 -0.013818
0.017958 0.018046 0.026433
0.034385 0.034288 0.045821
0.489233 -0.083185 0.170971
0.078991 -0.040329 0.043272
0.024007 -0.028075 0.079934
-0.268179 -0.320874 -0.269972
-0.064968 -0.034907 -0.032474
0.014497 -0.031170 0.015882
-0.051024 0.041502 0.018200
0.044152 -0.046919 0.058120
0.078991 0.040331 0.043272
0.024007 0.028076 0.079934
-0.064968 0.034908 -0.032474
0.014497 0.031170 0.015882
0.044152 0.046920 0.058120
0.489233 0.083187 0.170971
0.272499 -0.201143 0.385648
0.346183 -0.221861 0.305858
0.311562 0.227385 0.351927
0.031882 -0.006762 0.011355
0.031882 0.006764 0.011355
0.029270 -0.017471 0.039920
0.024035 0.012576 0.045589
0.024035 -0.012575 0.045589
0.332513 -0.044883 0.283485
-0.067836 0.022318 0.019248
-0.067836 -0.022317 0.019248
-0.027810 -0.075174 -0.026955
0.029270 0.017473 0.039920
-0.025731 -0.026375 -0.109278
-0.002095 -0.025263 -0.003329
-0.002095 0.025264 -0.003329
0.063661 -0.047671 0.059872
-0.413295 0.239233 -0.107113
0.332513 0.044883 0.283485
-0.025731 0.026376 -0.109278
0.212344 -0.108863 0.470804
0.063661 0.047671 0.059872
-0.164998 0.271458 -0.381703
-0.027810 0.075175 -0.026955
0.093777 0.005986 0.027261
0.093777 -0.005986 0.027261
0.018070 -0.016815 0.063487
0.339230 0.000885 0.316246
0.339230 -0.000884 0.316246
0.272499 0.201144 0.385648
-0.292250 0.309872 -0.238187
0.065057 -0.029702 0.078378
0.255902 0.187694 0.403620
0.018070 0.016816 0.063487
-0.036852 -0.018585 0.017151
0.212344 0.108863 0.470804
0.346183 0.221861 0.305858
0.015884 -0.008680 0.065855
0.065057 0.029703 0.078378
0.350850 -0.231029 0.309383
0.012085 0.000001 -0.018684
-0.398751 -0.271459 -0.128581
-0.072904 0.026411 -0.023880
-0.036852 0.018587 0.017151
0.293652 -0.033955 0.325566
0.284531 0.000001 0.335443
0.015884 0.008682 0.065855
-0.070401 -0.007598 0.022025
-0.288523 -0.322708 -0.233645
0.087050 -0.021378 0.054563
-0.070401 0.007598 0.022025
0.339297 0.000676 0.316173
0.339297 -0.000675 0.316173
-0.434663 0.221346 -0.075396
0.301757 -0.022636 0.251018
-0.028473 -0.009593 -0.071993
0.345410 -0.029155 0.269519
-0.021443 -0.073991 -0.033850
0.301757 0.022637 0.251018
-0.028473 0.009595 -0.071993
0.345410 0.029157 0.269519
-0.046810 -0.071637 -0.006381
0.018836 -0.011877 0.085534
-0.021443 0.073991 -0.033850
0.350850 0.231029 0.309383
0.247326 -0.023834 0.235606
0.247326 0.023836 0.235606
0.057981 -0.020515 0.020270
0.057981 0.020517 0.020270
-0.062270 -0.080412 -0.478646
-0.295570 0.320874 -0.240311
0.339635 0.038220 0.275773
0.305062 -0.015930 0.247439
-0.002770 -0.034907 -0.019754
0.076531 -0.002532 0.103130
0.076531 0.002533 0.103130
-0.057086 -0.029206 0.024764
0.238016 -0.018401 0.245688
-0.488008 0.038915 -0.026209
-0.052181 -0.038503 -0.046321
0.034355 0.000001 -0.005621
0.305062 0.015932 0.247439
0.066554 -0.002532 0.093917
0.066554 0.002533 0.093917
-0.398751 0.271458 -0.128580
-0.046810 0.071639 -0.006381
-0.002770 0.034908 -0.019754
-0.057086 0.029208 0.024764
0.016442 -0.017471 0.028074
0.016442 0.017473 0.028074
0.011207 0.012576 0.033743
0.011207 -0.012575 0.033743
0.238016 0.018402 0.245688
-0.052181 0.038505 -0.046321
0.328583 -0.047175 0.287740
0.239662 -0.020164 0.243906
0.239662 0.020165 0.243906
-0.009260 -0.068156 -0.047042
-0.062270 0.080413 -0.478646
-0.002279 0.021380 0.034048
-0.463614 -0.149577 -0.052625
0.018798 -0.015076 -0.057407
0.072934 -0.031170 0.069848
0.328583 0.047176 0.287740
0.493104 0.057569 0.155342
0.018798 0.015078 -0.057407
-0.288523 0.322708 -0.233645
-0.009260 0.068156 -0.047042
0.235235 -0.014036 0.248699
0.496801 -0.029012 0.151339
0.072934 0.031170 0.069848
0.036971 -0.017471 0.031582
0.010816 -0.014959 0.005570
0.235235 0.014038 0.248699
0.066877 -0.005025 0.093567
0.496801 0.029013 0.151339
0.076853 -0.005025 0.102780
0.036971 0.017473 0.031582
0.010816 0.014961 0.005570
0.263408 0.008792 0.218191
0.263408 -0.008790 0.218191
0.339146 0.001080 0.316337
0.339146 -0.001078 0.316337
0.269048 -0.022636 0.286437
0.012259 0.000001 -0.036029
0.102881 0.007440 0.074596
0.102881 -0.007438 0.074596
0.455472 0.158463 0.196092
0.269048 0.022637 0.286437
0.299315 -0.214914 0.376626
0.092905 0.007440 0.065383
0.092905 -0.007438 0.065383
0.011215 -0.007598 -0.066353
0.011215 0.007598 -0.066353
-0.473019 -0.154888 -0.048159
0.063838 0.012850 0.108294
0.063838 -0.012849 0.108294
0.016496 -0.027728 -0.074933
0.364974 -0.218362 0.285510
0.016496 0.027729 -0.074933
-0.027011 -0.060507 -0.024960
-0.069433 -0.015076 0.020977
-0.027011 0.060507 -0.024960
0.066698 -0.020515 0.105198
0.336931 0.000457 0.318735
0.336931 -0.000456 0.318735
-0.052777 -0.068156 0.000081
0.000998 -0.051188 -0.038133
0.264542 -0.190795 0.414280
0.066698 0.020517 0.105198
-0.260974 -0.322708 -0.263477
0.339374 0.000230 0.316090
0.339374 -0.000230 0.316090
0.299315 0.214913 0.376626
0.260155 0.016349 0.221715
0.260155 -0.016347 0.221715
-0.440881 -0.220088 -0.082960
-0.052777 0.068156 0.000081
0.000998 0.051189 -0.038133
0.087564 -0.019851 0.091182
-0.492391 -0.040525 -0.012885
0.196487 0.081835 0.467958
0.364974 0.218364 0.285510
0.077588 0.019851 0.081969
0.077588 -0.019851 0.081969
0.351572 -0.006216 0.262847
0.351572 0.006218 0.262847
0.087564 0.019851 0.091182
0.222661 0.132824 0.459632
0.031733 -0.015045 -0.002783
0.031733 0.015046 -0.002783
0.411965 -0.204467 0.254642
0.482793 -0.055283 0.157929
0.108795 -0.008680 0.059613
0.108795 0.008682 0.059613
-0.040594 -0.073991 -0.013112
0.000391 -0.041502 -0.054632
0.482793 0.055284 0.157929
0.198197 0.056198 0.486122
-0.213932 -0.295288 -0.322995
0.264542 0.190796 0.414280
0.024143 -0.017471 0.019735
0.024143 0.017473 0.019735
0.010421 -0.014201 -0.034039
-0.040594 0.073991 -0.013112
-0.067876 0.071508 -0.063641
-0.035090 0.022677 0.015244
-0.035090 -0.022675 0.015244
-0.020654 0.012391 0.016768
-0.020654 -0.012389 0.016768
0.036426 -0.043218 0.066486
0.092792 0.000001 0.048345
-0.021886 -0.059553 -0.030510
0.106608 -0.016815 0.061980
0.106608 0.016816 0.061980
0.307837 0.000001 0.244434
0.010421 0.014203 -0.034039
0.338805 -0.001550 0.316705
0.338805 0.001551 0.316705
-0.349279 -0.305773 -0.182152
-0.466985 -0.155772 -0.040396
0.036426 0.043220 0.066486
-0.021886 0.059554 -0.030509
-0.114834 -0.221345 -0.421726
0.193380 0.000001 0.491339
0.056158 0.021380 0.088014
-0.420913 -0.247725 -0.104583
-0.260974 0.322708 -0.263476
0.458447 -0.154688 0.204308
0.411965 0.204467 0.254642
0.026672 0.024065 0.002698
0.026672 -0.024063 0.002698
0.093015 0.011879 0.028086
0.093015 -0.011877 0.028086
-0.189335 -0.280935 -0.349630
0.324490 -0.048725 0.292173
0.288694 0.023897 0.330935
0.288693 -0.023895 0.330935
-0.061819 -0.070380 -0.070199
-0.003374 -0.046714 -0.050555
0.002770 -0.029725 -0.025753
0.107876 0.012850 0.060608
0.107876 -0.012849 0.060608
0.324490 0.048726 0.292173
0.002770 0.029727 -0.025753
-0.022003 -0.036691 0.001073
0.185177 -0.029012 0.488784
-0.061819 0.070381 -0.070199
0.232141 0.000001 0.252050
-0.022003 0.036693 0.001073
0.458447 0.154690 0.204308
0.498790 -0.028321 0.160622
0.444413 -0.174115 0.219505
-0.213932 0.295289 -0.322995
0.062175 0.000001 0.110096
0.498790 0.028322 0.160622
0.017817 0.000001 0.086637
0.214699 -0.130664 0.448237
0.000028 -0.024460 -0.005628
0.012234 -0.035635 -0.050300
0.000028 0.024461 -0.005628
0.339046 0.001257 0.316445
0.339046 -0.001256 0.316445
0.048189 -0.047671 0.053748
0.018073 -0.005986 0.086359
0.012234 0.035636 -0.050300
-0.080036 -0.070380 -0.050473
-0.005827 -0.036691 -0.016444
0.214699 0.130664 0.448237
0.084296 -0.018285 0.094722
0.441096 -0.178363 0.211660
-0.005827 0.036693 -0.016444
0.444413 0.174115 0.219505
0.000110 -0.032574 -0.022873
-0.009011 -0.037896 -0.012996
0.331128 -0.231029 0.330739
0.263672 0.008224 0.292258
0.263672 -0.008223 0.292258
0.074319 -0.018285 0.085509
-0.484682 -0.118355 -0.035529
0.048189 0.047671 0.053748
0.084296 0.018286 0.094722
0.285588 -0.012335 0.334298
0.285588 0.012336 0.334298
-0.080036 0.070381 -0.050473
0.000110 0.032575 -0.022873
-0.009011 0.037898 -0.012996
0.074319 0.018286 0.085509
-0.449439 0.182498 -0.067974
0.010324 -0.044274 -0.068249
0.029568 -0.036803 0.073912
-0.055468 -0.038503 -0.042762
0.090171 -0.015045 0.051183
0.090171 0.015046 0.051183
0.356316 -0.225527 0.314902
0.010324 0.044275 -0.068249
0.005176 0.046714 -0.042657
0.441096 0.178364 0.211660
0.029568 0.036804 0.073912
0.032860 -0.040329 0.070347
-0.055468 0.038505 -0.042762
0.012050 0.013960 0.004234
0.012050 -0.013959 0.004234
0.251379 -0.023459 0.231217
0.248968 0.174115 0.431145
0.032860 0.040331 0.070347
0.251379 0.023459 0.231217
-0.055811 0.046714 0.006226
0.035410 -0.028075 0.090464
0.331128 0.231029 0.330739
-0.012792 -0.023271 0.008255
-0.072361 -0.044275 0.021287
-0.022264 -0.006394 0.018512
-0.022264 0.006396 0.018512
0.035410 0.028076 0.090464
-0.157205 0.273010 -0.375845
-0.105408 -0.188977 -0.446230
-0.012792 0.023273 0.008255
-0.072361 0.044275 0.021287
0.055554 -0.046919 0.068651
-0.181345 -0.292571 -0.349704
-0.106363 -0.049046 -0.021965
0.055554 0.046920 0.068651
0.232650 0.005939 0.251498
0.232650 -0.005939 0.251498
-0.059576 -0.041502 0.010304
-0.079176 0.009595 -0.017089
-0.079176 -0.009593 -0.017089
-0.106363 0.049048 -0.021965
0.085110 0.024065 0.056664
0.085110 -0.024063 0.056664
0.356316 0.225526 0.314902
0.027814 -0.016622 0.041497
0.027814 0.016624 0.041497
0.194970 0.085216 0.478180
0.016804 -0.012849 0.064859
0.073167 -0.029471 0.098192
-0.034744 -0.026409 -0.065202
0.370417 -0.227386 0.288195
0.016804 0.012850 0.064859
0.073167 0.029473 0.098192
0.022187 -0.028258 0.007554
-0.034744 0.026411 -0.065202
0.495183 -0.056196 0.164528
0.022188 0.028260 0.007554
-0.318495 -0.304985 -0.209768
0.495183 0.056198 0.164528
0.020093 -0.017583 0.084172
-0.047260 -0.046714 0.014124
3 995 797 93
3 1124 1100 1194
3 96 288 524
3 1020 1042 814
3 940 813 1042
3 813 288 1042
3 1042 1020 560
3 1042 1216 1019
3 941 1020 814
3 561 1020 1217
3 287 814 523
3 560 1020 561
3 796 591 530
3 1020 941 1043
3 796 160 95
3 561 475 560
3 814 591 796
3 288 159 1042
3 560 1216 1042
3 92 160 994
3 95 814 796
3 95 523 814
3 159 288 96
3 814 1042 591
3 592 1270 404
3 159 1123 1042
3 1223 1224 1123
3 160 796 994
3 1269 591 393
3 1194 1314 393
3 1123 591 1042
3 962 1224 1223
3 1224 1194 1123
3 1123 900 1223
3 1194 393 591
3 1194 1224 1124
3 1224 901 1124
3 530 589 796
3 1193 1099 1313
3 404 1313 592
3 592 1313 1123
3 592 797 590
3 1313 1099 1123
3 591 1123 1194
3 529 592 590
3 797 159 93
3 592 159 797
3 592 1123 159
3 866 398 27
3 398 866 522
3 522 867 398
3 867 501 398
3 501 27 398
3 27 501 508
3 867 522 1127
3 793 867 1127
3 867 793 501
3 793 141 501
3 141 508 501
3 508 141 851
3 467 1127 522
3 1127 467 1085
3 793 1127 1085
3 547 793 1085
3 793 547 141
3 547 285 141
3 285 851 141
3 851 285 741
3 522 754 467
3 754 576 467
3 576 1085 467
3 1085 576 662
3 547 1085 662
3 212 547 662
3 547 212 285
3 212 641 285
3 641 741 285
3 741 641 663
3 754 522 923
3 753 754 923
3 754 753 576
3 753 623 576
3 623 662 576
3 662 623 1368
3 212 662 1368
3 458 212 1368
3 212 458 641
3 458 1341 641
3 1341 663 641
3 663 1341 904
3 1389 923 522
3 923 1389 874
3 753 923 874
3 134 753 874
3 753 134 623
3 134 567 623
3 567 1368 623
3 1368 567 1275
3 458 1368 1275
3 310 458 1275
3 458 310 1341
3 310 1248 1341
3 1248 904 1341
3 904 1248 226
3 522 499 1389
3 499 438 1389
3 438 874 1389
3 874 438 548
3 134 874 548
3 187 134 548
3 134 187 567
3 187 656 567
3 656 1275 567
3 1275 656 939
3 310 1275 939
3 1291 310 939
3 310 1291 1248
3 1291 259 1248
3 259 226 1248
3 226 259 1292
3 499 522 555
3 107 499 555
3 499 107 438
3 107 933 438
3 933 548 438
3 548 933 1047
3 187 548 1047
3 245 187 1047
3 187 245 656
3 245 514 656
3 514 939 656
3 939 514 818
3 1291 939 818
3 1219 1291 818
3 1291 1219 259
3 1219 1325 259
3 1325 1292 259
3 1292 1325 113
3 353 555 522
3 555 353 976
3 107 555 976
3 1286 107 976
3 107 1286 933
3 1286 312 933
3 312 1047 933
3 1047 312 1372
3 245 1047 1372
3 1169 245 1372
3 245 1169 514
3 1169 612 514
3 612 818 514
3 818 612 1037
3 1219 818 1037
3 1145 1219 1037
3 1219 1145 1325
3 1145 615 1325
3 615 113 1325
3 113 615 1184
3 522 549 353
3 549 491 353
3 491 976 353
3 976 491 1251
3 1286 976 1251
3 531 1286 1251
3 1286 531 312
3 531 90 312
3 90 1372 312
3 1372 90 143
3 1169 1372 143
3 586 1169 143
3 1169 586 612
3 586 1011 612
3 1011 1037 612
3 1037 1011 1319
3 1145 1037 1319
3 1310 1145 1319
3 1145 1310 615
3 1310 118 615
3 118 1184 615
3 1184 118 468
3 549 522 556
3 1290 549 556
3 549 1290 491
3 1290 489 491
3 489 1251 491
3 1251 489 644
3 531 1251 644
3 286 531 644
3 531 286 90
3 286 1129 90
3 1129 143 90
3 143 1129 1264
3 586 143 1264
3 234 586 1264
3 586 234 1011
3 234 1326 1011
3 1326 1319 1011
3 1319 1326 1086
3 1310 1319 1086
3 503 1310 1086
3 1310 503 118
3 503 89 118
3 89 468 118
3 468 89 271
3 1151 556 522
3 556 1151 153
3 1290 556 153
3 879 1290 153
3 1290 879 489
3 879 1061 489
3 1061 644 489
3 644 1061 1222
3 286 644 1222
3 1083 286 1222
3 286 1083 1129
3 1083 1212 1129
3 1212 1264 1129
3 1264 1212 176
3 234 1264 176
3 477 234 176
3 234 477 1326
3 477 758 1326
3 758 1086 1326
3 1086 758 358
3 503 1086 358
3 1063 503 358
3 503 1063 89
3 1063 670 89
3 670 271 89
3 271 670 575
3 522 1343 1151
3 1343 1017 1151
3 1017 153 1151
3 153 1017 1054
3 879 153 1054
3 740 879 1054
3 879 740 1061
3 740 1120 1061
3 1120 1222 1061
3 1222 1120 206
3 1083 1222 206
3 11 1083 206
3 1083 11 1212
3 11 401 1212
3 401 176 1212
3 176 401 696
3 477 176 696
3 146 477 696
3 477 146 758
3 146 144 758
3 144 358 758
3 358 144 403
3 1063 358 403
3 300 1063 403
3 1063 300 670
3 300 217 670
3 217 575 670
3 575 217 432
3 1343 522 853
3 1318 1343 853
3 1343 1318 1017
3 1318 1397 1017
3 1397 1054 1017
3 1054 1397 61
3 740 1054 61
3 607 740 61
3 740 607 1120
3 607 1247 1120
3 1247 206 1120
3 206 1247 1040
3 11 206 1040
3 16 11 1040
3 11 16 401
3 16 190 401
3 190 696 401
3 696 190 918
3 146 696 918
3 339 146 918
3 146 339 144
3 339 275 144
3 275 403 144
3 403 275 1048
3 300 403 1048
3 964 300 1048
3 300 964 217
3 964 1049 217
3 1049 432 217
3 432 1049 1065
3 515 853 522
3 853 515 319
3 1318 853 319
3 325 1318 319
3 1318 325 1397
3 325 1271 1397
3 1271 61 1397
3 61 1271 445
3 607 61 445
3 1133 607 445
3 607 1133 1247
3 1133 596 1247
3 596 1040 1247
3 1040 596 1013
3 16 1040 1013
3 1297 16 1013
3 16 1297 190
3 1297 683 190
3 683 918 190
3 918 683 388
3 339 918 388
3 980 339 388
3 339 980 275
3 980 1160 275
3 1160 1048 275
3 1048 1160 1077
3 964 1048 1077
3 850 964 1077
3 964 850 1049
3 850 32 1049
3 32 1065 1049
3 1065 32 337
3 522 1062 515
3 1062 192 515
3 192 319 515
3 319 192 645
3 325 319 645
3 371 325 645
3 325 371 1271
3 371 603 1271
3 603 445 1271
3 445 603 1218
3 1133 445 1218
3 569 1133 1218
3 1133 569 596
3 569 981 596
3 981 1013 596
3 1013 981 373
3 1297 1013 373
3 1362 1297 373
3 1297 1362 683
3 1362 795 683
3 795 388 683
3 388 795 382
3 980 388 382
3 56 980 382
3 980 56 1160
3 56 1384 1160
3 1384 1077 1160
3 1077 1384 473
3 850 1077 473
3 1262 850 473
3 850 1262 32
3 1262 150 32
3 150 337 32
3 337 150 494
3 1062 522 858
3 722 1062 858
3 1062 722 192
3 722 988 192
3 988 645 192
3 645 988 1113
3 371 645 1113
3 660 371 1113
3 371 660 603
3 660 772 603
3 772 1218 603
3 1218 772 60
3 569 1218 60
3 440 569 60
3 569 440 981
3 440 194 981
3 194 373 981
3 373 194 791
3 1362 373 791
3 931 1362 791
3 1362 931 795
3 931 333 795
3 333 382 795
3 382 333 289
3 56 382 289
3 199 56 289
3 56 199 1384
3 199 186 1384
3 186 473 1384
3 473 186 1351
3 1262 473 1351
3 257 1262 1351
3 1262 257 150
3 257 442 150
3 442 494 150
3 494 442 898
3 896 858 522
3 858 896 359
3 722 858 359
3 700 722 359
3 722 700 988
3 700 1278 988
3 1278 1113 988
3 1113 1278 247
3 660 1113 247
3 4 660 247
3 660 4 772
3 4 1027 772
3 1027 60 772
3 60 1027 1400
3 440 60 1400
3 242 440 1400
3 440 242 194
3 242 207 194
3 207 791 194
3 791 207 749
3 931 791 749
3 528 931 749
3 931 528 333
3 528 934 333
3 934 289 333
3 289 934 856
3 199 289 856
3 643 199 856
3 199 643 186
3 643 1342 186
3 1342 1351 186
3 1351 1342 248
3 257 1351 248
3 637 257 248
3 257 637 442
3 637 634 442
3 634 898 442
3 898 634 420
3 522 763 896
3 763 1373 896
3 1373 359 896
3 359 1373 38
3 700 359 38
3 1228 700 38
3 700 1228 1278
3 1228 736 1278
3 736 247 1278
3 247 736 961
3 4 247 961
3 1377 4 961
3 4 1377 1027
3 1377 345 1027
3 345 1400 1027
3 1400 345 94
3 242 1400 94
3 9 242 94
3 242 9 207
3 9 418 207
3 418 749 207
3 749 418 812
3 528 749 812
3 1163 528 812
3 528 1163 934
3 1163 1079 934
3 1079 856 934
3 856 1079 887
3 643 856 887
3 233 643 887
3 643 233 1342
3 233 553 1342
3 553 248 1342
3 248 553 917
3 637 248 917
3 282 637 917
3 637 282 634
3 282 672 634
3 672 420 634
3 420 672 278
3 763 522 471
3 416 763 471
3 763 416 1373
3 416 283 1373
3 283 38 1373
3 38 283 533
3 1228 38 533
3 181 1228 533
3 1228 181 736
3 181 1363 736
3 1363 961 736
3 961 1363 292
3 1377 961 292
3 702 1377 292
3 1377 702 345
3 702 1259 345
3 1259 94 345
3 94 1259 536
3 9 94 536
3 631 9 536
3 9 631 418
3 631 2 418
3 2 812 418
3 812 2 391
3 1163 812 391
3 309 1163 391
3 1163 309 1079
3 309 5 1079
3 5 887 1079
3 887 5 1060
3 233 887 1060
3 1360 233 1060
3 233 1360 553
3 1360 105 553
3 105 917 553
3 917 105 767
3 282 917 767
3 1215 282 767
3 282 1215 672
3 1215 760 672
3 760 278 672
3 278 760 1180
3 320 471 522
3 471 320 577
3 416 471 577
3 1172 416 577
3 416 1172 283
3 1172 1206 283
3 1206 533 283
3 533 1206 1272
3 181 533 1272
3 609 181 1272
3 181 609 1363
3 609 737 1363
3 737 292 1363
3 292 737 1148
3 702 292 1148
3 1106 702 1148
3 702 1106 1259
3 1106 1261 1259
3 1261 536 1259
3 536 1261 967
3 631 536 967
3 227 631 967
3 631 227 2
3 227 825 2
3 825 391 2
3 391 825 738
3 309 391 738
3 1098 309 738
3 309 1098 5
3 1098 179 5
3 179 1060 5
3 1060 179 492
3 1360 1060 492
3 330 1360 492
3 1360 330 105
3 330 182 105
3 182 767 105
3 767 182 871
3 1215 767 871
3 174 1215 871
3 1215 174 760
3 174 25 760
3 25 1180 760
3 1180 25 819
3 522 929 320
3 929 103 320
3 103 577 320
3 577 103 751
3 1172 577 751
3 1331 1172 751
3 1172 1331 1206
3 1331 1050 1206
3 1050 1272 1206
3 1272 1050 83
3 609 1272 83
3 1082 609 83
3 609 1082 737
3 1082 53 737
3 53 1148 737
3 1148 53 272
3 1106 1148 272
3 578 1106 272
3 1106 578 1261
3 578 411 1261
3 411 967 1261
3 967 411 914
3 227 967 914
3 256 227 914
3 227 256 825
3 256 173 825
3 173 738 825
3 738 173 1387
3 1098 738 1387
3 1399 1098 1387
3 1098 1399 179
3 1399 303 179
3 303 492 179
3 492 303 1041
3 330 492 1041
3 1029 330 1041
3 330 1029 182
3 1029 1208 182
3 1208 871 182
3 871 1208 1016
3 174 871 1016
3 807 174 1016
3 174 807 25
3 807 68 25
3 68 819 25
3 819 68 315
3 929 522 1379
3 378 929 1379
3 929 378 103
3 378 692 103
3 692 751 103
3 751 692 735
3 1331 751 735
3 647 1331 735
3 1331 647 1050
3 647 435 1050
3 435 83 1050
3 83 435 1213
3 1082 83 1213
3 177 1082 1213
3 1082 177 53
3 177 725 53
3 725 272 53
3 272 725 1364
3 578 272 1364
3 170 578 1364
3 578 170 411
3 170 544 411
3 544 914 411
3 914 544 538
3 256 914 538
3 451 256 538
3 256 451 173
3 451 1109 173
3 1109 1387 173
3 1387 1109 1134
3 1399 1387 1134
3 33 1399 1134
3 1399 33 303
3 33 666 303
3 666 1041 303
3 1041 666 1186
3 1029 1041 1186
3 881 1029 1186
3 1029 881 1208
3 881 1188 1208
3 1188 1016 1208
3 1016 1188 1376
3 807 1016 1376
3 1329 807 1376
3 807 1329 68
3 1329 1334 68
3 1334 315 68
3 315 1334 431
3 198 1379 522
3 1379 198 657
3 378 1379 657
3 446 378 657
3 378 446 692
3 446 872 692
3 872 735 692
3 735 872 1232
3 647 735 1232
3 847 647 1232
3 647 847 435
3 847 1119 435
3 1119 1213 435
3 1213 1119 78
3 177 1213 78
3 975 177 78
3 177 975 725
3 975 456 725
3 456 1364 725
3 1364 456 341
3 170 1364 341
3 883 170 341
3 170 883 544
3 883 831 544
3 831 538 544
3 538 831 745
3 451 538 745
3 470 451 745
3 451 470 1109
3 470 1316 1109
3 1316 1134 1109
3 1134 1316 215
3 33 1134 215
3 1009 33 215
3 33 1009 666
3 1009 1154 666
3 1154 1186 666
3 1186 1154 264
3 881 1186 264
3 1146 881 264
3 881 1146 1188
3 1146 48 1188
3 48 1376 1188
3 1376 48 1025
3 1329 1376 1025
3 860 1329 1025
3 1329 860 1334
3 860 84 1334
3 84 431 1334
3 431 84 1298
3 522 673 198
3 673 829 198
3 829 657 198
3 657 829 498
3 446 657 498
3 711 446 498
3 446 711 872
3 711 230 872
3 230 1232 872
3 1232 230 85
3 847 1232 85
3 59 847 85
3 847 59 1119
3 59 444 1119
3 444 78 1119
3 78 444 20
3 975 78 20
3 891 975 20
3 975 891 456
3 891 565 456
3 565 341 456
3 341 565 317
3 883 341 317
3 214 883 317
3 883 214 831
3 214 119 831
3 119 745 831
3 745 119 75
3 470 745 75
3 1308 470 75
3 470 1308 1316
3 1308 202 1316
3 202 215 1316
3 215 202 427
3 1009 215 427
3 799 1009 427
3 1009 799 1154
3 799 1306 1154
3 1306 264 1154
3 264 1306 792
3 1146 264 792
3 1300 1146 792
3 1146 1300 48
3 1300 703 48
3 703 1025 48
3 1025 703 1117
3 860 1025 1117
3 506 860 1117
3 860 506 84
3 506 149 84
3 149 1298 84
3 1298 149 1276
3 930 323 583
3 323 930 522
3 522 478 323
3 478 419 323
3 419 583 323
3 583 419 1340
3 478 522 1114
3 1380 478 1114
3 478 1380 419
3 1380 400 419
3 400 1340 419
3 1340 400 511
3 895 1114 522
3 1114 895 372
3 1380 1114 372
3 1089 1380 372
3 1380 1089 400
3 1089 558 400
3 558 511 400
3 511 558 624
3 522 859 895
3 859 732 895
3 732 372 895
3 372 732 1039
3 1089 372 1039
3 1156 1089 1039
3 1089 1156 558
3 1156 706 558
3 706 624 558
3 624 706 779
3 859 522 1068
3 203 859 1068
3 859 203 732
3 203 1044 732
3 1044 1039 732
3 1039 1044 781
3 1156 1039 781
3 1008 1156 781
3 1156 1008 706
3 1008 1229 706
3 1229 779 706
3 779 1229 572
3 521 1068 522
3 1068 521 329
3 203 1068 329
3 366 203 329
3 203 366 1044
3 366 221 1044
3 221 781 1044
3 781 221 493
3 1008 781 493
3 1157 1008 493
3 1008 1157 1229
3 1157 608 1229
3 608 572 1229
3 572 608 1024
3 522 855 521
3 855 1336 521
3 1336 329 521
3 329 1336 44
3 366 329 44
3 102 366 44
3 366 102 221
3 102 664 221
3 664 493 221
3 493 664 1256
3 1157 493 1256
3 1055 1157 1256
3 1157 1055 608
3 1055 29 608
3 29 1024 608
3 1024 29 193
3 855 522 1352
3 678 855 1352
3 855 678 1336
3 678 1102 1336
3 1102 44 1336
3 44 1102 1142
3 102 44 1142
3 1178 102 1142
3 102 1178 664
3 1178 218 664
3 218 1256 664
3 1256 218 21
3 1055 1256 21
3 414 1055 21
3 1055 414 29
3 414 704 29
3 704 193 29
3 193 704 145
3 1165 1352 522
3 1352 1165 1257
3 678 1352 1257
3 927 678 1257
3 678 927 1102
3 927 771 1102
3 771 1142 1102
3 1142 771 1279
3 1178 1142 1279
3 1095 1178 1279
3 1178 1095 218
3 1095 1214 218
3 1214 21 218
3 21 1214 185
3 414 21 185
3 483 414 185
3 414 483 704
3 483 768 704
3 768 145 704
3 145 768 357
3 522 564 1165
3 564 1299 1165
3 1299 1257 1165
3 1257 1299 550
3 927 1257 550
3 699 927 550
3 927 699 771
3 699 327 771
3 327 1279 771
3 1279 327 1135
3 1095 1279 1135
3 1274 1095 1135
3 1095 1274 1214
3 1274 244 1214
3 244 185 1214
3 185 244 1338
3 483 185 1338
3 1087 483 1338
3 483 1087 768
3 1087 502 768
3 502 357 768
3 357 502 97
3 564 522 554
3 507 564 554
3 564 507 1299
3 507 1305 1299
3 1305 550 1299
3 550 1305 241
3 699 550 241
3 138 699 241
3 699 138 327
3 138 162 327
3 162 1135 327
3 1135 162 602
3 1274 1135 602
3 1021 1274 602
3 1274 1021 244
3 1021 1323 244
3 1323 1338 244
3 1338 1323 1312
3 1087 1338 1312
3 125 1087 1312
3 1087 125 502
3 125 476 502
3 476 97 502
3 97 476 1254
3 360 554 522
3 554 360 984
3 507 554 984
3 636 507 984
3 507 636 1305
3 636 37 1305
3 37 241 1305
3 241 37 7
3 138 241 7
3 1179 138 7
3 138 1179 162
3 1179 625 162
3 625 602 162
3 602 625 1051
3 1021 602 1051
3 1158 1021 1051
3 1021 1158 1323
3 1158 616 1323
3 616 1312 1323
3 1312 616 1190
3 125 1312 1190
3 1396 125 1190
3 125 1396 476
3 1396 921 476
3 921 1254 476
3 1254 921 849
3 522 563 360
3 563 114 360
3 114 984 360
3 984 114 985
3 636 984 985
3 1094 636 985
3 636 1094 37
3 1094 1367 37
3 1367 7 37
3 7 1367 527
3 1179 7 527
3 827 1179 527
3 1179 827 625
3 827 1230 625
3 1230 1051 625
3 1051 1230 1337
3 1158 1051 1337
3 112 1158 1337
3 1158 112 616
3 112 1353 616
3 1353 1190 616
3 1190 1353 46
3 1396 1190 46
3 695 1396 46
3 1396 695 921
3 695 605 921
3 605 849 921
3 849 605 952
3 563 522 512
3 443 563 512
3 563 443 114
3 443 579 114
3 579 985 114
3 985 579 231
3 1094 985 231
3 22 1094 231
3 1094 22 1367
3 22 949 1367
3 949 527 1367
3 527 949 947
3 827 527 947
3 1348 827 947
3 827 1348 1230
3 1348 1296 1230
3 1296 1337 1230
3 1337 1296 710
3 112 1337 710
3 117 112 710
3 112 117 1353
3 117 1282 1353
3 1282 46 1353
3 46 1282 362
3 695 46 362
3 295 695 362
3 695 295 605
3 295 833 605
3 833 952 605
3 952 833 370
3 1394 512 522
3 512 1394 885
3 443 512 885
3 175 443 885
3 443 175 579
3 175 604 579
3 604 231 579
3 231 604 960
3 22 231 960
3 322 22 960
3 22 322 949
3 322 568 949
3 568 947 949
3 947 568 979
3 1348 947 979
3 756 1348 979
3 1348 756 1296
3 756 566 1296
3 566 710 1296
3 710 566 424
3 117 710 424
3 654 117 424
3 117 654 1282
3 654 171 1282
3 171 362 1282
3 362 171 77
3 295 362 77
3 249 295 77
3 295 249 833
3 249 412 833
3 412 370 833
3 370 412 748
3 522 925 1394
3 925 764 1394
3 764 885 1394
3 885 764 658
3 175 885 658
3 1000 175 658
3 175 1000 604
3 1000 487 604
3 487 960 604
3 960 487 1347
3 322 960 1347
3 913 322 1347
3 322 913 568
3 913 1317 568
3 1317 979 568
3 979 1317 268
3 756 979 268
3 30 756 268
3 756 30 566
3 30 237 566
3 237 424 566
3 424 237 52
3 654 424 52
3 908 654 52
3 654 908 171
3 908 840 171
3 840 77 171
3 77 840 1140
3 249 77 1140
3 698 249 1140
3 249 698 412
3 698 1031 412
3 1031 748 412
3 748 1031 152
3 925 522 755
3 582 925 755
3 925 582 764
3 582 688 764
3 688 658 764
3 658 688 243
3 1000 658 243
3 674 1000 243
3 1000 674 487
3 674 668 487
3 668 1347 487
3 1347 668 129
3 913 1347 129
3 539 913 129
3 913 539 1317
3 539 87 1317
3 87 268 1317
3 268 87 743
3 30 268 743
3 1002 30 743
3 30 1002 237
3 1002 1242 237
3 1242 52 237
3 52 1242 488
3 908 52 488
3 405 908 488
3 908 405 840
3 405 58 840
3 58 1140 840
3 1140 58 124
3 698 1140 124
3 447 698 124
3 698 447 1031
3 447 1345 1031
3 1345 152 1031
3 152 1345 258
3 108 379 1378
3 379 197 1378
3 197 379 665
3 346 108 784
3 108 346 379
3 346 296 379
3 296 665 379
3 665 296 1150
3 784 899 809
3 346 784 809
3 595 346 809
3 346 595 296
3 595 10 296
3 10 1150 296
3 1150 10 128
3 1125 888 899
3 888 809 899
3 809 888 537
3 595 809 537
3 304 595 537
3 595 304 10
3 304 262 10
3 262 128 10
3 128 262 835
3 977 1125 15
3 1125 977 888
3 977 1370 888
3 1370 537 888
3 537 1370 971
3 304 537 971
3 422 304 971
3 304 422 262
3 422 790 262
3 790 835 262
3 835 790 852
3 15 65 1359
3 977 15 1359
3 642 977 1359
3 977 642 1370
3 642 298 1370
3 298 971 1370
3 971 298 746
3 422 971 746
3 1081 422 746
3 422 1081 790
3 1081 111 790
3 111 852 790
3 852 111 1122
3 1001 452 65
3 452 1359 65
3 1359 452 334
3 642 1359 334
3 1064 642 334
3 642 1064 298
3 1064 712 298
3 712 746 298
3 746 712 1159
3 1081 746 1159
3 62 1081 1159
3 1081 62 111
3 62 516 111
3 516 1122 111
3 1122 516 79
3 384 1001 1301
3 1001 384 452
3 384 201 452
3 201 334 452
3 334 201 246
3 1064 334 246
3 430 1064 246
3 1064 430 712
3 430 1258 712
3 1258 1159 712
3 1159 1258 1115
3 62 1159 1115
3 273 62 1115
3 62 273 516
3 273 724 516
3 724 79 516
3 79 724 974
3 1301 924 682
3 384 1301 682
3 1369 384 682
3 384 1369 201
3 1369 800 201
3 800 246 201
3 246 800 213
3 430 246 213
3 8 430 213
3 430 8 1258
3 8 542 1258
3 542 1115 1258
3 1115 542 1260
3 273 1115 1260
3 585 273 1260
3 273 585 724
3 585 1365 724
3 1365 974 724
3 974 1365 811
3 151 343 924
3 343 682 924
3 682 343 392
3 1369 682 392
3 794 1369 392
3 1369 794 800
3 794 937 800
3 937 213 800
3 213 937 750
3 8 213 750
3 426 8 750
3 8 426 542
3 426 630 542
3 630 1260 542
3 1260 630 966
3 585 1260 966
3 410 585 966
3 585 410 1365
3 410 169 1365
3 169 811 1365
3 811 169 340
3 409 151 1069
3 151 409 343
3 409 280 343
3 280 392 343
3 392 280 989
3 794 392 989
3 386 794 989
3 794 386 937
3 386 338 937
3 338 750 937
3 750 338 532
3 426 750 532
3 1171 426 532
3 426 1171 630
3 1171 3 630
3 3 966 630
3 966 3 236
3 410 966 236
3 919 410 236
3 410 919 169
3 919 551 169
3 551 340 169
3 340 551 890
3 1069 270 669
3 409 1069 669
3 302 409 669
3 409 302 280
3 302 1056 280
3 1056 989 280
3 989 1056 1161
3 386 989 1161
3 63 386 1161
3 386 63 338
3 63 290 338
3 290 532 338
3 532 290 935
3 1171 532 935
3 1162 1171 935
3 1171 1162 3
3 1162 390 3
3 390 236 3
3 236 390 826
3 919 236 826
3 255 919 826
3 919 255 551
3 255 543 551
3 543 890 551
3 890 543 72
3 1189 188 270
3 188 669 270
3 669 188 574
3 302 669 574
3 224 302 574
3 302 224 1056
3 224 963 1056
3 963 1161 1056
3 1161 963 1084
3 63 1161 1084
3 1385 63 1084
3 63 1385 290
3 1385 200 290
3 200 935 290
3 935 200 857
3 1162 935 857
3 1078 1162 857
3 1162 1078 390
3 1078 308 390
3 308 826 390
3 826 308 739
3 255 826 739
3 172 255 739
3 255 172 543
3 172 450 543
3 450 72 543
3 72 450 1
3 618 1189 1005
3 1189 618 188
3 618 421 188
3 421 574 188
3 574 421 1045
3 224 574 1045
3 437 224 1045
3 224 437 963
3 437 1057 963
3 1057 1084 963
3 1084 1057 854
3 1385 1084 854
3 479 1385 854
3 1385 479 200
3 479 191 200
3 191 857 200
3 857 191 651
3 1078 857 651
3 886 1078 651
3 1078 886 308
3 886 6 308
3 6 739 308
3 739 6 1105
3 172 739 1105
3 1391 172 1105
3 172 1391 450
3 1391 1118 450
3 1118 1 450
3 1 1118 469
3 1005 726 472
3 618 1005 472
3 619 618 472
3 618 619 421
3 619 691 421
3 691 1045 421
3 1045 691 770
3 437 1045 770
3 1332 437 770
3 437 1332 1057
3 1332 1070 1057
3 1070 854 1057
3 854 1070 36
3 479 854 36
3 1273 479 36
3 479 1273 191
3 1273 1357 191
3 1357 651 191
3 651 1357 1350
3 886 651 1350
3 239 886 1350
3 886 239 6
3 239 1067 6
3 1067 1105 6
3 1105 1067 180
3 1391 1105 180
3 328 1391 180
3 1391 328 1118
3 328 55 1118
3 55 469 1118
3 469 55 232
3 717 1066 726
3 1066 472 726
3 472 1066 808
3 619 472 808
3 955 619 808
3 619 955 691
3 955 1023 691
3 1023 770 691
3 770 1023 1093
3 1332 770 1093
3 229 1332 1093
3 1332 229 1070
3 229 1374 1070
3 1374 36 1070
3 36 1374 344
3 1273 36 344
3 156 1273 344
3 1273 156 1357
3 156 261 1357
3 261 1350 1357
3 1350 261 260
3 239 1350 260
3 559 239 260
3 239 559 1067
3 559 1366 1067
3 1366 180 1067
3 180 1366 497
3 328 180 497
3 655 328 497
3 328 655 55
3 655 352 55
3 352 232 55
3 232 352 552
3 1381 717 778
3 717 1381 1066
3 1381 148 1066
3 148 808 1066
3 808 148 88
3 955 808 88
3 587 955 88
3 955 587 1023
3 587 208 1023
3 208 1093 1023
3 1093 208 1182
3 229 1093 1182
3 526 229 1182
3 229 526 1374
3 526 385 1374
3 385 344 1374
3 344 385 1110
3 156 344 1110
3 495 156 1110
3 156 495 261
3 495 449 261
3 449 260 261
3 260 449 648
3 559 260 648
3 1277 559 648
3 559 1277 1366
3 1277 106 1366
3 106 497 1366
3 497 106 335
3 655 497 335
3 1046 655 335
3 655 1046 352
3 1046 667 352
3 667 552 352
3 552 667 1010
3 778 18 139
3 1381 778 139
3 126 1381 139
3 1381 126 148
3 126 956 148
3 956 88 148
3 88 956 525
3 587 88 525
3 375 587 525
3 587 375 208
3 375 968 208
3 968 1182 208
3 1182 968 465
3 526 1182 465
3 301 526 465
3 526 301 385
3 301 1235 385
3 1235 1110 385
3 1110 1235 377
3 495 1110 377
3 1339 495 377
3 495 1339 449
3 1339 897 449
3 897 648 449
3 648 897 633
3 1277 648 633
3 281 1277 633
3 1277 281 106
3 281 766 106
3 766 335 106
3 335 766 183
3 1046 335 183
3 1028 1046 183
3 1046 1028 667
3 1028 81 667
3 81 1010 667
3 1010 81 1155
3 1266 916 18
3 916 139 18
3 139 916 40
3 126 139 40
3 606 126 40
3 126 606 956
3 606 733 956
3 733 525 956
3 525 733 787
3 375 525 787
3 394 375 787
3 375 394 968
3 394 228 968
3 228 465 968
3 465 228 824
3 301 465 824
3 240 301 824
3 301 240 1235
3 240 836 1235
3 836 377 1235
3 377 836 638
3 1339 377 638
3 266 1339 638
3 1339 266 897
3 266 1392 897
3 1392 633 897
3 633 1392 428
3 281 633 428
3 677 281 428
3 281 677 766
3 677 1221 766
3 1221 183 766
3 183 1221 878
3 1028 183 878
3 1207 1028 878
3 1028 1207 81
3 1207 882 81
3 882 1155 81
3 1155 882 263
3 1266 253 916
3 253 12 916
3 12 40 916
3 40 12 135
3 606 40 135
3 121 606 135
3 606 121 733
3 121 953 733
3 953 787 733
3 787 953 520
3 394 787 520
3 368 394 520
3 394 368 228
3 368 958 228
3 958 824 228
3 824 958 461
3 240 824 461
3 294 240 461
3 240 294 836
3 294 1239 836
3 1239 638 836
3 638 1239 369
3 266 638 369
3 1333 266 369
3 266 1333 1392
3 1333 893 1392
3 893 428 1392
3 428 893 621
3 677 428 621
3 277 677 621
3 677 277 1221
3 277 759 1221
3 759 878 1221
3 878 759 178
3 1207 878 178
3 1015 1207 178
3 1207 1015 882
3 1015 76 882
3 76 263 882
3 263 76 1147
3 253 195 12
3 195 830 12
3 830 135 12
3 135 830 1226
3 121 135 1226
3 839 121 1226
3 121 839 953
3 839 482 953
3 482 520 953
3 520 482 912
3 368 520 912
3 992 368 912
3 368 992 958
3 992 1358 958
3 1358 461 958
3 461 1358 496
3 294 461 496
3 1138 294 496
3 294 1138 1239
3 1138 284 1239
3 284 369 1239
3 369 284 659
3 1333 369 659
3 731 1333 659
3 1333 731 893
3 731 1168 893
3 1168 621 893
3 621 1168 1164
3 277 621 1164
3 413 277 1164
3 277 413 759
3 413 1185 759
3 1185 178 759
3 178 1185 24
3 1015 178 24
3 815 1015 24
3 1015 815 76
3 815 1375 76
3 1375 1147 76
3 1147 1375 47
3 195 1153 830
3 1153 355 830
3 355 1226 830
3 1226 355 1130
3 839 1226 1130
3 842 839 1130
3 839 842 482
3 842 109 482
3 109 912 482
3 912 109 823
3 992 912 823
3 164 992 823
3 992 164 1358
3 164 594 1358
3 594 496 1358
3 496 594 661
3 1138 496 661
3 216 1138 661
3 1138 216 284
3 216 276 284
3 276 659 284
3 659 276 349
3 731 659 349
3 66 731 349
3 731 66 1168
3 66 780 1168
3 780 1164 1168
3 1164 780 49
3 413 1164 49
3 1200 413 49
3 413 1200 1185
3 1200 154 1185
3 154 24 1185
3 24 154 828
3 815 24 828
3 69 815 828
3 815 69 1375
3 69 1328 1375
3 1328 47 1375
3 47 1328 1026
3 1153 463 355
3 463 1132 355
3 1132 1130 355
3 1130 1132 650
3 842 1130 650
3 1143 842 650
3 842 1143 109
3 1143 546 109
3 546 823 109
3 823 546 1090
3 164 823 1090
3 1175 164 1090
3 164 1175 594
3 1175 1295 594
3 1295 661 594
3 661 1295 868
3 216 661 868
3 884 216 868
3 216 884 276
3 884 821 276
3 821 349 276
3 349 821 946
3 66 349 946
3 684 66 946
3 66 684 780
3 684 115 780
3 115 49 780
3 49 115 613
3 1200 49 613
3 28 1200 613
3 1200 28 154
3 28 629 154
3 629 828 154
3 828 629 1288
3 69 828 1288
3 318 69 1288
3 69 318 1328
3 318 1335 1328
3 1335 1026 1328
3 1026 1335 861
3 463 697 1132
3 697 380 1132
3 380 650 1132
3 650 380 646
3 1143 650 646
3 365 1143 646
3 1143 365 546
3 365 965 546
3 965 1090 546
3 1090 965 628
3 1175 1090 628
3 1038 1175 628
3 1175 1038 1295
3 1038 1234 1295
3 1234 868 1295
3 868 1234 1108
3 884 868 1108
3 970 884 1108
3 884 970 821
3 970 843 821
3 843 946 821
3 946 843 1052
3 684 946 1052
3 1101 684 1052
3 684 1101 115
3 1101 1104 115
3 1104 613 115
3 613 1104 254
3 28 613 254
3 306 28 254
3 28 306 629
3 306 1320 629
3 1320 1288 629
3 1288 1320 1018
3 318 1288 1018
3 1233 318 1018
3 318 1233 1335
3 1233 57 1335
3 57 861 1335
3 861 57 786
3 697 101 380
3 101 168 380
3 168 646 380
3 646 168 1199
3 365 646 1199
3 1349 365 1199
3 365 1349 965
3 1349 460 965
3 460 628 965
3 628 460 415
3 1038 628 415
3 91 1038 415
3 1038 91 1234
3 91 17 1234
3 17 1108 1234
3 1108 17 1136
3 970 1108 1136
3 1361 970 1136
3 970 1361 843
3 1361 1074 843
3 1074 1052 843
3 1052 1074 978
3 1101 1052 978
3 991 1101 978
3 1101 991 1104
3 991 936 1104
3 936 254 1104
3 254 936 54
3 306 254 54
3 225 306 54
3 306 225 1320
3 225 133 1320
3 133 1018 1320
3 1018 133 204
3 1233 1018 204
3 1386 1233 204
3 1233 1386 57
3 1386 223 57
3 223 786 57
3 786 223 892
3 101 889 168
3 889 23 168
3 23 1199 168
3 1199 23 1302
3 1349 1199 1302
3 1324 1349 1302
3 1349 1324 460
3 1324 765 460
3 765 415 460
3 415 765 1281
3 91 415 1281
3 798 91 1281
3 91 798 17
3 798 436 17
3 436 1136 17
3 1136 436 1383
3 1361 1136 1383
3 617 1361 1383
3 1361 617 1074
3 617 130 1074
3 130 978 1074
3 978 130 1225
3 991 978 1225
3 734 991 1225
3 991 734 936
3 734 1252 936
3 1252 54 936
3 54 1252 1356
3 225 54 1356
3 707 225 1356
3 225 707 133
3 707 1240 133
3 1240 204 133
3 204 1240 1107
3 1386 204 1107
3 184 1386 1107
3 1386 184 223
3 184 1250 223
3 1250 892 223
3 892 1250 1030
3 889 1099 23
3 1099 1193 23
3 1193 1302 23
3 1302 1193 1313
3 1324 1302 1313
3 404 1324 1313
3 1324 404 765
3 404 1270 765
3 1270 1281 765
3 1281 1270 592
3 798 1281 592
3 529 798 592
3 798 529 436
3 529 590 436
3 590 1383 436
3 1383 590 797
3 617 1383 797
3 995 617 797
3 617 995 130
3 995 93 130
3 93 1225 130
3 1225 93 159
3 734 1225 159
3 96 734 159
3 734 96 1252
3 96 524 1252
3 524 1356 1252
3 1356 524 288
3 707 1356 288
3 813 707 288
3 707 813 1240
3 813 940 1240
3 940 1107 1240
3 1107 940 1042
3 184 1107 1042
3 1019 184 1042
3 184 1019 1250
3 1019 1216 1250
3 1216 1030 1250
3 1030 1216 560
3 1266 18 258
3 18 152 258
3 152 18 778
3 748 152 778
3 717 748 778
3 748 717 370
3 717 726 370
3 726 952 370
3 952 726 1005
3 849 952 1005
3 1189 849 1005
3 849 1189 1254
3 1189 270 1254
3 270 97 1254
3 97 270 1069
3 357 97 1069
3 151 357 1069
3 357 151 145
3 151 924 145
3 924 193 145
3 193 924 1301
3 1024 193 1301
3 1001 1024 1301
3 1024 1001 572
3 1001 65 572
3 65 779 572
3 779 65 15
3 624 779 15
3 1125 624 15
3 624 1125 511
3 1125 899 511
3 899 1340 511
3 1340 899 784
3 583 1340 784
3 108 583 784
3 583 108 930
3 108 1378 930
3 1378 522 930
3 522 1378 197
3 673 522 197
3 665 673 197
3 673 665 829
3 665 1150 829
3 1150 498 829
3 498 1150 128
3 711 498 128
3 835 711 128
3 711 835 230
3 835 852 230
3 852 85 230
3 85 852 1122
3 59 85 1122
3 79 59 1122
3 59 79 444
3 79 974 444
3 974 20 444
3 20 974 811
3 891 20 811
3 340 891 811
3 891 340 565
3 340 890 565
3 890 317 565
3 317 890 72
3 214 317 72
3 1 214 72
3 214 1 119
3 1 469 119
3 469 75 119
3 75 469 232
3 1308 75 232
3 552 1308 232
3 1308 552 202
3 552 1010 202
3 1010 427 202
3 427 1010 1155
3 799 427 1155
3 263 799 1155
3 799 263 1306
3 263 1147 1306
3 1147 792 1306
3 792 1147 47
3 1300 792 47
3 1026 1300 47
3 1300 1026 703
3 1026 861 703
3 861 1117 703
3 1117 861 786
3 506 1117 786
3 892 506 786
3 506 892 149
3 892 1030 149
3 1030 1276 149
3 1276 1030 560
3 500 801 1131
3 801 474 1131
3 474 801 1091
3 517 500 649
3 500 517 801
3 517 161 801
3 161 1091 801
3 1091 161 326
3 649 915 571
3 517 649 571
3 922 517 571
3 517 922 161
3 922 863 161
3 863 326 161
3 326 863 299
3 1141 455 915
3 455 571 915
3 571 455 42
3 922 571 42
3 462 922 42
3 922 462 863
3 462 1170 863
3 1170 299 863
3 299 1170 316
3 845 1141 1209
3 1141 845 455
3 845 429 455
3 429 42 455
3 42 429 862
3 462 42 862
3 433 462 862
3 462 433 1170
3 433 846 1170
3 846 316 1170
3 316 846 1211
3 1209 120 132
3 845 1209 132
3 761 845 132
3 845 761 429
3 761 1204 429
3 1204 862 429
3 862 1204 464
3 433 862 464
3 1205 433 464
3 433 1205 846
3 1205 762 846
3 762 1211 846
3 1211 762 131
3 1311 534 120
3 534 132 120
3 132 534 535
3 761 132 535
3 1173 761 535
3 761 1173 1204
3 1173 166 1204
3 166 464 1204
3 464 166 880
3 1205 464 880
3 167 1205 880
3 1205 167 762
3 167 1177 762
3 1177 131 762
3 131 1177 541
3 269 1311 747
3 1311 269 534
3 269 86 534
3 86 535 534
3 535 86 1255
3 1173 535 1255
3 448 1173 1255
3 1173 448 166
3 448 211 166
3 211 880 166
3 880 211 1196
3 167 880 1196
3 210 167 1196
3 167 210 1177
3 210 453 1177
3 453 541 1177
3 541 453 1268
3 747 701 562
3 269 747 562
3 31 269 562
3 269 31 86
3 31 744 86
3 744 1255 86
3 1255 744 305
3 448 1255 305
3 972 448 305
3 448 972 211
3 972 99 211
3 99 1196 211
3 1196 99 1112
3 210 1196 1112
3 100 210 1112
3 210 100 453
3 100 973 453
3 973 1268 453
3 1268 973 311
3 1354 116 701
3 116 562 701
3 562 116 423
3 31 562 423
3 238 31 423
3 31 238 744
3 238 990 744
3 990 305 744
3 305 990 434
3 972 305 434
3 348 972 434
3 972 348 99
3 348 509 99
3 509 1112 99
3 1112 509 715
3 100 1112 715
3 510 100 715
3 100 510 973
3 510 347 973
3 347 311 973
3 311 347 439
3 41 1354 1393
3 1354 41 116
3 41 1283 116
3 1283 423 116
3 423 1283 1006
3 238 423 1006
3 45 238 1006
3 238 45 990
3 45 1241 990
3 1241 434 990
3 434 1241 876
3 348 434 876
3 910 348 876
3 348 910 509
3 910 905 509
3 905 715 509
3 715 905 1152
3 510 715 1152
3 906 510 1152
3 510 906 347
3 906 911 347
3 911 439 347
3 439 911 875
3 1393 1253 920
3 41 1393 920
3 689 41 920
3 41 689 1283
3 689 354 1283
3 354 1006 1283
3 1006 354 163
3 45 1006 163
3 909 45 163
3 45 909 1241
3 909 484 1241
3 484 876 1241
3 876 484 1075
3 910 876 1075
3 783 910 1075
3 910 783 905
3 783 486 905
3 486 1152 905
3 1152 486 773
3 906 1152 773
3 485 906 773
3 906 485 911
3 485 782 911
3 782 875 911
3 875 782 1076
3 189 1183 1253
3 1183 920 1253
3 920 1183 848
3 689 920 848
3 598 689 848
3 689 598 354
3 598 291 354
3 291 163 354
3 163 291 74
3 909 163 74
3 841 909 74
3 909 841 484
3 841 395 484
3 395 1075 484
3 1075 395 983
3 783 1075 983
3 694 783 983
3 783 694 486
3 694 397 486
3 397 773 486
3 773 397 676
3 485 773 676
3 396 485 676
3 485 396 782
3 396 693 782
3 693 1076 782
3 1076 693 982
3 417 189 1034
3 189 417 1183
3 417 610 1183
3 610 848 1183
3 848 610 993
3 598 848 993
3 945 598 993
3 598 945 291
3 945 834 291
3 834 74 291
3 74 834 250
3 841 74 250
3 1139 841 250
3 841 1139 395
3 1139 50 395
3 50 983 395
3 983 50 70
3 694 983 70
3 34 694 70
3 694 34 397
3 34 998 397
3 998 676 397
3 676 998 716
3 396 676 716
3 1007 396 716
3 396 1007 693
3 1007 39 693
3 39 982 693
3 982 39 71
3 1034 1315 752
3 417 1034 752
3 687 417 752
3 417 687 610
3 687 614 610
3 614 993 610
3 993 614 466
3 945 993 466
3 721 945 466
3 945 721 834
3 721 363 834
3 363 250 834
3 250 363 407
3 1139 250 407
3 690 1139 407
3 1139 690 50
3 690 123 50
3 123 70 50
3 70 123 314
3 34 70 314
3 944 34 314
3 34 944 998
3 944 769 998
3 769 716 998
3 716 769 82
3 1007 716 82
3 777 1007 82
3 1007 777 39
3 777 951 39
3 951 71 39
3 71 951 313
3 1371 220 1315
3 220 752 1315
3 752 220 1088
3 687 752 1088
3 1012 687 1088
3 687 1012 614
3 1012 938 614
3 938 466 614
3 466 938 804
3 721 466 804
3 1059 721 804
3 721 1059 363
3 1059 709 363
3 709 407 363
3 407 709 742
3 690 407 742
3 1022 690 742
3 690 1022 123
3 1022 441 123
3 441 314 123
3 314 441 635
3 944 314 635
3 1285 944 635
3 944 1285 769
3 1285 1097 769
3 1097 82 769
3 82 1097 406
3 777 82 406
3 1096 777 406
3 777 1096 951
3 1096 1284 951
3 1284 313 951
3 313 1284 640
3 381 1371 1103
3 1371 381 220
3 381 519 220
3 519 1088 220
3 1088 519 1174
3 1012 1088 1174
3 205 1012 1174
3 1012 205 938
3 205 580 938
3 580 804 938
3 804 580 80
3 1059 804 80
3 142 1059 80
3 1059 142 709
3 142 1382 709
3 1382 742 709
3 742 1382 1121
3 1022 742 1121
3 147 1022 1121
3 1022 147 441
3 147 1344 441
3 1344 635 441
3 635 1344 1004
3 1285 635 1004
3 1035 1285 1004
3 1285 1035 1097
3 1035 1032 1097
3 1032 406 1097
3 406 1032 1263
3 1096 406 1263
3 1033 1096 1263
3 1096 1033 1284
3 1033 1036 1284
3 1036 640 1284
3 640 1036 1003
3 1103 1330 376
3 381 1103 376
3 1236 381 376
3 381 1236 519
3 1236 297 519
3 297 1174 519
3 1174 297 459
3 205 1174 459
3 969 205 459
3 205 969 580
3 969 374 580
3 374 80 580
3 80 374 518
3 142 80 518
3 950 142 518
3 142 950 1382
3 950 127 1382
3 127 1121 1382
3 1121 127 140
3 147 1121 140
3 19 147 140
3 147 19 1344
3 19 251 1344
3 251 1004 1344
3 1004 251 1203
3 1035 1004 1203
3 680 1035 1203
3 1035 680 1032
3 680 719 1032
3 719 1263 1032
3 1263 719 727
3 1033 1263 727
3 720 1033 727
3 1033 720 1036
3 720 681 1036
3 681 1003 1036
3 1003 681 1202
3 1388 265 1330
3 265 376 1330
3 376 265 632
3 1236 376 632
3 832 1236 632
3 1236 832 297
3 832 235 297
3 235 459 297
3 459 235 817
3 969 459 817
3 219 969 817
3 969 219 374
3 219 389 374
3 389 518 374
3 518 389 785
3 950 518 785
3 729 950 785
3 950 729 127
3 729 601 127
3 601 140 127
3 140 601 35
3 19 140 35
3 907 19 35
3 19 907 251
3 907 1265 251
3 1265 1203 251
3 1203 1265 1294
3 680 1203 1294
3 1245 680 1294
3 680 1245 719
3 1245 789 719
3 789 727 719
3 727 789 480
3 720 727 480
3 788 720 480
3 720 788 681
3 788 1246 681
3 1246 1202 681
3 1202 1246 1293
3 894 1388 622
3 1388 894 265
3 894 1321 265
3 1321 632 265
3 632 1321 361
3 832 632 361
3 1231 832 361
3 832 1231 235
3 1231 293 235
3 293 817 235
3 817 293 454
3 219 817 454
3 959 219 454
3 219 959 389
3 959 367 389
3 367 785 389
3 785 367 513
3 729 785 513
3 954 729 513
3 729 954 601
3 954 122 601
3 122 35 601
3 35 122 136
3 907 35 136
3 13 907 136
3 907 13 1265
3 13 252 1265
3 252 1294 1265
3 1294 252 1198
3 1245 1294 1198
3 685 1245 1198
3 1245 685 789
3 685 713 789
3 713 480 789
3 480 713 723
3 788 480 723
3 714 788 723
3 788 714 1246
3 714 686 1246
3 686 1293 1246
3 1293 686 1197
3 622 408 1149
3 894 622 1149
3 1167 894 1149
3 894 1167 1321
3 1167 730 1321
3 730 361 1321
3 361 730 652
3 1231 361 652
3 279 1231 652
3 1231 279 293
3 279 1137 293
3 1137 454 293
3 454 1137 490
3 959 454 490
3 1355 959 490
3 959 1355 367
3 1355 986 367
3 986 513 367
3 513 986 903
3 954 513 903
3 481 954 903
3 954 481 122
3 481 838 122
3 838 136 122
3 136 838 1227
3 13 136 1227
3 822 13 1227
3 13 822 252
3 822 196 252
3 196 1198 252
3 1198 196 1192
3 685 1198 1192
3 600 685 1192
3 685 600 713
3 600 505 713
3 505 723 713
3 723 505 14
3 714 723 14
3 504 714 14
3 714 504 686
3 504 599 686
3 599 1197 686
3 1197 599 1191
3 155 1195 408
3 1195 1149 408
3 1149 1195 43
3 1167 1149 43
3 774 1167 43
3 1167 774 730
3 774 64 730
3 64 652 730
3 652 64 350
3 279 652 350
3 267 279 350
3 279 267 1137
3 267 209 1137
3 209 490 1137
3 490 209 653
3 1355 490 653
3 584 1355 653
3 1355 584 986
3 584 157 986
3 157 903 986
3 903 157 816
3 481 903 816
3 104 481 816
3 481 104 838
3 104 837 838
3 837 1227 838
3 1227 837 1126
3 822 1227 1126
3 356 822 1126
3 822 356 196
3 356 1144 196
3 1144 1192 196
3 1192 1144 805
3 600 1192 805
3 627 600 805
3 600 627 505
3 627 942 505
3 942 14 505
3 14 942 1267
3 504 14 1267
3 943 504 1267
3 504 943 599
3 943 626 599
3 626 1191 599
3 1191 626 810
3 620 155 1289
3 155 620 1195
3 620 1116 1195
3 1116 43 1195
3 43 1116 274
3 774 43 274
3 110 774 274
3 774 110 64
3 110 671 64
3 671 350 64
3 350 671 928
3 267 350 928
3 806 267 928
3 267 806 209
3 806 877 209
3 877 653 209
3 653 877 865
3 584 653 865
3 1287 584 865
3 584 1287 157
3 1287 1166 157
3 1166 816 157
3 816 1166 1080
3 104 816 1080
3 540 104 1080
3 104 540 837
3 540 51 837
3 51 1126 837
3 1126 51 987
3 356 1126 987
3 1128 356 987
3 356 1128 1144
3 1128 457 1144
3 457 805 1144
3 805 457 331
3 627 805 331
3 775 627 331
3 627 775 942
3 775 1237 942
3 1237 1267 942
3 1267 1237 639
3 943 1267 639
3 1238 943 639
3 943 1238 626
3 1238 776 626
3 776 810 626
3 810 776 336
3 1289 873 999
3 620 1289 999
3 1309 620 999
3 620 1309 1116
3 1309 1053 1116
3 1053 274 1116
3 274 1053 222
3 110 274 222
3 364 110 222
3 110 364 671
3 364 1072 671
3 1072 928 671
3 928 1072 1014
3 806 928 1014
3 802 806 1014
3 806 802 877
3 802 926 877
3 926 865 877
3 865 926 1073
3 1287 865 1073
3 1210 1287 1073
3 1287 1210 1166
3 1210 997 1166
3 997 1080 1166
3 1080 997 593
3 540 1080 593
3 932 540 593
3 540 932 51
3 932 342 51
3 342 987 51
3 987 342 611
3 1128 987 611
3 351 1128 611
3 1128 351 457
3 351 675 457
3 675 331 457
3 331 675 803
3 775 331 803
3 1244 775 803
3 775 1244 1237
3 1244 158 1237
3 158 639 1237
3 639 158 844
3 1238 639 844
3 165 1238 844
3 1238 165 776
3 165 1249 776
3 1249 336 776
3 336 1249 820
3 957 708 873
3 708 999 873
3 999 708 581
3 1309 999 581
3 864 1309 581
3 1309 864 1053
3 864 597 1053
3 597 222 1053
3 222 597 26
3 364 222 26
3 902 364 26
3 364 902 1072
3 902 948 1072
3 948 1014 1072
3 1014 948 588
3 802 1014 588
3 679 802 588
3 802 679 926
3 679 1327 926
3 1327 1073 926
3 1073 1327 1111
3 1210 1073 1111
3 1390 1210 1111
3 1210 1390 997
3 1390 387 997
3 387 593 997
3 593 387 383
3 932 593 383
3 425 932 383
3 932 425 342
3 425 1322 342
3 1322 611 342
3 611 1322 402
3 351 611 402
3 137 351 402
3 351 137 675
3 137 73 675
3 73 803 675
3 803 73 307
3 1244 803 307
3 67 1244 307
3 1244 67 158
3 67 1181 158
3 1181 844 158
3 844 1181 545
3 165 844 545
3 1187 165 545
3 165 1187 1249
3 1187 1176 1249
3 1176 820 1249
3 820 1176 321
3 557 957 324
3 957 557 708
3 557 570 708
3 570 581 708
3 581 570 1092
3 864 581 1092
3 869 864 1092
3 864 869 597
3 869 332 597
3 332 26 597
3 26 332 996
3 902 26 996
3 1220 902 996
3 902 1220 948
3 1220 705 948
3 705 588 948
3 588 705 1201
3 679 588 1201
3 98 679 1201
3 679 98 1327
3 98 573 1327
3 573 1111 1327
3 1111 573 1346
3 1390 1111 1346
3 399 1390 1346
3 1390 399 387
3 399 757 387
3 757 383 387
3 383 757 1243
3 425 383 1243
3 728 425 1243
3 425 728 1322
3 728 1304 1322
3 1304 402 1322
3 402 1304 1280
3 137 402 1280
3 0 137 1280
3 137 0 73
3 0 870 73
3 870 307 73
3 307 870 1058
3 67 307 1058
3 1395 67 1058
3 67 1395 1181
3 1395 1303 1181
3 1303 545 1181
3 545 1303 718
3 1187 545 718
3 1307 1187 718
3 1187 1307 1176
3 1307 1398 1176
3 1398 321 1176
3 321 1398 1071
3 324 475 561
3 557 324 561
3 1217 557 561
3 557 1217 570
3 1217 1020 570
3 1020 1092 570
3 1092 1020 1043
3 869 1092 1043
3 941 869 1043
3 869 941 332
3 941 814 332
3 814 996 332
3 996 814 287
3 1220 996 287
3 523 1220 287
3 1220 523 705
3 523 95 705
3 95 1201 705
3 1201 95 160
3 98 1201 160
3 92 98 160
3 98 92 573
3 92 994 573
3 994 1346 573
3 1346 994 796
3 399 1346 796
3 589 399 796
3 399 589 757
3 589 530 757
3 530 1243 757
3 1243 530 591
3 728 1243 591
3 1269 728 591
3 728 1269 1304
3 1269 393 1304
3 393 1280 1304
3 1280 393 1314
3 0 1280 1314
3 1194 0 1314
3 0 1194 870
3 1194 1100 870
3 1100 1058 870
3 1058 1100 1124
3 1395 1058 1124
3 901 1395 1124
3 1395 901 1303
3 901 1224 1303
3 1224 718 1303
3 718 1224 962
3 1307 718 962
3 1223 1307 962
3 1307 1223 1398
3 1223 900 1398
3 900 1071 1398
3 1071 900 1123
3 1099 889 1123
3 889 1071 1123
3 1071 889 101
3 321 1071 101
3 697 321 101
3 321 697 820
3 697 463 820
3 463 336 820
3 336 463 1153
3 810 336 1153
3 195 810 1153
3 810 195 1191
3 195 253 1191
3 253 1197 1191
3 1197 253 1266
3 1293 1197 1266
3 258 1293 1266
3 1293 258 1202
3 258 1345 1202
3 1345 1003 1202
3 1003 1345 447
3 640 1003 447
3 124 640 447
3 640 124 313
3 124 58 313
3 58 71 313
3 71 58 405
3 982 71 405
3 488 982 405
3 982 488 1076
3 488 1242 1076
3 1242 875 1076
3 875 1242 1002
3 439 875 1002
3 743 439 1002
3 439 743 311
3 743 87 311
3 87 1268 311
3 1268 87 539
3 541 1268 539
3 129 541 539
3 541 129 131
3 129 668 131
3 668 1211 131
3 1211 668 674
3 316 1211 674
3 243 316 674
3 316 243 299
3 243 688 299
3 688 326 299
3 326 688 582
3 1091 326 582
3 755 1091 582
3 1091 755 474
3 755 522 474
3 522 1131 474
3 1131 522 866
3 500 1131 866
3 27 500 866
3 500 27 649
3 27 508 649
3 508 915 649
3 915 508 851
3 1141 915 851
3 741 1141 851
3 1141 741 1209
3 741 663 1209
3 663 120 1209
3 120 663 904
3 1311 120 904
3 226 1311 904
3 1311 226 747
3 226 1292 747
3 1292 701 747
3 701 1292 113
3 1354 701 113
3 1184 1354 113
3 1354 1184 1393
3 1184 468 1393
3 468 1253 1393
3 1253 468 271
3 189 1253 271
3 575 189 271
3 189 575 1034
3 575 432 1034
3 432 1315 1034
3 1315 432 1065
3 1371 1315 1065
3 337 1371 1065
3 1371 337 1103
3 337 494 1103
3 494 1330 1103
3 1330 494 898
3 1388 1330 898
3 420 1388 898
3 1388 420 622
3 420 278 622
3 278 408 622
3 408 278 1180
3 155 408 1180
3 819 155 1180
3 155 819 1289
3 819 315 1289
3 315 873 1289
3 873 315 431
3 957 873 431
3 1298 957 431
3 957 1298 324
3 1298 1276 324
3 1276 475 324
3 475 1276 560
