OFF

86 168 0
-0.388364 -0.033589 0.021854
-0.417404 -0.039887 0.017620
-0.462194 0.022088 0.037417
-0.367074 -0.024968 -0.002598
-0.413732 0.013102 0.039461
-0.403842 0.006323 0.045507
-0.359639 0.007496 0.035464
-0.420500 0.008153 0.038752
-0.376998 -0.000061 0.046161
-0.417510 0.004582 0.042710
-0.359618 -0.007595 0.035480
-0.417497 -0.004824 0.042720
-0.413696 -0.013360 0.039489
-0.411279 -0.000104 0.050258
-0.432842 0.019276 0.039745
-0.403822 0.005971 0.049964
-0.367142 0.024748 -0.002651
-0.374067 0.006841 0.042862
-0.376878 0.006983 0.043784
-0.424156 -0.021434 0.034139
-0.411450 0.004671 0.045389
-0.357803 0.007917 0.025719
-0.363967 0.016418 0.034641
-0.386073 0.006921 0.047938
-0.430225 -0.031927 0.025377
-0.464652 -0.000182 0.045196
-0.411437 -0.004889 0.045399
-0.395243 -0.000084 0.048183
-0.417512 0.039377 0.017536
-0.426713 -0.000130 0.045407
-0.370992 0.008640 0.040140
-0.430312 0.031613 0.025310
-0.401922 -0.014200 0.041135
-0.407656 0.025026 0.037955
-0.421559 0.029131 0.028979
-0.362536 0.007926 0.038174
-0.418439 -0.000117 0.047028
-0.393235 -0.022147 0.036460
-0.405208 -0.032587 0.032279
-0.428801 -0.010239 0.043904
-0.406404 -0.000095 0.052356
-0.388456 0.033382 0.021782
-0.401973 0.014248 0.041120
-0.424214 0.021157 0.034094
-0.374048 -0.006964 0.042877
-0.396307 0.007446 0.047777
-0.400132 0.009642 0.046236
-0.395388 0.009717 0.041990
-0.385325 -0.016065 0.036388
-0.396287 -0.007619 0.047793
-0.387188 -0.000075 0.046811
-0.421479 -0.029412 0.029041
-0.370968 -0.008759 0.040158
-0.403805 -0.006160 0.049977
-0.398588 0.005630 0.053012
-0.357190 -0.000085 0.008563
-0.374496 -0.032635 0.014351
-0.386054 -0.007066 0.047953
-0.371626 -0.000059 0.041412
-0.376858 -0.007112 0.043799
-0.428829 0.009969 0.043882
-0.357233 -0.007315 0.025719
-0.415443 -0.020722 0.036058
-0.398572 -0.005799 0.053024
-0.363923 -0.016531 0.034676
-0.415499 0.020472 0.036014
-0.362330 -0.000048 0.040124
-0.373044 -0.000058 0.044614
-0.380570 -0.000068 0.044914
-0.432789 -0.019565 0.039786
-0.367174 -0.024376 0.026902
-0.405297 0.032357 0.032210
-0.359035 -0.000047 0.036899
-0.420478 -0.008411 0.038770
-0.403825 -0.006521 0.045521
-0.435062 -0.000138 0.048519
-0.400105 -0.009827 0.046257
-0.362514 -0.008027 0.038191
-0.367240 0.024237 0.026850
-0.393296 0.021958 0.036413
-0.407240 -0.024416 0.038257
-0.395361 -0.009900 0.042011
-0.385546 0.015897 0.036359
-0.397394 -0.000080 0.054710
-0.374584 0.032451 0.014282
-0.400251 -0.000083 0.055673
3 25 28 2
3 25 24 28
3 24 1 28
3 1 3 28
3 3 16 28
3 1 56 3
3 16 84 28
3 28 31 2
3 3 55 16
3 25 69 24
3 1 0 56
3 1 38 0
3 84 41 28
3 41 71 28
3 3 61 55
3 51 19 62
3 19 73 62
3 38 1 80
3 53 49 76
3 49 53 63
3 69 73 19
3 73 69 39
3 51 80 1
3 80 51 62
3 70 0 37
3 0 70 56
3 12 73 11
3 73 12 62
3 12 26 74
3 26 12 11
3 80 74 32
3 74 80 12
3 32 53 76
3 53 32 74
3 57 37 81
3 37 57 48
3 37 38 81
3 38 37 0
3 38 32 81
3 32 38 80
3 64 10 70
3 10 64 77
3 70 48 64
3 48 70 37
3 52 48 44
3 48 52 64
3 69 25 75
3 39 75 29
3 75 39 69
3 11 29 36
3 29 11 39
3 13 74 26
3 74 13 53
3 26 36 13
3 36 26 11
3 63 40 85
3 40 63 53
3 57 27 50
3 27 57 81
3 44 8 67
3 8 44 59
3 52 67 58
3 67 52 44
3 77 58 66
3 58 77 52
3 10 66 72
3 66 10 77
3 24 51 1
3 51 24 19
3 80 62 12
3 11 73 39
3 81 76 49
3 76 81 32
3 52 77 64
3 48 59 44
3 40 53 13
3 83 63 85
3 63 27 49
3 49 27 81
3 27 63 83
3 57 68 48
3 68 59 48
3 68 57 50
3 8 59 68
3 24 69 19
3 3 70 61
3 70 3 56
3 61 72 55
3 72 61 10
3 10 61 70
3 34 65 43
3 43 65 7
3 71 33 28
3 15 46 45
3 45 54 15
3 14 43 7
3 7 60 14
3 34 28 33
3 33 65 34
3 78 79 41
3 41 84 78
3 4 9 7
3 7 65 4
3 4 5 20
3 20 9 4
3 33 42 5
3 5 4 33
3 42 46 15
3 15 5 42
3 23 47 79
3 79 82 23
3 79 47 71
3 71 41 79
3 71 47 42
3 42 33 71
3 22 78 6
3 6 35 22
3 78 22 82
3 82 79 78
3 30 17 82
3 82 22 30
3 14 75 25
3 25 2 14
3 60 29 75
3 75 14 60
3 9 36 29
3 29 60 9
3 13 20 5
3 5 15 13
3 20 13 36
3 36 9 20
3 54 85 40
3 40 15 54
3 23 50 27
3 27 47 23
3 17 67 8
3 8 18 17
3 30 58 67
3 67 17 30
3 35 66 58
3 58 30 35
3 6 72 66
3 66 35 6
3 31 28 34
3 34 43 31
3 31 14 2
3 33 4 65
3 9 60 7
3 47 45 46
3 46 42 47
3 30 22 35
3 82 17 18
3 40 13 15
3 83 85 54
3 54 45 27
3 45 47 27
3 27 83 54
3 23 82 68
3 68 82 18
3 68 50 23
3 8 68 18
3 31 43 14
3 16 21 78
3 78 84 16
3 21 55 72
3 72 6 21
3 6 78 21
3 21 16 55
