OFF

32 60 0
0.036512 -0.026633 0.033418
0.022917 -0.010766 0.029141
0.019702 -0.008094 0.025593
0.011263 -0.007687 0.000771
0.011621 -0.010218 -0.004078
0.022839 -0.030228 -0.016788
0.026275 -0.034462 -0.016232
0.016794 -0.021425 -0.014587
0.012698 -0.013451 -0.008379
0.312922 0.221347 -0.102718
0.327657 0.217453 -0.066848
0.016853 -0.006217 0.021296
0.033306 -0.022223 0.033979
0.012732 -0.005128 0.011264
0.014495 -0.005214 0.016449
0.026356 -0.014112 0.031791
0.331170 0.213578 -0.065216
0.315749 0.214323 -0.110571
0.320933 0.205748 -0.114866
0.312938 0.225600 -0.092682
0.324218 0.220800 -0.069499
0.318095 0.210140 -0.113227
0.313999 0.218114 -0.107018
0.318154 0.225348 -0.077344
0.029870 -0.017988 0.033424
0.014448 -0.017242 -0.011932
0.019632 -0.025817 -0.016226
0.321003 0.223471 -0.073047
0.334607 0.209343 -0.064660
0.011638 -0.005965 0.005958
0.314032 0.226437 -0.087376
0.315796 0.226351 -0.082190
3 6 28 0
3 6 18 28
3 18 16 28
3 18 22 16
3 22 9 16
3 9 19 16
3 19 30 16
3 30 10 16
3 6 5 18
3 28 12 0
3 9 3 19
3 9 4 3
3 5 26 18
3 30 27 10
3 0 7 6
3 0 14 7
3 26 21 18
3 1 27 2
3 1 20 27
3 1 15 20
3 15 10 20
3 27 23 2
3 23 11 2
3 15 16 10
3 22 8 9
3 8 4 9
3 3 29 19
3 29 30 19
3 0 12 24
3 29 3 13
3 1 14 0
3 6 26 5
3 26 6 7
3 8 25 7
3 13 3 14
3 7 4 8
3 14 4 7
3 1 0 24
3 11 1 2
3 3 4 14
3 11 14 1
3 1 24 15
3 18 21 17
3 22 18 17
3 23 27 30
3 23 30 31
3 20 10 27
3 26 7 21
3 7 25 17
3 25 8 22
3 29 13 30
3 13 14 31
3 14 11 23
3 15 24 16
3 24 12 28
3 21 7 17
3 17 25 22
3 30 13 31
3 31 14 23
3 16 24 28
