OFF
1426 2790 0
0.3539035897 -0.4085604699 0.1132176015
-0.3490427417 -0.3631537419 0.0236774783
0.1734005289 0.4013695722 -0.1001690875
-0.2071813196 0.4133730028 0.0205024393
0.2826430053 -0.1056086010 0.2094972545
-0.3966940163 -0.2334256927 0.1115359885
-0.2584662020 0.1469409919 -0.2768203789
0.4757110929 0.0235866024 -0.1314239743
-0.1845159628 -0.0422433183 -0.3975124819
0.4344924184 -0.0340773808 -0.1823368600
-0.4097385140 0.1248892808 0.2164688904
-0.4554536304 0.1510626907 -0.0672947290
0.1606835588 0.2307559173 -0.2499400114
0.1498086185 0.1022723997 -0.2695679731
-0.0958509372 -0.2456882940 -0.3465557840
-0.3589193329 0.3218541497 0.0420672510
-0.0414301469 0.2127966613 -0.2471381254
-0.0717156085 -0.1418190606 -0.3538773091
-0.1672639705 0.3299425937 0.1710171270
-0.4603980306 0.1654073813 0.0617117904
0.1174934647 -0.4213818278 -0.2202179213
0.2875926385 0.1223355116 -0.2610277323
-0.0825992191 0.2232830719 -0.2438972803
-0.4252109568 0.1334279430 -0.1576863991
-0.0192553882 -0.4010016847 -0.1024330137
0.0057289822 0.0875832242 -0.3499016002
-0.0002966090 0.2016317674 -0.2491358436
-0.0192326440 -0.3919070682 0.2937955985
0.1574363770 0.0427742381 -0.2706910810
0.1358013569 0.0853677376 0.2612050927
0.3300842888 0.3242222421 -0.1087527197
-0.1194118520 0.3418603099 0.1801779820
-0.4161115176 0.2628878451 0.0512536174
0.1113279878 0.1586442841 0.2799095993
-0.1077793231 -0.0841547517 0.4239045747
0.4109968758 0.1081488585 0.1058154522
0.2784022476 0.3212152159 0.0338959125
0.2209402770 0.3252551982 0.1058839007
0.1698075704 -0.1098015795 -0.2239510635
-0.2108042009 -0.0564513555 0.4275993462
-0.2191259453 0.1395866247 -0.3044793124
0.1560324881 0.0799561378 0.2566466791
-0.3659803631 -0.1618478395 0.2397690827
-0.0504727118 -0.0542685275 -0.3515357815
0.2943207359 -0.0564420969 0.2084287560
0.1512704367 0.3369046274 0.0450270447
-0.2253299444 0.3795678893 0.1337825378
-0.1253489936 0.2392456704 0.3568923243
-0.1114538371 0.3492750021 -0.1779868153
0.3034368129 -0.0111917678 0.1920036343
0.3709505309 0.0105507456 0.1566331084
-0.1356295976 -0.2649910747 0.3624369209
-0.0507919110 -0.3938945095 -0.2087153880
0.4685785756 -0.1939569355 0.2948341605
0.3794616490 0.0160471515 -0.1919427388
0.3523316921 0.3271403760 -0.1131438415
0.3187009682 0.1413599976 0.1985556290
0.0210403300 0.3978919545 -0.0759902132
0.2361013057 -0.2197200681 -0.1803660946
-0.2484066912 0.4540872192 -0.0454380306
0.4064449020 -0.1524423525 0.2375476302
-0.0369326008 0.0994587598 -0.3639793383
-0.3076127953 -0.2626828720 0.1877577160
-0.3534339974 0.1467948527 0.2829988991
-0.1920991403 0.0339081153 0.3995454797
0.0312980853 0.0758825780 -0.2897027338
-0.2123107858 0.3712370785 0.2759136849
-0.4857602988 -0.0718486955 -0.0565123472
-0.3504942524 0.2846287495 -0.2103559150
0.4516564411 0.0078806776 0.0932098276
-0.0236968773 -0.4637173302 0.2062100264
0.1806560451 -0.0613132729 -0.2313288960
-0.2086896969 0.3390586267 0.1748997313
-0.3973377288 -0.1707654347 0.1715838986
-0.2811953315 -0.3979650379 0.1198271758
0.2735414800 -0.3785246878 0.1177820458
-0.4313577339 -0.2201709330 -0.0382681083
0.3234883117 -0.0161179172 0.1846037387
-0.3063874819 -0.1475244308 -0.2703564990
-0.2173653746 0.4324830512 -0.1192612670
0.3186446730 -0.0427199888 -0.2175159891
-0.2198064028 -0.4137824299 -0.0965550753
-0.2885490264 -0.3833277539 0.0170039533
0.0738664472 -0.3098451143 -0.2613044864
0.4881729675 0.2528426642 -0.1171699344
-0.2412075353 -0.3105493682 0.2998896830
-0.4047049496 -0.0528409402 0.2508541656
0.2763924993 -0.0335915055 -0.2214837211
-0.2962783014 -0.3717159139 -0.0825070777
0.4490665738 0.0115792625 -0.1480251236
-0.3290707480 -0.3706693212 0.0214320044
-0.1721521317 -0.2204764593 0.3323815215
0.0616744935 0.1906402586 -0.2626681499
0.1765743975 0.3237157072 0.1061240046
-0.4199988093 0.2880952480 -0.0427524580
0.3372272262 0.0366986064 -0.2218965082
-0.0110643280 0.3347371202 0.1801884119
0.0410197514 0.1944012919 -0.2583332723
-0.3282753661 -0.1167996439 0.2860555692
0.0655177917 0.3337572830 -0.1344344560
0.4969089370 0.0436488108 0.0236714771
0.2139791810 -0.0439716018 0.2530266138
0.0973899861 -0.4513705130 0.0742305781
-0.0087120091 -0.3594296900 -0.3053232223
0.0159021825 -0.1215244707 0.4293356648
-0.2506809113 0.3346475828 -0.2125226927
0.1278250707 0.2578809224 0.2108091023
0.1989355579 0.3251283356 0.1062365209
0.1174977813 0.3483115472 0.1161735896
-0.3576538554 0.3241805851 -0.1595586691
-0.3207599239 0.0902443226 -0.3210700000
0.3994355190 0.0972702133 -0.1872505138
-0.2801058204 0.2523236881 0.3208504682
0.3377303816 -0.2240740999 -0.2502300004
0.1349387467 0.2850065057 -0.2000855288
0.4070367482 -0.3404910251 0.2532799240
0.1252386090 -0.0039514898 -0.2610161361
-0.0322112113 0.3378720222 0.1812469959
0.4705596647 -0.0005024873 0.0828228846
-0.4789645381 -0.1800086318 0.0449686712
-0.2003701678 0.4767968554 -0.0589871185
-0.3269789380 -0.1425691879 -0.2681627778
0.1539181640 -0.4381571640 0.1626064807
-0.0061876795 -0.1480857521 -0.3444693783
0.1814436598 -0.4635718105 0.0641558105
0.3079457629 0.1120847614 -0.2534874208
-0.0175533998 -0.4310412961 -0.2264652731
-0.0626410449 -0.3202573708 -0.2796774850
-0.0773132695 0.0283378449 -0.3764122021
-0.0534480433 0.3883267595 -0.1342719529
-0.2921272279 -0.2062019151 -0.2105677342
-0.2118589672 -0.1333783879 0.3838575799
-0.3306942234 -0.0463164840 0.3115167758
0.2647525594 -0.2121723302 0.2820405105
-0.4328765754 0.1388836544 0.1740334904
0.4655065713 -0.0506226648 0.1487561783
-0.4020173005 -0.0123884467 -0.2321799880
-0.3600218420 -0.2003168234 0.1751461734
0.4379957056 0.0436041825 0.0911936944
0.1464552956 0.1364330777 0.2461368630
0.2533900609 -0.3641676214 -0.1055317957
0.1483941821 0.3166227143 -0.1444941351
0.3682870690 -0.2302430855 0.2613057496
0.2674233831 -0.4274943064 -0.0372989647
0.3023728813 -0.4069651046 0.0385590648
0.3219092801 -0.4167064834 0.0372516633
-0.0236376082 -0.0187318573 0.4467703654
-0.1150161280 0.4069172862 0.0741203706
-0.2086059017 0.2572431485 0.3613919437
0.0919315103 0.1660318622 0.2879222949
0.0155031605 0.3414288720 -0.2085647724
-0.1388534691 0.1745404217 -0.2490385853
-0.2669301245 0.2902023768 -0.2654379879
0.2918217624 -0.3844624134 -0.1123791778
-0.0045950343 0.3833136385 0.1311627219
0.0570758835 0.2211525733 0.2495706926
0.0022951075 0.2818073262 0.2184054885
0.3691790055 -0.1743129567 -0.2738839588
-0.3544244236 0.3893734633 0.1396923276
-0.0379943028 -0.3890532365 -0.0985782349
-0.1868812738 0.3151130040 0.2273272909
-0.2811182089 0.0792680984 -0.3376156056
-0.4162586936 -0.0793128002 0.2015854254
-0.4001233724 -0.1104895308 0.2167314378
0.0100983600 0.4126307761 -0.0046730777
-0.1918785502 -0.1457658634 0.3927595915
0.0180858482 0.3858612450 0.1316857434
-0.2516504152 -0.1816342945 -0.2998843507
0.0982823229 -0.1405197039 0.4188023354
0.2738360931 0.0680406682 -0.2679946454
0.1194185725 0.2400010276 -0.2448290208
0.0447294013 0.2105140740 0.3651942272
0.4525766056 0.1310337166 0.0307560482
-0.0954358964 -0.1440341077 -0.3650322867
-0.3656007799 0.3668512266 0.0850308687
0.1913778161 -0.4714246976 -0.0323588039
-0.0478331005 -0.1819621549 0.3799331952
-0.0077814562 -0.4403493265 -0.1128500212
-0.2330351217 -0.3387005533 -0.1838536979
-0.2843209854 0.1317460929 0.3462715013
-0.4826607940 -0.0831675414 -0.0014857261
-0.3482284241 -0.1070828433 0.2834840827
0.2014538136 0.2171177597 -0.2497920584
-0.4729813443 0.0095160102 -0.1202393420
-0.0484296303 0.3836866597 0.1320903781
-0.2102934595 -0.2964285448 -0.2728796419
-0.2772258930 -0.3824822162 -0.0860778857
-0.2117280867 -0.4260185187 0.0076764033
-0.0268549214 0.3437844211 -0.1981621559
0.2055547582 0.1496125034 -0.2660918513
0.0109429251 -0.2332270473 0.4275997871
0.1810857190 0.2241020084 -0.2500599785
0.1625546491 -0.4180017455 -0.2180548191
-0.3829761087 -0.2483276833 -0.1414602813
-0.3277471008 -0.2856375045 -0.1590394088
-0.2897718907 -0.2815923007 0.1912030924
-0.1413404409 0.1690301699 0.3649083381
-0.1424097069 0.4407954049 0.1546492643
-0.0750108308 0.3880505111 -0.1293975155
0.3380467761 0.2171125532 -0.2069751392
-0.0699127401 -0.4232868326 0.0937096182
0.2261097991 0.1437919302 -0.2666562955
-0.4005448089 0.2898755263 0.1373330942
-0.3765293381 0.2435381021 0.2614829328
0.1910329114 -0.1133013925 -0.2234486880
-0.3466237270 -0.3013518803 0.1146220414
0.0738376292 -0.2347307455 0.4012743170
-0.3109622228 -0.0617203541 0.3249041370
-0.4126272317 0.1720209029 -0.1261808305
-0.3897241668 0.0019077883 0.2683779228
-0.0475974052 -0.1386959887 -0.3410270210
0.1158041175 0.0532443632 -0.2718070701
-0.3153270462 -0.3609398136 -0.0789337031
0.2214721164 -0.1393543741 0.3321153280
0.1556709855 0.3275536339 0.1079011632
-0.3282593152 0.1417134190 0.3244704632
-0.1506141481 -0.1547770247 0.3871120712
-0.3170330360 0.1573759071 -0.2298438436
-0.2391061099 -0.4039538312 -0.0932064096
-0.0284308048 -0.4318702678 0.0891205559
0.2538784230 -0.3688516672 0.1180547014
0.4685594466 -0.0211020288 0.1106468322
0.4319240383 0.2940641375 -0.1180928498
0.3162637202 -0.2215149589 -0.2508902111
-0.4605239212 0.1661341928 0.0588706067
0.2008535292 -0.1326153068 0.3299935918
-0.2202644280 0.0637857461 -0.3515300215
-0.2983934820 0.0037340948 -0.3296790480
0.1383987775 -0.0532251635 -0.2329834710
-0.2529437014 -0.3314001466 -0.1805196460
-0.4291394616 0.2534834921 -0.0507066325
0.0077290703 -0.4644744481 -0.1196227581
-0.3233851514 0.2854078621 0.2527880281
-0.4008517700 -0.2340626548 -0.1347029491
0.2987815419 0.2394686574 -0.2126560460
-0.4154773128 -0.1533741412 0.1687475000
0.3764974746 -0.0754384711 0.1959827488
0.2537963630 -0.1258978313 -0.2258388875
0.0589960797 -0.4287875277 0.0762815700
-0.1042069712 0.2961901792 0.2194236399
-0.1569762764 -0.2656156994 0.3701376146
-0.3110434465 -0.1466847661 0.3086588224
-0.1056117923 0.2325619442 0.3505463960
0.4469577784 0.0927452875 -0.1438814356
-0.1238531276 0.2318492119 -0.2371403619
-0.1651717436 -0.1474126732 -0.3924043748
-0.2713414037 -0.3189246145 -0.1746416017
-0.0180933048 0.2873686868 0.2211748404
0.1074448378 -0.4033436997 0.2687215794
0.1885227013 0.0181699848 0.2877391079
-0.1210804434 -0.4081970459 -0.2164943976
0.2345529082 0.0551926628 0.2226746067
-0.1103824392 -0.1762850449 0.4000549236
-0.2715049693 -0.4029091883 0.0144326784
0.3553844633 -0.4615739238 0.0392320627
0.1347117585 -0.4812869180 -0.1296063835
0.1808348148 0.3986428432 -0.0236168504
0.1441620781 -0.2983100283 -0.2471473193
-0.1347802878 -0.3707230569 0.1937633774
0.2582801586 0.1596520654 0.2101512173
0.0100000768 0.3313181680 0.1789544368
0.4180614738 0.0749510127 -0.1686267256
-0.3143671821 -0.2063433414 -0.2123788824
-0.0642496311 -0.4470190125 -0.0071874620
0.3296740281 -0.2834557585 0.2249560658
-0.3871675157 0.1129148269 0.2489426644
-0.3961972206 -0.1848624167 -0.2023203278
-0.1398731521 0.1240931137 -0.3525205414
0.2105562415 0.3038177820 -0.1520636347
-0.4153418357 -0.2081892993 -0.1222398750
0.0030742810 -0.4390298093 -0.0130986582
-0.2186895773 -0.3041926149 0.2902545407
-0.3671101839 -0.1297881511 -0.2603468752
-0.2023662743 -0.3852674592 0.2121121286
-0.3254517814 -0.2437687890 0.1843100649
-0.2406067111 0.0689036293 -0.3473569698
-0.1861052735 0.2366893629 -0.2123455945
0.2383482663 -0.4574955558 -0.0360685972
-0.0896714416 -0.1798837597 0.3958840678
-0.3957429148 0.0379205772 -0.2869827455
0.4252308340 -0.0407743897 0.1618946456
0.1924329385 -0.4077995521 0.2499108085
-0.0563527884 0.2765720296 0.3002214346
0.2278691726 0.4140174421 -0.0300025765
-0.1759515428 0.3466331525 -0.1574239996
-0.4138976221 -0.2130943026 0.1109245902
0.3497148970 -0.2925195637 0.2268765321
-0.1498597290 0.2929959032 0.2112693470
0.3552414105 0.2719485873 -0.1686960972
-0.0280153984 -0.1963222405 0.3917625849
0.1889958931 -0.2019487855 -0.2498456384
0.3624052767 0.1438607330 -0.2268229634
0.3231932780 -0.3624243500 -0.2821629039
0.3035322092 -0.2858184270 -0.2254385956
-0.0545019470 0.4153704870 0.0027039535
-0.4231215159 -0.0317389344 0.2369738947
0.3483834880 0.0859119866 -0.2280069490
0.0404258290 0.4166136714 0.0649944879
0.1896230198 -0.0169354647 -0.2471848384
-0.1194414147 -0.4511783371 0.1048973871
-0.0692155431 0.3461445541 -0.1877643767
-0.2622547538 0.1267606962 0.3581045304
-0.3855218746 0.2286716721 -0.2065416223
-0.0334390041 -0.3672901685 -0.3131927720
-0.2316708040 0.4085913610 0.2162254978
-0.1597603009 0.1767906541 0.3813180306
0.2976434468 -0.0380673548 -0.2185137787
-0.4482021462 0.0567681717 0.2153615836
0.3380955851 0.1333675151 0.1919278987
0.1305987759 -0.3932472576 0.2566177112
-0.1611925298 0.3873277650 -0.1101001659
-0.0620606013 0.2170112441 -0.2436324119
-0.3919004915 0.1923323397 0.2322228548
-0.1944117365 -0.2278735307 0.3468132741
0.2801073595 0.3580827248 -0.0336450354
-0.4495444911 -0.1073744163 0.1585605112
0.4894886837 0.0675536264 -0.1008165027
0.3923408343 -0.0228995108 -0.1899705457
0.0684055671 0.2796641793 0.2239971661
0.2619683162 0.1910463658 -0.2428537615
-0.2896361216 0.3404898533 0.2388584510
0.3425544553 0.1553862221 -0.2325320472
-0.2587577481 0.3922837426 0.2052319428
-0.4597228715 0.1678540137 0.0625487727
0.0601606830 0.3791551428 0.1284768627
0.3320973291 -0.1550123739 -0.2519728008
-0.0160730554 0.0941598232 -0.3628457132
-0.2959491536 0.2978312612 0.2759310109
-0.4602933498 0.1656688152 0.0621091784
0.3079933525 0.1981588103 0.1766161300
-0.3248129476 0.2250645387 -0.2487805875
0.3398337774 -0.3796209558 -0.2939617171
0.1985887836 0.4192007554 -0.1105646684
0.0621276045 -0.4651391900 -0.0199333709
0.3023495784 0.1740084479 -0.2386413610
0.3060507036 0.0021645858 -0.2302572801
0.0365147657 -0.1277491442 0.4302231707
-0.0816101169 -0.3102624517 -0.2735374857
-0.4651815075 -0.1506740282 0.1088392859
-0.1613948311 -0.3454418574 0.3011783035
0.0166011672 0.2661857100 -0.2357235127
0.0374203422 -0.2488409411 -0.3280337613
0.0533883816 -0.0378783016 -0.2390737731
0.3895729023 0.0923576564 0.1472086233
-0.1985262747 -0.2201415313 -0.3346577403
0.3985771595 0.1941664899 -0.2069703264
-0.0270456422 0.4091105735 0.0684452262
0.1480785876 -0.1074565204 -0.2266091471
-0.3413472284 0.3821528528 -0.1368027584
0.0396099742 0.3833027234 -0.0754433520
-0.3357472648 0.2018051177 0.3255400458
0.4556961004 0.2450024811 0.0099266028
0.0920743305 0.3105390530 0.1696143868
0.3282201042 0.1002017257 -0.2429484457
0.0773191704 0.1044702336 0.2893491890
-0.0495756869 -0.3485306635 -0.3001679122
-0.1607197900 -0.3928649838 0.2068427216
-0.1183566268 0.1706476120 -0.2545392354
0.3839345538 -0.1152428193 -0.2683004141
0.2769106070 0.2643121140 0.1489327066
-0.4568849485 0.0182809400 -0.1961185671
-0.2394844110 0.1217535991 0.3766608852
0.1365980476 0.0480375559 -0.2715035831
-0.2326226910 0.3945035076 -0.1774638696
0.0316374004 -0.2370244561 0.4237235342
-0.1590755582 0.3019388675 0.3120789267
-0.4638130018 -0.1773327203 -0.0260230648
-0.1311053570 0.0968856001 0.4172062041
-0.1343004558 -0.2672491080 -0.2448760752
0.1492323291 0.2553219849 0.2109076060
-0.0051923132 0.2347583916 0.2543277067
0.3897834492 0.2994304655 -0.1124653868
-0.4479245678 -0.1707429044 0.1093991105
0.4551620081 0.0299459754 0.0763066848
0.0533131450 0.1365819619 0.4059100226
-0.2029627060 0.3049789791 0.3064556179
-0.1091685783 0.0919035681 0.4278063637
0.1803722951 -0.1368176820 0.3540158599
0.3606223074 -0.4554773669 -0.1333586888
-0.1207429816 0.1640930393 0.3627401943
0.3856421887 -0.1313216811 0.2010418115
-0.2353310506 0.0510535503 0.3681085109
-0.1400326718 -0.3459005720 0.2960435442
-0.2496535256 0.3008985949 0.2904580022
0.4427384466 0.0705413850 0.0749421224
0.3650992332 0.1695870506 0.1569383899
0.4180986373 0.1475353875 0.0836346840
0.3953871221 0.2564137079 -0.1701246055
-0.2812261631 0.3754713495 0.0307347108
0.0649782276 -0.0579807980 -0.2920749880
0.4267159541 0.0888983589 0.0899525159
-0.2022857036 0.1849473628 0.3769699347
0.0183358056 0.0179694457 -0.2809396173
0.3315408444 0.0227362598 0.1726300319
0.1917768101 -0.4313129438 -0.1196253308
0.3739776536 -0.4755923720 0.0387013231
-0.0718902329 -0.4342808246 -0.1084157359
0.1750836412 -0.3260778667 0.3168743349
0.3932028221 0.2336091415 0.0692946473
-0.1161453353 -0.2782033609 0.3684756019
-0.3286401219 -0.0527875744 -0.2793425823
-0.3916558492 0.1181406723 -0.2220550110
0.4022141053 -0.1240839725 -0.2835507173
0.1997943951 -0.2356583149 0.3455261951
0.2116619300 0.0868209743 -0.2740923259
0.3584437702 0.0253321544 -0.2036123708
-0.3988795937 -0.2629383044 -0.0504969358
0.3487327406 -0.0952714899 -0.2301193256
-0.1841498744 -0.4022671883 0.2147868203
0.1964834011 -0.3250642277 0.3087832128
-0.4595917498 0.1685835772 0.0621338879
0.1765508660 -0.4327723700 0.1562733097
-0.2561051956 -0.2123142821 0.3526058518
-0.2718899311 -0.0972517676 0.3587027802
0.2329758063 -0.1214641423 -0.2246001426
0.3238205305 -0.1140603102 0.2017280585
0.0776617784 -0.1337284805 0.4165535628
0.3202589436 0.3437211659 -0.0376810841
-0.3111648921 0.3610102118 -0.2198035296
-0.0857077301 -0.0029227912 0.4484309242
0.4423485955 0.1732863048 0.0463728736
-0.1935908183 0.3161101151 0.1615602813
0.2821728701 0.1826533508 -0.2408967106
0.3066792704 -0.0868419803 -0.2306199063
0.3762555766 0.2516790814 0.0762030336
-0.4796200649 -0.1263460695 -0.0830352676
-0.3823065596 0.3680914645 0.1324235500
-0.4606301932 -0.0407058610 -0.0976820263
0.0354342303 0.3321860457 -0.2072771928
-0.1426117737 -0.0509300115 -0.3978706702
0.2737156958 0.0426874165 0.2050665650
0.1680128698 -0.4253492269 0.2669380927
0.0613213844 -0.2447446267 -0.3194379682
0.3107732558 -0.1637103508 0.1909317289
-0.3923160375 0.2809577571 -0.1811987824
-0.3038997365 0.2507615386 0.3075167193
-0.0688458208 -0.1820609154 0.3896011355
0.1672921019 -0.2953977189 -0.2431616138
0.1270267349 0.3174017071 -0.1401659737
-0.0416691696 0.4083471778 -0.0682293914
-0.2788004693 -0.2794811612 0.2902526020
0.0118559765 -0.4458560179 0.0855111242
0.1757981277 0.0739406787 0.2490432568
-0.1164120585 -0.2805803620 -0.2536421502
0.4798276443 0.1100788631 -0.0804483592
0.2527736143 0.2994490054 -0.1592680091
-0.3779252429 -0.1970020782 -0.2101506545
-0.0574049623 0.1042287957 -0.3602380523
-0.1758766631 -0.4133547343 -0.0984391099
0.3887515296 -0.3879080896 0.1878397643
-0.3482146260 -0.1393786347 -0.2680710173
-0.1531383767 0.1018703932 0.4056790164
0.2987405586 0.1479126535 0.2030864509
-0.4371178103 -0.1053679303 -0.1450345258
0.4854293370 -0.0555423816 0.1401578018
-0.0432034661 0.2189988538 0.3470186850
0.1362187056 -0.2423937922 0.3841070524
-0.4598490174 0.1687888005 0.0592331249
-0.1598856584 0.1282385089 -0.3430090965
0.0670351900 0.1260243611 -0.2735929657
0.2312026494 0.2991278227 -0.1543689805
0.0005774149 0.2143760621 0.3551988627
-0.4452368749 -0.0371280383 -0.1684324644
0.2048749527 -0.4556830616 0.0596582870
0.1563153086 -0.0438656030 0.3320327446
-0.2785434256 -0.0024625408 -0.3360722691
0.1562286126 0.2845472342 -0.2058637871
0.2741330876 -0.0529613365 0.2177910763
0.4718341995 0.2780736443 -0.1207176378
0.3159047775 0.0491365490 -0.2436051276
0.4161041239 0.2611757310 0.0151471201
0.3219058074 -0.4005803757 -0.2077445198
0.1053783469 -0.0691943404 -0.3009038757
0.0404463778 0.3872677362 0.1317963503
0.2182274409 0.2710580983 -0.2134647350
-0.4701455174 -0.0014295989 -0.0685555005
0.1047273163 -0.4692214751 -0.0241298074
-0.2831550466 0.4257180345 -0.1015680473
0.3701012544 -0.0989100538 -0.2279380532
0.1118303579 -0.2291681044 -0.2934352798
-0.2538231812 -0.0898875074 -0.3203566738
0.2184416551 0.2900204539 0.1622085764
-0.0874536143 0.0869285856 0.4363009815
0.2883338742 0.2058474899 0.1814265765
-0.0150221674 -0.4237896281 -0.0106443442
0.1092853674 -0.4945668836 -0.1317947315
-0.2964232580 -0.2570495835 0.2808772965
0.2492100050 0.2217973273 0.1915846757
0.3587129966 0.2676218605 0.0823443118
-0.0271841278 -0.1440628181 -0.3440025659
0.0158273490 -0.1497761156 -0.3405998089
-0.4855133989 -0.0113001766 0.0167185482
0.2466390624 0.1373787497 -0.2661295270
-0.1564234756 -0.3782640257 -0.2022898674
0.4832283468 0.0955066681 -0.0151867651
-0.2562703974 0.2539619869 0.3343647545
-0.0903263011 0.3477678838 -0.1829231465
0.0880078470 -0.4442216967 0.1775383164
-0.0992849161 -0.2962683723 -0.2642542037
0.2440094439 -0.3566417620 0.2052574663
0.4994243687 0.0854049397 -0.0472958877
-0.4558608956 0.0951680499 -0.1526064853
0.1666756968 0.1307288684 0.2421410382
0.1592762287 0.1944593835 0.2357790690
-0.1214270032 -0.0548817253 -0.3967265892
-0.0579985805 0.1706703065 -0.3083379147
0.0938545518 -0.2466676008 0.4094990580
0.3642859299 -0.0259821303 0.1764744460
0.0262485255 -0.4772479325 -0.1236721763
0.2265114373 0.1119305153 0.2261176035
-0.0797275201 -0.0639070331 -0.3982240890
-0.0132910984 -0.2649843657 -0.3547054992
-0.3099775547 -0.3002799099 -0.1659840186
-0.2705324165 0.3461505606 -0.2181970216
0.2411111364 0.0212612559 -0.2632171409
0.3580788755 0.2085336949 -0.2062285041
0.2926261061 0.2823283589 -0.1598724914
0.4147522004 0.0264873653 0.1183753171
-0.0563563035 -0.3078625519 0.3766908681
-0.3037279763 0.4382634005 0.0918963883
-0.1201075370 0.2863993040 0.2994750881
0.4175336046 -0.0847573475 0.1888721447
0.0113679010 -0.2588153099 -0.3436404332
0.1908444963 0.3135329087 -0.1523572357
0.4297266691 0.2069263629 0.0588890031
-0.4758486397 -0.1401035338 -0.0161141126
0.2727667162 -0.3135866920 0.1713901372
-0.2934816695 0.4454955550 -0.0358731940
0.2149096448 0.0613650152 0.2310801779
-0.1852943784 -0.1413798865 -0.3881895287
-0.4599846250 0.1683708792 0.0588982084
0.2133175953 -0.3950857540 -0.2062971057
-0.0711106667 0.0997968048 -0.2715761208
0.0045243344 0.1482689828 -0.2907107989
0.2757288818 -0.3322295956 -0.1749151530
0.4453171101 -0.0456977903 0.1548186551
-0.4606042401 0.1656618528 0.0591824972
-0.0481489536 0.2401678012 0.2521633097
0.3789049225 0.0472344884 0.1486568264
-0.0265018887 0.2378972274 0.2538770026
0.2930445572 0.0361104430 0.1946135217
0.2919933938 -0.3265851456 0.1745351182
0.2377678799 0.2592936178 -0.2101508829
0.1143135402 0.2897645971 -0.1977637643
-0.4387066454 0.1026471010 0.2011008420
-0.3266084331 0.4233899467 -0.0909015661
-0.2363936118 -0.2238429165 0.3569746265
-0.4327447871 -0.2589876146 0.0367072681
-0.3846895479 -0.0248217256 -0.2483201646
-0.4596734024 0.1692002188 0.0599614595
-0.4052229016 0.2493254698 0.1850940587
0.2224744318 -0.0701376636 -0.2321570371
-0.5000000000 -0.1119088502 0.1079618060
0.0950204354 0.0584388004 -0.2719756178
0.1578442594 -0.4722364096 0.0687936122
0.0762026942 0.3515159642 -0.0736124713
-0.2396308310 0.4071662112 0.1441209258
0.0230450487 0.2773170506 0.2166564307
-0.3431452424 0.0929519644 0.2942549855
0.2190741914 0.4137297554 -0.1125914755
-0.0601928109 0.2945889972 0.2229831010
0.3818444154 0.1287212430 -0.2167976563
0.1265175493 0.0329939473 0.2922110335
-0.0754672299 -0.2919026767 0.3679198068
0.3443900841 0.0706933818 0.1853944891
-0.2537635285 0.4628646961 0.0923009717
-0.2709454983 0.4497943119 -0.0406549877
0.2328176117 -0.0253961660 -0.2358130860
0.2390115361 -0.3250463201 0.2946029897
-0.4093170419 0.0189823301 0.2525054994
0.3343879660 -0.4210014647 -0.0432542395
-0.4483102503 -0.2333170508 0.0394424392
-0.1147952214 0.3820357941 0.1326854762
-0.3450739583 0.2265000255 -0.2354407950
0.4224410215 -0.1296443496 -0.2878162732
0.4215437122 -0.0029945857 -0.1671142395
-0.3786072087 0.1518799428 0.2415230880
0.4616350979 0.0729155872 0.0400430934
0.3651547525 -0.1349554431 0.2237147797
0.0815793622 0.2261346880 0.2618578379
-0.0014912642 0.0670577650 0.4616595458
-0.4016099856 -0.3103319163 0.0312314632
-0.0025839004 -0.0252992205 0.4526206661
-0.1357837891 -0.2323640617 -0.3380950483
-0.0315369949 -0.2536155971 -0.3448687335
0.2167059131 0.3364150629 0.0404770213
-0.4605729676 0.1658722918 0.0590008420
-0.1001317530 0.1591730445 0.3606536101
0.0156827128 0.2305244039 0.2531808343
0.0199036366 -0.4138813439 0.2974288239
0.3127313762 0.2747393440 -0.1606799957
0.2687148275 0.2136536090 0.1863432727
0.1784317212 -0.2399866963 0.3614820305
-0.2517553186 -0.1077658289 0.3648120607
-0.4894613441 -0.1334464262 0.0482686342
-0.2337604270 -0.3003840509 -0.2776866443
0.0054924663 -0.3725636702 0.2755841732
0.4631578283 -0.0172254812 -0.1576044302
-0.2224408384 0.2066891394 -0.2797960557
-0.0409187929 -0.4416734220 0.2014989026
-0.0317411755 0.3893868561 -0.1395519680
-0.2213804076 -0.3723055500 0.2110617621
0.4989455601 0.0607085388 0.0042265158
0.3773057423 0.2804683348 0.0207986804
0.3444268985 -0.1197105939 0.2012530292
0.3558882899 -0.2356894535 -0.2603684846
0.4049908952 -0.0358478063 0.1674715412
0.0126412177 0.1471339076 0.4136679748
0.2076451746 0.0132742689 0.2714771870
-0.1563643785 -0.2273832433 -0.3358663945
-0.0129274410 0.0153578002 -0.3625468012
0.2234040612 -0.4699889857 0.0591784595
-0.2581746531 -0.3932482033 -0.0896505996
-0.4830408083 0.0432616404 -0.0837197592
-0.2563981876 -0.3838727248 0.1142062074
-0.1706290864 0.2942597044 -0.1965372857
0.2103385485 0.2384967668 0.2024599949
0.2841084673 0.0089369505 -0.2449825367
-0.1802117009 0.4697682672 -0.0605730178
-0.0648071191 -0.0089493906 0.4516048218
-0.0586293446 -0.3714389720 0.2911556715
0.3683312392 0.0670028504 -0.2046116943
0.2121390492 -0.1170730935 -0.2234475532
0.1062692614 0.2600173532 0.2103030582
0.0303654976 0.4062712575 -0.0067490494
0.3231683318 -0.4314941777 -0.1256290930
-0.2246427636 -0.0305693158 -0.3871418367
0.3115347594 -0.3927330624 -0.1153532903
0.2671398491 0.1303935932 -0.2645641810
0.0724714494 -0.4246288521 -0.2223123045
-0.3797010555 0.3690030995 -0.0533082025
-0.4410211462 0.1417583165 -0.1179000538
-0.1810438657 -0.3349341446 0.2996792824
-0.3969918645 0.0518641061 0.2945268422
0.3964078088 0.2696559579 0.0178123184
0.0230950398 0.2133422202 0.3623352286
-0.1819917634 0.1796177067 0.3728200001
0.3410024863 -0.4468536167 -0.1303001912
-0.4475941332 -0.1987868511 -0.0321539855
-0.0767983313 0.1577737939 0.3763504979
0.1865794015 0.1243804290 0.2366001367
0.3204548289 0.2880630995 0.0905017428
0.4085508778 -0.2513932398 0.2737105538
0.1788025454 0.1868049031 0.2296405330
-0.4240356660 -0.1335908011 -0.1654805192
0.3885204461 0.0532553390 -0.1906565011
-0.4598063309 0.1674729077 0.0626238629
0.2951446497 -0.1354224252 -0.2295271117
0.3142791932 -0.4140374252 -0.0410228746
-0.3346634886 0.4025586723 0.0884640286
0.0158168033 -0.3521868471 -0.2979374134
-0.1695911714 -0.0676562261 0.4264151235
-0.1966951157 -0.3652262629 -0.1963854520
0.1830997725 -0.1568222787 -0.1997527800
0.3119427530 -0.3353303180 0.1748761302
-0.3038269426 0.1366532469 0.3588778996
-0.1488646428 0.0167609888 0.4309811696
-0.1194651559 -0.3510136821 0.2939815521
-0.2780734228 0.1505370958 -0.2622361533
0.4086638671 0.0385714393 -0.1750004259
-0.0718750997 -0.3906236701 -0.2073624949
0.3907186974 0.0045386830 0.1490557616
-0.3556741170 0.1637824921 -0.1934162110
0.2128577458 -0.4727218000 -0.0344365138
0.2248022600 -0.1653100309 -0.2024419513
0.2420774412 -0.2323586000 0.3215774596
0.1401520977 0.2362724283 -0.2484523827
-0.2182718060 0.4945668836 -0.0604310564
-0.0391517077 -0.3829628105 0.2933289277
0.1880259918 -0.2999133223 -0.2450051046
-0.2785636562 0.0681960422 0.3366716418
0.4296816286 -0.0082248736 0.1301414466
0.1394442612 0.2013420834 0.2407863148
-0.2303624932 0.3272463181 -0.2117488260
0.2957569694 0.2536424914 0.1432021669
0.3190833820 0.3093245393 0.0292636615
-0.1445578844 0.2344389747 -0.2306598629
0.4038463520 -0.0604871792 -0.2041217556
-0.1349139616 0.4146181208 0.0766768723
-0.3323978616 0.3424116079 0.0381022561
0.4382152417 0.2898749260 -0.0490401049
0.4872946091 0.2203469975 -0.0517269164
0.0780546796 0.3644887277 0.1227942397
-0.4595815132 -0.0150973165 -0.1458810878
0.0944819271 -0.0288969469 0.3378118804
-0.2198177166 -0.4146534942 0.1136378292
0.1302865445 0.3403190012 0.0469939646
0.1116849879 0.3531159098 0.0502526260
0.3063542646 0.0870010378 0.2050779748
0.2185098654 -0.3805134494 0.2264562534
-0.3180093679 0.0103233039 -0.3219703784
-0.4606405894 0.1652930948 0.0596754436
-0.0329007757 0.4147522744 0.0002229937
-0.3369676231 -0.2076106588 -0.2150760660
0.2578806228 0.2743851181 0.1542893523
-0.2410694532 0.1912726946 -0.2127863801
0.1150378593 -0.2445249778 0.3967967878
-0.3664060513 -0.3057076831 -0.0627252513
-0.1653219145 0.2357822222 -0.2219012462
0.0357910829 0.2243473022 0.2491980079
-0.0444776961 -0.0129265091 0.4446813503
0.3398750846 -0.0472118871 -0.2147039863
-0.4371514188 0.0113667841 -0.2019762315
0.2624536045 0.0153102828 -0.2560427185
-0.4162584224 0.1924045192 0.2098413876
0.2573544736 0.3243841726 0.0358251103
0.2225830096 -0.3977396793 -0.1125790297
0.4810721009 0.0754466984 0.0099357433
-0.1965765762 0.3520352557 0.2600933463
-0.3617888707 0.4292780465 -0.0205826286
-0.3388795194 0.0969369821 -0.2994341925
-0.2345654464 0.3713150486 0.2734357692
0.1114794619 0.3016951898 0.1650185786
0.0897076553 -0.3284651637 0.3475756009
0.1569918694 0.3897328243 -0.0207270918
-0.1689934540 0.4241859512 0.1490639289
0.3501799016 -0.1657080129 -0.2648743201
-0.2018251910 -0.1271310918 -0.3686667587
-0.2614490288 0.3578206649 0.2579816857
-0.1286096707 0.0130457174 0.4227883263
-0.3764387181 0.0502870641 0.2843127921
-0.2903583331 0.3578927317 -0.2241621980
0.1952408722 0.3379433004 0.0421809028
0.3579126284 -0.3923622956 -0.3022592173
-0.3926788730 0.3851973656 -0.0045730916
0.1467368588 -0.0082561463 -0.2561335870
-0.4605075456 0.1652062348 0.0611318117
0.4844049169 0.1143432162 -0.0468047748
-0.2108695046 0.3125761367 -0.2022790493
-0.3734059413 0.2728745500 0.2244591096
-0.4595344430 0.1689809354 0.0617743829
0.0873720661 0.3356056819 -0.1401184156
0.3884745252 -0.2401184704 0.2664645699
0.1730275646 0.3365248934 0.0434808847
0.0420737325 -0.1417766787 -0.3186650991
-0.4021061646 0.2719901446 0.1631503323
0.3567153898 0.1233992262 0.1824217457
0.3312448774 -0.1701665535 0.1910105847
0.1188566755 -0.1437426800 0.4125248241
0.3709773396 -0.0169167572 -0.1974249932
-0.4825465689 -0.0559750612 0.1461986731
0.4589765930 0.0528048118 0.0605271854
0.3494408209 -0.0106997701 -0.2070398276
-0.3652900533 -0.2632462689 -0.1485386462
-0.1722404180 -0.4429441658 0.0031369096
-0.2347424978 -0.0982993287 -0.3290039049
0.4365753077 0.2557453360 0.0129033925
0.1438895513 0.1671836170 -0.2645982658
0.1849829625 0.1550892707 -0.2648957697
-0.3648993704 0.1020157312 0.2761191203
-0.4601357492 0.1661587499 0.0624888008
0.1983357975 0.1791650985 0.2235244595
0.4490213475 -0.0147935420 0.1197338299
-0.4443249059 -0.1564431605 -0.0973205067
-0.4325965274 -0.1308049904 0.1638261207
0.2784887958 0.1537302751 0.2065379006
0.1283126763 -0.4618468692 -0.0259725600
-0.2110294304 0.3519737002 0.1234411116
-0.4355712635 0.2463914594 -0.0954847114
-0.3660472604 -0.0342394136 -0.2588336358
-0.0111994073 0.4145697478 -0.0022886522
-0.3045388599 0.2234615270 -0.2615867687
-0.3765900245 -0.2406000903 0.1097654474
0.1084538990 0.1138177033 -0.2705271008
-0.3779824823 -0.1820147379 0.1719460404
-0.2318137135 -0.1206333033 0.3744263303
0.3784516407 0.2021448762 -0.2072382387
-0.0866835686 0.2882558181 -0.2217021722
0.2532345954 -0.3337970686 -0.1759362115
-0.1747631113 -0.4070488955 0.1061205414
-0.2706177787 0.1913030901 0.3407899058
-0.1151844270 -0.2372975020 -0.3402634280
-0.0931873359 0.4068246415 0.0726107441
-0.3558349552 0.0447935362 0.2834573137
0.1011204068 0.3671513750 -0.0815947089
-0.1704798402 0.0253336104 0.4152651406
0.2591712367 -0.3332505301 0.2956675072
0.0629674645 0.2007768776 0.3515800924
0.0965725658 0.0977869388 0.2783837300
-0.2976072097 0.1540285105 -0.2467094126
-0.0480830742 0.3446686354 -0.1927248343
0.1704411823 0.0969881871 -0.2706555544
-0.3605513691 0.2013012572 0.3002431365
0.0842873854 -0.4134423746 0.2808268592
-0.0223046287 0.0720072216 0.4617661037
0.4675652742 0.2057573384 0.0030168099
0.0551508449 0.3542846719 -0.0708232567
-0.0963831174 0.3448889232 0.1829410377
0.2465427259 0.1058395220 0.2211999125
0.0283082502 -0.4248604121 -0.0147601655
-0.4086697534 0.1256181811 -0.1917256946
0.3353899760 -0.0658680978 0.2018460545
-0.3157085200 0.4426733955 -0.0315053821
0.4783703997 0.2755280595 -0.0530766621
0.1246784142 0.3771157266 -0.0896039771
-0.0266438200 0.3830241368 0.1314575440
0.1340698857 -0.4816998856 0.0735787120
0.3467651198 0.1811751840 0.1654719142
-0.1305464424 -0.4507582358 -0.0011619006
0.2416631635 0.3207727480 0.1038708852
0.2914023532 0.3460584056 -0.1077722285
-0.0157427584 0.1498048252 -0.2776958255
-0.4603722821 0.1668721002 0.0586309742
0.0480861622 -0.3217650404 0.3550887966
0.1029069490 0.1816208230 -0.2685992549
-0.4294051201 0.0604783465 -0.2401298560
0.1291513643 0.1078307689 -0.2693758144
-0.0214769627 0.2163579782 0.3503247257
-0.1177407104 0.0387586779 -0.3660426690
-0.3675772072 -0.3497188311 0.0260835687
-0.1847685890 0.2588931179 0.3749272321
-0.3017997494 0.4206333885 0.1501618622
0.2179897965 -0.3232552228 0.2999059650
0.3147600649 0.2434816842 0.1377903161
0.2417708829 0.1995124680 -0.2448994382
-0.2516738878 -0.4110011969 0.0121717209
-0.2314187712 -0.0501440244 0.4265054220
0.3686907657 -0.3798176013 0.1879352312
-0.2638992359 0.2193096490 -0.2841768931
-0.4288337647 0.0369923709 0.2352403730
0.4923698377 0.0099493834 0.0571988878
0.0005634684 0.4034040659 -0.0739758313
0.1066315844 0.3234244747 -0.1385471409
-0.3296713854 0.2845788246 -0.2214832838
-0.3385455461 0.4369413824 -0.0263179839
-0.1792587910 0.0537740894 -0.3573558208
-0.3316406410 -0.3317254103 0.1170493108
0.3005423267 0.2954662344 0.0935655044
0.3791088620 0.3162370840 -0.0433207635
0.3968038069 0.0368114819 0.1333989389
0.1782697437 0.0375124260 -0.2698993610
-0.0092150127 0.1504457547 0.4076210511
-0.0666030129 -0.0924832995 0.4158443356
-0.3748479761 0.1667855879 -0.1733843767
0.1303985374 0.1506046390 0.2703315832
-0.1968636547 -0.4089074241 0.1095262340
-0.4638765971 -0.2076472088 0.0421807548
0.1530347442 -0.3873655534 0.2472946620
0.4119351939 0.2219586935 0.0647015625
-0.1479597030 -0.3838663086 0.0988557918
-0.3865083890 0.2967060475 0.0463572691
-0.4001689095 0.1568508427 0.2344981961
0.0837623413 0.3553412504 -0.0107450388
-0.2912325514 -0.0713357015 -0.2998475177
0.0436041344 0.2722690719 0.2143766877
-0.3677504961 -0.0941508387 0.2777237083
0.3122769545 0.0294042903 0.1835308090
-0.2590183702 -0.0092131965 -0.3443136559
0.0943328609 0.2986777624 -0.1987825103
-0.0491155718 -0.4273332250 0.0913704506
0.1574037180 -0.2402606331 0.3714127939
0.3334155215 -0.4030521864 0.1151632240
0.0253187687 0.1412843164 -0.2863771465
0.3724812140 -0.4237318115 0.1151562922
-0.2646918670 0.4092376566 -0.0977759207
-0.3485909855 -0.1856505893 0.2500474128
0.1101013255 -0.3349069262 0.3468937627
0.4370852138 0.2492621737 -0.1758882372
-0.2754702455 0.4634377587 0.0938755833
0.3514394107 -0.1799595042 0.1960502711
-0.4432567018 0.0767718817 -0.1998899759
-0.2305206223 -0.1851143018 -0.3003213948
0.3613147567 -0.0515558195 -0.2102571069
-0.3347145848 0.3399001945 -0.1864573774
-0.2728213254 -0.0238752453 0.3916752263
-0.3141816040 -0.0008935306 0.3647059088
0.0450517833 -0.4432637239 0.1854829412
0.0522627948 -0.2416127450 0.4210280113
0.0316716115 -0.4543380904 0.0839794415
0.3403588445 -0.4128678170 -0.2135306871
-0.4606205749 0.1655074687 0.0593783038
0.0677102801 -0.4377499985 0.1791012713
0.0466160121 -0.4830647595 -0.1260597437
0.4729812206 0.0179556609 0.0638471598
-0.4606175663 0.1652043775 0.0600947149
-0.2719279511 -0.3005024228 0.1946491623
-0.3017658039 0.0841714599 -0.3358453343
-0.0537554311 0.1559981303 0.3901421738
-0.2691417744 -0.2724978664 -0.2591989900
0.3362664997 0.2909677801 0.0252387390
0.2429798898 0.0035840178 0.2112483017
0.4564767707 0.2378166262 -0.1746985199
0.4206387837 0.0567677327 0.1053617866
0.1707468666 -0.4666114294 -0.0301870264
0.2552733801 -0.0542101098 0.2504468593
-0.2088657041 0.4675317041 0.0899574713
-0.3473439314 -0.0435114318 -0.2690901295
0.1034810186 0.2245076852 0.2645105619
0.0535000001 0.3289950376 0.1792854262
0.3255258350 0.0791634911 0.1959875131
-0.4596161424 0.1692528406 0.0603839708
-0.4963683293 0.0320745837 -0.1844691586
0.2647815042 -0.0781499382 -0.2302426725
0.0823739557 0.0047439535 -0.2697979202
-0.1524688807 -0.4076888562 -0.0980743616
0.3846457066 -0.0309137617 0.1720442252
-0.3513475770 0.2479219649 0.2815378214
0.0896539204 -0.4859856785 -0.1287447688
0.2323130005 0.0813321063 -0.2745106297
-0.3096380531 -0.3804194363 0.0191244190
-0.2541016855 -0.3194820170 0.1981251105
0.3600372952 0.3277541060 -0.0416056115
-0.3485811713 0.2786681851 0.2379353802
0.2734243893 0.2948039605 -0.1615944924
0.1233838562 0.1740935907 -0.2660295555
0.1326816157 0.2987261032 0.1640672829
0.0617370152 0.0096539252 -0.2679418105
-0.1064335861 0.4090018481 -0.0577027320
-0.2609338732 -0.3004945010 0.2986868466
-0.1390823771 0.3905414204 -0.1164906839
-0.0532453368 0.3413800376 0.1825358004
0.3673588334 -0.2826962550 -0.4617661037
0.1991850993 -0.4273868036 0.1499430107
0.0853485127 0.2640079956 0.2115695071
-0.1074273272 0.2919001520 -0.2179745382
-0.2927931563 -0.1690297514 0.3237767004
0.1151556848 0.0902455601 0.2630613986
0.4273444807 -0.1809019439 0.2915901237
0.1934897345 -0.0394108963 0.2570813190
0.2200069696 0.0268954380 -0.2674269513
0.2111427814 -0.0212221025 -0.2421099795
0.1199906515 0.2091823157 0.2471913942
0.1361079322 0.3362095905 0.1114189178
0.4365481093 0.0513727378 -0.1485012926
-0.0978771979 0.4158602919 0.0077141060
0.2933036527 -0.3475295359 -0.1821812201
0.3588976968 -0.4248606328 -0.2191733601
0.1703899639 0.2520268019 0.2103047085
0.0408928052 0.0144189755 -0.2677086437
0.4045111149 0.1754318080 0.1000383794
-0.2186862609 -0.2140089068 -0.3310624937
-0.2806304408 -0.2393354557 -0.2348727616
-0.0379634408 -0.4285095310 -0.0087309658
-0.0947087686 -0.4377090126 -0.1082429202
-0.2942737860 0.4102393962 -0.1716712529
-0.1337724135 -0.4178458423 0.1019357430
-0.0105414091 0.3876857757 -0.1434038924
0.4719101059 0.0887915688 -0.1070690679
0.0320143576 0.3310220840 0.1796522902
0.2833842592 -0.0062724092 0.1993793534
-0.3352655323 0.0419669063 0.2762335440
-0.1283527547 -0.0810854638 0.4305495026
0.4557268739 -0.0398844951 -0.1765063314
0.2580818942 0.2525317118 -0.2108600002
0.3278889533 -0.0044592562 -0.2168632019
-0.2923305634 0.1948023329 0.3357049205
0.4949720074 0.0276772931 0.0415900639
-0.1433085272 -0.4088516475 -0.2170678997
-0.2608636917 0.0740871959 -0.3424861662
-0.2180331161 -0.1121393631 -0.3477643470
-0.0744625233 0.3442850803 0.1834507039
-0.0993804052 -0.3589596256 0.2937899696
-0.3033939796 0.4325869167 -0.1003911149
0.4883950919 -0.0270271232 0.1035058245
0.2787216071 0.2478691223 -0.2132612298
0.4946308965 0.0775511814 -0.0748387531
0.3335821325 0.2327312019 0.1320133638
0.0274121052 -0.3173949798 0.3578289308
0.1609667159 -0.4648847904 -0.1266722389
0.3158886971 -0.1400216634 -0.2310747682
0.3879774537 -0.3241546121 0.2441379703
0.1083894533 0.3677425445 -0.0141371494
-0.4151176638 -0.2415569317 -0.0443826103
0.0465860778 0.3476846043 -0.1369058425
0.3120555399 -0.3587910775 -0.1874634293
-0.0248196012 0.2740589741 -0.2289732318
-0.2069359023 0.2366561462 -0.2010635059
-0.3217994691 0.0853424132 0.3052350853
-0.4824396229 -0.1306039707 0.1082755201
0.2542005972 0.0490277070 0.2143040030
-0.0924492952 0.1057451890 -0.2787083271
-0.1165588191 -0.1402990369 -0.3650992752
-0.2521186607 -0.0370732356 0.4092428799
0.2386880168 0.3670050206 -0.0292228063
-0.3015615171 -0.3919843020 0.1218155529
0.0809287801 -0.4276883947 0.0730109163
-0.3713642440 0.2836863619 -0.1974124147
-0.1269209473 0.2949165678 0.2156562977
0.0404524662 -0.3446089070 -0.2902910086
0.0698780024 0.1264273623 0.3774167554
-0.3862871916 -0.0739431631 0.2647363390
0.3190231904 -0.3065751788 -0.2400327347
-0.4602207761 0.1675098515 0.0586174104
-0.1942611395 0.3663417864 -0.1671193878
-0.2878418859 0.2883300659 -0.2507890200
0.0080093087 -0.4123463074 0.1813684415
0.0889332324 0.3495854123 0.0512601051
0.4685650867 0.1869059976 -0.1530941846
0.0746511343 0.3095481528 -0.2013746585
-0.3649445076 0.3340826079 0.1656182355
0.4041966471 0.0722553686 0.1229218802
-0.4602145588 0.1659099301 0.0623076460
0.2336940948 -0.0457682202 0.2353773224
-0.1968741369 0.4269730262 -0.1211443192
-0.0373284121 -0.4232861720 -0.2229090004
-0.1199407666 0.4144853638 0.0103326376
0.0832523137 0.0429397599 0.2767998563
0.4424128336 -0.0107474647 -0.1603251259
-0.1796595472 0.1320594344 -0.3305126183
-0.4999564028 -0.0868834314 0.0515734748
-0.4479871027 0.1739642569 -0.0486066648
0.1299453511 -0.3454545664 0.3502894668
-0.4134239489 0.2748912655 -0.1588767851
0.1678598295 0.0231097071 0.2892822601
-0.1829650322 0.4240069729 0.0172333461
0.1644291715 0.1610276983 -0.2645475188
0.2436437606 -0.0741136947 -0.2311039125
-0.1731789693 0.4002391524 -0.0445208395
0.4102767906 -0.0017443229 0.1400952340
-0.1895902627 -0.3010485862 -0.2748061932
-0.0972349082 0.0337553349 -0.3689379040
-0.0143267511 -0.0330314689 -0.2659602358
0.4381561832 -0.0897765378 0.1870895131
0.3620077260 0.0596975948 0.1687747827
0.0569097084 0.2485075312 -0.2307461747
-0.1862870060 0.4703864846 0.0888556190
0.0340699451 0.1432737893 0.4169230064
-0.4318077387 -0.0446923463 0.1841621478
0.4638044178 0.0635935134 -0.1265941816
0.0058965813 -0.3192740299 0.3667787636
-0.3501697600 -0.3270917734 -0.0688403769
0.1035567448 0.0002210610 -0.2673761709
0.2994900931 0.3182085861 0.0319874103
0.3502200755 -0.3623546791 0.1818409216
-0.0048368678 -0.1053974799 0.4047657217
0.0957809393 0.3492211579 0.1168983652
-0.3339313501 -0.3484721566 -0.0749537329
-0.0923522407 0.3837427358 0.1329043842
-0.1031983122 0.2281468914 -0.2415782027
0.3344809551 0.2760229815 -0.1660730097
0.1518967826 -0.4544732067 -0.0278151697
-0.1587532205 0.0487697653 -0.3602510226
-0.4661666783 0.1174325488 -0.0923591570
-0.3700812097 -0.0145661267 0.2833512268
-0.0007761148 -0.0498389370 -0.3079214587
0.0704519677 0.3628372849 0.0545851723
-0.4464445678 -0.0047031583 0.1631970095
0.0850167774 -0.2412231667 -0.3115232930
-0.2382950793 -0.0139392390 -0.3457699547
0.1462706276 0.0280803838 0.2819975844
-0.2161142055 -0.2311304038 0.3571308825
0.3099941010 -0.2717217476 0.2203812900
-0.0639877598 0.2235577024 0.3482869640
-0.2313136005 0.4651968512 0.0911270945
0.0300187466 -0.0376082113 -0.2525406503
0.3400798688 0.2796296116 0.0870657295
-0.3432927940 -0.2248593687 0.1808636857
0.0367412965 0.2572243401 -0.2330862089
0.4286630369 -0.2621884636 0.2802405492
0.2623518949 -0.1246822174 0.2690727019
0.2859810552 -0.1818079229 -0.2109752017
-0.4494245917 -0.0747422848 -0.1226937367
0.1312840466 -0.4435422399 0.1689367631
-0.2483572107 0.1885149038 0.3494751951
0.2546808268 -0.0294393020 -0.2280402251
-0.0855032844 -0.4447717265 -0.0050853013
-0.4600830418 0.1680377142 0.0587229178
0.1991106591 0.0322380329 -0.2689977711
0.4861678390 -0.1239555245 0.3024269239
0.4557939800 0.0345183991 -0.1364178991
-0.2891059529 -0.3042750457 -0.1676955613
-0.2317305067 -0.4186334095 0.0099201644
-0.2919577651 -0.0859069375 0.3513497850
-0.1912738873 0.2988043853 -0.1938869862
-0.3275381080 0.4070664494 0.1456721877
0.3826288737 -0.0559863198 -0.2067932011
-0.2137156531 0.0424799814 0.3838285842
0.1517697587 -0.3412916664 0.3390695334
-0.3411007315 0.3202355162 0.2143888548
-0.2181271217 0.1167917614 0.3817305145
0.3183504510 0.2278883975 -0.2094908638
0.0489762780 0.3927897340 -0.0083270439
0.1026086433 0.0380375608 0.2628055050
-0.0051350657 0.3460960822 -0.2061698286
0.1211376539 -0.3008911901 -0.2508753044
-0.1642767789 0.2537406989 0.3722477961
-0.3755091417 0.0323654278 -0.2912298088
0.2225500263 0.0085159497 0.2150144894
-0.1994083478 0.1358431501 -0.3176843630
0.1468978958 -0.1945444355 -0.2484408178
-0.3147592647 0.3321519225 0.2283330337
0.0837528520 -0.0659899545 -0.3045329174
-0.0660624526 0.2835381608 -0.2241445581
0.1400324350 -0.4196606442 -0.2191228246
-0.4766268331 0.0251793462 -0.1902943625
-0.0361734442 0.1530171912 -0.2700245995
0.2462325592 -0.4648169363 0.0551714440
-0.1709870242 0.4446236063 0.0838074060
0.1598653850 -0.1391453247 0.3735695790
0.2014544510 -0.0659124251 -0.2323721293
0.3901934337 -0.1782951602 -0.2742779794
-0.2368059184 -0.3933614603 0.1128551579
-0.2544137577 0.3917285745 -0.1690885532
-0.0714523303 0.4063584400 0.0710514622
-0.0364914577 -0.3182234026 0.3798991402
0.1086521021 -0.4489229304 0.1752677891
0.1681020587 -0.0126501939 -0.2522778171
-0.1364043008 0.3833437849 0.1335555823
0.0374049457 0.0572539195 0.4353969727
0.1550708555 0.2996613815 0.1655290189
0.4163558179 0.2534863574 -0.1733407670
-0.4415389499 -0.0106366862 0.2230947297
-0.4664932909 -0.0839416714 0.1532919301
-0.2892954544 -0.1620551198 -0.2839671872
0.0823266711 0.1869091540 -0.2670557556
0.2493221426 0.3517135195 -0.1022287672
0.3594506045 -0.3484456416 -0.3873817180
-0.1327884425 0.3494527977 -0.1719832609
-0.4143938055 -0.0753035368 -0.2065195906
0.0877002025 0.1203796233 -0.2735255295
-0.3246505634 0.2553884825 0.3089471945
-0.3657233888 0.3626845798 -0.1150051937
-0.2468293376 0.2745615550 -0.2480223581
0.0742442017 0.0636200283 -0.2720535544
-0.1638005277 -0.0469815301 -0.3990155124
0.0170812800 0.4107537163 0.0656785951
0.2837978475 -0.2782049310 -0.2211662511
0.3521242710 0.2210601100 0.1256666332
-0.1981149376 0.1118705211 0.3739868486
-0.0991970042 -0.4090389588 0.2008596410
-0.1910732367 -0.4307342028 0.0055093469
-0.2742825540 0.4013691471 -0.1706895105
-0.1697980652 -0.3084823073 -0.2789391801
0.3423634702 -0.4223079308 0.0351968522
0.4022795325 -0.4344142920 0.2131069968
-0.3375979318 0.0169602165 -0.3141015200
-0.0977381161 0.1654752431 -0.2559742069
-0.2269438725 0.2543071379 -0.2221631973
0.2198060608 -0.4322212667 0.1477248070
0.3753029042 0.2641231198 -0.1693812491
-0.1764436509 0.1068947039 0.3820601002
0.1981762372 0.2795394475 -0.2141313931
-0.3504030678 -0.0306036586 0.2976769418
0.4655091959 0.0985022705 0.0186353898
0.2214537824 -0.2277499537 0.3242432048
-0.2842515343 0.2217260112 -0.2739570396
0.3975278340 0.3019288122 -0.0448376713
-0.3831037958 -0.1122667096 -0.2431676884
-0.1525213084 -0.4514962550 0.0008604313
-0.4595251014 0.1692349188 0.0612863247
-0.1071204756 0.0049235345 0.4362894063
0.4331328391 0.0170418057 0.1054575614
0.0571209751 -0.1331345993 0.4291159462
-0.1503475201 0.4059396053 -0.0496992559
-0.2263076662 0.3029396300 0.2984542184
-0.0389770665 0.2914639811 0.2225439597
-0.4026427958 0.2372592356 0.2369010936
-0.0807216611 0.2719336115 0.2884281950
0.1393198150 -0.1381714544 0.3852243738
-0.4255654590 0.1619415901 0.1908957152
0.1770150333 0.2991344910 0.1660872361
0.1169736990 -0.0405867841 0.3688897968
0.1980006603 0.2954708511 0.1647025019
0.2381344830 0.1657379714 0.2139978170
0.3147773004 -0.3881871048 0.1133421828
0.3305336981 -0.3520665152 0.1804877652
0.0457255290 0.1383406993 -0.2949144125
-0.0203955426 0.4066348145 -0.0713171645
-0.2934777820 -0.0142050574 0.3825422125
-0.3571631685 -0.2014297774 -0.2119269070
-0.3097040863 0.3702162466 0.1897830175
0.0741858396 -0.0250263136 0.3452530801
-0.4593711358 0.0453395865 0.1355902450
-0.0454909153 0.2783464361 -0.2260196599
-0.1420291604 -0.1465228307 -0.3837192099
-0.0847709846 0.4091376038 -0.0613135786
0.1490177441 0.3891838116 -0.0949536960
0.2589670277 0.3606840168 -0.0313034239
-0.2315975863 0.4018737809 0.0238328085
-0.3835660050 -0.1391813225 0.2302417174
-0.3087551182 0.2864540985 -0.2361358051
-0.1796968707 0.1808044737 -0.2331712223
-0.2388171534 0.1432910331 -0.2908963494
0.0834119538 -0.1513232439 -0.3223987201
0.4596114866 0.2883730893 -0.0514550435
-0.3965373272 0.3311425658 0.0815976390
-0.0311960381 0.1535995241 0.4007813790
-0.4056943340 0.2292317475 -0.1904162434
-0.3743055293 0.1109054624 -0.2497403388
-0.0726434612 -0.2434914845 -0.3402228921
-0.4306666841 -0.1908139429 0.1099629095
-0.0510880182 -0.2458205322 -0.3392831264
0.2291426373 0.3586576184 -0.1006206169
-0.0947442888 -0.3934623563 -0.2090071102
-0.4104653602 0.3190226751 -0.0227181446
-0.3482076707 -0.2802300435 -0.1566333018
-0.0632319699 0.4086881733 -0.0647560530
0.1952495970 0.0675215796 0.2393923294
0.3866113297 -0.4614493854 0.1261745214
-0.1448695050 0.2463818575 0.3643016656
0.1752325570 -0.0428232170 0.3003900130
-0.0988054855 -0.4559382654 0.1026911472
-0.0847990644 0.2280602053 0.3494176147
-0.2324374221 0.2556039139 0.3478772450
-0.1113577404 -0.4614981698 -0.0034927102
0.2747410406 -0.3662591161 -0.1070269220
0.3969897414 -0.0800047338 0.1919673508
-0.1156265876 0.1141873481 -0.3088735302
0.3148351215 -0.0610749676 0.2047442821
-0.4639776624 -0.1482657446 -0.0935557395
-0.1714872462 -0.1531874315 0.3942693853
-0.2725259229 -0.0806125545 -0.3101012825
0.2216164495 0.2083446489 -0.2473789014
-0.3363940290 0.1606333494 -0.2121506066
0.1908524111 0.2466949071 0.2077547238
-0.4605785917 0.1651612022 0.0605615943
-0.4600587300 0.1664430586 0.0625724610
0.3708496984 0.3122868376 -0.1125252849
-0.0872733588 -0.0820666772 0.4049251326
-0.1382483939 0.0437666563 -0.3631461545
0.0688516187 -0.3254468490 0.3516614528
0.4469001203 0.0970672611 0.0541245211
0.2947771635 0.0595739724 -0.2589389244
0.0203465095 0.1976967744 -0.2531464199
-0.0038399398 0.2725037080 -0.2351998690
0.3700325754 0.2073038613 0.1180239913
-0.4306739215 0.1734917654 -0.0919930504
-0.1593049258 0.1779848488 -0.2421005351
0.0286854596 0.3671873526 -0.1422630664
-0.4045611428 0.2836667965 -0.0949110647
0.0539825111 0.3840031724 0.0589985880
0.3460785994 -0.4626420362 -0.0464208335
-0.2562630015 0.3893067565 0.0272385536
0.0731448920 0.3209364118 0.1751766019
-0.0083979702 -0.2130963519 0.4071855001
-0.1282934370 0.4079240186 -0.0538304070
0.2632528954 -0.0013460384 0.2059833742
0.0632783333 0.0478584860 0.2849502889
0.2054151253 0.4109656807 -0.0272639795
0.4650250054 -0.1170723861 0.2950212836
0.1330448607 0.3803617808 -0.0177857283
0.2959128410 -0.3744651015 0.1119832250
-0.1542480914 0.3488174188 -0.1653273873
-0.4192383924 0.0002801435 -0.2156038672
-0.0494816743 0.4068219060 0.0696223135
-0.1729859113 0.2905156016 0.2063493266
0.4102187864 0.2937205951 -0.1144239247
-0.3808706214 0.3060056288 -0.1297232632
0.4168014925 0.2912951604 -0.0466154936
-0.2700503593 -0.1706887400 -0.2905450181
0.0185614858 0.0621377690 0.4542969990
-0.1901981135 -0.0619100035 0.4266570944
-0.0658207312 0.0819584337 0.4439978954
-0.1002421518 -0.0588292708 -0.3955813346
-0.3826431944 -0.2843223862 -0.0566110586
-0.0815706431 -0.4290325519 0.2047450564
-0.3988780075 -0.0941423443 -0.2252705508
-0.1493855820 0.2950303368 -0.2055458913
0.2655262068 -0.1764789758 -0.2083367372
0.3739627454 0.1099584842 0.1678467795
0.4760455261 0.0375155696 0.0484541682
0.2857259795 -0.0825014448 -0.2304556231
-0.2024075981 0.2076123903 -0.3006453271
0.3361944878 0.3187275821 -0.0384501116
0.3698048099 -0.3012152655 0.2284345712
-0.4603074610 0.1671621963 0.0585860473
0.5000000000 0.0755306727 -0.0194357805
-0.0761551387 0.4157618849 0.0051974954
0.3276400445 -0.0911662138 -0.2307404959
0.2452165844 -0.1707576654 -0.2052241804
-0.0077450163 -0.4364086965 0.0868736062
-0.4298354761 -0.1823152925 -0.1097825082
0.2825413608 -0.3985561089 0.0401062610
0.2745762265 -0.1304172353 -0.2272287575
-0.0255150989 -0.0941417573 0.3918377494
-0.1489545713 -0.0756710552 0.4315931135
0.4318587548 0.1202010209 0.0675789702
0.0823207998 0.1933120595 0.3433738565
-0.4131650979 0.0482036558 -0.2668954229
-0.4178170722 0.0746848149 0.2539583743
0.4004880182 0.0066629455 -0.1799587015
0.2945876720 -0.4053712552 -0.0387432255
0.0532119283 0.0691542155 -0.2753460851
-0.3529121413 0.3975032599 -0.0727795942
-0.0821259282 0.2956056156 0.2214081486
0.4322572514 0.1357761784 -0.1723246847
-0.2539345524 0.4347642793 0.1544626647
0.0404154762 -0.4193168430 0.2955814761
-0.0703226843 0.3839572412 0.1325879164
0.3510685326 0.0164145963 0.1634793402
0.0182400321 -0.0310442030 0.4544197608
-0.3860143028 -0.3358785953 0.0285011261
-0.1302861180 -0.1629729271 0.3897805267
0.3824833056 0.1552248662 0.1457488337
-0.1782891089 -0.3776772864 -0.2022503941
0.1125951693 -0.4807365911 0.0764732863
0.2530198778 0.0752489607 -0.2730420190
0.3876170902 0.1924999442 0.1097341765
0.0681340675 -0.4845309813 -0.1274026183
-0.4599555162 0.0104653196 0.2092144588
-0.2388290750 0.4327380756 -0.1146647160
-0.2731805031 0.2984081245 0.2817972608
0.2299811603 0.2307598952 0.1976091624
0.0273139682 -0.4238322213 0.1818283087
-0.2559396343 -0.3003473683 -0.2793567054
0.0622903965 -0.4167408697 0.2884415271
-0.4764770581 0.0477081944 -0.0316883048
-0.0600915927 -0.4295001710 0.2007664519
0.2571239071 -0.2233384492 -0.1815036029
-0.0154646904 -0.3199775152 0.3745598061
-0.4599281142 0.1669511062 0.0626555689
-0.3564879649 0.0247732334 -0.3023005836
0.4479680028 -0.1878959599 0.2943322985
0.0536720553 0.3120204941 -0.1972141540
0.0949541060 -0.4230998427 -0.2213140173
0.3976728960 0.1344211716 0.1283997863
0.0467377495 0.0526690465 0.3258126971
-0.3939864749 0.1697426472 -0.1529035101
0.0306863448 -0.4167645233 -0.2189506026
-0.3099370562 -0.0620625020 -0.2895949652
0.3418635788 -0.3352778016 -0.3753972788
0.0811418268 -0.4766018900 -0.0222849630
-0.0785022512 -0.3622467982 0.2905236879
-0.1810179727 0.3034603032 0.3092701793
0.2180959206 0.1721037650 0.2182525465
0.1262730123 -0.1052837253 -0.2295912939
0.0560684052 -0.0289322946 0.3910048768
0.4354735317 -0.0771403440 -0.2836374178
0.0119610113 0.3930360048 -0.1509015553
-0.3161434576 0.4069585541 -0.1628916317
0.4494704228 -0.2645796991 0.2742758665
0.4287962991 0.0235494357 -0.1587184542
0.4899896680 -0.0078131762 0.0749875218
0.3568137087 0.2858328613 0.0230340481
-0.4103473565 -0.1599466218 -0.1844665155
0.3011952944 0.3552590607 -0.0359679748
-0.0569601287 0.0232272407 -0.3805088776
-0.3138124949 -0.2332519476 0.2706020377
-0.4597677359 0.1689713705 0.0595880449
-0.3065656073 0.3600000739 0.0343429732
-0.0045638842 0.4115841574 0.0672910790
-0.3616072398 -0.2709748957 0.1121927599
-0.1426795659 0.4102211228 0.0131577482
-0.2894437151 0.3641739696 0.1869229510
0.3654524612 -0.4726196432 -0.0487343724
-0.3140384263 0.1983036083 0.3306224316
-0.2739438086 0.4418167359 0.1573967551
0.1701803175 0.3181107734 -0.1499952665
-0.1997964436 -0.4209480624 -0.0992651064
-0.0771629957 0.1607912681 -0.2589678515
-0.1303493338 -0.4068857021 -0.0988751703
0.0099701242 -0.4122372569 -0.2169762173
-0.1998320433 -0.3193554083 0.2948280253
0.1879091673 -0.4066432522 -0.2122249751
-0.2569480269 0.0596234543 0.3523916818
-0.2214143501 0.3697813032 0.1930553851
0.4135020827 -0.0286065143 -0.1850936771
0.4783670546 0.0553188047 0.0300181894
-0.1283394983 0.2940529009 -0.2124652499
-0.1765455176 0.4205887713 -0.1225723715
0.0500072503 -0.4252543930 -0.0168142815
-0.0958745454 -0.2855630894 0.3687044062
-0.1606580039 0.3993244952 0.0760623855
0.3032253963 -0.1091326273 0.2039396535
0.3275743179 0.1902399401 0.1715949204
-0.4302273236 -0.0573439646 -0.1888196030
0.0373872310 -0.0308206423 0.4268119548
-0.1093396073 -0.4102647393 -0.1006777821
-0.1127058167 -0.3681705633 0.1885752778
0.3224645098 0.1647906146 -0.2356999183
-0.2107590625 0.3977440867 -0.1862191685
-0.1398031326 0.2936363985 0.3049982778
0.2988139308 -0.2079703218 -0.2384571659
-0.2221294925 0.1908594577 0.3840683066
0.1379083169 -0.0467359082 0.3726636571
0.0623044571 -0.1475555009 -0.3224037331
-0.1429771083 0.3370885306 0.1763328998
-0.3566915848 0.1038504245 -0.2753789543
-0.4877483578 -0.0031213236 -0.0229984653
0.1910523930 0.0919093057 -0.2723816785
0.2382361090 0.2824552965 0.1584051399
0.4695075482 0.0032777516 -0.1440430468
0.2420680582 -0.1442399347 0.3298059028
0.0498562068 -0.4266079765 -0.2235339713
0.2666683306 0.0999439829 0.2167411341
0.2688533210 -0.2557540629 -0.2052462559
0.2811075264 0.3045847958 0.0972471465
-0.4258100016 0.2291918445 -0.1723816897
0.0980004643 -0.3038262071 -0.2548772932
-0.1175963696 0.3904104326 -0.1211576353
-0.3920573450 0.3305819836 -0.0830512007
0.3101369688 0.3322501831 -0.1074465087
-0.2745437784 -0.1913706459 0.3388865264
0.2839813718 -0.3069413158 0.2624502882
-0.4604393369 0.1665510155 0.0587250967
-0.2402287827 -0.3585054685 0.2096679525
-0.4171762244 -0.2846620658 0.0339707816
-0.4458158575 0.2280162394 -0.1507399303
-0.0460858966 -0.0911293873 0.3986269269
0.2615954134 0.3134280022 0.1008318966
-0.3001800293 0.0767698452 0.3209516716
0.2064419640 0.1179501235 0.2308655184
-0.3687329053 0.3045362695 0.1968244185
-0.0963847370 0.3887901714 -0.1250510817
-0.0354882019 0.0189082867 -0.3758035431
-0.2042728393 -0.0358901452 -0.3905926392
-0.0435673964 0.0769677472 0.4576236754
0.0775134567 0.2435966136 -0.2329537659
-0.3312024439 -0.2094511684 0.2603227712
0.0984906424 0.2420218951 -0.2391596836
-0.0208864516 0.2067248369 -0.2472396803
0.1774719476 0.2837816529 -0.2113970725
-0.1004151330 0.2791670526 0.2939501724
0.2702642105 0.3484178605 -0.1048708610
-0.1657234363 0.4046331037 0.0160704678
-0.3332181647 0.3655974446 0.1860356278
-0.4596291957 0.1683254716 0.0623653033
0.4528163596 0.2905296334 -0.1206636660
0.4825480452 0.0466893332 -0.1191512432
0.2866212165 0.0936947179 0.2114406181
-0.3653111313 0.2277233245 -0.2214332502
0.4239475638 -0.0657762012 -0.2101929700
0.3438654560 -0.0210491543 0.1803370027
0.4714936334 0.1352814677 -0.0082025758
0.0637240340 0.3626803190 -0.0087364403
0.4177046077 0.1797399443 -0.2015231373
0.2368934296 0.3298695625 0.0380794570
-0.3166567184 -0.3620997630 0.1194764971
0.1598738498 -0.0566862018 -0.2302054713
-0.1774862974 -0.2238782370 -0.3354016992
0.2890332069 -0.1726055993 0.2136813816
-0.4595741332 0.1692763453 0.0607282264
-0.2151047215 -0.3527773825 -0.1905201043
0.4224981481 -0.3835095479 0.2889300879
0.3559530322 -0.0706811190 0.1990607314
-0.1997637363 0.0587771891 -0.3544617919
3 870 691 491
3 491 691 999
3 491 999 180
3 180 999 594
3 180 594 525
3 525 594 119
3 525 119 366
3 366 119 836
3 366 836 638
3 638 836 571
3 638 571 76
3 76 571 547
3 76 547 962
3 962 547 1386
3 962 1386 406
3 406 1386 581
3 406 581 1244
3 1244 581 1281
3 1244 1281 697
3 697 1281 809
3 697 809 1020
3 1020 809 1
3 1020 1 1026
3 1026 1 90
3 1026 90 212
3 212 90 899
3 212 899 88
3 88 899 82
3 88 82 186
3 186 82 253
3 186 253 612
3 612 253 815
3 612 815 218
3 218 815 1061
3 218 1061 81
3 81 1061 187
3 81 187 1338
3 1338 187 1120
3 1338 1120 448
3 448 1120 744
3 448 744 894
3 894 744 1138
3 894 1138 1340
3 1340 1138 798
3 1340 798 1357
3 1357 798 1194
3 1357 1194 933
3 933 1194 1055
3 933 1055 396
3 396 1055 263
3 396 263 159
3 159 263 932
3 159 932 24
3 24 932 484
3 24 484 177
3 177 484 270
3 177 270 231
3 231 270 789
3 231 789 508
3 508 789 1350
3 508 1350 872
3 872 1350 333
3 872 333 1288
3 1288 333 1311
3 1288 1311 897
3 897 1311 476
3 897 476 485
3 485 476 756
3 485 756 255
3 255 756 1030
3 255 1030 958
3 958 1030 883
3 958 883 394
3 394 883 175
3 394 175 706
3 706 175 663
3 706 663 140
3 140 663 277
3 140 277 1195
3 1195 277 143
3 1195 143 153
3 153 143 1271
3 153 1271 627
3 627 1271 648
3 627 648 625
3 625 648 570
3 625 570 637
3 637 570 1221
3 637 1221 378
3 378 1221 1334
3 691 874 999
3 999 874 552
3 999 552 594
3 594 552 968
3 594 968 119
3 119 968 338
3 119 338 836
3 836 338 372
3 836 372 571
3 571 372 1180
3 571 1180 547
3 547 1180 285
3 547 285 1386
3 1386 285 5
3 1386 5 581
3 581 5 762
3 581 762 1281
3 1281 762 1331
3 1281 1331 809
3 809 1331 205
3 809 205 1
3 1 205 826
3 1 826 90
3 90 826 1417
3 90 1417 899
3 899 1417 974
3 899 974 82
3 82 974 74
3 82 74 253
3 253 74 614
3 253 614 815
3 815 614 1091
3 815 1091 1061
3 1061 1091 685
3 1061 685 187
3 187 685 835
3 187 835 1120
3 1120 835 769
3 1120 769 744
3 744 769 839
3 744 839 1138
3 1138 839 935
3 1138 935 798
3 798 935 299
3 798 299 1194
3 1194 299 1191
3 1194 1191 1055
3 1055 1191 200
3 1055 200 263
3 263 200 849
3 263 849 932
3 932 849 219
3 932 219 484
3 484 219 1260
3 484 1260 270
3 270 1260 441
3 270 441 789
3 789 441 868
3 789 868 1350
3 1350 868 238
3 1350 238 333
3 333 238 975
3 333 975 1311
3 1311 975 102
3 1311 102 476
3 476 102 1285
3 476 1285 756
3 756 1285 796
3 756 796 1030
3 1030 796 554
3 1030 554 883
3 883 554 124
3 883 124 175
3 175 124 463
3 175 463 663
3 663 463 611
3 663 611 277
3 277 611 1086
3 277 1086 143
3 143 1086 1262
3 143 1262 1271
3 1271 1262 144
3 1271 144 648
3 648 144 145
3 648 145 570
3 570 145 1123
3 570 1123 1221
3 1221 1123 254
3 1221 254 1334
3 1334 254 395
3 874 1205 552
3 552 1205 740
3 552 740 968
3 968 740 1102
3 968 1102 338
3 338 1102 315
3 338 315 372
3 372 315 754
3 372 754 1180
3 1180 754 235
3 1180 235 285
3 285 235 73
3 285 73 5
3 5 73 764
3 5 764 762
3 762 764 137
3 762 137 1331
3 1331 137 1046
3 1331 1046 205
3 205 1046 274
3 205 274 826
3 826 274 62
3 826 62 1417
3 1417 62 195
3 1417 195 974
3 974 195 875
3 974 875 74
3 74 875 900
3 74 900 614
3 614 900 1385
3 614 1385 1091
3 1091 1385 601
3 1091 601 685
3 685 601 273
3 685 273 835
3 835 273 408
3 835 408 769
3 769 408 356
3 769 356 839
3 839 356 258
3 839 258 935
3 935 258 1358
3 935 1358 299
3 299 1358 1119
3 299 1119 1191
3 1191 1119 1245
3 1191 1245 200
3 200 1245 1297
3 200 1297 849
3 849 1297 599
3 849 599 219
3 219 599 70
3 219 70 1260
3 1260 70 985
3 1260 985 441
3 441 985 1293
3 441 1293 868
3 868 1293 866
3 868 866 238
3 238 866 871
3 238 871 975
3 975 871 497
3 975 497 102
3 102 497 1095
3 102 1095 1285
3 1285 1095 1052
3 1285 1052 796
3 796 1052 122
3 796 122 554
3 554 122 411
3 554 411 124
3 124 411 912
3 124 912 463
3 463 912 1128
3 463 1128 611
3 611 1128 220
3 611 220 1086
3 1086 220 75
3 1086 75 1262
3 1262 75 1231
3 1262 1231 144
3 144 1231 1154
3 144 1154 145
3 145 1154 851
3 145 851 1123
3 1123 851 0
3 1123 0 254
3 254 0 853
3 254 853 395
3 395 853 1188
3 1205 726 740
3 740 726 1162
3 740 1162 1102
3 1102 1162 1036
3 1102 1036 315
3 315 1036 1017
3 315 1017 754
3 754 1017 162
3 754 162 235
3 235 162 163
3 235 163 73
3 73 163 1169
3 73 1169 764
3 764 1169 42
3 764 42 137
3 137 42 855
3 137 855 1046
3 1046 855 1398
3 1046 1398 274
3 274 1398 1327
3 274 1327 62
3 62 1327 486
3 62 486 195
3 195 486 440
3 195 440 875
3 875 440 908
3 875 908 900
3 900 908 85
3 900 85 1385
3 1385 85 271
3 1385 271 601
3 601 271 1342
3 601 1342 273
3 273 1342 632
3 273 632 408
3 408 632 339
3 408 339 356
3 356 339 382
3 356 382 258
3 258 382 657
3 258 657 1358
3 1358 657 951
3 1358 951 1119
3 1119 951 1312
3 1119 1312 1245
3 1245 1312 620
3 1245 620 1297
3 1297 620 668
3 1297 668 599
3 599 668 27
3 599 27 70
3 70 27 596
3 70 596 985
3 985 596 589
3 985 589 1293
3 1293 589 1277
3 1293 1277 866
3 866 1277 1295
3 866 1295 871
3 871 1295 783
3 871 783 497
3 497 783 248
3 497 248 1095
3 1095 248 309
3 1095 309 1052
3 1052 309 837
3 1052 837 122
3 122 837 431
3 122 431 411
3 411 431 281
3 411 281 912
3 912 281 689
3 912 689 1128
3 1128 689 499
3 1128 499 220
3 220 499 526
3 220 526 75
3 75 526 541
3 75 541 1231
3 1231 541 654
3 1231 654 1154
3 1154 654 1155
3 1154 1155 851
3 851 1155 1023
3 851 1023 0
3 0 1023 817
3 0 817 853
3 853 817 449
3 853 449 1188
3 1188 449 1124
3 726 19 1162
3 1162 19 1289
3 1162 1289 1036
3 1036 1289 1101
3 1036 1101 1017
3 1017 1101 295
3 1017 295 162
3 162 295 86
3 162 86 163
3 163 86 980
3 163 980 1169
3 1169 980 845
3 1169 845 42
3 42 845 181
3 42 181 855
3 855 181 98
3 855 98 1398
3 1398 98 241
3 1398 241 1327
3 1327 241 915
3 1327 915 486
3 486 915 1382
3 486 1382 440
3 440 1382 412
3 440 412 908
3 908 412 546
3 908 546 85
3 85 546 1040
3 85 1040 271
3 271 1040 313
3 271 313 1342
3 1342 313 91
3 1342 91 632
3 632 91 240
3 632 240 339
3 339 240 51
3 339 51 382
3 382 51 399
3 382 399 657
3 657 399 1351
3 657 1351 951
3 951 1351 563
3 951 563 1312
3 1312 563 518
3 1312 518 620
3 620 518 1094
3 620 1094 668
3 668 1094 1299
3 668 1299 27
3 27 1299 1019
3 27 1019 596
3 596 1019 957
3 596 957 589
3 589 957 803
3 589 803 1277
3 1277 803 1210
3 1277 1210 1295
3 1295 1210 713
3 1295 713 783
3 783 713 856
3 783 856 248
3 248 856 1001
3 248 1001 309
3 309 1001 1067
3 309 1067 837
3 837 1067 397
3 837 397 431
3 431 397 409
3 431 409 281
3 281 409 812
3 281 812 689
3 689 812 568
3 689 568 499
3 499 568 776
3 499 776 526
3 526 776 1383
3 526 1383 541
3 541 1383 1041
3 541 1041 654
3 654 1041 264
3 654 264 1155
3 1155 264 286
3 1155 286 1023
3 1023 286 1254
3 1023 1254 817
3 817 1254 960
3 817 960 449
3 449 960 115
3 449 115 1124
3 1124 115 1423
3 19 328 1289
3 1289 328 307
3 1289 307 1101
3 1101 307 819
3 1101 819 295
3 295 819 569
3 295 569 86
3 86 569 209
3 86 209 980
3 980 209 1033
3 980 1033 845
3 845 1033 1132
3 845 1132 181
3 181 1132 132
3 181 132 98
3 98 132 207
3 98 207 241
3 241 207 1062
3 241 1062 915
3 915 1062 413
3 915 413 1382
3 1382 413 593
3 1382 593 412
3 412 593 765
3 412 765 546
3 546 765 131
3 546 131 1040
3 1040 131 165
3 1040 165 313
3 313 165 1200
3 313 1200 91
3 91 1200 216
3 91 216 240
3 240 216 1282
3 240 1282 51
3 51 1282 252
3 51 252 399
3 399 252 278
3 399 278 1351
3 1351 278 436
3 1351 436 563
3 563 436 176
3 563 176 518
3 518 176 289
3 518 289 1094
3 1094 289 1224
3 1094 1224 1299
3 1299 1224 190
3 1299 190 1019
3 1019 190 364
3 1019 364 957
3 957 364 867
3 957 867 803
3 803 867 206
3 803 206 1210
3 1210 206 506
3 1210 506 713
3 713 506 696
3 713 696 856
3 856 696 456
3 856 456 1001
3 1001 456 850
3 1001 850 1067
3 1067 850 592
3 1067 592 397
3 397 592 403
3 397 403 409
3 409 403 1134
3 409 1134 812
3 812 1134 665
3 812 665 568
3 568 665 133
3 568 133 776
3 776 133 1420
3 776 1420 1383
3 1383 1420 433
3 1383 433 1041
3 1041 433 737
3 1041 737 264
3 264 737 859
3 264 859 286
3 286 859 142
3 286 142 1254
3 1254 142 732
3 1254 732 960
3 960 732 642
3 960 642 115
3 115 642 1048
3 115 1048 1423
3 1423 1048 1320
3 328 991 307
3 307 991 544
3 307 544 819
3 819 544 1269
3 819 1269 569
3 569 1269 633
3 569 633 209
3 209 633 720
3 209 720 1033
3 1033 720 773
3 1033 773 1132
3 1132 773 940
3 1132 940 132
3 132 940 865
3 132 865 207
3 207 865 1158
3 207 1158 1062
3 1062 1158 864
3 1062 864 413
3 413 864 972
3 413 972 593
3 593 972 816
3 593 816 765
3 765 816 39
3 765 39 131
3 131 39 1241
3 131 1241 165
3 165 1241 651
3 165 651 1200
3 1200 651 1265
3 1200 1265 216
3 216 1265 941
3 216 941 1282
3 1282 941 34
3 1282 34 252
3 252 34 1208
3 252 1208 278
3 278 1208 832
3 278 832 436
3 436 832 1388
3 436 1388 176
3 176 1388 1264
3 176 1264 289
3 289 1264 1024
3 289 1024 1224
3 1224 1024 104
3 1224 104 190
3 190 104 336
3 190 336 364
3 364 336 1142
3 364 1142 867
3 867 1142 416
3 867 416 206
3 206 416 168
3 206 168 506
3 506 168 738
3 506 738 696
3 696 738 1148
3 696 1148 456
3 456 1148 1088
3 456 1088 850
3 850 1088 377
3 850 377 592
3 592 377 225
3 592 225 403
3 403 225 213
3 403 213 1134
3 1134 213 1372
3 1134 1372 665
3 665 1372 1049
3 665 1049 133
3 133 1049 4
3 133 4 1420
3 1420 4 1353
3 1420 1353 433
3 433 1353 415
3 433 415 737
3 737 415 604
3 737 604 859
3 859 604 578
3 859 578 142
3 142 578 380
3 142 380 732
3 732 380 60
3 732 60 642
3 642 60 917
3 642 917 1048
3 1048 917 1302
3 1048 1302 1320
3 1320 1302 53
3 991 750 544
3 544 750 134
3 544 134 1269
3 1269 134 10
3 1269 10 633
3 633 10 265
3 633 265 720
3 720 265 749
3 720 749 773
3 773 749 558
3 773 558 940
3 940 558 967
3 940 967 865
3 865 967 1390
3 865 1390 1158
3 1158 1390 670
3 1158 670 864
3 864 670 1344
3 864 1344 972
3 972 1344 381
3 972 381 816
3 816 381 1066
3 816 1066 39
3 39 1066 64
3 39 64 1241
3 1241 64 775
3 1241 775 651
3 651 775 656
3 651 656 1265
3 1265 656 719
3 1265 719 941
3 941 719 1140
3 941 1140 34
3 34 1140 419
3 34 419 1208
3 1208 419 619
3 1208 619 832
3 832 619 700
3 832 700 1388
3 1388 700 146
3 1388 146 1264
3 1264 146 582
3 1264 582 1024
3 1024 582 1280
3 1024 1280 104
3 104 1280 1356
3 104 1356 336
3 336 1356 1316
3 336 1316 1142
3 1142 1316 1161
3 1142 1161 416
3 416 1161 684
3 416 684 168
3 168 684 1151
3 168 1151 738
3 738 1151 1364
3 738 1364 1148
3 1148 1364 464
3 1148 464 1088
3 1088 464 1190
3 1088 1190 377
3 377 1190 918
3 377 918 225
3 225 918 101
3 225 101 213
3 213 101 992
3 213 992 1372
3 1372 992 884
3 1372 884 1049
3 1049 884 467
3 1049 467 4
3 4 467 44
3 4 44 1353
3 1353 44 1198
3 1353 1198 415
3 415 1198 791
3 415 791 604
3 604 791 1424
3 604 1424 578
3 578 1424 236
3 578 236 380
3 380 236 1196
3 380 1196 60
3 60 1196 521
3 60 521 917
3 917 521 1012
3 917 1012 1302
3 1302 1012 1229
3 1302 1229 53
3 53 1229 1058
3 750 1206 134
3 134 1206 1149
3 134 1149 10
3 10 1149 841
3 10 841 265
3 265 841 576
3 265 576 749
3 749 576 63
3 749 63 558
3 558 63 215
3 558 215 967
3 967 215 655
3 967 655 1390
3 1390 655 179
3 1390 179 670
3 670 179 301
3 670 301 1344
3 1344 301 361
3 1344 361 381
3 381 361 1069
3 381 1069 1066
3 1066 1069 1118
3 1066 1118 64
3 64 1118 1130
3 64 1130 775
3 775 1130 451
3 775 451 656
3 656 451 367
3 656 367 719
3 719 367 376
3 719 376 1140
3 1140 376 482
3 1140 482 419
3 419 482 1242
3 419 1242 619
3 619 1242 1396
3 619 1396 700
3 700 1396 784
3 700 784 146
3 146 784 580
3 146 580 582
3 582 580 1240
3 582 1240 1280
3 1280 1240 1098
3 1280 1098 1356
3 1356 1098 1306
3 1356 1306 1316
3 1316 1306 1227
3 1316 1227 1161
3 1161 1227 996
3 1161 996 684
3 684 996 1072
3 684 1072 1151
3 1151 1072 562
3 1151 562 1364
3 1364 562 1039
3 1364 1039 464
3 464 1039 1003
3 464 1003 1190
3 1190 1003 249
3 1190 249 918
3 918 249 608
3 918 608 101
3 101 608 1077
3 101 1077 992
3 992 1077 880
3 992 880 884
3 884 880 1226
3 884 1226 467
3 467 1226 939
3 467 939 44
3 44 939 49
3 44 49 1198
3 1198 49 77
3 1198 77 791
3 791 77 1412
3 791 1412 1424
3 1424 1412 507
3 1424 507 236
3 236 507 895
3 236 895 1196
3 1196 895 606
3 1196 606 521
3 521 606 280
3 521 280 1012
3 1012 280 535
3 1012 535 1229
3 1229 535 135
3 1229 135 1058
3 1058 135 454
3 1206 1300 1149
3 1149 1300 704
3 1149 704 841
3 841 704 312
3 841 312 576
3 576 312 782
3 576 782 63
3 63 782 350
3 63 350 215
3 215 350 1335
3 215 1335 655
3 655 1335 945
3 655 945 179
3 179 945 770
3 179 770 301
3 301 770 1053
3 301 1053 361
3 361 1053 1363
3 361 1363 1069
3 1069 1363 391
3 1069 391 1118
3 1118 391 636
3 1118 636 1130
3 1130 636 305
3 1130 305 451
3 451 305 196
3 451 196 367
3 367 196 379
3 367 379 376
3 376 379 587
3 376 587 482
3 482 587 639
3 482 639 1242
3 1242 639 877
3 1242 877 1396
3 1396 877 1176
3 1396 1176 784
3 784 1176 831
3 784 831 580
3 580 831 607
3 580 607 1240
3 1240 607 1016
3 1240 1016 1098
3 1098 1016 374
3 1098 374 1306
3 1306 374 979
3 1306 979 1227
3 1227 979 354
3 1227 354 996
3 996 354 778
3 996 778 1072
3 1072 778 916
3 1072 916 562
3 562 916 29
3 562 29 1039
3 1039 29 41
3 1039 41 1003
3 1003 41 442
3 1003 442 249
3 249 442 1187
3 249 1187 608
3 608 1187 528
3 608 528 1077
3 1077 528 251
3 1077 251 880
3 880 251 969
3 880 969 1226
3 1226 969 430
3 1226 430 939
3 939 430 540
3 939 540 49
3 49 540 846
3 49 846 77
3 77 846 393
3 77 393 1412
3 1412 393 1279
3 1412 1279 507
3 507 1279 50
3 507 50 895
3 895 50 661
3 895 661 606
3 606 661 1008
3 606 1008 280
3 280 1008 671
3 280 671 535
3 535 671 752
3 535 752 135
3 135 752 221
3 135 221 454
3 454 221 953
3 1300 646 704
3 704 646 1146
3 704 1146 312
3 312 1146 203
3 312 203 782
3 782 203 896
3 782 896 350
3 350 896 1110
3 350 1110 1335
3 1335 1110 435
3 1335 435 945
3 945 435 112
3 945 112 770
3 770 112 495
3 770 495 1053
3 1053 495 1193
3 1053 1193 1363
3 1363 1193 148
3 1363 148 391
3 391 148 810
3 391 810 636
3 636 810 1075
3 636 1075 305
3 305 1075 1189
3 305 1189 196
3 196 1189 47
3 196 47 379
3 379 47 242
3 379 242 587
3 587 242 1192
3 587 1192 639
3 639 1192 1042
3 639 1042 877
3 877 1042 455
3 877 455 1176
3 1176 455 807
3 1176 807 831
3 831 807 461
3 831 461 607
3 607 461 635
3 607 635 1016
3 1016 635 171
3 1016 171 374
3 374 171 777
3 374 777 979
3 979 777 1267
3 979 1267 354
3 354 1267 149
3 354 149 778
3 778 149 33
3 778 33 916
3 916 33 834
3 916 834 29
3 29 834 139
3 29 139 41
3 41 139 502
3 41 502 442
3 442 502 640
3 442 640 1187
3 1187 640 1391
3 1187 1391 528
3 528 1391 509
3 528 509 251
3 251 509 788
3 251 788 969
3 969 788 1374
3 969 1374 430
3 430 1374 1409
3 430 1409 540
3 540 1409 688
3 540 688 846
3 846 688 889
3 846 889 393
3 393 889 564
3 393 564 1279
3 1279 564 1013
3 1279 1013 50
3 50 1013 538
3 50 538 661
3 661 538 829
3 661 829 1008
3 1008 829 517
3 1008 517 671
3 671 517 1141
3 671 1141 752
3 752 1141 69
3 752 69 221
3 221 69 118
3 221 118 953
3 953 118 1322
3 646 323 1146
3 1146 323 550
3 1146 550 203
3 203 550 729
3 203 729 896
3 896 729 902
3 896 902 1110
3 1110 902 232
3 1110 232 435
3 435 232 327
3 435 327 112
3 112 327 1291
3 112 1291 495
3 495 1291 383
3 495 383 1193
3 1193 383 1144
3 1193 1144 148
3 148 1144 375
3 148 375 810
3 810 375 1313
3 810 1313 1075
3 1075 1313 365
3 1075 365 1189
3 1189 365 1361
3 1189 1361 47
3 47 1361 520
3 47 520 242
3 242 520 1402
3 242 1402 1192
3 1192 1402 1147
3 1192 1147 1042
3 1042 1147 282
3 1042 282 455
3 455 282 537
3 455 537 807
3 807 537 539
3 807 539 461
3 461 539 370
3 461 370 635
3 635 370 588
3 635 588 171
3 171 588 699
3 171 699 777
3 777 699 155
3 777 155 1267
3 1267 155 579
3 1267 579 149
3 149 579 887
3 149 887 33
3 33 887 921
3 33 921 834
3 834 921 672
3 834 672 139
3 139 672 503
3 139 503 502
3 502 503 643
3 502 643 640
3 640 643 751
3 640 751 1391
3 1391 751 1314
3 1391 1314 509
3 509 1314 1153
3 509 1153 788
3 788 1153 259
3 788 259 1374
3 1374 259 755
3 1374 755 1409
3 1409 755 452
3 1409 452 688
3 688 452 56
3 688 56 889
3 889 56 308
3 889 308 564
3 564 308 736
3 564 736 1013
3 1013 736 1249
3 1013 1249 538
3 538 1249 343
3 538 343 829
3 829 343 990
3 829 990 517
3 517 990 882
3 517 882 1141
3 1141 882 138
3 1141 138 69
3 69 138 373
3 69 373 118
3 118 373 873
3 118 873 1322
3 1322 873 820
3 323 1406 550
3 550 1406 735
3 550 735 729
3 729 735 1392
3 729 1392 902
3 902 1392 1068
3 902 1068 232
3 232 1068 1080
3 232 1080 327
3 327 1080 320
3 327 320 1291
3 1291 320 718
3 1291 718 383
3 383 718 711
3 383 711 1144
3 1144 711 66
3 1144 66 375
3 375 66 708
3 375 708 1313
3 1313 708 160
3 1313 160 365
3 365 160 1235
3 365 1235 1361
3 1361 1235 287
3 1361 287 520
3 520 287 977
3 520 977 1402
3 1402 977 239
3 1402 239 1147
3 1147 239 1274
3 1147 1274 282
3 282 1274 560
3 282 560 537
3 537 560 1145
3 537 1145 539
3 539 1145 247
3 539 247 370
3 370 247 156
3 370 156 588
3 588 156 557
3 588 557 699
3 699 557 844
3 699 844 155
3 155 844 318
3 155 318 579
3 579 318 913
3 579 913 887
3 887 913 623
3 887 623 921
3 921 623 106
3 921 106 672
3 672 106 369
3 672 369 503
3 503 369 927
3 503 927 643
3 643 927 1204
3 643 1204 751
3 751 1204 616
3 751 616 1314
3 1314 616 1292
3 1314 1292 1153
3 1153 1292 487
3 1153 487 259
3 259 487 591
3 259 591 755
3 755 591 483
3 755 483 452
3 452 483 329
3 452 329 56
3 56 329 1354
3 56 1354 308
3 308 1354 797
3 308 797 736
3 736 797 385
3 736 385 1249
3 1249 385 1283
3 1249 1283 343
3 343 1283 1305
3 343 1305 990
3 990 1305 35
3 990 35 882
3 882 35 390
3 882 390 138
3 138 390 384
3 138 384 373
3 373 384 741
3 373 741 873
3 873 741 1250
3 873 1250 820
3 820 1250 946
3 1406 410 735
3 735 410 202
3 735 202 1392
3 1392 202 989
3 1392 989 1068
3 1068 989 1405
3 1068 1405 1080
3 1080 1405 1160
3 1080 1160 320
3 320 1160 1333
3 320 1333 718
3 718 1333 322
3 718 322 711
3 711 322 304
3 711 304 66
3 66 304 1345
3 66 1345 708
3 708 1345 72
3 708 72 160
3 160 72 421
3 160 421 1235
3 1235 421 18
3 1235 18 287
3 287 18 1366
3 287 1366 977
3 977 1366 31
3 977 31 239
3 239 31 787
3 239 787 1274
3 1274 787 950
3 1274 950 560
3 560 950 910
3 560 910 1145
3 1145 910 117
3 1145 117 247
3 247 117 96
3 247 96 156
3 156 96 260
3 156 260 557
3 557 260 938
3 557 938 844
3 844 938 888
3 844 888 318
3 318 888 1223
3 318 1223 913
3 913 1223 352
3 913 352 623
3 623 352 712
3 623 712 106
3 106 712 905
3 106 905 369
3 369 905 1099
3 369 1099 927
3 927 1099 1150
3 927 1150 1204
3 1204 1150 1152
3 1204 1152 616
3 616 1152 481
3 616 481 1292
3 1292 481 1370
3 1292 1370 487
3 487 1370 694
3 487 694 591
3 591 694 359
3 591 359 483
3 483 359 674
3 483 674 329
3 329 674 813
3 329 813 1354
3 1354 813 956
3 1354 956 797
3 797 956 1117
3 797 1117 385
3 385 1117 1215
3 385 1215 1283
3 1283 1215 1287
3 1283 1287 1305
3 1305 1287 929
3 1305 929 35
3 35 929 386
3 35 386 390
3 390 386 1266
3 390 1266 384
3 384 1266 1211
3 384 1211 741
3 741 1211 577
3 741 577 1250
3 1250 577 1347
3 1250 1347 946
3 946 1347 100
3 410 730 202
3 202 730 426
3 202 426 989
3 989 426 158
3 989 158 1405
3 1405 158 1064
3 1405 1064 1160
3 1160 1064 811
3 1160 811 1333
3 1333 811 1336
3 1333 1336 322
3 322 1336 1276
3 322 1276 304
3 304 1276 556
3 304 556 1345
3 1345 556 46
3 1345 46 72
3 72 46 757
3 72 757 421
3 421 757 715
3 421 715 18
3 18 715 197
3 18 197 1366
3 1366 197 1097
3 1366 1097 31
3 31 1097 572
3 31 572 787
3 787 572 1027
3 787 1027 950
3 950 1027 1278
3 950 1278 910
3 910 1278 184
3 910 184 117
3 117 184 795
3 117 795 96
3 96 795 154
3 96 154 260
3 260 154 166
3 260 166 938
3 938 166 473
3 938 473 888
3 888 473 324
3 888 324 1223
3 1223 324 682
3 1223 682 352
3 352 682 1025
3 352 1025 712
3 712 1025 108
3 712 108 905
3 905 108 922
3 905 922 1099
3 1099 922 214
3 1099 214 1150
3 1150 214 93
3 1150 93 1152
3 1152 93 107
3 1152 107 481
3 481 107 37
3 481 37 1370
3 1370 37 799
3 1370 799 694
3 694 799 1389
3 694 1389 359
3 359 1389 1376
3 359 1376 674
3 674 1376 827
3 674 827 813
3 813 827 641
3 813 641 956
3 956 641 1045
3 956 1045 1117
3 1117 1045 488
3 1117 488 1215
3 1215 488 424
3 1215 424 1287
3 1287 424 398
3 1287 398 929
3 929 398 838
3 929 838 386
3 386 838 524
3 386 524 1266
3 1266 524 420
3 1266 420 1211
3 1211 420 172
3 1211 172 577
3 577 172 1133
3 577 1133 1347
3 1347 1133 707
3 1347 707 100
3 100 707 602
3 730 1139 426
3 426 1139 1175
3 426 1175 158
3 158 1175 174
3 158 174 1064
3 1064 174 649
3 1064 649 811
3 811 649 519
3 811 519 1336
3 1336 519 858
3 1336 858 1276
3 1276 858 565
3 1276 565 556
3 556 565 1043
3 556 1043 46
3 46 1043 885
3 46 885 757
3 757 885 1015
3 757 1015 715
3 715 1015 1087
3 715 1087 197
3 197 1087 1352
3 197 1352 1097
3 1097 1352 678
3 1097 678 572
3 572 678 147
3 572 147 1027
3 1027 147 772
3 1027 772 1278
3 1278 772 1093
3 1278 1093 184
3 184 1093 1234
3 184 1234 795
3 795 1234 346
3 795 346 154
3 154 346 1330
3 154 1330 166
3 166 1330 1115
3 166 1115 473
3 473 1115 297
3 473 297 324
3 324 297 1220
3 324 1220 682
3 682 1220 1035
3 682 1035 1025
3 1025 1035 986
3 1025 986 108
3 108 986 687
3 108 687 922
3 922 687 686
3 922 686 214
3 214 686 45
3 214 45 93
3 93 45 733
3 93 733 107
3 107 733 722
3 107 722 37
3 37 722 585
3 37 585 799
3 799 585 1416
3 799 1416 1389
3 1389 1416 705
3 1389 705 1376
3 1376 705 36
3 1376 36 827
3 827 36 1022
3 827 1022 641
3 641 1022 675
3 641 675 1045
3 1045 675 879
3 1045 879 488
3 488 879 1323
3 488 1323 424
3 424 1323 603
3 424 603 398
3 398 603 634
3 398 634 838
3 838 634 470
3 838 470 524
3 524 470 746
3 524 746 420
3 420 746 351
3 420 351 172
3 172 351 785
3 172 785 1133
3 1133 785 1413
3 1133 1413 707
3 707 1413 494
3 707 494 602
3 602 494 1256
3 1139 1421 1175
3 1175 1421 32
3 1175 32 174
3 174 32 840
3 174 840 649
3 649 840 15
3 649 15 519
3 519 15 679
3 519 679 858
3 858 679 1329
3 858 1329 565
3 565 1329 388
3 565 388 1043
3 1043 388 1222
3 1043 1222 885
3 885 1222 1168
3 885 1168 1015
3 1015 1168 3
3 1015 3 1087
3 1087 3 1004
3 1087 1004 1352
3 1352 1004 1404
3 1352 1404 678
3 678 1404 1332
3 678 1332 147
3 147 1332 995
3 147 995 772
3 772 995 924
3 772 924 1093
3 1093 924 1257
3 1093 1257 1234
3 1234 1257 294
3 1234 294 346
3 346 294 692
3 346 692 1330
3 1330 692 760
3 1330 760 1115
3 1115 760 164
3 1115 164 297
3 297 164 624
3 297 624 1220
3 1220 624 1071
3 1220 1071 1035
3 1035 1071 1414
3 1035 1414 986
3 986 1414 842
3 986 842 687
3 687 842 961
3 687 961 686
3 686 961 1230
3 686 1230 45
3 45 1230 714
3 45 714 733
3 733 714 256
3 733 256 722
3 722 256 1228
3 722 1228 585
3 585 1228 283
3 585 283 1416
3 1416 283 973
3 1416 973 705
3 705 973 1167
3 705 1167 36
3 36 1167 314
3 36 314 1022
3 1022 314 1325
3 1022 1325 675
3 675 1325 417
3 675 417 879
3 879 417 1253
3 879 1253 1323
3 1323 1253 901
3 1323 901 603
3 603 901 828
3 603 828 634
3 634 828 1136
3 634 1136 470
3 470 1136 1238
3 470 1238 746
3 746 1238 680
3 746 680 351
3 351 680 1174
3 351 1174 785
3 785 1174 793
3 785 793 1413
3 1413 793 681
3 1413 681 494
3 494 681 727
3 494 727 1256
3 1256 727 500
3 1421 890 32
3 32 890 724
3 32 724 840
3 840 724 709
3 840 709 15
3 15 709 824
3 15 824 679
3 679 824 792
3 679 792 1329
3 1329 792 527
3 1329 527 388
3 388 527 566
3 388 566 1222
3 1222 566 59
3 1222 59 1168
3 1168 59 667
3 1168 667 3
3 3 667 120
3 3 120 1004
3 1004 120 618
3 1004 618 1404
3 1404 618 1007
3 1404 1007 1332
3 1332 1007 1143
3 1332 1143 995
3 995 1143 1225
3 995 1225 924
3 924 1225 907
3 924 907 1257
3 1257 907 1165
3 1257 1165 294
3 294 1165 1186
3 294 1186 692
3 692 1186 439
3 692 439 760
3 760 439 1157
3 760 1157 164
3 164 1157 821
3 164 821 624
3 624 821 57
3 624 57 1071
3 1071 57 349
3 1071 349 1414
3 1414 349 786
3 1414 786 842
3 842 786 555
3 842 555 961
3 961 555 774
3 961 774 1230
3 1230 774 794
3 1230 794 714
3 714 794 1166
3 714 1166 256
3 256 1166 2
3 256 2 1228
3 1228 2 332
3 1228 332 283
3 283 332 559
3 283 559 973
3 973 559 1182
3 973 1182 1167
3 1167 1182 1105
3 1167 1105 314
3 314 1105 1403
3 314 1403 1325
3 1325 1403 800
3 1325 800 417
3 417 800 1381
3 417 1381 1253
3 1253 1381 30
3 1253 30 901
3 901 30 55
3 901 55 828
3 828 55 1207
3 828 1207 1136
3 1136 1207 371
3 1136 371 1238
3 1238 371 1236
3 1238 1236 680
3 680 1236 222
3 680 222 1174
3 1174 222 1407
3 1174 1407 793
3 793 1407 468
3 793 468 681
3 681 468 84
3 681 84 727
3 727 84 444
3 727 444 500
3 500 444 955
3 890 549 724
3 724 549 1184
3 724 1184 709
3 709 1184 630
3 709 630 824
3 824 630 1273
3 824 1273 792
3 792 1273 545
3 792 545 527
3 527 545 952
3 527 952 566
3 566 952 477
3 566 477 59
3 59 477 854
3 59 854 667
3 667 854 1290
3 667 1290 120
3 120 1290 79
3 120 79 618
3 618 79 993
3 618 993 1007
3 1007 993 1349
3 1007 1349 1143
3 1143 1349 310
3 1143 310 1225
3 1225 310 909
3 1225 909 907
3 907 909 1379
3 907 1379 1165
3 1165 1379 1393
3 1165 1393 1186
3 1186 1393 198
3 1186 198 439
3 439 198 129
3 439 129 1157
3 1157 129 600
3 1157 600 821
3 821 600 936
3 821 936 57
3 57 936 1318
3 57 1318 349
3 349 1318 1218
3 349 1218 786
3 786 1218 963
3 786 963 555
3 555 963 99
3 555 99 774
3 774 99 731
3 774 731 794
3 794 731 822
3 794 822 1166
3 1166 822 438
3 1166 438 2
3 2 438 141
3 2 141 332
3 332 141 1337
3 332 1337 559
3 559 1337 523
3 559 523 1182
3 1182 523 268
3 1182 268 1105
3 1105 268 460
3 1105 460 1403
3 1403 460 445
3 1403 445 800
3 800 445 903
3 800 903 1381
3 1381 903 516
3 1381 516 30
3 30 516 590
3 30 590 55
3 55 590 1029
3 55 1029 1207
3 1207 1029 288
3 1207 288 371
3 371 288 1129
3 371 1129 1236
3 1236 1129 387
3 1236 387 222
3 222 387 1100
3 222 1100 1407
3 1407 1100 857
3 1407 857 468
3 468 857 881
3 468 881 84
3 84 881 987
3 84 987 444
3 444 987 937
3 444 937 955
3 955 937 316
3 549 1328 1184
3 1184 1328 94
3 1184 94 630
3 630 94 1380
3 630 1380 1273
3 1273 1380 1111
3 1273 1111 545
3 545 1111 348
3 545 348 952
3 952 348 1319
3 952 1319 477
3 477 1319 934
3 477 934 854
3 854 934 1121
3 854 1121 1290
3 1290 1121 1092
3 1290 1092 79
3 79 1092 363
3 79 363 993
3 993 363 1360
3 993 1360 1349
3 1349 1360 983
3 1349 983 310
3 310 983 284
3 310 284 909
3 909 284 1232
3 909 1232 1379
3 1379 1232 1107
3 1379 1107 1393
3 1393 1107 48
3 1393 48 198
3 198 48 496
3 198 496 129
3 129 496 300
3 129 300 600
3 600 300 780
3 600 780 936
3 936 780 188
3 936 188 1318
3 1318 188 1073
3 1318 1073 1218
3 1218 1073 150
3 1218 150 963
3 963 150 428
3 963 428 99
3 99 428 1303
3 99 1303 731
3 731 1303 988
3 731 988 822
3 822 988 848
3 822 848 438
3 438 848 543
3 438 543 141
3 141 543 114
3 141 114 1337
3 1337 114 466
3 1337 466 523
3 523 466 1401
3 523 1401 268
3 268 1401 1131
3 268 1131 460
3 460 1131 474
3 460 474 445
3 445 474 542
3 445 542 903
3 903 542 943
3 903 943 516
3 516 943 954
3 516 954 590
3 590 954 234
3 590 234 1029
3 1029 234 1070
3 1029 1070 288
3 288 1070 199
3 288 199 1129
3 1129 199 515
3 1129 515 387
3 387 515 766
3 387 766 1100
3 1100 766 345
3 1100 345 857
3 857 345 1415
3 857 1415 881
3 881 1415 1275
3 881 1275 987
3 987 1275 243
3 987 243 937
3 937 243 1018
3 937 1018 316
3 316 1018 1408
3 1328 457 94
3 94 457 230
3 94 230 1380
3 1380 230 1219
3 1380 1219 1111
3 1111 1219 1237
3 1111 1237 348
3 348 1237 109
3 348 109 1319
3 1319 109 863
3 1319 863 934
3 934 863 418
3 934 418 1121
3 1121 418 721
3 1121 721 1092
3 1092 721 513
3 1092 513 363
3 363 513 105
3 363 105 1360
3 1360 105 673
3 1360 673 983
3 983 673 728
3 983 728 284
3 284 728 1063
3 284 1063 1232
3 1232 1063 615
3 1232 615 1107
3 1107 615 1247
3 1107 1247 48
3 48 1247 1348
3 48 1348 496
3 496 1348 914
3 496 914 300
3 300 914 767
3 300 767 780
3 780 767 1082
3 780 1082 188
3 188 1082 1163
3 188 1163 1073
3 1073 1163 965
3 1073 965 150
3 150 965 1214
3 150 1214 428
3 428 1214 340
3 428 340 1303
3 1303 340 1047
3 1303 1047 988
3 988 1047 1014
3 988 1014 848
3 848 1014 1397
3 848 1397 543
3 543 1397 1399
3 543 1399 114
3 114 1399 170
3 114 170 466
3 466 170 666
3 466 666 1401
3 1401 666 12
3 1401 12 1131
3 1131 12 191
3 1131 191 474
3 474 191 182
3 474 182 542
3 542 182 1202
3 542 1202 943
3 943 1202 814
3 943 814 954
3 954 814 319
3 954 319 234
3 234 319 422
3 234 422 1070
3 1070 422 334
3 1070 334 199
3 199 334 1359
3 199 1359 515
3 515 1359 321
3 515 321 766
3 766 321 291
3 766 291 345
3 345 291 561
3 345 561 1415
3 1415 561 111
3 1415 111 1275
3 1275 111 261
3 1275 261 243
3 243 261 923
3 243 923 1018
3 1018 923 1059
3 1018 1059 1408
3 1408 1059 7
3 457 530 230
3 230 530 758
3 230 758 1219
3 1219 758 1002
3 1219 1002 1237
3 1237 1002 434
3 1237 434 109
3 109 434 976
3 109 976 863
3 863 976 68
3 863 68 418
3 418 68 823
3 418 823 721
3 721 823 1170
3 721 1170 513
3 513 1170 984
3 513 984 105
3 105 984 152
3 105 152 673
3 673 152 1112
3 673 1112 728
3 728 1112 1127
3 728 1127 1063
3 1063 1127 966
3 1063 966 615
3 615 966 276
3 615 276 1247
3 1247 276 698
3 1247 698 1348
3 1348 698 676
3 1348 676 914
3 914 676 244
3 914 244 767
3 767 244 1028
3 767 1028 1082
3 1082 1028 22
3 1082 22 1163
3 1163 22 311
3 1163 311 965
3 965 311 16
3 965 16 1214
3 1214 16 1400
3 1214 1400 340
3 340 1400 26
3 340 26 1047
3 1047 26 1213
3 1047 1213 1014
3 1014 1213 97
3 1014 97 1397
3 1397 97 92
3 1397 92 1399
3 1399 92 1104
3 1399 1104 170
3 170 1104 804
3 170 804 666
3 666 804 904
3 666 904 12
3 12 904 747
3 12 747 191
3 191 747 1005
3 191 1005 182
3 182 1005 748
3 182 748 1202
3 1202 748 189
3 1202 189 814
3 814 189 201
3 814 201 319
3 319 201 492
3 319 492 422
3 422 492 628
3 422 628 334
3 334 628 21
3 334 21 1359
3 1359 21 125
3 1359 125 321
3 321 125 353
3 321 353 291
3 291 353 296
3 291 296 561
3 561 296 621
3 561 621 111
3 111 621 645
3 111 645 261
3 261 645 659
3 261 659 923
3 923 659 1321
3 923 1321 1059
3 1059 1321 89
3 1059 89 7
3 7 89 1371
3 530 1056 758
3 758 1056 1387
3 758 1387 1002
3 1002 1387 1377
3 1002 1377 434
3 434 1377 1177
3 434 1177 976
3 976 1177 302
3 976 302 68
3 68 302 1410
3 68 1410 823
3 823 1410 573
3 823 573 1170
3 1170 573 330
3 1170 330 984
3 984 330 761
3 984 761 152
3 152 761 1135
3 152 1135 1112
3 1112 1135 818
3 1112 818 1127
3 1127 818 695
3 1127 695 966
3 966 695 598
3 966 598 276
3 276 598 1252
3 276 1252 698
3 698 1252 1171
3 698 1171 676
3 676 1171 1217
3 676 1217 244
3 244 1217 151
3 244 151 1028
3 1028 151 357
3 1028 357 22
3 22 357 1126
3 22 1126 311
3 311 1126 1339
3 311 1339 16
3 16 1339 505
3 16 505 1400
3 1400 505 1085
3 1400 1085 26
3 26 1085 801
3 26 801 1213
3 1213 801 533
3 1213 533 97
3 97 533 852
3 97 852 92
3 92 852 1156
3 92 1156 1104
3 1104 1156 459
3 1104 459 804
3 804 459 1109
3 804 1109 904
3 904 1109 763
3 904 763 747
3 747 763 806
3 747 806 1005
3 1005 806 13
3 1005 13 748
3 748 13 781
3 748 781 189
3 189 781 1369
3 189 1369 201
3 201 1369 404
3 201 404 492
3 492 404 898
3 492 898 628
3 628 898 1286
3 628 1286 21
3 21 1286 169
3 21 169 125
3 125 169 1212
3 125 1212 353
3 353 1212 469
3 353 469 296
3 296 469 95
3 296 95 621
3 621 95 405
3 621 405 645
3 645 405 54
3 645 54 659
3 659 54 1270
3 659 1270 1321
3 1321 1270 575
3 1321 575 89
3 89 575 997
3 89 997 1371
3 1371 997 597
3 1056 982 1387
3 1387 982 1000
3 1387 1000 1377
3 1377 1000 1216
3 1377 1216 1177
3 1177 1216 208
3 1177 208 302
3 302 208 1307
3 302 1307 1410
3 1410 1307 833
3 1410 833 573
3 573 833 662
3 573 662 330
3 330 662 1203
3 330 1203 761
3 761 1203 217
3 761 217 1135
3 1135 217 779
3 1135 779 818
3 818 779 658
3 818 658 695
3 695 658 6
3 695 6 598
3 598 6 1172
3 598 1172 1252
3 1252 1172 40
3 1252 40 1171
3 1171 40 1078
3 1171 1078 1217
3 1217 1078 998
3 1217 998 151
3 151 998 458
3 151 458 357
3 357 458 267
3 357 267 1126
3 1126 267 1197
3 1126 1197 1339
3 1339 1197 970
3 1339 970 505
3 505 970 532
3 505 532 1085
3 1085 532 447
3 1085 447 801
3 801 447 61
3 801 61 533
3 533 61 326
3 533 326 852
3 852 326 25
3 852 25 1156
3 1156 25 65
3 1156 65 459
3 459 65 1272
3 459 1272 1109
3 1109 1272 1113
3 1109 1113 763
3 763 1113 553
3 763 553 806
3 806 553 211
3 806 211 13
3 13 211 362
3 13 362 781
3 781 362 28
3 781 28 1369
3 1369 28 830
3 1369 830 404
3 404 830 1057
3 404 1057 898
3 898 1057 919
3 898 919 1286
3 1286 919 514
3 1286 514 169
3 169 514 703
3 169 703 1212
3 1212 703 617
3 1212 617 469
3 469 617 335
3 469 335 95
3 95 335 944
3 95 944 405
3 405 944 742
3 405 742 54
3 54 742 739
3 54 739 1270
3 1270 739 317
3 1270 317 575
3 575 317 1346
3 575 1346 997
3 997 1346 9
3 997 9 597
3 597 9 942
3 982 1255 1000
3 1000 1255 11
3 1000 11 1216
3 1216 11 631
3 1216 631 208
3 208 631 23
3 208 23 1307
3 1307 23 790
3 1307 790 833
3 833 790 401
3 833 401 662
3 662 401 1178
3 662 1178 1203
3 1203 1178 1367
3 1203 1367 217
3 217 1367 710
3 217 710 779
3 779 710 110
3 779 110 658
3 658 110 876
3 658 876 6
3 6 876 161
3 6 161 1172
3 1172 161 948
3 1172 948 40
3 40 948 275
3 40 275 1078
3 1078 275 226
3 1078 226 998
3 998 226 1425
3 998 1425 458
3 458 1425 825
3 458 825 267
3 267 825 1031
3 267 1031 1197
3 1197 1031 1209
3 1197 1209 970
3 970 1209 808
3 970 808 532
3 532 808 1010
3 532 1010 447
3 447 1010 128
3 447 128 61
3 61 128 1326
3 61 1326 326
3 326 1326 1394
3 326 1394 25
3 25 1394 610
3 25 610 65
3 65 610 392
3 65 392 1272
3 1272 392 928
3 1272 928 1113
3 1113 928 906
3 1113 906 553
3 553 906 893
3 553 893 211
3 211 893 1021
3 211 1021 362
3 362 1021 116
3 362 116 28
3 28 116 725
3 28 725 830
3 830 725 1096
3 830 1096 1057
3 1057 1096 298
3 1057 298 919
3 919 298 920
3 919 920 514
3 514 920 567
3 514 567 703
3 703 567 1054
3 703 1054 617
3 617 1054 87
3 617 87 335
3 335 87 306
3 335 306 944
3 944 306 80
3 944 80 742
3 742 80 701
3 742 701 739
3 739 701 862
3 739 862 317
3 317 862 1065
3 317 1065 1346
3 1346 1065 677
3 1346 677 9
3 9 677 1411
3 9 1411 942
3 942 1411 1317
3 1255 802 11
3 11 802 1032
3 11 1032 631
3 631 1032 501
3 631 501 23
3 23 501 860
3 23 860 790
3 790 860 805
3 790 805 401
3 401 805 1268
3 401 1268 1178
3 1178 1268 279
3 1178 279 1367
3 1367 279 1076
3 1367 1076 710
3 710 1076 1301
3 710 1301 110
3 110 1301 1125
3 110 1125 876
3 876 1125 690
3 876 690 161
3 161 690 227
3 161 227 948
3 948 227 465
3 948 465 275
3 275 465 847
3 275 847 226
3 226 847 1038
3 226 1038 1425
3 1425 1038 626
3 1425 626 825
3 825 626 1395
3 825 1395 1031
3 1031 1395 8
3 1031 8 1209
3 1209 8 1114
3 1209 1114 808
3 808 1114 429
3 808 429 1010
3 1010 429 504
3 1010 504 128
3 128 504 1243
3 128 1243 1326
3 1326 1243 510
3 1326 510 1394
3 1394 510 43
3 1394 43 610
3 610 43 1011
3 610 1011 392
3 392 1011 1034
3 392 1034 928
3 928 1034 1044
3 928 1044 906
3 906 1044 342
3 906 342 893
3 893 342 389
3 893 389 1021
3 1021 389 1081
3 1021 1081 116
3 116 1081 472
3 116 472 725
3 725 472 228
3 725 228 1096
3 1096 228 1418
3 1096 1418 298
3 298 1418 71
3 298 71 920
3 920 71 1089
3 920 1089 567
3 567 1089 551
3 567 551 1054
3 1054 551 1006
3 1054 1006 87
3 87 1006 892
3 87 892 306
3 306 892 1251
3 306 1251 80
3 80 1251 423
3 80 423 701
3 701 423 1258
3 701 1258 862
3 862 1258 407
3 862 407 1065
3 1065 407 478
3 1065 478 677
3 677 478 358
3 677 358 1411
3 1411 358 402
3 1411 402 1317
3 1317 402 574
3 802 1384 1032
3 1032 1384 891
3 1032 891 501
3 501 891 1084
3 501 1084 860
3 860 1084 360
3 860 360 805
3 805 360 702
3 805 702 1268
3 1268 702 1233
3 1268 1233 279
3 279 1233 136
3 279 136 1076
3 1076 136 548
3 1076 548 1301
3 1301 548 759
3 1301 759 1125
3 1125 759 886
3 1125 886 690
3 690 886 400
3 690 400 227
3 227 400 1309
3 227 1309 465
3 465 1309 843
3 465 843 847
3 847 843 1201
3 847 1201 1038
3 1038 1201 480
3 1038 480 626
3 626 480 745
3 626 745 1395
3 1395 745 949
3 1395 949 8
3 8 949 717
3 8 717 1114
3 1114 717 529
3 1114 529 429
3 429 529 245
3 429 245 504
3 504 245 1164
3 504 1164 1243
3 1243 1164 971
3 1243 971 510
3 510 971 173
3 510 173 43
3 43 173 17
3 43 17 1011
3 1011 17 210
3 1011 210 1034
3 1034 210 489
3 1034 489 1044
3 1044 489 123
3 1044 123 342
3 342 123 490
3 342 490 389
3 389 490 734
3 389 734 1081
3 1081 734 1365
3 1081 1365 472
3 472 1365 1173
3 472 1173 228
3 228 1173 1315
3 228 1315 1418
3 1418 1315 347
3 1418 347 71
3 71 347 38
3 71 38 1089
3 1089 38 204
3 1089 204 551
3 551 204 622
3 551 622 1006
3 1006 622 414
3 1006 414 892
3 892 414 237
3 892 237 1251
3 1251 237 1263
3 1251 1263 423
3 423 1263 647
3 423 647 1258
3 1258 647 959
3 1258 959 407
3 407 959 325
3 407 325 478
3 478 325 716
3 478 716 358
3 358 716 157
3 358 157 402
3 402 157 1090
3 402 1090 574
3 574 1090 911
3 1384 224 891
3 891 224 613
3 891 613 1084
3 1084 613 183
3 1084 183 360
3 360 183 683
3 360 683 702
3 702 683 462
3 702 462 1233
3 1233 462 1355
3 1233 1355 136
3 136 1355 1108
3 136 1108 548
3 548 1108 1246
3 548 1246 759
3 759 1246 1137
3 759 1137 886
3 886 1137 272
3 886 272 400
3 400 272 450
3 400 450 1309
3 1309 450 121
3 1309 121 843
3 843 121 78
3 843 78 1201
3 1201 78 1103
3 1201 1103 480
3 480 1103 1239
3 480 1239 745
3 745 1239 167
3 745 167 949
3 949 167 861
3 949 861 717
3 717 861 930
3 717 930 529
3 529 930 344
3 529 344 245
3 245 344 1419
3 245 1419 1164
3 1164 1419 609
3 1164 609 971
3 971 609 583
3 971 583 173
3 173 583 771
3 173 771 17
3 17 771 14
3 17 14 210
3 210 14 1179
3 210 1179 489
3 489 1179 1181
3 489 1181 123
3 123 1181 584
3 123 584 490
3 490 584 511
3 490 511 734
3 734 511 522
3 734 522 1365
3 1365 522 341
3 1365 341 1173
3 1173 341 432
3 1173 432 1315
3 1315 432 1037
3 1315 1037 347
3 347 1037 479
3 347 479 38
3 38 479 1079
3 38 1079 204
3 204 1079 653
3 204 653 622
3 622 653 290
3 622 290 414
3 414 290 664
3 414 664 237
3 237 664 1259
3 237 1259 1263
3 1263 1259 1248
3 1263 1248 647
3 647 1248 1050
3 647 1050 959
3 959 1050 1362
3 959 1362 325
3 325 1362 223
3 325 223 716
3 716 223 113
3 716 113 157
3 157 113 605
3 157 605 1090
3 1090 605 1310
3 1090 1310 911
3 911 1310 1106
3 224 586 613
3 613 586 1296
3 613 1296 183
3 183 1296 475
3 183 475 683
3 683 475 427
3 683 427 462
3 462 427 1051
3 462 1051 1355
3 1355 1051 453
3 1355 453 1108
3 1108 453 644
3 1108 644 1246
3 1246 644 1324
3 1246 1324 1137
3 1137 1324 266
3 1137 266 272
3 272 266 446
3 272 446 450
3 450 446 1159
3 450 1159 121
3 121 1159 693
3 121 693 78
3 78 693 262
3 78 262 1103
3 1103 262 130
3 1103 130 1239
3 1239 130 931
3 1239 931 167
3 167 931 878
3 167 878 861
3 861 878 1294
3 861 1294 930
3 930 1294 595
3 930 595 344
3 344 595 185
3 344 185 1419
3 1419 185 1009
3 1419 1009 609
3 609 1009 1122
3 609 1122 583
3 583 1122 368
3 583 368 771
3 771 368 443
3 771 443 14
3 14 443 498
3 14 498 1179
3 1179 498 337
3 1179 337 1181
3 1181 337 127
3 1181 127 584
3 584 127 355
3 584 355 511
3 511 355 303
3 511 303 522
3 522 303 103
3 522 103 341
3 341 103 650
3 341 650 432
3 432 650 978
3 432 978 1037
3 1037 978 83
3 1037 83 479
3 479 83 1378
3 479 1378 1079
3 1079 1378 1074
3 1079 1074 653
3 653 1074 257
3 653 257 290
3 290 257 437
3 290 437 664
3 664 437 669
3 664 669 1259
3 1259 669 58
3 1259 58 1248
3 1248 58 1298
3 1248 1298 1050
3 1050 1298 1375
3 1050 1375 1362
3 1362 1375 1116
3 1362 1116 223
3 223 1116 293
3 223 293 113
3 113 293 981
3 113 981 605
3 605 981 292
3 605 292 1310
3 1310 292 331
3 1310 331 1106
3 1106 331 723
3 586 536 1296
3 1296 536 1368
3 1296 1368 475
3 475 1368 67
3 475 67 427
3 427 67 425
3 427 425 1051
3 1051 425 1199
3 1051 1199 453
3 453 1199 753
3 453 753 644
3 644 753 1261
3 644 1261 1324
3 1324 1261 269
3 1324 269 266
3 266 269 233
3 266 233 446
3 446 233 193
3 446 193 1159
3 1159 193 743
3 1159 743 693
3 693 743 1185
3 693 1185 262
3 262 1185 194
3 262 194 130
3 130 194 512
3 130 512 931
3 931 512 1060
3 931 1060 878
3 878 1060 246
3 878 246 1294
3 1294 246 229
3 1294 229 595
3 595 229 178
3 595 178 185
3 185 178 1422
3 185 1422 1009
3 1009 1422 652
3 1009 652 1122
3 1122 652 1284
3 1122 1284 368
3 368 1284 493
3 368 493 443
3 443 493 947
3 443 947 498
3 498 947 250
3 498 250 337
3 337 250 1183
3 337 1183 127
3 127 1183 660
3 127 660 355
3 355 660 52
3 355 52 303
3 303 52 994
3 303 994 103
3 103 994 126
3 103 126 650
3 650 126 1341
3 650 1341 978
3 978 1341 1308
3 978 1308 83
3 83 1308 1373
3 83 1373 1378
3 1378 1373 629
3 1378 629 1074
3 1074 629 1304
3 1074 1304 257
3 257 1304 20
3 257 20 437
3 437 20 1083
3 437 1083 669
3 669 1083 192
3 669 192 58
3 58 192 1343
3 58 1343 1298
3 1298 1343 531
3 1298 531 1375
3 1375 531 768
3 1375 768 1116
3 1116 768 534
3 1116 534 293
3 293 534 925
3 293 925 981
3 981 925 964
3 981 964 292
3 292 964 471
3 292 471 331
3 331 471 869
3 331 869 723
3 723 869 926
3 536 870 1368
3 1368 870 491
3 1368 491 67
3 67 491 180
3 67 180 425
3 425 180 525
3 425 525 1199
3 1199 525 366
3 1199 366 753
3 753 366 638
3 753 638 1261
3 1261 638 76
3 1261 76 269
3 269 76 962
3 269 962 233
3 233 962 406
3 233 406 193
3 193 406 1244
3 193 1244 743
3 743 1244 697
3 743 697 1185
3 1185 697 1020
3 1185 1020 194
3 194 1020 1026
3 194 1026 512
3 512 1026 212
3 512 212 1060
3 1060 212 88
3 1060 88 246
3 246 88 186
3 246 186 229
3 229 186 612
3 229 612 178
3 178 612 218
3 178 218 1422
3 1422 218 81
3 1422 81 652
3 652 81 1338
3 652 1338 1284
3 1284 1338 448
3 1284 448 493
3 493 448 894
3 493 894 947
3 947 894 1340
3 947 1340 250
3 250 1340 1357
3 250 1357 1183
3 1183 1357 933
3 1183 933 660
3 660 933 396
3 660 396 52
3 52 396 159
3 52 159 994
3 994 159 24
3 994 24 126
3 126 24 177
3 126 177 1341
3 1341 177 231
3 1341 231 1308
3 1308 231 508
3 1308 508 1373
3 1373 508 872
3 1373 872 629
3 629 872 1288
3 629 1288 1304
3 1304 1288 897
3 1304 897 20
3 20 897 485
3 20 485 1083
3 1083 485 255
3 1083 255 192
3 192 255 958
3 192 958 1343
3 1343 958 394
3 1343 394 531
3 531 394 706
3 531 706 768
3 768 706 140
3 768 140 534
3 534 140 1195
3 534 1195 925
3 925 1195 153
3 925 153 964
3 964 153 627
3 964 627 471
3 471 627 625
3 471 625 869
3 869 625 637
3 869 637 926
3 926 637 378