OFF
1290 2576 0
-0.4594312396 0.1157070059 0.0290598878
0.1285961027 0.1794215666 -0.0204135536
-0.0515112648 -0.2363199281 0.0088554563
-0.0340949111 -0.2358557458 0.0073256463
-0.1994159704 -0.0766392326 -0.0780085045
0.3376041587 -0.0624029835 -0.0463505270
0.0702631352 -0.0696068474 0.0582334722
-0.0830085371 -0.2131346215 0.0090259698
0.0442898080 0.1666288821 -0.0018275204
0.0738237110 -0.1040349775 0.0227341405
-0.1233032559 -0.0851420553 -0.0883172487
0.1568697458 0.1350390240 0.0225034325
-0.3002120925 -0.1245131225 0.0292039465
0.2865853414 -0.1089023437 0.0071475656
-0.1139215931 -0.1195719863 0.0374758550
-0.1208137879 -0.0094421179 -0.0052701237
0.4924097819 0.0068797049 -0.0365882878
-0.0685377137 -0.2390271864 0.0063705035
-0.0717273065 -0.2391094872 0.0038582560
0.4058378666 -0.0060444714 0.0555064267
0.3986723822 -0.0062351693 0.0558500384
0.4489581441 -0.0048867232 0.0429530791
0.4267432739 -0.0054843985 0.0506803164
0.4334879843 -0.0053151254 0.0609001630
0.4106329958 -0.0059168566 0.0552764824
0.4122191574 0.0392582217 0.0131290209
0.4385175843 0.0399497402 0.0204993849
-0.0459259246 -0.2196129325 0.0052804688
-0.0548555047 -0.1718066694 0.0063309996
0.0504122605 0.0949107686 -0.0746869312
0.0905245960 0.0959616055 -0.0594048153
0.1720084646 0.0980513320 0.0179652166
0.1094037889 -0.1509748433 -0.0226951121
0.0999941254 -0.1512476872 0.0008709579
-0.0479537417 0.2115854932 -0.0007206212
-0.0854033776 0.2105773105 0.0129521585
0.2548292396 0.0897187172 0.0159086614
0.3226112375 0.0915857302 -0.0523984382
-0.3808898260 0.0728946938 -0.0511625404
0.0837047692 -0.1621917747 -0.0234290680
-0.4431828222 -0.1281565405 -0.0115599989
-0.4420900308 -0.1281367292 -0.0020537768
0.1574634792 0.0765703275 0.0435215721
-0.0436284239 0.2299885960 0.0030064962
0.2501874181 -0.1683037051 -0.0234735396
0.1307747213 -0.1399013048 0.0073275045
-0.4927746238 0.1072980595 0.0867960904
-0.0812663986 0.2307253922 0.0028413297
-0.0352961713 0.2319539309 -0.0046358036
-0.0593359129 0.2313013396 0.0097254725
-0.0861580745 0.2122976078 0.0090477320
0.4353932159 -0.0425706060 -0.0300159523
-0.4670618513 0.0893151674 0.0546912474
-0.0669703099 -0.2464487118 0.0023008579
-0.0276783995 -0.2213890728 0.0089831271
-0.0359310457 -0.2215971845 -0.0024970086
-0.0056544610 0.2161882190 -0.0067468356
-0.0197607497 -0.0652919813 0.0673562663
0.1382476989 0.1758409717 -0.0023951020
-0.2646712443 -0.0821917207 -0.0787015188
0.0945304770 -0.0727749791 0.0513354960
0.2227683937 -0.0692221008 -0.0991794966
0.4365042757 -0.0320636179 0.0291915496
0.3784970004 -0.0335582211 -0.0187170066
0.4167233330 -0.0325873031 0.0273017861
0.4344093249 -0.0321249349 0.0350274374
-0.0409237121 0.2335285294 0.0082050914
0.1038061913 0.1911986550 -0.0099601745
0.0124527612 0.1983584092 0.0128977649
0.0651170368 0.1997804944 -0.0107719556
0.0694681083 0.1998853908 0.0002573059
0.4943808693 0.0241425414 0.0044431267
0.4450106804 0.0227999178 0.0364142712
0.4381719316 0.0226206695 0.0339028320
0.4398000734 0.0226602911 0.0376483746
0.4355248633 0.0466226085 -0.0176519857
0.2265817607 0.0409849376 0.0717339222
0.4426554069 0.0468142309 -0.0199057309
0.4718708118 0.0475722537 -0.0012043926
-0.4589263045 -0.1360802369 0.0279537528
0.3410320888 0.0651785392 -0.0140536304
0.3342186939 0.0650287357 -0.0462269219
-0.4745706071 -0.0960296146 0.0236508670
-0.4743418852 -0.0960012198 0.0006415286
-0.0589343699 -0.2244782301 0.0104826531
0.1364626669 -0.1876714288 -0.0008664843
0.1335506047 -0.1877297109 -0.0205395615
-0.4799368541 0.1407174515 0.0008378689
0.2271489321 0.0515376895 0.0688641411
0.0711495052 0.0475464967 -0.0891068582
0.3350502858 0.0544649420 0.0063376964
0.0189615959 0.1112823400 -0.0301988261
-0.4267375558 -0.1479446220 -0.0469855481
-0.3728646159 -0.1465535292 -0.0055989222
0.0819624271 0.1580415804 -0.0234428158
-0.3825448982 0.1351929924 -0.0511021129
0.2141460272 -0.0963747395 -0.0330056916
-0.2182132949 -0.1079362496 0.0443844611
0.4827027797 0.0209705148 0.0298564648
-0.4736849998 -0.1439695765 0.0590197577
-0.4912458910 -0.1039182090 0.0014544072
-0.0387925394 -0.2313977842 -0.0023568350
-0.0530331115 -0.2077692328 0.0134967566
0.2498741597 -0.0198034134 0.0620618624
0.3426425660 -0.0172918799 0.0136427130
0.3583241790 -0.0168726844 0.0109789121
0.4665387757 -0.0140195856 0.0334814700
-0.1569679428 -0.0305038178 -0.0494119108
0.4519567708 -0.0143158446 -0.0604796288
0.3999625912 -0.0158016313 0.0472173267
-0.4762102997 0.0928095490 0.0809665594
0.4393996248 0.0092729963 0.0424217824
0.4306942482 0.0090338990 0.0504864738
-0.0579071178 -0.2512955596 -0.0047364487
-0.4775532785 0.1332413390 0.0753997123
-0.4958537443 0.1327657086 0.0645168291
-0.0563920571 0.1685221485 0.0036371300
0.4001079885 -0.0263205841 0.0347584652
0.3822115396 -0.0267737181 0.0117484337
0.1718078392 -0.0322554433 -0.0996439587
0.3102814402 -0.0285896876 -0.0861820629
-0.0371816863 -0.0379426183 0.0395071377
-0.1517177241 0.0797896731 0.0717271444
0.0678803554 0.0857572672 -0.0659629418
0.2291740402 0.0899765113 0.0019029305
0.3263198560 0.0925638029 -0.0047250934
-0.0297556102 -0.1883308560 0.0057705581
0.0661361056 0.1096969791 -0.0286366445
0.1242762186 -0.1917992685 -0.0167915395
0.0612387244 -0.1934628065 -0.0283097379
0.1422479704 -0.1596899707 -0.0447751757
-0.0367096885 -0.2319324322 0.0081444523
0.1819331754 -0.1692097359 -0.0043848054
-0.1618751224 0.0585989013 -0.0817612128
0.1632220826 -0.1802265904 -0.0199949394
-0.4437274017 -0.1318621982 -0.0249729234
-0.0456030885 0.2076494568 0.0038025900
-0.0652019777 0.2071304477 0.0020782788
0.0045637390 0.2089877699 -0.0019052165
-0.0220325013 0.2265704739 0.0006972155
-0.0704273627 0.2435769200 0.0003471721
0.3273459560 -0.0866330211 -0.0525713053
-0.0840312768 0.2266538329 0.0069718805
-0.4497990988 0.0966815422 -0.0247512426
-0.4459833362 0.0967607845 -0.0019354326
-0.4574033523 0.0964388775 0.0171503468
-0.5000000000 0.1358196312 -0.0347534882
-0.4771898518 0.1364070199 -0.0155713362
0.1016331347 0.1757762508 0.0159287337
0.1175551386 0.1762461795 -0.0324546752
0.1037654480 0.1854508955 0.0065541214
0.1189844819 0.1858777278 -0.0166525604
0.0639622155 0.1843832796 0.0170365952
-0.4879505122 -0.1113733142 0.0793323574
-0.0108289801 -0.1900710538 -0.0089817594
-0.0552928374 -0.1672385297 -0.0002536585
-0.0490692343 0.2458754872 0.0059266832
0.1759891546 0.1672529179 -0.0213495473
0.1370760682 0.1661897750 0.0089019128
0.1798578327 -0.0799824838 -0.0875602306
-0.0558705891 0.2091114716 0.0056270275
-0.0708165564 0.2087156748 0.0043165113
-0.0846652294 0.2100823824 0.0063126793
-0.0052472517 0.2122093961 -0.0113421588
-0.0691686769 0.2104922143 0.0082337129
-0.0294033466 0.1932541966 0.0109670945
0.3852226082 0.0356701154 -0.0104290325
0.4460332035 0.0372504499 0.0258752892
0.3614531434 0.0350625898 -0.0351259017
0.3868925353 0.0357006224 0.0038577870
-0.1509321794 0.0424403915 0.0468483665
-0.2229600781 0.0405652342 0.0072593876
0.0019960620 -0.1920069008 0.0108535591
-0.4947850397 0.1066223020 0.0722938986
0.4228952537 0.0472159885 -0.0208702482
-0.0814770174 0.0337594899 0.0377855061
0.4685730413 0.0484473639 -0.0392816650
-0.4785225120 0.0883709922 0.0580804048
-0.2673113226 0.1181120232 -0.0527983594
-0.3754420411 -0.1321644708 -0.0513614419
-0.4972417028 0.1283599537 0.0331280146
-0.4934685592 0.1284108090 0.0840423261
-0.4604229966 -0.1179836451 -0.0500140892
-0.4911887214 -0.1188018639 -0.0491180719
-0.0225311216 0.0899431405 0.0655301253
-0.4344145262 0.1031521862 -0.0677228068
0.1686639939 0.1506963414 0.0172984740
0.1378372789 0.1499374672 -0.0446577657
-0.0625393243 -0.2183156227 0.0027744955
-0.0391567271 -0.2176894554 -0.0023435383
-0.2657334236 0.1286407068 -0.0031716598
-0.3076790315 0.1275688957 -0.0470423695
0.2126828285 -0.1060266165 -0.0289931467
-0.3011109602 -0.1196587814 -0.0472821733
0.0506629760 0.1792638932 -0.0226442708
0.0104489641 0.1781737698 -0.0002085068
0.3377749298 -0.0480929286 0.0062382182
-0.0337970379 -0.0578704090 -0.0907052631
-0.0547415788 -0.2009846725 0.0142712398
-0.0435461922 -0.1766548525 0.0038207207
-0.0243968502 -0.1761375248 -0.0050344022
-0.0451033735 -0.2441273091 -0.0020503909
-0.0180379579 -0.2193841237 -0.0039935455
-0.0439234531 -0.2200800496 0.0044899702
0.4542294423 -0.0104744969 0.0398059973
0.4391975435 -0.0108708381 0.0367032148
0.4114934588 -0.0116192636 0.0495015339
-0.4906511773 -0.1263037297 0.0014326939
0.3128350703 0.0509762673 0.0112274959
-0.0094365933 0.0425210631 -0.0986238190
-0.2692783970 0.0912253438 -0.0785333092
0.0671424989 -0.2029321095 -0.0107467253
-0.0693980208 -0.2019487404 0.0090079757
0.0192836683 0.0883542702 -0.0760890273
-0.4319876103 0.0763425498 -0.0525371839
-0.0074525006 0.0875147249 0.0571606750
0.1219311603 -0.1564088414 0.0143607681
-0.2021716464 0.0479136496 -0.0760024119
0.2047723479 0.0826334110 0.0412514761
-0.1991603143 0.0718741147 0.0701805975
-0.1200277187 0.0739782483 0.0682977038
-0.0733078545 0.2377689812 0.0011250126
-0.0562814164 0.2382201464 0.0023357626
-0.0706774304 0.2029784345 0.0149125722
0.1808883184 -0.0791572756 0.0443575710
-0.4914301151 -0.1045823952 0.0250410139
-0.0285841185 -0.0607116415 0.0563070660
-0.3770971133 -0.0698661722 -0.0513010144
-0.0325769673 -0.1838293663 0.0026023431
-0.0250147898 -0.2270484362 0.0082191689
-0.0393436655 -0.2274297764 0.0089062919
-0.0779120274 -0.2284555941 0.0101188686
-0.0342404524 0.1856666162 0.0025698487
0.3141131658 -0.0861020523 -0.0079668859
-0.0054471855 -0.2024874867 -0.0112065898
-0.0629521326 -0.2040281170 0.0020953166
-0.0199740732 -0.2028817952 -0.0025731307
-0.0522584103 0.2400644466 0.0014476859
-0.4952572941 0.1203299461 0.0700532529
-0.4961464816 0.1203934351 -0.0197555647
-0.4312641883 0.1309423688 0.0133955886
0.0988304123 0.1450375171 0.0008367427
0.2368039231 0.1487094623 -0.0057796012
-0.0558505200 0.1725275520 0.0062740991
0.2035609998 -0.0995179323 -0.0657498970
0.0539652502 -0.1035845402 0.0294215557
-0.0510121050 0.2418290622 0.0066590337
-0.0472601909 0.2236435063 -0.0001195681
-0.0216898778 0.2243163209 0.0065910808
-0.4812949753 0.1424762420 0.0592976019
0.3611151956 0.0254565061 -0.0475044701
0.3988465544 0.0263762662 0.0376989800
0.3759292894 0.0258034457 0.0005638659
0.3868611245 0.0261445026 -0.0516356524
0.4508835961 0.0278529664 -0.0594561207
0.4965079632 0.0184868236 -0.0147741755
0.4656981713 0.0176214668 0.0335121609
0.4366446025 0.0168445436 0.0387290059
-0.0103792088 0.1897670678 0.0093613987
0.4012559900 0.0053529945 0.0557226452
0.4326367731 0.0063086755 -0.0700451512
0.4132626888 0.0056715779 0.0561321639
0.4793071166 0.0075275813 -0.0484153549
0.5000000000 0.0080476653 -0.0178355250
0.4486523255 0.0066245431 0.0429642447
0.3968813209 0.0053533924 -0.0645070309
0.4331821657 0.0061961409 0.0609113286
-0.0246869166 -0.2292919266 0.0029324916
-0.0431476747 0.2071970280 0.0003828818
-0.0850793113 0.2060772626 0.0063337495
-0.0221621143 0.2077459164 0.0092829067
-0.0882096203 0.1132666049 -0.0584874651
-0.3100072639 0.0968530731 -0.0727588402
-0.3066282440 0.0968158941 0.0581204121
0.1512129426 -0.1383414615 -0.0260361166
0.2000219110 0.0997962572 0.0012704343
-0.0858844026 0.1238105702 -0.0041469844
-0.2636519027 0.1190405741 0.0445822812
-0.3788287901 0.1400179858 0.0290692941
0.1208119606 -0.1496854386 -0.0245750757
-0.0819212309 -0.1234336121 -0.0587170575
-0.4661398042 0.1354419011 0.0282171214
0.4544454991 -0.0306063025 0.0331387555
0.3868912901 -0.0323558818 -0.0133844161
-0.2627648383 -0.0495786887 -0.0510536962
0.4070587597 -0.0318590528 0.0267796546
0.4501562539 -0.0307213537 0.0342720144
-0.3758804103 -0.0526280204 -0.0054828622
-0.3022031182 -0.0611650333 -0.0472475792
0.4288967267 -0.0417543344 -0.0345125740
0.2023948563 -0.0478722837 0.0690969563
0.4251260600 -0.0418649114 -0.0237884758
0.4369470427 -0.0415475047 -0.0272524297
0.0980232759 -0.0504960013 -0.0846303379
0.4304333656 -0.0417152926 -0.0326755018
0.4509783187 -0.0411481242 -0.0546893492
-0.3739518653 -0.0631450329 0.0288971868
0.4430045030 -0.0413825862 -0.0313665256
0.2823986275 -0.0457134414 0.0346725820
0.4397740592 -0.0099325160 0.0395713319
-0.1961099812 -0.0267868900 -0.0007282061
0.3764260526 -0.0116156132 0.0397130604
0.4206786524 -0.0104518362 0.0519578821
-0.0576270790 -0.1701982170 0.0037992456
-0.0386181907 -0.1696923257 0.0028876986
-0.0552464814 -0.1701304216 -0.0008919222
-0.0517964536 -0.2374786093 0.0022652433
-0.0005490600 -0.2120924779 -0.0001995580
-0.0488396162 -0.2133872630 0.0120225148
-0.0351121094 -0.2130097332 -0.0012073313
-0.0293796178 -0.1888387301 0.0024505659
-0.4796357221 0.0946255371 0.0238357970
-0.4794070003 0.0946539320 0.0008264587
-0.1953798212 -0.0373302333 0.0279748272
-0.1160707132 -0.0352343819 0.0394650830
-0.0401775260 -0.2394209315 -0.0042585623
-0.0476674172 -0.2396253774 0.0013732954
0.0078266666 0.0572396796 0.0592766848
0.0121310459 -0.2140116728 -0.0015015615
-0.0555333469 -0.2158111602 0.0004105981
0.1459736351 -0.1864139711 -0.0217735604
-0.4622948446 -0.0901189356 0.0545172015
0.1223256389 -0.1659517161 -0.0431229291
0.2504603604 0.0742327919 0.0467107210
0.1758100439 0.0723796605 -0.0874124437
0.2621667406 -0.0835274412 -0.0867550512
0.2979887945 -0.0826678218 0.0081562937
-0.1464228731 -0.1290680313 0.0456989841
-0.0060508775 -0.1253035406 0.0093650131
-0.0622983068 0.2523584035 0.0019253204
0.1252671371 0.1707230806 -0.0354296130
-0.1473656476 -0.0840261132 0.0715682478
-0.3050942649 -0.0880763054 -0.0729382164
0.2780411603 -0.0726832356 0.0291542714
-0.0378647935 -0.1725126048 0.0061545526
-0.4499998460 0.1284419171 -0.0113111058
-0.4489070546 0.1284617284 -0.0018048837
0.1324424010 0.1363459710 -0.0245249690
0.1164240258 0.1358953364 0.0013275335
-0.0472261705 -0.2401915200 -0.0006182572
0.0906611195 0.1592165644 0.0184293442
0.2053813710 -0.1090915816 -0.0524520278
-0.1207904552 -0.1177554362 -0.0540165252
-0.0668446851 0.2173864665 0.0061506737
-0.0429087421 0.2180266865 0.0017007358
-0.0472315074 0.2362086254 -0.0034268798
-0.0591336487 0.1992986338 0.0070613469
-0.0254213616 0.2001894267 0.0120489575
-0.0608731787 0.2541335104 0.0012184834
-0.0624386727 0.2540931399 -0.0000390455
-0.0420341042 -0.2229286243 0.0096718882
-0.0326165603 -0.2226709666 0.0019780723
0.0071328187 -0.1975978613 0.0073068532
-0.0383321605 0.2381775323 0.0007805562
-0.1226384761 -0.0286028823 -0.0539550048
0.4461601973 -0.0135829904 0.0401938268
0.4500197310 -0.0134812297 0.0409929832
0.4972282177 -0.0121710195 -0.0167689144
0.4898408033 -0.0123537443 -0.0307238480
0.4374146992 -0.0138129837 0.0377738233
0.4325207881 -0.0138439928 -0.0642982524
0.4496948156 0.0421723296 0.0046683423
0.4359014183 0.0417932152 0.0177271657
0.3992525639 0.0408521972 -0.0159111340
-0.0593377102 0.2010329665 0.0037684846
-0.0071304649 0.2024146807 0.0092017933
-0.0512577680 0.2012505305 0.0007735320
0.0011351249 0.2026544928 -0.0116452632
0.4264600091 0.0069523006 0.0516754039
0.4544478617 0.0078103234 -0.0663410031
0.4103940519 0.0065201232 0.0571959689
0.4170803973 0.0307370219 0.0396628037
0.2486509132 0.0262406041 0.0621065238
0.4382210875 0.0313079651 0.0300742191
0.3808444350 0.0297986201 0.0146361758
0.4010488861 0.0303929150 -0.0446701603
0.4441347175 0.0314625928 0.0326300212
-0.0497091509 0.2195739487 0.0106000737
-0.0650477444 0.2191651177 0.0119735856
-0.0568283950 0.2193940902 0.0010351073
-0.0511290503 0.2195438588 0.0027313226
-0.0050833251 -0.1175252831 -0.0471090568
0.1460090035 -0.1135663500 0.0097180728
0.2321028591 -0.1458395149 0.0130731038
0.1169434165 -0.1488619877 -0.0250267658
0.1085530851 -0.1491096141 0.0004599435
-0.4532750088 -0.1160186509 0.0288351206
-0.0154941552 0.0845516595 -0.0916260738
-0.0901049179 0.0825734302 -0.0956951311
0.1739715744 -0.1579227254 0.0171377558
0.1162634559 -0.1594540965 0.0153291150
-0.4914495520 0.1197730663 0.0923487726
-0.0593387102 -0.2502370299 -0.0013660124
-0.0414229434 -0.2257392582 -0.0009008872
0.0130406105 0.2050919996 0.0095654152
0.0123754884 0.2098896517 -0.0016420608
0.0119320786 0.2098868421 -0.0108902384
0.4377065138 -0.0406080233 -0.0205684186
0.4338458834 -0.0407098121 -0.0213685717
0.4447899256 -0.0404166995 -0.0238051884
0.4324906106 -0.0407570629 -0.0097750160
0.0109649020 -0.0625565594 0.0582350403
0.0500188606 -0.0615218081 0.0611123999
-0.0427563024 -0.2063869646 0.0037918814
0.0074105251 -0.2050486515 -0.0019159251
-0.0822463561 -0.2074385483 0.0063235459
0.3919293639 -0.0313201755 0.0112838876
0.4843535475 -0.0288307277 -0.0237938029
0.3875307104 -0.0314066146 -0.0200773114
0.3885837710 -0.0313999421 0.0018863253
0.3932563941 -0.0073024351 0.0522864187
0.4356222672 -0.0061693716 0.0445193901
0.4397625517 -0.0060564315 0.0414825146
0.3708530197 -0.0078532619 0.0065518518
0.4296520099 -0.0063430957 0.0601001585
0.4332878994 -0.0062333515 0.0465431407
-0.4975524296 0.1010191982 -0.0163222297
-0.0435080092 0.1774260931 0.0089829606
-0.0256832565 0.1779139561 -0.0057749146
-0.0663496274 -0.2092811280 0.0141356848
-0.0529167261 -0.2089159902 0.0056123976
-0.0020118832 -0.2075624755 0.0044462098
-0.0301910748 -0.1842940328 0.0097869603
-0.4831190801 -0.1243491909 0.1015815191
-0.4683377588 -0.1239509212 0.0958329528
0.4266425444 0.0483103892 -0.0315358134
0.4331101362 0.0484779063 -0.0270958161
0.4332297134 0.0485079481 -0.0547924569
0.4346929105 0.0485172193 -0.0242746223
0.4282235544 0.0483497122 -0.0287732953
0.4407946918 0.0486824185 -0.0274643192
0.1768405296 0.0732048688 0.0445053578
-0.0224917932 0.1797213480 0.0086125964
0.4507550643 0.0383615722 0.0246632746
0.4027709882 0.0370956788 0.0154934356
0.4359060709 0.0379663899 0.0253753391
-0.1550677141 0.0222904852 0.0001861795
0.3149383624 0.0347618612 0.0158827684
0.0468116762 0.0591992839 0.0612294959
0.0652318257 -0.1876709376 0.0170887514
-0.4449543739 -0.1119683824 -0.0395188220
0.2343948812 -0.0939095438 -0.0504877762
-0.4287116373 -0.1115093044 -0.0679310222
-0.4422515241 -0.1119383694 0.0035683140
-0.4890242007 -0.1132458033 0.0704045713
-0.4249828899 -0.1115055955 0.0303733093
-0.0844913646 -0.2103399168 0.0110657354
-0.1578284046 0.1085145055 -0.0494128886
-0.0111919309 0.1124077300 -0.0468860284
-0.2239146529 0.1066676165 0.0445926206
0.1526490450 0.1723455658 -0.0037224909
0.1566859429 0.1724683974 -0.0197887072
0.0556115712 0.1697495814 0.0148349787
-0.4239062272 -0.1460174203 0.0131269456
-0.1483625322 -0.1386842639 -0.0000864013
0.2079768884 -0.1292364273 0.0194964337
0.2660514270 -0.1035961709 -0.0579695259
-0.0108608380 -0.0898502590 -0.0917952386
-0.0719111948 0.2463719115 0.0023880351
-0.4328549185 0.1357337368 -0.0171174848
-0.4942430164 0.1341005522 -0.0147530106
-0.3061558625 0.1390917509 -0.0088840939
0.2406522475 0.1536325463 -0.0231141725
0.0683033687 0.1921447713 0.0115544592
0.0126876654 0.1906653217 0.0135268085
-0.0541027089 0.2137353509 0.0015441107
-0.0520362970 0.2137800625 0.0120460102
-0.0082534881 -0.1911811367 0.0126773292
-0.0273295492 -0.1916862865 0.0109846082
-0.0399872102 -0.1679867818 -0.0029567888
0.4900758847 -0.0219761018 -0.0106298760
-0.0428525721 -0.2354991669 -0.0034935279
-0.0525195779 -0.2357584052 -0.0010027279
-0.0355973478 -0.2353067544 -0.0031468120
-0.0508257273 -0.2116961757 0.0041803881
-0.0809658479 0.2313058384 0.0094309818
-0.0598251577 0.2318767816 -0.0001576029
0.3830766216 0.0202275590 0.0365451390
0.4499218680 0.0220019302 0.0380908521
0.4187743448 0.0211637175 0.0491424878
-0.0828962089 0.0078895379 -0.0061668475
0.4547180437 0.0221295728 0.0378608576
0.3573560365 0.0195690071 0.0110142595
0.4406102172 0.0217578242 0.0347137623
0.4739963557 0.0226500519 0.0292891545
0.4332575779 0.0215565823 0.0408017759
0.2824428492 0.0070209659 0.0346544413
0.3927984317 0.0099356522 0.0523031391
-0.0428281866 -0.0015985175 0.0120172678
0.1433174621 0.0032831328 0.0776493445
0.1634241441 0.0038182401 0.0766851542
0.3125790971 0.0078433916 0.0121804457
0.0983942683 0.0022498560 -0.0875027967
0.3398459172 0.0085597835 0.0204308960
-0.0404000984 -0.0014671422 -0.0569214605
0.2154781247 0.0053723746 -0.0998374861
0.1769246937 0.0043407734 -0.0922534882
0.0533715063 0.0010507479 -0.0844169484
0.0440206262 0.0006423601 0.0804991887
0.2026219832 0.0048632826 0.0728936627
-0.0334504019 -0.0013832766 0.0469643663
-0.0217933224 -0.0010961925 0.0702725495
-0.0826165270 -0.0026379221 -0.0061770588
0.0228451645 0.0002457552 -0.0906000179
-0.0343172892 -0.0012727790 -0.0906975135
0.4263099172 0.0108275070 0.0506961385
0.0072549502 -0.0003286822 0.0746150037
0.1273996839 0.0030264529 -0.0937020926
0.0703676738 0.0013435448 0.0792357496
0.2305046734 0.0056034816 0.0734683928
0.0745512715 0.0016125592 -0.0835207880
0.0986214708 0.0020954746 0.0778808748
0.1839019328 0.0043650783 0.0737913589
0.3182433800 0.0080831457 -0.0798549689
-0.0082917011 -0.0005736312 -0.0986656196
0.2512324716 0.0061718085 0.0552681363
-0.0441339354 0.1974396143 0.0070373715
-0.0460078839 0.2156886349 -0.0001771941
-0.0219516834 0.2163307628 -0.0033002986
0.1297647232 -0.1791900818 -0.0355389506
0.1591355166 -0.1784404538 -0.0039269218
0.0516267537 -0.1812785338 -0.0225809486
0.3079251374 0.1180260842 -0.0237213087
-0.2276147830 0.1038284981 -0.0546972961
-0.0822733724 0.1075963381 0.0416248735
-0.0688080114 -0.2384504620 0.0010539381
0.0932108386 0.0778133026 -0.0738950950
0.0427367496 -0.1710001152 -0.0016504879
0.1181040790 -0.1449784760 0.0013323105
-0.4879164633 -0.1206878223 0.0748730179
-0.4621425558 -0.1199844144 0.0556196793
-0.2656155173 0.0577232444 -0.0509496165
0.2280426596 0.0707322665 0.0582721820
-0.4731614988 -0.1389486844 0.0292163484
-0.4873764694 -0.0989182938 0.0849200049
-0.0225634428 -0.0385045198 0.0636588883
0.4408227514 -0.0261629625 0.0318787485
-0.4735288994 0.0979554126 -0.0185738289
-0.4957130931 0.0972876393 0.0622617397
0.1314756689 0.1784955305 -0.0007386194
-0.2578850638 -0.0793141703 0.0644106546
0.1377023463 0.1681615730 -0.0373575437
-0.1580055862 -0.0870536636 -0.0819024916
-0.3725218571 -0.0928730890 0.0422192655
-0.3770341998 -0.0928911338 -0.0627674671
0.4379278192 0.0495309538 -0.0263418385
-0.1179286439 0.0346996779 0.0395329170
-0.1586737296 0.0337034211 -0.0493496317
0.4396474136 0.0495711549 -0.0206888723
0.1580446033 0.0420062805 0.0654606275
0.4613811908 0.0501458559 -0.0179074699
-0.0216486727 -0.1772359882 0.0093752452
0.4113989406 0.0382900266 -0.0250664795
0.4826587791 0.0401790761 -0.0208364181
0.3985010173 0.0379458702 -0.0235214516
-0.0439381955 -0.2452557075 -0.0001363938
-0.0297879332 -0.2208556205 -0.0020971386
-0.1214254251 0.0135804148 -0.0052477925
0.1283901420 0.1304765196 0.0073596951
0.2992403450 -0.1123290399 -0.0523166638
0.2508250751 0.1231904180 0.0113980450
0.2013058569 0.1218667548 0.0197399966
-0.1174137217 -0.1339805110 -0.0034834993
0.3172043545 -0.1224140682 -0.0240931621
-0.4990579663 0.1003606982 -0.0347878823
-0.4677070024 0.1011966838 -0.0379712984
0.1393214194 0.1412882370 0.0213733802
0.1571241501 0.1418286718 -0.0481869876
-0.1971611624 -0.1149820331 -0.0522675337
-0.0107622851 -0.1101187041 0.0391888935
0.0069318138 -0.1096469052 0.0374138711
0.0983836783 0.1872486465 -0.0249346962
0.0606214142 0.1910532300 -0.0283969548
-0.0316619130 0.1903049902 0.0057469291
-0.0753060389 0.2440214398 0.0052156674
-0.0702210252 0.2441567693 0.0049718220
0.3725055569 -0.0107150507 0.0188708642
0.4300127371 -0.0092142581 0.0467010761
0.4268003822 -0.0093025599 0.0497522142
-0.0858328269 0.2071506352 0.0129737897
-0.0574690940 0.2079138081 0.0030388332
0.4356989788 -0.0435422132 -0.0338539341
0.2298228615 -0.0491112409 0.0687665145
0.4402587748 -0.0434254690 -0.0293224508
-0.1587432306 -0.0592881163 -0.0818755598
0.4561872443 -0.0429941416 -0.0377324672
0.4419340483 -0.0433855487 -0.0245938836
0.4637121464 -0.0428105669 -0.0208880822
0.4875701902 -0.0182025274 0.0286507591
0.4392436055 -0.0194905168 0.0328800080
0.4417514484 -0.0194265837 0.0356557920
-0.2197786834 -0.0370163644 0.0510999190
0.4750461343 -0.0185349354 0.0283237606
0.4407802946 -0.0194514747 0.0347181271
0.4536664454 0.0124896619 0.0408102493
0.4294533733 0.0118406620 0.0467214987
0.3806209549 0.0105401093 0.0500484798
-0.4949975582 0.1115963530 0.0706226617
-0.4870802314 -0.1355126455 -0.0150145277
-0.4468659635 -0.0939857202 -0.0113937892
-0.0630335334 0.2260562399 0.0046327120
-0.0387686600 0.2267090905 -0.0038297505
-0.0536000101 0.2280496457 -0.0017864594
-0.0453326877 0.2282683758 -0.0008513575
-0.0821827375 0.2272850853 0.0035809400
-0.0488498846 0.2464659655 -0.0000502825
-0.0693178113 0.2093248062 0.0141508257
-0.0049800671 0.2110434587 0.0044613507
-0.4319385133 0.0676830555 -0.0152290454
0.2250269935 0.0850892640 0.0335599475
0.2934830433 0.0869324098 0.0083208010
0.1106801540 -0.1652758480 -0.0438971741
0.1771220417 -0.1635133907 -0.0411164093
0.0507491966 0.0460265837 -0.0947904500
0.0954277009 0.0472036058 -0.0845355721
0.1268538015 0.0480529418 -0.0994248143
0.2798030525 0.0519861657 0.0347673478
0.2781887938 -0.1397935808 -0.0050120292
-0.0768143629 -0.2318405346 0.0093726380
-0.0311600538 -0.2306139976 -0.0046935863
-0.0556736727 -0.2312695915 -0.0002159467
-0.0623413577 -0.2074266890 0.0020670651
-0.0829568395 -0.2079849461 0.0129620150
-0.0545931066 -0.2072217732 0.0030270585
0.2842846313 -0.1501482720 -0.0238389791
-0.4518634683 0.0941245270 -0.0112113277
-0.0408019296 0.1695215357 -0.0030202600
-0.0103426531 0.1943377909 0.0126603767
0.2095593119 -0.0975519051 0.0410767015
-0.2575679305 -0.1099652095 0.0443601522
0.4526245303 -0.0354496198 0.0226842569
0.4377755369 -0.0358448021 0.0233963214
0.4160144028 -0.0363423496 -0.0596764962
0.4141393102 -0.0364608629 0.0111481526
-0.0070438489 -0.0475438305 -0.0987111794
-0.4936639856 -0.1026732295 -0.0349848194
-0.4623130218 -0.1018372439 -0.0381682355
-0.4282979444 -0.0693509897 -0.0153619645
0.1184599738 0.1580467586 -0.0430360166
0.1078798144 0.1577664769 -0.0438610488
0.0240706323 -0.0918310459 -0.0762638018
-0.0026655366 -0.0926705912 0.0569859004
0.4352411283 0.0081770168 0.0445333056
0.4054813334 0.0073757353 0.0555194439
0.4292708709 0.0080032927 0.0601140741
0.3983158490 0.0071850373 0.0558630556
0.4329067604 0.0081130369 0.0465570563
-0.2635189598 0.0452864404 -0.0032525111
-0.0366999346 0.0513970411 -0.0905992769
-0.2219931195 0.0463368543 0.0511807692
0.3414715650 0.0267855728 0.0136854668
-0.0395865840 0.0167148378 -0.0407451016
0.4760962034 0.0304175612 -0.0434605075
0.4887402599 0.0307401831 -0.0297576494
0.4393918339 0.0293684133 0.0328580580
0.2480182809 0.0482790318 0.0611448762
-0.0186781708 -0.2137285759 -0.0033265991
-0.0427354179 -0.2143707316 -0.0002034444
-0.4850459275 -0.1212646989 0.0921149729
-0.4682978067 -0.0989472754 -0.0187648188
-0.4904820005 -0.0996150487 0.0620707498
0.0164669260 0.1178987480 0.0024183624
0.3050786585 0.1150373686 -0.0037712090
-0.4252172755 -0.1517535124 -0.0173963392
-0.0634523578 -0.2171845788 0.0061200471
-0.0395164148 -0.2165443588 0.0016701092
0.2595712969 0.1033458095 -0.0577217000
-0.2623662371 0.0893609272 0.0645742646
0.2071581923 0.1019252946 -0.0287914394
0.1237467608 0.1821679783 -0.0003691676
-0.0494704041 0.2206852481 0.0053166505
0.3622898045 -0.0205301854 -0.0485315766
0.4309762104 -0.0187921698 0.0409234153
-0.2613291016 -0.0371416442 -0.0033324639
0.4197524639 -0.0190964341 0.0471960136
0.4392661092 -0.0185650844 0.0338628830
0.3880385042 -0.0198421714 -0.0526049709
0.4408027983 -0.0185260423 0.0357010021
0.4342827785 -0.0187032710 0.0398372794
0.4185933022 -0.0296529157 0.0376968043
0.4396869110 -0.0290822709 0.0271262419
0.3948655727 -0.0302695563 0.0235401650
0.4456476225 -0.0289273449 0.0306640217
0.4373535913 -0.0396356670 -0.0177134604
0.1293986619 -0.0477377250 -0.0995177285
0.4263155610 -0.0399387546 -0.0075673894
0.4271385846 -0.0399335397 0.0095983756
0.4336368415 -0.0397271648 -0.0251824645
0.4402743765 -0.0395691174 -0.0063249576
0.4334233213 -0.0397671812 0.0102245727
0.4311537415 -0.0082618127 0.0504696975
0.3811557408 -0.0095896767 0.0500289545
0.4050497457 0.0150666335 0.0507876591
0.4453703353 0.0161480740 0.0402226651
0.4492741899 0.0162501155 0.0419462205
0.3498014033 0.0137066478 -0.0603405882
0.4022046402 0.0149900168 0.0518506169
0.4402040492 0.0160087281 0.0423811675
-0.0656314270 0.2037037724 0.0020999100
0.0048761123 0.2055763415 0.0027155620
-0.0334241248 0.2228552607 -0.0020575964
-0.0395815554 0.2226920643 -0.0024569556
-0.0038831830 0.1870514137 0.0031411598
-0.0318848076 0.1863010817 0.0097555823
-0.0447838865 0.2408473370 -0.0041836108
0.2740701949 0.0767872099 0.0292992534
-0.0636211591 0.2237856461 0.0019974256
-0.0457614458 0.2242526376 0.0097147464
-0.0363439019 0.2245102953 0.0020209304
0.1423002087 -0.1740959846 0.0087548153
0.0074131003 -0.1776710679 0.0000451538
-0.0043089494 0.1887843417 -0.0047757913
-0.0225246676 0.0583356993 0.0674512266
-0.2273185849 0.0530347935 -0.0767100901
-0.1975189925 0.0431899587 0.0280529295
0.3308531393 0.0888806145 -0.0222053130
0.2586190885 0.0870240769 -0.0866367695
-0.3057406991 0.0719924590 -0.0471184203
-0.0045595983 -0.1990678262 0.0092005000
0.0036494798 -0.1988295181 -0.0116438465
-0.0568233554 -0.2004510444 0.0037699013
0.1083698649 -0.1960489578 -0.0100613387
-0.0487444596 -0.2002335082 0.0007749988
0.0925650544 -0.1648917839 0.0184365215
-0.0422691491 -0.1760472307 0.0090309463
-0.0704865462 -0.2442298803 0.0051329223
-0.0653450208 -0.2440930468 0.0048863670
-0.0242580072 0.1767861221 0.0027885626
0.1740224670 0.1633633650 -0.0041065556
-0.3807066483 0.1486271057 -0.0053126055
-0.4278629702 -0.0789123411 -0.0526877767
0.0884430806 0.1716597630 -0.0402685831
0.2543298966 -0.0714197730 0.0465694422
0.2318353723 -0.0720285996 0.0581337081
-0.0571582924 0.1730766097 0.0010649955
-0.0389069493 0.1735566080 0.0060993851
0.4348919065 0.0436960803 -0.0022685703
-0.0244213735 0.0314295399 0.0637267224
0.4146666627 0.0431801265 -0.0242981140
0.4285811573 0.0435494829 -0.0239800812
0.4250599723 0.0434205396 0.0125120953
0.4140371567 0.0431948965 -0.0567672116
0.4375999166 0.0437811865 -0.0158388038
0.4382428458 0.0437852602 -0.0024292603
0.4405797491 0.0438586356 -0.0140698888
0.2264767810 0.0275524486 0.0717430362
0.4903305289 0.0346264169 0.0055617113
-0.0496605829 -0.2271146956 -0.0018370609
-0.0801072171 -0.2279320640 0.0069218401
-0.0782433103 -0.2278792561 0.0035303386
0.0075400419 -0.2015772081 0.0027115296
-0.0555373461 -0.2535532737 0.0011168864
-0.0571038867 -0.2535936721 -0.0001405923
-0.0476093068 -0.2293168149 -0.0025727107
0.0249687724 -0.1148327924 -0.0304181513
-0.2590639231 -0.1224048508 -0.0034151668
-0.2187973006 -0.1213424898 0.0042118945
0.1874305572 -0.1105487459 0.0026326675
-0.0585339866 0.1707801391 0.0037391402
-0.0395250982 0.1712860304 0.0028275932
-0.0561523425 0.1708479624 -0.0009520779
0.1351573768 -0.1464682538 -0.0245692225
0.2294311675 0.0929287751 -0.0503065484
0.1281350433 0.0902565968 -0.0698381230
0.1316123199 -0.1571359387 0.0152294194
-0.2592475807 -0.0467417769 0.0444214771
-0.2246953423 -0.0457062442 -0.0768058661
0.4015356998 -0.0051755133 0.0557124329
-0.0848141788 -0.0179835744 -0.0605221969
0.2504632430 -0.0437513788 0.0610556093
0.4199617003 -0.0391708819 -0.0187915447
0.4368988593 -0.0387331632 -0.0061633702
0.4379047882 -0.0387267894 0.0148172419
-0.3009415960 -0.0583705102 0.0301453532
0.1401309123 -0.0466858436 0.0644346467
0.4276019349 -0.0389666505 -0.0200844468
0.4274284358 -0.0390157715 0.0258051916
0.4354085781 -0.0387227013 -0.0577669919
0.0736958965 -0.0483017945 -0.0891998283
0.4309982416 -0.0388771620 -0.0193207880
0.3153046382 -0.0419803251 0.0111373307
0.4339780741 -0.0387997129 -0.0175518730
0.4396540012 -0.0386477584 -0.0187505792
0.4707257944 -0.0377994790 -0.0422547223
0.4340388617 -0.0388379912 0.0235763880
0.4426338337 -0.0385703093 -0.0169816642
-0.0823445059 -0.2114421903 0.0129337065
-0.0448938234 -0.2104339798 -0.0007391233
-0.0025240388 -0.1852822014 -0.0047477303
-0.4615111644 -0.1329587867 -0.0387186192
-0.0422563450 0.1985823908 0.0141892096
-0.0089203134 0.1994907043 -0.0091916188
-0.0588642099 0.2164463165 0.0004389805
-0.0509224394 -0.2128536627 0.0015212264
0.0046809747 0.2015726089 0.0073031423
0.1439244891 -0.1836509717 -0.0025580673
-0.0610465053 0.2547109541 -0.0020755010
-0.4650004566 -0.1113940413 0.0720915568
-0.1267901500 0.0461075445 -0.0881899404
-0.4888044859 -0.1225591350 0.0698176575
-0.4896936734 -0.1224956460 -0.0199911601
0.4333390757 0.0503979980 -0.0309309930
0.3497138334 0.0481974504 -0.0526999486
0.1796618378 0.0435642362 0.0663355105
0.4538744227 0.0509463679 -0.0338275485
0.4486734468 0.0508255398 -0.0517102136
0.0115908718 -0.2082484140 0.0097604949
-0.0399916506 0.2369794824 -0.0030796028
-0.0543315969 -0.1695356410 0.0076377904
-0.0338753469 -0.2364222452 0.0007110527
-0.0572856193 0.2016561505 0.0142708950
0.1137674040 0.1521345865 0.0153541306
0.1263908915 0.1525250469 -0.0414449676
0.2349342602 -0.0920355279 0.0016820475
-0.2220901746 -0.1041223653 -0.0548990025
0.1178690640 0.1417473338 -0.0245225126
0.1140250979 0.1416456506 -0.0249751001
-0.1159276565 -0.0803515085 0.0681480084
0.1965924757 -0.1140949472 -0.0282192333
0.2323757076 -0.1131875309 0.0163522216
0.0724368213 -0.0857519047 -0.0661293008
0.1420244811 -0.0840093456 0.0433263530
0.0100717568 0.2021418152 -0.0141008105
0.4392538747 0.0130905961 0.0415010866
0.3703443426 0.0112937657 0.0065704239
0.4386527811 0.0130774080 0.0386338669
0.4201113362 0.0125709772 0.0529046123
0.4108572437 0.0123284031 0.0495247624
0.2171774626 -0.0272274231 -0.1018207619
0.4387899671 -0.0214696451 0.0319747858
0.4510238921 -0.0211496219 0.0371235507
0.4364989238 -0.0215333717 0.0349240326
0.4460902287 -0.0212781144 0.0344640938
0.3770284565 -0.0230372461 -0.0435022535
0.4558200678 -0.0210219793 0.0368935562
0.4916469190 -0.0200369810 0.0026758207
0.3771806967 -0.0230749449 -0.0004665690
0.4949141242 0.0040703798 0.0044236572
0.3689392052 0.0007075873 0.0209501936
0.3762770026 0.0008806183 0.0435400274
0.3809659528 0.0009970349 0.0519466463
0.3704758943 0.0007466294 0.0227883127
0.4887312837 0.0355216688 -0.0067592589
0.4349306795 0.0340537201 0.0330705275
0.3933245069 0.0329547544 0.0264919380
0.4054198475 0.0332738996 0.0287502547
0.3597051021 0.0321008793 -0.0140123470
0.3489826921 0.0318572138 -0.0564833366
0.2814511873 0.0299718621 0.0375910583
0.4326999050 0.0339915426 0.0360735459
-0.0418316384 -0.1960623649 0.0070465305
-0.0561325478 -0.1724142912 0.0011207741
-0.0435635815 -0.2223809714 -0.0001613041
-0.0179922218 -0.2217081289 0.0065492945
-0.0567114904 -0.1987150242 0.0070661297
-0.0230002498 -0.1978242592 0.0120537906
0.0665065080 0.0683528001 0.0564598661
-0.1241339090 0.1189729393 -0.0032381418
0.2641533965 0.1293319861 -0.0480430333
0.1317369743 -0.1772683235 0.0066558009
-0.0448147379 0.1779752835 0.0037738069
0.2315602345 0.1179354554 -0.0524437701
-0.2030423040 0.1063890369 -0.0520528102
-0.1988799639 0.1064154106 0.0347609240
0.1458808382 -0.1318004544 0.0066007710
0.2594274617 -0.1287882008 0.0110621481
-0.4890759994 -0.1082707340 0.0720854585
0.0683236805 0.1029907518 0.0229349495
0.1402046854 0.1049130212 0.0099299915
0.1826010260 0.1060462777 0.0027984218
0.2779162027 0.1085739482 0.0074971447
0.2741692114 -0.1388737415 -0.0484417683
0.1273162116 0.1697531401 0.0067623336
0.1216963645 0.1696003739 0.0103339464
0.2062619942 -0.0755983302 0.0546107835
-0.3016891361 -0.0890962430 0.0579400827
-0.4708923701 0.1103824952 0.0723066736
0.4904556585 -0.0229187919 0.0161164713
-0.0425349322 0.1757863259 -0.0042716731
-0.2239723222 -0.0763640698 -0.0787429216
0.3113556545 -0.0621385214 -0.0823999677
0.4478032645 -0.0345934283 0.0229151554
-0.0857400167 -0.0486518475 -0.0968494081
0.1602836452 -0.0422731199 0.0653788789
-0.0300232426 0.2297762623 -0.0022227565
-0.0433276559 0.2294119598 0.0089585204
-0.0610615917 0.2289457865 0.0038426574
-0.0841256276 -0.2069130164 0.0097156084
-0.0403300843 -0.2057404430 0.0003732392
-0.0376753355 -0.2056826030 0.0134544150
-0.0193445239 -0.2051915547 0.0092732641
-0.0314183214 -0.1814778040 -0.0033635311
-0.0840609601 0.2300670525 0.0082471555
-0.0421879283 0.2311852583 0.0022990981
-0.0287769373 0.2315408779 0.0029885913
-0.0516839628 0.2309376498 -0.0025171719
-0.0181995915 -0.2245450422 0.0006504911
-0.0591863027 -0.2256377486 0.0045854767
-0.0349214293 -0.2249848979 -0.0038769859
0.0206125928 0.0404204195 -0.0943286928
-0.1977389446 0.0345286500 -0.0006687318
0.2024170638 0.0691280529 0.0547511639
-0.2619983613 0.0567999000 0.0445219096
-0.0001514999 0.1957101370 0.0108387386
0.1053247933 -0.1808160667 0.0158600659
-0.4685587143 0.1323168628 -0.0384613095
0.4018283512 0.0399242575 -0.0025939795
0.4809450081 0.0420001519 0.0241999774
0.4254983065 0.0405217732 0.0296971867
0.4434763091 0.0410141086 0.0145258868
-0.0342387609 0.0282912110 0.0469931497
0.1700513378 0.0338607358 -0.0995798279
0.3085249387 0.0375264915 -0.0861179321
0.4320172797 0.0406989741 0.0255609596
-0.0539445325 0.2125792693 0.0042010283
0.3757001728 0.0287338909 -0.0424695362
-0.0037600617 0.2156533200 -0.0001755518
-0.0383231111 0.2147360647 -0.0011833251
-0.0429747566 0.2329053732 -0.0022973692
-0.0644921707 0.2506245346 -0.0012710860
-0.4969255250 0.1022694131 0.0252416542
0.2253888193 0.1455506038 -0.0461893679
0.1065918191 0.1423492828 0.0004654338
0.2053944033 -0.1024288330 0.0010742818
-0.1930495369 -0.1130467192 0.0345480521
0.0934767628 -0.1054120062 0.0112490032
-0.0449215930 0.1980026189 0.0018033265
-0.0678780582 -0.2087334472 0.0043024422
0.2737836707 0.1362793212 -0.0234225192
0.2237183499 0.1349135343 0.0133898129
-0.0570557172 -0.2518580555 0.0018271397
0.0552922936 -0.1169306499 -0.0204006487
-0.1516936900 -0.1224012661 -0.0496368702
-0.1944630842 -0.1235849080 -0.0007777608
-0.0560450515 0.1679564566 -0.0003194238
-0.2007514735 0.1131153090 -0.0005481684
-0.1528895152 0.1143417651 0.0459350846
0.2034964930 0.1239058660 -0.0530697792
0.1401133073 0.1778184075 -0.0216032354
0.3582006222 0.0013410663 0.0281855792
-0.4973022234 0.1240471916 0.0016755271
0.2038482958 -0.0238727130 0.0728435962
0.4397939845 -0.0175683884 0.0357490794
0.4836484186 -0.0163966091 0.0288382424
0.3843029620 -0.0190470480 0.0403218897
0.3954742806 -0.0187524953 0.0426255660
-0.0797466526 -0.0313728831 0.0377223295
0.4253551225 -0.0179609721 0.0450152371
0.4772954154 -0.0164942643 -0.0444879879
0.2828250189 -0.0217403042 0.0375408990
0.3718954785 0.0122488097 0.0188931385
0.3757898375 0.0123320535 0.0397362890
0.4069605623 0.0131504873 0.0497113415
0.1986218919 0.0863942047 -0.0655695676
-0.2034637871 0.0757239595 -0.0778607165
0.2979240390 0.0890443905 -0.0779783970
-0.1276307544 0.0777485969 -0.0881592494
-0.0556091136 -0.1678295174 0.0037017734
0.0489293379 0.1033948273 0.0296001264
0.0013057762 0.1021218389 0.0376192807
0.0115459724 -0.2006116518 0.0130624468
0.1582293643 -0.1726420388 -0.0389333455
0.2505047499 0.0982327927 0.0114209852
0.1432987542 -0.1520272954 0.0212717923
0.1620255572 -0.1514622679 -0.0483328882
-0.2181050286 -0.0724706616 0.0663249133
-0.4666775670 0.1174435957 -0.0497857316
-0.4974432918 0.1166253769 -0.0488897142
-0.4903601306 -0.1306681595 0.0328767648
-0.4865869870 -0.1306173042 0.0837910763
-0.4737893244 -0.0897901347 0.0579075937
0.4045454187 -0.0348068537 0.0125918705
0.4745090318 -0.0329541556 0.0187958997
0.4827919203 -0.0327364728 0.0212370378
0.2172239244 -0.0398412289 0.0722071443
0.4646391193 -0.0332205364 0.0230928169
0.3522341159 -0.0466680823 -0.0527919655
-0.0413708775 -0.1749106807 -0.0042209443
-0.0316130502 0.0532998711 0.0564176539
-0.0533427968 -0.2186483278 0.0010010634
-0.0462245993 -0.2184684972 0.0105660800
-0.0615631928 -0.2188773283 0.0119395919
-0.0476444987 -0.2184985871 0.0026973288
0.1017111324 -0.1904815696 -0.0249794804
0.1278471954 -0.1898110059 -0.0004527600
-0.0627201084 0.2249011420 0.0105276433
0.1376352356 0.0472535073 0.0645257651
0.2157015925 0.0493227467 0.0694136640
0.0724501386 -0.2018183022 0.0002363663
0.0093417149 -0.2034811438 -0.0139425817
0.4865492309 0.0219997187 0.0296717315
0.4388681109 0.0207251984 0.0376936460
0.4299798290 0.0204849421 0.0419434903
0.3945040359 0.0195408104 0.0436446868
0.4383140989 0.0207123087 0.0358084039
0.4243849281 0.0203323340 0.0460354048
0.4398507880 0.0207513508 0.0376465230
0.4178842899 0.0442418870 -0.0158201895
-0.1241921192 0.0298775356 -0.0538982805
0.4255688454 0.0444463992 -0.0161886925
0.4352515528 0.0447022357 -0.0147422547
0.4289208312 0.0445356070 -0.0163494327
0.4241664409 0.0443988498 -0.0055781614
0.4319006135 0.0446130557 -0.0145815647
0.2151354676 0.0387700228 0.0722833949
-0.0313456396 0.1908960826 0.0017914973
-0.0499535983 0.2452807953 -0.0019665237
-0.0559408776 0.2085231049 0.0135097036
-0.0874903085 0.2094238494 0.0110819993
-0.4938086067 0.1091302462 0.0795462395
0.1704752510 0.1584997303 -0.0408955508
0.1501644121 0.1579047401 0.0162137390
0.1614146197 -0.1448317091 0.0223705491
-0.4927219520 -0.1381321625 -0.0350192135
-0.4699118037 -0.1375447738 -0.0158370616
0.3025573561 -0.0853575280 -0.0781475618
0.2585316408 -0.0866182661 0.0157847178
-0.4446694354 -0.0964032652 -0.0249385293
-0.4408536728 -0.0963240229 -0.0021227193
-0.4522736889 -0.0966459299 0.0169630600
-0.0289849491 0.2292726894 0.0082708924
-0.0818821868 0.2278655315 0.0101705921
0.1429234071 0.1231644741 0.0066651098
-0.0125420975 0.1190313899 0.0096020110
0.1196065174 0.1465597900 0.0143801841
-0.3714447201 -0.1379245618 0.0287996978
0.2389081244 -0.1216303080 -0.0527232904
0.2566801079 -0.0971978935 0.0111842747
0.0957679916 -0.1014041734 -0.0595962545
-0.2612273225 -0.1108948081 -0.0530204894
-0.0441882773 -0.2446894015 0.0058416940
-0.0128566807 0.1931343052 -0.0090009561
-0.1199041639 0.1056169644 0.0376942818
-0.1267223114 0.1055245742 -0.0537999501
0.2103196683 -0.1329241370 -0.0533188969
0.4516692882 -0.0373638862 0.0017017941
0.4638746150 -0.0370334977 -0.0046189239
0.1820038397 -0.0445906693 0.0662500028
0.4167389315 -0.0382647314 -0.0262845362
0.4454246729 -0.0375393487 0.0115602919
0.3519309620 -0.0399969098 -0.0155295164
0.4306062944 -0.0378956736 -0.0269495279
0.4740199319 -0.0367653507 -0.0031936206
0.3991873305 0.0168227590 0.0491563944
-0.0695711329 -0.2025282744 0.0050763634
0.2278014568 -0.0223094496 0.0716946716
-0.4507411325 0.1321404752 -0.0247168484
-0.1486670287 -0.0428217675 0.0467656647
0.3612897167 -0.0292138938 -0.0149962193
-0.1997282152 -0.0440591365 -0.0760916229
-0.4967075097 0.1016616709 0.0016538137
-0.4891262566 0.1017659416 0.1018008443
-0.4743449354 0.1021642113 0.0960522779
0.0906363629 0.0738027199 0.0514776721
0.0551593069 -0.1745067783 0.0149612463
-0.0260228410 -0.2276437859 -0.0022755961
-0.0570622367 -0.2284742895 0.0037898679
-0.0486384099 -0.2042253099 0.0007711269
-0.3034030622 0.0528580681 -0.0089898813
0.3078672295 0.0691687028 -0.0822726035
0.2191539615 0.0668281381 -0.0990475318
0.1223062978 -0.1832116845 -0.0325732709
-0.4704381184 -0.1345792150 0.0751399340
-0.4887385843 -0.1350548454 0.0642570509
-0.4712435242 -0.0941440187 0.0807852198
-0.0883110138 0.0481226255 -0.0967555396
0.3094291619 0.0902077587 -0.0077958705
-0.2220498573 0.0760159776 0.0664689410
-0.3775377884 0.0959307469 0.0424023998
-0.3820501311 0.0959127021 -0.0625843328
0.0699776131 -0.1951796342 0.0115918539
0.2353911741 -0.1591239875 -0.0465763785
0.1299454253 -0.1619302581 -0.0415198619
0.2459590569 -0.1588824683 -0.0061251049
-0.0551924104 0.1697076958 0.0075760020
0.0126890577 0.1811193366 0.0082580030
-0.0776420481 -0.0783564126 0.0748855322
0.3088599779 -0.0680285824 0.0133660459
0.3445450917 -0.0670538191 -0.0141818919
-0.0855484521 -0.0889357417 -0.0958614900
-0.0556645758 -0.2547109541 -0.0021787810
-0.0771456458 -0.2312641966 0.0027841079
-0.0799555747 -0.2313440917 0.0081904948
-0.0552151601 -0.2306882491 0.0096682507
-0.0380814964 -0.2302258581 0.0022423873
0.3355617212 -0.0883543306 -0.0223772258
0.0554773756 -0.0957443832 -0.0748718612
-0.0175428300 -0.0978203124 0.0653480002
0.1330219057 -0.0936889755 -0.0700165449
-0.1953660707 -0.0709443758 0.0700420677
-0.4247572937 -0.0769834011 0.0131467783
0.4526194989 0.0009415880 0.0427757625
0.4842400080 0.0017933441 0.0307161607
0.3933540025 -0.0006476939 0.0580151425
0.4058243072 -0.0003167723 0.0584024296
0.4871283878 0.0018702137 0.0305776521
0.4479158223 0.0008145527 0.0449131304
0.4086212344 -0.0002404822 0.0563564975
0.4197481818 0.0000537894 0.0577347280
0.4304907852 0.0003350792 0.0619697226
0.3985673701 -0.0005080497 0.0568386178
0.4337983998 0.0004240058 0.0608835365
0.4029348808 -0.0003936698 0.0585409884
0.4245443575 0.0001814320 0.0575047335
0.4662229806 0.0013101408 0.0354037624
0.4365039246 0.0004997168 0.0569312277
0.4125261857 -0.0001384125 0.0580810496
0.4755870091 0.0015639580 0.0302035306
0.4410700633 0.0006259018 0.0519033615
0.4376110917 0.0245746535 0.0329448931
0.4353671300 0.0245112252 0.0368761175
0.4381196861 0.0245872343 0.0339047395
0.4396563752 0.0246262764 0.0357428586
-0.0085328339 -0.1866130439 0.0093872156
-0.4724252182 -0.1420267830 0.0005636152
0.4315102752 0.0455358723 -0.0222093146
0.4316931805 0.0455370312 -0.0183944675
0.4303350968 0.0454897626 -0.0068595374
0.0116615272 -0.2130317239 -0.0107487859
0.4260633424 0.0347975684 0.0383033037
-0.0858576417 0.0212932393 -0.0604840996
0.4150764684 0.0345135426 0.0301986937
0.4889688624 0.0364883872 0.0180815176
-0.0474971338 0.2213172908 0.0045272180
-0.0216126852 0.2220131889 -0.0039562474
-0.0730836564 0.2389274856 0.0064432611
-0.0762732493 0.2388451848 0.0039310137
-0.0721761756 0.2023693031 0.0050782578
-0.0518632911 0.2412345805 -0.0005421826
0.2081568121 0.0942568673 -0.0327764479
0.1283118714 0.1477159647 0.0152950489
-0.4341969184 0.1328320000 -0.0467132028
-0.0081994055 0.2058213154 -0.0111986752
-0.0513484363 0.2046633638 0.0007768423
-0.0226687350 0.2054285387 -0.0025679763
0.0720172471 -0.1116740909 -0.0288513681
0.2089689165 -0.1080859261 0.0229187465
-0.0763415162 -0.1156836722 0.0414082983
0.1775069641 -0.1089167729 0.0177644635
-0.0024127272 -0.2127143632 -0.0067719639
-0.0313442768 0.2234786206 0.0090237411
0.1479742987 0.1272085515 -0.0259615106
0.3150844301 -0.1157753810 -0.0041808222
-0.2989515761 -0.1320835928 -0.0091471262
-0.0779526017 -0.2341260020 0.0061257866
-0.0869278506 0.2054460101 0.0097246899
-0.0404786049 0.2066763957 0.0134635468
0.2184262365 -0.0532351239 0.0693141858
-0.4922409776 0.1154146669 0.0879275053
0.4134916840 -0.0029479895 0.0561238032
0.4427324076 -0.0021605223 0.0451625563
-0.1539981145 -0.0179701347 0.0001471279
0.4363963397 -0.0023365642 0.0531136306
-0.4870148967 -0.1095028691 0.0865857998
0.0532187645 -0.0469300087 -0.0948806152
0.4037520868 -0.0377040660 -0.0055597240
0.4012495401 -0.0377585863 -0.0178948072
0.4404638459 -0.0367521029 0.0185175633
0.4057220462 -0.0136822518 0.0488523506
0.4076277490 -0.0136315346 0.0487609650
0.4029240725 -0.0137585699 0.0508983329
-0.2210775695 -0.0302939596 0.0071906562
0.4408763999 -0.0127401568 0.0404469058
-0.0171780998 -0.2153768436 0.0065083375
-0.0344354479 -0.2158399972 0.0113326428
-0.1624867317 0.0816203862 -0.0817388826
0.2000596210 0.0912235206 -0.0522577279
0.2036732754 0.0912464176 0.0231120931
-0.2281230711 0.0798735796 -0.0785913756
-0.4287805045 0.0744536091 0.0132936678
-0.4925737430 0.0967114181 0.0851097601
0.0743457237 -0.1595721123 0.0027978466
-0.4805071571 0.1375480138 0.0294845422
-0.0425731990 -0.1972344844 0.0018108025
-0.0398951666 -0.1971753509 0.0141962308
-0.0065591350 -0.1962670374 -0.0091845976
-0.0463442523 -0.2407538226 0.0065818370
0.1999007105 0.0460094428 0.0691880189
0.1521334249 0.1656515157 -0.0387438439
-0.0655820904 -0.2435161118 0.0002628391
0.1616649706 -0.0815773100 0.0433681734
0.0974876225 -0.0831684093 -0.0740512426
0.0746558876 0.1530180902 0.0026880121
0.3311052891 -0.0875638888 -0.0048998121
0.2296864195 -0.0902954129 0.0333898294
-0.4942693733 0.1184410026 0.0751049660
-0.4684926549 0.1191444283 0.0559102529
-0.3070352678 0.1323168805 0.0294530642
0.1073667181 0.1433768280 -0.0226868662
-0.0598784528 -0.2239739556 0.0019540065
-0.0266877882 -0.1990677564 -0.0002828766
-0.0234972802 -0.1749644042 0.0034969183
-0.4860524866 -0.1175252939 0.0877015603
0.3814776536 0.0030266964 -0.0571057309
0.3603439586 0.0024651557 -0.0570191306
0.4425541271 0.0045501049 0.0451690655
0.4362180592 0.0043740629 0.0531201397
0.3902643151 0.0347965831 0.0132554419
0.2156499563 0.0302691886 -0.1017649918
0.4408006051 0.0361266908 0.0261265108
0.4727868746 0.0369807645 0.0216955563
0.3767812369 0.0344674778 -0.0167436007
0.3858656615 0.0347101440 -0.0181057571
0.4629169622 0.0367143837 0.0259924735
0.4386020387 0.0255249598 0.0348089013
0.4061975307 0.0246588566 0.0401864363
0.4315216940 0.0254320541 -0.0633353383
-0.0631189752 0.2517641152 -0.0046393901
-0.0822086083 0.2329546530 0.0061879466
-0.0680431865 -0.2030183029 0.0149096117
-0.0205396950 0.2180374174 0.0065378420
-0.0377970431 0.2175742638 0.0113621473
0.2254883575 0.1090825487 0.0166149154
-0.0164144594 0.1026338461 0.0393952573
0.1916694333 0.1082274094 -0.0280507355
0.0878753031 0.1054316038 0.0114535154
0.2894363853 0.1108479206 -0.0519144068
-0.4509108081 0.1122367620 -0.0393013494
-0.4482079583 0.1122667750 0.0037857866
-0.1552363943 0.1200536318 0.0001645670
0.2680961275 0.1313048933 -0.0046104883
-0.2251609826 0.1181918015 0.0044442359
0.1831461533 -0.1739648552 -0.0215890338
0.0909821563 -0.1763952321 -0.0402845831
0.0228567446 -0.1226193496 0.0021850667
-0.0130262627 -0.1821432418 -0.0069092982
-0.0089701665 -0.1820449042 0.0028025575
0.0490870990 0.1149675991 -0.0211011596
-0.4306596422 0.1021720889 0.0305805705
-0.0611432117 0.2535532575 -0.0047346629
-0.0789859348 -0.1358535072 -0.0043988511
-0.0291714109 0.2012594702 -0.0002854153
-0.0659931438 0.2185700390 0.0028073672
-0.0426105466 0.2191962063 -0.0023106667
-0.0329460933 0.1828704029 -0.0034009685
-0.0569302947 0.2371062483 -0.0009349074
-0.0559362997 0.2371230930 0.0089237875
-0.0385199460 0.2375872753 0.0073939775
0.0228516346 -0.0438589810 -0.0944104413
0.3631752504 -0.0348723305 -0.0380266052
0.4424938148 -0.0328244409 0.0231691830
0.2286947954 -0.0385514482 0.0716567742
0.4277320243 -0.0332284288 0.0353479201
0.4132604541 -0.0335532721 -0.0261191897
0.4003182100 -0.0338977093 -0.0254985608
-0.1242960042 -0.0477741820 -0.0882810029
-0.0021751320 -0.1841220685 0.0031720270
-0.4896717867 0.1223001464 0.1018207619
-0.4748904654 0.1226984161 0.0960721955
-0.0558381113 -0.2529767423 -0.0048351378
-0.0395998676 -0.2285306399 0.0029526406
-0.0146298199 0.1850970060 -0.0069439806
-0.0105737237 0.1851953437 0.0027678752
0.4952053415 -0.0103342125 0.0025022622
-0.0384924065 -0.0244709162 -0.0407850506
-0.0719738678 0.2018498868 0.0090088041
-0.3008827798 -0.0420074646 -0.0090818981
0.4397386451 -0.0223712342 0.0319295748
-0.0325590829 -0.0349332693 0.0469318238
0.4073341371 -0.0232373374 0.0373071097
0.4392290042 -0.0223838428 0.0309697786
0.4023835385 -0.0232874432 -0.0466296517
0.3165427479 -0.0256285447 0.0158241915
0.3504840896 -0.0246566393 -0.0565381534
0.4407656933 -0.0223448007 0.0328078976
0.4528101922 0.0326184590 0.0341255273
0.2025251509 0.0259315607 0.0728919049
0.4485680285 0.0325037061 0.0362407639
-0.3043024551 0.0681350272 0.0302680599
-0.0816898369 0.0740057318 0.0750333191
-0.3773880169 0.0661945789 0.0290226425
0.1376708737 0.0798640650 0.0434853055
0.1559064235 -0.1670272520 0.0160371474
-0.4921246299 -0.1032877056 -0.0165204015
-0.4836815335 -0.1031779742 0.1016020546
-0.4689002122 -0.1027797044 0.0958534882
0.3050918710 0.0738061019 0.0135036215
-0.3787571981 0.0556566712 -0.0053778291
0.1261417329 -0.1783472715 0.0102265153
0.0098314606 -0.1814356044 0.0085051549
0.1430796771 -0.1778509797 -0.0375102462
0.4618755868 0.0434289002 -0.0016504305
0.3498404811 0.0404649087 -0.0144684465
-0.0389889024 0.0300825012 0.0395731202
0.4313735283 0.0426041568 0.0131938709
-0.0022175757 -0.2087111544 -0.0113595447
-0.0660814425 -0.2104268043 0.0082135668
-0.0816355534 -0.2108381681 0.0062952933
0.1079997772 -0.1893604986 0.0064649698
0.0103633149 -0.1919614667 0.0137544912
3 57 401 535
3 641 401 57
3 498 506 401
3 910 501 737
3 634 457 197
3 1227 661 958
3 1023 959 661
3 910 712 978
3 501 506 737
3 497 89 510
3 89 497 613
3 503 497 1154
3 514 1238 634
3 1154 1086 640
3 457 634 1238
3 640 1086 754
3 712 184 978
3 1238 1154 640
3 640 457 1238
3 209 387 899
3 1154 1238 503
3 215 317 959
3 29 91 1227
3 661 1227 91
3 498 438 317
3 494 651 648
3 640 381 457
3 401 641 570
3 402 498 401
3 402 401 245
3 1087 57 226
3 89 613 29
3 123 89 29
3 754 381 640
3 317 438 958
3 754 1224 381
3 514 503 1238
3 754 1086 931
3 931 1224 754
3 497 503 613
3 1254 494 197
3 29 213 91
3 899 514 209
3 29 613 213
3 29 127 123
3 121 226 1258
3 641 57 1087
3 569 570 641
3 381 1224 328
3 127 29 1227
3 1227 867 127
3 1227 958 867
3 958 856 867
3 856 958 438
3 856 438 498
3 508 856 498
3 978 1283 910
3 712 215 184
3 959 1213 215
3 661 448 1023
3 959 958 661
3 1023 1213 959
3 317 958 959
3 494 648 504
3 215 1213 184
3 910 737 712
3 317 737 506
3 317 712 737
3 317 215 712
3 506 498 317
3 899 613 503
3 503 514 899
3 613 899 213
3 387 213 899
3 448 213 387
3 448 91 213
3 661 91 448
3 514 504 209
3 209 504 648
3 387 209 648
3 245 570 1224
3 569 328 570
3 245 401 570
3 569 641 1087
3 535 1258 57
3 535 401 506
3 501 1258 535
3 1224 931 245
3 570 328 1224
3 57 1258 226
3 506 501 535
3 778 497 510
3 497 778 1154
3 1154 778 1086
3 778 820 1086
3 1135 1086 820
3 1086 1135 931
3 9 931 1135
3 245 931 9
3 6 245 9
3 245 6 402
3 402 6 498
3 6 508 498
3 197 494 504
3 504 514 634
3 504 634 197
3 488 651 494
3 494 1254 488
3 121 1258 500
3 500 488 121
3 501 500 1258
3 501 910 500
3 500 910 1283
3 1283 488 500
3 510 614 492
3 382 925 1028
3 615 614 763
3 526 763 614
3 293 778 510
3 778 293 820
3 293 684 1088
3 1088 1181 293
3 511 60 774
3 1053 511 986
3 293 510 492
3 492 507 684
3 684 293 492
3 489 986 511
3 986 1271 1053
3 30 763 526
3 774 489 511
3 763 30 868
3 1215 868 30
3 868 1215 1271
3 1053 1271 1215
3 508 60 511
3 925 1135 1028
3 820 293 1181
3 1028 820 1181
3 60 6 9
3 6 60 508
3 925 9 1135
3 1088 1028 1181
3 821 774 60
3 60 9 925
3 925 382 821
3 821 60 925
3 1028 1135 820
3 507 492 615
3 614 615 492
3 1028 1088 382
3 1053 508 511
3 856 1053 867
3 1053 856 508
3 867 1215 127
3 867 1053 1215
3 127 30 123
3 127 1215 30
3 614 123 526
3 123 30 526
3 89 614 510
3 614 89 123
3 507 496 119
3 119 684 507
3 684 119 159
3 159 244 1088
3 1088 684 159
3 496 495 828
3 828 119 496
3 119 828 61
3 61 159 119
3 159 61 325
3 325 244 159
3 495 513 120
3 120 828 495
3 828 120 880
3 880 1015 325
3 325 61 880
3 883 1037 490
3 1037 512 490
3 1180 224 1037
3 1180 1037 883
3 628 224 1138
3 1045 103 509
3 582 769 1241
3 582 732 769
3 1016 733 1184
3 1016 732 733
3 780 1262 949
3 1262 491 486
3 333 1077 298
3 949 1262 486
3 1016 326 333
3 326 1077 333
3 1088 244 341
3 441 244 325
3 341 1136 1138
3 1138 1088 341
3 96 813 1136
3 1138 1136 628
3 1138 1180 382
3 1136 813 1184
3 813 1016 1184
3 1015 880 5
3 5 141 1015
3 880 120 976
3 976 5 880
3 120 513 695
3 695 1263 120
3 1078 196 1085
3 196 1183 1085
3 104 196 1078
3 233 1183 196
3 196 1077 233
3 196 104 1262
3 1262 780 196
3 104 493 491
3 491 1262 104
3 941 512 1037
3 290 1037 874
3 874 1037 224
3 874 224 628
3 104 1078 1040
3 509 499 941
3 499 512 941
3 880 61 828
3 341 96 1136
3 333 298 769
3 515 103 949
3 486 515 949
3 333 769 732
3 333 732 1016
3 874 1147 290
3 733 874 628
3 1045 509 941
3 582 1241 1147
3 515 509 103
3 1037 290 941
3 733 582 1147
3 732 582 733
3 1147 1241 974
3 103 1241 769
3 103 769 298
3 949 298 780
3 103 298 949
3 1077 780 298
3 196 780 1077
3 490 489 883
3 883 489 774
3 821 883 774
3 821 1180 883
3 382 1180 821
3 1088 1138 382
3 1138 224 1180
3 874 733 1147
3 1241 1045 974
3 1045 1241 103
3 974 1045 941
3 1147 974 290
3 974 941 290
3 1184 733 628
3 1136 1184 628
3 233 1077 326
3 244 441 341
3 441 96 341
3 1085 141 1078
3 1078 141 5
3 1078 5 1040
3 1040 5 976
3 120 1263 976
3 496 507 911
3 615 911 507
3 911 615 324
3 953 324 763
3 615 763 324
3 495 496 1198
3 911 1198 496
3 1198 911 1060
3 324 1060 911
3 1060 324 716
3 953 716 324
3 513 495 912
3 1198 912 495
3 912 1198 1059
3 955 1059 716
3 1060 716 1059
3 803 549 490
3 512 803 490
3 431 42 803
3 803 42 549
3 431 218 31
3 372 745 509
3 655 88 76
3 323 88 655
3 532 36 609
3 323 36 532
3 437 208 848
3 491 437 486
3 1276 705 616
3 437 848 486
3 610 36 705
3 1276 610 705
3 953 763 1166
3 953 762 716
3 1167 1166 31
3 763 31 1166
3 124 1129 1167
3 1167 31 218
3 42 31 868
3 124 1167 609
3 36 124 609
3 1059 955 81
3 37 81 955
3 912 1059 802
3 81 802 1059
3 513 912 695
3 847 695 912
3 90 80 715
3 125 90 715
3 90 650 80
3 125 1066 90
3 1276 90 1066
3 650 90 437
3 208 437 90
3 493 650 491
3 437 491 650
3 512 1266 803
3 803 1177 901
3 803 901 431
3 431 901 218
3 80 650 1282
3 499 509 1266
3 512 499 1266
3 1060 1059 1198
3 1129 1166 1167
3 616 705 655
3 372 515 848
3 515 486 848
3 655 705 323
3 323 705 36
3 987 901 1177
3 901 532 218
3 509 745 1266
3 76 88 987
3 509 515 372
3 1177 803 1266
3 88 532 987
3 88 323 532
3 76 987 1004
3 76 372 655
3 655 372 616
3 616 848 208
3 616 372 848
3 208 1276 616
3 208 90 1276
3 489 490 549
3 489 549 986
3 549 1271 986
3 42 1271 549
3 42 868 1271
3 31 763 868
3 431 31 42
3 532 901 987
3 745 76 1004
3 76 745 372
3 745 1004 1266
3 1004 987 1177
3 1266 1004 1177
3 532 609 218
3 609 1167 218
3 1276 1066 610
3 762 953 1166
3 1129 762 1166
3 37 715 80
3 37 80 81
3 81 80 1282
3 81 1282 802
3 847 912 802
3 671 1239 976
3 1263 695 1194
3 1048 105 1040
3 104 1040 105
3 105 939 493
3 105 493 104
3 105 838 939
3 1239 671 833
3 413 105 836
3 1239 833 63
3 1048 63 836
3 836 63 408
3 1040 976 1048
3 1048 976 1239
3 63 1048 1239
3 105 413 838
3 676 408 833
3 676 833 1193
3 1194 671 1263
3 833 671 1194
3 976 1263 671
3 168 250 802
3 695 847 1194
3 482 846 1282
3 1282 650 482
3 939 482 493
3 493 482 650
3 838 482 939
3 250 168 915
3 482 824 252
3 915 168 1201
3 1201 846 252
3 1201 252 1202
3 482 252 846
3 1201 1202 915
3 1193 253 265
3 915 1193 1194
3 836 105 1048
3 408 63 833
3 676 1193 265
3 1193 833 1194
3 802 1282 846
3 802 846 168
3 846 1201 168
3 824 482 838
3 1202 253 915
3 915 253 1193
3 250 1194 847
3 250 915 1194
3 847 802 250
3 204 106 1104
3 834 106 204
3 1107 1104 106
3 975 1036 972
3 592 975 972
3 1091 1096 21
3 1149 1098 1106
3 206 674 302
3 206 302 1149
3 947 302 674
3 947 674 679
3 690 23 414
3 948 16 358
3 414 23 1101
3 576 841 413
3 118 576 836
3 283 118 836
3 587 297 585
3 581 777 297
3 408 676 1261
3 1042 1036 587
3 587 399 297
3 356 834 204
3 877 973 1042
3 633 64 285
3 1259 206 1159
3 1159 206 24
3 1259 674 206
3 947 679 1242
3 1149 1106 1097
3 302 1098 1149
3 206 1149 24
3 1094 24 1097
3 1097 24 1149
3 1159 24 19
3 1102 19 1094
3 1100 767 1102
3 767 19 1102
3 410 945 20
3 20 1100 1093
3 117 1259 109
3 109 1160 20
3 680 829 62
3 832 590 682
3 359 411 678
3 359 412 411
3 784 62 65
3 62 831 65
3 62 631 680
3 299 1162 1150
3 536 680 1240
3 831 829 359
3 831 359 678
3 678 1242 65
3 678 65 831
3 672 1242 678
3 1242 672 947
3 689 784 686
3 784 689 631
3 21 355 356
3 204 21 356
3 1150 412 299
3 1150 1108 412
3 21 1096 1150
3 590 832 355
3 832 830 356
3 355 832 356
3 682 286 832
3 682 1240 286
3 1157 772 688
3 772 631 689
3 1035 1039 688
3 683 400 781
3 685 400 689
3 400 772 689
3 633 971 1155
3 64 633 776
3 283 1156 1155
3 685 633 1155
3 685 1156 770
3 770 1156 1244
3 1261 1244 408
3 408 1244 1156
3 282 830 286
3 830 832 286
3 356 830 834
3 106 834 282
3 1157 1240 680
3 1240 1157 881
3 881 1157 1039
3 286 1240 881
3 1259 679 674
3 633 285 971
3 64 776 1242
3 686 633 685
3 117 285 1259
3 285 679 1259
3 945 944 681
3 117 681 285
3 285 64 679
3 64 1242 679
3 776 686 784
3 776 633 686
3 1035 630 1039
3 1039 1157 688
3 1036 1035 785
3 1035 688 785
3 837 357 263
3 837 1095 1253
3 877 835 1253
3 835 1042 470
3 357 835 470
3 16 263 358
3 358 783 948
3 16 948 262
3 783 407 585
3 407 783 358
3 399 587 1036
3 587 407 1042
3 260 369 108
3 260 108 360
3 360 108 295
3 585 295 783
3 783 295 108
3 943 1092 1107
3 576 301 841
3 413 836 576
3 413 841 838
3 301 691 840
3 691 1093 840
3 691 944 410
3 410 20 1093
3 590 1264 536
3 680 1260 829
3 677 593 590
3 589 675 299
3 589 299 205
3 292 583 586
3 782 771 683
3 586 782 397
3 687 294 51
3 687 1041 294
3 291 294 1041
3 586 399 782
3 688 782 785
3 583 297 586
3 583 581 297
3 294 289 51
3 291 1038 289
3 291 770 1038
3 294 291 289
3 292 397 687
3 781 400 779
3 772 771 688
3 688 771 782
3 777 581 289
3 583 51 581
3 292 51 583
3 289 581 51
3 779 1041 398
3 292 687 51
3 685 775 779
3 779 291 1041
3 1038 770 1243
3 1038 1243 289
3 399 1036 785
3 782 399 785
3 397 292 586
3 297 399 586
3 781 397 683
3 397 782 683
3 398 397 781
3 779 398 781
3 834 830 282
3 1264 593 1257
3 1257 536 1264
3 589 829 1260
3 590 1162 677
3 1162 942 677
3 1162 675 942
3 299 675 1162
3 589 205 829
3 942 675 589
3 1260 680 536
3 536 1257 1260
3 1264 590 593
3 593 677 589
3 677 942 589
3 1257 593 589
3 1257 589 1260
3 771 772 400
3 975 592 106
3 767 20 1160
3 301 839 841
3 360 265 260
3 948 369 262
3 108 369 948
3 357 358 263
3 357 837 1253
3 1095 588 1253
3 1099 1103 414
3 301 840 839
3 1108 411 412
3 1152 1105 23
3 21 1150 355
3 1155 1156 685
3 784 65 776
3 409 406 118
3 301 576 118
3 412 205 299
3 65 1242 776
3 1244 1261 1243
3 406 409 971
3 685 779 400
3 770 1244 1243
3 289 1243 1261
3 1261 632 289
3 291 779 775
3 630 282 881
3 1039 630 881
3 1042 973 1036
3 943 973 588
3 1095 943 588
3 118 944 301
3 109 945 117
3 1098 302 22
3 944 691 301
3 398 687 397
3 683 771 400
3 297 777 585
3 632 777 289
3 1091 204 1104
3 1150 1162 355
3 62 784 631
3 947 672 577
3 678 411 672
3 1096 1108 1150
3 23 1105 1101
3 414 1103 22
3 1103 1098 22
3 767 1100 20
3 285 681 971
3 19 1160 1158
3 415 1152 23
3 411 415 672
3 282 630 975
3 881 282 286
3 204 1091 21
3 106 282 975
3 687 398 1041
3 685 770 775
3 283 408 1156
3 775 770 291
3 831 62 829
3 682 536 1240
3 359 829 205
3 430 550 804
3 427 801 430
3 253 1202 375
3 205 412 359
3 1281 78 550
3 77 550 430
3 481 694 594
3 907 1122 78
3 1121 25 845
3 478 481 1265
3 362 736 1117
3 484 1203 256
3 645 259 696
3 839 951 841
3 265 1206 260
3 369 652 262
3 369 254 652
3 653 255 263
3 837 255 71
3 990 1095 71
3 1103 1099 644
3 840 951 839
3 642 1108 111
3 1105 1196 266
3 1195 264 693
3 363 906 1002
3 849 913 908
3 1197 169 374
3 950 951 374
3 825 111 823
3 1119 849 908
3 375 554 552
3 169 1197 434
3 1001 1002 1117
3 554 997 552
3 552 425 375
3 741 375 425
3 1001 174 999
3 1265 433 167
3 433 909 167
3 907 78 1281
3 907 98 990
3 98 1095 990
3 477 374 951
3 993 1043 251
3 826 1098 368
3 596 477 951
3 1115 1116 75
3 736 1000 1117
3 427 430 804
3 427 741 425
3 594 1091 1104
3 697 1195 693
3 913 843 435
3 992 995 595
3 642 485 992
3 1108 1096 1195
3 1105 266 1101
3 1103 644 368
3 1098 1103 368
3 1100 259 645
3 844 845 434
3 696 643 692
3 1196 646 266
3 646 642 992
3 433 1265 1203
3 1265 167 1267
3 1091 594 264
3 1265 256 1203
3 1116 1115 739
3 997 1002 999
3 1202 166 363
3 997 999 174
3 252 166 1202
3 374 477 1197
3 697 693 483
3 654 483 376
3 907 1281 1200
3 907 1200 98
3 553 78 842
3 78 1122 746
3 804 550 553
3 427 804 805
3 414 578 690
3 578 947 577
3 1197 477 844
3 434 1197 844
3 265 741 1206
3 741 265 375
3 375 265 253
3 672 415 577
3 415 23 690
3 1206 741 427
3 805 1206 427
3 176 652 254
3 255 653 553
3 255 553 842
3 746 71 255
3 990 71 1122
3 907 990 1122
3 98 1092 1095
3 98 1200 484
3 484 256 1107
3 98 484 1107
3 1105 1108 1196
3 643 952 692
3 505 995 826
3 696 692 1205
3 645 1043 993
3 1043 696 1205
3 370 643 1094
3 696 259 643
3 1205 692 952
3 1196 642 646
3 1196 1108 642
3 368 644 505
3 368 505 826
3 1101 644 1099
3 266 112 644
3 283 836 408
3 16 652 653
3 266 644 1101
3 841 950 824
3 950 374 252
3 374 166 252
3 944 118 406
3 843 1110 1109
3 654 376 1199
3 1109 257 825
3 111 825 257
3 505 644 112
3 995 505 595
3 646 992 595
3 266 646 112
3 112 595 505
3 646 595 112
3 435 373 26
3 435 26 362
3 433 1203 361
3 361 1203 1281
3 166 169 906
3 1002 740 1284
3 374 169 166
3 906 169 434
3 487 596 1093
3 251 844 993
3 487 993 477
3 256 594 1104
3 256 481 594
3 1104 1107 256
3 1281 1203 1200
3 1203 484 1200
3 1096 1091 264
3 1098 261 1106
3 479 827 826
3 826 827 261
3 826 995 479
3 479 995 371
3 355 1162 590
3 590 536 682
3 1036 973 972
3 972 973 943
3 1042 407 470
3 877 1042 835
3 587 585 407
3 585 777 295
3 577 690 578
3 577 415 690
3 944 406 681
3 406 971 681
3 632 265 360
3 265 632 1261
3 265 1261 676
3 680 631 1157
3 1157 631 772
3 632 360 777
3 360 295 777
3 948 783 108
3 358 357 407
3 407 357 470
3 1253 835 357
3 1253 588 877
3 588 973 877
3 1092 943 1095
3 972 943 592
3 106 592 1107
3 592 943 1107
3 1108 1105 1152
3 1159 19 1158
3 947 578 302
3 1158 1160 1259
3 109 20 945
3 1160 109 1259
3 19 24 1094
3 767 1160 19
3 1158 1259 1159
3 411 1152 415
3 1108 1152 411
3 414 22 578
3 578 22 302
3 975 630 1035
3 975 1035 1036
3 409 283 1155
3 827 1205 952
3 827 952 370
3 479 1205 827
3 371 995 1119
3 1106 261 1097
3 1098 826 261
3 261 827 370
3 370 1094 1097
3 370 1097 261
3 370 952 643
3 643 1102 1094
3 259 1100 1102
3 643 259 1102
3 993 487 645
3 1100 645 1093
3 1205 251 1043
3 696 1043 645
3 1109 373 843
3 483 72 376
3 642 257 485
3 111 257 642
3 843 913 849
3 1110 843 849
3 435 843 373
3 697 823 1195
3 373 654 1199
3 1109 1110 257
3 257 1110 485
3 1119 485 849
3 849 485 1110
3 1119 992 485
3 992 1119 995
3 913 1284 740
3 1284 913 435
3 693 264 694
3 264 594 694
3 111 1195 823
3 1108 1195 111
3 1096 264 1195
3 72 483 693
3 478 72 694
3 72 693 694
3 1267 376 72
3 1199 376 1267
3 362 26 743
3 435 362 1284
3 909 361 743
3 1117 1000 1003
3 1117 1002 1284
3 362 1117 1284
3 434 25 906
3 25 1121 908
3 363 166 906
3 25 1002 906
3 363 1002 997
3 363 997 554
3 554 375 1202
3 554 1202 363
3 478 1265 1267
3 72 478 1267
3 478 694 481
3 481 256 1265
3 1199 26 373
3 26 1199 167
3 26 167 909
3 1199 1267 167
3 371 1205 479
3 845 25 434
3 908 1121 1119
3 25 740 1002
3 845 251 1205
3 371 845 1205
3 477 993 844
3 844 251 845
3 1121 845 371
3 1119 1121 371
3 740 908 913
3 25 908 740
3 433 361 909
3 26 909 743
3 361 1281 744
3 743 361 744
3 255 837 263
3 1095 837 71
3 746 1122 71
3 78 746 842
3 746 255 842
3 263 16 653
3 176 653 652
3 652 16 262
3 553 176 804
3 176 553 653
3 550 77 1281
3 553 550 78
3 369 260 254
3 254 260 1206
3 254 1206 805
3 805 804 176
3 805 176 254
3 1092 98 1107
3 951 950 841
3 252 824 950
3 686 685 689
3 841 824 838
3 596 951 840
3 1093 596 840
3 477 596 487
3 645 487 1093
3 1112 483 654
3 1111 373 1109
3 74 996 483
3 994 73 823
3 823 73 825
3 545 428 548
3 736 742 1000
3 742 548 75
3 429 1115 426
3 739 1115 429
3 429 174 739
3 77 548 742
3 742 743 744
3 430 545 548
3 801 545 430
3 425 429 426
3 738 174 425
3 997 174 738
3 174 429 425
3 75 428 1115
3 1117 1003 1001
3 736 362 743
3 736 743 742
3 801 427 425
3 426 545 801
3 426 428 545
3 801 425 426
3 739 1001 1116
3 1115 428 426
3 999 1002 1001
3 174 1001 739
3 997 738 552
3 552 738 425
3 1281 77 744
3 77 742 744
3 428 75 548
3 77 430 548
3 75 1003 1000
3 742 75 1000
3 75 1116 1003
3 1116 1001 1003
3 409 118 283
3 409 1155 971
3 691 410 1093
3 681 117 945
3 414 1101 1099
3 945 410 944
3 74 1112 1204
3 654 1204 1112
3 1109 73 1111
3 697 483 996
3 991 697 996
3 994 697 991
3 994 823 697
3 825 73 1109
3 994 991 73
3 373 1111 654
3 1204 654 1111
3 483 1112 74
3 996 74 73
3 991 996 73
3 74 1204 73
3 73 1204 1111
3 13 1142 233
3 1015 559 456
3 1183 1142 563
3 563 1085 1183
3 1142 1183 233
3 871 1071 1026
3 96 192 923
3 1034 818 192
3 617 1073 624
3 624 559 563
3 141 563 559
3 871 456 559
3 624 44 871
3 871 559 624
3 1026 456 871
3 1026 441 456
3 326 1016 1027
3 1027 813 923
3 818 757 923
3 1027 923 819
3 819 757 455
3 132 1272 520
3 709 859 795
3 795 859 85
3 45 761 279
3 757 818 274
3 279 1072 322
3 274 964 130
3 519 322 1072
3 1073 383 389
3 1012 383 455
3 274 761 864
3 389 963 1272
3 389 1272 132
3 132 44 1073
3 132 1073 389
3 274 130 761
3 274 864 757
3 964 1034 612
3 964 818 1034
3 612 1034 1071
3 612 1071 1222
3 1280 130 961
3 795 320 134
3 795 134 520
3 795 520 709
3 764 216 709
3 709 520 1272
3 1072 761 130
3 1072 130 1280
3 279 322 384
3 384 385 528
3 764 1272 963
3 764 963 528
3 132 1222 44
3 520 1222 132
3 1071 44 1222
3 612 134 961
3 961 134 320
3 85 86 320
3 961 320 1280
3 1280 86 519
3 455 757 864
3 761 45 864
3 455 864 1012
3 1012 45 963
3 279 528 45
3 384 528 279
3 963 45 528
3 764 385 216
3 871 44 1071
3 617 563 1142
3 1071 1034 1026
3 624 563 617
3 13 233 326
3 624 1073 44
3 13 617 1142
3 819 865 13
3 865 617 13
3 192 818 923
3 1085 563 141
3 456 325 1015
3 1027 1016 813
3 192 1026 1034
3 757 819 923
3 141 559 1015
3 617 865 1073
3 865 455 383
3 1073 865 383
3 612 961 964
3 961 130 964
3 819 13 1027
3 13 326 1027
3 612 1222 134
3 1222 520 134
3 389 383 1012
3 389 1012 963
3 964 274 818
3 45 1012 864
3 1280 519 1072
3 795 85 320
3 86 1280 320
3 709 1272 764
3 709 216 859
3 1072 279 761
3 385 764 528
3 865 819 455
3 923 813 96
3 1026 96 441
3 1026 192 96
3 325 456 441
3 211 988 806
3 385 384 32
3 129 39 1223
3 211 129 1223
3 32 611 1223
3 721 1288 1070
3 721 1070 988
3 904 723 1054
3 39 129 521
3 216 385 33
3 39 1171 33
3 216 33 390
3 390 1171 723
3 723 1171 527
3 723 527 1054
3 1054 527 710
3 1054 710 1279
3 318 404 1118
3 404 719 1118
3 318 806 750
3 806 352 750
3 1289 1246 172
3 989 719 788
3 788 1246 1279
3 960 1289 172
3 989 788 710
3 1118 719 989
3 1279 1246 1289
3 172 352 960
3 904 1054 439
3 1171 521 527
3 1289 439 1279
3 1223 983 211
3 611 32 384
3 390 859 216
3 32 39 33
3 390 723 1278
3 1288 984 1278
3 984 86 85
3 859 984 85
3 32 1223 39
3 352 806 960
3 318 750 404
3 32 33 385
3 710 788 1279
3 1061 322 519
3 1061 519 128
3 611 322 1061
3 611 384 322
3 1279 439 1054
3 989 710 527
3 989 527 521
3 960 988 1070
3 439 960 1070
3 318 129 211
3 318 211 806
3 1118 129 318
3 1118 521 129
3 1171 390 33
3 859 1278 984
3 1278 904 1288
3 1288 904 439
3 1288 439 1070
3 439 1289 960
3 1171 39 521
3 1118 989 521
3 984 128 86
3 1288 128 984
3 1061 983 611
3 983 1223 611
3 1061 128 721
3 128 1288 721
3 1278 859 390
3 1278 723 904
3 519 86 128
3 1061 721 983
3 983 721 988
3 983 988 211
3 960 806 988
3 229 853 54
3 1163 54 853
3 421 352 718
3 172 718 352
3 1163 421 890
3 54 1163 1164
3 890 1164 1163
3 718 172 467
3 890 718 855
3 1164 890 889
3 467 172 1113
3 855 467 468
3 1113 468 467
3 889 855 1174
3 468 1174 855
3 392 752 930
3 751 930 752
3 113 1249 752
3 392 113 752
3 18 725 17
3 726 17 725
3 525 1179 725
3 18 525 725
3 748 1082 231
3 618 231 1082
3 749 1081 1082
3 748 749 1082
3 887 446 622
3 786 622 446
3 405 1287 446
3 887 405 446
3 202 1055 656
3 556 656 1055
3 1285 202 234
3 656 234 202
3 234 719 1285
3 656 556 236
3 309 236 556
3 234 656 1175
3 236 1175 656
3 1175 719 234
3 236 309 1190
3 888 1190 309
3 1175 236 154
3 1190 154 236
3 719 1175 788
3 154 788 1175
3 1190 888 310
3 1173 310 888
3 1190 310 154
3 1225 154 310
3 1225 788 154
3 267 229 3
3 3 809 267
3 267 809 619
3 809 473 619
3 229 54 131
3 54 351 1084
3 1084 131 54
3 619 473 898
3 473 101 898
3 898 101 1084
3 1084 351 898
3 54 1164 350
3 350 230 54
3 351 54 230
3 230 1250 351
3 1164 665 203
3 203 350 1164
3 351 1250 55
3 1250 393 55
3 55 393 189
3 393 852 189
3 189 852 203
3 203 665 189
3 1164 889 308
3 308 980 1164
3 665 1164 980
3 980 27 665
3 889 403 474
3 474 308 889
3 665 27 657
3 27 982 657
3 657 982 787
3 982 793 787
3 787 793 474
3 474 403 787
3 1174 850 854
3 854 198 1174
3 722 720 854
3 854 850 722
3 889 1174 198
3 198 102 889
3 403 889 102
3 102 420 403
3 403 420 1057
3 420 623 1057
3 1057 623 722
3 1113 1226 1191
3 1191 551 1113
3 468 1113 551
3 126 468 422
3 422 228 126
3 1226 1225 200
3 200 1191 1226
3 310 126 228
3 228 891 310
3 1225 310 891
3 891 200 1225
3 809 3 1030
3 1030 555 809
3 131 1084 316
3 316 1176 131
3 3 131 1176
3 809 555 315
3 555 201 315
3 315 201 471
3 201 339 471
3 471 339 316
3 316 1084 471
3 555 1030 751
3 751 1080 555
3 1176 316 392
3 392 930 1176
3 1030 1176 930
3 930 751 1030
3 201 555 1080
3 1080 1249 201
3 339 201 1249
3 1249 113 339
3 316 339 113
3 113 392 316
3 1250 230 2
3 2 306 1250
3 350 203 1056
3 1056 1083 350
3 230 350 1083
3 1250 306 753
3 306 472 753
3 753 472 747
3 747 620 1056
3 1056 203 747
3 306 2 726
3 726 53 306
3 1083 1056 18
3 2 1083 17
3 17 726 2
3 472 306 53
3 53 1179 472
3 620 472 1179
3 1179 525 620
3 1056 620 525
3 525 18 1056
3 27 980 84
3 84 897 27
3 308 474 664
3 664 981 308
3 980 308 981
3 27 897 979
3 897 1189 979
3 979 1189 319
3 1189 188 319
3 319 188 664
3 664 474 319
3 897 84 618
3 618 1144 897
3 981 664 748
3 748 231 981
3 84 981 231
3 231 618 84
3 1189 897 1144
3 188 1189 1081
3 1081 749 188
3 664 188 749
3 749 748 664
3 420 102 419
3 419 1286 420
3 198 854 212
3 102 198 1209
3 420 1286 621
3 1286 927 621
3 621 927 235
3 235 1044 212
3 212 854 235
3 1286 419 786
3 786 7 1286
3 1209 212 887
3 887 622 1209
3 419 1209 622
3 622 786 419
3 927 1286 7
3 7 1287 927
3 1044 927 1287
3 1287 405 1044
3 212 1044 405
3 405 887 212
3 422 551 334
3 334 724 422
3 228 422 724
3 724 199 228
3 551 1191 304
3 891 228 199
3 199 977 891
3 200 891 977
3 977 469 200
3 1191 200 469
3 724 334 808
3 808 28 724
3 199 724 28
3 28 851 199
3 334 304 957
3 957 808 334
3 977 199 851
3 851 305 977
3 469 977 305
3 305 155 469
3 304 469 155
3 155 957 304
3 267 1055 896
3 718 890 421
3 467 855 718
3 855 889 890
3 131 3 229
3 623 720 722
3 551 422 468
3 1176 1030 3
3 1083 2 230
3 472 620 747
3 18 17 1083
3 981 84 980
3 1144 1081 1189
3 212 1209 198
3 1209 419 102
3 927 1044 235
3 304 334 551
3 469 304 1191
3 750 421 404
3 235 854 720
3 235 720 621
3 621 623 420
3 621 720 623
3 722 850 1173
3 722 1173 1057
3 1057 888 403
3 1057 1173 888
3 787 888 657
3 787 403 888
3 657 309 665
3 657 888 309
3 319 793 979
3 319 474 793
3 979 982 27
3 979 793 982
3 786 446 7
3 7 446 1287
3 618 1082 1144
3 1144 1082 1081
3 726 725 53
3 53 725 1179
3 751 752 1080
3 1080 752 1249
3 747 203 852
3 747 852 753
3 753 393 1250
3 753 852 393
3 28 808 303
3 303 305 851
3 471 101 315
3 471 1084 101
3 315 473 809
3 315 101 473
3 898 556 619
3 898 351 556
3 619 1055 267
3 619 556 1055
3 55 556 351
3 55 309 556
3 189 309 55
3 189 665 309
3 307 1139 404
3 1139 307 896
3 853 896 307
3 896 853 267
3 229 267 853
3 719 404 1285
3 1139 1285 404
3 1285 1139 202
3 896 202 1139
3 202 896 1055
3 1113 172 1226
3 1246 1226 172
3 851 28 303
3 957 303 808
3 1174 468 850
3 126 850 468
3 1226 1246 1225
3 788 1225 1246
3 305 303 155
3 957 155 303
3 850 126 1173
3 310 1173 126
3 307 404 421
3 352 421 750
3 853 307 1163
3 421 1163 307
3 766 1049 4
3 4 879 766
3 879 4 568
3 568 814 879
3 1049 107 584
3 4 584 542
3 4 542 932
3 197 882 768
3 457 1079 882
3 381 280 1079
3 1047 331 817
3 591 965 1089
3 1089 313 591
3 965 97 924
3 924 1089 965
3 313 1089 1047
3 817 314 1047
3 1089 924 327
3 14 817 331
3 313 1151 300
3 14 454 562
3 933 327 924
3 1151 1047 314
3 768 1245 354
3 882 10 1245
3 1079 342 10
3 1076 226 121
3 280 562 342
3 502 768 15
3 331 327 14
3 1076 14 1137
3 14 562 1230
3 328 569 1137
3 314 946 15
3 1254 197 768
3 1254 502 488
3 1245 107 354
3 10 584 1245
3 342 542 10
3 562 932 342
3 1137 569 1087
3 300 107 1049
3 107 1151 15
3 817 1076 946
3 14 1076 817
3 313 1047 1151
3 946 502 15
3 584 107 1245
3 584 4 1049
3 542 584 10
3 932 542 342
3 932 568 4
3 1047 1089 331
3 331 1089 327
3 454 932 562
3 454 933 568
3 107 15 354
3 327 454 14
3 1151 314 15
3 768 882 1245
3 457 882 197
3 882 1079 10
3 381 1079 457
3 1079 280 342
3 814 568 933
3 933 756 814
3 568 932 454
3 328 1230 280
3 1254 768 502
3 300 1151 107
3 1049 766 1161
3 1161 300 1049
3 946 1076 121
3 226 1076 1087
3 817 946 314
3 1137 1087 1076
3 328 280 381
3 280 1230 562
3 15 768 354
3 1230 328 1137
3 946 488 502
3 300 1161 591
3 591 313 300
3 756 933 924
3 924 97 756
3 933 454 327
3 121 488 946
3 1230 1137 14
3 296 1090 543
3 543 445 1025
3 1143 179 193
3 730 637 227
3 637 1090 287
3 1256 296 773
3 12 93 1143
3 453 663 1025
3 445 543 1090
3 543 773 296
3 453 1025 445
3 12 875 543
3 540 765 773
3 591 765 965
3 629 540 875
3 1143 629 12
3 1018 1090 637
3 1090 1018 445
3 445 443 453
3 445 1018 443
3 442 440 730
3 227 544 442
3 442 544 179
3 879 59 284
3 814 1029 59
3 773 543 875
3 543 1025 12
3 773 875 540
3 875 12 629
3 97 965 540
3 879 284 766
3 284 59 332
3 814 59 879
3 59 1029 193
3 756 1029 814
3 1029 755 1143
3 1256 284 288
3 284 673 1161
3 773 673 1256
3 1161 765 591
3 97 629 756
3 544 227 332
3 730 227 442
3 179 544 193
3 442 179 92
3 93 179 1143
3 92 93 663
3 287 227 637
3 440 442 92
3 135 92 663
3 440 92 135
3 40 663 453
3 135 663 40
3 40 453 41
3 453 443 41
3 287 1256 288
3 287 296 1256
3 1025 93 12
3 755 756 629
3 599 730 1017
3 730 440 1017
3 1018 637 599
3 332 227 288
3 193 544 332
3 92 179 93
3 756 755 1029
3 1256 673 284
3 284 332 288
3 59 193 332
3 540 965 765
3 629 97 540
3 1029 1143 193
3 284 1161 766
3 765 673 773
3 599 637 730
3 288 227 287
3 1090 296 287
3 663 93 1025
3 1161 673 765
3 1143 755 629
3 83 1019 1018
3 1019 443 1018
3 386 443 1019
3 386 41 443
3 79 41 386
3 79 1114 41
3 968 1063 225
3 1063 968 533
3 1063 533 99
3 533 79 99
3 225 660 82
3 225 1063 660
3 82 660 970
3 321 82 970
3 534 1274 1064
3 1064 321 970
3 530 797 1062
3 321 797 530
3 423 1062 424
3 424 1062 797
3 423 969 1062
3 658 969 423
3 1014 1114 207
3 1014 40 1114
3 800 207 1273
3 207 800 598
3 83 1273 100
3 1273 207 100
3 598 1013 1014
3 207 598 1014
3 659 635 83
3 599 659 83
3 99 1062 969
3 1063 99 969
3 1114 533 968
3 789 1014 1013
3 800 1013 598
3 99 530 1062
3 530 99 79
3 1114 79 533
3 135 40 789
3 1014 789 40
3 207 1114 968
3 1275 1274 424
3 970 534 1064
3 1275 1064 1274
3 100 225 83
3 83 225 82
3 636 635 659
3 1273 83 635
3 321 1064 797
3 321 1019 82
3 83 82 1019
3 1017 636 599
3 659 599 636
3 444 866 660
3 866 1153 534
3 207 968 100
3 100 968 225
3 183 800 635
3 635 800 1273
3 636 182 183
3 635 636 183
3 1017 440 636
3 182 636 440
3 321 530 386
3 321 386 1019
3 424 797 1275
3 797 1064 1275
3 423 424 1274
3 599 83 1018
3 1114 40 41
3 789 440 135
3 386 530 79
3 800 183 1013
3 866 444 153
3 1013 183 182
3 534 1153 1274
3 1192 529 658
3 1274 1153 423
3 534 970 660
3 534 660 866
3 799 444 660
3 799 153 444
3 866 153 1153
3 153 799 529
3 969 658 799
3 660 1063 799
3 529 1192 1153
3 153 529 1153
3 658 529 799
3 1192 658 1153
3 969 799 1063
3 658 423 1153
3 1013 182 789
3 182 440 789
3 450 158 1011
3 337 812 187
3 187 812 541
3 638 815 816
3 922 816 338
3 1011 1130 566
3 566 1130 338
3 157 728 462
3 157 450 728
3 462 921 157
3 451 1010 1178
3 451 1178 938
3 1 539 938
3 938 1178 541
3 1 541 330
3 869 561 1022
3 558 337 1022
3 1022 561 11
3 558 11 566
3 338 815 558
3 338 816 815
3 558 566 338
3 922 1130 1024
3 522 715 37
3 1066 870 610
3 1178 1010 567
3 187 1178 567
3 157 1010 451
3 450 157 451
3 929 186 11
3 11 186 566
3 1141 567 1214
3 11 558 1022
3 330 541 812
3 539 58 938
3 541 1 938
3 1011 158 1130
3 1024 158 872
3 815 812 337
3 1130 922 338
3 1011 728 450
3 872 158 58
3 872 58 539
3 666 716 762
3 1216 37 955
3 716 666 955
3 36 962 124
3 662 870 1066
3 36 610 962
3 1216 955 666
3 662 125 522
3 715 522 125
3 125 662 1066
3 921 858 861
3 937 921 861
3 522 928 1220
3 242 928 462
3 560 1212 870
3 1220 560 870
3 861 668 937
3 1212 869 275
3 560 1220 242
3 610 870 962
3 1212 560 561
3 124 275 1129
3 1129 861 762
3 668 861 1129
3 337 558 815
3 1214 869 1141
3 812 815 638
3 567 1141 187
3 638 330 812
3 929 242 186
3 929 11 561
3 337 1141 1022
3 566 186 1011
3 522 37 1216
3 462 928 858
3 462 858 921
3 522 1220 662
3 1220 870 662
3 561 560 929
3 560 242 929
3 1214 668 275
3 870 1212 962
3 668 1129 275
3 1214 937 668
3 242 1220 928
3 1216 928 522
3 666 858 1216
3 1216 858 928
3 666 861 858
3 762 861 666
3 1011 186 728
3 124 962 275
3 869 1214 275
3 275 962 1212
3 869 1212 561
3 462 728 242
3 242 728 186
3 187 1141 337
3 1022 1141 869
3 937 567 1010
3 1214 567 937
3 937 1010 921
3 921 1010 157
3 187 541 1178
3 938 58 451
3 451 58 450
3 450 58 158
3 1024 1130 158
3 873 872 669
3 148 873 150
3 148 150 152
3 152 150 463
3 464 152 68
3 94 1182 194
3 822 396 194
3 816 922 1188
3 70 69 394
3 638 149 330
3 330 149 151
3 638 639 149
3 816 639 638
3 152 1075 452
3 195 822 8
3 8 822 194
3 70 68 463
3 922 1024 241
3 1182 94 241
3 241 1024 811
3 1182 811 340
3 1182 340 8
3 8 340 452
3 8 452 195
3 195 452 1075
3 138 395 396
3 367 138 396
3 394 395 699
3 794 394 699
3 702 464 903
3 367 822 711
3 702 711 1075
3 94 572 731
3 464 68 903
3 639 1188 731
3 711 822 195
3 394 794 68
3 699 395 138
3 367 396 822
3 711 195 1075
3 702 1075 464
3 794 903 68
3 452 148 152
3 68 152 463
3 572 395 69
3 69 395 394
3 572 396 395
3 194 396 572
3 872 811 1024
3 94 1188 241
3 340 811 873
3 669 150 873
3 1 669 539
3 669 872 539
3 731 1188 94
3 241 1188 922
3 151 669 1
3 151 150 669
3 1 330 151
3 67 149 571
3 571 149 639
3 731 571 639
3 151 149 67
3 150 151 67
3 872 873 811
3 340 873 148
3 1188 639 816
3 811 1182 241
3 571 731 69
3 572 69 731
3 150 67 463
3 463 67 70
3 340 148 452
3 572 94 194
3 194 1182 8
3 152 464 1075
3 67 571 70
3 70 571 69
3 394 68 70
3 56 916 138
3 916 56 139
3 139 248 916
3 248 139 894
3 894 1020 248
3 138 367 163
3 163 56 138
3 56 163 1124
3 1124 139 56
3 139 1124 884
3 903 258 1252
3 1252 702 903
3 243 734 758
3 758 116 1074
3 165 790 516
3 516 573 165
3 702 1252 1251
3 1251 711 702
3 758 760 934
3 934 116 758
3 573 516 926
3 926 1005 573
3 138 916 607
3 607 794 699
3 916 248 1210
3 1210 607 916
3 248 1020 1140
3 1140 1210 248
3 794 607 365
3 365 903 794
3 607 1210 270
3 1210 1140 1211
3 1211 270 1210
3 903 365 627
3 365 270 347
3 270 1211 1146
3 903 627 258
3 627 347 165
3 165 258 627
3 347 1146 790
3 790 165 347
3 349 919 329
3 329 348 349
3 1229 1207 349
3 1207 919 349
3 574 1126 1125
3 1125 575 574
3 140 221 574
3 221 1126 574
3 892 142 1021
3 1021 475 892
3 47 604 892
3 604 142 892
3 1008 1145 579
3 579 35 1008
3 162 269 1008
3 269 1145 1008
3 884 1124 518
3 518 700 884
3 1124 163 1132
3 1132 518 1124
3 367 1132 163
3 700 518 1134
3 1134 917 700
3 518 1132 791
3 791 1134 518
3 367 791 1132
3 917 1134 1231
3 1231 268 917
3 1134 791 1031
3 1031 1231 1134
3 791 367 711
3 711 1031 791
3 268 1231 1005
3 1005 926 268
3 1005 1231 1031
3 1031 1251 1005
3 711 1251 1031
3 1020 894 1237
3 353 1237 894
3 353 894 48
3 807 353 48
3 1140 1020 66
3 708 1140 893
3 66 893 1140
3 807 48 601
3 918 807 601
3 918 601 893
3 708 893 601
3 1211 1140 707
3 885 707 1140
3 1140 708 885
3 43 885 708
3 344 1211 1123
3 707 1123 1211
3 43 708 701
3 603 43 701
3 603 701 1233
3 247 603 1233
3 247 1233 1123
3 344 1123 1233
3 1146 1211 466
3 377 466 1211
3 1211 344 377
3 670 377 344
3 136 1146 914
3 466 914 1146
3 670 344 517
3 380 670 517
3 380 517 34
3 465 380 34
3 465 34 914
3 136 914 34
3 516 790 346
3 810 346 790
3 364 366 346
3 516 346 366
3 790 1146 810
3 1007 810 1146
3 1146 136 1007
3 160 1007 136
3 160 136 1133
3 580 160 1133
3 580 1133 366
3 1252 258 727
3 432 727 258
3 258 165 432
3 165 573 703
3 232 703 573
3 1251 1252 418
3 727 418 1252
3 573 1005 232
3 1234 232 1005
3 1005 1251 1234
3 418 1234 1251
3 1237 353 156
3 605 156 353
3 893 66 237
3 246 237 66
3 66 1237 246
3 605 353 704
3 1006 605 704
3 1006 704 345
3 1128 1006 345
3 1128 345 237
3 893 237 345
3 156 605 348
3 796 348 605
3 237 246 919
3 329 919 246
3 246 156 329
3 348 329 156
3 605 1006 796
3 1229 796 1006
3 1006 1128 1229
3 1207 1229 1128
3 1128 237 1207
3 919 1207 237
3 885 43 1236
3 222 1236 43
3 1123 707 886
3 49 886 707
3 707 885 49
3 222 43 895
3 1235 222 895
3 1235 895 602
3 476 602 886
3 1123 886 602
3 1236 222 575
3 458 575 222
3 886 49 1126
3 49 1236 1125
3 575 1125 1236
3 222 1235 458
3 140 458 1235
3 1235 476 140
3 221 140 476
3 476 886 221
3 1126 221 886
3 377 670 985
3 600 985 670
3 914 466 343
3 378 343 466
3 466 377 378
3 600 670 379
3 706 600 379
3 706 379 792
3 1232 706 792
3 1232 792 343
3 914 343 792
3 985 600 475
3 1208 475 600
3 343 378 142
3 1021 142 378
3 378 985 1021
3 475 1021 985
3 600 706 1208
3 706 1232 47
3 604 47 1232
3 1232 343 604
3 142 604 343
3 1007 160 606
3 164 606 160
3 346 810 1255
3 810 1007 223
3 164 160 137
3 161 164 137
3 161 137 698
3 1127 698 1255
3 346 1255 698
3 606 164 35
3 50 35 164
3 1255 223 1145
3 579 1145 223
3 223 606 579
3 35 579 606
3 164 161 50
3 162 50 161
3 161 1127 162
3 269 162 1127
3 1127 1255 269
3 1145 269 1255
3 432 703 735
3 417 735 703
3 703 232 417
3 860 417 232
3 727 432 759
3 232 1234 860
3 878 860 1234
3 1234 418 878
3 626 878 418
3 418 727 626
3 735 417 1074
3 243 1074 417
3 417 860 243
3 734 243 860
3 759 735 116
3 1074 116 735
3 860 878 734
3 760 734 878
3 878 626 760
3 934 760 626
3 626 759 934
3 116 934 759
3 884 894 139
3 270 365 607
3 347 627 365
3 1146 347 270
3 1237 66 1020
3 364 580 366
3 703 432 165
3 156 246 1237
3 1236 49 885
3 476 1235 602
3 1125 1126 49
3 985 378 377
3 47 1208 706
3 223 1255 810
3 606 223 1007
3 1127 161 698
3 735 759 432
3 759 626 727
3 607 699 138
3 346 698 364
3 364 698 137
3 580 137 160
3 364 137 580
3 516 366 926
3 926 366 1133
3 268 1133 136
3 926 1133 268
3 268 34 517
3 136 34 268
3 917 517 344
3 268 517 917
3 465 792 379
3 914 792 465
3 380 379 670
3 465 379 380
3 1008 35 50
3 1008 50 162
3 892 475 1208
3 892 1208 47
3 574 575 458
3 574 458 140
3 349 348 796
3 349 796 1229
3 1123 602 247
3 247 602 895
3 603 895 43
3 247 895 603
3 1074 243 758
3 760 758 734
3 918 345 704
3 893 345 918
3 807 704 353
3 918 704 807
3 700 601 48
3 708 601 700
3 884 48 894
3 700 48 884
3 700 701 708
3 917 701 700
3 917 1233 701
3 344 1233 917
3 217 713 954
3 1168 954 713
3 954 1168 862
3 523 862 1168
3 547 217 133
3 133 954 1165
3 1165 954 447
3 1065 648 1120
3 388 387 1065
3 271 448 388
3 1067 649 219
3 714 219 649
3 449 1067 863
3 219 863 1067
3 219 714 170
3 546 220 170
3 863 219 936
3 220 1032 122
3 1269 220 175
3 1269 1032 220
3 862 523 935
3 1221 935 523
3 447 862 1219
3 276 1023 271
3 1120 651 480
3 436 900 547
3 713 217 171
3 900 171 217
3 171 900 649
3 714 649 900
3 935 1221 863
3 449 863 1221
3 1219 935 936
3 488 1283 175
3 524 276 1032
3 170 714 436
3 480 175 557
3 547 133 798
3 954 133 217
3 133 1165 956
3 1165 447 1033
3 862 447 954
3 219 170 122
3 219 122 936
3 447 1219 857
3 935 1219 862
3 557 547 998
3 1219 936 1032
3 546 436 557
3 1065 1120 798
3 1065 387 648
3 388 1065 956
3 388 448 387
3 271 388 1033
3 1269 175 1283
3 1269 978 184
3 175 220 546
3 184 524 1269
3 271 1023 448
3 276 271 857
3 1120 557 998
3 1023 276 524
3 488 175 480
3 648 651 1120
3 122 170 220
3 936 122 1032
3 1032 1269 524
3 857 1032 276
3 1213 1023 524
3 175 546 557
3 480 651 488
3 547 798 998
3 133 956 798
3 1165 1033 956
3 447 857 1033
3 547 900 217
3 436 547 557
3 436 714 900
3 1219 1032 857
3 936 935 863
3 170 436 546
3 798 1120 998
3 956 1065 798
3 1033 388 956
3 978 1269 1283
3 857 271 1033
3 1120 480 557
3 1213 524 184
3 1069 38 185
3 1069 185 95
3 210 1168 531
3 178 523 210
3 1068 1268 273
3 278 1068 1187
3 273 1268 667
3 1187 273 277
3 1067 449 667
3 95 1131 729
3 190 1221 178
3 647 1058 531
3 38 717 1277
3 1270 1169 1277
3 729 459 278
3 647 171 902
3 190 461 277
3 272 531 717
3 191 210 272
3 1067 667 902
3 449 277 667
3 461 178 191
3 171 531 713
3 647 902 1268
3 1221 190 277
3 38 272 717
3 1069 191 272
3 1169 1270 1068
3 1228 1068 278
3 95 461 191
3 608 214 38
3 1169 608 1277
3 1270 1058 1268
3 729 1187 461
3 459 240 278
3 1068 1228 1169
3 1268 1068 1270
3 278 240 1228
3 273 1187 1068
3 902 667 1268
3 902 649 1067
3 667 277 273
3 277 461 1187
3 531 1168 713
3 210 531 272
3 210 523 1168
3 178 210 191
3 178 1221 523
3 190 178 461
3 531 1058 717
3 647 531 171
3 647 1268 1058
3 902 171 649
3 277 449 1221
3 38 1069 272
3 38 214 185
3 1069 95 191
3 95 185 1131
3 95 729 461
3 729 1131 459
3 38 1277 608
3 1058 1277 717
3 1270 1277 1058
3 729 278 1187
3 214 625 143
3 1217 214 143
3 608 144 625
3 608 625 214
3 1169 144 608
3 144 1169 1228
3 1218 1228 240
3 144 1228 1218
3 1217 185 214
3 185 1217 1131
3 1131 1046 459
3 1131 1217 1046
3 459 335 240
3 459 1046 335
3 240 335 336
3 1218 240 336
3 114 249 181
3 249 115 181
3 1172 87 180
3 147 905 146
3 146 239 460
3 1186 249 114
3 249 1186 281
3 281 87 1172
3 335 1046 905
3 905 147 335
3 1170 177 110
3 110 1052 1051
3 920 1050 312
3 920 312 311
3 564 565 537
3 312 416 564
3 110 52 876
3 145 52 311
3 311 312 145
3 565 143 625
3 625 537 565
3 173 597 538
3 46 173 1170
3 180 940 1050
3 180 1050 920
3 239 967 564
3 239 564 416
3 966 565 967
3 565 564 967
3 1217 143 565
3 565 966 1217
3 1186 52 0
3 0 52 145
3 876 1248 1052
3 110 876 1052
3 1248 1247 1051
3 312 625 144
3 335 87 336
3 1217 905 1046
3 1186 0 281
3 967 239 146
3 967 146 966
3 966 146 905
3 1217 966 905
3 87 940 180
3 1051 1052 1248
3 597 173 1009
3 46 1170 1051
3 1185 1148 391
3 46 1051 1247
3 177 1170 538
3 538 1170 173
3 597 238 538
3 1009 238 597
3 1009 173 46
3 238 1009 1185
3 391 181 238
3 115 538 238
3 1148 1185 46
3 1185 1009 46
3 1185 391 238
3 391 1148 46
3 238 181 115
3 1247 391 46
3 145 312 144
3 1218 145 144
3 1218 0 145
3 336 0 1218
3 336 281 0
3 87 281 336
3 115 180 920
3 180 115 1172
3 1172 115 249
3 281 1172 249
3 538 920 311
3 115 920 538
3 538 311 177
3 311 52 177
3 1051 1170 110
3 52 110 177
3 876 1186 114
3 876 52 1186
3 114 1247 1248
3 114 1248 876
3 181 1247 114
3 181 391 1247
3 87 147 940
3 335 147 87
3 940 239 416
3 239 940 460
3 416 312 1050
3 940 416 1050
3 146 460 147
3 460 940 147
3 564 537 312
3 537 625 312