OFF

5 6 0
-0.206712 0.287861 -0.042459
-0.208634 0.298369 -0.042538
-0.207672 0.296617 -0.042576
-0.208728 0.295625 -0.047810
-0.210561 0.298374 -0.042382
3 0 4 3
3 4 1 3
3 0 1 4
3 0 2 1
3 2 0 3
3 1 2 3
