OFF

7 10 0
0.087061 -0.178021 0.129259
0.056905 -0.191404 0.149769
0.026748 -0.204787 0.170278
0.097314 -0.220660 0.116510
0.116586 -0.188513 0.106292
0.067156 -0.234043 0.137019
0.036999 -0.247426 0.157528
3 0 1 4
3 1 3 4
3 1 2 3
3 2 6 3
3 6 5 3
3 3 0 4
3 0 3 5
3 5 6 1
3 5 1 0
3 2 1 6
