OFF
1223 1639 0
0.3876400782 -0.0320375235 -0.0218995152
0.0080217480 -0.1187067476 -0.0398828149
0.4839847605 -0.1120887522 0.0049256687
-0.4662088045 0.0807833822 -0.0784633684
-0.4542269046 0.0623119451 0.0177916498
-0.2168038841 0.1110376249 -0.0200078954
0.1698067149 0.0408464651 -0.0204491061
0.3448010828 0.0037772431 -0.0566442136
-0.2238860602 0.1131655528 -0.0751478625
-0.2023681647 -0.0872975193 -0.0656378004
0.0222481407 0.0992056617 0.0653689485
-0.4021456330 0.0228811581 -0.0150571712
-0.3309602480 -0.0577952891 -0.0793940732
-0.4084242307 0.0639293955 0.0187065848
0.4667754675 -0.0235509312 -0.0765334754
-0.3980764054 0.0258532295 -0.0015543186
-0.0632189008 0.0861145476 -0.0281538474
0.3905480668 0.0030716834 -0.0592715661
-0.0277421457 -0.1226757097 -0.0449660029
0.3303041969 -0.0843214286 -0.0327464736
-0.3934416559 0.0331712973 0.0169669751
-0.1884559100 -0.0687972397 -0.0643486497
0.3243497094 -0.1189763572 -0.0621996287
-0.4328407325 0.0205460844 -0.0260664441
-0.3052988126 -0.0108400040 0.0073162728
0.0147128955 -0.0157650864 -0.0294377049
-0.4428631541 0.0106627627 -0.0602257286
-0.0019297828 -0.1376738151 -0.0254712832
-0.0037485010 -0.1275957081 -0.0339443767
-0.0715163549 -0.0016789674 0.0208451917
-0.0365801260 -0.0831884960 -0.0583416998
0.0097526089 0.1006108862 0.0480509241
-0.4952306657 0.0856207108 -0.0379637363
-0.3617692974 0.0735504965 -0.0625646950
-0.4714058758 0.0190790509 0.0031535645
0.0110380046 -0.1216090508 -0.0425486781
-0.3048499653 0.1409141135 -0.0790661210
0.4098912741 -0.0291574695 -0.0604287501
0.0123099821 0.1000646765 0.0794594887
-0.4580394467 0.0421991538 0.0140287840
0.4519561673 -0.1262435784 -0.0775907135
0.4394731080 -0.1242260991 -0.0774408274
-0.0037792984 -0.1296826839 -0.0269654111
0.1516551149 -0.1104420139 -0.0209974932
-0.0359889731 0.1169133398 0.0179659113
-0.0308970247 -0.0525972553 0.0118149257
0.0122218454 -0.1216149655 -0.0249842911
-0.2133697312 0.0909597810 -0.0837870512
-0.2225168238 0.0265662058 -0.0872007710
-0.0327813945 0.1259885070 0.0754530186
-0.0529264093 0.1223746290 0.0092625738
0.1582941973 0.0095823019 -0.0589089029
-0.4283757997 0.0287169682 0.0159069983
0.1613202461 -0.0205271406 0.0004463290
-0.1209179428 0.0708757948 -0.0453666045
-0.2334294558 0.1000913731 -0.0879608257
0.0177736695 0.1019595147 0.0818773789
-0.4720469088 0.0631448743 0.0161637151
-0.4050531237 0.0217555639 -0.0341314734
-0.4138696094 0.0934834705 0.0014773618
-0.0759551146 -0.1090172668 -0.0421590599
0.0094933946 -0.1266001528 -0.0134923706
0.4453303666 -0.0358479339 -0.0334558213
-0.3519582131 -0.0291169729 -0.0777401812
0.3702925920 -0.1321180121 -0.0566517858
0.3907279736 -0.0971011163 -0.0384365575
0.1533162145 -0.0146819164 -0.0527402099
0.1547594785 -0.0990653283 0.0008195029
-0.0114352352 -0.1345156917 -0.0125015005
0.1541065736 -0.0775701213 -0.0574911591
-0.1423450869 -0.0555315720 -0.0464462260
0.3735479992 -0.1151087647 -0.0706489287
-0.0063299873 -0.1168595412 -0.0481561874
-0.0389032084 0.1174074470 0.0647376848
0.1490914504 0.0367417178 -0.0046178217
-0.0057619636 0.1153234139 0.0294217917
0.4365965176 -0.1395913963 -0.0720721839
0.4388587963 -0.0115309362 -0.0641055286
-0.3702838672 0.0489677435 -0.0062356812
-0.0789348508 -0.0434797713 -0.0765040576
-0.4081486183 0.0912651896 -0.0504726575
-0.0656511643 0.0717135668 -0.0572050164
0.0077058245 0.1065063524 0.0893949026
0.0066619302 0.1038991294 0.0807661735
0.3772330043 -0.0893854618 -0.0397915212
-0.3310824963 0.1131198293 -0.0758156242
-0.0933487475 -0.0854368064 -0.0268494798
0.3421704648 -0.0217779802 -0.0567930937
-0.0066353295 0.1163166412 0.0769605770
0.3704754689 -0.1309488689 -0.0239685550
-0.0275892111 -0.1295371051 -0.0060753189
0.4216305482 -0.1300546225 -0.0660128521
-0.4954796772 0.0409794673 -0.0119298525
0.4429789576 -0.0344170258 -0.0681293583
0.4244870493 -0.1124463511 -0.0659116486
-0.0194946618 0.1176920192 0.0804170941
0.4011737735 -0.0356008598 -0.0359383959
-0.2452112250 0.0839617103 0.0355990979
-0.4925412406 0.0695722526 -0.0104358850
-0.2357935203 -0.0482505620 0.0099601894
-0.0092475779 0.1153192856 0.0484470918
-0.2440461619 -0.0557640047 -0.0648005633
-0.0058427124 -0.1230672565 -0.0425765314
-0.0113482657 -0.1307015970 -0.0072560840
-0.1809417913 -0.0955597678 -0.0649484447
-0.4267418819 0.0213852981 0.0011292154
-0.1590591081 0.1099182772 -0.0174309342
-0.3815590218 0.0422842972 -0.0734098225
-0.0605372050 -0.1239829288 -0.0345625430
-0.4260517526 0.0070642259 -0.0562097610
-0.1060508416 0.0746754712 -0.0448878534
0.1407293782 -0.0483092285 -0.0503618588
-0.0104819976 0.0369194611 -0.0745507886
-0.0040471611 -0.1185954893 -0.0509313203
-0.3184547427 0.1472625588 -0.0539476905
-0.1602131522 0.1074321216 -0.0569185028
0.4904607626 -0.0178059391 0.0344091844
0.4558524176 -0.1053484314 -0.0548642866
-0.2745942523 0.1172557136 0.0026930420
0.4772184376 -0.1496085345 0.0051413771
0.3877349410 -0.0182504115 -0.0686808421
-0.1670055483 -0.0738449006 -0.0608255185
0.3893022802 -0.0147053611 -0.0107114626
-0.0561560733 0.1163769152 0.0431342780
-0.4130075778 0.1059241637 -0.0556684202
0.4706480764 -0.1351289227 0.0331936089
0.3910619322 0.0092055772 -0.0399358290
-0.4581093629 0.0839211913 0.0075592917
-0.4854379639 0.0953050961 -0.0127156150
-0.1734999202 -0.0975589251 -0.0165492155
-0.4757054435 0.0210235187 -0.0547112547
-0.4190745584 0.0855791999 0.0163924297
-0.1202876430 0.0714365309 -0.0004205095
-0.1155183513 0.0062917732 0.0176778446
-0.1064750871 0.0693600269 -0.0006875090
-0.0031465145 -0.1345206204 -0.0361350278
-0.4724199932 0.0538708227 -0.0745723129
-0.4714119908 0.0379594447 0.0124300508
-0.1415603736 -0.0551576426 0.0043790715
-0.0549067359 0.1108176930 0.0108063051
-0.4596192692 0.1064102953 -0.0012375185
0.0099871961 -0.1258714732 -0.0181152061
-0.0374690035 -0.1252609593 -0.0083597977
-0.1574422951 0.1393966854 -0.0598345491
-0.1187841258 0.0825272243 -0.0244837795
-0.0360387064 0.1272706913 0.0155122263
-0.4220611675 0.0512495300 0.0205730871
-0.0349921588 -0.0078331817 0.0167877553
-0.0314358447 -0.1193645550 -0.0508007521
-0.1612927154 0.1346910181 -0.0124343348
0.4486448454 -0.1490229745 -0.0547881946
-0.1930395026 -0.0916676887 -0.0164066037
0.4370218669 -0.0292743690 -0.0642187011
-0.3976627421 0.0866573368 -0.0338014177
-0.0623024288 -0.1360368128 -0.0326417576
-0.0031730143 -0.1366773824 -0.0289237218
-0.4314083007 0.1134196826 -0.0356049132
0.4585694916 -0.1130260104 -0.0030677561
0.0134623777 -0.1297408629 -0.0141800760
-0.3480932216 -0.0587233518 -0.0544990952
0.3981516429 -0.1054573626 -0.0627926325
0.0157888858 -0.1247914643 -0.0271622710
-0.3645150460 0.0205201183 -0.0509723559
-0.0585980518 -0.1142106531 -0.0414262089
-0.3237119137 0.1297883974 -0.0603727323
-0.0614212524 -0.1239138893 -0.0064445079
0.3906414057 0.0004361070 -0.0224122868
-0.0101771544 -0.1338341179 -0.0066157289
0.4700525529 -0.0025424501 -0.0538136342
-0.0385818520 -0.0964671827 -0.0291046348
-0.3158650280 0.0418667591 -0.0865522733
-0.0703292097 0.1162018093 0.0326737198
-0.4445614903 0.1139621886 -0.0189663820
0.0109909592 0.1054594990 0.0844138949
-0.1228038223 -0.0325464032 0.0110650497
0.4333688411 -0.1084387043 -0.0348645472
-0.2891696401 0.0870880876 0.0110167103
-0.1037876202 0.0848501197 -0.0241434847
-0.2181711319 0.1075709225 -0.0631661896
-0.3470388369 0.0705105695 -0.0301233726
-0.4558417835 0.0089557480 -0.0189148067
0.4581046426 -0.1264078697 0.0043657159
-0.0083493605 0.0657559512 -0.0587875689
-0.0581853112 -0.0022198713 -0.0868712354
-0.4285651646 0.0932087014 -0.0755545795
0.1694797737 0.0338367641 -0.0029333474
-0.0177907236 -0.1221161756 -0.0543278559
0.1605470307 -0.0492323603 0.0049961851
-0.3786368135 0.0392595831 0.0149112900
-0.0173558839 -0.1265683438 -0.0497675712
-0.4782385926 0.0662670109 0.0162143258
-0.3693794478 0.0230641260 -0.0632267992
-0.2577428244 0.0309326059 0.0300485123
-0.0326800483 0.1179333884 0.0753546721
0.4960673351 -0.0228900011 -0.0721796659
-0.3876129555 0.0714111647 0.0174189745
-0.1516664823 0.1108325341 -0.0121703291
0.3286540099 -0.0923539625 -0.0620614707
-0.2132726971 0.0779322470 0.0182699523
-0.0613221566 -0.1197205967 -0.0467355151
-0.3925269405 0.0844670268 -0.0144423374
-0.0631849017 0.0664157219 -0.0003091472
0.3466579033 0.0114117615 -0.0288116747
-0.1310624912 0.0101251799 -0.0725331624
-0.0586126564 0.1229392982 0.0442117104
-0.0360321859 -0.0816751100 -0.0032604025
0.1341610192 -0.1084454157 -0.0192211479
-0.3982291262 0.0439532636 -0.0671070288
-0.3371569312 0.0441928375 -0.0196576408
0.4359757566 -0.1235570107 -0.0179073938
0.0113157438 0.1163105250 0.0636443495
0.4680413867 -0.0027473051 -0.0248217842
-0.0174417818 -0.1223344717 -0.0463773931
0.1437622243 0.0119862444 0.0069527144
-0.0781752588 -0.1174949236 -0.0461283733
0.0071973251 0.1180996516 0.0707888772
0.0093746751 0.1026773535 0.0511457247
-0.2411777231 0.1123044477 0.0163844575
-0.2670623056 -0.0474216929 0.0164063481
-0.1114150137 0.0488375290 -0.0586628512
-0.0594492092 -0.1195684139 -0.0332759435
0.4964198145 -0.0451071603 0.0054105882
-0.4137465101 0.0558398504 0.0305146118
-0.2969174879 0.0377327790 0.0052266807
-0.4522561145 0.0816298214 0.0145522049
0.4523647376 -0.0377581000 -0.0706953154
0.1451836408 -0.0458845393 0.0071904680
0.4819202102 -0.1290820513 0.0379752524
0.0084036036 -0.1200689573 -0.0361568737
0.4688457613 -0.0087147449 -0.0712045278
0.4890062725 -0.0108852734 0.0067713792
0.4660201891 -0.0383010186 -0.0716236145
-0.1097460158 0.0423832026 0.0126253011
-0.3915556520 0.0742506208 -0.0616397369
0.1511463628 -0.1029556497 -0.0427368321
0.1604837013 -0.0453519007 -0.0231359654
0.0198171017 0.1005634102 0.0765094945
0.0134419692 0.1114361842 0.0530647310
-0.0062530668 0.1223058189 0.0490362492
0.4653826390 -0.0465619316 -0.0537639610
0.3451711437 -0.0094250723 -0.0117593961
0.4287471735 -0.1369286135 -0.0350282891
0.4684519449 -0.1435062833 0.0059316933
-0.0247077434 -0.1272053308 -0.0271452689
-0.3894047568 0.0810510266 0.0004917693
-0.0631563563 -0.1252618928 -0.0156671605
0.4563741996 -0.0043673406 -0.0702831418
-0.0177356824 0.1210432570 0.0802830000
-0.4370751969 0.0759070270 0.0147521565
-0.2676394168 -0.0554207785 -0.0168128899
0.1372946833 -0.0972318626 0.0033272415
-0.0379450968 0.1117306555 0.0218954505
0.1670431638 0.0101106144 0.0088665548
-0.0267954946 -0.1289376876 -0.0145961106
0.0047019623 0.1135292186 0.0429543938
-0.4878975118 0.0705987010 -0.0609801012
-0.3786791935 0.0331471760 -0.0031618131
-0.4733419356 0.1096619806 -0.0146267306
0.4799198957 -0.1344657109 -0.0652408211
0.4798424420 -0.1344261072 -0.0722245163
-0.1369721941 -0.0267426911 0.0186740985
0.4888387224 -0.0317553683 0.0337022060
0.4963298864 -0.0229489629 -0.0652004474
-0.0889208084 -0.0724516256 -0.0032400410
-0.2546501151 -0.0468097984 -0.0757974968
-0.0251099625 -0.1253264214 -0.0363272728
-0.2003536145 -0.1063991093 -0.0381345048
-0.0562199756 0.1255444454 0.0561368275
-0.1305030342 -0.0718288041 -0.0242037597
-0.0286014462 -0.1359014019 -0.0061338444
-0.0574921950 0.1105344325 0.0493663116
0.4273528443 -0.1357204131 -0.0697554638
0.1435936625 -0.0420199373 -0.0235461579
-0.3784538574 0.0311409126 -0.0276738529
-0.0252840932 0.1253064136 0.0685886550
-0.0084089594 0.1108142645 0.0319722103
0.0153108759 -0.1228280260 -0.0319028101
-0.3997071030 0.0315309985 -0.0623948507
-0.0054097314 -0.1322683370 -0.0395640885
0.1574157956 -0.0510776339 -0.0513339743
0.1466304599 -0.0228980611 -0.0281014115
0.4542077051 -0.0222344505 -0.0760612747
-0.1503651025 0.1335481889 -0.0081866617
-0.0285466418 -0.1351437324 -0.0153174928
0.0115944968 -0.1235426346 -0.0380630826
0.1336362069 -0.1007074992 -0.0416905788
0.3857531455 -0.0402787806 -0.0397248226
-0.0895901316 -0.0710394105 -0.0567829954
0.0118890704 -0.1198731220 -0.0294663022
0.3824403237 -0.1148837635 -0.0235017698
-0.0433461837 0.1173814204 0.0291728768
0.1405419114 -0.0739065731 0.0103018300
0.4713209637 -0.0393660667 -0.0025737191
-0.1278492874 -0.0617970219 -0.0475483094
-0.0056353003 -0.1185901284 -0.0454538266
0.4727852676 -0.1145782623 0.0062496450
-0.3325598712 -0.0318797046 -0.0195864128
-0.0158220365 0.1175291430 0.0583603734
-0.4301695629 0.0593553887 -0.0817613694
-0.1311964382 0.0092160849 0.0147157853
-0.0278990561 0.1184932615 0.0684349107
-0.0683022261 0.1278088475 0.0328327697
-0.0435183292 0.1365394864 0.0379226252
0.0138947250 -0.1288486903 -0.0191110852
-0.4431696366 0.0065291694 -0.0313545871
-0.0633758450 0.0472476142 -0.0759020844
-0.1589789297 0.1496085345 -0.0310851030
0.1697057946 0.0343074645 -0.0445775171
-0.0120295613 -0.1313708550 -0.0112389971
-0.0425269874 0.1232681314 0.0286344116
0.0138863660 0.1016524103 0.0484538313
0.0160784666 0.0990119951 0.0682227400
-0.0647283223 -0.1084336437 -0.0125388341
-0.4956876460 0.0353590565 -0.0474876253
0.3732297490 -0.1145170414 -0.0140697740
0.0135525595 0.1039355767 0.0517744764
-0.0605941211 -0.1232652442 -0.0529561840
-0.1794262704 -0.1125016244 -0.0375267708
-0.3966352802 0.0265087177 -0.0482263418
0.4050090419 0.0018137100 -0.0357215277
0.4750653153 -0.0236497421 0.0052400040
-0.3241127156 -0.0602298528 -0.0230740708
-0.4468460807 0.0949207173 0.0071306929
0.3874432864 -0.0342431135 -0.0587406058
-0.4232389161 0.0573490578 0.0249682119
0.0079173264 0.1067440775 0.0541144711
-0.3563240804 0.0750777113 -0.0500812288
0.3981576464 -0.0164595379 -0.0206684948
-0.0058642458 -0.1284067968 -0.0465097261
0.1353604892 -0.0754469168 -0.0545780512
-0.2451381329 0.0301838181 -0.0893949026
-0.3753310096 0.0605104741 0.0147521506
0.1585596315 -0.0760815844 0.0098992750
-0.0645135604 0.0394641432 0.0169068772
-0.2352548200 -0.0444414773 -0.0842108794
0.3772623570 -0.0948679248 -0.0603695599
-0.0258654042 -0.0556121613 -0.0771529133
-0.1255222369 0.0425138526 0.0153991858
0.0172715870 0.0973920513 0.0640916276
-0.0416338860 -0.1313148914 -0.0084026361
-0.2901285447 0.1384035011 -0.0183844749
0.3847419206 -0.1342308386 -0.0386275360
-0.3436961608 0.0458088156 -0.0788615796
0.1413971408 -0.0203628959 -0.0023643865
-0.0795536521 -0.1235463666 -0.0201049557
-0.3905208376 0.0521809128 0.0189946958
-0.1274582720 -0.0602207063 -0.0040760235
0.4547419590 -0.1115262665 -0.0722597513
-0.0029811528 -0.1397545083 -0.0174058234
0.4530801673 -0.1053001338 -0.0259320901
0.0002089899 0.1099335000 0.0439084467
-0.0123825199 0.0805801663 -0.0279589640
0.4864577073 -0.0413114582 0.0065355863
0.3757357946 -0.0942189105 -0.0220433245
0.1644233583 -0.0159595179 -0.0516933620
-0.0031417953 -0.1209020827 -0.0477774099
-0.3685232469 0.0492545617 -0.0667723422
0.4456644312 -0.0084546339 -0.0681647521
-0.1243155410 0.0508174245 -0.0583436114
-0.3950790952 0.0624315092 -0.0653710836
0.4536303039 -0.1421135853 -0.0034745634
-0.4280713008 0.1060594055 -0.0579545476
0.5000000000 -0.0086394274 0.0052032122
-0.3278555324 -0.0054613330 -0.0079668632
0.4812027037 -0.1272371432 -0.0655158439
0.4811252500 -0.1271975395 -0.0724995391
0.4122619287 -0.0060337686 -0.0602947729
-0.0251795026 0.1242570400 0.0624942403
0.0019189425 0.1120082678 0.0692076859
-0.0178920525 -0.1187322390 -0.0501004968
-0.3508721279 -0.0426297979 -0.0608015513
-0.4484469486 0.0217973981 -0.0165863752
-0.0609465586 -0.1191264606 -0.0175057873
0.3944521825 -0.1284047694 -0.0629105571
-0.0014458109 0.1144204632 0.0706555962
-0.0210595621 0.1199228364 0.0862724831
-0.4569976386 0.0282284402 0.0066431265
-0.4408610804 0.0270858026 -0.0724777243
-0.0054119032 -0.1261631868 -0.0369951173
0.4522195636 -0.0221474781 -0.0164584694
-0.3957430289 0.0178178814 -0.0670770618
-0.0030523533 -0.1313445043 -0.0238332147
-0.0319878571 -0.1238221102 -0.0539911547
-0.3736750130 0.0674209729 -0.0273130489
0.3270196013 -0.1059804791 -0.0147669274
-0.4211094716 0.0950847734 -0.0250089144
-0.3225515334 -0.0281530331 -0.0847638307
-0.0247045353 -0.1341481689 -0.0272267522
-0.0415447212 0.1249929435 0.0632647668
-0.0133187304 0.1245517767 0.0589078482
0.1621426194 -0.0234508318 -0.0266862293
0.4461983669 -0.1471126160 -0.0258734556
-0.0119588820 0.0616166082 -0.0010770027
0.1666355039 0.0083364207 -0.0584423500
0.4502225718 -0.1408991169 -0.0726531618
-0.2114034456 0.1023564640 0.0107878023
0.4483023647 -0.0071373292 -0.0332728474
-0.1226423337 -0.0345984498 -0.0618977778
-0.5000000000 0.0539322074 -0.0382810410
0.4952116709 -0.0301812214 -0.0719067903
0.4635884263 -0.0448904392 -0.0247889116
-0.2398970084 0.1195841592 -0.0161145685
-0.1181747507 0.0080461522 -0.0725830121
-0.4691944754 0.0881988022 0.0111840483
0.3698380877 -0.1388240643 -0.0399146571
-0.1438984389 -0.0641966238 -0.0301642256
-0.1914427375 -0.0761331564 -0.0167329923
-0.1414116509 0.1482604124 -0.0291056392
-0.3532470479 0.0218806110 -0.0299744392
-0.4864981591 0.1021279901 -0.0458931974
0.4730553294 -0.1212924605 0.0338964976
-0.0040528842 -0.1333654845 -0.0159758342
-0.2568382305 -0.0448229658 -0.0891882171
-0.0235270097 -0.0078644826 -0.0849324404
-0.3651340065 0.0484471807 -0.0133276522
0.0031754537 0.1049486956 0.0858030762
0.3423994337 -0.0299381404 -0.0290526879
0.0209889549 0.1010448730 0.0699206904
-0.2291769458 -0.0247719067 0.0179869885
0.4425184622 -0.1064870896 -0.0716683293
-0.2174192675 0.0242435039 0.0236675054
0.3233395893 -0.1273979994 -0.0329701058
-0.4376610255 0.0596671547 0.0177181004
-0.0017754204 0.1214958590 0.0793953736
-0.1310494864 0.1380057951 -0.0513579458
-0.4421313512 0.0441065127 0.0140630290
0.1538511771 0.0435734859 -0.0218548250
-0.4367163525 0.0984009914 -0.0157793652
-0.0221143679 0.1167696924 0.0844381107
-0.3037557809 0.1082706872 -0.0853529914
-0.1378302307 -0.0304160361 -0.0599598948
-0.0047744145 0.1184866896 0.0385634152
-0.3129652186 0.0860878877 -0.0062306539
-0.0632024494 -0.1029153132 -0.0490097871
-0.0772639387 -0.1140500992 -0.0204138399
-0.1695555279 -0.0825644347 -0.0191694285
-0.3092809206 0.1159044700 -0.0165955857
-0.0292665046 0.1197771291 0.0635471215
0.0054148109 0.1097582950 0.0597238320
-0.2638484506 -0.0241341998 0.0342439897
-0.4588205788 0.0638671285 0.0115768751
-0.0413952461 0.1024424324 0.0094592398
0.4954741339 -0.0302400620 -0.0649276754
-0.4108293831 0.0461193313 0.0202290339
0.4998619761 -0.0251032077 0.0382281210
-0.4876676745 0.0230146976 -0.0150904921
-0.2432695784 -0.0556200279 -0.0194551584
-0.0311524158 -0.1297460754 -0.0165786350
0.0035784125 0.1195205666 0.0729313898
0.0132225599 0.0980747815 0.0735380162
-0.4205776426 0.0625163252 0.0204280302
0.0014856050 0.1065049478 0.0397493216
0.1590598051 0.0361999481 -0.0461099685
-0.4615093391 0.1088628437 -0.0545551790
-0.0315900077 -0.1354215273 -0.0168307562
-0.0160760102 0.0350898391 0.0130861031
-0.0277170760 -0.1276078166 -0.0479285054
-0.0795315297 -0.0433762713 0.0153718910
0.4745435588 -0.0104260525 -0.0021255688
-0.3879072123 0.0873333528 -0.0680563218
0.0059371897 0.1102556970 0.0622801145
0.0101216614 0.1151383403 0.0601081703
-0.1309022433 0.1033607968 -0.0515312221
-0.0077302402 0.1133972831 0.0399758202
-0.3785196207 0.0613083253 -0.0723490780
-0.3847149065 0.0780355521 -0.0479800884
-0.4196909546 0.0208297456 -0.0509146940
-0.3053435140 -0.0420590799 0.0046782994
0.4315351442 -0.1099587030 -0.0698081758
-0.0246705642 -0.1320708105 -0.0376278253
-0.3737865622 0.0652531094 -0.0032528001
0.0062952057 0.1092528083 0.0379748877
0.4219339191 -0.0048586131 -0.0499135282
0.4251886050 -0.0193035080 -0.0185634821
0.4266966685 -0.0288741689 -0.0261984327
0.3760308695 -0.0254677248 -0.0586109219
0.3716721191 -0.0286894200 -0.0463657448
0.3773461785 -0.0126901132 -0.0585364818
0.3773461785 -0.0126901132 -0.0585364818
0.3794599160 0.0026889964 -0.0445532238
0.3794599160 0.0026889964 -0.0445532238
0.3750900928 -0.0038056812 -0.0237404619
0.3750900928 -0.0038056812 -0.0237404619
0.3717866036 -0.0327695001 -0.0324955419
0.3702785401 -0.0231988391 -0.0248605913
0.4076075114 -0.1047737337 -0.0521741031
0.4092080402 -0.1192203871 -0.0207045818
0.4103588386 -0.1288939247 -0.0282674649
0.3594009460 -0.1236905633 -0.0625550929
0.3545458150 -0.1266035979 -0.0504135823
0.3615530962 -0.1103793659 -0.0624860139
0.3615530962 -0.1103793659 -0.0624860139
0.3642279199 -0.0948893956 -0.0477695530
0.3642279199 -0.0948893956 -0.0477695530
0.3588737874 -0.1015407977 -0.0266017425
0.3588737874 -0.1015407977 -0.0266017425
0.3540407550 -0.1308144190 -0.0357988209
0.3528899565 -0.1211408815 -0.0282359378
0.4677175959 -0.0245521908 -0.0537887976
0.4522486315 -0.1271857030 -0.0548262406
-0.2599027386 0.1006087119 0.0191460699
-0.2599027386 0.1006087119 0.0191460699
-0.2992252804 0.1014962788 -0.0027894377
-0.3281598787 0.0932075198 -0.0233594792
-0.3373894116 0.1111701351 -0.0520144597
-0.3138678317 0.1315835144 -0.0352716381
-0.3328025005 0.0954910907 -0.0333384072
-0.3328025005 0.0954910907 -0.0333384072
-0.1684776288 0.0950490734 -0.0438249845
-0.1695445373 0.0892233587 -0.0542663970
-0.1436308773 0.0887881489 -0.0341543820
-0.1684776288 0.0950490734 -0.0438249845
-0.1677940049 0.0967824246 -0.0222458375
-0.1926407565 0.1030433492 -0.0319164400
-0.2318915343 0.1163748560 -0.0456312155
-0.2638209205 0.1107181200 -0.0802504269
-0.2643680128 0.1270398331 -0.0771069917
-0.2840618968 0.1176552602 -0.0812299916
-0.2638209205 0.1107181200 -0.0802504269
-0.1831586556 -0.0171581487 -0.0783720209
-0.1865425254 -0.0374287567 -0.0720853871
-0.1571105734 -0.0035164844 -0.0754525917
-0.1831586556 -0.0171581487 -0.0783720209
-0.1767896575 0.0183456928 -0.0798669667
-0.2028377397 0.0047040285 -0.0827863960
-0.1571105734 -0.0035164844 -0.0754525917
-0.2288858219 -0.0089376358 -0.0857058252
-0.2092067378 -0.0307998130 -0.0812914502
-0.2028377397 0.0047040285 -0.0827863960
-0.2396775271 -0.0091283800 -0.0881944941
-0.2396775271 -0.0091283800 -0.0881944941
-0.2838448332 0.0010153925 -0.0870793666
-0.2896948819 -0.0364879995 -0.0869760239
-0.2703415318 -0.0219037867 -0.0881337919
-0.3031981833 -0.0135688203 -0.0859215987
-0.2509881817 -0.0073195739 -0.0892915599
-0.2644914831 0.0155996053 -0.0882371346
-0.2703415318 -0.0219037867 -0.0881337919
-0.2838448332 0.0010153925 -0.0870793666
-0.2805015805 0.0360252886 -0.0879735880
-0.2998549306 0.0214410758 -0.0868158200
-0.2644914831 0.0155996053 -0.0882371346
-0.3192082807 0.0068568630 -0.0856580520
-0.3031981833 -0.0135688203 -0.0859215987
-0.2998549306 0.0214410758 -0.0868158200
-0.3237259709 0.0770397514 -0.0821072855
-0.3237259709 0.0770397514 -0.0821072855
-0.3498028716 0.0811871955 -0.0712939832
-0.3602407300 0.0100687944 -0.0722562617
-0.1909381963 -0.0430900204 -0.0623802290
-0.1931956244 -0.0556477884 -0.0556233946
-0.1643842135 -0.0367530282 -0.0611700619
-0.1909381963 -0.0430900204 -0.0623802290
-0.1865425254 -0.0374287567 -0.0720853871
-0.2174921791 -0.0494270125 -0.0635903962
-0.1928073326 -0.0555758000 -0.0329506922
-0.1928073326 -0.0555758000 -0.0329506922
-0.1931956244 -0.0556477884 -0.0556233946
-0.2184267473 -0.0556699023 -0.0488756278
-0.1853686597 -0.0399647747 0.0111830300
-0.1830745699 -0.0257572989 0.0183305435
-0.1611704269 -0.0333537329 0.0149285643
-0.1886769470 -0.0517041023 0.0071696304
-0.2089269464 -0.0382380045 0.0125783095
-0.1853686597 -0.0399647747 0.0111830300
-0.2864914654 -0.0487399292 -0.0060672952
-0.2958760662 -0.0578253156 -0.0199434803
-0.3563041338 -0.0191016167 -0.0527357256
-0.3485374586 -0.0056797931 -0.0352793844
-0.3403265464 -0.0453015282 -0.0370427540
-0.3429034596 -0.0049995468 -0.0247804260
-0.3485374586 -0.0056797931 -0.0352793844
-0.3212278719 0.0166764168 -0.0061706840
-0.3212278719 0.0166764168 -0.0061706840
-0.2803829693 0.0067992896 0.0197353352
-0.2845736316 -0.0174871019 0.0207801312
-0.3011081503 0.0134463875 0.0062714767
-0.2803829693 0.0067992896 0.0197353352
-0.2773301562 0.0343326924 0.0176375965
-0.2607956375 0.0033992031 0.0321462510
-0.3131632856 0.0656404625 -0.0043204652
-0.3131632856 0.0656404625 -0.0043204652
-0.2930435640 0.0624104333 0.0081216955
-0.3170372095 0.0409628082 -0.0072154801
-0.2710643565 0.0608472447 0.0204128893
-0.2930435640 0.0624104333 0.0081216955
-0.2671904325 0.0855248989 0.0233079041
-0.2710643565 0.0608472447 0.0204128893
-0.2514770247 0.0574471581 0.0328238051
-0.2773301562 0.0343326924 0.0176375965
-0.3325062318 0.0193657523 -0.0138122520
-0.3250610749 0.0651403626 -0.0129441474
-0.2215530125 -0.0578035191 -0.0700730733
-0.2666642064 -0.0725464042 -0.0725159368
-0.2285091399 -0.0670536589 -0.0707176486
-0.2928051815 -0.0523025438 -0.0775957850
-0.2280476634 -0.0621090091 -0.0405807698
-0.1899493238 -0.0724651981 -0.0405408210
-0.2295410772 -0.0657769675 -0.0167729411
-0.2280476634 -0.0621090091 -0.0405807698
-0.2611447659 -0.0511152885 -0.0463051934
-0.2215530125 -0.0578035191 -0.0700730733
-0.2585761091 -0.0759487707 -0.0197403373
-0.2577777266 -0.0681815046 -0.0199035315
-0.2705663621 -0.0751955202 -0.0354528495
-0.2318029324 -0.0834316045 -0.0259297266
-0.2742234181 -0.0825612306 -0.0463168000
-0.2705663621 -0.0751955202 -0.0354528495
-0.3093297919 -0.0669594360 -0.0449759724
-0.2585761091 -0.0759487707 -0.0197403373
-0.2656569313 -0.0820971992 -0.0587642890
-0.2330052729 -0.0942481543 -0.0484493969
-0.2666642064 -0.0725464042 -0.0725159368
-0.2742234181 -0.0825612306 -0.0463168000
-0.2656569313 -0.0820971992 -0.0587642890
-0.3111583198 -0.0706422912 -0.0504079476
-0.3078663192 -0.0570720652 -0.0356559926
-0.2992998324 -0.0566080338 -0.0481034815
-0.3078663192 -0.0570720652 -0.0356559926
-0.3236965270 -0.0576656928 -0.0513012884
-0.2992998324 -0.0566080338 -0.0481034815
-0.2928051815 -0.0523025438 -0.0775957850
-0.2611447659 -0.0511152885 -0.0463051934
-0.2791758755 0.1334233590 -0.0350311295
-0.2723734869 0.1302491363 -0.0475903447
-0.2954141148 0.1387558476 -0.0507690176
-0.2791758755 0.1334233590 -0.0350311295
-0.2723734869 0.1302491363 -0.0475903447
-0.2318915343 0.1163748560 -0.0456312155
-0.2481297735 0.1217073446 -0.0613691036
-0.2561352476 0.1249166477 -0.0318524566
-0.2643680128 0.1270398331 -0.0771069917
-0.2886117261 0.1355816249 -0.0633282329
-0.2481297735 0.1217073446 -0.0613691036
-0.2325315588 0.1241731176 -0.0679923119
-0.2325315588 0.1241731176 -0.0679923119
-0.1949869269 0.1317849015 -0.0639134305
-0.1963723555 0.1158026196 -0.0624554073
-0.1776000396 0.1196085115 -0.0604159666
-0.2311461302 0.1401553994 -0.0694503350
-0.2686907621 0.1325436155 -0.0735292164
-0.1949869269 0.1317849015 -0.0639134305
-0.1914725842 0.1115419150 -0.0462893983
-0.2318915343 0.1163748560 -0.0456312155
-0.2156847963 0.1155630371 -0.0312019834
-0.2076793222 0.1123537339 -0.0607186304
-0.1994780583 0.1147512182 -0.0167727513
-0.1752658461 0.1107300961 -0.0318601663
-0.2156847963 0.1155630371 -0.0312019834
-0.1914725842 0.1115419150 -0.0462893983
-0.1752658461 0.1107300961 -0.0318601663
-0.1920496062 0.1102988372 -0.0660331826
-0.2257106300 0.1365472596 -0.0154094048
-0.1994780583 0.1147512182 -0.0167727513
-0.2387168362 0.1484355467 -0.0425163968
-0.2245537372 0.1440060178 -0.0247347889
-0.2573411409 0.1412047595 -0.0215596319
-0.1988478829 0.1490220406 -0.0368007499
-0.2785857894 0.1478490527 -0.0482320437
-0.2644226904 0.1434195239 -0.0304504358
-0.3042916437 0.1428330300 -0.0361660827
-0.2245537372 0.1440060178 -0.0247347889
-0.1917663334 0.1468072762 -0.0279099460
-0.2257106300 0.1365472596 -0.0154094048
-0.2379485189 0.1433296221 -0.0568911198
-0.2782016308 0.1452960904 -0.0554194052
-0.2311461302 0.1401553994 -0.0694503350
-0.2379485189 0.1433296221 -0.0568911198
-0.1984637243 0.1464690783 -0.0439881114
-0.1976954070 0.1413631537 -0.0583628345
-0.1779530097 0.1429328818 -0.0519113303
-0.2387168362 0.1484355467 -0.0425163968
-0.2782016308 0.1452960904 -0.0554194052
-0.1984637243 0.1464690783 -0.0439881114
-0.1559398173 0.1091323278 -0.0345444159
-0.2845959823 -0.0330966398 0.0194611446
-0.2406338591 0.0000546521 0.0289557476
-0.2406338591 0.0000546521 0.0289557476
-0.1801866920 -0.0077779109 0.0163513869
-0.1556915651 0.0007190870 0.0155335861
-0.1830745699 -0.0257572989 0.0183305435
-0.1801866920 -0.0077779109 0.0163513869
-0.2046818189 -0.0162749088 0.0171691877
-0.1743078529 0.0167297944 0.0191916454
-0.1722345676 0.0435741660 0.0164928688
-0.1693974670 0.0602230498 0.0168345691
-0.1517155029 0.0263951254 0.0156043271
-0.1722345676 0.0435741660 0.0164928688
-0.1743078529 0.0167297944 0.0191916454
-0.2153459823 0.0510878755 0.0209687288
-0.1667801700 0.0746843890 0.0089247214
-0.1461512035 0.0585991208 0.0121619536
-0.1693974670 0.0602230498 0.0168345691
-0.1658455443 0.0868964975 0.0051836464
-0.1667801700 0.0746843890 0.0089247214
-0.1895591207 0.0824143723 0.0117267993
-0.2313152463 0.0541026071 0.0296333016
-0.2313152463 0.0541026071 0.0296333016
-0.3138678317 0.1315835144 -0.0352716381
-0.2650127765 0.1289938302 -0.0172495217
-0.1677940049 0.0967824246 -0.0222458375
-0.1650937857 0.0924418442 -0.0068479886
-0.1895987252 0.0995694443 -0.0057290176
-0.1722161112 0.0505424804 -0.0781601068
-0.1516393012 0.0303338301 -0.0753466346
-0.1688426361 0.0708886028 -0.0710653313
-0.1722161112 0.0505424804 -0.0781601068
-0.2179432775 0.0587629934 -0.0854939111
-0.1973664675 0.0385543431 -0.0826804389
-0.1927929212 0.0707511307 -0.0809735790
-0.1767896575 0.0183456928 -0.0798669667
-0.1516393012 0.0303338301 -0.0753466346
-0.1973664675 0.0385543431 -0.0826804389
-0.1712433365 0.0791941735 -0.0607549005
-0.1477794387 0.0650057990 -0.0595492560
-0.1695445373 0.0892233587 -0.0542663970
-0.1712433365 0.0791941735 -0.0607549005
-0.1947072342 0.0933825480 -0.0619605450
-0.1688426361 0.0708886028 -0.0710653313
-0.2279731398 0.0633287894 -0.0875807984
-0.2279731398 0.0633287894 -0.0875807984
-0.2744469569 0.0692272526 -0.0873739470
-0.3098104045 0.0750687231 -0.0859526324
-0.2951559925 0.0555470059 -0.0869631102
-0.2891013689 0.0887489699 -0.0863634692
-0.2805015805 0.0360252886 -0.0879735880
-0.2597925449 0.0497055354 -0.0883844248
-0.2951559925 0.0555470059 -0.0869631102
-0.2744469569 0.0692272526 -0.0873739470
-0.2392837944 0.0651375956 -0.0886778641
-0.2539382064 0.0846593128 -0.0876673863
-0.2597925449 0.0497055354 -0.0883844248
-0.2685926184 0.1041810301 -0.0866569086
-0.2891013689 0.0887489699 -0.0863634692
-0.2539382064 0.0846593128 -0.0876673863
-0.3331238471 0.0088278912 -0.0818127051
-0.3331238471 0.0088278912 -0.0818127051
-0.2928051815 -0.0523025438 -0.0775957850
-0.1650937857 0.0924418442 -0.0068479886
-0.1419389557 0.0874845342 -0.0156658840
-0.1658455443 0.0868964975 0.0051836464
-0.2611447659 -0.0511152885 -0.0463051934
-0.1898459796 -0.0562235929 -0.0101020181
-0.1886769470 -0.0517041023 0.0071696304
-0.1668722093 -0.0602101083 -0.0201331218
-0.1898459796 -0.0562235929 -0.0101020181
-0.1935840086 -0.0599083259 -0.0248096920
-0.2165577790 -0.0559218104 -0.0147785882
-0.0862223663 0.1202241138 -0.0209493530
-0.1086359263 0.1291149545 -0.0361536494
-0.0861487447 0.1029016146 -0.0210359911
-0.0835440964 0.1326382432 -0.0179228598
-0.0862223663 0.1202241138 -0.0209493530
-0.0624696712 0.1175403378 -0.0042318100
-0.0941972192 0.1069476147 -0.0010824552
-0.1125497312 0.1051542058 -0.0263068387
-0.1412843628 0.1070966655 -0.0318507756
-0.1229318507 0.1088900744 -0.0066263922
-0.1045793387 0.1106834833 0.0185979913
-0.0758447071 0.1087410236 0.0241419282
-0.1229318507 0.1088900744 -0.0066263922
-0.0941972192 0.1069476147 -0.0010824552
-0.0758447071 0.1087410236 0.0241419282
-0.0861487447 0.1029016146 -0.0210359911
-0.1039432290 0.1181884897 0.0219832492
-0.1278048556 0.1145105119 0.0049064600
-0.1032925391 0.1295463171 0.0239750829
-0.1039432290 0.1181884897 0.0219832492
-0.0924649901 0.1423999494 0.0044084930
-0.0969417159 0.1350438377 0.0148679817
-0.1214150463 0.1379740692 -0.0018890844
-0.0969417159 0.1350438377 0.0148679817
-0.0765808457 0.1302941415 0.0355024046
-0.1032925391 0.1295463171 0.0239750829
-0.0835440964 0.1326382432 -0.0179228598
-0.0887251786 0.1377655518 -0.0067967065
-0.1124778736 0.1404493278 -0.0235142495
-0.0924649901 0.1423999494 0.0044084930
-0.0887251786 0.1377655518 -0.0067967065
-0.0679916596 0.1394697179 0.0211655591
-0.1137998347 -0.0985550724 -0.0568908512
-0.1207679562 -0.1094125060 -0.0589523143
-0.1137998347 -0.0985550724 -0.0568908512
-0.1508548737 -0.1024861369 -0.0619503795
-0.1163789886 -0.0927398740 -0.0340896078
-0.0905536555 -0.1005867588 -0.0233142210
-0.1171419251 -0.0954990392 -0.0158541313
-0.1163789886 -0.0927398740 -0.0340896078
-0.1416922685 -0.0832923873 -0.0474575632
-0.1151039988 -0.0883801069 -0.0549176528
-0.1174605863 -0.1107364072 -0.0114968617
-0.1191141213 -0.1029962844 -0.0145440248
-0.1204237614 -0.1182077569 -0.0219856394
-0.0913630951 -0.1271222848 -0.0273136985
-0.1208643496 -0.1242692186 -0.0350842642
-0.1204237614 -0.1182077569 -0.0219856394
-0.1499250159 -0.1153546907 -0.0297562051
-0.1174605863 -0.1107364072 -0.0114968617
-0.1216221100 -0.1157982903 -0.0487951011
-0.0919622694 -0.1259175516 -0.0407184294
-0.1207679562 -0.1094125060 -0.0589523143
-0.1216221100 -0.1157982903 -0.0487951011
-0.1512819507 -0.1056790291 -0.0568717729
-0.1208643496 -0.1242692186 -0.0350842642
0.0543007518 -0.0249265595 -0.0033792013
0.0096542965 -0.0163798706 0.0067042770
-0.0101396317 -0.0117991340 -0.0063249748
0.0345068236 -0.0203458229 -0.0164084531
0.0791532790 -0.0288925118 -0.0264919314
0.0989472072 -0.0334732484 -0.0134626796
0.0469330872 -0.0223287991 -0.0279648181
0.0543007518 -0.0249265595 -0.0033792013
0.0997421963 -0.0354055494 0.0019056333
0.0989472072 -0.0334732484 -0.0134626796
0.1216679294 -0.0387127434 -0.0108202623
0.0550957410 -0.0268588605 0.0119891116
0.0096542965 -0.0163798706 0.0067042770
0.0997421963 -0.0354055494 0.0019056333
0.0586011843 -0.0280868555 -0.0676471496
0.0777211368 -0.0320371574 -0.0398997818
0.0462170161 -0.0239011219 -0.0346687433
0.0996652812 -0.0381980420 -0.0590045042
0.0175370873 -0.0179756691 -0.0762897950
0.0366570399 -0.0219259709 -0.0485424272
-0.0044070571 -0.0118147845 -0.0571850726
0.0777211368 -0.0320371574 -0.0398997818
0.1106573997 -0.0370285474 -0.0317229699
0.0791532790 -0.0288925118 -0.0264919314
0.0559167397 -0.0416556997 -0.0697552458
0.0161948650 -0.0247600911 -0.0773438431
-0.0048352696 -0.0401861262 -0.0772483782
0.0150256678 -0.0486339305 -0.0734540795
0.0547475425 -0.0655295390 -0.0658654822
0.0956386144 -0.0585513082 -0.0621666485
0.0150256678 -0.0486339305 -0.0734540795
0.0559167397 -0.0416556997 -0.0697552458
0.0956386144 -0.0585513082 -0.0621666485
0.1181839963 -0.0534302684 -0.0562642536
0.0983230590 -0.0449824641 -0.0600585523
0.0586011843 -0.0280868555 -0.0676471496
0.0161948650 -0.0247600911 -0.0773438431
0.0983230590 -0.0449824641 -0.0600585523
0.0485280405 -0.0919479976 -0.0500161393
0.0538854014 -0.0781598302 -0.0594217460
0.0113313181 -0.0737800794 -0.0635845263
0.0910821237 -0.0963277484 -0.0458533591
0.0113313181 -0.0737800794 -0.0635845263
-0.0126244039 -0.0784842877 -0.0609631130
0.0059739573 -0.0875682468 -0.0541789195
0.0538854014 -0.0781598302 -0.0594217460
0.0937608041 -0.0894336647 -0.0505561624
0.0547475425 -0.0655295390 -0.0658654822
0.0487904466 -0.0958169558 -0.0387814238
0.0061051603 -0.0895027259 -0.0485615618
-0.0162383458 -0.0929849543 -0.0388330983
0.0051042973 -0.0961420692 -0.0339430293
0.0477895836 -0.1024562992 -0.0241628913
0.0914757329 -0.1021311858 -0.0290012859
0.0051042973 -0.0961420692 -0.0339430293
0.0487904466 -0.0958169558 -0.0387814238
0.0914757329 -0.1021311858 -0.0290012859
0.0485280405 -0.0919479976 -0.0500161393
0.0493564157 -0.0968495226 -0.0128886966
0.0053872819 -0.0966583526 -0.0209966657
-0.0153224520 -0.0891667313 -0.0121285341
0.0066621149 -0.0892623163 -0.0080745495
0.0506312487 -0.0894534863 0.0000334195
0.0933255495 -0.0970406926 -0.0047807275
0.0066621149 -0.0892623163 -0.0080745495
0.0493564157 -0.0968495226 -0.0128886966
0.0933255495 -0.0970406926 -0.0047807275
0.0477895836 -0.1024562992 -0.0241628913
0.0522548628 -0.0777908415 0.0035207138
0.0081113384 -0.0797329758 0.0001301557
-0.0113928431 -0.0661651156 0.0059725407
0.0106789191 -0.0651940484 0.0076678198
0.0548224434 -0.0632519142 0.0110583779
0.0963983871 -0.0758487073 0.0069112719
0.0106789191 -0.0651940484 0.0076678198
0.0522548628 -0.0777908415 0.0035207138
0.0963983871 -0.0758487073 0.0069112719
0.0506312487 -0.0894534863 0.0000334195
0.0550957410 -0.0268588605 0.0119891116
0.0571433081 -0.0492408973 0.0095026968
0.0120993582 -0.0397280579 0.0119020187
0.1001396909 -0.0363716999 0.0095897898
0.0100517911 -0.0173460211 0.0143884335
0.0120993582 -0.0397280579 0.0119020187
-0.0104226168 -0.0349716382 0.0131016796
0.0571433081 -0.0492408973 0.0095026968
0.1011634744 -0.0475627183 0.0083465824
0.1208526929 -0.0607346457 0.0093242062
0.0988426097 -0.0615737352 0.0099022634
0.0548224434 -0.0632519142 0.0110583779
0.0131231417 -0.0509190763 0.0106588113
0.0988426097 -0.0615737352 0.0099022634
0.0543850327 0.0020765314 0.0118702348
0.0096964369 -0.0028783252 0.0143289951
-0.0255340845 0.0136283287 0.0149369292
0.0191545113 0.0185831852 0.0124781690
0.0638431070 0.0235380418 0.0100194087
0.0990736285 0.0070313879 0.0094114746
0.0238835484 0.0293139404 0.0115527559
0.0543850327 0.0020765314 0.0118702348
0.0978910868 -0.0091431823 0.0047529242
0.0990736285 0.0070313879 0.0094114746
0.1208266555 0.0014215311 0.0058528193
0.0532024910 -0.0140980388 0.0072116844
0.0096964369 -0.0028783252 0.0143289951
0.0978910868 -0.0091431823 0.0047529242
0.0665077201 0.0359157784 0.0042341407
0.0252158550 0.0355028087 0.0086601219
0.0066284865 0.0485597085 0.0037915596
0.0272744190 0.0487661933 0.0015785690
0.0685662842 0.0491791630 -0.0028474122
0.1077995852 0.0363287481 -0.0001918405
0.0272744190 0.0487661933 0.0015785690
0.0665077201 0.0359157784 0.0042341407
0.1077995852 0.0363287481 -0.0001918405
0.0638431070 0.0235380418 0.0100194087
0.0707343286 0.0620768261 -0.0249068945
0.0709461475 0.0525950470 -0.0114659138
0.0293877233 0.0618467171 -0.0129919486
0.1122927528 0.0528251560 -0.0233808597
0.0293877233 0.0618467171 -0.0129919486
0.0085026017 0.0712134417 -0.0204754563
0.0291759043 0.0713284962 -0.0264329293
0.0709461475 0.0525950470 -0.0114659138
0.1123986623 0.0480842665 -0.0166603694
0.0685662842 0.0491791630 -0.0028474122
0.0733386426 0.0583900572 -0.0370344663
0.0304780613 0.0694851117 -0.0324967151
0.0110643504 0.0676205315 -0.0456421420
0.0324946410 0.0620730042 -0.0479110176
0.0753552223 0.0509779497 -0.0524487687
0.1161992239 0.0472950027 -0.0415722174
0.0335029309 0.0583669504 -0.0556181688
0.0733386426 0.0583900572 -0.0370344663
0.1161992239 0.0472950027 -0.0415722174
0.0707343286 0.0620768261 -0.0249068945
0.0749724184 0.0376691265 -0.0588482359
0.0333115289 0.0517125389 -0.0588179024
0.0114147657 0.0443160000 -0.0666843455
0.0322452104 0.0372942938 -0.0666995123
0.0739060999 0.0232508815 -0.0667298458
0.1166333078 0.0236257142 -0.0588785694
0.0322452104 0.0372942938 -0.0666995123
0.0749724184 0.0376691265 -0.0588482359
0.1166333078 0.0236257142 -0.0588785694
0.1378465565 0.0299128312 -0.0524942690
0.1170161118 0.0369345373 -0.0524791022
0.0753552223 0.0509779497 -0.0524487687
0.0333115289 0.0517125389 -0.0588179024
0.1172075137 0.0435889489 -0.0492793686
0.0648946024 -0.0112731995 -0.0688363252
0.0714171085 0.0111187723 -0.0636454993
0.0272063024 0.0128231308 -0.0716935569
0.1091054085 -0.0129775580 -0.0607882676
0.0206837964 -0.0095688410 -0.0768843828
0.0272063024 0.0128231308 -0.0716935569
0.0051008994 0.0136753100 -0.0757175857
0.0714171085 0.0111187723 -0.0636454993
0.1148556529 0.0103505371 -0.0612772011
0.0739060999 0.0232508815 -0.0667298458
0.0615517251 -0.0153812719 -0.0565169259
0.0190123577 -0.0116228772 -0.0707246832
-0.0044070571 -0.0118147845 -0.0571850726
0.0381323103 -0.0155731791 -0.0429773154
0.0806716777 -0.0193315737 -0.0287695582
0.1040910925 -0.0191396665 -0.0423091687
0.0476922866 -0.0175483301 -0.0291036315
0.0615517251 -0.0153812719 -0.0565169259
0.1074339698 -0.0150315941 -0.0546285679
0.1040910925 -0.0191396665 -0.0423091687
0.1270322149 -0.0189648276 -0.0413649897
0.0648946024 -0.0112731995 -0.0688363252
0.0190123577 -0.0116228772 -0.0707246832
0.1074339698 -0.0150315941 -0.0546285679
0.0532024910 -0.0140980388 0.0072116844
0.0780550181 -0.0180639911 -0.0159010457
0.0463839568 -0.0169145387 -0.0226693753
0.0972998159 -0.0172304673 0.0024236490
0.0091051661 -0.0109656103 0.0119997199
0.0339576932 -0.0149315626 -0.0111130102
-0.0101396317 -0.0117991340 -0.0063249748
0.0806716777 -0.0193315737 -0.0287695582
0.0780550181 -0.0180639911 -0.0159010457
0.1110344092 -0.0198472348 -0.0155669723
0.2688900175 -0.0693089110 -0.0173976680
0.2147185241 -0.0592706357 -0.0062007414
0.1876011127 -0.0523112682 -0.0146683534
0.2146868594 -0.0573304059 -0.0202668167
0.2688583528 -0.0673686813 -0.0314637433
0.3230615109 -0.0793471864 -0.0285945946
0.2146868594 -0.0573304059 -0.0202668167
0.2688900175 -0.0693089110 -0.0173976680
0.3230615109 -0.0793471864 -0.0285945946
0.2681414127 -0.0717256354 -0.0085235697
0.2688730292 -0.0701099128 -0.0417527627
0.2131444124 -0.0605937734 -0.0465433685
0.2146783652 -0.0577309068 -0.0324443640
0.1868140568 -0.0529728370 -0.0348396669
0.2673390763 -0.0729727794 -0.0558517671
0.3230676931 -0.0824889188 -0.0510611613
0.2131444124 -0.0605937734 -0.0465433685
0.2688730292 -0.0701099128 -0.0417527627
0.3230676931 -0.0824889188 -0.0510611613
0.2688583528 -0.0673686813 -0.0314637433
0.2654818974 -0.0830931993 -0.0609914515
0.2114488465 -0.0670854166 -0.0561627129
0.1827777101 -0.0723277690 -0.0568269360
0.2097942355 -0.0803316603 -0.0592413053
0.2638272864 -0.0963394430 -0.0640700439
0.3195149483 -0.0991009820 -0.0658201901
0.2097942355 -0.0803316603 -0.0592413053
0.2654818974 -0.0830931993 -0.0609914515
0.3195149483 -0.0991009820 -0.0658201901
0.3483886527 -0.0969844534 -0.0630948750
0.3213721272 -0.0889805621 -0.0606805057
0.2673390763 -0.0729727794 -0.0558517671
0.2114488465 -0.0670854166 -0.0561627129
0.3213721272 -0.0889805621 -0.0606805057
0.2621995828 -0.1048440667 -0.0570714724
0.2066729728 -0.1038998582 -0.0499041523
0.2081530782 -0.0912070940 -0.0572813158
0.1803897732 -0.0907349898 -0.0536976557
0.2607194774 -0.1175368309 -0.0496943089
0.3162460874 -0.1184810394 -0.0568616291
0.2066729728 -0.1038998582 -0.0499041523
0.2638272864 -0.0963394430 -0.0640700439
0.2621995828 -0.1048440667 -0.0570714724
0.3170599392 -0.1142287275 -0.0603609148
0.2089669300 -0.0869547822 -0.0607806015
0.3170599392 -0.1142287275 -0.0603609148
0.3453039692 -0.1146687461 -0.0655049218
0.3186876428 -0.1057241039 -0.0673594863
0.2604922252 -0.1208898570 -0.0413257446
0.2060736701 -0.1156659355 -0.0311616189
0.2058192940 -0.1119227534 -0.0420312884
0.1786100164 -0.1093107926 -0.0369492255
0.2607466013 -0.1246330391 -0.0304560752
0.3151651564 -0.1298569607 -0.0406202009
0.2060736701 -0.1156659355 -0.0311616189
0.2604922252 -0.1208898570 -0.0413257446
0.3153924086 -0.1265039345 -0.0489887652
0.2607194774 -0.1175368309 -0.0496943089
0.2610652919 -0.1206954414 -0.0224830241
0.2079123852 -0.1098803849 -0.0108317606
0.2063602034 -0.1155687277 -0.0217402587
0.1797837501 -0.1101611994 -0.0159146269
0.2626174737 -0.1150070986 -0.0115745261
0.3157703804 -0.1258221552 -0.0232257896
0.2079123852 -0.1098803849 -0.0108317606
0.2607466013 -0.1246330391 -0.0304560752
0.2610652919 -0.1206954414 -0.0224830241
0.3152923445 -0.1317285517 -0.0351853662
0.2639946137 -0.1067911848 -0.0066251355
0.2112771226 -0.0914363846 0.0016370697
0.2093770461 -0.1029282566 -0.0029028163
0.1830183006 -0.0952508565 0.0012282863
0.2658946902 -0.0952993129 -0.0020852495
0.3186121813 -0.1106541131 -0.0103474548
0.2112771226 -0.0914363846 0.0016370697
0.2639946137 -0.1067911848 -0.0066251355
0.3172350413 -0.1188700269 -0.0152968453
0.2626174737 -0.1150070986 -0.0115745261
0.2681414127 -0.0717256354 -0.0085235697
0.2671477131 -0.0851502475 -0.0060720247
0.2133505221 -0.0739036099 0.0006878527
0.3219386036 -0.0829722730 -0.0152834471
0.2133505221 -0.0739036099 0.0006878527
0.1869487764 -0.0615679851 0.0028420189
0.2143442217 -0.0604789979 -0.0017636923
0.2671477131 -0.0851502475 -0.0060720247
0.3201887310 -0.0998336444 -0.0100708994
0.3214417538 -0.0896845790 -0.0140576746
0.3479622628 -0.0970262775 -0.0160571119
0.2658946902 -0.0952993129 -0.0020852495
0.2128536723 -0.0806159159 0.0019136251
0.3201887310 -0.0998336444 -0.0100708994
0.2753112631 -0.0176162509 -0.0051325668
0.2183157546 -0.0190716958 -0.0023431189
0.1926794592 -0.0044805407 0.0032617179
0.2211772135 -0.0037528182 0.0018669940
0.2781727220 -0.0022973733 -0.0009224539
0.3323067716 -0.0161608060 -0.0079220147
0.2211772135 -0.0037528182 0.0018669940
0.2753112631 -0.0176162509 -0.0051325668
0.3314756707 -0.0248268872 -0.0135160410
0.2744801621 -0.0262823321 -0.0107265931
0.2788422848 0.0052733607 -0.0067728660
0.2241610292 0.0195550624 -0.0048531067
0.2229427243 0.0076919875 0.0010468444
0.1956020965 0.0148328384 0.0020067240
0.2800605897 0.0171364356 -0.0126728171
0.3347418452 0.0028547339 -0.0145925764
0.2241610292 0.0195550624 -0.0048531067
0.2788422848 0.0052733607 -0.0067728660
0.3347418452 0.0028547339 -0.0145925764
0.2781727220 -0.0022973733 -0.0009224539
0.2802708529 0.0215211706 -0.0214345882
0.2248753133 0.0276789674 -0.0121839678
0.2804343235 0.0250260211 -0.0301924676
0.2802708529 0.0215211706 -0.0214345882
0.3356663925 0.0153633739 -0.0306852086
0.2800605897 0.0171364356 -0.0126728171
0.2801773909 0.0219590742 -0.0398603361
0.2249920529 0.0314027697 -0.0301547211
0.1973489238 0.0328551171 -0.0373661191
0.2249415927 0.0281332694 -0.0422189266
0.2801269307 0.0186895739 -0.0519245416
0.3353627288 0.0125153788 -0.0495659511
0.2249163627 0.0264985192 -0.0482510294
0.2801773909 0.0219590742 -0.0398603361
0.3353627288 0.0125153788 -0.0495659511
0.2804343235 0.0250260211 -0.0301924676
0.2787203678 0.0080285265 -0.0566291796
0.2242130812 0.0211679955 -0.0506033484
0.1954242926 0.0147522081 -0.0545228492
0.2226779359 0.0081824736 -0.0575357648
0.2771852225 -0.0049569954 -0.0635615960
0.3332276544 -0.0051109425 -0.0626550108
0.2226779359 0.0081824736 -0.0575357648
0.2787203678 0.0080285265 -0.0566291796
0.3332276544 -0.0051109425 -0.0626550108
0.3618878606 -0.0010196296 -0.0609632885
0.3346342173 0.0055501049 -0.0579503728
0.2801269307 0.0186895739 -0.0519245416
0.2242130812 0.0211679955 -0.0506033484
0.3346342173 0.0055501049 -0.0579503728
0.2770393952 -0.0129533464 -0.0585914779
0.2207313767 -0.0144564321 -0.0551424200
0.2218374495 -0.0023084629 -0.0585169139
0.1936834403 -0.0030600057 -0.0567923850
0.2759333224 -0.0251013157 -0.0552169839
0.3322413408 -0.0235982300 -0.0586660418
0.2207313767 -0.0144564321 -0.0551424200
0.2770393952 -0.0129533464 -0.0585914779
0.3322413408 -0.0235982300 -0.0586660418
0.2771852225 -0.0049569954 -0.0635615960
0.2739478824 -0.0318648062 -0.0332055260
0.2750882519 -0.0281191492 -0.0457090923
0.2191856204 -0.0239121620 -0.0424494440
0.3298505140 -0.0360717934 -0.0364651743
0.2180452509 -0.0276578190 -0.0299458776
0.2191856204 -0.0239121620 -0.0424494440
0.1912343046 -0.0218086684 -0.0408196198
0.2759333224 -0.0251013157 -0.0552169839
0.2750882519 -0.0281191492 -0.0457090923
0.3308432339 -0.0326900482 -0.0474709033
0.2744801621 -0.0262823321 -0.0107265931
0.2748913488 -0.0277441777 -0.0242928723
0.2183113908 -0.0248665820 -0.0187064112
0.3310601202 -0.0291599278 -0.0163130542
0.2179002041 -0.0234047364 -0.0051401321
0.2183113908 -0.0248665820 -0.0187064112
0.1900214117 -0.0234277841 -0.0159131807
0.2748913488 -0.0277441777 -0.0242928723
0.3312657135 -0.0298908506 -0.0230961937
0.2739478824 -0.0318648062 -0.0332055260
-0.0380665809 0.0543165139 -0.0658779025
-0.0380665809 0.0543165139 -0.0658779025
-0.0357841307 0.0759352494 -0.0434707082
-0.0357841307 0.0759352494 -0.0434707082
-0.0377837108 0.0734979441 -0.0141340556
-0.0377837108 0.0734979441 -0.0141340556
-0.0382362212 0.0505403757 0.0079149373
-0.0382362212 0.0505403757 0.0079149373
-0.0437961826 0.0167054358 0.0169656474
-0.0437961826 0.0167054358 0.0169656474
-0.0572618443 -0.0256047265 0.0160798232
-0.0572618443 -0.0256047265 0.0160798232
-0.0599089165 -0.0625244404 0.0042874424
-0.0599089165 -0.0625244404 0.0042874424
-0.0646904667 -0.0835559582 -0.0150549411
-0.0646904667 -0.0835559582 -0.0150549411
-0.0640859918 -0.0837532966 -0.0429438151
-0.0640859918 -0.0837532966 -0.0429438151
-0.0577574884 -0.0633341337 -0.0674228787
-0.0577574884 -0.0633341337 -0.0674228787
-0.0420253577 -0.0289160163 -0.0820120744
-0.0420253577 -0.0289160163 -0.0820120744
-0.0685600810 -0.0228498213 -0.0816876465
-0.0524001275 -0.0495459663 -0.0768284854
-0.0434514274 0.0196915658 -0.0804172624
-0.0170045036 0.0145274892 -0.0797416145
-0.0369289213 0.0420835376 -0.0752264365
-0.0434514274 0.0196915658 -0.0804172624
-0.0847133433 0.0609615427 -0.0603949689
-0.0847133433 0.0609615427 -0.0603949689
-0.0847193923 0.0782818433 -0.0406742505
-0.0848469940 0.0777372873 -0.0144206782
-0.0864654588 0.0543994622 0.0061580770
-0.0864654588 0.0543994622 0.0061580770
-0.0900159558 0.0228779582 0.0172923609
-0.0900159558 0.0228779582 0.0172923609
-0.0971600886 -0.0171126853 0.0159551207
-0.0971600886 -0.0171126853 0.0159551207
-0.1034949008 -0.0517984888 0.0056479337
-0.1034949008 -0.0517984888 0.0056479337
-0.1105990175 -0.0736169142 -0.0371988946
-0.1061162327 -0.0528189302 -0.0593403866
-0.1061162327 -0.0528189302 -0.0593403866
-0.0985548008 -0.0177168096 -0.0745435348
-0.0685600810 -0.0228498213 -0.0816876465
-0.0881800309 0.0029131405 -0.0797271238
-0.0985548008 -0.0177168096 -0.0745435348
-0.0848001624 0.0233088289 -0.0727670433
-0.0607805781 0.0225138715 -0.0813866599
-0.0873954293 0.0480425716 -0.0672824678
-0.0848001624 0.0233088289 -0.0727670433
-0.1147948822 0.0284418406 -0.0656229316
-0.0881800309 0.0029131405 -0.0797271238
-0.4493524688 0.0098092553 -0.0395702676
-0.4657736135 0.0149896333 -0.0368130307
-0.4363163955 0.1100107970 -0.0384604648
-0.4450372519 0.1010357725 -0.0650548792
-0.4481891837 0.0700693854 -0.0801123689
-0.4035423927 0.0772585133 -0.0739518287
-0.4512947781 0.0566131057 -0.0781668412
-0.4112100511 0.0346850499 -0.0729437734
-0.4112100511 0.0346850499 -0.0729437734
-0.4566405368 0.0404783126 -0.0735250186
3 62 152 37
3 62 37 96
3 152 77 366
3 152 366 37
3 396 472 77
3 319 472 396
3 77 319 366
3 396 473 327
3 379 473 396
3 396 327 319
3 379 62 96
3 327 474 96
3 379 474 327
3 96 475 87
3 37 475 96
3 416 476 87
3 96 476 416
3 366 477 37
3 7 477 366
3 87 478 7
3 37 478 87
3 319 479 366
3 202 479 319
3 7 480 202
3 366 480 7
3 327 481 319
3 240 481 327
3 202 482 240
3 319 482 202
3 327 483 416
3 96 483 327
3 240 484 416
3 327 484 240
3 396 211 458
3 396 458 379
3 77 357 211
3 77 211 396
3 62 400 93
3 152 62 93
3 62 292 400
3 62 379 292
3 379 320 292
3 379 458 320
3 77 152 93
3 77 93 357
3 241 91 373
3 241 373 341
3 91 94 160
3 91 160 373
3 175 485 94
3 65 485 175
3 94 65 160
3 175 486 289
3 209 486 175
3 175 289 65
3 209 241 341
3 289 487 341
3 209 487 289
3 341 488 22
3 373 488 341
3 421 489 22
3 341 489 421
3 160 490 373
3 197 490 160
3 22 491 197
3 373 491 22
3 65 492 160
3 19 492 65
3 197 493 19
3 160 493 197
3 289 494 65
3 384 494 289
3 19 495 384
3 65 495 19
3 289 496 421
3 341 496 289
3 384 497 421
3 289 497 384
3 175 349 157
3 175 157 209
3 94 468 349
3 94 349 175
3 209 157 181
3 91 241 391
3 91 391 271
3 241 209 360
3 241 360 391
3 209 181 360
3 94 91 271
3 94 271 468
3 10 237 338
3 237 325 338
3 338 325 311
3 325 438 311
3 311 438 417
3 438 461 417
3 417 461 10
3 461 237 10
3 237 431 325
3 431 463 325
3 325 463 438
3 463 100 438
3 438 100 461
3 100 238 461
3 461 238 237
3 238 431 237
3 417 10 338
3 338 311 417
3 236 210 449
3 210 460 449
3 449 460 38
3 460 368 38
3 38 368 56
3 368 215 56
3 56 215 236
3 215 210 236
3 210 238 460
3 238 100 460
3 460 100 368
3 100 297 368
3 368 297 215
3 297 389 215
3 215 389 210
3 389 238 210
3 56 236 449
3 449 38 56
3 310 471 31
3 471 451 31
3 31 451 216
3 451 350 216
3 216 350 315
3 350 254 315
3 315 254 310
3 254 471 310
3 471 75 451
3 75 275 451
3 451 275 350
3 275 463 350
3 350 463 254
3 463 431 254
3 254 431 471
3 431 75 471
3 315 310 31
3 31 216 315
3 173 448 83
3 448 374 83
3 83 374 415
3 374 88 415
3 415 88 82
3 88 423 82
3 82 423 173
3 423 448 173
3 448 389 374
3 389 297 374
3 374 297 88
3 297 437 88
3 88 437 423
3 437 367 423
3 423 367 448
3 367 389 448
3 82 173 83
3 83 415 82
3 428 193 375
3 193 49 375
3 375 49 247
3 49 274 247
3 247 274 95
3 274 300 95
3 95 300 428
3 300 193 428
3 193 73 49
3 73 388 49
3 49 388 274
3 388 367 274
3 274 367 300
3 367 437 300
3 300 437 193
3 437 73 193
3 95 428 375
3 375 247 95
3 309 75 431
3 309 431 238
3 309 238 389
3 309 389 367
3 309 367 388
3 463 275 290
3 100 463 290
3 297 100 290
3 437 297 290
3 73 437 290
3 309 388 204
3 123 73 290
3 251 290 275
3 75 309 44
3 204 388 73
3 123 204 73
3 44 251 275
3 44 275 75
3 251 44 50
3 50 139 251
3 301 204 171
3 204 123 171
3 309 204 301
3 44 309 50
3 309 301 50
3 171 123 290
3 139 290 251
3 171 290 139
3 1 102 35
3 102 328 35
3 35 328 284
3 328 278 284
3 284 278 228
3 278 378 228
3 228 378 1
3 378 102 1
3 102 18 328
3 18 456 328
3 328 456 278
3 456 469 278
3 278 469 378
3 469 265 378
3 378 265 102
3 265 18 102
3 228 1 35
3 35 284 228
3 288 28 276
3 28 135 276
3 276 135 161
3 135 155 161
3 161 155 46
3 155 42 46
3 46 42 288
3 42 28 288
3 28 265 135
3 265 469 135
3 135 469 155
3 469 387 155
3 155 387 42
3 387 243 42
3 42 243 28
3 243 265 28
3 46 288 276
3 276 161 46
3 72 369 113
3 369 186 113
3 113 186 355
3 186 189 355
3 355 189 294
3 189 212 294
3 294 212 72
3 212 369 72
3 369 148 186
3 148 382 186
3 186 382 189
3 382 456 189
3 189 456 212
3 456 18 212
3 212 18 369
3 18 148 369
3 294 72 113
3 113 355 294
3 141 381 303
3 381 27 303
3 303 27 158
3 27 348 158
3 158 348 61
3 348 411 61
3 61 411 141
3 411 381 141
3 381 243 27
3 243 387 27
3 27 387 348
3 387 454 348
3 348 454 411
3 454 447 411
3 411 447 381
3 447 243 381
3 61 141 303
3 303 158 61
3 167 269 103
3 269 90 103
3 103 90 308
3 90 253 308
3 308 253 68
3 253 283 68
3 68 283 167
3 283 269 167
3 269 339 90
3 339 142 90
3 90 142 253
3 142 447 253
3 253 447 283
3 447 454 283
3 283 454 269
3 454 339 269
3 68 167 103
3 103 308 68
3 108 339 454
3 108 454 387
3 108 387 469
3 108 469 456
3 108 456 382
3 243 447 220
3 265 243 220
3 18 265 220
3 148 18 220
3 245 339 108
3 108 382 199
3 220 163 148
3 372 220 142
3 382 148 163
3 199 382 163
3 245 372 142
3 339 245 142
3 447 142 220
3 372 344 434
3 245 344 372
3 214 199 163
3 214 163 60
3 344 245 108
3 108 199 214
3 344 108 214
3 372 434 220
3 220 60 163
3 434 60 220
3 222 13 443
3 13 195 345
3 13 345 443
3 443 345 20
3 195 244 331
3 195 331 345
3 345 331 188
3 345 188 20
3 20 188 15
3 244 200 470
3 244 470 331
3 331 470 78
3 331 78 188
3 188 78 256
3 188 256 15
3 15 256 11
3 200 153 383
3 200 383 470
3 256 273 11
3 11 273 58
3 153 465 383
3 273 318 58
3 222 443 324
3 443 20 146
3 443 146 324
3 324 146 422
3 20 15 52
3 20 52 146
3 146 52 425
3 146 425 422
3 422 425 4
3 15 11 105
3 15 105 52
3 52 105 376
3 52 376 425
3 425 376 39
3 425 39 4
3 4 39 440
3 11 58 23
3 11 23 105
3 105 23 371
3 105 371 376
3 58 466 23
3 222 324 13
3 324 422 450
3 324 450 13
3 13 450 195
3 422 4 248
3 422 248 450
3 450 248 131
3 450 131 195
3 195 131 244
3 4 440 224
3 4 224 248
3 248 224 322
3 248 322 131
3 131 322 59
3 131 59 244
3 244 59 200
3 440 127 224
3 224 127 322
3 322 427 59
3 59 427 385
3 59 385 200
3 200 385 153
3 385 80 153
3 80 233 465
3 466 58 318
3 80 465 153
3 273 256 78
3 383 78 470
3 273 78 414
3 383 414 78
3 414 179 208
3 414 208 408
3 273 414 408
3 273 408 162
3 318 273 162
3 318 162 191
3 277 318 191
3 277 191 356
3 207 277 356
3 414 383 179
3 383 326 179
3 383 465 326
3 465 33 326
3 465 233 33
3 233 356 33
3 233 359 356
3 359 207 356
3 466 318 277
3 292 320 261
3 292 261 352
3 320 458 230
3 320 230 116
3 211 246 229
3 211 229 168
3 246 281 14
3 246 14 229
3 281 225 231
3 281 231 14
3 225 400 239
3 225 239 231
3 400 352 221
3 400 221 239
3 352 261 444
3 352 444 221
3 261 116 444
3 116 230 362
3 116 362 444
3 230 211 168
3 230 168 362
3 400 292 352
3 93 400 225
3 93 225 281
3 357 281 246
3 357 93 281
3 357 246 211
3 458 211 230
3 320 116 261
3 14 194 229
3 231 399 14
3 14 399 194
3 168 229 262
3 229 194 262
3 239 442 231
3 231 442 399
3 168 262 442
3 442 498 168
3 239 498 442
3 360 181 125
3 360 125 242
3 181 157 295
3 181 295 410
3 349 419 347
3 349 347 117
3 419 41 40
3 419 40 347
3 41 76 394
3 41 394 40
3 76 391 150
3 76 150 394
3 391 242 119
3 391 119 150
3 242 125 227
3 242 227 119
3 125 410 227
3 410 295 2
3 410 2 227
3 295 349 117
3 295 117 2
3 391 360 242
3 271 391 76
3 271 76 41
3 468 41 419
3 468 271 41
3 468 419 349
3 157 349 295
3 181 410 125
3 40 365 347
3 394 259 40
3 40 259 365
3 117 347 364
3 347 365 364
3 150 258 394
3 394 258 259
3 117 364 258
3 258 499 117
3 150 499 258
3 217 500 118
3 97 500 217
3 176 501 97
3 118 501 176
3 118 502 436
3 176 502 118
3 176 432 436
3 432 503 436
3 179 503 432
3 504 505 436
3 114 505 504
3 504 506 326
3 436 506 504
3 179 507 436
3 326 507 179
3 508 509 54
3 178 509 508
3 54 510 508
3 144 510 54
3 511 512 5
3 144 512 511
3 178 513 5
3 511 513 178
3 8 178 5
3 5 514 8
3 401 514 5
3 55 47 178
3 178 8 55
3 55 515 429
3 8 515 55
3 36 517 516
3 429 517 36
3 516 518 8
3 429 518 516
3 85 429 36
3 36 164 85
3 33 85 164
3 164 326 33
3 519 520 430
3 334 520 519
3 430 521 519
3 203 521 430
3 523 524 522
3 48 524 523
3 523 525 203
3 522 525 523
3 526 527 522
3 334 527 526
3 526 528 48
3 522 528 526
3 334 529 412
3 48 529 334
3 330 530 48
3 412 530 330
3 532 533 531
3 412 533 532
3 532 534 386
3 531 534 532
3 535 536 531
3 330 536 535
3 535 537 412
3 531 537 535
3 539 540 538
3 170 540 539
3 539 541 330
3 538 541 539
3 542 543 538
3 386 543 542
3 542 544 170
3 538 544 542
3 170 545 342
3 429 545 170
3 85 546 429
3 342 546 85
3 342 547 356
3 85 547 342
3 85 33 356
3 342 548 63
3 356 548 342
3 549 550 70
3 101 550 549
3 70 551 549
3 430 551 70
3 552 553 334
3 430 553 552
3 334 554 552
3 101 554 334
3 405 555 446
3 70 555 405
3 556 557 101
3 70 557 556
3 446 558 101
3 556 558 446
3 191 370 63
3 63 356 191
3 370 191 162
3 559 560 260
3 418 560 559
3 138 561 260
3 559 561 138
3 99 563 562
3 418 563 99
3 562 564 138
3 418 564 562
3 218 99 446
3 446 249 218
3 439 418 99
3 99 218 439
3 218 565 467
3 249 565 218
3 467 566 321
3 249 566 467
3 296 467 321
3 321 159 296
3 567 568 296
3 162 568 567
3 567 569 159
3 296 569 567
3 363 570 408
3 296 570 363
3 408 571 162
3 296 571 408
3 363 572 24
3 208 572 363
3 223 573 208
3 24 573 223
3 574 575 24
3 439 575 574
3 574 576 223
3 24 576 574
3 577 578 192
3 223 578 577
3 577 579 439
3 192 579 577
3 432 580 208
3 176 580 432
3 581 582 223
3 176 582 581
3 581 583 208
3 223 583 581
3 584 585 176
3 223 585 584
3 584 586 97
3 176 586 584
3 587 588 192
3 97 588 587
3 587 589 223
3 192 589 587
3 408 590 363
3 208 590 408
3 179 591 208
3 432 591 179
3 114 164 36
3 159 12 370
3 104 121 21
3 104 21 9
3 121 435 406
3 121 406 21
3 435 129 151
3 435 151 406
3 129 317 266
3 129 266 151
3 317 104 9
3 317 9 266
3 9 592 264
3 21 592 9
3 593 594 264
3 9 594 593
3 593 595 12
3 264 595 593
3 596 597 406
3 21 597 596
3 596 598 249
3 406 598 596
3 599 600 264
3 249 600 599
3 599 601 21
3 264 601 599
3 406 602 321
3 151 602 406
3 249 603 321
3 406 603 249
3 266 605 151
3 604 605 266
3 604 606 159
3 266 606 604
3 321 608 159
3 607 608 321
3 607 609 151
3 321 609 607
3 9 611 266
3 610 611 9
3 610 612 12
3 9 612 610
3 613 614 12
3 266 614 613
3 12 615 613
3 159 615 12
3 321 616 249
3 159 616 321
3 617 618 159
3 249 618 617
3 12 619 159
3 617 619 12
3 620 621 264
3 12 621 620
3 620 622 249
3 264 622 620
3 340 623 114
3 401 623 340
3 36 625 624
3 114 625 36
3 624 626 401
3 114 626 624
3 628 629 627
3 8 629 628
3 628 630 401
3 627 630 628
3 631 632 627
3 36 632 631
3 631 633 8
3 627 633 631
3 8 634 36
3 115 634 8
3 636 637 115
3 635 637 636
3 143 638 115
3 636 638 143
3 639 640 635
3 36 640 639
3 639 641 143
3 635 641 639
3 643 644 642
3 401 644 643
3 643 645 8
3 642 645 643
3 646 647 642
3 106 647 646
3 646 648 401
3 642 648 646
3 115 650 106
3 649 650 115
3 649 651 8
3 115 651 649
3 401 652 149
3 340 652 401
3 149 653 401
3 106 653 149
3 654 656 340
3 655 656 654
3 655 657 306
3 654 657 655
3 658 659 340
3 654 659 658
3 658 660 114
3 340 660 658
3 149 662 306
3 661 662 149
3 661 663 340
3 149 663 661
3 36 665 114
3 664 665 36
3 664 666 143
3 36 666 664
3 668 669 143
3 667 669 668
3 306 670 143
3 668 670 306
3 671 672 667
3 114 672 671
3 671 673 306
3 667 673 671
3 143 115 462
3 143 462 424
3 115 106 196
3 462 674 196
3 115 674 462
3 106 149 282
3 106 282 196
3 149 306 407
3 149 407 282
3 306 143 424
3 306 424 407
3 467 439 218
3 24 675 467
3 439 675 24
3 363 24 296
3 296 24 467
3 418 676 420
3 439 676 418
3 192 677 439
3 420 677 192
3 260 679 299
3 678 679 260
3 678 680 418
3 260 680 678
3 420 682 418
3 681 682 420
3 681 683 299
3 420 683 681
3 684 685 337
3 198 685 684
3 337 686 684
3 299 686 337
3 687 688 420
3 299 688 687
3 687 689 198
3 420 689 687
3 132 691 690
3 337 691 132
3 690 692 198
3 337 692 690
3 693 694 198
3 132 694 693
3 395 695 198
3 693 695 395
3 198 696 97
3 420 696 198
3 192 697 420
3 97 697 192
3 97 395 198
3 97 217 395
3 436 340 118
3 340 698 114
3 436 698 340
3 217 5 395
3 217 401 5
3 118 401 217
3 118 699 401
3 340 699 118
3 700 701 395
3 144 701 700
3 5 702 395
3 700 702 5
3 358 704 203
3 703 704 358
3 703 705 47
3 358 705 703
3 707 708 706
3 48 708 707
3 707 709 47
3 706 709 707
3 710 711 706
3 203 711 710
3 710 712 48
3 706 712 710
3 54 714 358
3 713 714 54
3 713 715 178
3 54 715 713
3 47 717 178
3 716 717 47
3 716 718 358
3 47 718 716
3 330 719 55
3 48 719 330
3 47 720 48
3 55 720 47
3 722 723 721
3 170 723 722
3 722 724 429
3 721 724 722
3 725 726 721
3 330 726 725
3 725 727 170
3 721 727 725
3 729 730 728
3 55 730 729
3 729 731 330
3 728 731 729
3 732 733 728
3 429 733 732
3 732 734 55
3 728 734 732
3 170 735 386
3 342 735 170
3 63 736 342
3 386 736 63
3 63 12 386
3 63 370 12
3 412 101 334
3 412 264 101
3 386 264 412
3 386 737 264
3 12 737 386
3 132 739 144
3 738 739 132
3 738 740 395
3 132 740 738
3 264 446 101
3 446 741 249
3 264 741 446
3 742 743 138
3 99 743 742
3 138 744 742
3 405 744 138
3 745 746 446
3 405 746 745
3 99 747 446
3 745 747 99
3 326 164 114
3 162 159 370
3 462 749 424
3 748 749 462
3 748 750 441
3 462 750 748
3 751 752 441
3 424 752 751
3 145 753 441
3 751 753 145
3 755 756 196
3 462 756 755
3 755 757 754
3 196 757 755
3 758 759 754
3 270 759 758
3 758 760 196
3 754 760 758
3 441 762 270
3 761 762 441
3 761 763 462
3 441 763 761
3 282 765 196
3 764 765 282
3 764 766 267
3 282 766 764
3 270 767 267
3 196 767 270
3 768 769 282
3 302 769 768
3 407 770 282
3 768 770 407
3 302 772 771
3 267 772 302
3 771 773 282
3 267 773 771
3 774 775 407
3 145 775 774
3 424 776 407
3 774 776 424
3 777 778 145
3 407 778 777
3 145 779 777
3 302 779 145
3 433 780 316
3 121 780 433
3 781 782 121
3 316 782 781
3 121 783 781
3 104 783 121
3 433 785 784
3 312 785 433
3 784 786 435
3 312 786 784
3 435 788 787
3 121 788 435
3 787 789 433
3 121 789 787
3 312 790 129
3 165 790 312
3 435 791 129
3 312 791 435
3 165 793 792
3 154 793 165
3 792 794 317
3 154 794 792
3 129 796 317
3 795 796 129
3 795 797 165
3 129 797 795
3 316 799 154
3 798 799 316
3 798 800 104
3 316 800 798
3 317 802 104
3 801 802 317
3 801 803 154
3 317 803 801
3 805 806 25
3 147 806 805
3 805 807 804
3 25 807 805
3 808 809 804
3 272 809 808
3 804 810 808
3 25 810 804
3 812 813 272
3 811 813 812
3 226 814 272
3 812 814 226
3 815 816 811
3 147 816 815
3 815 817 226
3 811 817 815
3 818 820 25
3 819 820 818
3 819 821 111
3 818 821 819
3 822 823 25
3 818 823 822
3 822 824 413
3 25 824 822
3 111 826 825
3 272 826 111
3 825 827 25
3 272 827 825
3 413 830 829
3 336 830 413
3 829 831 828
3 336 831 829
3 832 833 828
3 329 833 832
3 832 834 336
3 828 834 832
3 329 837 836
3 111 837 329
3 836 838 835
3 111 838 836
3 839 840 835
3 413 840 839
3 839 841 111
3 835 841 839
3 843 844 842
3 336 844 843
3 843 845 285
3 842 845 843
3 336 847 846
3 30 847 336
3 846 848 842
3 30 848 846
3 329 850 285
3 849 850 329
3 849 851 336
3 329 851 849
3 30 854 853
3 169 854 30
3 853 855 852
3 169 855 853
3 856 857 852
3 206 857 856
3 856 858 169
3 852 858 856
3 285 860 206
3 859 860 285
3 859 861 30
3 285 861 859
3 169 864 863
3 205 864 169
3 863 865 862
3 205 865 863
3 866 867 862
3 250 867 866
3 866 868 205
3 862 868 866
3 206 870 250
3 869 870 206
3 869 871 169
3 206 871 869
3 205 874 873
3 45 874 205
3 873 875 872
3 45 875 873
3 876 877 872
3 291 877 876
3 876 878 45
3 872 878 876
3 250 880 291
3 879 880 250
3 879 881 205
3 250 881 879
3 883 884 882
3 45 884 883
3 883 885 226
3 882 885 883
3 886 887 45
3 882 887 886
3 147 888 45
3 886 888 147
3 226 891 890
3 291 891 226
3 890 892 889
3 291 892 890
3 893 894 889
3 45 894 893
3 893 895 291
3 889 895 893
3 897 898 455
3 147 898 897
3 897 899 896
3 455 899 897
3 900 901 896
3 213 901 900
3 896 902 900
3 455 902 896
3 904 905 213
3 903 905 904
3 343 906 213
3 904 906 343
3 907 908 903
3 147 908 907
3 907 909 343
3 903 909 907
3 455 912 911
3 392 912 455
3 911 913 910
3 392 913 911
3 914 915 910
3 74 915 914
3 914 916 392
3 910 916 914
3 213 918 74
3 917 918 213
3 917 919 455
3 213 919 917
3 921 922 920
3 392 922 921
3 921 923 426
3 920 923 921
3 392 925 924
3 351 925 392
3 924 926 920
3 351 926 924
3 74 928 426
3 927 928 74
3 927 929 392
3 74 929 927
3 351 932 931
3 182 932 351
3 931 933 930
3 182 933 931
3 934 935 930
3 452 935 934
3 930 936 934
3 182 936 930
3 426 938 452
3 937 938 426
3 937 939 351
3 426 939 937
3 182 942 941
3 112 942 182
3 941 943 940
3 112 943 941
3 944 945 940
3 51 945 944
3 944 946 112
3 940 946 944
3 51 949 948
3 452 949 51
3 948 950 947
3 452 950 948
3 951 952 947
3 182 952 951
3 947 953 951
3 452 953 947
3 955 956 954
3 112 956 955
3 955 957 66
3 954 957 955
3 958 959 112
3 954 959 958
3 413 960 112
3 958 960 413
3 66 962 961
3 51 962 66
3 961 963 112
3 51 963 961
3 965 966 25
3 413 966 965
3 965 967 964
3 25 967 965
3 968 969 964
3 280 969 968
3 964 970 968
3 25 970 964
3 972 973 280
3 971 973 972
3 66 974 280
3 972 974 66
3 975 976 971
3 413 976 975
3 975 977 66
3 971 977 975
3 978 980 25
3 979 980 978
3 979 981 343
3 978 981 979
3 982 983 25
3 978 983 982
3 982 984 147
3 25 984 982
3 985 986 343
3 25 986 985
3 280 987 343
3 985 987 280
3 226 272 235
3 226 235 187
3 272 111 279
3 272 279 235
3 111 329 69
3 111 69 279
3 329 285 234
3 329 234 69
3 285 206 43
3 285 43 234
3 206 250 67
3 206 67 43
3 250 291 332
3 250 332 67
3 291 226 187
3 291 187 332
3 343 213 252
3 343 252 53
3 213 74 185
3 213 185 252
3 74 426 6
3 74 6 185
3 426 452 307
3 426 307 6
3 452 51 393
3 452 393 307
3 51 66 354
3 51 354 393
3 66 280 390
3 66 390 354
3 280 343 53
3 280 53 390
3 187 990 989
3 235 990 187
3 989 991 988
3 235 991 989
3 992 993 988
3 84 993 992
3 992 994 235
3 988 994 992
3 353 996 84
3 995 996 353
3 995 997 187
3 353 997 995
3 999 1000 235
3 998 1000 999
3 279 1001 235
3 999 1001 279
3 1002 1003 998
3 335 1003 1002
3 1002 1004 279
3 998 1004 1002
3 84 1006 335
3 1005 1006 84
3 1005 1007 235
3 84 1007 1005
3 279 1010 1009
3 69 1010 279
3 1009 1011 1008
3 69 1011 1009
3 1012 1013 1008
3 71 1013 1012
3 1012 1014 69
3 1008 1014 1012
3 71 1017 1016
3 335 1017 71
3 1016 1018 1015
3 335 1018 1016
3 1019 1020 1015
3 279 1020 1019
3 1019 1021 335
3 1015 1021 1019
3 1023 1024 69
3 1022 1024 1023
3 234 1025 69
3 1023 1025 234
3 1026 1027 1022
3 64 1027 1026
3 1026 1028 234
3 1022 1028 1026
3 1030 1031 1029
3 64 1031 1030
3 1030 1032 69
3 1029 1032 1030
3 64 1034 1033
3 71 1034 64
3 1033 1035 1029
3 71 1035 1033
3 1037 1038 234
3 1036 1038 1037
3 43 1039 234
3 1037 1039 43
3 1040 1041 1036
3 404 1041 1040
3 1040 1042 43
3 1036 1042 1040
3 404 1044 1043
3 64 1044 404
3 1043 1045 234
3 64 1045 1043
3 1047 1048 43
3 1046 1048 1047
3 67 1049 43
3 1047 1049 67
3 1050 1051 1046
3 89 1051 1050
3 1050 1052 67
3 1046 1052 1050
3 1053 1054 89
3 43 1054 1053
3 89 1055 1053
3 404 1055 89
3 1057 1058 67
3 1056 1058 1057
3 332 1059 67
3 1057 1059 332
3 1060 1061 1056
3 314 1061 1060
3 1060 1062 332
3 1056 1062 1060
3 314 1064 1063
3 89 1064 314
3 1063 1065 67
3 89 1065 1063
3 1067 1068 1066
3 332 1068 1067
3 1067 1069 353
3 1066 1069 1067
3 332 1071 1070
3 187 1071 332
3 1070 1072 1066
3 187 1072 1070
3 1074 1075 353
3 1073 1075 1074
3 314 1076 353
3 1074 1076 314
3 1077 1078 1073
3 332 1078 1077
3 1077 1079 314
3 1073 1079 1077
3 53 1082 1081
3 252 1082 53
3 1081 1083 1080
3 252 1083 1081
3 1084 1085 1080
3 122 1085 1084
3 1084 1086 252
3 1080 1086 1084
3 122 1088 1087
3 0 1088 122
3 1087 1089 53
3 0 1089 1087
3 1091 1092 252
3 1090 1092 1091
3 185 1093 252
3 1091 1093 185
3 1094 1095 1090
3 166 1095 1094
3 1094 1096 185
3 1090 1096 1094
3 122 1098 166
3 1097 1098 122
3 1097 1099 252
3 122 1099 1097
3 6 1101 185
3 1100 1101 6
3 1100 1102 126
3 6 1102 1100
3 166 1104 126
3 1103 1104 166
3 1103 1105 185
3 166 1105 1103
3 6 1108 1107
3 307 1108 6
3 1107 1109 1106
3 307 1109 1107
3 1110 1111 1106
3 17 1111 1110
3 1106 1112 1110
3 307 1112 1106
3 126 1114 17
3 1113 1114 126
3 1113 1115 6
3 126 1115 1113
3 307 1118 1117
3 393 1118 307
3 1117 1119 1116
3 393 1119 1117
3 1120 1121 1116
3 120 1121 1120
3 1120 1122 393
3 1116 1122 1120
3 120 1125 1124
3 17 1125 120
3 1124 1126 1123
3 17 1126 1124
3 1127 1128 1123
3 307 1128 1127
3 1127 1129 17
3 1123 1129 1127
3 1131 1132 393
3 1130 1132 1131
3 354 1133 393
3 1131 1133 354
3 1134 1135 1130
3 323 1135 1134
3 1134 1136 354
3 1130 1136 1134
3 120 1138 323
3 1137 1138 120
3 1137 1139 393
3 120 1139 1137
3 1141 1142 1140
3 354 1142 1141
3 1141 1143 286
3 1140 1143 1141
3 1144 1145 354
3 1140 1145 1144
3 390 1146 354
3 1144 1146 390
3 1147 1148 286
3 354 1148 1147
3 323 1149 286
3 1147 1149 323
3 1151 1152 1150
3 390 1152 1151
3 1151 1153 0
3 1150 1153 1151
3 1154 1155 390
3 1150 1155 1154
3 53 1156 390
3 1154 1156 53
3 286 1158 0
3 1157 1158 286
3 1157 1159 390
3 286 1159 1157
3 182 1160 112
3 81 1160 182
3 305 1161 81
3 112 1161 305
3 351 1162 182
3 16 1162 351
3 81 1163 16
3 182 1163 81
3 392 1164 351
3 201 1164 392
3 16 1165 201
3 351 1165 16
3 455 1166 392
3 333 1166 455
3 201 1167 333
3 392 1167 201
3 147 1168 455
3 29 1168 147
3 333 1169 29
3 455 1169 333
3 45 1170 147
3 457 1170 45
3 29 1171 457
3 147 1171 29
3 205 1172 45
3 263 1172 205
3 457 1173 263
3 45 1173 457
3 169 1174 205
3 86 1174 169
3 263 1175 86
3 205 1175 263
3 30 1176 169
3 287 1176 30
3 86 1177 287
3 169 1177 86
3 336 1178 30
3 79 1178 336
3 287 1179 79
3 30 1179 287
3 413 1180 336
3 183 1180 413
3 1181 1182 79
3 183 1182 1181
3 1181 1183 336
3 79 1183 1181
3 1184 1185 112
3 413 1185 1184
3 1184 1186 305
3 112 1186 1184
3 183 1187 305
3 413 1187 183
3 81 1188 305
3 110 1188 81
3 219 1189 110
3 305 1189 219
3 16 1190 81
3 177 1190 16
3 81 177 110
3 201 1191 16
3 134 1191 201
3 16 134 177
3 333 1192 201
3 232 1192 333
3 134 1193 232
3 201 1193 134
3 29 1194 333
3 133 1194 29
3 232 1195 133
3 333 1195 232
3 457 1196 29
3 174 1196 457
3 133 1197 174
3 29 1197 133
3 263 1198 457
3 346 1198 263
3 174 1199 346
3 457 1199 174
3 263 86 268
3 263 268 346
3 287 1200 86
3 293 1200 287
3 86 293 268
3 79 1201 287
3 397 1201 79
3 293 1202 397
3 287 1202 293
3 1203 1204 183
3 79 1204 1203
3 1203 1205 402
3 183 1205 1203
3 397 1206 402
3 79 1206 397
3 1207 1208 305
3 183 1208 1207
3 1207 1209 219
3 305 1209 1207
3 1210 1211 402
3 219 1211 1210
3 1210 1212 183
3 402 1212 1210
3 219 110 54
3 219 54 358
3 110 177 144
3 110 144 54
3 177 134 132
3 177 132 144
3 134 232 337
3 134 337 132
3 232 133 299
3 232 299 337
3 133 174 260
3 133 260 299
3 174 346 138
3 174 138 260
3 346 268 405
3 346 405 138
3 268 293 70
3 268 70 405
3 293 397 430
3 293 430 70
3 397 402 203
3 397 203 430
3 402 219 358
3 402 358 203
3 57 137 190
3 34 180 445
3 34 445 137
3 137 445 92
3 137 92 190
3 190 92 98
3 304 109 26
3 304 26 180
3 130 1213 26
3 180 1213 130
3 445 1214 130
3 180 1214 445
3 445 130 313
3 445 313 92
3 92 313 398
3 92 398 98
3 57 190 403
3 190 98 128
3 190 128 403
3 403 128 257
3 403 257 140
3 140 257 172
3 98 32 128
3 128 32 409
3 128 409 257
3 257 409 453
3 257 453 172
3 453 1215 172
3 361 1215 453
3 172 361 156
3 156 361 124
3 124 361 459
3 361 453 184
3 361 184 459
3 459 184 464
3 453 409 3
3 3 1216 453
3 184 1216 3
3 184 1217 298
3 3 1217 184
3 298 1218 184
3 464 1218 298
3 464 298 107
3 409 32 255
3 409 255 3
3 3 255 136
3 3 136 298
3 377 1219 136
3 298 1219 377
3 298 1220 107
3 377 1220 298
3 380 1221 377
3 107 1221 380
3 32 398 255
3 255 398 313
3 255 313 136
3 136 313 130
3 130 1222 136
3 377 1222 130
3 377 130 26
3 377 26 380
3 380 26 109
3 32 98 398
3 403 127 440
3 403 440 57
3 57 440 39
3 57 39 137
3 137 39 376
3 34 137 376
3 34 376 371
3 34 371 180
3 180 371 23
3 180 23 304
3 304 23 466
3 304 466 109
3 109 466 277
3 109 277 380
3 403 140 127
3 140 322 127
3 140 172 427
3 140 427 322
3 172 156 385
3 172 385 427
3 156 124 80
3 156 80 385
3 124 459 233
3 124 233 80
3 277 107 380
3 233 459 464