OFF
1144 1152 0
0.2523526659 -0.2523497073 -0.2523503359
0.2523516219 0.3785250381 -0.2523500918
0.2523528748 -0.3785242354 -0.2523503847
0.2523518307 0.2523505100 -0.2523501406
-0.3785220795 -0.2523507514 -0.2523498203
-0.3785231235 0.3785239940 -0.2523495762
-0.3785218707 -0.3785252794 -0.2523498691
-0.3785229147 0.2523494660 -0.2523496250
-0.3995558238 0.3995523780 -0.3364652012
-0.3995545014 -0.3995536679 -0.3364655103
-0.3995557551 0.3995523455 -0.2523495509
-0.3995544326 -0.3995537005 -0.2523498601
-0.3595994930 -0.2712719692 0.3364660246
-0.3595993468 -0.3595991915 0.3364659904
-0.3596005371 0.3596017236 0.3364661634
-0.3596003909 0.2712745013 0.3364661292
0.3785271940 -0.2523494985 -0.2523504390
0.3785261499 0.3785252469 -0.2523501949
0.3785274028 -0.3785240265 -0.2523504878
0.3785263587 0.2523507189 -0.2523502437
-0.4999983451 -0.4999978947 -0.2944076420
-0.5000000000 0.4999962398 -0.2944072551
-0.2523475514 -0.2523505426 -0.2523499234
-0.2523485955 0.3785242028 -0.2523496793
-0.2523473426 -0.3785250706 -0.2523499722
-0.2523483867 0.2523496748 -0.2523497282
-0.2712722708 -0.2712718230 0.3364659524
-0.2712721246 -0.3595990453 0.3364659182
-0.2712733148 0.3596018697 0.3364660912
-0.2712731687 0.2712746475 0.3364660570
0.2712741998 -0.2712709251 0.3364655090
0.2712743459 -0.3595981474 0.3364654748
0.2712731557 0.3596027676 0.3364656478
0.2712733019 0.2712755454 0.3364656136
0.5000000000 -0.4999962398 -0.2944084592
0.4999983451 0.4999978947 -0.2944080723
0.3596014220 -0.2712707790 0.3364654368
0.3596015682 -0.3595980012 0.3364654026
0.3596003779 0.3596029138 0.3364655756
0.3596005241 0.2712756916 0.3364655415
0.3995544326 0.3995537005 -0.3364658542
0.3995557551 -0.3995523455 -0.3364661634
0.3995545014 0.3995536679 -0.2523502039
0.3995558238 -0.3995523780 -0.2523505131
-0.0000000344 0.0000000163 -0.3364656823
0.0000006269 -0.3995530067 -0.3364658369
0.1997778604 -0.1997761646 -0.3364659228
-0.1997772679 -0.1997768258 -0.3364655963
0.3995550939 0.0000006775 -0.3364660088
0.1997771991 0.1997768584 -0.3364657682
0.1997778604 -0.1997761646 -0.3364659228
-0.0000000344 0.0000000163 -0.3364656823
-0.0000006956 0.3995530392 -0.3364655277
-0.1997779291 0.1997761971 -0.3364654417
0.1997771991 0.1997768584 -0.3364657682
-0.3995551626 -0.0000006450 -0.3364653558
-0.1997772679 -0.1997768258 -0.3364655963
-0.1997779291 0.1997761971 -0.3364654417
0.0000000344 -0.0000000163 -0.2523500320
0.3995551626 0.0000006450 -0.2523503585
0.1997779291 -0.1997761971 -0.2523502726
0.1997772679 0.1997768258 -0.2523501180
0.0000006956 -0.3995530392 -0.2523501866
-0.1997771991 -0.1997768584 -0.2523499460
0.1997779291 -0.1997761971 -0.2523502726
0.0000000344 -0.0000000163 -0.2523500320
-0.3995550939 -0.0000006775 -0.2523497055
-0.1997778604 0.1997761646 -0.2523497915
-0.1997771991 -0.1997768584 -0.2523499460
-0.0000006269 0.3995530067 -0.2523498774
0.1997772679 0.1997768258 -0.2523501180
-0.1997778604 0.1997761646 -0.2523497915
0.0000002963 -0.1997764952 -0.3364657596
0.1997781910 -0.3995526761 -0.3364660001
-0.1997769372 -0.3995533373 -0.3364656736
0.0000002963 -0.1997764952 -0.3364657596
0.1997775297 0.0000003469 -0.3364658455
0.3995547632 0.1997771890 -0.3364659315
0.3995554245 -0.1997758340 -0.3364660861
0.1997775297 0.0000003469 -0.3364658455
-0.0000003650 0.1997765278 -0.3364656050
-0.1997782597 0.3995527086 -0.3364653644
0.1997768685 0.3995533699 -0.3364656909
-0.0000003650 0.1997765278 -0.3364656050
-0.1997775985 -0.0000003144 -0.3364655190
-0.3995548320 -0.1997771565 -0.3364654330
-0.3995554932 0.1997758665 -0.3364652785
-0.1997775985 -0.0000003144 -0.3364655190
-0.4497772507 0.0502212859 -0.3154363827
-0.4999991725 -0.0000008275 -0.2944074485
0.0502212606 0.4497751364 -0.3154366367
-0.0000008275 0.4999970673 -0.2944076637
0.4497772163 -0.0502212697 -0.3154371567
0.4999991725 0.0000008275 -0.2944082657
-0.0502212950 -0.4497751201 -0.3154369027
0.0000008275 -0.4999970673 -0.2944080506
-0.4999991725 -0.0000008275 -0.2944074485
-0.4497770501 -0.0502227746 -0.2733785964
-0.0000008275 0.4999970673 -0.2944076637
-0.0502227493 0.4497749539 -0.2733787295
0.4999991725 0.0000008275 -0.2944082657
0.4497770845 0.0502227584 -0.2733792927
0.0000008275 -0.4999970673 -0.2944080506
0.0502227837 -0.4497749701 -0.2733791596
0.1997775985 0.0000003144 -0.2523501953
0.3995554932 -0.1997758665 -0.2523504358
0.3995548320 0.1997771565 -0.2523502812
0.1997775985 0.0000003144 -0.2523501953
0.0000003650 -0.1997765278 -0.2523501093
-0.1997768685 -0.3995533699 -0.2523500233
0.1997782597 -0.3995527086 -0.2523503499
0.0000003650 -0.1997765278 -0.2523501093
-0.1997775297 -0.0000003469 -0.2523498687
-0.3995554245 0.1997758340 -0.2523496282
-0.3995547632 -0.1997771890 -0.2523497828
-0.1997775297 -0.0000003469 -0.2523498687
-0.0000002963 0.1997764952 -0.2523499547
0.1997769372 0.3995533373 -0.2523500407
-0.1997781910 0.3995526761 -0.2523497142
-0.0000002963 0.1997764952 -0.2523499547
-0.4999987588 -0.2499993611 -0.2944075453
-0.4497772507 0.0502212859 -0.3154363827
-0.2500004137 0.4999966535 -0.2944074594
0.0502212606 0.4497751364 -0.3154366367
0.4999987588 0.2499993611 -0.2944081690
0.4497772163 -0.0502212697 -0.3154371567
0.2500004137 -0.4999966535 -0.2944082549
-0.0502212950 -0.4497751201 -0.3154369027
-0.4999995863 0.2499977062 -0.2944073518
-0.4497770501 -0.0502227746 -0.2733785964
0.2499987588 0.4999974810 -0.2944078680
-0.0502227493 0.4497749539 -0.2733787295
0.4999995863 -0.2499977062 -0.2944083625
0.4497770845 0.0502227584 -0.2733792927
-0.2499987588 -0.4999974810 -0.2944078463
0.0502227837 -0.4497749701 -0.2733791596
-0.3690617259 0.3059755948 0.0420582692
-0.3690617259 0.3059755948 0.0420582692
-0.3248982192 0.3690629319 0.0420582575
-0.3248982192 0.3690629319 0.0420582575
-0.2618108821 0.3248994252 0.0420581888
-0.2618108821 0.3248994252 0.0420581888
-0.3059743888 0.2618120881 0.0420582005
-0.3059743888 0.2618120881 0.0420582005
-0.3690606818 -0.3248986243 0.0420580777
-0.3690606818 -0.3248986243 0.0420580777
-0.3248971751 -0.2618112872 0.0420580660
-0.3248971751 -0.2618112872 0.0420580660
-0.2618098380 -0.3059747939 0.0420579974
-0.2618098380 -0.3059747939 0.0420579974
-0.3059733447 -0.3690621310 0.0420580091
-0.3059733447 -0.3690621310 0.0420580091
0.2618135373 -0.3248975803 0.0420575622
0.2618135373 -0.3248975803 0.0420575622
0.3059770440 -0.2618102432 0.0420575505
0.3059770440 -0.2618102432 0.0420575505
0.3690643811 -0.3059737499 0.0420574818
0.3690643811 -0.3059737499 0.0420574818
0.3249008744 -0.3690610870 0.0420574935
0.3249008744 -0.3690610870 0.0420574935
0.2618124932 0.3059766388 0.0420577536
0.2618124932 0.3059766388 0.0420577536
0.3059759999 0.3690639759 0.0420577419
0.3059759999 0.3690639759 0.0420577419
0.3690633370 0.3249004692 0.0420576733
0.3690633370 0.3249004692 0.0420576733
0.3248998303 0.2618131321 0.0420576850
0.3248998303 0.2618131321 0.0420576850
0.0998892436 -0.2996645856 -0.3364658798
0.0998889130 -0.0998880742 -0.3364658025
0.2996668077 -0.2996642550 -0.3364660431
0.0998892436 -0.2996645856 -0.3364658798
-0.0998883205 -0.2996649163 -0.3364657166
-0.2996658846 -0.2996652469 -0.3364655533
-0.0998886511 -0.0998884048 -0.3364656393
-0.0998883205 -0.2996649163 -0.3364657166
0.2996661465 0.0998887679 -0.3364658885
0.0998885824 0.0998884373 -0.3364657253
0.2996658159 0.2996652794 -0.3364658112
0.2996661465 0.0998887679 -0.3364658885
0.2996664771 -0.0998877435 -0.3364659658
0.2996668077 -0.2996642550 -0.3364660431
0.0998889130 -0.0998880742 -0.3364658025
0.2996664771 -0.0998877435 -0.3364659658
-0.0998893124 0.2996646182 -0.3364654847
-0.0998889817 0.0998881067 -0.3364655620
-0.2996668765 0.2996642876 -0.3364653214
-0.0998893124 0.2996646182 -0.3364654847
0.0998882518 0.2996649488 -0.3364656480
0.2996658159 0.2996652794 -0.3364658112
0.0998885824 0.0998884373 -0.3364657253
0.0998882518 0.2996649488 -0.3364656480
-0.2996662152 -0.0998887354 -0.3364654760
-0.0998886511 -0.0998884048 -0.3364656393
-0.2996658846 -0.2996652469 -0.3364655533
-0.2996662152 -0.0998887354 -0.3364654760
-0.2996665459 0.0998877761 -0.3364653987
-0.2996668765 0.2996642876 -0.3364653214
-0.0998889817 0.0998881067 -0.3364655620
-0.2996665459 0.0998877761 -0.3364653987
-0.3995551626 -0.0000006450 -0.3364653558
-0.4748886253 0.2751087629 -0.3049218189
-0.0000006956 0.3995530392 -0.3364655277
0.2751098028 0.4748865156 -0.3049223545
0.3995550939 0.0000006775 -0.3364660088
0.4748886082 -0.2751087547 -0.3049228079
0.0000006269 -0.3995530067 -0.3364658369
-0.2751098200 -0.4748865074 -0.3049222723
-0.3995550939 -0.0000006775 -0.2523497055
-0.4748876976 -0.2751103347 -0.2838931192
-0.0000006269 0.3995530067 -0.2523498774
-0.2751113747 0.4748855968 -0.2838929923
0.3995551626 0.0000006450 -0.2523503585
0.4748877148 0.2751103266 -0.2838936825
0.0000006956 -0.3995530392 -0.2523501866
0.2751113918 -0.4748856050 -0.2838938094
0.2996665459 -0.0998877761 -0.2523503155
0.0998889817 -0.0998881067 -0.2523501523
0.2996668765 -0.2996642876 -0.2523503928
0.2996665459 -0.0998877761 -0.2523503155
0.2996662152 0.0998887354 -0.2523502382
0.2996658846 0.2996652469 -0.2523501610
0.0998886511 0.0998884048 -0.2523500750
0.2996662152 0.0998887354 -0.2523502382
-0.0998882518 -0.2996649488 -0.2523500663
-0.0998885824 -0.0998884373 -0.2523499890
-0.2996658159 -0.2996652794 -0.2523499031
-0.0998882518 -0.2996649488 -0.2523500663
0.0998893124 -0.2996646182 -0.2523502296
0.2996668765 -0.2996642876 -0.2523503928
0.0998889817 -0.0998881067 -0.2523501523
0.0998893124 -0.2996646182 -0.2523502296
-0.2996664771 0.0998877435 -0.2523497485
-0.0998889130 0.0998880742 -0.2523499117
-0.2996668077 0.2996642550 -0.2523496712
-0.2996664771 0.0998877435 -0.2523497485
-0.2996661465 -0.0998887679 -0.2523498258
-0.2996658159 -0.2996652794 -0.2523499031
-0.0998885824 -0.0998884373 -0.2523499890
-0.2996661465 -0.0998887679 -0.2523498258
0.0998883205 0.2996649163 -0.2523499977
0.0998886511 0.0998884048 -0.2523500750
0.2996658846 0.2996652469 -0.2523501610
0.0998883205 0.2996649163 -0.2523499977
-0.0998892436 0.2996645856 -0.2523498344
-0.2996668077 0.2996642550 -0.2523496712
-0.0998889130 0.0998880742 -0.2523499117
-0.0998892436 0.2996645856 -0.2523498344
-0.3737924247 0.3422497944 -0.1051456535
-0.3690618303 0.3690628588 0.0420582936
-0.2886234073 0.3737935674 -0.1051457109
-0.2618109552 0.3690630363 0.0420582059
-0.2570796344 0.2886245500 -0.1051457697
-0.2618107777 0.2618121611 0.0420581644
-0.3422486518 0.2570807770 -0.1051457123
-0.3690616528 0.2618119837 0.0420582521
-0.3737913806 -0.2886246879 -0.1051458713
-0.3690607862 -0.2618113603 0.0420581021
-0.2886223633 -0.2570809149 -0.1051459287
-0.2618099111 -0.2618111828 0.0420580145
-0.2570785903 -0.3422499323 -0.1051459874
-0.2618097336 -0.3690620579 0.0420579730
-0.3422476077 -0.3737937052 -0.1051459300
-0.3690606087 -0.3690622354 0.0420580606
0.2570831016 -0.2886236438 -0.1051463869
0.2618134329 -0.2618103162 0.0420575866
0.3422521190 -0.2570798708 -0.1051464442
0.3690643080 -0.2618101387 0.0420574989
0.3737958919 -0.3422488882 -0.1051465030
0.3690644855 -0.3690610139 0.0420574574
0.2886268746 -0.3737926612 -0.1051464456
0.2618136104 -0.3690611914 0.0420575451
0.2570820575 0.3422508385 -0.1051461691
0.2618123888 0.3690639029 0.0420577780
0.3422510749 0.3737946114 -0.1051462265
0.3690632639 0.3690640804 0.0420576904
0.3737948479 0.2886255940 -0.1051462852
0.3690634414 0.2618132052 0.0420576489
0.2886258305 0.2570818211 -0.1051462278
0.2618125663 0.2618130277 0.0420577365
-0.3995554932 0.1997758665 -0.3364652785
-0.4246658760 -0.1746661910 -0.3259509465
-0.4246665373 0.2248868320 -0.3259507919
-0.4874443127 0.3875525013 -0.2996645370
-0.4999985519 -0.3749986279 -0.2944075936
-0.4497768369 -0.1997772477 -0.3154364794
-0.4999995863 0.2499977062 -0.2944073518
-0.4246658760 -0.1746661910 -0.3259509465
0.1997768685 0.3995533699 -0.3364656909
-0.1746672816 0.4246637572 -0.3259509189
0.2248878466 0.4246644184 -0.3259512455
0.3875540739 0.4874422052 -0.2996652134
-0.3750002069 0.4999964467 -0.2944073572
-0.1997783257 0.4497747226 -0.3154364324
0.2499987588 0.4999974810 -0.2944078680
-0.1746672816 0.4246637572 -0.3259509189
0.3995554245 -0.1997758340 -0.3364660861
0.4246658245 0.1746662154 -0.3259515055
0.4246664857 -0.2248868076 -0.3259516600
0.4874443041 -0.3875524973 -0.2996656336
0.4999985519 0.3749986279 -0.2944081207
0.4497768026 0.1997772640 -0.3154370600
0.4999995863 -0.2499977062 -0.2944083625
0.4246658245 0.1746662154 -0.3259515055
-0.1997769372 -0.3995533373 -0.3364656736
0.1746672301 -0.4246637328 -0.3259515330
-0.2248878982 -0.4246643940 -0.3259512065
-0.3875540825 -0.4874422011 -0.2996649572
0.3750002069 -0.4999964467 -0.2944083570
0.1997782913 -0.4497747064 -0.3154371070
-0.2499987588 -0.4999974810 -0.2944078463
0.1746672301 -0.4246637328 -0.3259515330
-0.4999997931 0.3749969730 -0.2944073034
-0.4497774638 0.1997757590 -0.2733784997
-0.4999987588 -0.2499993611 -0.2944075453
-0.4246664026 0.1746647854 -0.2628640737
-0.3995547632 -0.1997771890 -0.2523497828
-0.4246664026 0.1746647854 -0.2628640737
-0.4246657414 -0.2248882376 -0.2628642283
-0.4874430213 -0.3875541147 -0.2891503806
0.3749985519 0.4999976879 -0.2944079701
0.1997768369 0.4497753676 -0.2733789338
-0.2500004137 0.4999966535 -0.2944074594
0.1746658760 0.4246643109 -0.2628644667
-0.1997781910 0.3995526761 -0.2523497142
0.1746658760 0.4246643109 -0.2628644667
-0.2248892522 0.4246636497 -0.2628641402
-0.3875556873 0.4874409183 -0.2891501237
0.4999997931 -0.3749969730 -0.2944084108
0.4497774982 -0.1997757753 -0.2733793894
0.4999987588 0.2499993611 -0.2944081690
0.4246664541 -0.1746648098 -0.2628649029
0.3995548320 0.1997771565 -0.2523502812
0.4246664541 -0.1746648098 -0.2628649029
0.4246657929 0.2248882132 -0.2628647483
0.4874430299 0.3875541107 -0.2891508774
-0.3749985519 -0.4999976879 -0.2944077441
-0.1997768026 -0.4497753839 -0.2733789553
0.2500004137 -0.4999966535 -0.2944082549
-0.1746658245 -0.4246643353 -0.2628645099
0.1997782597 -0.3995527086 -0.2523503499
-0.1746658245 -0.4246643353 -0.2628645099
0.2248893038 -0.4246636741 -0.2628648364
0.3875556959 -0.4874409224 -0.2891511343
-0.3643311315 0.3327886592 0.1892622163
-0.3690616528 0.2618119837 0.0420582521
-0.2980857670 0.3643324008 0.1892621743
-0.3690618303 0.3690628588 0.0420582936
-0.2665420254 0.2980870363 0.1892621229
-0.2618109552 0.3690630363 0.0420582059
-0.3327873899 0.2665432947 0.1892621649
-0.2618107777 0.2618121611 0.0420581644
-0.3643300874 -0.2980852968 0.1892620511
-0.3690606087 -0.3690622354 0.0420580606
-0.2980847229 -0.2665415551 0.1892620092
-0.3690607862 -0.2618113603 0.0420581021
-0.2665409813 -0.3327869196 0.1892619578
-0.2618099111 -0.2618111828 0.0420580145
-0.3327863458 -0.3643306612 0.1892619997
-0.2618097336 -0.3690620579 0.0420579730
0.2665438685 -0.2980842527 0.1892615356
0.2618136104 -0.3690611914 0.0420575451
0.3327892330 -0.2665405111 0.1892614936
0.2618134329 -0.2618103162 0.0420575866
0.3643329746 -0.3327858755 0.1892614422
0.3690643080 -0.2618101387 0.0420574989
0.2980876102 -0.3643296172 0.1892614842
0.3690644855 -0.3690610139 0.0420574574
0.2665428244 0.3327897032 0.1892617007
0.2618125663 0.2618130277 0.0420577365
0.3327881889 0.3643334449 0.1892616588
0.2618123888 0.3690639029 0.0420577780
0.3643319306 0.2980880804 0.1892616074
0.3690632639 0.3690640804 0.0420576904
0.2980865661 0.2665443388 0.1892616493
0.3690634414 0.2618132052 0.0420576489
0.0998890783 -0.1997763299 -0.3364658412
0.0000004616 -0.2996647510 -0.3364657982
0.0000001309 -0.0998882395 -0.3364657209
0.0998890783 -0.1997763299 -0.3364658412
0.1997780257 -0.2996644203 -0.3364659615
0.2996669730 -0.3995525108 -0.3364660817
0.0998894089 -0.3995528414 -0.3364659185
0.1997780257 -0.2996644203 -0.3364659615
-0.1997771026 -0.2996650816 -0.3364656350
-0.0998881552 -0.3995531720 -0.3364657552
-0.2996657193 -0.3995535026 -0.3364655920
-0.1997771026 -0.2996650816 -0.3364656350
-0.0998884858 -0.1997766605 -0.3364656779
0.0000001309 -0.0998882395 -0.3364657209
0.0000004616 -0.2996647510 -0.3364657982
-0.0998884858 -0.1997766605 -0.3364656779
0.1997773644 0.0998886026 -0.3364658069
0.2996663118 0.0000005122 -0.3364659272
0.0998887477 0.0000001816 -0.3364657639
0.1997773644 0.0998886026 -0.3364658069
0.2996659812 0.1997770237 -0.3364658499
0.3995545979 0.2996654447 -0.3364658929
0.3995549286 0.0998889333 -0.3364659701
0.2996659812 0.1997770237 -0.3364658499
0.2996666424 -0.1997759993 -0.3364660045
0.3995552592 -0.0998875782 -0.3364660474
0.3995555898 -0.2996640897 -0.3364661247
0.2996666424 -0.1997759993 -0.3364660045
0.1997776951 -0.0998879088 -0.3364658842
0.0998887477 0.0000001816 -0.3364657639
0.2996663118 0.0000005122 -0.3364659272
0.1997776951 -0.0998879088 -0.3364658842
-0.0998891470 0.1997763624 -0.3364655233
-0.0000005303 0.2996647835 -0.3364655663
-0.0000001997 0.0998882720 -0.3364656436
-0.0998891470 0.1997763624 -0.3364655233
-0.1997780944 0.2996644529 -0.3364654031
-0.2996670418 0.3995525433 -0.3364652828
-0.0998894777 0.3995528739 -0.3364654461
-0.1997780944 0.2996644529 -0.3364654031
0.1997770338 0.2996651141 -0.3364657296
0.0998880864 0.3995532046 -0.3364656093
0.2996656506 0.3995535352 -0.3364657726
0.1997770338 0.2996651141 -0.3364657296
0.0998884171 0.1997766931 -0.3364656866
-0.0000001997 0.0998882720 -0.3364656436
-0.0000005303 0.2996647835 -0.3364655663
0.0998884171 0.1997766931 -0.3364656866
-0.1997774332 -0.0998885701 -0.3364655577
-0.2996663805 -0.0000004797 -0.3364654374
-0.0998888164 -0.0000001490 -0.3364656006
-0.1997774332 -0.0998885701 -0.3364655577
-0.2996660499 -0.1997769911 -0.3364655147
-0.3995546667 -0.2996654122 -0.3364654717
-0.3995549973 -0.0998889007 -0.3364653944
-0.2996660499 -0.1997769911 -0.3364655147
-0.2996667112 0.1997760318 -0.3364653601
-0.3995553279 0.0998876108 -0.3364653171
-0.3995556585 0.2996641223 -0.3364652398
-0.2996667112 0.1997760318 -0.3364653601
-0.1997777638 0.0998879414 -0.3364654804
-0.0998888164 -0.0000001490 -0.3364656006
-0.2996663805 -0.0000004797 -0.3364654374
-0.1997777638 0.0998879414 -0.3364654804
0.1997777638 -0.0998879414 -0.2523502339
0.2996663805 0.0000004797 -0.2523502769
0.0998888164 0.0000001490 -0.2523501136
0.1997777638 -0.0998879414 -0.2523502339
0.2996667112 -0.1997760318 -0.2523503542
0.3995556585 -0.2996641223 -0.2523504745
0.3995553279 -0.0998876108 -0.2523503972
0.2996667112 -0.1997760318 -0.2523503542
0.2996660499 0.1997769911 -0.2523501996
0.3995549973 0.0998889007 -0.2523503199
0.3995546667 0.2996654122 -0.2523502426
0.2996660499 0.1997769911 -0.2523501996
0.1997774332 0.0998885701 -0.2523501566
0.0998888164 0.0000001490 -0.2523501136
0.2996663805 0.0000004797 -0.2523502769
0.1997774332 0.0998885701 -0.2523501566
-0.0998884171 -0.1997766931 -0.2523500277
0.0000005303 -0.2996647835 -0.2523501479
0.0000001997 -0.0998882720 -0.2523500707
-0.0998884171 -0.1997766931 -0.2523500277
-0.1997770338 -0.2996651141 -0.2523499847
-0.2996656506 -0.3995535352 -0.2523499417
-0.0998880864 -0.3995532046 -0.2523501050
-0.1997770338 -0.2996651141 -0.2523499847
0.1997780944 -0.2996644529 -0.2523503112
0.0998894777 -0.3995528739 -0.2523502682
0.2996670418 -0.3995525433 -0.2523504315
0.1997780944 -0.2996644529 -0.2523503112
0.0998891470 -0.1997763624 -0.2523501909
0.0000001997 -0.0998882720 -0.2523500707
0.0000005303 -0.2996647835 -0.2523501479
0.0998891470 -0.1997763624 -0.2523501909
-0.1997776951 0.0998879088 -0.2523498301
-0.2996663118 -0.0000005122 -0.2523497871
-0.0998887477 -0.0000001816 -0.2523499504
-0.1997776951 0.0998879088 -0.2523498301
-0.2996666424 0.1997759993 -0.2523497098
-0.3995555898 0.2996640897 -0.2523495895
-0.3995552592 0.0998875782 -0.2523496668
-0.2996666424 0.1997759993 -0.2523497098
-0.2996659812 -0.1997770237 -0.2523498644
-0.3995549286 -0.0998889333 -0.2523497441
-0.3995545979 -0.2996654447 -0.2523498214
-0.2996659812 -0.1997770237 -0.2523498644
-0.1997773644 -0.0998886026 -0.2523499074
-0.0998887477 -0.0000001816 -0.2523499504
-0.2996663118 -0.0000005122 -0.2523497871
-0.1997773644 -0.0998886026 -0.2523499074
0.0998884858 0.1997766605 -0.2523500363
-0.0000004616 0.2996647510 -0.2523499161
-0.0000001309 0.0998882395 -0.2523499934
0.0998884858 0.1997766605 -0.2523500363
0.1997771026 0.2996650816 -0.2523500793
0.2996657193 0.3995535026 -0.2523501223
0.0998881552 0.3995531720 -0.2523499590
0.1997771026 0.2996650816 -0.2523500793
-0.1997780257 0.2996644203 -0.2523497528
-0.0998894089 0.3995528414 -0.2523497958
-0.2996669730 0.3995525108 -0.2523496325
-0.1997780257 0.2996644203 -0.2523497528
-0.0998890783 0.1997763299 -0.2523498731
-0.0000001309 0.0998882395 -0.2523499934
-0.0000004616 0.2996647510 -0.2523499161
-0.0998890783 0.1997763299 -0.2523498731
-0.3737923203 0.2791625304 -0.1051456779
-0.3761576697 0.2972996302 -0.1787476393
-0.3643311315 0.3327886592 0.1892622163
-0.3737924247 0.3422497944 -0.1051456535
-0.3517106714 0.3737934629 -0.1051456594
-0.3335732654 0.3761587807 -0.1787476436
-0.2980857670 0.3643324008 0.1892621743
-0.2886234073 0.3737935674 -0.1051457109
-0.2570797388 0.3517118140 -0.1051457452
-0.2547141149 0.3335743764 -0.1787477245
-0.2665420254 0.2980870363 0.1892621229
-0.2570796344 0.2886245500 -0.1051457697
-0.2791613877 0.2570808814 -0.1051457638
-0.2972985192 0.2547152259 -0.1787477202
-0.3327873899 0.2665432947 0.1892621649
-0.3422486518 0.2570807770 -0.1051457123
-0.3737912762 -0.3517119519 -0.1051458957
-0.3761566256 -0.3335749836 -0.1787478702
-0.3643300874 -0.2980852968 0.1892620511
-0.3737913806 -0.2886246879 -0.1051458713
-0.3517096273 -0.2570810193 -0.1051458771
-0.3335722214 -0.2547158332 -0.1787478745
-0.2980847229 -0.2665415551 0.1892620092
-0.2886223633 -0.2570809149 -0.1051459287
-0.2570786947 -0.2791626683 -0.1051459630
-0.2547130709 -0.2973002374 -0.1787479554
-0.2665409813 -0.3327869196 0.1892619578
-0.2570785903 -0.3422499323 -0.1051459874
-0.2791603437 -0.3737936008 -0.1051459816
-0.2972974752 -0.3761593879 -0.1787479511
-0.3327863458 -0.3643306612 0.1892619997
-0.3422476077 -0.3737937052 -0.1051459300
0.2570832060 -0.3517109078 -0.1051464113
0.2547179882 -0.3335739396 -0.1787483858
0.2665438685 -0.2980842527 0.1892615356
0.2570831016 -0.2886236438 -0.1051463869
0.2791648550 -0.2570799752 -0.1051463927
0.2973023925 -0.2547147891 -0.1787483901
0.3327892330 -0.2665405111 0.1892614936
0.3422521190 -0.2570798708 -0.1051464442
0.3737957875 -0.2791616242 -0.1051464786
0.3761615430 -0.2972991934 -0.1787484710
0.3643329746 -0.3327858755 0.1892614422
0.3737958919 -0.3422488882 -0.1051465030
0.3517141386 -0.3737925568 -0.1051464971
0.3335771387 -0.3761583439 -0.1787484667
0.2980876102 -0.3643296172 0.1892614842
0.2886268746 -0.3737926612 -0.1051464456
0.2570821619 0.2791635744 -0.1051461935
0.2547169441 0.2973006743 -0.1787481548
0.2665428244 0.3327897032 0.1892617007
0.2570820575 0.3422508385 -0.1051461691
0.2791638109 0.3737945070 -0.1051461749
0.2973013484 0.3761598247 -0.1787481591
0.3327881889 0.3643334449 0.1892616588
0.3422510749 0.3737946114 -0.1051462265
0.3737947435 0.3517128581 -0.1051462608
0.3761604989 0.3335754205 -0.1787482400
0.3643319306 0.2980880804 0.1892616074
0.3737948479 0.2886255940 -0.1051462852
0.3517130945 0.2570819255 -0.1051462794
0.3335760946 0.2547162700 -0.1787482358
0.2980865661 0.2665443388 0.1892616493
0.2886258305 0.2570818211 -0.1051462278
-0.4246665373 0.2248868320 -0.3259507919
-0.3995553279 0.0998876108 -0.3364653171
-0.3995548320 -0.1997771565 -0.3364654330
-0.4372215634 -0.0622224525 -0.3206936646
-0.4121111806 0.3122196050 -0.3312079966
-0.4623329380 0.1626650244 -0.3101791008
-0.4372222246 0.3373305704 -0.3206935100
-0.4497779119 0.4497743089 -0.3154362281
-0.4497764232 -0.4497757813 -0.3154365762
-0.4497766301 -0.3247765145 -0.3154365278
-0.4999989657 -0.1250000943 -0.2944074969
-0.4246656692 -0.2996654578 -0.3259509949
-0.4999993794 0.1249984393 -0.2944074002
-0.4748886253 0.2751087629 -0.3049218189
-0.4372215634 -0.0622224525 -0.3206936646
-0.4497768369 -0.1997772477 -0.3154364794
0.2248878466 0.4246644184 -0.3259512455
0.0998880864 0.3995532046 -0.3364656093
-0.1997782597 0.3995527086 -0.3364653644
-0.0622230105 0.4372194468 -0.3206937778
0.3122211396 0.4121090595 -0.3312085498
0.1626655317 0.4623308260 -0.3101794956
0.3373321177 0.4372201080 -0.3206941044
0.4497763888 0.4497757976 -0.3154369632
-0.4497779119 0.4497743089 -0.3154362281
-0.3247781188 0.4497745158 -0.3154363303
-0.1250006206 0.4999968604 -0.2944075615
-0.2996670748 0.4246635503 -0.3259508168
0.1249989657 0.4999972741 -0.2944077658
0.2751098028 0.4748865156 -0.3049223545
-0.0622230105 0.4372194468 -0.3206937778
-0.1997783257 0.4497747226 -0.3154364324
0.4246664857 -0.2248868076 -0.3259516600
0.3995552592 -0.0998875782 -0.3364660474
0.3995547632 0.1997771890 -0.3364659315
0.4372215204 0.0622224729 -0.3206943311
0.4121111204 -0.3122195765 -0.3312089117
0.4623329122 -0.1626650122 -0.3101799823
0.4372221816 -0.3373305501 -0.3206944857
0.4497778776 -0.4497742926 -0.3154373113
0.4497763888 0.4497757976 -0.3154369632
0.4497765957 0.3247765308 -0.3154370116
0.4999989657 0.1250000943 -0.2944082174
0.4246656176 0.2996654822 -0.3259514571
0.4999993794 -0.1249984393 -0.2944083141
0.4748886082 -0.2751087547 -0.3049228079
0.4372215204 0.0622224729 -0.3206943311
0.4497768026 0.1997772640 -0.3154370600
-0.2248878982 -0.4246643940 -0.3259512065
-0.0998881552 -0.3995531720 -0.3364657552
0.1997781910 -0.3995526761 -0.3364660001
0.0622229675 -0.4372194264 -0.3206942179
-0.3122211998 -0.4121090310 -0.3312083584
-0.1626655575 -0.4623308138 -0.3101795875
-0.3373321607 -0.4372200877 -0.3206938913
-0.4497764232 -0.4497757813 -0.3154365762
0.4497778776 -0.4497742926 -0.3154373113
0.3247780844 -0.4497744995 -0.3154372091
0.1250006206 -0.4999968604 -0.2944081527
0.2996670232 -0.4246635259 -0.3259516352
-0.1249989657 -0.4999972741 -0.2944079484
-0.2751098200 -0.4748865074 -0.3049222723
0.0622229675 -0.4372194264 -0.3206942179
0.1997782913 -0.4497747064 -0.3154371070
-0.4497778776 0.4497742926 -0.2733784030
-0.4497776707 0.3247750258 -0.2733784514
-0.4999993794 0.1249984393 -0.2944074002
-0.4246666095 0.2996640522 -0.2628640253
-0.4999989657 -0.1250000943 -0.2944074969
-0.4748876976 -0.2751103347 -0.2838931192
-0.4372217263 0.0622210054 -0.2681213351
-0.4497774638 0.1997757590 -0.2733784997
-0.4246657414 -0.2248882376 -0.2628642283
-0.3995549286 -0.0998889333 -0.2523497441
-0.3995554245 0.1997758340 -0.2523496282
-0.4372217263 0.0622210054 -0.2681213351
-0.4121100870 -0.3122209690 -0.2576070442
-0.4623323738 -0.1626665547 -0.2786358578
-0.4372210651 -0.3373320176 -0.2681214896
-0.4497763888 -0.4497757976 -0.2733787510
0.4497764232 0.4497757813 -0.2733791381
0.3247766301 0.4497755745 -0.2733790360
0.1249989657 0.4999972741 -0.2944077658
0.2996656692 0.4246645178 -0.2628645689
-0.1250006206 0.4999968604 -0.2944075615
-0.2751113747 0.4748855968 -0.2838929923
0.0622215634 0.4372196324 -0.2681215981
0.1997768369 0.4497753676 -0.2733789338
-0.2248892522 0.4246636497 -0.2628641402
-0.0998894089 0.3995528414 -0.2523497958
0.1997769372 0.3995533373 -0.2523500407
0.0622215634 0.4372196324 -0.2681215981
-0.3122225037 0.4121079976 -0.2576068456
-0.1626670620 0.4623302754 -0.2786358609
-0.3373335649 0.4372189711 -0.2681212716
-0.4497778776 0.4497742926 -0.2733784030
0.4497779119 -0.4497743089 -0.2733794862
0.4497777051 -0.3247750421 -0.2733794378
0.4999993794 -0.1249984393 -0.2944083141
0.4246666610 -0.2996640766 -0.2628649513
0.4999989657 0.1250000943 -0.2944082174
0.4748877148 0.2751103266 -0.2838936825
0.4372217693 -0.0622210257 -0.2681220978
0.4497774982 -0.1997757753 -0.2733793894
0.4246657929 0.2248882132 -0.2628647483
0.3995549973 0.0998889007 -0.2523503199
0.3995554932 -0.1997758665 -0.2523504358
0.4372217693 -0.0622210257 -0.2681220978
0.4121101471 0.3122209406 -0.2576074761
0.4623323996 0.1626665425 -0.2786364876
0.4372211081 0.3373319973 -0.2681219432
0.4497764232 0.4497757813 -0.2733791381
-0.4497763888 -0.4497757976 -0.2733787510
-0.3247765957 -0.4497755907 -0.2733788532
-0.1249989657 -0.4999972741 -0.2944079484
-0.2996656176 -0.4246645422 -0.2628644077
0.1250006206 -0.4999968604 -0.2944081527
0.2751113918 -0.4748856050 -0.2838938094
-0.0622215204 -0.4372196527 -0.2681218347
-0.1997768026 -0.4497753839 -0.2733789553
0.2248893038 -0.4246636741 -0.2628648364
0.0998894777 -0.3995528739 -0.2523502682
-0.1997768685 -0.3995533699 -0.2523500233
-0.0622215204 -0.4372196527 -0.2681218347
0.3122225638 -0.4121080260 -0.2576076747
0.1626670878 -0.4623302876 -0.2786364845
0.3373336078 -0.4372189915 -0.2681221613
0.4497779119 -0.4497743089 -0.2733794862
-0.3619657612 0.3020315802 0.2628641727
-0.3643310584 0.2886250480 0.1892621992
-0.3737923203 0.2791625304 -0.1051456779
-0.3643310584 0.2886250480 0.1892621992
-0.3288431520 0.3619670622 0.2628641689
-0.3422493781 0.3643323277 0.1892622104
-0.3517106714 0.3737934629 -0.1051456594
-0.3422493781 0.3643323277 0.1892622104
-0.2689076701 0.3288444530 0.2628641071
-0.2665420985 0.3422506475 0.1892621400
-0.2570797388 0.3517118140 -0.1051457452
-0.2665420985 0.3422506475 0.1892621400
-0.3020302793 0.2689089711 0.2628641109
-0.2886237787 0.2665433678 0.1892621288
-0.2791613877 0.2570808814 -0.1051457638
-0.2886237787 0.2665433678 0.1892621288
-0.3619647171 -0.3288422441 0.2628640208
-0.3643300143 -0.3422489079 0.1892620341
-0.3737912762 -0.3517119519 -0.1051458957
-0.3643300143 -0.3422489079 0.1892620341
-0.3288421080 -0.2689067622 0.2628640169
-0.3422483341 -0.2665416282 0.1892620453
-0.3517096273 -0.2570810193 -0.1051458771
-0.3422483341 -0.2665416282 0.1892620453
-0.2689066260 -0.3020293713 0.2628639551
-0.2665410544 -0.2886233085 0.1892619749
-0.2570786947 -0.2791626683 -0.1051459630
-0.2665410544 -0.2886233085 0.1892619749
-0.3020292352 -0.3619648533 0.2628639590
-0.2886227347 -0.3643305882 0.1892619636
-0.2791603437 -0.3737936008 -0.1051459816
-0.2886227347 -0.3643305882 0.1892619636
0.2689091072 -0.3288412000 0.2628635052
0.2665439416 -0.3422478638 0.1892615185
0.2570832060 -0.3517109078 -0.1051464113
0.2665439416 -0.3422478638 0.1892615185
0.3020317164 -0.2689057181 0.2628635013
0.2886256219 -0.2665405841 0.1892615297
0.2791648550 -0.2570799752 -0.1051463927
0.2886256219 -0.2665405841 0.1892615297
0.3619671983 -0.3020283273 0.2628634395
0.3643329015 -0.2886222644 0.1892614593
0.3737957875 -0.2791616242 -0.1051464786
0.3643329015 -0.2886222644 0.1892614593
0.3288445892 -0.3619638092 0.2628634434
0.3422512213 -0.3643295441 0.1892614481
0.3517141386 -0.3737925568 -0.1051464971
0.3422512213 -0.3643295441 0.1892614481
0.2689080632 0.3020326243 0.2628636572
0.2665428975 0.2886260921 0.1892616836
0.2570821619 0.2791635744 -0.1051461935
0.2665428975 0.2886260921 0.1892616836
0.3020306723 0.3619681063 0.2628636533
0.2886245778 0.3643333718 0.1892616949
0.2791638109 0.3737945070 -0.1051461749
0.2886245778 0.3643333718 0.1892616949
0.3619661543 0.3288454971 0.2628635915
0.3643318575 0.3422516915 0.1892616245
0.3737947435 0.3517128581 -0.1051462608
0.3643318575 0.3422516915 0.1892616245
0.3288435451 0.2689100152 0.2628635954
0.3422501772 0.2665444118 0.1892616132
0.3517130945 0.2570819255 -0.1051462794
0.3422501772 0.2665444118 0.1892616132
0.0499447699 -0.2497205404 -0.3364658197
0.1498335520 -0.2497203751 -0.3364659013
0.0499449352 -0.3496087962 -0.3364658584
0.0499447699 -0.2497205404 -0.3364658197
0.0499446046 -0.1498322847 -0.3364657811
0.0499444393 -0.0499440289 -0.3364657424
0.1498333867 -0.1498321194 -0.3364658627
0.0499446046 -0.1498322847 -0.3364657811
0.2497224994 -0.3496084656 -0.3364660216
0.2497223341 -0.2497202098 -0.3364659830
0.3496112814 -0.3496083002 -0.3364661032
0.2497224994 -0.3496084656 -0.3364660216
0.1498337173 -0.3496086309 -0.3364659400
0.0499449352 -0.3496087962 -0.3364658584
0.1498335520 -0.2497203751 -0.3364659013
0.1498337173 -0.3496086309 -0.3364659400
-0.1498326289 -0.3496091268 -0.3364656951
-0.1498327942 -0.2497208711 -0.3364656564
-0.0499438468 -0.3496089615 -0.3364657767
-0.1498326289 -0.3496091268 -0.3364656951
-0.2497214109 -0.3496092921 -0.3364656135
-0.3496101930 -0.3496094574 -0.3364655318
-0.2497215762 -0.2497210364 -0.3364655748
-0.2497214109 -0.3496092921 -0.3364656135
-0.0499441774 -0.1498324500 -0.3364656994
-0.1498329595 -0.1498326153 -0.3364656178
-0.0499443427 -0.0499441943 -0.3364656608
-0.0499441774 -0.1498324500 -0.3364656994
-0.0499440121 -0.2497207057 -0.3364657381
-0.0499438468 -0.3496089615 -0.3364657767
-0.1498327942 -0.2497208711 -0.3364656564
-0.0499440121 -0.2497207057 -0.3364657381
0.2497218381 0.0499445574 -0.3364658670
0.2497216728 0.1498328132 -0.3364658284
0.3496106202 0.0499447227 -0.3364659487
0.2497218381 0.0499445574 -0.3364658670
0.1498330561 0.0499443921 -0.3364657854
0.0499442740 0.0499442268 -0.3364657038
0.1498328908 0.1498326479 -0.3364657467
0.1498330561 0.0499443921 -0.3364657854
0.3496102896 0.2497212342 -0.3364658714
0.2497215075 0.2497210689 -0.3364657897
0.3496101242 0.3496094900 -0.3364658327
0.3496102896 0.2497212342 -0.3364658714
0.3496104549 0.1498329785 -0.3364659100
0.3496106202 0.0499447227 -0.3364659487
0.2497216728 0.1498328132 -0.3364658284
0.3496104549 0.1498329785 -0.3364659100
0.3496109508 -0.1498317888 -0.3364660259
0.2497221687 -0.1498319541 -0.3364659443
0.3496107855 -0.0499435330 -0.3364659873
0.3496109508 -0.1498317888 -0.3364660259
0.3496111161 -0.2497200445 -0.3364660646
0.3496112814 -0.3496083002 -0.3364661032
0.2497223341 -0.2497202098 -0.3364659830
0.3496111161 -0.2497200445 -0.3364660646
0.1498332214 -0.0499438636 -0.3364658240
0.1498333867 -0.1498321194 -0.3364658627
0.0499444393 -0.0499440289 -0.3364657424
0.1498332214 -0.0499438636 -0.3364658240
0.2497220034 -0.0499436983 -0.3364659057
0.3496107855 -0.0499435330 -0.3364659873
0.2497221687 -0.1498319541 -0.3364659443
0.2497220034 -0.0499436983 -0.3364659057
-0.0499448387 0.2497205730 -0.3364655448
-0.1498336207 0.2497204077 -0.3364654632
-0.0499450040 0.3496088287 -0.3364655062
-0.0499448387 0.2497205730 -0.3364655448
-0.0499446734 0.1498323172 -0.3364655835
-0.0499445081 0.0499440615 -0.3364656221
-0.1498334554 0.1498321519 -0.3364655019
-0.0499446734 0.1498323172 -0.3364655835
-0.2497225681 0.3496084981 -0.3364653429
-0.2497224028 0.2497202424 -0.3364653816
-0.3496113502 0.3496083328 -0.3364652613
-0.2497225681 0.3496084981 -0.3364653429
-0.1498337860 0.3496086634 -0.3364654246
-0.0499450040 0.3496088287 -0.3364655062
-0.1498336207 0.2497204077 -0.3364654632
-0.1498337860 0.3496086634 -0.3364654246
0.1498325601 0.3496091593 -0.3364656695
0.1498327254 0.2497209036 -0.3364657081
0.0499437781 0.3496089940 -0.3364655878
0.1498325601 0.3496091593 -0.3364656695
0.2497213422 0.3496093247 -0.3364657511
0.3496101242 0.3496094900 -0.3364658327
0.2497215075 0.2497210689 -0.3364657897
0.2497213422 0.3496093247 -0.3364657511
0.0499441087 0.1498324825 -0.3364656651
0.1498328908 0.1498326479 -0.3364657467
0.0499442740 0.0499442268 -0.3364657038
0.0499441087 0.1498324825 -0.3364656651
0.0499439434 0.2497207383 -0.3364656265
0.0499437781 0.3496089940 -0.3364655878
0.1498327254 0.2497209036 -0.3364657081
0.0499439434 0.2497207383 -0.3364656265
-0.2497219069 -0.0499445249 -0.3364654975
-0.2497217415 -0.1498327806 -0.3364655362
-0.3496106889 -0.0499446902 -0.3364654159
-0.2497219069 -0.0499445249 -0.3364654975
-0.1498331248 -0.0499443596 -0.3364655792
-0.0499443427 -0.0499441943 -0.3364656608
-0.1498329595 -0.1498326153 -0.3364656178
-0.1498331248 -0.0499443596 -0.3364655792
-0.3496103583 -0.2497212017 -0.3364654932
-0.2497215762 -0.2497210364 -0.3364655748
-0.3496101930 -0.3496094574 -0.3364655318
-0.3496103583 -0.2497212017 -0.3364654932
-0.3496105236 -0.1498329459 -0.3364654545
-0.3496106889 -0.0499446902 -0.3364654159
-0.2497217415 -0.1498327806 -0.3364655362
-0.3496105236 -0.1498329459 -0.3364654545
-0.3496110195 0.1498318213 -0.3364653386
-0.2497222375 0.1498319866 -0.3364654202
-0.3496108542 0.0499435656 -0.3364653772
-0.3496110195 0.1498318213 -0.3364653386
-0.3496111848 0.2497200770 -0.3364653000
-0.3496113502 0.3496083328 -0.3364652613
-0.2497224028 0.2497202424 -0.3364653816
-0.3496111848 0.2497200770 -0.3364653000
-0.1498332901 0.0499438962 -0.3364655405
-0.1498334554 0.1498321519 -0.3364655019
-0.0499445081 0.0499440615 -0.3364656221
-0.1498332901 0.0499438962 -0.3364655405
-0.2497220722 0.0499437309 -0.3364654589
-0.3496108542 0.0499435656 -0.3364653772
-0.2497222375 0.1498319866 -0.3364654202
-0.2497220722 0.0499437309 -0.3364654589
0.2497220722 -0.0499437309 -0.2523502554
0.2497222375 -0.1498319866 -0.2523502941
0.3496108542 -0.0499435656 -0.2523503370
0.2497220722 -0.0499437309 -0.2523502554
0.1498332901 -0.0499438962 -0.2523501738
0.0499445081 -0.0499440615 -0.2523500921
0.1498334554 -0.1498321519 -0.2523502124
0.1498332901 -0.0499438962 -0.2523501738
0.3496111848 -0.2497200770 -0.2523504143
0.2497224028 -0.2497202424 -0.2523503327
0.3496113502 -0.3496083328 -0.2523504530
0.3496111848 -0.2497200770 -0.2523504143
0.3496110195 -0.1498318213 -0.2523503757
0.3496108542 -0.0499435656 -0.2523503370
0.2497222375 -0.1498319866 -0.2523502941
0.3496110195 -0.1498318213 -0.2523503757
0.3496105236 0.1498329459 -0.2523502597
0.2497217415 0.1498327806 -0.2523501781
0.3496106889 0.0499446902 -0.2523502984
0.3496105236 0.1498329459 -0.2523502597
0.3496103583 0.2497212017 -0.2523502211
0.3496101930 0.3496094574 -0.2523501824
0.2497215762 0.2497210364 -0.2523501395
0.3496103583 0.2497212017 -0.2523502211
0.1498331248 0.0499443596 -0.2523501351
0.1498329595 0.1498326153 -0.2523500965
0.0499443427 0.0499441943 -0.2523500535
0.1498331248 0.0499443596 -0.2523501351
0.2497219069 0.0499445249 -0.2523502168
0.3496106889 0.0499446902 -0.2523502984
0.2497217415 0.1498327806 -0.2523501781
0.2497219069 0.0499445249 -0.2523502168
-0.0499439434 -0.2497207383 -0.2523500878
-0.1498327254 -0.2497209036 -0.2523500062
-0.0499437781 -0.3496089940 -0.2523501265
-0.0499439434 -0.2497207383 -0.2523500878
-0.0499441087 -0.1498324825 -0.2523500492
-0.0499442740 -0.0499442268 -0.2523500105
-0.1498328908 -0.1498326479 -0.2523499675
-0.0499441087 -0.1498324825 -0.2523500492
-0.2497213422 -0.3496093247 -0.2523499632
-0.2497215075 -0.2497210689 -0.2523499245
-0.3496101242 -0.3496094900 -0.2523498816
-0.2497213422 -0.3496093247 -0.2523499632
-0.1498325601 -0.3496091593 -0.2523500448
-0.0499437781 -0.3496089940 -0.2523501265
-0.1498327254 -0.2497209036 -0.2523500062
-0.1498325601 -0.3496091593 -0.2523500448
0.1498337860 -0.3496086634 -0.2523502897
0.1498336207 -0.2497204077 -0.2523502511
0.0499450040 -0.3496088287 -0.2523502081
0.1498337860 -0.3496086634 -0.2523502897
0.2497225681 -0.3496084981 -0.2523503713
0.3496113502 -0.3496083328 -0.2523504530
0.2497224028 -0.2497202424 -0.2523503327
0.2497225681 -0.3496084981 -0.2523503713
0.0499446734 -0.1498323172 -0.2523501308
0.1498334554 -0.1498321519 -0.2523502124
0.0499445081 -0.0499440615 -0.2523500921
0.0499446734 -0.1498323172 -0.2523501308
0.0499448387 -0.2497205730 -0.2523501694
0.0499450040 -0.3496088287 -0.2523502081
0.1498336207 -0.2497204077 -0.2523502511
0.0499448387 -0.2497205730 -0.2523501694
-0.2497220034 0.0499436983 -0.2523498086
-0.2497221687 0.1498319541 -0.2523497700
-0.3496107855 0.0499435330 -0.2523497270
-0.2497220034 0.0499436983 -0.2523498086
-0.1498332214 0.0499438636 -0.2523498902
-0.0499444393 0.0499440289 -0.2523499719
-0.1498333867 0.1498321194 -0.2523498516
-0.1498332214 0.0499438636 -0.2523498902
-0.3496111161 0.2497200445 -0.2523496497
-0.2497223341 0.2497202098 -0.2523497313
-0.3496112814 0.3496083002 -0.2523496110
-0.3496111161 0.2497200445 -0.2523496497
-0.3496109508 0.1498317888 -0.2523496883
-0.3496107855 0.0499435330 -0.2523497270
-0.2497221687 0.1498319541 -0.2523497700
-0.3496109508 0.1498317888 -0.2523496883
-0.3496104549 -0.1498329785 -0.2523498043
-0.2497216728 -0.1498328132 -0.2523498859
-0.3496106202 -0.0499447227 -0.2523497656
-0.3496104549 -0.1498329785 -0.2523498043
-0.3496102896 -0.2497212342 -0.2523498429
-0.3496101242 -0.3496094900 -0.2523498816
-0.2497215075 -0.2497210689 -0.2523499245
-0.3496102896 -0.2497212342 -0.2523498429
-0.1498330561 -0.0499443921 -0.2523499289
-0.1498328908 -0.1498326479 -0.2523499675
-0.0499442740 -0.0499442268 -0.2523500105
-0.1498330561 -0.0499443921 -0.2523499289
-0.2497218381 -0.0499445574 -0.2523498473
-0.3496106202 -0.0499447227 -0.2523497656
-0.2497216728 -0.1498328132 -0.2523498859
-0.2497218381 -0.0499445574 -0.2523498473
0.0499440121 0.2497207057 -0.2523499762
0.1498327942 0.2497208711 -0.2523500578
0.0499438468 0.3496089615 -0.2523499376
0.0499440121 0.2497207057 -0.2523499762
0.0499441774 0.1498324500 -0.2523500149
0.0499443427 0.0499441943 -0.2523500535
0.1498329595 0.1498326153 -0.2523500965
0.0499441774 0.1498324500 -0.2523500149
0.2497214109 0.3496092921 -0.2523501008
0.2497215762 0.2497210364 -0.2523501395
0.3496101930 0.3496094574 -0.2523501824
0.2497214109 0.3496092921 -0.2523501008
0.1498326289 0.3496091268 -0.2523500192
0.0499438468 0.3496089615 -0.2523499376
0.1498327942 0.2497208711 -0.2523500578
0.1498326289 0.3496091268 -0.2523500192
-0.1498337173 0.3496086309 -0.2523497743
-0.1498335520 0.2497203751 -0.2523498129
-0.0499449352 0.3496087962 -0.2523498559
-0.1498337173 0.3496086309 -0.2523497743
-0.2497224994 0.3496084656 -0.2523496927
-0.3496112814 0.3496083002 -0.2523496110
-0.2497223341 0.2497202098 -0.2523497313
-0.2497224994 0.3496084656 -0.2523496927
-0.0499446046 0.1498322847 -0.2523499332
-0.1498333867 0.1498321194 -0.2523498516
-0.0499444393 0.0499440289 -0.2523499719
-0.0499446046 0.1498322847 -0.2523499332
-0.0499447699 0.2497205404 -0.2523498946
-0.0499449352 0.3496087962 -0.2523498559
-0.1498335520 0.2497203751 -0.2523498129
-0.0499447699 0.2497205404 -0.2523498946
-0.3761576697 0.2972996302 -0.1787476393
-0.3714270753 0.3241126946 -0.0315436922
-0.3785230191 0.3154367300 -0.2523496006
-0.3761577741 0.3603868942 -0.1787476149
-0.3666964809 0.3509257590 0.1156602549
-0.3643311837 0.3643322912 0.1892622285
-0.3737924769 0.3737934264 -0.1051456413
-0.3714270753 0.3241126946 -0.0315436922
-0.3335732654 0.3761587807 -0.1787476436
-0.3067608133 0.3714282496 -0.0315437267
-0.3154358595 0.3785240984 -0.2523496278
-0.2704860014 0.3761588851 -0.1787476951
-0.2799483611 0.3666977185 0.1156601901
-0.2665421350 0.3643324530 0.1892621486
-0.2570797753 0.3737936196 -0.1051457367
-0.3067608133 0.3714282496 -0.0315437267
-0.2547141149 0.3335743764 -0.1787477245
-0.2594452582 0.3067619876 -0.0315437904
-0.2523484911 0.3154369388 -0.2523497037
-0.2547140105 0.2704871124 -0.1787477489
-0.2641764015 0.2799495987 0.1156601437
-0.2665419732 0.2665434043 0.1892621107
-0.2570795822 0.2570809180 -0.1051457819
-0.2594452582 0.3067619876 -0.0315437904
-0.2972985192 0.2547152259 -0.1787477202
-0.3241115203 0.2594464325 -0.0315437559
-0.3154356507 0.2523495704 -0.2523496766
-0.3603857832 0.2547151215 -0.1787476686
-0.3509245213 0.2641776392 0.1156602085
-0.3643310219 0.2665432425 0.1892621906
-0.3737922838 0.2570807248 -0.1051456865
-0.3241115203 0.2594464325 -0.0315437559
-0.3761566256 -0.3335749836 -0.1787478702
-0.3714260312 -0.3067616561 -0.0315438968
-0.3785219751 -0.3154380154 -0.2523498447
-0.3761567301 -0.2704877196 -0.1787478458
-0.3666954368 -0.2799483285 0.1156600766
-0.3643301396 -0.2665416648 0.1892620633
-0.3737914329 -0.2570810559 -0.1051458591
-0.3714260312 -0.3067616561 -0.0315438968
-0.3335722214 -0.2547158332 -0.1787478745
-0.3067597692 -0.2594461011 -0.0315439313
-0.3154348154 -0.2523506470 -0.2523498719
-0.2704849574 -0.2547157287 -0.1787479261
-0.2799473170 -0.2641763690 0.1156600118
-0.2665410909 -0.2665415029 0.1892619834
-0.2570787313 -0.2570808627 -0.1051459545
-0.3067597692 -0.2594461011 -0.0315439313
-0.2547130709 -0.2973002374 -0.1787479554
-0.2594442142 -0.3241123631 -0.0315439950
-0.2523474470 -0.3154378066 -0.2523499478
-0.2547129665 -0.3603875014 -0.1787479798
-0.2641753575 -0.3509244888 0.1156599654
-0.2665409291 -0.3643305516 0.1892619456
-0.2570785381 -0.3737935643 -0.1051459996
-0.2594442142 -0.3241123631 -0.0315439950
-0.2972974752 -0.3761593879 -0.1787479511
-0.3241104762 -0.3714279181 -0.0315439605
-0.3154346066 -0.3785251750 -0.2523499207
-0.3603847392 -0.3761594923 -0.1787478996
-0.3509234773 -0.3666964483 0.1156600302
-0.3643299778 -0.3643307135 0.1892620255
-0.3737912397 -0.3737937574 -0.1051459042
-0.3241104762 -0.3714279181 -0.0315439605
0.2547179882 -0.3335739396 -0.1787483858
0.2594483194 -0.3067606120 -0.0315444123
0.2523527704 -0.3154369713 -0.2523503603
0.2547178838 -0.2704866756 -0.1787483614
0.2641786507 -0.2799472845 0.1156595611
0.2665438163 -0.2665406207 0.1892615478
0.2570830494 -0.2570800118 -0.1051463746
0.2594483194 -0.3067606120 -0.0315444123
0.2973023925 -0.2547147891 -0.1787483901
0.3241145815 -0.2594450570 -0.0315444469
0.3154399300 -0.2523496029 -0.2523503874
0.3603896565 -0.2547146847 -0.1787484416
0.3509267705 -0.2641753249 0.1156594963
0.3643328650 -0.2665404589 0.1892614679
0.3737957510 -0.2570798186 -0.1051464700
0.3241145815 -0.2594450570 -0.0315444469
0.3761615430 -0.2972991934 -0.1787484710
0.3714301365 -0.3241113190 -0.0315445106
0.3785272984 -0.3154367625 -0.2523504634
0.3761616474 -0.3603864574 -0.1787484954
0.3666987301 -0.3509234447 0.1156594498
0.3643330268 -0.3643295075 0.1892614300
0.3737959441 -0.3737925202 -0.1051465152
0.3714301365 -0.3241113190 -0.0315445106
0.3335771387 -0.3761583439 -0.1787484667
0.3067638745 -0.3714268741 -0.0315444760
0.3154401388 -0.3785241310 -0.2523504362
0.2704898747 -0.3761584483 -0.1787484151
0.2799506103 -0.3666954043 0.1156595146
0.2665439781 -0.3643296694 0.1892615100
0.2570832426 -0.3737927134 -0.1051464198
0.3067638745 -0.3714268741 -0.0315444760
0.2547169441 0.2973006743 -0.1787481548
0.2594472754 0.3241137387 -0.0315442077
0.2523517263 0.3154377741 -0.2523501162
0.2547168397 0.3603879383 -0.1787481304
0.2641776066 0.3509268030 0.1156597394
0.2665427722 0.3643333352 0.1892617129
0.2570820053 0.3737944705 -0.1051461569
0.2594472754 0.3241137387 -0.0315442077
0.2973013484 0.3761598247 -0.1787481591
0.3241135374 0.3714292937 -0.0315442423
0.3154388859 0.3785251425 -0.2523501433
0.3603886124 0.3761599292 -0.1787482107
0.3509257264 0.3666987626 0.1156596746
0.3643318209 0.3643334971 0.1892616330
0.3737947069 0.3737946636 -0.1051462523
0.3241135374 0.3714292937 -0.0315442423
0.3761604989 0.3335754205 -0.1787482400
0.3714290924 0.3067630316 -0.0315443060
0.3785262543 0.3154379829 -0.2523502193
0.3761606033 0.2704881565 -0.1787482645
0.3666976860 0.2799506428 0.1156596281
0.3643319828 0.2665444484 0.1892615952
0.3737949001 0.2570819620 -0.1051462974
0.3714290924 0.3067630316 -0.0315443060
0.3335760946 0.2547162700 -0.1787482358
0.3067628304 0.2594474766 -0.0315442714
0.3154390947 0.2523506145 -0.2523501922
0.2704888306 0.2547161656 -0.1787481842
0.2799495662 0.2641786832 0.1156596929
0.2665429341 0.2665442866 0.1892616751
0.2570821985 0.2570817689 -0.1051462020
0.3067628304 0.2594474766 -0.0315442714
3 376 760 168
3 72 760 376
3 376 761 46
3 168 761 376
3 377 762 168
3 45 762 377
3 377 763 72
3 168 763 377
3 378 764 169
3 72 764 378
3 378 765 44
3 169 765 378
3 379 766 169
3 46 766 379
3 379 767 72
3 169 767 379
3 380 768 170
3 73 768 380
3 380 769 46
3 170 769 380
3 381 770 170
3 41 770 381
3 381 771 73
3 170 771 381
3 382 772 171
3 73 772 382
3 382 773 45
3 171 773 382
3 383 774 171
3 46 774 383
3 383 775 73
3 171 775 383
3 384 776 172
3 74 776 384
3 384 777 47
3 172 777 384
3 385 778 172
3 45 778 385
3 385 779 74
3 172 779 385
3 386 780 173
3 74 780 386
3 386 781 9
3 173 781 386
3 387 782 173
3 47 782 387
3 387 783 74
3 173 783 387
3 388 784 174
3 75 784 388
3 388 785 47
3 174 785 388
3 389 786 174
3 44 786 389
3 389 787 75
3 174 787 389
3 390 788 175
3 75 788 390
3 390 789 45
3 175 789 390
3 391 790 175
3 47 790 391
3 391 791 75
3 175 791 391
3 392 792 176
3 76 792 392
3 392 793 49
3 176 793 392
3 393 794 176
3 48 794 393
3 393 795 76
3 176 795 393
3 394 796 177
3 76 796 394
3 394 797 44
3 177 797 394
3 395 798 177
3 49 798 395
3 395 799 76
3 177 799 395
3 396 800 178
3 77 800 396
3 396 801 49
3 178 801 396
3 397 802 178
3 40 802 397
3 397 803 77
3 178 803 397
3 398 804 179
3 77 804 398
3 398 805 48
3 179 805 398
3 399 806 179
3 49 806 399
3 399 807 77
3 179 807 399
3 400 808 180
3 78 808 400
3 400 809 50
3 180 809 400
3 401 810 180
3 48 810 401
3 401 811 78
3 180 811 401
3 402 812 181
3 78 812 402
3 402 813 41
3 181 813 402
3 403 814 181
3 50 814 403
3 403 815 78
3 181 815 403
3 404 816 182
3 79 816 404
3 404 817 50
3 182 817 404
3 405 818 182
3 44 818 405
3 405 819 79
3 182 819 405
3 406 820 183
3 79 820 406
3 406 821 48
3 183 821 406
3 407 822 183
3 50 822 407
3 407 823 79
3 183 823 407
3 408 824 184
3 80 824 408
3 408 825 53
3 184 825 408
3 409 826 184
3 52 826 409
3 409 827 80
3 184 827 409
3 410 828 185
3 80 828 410
3 410 829 51
3 185 829 410
3 411 830 185
3 53 830 411
3 411 831 80
3 185 831 411
3 412 832 186
3 81 832 412
3 412 833 53
3 186 833 412
3 413 834 186
3 8 834 413
3 413 835 81
3 186 835 413
3 414 836 187
3 81 836 414
3 414 837 52
3 187 837 414
3 415 838 187
3 53 838 415
3 415 839 81
3 187 839 415
3 416 840 188
3 82 840 416
3 416 841 54
3 188 841 416
3 417 842 188
3 52 842 417
3 417 843 82
3 188 843 417
3 418 844 189
3 82 844 418
3 418 845 40
3 189 845 418
3 419 846 189
3 54 846 419
3 419 847 82
3 189 847 419
3 420 848 190
3 83 848 420
3 420 849 54
3 190 849 420
3 421 850 190
3 51 850 421
3 421 851 83
3 190 851 421
3 422 852 191
3 83 852 422
3 422 853 52
3 191 853 422
3 423 854 191
3 54 854 423
3 423 855 83
3 191 855 423
3 424 856 192
3 84 856 424
3 424 857 56
3 192 857 424
3 425 858 192
3 55 858 425
3 425 859 84
3 192 859 425
3 426 860 193
3 84 860 426
3 426 861 51
3 193 861 426
3 427 862 193
3 56 862 427
3 427 863 84
3 193 863 427
3 428 864 194
3 85 864 428
3 428 865 56
3 194 865 428
3 429 866 194
3 9 866 429
3 429 867 85
3 194 867 429
3 430 868 195
3 85 868 430
3 430 869 55
3 195 869 430
3 431 870 195
3 56 870 431
3 431 871 85
3 195 871 431
3 432 872 196
3 86 872 432
3 432 873 57
3 196 873 432
3 433 874 196
3 55 874 433
3 433 875 86
3 196 875 433
3 434 876 197
3 86 876 434
3 434 877 8
3 197 877 434
3 435 878 197
3 57 878 435
3 435 879 86
3 197 879 435
3 436 880 198
3 87 880 436
3 436 881 57
3 198 881 436
3 437 882 198
3 51 882 437
3 437 883 87
3 198 883 437
3 438 884 199
3 87 884 438
3 438 885 55
3 199 885 438
3 439 886 199
3 57 886 439
3 439 887 87
3 199 887 439
3 280 568 88
3 8 568 280
3 88 569 280
3 200 569 88
3 281 570 200
3 9 570 281
3 200 571 281
3 88 571 200
3 201 572 8
3 282 572 201
3 282 573 88
3 201 573 282
3 283 574 8
3 201 574 283
3 283 575 21
3 8 575 283
3 284 576 9
3 20 576 284
3 284 577 120
3 9 577 284
3 285 578 120
3 89 578 285
3 120 579 285
3 9 579 120
3 121 580 89
3 286 580 121
3 286 581 21
3 121 581 286
3 89 582 121
3 287 582 89
3 287 583 9
3 89 583 287
3 288 584 90
3 40 584 288
3 90 585 288
3 202 585 90
3 289 586 202
3 8 586 289
3 202 587 289
3 90 587 202
3 203 588 40
3 290 588 203
3 290 589 90
3 203 589 290
3 291 590 40
3 203 590 291
3 291 591 35
3 40 591 291
3 292 592 8
3 21 592 292
3 292 593 122
3 8 593 292
3 293 594 122
3 91 594 293
3 122 595 293
3 8 595 122
3 123 596 91
3 294 596 123
3 294 597 35
3 123 597 294
3 91 598 123
3 295 598 91
3 295 599 8
3 91 599 295
3 296 600 92
3 41 600 296
3 92 601 296
3 204 601 92
3 297 602 204
3 40 602 297
3 204 603 297
3 92 603 204
3 205 604 41
3 298 604 205
3 298 605 92
3 205 605 298
3 299 606 41
3 205 606 299
3 299 607 34
3 41 607 299
3 300 608 40
3 35 608 300
3 300 609 124
3 40 609 300
3 301 610 124
3 93 610 301
3 124 611 301
3 40 611 124
3 125 612 93
3 302 612 125
3 302 613 34
3 125 613 302
3 93 614 125
3 303 614 93
3 303 615 40
3 93 615 303
3 304 616 94
3 9 616 304
3 94 617 304
3 206 617 94
3 305 618 206
3 41 618 305
3 206 619 305
3 94 619 206
3 207 620 9
3 306 620 207
3 306 621 94
3 207 621 306
3 307 622 9
3 207 622 307
3 307 623 20
3 9 623 307
3 308 624 41
3 34 624 308
3 308 625 126
3 41 625 308
3 309 626 126
3 95 626 309
3 126 627 309
3 41 627 126
3 127 628 95
3 310 628 127
3 310 629 20
3 127 629 310
3 95 630 127
3 311 630 95
3 311 631 41
3 95 631 311
3 312 632 10
3 21 632 312
3 312 633 128
3 10 633 312
3 313 634 128
3 96 634 313
3 128 635 313
3 10 635 128
3 129 636 96
3 314 636 129
3 314 637 20
3 129 637 314
3 96 638 129
3 315 638 96
3 315 639 10
3 96 639 315
3 316 640 97
3 11 640 316
3 97 641 316
3 208 641 97
3 317 642 208
3 10 642 317
3 208 643 317
3 97 643 208
3 209 644 11
3 318 644 209
3 318 645 97
3 209 645 318
3 319 646 11
3 209 646 319
3 319 647 20
3 11 647 319
3 320 648 42
3 35 648 320
3 320 649 130
3 42 649 320
3 321 650 130
3 98 650 321
3 130 651 321
3 42 651 130
3 131 652 98
3 322 652 131
3 322 653 21
3 131 653 322
3 98 654 131
3 323 654 98
3 323 655 42
3 98 655 323
3 324 656 99
3 10 656 324
3 99 657 324
3 210 657 99
3 325 658 210
3 42 658 325
3 210 659 325
3 99 659 210
3 211 660 10
3 326 660 211
3 326 661 99
3 211 661 326
3 327 662 10
3 211 662 327
3 327 663 21
3 10 663 327
3 328 664 43
3 34 664 328
3 328 665 132
3 43 665 328
3 329 666 132
3 100 666 329
3 132 667 329
3 43 667 132
3 133 668 100
3 330 668 133
3 330 669 35
3 133 669 330
3 100 670 133
3 331 670 100
3 331 671 43
3 100 671 331
3 332 672 101
3 42 672 332
3 101 673 332
3 212 673 101
3 333 674 212
3 43 674 333
3 212 675 333
3 101 675 212
3 213 676 42
3 334 676 213
3 334 677 101
3 213 677 334
3 335 678 42
3 213 678 335
3 335 679 35
3 42 679 335
3 336 680 11
3 20 680 336
3 336 681 134
3 11 681 336
3 337 682 134
3 102 682 337
3 134 683 337
3 11 683 134
3 135 684 102
3 338 684 135
3 338 685 34
3 135 685 338
3 102 686 135
3 339 686 102
3 339 687 11
3 102 687 339
3 340 688 103
3 43 688 340
3 103 689 340
3 214 689 103
3 341 690 214
3 11 690 341
3 214 691 341
3 103 691 214
3 215 692 43
3 342 692 215
3 342 693 103
3 215 693 342
3 343 694 43
3 215 694 343
3 343 695 34
3 43 695 343
3 440 888 216
3 104 888 440
3 440 889 60
3 216 889 440
3 441 890 216
3 59 890 441
3 441 891 104
3 216 891 441
3 442 892 217
3 104 892 442
3 442 893 58
3 217 893 442
3 443 894 217
3 60 894 443
3 443 895 104
3 217 895 443
3 444 896 218
3 105 896 444
3 444 897 60
3 218 897 444
3 445 898 218
3 43 898 445
3 445 899 105
3 218 899 445
3 446 900 219
3 105 900 446
3 446 901 59
3 219 901 446
3 447 902 219
3 60 902 447
3 447 903 105
3 219 903 447
3 448 904 220
3 106 904 448
3 448 905 61
3 220 905 448
3 449 906 220
3 59 906 449
3 449 907 106
3 220 907 449
3 450 908 221
3 106 908 450
3 450 909 42
3 221 909 450
3 451 910 221
3 61 910 451
3 451 911 106
3 221 911 451
3 452 912 222
3 107 912 452
3 452 913 61
3 222 913 452
3 453 914 222
3 58 914 453
3 453 915 107
3 222 915 453
3 454 916 223
3 107 916 454
3 454 917 59
3 223 917 454
3 455 918 223
3 61 918 455
3 455 919 107
3 223 919 455
3 456 920 224
3 108 920 456
3 456 921 63
3 224 921 456
3 457 922 224
3 62 922 457
3 457 923 108
3 224 923 457
3 458 924 225
3 108 924 458
3 458 925 58
3 225 925 458
3 459 926 225
3 63 926 459
3 459 927 108
3 225 927 459
3 460 928 226
3 109 928 460
3 460 929 63
3 226 929 460
3 461 930 226
3 11 930 461
3 461 931 109
3 226 931 461
3 462 932 227
3 109 932 462
3 462 933 62
3 227 933 462
3 463 934 227
3 63 934 463
3 463 935 109
3 227 935 463
3 464 936 228
3 110 936 464
3 464 937 64
3 228 937 464
3 465 938 228
3 62 938 465
3 465 939 110
3 228 939 465
3 466 940 229
3 110 940 466
3 466 941 43
3 229 941 466
3 467 942 229
3 64 942 467
3 467 943 110
3 229 943 467
3 468 944 230
3 111 944 468
3 468 945 64
3 230 945 468
3 469 946 230
3 58 946 469
3 469 947 111
3 230 947 469
3 470 948 231
3 111 948 470
3 470 949 62
3 231 949 470
3 471 950 231
3 64 950 471
3 471 951 111
3 231 951 471
3 472 952 232
3 112 952 472
3 472 953 67
3 232 953 472
3 473 954 232
3 66 954 473
3 473 955 112
3 232 955 473
3 474 956 233
3 112 956 474
3 474 957 65
3 233 957 474
3 475 958 233
3 67 958 475
3 475 959 112
3 233 959 475
3 476 960 234
3 113 960 476
3 476 961 67
3 234 961 476
3 477 962 234
3 10 962 477
3 477 963 113
3 234 963 477
3 478 964 235
3 113 964 478
3 478 965 66
3 235 965 478
3 479 966 235
3 67 966 479
3 479 967 113
3 235 967 479
3 480 968 236
3 114 968 480
3 480 969 68
3 236 969 480
3 481 970 236
3 66 970 481
3 481 971 114
3 236 971 481
3 482 972 237
3 114 972 482
3 482 973 11
3 237 973 482
3 483 974 237
3 68 974 483
3 483 975 114
3 237 975 483
3 484 976 238
3 115 976 484
3 484 977 68
3 238 977 484
3 485 978 238
3 65 978 485
3 485 979 115
3 238 979 485
3 486 980 239
3 115 980 486
3 486 981 66
3 239 981 486
3 487 982 239
3 68 982 487
3 487 983 115
3 239 983 487
3 488 984 240
3 116 984 488
3 488 985 70
3 240 985 488
3 489 986 240
3 69 986 489
3 489 987 116
3 240 987 489
3 490 988 241
3 116 988 490
3 490 989 65
3 241 989 490
3 491 990 241
3 70 990 491
3 491 991 116
3 241 991 491
3 492 992 242
3 117 992 492
3 492 993 70
3 242 993 492
3 493 994 242
3 42 994 493
3 493 995 117
3 242 995 493
3 494 996 243
3 117 996 494
3 494 997 69
3 243 997 494
3 495 998 243
3 70 998 495
3 495 999 117
3 243 999 495
3 496 1000 244
3 118 1000 496
3 496 1001 71
3 244 1001 496
3 497 1002 244
3 69 1002 497
3 497 1003 118
3 244 1003 497
3 498 1004 245
3 118 1004 498
3 498 1005 10
3 245 1005 498
3 499 1006 245
3 71 1006 499
3 499 1007 118
3 245 1007 499
3 500 1008 246
3 119 1008 500
3 500 1009 71
3 246 1009 500
3 501 1010 246
3 65 1010 501
3 501 1011 119
3 246 1011 501
3 502 1012 247
3 119 1012 502
3 502 1013 69
3 247 1013 502
3 503 1014 247
3 71 1014 503
3 503 1015 119
3 247 1015 503
3 504 1016 248
3 7 1016 504
3 504 1017 136
3 248 1017 504
3 505 1018 5
3 7 1018 505
3 505 1019 248
3 5 1019 505
3 136 1020 506
3 249 1020 136
3 506 1021 14
3 249 1021 506
3 507 1022 249
3 5 1022 507
3 249 1023 507
3 136 1023 249
3 14 696 344
3 15 696 14
3 344 697 137
3 15 697 344
3 345 698 137
3 7 698 345
3 345 699 15
3 137 699 345
3 508 1024 250
3 5 1024 508
3 508 1025 138
3 250 1025 508
3 509 1026 23
3 5 1026 509
3 509 1027 250
3 23 1027 509
3 138 1028 510
3 251 1028 138
3 510 1029 28
3 251 1029 510
3 511 1030 251
3 23 1030 511
3 251 1031 511
3 138 1031 251
3 28 700 346
3 14 700 28
3 346 701 139
3 14 701 346
3 347 702 139
3 5 702 347
3 347 703 14
3 139 703 347
3 512 1032 252
3 23 1032 512
3 512 1033 140
3 252 1033 512
3 513 1034 25
3 23 1034 513
3 513 1035 252
3 25 1035 513
3 140 1036 514
3 253 1036 140
3 514 1037 29
3 253 1037 514
3 515 1038 253
3 25 1038 515
3 253 1039 515
3 140 1039 253
3 29 704 348
3 28 704 29
3 348 705 141
3 28 705 348
3 349 706 141
3 23 706 349
3 349 707 28
3 141 707 349
3 516 1040 254
3 25 1040 516
3 516 1041 142
3 254 1041 516
3 517 1042 7
3 25 1042 517
3 517 1043 254
3 7 1043 517
3 142 1044 518
3 255 1044 142
3 518 1045 15
3 255 1045 518
3 519 1046 255
3 7 1046 519
3 255 1047 519
3 142 1047 255
3 15 708 350
3 29 708 15
3 350 709 143
3 29 709 350
3 351 710 143
3 25 710 351
3 351 711 29
3 143 711 351
3 520 1048 256
3 6 1048 520
3 520 1049 144
3 256 1049 520
3 521 1050 4
3 6 1050 521
3 521 1051 256
3 4 1051 521
3 144 1052 522
3 257 1052 144
3 522 1053 12
3 257 1053 522
3 523 1054 257
3 4 1054 523
3 257 1055 523
3 144 1055 257
3 12 712 352
3 13 712 12
3 352 713 145
3 13 713 352
3 353 714 145
3 6 714 353
3 353 715 13
3 145 715 353
3 524 1056 258
3 4 1056 524
3 524 1057 146
3 258 1057 524
3 525 1058 22
3 4 1058 525
3 525 1059 258
3 22 1059 525
3 146 1060 526
3 259 1060 146
3 526 1061 26
3 259 1061 526
3 527 1062 259
3 22 1062 527
3 259 1063 527
3 146 1063 259
3 26 716 354
3 12 716 26
3 354 717 147
3 12 717 354
3 355 718 147
3 4 718 355
3 355 719 12
3 147 719 355
3 528 1064 260
3 22 1064 528
3 528 1065 148
3 260 1065 528
3 529 1066 24
3 22 1066 529
3 529 1067 260
3 24 1067 529
3 148 1068 530
3 261 1068 148
3 530 1069 27
3 261 1069 530
3 531 1070 261
3 24 1070 531
3 261 1071 531
3 148 1071 261
3 27 720 356
3 26 720 27
3 356 721 149
3 26 721 356
3 357 722 149
3 22 722 357
3 357 723 26
3 149 723 357
3 532 1072 262
3 24 1072 532
3 532 1073 150
3 262 1073 532
3 533 1074 6
3 24 1074 533
3 533 1075 262
3 6 1075 533
3 150 1076 534
3 263 1076 150
3 534 1077 13
3 263 1077 534
3 535 1078 263
3 6 1078 535
3 263 1079 535
3 150 1079 263
3 13 724 358
3 27 724 13
3 358 725 151
3 27 725 358
3 359 726 151
3 24 726 359
3 359 727 27
3 151 727 359
3 536 1080 264
3 2 1080 536
3 536 1081 152
3 264 1081 536
3 537 1082 0
3 2 1082 537
3 537 1083 264
3 0 1083 537
3 152 1084 538
3 265 1084 152
3 538 1085 30
3 265 1085 538
3 539 1086 265
3 0 1086 539
3 265 1087 539
3 152 1087 265
3 30 728 360
3 31 728 30
3 360 729 153
3 31 729 360
3 361 730 153
3 2 730 361
3 361 731 31
3 153 731 361
3 540 1088 266
3 0 1088 540
3 540 1089 154
3 266 1089 540
3 541 1090 16
3 0 1090 541
3 541 1091 266
3 16 1091 541
3 154 1092 542
3 267 1092 154
3 542 1093 36
3 267 1093 542
3 543 1094 267
3 16 1094 543
3 267 1095 543
3 154 1095 267
3 36 732 362
3 30 732 36
3 362 733 155
3 30 733 362
3 363 734 155
3 0 734 363
3 363 735 30
3 155 735 363
3 544 1096 268
3 16 1096 544
3 544 1097 156
3 268 1097 544
3 545 1098 18
3 16 1098 545
3 545 1099 268
3 18 1099 545
3 156 1100 546
3 269 1100 156
3 546 1101 37
3 269 1101 546
3 547 1102 269
3 18 1102 547
3 269 1103 547
3 156 1103 269
3 37 736 364
3 36 736 37
3 364 737 157
3 36 737 364
3 365 738 157
3 16 738 365
3 365 739 36
3 157 739 365
3 548 1104 270
3 18 1104 548
3 548 1105 158
3 270 1105 548
3 549 1106 2
3 18 1106 549
3 549 1107 270
3 2 1107 549
3 158 1108 550
3 271 1108 158
3 550 1109 31
3 271 1109 550
3 551 1110 271
3 2 1110 551
3 271 1111 551
3 158 1111 271
3 31 740 366
3 37 740 31
3 366 741 159
3 37 741 366
3 367 742 159
3 18 742 367
3 367 743 37
3 159 743 367
3 552 1112 272
3 3 1112 552
3 552 1113 160
3 272 1113 552
3 553 1114 1
3 3 1114 553
3 553 1115 272
3 1 1115 553
3 160 1116 554
3 273 1116 160
3 554 1117 32
3 273 1117 554
3 555 1118 273
3 1 1118 555
3 273 1119 555
3 160 1119 273
3 32 744 368
3 33 744 32
3 368 745 161
3 33 745 368
3 369 746 161
3 3 746 369
3 369 747 33
3 161 747 369
3 556 1120 274
3 1 1120 556
3 556 1121 162
3 274 1121 556
3 557 1122 17
3 1 1122 557
3 557 1123 274
3 17 1123 557
3 162 1124 558
3 275 1124 162
3 558 1125 38
3 275 1125 558
3 559 1126 275
3 17 1126 559
3 275 1127 559
3 162 1127 275
3 38 748 370
3 32 748 38
3 370 749 163
3 32 749 370
3 371 750 163
3 1 750 371
3 371 751 32
3 163 751 371
3 560 1128 276
3 17 1128 560
3 560 1129 164
3 276 1129 560
3 561 1130 19
3 17 1130 561
3 561 1131 276
3 19 1131 561
3 164 1132 562
3 277 1132 164
3 562 1133 39
3 277 1133 562
3 563 1134 277
3 19 1134 563
3 277 1135 563
3 164 1135 277
3 39 752 372
3 38 752 39
3 372 753 165
3 38 753 372
3 373 754 165
3 17 754 373
3 373 755 38
3 165 755 373
3 564 1136 278
3 19 1136 564
3 564 1137 166
3 278 1137 564
3 565 1138 3
3 19 1138 565
3 565 1139 278
3 3 1139 565
3 166 1140 566
3 279 1140 166
3 566 1141 33
3 279 1141 566
3 567 1142 279
3 3 1142 567
3 279 1143 567
3 166 1143 279
3 33 756 374
3 39 756 33
3 374 757 167
3 39 757 374
3 375 758 167
3 19 758 375
3 375 759 39
3 167 759 375