OFF

174 344 0
0.104808 0.087486 -0.011597
-0.096554 0.087437 -0.004507
-0.023769 0.055074 0.009567
0.117294 -0.000073 0.032408
0.218396 -0.127542 -0.066058
-0.089985 -0.125742 -0.015931
0.148935 -0.116701 -0.031421
0.104462 -0.098489 -0.018379
-0.237447 0.064732 -0.029984
-0.199132 0.082185 -0.028559
-0.151913 0.048987 -0.028195
-0.285992 0.111718 -0.032388
-0.272118 0.034212 -0.032004
-0.301292 0.081099 -0.031182
-0.198214 0.035367 -0.029761
0.028582 -0.113760 -0.051432
0.212107 -0.023227 -0.061604
-0.083634 -0.114207 -0.045288
-0.206856 -0.104155 -0.041779
-0.386946 0.003704 -0.019078
-0.313120 -0.028889 -0.030956
-0.355570 -0.021530 -0.025477
-0.322063 0.021561 -0.033826
-0.252283 -0.043543 -0.033998
-0.129157 0.110068 -0.027897
-0.199089 -0.048203 -0.026586
-0.177782 -0.043147 -0.041288
0.015320 -0.052540 -0.041980
0.096736 -0.045061 -0.046380
-0.415199 0.000162 -0.012747
-0.286575 -0.129552 -0.038413
-0.155056 -0.064783 -0.009954
-0.023538 -0.000014 0.018506
-0.242006 -0.097154 -0.023377
-0.169183 -0.064774 -0.009416
-0.156212 -0.139766 -0.045635
0.096273 -0.138761 -0.059458
-0.025849 -0.149979 -0.052857
-0.243233 -0.032328 -0.007175
-0.056417 -0.016206 0.011391
-0.169759 0.032382 -0.001429
-0.290849 0.097096 -0.027625
0.035520 -0.139744 -0.046234
-0.056566 -0.043819 0.007019
-0.090107 -0.130994 -0.019476
-0.169339 0.119800 -0.018582
-0.218754 -0.032339 -0.005222
-0.145280 0.032371 0.000524
0.011612 0.013743 0.019747
-0.056714 -0.071432 0.002647
-0.266370 0.097085 -0.025672
-0.056863 -0.099045 -0.001725
-0.390720 0.000151 -0.010794
-0.194276 -0.032350 -0.003269
-0.132831 0.076074 -0.007076
-0.120801 0.032360 0.002477
-0.241892 0.097074 -0.023719
-0.366241 0.000140 -0.008841
-0.169797 -0.032361 -0.001315
-0.155205 -0.092396 -0.014326
-0.096322 0.032349 0.004431
-0.155353 -0.120009 -0.018698
0.082028 0.013714 0.026698
-0.341762 0.000129 -0.006888
-0.145318 -0.032372 0.000638
0.046646 0.055045 0.016519
-0.253696 -0.113360 -0.031298
-0.317283 0.000118 -0.004934
-0.120839 -0.032383 0.002591
-0.278417 -0.113344 -0.030357
-0.155596 -0.130513 -0.025788
-0.292805 0.000107 -0.002981
0.157643 -0.128525 -0.052834
-0.339921 -0.097110 -0.031190
-0.268326 0.000096 -0.001028
-0.315442 -0.097121 -0.029237
-0.243847 0.000085 0.000926
-0.364937 0.064799 -0.025271
-0.169223 0.092256 -0.014113
-0.290964 -0.097132 -0.027284
-0.278284 0.113256 -0.030756
-0.219368 0.000074 0.002879
-0.340459 0.064788 -0.023317
-0.023653 0.027530 0.014037
-0.266485 -0.097143 -0.025330
-0.132715 0.048530 -0.002607
-0.089297 -0.032399 0.004276
-0.194889 0.000063 0.004832
-0.221086 -0.130033 -0.032101
-0.315980 0.064777 -0.021364
-0.089445 -0.060012 -0.000096
-0.090723 -0.140246 -0.039323
-0.089594 -0.087624 -0.004468
-0.170410 0.000052 0.006786
-0.291501 0.064766 -0.019411
-0.059949 -0.016204 0.011525
-0.089742 -0.115237 -0.008840
0.005451 -0.135609 -0.029699
0.096889 -0.129508 -0.039611
-0.145932 0.000041 0.008739
-0.187936 -0.080975 -0.017069
0.046762 0.027501 0.020988
-0.267022 0.064755 -0.017457
-0.188085 -0.108588 -0.021441
-0.121453 0.000030 0.010692
-0.242543 0.064744 -0.015504
-0.365014 -0.064686 -0.025043
-0.096974 0.000019 0.012646
-0.218065 0.064733 -0.013551
0.040165 -0.104477 -0.008681
-0.340535 -0.064697 -0.023089
0.159090 0.058926 0.007448
-0.205615 0.108437 -0.021150
-0.072495 0.000008 0.014599
-0.193586 0.064722 -0.011597
-0.314676 0.129437 -0.037794
0.081796 0.068802 0.017760
-0.316056 -0.064708 -0.021136
-0.060046 0.043711 0.006999
0.039922 -0.114982 -0.015771
-0.169107 0.064712 -0.009644
-0.205595 -0.080964 -0.016397
-0.291577 -0.064719 -0.019183
-0.057670 -0.135861 -0.026243
0.036136 -0.130492 -0.026387
-0.267098 -0.064730 -0.017229
-0.023686 -0.027627 0.014134
-0.390068 0.032480 -0.019009
-0.023834 -0.055240 0.009762
-0.242620 -0.064741 -0.015276
0.011596 -0.013835 0.019795
-0.365589 0.032469 -0.017056
-0.023983 -0.082853 0.005390
0.144580 -0.110789 -0.020714
0.011448 -0.041448 0.015423
-0.122177 -0.048591 -0.002839
-0.218141 -0.064752 -0.013323
0.046878 -0.000043 0.025457
-0.341110 0.032458 -0.015102
0.011299 -0.069061 0.011051
-0.122325 -0.076204 -0.007211
0.011496 0.041287 0.015278
0.046730 -0.027656 0.021085
0.088181 -0.117684 -0.018197
0.011151 -0.096674 0.006679
-0.390106 -0.032262 -0.018895
-0.122474 -0.103817 -0.011583
-0.193662 -0.064763 -0.011369
-0.316632 0.032447 -0.013149
0.046581 -0.055269 0.016713
0.082012 -0.013864 0.026746
-0.242008 0.124618 -0.028188
-0.365627 -0.032273 -0.016942
0.046433 -0.082882 0.012341
-0.220816 -0.097168 -0.024184
-0.292153 0.032437 -0.011196
0.081863 -0.041477 0.022374
-0.096438 0.059893 -0.000038
-0.220964 -0.124781 -0.028556
-0.205499 0.080893 -0.016681
-0.341149 -0.032284 -0.014988
-0.267674 0.032426 -0.009242
0.081912 0.041258 0.022229
0.117145 -0.027686 0.028036
-0.059930 0.016167 0.011468
-0.316670 -0.032295 -0.013035
-0.243195 0.032415 -0.007289
-0.292191 -0.032306 -0.011082
-0.218716 0.032404 -0.005336
-0.339807 0.097118 -0.031532
-0.267712 -0.032317 -0.009129
-0.194238 0.032393 -0.003382
-0.315328 0.097107 -0.029579
-0.314829 -0.129534 -0.037338
3 4 111 16
3 111 0 16
3 0 24 16
3 0 45 24
3 0 116 45
3 116 1 45
3 24 28 16
3 24 27 28
3 1 54 45
3 54 78 45
3 24 10 27
3 24 9 10
3 54 120 78
3 116 2 1
3 116 65 2
3 0 111 116
3 111 3 116
3 111 163 3
3 111 133 163
3 111 6 133
3 3 162 116
3 65 141 2
3 111 4 6
3 4 72 6
3 10 26 27
3 26 17 27
3 2 118 1
3 118 157 1
3 3 62 162
3 17 37 27
3 118 60 157
3 133 7 163
3 7 156 163
3 7 153 156
3 7 109 153
3 109 144 153
3 109 119 144
3 119 124 144
3 124 97 144
3 97 51 144
3 97 123 51
3 123 96 51
3 123 5 96
3 123 44 5
3 51 132 144
3 153 149 156
3 97 37 123
3 10 14 26
3 119 143 124
3 51 49 132
3 149 142 156
3 156 150 163
3 123 91 44
3 124 42 97
3 6 98 133
3 44 61 5
3 58 34 53
3 34 147 53
3 58 31 34
3 58 64 31
3 34 121 147
3 121 136 147
3 113 95 107
3 95 86 107
3 86 104 107
3 86 68 104
3 86 135 68
3 26 23 25
3 45 151 9
3 18 26 25
3 169 77 13
3 14 8 12
3 26 14 23
3 151 115 11
3 145 19 29
3 21 22 127
3 9 14 10
3 115 13 11
3 13 12 8
3 37 17 35
3 36 28 15
3 20 23 12
3 14 12 23
3 13 22 12
3 21 127 19
3 21 145 106
3 12 22 20
3 13 115 169
3 106 73 20
3 9 151 8
3 18 30 35
3 22 21 20
3 19 127 29
3 18 35 26
3 15 27 37
3 37 36 15
3 32 39 95
3 23 73 30
3 106 20 21
3 18 25 23
3 21 19 145
3 13 8 11
3 24 45 9
3 8 14 9
3 121 100 154
3 121 34 100
3 66 69 33
3 33 79 84
3 22 13 77
3 22 77 127
3 30 70 88
3 28 27 15
3 35 17 26
3 28 4 16
3 154 33 121
3 66 30 69
3 28 36 4
3 151 11 8
3 23 20 73
3 69 30 173
3 39 86 95
3 23 30 18
3 31 100 34
3 173 30 73
3 33 154 66
3 64 135 31
3 68 135 64
3 50 41 56
3 47 60 55
3 108 120 114
3 44 70 61
3 158 70 30
3 158 61 70
3 5 61 96
3 156 142 150
3 163 150 3
3 130 137 142
3 130 32 137
3 150 137 3
3 150 142 137
3 149 134 142
3 149 153 134
3 130 134 32
3 130 142 134
3 139 144 128
3 139 153 144
3 132 128 144
3 126 134 128
3 126 32 134
3 139 134 153
3 139 128 134
3 110 160 117
3 110 106 160
3 165 160 67
3 165 117 160
3 75 73 117
3 75 173 73
3 110 73 106
3 110 117 73
3 152 145 57
3 152 106 145
3 52 145 29
3 52 57 145
3 63 160 57
3 63 67 160
3 152 160 106
3 152 57 160
3 170 167 74
3 170 125 167
3 71 167 67
3 71 74 167
3 76 38 74
3 76 81 38
3 170 38 125
3 170 74 38
3 122 79 117
3 122 125 79
3 75 79 173
3 75 117 79
3 165 167 117
3 165 67 167
3 122 167 125
3 122 117 167
3 58 53 93
3 87 53 81
3 87 93 53
3 99 64 93
3 99 104 64
3 58 93 64
3 95 113 32
3 68 64 104
3 129 33 125
3 129 136 33
3 121 33 136
3 69 79 33
3 69 173 79
3 84 125 33
3 84 79 125
3 46 53 136
3 46 81 53
3 147 136 53
3 129 38 136
3 129 125 38
3 46 38 81
3 46 136 38
3 140 146 31
3 140 92 146
3 59 146 61
3 59 31 146
3 51 96 92
3 146 96 61
3 146 92 96
3 103 158 154
3 103 61 158
3 66 158 30
3 66 154 158
3 103 100 61
3 103 154 100
3 59 100 31
3 59 61 100
3 90 49 92
3 90 86 49
3 51 92 49
3 140 135 92
3 140 31 135
3 90 135 86
3 90 92 135
3 43 39 128
3 43 86 39
3 126 39 32
3 126 128 39
3 132 49 128
3 43 49 86
3 43 128 49
3 109 7 119
3 133 143 7
3 119 7 143
3 91 35 70
3 91 37 35
3 88 35 30
3 88 70 35
3 123 37 91
3 44 91 70
3 6 72 98
3 124 143 98
3 133 98 143
3 124 98 42
3 97 42 37
3 72 36 98
3 72 4 36
3 42 36 37
3 42 98 36
3 83 141 32
3 83 2 141
3 65 116 101
3 162 101 116
3 48 141 101
3 48 32 141
3 65 101 141
3 62 137 101
3 62 3 137
3 48 137 32
3 48 101 137
3 162 62 101
3 168 166 108
3 168 81 166
3 105 166 102
3 105 108 166
3 114 171 108
3 114 120 171
3 168 171 81
3 168 108 171
3 50 102 41
3 50 56 102
3 80 41 115
3 80 56 41
3 159 108 56
3 159 120 108
3 105 56 108
3 105 102 56
3 55 104 47
3 55 60 104
3 85 47 120
3 85 60 47
3 164 113 60
3 164 32 113
3 107 60 113
3 107 104 60
3 40 47 93
3 40 120 47
3 99 47 104
3 99 93 47
3 87 171 93
3 87 81 171
3 40 171 120
3 40 93 171
3 94 155 89
3 94 102 155
3 148 155 67
3 148 89 155
3 172 41 89
3 172 115 41
3 94 41 102
3 94 89 41
3 161 166 74
3 161 102 166
3 76 166 81
3 76 74 166
3 71 155 74
3 71 67 155
3 161 155 102
3 161 74 155
3 131 138 57
3 131 77 138
3 63 138 67
3 63 57 138
3 52 127 57
3 52 29 127
3 131 127 77
3 131 57 127
3 82 169 89
3 82 77 169
3 172 169 115
3 172 89 169
3 148 138 89
3 148 67 138
3 82 138 77
3 82 89 138
3 83 164 2
3 83 32 164
3 118 164 60
3 118 2 164
3 157 85 1
3 157 60 85
3 54 85 120
3 54 1 85
3 78 159 45
3 78 120 159
3 112 159 56
3 112 45 159
3 80 151 56
3 80 115 151
3 112 151 45
3 112 56 151
