OFF

189 374 0
-0.378063 0.189259 0.100112
0.363085 0.160555 0.171819
0.203740 0.159858 0.181678
0.076777 0.193566 0.178649
0.106458 0.223381 0.182498
0.319898 0.160335 0.174323
-0.344491 0.219743 0.129957
0.293051 0.189836 0.175280
0.048663 0.193403 0.179222
0.137139 0.223558 0.181872
-0.181844 0.157467 0.185498
-0.126487 0.222045 0.183203
0.076135 0.188567 0.183745
0.048021 0.188404 0.184318
-0.299737 0.220487 0.155946
0.139955 0.159489 0.182978
-0.005819 0.193284 0.185321
-0.037122 0.158305 0.182548
0.264978 0.160017 0.175442
0.347661 0.224810 0.173438
-0.209380 0.157308 0.186059
-0.154022 0.221885 0.183764
0.170637 0.159667 0.182353
0.347700 0.160511 0.174633
0.104036 0.223367 0.182547
-0.035671 0.187919 0.186024
0.362819 0.195101 0.170925
-0.006663 0.188103 0.180440
-0.181345 0.187089 0.184949
0.238132 0.189518 0.176399
0.106852 0.159297 0.183653
-0.257451 0.221207 0.180286
-0.236858 0.191393 0.184082
0.205768 0.223956 0.180474
0.019874 0.193432 0.184797
0.236450 0.224133 0.179848
0.137534 0.159475 0.183028
-0.257454 0.191453 0.180450
-0.008240 0.193270 0.185370
0.439412 0.189760 0.121190
-0.208880 0.186929 0.185511
-0.236776 0.187058 0.184744
-0.096314 0.187584 0.182268
-0.126773 0.157786 0.184375
0.397587 0.160405 0.150512
0.418689 0.189889 0.135391
-0.065587 0.192938 0.186539
0.171692 0.189133 0.177803
0.319798 0.195010 0.174643
0.139774 0.188935 0.182447
0.292913 0.224476 0.173706
0.172665 0.223764 0.181148
-0.038092 0.187905 0.186073
0.104431 0.159283 0.183702
-0.097103 0.192596 0.183141
-0.154308 0.157627 0.184936
0.264879 0.194692 0.175763
-0.006952 0.222737 0.180766
0.206163 0.159872 0.181629
-0.066431 0.187757 0.181659
0.397753 0.224656 0.148968
0.137995 0.193921 0.177401
0.236844 0.160050 0.181003
0.106671 0.188743 0.183122
0.237994 0.224158 0.174825
0.104892 0.193729 0.178076
-0.126274 0.187407 0.183827
-0.236904 0.221425 0.185328
0.137353 0.188921 0.182497
0.205029 0.189326 0.177074
0.321250 0.224624 0.178120
0.266331 0.224306 0.179239
0.021451 0.188266 0.179867
0.292438 0.160176 0.174882
0.438818 0.194787 0.121485
-0.280281 0.191190 0.167672
0.173060 0.159681 0.182303
0.376569 0.195169 0.164049
-0.153809 0.187248 0.184388
-0.096603 0.222218 0.182594
0.347874 0.190173 0.174062
0.104250 0.188729 0.183172
0.459537 0.194542 0.106780
0.078524 0.193772 0.183602
-0.067401 0.192751 0.182087
0.050410 0.193609 0.184175
-0.066720 0.222391 0.181985
0.318829 0.224610 0.178169
0.022296 0.193447 0.184748
-0.257138 0.186692 0.180504
0.263909 0.224292 0.179288
-0.007238 0.158478 0.181938
0.077157 0.223224 0.179102
0.418095 0.194915 0.135686
0.138684 0.223583 0.176849
0.077679 0.188592 0.178721
0.321645 0.160541 0.179275
0.266725 0.160223 0.180394
0.021162 0.222900 0.180193
0.105581 0.223392 0.177524
0.049566 0.188429 0.179294
-0.279873 0.220817 0.167480
0.363104 0.190296 0.170923
0.076103 0.193758 0.183651
0.172878 0.189127 0.181773
-0.005787 0.188092 0.185415
0.047989 0.193595 0.184224
0.204415 0.159666 0.176676
0.204891 0.223967 0.175500
0.292338 0.194851 0.175203
-0.096889 0.157959 0.183766
0.020876 0.158641 0.181365
0.078343 0.223218 0.183071
0.319223 0.160527 0.179324
0.264304 0.160209 0.180444
0.397966 0.190018 0.149592
0.459767 0.224289 0.106233
0.237518 0.159858 0.176002
0.138208 0.159283 0.178026
0.376964 0.224784 0.163164
-0.007566 0.193078 0.180368
0.171312 0.159475 0.177351
0.019906 0.188241 0.184891
-0.035703 0.193111 0.185930
-0.067006 0.158132 0.183157
0.293790 0.224465 0.178679
0.238870 0.224147 0.179799
0.171788 0.223775 0.176175
0.105105 0.159091 0.178701
-0.008208 0.188078 0.185464
0.320511 0.189995 0.174720
0.049277 0.223063 0.179620
-0.378297 0.219067 0.099837
0.439032 0.160148 0.122110
-0.182058 0.192104 0.184873
-0.095437 0.187573 0.187242
0.376783 0.160532 0.164673
-0.036547 0.187930 0.181049
-0.065555 0.187746 0.186633
0.265592 0.189677 0.175839
0.020549 0.193240 0.179795
0.139742 0.194127 0.182354
0.360721 0.225291 0.164867
-0.322522 0.190489 0.143142
-0.209593 0.191945 0.185434
0.291368 0.224451 0.178729
0.170424 0.194304 0.181728
0.363018 0.224852 0.170546
0.347486 0.195148 0.174008
0.204316 0.194342 0.176997
0.294185 0.160382 0.179834
0.239265 0.160064 0.180954
0.458293 0.224705 0.099005
-0.097859 0.187559 0.187291
0.138898 0.188946 0.177473
0.237419 0.194533 0.176322
0.418309 0.160276 0.136311
-0.067976 0.187732 0.186682
-0.181558 0.221726 0.184325
0.105794 0.188754 0.178148
0.106639 0.193935 0.183029
0.203346 0.223942 0.180523
0.137321 0.194113 0.182403
0.077104 0.158966 0.180219
0.439198 0.224399 0.120566
-0.344899 0.190117 0.130148
0.171448 0.194153 0.177717
0.048990 0.158804 0.180792
-0.037517 0.192924 0.181478
-0.036836 0.222564 0.181375
0.320374 0.224635 0.173146
-0.209093 0.221566 0.184887
-0.364501 0.219454 0.118129
-0.126986 0.192423 0.183750
0.397373 0.195042 0.149887
-0.300145 0.190860 0.156137
0.418475 0.224528 0.134767
0.291763 0.160368 0.179884
-0.322115 0.220115 0.142951
0.139561 0.223572 0.181823
0.078556 0.188581 0.183695
0.170243 0.223750 0.181198
0.104218 0.193921 0.183078
0.050442 0.188418 0.184268
0.265454 0.224317 0.174265
-0.363955 0.189484 0.117401
0.022328 0.188255 0.184841
-0.154522 0.192264 0.184312
0.377178 0.190146 0.163788
3 0 133 132
3 133 82 132
3 82 152 132
3 152 172 132
3 152 6 172
3 152 178 6
3 152 14 178
3 152 101 14
3 152 31 101
3 152 67 31
3 152 171 67
3 0 20 133
3 20 10 133
3 10 55 133
3 55 43 133
3 152 158 171
3 152 11 158
3 152 79 11
3 152 86 79
3 43 110 133
3 110 124 133
3 124 17 133
3 17 91 133
3 91 163 133
3 163 156 133
3 163 44 156
3 163 128 44
3 128 136 44
3 128 1 136
3 128 118 1
3 118 121 1
3 121 107 1
3 107 73 1
3 73 5 1
3 5 23 1
3 152 169 86
3 152 131 169
3 152 92 131
3 0 185 20
3 82 116 152
3 107 18 73
3 107 117 18
3 185 89 20
3 133 39 82
3 39 45 82
3 45 102 82
3 102 26 82
3 131 98 169
3 98 57 169
3 91 111 163
3 111 167 163
3 11 21 158
3 152 99 92
3 152 94 99
3 152 127 94
3 152 108 127
3 152 64 108
3 152 184 64
3 152 50 184
3 152 170 50
3 152 142 170
3 89 41 20
3 41 40 20
3 82 74 116
3 185 172 165
3 172 6 165
3 185 132 172
3 142 152 119
3 10 20 28
3 55 10 78
3 43 55 66
3 110 43 153
3 124 110 157
3 17 124 52
3 91 17 129
3 111 91 122
3 167 111 13
3 163 167 12
3 53 163 81
3 36 30 68
3 22 15 47
3 2 76 69
3 62 58 29
3 114 151 139
3 177 97 7
3 113 150 130
3 23 96 80
3 1 23 102
3 136 1 188
3 44 136 115
3 156 44 45
3 133 156 39
3 96 23 5
3 150 113 73
3 113 130 5
3 97 177 18
3 177 7 73
3 151 114 117
3 114 139 18
3 58 62 107
3 62 29 117
3 76 2 121
3 104 76 47
3 2 69 107
3 15 22 118
3 49 15 154
3 22 47 121
3 30 36 128
3 63 30 159
3 68 63 154
3 36 68 118
3 180 163 95
3 81 180 159
3 53 81 128
3 183 167 100
3 12 183 95
3 186 111 72
3 13 186 100
3 105 91 27
3 122 105 72
3 25 17 137
3 129 25 27
3 138 124 59
3 52 138 137
3 135 110 42
3 157 135 59
3 153 66 42
3 41 102 42
3 41 89 32
3 102 41 32
3 26 32 120
3 46 168 84
3 38 57 120
3 123 38 168
3 34 98 140
3 16 34 120
3 106 131 8
3 88 106 140
3 103 92 3
3 85 103 8
3 182 24 65
3 83 182 3
3 112 83 92
3 24 112 99
3 162 9 61
3 160 162 65
3 4 160 99
3 9 4 94
3 146 181 166
3 141 146 61
3 179 141 94
3 181 179 127
3 51 166 127
3 161 51 108
3 33 149 108
3 35 33 64
3 126 155 64
3 90 126 184
3 71 56 184
3 145 71 50
3 125 109 50
3 87 125 170
3 70 48 170
3 164 116 74
3 176 164 93
3 60 176 174
3 119 60 77
3 147 119 26
3 19 147 148
3 70 19 48
3 125 87 109
3 71 145 56
3 126 90 155
3 33 35 149
3 51 161 166
3 179 181 141
3 4 9 160
3 112 24 83
3 131 92 85
3 98 131 88
3 57 98 16
3 169 57 123
3 86 169 46
3 79 86 54
3 11 79 173
3 21 11 187
3 158 21 134
3 171 158 144
3 67 171 32
3 31 67 37
3 101 31 75
3 14 101 175
3 178 14 143
3 6 178 165
3 0 132 185
3 116 164 152
3 164 176 152
3 176 60 152
3 60 119 152
3 119 147 142
3 147 19 142
3 19 170 142
3 40 28 20
3 28 78 10
3 78 66 55
3 66 153 43
3 135 157 110
3 138 52 124
3 25 129 17
3 105 122 91
3 186 13 111
3 183 12 167
3 180 81 163
3 63 68 30
3 49 47 15
3 104 69 76
3 69 29 58
3 29 139 151
3 139 7 97
3 7 130 150
3 130 80 96
3 80 102 23
3 102 188 1
3 188 115 136
3 115 45 44
3 45 39 156
3 5 130 96
3 5 73 113
3 73 7 150
3 73 18 177
3 18 139 97
3 18 117 114
3 117 29 151
3 117 107 62
3 107 69 58
3 107 121 2
3 121 47 76
3 47 69 104
3 121 118 22
3 118 154 15
3 154 47 49
3 118 128 36
3 128 159 30
3 159 154 63
3 154 118 68
3 128 163 53
3 95 159 180
3 159 128 81
3 100 95 183
3 95 163 12
3 72 100 186
3 100 167 13
3 27 72 105
3 72 111 122
3 137 27 25
3 27 91 129
3 59 137 138
3 137 17 52
3 42 59 135
3 59 124 157
3 42 110 153
3 45 115 102
3 115 188 102
3 80 130 102
3 130 7 102
3 7 139 102
3 139 29 102
3 29 69 102
3 69 47 102
3 47 154 102
3 154 159 102
3 159 95 102
3 95 100 102
3 100 72 102
3 72 27 102
3 27 137 102
3 137 59 102
3 59 42 102
3 42 66 41
3 66 78 41
3 78 28 41
3 28 40 41
3 185 37 89
3 37 32 89
3 32 26 102
3 165 143 185
3 143 175 185
3 175 75 185
3 75 37 185
3 144 134 32
3 134 187 32
3 187 173 32
3 173 54 32
3 54 84 32
3 84 168 32
3 168 120 32
3 120 140 26
3 140 8 26
3 8 3 26
3 3 65 26
3 65 61 26
3 61 166 26
3 166 149 26
3 149 155 26
3 155 56 26
3 56 109 26
3 109 48 26
3 48 148 26
3 77 174 26
3 174 93 26
3 93 74 26
3 74 82 26
3 84 86 46
3 120 168 38
3 168 169 123
3 140 120 34
3 120 57 16
3 8 140 106
3 140 98 88
3 3 8 103
3 8 131 85
3 99 65 24
3 65 3 182
3 3 92 83
3 92 99 112
3 94 61 9
3 61 65 162
3 65 99 160
3 99 94 4
3 127 166 181
3 166 61 146
3 61 94 141
3 94 127 179
3 108 149 161
3 127 108 51
3 64 155 35
3 108 64 33
3 184 56 90
3 64 184 126
3 50 109 145
3 184 50 71
3 170 48 87
3 50 170 125
3 170 19 70
3 74 93 164
3 93 174 176
3 174 77 60
3 77 26 119
3 26 148 147
3 148 48 19
3 48 109 87
3 109 56 145
3 56 155 90
3 155 149 35
3 149 166 161
3 146 141 181
3 162 160 9
3 182 83 24
3 103 85 92
3 106 88 131
3 34 16 98
3 38 123 57
3 168 46 169
3 84 54 86
3 54 173 79
3 173 187 11
3 187 134 21
3 134 144 158
3 144 32 171
3 32 37 67
3 37 75 31
3 75 175 101
3 175 143 14
3 143 165 178
