"tick","Other_happiness","EV_happiness"
1.0,0.4835164317454199,0.4121355988661642
2.0,0.479603807649006,0.45715472378312516
3.0,0.4813005127412691,0.49168984937114285
4.0,0.4824640274611466,0.49168984937114285
5.0,0.48094164773289894,0.4296301885290005
6.0,0.47939038604889583,0.49294175257353423
7.0,0.484433356146883,0.46848241193343804
8.0,0.48099910075609603,0.4922402543896888
9.0,0.48366937085039885,0.49294175257353423
10.0,0.4809110598617588,0.4922402543896888
11.0,0.4823081223315707,0.49168984937114285
12.0,0.48425546433746464,0.49168984937114285
13.0,0.4864141848418471,0.4900322146618075
14.0,0.4822108459442222,0.49168984937114285
15.0,0.48053106380396726,0.4964731076884537
16.0,0.4813765838055923,0.4922402543896888
17.0,0.4838083197435839,0.4909883511872978
18.0,0.48394848705383586,0.49294175257353423
19.0,0.48160233386624685,0.4777744986654518
20.0,0.48256755732583834,0.4922402543896888
21.0,0.48241349960673136,0.4893307164779622
22.0,0.48199141811336704,0.49168984937114285
23.0,0.48404739937762636,0.49294175257353423
24.0,0.481252873177926,0.4909883511872978
25.0,0.4842028399227281,0.4900322146618075
26.0,0.48133552029464666,0.4909883511872978
27.0,0.48401743351690424,0.49294175257353423
28.0,0.4847923079802248,0.4909883511872978
29.0,0.4841068833427454,0.48108130884949574
30.0,0.4817732017822822,0.4697226720885189
31.0,0.484145382995846,0.4777744986654518
32.0,0.4831756890270032,0.49168984937114285
33.0,0.48208361655478654,0.49294175257353423
34.0,0.48167945739168483,0.4668247772241027
35.0,0.48497101508282925,0.4697343151358294
36.0,0.4801606779407102,0.4909883511872978
37.0,0.48298164963348017,0.49168984937114285
38.0,0.48226589673431225,0.48893444253020724
39.0,0.4826804426276966,0.4900322146618075
40.0,0.4838523704093185,0.4922402543896888
41.0,0.4792979548620588,0.49168984937114285
42.0,0.48404122073989464,0.49294175257353423
43.0,0.47866881271990935,0.4828676201632978
44.0,0.4816192816993333,0.49168984937114285
45.0,0.479867764604056,0.49294175257353423
46.0,0.482004922390696,0.48323132616076064
47.0,0.4828378917909375,0.48127422835206696
48.0,0.48339314062649824,0.4909883511872978
49.0,0.48346975378598583,0.49168984937114285
50.0,0.48308997673464676,0.4909883511872978
51.0,0.482063704648782,0.4821661219794524
52.0,0.48027731661506917,0.4697343151358294
53.0,0.48109487608820234,0.4562588033465338
54.0,0.4826357116655345,0.4777744986654518
55.0,0.4823596089929183,0.4900322146618075
56.0,0.48429011864582217,0.49168984937114285
57.0,0.48319531621858564,0.4900322146618075
58.0,0.480678727167229,0.49294175257353423
59.0,0.4822656590068093,0.4668247772241027
60.0,0.4801119029738274,0.4909883511872978
61.0,0.48121973235999227,0.4909883511872978
62.0,0.4799110774485259,0.49168984937114285
63.0,0.4815012764429427,0.4909883511872978
64.0,0.481378808636709,0.49168984937114285
65.0,0.47960529460465695,0.4922402543896888
66.0,0.4839970643953674,0.4922402543896888
67.0,0.475874959967886,0.4883524990024787
68.0,0.4830661727874012,0.4900322146618074
69.0,0.4808146453797725,0.49294175257353423
70.0,0.4811764107717004,0.49294175257353423
71.0,0.48436366708317663,0.49168984937114285
72.0,0.47942103171148603,0.4922402543896888
73.0,0.48504308279831143,0.4900322146618074
74.0,0.481497886195975,0.45674989306024777
75.0,0.48296569278440854,0.4909883511872978
76.0,0.48364918690146935,0.485459147695349
77.0,0.48199101582466325,0.4879346459126063
78.0,0.48382998122297655,0.4909883511872978
79.0,0.48338950778748135,0.4922402543896888
80.0,0.4801460648198003,0.4909883511872978
81.0,0.48571745229981655,0.4821661219794524
82.0,0.4794953406664033,0.49294175257353423
83.0,0.4786622677212893,0.4909883511872978
84.0,0.4830166538309426,0.4922402543896888
85.0,0.4849377492010261,0.49003221466180746
86.0,0.48109385842452107,0.49168984937114285
87.0,0.48152996256027597,0.4909883511872978
88.0,0.48182918453108775,0.4697343151358294
89.0,0.48563285936296763,0.4298207063702008
90.0,0.4795859596075418,0.4922402543896888
91.0,0.4838589082918673,0.4697343151358294
92.0,0.48457313092622595,0.48380151298601365
93.0,0.4827661946707567,0.49001096174565745
94.0,0.48308709755835505,0.49294175257353423
95.0,0.4812885185940614,0.49168984937114285
96.0,0.48233616695307396,0.46848241193343804
97.0,0.4832080736192897,0.4821661219794524
98.0,0.4840437103828386,0.49168984937114285
99.0,0.48380067914716746,0.49168984937114285
100.0,0.48007559568758257,0.46848241193343804
101.0,0.48057246184856545,0.49168984937114285
102.0,0.4818875225214815,0.4952212044860625
103.0,0.48097952958400403,0.4922402543896888
104.0,0.47814147050666667,0.4922402543896888
105.0,0.48458539966421826,0.49168984937114285
106.0,0.4821559346179275,0.4922402543896888
107.0,0.4803235926641076,0.49168984937114285
108.0,0.4846271886374301,0.4790159947564612
109.0,0.48372926060128285,0.49168984937114285
110.0,0.48194886509287177,0.4909883511872978
111.0,0.4784869761863125,0.49294175257353423
112.0,0.48094429888019147,0.48669044812680895
113.0,0.48329287261724424,0.49294175257353423
114.0,0.483709074272927,0.4898707572476714
115.0,0.4838192542788411,0.48823294434636205
116.0,0.48041445355369317,0.49168984937114285
117.0,0.4825714270271298,0.49168984937114285
118.0,0.4844488067275843,0.4821661219794524
119.0,0.4812879820179424,0.4887590585432663
120.0,0.48235810753649216,0.49168984937114285
121.0,0.48282737360671407,0.4342493154649557
122.0,0.4852150577024813,0.4821661219794524
123.0,0.4841993482020301,0.4697226720885189
124.0,0.48040819063686757,0.49168984937114285
125.0,0.48156405318430834,0.49003221466180746
126.0,0.48159572791031546,0.49168984937114285
127.0,0.4815053930059006,0.49168984937114285
128.0,0.4790479847099299,0.49003221466180746
129.0,0.4799229377843195,0.4697343151358294
130.0,0.48194761355182447,0.4909883511872978
131.0,0.48556025345076154,0.4812742283520669
132.0,0.4818707995210924,0.48323132616076064
133.0,0.48293042664357283,0.4922402543896888
134.0,0.48129136291240737,0.4893307164779622
135.0,0.48448019614896776,0.4719519647325499
136.0,0.48167076972559186,0.4922402543896888
137.0,0.4831939288637742,0.4909883511872978
138.0,0.48571643452178165,0.4922402543896888
139.0,0.48002538320056315,0.4909883511872978
140.0,0.48063828816504084,0.4777744986654518
141.0,0.48296225256347686,0.49003221466180746
142.0,0.48217476550304283,0.49294175257353423
143.0,0.48236323111560997,0.4909883511872978
144.0,0.4797776571637083,0.49168984937114285
145.0,0.4814215756390689,0.49168984937114285
146.0,0.48119378839427446,0.49294175257353423
147.0,0.4801746896506771,0.4802678979588526
148.0,0.47844954842851234,0.49294175257353423
149.0,0.4786173843791078,0.4777744986654518
150.0,0.4813460566970915,0.4819924532002408
151.0,0.4859024148779792,0.4579100652010061
152.0,0.4853067321361874,0.48483282604337163
153.0,0.4809927914806062,0.49003221466180746
154.0,0.4830452755830946,0.4893307164779622
155.0,0.47808742474086097,0.49168984937114285
156.0,0.48735032366176795,0.4912620369142047
157.0,0.4833219280177978,0.49168984937114285
158.0,0.4831952324016677,0.49294175257353423
159.0,0.48269983970129027,0.49294175257353423
160.0,0.4816516936874223,0.4909883511872978
161.0,0.4825276346750879,0.49294175257353423
162.0,0.48232471963037443,0.4828676201632978
163.0,0.4821887414170338,0.49294175257353423
164.0,0.4799053540453877,0.49168984937114285
165.0,0.4859049106799574,0.49168984937114285
166.0,0.47862862469261597,0.49168984937114285
167.0,0.4812537661144663,0.4922402543896888
168.0,0.48368658241971624,0.49168984937114285
169.0,0.4806302673014427,0.4909883511872978
170.0,0.48465393400090745,0.49168984937114285
171.0,0.48364903441902596,0.46848241193343804
172.0,0.4843226809157984,0.49168984937114285
173.0,0.4786784876522834,0.4922402543896888
174.0,0.4806976937266312,0.46848241193343804
175.0,0.48504302506973473,0.4922402543896888
176.0,0.4847745897699385,0.49168984937114285
177.0,0.4834979346388026,0.49382403350184256
178.0,0.48173606412133485,0.49272861819975017
179.0,0.48260163239962645,0.48055268633227044
180.0,0.4816576084015309,0.49382403350184256
181.0,0.4800539734477412,0.49382403350184256
182.0,0.48549834565656097,0.49272861819975017
183.0,0.47693468134870354,0.4847103651101508
184.0,0.4830990259537905,0.4921148072888854
185.0,0.4856399943594571,0.49272861819975017
186.0,0.48179506705346503,0.4921148072888854
187.0,0.4810602290164856,0.4856994615090597
188.0,0.48257041555508895,0.48626300995219046
189.0,0.48082888515535926,0.49382403350184256
190.0,0.48672318822084193,0.49272861819975017
191.0,0.48022773009199016,0.4921148072888854
192.0,0.48268720604194737,0.49643236483616937
193.0,0.4850701943271722,0.4887137458546896
194.0,0.47991116529076056,0.4938240335018425
195.0,0.48300939157783707,0.4938240335018425
196.0,0.48255780751230687,0.4921148072888854
197.0,0.4783917004619987,0.43842641496287527
198.0,0.4805026158777889,0.49272861819975017
199.0,0.48037101180479924,0.49272861819975017
200.0,0.4839829183660601,0.49272861819975017
201.0,0.47974966743868586,0.4921148072888854
202.0,0.48158124814406633,0.48787450574681107
203.0,0.48139897239451085,0.49272861819975017
204.0,0.47897662625999904,0.49272861819975017
205.0,0.4801602078419696,0.49272861819975017
206.0,0.4855901376565111,0.4655822880366987
207.0,0.4837051188871058,0.49272861819975017
208.0,0.48398077964561514,0.49272861819975017
209.0,0.47994538750137783,0.4938240335018425
210.0,0.48211183557993803,0.4760717800518461
211.0,0.481247002042264,0.4912781878290817
212.0,0.4825380070504875,0.49321022259097763
213.0,0.4835123153280594,0.49272861819975017
214.0,0.48242521824164675,0.46124456315072493
215.0,0.4857351375253823,0.4126674212772996
216.0,0.4857336114826106,0.4921148072888854
217.0,0.4814238606093209,0.4824447256684937
218.0,0.4825027441894473,0.4921148072888854
219.0,0.4833882388329723,0.46558228803669865
220.0,0.4821648888318822,0.4921148072888854
221.0,0.48348809446349106,0.4323601181244268
222.0,0.481392468557896,0.4932102225909777
223.0,0.4811122653450533,0.49272861819975017
224.0,0.48248704207225174,0.49272861819975017
225.0,0.48072459755974145,0.49272861819975017
226.0,0.47816011979932727,0.49382403350184245
227.0,0.4823100375213774,0.47268138371355833
228.0,0.4798499192454564,0.49272861819975017
229.0,0.4823159465543985,0.4932102225909777
230.0,0.48010715926060304,0.49272861819975017
231.0,0.484155409070126,0.4932102225909777
232.0,0.48788623193975333,0.490164176225358
233.0,0.4849257520598744,0.4912781878290816
234.0,0.48196557630558334,0.474319839934644
235.0,0.4824586881835816,0.49272861819975017
236.0,0.48210391614830567,0.4921148072888854
237.0,0.4801320053946259,0.46667770333879094
238.0,0.48406022155070866,0.49272861819975017
239.0,0.48173783722367247,0.49272861819975017
240.0,0.47766574036514126,0.49321022259097763
241.0,0.48414905114150203,0.46558228803669865
242.0,0.4863803098670953,0.48163899541190364
243.0,0.48443723797926275,0.49272861819975017
244.0,0.4788803286843976,0.4938240335018425
245.0,0.48332589056259545,0.4858169478422089
246.0,0.4780520946721578,0.43497795954163837
247.0,0.4834984811598775,0.49272861819975017
248.0,0.479989108109386,0.48385202896637214
249.0,0.4851739292246149,0.49272861819975017
250.0,0.48328106547600963,0.474319839934644
251.0,0.48068822043433324,0.4908961419429419
252.0,0.4816741255148603,0.47242211044175836
253.0,0.4825824496541456,0.49321022259097763
254.0,0.4826370804756109,0.4912781878290816
255.0,0.48200398478710177,0.4827344107139961
256.0,0.4797989397937019,0.4921148072888854
257.0,0.4830423554604387,0.48175460191114905
258.0,0.48165423260551965,0.49272861819975017
259.0,0.48240626006786314,0.4912588669978371
260.0,0.48062531807480885,0.48582632386276187
261.0,0.481846476643655,0.4912781878290816
262.0,0.4799839021323232,0.4921148072888854
263.0,0.4840472569405879,0.49321022259097763
264.0,0.4813018293321917,0.47945727103017804
265.0,0.48280206391411257,0.49272861819975017
266.0,0.48298210745201625,0.47945727103017804
267.0,0.48588482468417765,0.4827344107139961
268.0,0.4797547424267862,0.483417462034848
269.0,0.4831717493286341,0.48500916764288576
270.0,0.4813071613464703,0.49321022259097763
271.0,0.4791667910557604,0.4938240335018425
272.0,0.48326516192232366,0.4329739290352914
273.0,0.4871087049159243,0.47264079987112395
274.0,0.4830579464424236,0.49382403350184245
275.0,0.47887433386588374,0.49382403350184245
276.0,0.48120830708262446,0.49211480728888546
277.0,0.48412955716321826,0.4831479812481184
278.0,0.4781102363859203,0.49382403350184245
279.0,0.48056533335756074,0.45167089866176435
280.0,0.48646802393195204,0.49272861819975017
281.0,0.4827240105174541,0.49211480728888546
282.0,0.48311330446641054,0.46558228803669865
283.0,0.4828543747337644,0.47242211044175836
284.0,0.4862196167488431,0.45105708775089975
285.0,0.4818909234314236,0.48317379498733465
286.0,0.4779287465210129,0.4912781878290816
287.0,0.4802194653180236,0.493059091391691
288.0,0.4807323885460865,0.4920772383268842
289.0,0.48504251107888213,0.4926228480254306
290.0,0.48394725283560097,0.4761997285120048
291.0,0.48503827995788856,0.4940327938824397
292.0,0.4832770008210161,0.4711571913526364
293.0,0.48291947356837944,0.49231542964964303
294.0,0.480899251531487,0.49316355415161933
295.0,0.4837218619903238,0.493059091391691
296.0,0.4801042551820098,0.49457840358098604
297.0,0.48531414403926426,0.4887585997868419
298.0,0.48088147194904407,0.49360470109023713
299.0,0.4803668719311842,0.49360470109023713
300.0,0.47888218071429983,0.49231542964964303
301.0,0.48411996121906037,0.493059091391691
302.0,0.4815595000209413,0.49360470109023713
303.0,0.47877406519350524,0.49360470109023713
304.0,0.48394586254391436,0.49360470109023713
305.0,0.48358698152484403,0.4950620391834696
306.0,0.48242133151595573,0.493059091391691
307.0,0.4837140322215504,0.493059091391691
308.0,0.4832072542627858,0.4940327938824397
309.0,0.4832312650631313,0.4956076488820159
310.0,0.4821198698527006,0.49457840358098604
311.0,0.48036807293445355,0.486197357563367
312.0,0.48471146376884977,0.47652817446277146
313.0,0.4811349927174689,0.4951205632228873
314.0,0.48293958052893093,0.49462951449419573
315.0,0.4806351238828666,0.4663516064052811
316.0,0.4819202455549731,0.4942442309812133
317.0,0.4828810285562616,0.4925928379559869
318.0,0.48279096606175764,0.4951205632228873
319.0,0.4805520988573458,0.4942442309812133
320.0,0.4835534359924239,0.4925928379559869
321.0,0.4830950892845255,0.4937531822525217
322.0,0.4817499786819186,0.4937220693589674
323.0,0.48519742047616454,0.4836271532455557
324.0,0.4830475374791164,0.49375318225252174
325.0,0.47922631017641376,0.4951205632228873
326.0,0.4836841322517996,0.49424423098121334
327.0,0.48102004205764304,0.4836271532455557
328.0,0.4858623593911131,0.49424423098121334
329.0,0.4813332429369243,0.49512056322288717
330.0,0.4821364549790766,0.49512056322288717
331.0,0.47946669987246243,0.49512056322288717
332.0,0.4804552182385213,0.49512056322288717
333.0,0.4805530083552809,0.49375318225252174
334.0,0.4836237498318322,0.4713668225542378
335.0,0.48300949008189176,0.49462951449419573
336.0,0.4826894948990841,0.4960468839938144
337.0,0.475041055937941,0.4794054228274393
338.0,0.4795671311143444,0.4951205632228871
339.0,0.4805511251153804,0.4951205632228871
340.0,0.4800354376363889,0.49308388668467895
341.0,0.4813716264780963,0.4866003724112813
342.0,0.48146201108801645,0.4937531822525217
343.0,0.478405097913189,0.4951205632228871
344.0,0.47833164697433167,0.4951205632228871
345.0,0.48216120584620203,0.4951205632228871
346.0,0.48022425352677106,0.4946295144941957
347.0,0.480805594564778,0.4951205632228871
348.0,0.48277091908423847,0.43019527344325337
349.0,0.4809784712371392,0.45962863794078934
350.0,0.4839067000915758,0.4942442309812133
351.0,0.4796964334881895,0.4951205632228871
352.0,0.48218931122828645,0.4837913751404113
353.0,0.4806069504729337,0.490352219098885
354.0,0.4812371907280471,0.4942442309812133
355.0,0.48043696284161364,0.49259283795598696
356.0,0.48262471006309166,0.4942442309812133
357.0,0.4784981325603639,0.49259283795598696
358.0,0.4833417496831772,0.4951205632228871
359.0,0.4837598668133276,0.4937531822525216
360.0,0.47832716351304627,0.493083886684679
361.0,0.48117169718940545,0.4875776218070302
362.0,0.48000722755593683,0.4942442309812133
363.0,0.4809873565196444,0.4951205632228871
364.0,0.4835606914123142,0.493083886684679
365.0,0.47921080641101543,0.47136682255423784
366.0,0.4856025323036442,0.48806867053572206
367.0,0.4827137953384459,0.4912372732605362
368.0,0.4836942488076488,0.4923154461925586
369.0,0.47593058197798205,0.4936522650984467
370.0,0.4788838665652289,0.4951205632228871
371.0,0.48186349944676077,0.48767060759630526
372.0,0.4866907410461207,0.48806867053572206
373.0,0.48260858188610106,0.4937531822525217
374.0,0.48011159161585915,0.4946295144941957
375.0,0.4828725646904743,0.4923154461925586
376.0,0.481534614099551,0.4803813488498084
377.0,0.4871409860298891,0.4779990247748201
378.0,0.47866717608434295,0.4942442309812133
379.0,0.4828833170751224,0.4942442309812133
380.0,0.48295383419538046,0.47887535701649403
381.0,0.48305185275933193,0.49308388668467906
382.0,0.48129179531896815,0.4942442309812134
383.0,0.480565306873122,0.4740414722173725
384.0,0.48238577462108007,0.49259283795598696
385.0,0.4799806038660387,0.4874664827963654
386.0,0.47943921297875236,0.49424423098121334
387.0,0.47978970968591833,0.4937531822525216
388.0,0.4815251608266815,0.4918105221982486
389.0,0.4827225030744347,0.4972072282903492
390.0,0.4839362969797455,0.49512056322288717
391.0,0.48192147473766306,0.4760702399861653
392.0,0.4814970184418707,0.49512056322288717
393.0,0.48034306988044756,0.49512056322288717
394.0,0.48244128455969015,0.49424423098121334
395.0,0.4818295712585873,0.4937531822525216
396.0,0.48326442543300113,0.4921926774016999
397.0,0.48108365136906106,0.49306900964337363
398.0,0.48093236885693713,0.49424423098121334
399.0,0.48568956376796374,0.4803813488498085
400.0,0.48386810113411405,0.4948249618671977
401.0,0.4847672138485542,0.49424423098121334
402.0,0.48247011291605896,0.49345758089683206
403.0,0.47704849113665937,0.49512056322288717
404.0,0.4768854139210609,0.49512056322288717
405.0,0.4847567402715599,0.4967161795616574
406.0,0.4820537908917207,0.4937531822525217
407.0,0.4797699063485094,0.49424423098121334
408.0,0.4828741776170131,0.4946295144941957
409.0,0.48476428043615594,0.49424423098121334
410.0,0.48218102796503864,0.4946295144941957
411.0,0.4820531932365307,0.47887535701649403
412.0,0.4798573580918902,0.49308388668467895
413.0,0.48172829887522645,0.4946295144941957
414.0,0.48212516713176284,0.49424423098121334
415.0,0.48279212689512774,0.4937531822525216
416.0,0.4818663425057787,0.49424423098121334
417.0,0.4814423137939854,0.4819072128963698
418.0,0.4810173427948207,0.47697635561518686
419.0,0.4791462080704566,0.49431865078544407
420.0,0.48385241628127756,0.4777325757487902
421.0,0.48230533250916263,0.494650211449716
422.0,0.48152830917364364,0.47129458138235947
423.0,0.47880086148372203,0.49415900077808134
424.0,0.47918702592755674,0.4944841104235953
425.0,0.4828654094068485,0.48950391107847335
426.0,0.47984136321070053,0.4917319631139023
427.0,0.4839999279321569,0.4840433443865371
428.0,0.482214068211009,0.49110437557708747
429.0,0.48082032938470753,0.4939162782538759
430.0,0.48196910843650537,0.4950594187236259
431.0,0.4791984270530156,0.48657322559696387
432.0,0.482628597836312,0.48651465205821454
433.0,0.4811149821139082,0.49578969559168745
434.0,0.4837048436873392,0.494889277646143
435.0,0.483010893287591,0.4927868799750883
436.0,0.4852188464720881,0.4651700997653675
437.0,0.47958005435666473,0.49578969559168745
438.0,0.48107877025163376,0.4941590007780814
439.0,0.48037764361523927,0.4922252827622618
440.0,0.48277523332957745,0.490001202724695
441.0,0.47700531409598856,0.4952984849200526
442.0,0.47950685279113736,0.48978021345219824
443.0,0.4789026898889523,0.48485907103740156
444.0,0.48395455663561193,0.4906951683031776
445.0,0.4820178469613023,0.4909278823442917
446.0,0.48431538185753403,0.48860753318429084
447.0,0.48028280077220475,0.4590573693293256
448.0,0.4823123049863682,0.4957896955916874
449.0,0.4825994438196749,0.47870777160402866
450.0,0.48199030678613647,0.4952984849200526
451.0,0.4851616984146386,0.47515354897764
452.0,0.4828511315486133,0.49456820805199114
453.0,0.4831749328424858,0.4745921523451338
454.0,0.4824540916202818,0.48485907103740156
455.0,0.4842942790214912,0.4911785082830046
456.0,0.4841038905706047,0.4914248427460795
457.0,0.4786797453411967,0.4952984849200527
458.0,0.4812988206528848,0.49578969559168745
459.0,0.480114702212157,0.4863607516969696
460.0,0.4814126642605048,0.4908855609885549
461.0,0.48220784412437795,0.4954394634371931
462.0,0.48155433721901053,0.48360621616894284
463.0,0.4801455607101199,0.4900085535436554
464.0,0.47975970764785014,0.47367325471372357
465.0,0.4797220662304399,0.47895470597970935
466.0,0.4801594122249135,0.4905348401660772
467.0,0.48198821186263685,0.49385657810611433
468.0,0.4820835447862416,0.48473233248358816
469.0,0.4823224383395009,0.4912547347409383
470.0,0.48170347785522655,0.4804656509291409
471.0,0.48312266907130536,0.4897204055982978
472.0,0.4870612417592128,0.4857407267454176
473.0,0.4817171526371019,0.49433920568525874
474.0,0.48422572904249334,0.49136840315742075
475.0,0.4817621268142681,0.4669347954179478
476.0,0.4793381740005736,0.4901093016754365
477.0,0.482002957106419,0.4911590625955628
478.0,0.48351717262123123,0.4930827276250224
479.0,0.48180843770871506,0.4609815667903484
480.0,0.48398853131757796,0.4958027978355621
481.0,0.4795986004052215,0.49545827868648074
482.0,0.48002820423501696,0.4964349793795988
483.0,0.48041100600794284,0.4958090277784032
484.0,0.48213821853416816,0.4955978839529107
485.0,0.4791585886968469,0.49335756773326683
486.0,0.48238544874704425,0.4944183175063205
487.0,0.4882664840116272,0.4735980367953824
488.0,0.4802805033236069,0.49398568499294926
489.0,0.48085004782757224,0.49413152020222034
490.0,0.48343762986543337,0.4960842302876761
491.0,0.4858210172782259,0.4718407784359552
492.0,0.48078761026146566,0.49538799005985906
493.0,0.4850752381589302,0.4873959336661788
494.0,0.4799811046039449,0.4786193315376197
495.0,0.4794972574911499,0.4885569809736688
496.0,0.48494309821339365,0.47814599426275867
497.0,0.4828685092333938,0.4845710759923032
498.0,0.48037381157510367,0.4847137724168722
499.0,0.48754778847631086,0.43941389172923934
500.0,0.4837093018021394,0.4964349793795988
501.0,0.48119194907991025,0.4929569229700687
502.0,0.4810965520592238,0.4740476355750156
503.0,0.48665981082747367,0.4758086920749598
504.0,0.4840640042791386,0.4698338930766445
505.0,0.4806227242156481,0.48760407793560184
506.0,0.4832113671140463,0.46790858494280396
507.0,0.48232390997078217,0.4600741827370388
508.0,0.4833977786773812,0.48179333024731996
509.0,0.4815450399328522,0.4883391290107179
510.0,0.4786581391704374,0.49580902777840324
511.0,0.4802663303575631,0.49363839880219423
512.0,0.4824600712294677,0.4856200312225244
513.0,0.48068649109685446,0.4852897259126284
514.0,0.48139090988837946,0.4929569229700687
515.0,0.48233216539738566,0.48727793049012164
516.0,0.4760882248955138,0.4799589127381871
517.0,0.4806166879486108,0.4811673419787385
518.0,0.4862157827456733,0.47128657171487864
519.0,0.4852255507232981,0.49580902777840324
520.0,0.4827307928673524,0.49413152020222034
521.0,0.48119691048934804,0.4779149075049164
522.0,0.4828311373979217,0.479612249361859
523.0,0.4845897312369252,0.47955406237388504
524.0,0.48343387821938644,0.4768108876409753
525.0,0.47942511302570295,0.47743847574928266
526.0,0.48512460254944406,0.4885914390439566
527.0,0.48176104568090233,0.4635210642121
528.0,0.4839333895771553,0.49074148321947336
529.0,0.4812734017990912,0.47445781358965794
530.0,0.483418912028824,0.4516165685996281
531.0,0.4773916835702259,0.4926941933049291
532.0,0.48298835149694924,0.49045792157160356
533.0,0.4841846678361519,0.4796054864123811
534.0,0.483073227081543,0.476501101139481
535.0,0.4790381352012324,0.4965347441557028
536.0,0.4845691134972951,0.48928458506785416
537.0,0.4785209421694932,0.4962238355541063
538.0,0.48062157755161955,0.4909424223952477
539.0,0.4777829698534733,0.495315906378377
540.0,0.48386089535923504,0.4589805372016674
541.0,0.48104162132025174,0.4785956976357057
542.0,0.4791072872518876,0.4867174274385358
543.0,0.48195621181191495,0.4958090277784032
544.0,0.48283237762680287,0.4759112524832528
545.0,0.48171962291564163,0.49302569708082106
546.0,0.4857728181457225,0.4629858048762569
547.0,0.4790055833467229,0.4887866439382618
548.0,0.4814015635453369,0.49033437809175645
549.0,0.4832478281366043,0.47790570316068004
550.0,0.4860475188048285,0.49390108628122675
551.0,0.4837408649026376,0.4647729805162916
552.0,0.48097949992686695,0.4930590946527804
553.0,0.4811311125498589,0.49437274936468695
554.0,0.48526800953501387,0.49527148718501995
555.0,0.4818079060849219,0.49468726569057087
556.0,0.48431569201304037,0.48620758665334585
557.0,0.480285103656029,0.492289663361448
558.0,0.48347797752388066,0.49424725133344694
559.0,0.47702191117432285,0.49573053372349274
560.0,0.4779028604918001,0.47529129550098315
561.0,0.4799806520614639,0.45890556915186215
562.0,0.4823587065079994,0.4826056419043135
563.0,0.48442177629618355,0.4948311047531095
564.0,0.48018953766214645,0.46074671358162334
565.0,0.4837164793929176,0.49318857373493336
566.0,0.48223034659491554,0.4905510337957337
567.0,0.480492116477612,0.49167188827259184
568.0,0.4822478331602,0.49423283366386433
569.0,0.482159484938661,0.49403899387969524
570.0,0.4835355325868849,0.4783192672010953
571.0,0.480774916630905,0.49202355282041116
572.0,0.4833928854085949,0.4935133603885563
573.0,0.48196691617044307,0.45944211873742585
574.0,0.4805870570130234,0.49326543101533893
575.0,0.4808481834006791,0.49455782852302993
576.0,0.48228218814899426,0.49228861670549356
577.0,0.48174499881487687,0.48945510823868177
578.0,0.48125600945945113,0.48871562577721595
579.0,0.48540929868229304,0.47677806835169617
580.0,0.4787989675900634,0.4918934670320848
581.0,0.4835305526372018,0.4920685138589494
582.0,0.48509147312324674,0.4867727808166767
583.0,0.4825589591168555,0.4415155773813263
584.0,0.48325846710501535,0.4852437731082611
585.0,0.4854789582709095,0.488850058552185
586.0,0.48329602316546744,0.484344188645585
587.0,0.4804990691967512,0.49141058263534376
588.0,0.4852063088695672,0.46198941425816953
589.0,0.482809493928707,0.44249071409507273
590.0,0.48490729419020717,0.45100144091216327
591.0,0.48553214516002885,0.4861421998022309
592.0,0.4821987774359715,0.4815032360915682
593.0,0.48491096730610983,0.4933162928180962
594.0,0.48246910954244593,0.49403899387969524
595.0,0.48150959639593294,0.4878581280526872
596.0,0.4827863653231598,0.49423046270390214
597.0,0.47981850736075093,0.4939137028262142
598.0,0.48437364779485625,0.4912886072647173
599.0,0.4811860126148271,0.493138573019068
600.0,0.48012481385280914,0.47751198606084266
601.0,0.4848138946777785,0.4418428588638016
602.0,0.4808189353134567,0.4934553474377917
603.0,0.4826738142006313,0.49340140916480074
604.0,0.48432798399427723,0.47290693574538706
605.0,0.48345279262936997,0.4662878137164892
606.0,0.48268347164863157,0.4870976299704554
607.0,0.4813745778032253,0.49008538604169444
608.0,0.4842613831057534,0.4717824082705744
609.0,0.48053819303868706,0.48641326504894455
610.0,0.48516163637683696,0.4724245597043771
611.0,0.48368902878873915,0.47364160061102534
612.0,0.4840348272455463,0.4540530531425171
613.0,0.4801523588661477,0.4933298570536763
614.0,0.48526440260875914,0.4655990244233258
615.0,0.4846480544231747,0.48522613441002455
616.0,0.4825457970313322,0.4686598003610187
617.0,0.47573312068631224,0.49327006894881514
618.0,0.4820998969315838,0.46138565751952126
619.0,0.4826582300408367,0.4873807940244155
620.0,0.4839764279199125,0.4936460253423876
621.0,0.4807896772859101,0.4908424102194885
622.0,0.48464334748864657,0.4950146315096985
623.0,0.48415471963057316,0.46014441317722665
624.0,0.48035093536258744,0.479794218842718
625.0,0.48298115820754767,0.48144839193671335
626.0,0.480094145043736,0.4939137028262143
627.0,0.48194245151764425,0.49073499438725815
628.0,0.48100550335627157,0.4767586183602315
629.0,0.48121570635946187,0.4884094211570495
630.0,0.4820297781041713,0.49417157838000864
631.0,0.48302105064283474,0.47968050232435105
632.0,0.4817005414994406,0.4894549524748066
633.0,0.4844854268745372,0.46963906557367674
634.0,0.4809809940408636,0.47562886956513634
635.0,0.48477434588430895,0.4723168996376191
636.0,0.47945110531439405,0.48490220884329355
637.0,0.48138278936511353,0.491454114142228
638.0,0.4837011039250225,0.486510959832914
639.0,0.47983338274156756,0.48670802740337366
640.0,0.4841840515440174,0.48875694102560646
641.0,0.48517361517254326,0.4728233127854203
642.0,0.47842915028091987,0.49579592057460753
643.0,0.4790626015675777,0.49287731627857245
644.0,0.48126611543670733,0.4858306296460076
645.0,0.4843441940661377,0.4940357660934048
646.0,0.484294241931901,0.4946232153741447
647.0,0.4848169536652977,0.4953422131958915
648.0,0.4838316453008004,0.4865349524724736
649.0,0.4850272281751612,0.4943727493646871
650.0,0.4815193888294675,0.49546855475547963
651.0,0.48338328591197527,0.4781989811843029
652.0,0.4860292443816985,0.4832088564087665
653.0,0.48488009692524864,0.48815919822686565
654.0,0.48214072555482285,0.4790353176349288
655.0,0.4830298659038388,0.4856708239332423
656.0,0.48157429859508183,0.49215557602975013
657.0,0.4807806828917002,0.49397360702858045
658.0,0.4845532970138179,0.4861598255781933
659.0,0.48363460800180735,0.4840776246060419
660.0,0.48117071287147883,0.4935330898841457
661.0,0.4804227706489879,0.48743557989710923
662.0,0.4837370424368805,0.4883446504677228
663.0,0.48370903547184446,0.44548727612953776
664.0,0.481302927525178,0.49544966771472826
665.0,0.4828897965841023,0.4629223338993934
666.0,0.48462288694979627,0.48052892610750547
667.0,0.4803653599170657,0.48566213830531035
668.0,0.48304041686603594,0.49509286053311996
669.0,0.481142544732782,0.49612017808698805
670.0,0.4864568445943985,0.48897049100871637
671.0,0.4817693129081013,0.4647881490909813
672.0,0.48523005029192856,0.46472070158850476
673.0,0.4823708011711001,0.4930641362834102
674.0,0.48248327296846116,0.49101260298260846
675.0,0.4815237352883211,0.4913905116710051
676.0,0.47702298362344764,0.49399234627033417
677.0,0.48287718795719964,0.489911521529288
678.0,0.48341316212947294,0.4884092774264444
679.0,0.4823573478558855,0.4671594236138261
680.0,0.47966404583179667,0.4803977064016731
681.0,0.4815055427413635,0.4937394685396781
682.0,0.480023599644664,0.49165144498458974
683.0,0.47913893818405906,0.4881423813222935
684.0,0.48155302708517395,0.4659826460929784
685.0,0.47760962335942436,0.488900371163698
686.0,0.47952036208679844,0.4828660695705474
687.0,0.4791075463819882,0.4946610353944364
688.0,0.4843335894615405,0.4935581140545606
689.0,0.48242084995495393,0.49559134185788806
690.0,0.4790780191378588,0.49041609380215634
691.0,0.4831687353421715,0.49624233269511425
692.0,0.4819541156169551,0.48938677864182406
693.0,0.4823450996806958,0.49220127493902477
694.0,0.4802975723626034,0.4958793758913744
695.0,0.48364573354885293,0.49248085108397077
696.0,0.4829614040989812,0.47123400291121487
697.0,0.4786081986847704,0.4898309643610818
698.0,0.48080404489562867,0.4743081733513536
699.0,0.483713863853726,0.47449503952619054
700.0,0.4840328331557545,0.49404399605314636
701.0,0.47720722941334764,0.49587937589137443
702.0,0.4834180622151104,0.478870689090364
703.0,0.4817706244087783,0.4916106413320329
704.0,0.4842931259212259,0.46054747727695233
705.0,0.48153230590628227,0.4919790493357589
706.0,0.4776499610477489,0.4920802626921904
707.0,0.48401971962609186,0.47432298319188826
708.0,0.4787563511479896,0.49636578336950044
709.0,0.4823078781870134,0.4944115567622144
710.0,0.48315652927579367,0.44426436071106645
711.0,0.48374173882298155,0.49587937589137454
712.0,0.4835121464801712,0.49526491686742213
713.0,0.4766507305478309,0.49605867553869454
714.0,0.48043003067631573,0.46599188037003075
715.0,0.48227660614809303,0.48962355183707257
716.0,0.48506583954931637,0.4949580114119899
717.0,0.4835063556426976,0.494317584031196
718.0,0.4812807288114314,0.4776125241592713
719.0,0.4831412894326602,0.49471287544555653
720.0,0.4860412675483547,0.4719421719158159
721.0,0.48279806335708236,0.49119746192053637
722.0,0.4804507262630941,0.4936003033695039
723.0,0.48082683561359707,0.48497922077265876
724.0,0.4834626028411942,0.49505891132213975
725.0,0.4849579863882194,0.4915780976207772
726.0,0.47981880554261763,0.49534837350427624
727.0,0.4861208006064954,0.46213038448430377
728.0,0.4804036485491461,0.4886812206464064
729.0,0.4849799389137593,0.48409028232075363
730.0,0.48196279239446854,0.49629610851529365
731.0,0.4821809716466304,0.49268032282018487
732.0,0.47900998953443097,0.4688416792754273
733.0,0.4834858122482501,0.4816958243599859
734.0,0.48433297162427774,0.4697258197930772
735.0,0.47866847506389565,0.4906772076521416
736.0,0.48558396600184944,0.4435989711463343
737.0,0.47892578170003186,0.49235302892831573
738.0,0.48550715416010276,0.47816351054208345
739.0,0.48164362115026466,0.4880140697209726
740.0,0.481048970560778,0.4876589419284738
741.0,0.47849674206861303,0.4681960261738517
742.0,0.4801362563193635,0.49285843089520076
743.0,0.4830766040962487,0.46574899727355257
744.0,0.486091554995172,0.4812649033806482
745.0,0.47977145869499016,0.4953146928751956
746.0,0.4823037577815474,0.4874199754690876
747.0,0.4803944168749362,0.4964053745939036
748.0,0.4828109521849778,0.4872615455497099
749.0,0.4800105091833193,0.47782992751128195
750.0,0.4820297644488989,0.4885199847478743
751.0,0.4815387175748704,0.4944050986673468
752.0,0.4801349328933719,0.49353273275531656
753.0,0.48419733233923246,0.4363973516737318
754.0,0.4792897890599346,0.495151476086733
755.0,0.48110152660811245,0.4830751208863665
756.0,0.48513447881062116,0.4693540941991596
757.0,0.47987672286893984,0.4852934681485212
758.0,0.47967481928253103,0.48410543551749485
759.0,0.48712465957213713,0.4752810176777188
760.0,0.48347782476346435,0.493622932500947
761.0,0.48758675345929364,0.47581897219636965
762.0,0.4798841496234194,0.4918140709852515
763.0,0.4776973811697871,0.4914871647054656
764.0,0.4811782006589958,0.4941874940556708
765.0,0.4839959258414907,0.48408061276056336
766.0,0.4839417870811179,0.4903308196833481
767.0,0.4827032985612766,0.4922534519010892
768.0,0.4817789806408576,0.483872008256436
769.0,0.48276936201548387,0.49302396497117235
770.0,0.48095077333330327,0.48846436668151005
771.0,0.48240969114141946,0.49515103349571327
772.0,0.4797275714624529,0.48969266598030764
773.0,0.4777747174385643,0.4923072459981487
774.0,0.4834898868698668,0.486661575412004
775.0,0.4796458437122289,0.4928685218930162
776.0,0.47974780164857,0.4886539503199694
777.0,0.4814220617842171,0.48442966952660554
778.0,0.4806629997468675,0.49414075366816584
779.0,0.477658389214351,0.4877423917405303
780.0,0.48438543016081753,0.49612874742493424
781.0,0.48290233637919067,0.47947972512712106
782.0,0.480268463983105,0.49072891901242727
783.0,0.48041267957089484,0.4780600687769312
784.0,0.4756723722864351,0.4946211691910865
785.0,0.4823058050243544,0.4953096272358882
786.0,0.4825680929019126,0.4906027332637707
787.0,0.48374611565912756,0.4847203242110027
788.0,0.4847555673987572,0.4510104837475909
789.0,0.47922289270849305,0.48472339537582854
790.0,0.48130853608087365,0.4927723043612782
791.0,0.48258728942076323,0.47865964586657483
792.0,0.48072627432554343,0.492604511913293
793.0,0.48320982758630115,0.4862672093292157
794.0,0.479651744369752,0.4947891739785376
795.0,0.48415768607606174,0.48717608584553007
796.0,0.4794058603966726,0.4857321369269679
797.0,0.48051722690907955,0.49628422467132055
798.0,0.4807340227739803,0.46962210667262166
799.0,0.4773645107346287,0.478304153837765
800.0,0.4807477898707633,0.4954577727546604
801.0,0.48229105599288763,0.4984596855074452
802.0,0.4843271024754226,0.4862696319319042
803.0,0.47973297457052494,0.49374369301282495
804.0,0.4805633677251135,0.4951610674900271
805.0,0.4822437598256745,0.4670182855954517
806.0,0.48155891471133444,0.480336200404729
807.0,0.47897380368969494,0.4892156337115011
808.0,0.4859250680282513,0.4912162101498751
809.0,0.4817431726540229,0.48107088821584754
810.0,0.48216659851653254,0.4783899196236964
811.0,0.48300166627359387,0.46277609494750854
812.0,0.4834577444159384,0.48387994358641845
813.0,0.4806222886802034,0.48976079651526183
814.0,0.48630375081458127,0.49191744244912794
815.0,0.48205619953918316,0.4907577461747716
816.0,0.4803646635091556,0.4966938309686899
817.0,0.48052537053746064,0.4920947950242471
818.0,0.4817514194570737,0.4852412383844256
819.0,0.4834574268029514,0.47770908440094356
820.0,0.47855099992348954,0.48599279827785796
821.0,0.47422460549928674,0.49530406490426776
822.0,0.48099686062316416,0.49307558616942093
823.0,0.4803621791146395,0.4885907423107829
824.0,0.47876858312583676,0.49328974353934324
825.0,0.480370934273824,0.4953066131566025
826.0,0.4835000720896602,0.4848116340952513
827.0,0.4823514898615266,0.49469514709570783
828.0,0.48198618157387646,0.4934395490807637
829.0,0.48429107164005153,0.49239793812424915
830.0,0.48291188428680837,0.470848422096882
831.0,0.482002351105647,0.4750986586220236
832.0,0.4800044666583469,0.49138263893796713
833.0,0.4838114779223536,0.4895851507366814
834.0,0.4841897065178659,0.48442449012732364
835.0,0.4819307677055092,0.48185288545485666
836.0,0.4847856916715738,0.4553082787190766
837.0,0.479274164431197,0.4839739032135004
838.0,0.48017733615628905,0.48974283539298075
839.0,0.479330333994378,0.47874477675759514
840.0,0.4813644908724069,0.4677491321906827
841.0,0.4846114940665039,0.46361718335022434
842.0,0.48606615600917646,0.47370405583204284
843.0,0.4830302336264376,0.49080439693826716
844.0,0.48094899169530164,0.4912729335917855
845.0,0.4808753265306086,0.4939478775162623
846.0,0.48475529656547794,0.4858177079133742
847.0,0.4802512316874337,0.4912377589224001
848.0,0.4866629332474167,0.4764122739552076
849.0,0.4800863241901764,0.4898504842290965
850.0,0.4822608173167472,0.48505642593532117
851.0,0.4775031887200441,0.4960771262266855
852.0,0.48059954678720124,0.4815343967275827
853.0,0.47980059650289514,0.49433253624593126
854.0,0.4804998253339176,0.4878076056550566
855.0,0.4794145675805586,0.47736857450138004
856.0,0.47506094231712387,0.4873918424059402
857.0,0.48409423858071093,0.48762887254828036
858.0,0.48161042338745735,0.4879882451926228
859.0,0.4806817485636363,0.4965899749205518
860.0,0.48020068683708284,0.49047629706439433
861.0,0.4845252170018804,0.4873185991067914
862.0,0.48437635147611857,0.48815992211421555
863.0,0.4766430430774611,0.4922566914386301
864.0,0.4801214908660128,0.496542671370632
865.0,0.4826010599771377,0.47511042075337323
866.0,0.4806757638049358,0.49197833729817714
867.0,0.4796564294391915,0.4939585676324759
868.0,0.47981969905224636,0.49230931338545303
869.0,0.4851427827716193,0.4924570977716967
870.0,0.47768737848471526,0.4850610164195199
871.0,0.4798796373232602,0.4893826427762448
872.0,0.4781867643660164,0.49530997733928206
873.0,0.4794876031210948,0.4868978806084759
874.0,0.4803448141418674,0.4830203810306895
875.0,0.4756088978949325,0.4689055654022609
876.0,0.4819859994698645,0.487549583750175
877.0,0.4780542655374865,0.4813002440526105
878.0,0.4799897274782932,0.49425587433736656
879.0,0.48034412243766983,0.49645164151012533
880.0,0.4850848333026789,0.47777540694444376
881.0,0.4789295919676497,0.4825994949389187
882.0,0.4806108586509958,0.48585804154047857
883.0,0.48063018000488095,0.49083628638113247
884.0,0.47859318992494987,0.49592714931782306
885.0,0.4810617482141031,0.49127158738962173
886.0,0.48110063492642463,0.47955605554453123
887.0,0.46964115126881,0.4949055728624631
888.0,0.477373948360272,0.4939249584866034
889.0,0.47901819234433046,0.4919256735641617
890.0,0.4816516952576366,0.47944109560814396
891.0,0.47995851701238446,0.49666257609926184
892.0,0.48022564060655576,0.484711027451681
893.0,0.4826268301216289,0.4876519718645876
894.0,0.47993953738864764,0.4961989097478316
895.0,0.48221839519077503,0.48095087863594527
896.0,0.4777368903223576,0.4962449116168517
897.0,0.4833747326118246,0.4729427015816411
898.0,0.48161520416474596,0.48438591968812256
899.0,0.47845147753364564,0.4886409761422977
900.0,0.48059027560060175,0.49232597873531214
901.0,0.47907165855710837,0.4927191826375417
902.0,0.4780236056447197,0.4957043667879823
903.0,0.4824111006261998,0.49068810357095594
904.0,0.48255077790440154,0.4734582028219093
905.0,0.47865468832036706,0.49036641191135355
906.0,0.4815987536590902,0.4848402548319875
907.0,0.48086631068087565,0.48093816953683427
908.0,0.48032159027791105,0.4729623466579509
909.0,0.4783226653346129,0.4941438189878016
910.0,0.4815993534035153,0.4932995181341814
911.0,0.47976415375706405,0.4952177813366253
912.0,0.479252944401869,0.47455842059433895
913.0,0.4750382701250547,0.4867033960901382
914.0,0.48324789610165897,0.48865217761276114
915.0,0.48393462632500084,0.47109048917240454
916.0,0.4803771479872773,0.4958159512198604
917.0,0.4796503638780668,0.49681239117296594
918.0,0.48395465485693473,0.4673844309906268
919.0,0.4809831105477161,0.48777563986817407
920.0,0.482642385803544,0.4668660336174717
921.0,0.4814358418727592,0.49626510927131173
922.0,0.4796766924832477,0.496726963192991
923.0,0.481483704501832,0.49086985520567555
924.0,0.48440382654207714,0.49522630108532084
925.0,0.4818917569515211,0.4915529349486059
926.0,0.48573899390414904,0.4544272522568706
927.0,0.47816470249190135,0.49407459378018975
928.0,0.48127956437396335,0.4901373725572232
929.0,0.4849530664119087,0.46947770965943875
930.0,0.4794746952212964,0.4960516098240544
931.0,0.4822749625479944,0.46814194246597607
932.0,0.48179793639835183,0.4747232933401583
933.0,0.48354257335844897,0.4837458374199842
934.0,0.4760353151996803,0.4947833048600859
935.0,0.47835316743604844,0.4942822494097773
936.0,0.4821734932377149,0.4964716918002385
937.0,0.48025307284222213,0.49631581086676013
938.0,0.48114718431864173,0.48067317557490263
939.0,0.47884934499468335,0.4967697475744126
940.0,0.47881369061482126,0.4946135444283398
941.0,0.47897460886681675,0.4812499549328812
942.0,0.4781788971549614,0.4890744899192957
943.0,0.4807048469294497,0.45863452473208305
944.0,0.48183902336052786,0.4917286886067148
945.0,0.4822542429980894,0.46648005335847875
946.0,0.4830632594927972,0.4965989763289936
947.0,0.47668020530809535,0.4971508461958168
948.0,0.48121849218315615,0.49308976652839853
949.0,0.48441453361005166,0.4707535376652926
950.0,0.48198190203003793,0.49460407184696625
951.0,0.4814600307589267,0.4738091025277587
952.0,0.48255989107253716,0.4897450514817742
953.0,0.4797216815089865,0.4920143793657269
954.0,0.48196847440667806,0.48916023318675134
955.0,0.47905531032874643,0.49715441294878365
956.0,0.48002209298531023,0.49613354676682614
957.0,0.4815312601893647,0.4955670850613331
958.0,0.486673001376817,0.46078345615224237
959.0,0.48259661159574724,0.4921820596285709
960.0,0.4803815652669068,0.4746870545080127
961.0,0.4856579699501247,0.4761017001117356
962.0,0.4792766292624137,0.4656230971650575
963.0,0.48327918477738074,0.4649815304918975
964.0,0.4801825823215352,0.48987542556482017
965.0,0.4812406409172167,0.48449367315433495
966.0,0.4811982913483321,0.48634228701649246
967.0,0.48526839099908203,0.4858091902347206
968.0,0.48103650647444657,0.4762412801026562
969.0,0.4808807246526227,0.48604043112873335
970.0,0.4820264734984799,0.4913413548815972
971.0,0.47686897081161117,0.47208781923894766
972.0,0.479403469772003,0.4756379133413088
973.0,0.4853290761757134,0.4710748128546461
974.0,0.48126504445302987,0.4863076940159803
975.0,0.48126633866653956,0.4848823154793313
976.0,0.4785161217313431,0.49341071667983305
977.0,0.4858918451792523,0.45561268658939263
978.0,0.4799544500170712,0.48416308450781126
979.0,0.48024423661288895,0.48898930070249824
980.0,0.47895685449169373,0.46865441376171596
981.0,0.48103933617525735,0.48616941175394784
982.0,0.4819829944182787,0.47457332628941545
983.0,0.4845357007756268,0.4704281010943297
984.0,0.4816107784388807,0.4654895461344283
985.0,0.48259686292901344,0.4901191175795781
986.0,0.482793874450948,0.49286392454141836
987.0,0.48195497133369314,0.48728431296359465
988.0,0.48347068980686136,0.492247352484134
989.0,0.48409494582922574,0.4749925167449879
990.0,0.48240576672609425,0.47668164150778686
991.0,0.4846092080673775,0.4844731848574291
992.0,0.47659507534608797,0.4904005756913842
993.0,0.4769317491731221,0.4840764530644545
994.0,0.4814451458138072,0.49182128698746774
995.0,0.48276499885305835,0.49631206700941455
996.0,0.4854063386704596,0.46455745030172674
997.0,0.4825080780831093,0.4974031057134556
998.0,0.48358973893403123,0.4926617099931781
999.0,0.4801200561432848,0.4867273394225602
1000.0,0.4786165561077837,0.496264930515166
1001.0,0.48115589181034707,0.4941305180475734
1002.0,0.48360148307355544,0.49196476539445116
1003.0,0.47629948479054474,0.49457315011034797
1004.0,0.4797112136359406,0.4868204682180386
1005.0,0.48193942694068087,0.47945923985611527
1006.0,0.48008974493613155,0.4905573022209553
1007.0,0.48187465844607885,0.4947502168722286
1008.0,0.4810526324561749,0.4907217320057437
1009.0,0.47459660637667356,0.4897757704168842
1010.0,0.48048114559475186,0.4877894039610823
1011.0,0.48730842672351155,0.48004339019916425
1012.0,0.4803858633887776,0.48909128592760154
1013.0,0.4833715962366412,0.4919647653944509
1014.0,0.4811565966762706,0.48862733806553466
1015.0,0.476825568384231,0.49040514216960635
1016.0,0.4811633279152509,0.48498800014870486
1017.0,0.4778159382722684,0.4901588961011717
1018.0,0.47482571180336086,0.4963866598254328
1019.0,0.47941194438349544,0.4890438486763006
1020.0,0.4800039457993307,0.4942525023526939
1021.0,0.48132439902712665,0.4951937210926171
1022.0,0.4803198705172352,0.49484955024166455
1023.0,0.48121505797089814,0.4861729737597266
1024.0,0.48139320363225924,0.47249968245305424
1025.0,0.48189491822452696,0.47810286854631384
1026.0,0.48312205907119044,0.4623368216728686
1027.0,0.4845273441440242,0.47796493369066534
1028.0,0.48159554627459333,0.4885496672211874
1029.0,0.4777938587137068,0.4956490308555098
1030.0,0.4800089121765129,0.49249516052765285
1031.0,0.47985709669891097,0.4923723355239654
1032.0,0.480725307791328,0.4969818962287628
1033.0,0.48223073704812514,0.45939593279621516
1034.0,0.4821139498851668,0.4733877712688999
1035.0,0.4834850523986881,0.4881925158422496
1036.0,0.48265765364059027,0.4892344484794863
1037.0,0.47584606284697933,0.49066674610874184
1038.0,0.47960288771711834,0.49565282594491555
1039.0,0.4844014324634099,0.4889388630666213
1040.0,0.4815433558877278,0.497052572816786
1041.0,0.4757106449101101,0.4977571273781161
1042.0,0.4817493750759732,0.469427452479362
1043.0,0.4867050313994118,0.4450921679017458
1044.0,0.48407201552924867,0.48615962668172785
1045.0,0.48188140876970925,0.4749594299834071
1046.0,0.4840249286895128,0.4956278966679873
1047.0,0.4789931049085773,0.48963564541220894
1048.0,0.4773752986618071,0.49717094287930086
1049.0,0.48406238777494826,0.46641578540808754
1050.0,0.4802877939254903,0.481459569926392
1051.0,0.4797069708931042,0.48928298849833457
1052.0,0.483119096435951,0.4829095224938785
1053.0,0.479531342109149,0.4809939708808216
1054.0,0.4824873117991255,0.48804574204263657
1055.0,0.4805931551106922,0.47239778043450703
1056.0,0.48362319293441214,0.4707072595202826
1057.0,0.4836584594273513,0.4953492609061183
1058.0,0.48432203032473525,0.46588641900040195
1059.0,0.4803335759455567,0.49038898112303353
1060.0,0.4802988616106444,0.49172709474791915
1061.0,0.4795032655488313,0.47398773125282073
1062.0,0.48165236150524493,0.4695466260325483
1063.0,0.48135742119160346,0.49161074372979097
1064.0,0.4781620139740409,0.4904960412232645
1065.0,0.48180869378436947,0.4840760072504769
1066.0,0.4788537409603061,0.4970920122827162
1067.0,0.481303651284564,0.4889140197501249
1068.0,0.47538919883933145,0.4905866153096951
1069.0,0.48378569905619584,0.49626841928315696
1070.0,0.48111054976546863,0.489859990063606
1071.0,0.4838260134249879,0.4904361006333247
1072.0,0.48141678827484047,0.4960762858870299
1073.0,0.4823037387518523,0.4937438014048777
1074.0,0.4814926692943977,0.49373730709591057
1075.0,0.4826941688122763,0.4791653402824753
1076.0,0.4870265557404062,0.4858383821943277
1077.0,0.478365303641033,0.49776869303293997
1078.0,0.476048192750783,0.49154527996672664
1079.0,0.4765639192451614,0.48388130305182764
1080.0,0.47737940703786697,0.4958375628586899
1081.0,0.4825562588463132,0.474675602912929
1082.0,0.4814045645348264,0.49457190825115954
1083.0,0.4785000412637042,0.49170356396687925
1084.0,0.476760760597214,0.4916392638104134
1085.0,0.4817637767048764,0.4935169233079326
1086.0,0.4834931515452433,0.4768002029445881
1087.0,0.482339876613188,0.4922439762349625
1088.0,0.48086161290089013,0.4656618025804183
1089.0,0.4829963253737285,0.4710456575301723
1090.0,0.4823324667284229,0.4796637901006198
1091.0,0.4748069813833325,0.4888562176204851
1092.0,0.4803130592796117,0.495361035388184
