"_ages_vehicles_in_simulation"
10
8
5
7
10
18
9
10
12
8
10
4
15
9
7
2
14
3
1
21
8
8
10
2
7
10
7
16
15
12
4
7
3
9
5
9
4
12
8
6
18
9
7
18
12
9
2
3
6
6
4
11
12
18
8
5
6
10
5
4
21
13
10
4
11
7
8
9
3
20
10
21
2
3
17
2
14
21
3
8
7
20
9
13
4
8
11
9
21
8
9
4
2
5
9
19
12
4
16
12
17
3
21
4
16
6
2
9
14
5
4
13
4
13
19
19
16
13
11
5
19
8
2
10
10
15
7
19
3
21
11
15
13
19
4
20
4
2
4
16
6
12
10
19
18
21
10
4
4
2
3
5
17
5
13
12
9
17
12
10
13
1
2
17
2
11
5
4
3
17
15
4
12
10
12
1
7
3
4
18
21
10
15
2
14
4
14
4
7
10
21
4
19
2
6
21
3
14
6
10
