"tick","Agents","Occasion","Private new","Lease"
1.0,9.700000000000005,10.571428571428573,5.666666666666665,3.5
2.0,9.700000000000005,10.571428571428573,5.666666666666665,3.5
3.0,9.700000000000005,10.571428571428573,5.666666666666665,3.5
4.0,9.700000000000005,10.571428571428573,5.666666666666665,3.5
5.0,9.700000000000005,10.571428571428573,5.666666666666665,3.5
6.0,9.700000000000005,10.571428571428573,5.666666666666665,3.5
7.0,9.700000000000005,10.571428571428573,5.666666666666665,3.5
8.0,9.700000000000005,10.571428571428573,5.666666666666665,3.5
9.0,9.700000000000005,10.571428571428573,5.666666666666665,3.5
10.0,9.700000000000005,10.571428571428573,5.666666666666665,3.5
11.0,9.700000000000005,10.571428571428573,5.666666666666665,3.5
12.0,9.700000000000005,10.571428571428573,5.666666666666665,3.5
13.0,9.700000000000005,10.571428571428573,5.666666666666665,3.5
14.0,9.700000000000005,10.571428571428573,5.666666666666665,3.5
15.0,9.700000000000005,10.571428571428573,5.666666666666665,3.5
16.0,9.700000000000005,10.571428571428573,5.666666666666665,3.5
17.0,9.700000000000005,10.571428571428573,5.666666666666665,3.5
18.0,9.700000000000005,10.571428571428573,5.666666666666665,3.5
19.0,9.700000000000005,10.571428571428573,5.666666666666665,3.5
20.0,9.700000000000005,10.571428571428573,5.666666666666665,3.5
21.0,9.700000000000005,10.571428571428573,5.666666666666665,3.5
22.0,9.700000000000005,10.571428571428573,5.666666666666665,3.5
23.0,9.700000000000005,10.571428571428573,5.666666666666665,3.5
24.0,9.700000000000005,10.571428571428573,5.666666666666665,3.5
25.0,9.700000000000005,10.571428571428573,5.666666666666665,3.5
26.0,9.700000000000005,10.571428571428573,5.666666666666665,3.5
27.0,9.700000000000005,10.571428571428573,5.666666666666665,3.5
28.0,9.700000000000005,10.571428571428573,5.666666666666665,3.5
29.0,9.700000000000005,10.571428571428573,5.666666666666665,3.5
30.0,9.700000000000005,10.571428571428573,5.666666666666665,3.5
31.0,9.700000000000005,10.571428571428573,5.666666666666665,3.5
32.0,9.700000000000005,10.571428571428573,5.666666666666665,3.5
33.0,9.700000000000005,10.571428571428573,5.666666666666665,3.5
34.0,9.700000000000005,10.571428571428573,5.666666666666665,3.5
35.0,9.700000000000005,10.571428571428573,5.666666666666665,3.5
36.0,9.700000000000005,10.571428571428573,5.666666666666665,3.5
37.0,9.700000000000005,10.571428571428573,5.666666666666665,3.5
38.0,9.700000000000005,10.571428571428573,5.666666666666665,3.5
39.0,9.700000000000005,10.571428571428573,5.666666666666665,3.5
40.0,9.700000000000005,10.571428571428573,5.666666666666665,3.5
41.0,9.700000000000005,10.571428571428573,5.666666666666665,3.5
42.0,9.700000000000005,10.571428571428573,5.666666666666665,3.5
43.0,9.700000000000005,10.571428571428573,5.666666666666665,3.5
44.0,9.700000000000005,10.571428571428573,5.666666666666665,3.5
45.0,9.700000000000005,10.571428571428573,5.666666666666665,3.5
46.0,9.700000000000005,10.571428571428573,5.666666666666665,3.5
47.0,9.700000000000005,10.571428571428573,5.666666666666665,3.5
48.0,9.700000000000005,10.571428571428573,5.666666666666665,3.5
49.0,9.700000000000005,10.571428571428573,5.666666666666665,3.5
50.0,9.700000000000005,10.571428571428573,5.666666666666665,3.5
51.0,9.700000000000005,10.571428571428573,5.666666666666665,3.5
52.0,9.700000000000005,10.571428571428573,5.666666666666665,3.5
53.0,10.700000000000005,11.571428571428573,6.666666666666666,4.499999999999999
54.0,10.700000000000005,11.571428571428573,6.666666666666666,4.499999999999999
55.0,10.700000000000005,11.571428571428573,6.666666666666666,4.499999999999999
56.0,10.700000000000005,11.571428571428573,6.666666666666666,4.499999999999999
57.0,10.700000000000005,11.571428571428573,6.666666666666666,4.499999999999999
58.0,10.625000000000004,11.482142857142861,6.666666666666666,4.499999999999999
59.0,10.625000000000004,11.482142857142861,6.666666666666666,4.499999999999999
60.0,10.625000000000004,11.482142857142861,6.666666666666666,4.499999999999999
61.0,10.625000000000004,11.482142857142861,6.666666666666666,4.499999999999999
62.0,10.565000000000003,11.41071428571428,6.666666666666666,4.499999999999999
63.0,10.565000000000003,11.41071428571428,6.666666666666666,4.499999999999999
64.0,10.565000000000003,11.41071428571428,6.666666666666666,4.499999999999999
65.0,10.565000000000003,11.41071428571428,6.666666666666666,4.499999999999999
66.0,10.565000000000003,11.41071428571428,6.666666666666666,4.499999999999999
67.0,10.565000000000003,11.41071428571428,6.666666666666666,4.499999999999999
68.0,10.565000000000003,11.41071428571428,6.666666666666666,4.499999999999999
69.0,10.565000000000003,11.41071428571428,6.666666666666666,4.499999999999999
70.0,10.565000000000003,11.41071428571428,6.666666666666666,4.499999999999999
71.0,10.565000000000003,11.41071428571428,6.666666666666666,4.499999999999999
72.0,10.565000000000003,11.41071428571428,6.666666666666666,4.499999999999999
73.0,10.565000000000003,11.41071428571428,6.666666666666666,4.499999999999999
74.0,10.565000000000003,11.41071428571428,6.666666666666666,4.499999999999999
75.0,10.505000000000008,11.339285714285717,6.666666666666666,4.499999999999999
76.0,10.505000000000008,11.339285714285717,6.666666666666666,4.499999999999999
77.0,10.505000000000008,11.339285714285717,6.666666666666666,4.499999999999999
78.0,10.505000000000008,11.339285714285717,6.666666666666666,4.499999999999999
79.0,10.505000000000008,11.339285714285717,6.666666666666666,4.499999999999999
80.0,10.505000000000008,11.339285714285717,6.666666666666666,4.499999999999999
81.0,10.505000000000008,11.339285714285717,6.666666666666666,4.499999999999999
82.0,10.505000000000008,11.339285714285717,6.666666666666666,4.499999999999999
83.0,10.505000000000008,11.339285714285717,6.666666666666666,4.499999999999999
84.0,10.505000000000008,11.339285714285717,6.666666666666666,4.499999999999999
85.0,10.505000000000008,11.339285714285717,6.666666666666666,4.499999999999999
86.0,10.505000000000008,11.339285714285717,6.666666666666666,4.499999999999999
87.0,10.505000000000008,11.339285714285717,6.666666666666666,4.499999999999999
88.0,10.505000000000008,11.339285714285717,6.666666666666666,4.499999999999999
89.0,10.505000000000008,11.339285714285717,6.666666666666666,4.499999999999999
90.0,10.505000000000008,11.339285714285717,6.666666666666666,4.499999999999999
91.0,10.505000000000008,11.339285714285717,6.666666666666666,4.499999999999999
92.0,10.505000000000008,11.339285714285717,6.666666666666666,4.499999999999999
93.0,10.505000000000008,11.339285714285717,6.666666666666666,4.499999999999999
94.0,10.505000000000008,11.339285714285717,6.666666666666666,4.499999999999999
95.0,10.505000000000008,11.339285714285717,6.666666666666666,4.499999999999999
96.0,10.505000000000008,11.339285714285717,6.666666666666666,4.499999999999999
97.0,10.505000000000008,11.339285714285717,6.666666666666666,4.499999999999999
98.0,10.505000000000008,11.339285714285717,6.666666666666666,4.499999999999999
99.0,10.505000000000008,11.339285714285717,6.666666666666666,4.499999999999999
100.0,10.505000000000008,11.339285714285717,6.666666666666666,4.499999999999999
101.0,10.505000000000008,11.339285714285717,6.666666666666666,4.499999999999999
102.0,10.505000000000008,11.339285714285717,6.666666666666666,4.499999999999999
103.0,10.505000000000008,11.339285714285717,6.666666666666666,4.499999999999999
104.0,10.505000000000008,11.339285714285717,6.666666666666666,4.499999999999999
105.0,11.505000000000008,12.339285714285717,7.666666666666666,5.499999999999999
106.0,11.505000000000008,12.339285714285717,7.666666666666666,5.499999999999999
107.0,11.505000000000008,12.339285714285717,7.666666666666666,5.499999999999999
108.0,11.505000000000008,12.339285714285717,7.666666666666666,5.499999999999999
109.0,11.505000000000008,12.339285714285717,7.666666666666666,5.499999999999999
110.0,11.505000000000008,12.339285714285717,7.666666666666666,5.499999999999999
111.0,11.505000000000008,12.339285714285717,7.666666666666666,5.499999999999999
112.0,11.505000000000008,12.339285714285717,7.666666666666666,5.499999999999999
113.0,11.505000000000008,12.339285714285717,7.666666666666666,5.499999999999999
114.0,11.505000000000008,12.339285714285717,7.666666666666666,5.499999999999999
115.0,11.505000000000008,12.339285714285717,7.666666666666666,5.499999999999999
116.0,11.505000000000008,12.339285714285717,7.666666666666666,5.499999999999999
117.0,11.505000000000008,12.339285714285717,7.666666666666666,5.499999999999999
118.0,11.505000000000008,12.339285714285717,7.666666666666666,5.499999999999999
119.0,11.505000000000008,12.339285714285717,7.666666666666666,5.499999999999999
120.0,11.505000000000008,12.339285714285717,7.666666666666666,5.499999999999999
121.0,11.505000000000008,12.339285714285717,7.666666666666666,5.499999999999999
122.0,11.505000000000008,12.339285714285717,7.666666666666666,5.499999999999999
123.0,11.505000000000008,12.339285714285717,7.666666666666666,5.499999999999999
124.0,11.505000000000008,12.339285714285717,7.666666666666666,5.499999999999999
125.0,11.505000000000008,12.339285714285717,7.666666666666666,5.499999999999999
126.0,11.505000000000008,12.339285714285717,7.666666666666666,5.499999999999999
127.0,11.505000000000008,12.339285714285717,7.666666666666666,5.499999999999999
128.0,11.505000000000008,12.339285714285717,7.666666666666666,5.499999999999999
129.0,11.505000000000008,12.339285714285717,7.666666666666666,5.499999999999999
130.0,11.505000000000008,12.339285714285717,7.666666666666666,5.499999999999999
131.0,11.505000000000008,12.339285714285717,7.666666666666666,5.499999999999999
132.0,11.505000000000008,12.339285714285717,7.666666666666666,5.499999999999999
133.0,11.409999999999998,12.226190476190474,7.666666666666666,5.499999999999999
134.0,11.409999999999998,12.226190476190474,7.666666666666666,5.499999999999999
135.0,11.409999999999998,12.226190476190474,7.666666666666666,5.499999999999999
136.0,11.409999999999998,12.226190476190474,7.666666666666666,5.499999999999999
137.0,11.409999999999998,12.226190476190474,7.666666666666666,5.499999999999999
138.0,11.409999999999998,12.226190476190474,7.666666666666666,5.499999999999999
139.0,11.409999999999998,12.226190476190474,7.666666666666666,5.499999999999999
140.0,11.409999999999998,12.226190476190474,7.666666666666666,5.499999999999999
141.0,11.409999999999998,12.226190476190474,7.666666666666666,5.499999999999999
142.0,11.409999999999998,12.226190476190474,7.666666666666666,5.499999999999999
143.0,11.409999999999998,12.226190476190474,7.666666666666666,5.499999999999999
144.0,11.409999999999998,12.226190476190474,7.666666666666666,5.499999999999999
145.0,11.409999999999998,12.226190476190474,7.666666666666666,5.499999999999999
146.0,11.409999999999998,12.226190476190474,7.666666666666666,5.499999999999999
147.0,11.409999999999998,12.226190476190474,7.666666666666666,5.499999999999999
148.0,11.409999999999998,12.226190476190474,7.666666666666666,5.499999999999999
149.0,11.409999999999998,12.226190476190474,7.666666666666666,5.499999999999999
150.0,11.409999999999998,12.226190476190474,7.666666666666666,5.499999999999999
151.0,11.409999999999998,12.226190476190474,7.666666666666666,5.499999999999999
152.0,11.409999999999998,12.226190476190474,7.666666666666666,5.499999999999999
153.0,11.409999999999998,12.226190476190474,7.666666666666666,5.499999999999999
154.0,11.409999999999998,12.226190476190474,7.666666666666666,5.499999999999999
155.0,11.409999999999998,12.226190476190474,7.666666666666666,5.499999999999999
156.0,11.409999999999998,12.226190476190474,7.666666666666666,5.499999999999999
157.0,12.409999999999998,13.226190476190474,8.66666666666667,6.499999999999999
158.0,12.409999999999998,13.226190476190474,8.66666666666667,6.499999999999999
159.0,12.409999999999998,13.226190476190474,8.66666666666667,6.499999999999999
160.0,12.409999999999998,13.226190476190474,8.66666666666667,6.499999999999999
161.0,12.409999999999998,13.226190476190474,8.66666666666667,6.499999999999999
162.0,12.409999999999998,13.226190476190474,8.66666666666667,6.499999999999999
163.0,12.409999999999998,13.226190476190474,8.66666666666667,6.499999999999999
164.0,12.409999999999998,13.226190476190474,8.66666666666667,6.499999999999999
165.0,12.409999999999998,13.226190476190474,8.66666666666667,6.499999999999999
166.0,12.409999999999998,13.226190476190474,8.66666666666667,6.499999999999999
167.0,12.409999999999998,13.226190476190474,8.66666666666667,6.499999999999999
168.0,12.409999999999998,13.226190476190474,8.66666666666667,6.499999999999999
169.0,12.409999999999998,13.226190476190474,8.66666666666667,6.499999999999999
170.0,12.409999999999998,13.226190476190474,8.66666666666667,6.499999999999999
171.0,12.409999999999998,13.226190476190474,8.66666666666667,6.499999999999999
172.0,12.409999999999998,13.226190476190474,8.66666666666667,6.499999999999999
173.0,12.329999999999993,13.130952380952387,8.66666666666667,6.499999999999999
174.0,12.329999999999993,13.130952380952387,8.66666666666667,6.499999999999999
175.0,12.329999999999993,13.130952380952387,8.66666666666667,6.499999999999999
176.0,12.329999999999993,13.130952380952387,8.66666666666667,6.499999999999999
177.0,12.279999999999996,13.071428571428568,8.66666666666667,6.499999999999999
178.0,12.264999999999997,13.053571428571425,8.66666666666667,6.499999999999999
179.0,12.264999999999997,13.053571428571425,8.66666666666667,6.499999999999999
180.0,12.264999999999997,13.053571428571425,8.66666666666667,6.499999999999999
181.0,12.264999999999997,13.053571428571425,8.66666666666667,6.499999999999999
182.0,12.264999999999997,13.053571428571425,8.66666666666667,6.499999999999999
183.0,12.264999999999997,13.053571428571425,8.66666666666667,6.499999999999999
184.0,12.264999999999997,13.053571428571425,8.66666666666667,6.499999999999999
185.0,12.264999999999997,13.053571428571425,8.66666666666667,6.499999999999999
186.0,12.264999999999997,13.053571428571425,8.66666666666667,6.499999999999999
187.0,12.264999999999997,13.053571428571425,8.66666666666667,6.499999999999999
188.0,12.264999999999997,13.053571428571425,8.66666666666667,6.499999999999999
189.0,12.264999999999997,13.053571428571425,8.66666666666667,6.499999999999999
190.0,12.214999999999991,12.994047619047613,8.66666666666667,6.499999999999999
191.0,12.214999999999991,12.994047619047613,8.66666666666667,6.499999999999999
192.0,12.214999999999991,12.994047619047613,8.66666666666667,6.499999999999999
193.0,12.214999999999991,12.994047619047613,8.66666666666667,6.499999999999999
194.0,12.214999999999991,12.994047619047613,8.66666666666667,6.499999999999999
195.0,12.214999999999991,12.994047619047613,8.66666666666667,6.499999999999999
196.0,12.214999999999991,12.994047619047613,8.66666666666667,6.499999999999999
197.0,12.214999999999991,12.994047619047613,8.66666666666667,6.499999999999999
198.0,12.214999999999991,12.994047619047613,8.66666666666667,6.499999999999999
199.0,12.214999999999991,12.994047619047613,8.66666666666667,6.499999999999999
200.0,12.214999999999991,12.994047619047613,8.66666666666667,6.499999999999999
201.0,12.214999999999991,12.994047619047613,8.66666666666667,6.499999999999999
202.0,12.214999999999991,12.994047619047613,8.66666666666667,6.499999999999999
203.0,12.214999999999991,12.994047619047613,8.66666666666667,6.499999999999999
204.0,12.195,12.970238095238097,8.66666666666667,6.499999999999999
205.0,12.195,12.970238095238097,8.66666666666667,6.499999999999999
206.0,12.195,12.970238095238097,8.66666666666667,6.499999999999999
207.0,12.135000000000003,12.898809523809522,8.66666666666667,6.499999999999999
208.0,12.135000000000003,12.898809523809522,8.66666666666667,6.499999999999999
209.0,13.135000000000003,13.898809523809522,9.666666666666668,7.499999999999999
210.0,13.135000000000003,13.898809523809522,9.666666666666668,7.499999999999999
211.0,13.135000000000003,13.898809523809522,9.666666666666668,7.499999999999999
212.0,13.059999999999997,13.809523809523812,9.666666666666668,7.499999999999999
213.0,13.059999999999997,13.809523809523812,9.666666666666668,7.499999999999999
214.0,13.0,13.738095238095237,9.666666666666668,7.499999999999999
215.0,13.0,13.738095238095237,9.666666666666668,7.499999999999999
216.0,13.0,13.738095238095237,9.666666666666668,7.499999999999999
217.0,13.0,13.738095238095237,9.666666666666668,7.499999999999999
218.0,13.0,13.738095238095237,9.666666666666668,7.499999999999999
219.0,13.0,13.738095238095237,9.666666666666668,7.499999999999999
220.0,13.0,13.738095238095237,9.666666666666668,7.499999999999999
221.0,13.0,13.738095238095237,9.666666666666668,7.499999999999999
222.0,12.914999999999996,13.738095238095237,9.347826086956523,6.666666666666666
223.0,12.914999999999996,13.738095238095237,9.347826086956523,6.666666666666666
224.0,12.914999999999996,13.738095238095237,9.347826086956523,6.666666666666666
225.0,12.905000000000001,13.726190476190473,9.347826086956523,6.666666666666666
226.0,12.905000000000001,13.726190476190473,9.347826086956523,6.666666666666666
227.0,12.905000000000001,13.726190476190473,9.347826086956523,6.666666666666666
228.0,12.905000000000001,13.726190476190473,9.347826086956523,6.666666666666666
229.0,12.905000000000001,13.726190476190473,9.347826086956523,6.666666666666666
230.0,12.905000000000001,13.726190476190473,9.347826086956523,6.666666666666666
231.0,12.905000000000001,13.726190476190473,9.347826086956523,6.666666666666666
232.0,12.905000000000001,13.726190476190473,9.347826086956523,6.666666666666666
233.0,12.905000000000001,13.726190476190473,9.347826086956523,6.666666666666666
234.0,12.905000000000001,13.726190476190473,9.347826086956523,6.666666666666666
235.0,12.849999999999998,13.660714285714285,9.347826086956523,6.666666666666666
236.0,12.849999999999998,13.660714285714285,9.347826086956523,6.666666666666666
237.0,12.849999999999998,13.660714285714285,9.347826086956523,6.666666666666666
238.0,12.849999999999998,13.660714285714285,9.347826086956523,6.666666666666666
239.0,12.849999999999998,13.660714285714285,9.347826086956523,6.666666666666666
240.0,12.849999999999998,13.660714285714285,9.347826086956523,6.666666666666666
241.0,12.849999999999998,13.660714285714285,9.347826086956523,6.666666666666666
242.0,12.849999999999998,13.660714285714285,9.347826086956523,6.666666666666666
243.0,12.789999999999997,13.589285714285706,9.347826086956523,6.666666666666666
244.0,12.789999999999997,13.589285714285706,9.347826086956523,6.666666666666666
245.0,12.789999999999997,13.589285714285706,9.347826086956523,6.666666666666666
246.0,12.789999999999997,13.589285714285706,9.347826086956523,6.666666666666666
247.0,12.735,13.52380952380952,9.347826086956523,6.666666666666666
248.0,12.735,13.52380952380952,9.347826086956523,6.666666666666666
249.0,12.735,13.52380952380952,9.347826086956523,6.666666666666666
250.0,12.735,13.52380952380952,9.347826086956523,6.666666666666666
251.0,12.735,13.52380952380952,9.347826086956523,6.666666666666666
252.0,12.735,13.52380952380952,9.347826086956523,6.666666666666666
253.0,12.735,13.52380952380952,9.347826086956523,6.666666666666666
254.0,12.660000000000002,13.434523809523808,9.347826086956523,6.666666666666666
255.0,12.660000000000002,13.434523809523808,9.347826086956523,6.666666666666666
256.0,12.660000000000002,13.434523809523808,9.347826086956523,6.666666666666666
257.0,12.660000000000002,13.434523809523808,9.347826086956523,6.666666666666666
258.0,12.660000000000002,13.434523809523808,9.347826086956523,6.666666666666666
259.0,12.660000000000002,13.434523809523808,9.347826086956523,6.666666666666666
260.0,12.660000000000002,13.434523809523808,9.347826086956523,6.666666666666666
261.0,13.465000000000005,14.20238095238095,10.347826086956523,7.666666666666667
262.0,13.465000000000005,14.20238095238095,10.347826086956523,7.666666666666667
263.0,13.465000000000005,14.20238095238095,10.347826086956523,7.666666666666667
264.0,13.465000000000005,14.20238095238095,10.347826086956523,7.666666666666667
265.0,13.465000000000005,14.20238095238095,10.347826086956523,7.666666666666667
266.0,13.465000000000005,14.20238095238095,10.347826086956523,7.666666666666667
267.0,13.440000000000005,14.172619047619053,10.347826086956523,7.666666666666667
268.0,13.440000000000005,14.172619047619053,10.347826086956523,7.666666666666667
269.0,13.344999999999995,14.059523809523814,10.347826086956523,7.666666666666667
270.0,13.344999999999995,14.059523809523814,10.347826086956523,7.666666666666667
271.0,13.344999999999995,14.059523809523814,10.347826086956523,7.666666666666667
272.0,13.344999999999995,14.059523809523814,10.347826086956523,7.666666666666667
273.0,13.309999999999988,14.017857142857151,10.347826086956523,7.666666666666667
274.0,13.309999999999988,14.017857142857151,10.347826086956523,7.666666666666667
275.0,13.309999999999988,14.017857142857151,10.347826086956523,7.666666666666667
276.0,13.309999999999988,14.017857142857151,10.347826086956523,7.666666666666667
277.0,13.309999999999988,14.017857142857151,10.347826086956523,7.666666666666667
278.0,13.239999999999998,13.934523809523805,10.347826086956523,7.666666666666667
279.0,13.239999999999998,13.934523809523805,10.347826086956523,7.666666666666667
280.0,13.239999999999998,13.934523809523805,10.347826086956523,7.666666666666667
281.0,13.239999999999998,13.934523809523805,10.347826086956523,7.666666666666667
282.0,13.149999999999997,13.88095238095238,9.956521739130435,7.666666666666667
283.0,13.149999999999997,13.88095238095238,9.956521739130435,7.666666666666667
284.0,13.149999999999997,13.88095238095238,9.956521739130435,7.666666666666667
285.0,13.149999999999997,13.88095238095238,9.956521739130435,7.666666666666667
286.0,13.149999999999997,13.88095238095238,9.956521739130435,7.666666666666667
287.0,13.13,13.857142857142852,9.956521739130435,7.666666666666667
288.0,13.13,13.857142857142852,9.956521739130435,7.666666666666667
289.0,13.13,13.857142857142852,9.956521739130435,7.666666666666667
290.0,13.06,13.773809523809524,9.956521739130435,7.666666666666667
291.0,13.06,13.773809523809524,9.956521739130435,7.666666666666667
292.0,13.06,13.773809523809524,9.956521739130435,7.666666666666667
293.0,13.06,13.773809523809524,9.956521739130435,7.666666666666667
294.0,13.06,13.773809523809524,9.956521739130435,7.666666666666667
295.0,13.06,13.773809523809524,9.956521739130435,7.666666666666667
296.0,13.06,13.773809523809524,9.956521739130435,7.666666666666667
297.0,13.06,13.773809523809524,9.956521739130435,7.666666666666667
298.0,13.06,13.773809523809524,9.956521739130435,7.666666666666667
299.0,13.06,13.773809523809524,9.956521739130435,7.666666666666667
300.0,13.06,13.773809523809524,9.956521739130435,7.666666666666667
301.0,13.06,13.773809523809524,9.956521739130435,7.666666666666667
302.0,13.035000000000009,13.744047619047619,9.956521739130435,7.666666666666667
303.0,13.035000000000009,13.744047619047619,9.956521739130435,7.666666666666667
304.0,12.940000000000001,13.684523809523812,10.0,6.899999999999999
305.0,12.940000000000001,13.684523809523812,10.0,6.899999999999999
306.0,12.940000000000001,13.684523809523812,10.0,6.899999999999999
307.0,12.940000000000001,13.684523809523812,10.0,6.899999999999999
308.0,12.919999999999998,13.660714285714288,10.0,6.899999999999999
309.0,12.919999999999998,13.660714285714288,10.0,6.899999999999999
310.0,12.919999999999998,13.660714285714288,10.0,6.899999999999999
311.0,12.919999999999998,13.660714285714288,10.0,6.899999999999999
312.0,12.919999999999998,13.660714285714288,10.0,6.899999999999999
313.0,13.745000000000006,14.452380952380945,11.0,7.8999999999999995
314.0,13.745000000000006,14.452380952380945,11.0,7.8999999999999995
315.0,13.745000000000006,14.452380952380945,11.0,7.8999999999999995
316.0,13.745000000000006,14.452380952380945,11.0,7.8999999999999995
317.0,13.745000000000006,14.452380952380945,11.0,7.8999999999999995
318.0,13.745000000000006,14.452380952380945,11.0,7.8999999999999995
319.0,13.745000000000006,14.452380952380945,11.0,7.8999999999999995
320.0,13.670000000000005,14.363095238095237,11.0,7.8999999999999995
321.0,13.590000000000003,14.26785714285714,11.0,7.8999999999999995
322.0,13.590000000000003,14.26785714285714,11.0,7.8999999999999995
323.0,13.530000000000005,14.196428571428573,11.0,7.8999999999999995
324.0,13.530000000000005,14.196428571428573,11.0,7.8999999999999995
325.0,13.530000000000005,14.196428571428573,11.0,7.8999999999999995
326.0,13.530000000000005,14.196428571428573,11.0,7.8999999999999995
327.0,13.494999999999996,14.154761904761905,11.0,7.8999999999999995
328.0,13.494999999999996,14.154761904761905,11.0,7.8999999999999995
329.0,13.494999999999996,14.154761904761905,11.0,7.8999999999999995
330.0,13.494999999999996,14.154761904761905,11.0,7.8999999999999995
331.0,13.494999999999996,14.154761904761905,11.0,7.8999999999999995
332.0,13.494999999999996,14.154761904761905,11.0,7.8999999999999995
333.0,13.494999999999996,14.154761904761905,11.0,7.8999999999999995
334.0,13.475,14.13095238095238,11.0,7.8999999999999995
335.0,13.475,14.13095238095238,11.0,7.8999999999999995
336.0,13.445000000000006,14.095238095238097,11.0,7.8999999999999995
337.0,13.445000000000006,14.095238095238097,11.0,7.8999999999999995
338.0,13.445000000000006,14.095238095238097,11.0,7.8999999999999995
339.0,13.445000000000006,14.095238095238097,11.0,7.8999999999999995
340.0,13.445000000000006,14.095238095238097,11.0,7.8999999999999995
341.0,13.379999999999999,14.017857142857144,11.0,7.8999999999999995
342.0,13.359999999999996,13.994047619047622,11.0,7.8999999999999995
343.0,13.359999999999996,13.994047619047622,11.0,7.8999999999999995
344.0,13.359999999999996,13.994047619047622,11.0,7.8999999999999995
345.0,13.359999999999996,13.994047619047622,11.0,7.8999999999999995
346.0,13.329999999999991,13.958333333333336,11.0,7.8999999999999995
347.0,13.339999999999996,13.970238095238098,11.0,7.8999999999999995
348.0,13.339999999999996,13.970238095238098,11.0,7.8999999999999995
349.0,13.339999999999996,13.970238095238098,11.0,7.8999999999999995
350.0,13.324999999999998,13.952380952380963,11.0,7.8999999999999995
351.0,13.324999999999998,13.952380952380963,11.0,7.8999999999999995
352.0,13.324999999999998,13.952380952380963,11.0,7.8999999999999995
353.0,13.324999999999998,13.952380952380963,11.0,7.8999999999999995
354.0,13.324999999999998,13.952380952380963,11.0,7.8999999999999995
355.0,13.324999999999998,13.952380952380963,11.0,7.8999999999999995
356.0,13.324999999999998,13.952380952380963,11.0,7.8999999999999995
357.0,13.324999999999998,13.952380952380963,11.0,7.8999999999999995
358.0,13.284999999999998,13.90476190476191,11.0,7.8999999999999995
359.0,13.284999999999998,13.90476190476191,11.0,7.8999999999999995
360.0,13.235000000000003,13.845238095238091,11.0,7.8999999999999995
361.0,13.235000000000003,13.845238095238091,11.0,7.8999999999999995
362.0,13.235000000000003,13.845238095238091,11.0,7.8999999999999995
363.0,13.235000000000003,13.845238095238091,11.0,7.8999999999999995
364.0,13.235000000000003,13.845238095238091,11.0,7.8999999999999995
365.0,14.120000000000008,14.708333333333332,12.0,8.9
366.0,14.120000000000008,14.708333333333332,12.0,8.9
367.0,14.120000000000008,14.708333333333332,12.0,8.9
368.0,14.120000000000008,14.708333333333332,12.0,8.9
369.0,14.120000000000008,14.708333333333332,12.0,8.9
370.0,14.120000000000008,14.708333333333332,12.0,8.9
371.0,14.120000000000008,14.708333333333332,12.0,8.9
372.0,14.120000000000008,14.708333333333332,12.0,8.9
373.0,14.120000000000008,14.708333333333332,12.0,8.9
374.0,14.120000000000008,14.708333333333332,12.0,8.9
375.0,14.120000000000008,14.708333333333332,12.0,8.9
376.0,14.045000000000007,14.61904761904762,12.0,8.9
377.0,14.045000000000007,14.61904761904762,12.0,8.9
378.0,14.045000000000007,14.61904761904762,12.0,8.9
379.0,14.045000000000007,14.61904761904762,12.0,8.9
380.0,14.045000000000007,14.61904761904762,12.0,8.9
381.0,13.93500000000001,14.488095238095239,12.0,8.9
382.0,13.93500000000001,14.488095238095239,12.0,8.9
383.0,13.940000000000008,14.494047619047617,12.0,8.9
384.0,13.940000000000008,14.494047619047617,12.0,8.9
385.0,13.940000000000008,14.494047619047617,12.0,8.9
386.0,13.940000000000008,14.494047619047617,12.0,8.9
387.0,13.940000000000008,14.494047619047617,12.0,8.9
388.0,13.940000000000008,14.494047619047617,12.0,8.9
389.0,13.940000000000008,14.494047619047617,12.0,8.9
390.0,13.940000000000008,14.494047619047617,12.0,8.9
391.0,13.940000000000008,14.494047619047617,12.0,8.9
392.0,13.940000000000008,14.494047619047617,12.0,8.9
393.0,13.940000000000008,14.494047619047617,12.0,8.9
394.0,13.940000000000008,14.494047619047617,12.0,8.9
395.0,13.885000000000012,14.428571428571425,12.0,8.9
396.0,13.805000000000012,14.333333333333329,12.0,8.9
397.0,13.740000000000004,14.255952380952378,12.0,8.9
398.0,13.725,14.238095238095243,12.0,8.9
399.0,13.669999999999998,14.238095238095243,12.0,7.800000000000001
400.0,13.669999999999998,14.238095238095243,12.0,7.800000000000001
401.0,13.669999999999998,14.238095238095243,12.0,7.800000000000001
402.0,13.669999999999998,14.238095238095243,12.0,7.800000000000001
403.0,13.645,14.208333333333343,12.0,7.800000000000001
404.0,13.645,14.208333333333343,12.0,7.800000000000001
405.0,13.569999999999997,14.119047619047626,12.0,7.800000000000001
406.0,13.569999999999997,14.119047619047626,12.0,7.800000000000001
407.0,13.425000000000004,13.946428571428571,12.0,7.800000000000001
408.0,13.425000000000004,13.946428571428571,12.0,7.800000000000001
409.0,13.425000000000004,13.946428571428571,12.0,7.800000000000001
410.0,13.425000000000004,13.946428571428571,12.0,7.800000000000001
411.0,13.425000000000004,13.946428571428571,12.0,7.800000000000001
412.0,13.425000000000004,13.946428571428571,12.0,7.800000000000001
413.0,13.425000000000004,13.946428571428571,12.0,7.800000000000001
414.0,13.425000000000004,13.946428571428571,12.0,7.800000000000001
415.0,13.425000000000004,13.946428571428571,12.0,7.800000000000001
416.0,13.425000000000004,13.946428571428571,12.0,7.800000000000001
417.0,14.275000000000006,14.922619047619051,12.363636363636363,7.6
418.0,14.184999999999997,14.81547619047619,12.363636363636363,7.6
419.0,14.184999999999997,14.81547619047619,12.363636363636363,7.6
420.0,14.184999999999997,14.81547619047619,12.363636363636363,7.6
421.0,14.179999999999996,14.809523809523808,12.363636363636363,7.6
422.0,14.179999999999996,14.809523809523808,12.363636363636363,7.6
423.0,14.179999999999996,14.809523809523808,12.363636363636363,7.6
424.0,14.159999999999997,14.785714285714288,12.363636363636363,7.6
425.0,14.159999999999997,14.785714285714288,12.363636363636363,7.6
426.0,14.159999999999997,14.785714285714288,12.363636363636363,7.6
427.0,14.08,14.690476190476197,12.363636363636363,7.6
428.0,14.08,14.690476190476197,12.363636363636363,7.6
429.0,14.08,14.690476190476197,12.363636363636363,7.6
430.0,14.08,14.690476190476197,12.363636363636363,7.6
431.0,14.08,14.690476190476197,12.363636363636363,7.6
432.0,14.08,14.690476190476197,12.363636363636363,7.6
433.0,14.08,14.690476190476197,12.363636363636363,7.6
434.0,14.08,14.690476190476197,12.363636363636363,7.6
435.0,14.08,14.690476190476197,12.363636363636363,7.6
436.0,14.014999999999997,14.61309523809524,12.363636363636363,7.6
437.0,14.014999999999997,14.61309523809524,12.363636363636363,7.6
438.0,14.014999999999997,14.61309523809524,12.363636363636363,7.6
439.0,14.014999999999997,14.61309523809524,12.363636363636363,7.6
440.0,14.014999999999997,14.61309523809524,12.363636363636363,7.6
441.0,14.014999999999997,14.61309523809524,12.363636363636363,7.6
442.0,14.014999999999997,14.61309523809524,12.363636363636363,7.6
443.0,14.014999999999997,14.61309523809524,12.363636363636363,7.6
444.0,14.004999999999997,14.601190476190473,12.363636363636363,7.6
445.0,14.004999999999997,14.601190476190473,12.363636363636363,7.6
446.0,14.004999999999997,14.601190476190473,12.363636363636363,7.6
447.0,14.004999999999997,14.601190476190473,12.363636363636363,7.6
448.0,14.004999999999997,14.601190476190473,12.363636363636363,7.6
449.0,14.004999999999997,14.601190476190473,12.363636363636363,7.6
450.0,14.004999999999997,14.601190476190473,12.363636363636363,7.6
451.0,14.004999999999997,14.601190476190473,12.363636363636363,7.6
452.0,13.950000000000001,14.601190476190473,11.863636363636363,7.6
453.0,13.950000000000001,14.601190476190473,11.863636363636363,7.6
454.0,13.950000000000001,14.601190476190473,11.863636363636363,7.6
455.0,13.950000000000001,14.601190476190473,11.863636363636363,7.6
456.0,13.950000000000001,14.601190476190473,11.863636363636363,7.6
457.0,13.950000000000001,14.601190476190473,11.863636363636363,7.6
458.0,13.950000000000001,14.601190476190473,11.863636363636363,7.6
459.0,13.9,14.541666666666664,11.863636363636363,7.6
460.0,13.9,14.541666666666664,11.863636363636363,7.6
461.0,13.865000000000006,14.500000000000002,11.863636363636363,7.6
462.0,13.865000000000006,14.500000000000002,11.863636363636363,7.6
463.0,13.865000000000006,14.500000000000002,11.863636363636363,7.6
464.0,13.865000000000006,14.500000000000002,11.863636363636363,7.6
465.0,13.865000000000006,14.500000000000002,11.863636363636363,7.6
466.0,13.865000000000006,14.500000000000002,11.863636363636363,7.6
467.0,13.865000000000006,14.500000000000002,11.863636363636363,7.6
468.0,13.785000000000005,14.500000000000002,11.863636363636363,6.0
469.0,14.630000000000004,15.315476190476192,12.863636363636363,7.0
470.0,14.630000000000004,15.315476190476192,12.863636363636363,7.0
471.0,14.630000000000004,15.315476190476192,12.863636363636363,7.0
472.0,14.630000000000004,15.315476190476192,12.863636363636363,7.0
473.0,14.630000000000004,15.315476190476192,12.863636363636363,7.0
474.0,14.630000000000004,15.315476190476192,12.863636363636363,7.0
475.0,14.59,15.267857142857142,12.863636363636363,7.0
476.0,14.59,15.267857142857142,12.863636363636363,7.0
477.0,14.59,15.267857142857142,12.863636363636363,7.0
478.0,14.59,15.267857142857142,12.863636363636363,7.0
479.0,14.59,15.267857142857142,12.863636363636363,7.0
480.0,14.59,15.267857142857142,12.863636363636363,7.0
481.0,14.59,15.267857142857142,12.863636363636363,7.0
482.0,14.59,15.267857142857142,12.863636363636363,7.0
483.0,14.59,15.267857142857142,12.863636363636363,7.0
484.0,14.59,15.267857142857142,12.863636363636363,7.0
485.0,14.59,15.267857142857142,12.863636363636363,7.0
486.0,14.59,15.267857142857142,12.863636363636363,7.0
487.0,14.59,15.267857142857142,12.863636363636363,7.0
488.0,14.59,15.267857142857142,12.863636363636363,7.0
489.0,14.59,15.267857142857142,12.863636363636363,7.0
490.0,14.59,15.267857142857142,12.863636363636363,7.0
491.0,14.59,15.267857142857142,12.863636363636363,7.0
492.0,14.545000000000007,15.214285714285714,12.863636363636363,7.0
493.0,14.545000000000007,15.214285714285714,12.863636363636363,7.0
494.0,14.545000000000007,15.214285714285714,12.863636363636363,7.0
495.0,14.48000000000001,15.214285714285714,12.272727272727273,7.0
496.0,14.48000000000001,15.214285714285714,12.272727272727273,7.0
497.0,14.454999999999995,15.184523809523814,12.272727272727273,7.0
498.0,14.454999999999995,15.184523809523814,12.272727272727273,7.0
499.0,14.454999999999995,15.184523809523814,12.272727272727273,7.0
500.0,14.454999999999995,15.184523809523814,12.272727272727273,7.0
501.0,14.284999999999997,15.06547619047619,11.636363636363637,7.0
502.0,14.284999999999997,15.06547619047619,11.636363636363637,7.0
503.0,14.270000000000003,15.047619047619047,11.636363636363637,7.0
504.0,14.270000000000003,15.047619047619047,11.636363636363637,7.0
505.0,14.209999999999999,14.976190476190482,11.636363636363637,7.0
506.0,14.209999999999999,14.976190476190482,11.636363636363637,7.0
507.0,14.209999999999999,14.976190476190482,11.636363636363637,7.0
508.0,14.209999999999999,14.976190476190482,11.636363636363637,7.0
509.0,14.209999999999999,14.976190476190482,11.636363636363637,7.0
510.0,14.209999999999999,14.976190476190482,11.636363636363637,7.0
511.0,14.209999999999999,14.976190476190482,11.636363636363637,7.0
512.0,14.209999999999999,14.976190476190482,11.636363636363637,7.0
513.0,14.209999999999999,14.976190476190482,11.636363636363637,7.0
514.0,14.209999999999999,14.976190476190482,11.636363636363637,7.0
515.0,14.209999999999999,14.976190476190482,11.636363636363637,7.0
516.0,14.209999999999999,14.976190476190482,11.636363636363637,7.0
517.0,14.209999999999999,14.976190476190482,11.636363636363637,7.0
518.0,14.209999999999999,14.976190476190482,11.636363636363637,7.0
519.0,14.209999999999999,14.976190476190482,11.636363636363637,7.0
520.0,14.209999999999999,14.976190476190482,11.636363636363637,7.0
521.0,15.005000000000006,15.874999999999996,12.090909090909088,6.800000000000001
522.0,15.005000000000006,15.874999999999996,12.090909090909088,6.800000000000001
523.0,15.005000000000006,15.874999999999996,12.090909090909088,6.800000000000001
524.0,15.005000000000006,15.874999999999996,12.090909090909088,6.800000000000001
525.0,15.005000000000006,15.874999999999996,12.090909090909088,6.800000000000001
526.0,15.005000000000006,15.874999999999996,12.090909090909088,6.800000000000001
527.0,14.929999999999996,15.785714285714288,12.090909090909088,6.800000000000001
528.0,14.929999999999996,15.785714285714288,12.090909090909088,6.800000000000001
529.0,14.929999999999996,15.785714285714288,12.090909090909088,6.800000000000001
530.0,14.929999999999996,15.785714285714288,12.090909090909088,6.800000000000001
531.0,14.929999999999996,15.785714285714288,12.090909090909088,6.800000000000001
532.0,14.869999999999997,15.785714285714288,11.545454545454543,6.800000000000001
533.0,14.869999999999997,15.785714285714288,11.545454545454543,6.800000000000001
534.0,14.845,15.755952380952378,11.545454545454543,6.800000000000001
535.0,14.845,15.755952380952378,11.545454545454543,6.800000000000001
536.0,14.79,15.690476190476192,11.545454545454543,6.800000000000001
537.0,14.79,15.690476190476192,11.545454545454543,6.800000000000001
538.0,14.79,15.690476190476192,11.545454545454543,6.800000000000001
539.0,14.79,15.690476190476192,11.545454545454543,6.800000000000001
540.0,14.79,15.690476190476192,11.545454545454543,6.800000000000001
541.0,14.79,15.690476190476192,11.545454545454543,6.800000000000001
542.0,14.829999999999993,15.738095238095243,11.545454545454543,6.800000000000001
543.0,14.829999999999993,15.738095238095243,11.545454545454543,6.800000000000001
544.0,14.829999999999993,15.738095238095243,11.545454545454543,6.800000000000001
545.0,14.829999999999993,15.738095238095243,11.545454545454543,6.800000000000001
546.0,14.759999999999996,15.738095238095243,10.909090909090908,6.800000000000001
547.0,14.759999999999996,15.738095238095243,10.909090909090908,6.800000000000001
548.0,14.759999999999996,15.738095238095243,10.909090909090908,6.800000000000001
549.0,14.704999999999993,15.738095238095243,10.909090909090908,5.7
550.0,14.704999999999993,15.738095238095243,10.909090909090908,5.7
551.0,14.704999999999993,15.738095238095243,10.909090909090908,5.7
552.0,14.704999999999993,15.738095238095243,10.909090909090908,5.7
553.0,14.704999999999993,15.738095238095243,10.909090909090908,5.7
554.0,14.704999999999993,15.738095238095243,10.909090909090908,5.7
555.0,14.704999999999993,15.738095238095243,10.909090909090908,5.7
556.0,14.704999999999993,15.738095238095243,10.909090909090908,5.7
557.0,14.704999999999993,15.738095238095243,10.909090909090908,5.7
558.0,14.704999999999993,15.738095238095243,10.909090909090908,5.7
559.0,14.704999999999993,15.738095238095243,10.909090909090908,5.7
560.0,14.704999999999993,15.738095238095243,10.909090909090908,5.7
561.0,14.704999999999993,15.738095238095243,10.909090909090908,5.7
562.0,14.704999999999993,15.738095238095243,10.909090909090908,5.7
563.0,14.704999999999993,15.738095238095243,10.909090909090908,5.7
564.0,14.704999999999993,15.738095238095243,10.909090909090908,5.7
565.0,14.704999999999993,15.738095238095243,10.909090909090908,5.7
566.0,14.660000000000002,15.684523809523807,10.909090909090908,5.7
567.0,14.660000000000002,15.684523809523807,10.909090909090908,5.7
568.0,14.660000000000002,15.684523809523807,10.909090909090908,5.7
569.0,14.660000000000002,15.684523809523807,10.909090909090908,5.7
570.0,14.660000000000002,15.684523809523807,10.909090909090908,5.7
571.0,14.660000000000002,15.684523809523807,10.909090909090908,5.7
572.0,14.660000000000002,15.684523809523807,10.909090909090908,5.7
573.0,15.575000000000003,16.66666666666666,11.272727272727273,6.7
574.0,15.575000000000003,16.66666666666666,11.272727272727273,6.7
575.0,15.575000000000003,16.66666666666666,11.272727272727273,6.7
576.0,15.535,16.619047619047617,11.272727272727273,6.7
577.0,15.535,16.619047619047617,11.272727272727273,6.7
578.0,15.535,16.619047619047617,11.272727272727273,6.7
579.0,15.535,16.619047619047617,11.272727272727273,6.7
580.0,15.535,16.619047619047617,11.272727272727273,6.7
581.0,15.535,16.619047619047617,11.272727272727273,6.7
582.0,15.489999999999998,16.565476190476197,11.272727272727273,6.7
583.0,15.424999999999997,16.488095238095248,11.272727272727273,6.7
584.0,15.424999999999997,16.488095238095248,11.272727272727273,6.7
585.0,15.424999999999997,16.488095238095248,11.272727272727273,6.7
586.0,15.424999999999997,16.488095238095248,11.272727272727273,6.7
587.0,15.424999999999997,16.488095238095248,11.272727272727273,6.7
588.0,15.424999999999997,16.488095238095248,11.272727272727273,6.7
589.0,15.424999999999997,16.488095238095248,11.272727272727273,6.7
590.0,15.424999999999997,16.488095238095248,11.272727272727273,6.7
591.0,15.374999999999998,16.428571428571427,11.272727272727273,6.7
592.0,15.374999999999998,16.428571428571427,11.272727272727273,6.7
593.0,15.374999999999998,16.428571428571427,11.272727272727273,6.7
594.0,15.374999999999998,16.428571428571427,11.272727272727273,6.7
595.0,15.315,16.35714285714286,11.272727272727273,6.7
596.0,15.315,16.35714285714286,11.272727272727273,6.7
597.0,15.315,16.35714285714286,11.272727272727273,6.7
598.0,15.315,16.35714285714286,11.272727272727273,6.7
599.0,15.315,16.35714285714286,11.272727272727273,6.7
600.0,15.315,16.35714285714286,11.272727272727273,6.7
601.0,15.315,16.35714285714286,11.272727272727273,6.7
602.0,15.315,16.35714285714286,11.272727272727273,6.7
603.0,15.315,16.35714285714286,11.272727272727273,6.7
604.0,15.315,16.35714285714286,11.272727272727273,6.7
605.0,15.315,16.35714285714286,11.272727272727273,6.7
606.0,15.315,16.35714285714286,11.272727272727273,6.7
607.0,15.315,16.35714285714286,11.272727272727273,6.7
608.0,15.315,16.35714285714286,11.272727272727273,6.7
609.0,15.315,16.35714285714286,11.272727272727273,6.7
610.0,15.315,16.35714285714286,11.272727272727273,6.7
611.0,15.315,16.35714285714286,11.272727272727273,6.7
612.0,15.315,16.35714285714286,11.272727272727273,6.7
613.0,15.315,16.35714285714286,11.272727272727273,6.7
614.0,15.315,16.35714285714286,11.272727272727273,6.7
615.0,15.315,16.35714285714286,11.272727272727273,6.7
616.0,15.315,16.35714285714286,11.272727272727273,6.7
617.0,15.315,16.35714285714286,11.272727272727273,6.7
618.0,15.315,16.35714285714286,11.272727272727273,6.7
619.0,15.204999999999997,16.22619047619048,11.272727272727273,6.7
620.0,15.035000000000002,16.023809523809522,11.272727272727273,6.7
621.0,15.035000000000002,16.023809523809522,11.272727272727273,6.7
622.0,15.035000000000002,16.023809523809522,11.272727272727273,6.7
623.0,15.035000000000002,16.023809523809522,11.272727272727273,6.7
624.0,15.035000000000002,16.023809523809522,11.272727272727273,6.7
625.0,16.035000000000004,17.023809523809515,12.272727272727273,7.7
626.0,16.035000000000004,17.023809523809515,12.272727272727273,7.7
627.0,16.035000000000004,17.023809523809515,12.272727272727273,7.7
628.0,16.035000000000004,17.023809523809515,12.272727272727273,7.7
629.0,16.035000000000004,17.023809523809515,12.272727272727273,7.7
630.0,15.950000000000001,16.922619047619047,12.272727272727273,7.7
631.0,15.950000000000001,16.922619047619047,12.272727272727273,7.7
632.0,15.950000000000001,16.922619047619047,12.272727272727273,7.7
633.0,15.844999999999995,16.797619047619047,12.272727272727273,7.7
634.0,15.844999999999995,16.797619047619047,12.272727272727273,7.7
635.0,15.844999999999995,16.797619047619047,12.272727272727273,7.7
636.0,15.844999999999995,16.797619047619047,12.272727272727273,7.7
637.0,15.844999999999995,16.797619047619047,12.272727272727273,7.7
638.0,15.844999999999995,16.797619047619047,12.272727272727273,7.7
639.0,15.844999999999995,16.797619047619047,12.272727272727273,7.7
640.0,15.69,16.797619047619047,11.59090909090909,6.1000000000000005
641.0,15.69,16.797619047619047,11.59090909090909,6.1000000000000005
642.0,15.69,16.797619047619047,11.59090909090909,6.1000000000000005
643.0,15.69,16.797619047619047,11.59090909090909,6.1000000000000005
644.0,15.580000000000002,16.666666666666664,11.59090909090909,6.1000000000000005
645.0,15.580000000000002,16.666666666666664,11.59090909090909,6.1000000000000005
646.0,15.464999999999993,16.529761904761894,11.59090909090909,6.1000000000000005
647.0,15.380000000000004,16.428571428571427,11.59090909090909,6.1000000000000005
648.0,15.380000000000004,16.428571428571427,11.59090909090909,6.1000000000000005
649.0,15.380000000000004,16.428571428571427,11.59090909090909,6.1000000000000005
650.0,15.380000000000004,16.428571428571427,11.59090909090909,6.1000000000000005
651.0,15.299999999999995,16.428571428571427,10.863636363636363,6.1000000000000005
652.0,15.299999999999995,16.428571428571427,10.863636363636363,6.1000000000000005
653.0,15.299999999999995,16.428571428571427,10.863636363636363,6.1000000000000005
654.0,15.299999999999995,16.428571428571427,10.863636363636363,6.1000000000000005
655.0,15.299999999999995,16.428571428571427,10.863636363636363,6.1000000000000005
656.0,15.299999999999995,16.428571428571427,10.863636363636363,6.1000000000000005
657.0,15.299999999999995,16.428571428571427,10.863636363636363,6.1000000000000005
658.0,15.299999999999995,16.428571428571427,10.863636363636363,6.1000000000000005
659.0,15.249999999999998,16.369047619047617,10.863636363636363,6.1000000000000005
660.0,15.249999999999998,16.369047619047617,10.863636363636363,6.1000000000000005
661.0,15.249999999999998,16.369047619047617,10.863636363636363,6.1000000000000005
662.0,15.174999999999999,16.279761904761894,10.863636363636363,6.1000000000000005
663.0,15.174999999999999,16.279761904761894,10.863636363636363,6.1000000000000005
664.0,15.174999999999999,16.279761904761894,10.863636363636363,6.1000000000000005
665.0,15.174999999999999,16.279761904761894,10.863636363636363,6.1000000000000005
666.0,15.174999999999999,16.279761904761894,10.863636363636363,6.1000000000000005
667.0,15.114999999999993,16.208333333333357,10.863636363636363,6.1000000000000005
668.0,15.114999999999993,16.208333333333357,10.863636363636363,6.1000000000000005
669.0,15.114999999999993,16.208333333333357,10.863636363636363,6.1000000000000005
670.0,15.114999999999993,16.208333333333357,10.863636363636363,6.1000000000000005
671.0,15.114999999999993,16.208333333333357,10.863636363636363,6.1000000000000005
672.0,15.114999999999993,16.208333333333357,10.863636363636363,6.1000000000000005
673.0,15.114999999999993,16.208333333333357,10.863636363636363,6.1000000000000005
674.0,15.114999999999993,16.208333333333357,10.863636363636363,6.1000000000000005
675.0,15.114999999999993,16.208333333333357,10.863636363636363,6.1000000000000005
676.0,15.114999999999993,16.208333333333357,10.863636363636363,6.1000000000000005
677.0,15.940000000000007,17.113095238095237,11.523809523809526,6.454545454545455
678.0,15.940000000000007,17.113095238095237,11.523809523809526,6.454545454545455
679.0,15.940000000000007,17.113095238095237,11.523809523809526,6.454545454545455
680.0,15.940000000000007,17.113095238095237,11.523809523809526,6.454545454545455
681.0,15.940000000000007,17.113095238095237,11.523809523809526,6.454545454545455
682.0,15.940000000000007,17.113095238095237,11.523809523809526,6.454545454545455
683.0,15.940000000000007,17.113095238095237,11.523809523809526,6.454545454545455
684.0,15.940000000000007,17.113095238095237,11.523809523809526,6.454545454545455
685.0,15.940000000000007,17.113095238095237,11.523809523809526,6.454545454545455
686.0,15.940000000000007,17.113095238095237,11.523809523809526,6.454545454545455
687.0,15.940000000000007,17.113095238095237,11.523809523809526,6.454545454545455
688.0,15.940000000000007,17.113095238095237,11.523809523809526,6.454545454545455
689.0,15.940000000000007,17.113095238095237,11.523809523809526,6.454545454545455
690.0,15.864999999999991,17.023809523809522,11.523809523809526,6.454545454545455
691.0,15.775000000000004,16.916666666666675,11.523809523809526,6.454545454545455
692.0,15.539999999999997,16.755952380952383,10.571428571428571,6.454545454545455
693.0,15.539999999999997,16.755952380952383,10.571428571428571,6.454545454545455
694.0,15.539999999999997,16.755952380952383,10.571428571428571,6.454545454545455
695.0,15.539999999999997,16.755952380952383,10.571428571428571,6.454545454545455
696.0,15.539999999999997,16.755952380952383,10.571428571428571,6.454545454545455
697.0,15.354999999999993,16.53571428571429,10.571428571428571,6.454545454545455
698.0,15.354999999999993,16.53571428571429,10.571428571428571,6.454545454545455
699.0,15.354999999999993,16.53571428571429,10.571428571428571,6.454545454545455
700.0,15.354999999999993,16.53571428571429,10.571428571428571,6.454545454545455
701.0,15.354999999999993,16.53571428571429,10.571428571428571,6.454545454545455
702.0,15.354999999999993,16.53571428571429,10.571428571428571,6.454545454545455
703.0,15.235000000000003,16.392857142857146,10.571428571428571,6.454545454545455
704.0,15.235000000000003,16.392857142857146,10.571428571428571,6.454545454545455
705.0,15.235000000000003,16.392857142857146,10.571428571428571,6.454545454545455
706.0,15.235000000000003,16.392857142857146,10.571428571428571,6.454545454545455
707.0,15.235000000000003,16.392857142857146,10.571428571428571,6.454545454545455
708.0,15.235000000000003,16.392857142857146,10.571428571428571,6.454545454545455
709.0,15.235000000000003,16.392857142857146,10.571428571428571,6.454545454545455
710.0,15.235000000000003,16.392857142857146,10.571428571428571,6.454545454545455
711.0,15.235000000000003,16.392857142857146,10.571428571428571,6.454545454545455
712.0,15.169999999999995,16.315476190476186,10.571428571428571,6.454545454545455
713.0,15.169999999999995,16.315476190476186,10.571428571428571,6.454545454545455
714.0,15.169999999999995,16.315476190476186,10.571428571428571,6.454545454545455
715.0,15.089999999999993,16.315476190476186,9.809523809523808,6.454545454545455
716.0,15.089999999999993,16.315476190476186,9.809523809523808,6.454545454545455
717.0,15.039999999999997,16.255952380952376,9.809523809523808,6.454545454545455
718.0,15.039999999999997,16.255952380952376,9.809523809523808,6.454545454545455
719.0,15.039999999999997,16.255952380952376,9.809523809523808,6.454545454545455
720.0,15.01,16.220238095238113,9.809523809523808,6.454545454545455
721.0,15.01,16.220238095238113,9.809523809523808,6.454545454545455
722.0,15.01,16.220238095238113,9.809523809523808,6.454545454545455
723.0,15.01,16.220238095238113,9.809523809523808,6.454545454545455
724.0,15.01,16.220238095238113,9.809523809523808,6.454545454545455
725.0,15.01,16.220238095238113,9.809523809523808,6.454545454545455
726.0,15.01,16.220238095238113,9.809523809523808,6.454545454545455
727.0,14.890000000000002,16.07738095238095,9.809523809523808,6.454545454545455
728.0,14.890000000000002,16.07738095238095,9.809523809523808,6.454545454545455
729.0,15.890000000000002,17.077380952380953,10.809523809523808,7.454545454545455
730.0,15.890000000000002,17.077380952380953,10.809523809523808,7.454545454545455
731.0,15.890000000000002,17.077380952380953,10.809523809523808,7.454545454545455
732.0,15.890000000000002,17.077380952380953,10.809523809523808,7.454545454545455
733.0,15.890000000000002,17.077380952380953,10.809523809523808,7.454545454545455
734.0,15.890000000000002,17.077380952380953,10.809523809523808,7.454545454545455
735.0,15.890000000000002,17.077380952380953,10.809523809523808,7.454545454545455
736.0,15.739999999999997,16.898809523809533,10.809523809523808,7.454545454545455
737.0,15.739999999999997,16.898809523809533,10.809523809523808,7.454545454545455
738.0,15.739999999999997,16.898809523809533,10.809523809523808,7.454545454545455
739.0,15.630000000000003,16.76785714285714,10.809523809523808,7.454545454545455
740.0,15.630000000000003,16.76785714285714,10.809523809523808,7.454545454545455
741.0,15.630000000000003,16.76785714285714,10.809523809523808,7.454545454545455
742.0,15.630000000000003,16.76785714285714,10.809523809523808,7.454545454545455
743.0,15.630000000000003,16.76785714285714,10.809523809523808,7.454545454545455
744.0,15.579999999999997,16.70833333333334,10.809523809523808,7.454545454545455
745.0,15.579999999999997,16.70833333333334,10.809523809523808,7.454545454545455
746.0,15.579999999999997,16.70833333333334,10.809523809523808,7.454545454545455
747.0,15.579999999999997,16.70833333333334,10.809523809523808,7.454545454545455
748.0,15.579999999999997,16.70833333333334,10.809523809523808,7.454545454545455
749.0,15.579999999999997,16.70833333333334,10.809523809523808,7.454545454545455
750.0,15.389999999999999,16.642857142857142,9.523809523809524,7.454545454545455
751.0,15.389999999999999,16.642857142857142,9.523809523809524,7.454545454545455
752.0,15.319999999999999,16.5595238095238,9.523809523809524,7.454545454545455
753.0,15.319999999999999,16.5595238095238,9.523809523809524,7.454545454545455
754.0,15.319999999999999,16.5595238095238,9.523809523809524,7.454545454545455
755.0,15.25,16.476190476190467,9.523809523809524,7.454545454545455
756.0,15.25,16.476190476190467,9.523809523809524,7.454545454545455
757.0,15.25,16.476190476190467,9.523809523809524,7.454545454545455
758.0,15.25,16.476190476190467,9.523809523809524,7.454545454545455
759.0,15.25,16.476190476190467,9.523809523809524,7.454545454545455
760.0,15.25,16.476190476190467,9.523809523809524,7.454545454545455
761.0,15.25,16.476190476190467,9.523809523809524,7.454545454545455
762.0,15.25,16.476190476190467,9.523809523809524,7.454545454545455
763.0,15.25,16.476190476190467,9.523809523809524,7.454545454545455
764.0,15.25,16.476190476190467,9.523809523809524,7.454545454545455
765.0,15.25,16.476190476190467,9.523809523809524,7.454545454545455
766.0,15.149999999999995,16.357142857142854,9.523809523809524,7.454545454545455
767.0,15.149999999999995,16.357142857142854,9.523809523809524,7.454545454545455
768.0,15.149999999999995,16.357142857142854,9.523809523809524,7.454545454545455
769.0,15.149999999999995,16.357142857142854,9.523809523809524,7.454545454545455
770.0,15.149999999999995,16.357142857142854,9.523809523809524,7.454545454545455
771.0,15.149999999999995,16.357142857142854,9.523809523809524,7.454545454545455
772.0,15.149999999999995,16.357142857142854,9.523809523809524,7.454545454545455
773.0,15.149999999999995,16.357142857142854,9.523809523809524,7.454545454545455
774.0,15.149999999999995,16.357142857142854,9.523809523809524,7.454545454545455
775.0,15.149999999999995,16.357142857142854,9.523809523809524,7.454545454545455
776.0,15.149999999999995,16.357142857142854,9.523809523809524,7.454545454545455
777.0,15.149999999999995,16.357142857142854,9.523809523809524,7.454545454545455
778.0,14.99,16.166666666666668,9.523809523809524,7.454545454545455
779.0,14.99,16.166666666666668,9.523809523809524,7.454545454545455
780.0,14.99,16.166666666666668,9.523809523809524,7.454545454545455
781.0,15.99,17.166666666666657,10.523809523809522,8.454545454545455
782.0,15.99,17.166666666666657,10.523809523809522,8.454545454545455
783.0,15.99,17.166666666666657,10.523809523809522,8.454545454545455
784.0,15.99,17.166666666666657,10.523809523809522,8.454545454545455
785.0,15.99,17.166666666666657,10.523809523809522,8.454545454545455
786.0,15.99,17.166666666666657,10.523809523809522,8.454545454545455
787.0,15.99,17.166666666666657,10.523809523809522,8.454545454545455
788.0,15.99,17.166666666666657,10.523809523809522,8.454545454545455
789.0,15.964999999999996,17.136904761904752,10.523809523809522,8.454545454545455
790.0,15.964999999999996,17.136904761904752,10.523809523809522,8.454545454545455
791.0,15.964999999999996,17.136904761904752,10.523809523809522,8.454545454545455
792.0,15.964999999999996,17.136904761904752,10.523809523809522,8.454545454545455
793.0,15.900000000000004,17.05952380952381,10.523809523809522,8.454545454545455
794.0,15.900000000000004,17.05952380952381,10.523809523809522,8.454545454545455
795.0,15.900000000000004,17.05952380952381,10.523809523809522,8.454545454545455
796.0,15.900000000000004,17.05952380952381,10.523809523809522,8.454545454545455
797.0,15.900000000000004,17.05952380952381,10.523809523809522,8.454545454545455
798.0,15.900000000000004,17.05952380952381,10.523809523809522,8.454545454545455
799.0,15.900000000000004,17.05952380952381,10.523809523809522,8.454545454545455
800.0,15.900000000000004,17.05952380952381,10.523809523809522,8.454545454545455
801.0,15.900000000000004,17.05952380952381,10.523809523809522,8.454545454545455
802.0,15.900000000000004,17.05952380952381,10.523809523809522,8.454545454545455
803.0,15.815000000000001,17.05952380952381,9.714285714285715,8.454545454545455
804.0,15.815000000000001,17.05952380952381,9.714285714285715,8.454545454545455
805.0,15.815000000000001,17.05952380952381,9.714285714285715,8.454545454545455
806.0,15.815000000000001,17.05952380952381,9.714285714285715,8.454545454545455
807.0,15.815000000000001,17.05952380952381,9.714285714285715,8.454545454545455
808.0,15.815000000000001,17.05952380952381,9.714285714285715,8.454545454545455
809.0,15.815000000000001,17.05952380952381,9.714285714285715,8.454545454545455
810.0,15.815000000000001,17.05952380952381,9.714285714285715,8.454545454545455
811.0,15.815000000000001,17.05952380952381,9.714285714285715,8.454545454545455
812.0,15.815000000000001,17.05952380952381,9.714285714285715,8.454545454545455
813.0,15.815000000000001,17.05952380952381,9.714285714285715,8.454545454545455
814.0,15.700000000000001,16.922619047619044,9.714285714285715,8.454545454545455
815.0,15.700000000000001,16.922619047619044,9.714285714285715,8.454545454545455
816.0,15.700000000000001,16.922619047619044,9.714285714285715,8.454545454545455
817.0,15.620000000000005,16.827380952380956,9.714285714285715,8.454545454545455
818.0,15.620000000000005,16.827380952380956,9.714285714285715,8.454545454545455
819.0,15.55000000000001,16.744047619047613,9.714285714285715,8.454545454545455
820.0,15.440000000000001,16.613095238095223,9.714285714285715,8.454545454545455
821.0,15.440000000000001,16.613095238095223,9.714285714285715,8.454545454545455
822.0,15.440000000000001,16.613095238095223,9.714285714285715,8.454545454545455
823.0,15.440000000000001,16.613095238095223,9.714285714285715,8.454545454545455
824.0,15.440000000000001,16.613095238095223,9.714285714285715,8.454545454545455
825.0,15.440000000000001,16.613095238095223,9.714285714285715,8.454545454545455
826.0,15.440000000000001,16.613095238095223,9.714285714285715,8.454545454545455
827.0,15.440000000000001,16.613095238095223,9.714285714285715,8.454545454545455
828.0,15.374999999999998,16.535714285714278,9.714285714285715,8.454545454545455
829.0,15.374999999999998,16.535714285714278,9.714285714285715,8.454545454545455
830.0,15.374999999999998,16.535714285714278,9.714285714285715,8.454545454545455
831.0,15.374999999999998,16.535714285714278,9.714285714285715,8.454545454545455
832.0,15.374999999999998,16.535714285714278,9.714285714285715,8.454545454545455
833.0,16.329999999999995,17.482142857142854,10.714285714285715,9.454545454545455
834.0,16.329999999999995,17.482142857142854,10.714285714285715,9.454545454545455
835.0,16.329999999999995,17.482142857142854,10.714285714285715,9.454545454545455
836.0,16.329999999999995,17.482142857142854,10.714285714285715,9.454545454545455
837.0,16.329999999999995,17.482142857142854,10.714285714285715,9.454545454545455
838.0,16.329999999999995,17.482142857142854,10.714285714285715,9.454545454545455
839.0,16.329999999999995,17.482142857142854,10.714285714285715,9.454545454545455
840.0,16.329999999999995,17.482142857142854,10.714285714285715,9.454545454545455
841.0,16.329999999999995,17.482142857142854,10.714285714285715,9.454545454545455
842.0,16.289999999999996,17.4345238095238,10.714285714285715,9.454545454545455
843.0,16.289999999999996,17.4345238095238,10.714285714285715,9.454545454545455
844.0,16.289999999999996,17.4345238095238,10.714285714285715,9.454545454545455
845.0,16.289999999999996,17.4345238095238,10.714285714285715,9.454545454545455
846.0,16.289999999999996,17.4345238095238,10.714285714285715,9.454545454545455
847.0,16.289999999999996,17.4345238095238,10.714285714285715,9.454545454545455
848.0,16.289999999999996,17.4345238095238,10.714285714285715,9.454545454545455
849.0,16.289999999999996,17.4345238095238,10.714285714285715,9.454545454545455
850.0,16.240000000000002,17.37500000000001,10.714285714285715,9.454545454545455
851.0,16.240000000000002,17.37500000000001,10.714285714285715,9.454545454545455
852.0,16.240000000000002,17.37500000000001,10.714285714285715,9.454545454545455
853.0,16.240000000000002,17.37500000000001,10.714285714285715,9.454545454545455
854.0,16.240000000000002,17.37500000000001,10.714285714285715,9.454545454545455
855.0,16.240000000000002,17.37500000000001,10.714285714285715,9.454545454545455
856.0,16.174999999999997,17.29761904761904,10.714285714285715,9.454545454545455
857.0,16.174999999999997,17.29761904761904,10.714285714285715,9.454545454545455
858.0,16.174999999999997,17.29761904761904,10.714285714285715,9.454545454545455
859.0,16.174999999999997,17.29761904761904,10.714285714285715,9.454545454545455
860.0,16.174999999999997,17.29761904761904,10.714285714285715,9.454545454545455
861.0,16.174999999999997,17.29761904761904,10.714285714285715,9.454545454545455
862.0,16.174999999999997,17.29761904761904,10.714285714285715,9.454545454545455
863.0,16.174999999999997,17.29761904761904,10.714285714285715,9.454545454545455
864.0,16.174999999999997,17.29761904761904,10.714285714285715,9.454545454545455
865.0,16.174999999999997,17.29761904761904,10.714285714285715,9.454545454545455
866.0,16.000000000000007,17.08928571428572,10.714285714285715,9.454545454545455
867.0,16.000000000000007,17.08928571428572,10.714285714285715,9.454545454545455
868.0,16.000000000000007,17.08928571428572,10.714285714285715,9.454545454545455
869.0,16.000000000000007,17.08928571428572,10.714285714285715,9.454545454545455
870.0,16.000000000000007,17.08928571428572,10.714285714285715,9.454545454545455
871.0,15.865000000000006,16.928571428571434,10.714285714285715,9.454545454545455
872.0,15.865000000000006,16.928571428571434,10.714285714285715,9.454545454545455
873.0,15.865000000000006,16.928571428571434,10.714285714285715,9.454545454545455
874.0,15.865000000000006,16.928571428571434,10.714285714285715,9.454545454545455
875.0,15.645000000000003,16.666666666666675,10.714285714285715,9.454545454545455
876.0,15.580000000000004,16.58928571428571,10.714285714285715,9.454545454545455
877.0,15.580000000000004,16.58928571428571,10.714285714285715,9.454545454545455
878.0,15.580000000000004,16.58928571428571,10.714285714285715,9.454545454545455
879.0,15.490000000000004,16.482142857142854,10.714285714285715,9.454545454545455
880.0,15.490000000000004,16.482142857142854,10.714285714285715,9.454545454545455
881.0,15.414999999999997,16.39285714285714,10.714285714285715,9.454545454545455
882.0,15.414999999999997,16.39285714285714,10.714285714285715,9.454545454545455
883.0,15.32,16.39285714285714,10.714285714285715,7.7272727272727275
884.0,15.32,16.39285714285714,10.714285714285715,7.7272727272727275
885.0,16.11500000000001,17.309523809523817,10.950000000000001,8.0
886.0,16.11500000000001,17.309523809523817,10.950000000000001,8.0
887.0,16.11500000000001,17.309523809523817,10.950000000000001,8.0
888.0,16.040000000000003,17.220238095238095,10.950000000000001,8.0
889.0,16.040000000000003,17.220238095238095,10.950000000000001,8.0
890.0,15.965,17.130952380952387,10.950000000000001,8.0
891.0,15.965,17.130952380952387,10.950000000000001,8.0
892.0,15.965,17.130952380952387,10.950000000000001,8.0
893.0,15.965,17.130952380952387,10.950000000000001,8.0
894.0,15.965,17.130952380952387,10.950000000000001,8.0
895.0,15.965,17.130952380952387,10.950000000000001,8.0
896.0,15.965,17.130952380952387,10.950000000000001,8.0
897.0,15.965,17.130952380952387,10.950000000000001,8.0
898.0,15.829999999999997,16.97023809523809,10.950000000000001,8.0
899.0,15.719999999999995,16.97023809523809,9.849999999999998,8.0
900.0,15.719999999999995,16.97023809523809,9.849999999999998,8.0
901.0,15.565000000000005,16.78571428571429,9.849999999999998,8.0
902.0,15.565000000000005,16.78571428571429,9.849999999999998,8.0
903.0,15.375000000000007,16.672619047619055,9.849999999999998,6.416666666666667
904.0,15.375000000000007,16.672619047619055,9.849999999999998,6.416666666666667
905.0,15.375000000000007,16.672619047619055,9.849999999999998,6.416666666666667
906.0,15.375000000000007,16.672619047619055,9.849999999999998,6.416666666666667
907.0,15.375000000000007,16.672619047619055,9.849999999999998,6.416666666666667
908.0,15.375000000000007,16.672619047619055,9.849999999999998,6.416666666666667
909.0,15.26999999999999,16.547619047619047,9.849999999999998,6.416666666666667
910.0,15.26999999999999,16.547619047619047,9.849999999999998,6.416666666666667
911.0,15.26999999999999,16.547619047619047,9.849999999999998,6.416666666666667
912.0,15.26999999999999,16.547619047619047,9.849999999999998,6.416666666666667
913.0,15.26999999999999,16.547619047619047,9.849999999999998,6.416666666666667
914.0,15.26999999999999,16.547619047619047,9.849999999999998,6.416666666666667
915.0,15.26999999999999,16.547619047619047,9.849999999999998,6.416666666666667
916.0,15.26999999999999,16.547619047619047,9.849999999999998,6.416666666666667
917.0,15.124999999999996,16.374999999999996,9.849999999999998,6.416666666666667
918.0,15.124999999999996,16.374999999999996,9.849999999999998,6.416666666666667
919.0,15.124999999999996,16.374999999999996,9.849999999999998,6.416666666666667
920.0,15.124999999999996,16.374999999999996,9.849999999999998,6.416666666666667
921.0,15.124999999999996,16.374999999999996,9.849999999999998,6.416666666666667
922.0,15.124999999999996,16.374999999999996,9.849999999999998,6.416666666666667
923.0,15.124999999999996,16.374999999999996,9.849999999999998,6.416666666666667
924.0,15.124999999999996,16.374999999999996,9.849999999999998,6.416666666666667
925.0,15.124999999999996,16.374999999999996,9.849999999999998,6.416666666666667
926.0,15.019999999999996,16.374999999999996,9.263157894736842,5.923076923076923
927.0,15.019999999999996,16.374999999999996,9.263157894736842,5.923076923076923
928.0,15.019999999999996,16.374999999999996,9.263157894736842,5.923076923076923
929.0,15.019999999999996,16.374999999999996,9.263157894736842,5.923076923076923
930.0,15.019999999999996,16.374999999999996,9.263157894736842,5.923076923076923
931.0,15.019999999999996,16.374999999999996,9.263157894736842,5.923076923076923
932.0,15.019999999999996,16.374999999999996,9.263157894736842,5.923076923076923
933.0,15.019999999999996,16.374999999999996,9.263157894736842,5.923076923076923
934.0,14.900000000000002,16.23214285714286,9.263157894736842,5.923076923076923
935.0,14.900000000000002,16.23214285714286,9.263157894736842,5.923076923076923
936.0,14.799999999999995,16.23214285714286,8.210526315789473,5.923076923076923
937.0,15.799999999999995,17.23214285714287,9.210526315789473,6.923076923076923
938.0,15.799999999999995,17.23214285714287,9.210526315789473,6.923076923076923
939.0,15.799999999999995,17.23214285714287,9.210526315789473,6.923076923076923
940.0,15.799999999999995,17.23214285714287,9.210526315789473,6.923076923076923
941.0,15.799999999999995,17.23214285714287,9.210526315789473,6.923076923076923
942.0,15.799999999999995,17.23214285714287,9.210526315789473,6.923076923076923
943.0,15.510000000000002,16.88690476190477,9.210526315789473,6.923076923076923
944.0,15.510000000000002,16.88690476190477,9.210526315789473,6.923076923076923
945.0,15.419999999999995,16.779761904761898,9.210526315789473,6.923076923076923
946.0,15.319999999999995,16.660714285714285,9.210526315789473,6.923076923076923
947.0,15.219999999999997,16.54166666666668,9.210526315789473,6.923076923076923
948.0,15.219999999999997,16.54166666666668,9.210526315789473,6.923076923076923
949.0,15.219999999999997,16.54166666666668,9.210526315789473,6.923076923076923
950.0,15.219999999999997,16.54166666666668,9.210526315789473,6.923076923076923
951.0,15.219999999999997,16.54166666666668,9.210526315789473,6.923076923076923
952.0,15.219999999999997,16.54166666666668,9.210526315789473,6.923076923076923
953.0,15.219999999999997,16.54166666666668,9.210526315789473,6.923076923076923
954.0,15.219999999999997,16.54166666666668,9.210526315789473,6.923076923076923
955.0,15.219999999999997,16.54166666666668,9.210526315789473,6.923076923076923
956.0,15.219999999999997,16.54166666666668,9.210526315789473,6.923076923076923
957.0,15.219999999999997,16.54166666666668,9.210526315789473,6.923076923076923
958.0,15.219999999999997,16.54166666666668,9.210526315789473,6.923076923076923
959.0,15.069999999999999,16.36309523809523,9.210526315789473,6.923076923076923
960.0,15.069999999999999,16.36309523809523,9.210526315789473,6.923076923076923
961.0,15.069999999999999,16.36309523809523,9.210526315789473,6.923076923076923
962.0,15.069999999999999,16.36309523809523,9.210526315789473,6.923076923076923
963.0,15.069999999999999,16.36309523809523,9.210526315789473,6.923076923076923
964.0,15.069999999999999,16.36309523809523,9.210526315789473,6.923076923076923
965.0,15.069999999999999,16.36309523809523,9.210526315789473,6.923076923076923
966.0,15.069999999999999,16.36309523809523,9.210526315789473,6.923076923076923
967.0,15.069999999999999,16.36309523809523,9.210526315789473,6.923076923076923
968.0,15.069999999999999,16.36309523809523,9.210526315789473,6.923076923076923
969.0,15.069999999999999,16.36309523809523,9.210526315789473,6.923076923076923
970.0,15.069999999999999,16.36309523809523,9.210526315789473,6.923076923076923
971.0,15.069999999999999,16.36309523809523,9.210526315789473,6.923076923076923
972.0,14.920000000000005,16.184523809523807,9.210526315789473,6.923076923076923
973.0,14.920000000000005,16.184523809523807,9.210526315789473,6.923076923076923
974.0,14.920000000000005,16.184523809523807,9.210526315789473,6.923076923076923
975.0,14.920000000000005,16.184523809523807,9.210526315789473,6.923076923076923
976.0,14.920000000000005,16.184523809523807,9.210526315789473,6.923076923076923
977.0,14.920000000000005,16.184523809523807,9.210526315789473,6.923076923076923
978.0,14.920000000000005,16.184523809523807,9.210526315789473,6.923076923076923
979.0,14.920000000000005,16.184523809523807,9.210526315789473,6.923076923076923
980.0,14.920000000000005,16.184523809523807,9.210526315789473,6.923076923076923
981.0,14.920000000000005,16.184523809523807,9.210526315789473,6.923076923076923
982.0,14.920000000000005,16.184523809523807,9.210526315789473,6.923076923076923
983.0,14.920000000000005,16.184523809523807,9.210526315789473,6.923076923076923
984.0,14.920000000000005,16.184523809523807,9.210526315789473,6.923076923076923
985.0,14.920000000000005,16.184523809523807,9.210526315789473,6.923076923076923
986.0,14.920000000000005,16.184523809523807,9.210526315789473,6.923076923076923
987.0,14.920000000000005,16.184523809523807,9.210526315789473,6.923076923076923
988.0,14.725,16.184523809523807,7.555555555555555,6.428571428571428
989.0,15.725,17.184523809523817,8.555555555555555,7.428571428571428
990.0,15.725,17.184523809523817,8.555555555555555,7.428571428571428
991.0,15.635,17.07738095238095,8.555555555555555,7.428571428571428
992.0,15.515000000000008,17.07738095238095,7.222222222222221,7.428571428571428
993.0,15.409999999999995,16.952380952380953,7.222222222222221,7.428571428571428
994.0,15.409999999999995,16.952380952380953,7.222222222222221,7.428571428571428
995.0,15.315000000000008,16.839285714285708,7.222222222222221,7.428571428571428
996.0,15.315000000000008,16.839285714285708,7.222222222222221,7.428571428571428
997.0,15.315000000000008,16.839285714285708,7.222222222222221,7.428571428571428
998.0,15.315000000000008,16.839285714285708,7.222222222222221,7.428571428571428
999.0,15.230000000000008,16.738095238095244,7.222222222222221,7.428571428571428
1000.0,15.230000000000008,16.738095238095244,7.222222222222221,7.428571428571428
1001.0,15.230000000000008,16.738095238095244,7.222222222222221,7.428571428571428
1002.0,15.230000000000008,16.738095238095244,7.222222222222221,7.428571428571428
1003.0,15.230000000000008,16.738095238095244,7.222222222222221,7.428571428571428
1004.0,15.230000000000008,16.738095238095244,7.222222222222221,7.428571428571428
1005.0,15.230000000000008,16.738095238095244,7.222222222222221,7.428571428571428
1006.0,15.230000000000008,16.738095238095244,7.222222222222221,7.428571428571428
1007.0,15.230000000000008,16.738095238095244,7.222222222222221,7.428571428571428
1008.0,15.230000000000008,16.738095238095244,7.222222222222221,7.428571428571428
1009.0,15.230000000000008,16.738095238095244,7.222222222222221,7.428571428571428
1010.0,15.230000000000008,16.738095238095244,7.222222222222221,7.428571428571428
1011.0,15.230000000000008,16.738095238095244,7.222222222222221,7.428571428571428
1012.0,15.230000000000008,16.738095238095244,7.222222222222221,7.428571428571428
1013.0,15.125000000000002,16.613095238095227,7.222222222222221,7.428571428571428
1014.0,15.125000000000002,16.613095238095227,7.222222222222221,7.428571428571428
1015.0,15.125000000000002,16.613095238095227,7.222222222222221,7.428571428571428
1016.0,15.125000000000002,16.613095238095227,7.222222222222221,7.428571428571428
1017.0,15.125000000000002,16.613095238095227,7.222222222222221,7.428571428571428
1018.0,15.065000000000005,16.54166666666667,7.222222222222221,7.428571428571428
1019.0,15.065000000000005,16.54166666666667,7.222222222222221,7.428571428571428
1020.0,15.065000000000005,16.54166666666667,7.222222222222221,7.428571428571428
1021.0,15.065000000000005,16.54166666666667,7.222222222222221,7.428571428571428
1022.0,15.065000000000005,16.54166666666667,7.222222222222221,7.428571428571428
1023.0,15.065000000000005,16.54166666666667,7.222222222222221,7.428571428571428
1024.0,15.065000000000005,16.54166666666667,7.222222222222221,7.428571428571428
1025.0,15.065000000000005,16.54166666666667,7.222222222222221,7.428571428571428
1026.0,15.065000000000005,16.54166666666667,7.222222222222221,7.428571428571428
1027.0,15.065000000000005,16.54166666666667,7.222222222222221,7.428571428571428
1028.0,15.065000000000005,16.54166666666667,7.222222222222221,7.428571428571428
1029.0,15.065000000000005,16.54166666666667,7.222222222222221,7.428571428571428
1030.0,15.065000000000005,16.54166666666667,7.222222222222221,7.428571428571428
1031.0,15.065000000000005,16.54166666666667,7.222222222222221,7.428571428571428
1032.0,15.065000000000005,16.54166666666667,7.222222222222221,7.428571428571428
1033.0,15.065000000000005,16.54166666666667,7.222222222222221,7.428571428571428
1034.0,15.065000000000005,16.54166666666667,7.222222222222221,7.428571428571428
1035.0,15.065000000000005,16.54166666666667,7.222222222222221,7.428571428571428
1036.0,15.065000000000005,16.54166666666667,7.222222222222221,7.428571428571428
1037.0,15.065000000000005,16.54166666666667,7.222222222222221,7.428571428571428
1038.0,15.065000000000005,16.54166666666667,7.222222222222221,7.428571428571428
1039.0,15.065000000000005,16.54166666666667,7.222222222222221,7.428571428571428
1040.0,15.065000000000005,16.54166666666667,7.222222222222221,7.428571428571428
1041.0,16.065,17.541666666666664,8.222222222222221,8.428571428571429
1042.0,16.065,17.541666666666664,8.222222222222221,8.428571428571429
1043.0,16.065,17.541666666666664,8.222222222222221,8.428571428571429
1044.0,16.065,17.541666666666664,8.222222222222221,8.428571428571429
1045.0,16.065,17.541666666666664,8.222222222222221,8.428571428571429
1046.0,16.065,17.541666666666664,8.222222222222221,8.428571428571429
1047.0,16.065,17.541666666666664,8.222222222222221,8.428571428571429
1048.0,16.065,17.541666666666664,8.222222222222221,8.428571428571429
1049.0,16.065,17.541666666666664,8.222222222222221,8.428571428571429
1050.0,16.065,17.541666666666664,8.222222222222221,8.428571428571429
1051.0,16.065,17.541666666666664,8.222222222222221,8.428571428571429
1052.0,16.065,17.541666666666664,8.222222222222221,8.428571428571429
1053.0,16.065,17.541666666666664,8.222222222222221,8.428571428571429
1054.0,16.065,17.541666666666664,8.222222222222221,8.428571428571429
1055.0,16.065,17.541666666666664,8.222222222222221,8.428571428571429
1056.0,16.065,17.541666666666664,8.222222222222221,8.428571428571429
1057.0,16.065,17.541666666666664,8.222222222222221,8.428571428571429
1058.0,16.065,17.541666666666664,8.222222222222221,8.428571428571429
1059.0,16.065,17.541666666666664,8.222222222222221,8.428571428571429
1060.0,16.065,17.541666666666664,8.222222222222221,8.428571428571429
1061.0,16.065,17.541666666666664,8.222222222222221,8.428571428571429
1062.0,16.065,17.541666666666664,8.222222222222221,8.428571428571429
1063.0,16.065,17.541666666666664,8.222222222222221,8.428571428571429
1064.0,15.969999999999997,17.42857142857142,8.222222222222221,8.428571428571429
1065.0,15.969999999999997,17.42857142857142,8.222222222222221,8.428571428571429
1066.0,15.969999999999997,17.42857142857142,8.222222222222221,8.428571428571429
1067.0,15.969999999999997,17.42857142857142,8.222222222222221,8.428571428571429
1068.0,15.969999999999997,17.42857142857142,8.222222222222221,8.428571428571429
1069.0,15.969999999999997,17.42857142857142,8.222222222222221,8.428571428571429
1070.0,15.900000000000002,17.345238095238095,8.222222222222221,8.428571428571429
1071.0,15.900000000000002,17.345238095238095,8.222222222222221,8.428571428571429
1072.0,15.900000000000002,17.345238095238095,8.222222222222221,8.428571428571429
1073.0,15.900000000000002,17.345238095238095,8.222222222222221,8.428571428571429
1074.0,15.900000000000002,17.345238095238095,8.222222222222221,8.428571428571429
1075.0,15.900000000000002,17.345238095238095,8.222222222222221,8.428571428571429
1076.0,15.900000000000002,17.345238095238095,8.222222222222221,8.428571428571429
1077.0,15.804999999999994,17.232142857142858,8.222222222222221,8.428571428571429
1078.0,15.804999999999994,17.232142857142858,8.222222222222221,8.428571428571429
1079.0,15.804999999999994,17.232142857142858,8.222222222222221,8.428571428571429
1080.0,15.804999999999994,17.232142857142858,8.222222222222221,8.428571428571429
1081.0,15.804999999999994,17.232142857142858,8.222222222222221,8.428571428571429
1082.0,15.804999999999994,17.232142857142858,8.222222222222221,8.428571428571429
1083.0,15.804999999999994,17.232142857142858,8.222222222222221,8.428571428571429
1084.0,15.804999999999994,17.232142857142858,8.222222222222221,8.428571428571429
1085.0,15.804999999999994,17.232142857142858,8.222222222222221,8.428571428571429
1086.0,15.804999999999994,17.232142857142858,8.222222222222221,8.428571428571429
1087.0,15.804999999999994,17.232142857142858,8.222222222222221,8.428571428571429
1088.0,15.804999999999994,17.232142857142858,8.222222222222221,8.428571428571429
1089.0,15.804999999999994,17.232142857142858,8.222222222222221,8.428571428571429
1090.0,15.804999999999994,17.232142857142858,8.222222222222221,8.428571428571429
1091.0,15.804999999999994,17.232142857142858,8.222222222222221,8.428571428571429
1092.0,15.804999999999994,17.232142857142858,8.222222222222221,8.428571428571429
