"tick","perc BEV new","perc BEV occ","perc BEV lease"
1.0,1.0,2.5,0.0
2.0,1.0,2.5,0.0
3.0,1.0,2.5,0.0
4.0,1.0,2.5,0.0
5.0,1.0,2.5,0.0
6.0,1.0,2.5,0.0
7.0,1.0,2.5,0.0
8.0,1.0,2.5,0.0
9.0,1.0,2.5,0.0
10.0,1.0,2.5,0.0
11.0,1.0,2.5,0.0
12.0,1.0,2.5,0.0
13.0,1.0,2.5,0.0
14.0,1.0,2.5,0.0
15.0,1.0,2.5,0.0
16.0,1.0,2.5,0.0
17.0,1.0,2.5,0.0
18.0,1.0,2.5,0.0
19.0,1.0,2.5,0.0
20.0,1.0,2.5,0.0
21.0,1.0,2.5,0.0
22.0,1.0,2.5,0.0
23.0,1.0,2.5,0.0
24.0,1.0,2.5,0.0
25.0,1.0,2.5,0.0
26.0,1.0,2.5,0.0
27.0,1.0,2.5,0.0
28.0,1.0,2.5,0.0
29.0,1.0,2.5,0.0
30.0,1.0,2.5,0.0
31.0,1.0,2.5,0.0
32.0,1.0,2.5,0.0
33.0,1.0,2.5,0.0
34.0,1.0,2.5,0.0
35.0,1.0,2.5,0.0
36.0,1.0,2.5,0.0
37.0,1.0,2.5,0.0
38.0,1.0,2.5,0.0
39.0,1.0,2.5,0.0
40.0,1.0,2.5,0.0
41.0,1.0,2.5,0.0
42.0,1.0,2.5,0.0
43.0,1.0,2.5,0.0
44.0,1.0,2.5,0.0
45.0,1.0,2.5,0.0
46.0,1.0,2.5,0.0
47.0,1.0,2.5,0.0
48.0,1.0,2.5,0.0
49.0,1.0,2.5,0.0
50.0,1.0,2.5,0.0
51.0,1.0,2.5,0.0
52.0,1.0,2.5,0.0
53.0,1.0,2.5,0.0
54.0,1.0,2.5,0.0
55.0,1.0,2.5,0.0
56.0,1.0,2.5,0.0
57.0,1.0,2.5,0.0
58.0,1.0,3.0,0.0
59.0,1.0,3.0,0.0
60.0,1.0,3.0,0.0
61.0,1.0,3.0,0.0
62.0,1.0,3.5000000000000004,0.0
63.0,1.0,3.5000000000000004,0.0
64.0,1.0,3.5000000000000004,0.0
65.0,1.0,3.5000000000000004,0.0
66.0,1.0,3.5000000000000004,0.0
67.0,1.0,3.5000000000000004,0.0
68.0,1.0,3.5000000000000004,0.0
69.0,1.0,3.5000000000000004,0.0
70.0,1.0,3.5000000000000004,0.0
71.0,1.0,3.5000000000000004,0.0
72.0,1.0,3.5000000000000004,0.0
73.0,1.0,3.5000000000000004,0.0
74.0,1.0,3.5000000000000004,0.0
75.0,1.0,4.0,0.0
76.0,1.0,4.0,0.0
77.0,1.0,4.0,0.0
78.0,1.0,4.0,0.0
79.0,1.0,4.0,0.0
80.0,1.0,4.0,0.0
81.0,1.0,4.0,0.0
82.0,1.0,4.0,0.0
83.0,1.0,4.0,0.0
84.0,1.0,4.0,0.0
85.0,1.0,4.0,0.0
86.0,1.0,4.0,0.0
87.0,1.0,4.0,0.0
88.0,1.0,4.0,0.0
89.0,1.0,4.0,0.0
90.0,1.0,4.0,0.0
91.0,1.0,4.0,0.0
92.0,1.0,4.0,0.0
93.0,1.0,4.0,0.0
94.0,1.0,4.0,0.0
95.0,1.0,4.0,0.0
96.0,1.0,4.0,0.0
97.0,1.0,4.0,0.0
98.0,1.0,4.0,0.0
99.0,1.0,4.0,0.0
100.0,1.0,4.0,0.0
101.0,1.0,4.0,0.0
102.0,1.0,4.0,0.0
103.0,1.0,4.0,0.0
104.0,1.0,4.0,0.0
105.0,1.0,4.0,0.0
106.0,1.0,4.0,0.0
107.0,1.0,4.0,0.0
108.0,1.0,4.0,0.0
109.0,1.0,4.0,0.0
110.0,1.0,4.0,0.0
111.0,1.0,4.0,0.0
112.0,1.0,4.0,0.0
113.0,1.0,4.0,0.0
114.0,1.0,4.0,0.0
115.0,1.0,4.0,0.0
116.0,1.0,4.0,0.0
117.0,1.0,4.0,0.0
118.0,1.0,4.0,0.0
119.0,1.0,4.0,0.0
120.0,1.0,4.0,0.0
121.0,1.0,4.0,0.0
122.0,1.0,4.0,0.0
123.0,1.0,4.0,0.0
124.0,1.0,4.0,0.0
125.0,1.0,4.0,0.0
126.0,1.0,4.0,0.0
127.0,1.0,4.0,0.0
128.0,1.0,4.0,0.0
129.0,1.0,4.0,0.0
130.0,1.0,4.0,0.0
131.0,1.0,4.0,0.0
132.0,1.0,4.0,0.0
133.0,1.0,4.5,0.0
134.0,1.0,4.5,0.0
135.0,1.0,4.5,0.0
136.0,1.0,4.5,0.0
137.0,1.0,4.5,0.0
138.0,1.0,4.5,0.0
139.0,1.0,4.5,0.0
140.0,1.0,4.5,0.0
141.0,1.0,4.5,0.0
142.0,1.0,4.5,0.0
143.0,1.0,4.5,0.0
144.0,1.0,4.5,0.0
145.0,1.0,4.5,0.0
146.0,1.0,4.5,0.0
147.0,1.0,4.5,0.0
148.0,1.0,4.5,0.0
149.0,1.0,4.5,0.0
150.0,1.0,4.5,0.0
151.0,1.0,4.5,0.0
152.0,1.0,4.5,0.0
153.0,1.0,4.5,0.0
154.0,1.0,4.5,0.0
155.0,1.0,4.5,0.0
156.0,1.0,4.5,0.0
157.0,1.0,4.5,0.0
158.0,1.0,4.5,0.0
159.0,1.0,4.5,0.0
160.0,1.0,4.5,0.0
161.0,1.0,4.5,0.0
162.0,1.0,4.5,0.0
163.0,1.0,4.5,0.0
164.0,1.0,4.5,0.0
165.0,1.0,4.5,0.0
166.0,1.0,4.5,0.0
167.0,1.0,4.5,0.0
168.0,1.0,4.5,0.0
169.0,1.0,4.5,0.0
170.0,1.0,4.5,0.0
171.0,1.0,4.5,0.0
172.0,1.0,4.5,0.0
173.0,1.0,5.0,0.0
174.0,1.0,5.0,0.0
175.0,1.0,5.0,0.0
176.0,1.0,5.0,0.0
177.0,1.0,5.5,0.0
178.0,1.0,6.0,0.0
179.0,1.0,6.0,0.0
180.0,1.0,6.0,0.0
181.0,1.0,6.0,0.0
182.0,1.0,6.0,0.0
183.0,1.0,6.0,0.0
184.0,1.0,6.0,0.0
185.0,1.0,6.0,0.0
186.0,1.0,6.0,0.0
187.0,1.0,6.0,0.0
188.0,1.0,6.0,0.0
189.0,1.0,6.0,0.0
190.0,1.0,6.5,0.0
191.0,1.0,6.5,0.0
192.0,1.0,6.5,0.0
193.0,1.0,6.5,0.0
194.0,1.0,6.5,0.0
195.0,1.0,6.5,0.0
196.0,1.0,6.5,0.0
197.0,1.0,6.5,0.0
198.0,1.0,6.5,0.0
199.0,1.0,6.5,0.0
200.0,1.0,6.5,0.0
201.0,1.0,6.5,0.0
202.0,1.0,6.5,0.0
203.0,1.0,6.5,0.0
204.0,1.0,7.000000000000001,0.0
205.0,1.0,7.000000000000001,0.0
206.0,1.0,7.000000000000001,0.0
207.0,1.0,7.5,0.0
208.0,1.0,7.5,0.0
209.0,1.0,7.5,0.0
210.0,1.0,7.5,0.0
211.0,1.0,7.5,0.0
212.0,1.0,8.0,0.0
213.0,1.0,8.0,0.0
214.0,1.0,8.5,0.0
215.0,1.0,8.5,0.0
216.0,1.0,8.5,0.0
217.0,1.0,8.5,0.0
218.0,1.0,8.5,0.0
219.0,1.0,8.5,0.0
220.0,1.0,8.5,0.0
221.0,1.0,8.5,0.0
222.0,1.0,8.5,0.5
223.0,1.0,8.5,0.5
224.0,1.0,8.5,0.5
225.0,1.0,9.0,0.5
226.0,1.0,9.0,0.5
227.0,1.0,9.0,0.5
228.0,1.0,9.0,0.5
229.0,1.0,9.0,0.5
230.0,1.0,9.0,0.5
231.0,1.0,9.0,0.5
232.0,1.0,9.0,0.5
233.0,1.0,9.0,0.5
234.0,1.0,9.0,0.5
235.0,1.0,9.5,0.5
236.0,1.0,9.5,0.5
237.0,1.0,9.5,0.5
238.0,1.0,9.5,0.5
239.0,1.0,9.5,0.5
240.0,1.0,9.5,0.5
241.0,1.0,9.5,0.5
242.0,1.0,9.5,0.5
243.0,1.0,10.0,0.5
244.0,1.0,10.0,0.5
245.0,1.0,10.0,0.5
246.0,1.0,10.0,0.5
247.0,1.0,10.5,0.5
248.0,1.0,10.5,0.5
249.0,1.0,10.5,0.5
250.0,1.0,10.5,0.5
251.0,1.0,10.5,0.5
252.0,1.0,10.5,0.5
253.0,1.0,10.5,0.5
254.0,1.0,11.0,0.5
255.0,1.0,11.0,0.5
256.0,1.0,11.0,0.5
257.0,1.0,11.0,0.5
258.0,1.0,11.0,0.5
259.0,1.0,11.0,0.5
260.0,1.0,11.0,0.5
261.0,1.0,13.5,0.5
262.0,1.0,13.5,0.5
263.0,1.0,13.5,0.5
264.0,1.0,13.5,0.5
265.0,1.0,13.5,0.5
266.0,1.0,13.5,0.5
267.0,1.0,14.000000000000002,0.5
268.0,1.0,14.000000000000002,0.5
269.0,1.0,15.0,0.5
270.0,1.0,15.0,0.5
271.0,1.0,15.0,0.5
272.0,1.0,15.0,0.5
273.0,1.0,15.5,0.5
274.0,1.0,15.5,0.5
275.0,1.0,15.5,0.5
276.0,1.0,15.5,0.5
277.0,1.0,15.5,0.5
278.0,1.0,16.0,0.5
279.0,1.0,16.0,0.5
280.0,1.0,16.0,0.5
281.0,1.0,16.0,0.5
282.0,1.0,16.5,0.5
283.0,1.0,16.5,0.5
284.0,1.0,16.5,0.5
285.0,1.0,16.5,0.5
286.0,1.0,16.5,0.5
287.0,1.0,17.0,0.5
288.0,1.0,17.0,0.5
289.0,1.0,17.0,0.5
290.0,1.0,17.5,0.5
291.0,1.0,17.5,0.5
292.0,1.0,17.5,0.5
293.0,1.0,17.5,0.5
294.0,1.0,17.5,0.5
295.0,1.0,17.5,0.5
296.0,1.0,17.5,0.5
297.0,1.0,17.5,0.5
298.0,1.0,17.5,0.5
299.0,1.0,17.5,0.5
300.0,1.0,17.5,0.5
301.0,1.0,17.5,0.5
302.0,1.0,18.0,0.5
303.0,1.0,18.0,0.5
304.0,1.0,18.5,1.0
305.0,1.0,18.5,1.0
306.0,1.0,18.5,1.0
307.0,1.0,18.5,1.0
308.0,1.0,19.0,1.0
309.0,1.0,19.0,1.0
310.0,1.0,19.0,1.0
311.0,1.0,19.0,1.0
312.0,1.0,19.0,1.0
313.0,1.0,20.5,1.0
314.0,1.0,20.5,1.0
315.0,1.0,20.5,1.0
316.0,1.0,20.5,1.0
317.0,1.0,20.5,1.0
318.0,1.0,20.5,1.0
319.0,1.0,20.5,1.0
320.0,1.0,21.0,1.0
321.0,1.0,21.5,1.0
322.0,1.0,21.5,1.0
323.0,1.0,22.0,1.0
324.0,1.0,22.0,1.0
325.0,1.0,22.0,1.0
326.0,1.0,22.0,1.0
327.0,1.0,22.5,1.0
328.0,1.0,22.5,1.0
329.0,1.0,22.5,1.0
330.0,1.0,22.5,1.0
331.0,1.0,22.5,1.0
332.0,1.0,22.5,1.0
333.0,1.0,22.5,1.0
334.0,1.0,23.0,1.0
335.0,1.0,23.0,1.0
336.0,1.0,23.5,1.0
337.0,1.0,23.5,1.0
338.0,1.0,23.5,1.0
339.0,1.0,23.5,1.0
340.0,1.0,23.5,1.0
341.0,1.0,24.0,1.0
342.0,1.0,24.5,1.0
343.0,1.0,24.5,1.0
344.0,1.0,24.5,1.0
345.0,1.0,24.5,1.0
346.0,1.0,25.0,1.0
347.0,1.0,25.0,1.0
348.0,1.0,25.0,1.0
349.0,1.0,25.0,1.0
350.0,1.0,25.5,1.0
351.0,1.0,25.5,1.0
352.0,1.0,25.5,1.0
353.0,1.0,25.5,1.0
354.0,1.0,25.5,1.0
355.0,1.0,25.5,1.0
356.0,1.0,25.5,1.0
357.0,1.0,25.5,1.0
358.0,1.0,25.5,1.0
359.0,1.0,25.5,1.0
360.0,1.0,26.0,1.0
361.0,1.0,26.0,1.0
362.0,1.0,26.0,1.0
363.0,1.0,26.0,1.0
364.0,1.0,26.0,1.0
365.0,1.0,27.0,1.0
366.0,1.0,27.0,1.0
367.0,1.0,27.0,1.0
368.0,1.0,27.0,1.0
369.0,1.0,27.0,1.0
370.0,1.0,27.0,1.0
371.0,1.0,27.0,1.0
372.0,1.0,27.0,1.0
373.0,1.0,27.0,1.0
374.0,1.0,27.0,1.0
375.0,1.0,27.0,1.0
376.0,1.0,27.500000000000004,1.0
377.0,1.0,27.500000000000004,1.0
378.0,1.0,27.500000000000004,1.0
379.0,1.0,27.500000000000004,1.0
380.0,1.0,27.500000000000004,1.0
381.0,1.0,28.000000000000004,1.0
382.0,1.0,28.000000000000004,1.0
383.0,1.0,28.000000000000004,1.0
384.0,1.0,28.000000000000004,1.0
385.0,1.0,28.000000000000004,1.0
386.0,1.0,28.000000000000004,1.0
387.0,1.0,28.000000000000004,1.0
388.0,1.0,28.000000000000004,1.0
389.0,1.0,28.000000000000004,1.0
390.0,1.0,28.000000000000004,1.0
391.0,1.0,28.000000000000004,1.0
392.0,1.0,28.000000000000004,1.0
393.0,1.0,28.000000000000004,1.0
394.0,1.0,28.000000000000004,1.0
395.0,1.0,28.499999999999996,1.0
396.0,1.0,28.999999999999996,1.0
397.0,1.0,29.5,1.0
398.0,1.0,29.5,1.0
399.0,1.0,29.5,1.5
400.0,1.0,29.5,1.5
401.0,1.0,29.5,1.5
402.0,1.0,29.5,1.5
403.0,1.0,30.0,1.5
404.0,1.0,30.0,1.5
405.0,1.0,30.5,1.5
406.0,1.0,30.5,1.5
407.0,1.0,31.5,1.5
408.0,1.0,31.5,1.5
409.0,1.0,31.5,1.5
410.0,1.0,31.5,1.5
411.0,1.0,31.5,1.5
412.0,1.0,31.5,1.5
413.0,1.0,31.5,1.5
414.0,1.0,31.5,1.5
415.0,1.0,31.5,1.5
416.0,1.0,31.5,1.5
417.0,1.0,32.0,2.0
418.0,1.0,32.5,2.0
419.0,1.0,32.5,2.0
420.0,1.0,32.5,2.0
421.0,1.0,33.0,2.0
422.0,1.0,33.0,2.0
423.0,1.0,33.0,2.0
424.0,1.0,33.5,2.0
425.0,1.0,33.5,2.0
426.0,1.0,33.5,2.0
427.0,1.0,34.0,2.0
428.0,1.0,34.0,2.0
429.0,1.0,34.0,2.0
430.0,1.0,34.0,2.0
431.0,1.0,34.5,2.0
432.0,1.0,34.5,2.0
433.0,1.0,34.5,2.0
434.0,1.0,34.5,2.0
435.0,1.0,34.5,2.0
436.0,1.0,35.0,2.0
437.0,1.0,35.0,2.0
438.0,1.0,35.0,2.0
439.0,1.0,35.0,2.0
440.0,1.0,35.0,2.0
441.0,1.0,35.0,2.0
442.0,1.0,35.0,2.0
443.0,1.0,35.0,2.0
444.0,1.0,35.5,2.0
445.0,1.0,35.5,2.0
446.0,1.0,35.5,2.0
447.0,1.0,35.5,2.0
448.0,1.0,35.5,2.0
449.0,1.0,35.5,2.0
450.0,1.0,35.5,2.0
451.0,1.0,35.5,2.0
452.0,1.0,35.5,2.0
453.0,1.0,35.5,2.0
454.0,1.0,35.5,2.0
455.0,1.0,35.5,2.0
456.0,1.0,35.5,2.0
457.0,1.0,35.5,2.0
458.0,1.0,35.5,2.0
459.0,1.0,36.0,2.0
460.0,1.0,36.0,2.0
461.0,1.0,36.5,2.0
462.0,1.0,36.5,2.0
463.0,1.0,36.5,2.0
464.0,1.0,36.5,2.0
465.0,1.0,36.5,2.0
466.0,1.0,36.5,2.0
467.0,1.0,36.5,2.0
468.0,1.0,36.5,2.5
469.0,1.0,37.5,2.5
470.0,1.0,37.5,2.5
471.0,1.0,37.5,2.5
472.0,1.0,37.5,2.5
473.0,1.0,37.5,2.5
474.0,1.0,37.5,2.5
475.0,1.0,38.0,2.5
476.0,1.0,38.0,2.5
477.0,1.0,38.0,2.5
478.0,1.0,38.0,2.5
479.0,1.0,38.0,2.5
480.0,1.0,38.0,2.5
481.0,1.0,38.0,2.5
482.0,1.0,38.0,2.5
483.0,1.0,38.0,2.5
484.0,1.0,38.0,2.5
485.0,1.0,38.0,2.5
486.0,1.0,38.0,2.5
487.0,1.0,38.0,2.5
488.0,1.0,38.0,2.5
489.0,1.0,38.0,2.5
490.0,1.0,38.0,2.5
491.0,1.0,38.0,2.5
492.0,1.0,38.5,2.5
493.0,1.0,38.5,2.5
494.0,1.0,38.5,2.5
495.0,1.0,38.5,2.5
496.0,1.0,38.5,2.5
497.0,1.0,39.0,2.5
498.0,1.0,39.0,2.5
499.0,1.0,39.0,2.5
500.0,1.0,39.0,2.5
501.0,1.0,39.5,2.5
502.0,1.0,39.5,2.5
503.0,1.0,40.0,2.5
504.0,1.0,40.0,2.5
505.0,1.0,40.5,2.5
506.0,1.0,40.5,2.5
507.0,1.0,40.5,2.5
508.0,1.0,40.5,2.5
509.0,1.0,40.5,2.5
510.0,1.0,40.5,2.5
511.0,1.0,40.5,2.5
512.0,1.0,40.5,2.5
513.0,1.0,40.5,2.5
514.0,1.0,40.5,2.5
515.0,1.0,40.5,2.5
516.0,1.0,40.5,2.5
517.0,1.0,40.5,2.5
518.0,1.0,40.5,2.5
519.0,1.0,40.5,2.5
520.0,1.0,40.5,2.5
521.0,1.0,41.0,3.0
522.0,1.0,41.0,3.0
523.0,1.0,41.0,3.0
524.0,1.0,41.0,3.0
525.0,1.0,41.0,3.0
526.0,1.0,41.0,3.0
527.0,1.0,41.5,3.0
528.0,1.0,41.5,3.0
529.0,1.0,41.5,3.0
530.0,1.0,41.5,3.0
531.0,1.0,41.5,3.0
532.0,1.0,41.5,3.0
533.0,1.0,41.5,3.0
534.0,1.0,41.5,3.0
535.0,1.0,41.5,3.0
536.0,1.0,42.0,3.0
537.0,1.0,42.0,3.0
538.0,1.0,42.0,3.0
539.0,1.0,42.0,3.0
540.0,1.0,42.0,3.0
541.0,1.0,42.0,3.0
542.0,1.0,42.0,3.0
543.0,1.0,42.0,3.0
544.0,1.0,42.0,3.0
545.0,1.0,42.0,3.0
546.0,1.0,42.0,3.0
547.0,1.0,42.0,3.0
548.0,1.0,42.0,3.0
549.0,1.0,42.0,3.5000000000000004
550.0,1.0,42.0,3.5000000000000004
551.0,1.0,42.0,3.5000000000000004
552.0,1.0,42.0,3.5000000000000004
553.0,1.0,42.0,3.5000000000000004
554.0,1.0,42.0,3.5000000000000004
555.0,1.0,42.0,3.5000000000000004
556.0,1.0,42.0,3.5000000000000004
557.0,1.0,42.0,3.5000000000000004
558.0,1.0,42.0,3.5000000000000004
559.0,1.0,42.0,3.5000000000000004
560.0,1.0,42.0,3.5000000000000004
561.0,1.0,42.0,3.5000000000000004
562.0,1.0,42.0,3.5000000000000004
563.0,1.0,42.0,3.5000000000000004
564.0,1.0,42.0,3.5000000000000004
565.0,1.0,42.0,3.5000000000000004
566.0,1.0,42.5,3.5000000000000004
567.0,1.0,42.5,3.5000000000000004
568.0,1.0,42.5,3.5000000000000004
569.0,1.0,42.5,3.5000000000000004
570.0,1.0,42.5,3.5000000000000004
571.0,1.0,42.5,3.5000000000000004
572.0,1.0,42.5,3.5000000000000004
573.0,1.0,43.0,3.5000000000000004
574.0,1.0,43.0,3.5000000000000004
575.0,1.0,43.0,3.5000000000000004
576.0,1.0,43.5,3.5000000000000004
577.0,1.0,43.5,3.5000000000000004
578.0,1.0,43.5,3.5000000000000004
579.0,1.0,43.5,3.5000000000000004
580.0,1.0,43.5,3.5000000000000004
581.0,1.0,43.5,3.5000000000000004
582.0,1.0,44.0,3.5000000000000004
583.0,1.0,44.5,3.5000000000000004
584.0,1.0,44.5,3.5000000000000004
585.0,1.0,44.5,3.5000000000000004
586.0,1.0,44.5,3.5000000000000004
587.0,1.0,44.5,3.5000000000000004
588.0,1.0,44.5,3.5000000000000004
589.0,1.0,44.5,3.5000000000000004
590.0,1.0,44.5,3.5000000000000004
591.0,1.0,45.0,3.5000000000000004
592.0,1.0,45.0,3.5000000000000004
593.0,1.0,45.0,3.5000000000000004
594.0,1.0,45.0,3.5000000000000004
595.0,1.0,45.5,3.5000000000000004
596.0,1.0,45.5,3.5000000000000004
597.0,1.0,45.5,3.5000000000000004
598.0,1.0,45.5,3.5000000000000004
599.0,1.0,45.5,3.5000000000000004
600.0,1.0,45.5,3.5000000000000004
601.0,1.0,45.5,3.5000000000000004
602.0,1.0,45.5,3.5000000000000004
603.0,1.0,45.5,3.5000000000000004
604.0,1.0,45.5,3.5000000000000004
605.0,1.0,45.5,3.5000000000000004
606.0,1.0,45.5,3.5000000000000004
607.0,1.0,45.5,3.5000000000000004
608.0,1.0,45.5,3.5000000000000004
609.0,1.0,45.5,3.5000000000000004
610.0,1.0,45.5,3.5000000000000004
611.0,1.0,45.5,3.5000000000000004
612.0,1.0,45.5,3.5000000000000004
613.0,1.0,45.5,3.5000000000000004
614.0,1.0,45.5,3.5000000000000004
615.0,1.0,45.5,3.5000000000000004
616.0,1.0,45.5,3.5000000000000004
617.0,1.0,45.5,3.5000000000000004
618.0,1.0,45.5,3.5000000000000004
619.0,1.0,46.0,3.5000000000000004
620.0,1.0,47.0,3.5000000000000004
621.0,1.0,47.0,3.5000000000000004
622.0,1.0,47.0,3.5000000000000004
623.0,1.0,47.0,3.5000000000000004
624.0,1.0,47.0,3.5000000000000004
625.0,1.0,47.0,3.5000000000000004
626.0,1.0,47.0,3.5000000000000004
627.0,1.0,47.0,3.5000000000000004
628.0,1.0,47.0,3.5000000000000004
629.0,1.0,47.0,3.5000000000000004
630.0,1.0,47.5,3.5000000000000004
631.0,1.0,47.5,3.5000000000000004
632.0,1.0,47.5,3.5000000000000004
633.0,1.0,48.5,3.5000000000000004
634.0,1.0,48.5,3.5000000000000004
635.0,1.0,48.5,3.5000000000000004
636.0,1.0,48.5,3.5000000000000004
637.0,1.0,48.5,3.5000000000000004
638.0,1.0,48.5,3.5000000000000004
639.0,1.0,48.5,3.5000000000000004
640.0,1.0,48.5,4.0
641.0,1.0,48.5,4.0
642.0,1.0,48.5,4.0
643.0,1.0,48.5,4.0
644.0,1.0,49.0,4.0
645.0,1.0,49.0,4.0
646.0,1.0,49.5,4.0
647.0,1.0,50.0,4.0
648.0,1.0,50.0,4.0
649.0,1.0,50.0,4.0
650.0,1.0,50.0,4.0
651.0,1.0,50.0,4.0
652.0,1.0,50.0,4.0
653.0,1.0,50.0,4.0
654.0,1.0,50.0,4.0
655.0,1.0,50.0,4.0
656.0,1.0,50.0,4.0
657.0,1.0,50.0,4.0
658.0,1.0,50.0,4.0
659.0,1.0,50.5,4.0
660.0,1.0,50.5,4.0
661.0,1.0,50.5,4.0
662.0,1.0,51.0,4.0
663.0,1.0,51.0,4.0
664.0,1.0,51.0,4.0
665.0,1.0,51.0,4.0
666.0,1.0,51.0,4.0
667.0,1.0,51.5,4.0
668.0,1.0,51.5,4.0
669.0,1.0,51.5,4.0
670.0,1.0,51.5,4.0
671.0,1.0,51.5,4.0
672.0,1.0,51.5,4.0
673.0,1.0,51.5,4.0
674.0,1.0,51.5,4.0
675.0,1.0,51.5,4.0
676.0,1.0,51.5,4.0
677.0,1.0,51.5,4.5
678.0,1.0,51.5,4.5
679.0,1.0,51.5,4.5
680.0,1.0,51.5,4.5
681.0,1.0,51.5,4.5
682.0,1.0,51.5,4.5
683.0,1.0,51.5,4.5
684.0,1.0,51.5,4.5
685.0,1.0,51.5,4.5
686.0,1.0,51.5,4.5
687.0,1.0,51.5,4.5
688.0,1.0,51.5,4.5
689.0,1.0,51.5,4.5
690.0,1.0,51.5,4.5
691.0,1.0,52.0,4.5
692.0,1.0,52.5,4.5
693.0,1.0,52.5,4.5
694.0,1.0,52.5,4.5
695.0,1.0,52.5,4.5
696.0,1.0,52.5,4.5
697.0,1.0,53.5,4.5
698.0,1.0,53.5,4.5
699.0,1.0,53.5,4.5
700.0,1.0,53.5,4.5
701.0,1.0,53.5,4.5
702.0,1.0,53.5,4.5
703.0,1.0,54.50000000000001,4.5
704.0,1.0,54.50000000000001,4.5
705.0,1.0,54.50000000000001,4.5
706.0,1.0,54.50000000000001,4.5
707.0,1.0,54.50000000000001,4.5
708.0,1.0,54.50000000000001,4.5
709.0,1.0,54.50000000000001,4.5
710.0,1.0,54.50000000000001,4.5
711.0,1.0,54.50000000000001,4.5
712.0,1.0,55.00000000000001,4.5
713.0,1.0,55.00000000000001,4.5
714.0,1.0,55.00000000000001,4.5
715.0,1.0,55.00000000000001,4.5
716.0,1.0,55.00000000000001,4.5
717.0,1.0,55.50000000000001,4.5
718.0,1.0,55.50000000000001,4.5
719.0,1.0,55.50000000000001,4.5
720.0,1.0,56.00000000000001,4.5
721.0,1.0,56.00000000000001,4.5
722.0,1.0,56.00000000000001,4.5
723.0,1.0,56.00000000000001,4.5
724.0,1.0,56.00000000000001,4.5
725.0,1.0,56.00000000000001,4.5
726.0,1.0,56.00000000000001,4.5
727.0,1.0,56.49999999999999,4.5
728.0,1.0,56.49999999999999,4.5
729.0,1.0,56.49999999999999,4.5
730.0,1.0,56.49999999999999,4.5
731.0,1.0,56.49999999999999,4.5
732.0,1.0,56.49999999999999,4.5
733.0,1.0,56.49999999999999,4.5
734.0,1.0,56.49999999999999,4.5
735.0,1.0,56.49999999999999,4.5
736.0,1.0,56.99999999999999,4.5
737.0,1.0,56.99999999999999,4.5
738.0,1.0,56.99999999999999,4.5
739.0,1.0,57.49999999999999,4.5
740.0,1.0,57.49999999999999,4.5
741.0,1.0,57.49999999999999,4.5
742.0,1.0,57.49999999999999,4.5
743.0,1.0,57.49999999999999,4.5
744.0,1.0,57.49999999999999,4.5
745.0,1.0,57.49999999999999,4.5
746.0,1.0,57.49999999999999,4.5
747.0,1.0,57.49999999999999,4.5
748.0,1.0,57.49999999999999,4.5
749.0,1.0,57.49999999999999,4.5
750.0,1.0,57.99999999999999,4.5
751.0,1.0,57.99999999999999,4.5
752.0,1.0,58.5,4.5
753.0,1.0,58.5,4.5
754.0,1.0,58.5,4.5
755.0,1.0,59.0,4.5
756.0,1.0,59.0,4.5
757.0,1.0,59.0,4.5
758.0,1.0,59.0,4.5
759.0,1.0,59.0,4.5
760.0,1.0,59.0,4.5
761.0,1.0,59.0,4.5
762.0,1.0,59.0,4.5
763.0,1.0,59.0,4.5
764.0,1.0,59.0,4.5
765.0,1.0,59.0,4.5
766.0,1.0,59.5,4.5
767.0,1.0,59.5,4.5
768.0,1.0,59.5,4.5
769.0,1.0,59.5,4.5
770.0,1.0,59.5,4.5
771.0,1.0,59.5,4.5
772.0,1.0,59.5,4.5
773.0,1.0,59.5,4.5
774.0,1.0,59.5,4.5
775.0,1.0,59.5,4.5
776.0,1.0,59.5,4.5
777.0,1.0,59.5,4.5
778.0,1.0,60.5,4.5
779.0,1.0,60.5,4.5
780.0,1.0,60.5,4.5
781.0,1.0,60.5,4.5
782.0,1.0,60.5,4.5
783.0,1.0,60.5,4.5
784.0,1.0,60.5,4.5
785.0,1.0,60.5,4.5
786.0,1.0,60.5,4.5
787.0,1.0,60.5,4.5
788.0,1.0,60.5,4.5
789.0,1.0,61.0,4.5
790.0,1.0,61.0,4.5
791.0,1.0,61.0,4.5
792.0,1.0,61.0,4.5
793.0,1.0,61.5,4.5
794.0,1.0,61.5,4.5
795.0,1.0,61.5,4.5
796.0,1.0,61.5,4.5
797.0,1.0,61.5,4.5
798.0,1.0,61.5,4.5
799.0,1.0,61.5,4.5
800.0,1.0,61.5,4.5
801.0,1.0,61.5,4.5
802.0,1.0,61.5,4.5
803.0,1.0,61.5,4.5
804.0,1.0,61.5,4.5
805.0,1.0,61.5,4.5
806.0,1.0,61.5,4.5
807.0,1.0,61.5,4.5
808.0,1.0,61.5,4.5
809.0,1.0,61.5,4.5
810.0,1.0,61.5,4.5
811.0,1.0,61.5,4.5
812.0,1.0,61.5,4.5
813.0,1.0,61.5,4.5
814.0,1.0,62.0,4.5
815.0,1.0,62.0,4.5
816.0,1.0,62.0,4.5
817.0,1.0,62.0,4.5
818.0,1.0,62.0,4.5
819.0,1.0,62.5,4.5
820.0,1.0,63.0,4.5
821.0,1.0,63.0,4.5
822.0,1.0,63.0,4.5
823.0,1.0,63.0,4.5
824.0,1.0,63.0,4.5
825.0,1.0,63.0,4.5
826.0,1.0,63.0,4.5
827.0,1.0,63.0,4.5
828.0,1.0,63.5,4.5
829.0,1.0,63.5,4.5
830.0,1.0,63.5,4.5
831.0,1.0,63.5,4.5
832.0,1.0,63.5,4.5
833.0,1.0,64.0,4.5
834.0,1.0,64.0,4.5
835.0,1.0,64.0,4.5
836.0,1.0,64.0,4.5
837.0,1.0,64.0,4.5
838.0,1.0,64.0,4.5
839.0,1.0,64.0,4.5
840.0,1.0,64.0,4.5
841.0,1.0,64.0,4.5
842.0,1.0,64.5,4.5
843.0,1.0,64.5,4.5
844.0,1.0,64.5,4.5
845.0,1.0,64.5,4.5
846.0,1.0,64.5,4.5
847.0,1.0,64.5,4.5
848.0,1.0,64.5,4.5
849.0,1.0,64.5,4.5
850.0,1.0,65.0,4.5
851.0,1.0,65.0,4.5
852.0,1.0,65.0,4.5
853.0,1.0,65.0,4.5
854.0,1.0,65.0,4.5
855.0,1.0,65.0,4.5
856.0,1.0,65.5,4.5
857.0,1.0,65.5,4.5
858.0,1.0,65.5,4.5
859.0,1.0,65.5,4.5
860.0,1.0,65.5,4.5
861.0,1.0,65.5,4.5
862.0,1.0,65.5,4.5
863.0,1.0,65.5,4.5
864.0,1.0,65.5,4.5
865.0,1.0,65.5,4.5
866.0,1.0,66.5,4.5
867.0,1.0,66.5,4.5
868.0,1.0,66.5,4.5
869.0,1.0,66.5,4.5
870.0,1.0,66.5,4.5
871.0,1.0,67.0,4.5
872.0,1.0,67.0,4.5
873.0,1.0,67.0,4.5
874.0,1.0,67.0,4.5
875.0,1.0,68.0,4.5
876.0,1.0,68.5,4.5
877.0,1.0,68.5,4.5
878.0,1.0,68.5,4.5
879.0,1.0,69.0,4.5
880.0,1.0,69.0,4.5
881.0,1.0,69.5,4.5
882.0,1.0,69.5,4.5
883.0,1.0,69.5,5.0
884.0,1.0,69.5,5.0
885.0,1.0,70.0,5.5
886.0,1.0,70.0,5.5
887.0,1.0,70.0,5.5
888.0,1.0,70.0,5.5
889.0,1.0,70.0,5.5
890.0,1.0,70.5,5.5
891.0,1.0,70.5,5.5
892.0,1.0,70.5,5.5
893.0,1.0,70.5,5.5
894.0,1.0,70.5,5.5
895.0,1.0,70.5,5.5
896.0,1.0,70.5,5.5
897.0,1.0,70.5,5.5
898.0,1.0,71.0,5.5
899.0,1.0,71.0,5.5
900.0,1.0,71.0,5.5
901.0,1.0,71.5,5.5
902.0,1.0,71.5,5.5
903.0,1.0,72.0,6.0
904.0,1.0,72.0,6.0
905.0,1.0,72.0,6.0
906.0,1.0,72.0,6.0
907.0,1.0,72.0,6.0
908.0,1.0,72.0,6.0
909.0,1.0,72.5,6.0
910.0,1.0,72.5,6.0
911.0,1.0,72.5,6.0
912.0,1.0,72.5,6.0
913.0,1.0,72.5,6.0
914.0,1.0,72.5,6.0
915.0,1.0,72.5,6.0
916.0,1.0,72.5,6.0
917.0,1.0,73.0,6.0
918.0,1.0,73.0,6.0
919.0,1.0,73.0,6.0
920.0,1.0,73.0,6.0
921.0,1.0,73.0,6.0
922.0,1.0,73.0,6.0
923.0,1.0,73.0,6.0
924.0,1.0,73.0,6.0
925.0,1.0,73.0,6.0
926.0,1.0,73.0,6.5
927.0,1.0,73.0,6.5
928.0,1.0,73.0,6.5
929.0,1.0,73.0,6.5
930.0,1.0,73.0,6.5
931.0,1.0,73.0,6.5
932.0,1.0,73.0,6.5
933.0,1.0,73.0,6.5
934.0,1.0,73.5,6.5
935.0,1.0,73.5,6.5
936.0,1.5,73.5,6.5
937.0,1.5,73.5,6.5
938.0,1.5,73.5,6.5
939.0,1.5,73.5,6.5
940.0,1.5,73.5,6.5
941.0,1.5,73.5,6.5
942.0,1.5,73.5,6.5
943.0,1.5,74.5,6.5
944.0,1.5,74.5,6.5
945.0,1.5,75.0,6.5
946.0,1.5,75.5,6.5
947.0,1.5,76.0,6.5
948.0,1.5,76.0,6.5
949.0,1.5,76.0,6.5
950.0,1.5,76.0,6.5
951.0,1.5,76.0,6.5
952.0,1.5,76.0,6.5
953.0,1.5,76.0,6.5
954.0,1.5,76.0,6.5
955.0,1.5,76.0,6.5
956.0,1.5,76.0,6.5
957.0,1.5,76.0,6.5
958.0,1.5,76.0,6.5
959.0,1.5,76.5,6.5
960.0,1.5,76.5,6.5
961.0,1.5,76.5,6.5
962.0,1.5,76.5,6.5
963.0,1.5,76.5,6.5
964.0,1.5,76.5,6.5
965.0,1.5,76.5,6.5
966.0,1.5,76.5,6.5
967.0,1.5,76.5,6.5
968.0,1.5,76.5,6.5
969.0,1.5,76.5,6.5
970.0,1.5,76.5,6.5
971.0,1.5,76.5,6.5
972.0,1.5,77.0,6.5
973.0,1.5,77.0,6.5
974.0,1.5,77.0,6.5
975.0,1.5,77.0,6.5
976.0,1.5,77.0,6.5
977.0,1.5,77.0,6.5
978.0,1.5,77.0,6.5
979.0,1.5,77.0,6.5
980.0,1.5,77.0,6.5
981.0,1.5,77.0,6.5
982.0,1.5,77.0,6.5
983.0,1.5,77.0,6.5
984.0,1.5,77.0,6.5
985.0,1.5,77.0,6.5
986.0,1.5,77.0,6.5
987.0,1.5,77.0,6.5
988.0,1.5,77.0,7.000000000000001
989.0,1.5,77.0,7.000000000000001
990.0,1.5,77.0,7.000000000000001
991.0,1.5,77.5,7.000000000000001
992.0,1.5,77.5,7.000000000000001
993.0,1.5,78.0,7.000000000000001
994.0,1.5,78.0,7.000000000000001
995.0,1.5,78.5,7.000000000000001
996.0,1.5,78.5,7.000000000000001
997.0,1.5,78.5,7.000000000000001
998.0,1.5,78.5,7.000000000000001
999.0,1.5,79.0,7.000000000000001
1000.0,1.5,79.0,7.000000000000001
1001.0,1.5,79.0,7.000000000000001
1002.0,1.5,79.0,7.000000000000001
1003.0,1.5,79.0,7.000000000000001
1004.0,1.5,79.0,7.000000000000001
1005.0,1.5,79.0,7.000000000000001
1006.0,1.5,79.0,7.000000000000001
1007.0,1.5,79.0,7.000000000000001
1008.0,1.5,79.0,7.000000000000001
1009.0,1.5,79.0,7.000000000000001
1010.0,1.5,79.0,7.000000000000001
1011.0,1.5,79.0,7.000000000000001
1012.0,1.5,79.0,7.000000000000001
1013.0,1.5,79.0,7.000000000000001
1014.0,1.5,79.0,7.000000000000001
1015.0,1.5,79.0,7.000000000000001
1016.0,1.5,79.0,7.000000000000001
1017.0,1.5,79.0,7.000000000000001
1018.0,1.5,79.5,7.000000000000001
1019.0,1.5,79.5,7.000000000000001
1020.0,1.5,79.5,7.000000000000001
1021.0,1.5,79.5,7.000000000000001
1022.0,1.5,79.5,7.000000000000001
1023.0,1.5,79.5,7.000000000000001
1024.0,1.5,79.5,7.000000000000001
1025.0,1.5,79.5,7.000000000000001
1026.0,1.5,79.5,7.000000000000001
1027.0,1.5,79.5,7.000000000000001
1028.0,1.5,79.5,7.000000000000001
1029.0,1.5,79.5,7.000000000000001
1030.0,1.5,79.5,7.000000000000001
1031.0,1.5,79.5,7.000000000000001
1032.0,1.5,79.5,7.000000000000001
1033.0,1.5,79.5,7.000000000000001
1034.0,1.5,79.5,7.000000000000001
1035.0,1.5,79.5,7.000000000000001
1036.0,1.5,79.5,7.000000000000001
1037.0,1.5,79.5,7.000000000000001
1038.0,1.5,79.5,7.000000000000001
1039.0,1.5,79.5,7.000000000000001
1040.0,1.5,79.5,7.000000000000001
1041.0,1.5,79.5,7.000000000000001
1042.0,1.5,79.5,7.000000000000001
1043.0,1.5,79.5,7.000000000000001
1044.0,1.5,79.5,7.000000000000001
1045.0,1.5,79.5,7.000000000000001
1046.0,1.5,79.5,7.000000000000001
1047.0,1.5,79.5,7.000000000000001
1048.0,1.5,79.5,7.000000000000001
1049.0,1.5,79.5,7.000000000000001
1050.0,1.5,79.5,7.000000000000001
1051.0,1.5,79.5,7.000000000000001
1052.0,1.5,79.5,7.000000000000001
1053.0,1.5,79.5,7.000000000000001
1054.0,1.5,79.5,7.000000000000001
1055.0,1.5,79.5,7.000000000000001
1056.0,1.5,79.5,7.000000000000001
1057.0,1.5,79.5,7.000000000000001
1058.0,1.5,79.5,7.000000000000001
1059.0,1.5,79.5,7.000000000000001
1060.0,1.5,79.5,7.000000000000001
1061.0,1.5,79.5,7.000000000000001
1062.0,1.5,79.5,7.000000000000001
1063.0,1.5,79.5,7.000000000000001
1064.0,1.5,79.5,7.000000000000001
1065.0,1.5,79.5,7.000000000000001
1066.0,1.5,79.5,7.000000000000001
1067.0,1.5,79.5,7.000000000000001
1068.0,1.5,79.5,7.000000000000001
1069.0,1.5,79.5,7.000000000000001
1070.0,1.5,79.5,7.000000000000001
1071.0,1.5,79.5,7.000000000000001
1072.0,1.5,79.5,7.000000000000001
1073.0,1.5,79.5,7.000000000000001
1074.0,1.5,79.5,7.000000000000001
1075.0,1.5,79.5,7.000000000000001
1076.0,1.5,79.5,7.000000000000001
1077.0,1.5,79.5,7.000000000000001
1078.0,1.5,79.5,7.000000000000001
1079.0,1.5,79.5,7.000000000000001
1080.0,1.5,79.5,7.000000000000001
1081.0,1.5,79.5,7.000000000000001
1082.0,1.5,79.5,7.000000000000001
1083.0,1.5,79.5,7.000000000000001
1084.0,1.5,79.5,7.000000000000001
1085.0,1.5,79.5,7.000000000000001
1086.0,1.5,79.5,7.000000000000001
1087.0,1.5,79.5,7.000000000000001
1088.0,1.5,79.5,7.000000000000001
1089.0,1.5,79.5,7.000000000000001
1090.0,1.5,79.5,7.000000000000001
1091.0,1.5,79.5,7.000000000000001
1092.0,1.5,79.5,7.000000000000001
