"tick","New CI Buyers","New BEV Buyers","Occasion BEV Buyers","Occasion CI Buyers","Lease BEV Buyers","Lease CI Buyers"
1.0,0.0,0.0,0.0,0.0,0.0,0.0
2.0,0.0,0.0,0.0,0.0,0.0,0.0
3.0,0.0,0.0,0.0,0.0,0.0,0.0
4.0,0.0,0.0,0.0,0.0,0.0,0.0
5.0,0.0,0.0,0.0,0.0,0.0,0.0
6.0,0.0,0.0,0.0,0.0,0.0,0.0
7.0,0.0,0.0,0.0,0.0,0.0,0.0
8.0,0.0,0.0,0.0,0.0,0.0,0.0
9.0,0.0,0.0,0.0,0.0,0.0,0.0
10.0,0.0,0.0,0.0,0.0,0.0,0.0
11.0,0.0,0.0,0.0,0.0,0.0,0.0
12.0,0.0,0.0,0.0,0.0,0.0,0.0
13.0,0.0,0.0,0.0,0.0,0.0,0.0
14.0,0.0,0.0,0.0,0.0,0.0,0.0
15.0,0.0,0.0,0.0,0.0,0.0,0.0
16.0,0.0,0.0,0.0,0.0,0.0,0.0
17.0,0.0,0.0,0.0,0.0,0.0,0.0
18.0,0.0,0.0,0.0,0.0,0.0,0.0
19.0,0.0,0.0,0.0,0.0,0.0,0.0
20.0,0.0,0.0,0.0,0.0,0.0,0.0
21.0,0.0,0.0,0.0,0.0,0.0,0.0
22.0,0.0,0.0,0.0,0.0,0.0,0.0
23.0,0.0,0.0,0.0,0.0,0.0,0.0
24.0,0.0,0.0,0.0,0.0,0.0,0.0
25.0,0.0,0.0,0.0,0.0,0.0,0.0
26.0,0.0,0.0,0.0,0.0,0.0,0.0
27.0,0.0,0.0,0.0,0.0,0.0,0.0
28.0,0.0,0.0,0.0,0.0,0.0,0.0
29.0,0.0,0.0,0.0,0.0,0.0,0.0
30.0,0.0,0.0,0.0,0.0,0.0,0.0
31.0,0.0,0.0,0.0,0.0,0.0,0.0
32.0,0.0,0.0,0.0,0.0,0.0,0.0
33.0,0.0,0.0,0.0,0.0,0.0,0.0
34.0,0.0,0.0,0.0,0.0,0.0,0.0
35.0,0.0,0.0,0.0,0.0,0.0,0.0
36.0,0.0,0.0,0.0,0.0,0.0,0.0
37.0,0.0,0.0,0.0,0.0,0.0,0.0
38.0,0.0,0.0,0.0,0.0,0.0,0.0
39.0,0.0,0.0,0.0,0.0,0.0,0.0
40.0,0.0,0.0,0.0,0.0,0.0,0.0
41.0,0.0,0.0,0.0,0.0,0.0,0.0
42.0,0.0,0.0,0.0,0.0,0.0,0.0
43.0,0.0,0.0,0.0,0.0,0.0,0.0
44.0,0.0,0.0,0.0,0.0,0.0,0.0
45.0,0.0,0.0,0.0,0.0,0.0,0.0
46.0,0.0,0.0,0.0,0.0,0.0,0.0
47.0,0.0,0.0,0.0,0.0,0.0,0.0
48.0,0.0,0.0,0.0,0.0,0.0,0.0
49.0,0.0,0.0,0.0,0.0,0.0,0.0
50.0,0.0,0.0,0.0,0.0,0.0,0.0
51.0,0.0,0.0,0.0,0.0,0.0,0.0
52.0,0.0,0.0,0.0,0.0,0.0,0.0
53.0,0.0,0.0,0.0,0.0,0.0,0.0
54.0,0.0,0.0,0.0,0.0,0.0,0.0
55.0,0.0,0.0,0.0,0.0,0.0,0.0
56.0,0.0,0.0,0.0,0.0,0.0,0.0
57.0,0.0,0.0,0.0,0.0,0.0,0.0
58.0,0.0,0.0,0.0,1.0,0.0,0.0
59.0,0.0,0.0,0.0,1.0,0.0,0.0
60.0,0.0,0.0,0.0,1.0,0.0,0.0
61.0,0.0,0.0,0.0,1.0,0.0,0.0
62.0,0.0,0.0,0.0,2.0,0.0,0.0
63.0,0.0,0.0,0.0,2.0,0.0,0.0
64.0,0.0,0.0,0.0,2.0,0.0,0.0
65.0,0.0,0.0,0.0,2.0,0.0,0.0
66.0,0.0,0.0,0.0,2.0,0.0,0.0
67.0,0.0,0.0,0.0,2.0,0.0,0.0
68.0,0.0,0.0,0.0,2.0,0.0,0.0
69.0,0.0,0.0,0.0,2.0,0.0,0.0
70.0,0.0,0.0,0.0,2.0,0.0,0.0
71.0,0.0,0.0,0.0,2.0,0.0,0.0
72.0,0.0,0.0,0.0,2.0,0.0,0.0
73.0,0.0,0.0,0.0,2.0,0.0,0.0
74.0,0.0,0.0,0.0,2.0,0.0,0.0
75.0,0.0,0.0,0.0,3.0,0.0,0.0
76.0,0.0,0.0,0.0,3.0,0.0,0.0
77.0,0.0,0.0,0.0,3.0,0.0,0.0
78.0,0.0,0.0,0.0,3.0,0.0,0.0
79.0,0.0,0.0,0.0,3.0,0.0,0.0
80.0,0.0,0.0,0.0,3.0,0.0,0.0
81.0,0.0,0.0,0.0,3.0,0.0,0.0
82.0,0.0,0.0,0.0,3.0,0.0,0.0
83.0,0.0,0.0,0.0,3.0,0.0,0.0
84.0,0.0,0.0,0.0,3.0,0.0,0.0
85.0,0.0,0.0,0.0,3.0,0.0,0.0
86.0,0.0,0.0,0.0,3.0,0.0,0.0
87.0,0.0,0.0,0.0,3.0,0.0,0.0
88.0,0.0,0.0,0.0,3.0,0.0,0.0
89.0,0.0,0.0,0.0,3.0,0.0,0.0
90.0,0.0,0.0,0.0,3.0,0.0,0.0
91.0,0.0,0.0,0.0,3.0,0.0,0.0
92.0,0.0,0.0,0.0,3.0,0.0,0.0
93.0,0.0,0.0,0.0,3.0,0.0,0.0
94.0,0.0,0.0,0.0,3.0,0.0,0.0
95.0,0.0,0.0,0.0,3.0,0.0,0.0
96.0,0.0,0.0,0.0,3.0,0.0,0.0
97.0,0.0,0.0,0.0,3.0,0.0,0.0
98.0,0.0,0.0,0.0,3.0,0.0,0.0
99.0,0.0,0.0,0.0,3.0,0.0,0.0
100.0,0.0,0.0,0.0,3.0,0.0,0.0
101.0,0.0,0.0,0.0,3.0,0.0,0.0
102.0,0.0,0.0,0.0,3.0,0.0,0.0
103.0,0.0,0.0,0.0,3.0,0.0,0.0
104.0,0.0,0.0,0.0,3.0,0.0,0.0
105.0,0.0,0.0,0.0,3.0,0.0,0.0
106.0,0.0,0.0,0.0,3.0,0.0,0.0
107.0,0.0,0.0,0.0,3.0,0.0,0.0
108.0,0.0,0.0,0.0,3.0,0.0,0.0
109.0,0.0,0.0,0.0,3.0,0.0,0.0
110.0,0.0,0.0,0.0,3.0,0.0,0.0
111.0,0.0,0.0,0.0,3.0,0.0,0.0
112.0,0.0,0.0,0.0,3.0,0.0,0.0
113.0,0.0,0.0,0.0,3.0,0.0,0.0
114.0,0.0,0.0,0.0,3.0,0.0,0.0
115.0,0.0,0.0,0.0,3.0,0.0,0.0
116.0,0.0,0.0,0.0,3.0,0.0,0.0
117.0,0.0,0.0,0.0,3.0,0.0,0.0
118.0,0.0,0.0,0.0,3.0,0.0,0.0
119.0,0.0,0.0,0.0,3.0,0.0,0.0
120.0,0.0,0.0,0.0,3.0,0.0,0.0
121.0,0.0,0.0,0.0,3.0,0.0,0.0
122.0,0.0,0.0,0.0,3.0,0.0,0.0
123.0,0.0,0.0,0.0,3.0,0.0,0.0
124.0,0.0,0.0,0.0,3.0,0.0,0.0
125.0,0.0,0.0,0.0,3.0,0.0,0.0
126.0,0.0,0.0,0.0,3.0,0.0,0.0
127.0,0.0,0.0,0.0,3.0,0.0,0.0
128.0,0.0,0.0,0.0,3.0,0.0,0.0
129.0,0.0,0.0,0.0,3.0,0.0,0.0
130.0,0.0,0.0,0.0,3.0,0.0,0.0
131.0,0.0,0.0,0.0,3.0,0.0,0.0
132.0,0.0,0.0,0.0,3.0,0.0,0.0
133.0,0.0,0.0,0.0,4.0,0.0,0.0
134.0,0.0,0.0,0.0,4.0,0.0,0.0
135.0,0.0,0.0,0.0,4.0,0.0,0.0
136.0,0.0,0.0,0.0,4.0,0.0,0.0
137.0,0.0,0.0,0.0,4.0,0.0,0.0
138.0,0.0,0.0,0.0,4.0,0.0,0.0
139.0,0.0,0.0,0.0,4.0,0.0,0.0
140.0,0.0,0.0,0.0,4.0,0.0,0.0
141.0,0.0,0.0,0.0,4.0,0.0,0.0
142.0,0.0,0.0,0.0,4.0,0.0,0.0
143.0,0.0,0.0,0.0,4.0,0.0,0.0
144.0,0.0,0.0,0.0,4.0,0.0,0.0
145.0,0.0,0.0,0.0,4.0,0.0,0.0
146.0,0.0,0.0,0.0,4.0,0.0,0.0
147.0,0.0,0.0,0.0,4.0,0.0,0.0
148.0,0.0,0.0,0.0,4.0,0.0,0.0
149.0,0.0,0.0,0.0,4.0,0.0,0.0
150.0,0.0,0.0,0.0,4.0,0.0,0.0
151.0,0.0,0.0,0.0,4.0,0.0,0.0
152.0,0.0,0.0,0.0,4.0,0.0,0.0
153.0,0.0,0.0,0.0,4.0,0.0,0.0
154.0,0.0,0.0,0.0,4.0,0.0,0.0
155.0,0.0,0.0,0.0,4.0,0.0,0.0
156.0,0.0,0.0,0.0,4.0,0.0,0.0
157.0,0.0,0.0,0.0,4.0,0.0,0.0
158.0,0.0,0.0,0.0,4.0,0.0,0.0
159.0,0.0,0.0,0.0,4.0,0.0,0.0
160.0,0.0,0.0,0.0,4.0,0.0,0.0
161.0,0.0,0.0,0.0,4.0,0.0,0.0
162.0,0.0,0.0,0.0,4.0,0.0,0.0
163.0,0.0,0.0,0.0,4.0,0.0,0.0
164.0,0.0,0.0,0.0,4.0,0.0,0.0
165.0,0.0,0.0,0.0,4.0,0.0,0.0
166.0,0.0,0.0,0.0,4.0,0.0,0.0
167.0,0.0,0.0,0.0,4.0,0.0,0.0
168.0,0.0,0.0,0.0,4.0,0.0,0.0
169.0,0.0,0.0,0.0,4.0,0.0,0.0
170.0,0.0,0.0,0.0,4.0,0.0,0.0
171.0,0.0,0.0,0.0,4.0,0.0,0.0
172.0,0.0,0.0,0.0,4.0,0.0,0.0
173.0,0.0,0.0,0.0,5.0,0.0,0.0
174.0,0.0,0.0,0.0,5.0,0.0,0.0
175.0,0.0,0.0,0.0,5.0,0.0,0.0
176.0,0.0,0.0,0.0,5.0,0.0,0.0
177.0,0.0,0.0,1.0,5.0,0.0,0.0
178.0,0.0,0.0,2.0,5.0,0.0,0.0
179.0,0.0,0.0,2.0,5.0,0.0,0.0
180.0,0.0,0.0,2.0,5.0,0.0,0.0
181.0,0.0,0.0,2.0,5.0,0.0,0.0
182.0,0.0,0.0,2.0,5.0,0.0,0.0
183.0,0.0,0.0,2.0,5.0,0.0,0.0
184.0,0.0,0.0,2.0,5.0,0.0,0.0
185.0,0.0,0.0,2.0,5.0,0.0,0.0
186.0,0.0,0.0,2.0,5.0,0.0,0.0
187.0,0.0,0.0,2.0,5.0,0.0,0.0
188.0,0.0,0.0,2.0,5.0,0.0,0.0
189.0,0.0,0.0,2.0,5.0,0.0,0.0
190.0,0.0,0.0,3.0,5.0,0.0,0.0
191.0,0.0,0.0,3.0,5.0,0.0,0.0
192.0,0.0,0.0,3.0,5.0,0.0,0.0
193.0,0.0,0.0,3.0,5.0,0.0,0.0
194.0,0.0,0.0,3.0,5.0,0.0,0.0
195.0,0.0,0.0,3.0,5.0,0.0,0.0
196.0,0.0,0.0,3.0,5.0,0.0,0.0
197.0,0.0,0.0,3.0,5.0,0.0,0.0
198.0,0.0,0.0,3.0,5.0,0.0,0.0
199.0,0.0,0.0,3.0,5.0,0.0,0.0
200.0,0.0,0.0,3.0,5.0,0.0,0.0
201.0,0.0,0.0,3.0,5.0,0.0,0.0
202.0,0.0,0.0,3.0,5.0,0.0,0.0
203.0,0.0,0.0,3.0,5.0,0.0,0.0
204.0,0.0,0.0,4.0,5.0,0.0,0.0
205.0,0.0,0.0,4.0,5.0,0.0,0.0
206.0,0.0,0.0,4.0,5.0,0.0,0.0
207.0,0.0,0.0,5.0,5.0,0.0,0.0
208.0,0.0,0.0,5.0,5.0,0.0,0.0
209.0,0.0,0.0,5.0,5.0,0.0,0.0
210.0,0.0,0.0,5.0,5.0,0.0,0.0
211.0,0.0,0.0,5.0,5.0,0.0,0.0
212.0,0.0,0.0,6.0,5.0,0.0,0.0
213.0,0.0,0.0,6.0,5.0,0.0,0.0
214.0,0.0,0.0,6.0,6.0,0.0,0.0
215.0,0.0,0.0,6.0,6.0,0.0,0.0
216.0,0.0,0.0,6.0,6.0,0.0,0.0
217.0,0.0,0.0,6.0,6.0,0.0,0.0
218.0,0.0,0.0,6.0,6.0,0.0,0.0
219.0,0.0,0.0,6.0,6.0,0.0,0.0
220.0,0.0,0.0,6.0,6.0,0.0,0.0
221.0,0.0,0.0,6.0,6.0,0.0,0.0
222.0,0.0,0.0,6.0,6.0,0.0,1.0
223.0,0.0,0.0,6.0,6.0,0.0,1.0
224.0,0.0,0.0,6.0,6.0,0.0,1.0
225.0,0.0,0.0,7.0,6.0,0.0,1.0
226.0,0.0,0.0,7.0,6.0,0.0,1.0
227.0,0.0,0.0,7.0,6.0,0.0,1.0
228.0,0.0,0.0,7.0,6.0,0.0,1.0
229.0,0.0,0.0,7.0,6.0,0.0,1.0
230.0,0.0,0.0,7.0,6.0,0.0,1.0
231.0,0.0,0.0,7.0,6.0,0.0,1.0
232.0,0.0,0.0,7.0,6.0,0.0,1.0
233.0,0.0,0.0,7.0,6.0,0.0,1.0
234.0,0.0,0.0,7.0,6.0,0.0,1.0
235.0,0.0,0.0,8.0,6.0,0.0,1.0
236.0,0.0,0.0,8.0,6.0,0.0,1.0
237.0,0.0,0.0,8.0,6.0,0.0,1.0
238.0,0.0,0.0,8.0,6.0,0.0,1.0
239.0,0.0,0.0,8.0,6.0,0.0,1.0
240.0,0.0,0.0,8.0,6.0,0.0,1.0
241.0,0.0,0.0,8.0,6.0,0.0,1.0
242.0,0.0,0.0,8.0,6.0,0.0,1.0
243.0,0.0,0.0,8.0,7.0,0.0,1.0
244.0,0.0,0.0,8.0,7.0,0.0,1.0
245.0,0.0,0.0,8.0,7.0,0.0,1.0
246.0,0.0,0.0,8.0,7.0,0.0,1.0
247.0,0.0,0.0,8.0,8.0,0.0,1.0
248.0,0.0,0.0,8.0,8.0,0.0,1.0
249.0,0.0,0.0,8.0,8.0,0.0,1.0
250.0,0.0,0.0,8.0,8.0,0.0,1.0
251.0,0.0,0.0,8.0,8.0,0.0,1.0
252.0,0.0,0.0,8.0,8.0,0.0,1.0
253.0,0.0,0.0,8.0,8.0,0.0,1.0
254.0,0.0,0.0,8.0,9.0,0.0,1.0
255.0,0.0,0.0,8.0,9.0,0.0,1.0
256.0,0.0,0.0,8.0,9.0,0.0,1.0
257.0,0.0,0.0,8.0,9.0,0.0,1.0
258.0,0.0,0.0,8.0,9.0,0.0,1.0
259.0,0.0,0.0,8.0,9.0,0.0,1.0
260.0,0.0,0.0,8.0,9.0,0.0,1.0
261.0,0.0,0.0,13.0,9.0,0.0,1.0
262.0,0.0,0.0,13.0,9.0,0.0,1.0
263.0,0.0,0.0,13.0,9.0,0.0,1.0
264.0,0.0,0.0,13.0,9.0,0.0,1.0
265.0,0.0,0.0,13.0,9.0,0.0,1.0
266.0,0.0,0.0,13.0,9.0,0.0,1.0
267.0,0.0,0.0,13.0,10.0,0.0,1.0
268.0,0.0,0.0,13.0,10.0,0.0,1.0
269.0,0.0,0.0,14.0,11.0,0.0,1.0
270.0,0.0,0.0,14.0,11.0,0.0,1.0
271.0,0.0,0.0,14.0,11.0,0.0,1.0
272.0,0.0,0.0,14.0,11.0,0.0,1.0
273.0,0.0,0.0,14.0,12.0,0.0,1.0
274.0,0.0,0.0,14.0,12.0,0.0,1.0
275.0,0.0,0.0,14.0,12.0,0.0,1.0
276.0,0.0,0.0,14.0,12.0,0.0,1.0
277.0,0.0,0.0,14.0,12.0,0.0,1.0
278.0,0.0,0.0,14.0,13.0,0.0,1.0
279.0,0.0,0.0,14.0,13.0,0.0,1.0
280.0,0.0,0.0,14.0,13.0,0.0,1.0
281.0,0.0,0.0,14.0,13.0,0.0,1.0
282.0,1.0,0.0,15.0,13.0,0.0,1.0
283.0,1.0,0.0,15.0,13.0,0.0,1.0
284.0,1.0,0.0,15.0,13.0,0.0,1.0
285.0,1.0,0.0,15.0,13.0,0.0,1.0
286.0,1.0,0.0,15.0,13.0,0.0,1.0
287.0,1.0,0.0,15.0,14.0,0.0,1.0
288.0,1.0,0.0,15.0,14.0,0.0,1.0
289.0,1.0,0.0,15.0,14.0,0.0,1.0
290.0,1.0,0.0,15.0,15.0,0.0,1.0
291.0,1.0,0.0,15.0,15.0,0.0,1.0
292.0,1.0,0.0,15.0,15.0,0.0,1.0
293.0,1.0,0.0,15.0,15.0,0.0,1.0
294.0,1.0,0.0,15.0,15.0,0.0,1.0
295.0,1.0,0.0,15.0,15.0,0.0,1.0
296.0,1.0,0.0,15.0,15.0,0.0,1.0
297.0,1.0,0.0,15.0,15.0,0.0,1.0
298.0,1.0,0.0,15.0,15.0,0.0,1.0
299.0,1.0,0.0,15.0,15.0,0.0,1.0
300.0,1.0,0.0,15.0,15.0,0.0,1.0
301.0,1.0,0.0,15.0,15.0,0.0,1.0
302.0,1.0,0.0,16.0,15.0,0.0,1.0
303.0,1.0,0.0,16.0,15.0,0.0,1.0
304.0,1.0,0.0,17.0,15.0,0.0,2.0
305.0,1.0,0.0,17.0,15.0,0.0,2.0
306.0,1.0,0.0,17.0,15.0,0.0,2.0
307.0,1.0,0.0,17.0,15.0,0.0,2.0
308.0,1.0,0.0,18.0,15.0,0.0,2.0
309.0,1.0,0.0,18.0,15.0,0.0,2.0
310.0,1.0,0.0,18.0,15.0,0.0,2.0
311.0,1.0,0.0,18.0,15.0,0.0,2.0
312.0,1.0,0.0,18.0,15.0,0.0,2.0
313.0,1.0,0.0,21.0,15.0,0.0,2.0
314.0,1.0,0.0,21.0,15.0,0.0,2.0
315.0,1.0,0.0,21.0,15.0,0.0,2.0
316.0,1.0,0.0,21.0,15.0,0.0,2.0
317.0,1.0,0.0,21.0,15.0,0.0,2.0
318.0,1.0,0.0,21.0,15.0,0.0,2.0
319.0,1.0,0.0,21.0,15.0,0.0,2.0
320.0,1.0,0.0,22.0,15.0,0.0,2.0
321.0,1.0,0.0,23.0,15.0,0.0,2.0
322.0,1.0,0.0,23.0,15.0,0.0,2.0
323.0,1.0,0.0,23.0,16.0,0.0,2.0
324.0,1.0,0.0,23.0,16.0,0.0,2.0
325.0,1.0,0.0,23.0,16.0,0.0,2.0
326.0,1.0,0.0,23.0,16.0,0.0,2.0
327.0,1.0,0.0,24.0,16.0,0.0,2.0
328.0,1.0,0.0,24.0,16.0,0.0,2.0
329.0,1.0,0.0,24.0,16.0,0.0,2.0
330.0,1.0,0.0,24.0,16.0,0.0,2.0
331.0,1.0,0.0,24.0,16.0,0.0,2.0
332.0,1.0,0.0,24.0,16.0,0.0,2.0
333.0,1.0,0.0,24.0,16.0,0.0,2.0
334.0,1.0,0.0,25.0,16.0,0.0,2.0
335.0,1.0,0.0,25.0,16.0,0.0,2.0
336.0,1.0,0.0,26.0,16.0,0.0,2.0
337.0,1.0,0.0,26.0,16.0,0.0,2.0
338.0,1.0,0.0,26.0,16.0,0.0,2.0
339.0,1.0,0.0,26.0,16.0,0.0,2.0
340.0,1.0,0.0,26.0,16.0,0.0,2.0
341.0,1.0,0.0,27.0,16.0,0.0,2.0
342.0,1.0,0.0,27.0,17.0,0.0,2.0
343.0,1.0,0.0,27.0,17.0,0.0,2.0
344.0,1.0,0.0,27.0,17.0,0.0,2.0
345.0,1.0,0.0,27.0,17.0,0.0,2.0
346.0,1.0,0.0,28.0,17.0,0.0,2.0
347.0,1.0,0.0,28.0,18.0,0.0,2.0
348.0,1.0,0.0,28.0,18.0,0.0,2.0
349.0,1.0,0.0,28.0,18.0,0.0,2.0
350.0,1.0,0.0,28.0,19.0,0.0,2.0
351.0,1.0,0.0,28.0,19.0,0.0,2.0
352.0,1.0,0.0,28.0,19.0,0.0,2.0
353.0,1.0,0.0,28.0,19.0,0.0,2.0
354.0,1.0,0.0,28.0,19.0,0.0,2.0
355.0,1.0,0.0,28.0,19.0,0.0,2.0
356.0,1.0,0.0,28.0,19.0,0.0,2.0
357.0,1.0,0.0,28.0,19.0,0.0,2.0
358.0,1.0,0.0,28.0,20.0,0.0,2.0
359.0,1.0,0.0,28.0,20.0,0.0,2.0
360.0,1.0,0.0,29.0,20.0,0.0,2.0
361.0,1.0,0.0,29.0,20.0,0.0,2.0
362.0,1.0,0.0,29.0,20.0,0.0,2.0
363.0,1.0,0.0,29.0,20.0,0.0,2.0
364.0,1.0,0.0,29.0,20.0,0.0,2.0
365.0,1.0,0.0,30.0,21.0,0.0,2.0
366.0,1.0,0.0,30.0,21.0,0.0,2.0
367.0,1.0,0.0,30.0,21.0,0.0,2.0
368.0,1.0,0.0,30.0,21.0,0.0,2.0
369.0,1.0,0.0,30.0,21.0,0.0,2.0
370.0,1.0,0.0,30.0,21.0,0.0,2.0
371.0,1.0,0.0,30.0,21.0,0.0,2.0
372.0,1.0,0.0,30.0,21.0,0.0,2.0
373.0,1.0,0.0,30.0,21.0,0.0,2.0
374.0,1.0,0.0,30.0,21.0,0.0,2.0
375.0,1.0,0.0,30.0,21.0,0.0,2.0
376.0,1.0,0.0,31.0,21.0,0.0,2.0
377.0,1.0,0.0,31.0,21.0,0.0,2.0
378.0,1.0,0.0,31.0,21.0,0.0,2.0
379.0,1.0,0.0,31.0,21.0,0.0,2.0
380.0,1.0,0.0,31.0,21.0,0.0,2.0
381.0,1.0,0.0,32.0,21.0,0.0,2.0
382.0,1.0,0.0,32.0,21.0,0.0,2.0
383.0,1.0,0.0,32.0,22.0,0.0,2.0
384.0,1.0,0.0,32.0,22.0,0.0,2.0
385.0,1.0,0.0,32.0,22.0,0.0,2.0
386.0,1.0,0.0,32.0,22.0,0.0,2.0
387.0,1.0,0.0,32.0,22.0,0.0,2.0
388.0,1.0,0.0,32.0,22.0,0.0,2.0
389.0,1.0,0.0,32.0,22.0,0.0,2.0
390.0,1.0,0.0,32.0,22.0,0.0,2.0
391.0,1.0,0.0,32.0,22.0,0.0,2.0
392.0,1.0,0.0,32.0,22.0,0.0,2.0
393.0,1.0,0.0,32.0,22.0,0.0,2.0
394.0,1.0,0.0,32.0,22.0,0.0,2.0
395.0,1.0,0.0,33.0,22.0,0.0,2.0
396.0,1.0,0.0,34.0,22.0,0.0,2.0
397.0,1.0,0.0,34.0,23.0,0.0,2.0
398.0,1.0,0.0,34.0,24.0,0.0,2.0
399.0,1.0,0.0,34.0,24.0,0.0,3.0
400.0,1.0,0.0,34.0,24.0,0.0,3.0
401.0,1.0,0.0,34.0,24.0,0.0,3.0
402.0,1.0,0.0,34.0,24.0,0.0,3.0
403.0,1.0,0.0,34.0,25.0,0.0,3.0
404.0,1.0,0.0,34.0,25.0,0.0,3.0
405.0,1.0,0.0,35.0,25.0,0.0,3.0
406.0,1.0,0.0,35.0,25.0,0.0,3.0
407.0,1.0,0.0,36.0,26.0,0.0,3.0
408.0,1.0,0.0,36.0,26.0,0.0,3.0
409.0,1.0,0.0,36.0,26.0,0.0,3.0
410.0,1.0,0.0,36.0,26.0,0.0,3.0
411.0,1.0,0.0,36.0,26.0,0.0,3.0
412.0,1.0,0.0,36.0,26.0,0.0,3.0
413.0,1.0,0.0,36.0,26.0,0.0,3.0
414.0,1.0,0.0,36.0,26.0,0.0,3.0
415.0,1.0,0.0,36.0,26.0,0.0,3.0
416.0,1.0,0.0,36.0,26.0,0.0,3.0
417.0,1.0,1.0,36.0,27.0,1.0,3.0
418.0,1.0,1.0,37.0,27.0,1.0,3.0
419.0,1.0,1.0,37.0,27.0,1.0,3.0
420.0,1.0,1.0,37.0,27.0,1.0,3.0
421.0,1.0,1.0,38.0,27.0,1.0,3.0
422.0,1.0,1.0,38.0,27.0,1.0,3.0
423.0,1.0,1.0,38.0,27.0,1.0,3.0
424.0,1.0,1.0,38.0,28.0,1.0,3.0
425.0,1.0,1.0,38.0,28.0,1.0,3.0
426.0,1.0,1.0,38.0,28.0,1.0,3.0
427.0,1.0,1.0,39.0,28.0,1.0,3.0
428.0,1.0,1.0,39.0,28.0,1.0,3.0
429.0,1.0,1.0,39.0,28.0,1.0,3.0
430.0,1.0,1.0,39.0,28.0,1.0,3.0
431.0,1.0,1.0,40.0,28.0,1.0,3.0
432.0,1.0,1.0,40.0,28.0,1.0,3.0
433.0,1.0,1.0,40.0,28.0,1.0,3.0
434.0,1.0,1.0,40.0,28.0,1.0,3.0
435.0,1.0,1.0,40.0,28.0,1.0,3.0
436.0,1.0,1.0,41.0,28.0,1.0,3.0
437.0,1.0,1.0,41.0,28.0,1.0,3.0
438.0,1.0,1.0,41.0,28.0,1.0,3.0
439.0,1.0,1.0,41.0,28.0,1.0,3.0
440.0,1.0,1.0,41.0,28.0,1.0,3.0
441.0,1.0,1.0,41.0,28.0,1.0,3.0
442.0,1.0,1.0,41.0,28.0,1.0,3.0
443.0,1.0,1.0,41.0,28.0,1.0,3.0
444.0,1.0,1.0,41.0,29.0,1.0,3.0
445.0,1.0,1.0,41.0,29.0,1.0,3.0
446.0,1.0,1.0,41.0,29.0,1.0,3.0
447.0,1.0,1.0,41.0,29.0,1.0,3.0
448.0,1.0,1.0,41.0,29.0,1.0,3.0
449.0,1.0,1.0,41.0,29.0,1.0,3.0
450.0,1.0,1.0,41.0,29.0,1.0,3.0
451.0,1.0,1.0,41.0,29.0,1.0,3.0
452.0,2.0,1.0,41.0,29.0,1.0,3.0
453.0,2.0,1.0,41.0,29.0,1.0,3.0
454.0,2.0,1.0,41.0,29.0,1.0,3.0
455.0,2.0,1.0,41.0,29.0,1.0,3.0
456.0,2.0,1.0,41.0,29.0,1.0,3.0
457.0,2.0,1.0,41.0,29.0,1.0,3.0
458.0,2.0,1.0,41.0,29.0,1.0,3.0
459.0,2.0,1.0,42.0,29.0,1.0,3.0
460.0,2.0,1.0,42.0,29.0,1.0,3.0
461.0,2.0,1.0,43.0,29.0,1.0,3.0
462.0,2.0,1.0,43.0,29.0,1.0,3.0
463.0,2.0,1.0,43.0,29.0,1.0,3.0
464.0,2.0,1.0,43.0,29.0,1.0,3.0
465.0,2.0,1.0,43.0,29.0,1.0,3.0
466.0,2.0,1.0,43.0,29.0,1.0,3.0
467.0,2.0,1.0,43.0,29.0,1.0,3.0
468.0,2.0,1.0,43.0,29.0,2.0,3.0
469.0,2.0,1.0,45.0,29.0,2.0,3.0
470.0,2.0,1.0,45.0,29.0,2.0,3.0
471.0,2.0,1.0,45.0,29.0,2.0,3.0
472.0,2.0,1.0,45.0,29.0,2.0,3.0
473.0,2.0,1.0,45.0,29.0,2.0,3.0
474.0,2.0,1.0,45.0,29.0,2.0,3.0
475.0,2.0,1.0,46.0,29.0,2.0,3.0
476.0,2.0,1.0,46.0,29.0,2.0,3.0
477.0,2.0,1.0,46.0,29.0,2.0,3.0
478.0,2.0,1.0,46.0,29.0,2.0,3.0
479.0,2.0,1.0,46.0,29.0,2.0,3.0
480.0,2.0,1.0,46.0,29.0,2.0,3.0
481.0,2.0,1.0,46.0,29.0,2.0,3.0
482.0,2.0,1.0,46.0,29.0,2.0,3.0
483.0,2.0,1.0,46.0,29.0,2.0,3.0
484.0,2.0,1.0,46.0,29.0,2.0,3.0
485.0,2.0,1.0,46.0,29.0,2.0,3.0
486.0,2.0,1.0,46.0,29.0,2.0,3.0
487.0,2.0,1.0,46.0,29.0,2.0,3.0
488.0,2.0,1.0,46.0,29.0,2.0,3.0
489.0,2.0,1.0,46.0,29.0,2.0,3.0
490.0,2.0,1.0,46.0,29.0,2.0,3.0
491.0,2.0,1.0,46.0,29.0,2.0,3.0
492.0,2.0,1.0,47.0,29.0,2.0,3.0
493.0,2.0,1.0,47.0,29.0,2.0,3.0
494.0,2.0,1.0,47.0,29.0,2.0,3.0
495.0,3.0,1.0,47.0,29.0,2.0,3.0
496.0,3.0,1.0,47.0,29.0,2.0,3.0
497.0,3.0,1.0,47.0,30.0,2.0,3.0
498.0,3.0,1.0,47.0,30.0,2.0,3.0
499.0,3.0,1.0,47.0,30.0,2.0,3.0
500.0,3.0,1.0,47.0,30.0,2.0,3.0
501.0,4.0,1.0,47.0,31.0,2.0,3.0
502.0,4.0,1.0,47.0,31.0,2.0,3.0
503.0,4.0,1.0,48.0,31.0,2.0,3.0
504.0,4.0,1.0,48.0,31.0,2.0,3.0
505.0,4.0,1.0,48.0,32.0,2.0,3.0
506.0,4.0,1.0,48.0,32.0,2.0,3.0
507.0,4.0,1.0,48.0,32.0,2.0,3.0
508.0,4.0,1.0,48.0,32.0,2.0,3.0
509.0,4.0,1.0,48.0,32.0,2.0,3.0
510.0,4.0,1.0,48.0,32.0,2.0,3.0
511.0,4.0,1.0,48.0,32.0,2.0,3.0
512.0,4.0,1.0,48.0,32.0,2.0,3.0
513.0,4.0,1.0,48.0,32.0,2.0,3.0
514.0,4.0,1.0,48.0,32.0,2.0,3.0
515.0,4.0,1.0,48.0,32.0,2.0,3.0
516.0,4.0,1.0,48.0,32.0,2.0,3.0
517.0,4.0,1.0,48.0,32.0,2.0,3.0
518.0,4.0,1.0,48.0,32.0,2.0,3.0
519.0,4.0,1.0,48.0,32.0,2.0,3.0
520.0,4.0,1.0,48.0,32.0,2.0,3.0
521.0,5.0,1.0,50.0,32.0,3.0,3.0
522.0,5.0,1.0,50.0,32.0,3.0,3.0
523.0,5.0,1.0,50.0,32.0,3.0,3.0
524.0,5.0,1.0,50.0,32.0,3.0,3.0
525.0,5.0,1.0,50.0,32.0,3.0,3.0
526.0,5.0,1.0,50.0,32.0,3.0,3.0
527.0,5.0,1.0,51.0,32.0,3.0,3.0
528.0,5.0,1.0,51.0,32.0,3.0,3.0
529.0,5.0,1.0,51.0,32.0,3.0,3.0
530.0,5.0,1.0,51.0,32.0,3.0,3.0
531.0,5.0,1.0,51.0,32.0,3.0,3.0
532.0,5.0,2.0,51.0,32.0,3.0,3.0
533.0,5.0,2.0,51.0,32.0,3.0,3.0
534.0,5.0,2.0,51.0,33.0,3.0,3.0
535.0,5.0,2.0,51.0,33.0,3.0,3.0
536.0,5.0,2.0,52.0,33.0,3.0,3.0
537.0,5.0,2.0,52.0,33.0,3.0,3.0
538.0,5.0,2.0,52.0,33.0,3.0,3.0
539.0,5.0,2.0,52.0,33.0,3.0,3.0
540.0,5.0,2.0,52.0,33.0,3.0,3.0
541.0,5.0,2.0,52.0,33.0,3.0,3.0
542.0,5.0,2.0,52.0,34.0,3.0,3.0
543.0,5.0,2.0,52.0,34.0,3.0,3.0
544.0,5.0,2.0,52.0,34.0,3.0,3.0
545.0,5.0,2.0,52.0,34.0,3.0,3.0
546.0,6.0,2.0,52.0,34.0,3.0,3.0
547.0,6.0,2.0,52.0,34.0,3.0,3.0
548.0,6.0,2.0,52.0,34.0,3.0,3.0
549.0,6.0,2.0,52.0,34.0,4.0,3.0
550.0,6.0,2.0,52.0,34.0,4.0,3.0
551.0,6.0,2.0,52.0,34.0,4.0,3.0
552.0,6.0,2.0,52.0,34.0,4.0,3.0
553.0,6.0,2.0,52.0,34.0,4.0,3.0
554.0,6.0,2.0,52.0,34.0,4.0,3.0
555.0,6.0,2.0,52.0,34.0,4.0,3.0
556.0,6.0,2.0,52.0,34.0,4.0,3.0
557.0,6.0,2.0,52.0,34.0,4.0,3.0
558.0,6.0,2.0,52.0,34.0,4.0,3.0
559.0,6.0,2.0,52.0,34.0,4.0,3.0
560.0,6.0,2.0,52.0,34.0,4.0,3.0
561.0,6.0,2.0,52.0,34.0,4.0,3.0
562.0,6.0,2.0,52.0,34.0,4.0,3.0
563.0,6.0,2.0,52.0,34.0,4.0,3.0
564.0,6.0,2.0,52.0,34.0,4.0,3.0
565.0,6.0,2.0,52.0,34.0,4.0,3.0
566.0,6.0,2.0,53.0,34.0,4.0,3.0
567.0,6.0,2.0,53.0,34.0,4.0,3.0
568.0,6.0,2.0,53.0,34.0,4.0,3.0
569.0,6.0,2.0,53.0,34.0,4.0,3.0
570.0,6.0,2.0,53.0,34.0,4.0,3.0
571.0,6.0,2.0,53.0,34.0,4.0,3.0
572.0,6.0,2.0,53.0,34.0,4.0,3.0
573.0,7.0,2.0,54.0,34.0,4.0,3.0
574.0,7.0,2.0,54.0,34.0,4.0,3.0
575.0,7.0,2.0,54.0,34.0,4.0,3.0
576.0,7.0,2.0,55.0,34.0,4.0,3.0
577.0,7.0,2.0,55.0,34.0,4.0,3.0
578.0,7.0,2.0,55.0,34.0,4.0,3.0
579.0,7.0,2.0,55.0,34.0,4.0,3.0
580.0,7.0,2.0,55.0,34.0,4.0,3.0
581.0,7.0,2.0,55.0,34.0,4.0,3.0
582.0,7.0,2.0,56.0,34.0,4.0,3.0
583.0,7.0,2.0,57.0,34.0,4.0,3.0
584.0,7.0,2.0,57.0,34.0,4.0,3.0
585.0,7.0,2.0,57.0,34.0,4.0,3.0
586.0,7.0,2.0,57.0,34.0,4.0,3.0
587.0,7.0,2.0,57.0,34.0,4.0,3.0
588.0,7.0,2.0,57.0,34.0,4.0,3.0
589.0,7.0,2.0,57.0,34.0,4.0,3.0
590.0,7.0,2.0,57.0,34.0,4.0,3.0
591.0,7.0,2.0,58.0,34.0,4.0,3.0
592.0,7.0,2.0,58.0,34.0,4.0,3.0
593.0,7.0,2.0,58.0,34.0,4.0,3.0
594.0,7.0,2.0,58.0,34.0,4.0,3.0
595.0,7.0,2.0,59.0,34.0,4.0,3.0
596.0,7.0,2.0,59.0,34.0,4.0,3.0
597.0,7.0,2.0,59.0,34.0,4.0,3.0
598.0,7.0,2.0,59.0,34.0,4.0,3.0
599.0,7.0,2.0,59.0,34.0,4.0,3.0
600.0,7.0,2.0,59.0,34.0,4.0,3.0
601.0,7.0,2.0,59.0,34.0,4.0,3.0
602.0,7.0,2.0,59.0,34.0,4.0,3.0
603.0,7.0,2.0,59.0,34.0,4.0,3.0
604.0,7.0,2.0,59.0,34.0,4.0,3.0
605.0,7.0,2.0,59.0,34.0,4.0,3.0
606.0,7.0,2.0,59.0,34.0,4.0,3.0
607.0,7.0,2.0,59.0,34.0,4.0,3.0
608.0,7.0,2.0,59.0,34.0,4.0,3.0
609.0,7.0,2.0,59.0,34.0,4.0,3.0
610.0,7.0,2.0,59.0,34.0,4.0,3.0
611.0,7.0,2.0,59.0,34.0,4.0,3.0
612.0,7.0,2.0,59.0,34.0,4.0,3.0
613.0,7.0,2.0,59.0,34.0,4.0,3.0
614.0,7.0,2.0,59.0,34.0,4.0,3.0
615.0,7.0,2.0,59.0,34.0,4.0,3.0
616.0,7.0,2.0,59.0,34.0,4.0,3.0
617.0,7.0,2.0,59.0,34.0,4.0,3.0
618.0,7.0,2.0,59.0,34.0,4.0,3.0
619.0,7.0,2.0,60.0,34.0,4.0,3.0
620.0,7.0,2.0,62.0,34.0,4.0,3.0
621.0,7.0,2.0,62.0,34.0,4.0,3.0
622.0,7.0,2.0,62.0,34.0,4.0,3.0
623.0,7.0,2.0,62.0,34.0,4.0,3.0
624.0,7.0,2.0,62.0,34.0,4.0,3.0
625.0,7.0,2.0,62.0,34.0,4.0,3.0
626.0,7.0,2.0,62.0,34.0,4.0,3.0
627.0,7.0,2.0,62.0,34.0,4.0,3.0
628.0,7.0,2.0,62.0,34.0,4.0,3.0
629.0,7.0,2.0,62.0,34.0,4.0,3.0
630.0,7.0,2.0,63.0,34.0,4.0,3.0
631.0,7.0,2.0,63.0,34.0,4.0,3.0
632.0,7.0,2.0,63.0,34.0,4.0,3.0
633.0,7.0,2.0,65.0,34.0,4.0,3.0
634.0,7.0,2.0,65.0,34.0,4.0,3.0
635.0,7.0,2.0,65.0,34.0,4.0,3.0
636.0,7.0,2.0,65.0,34.0,4.0,3.0
637.0,7.0,2.0,65.0,34.0,4.0,3.0
638.0,7.0,2.0,65.0,34.0,4.0,3.0
639.0,7.0,2.0,65.0,34.0,4.0,3.0
640.0,8.0,2.0,65.0,34.0,5.0,3.0
641.0,8.0,2.0,65.0,34.0,5.0,3.0
642.0,8.0,2.0,65.0,34.0,5.0,3.0
643.0,8.0,2.0,65.0,34.0,5.0,3.0
644.0,8.0,2.0,66.0,34.0,5.0,3.0
645.0,8.0,2.0,66.0,34.0,5.0,3.0
646.0,8.0,2.0,67.0,34.0,5.0,3.0
647.0,8.0,2.0,68.0,34.0,5.0,3.0
648.0,8.0,2.0,68.0,34.0,5.0,3.0
649.0,8.0,2.0,68.0,34.0,5.0,3.0
650.0,8.0,2.0,68.0,34.0,5.0,3.0
651.0,9.0,2.0,68.0,34.0,5.0,3.0
652.0,9.0,2.0,68.0,34.0,5.0,3.0
653.0,9.0,2.0,68.0,34.0,5.0,3.0
654.0,9.0,2.0,68.0,34.0,5.0,3.0
655.0,9.0,2.0,68.0,34.0,5.0,3.0
656.0,9.0,2.0,68.0,34.0,5.0,3.0
657.0,9.0,2.0,68.0,34.0,5.0,3.0
658.0,9.0,2.0,68.0,34.0,5.0,3.0
659.0,9.0,2.0,69.0,34.0,5.0,3.0
660.0,9.0,2.0,69.0,34.0,5.0,3.0
661.0,9.0,2.0,69.0,34.0,5.0,3.0
662.0,9.0,2.0,70.0,34.0,5.0,3.0
663.0,9.0,2.0,70.0,34.0,5.0,3.0
664.0,9.0,2.0,70.0,34.0,5.0,3.0
665.0,9.0,2.0,70.0,34.0,5.0,3.0
666.0,9.0,2.0,70.0,34.0,5.0,3.0
667.0,9.0,2.0,71.0,34.0,5.0,3.0
668.0,9.0,2.0,71.0,34.0,5.0,3.0
669.0,9.0,2.0,71.0,34.0,5.0,3.0
670.0,9.0,2.0,71.0,34.0,5.0,3.0
671.0,9.0,2.0,71.0,34.0,5.0,3.0
672.0,9.0,2.0,71.0,34.0,5.0,3.0
673.0,9.0,2.0,71.0,34.0,5.0,3.0
674.0,9.0,2.0,71.0,34.0,5.0,3.0
675.0,9.0,2.0,71.0,34.0,5.0,3.0
676.0,9.0,2.0,71.0,34.0,5.0,3.0
677.0,9.0,2.0,72.0,34.0,6.0,3.0
678.0,9.0,2.0,72.0,34.0,6.0,3.0
679.0,9.0,2.0,72.0,34.0,6.0,3.0
680.0,9.0,2.0,72.0,34.0,6.0,3.0
681.0,9.0,2.0,72.0,34.0,6.0,3.0
682.0,9.0,2.0,72.0,34.0,6.0,3.0
683.0,9.0,2.0,72.0,34.0,6.0,3.0
684.0,9.0,2.0,72.0,34.0,6.0,3.0
685.0,9.0,2.0,72.0,34.0,6.0,3.0
686.0,9.0,2.0,72.0,34.0,6.0,3.0
687.0,9.0,2.0,72.0,34.0,6.0,3.0
688.0,9.0,2.0,72.0,34.0,6.0,3.0
689.0,9.0,2.0,72.0,34.0,6.0,3.0
690.0,9.0,2.0,73.0,34.0,6.0,3.0
691.0,9.0,2.0,74.0,34.0,6.0,3.0
692.0,10.0,2.0,75.0,34.0,6.0,3.0
693.0,10.0,2.0,75.0,34.0,6.0,3.0
694.0,10.0,2.0,75.0,34.0,6.0,3.0
695.0,10.0,2.0,75.0,34.0,6.0,3.0
696.0,10.0,2.0,75.0,34.0,6.0,3.0
697.0,10.0,2.0,77.0,34.0,6.0,3.0
698.0,10.0,2.0,77.0,34.0,6.0,3.0
699.0,10.0,2.0,77.0,34.0,6.0,3.0
700.0,10.0,2.0,77.0,34.0,6.0,3.0
701.0,10.0,2.0,77.0,34.0,6.0,3.0
702.0,10.0,2.0,77.0,34.0,6.0,3.0
703.0,10.0,2.0,79.0,34.0,6.0,3.0
704.0,10.0,2.0,79.0,34.0,6.0,3.0
705.0,10.0,2.0,79.0,34.0,6.0,3.0
706.0,10.0,2.0,79.0,34.0,6.0,3.0
707.0,10.0,2.0,79.0,34.0,6.0,3.0
708.0,10.0,2.0,79.0,34.0,6.0,3.0
709.0,10.0,2.0,79.0,34.0,6.0,3.0
710.0,10.0,2.0,79.0,34.0,6.0,3.0
711.0,10.0,2.0,79.0,34.0,6.0,3.0
712.0,10.0,2.0,79.0,35.0,6.0,3.0
713.0,10.0,2.0,79.0,35.0,6.0,3.0
714.0,10.0,2.0,79.0,35.0,6.0,3.0
715.0,11.0,2.0,79.0,35.0,6.0,3.0
716.0,11.0,2.0,79.0,35.0,6.0,3.0
717.0,11.0,2.0,79.0,36.0,6.0,3.0
718.0,11.0,2.0,79.0,36.0,6.0,3.0
719.0,11.0,2.0,79.0,36.0,6.0,3.0
720.0,11.0,2.0,80.0,36.0,6.0,3.0
721.0,11.0,2.0,80.0,36.0,6.0,3.0
722.0,11.0,2.0,80.0,36.0,6.0,3.0
723.0,11.0,2.0,80.0,36.0,6.0,3.0
724.0,11.0,2.0,80.0,36.0,6.0,3.0
725.0,11.0,2.0,80.0,36.0,6.0,3.0
726.0,11.0,2.0,80.0,36.0,6.0,3.0
727.0,11.0,2.0,81.0,36.0,6.0,3.0
728.0,11.0,2.0,81.0,36.0,6.0,3.0
729.0,11.0,2.0,81.0,36.0,6.0,3.0
730.0,11.0,2.0,81.0,36.0,6.0,3.0
731.0,11.0,2.0,81.0,36.0,6.0,3.0
732.0,11.0,2.0,81.0,36.0,6.0,3.0
733.0,11.0,2.0,81.0,36.0,6.0,3.0
734.0,11.0,2.0,81.0,36.0,6.0,3.0
735.0,11.0,2.0,81.0,36.0,6.0,3.0
736.0,11.0,2.0,82.0,36.0,6.0,3.0
737.0,11.0,2.0,82.0,36.0,6.0,3.0
738.0,11.0,2.0,82.0,36.0,6.0,3.0
739.0,11.0,2.0,82.0,37.0,6.0,3.0
740.0,11.0,2.0,82.0,37.0,6.0,3.0
741.0,11.0,2.0,82.0,37.0,6.0,3.0
742.0,11.0,2.0,82.0,37.0,6.0,3.0
743.0,11.0,2.0,82.0,37.0,6.0,3.0
744.0,11.0,2.0,82.0,38.0,6.0,3.0
745.0,11.0,2.0,82.0,38.0,6.0,3.0
746.0,11.0,2.0,82.0,38.0,6.0,3.0
747.0,11.0,2.0,82.0,38.0,6.0,3.0
748.0,11.0,2.0,82.0,38.0,6.0,3.0
749.0,11.0,2.0,82.0,38.0,6.0,3.0
750.0,12.0,2.0,83.0,38.0,6.0,3.0
751.0,12.0,2.0,83.0,38.0,6.0,3.0
752.0,12.0,2.0,84.0,38.0,6.0,3.0
753.0,12.0,2.0,84.0,38.0,6.0,3.0
754.0,12.0,2.0,84.0,38.0,6.0,3.0
755.0,12.0,2.0,84.0,39.0,6.0,3.0
756.0,12.0,2.0,84.0,39.0,6.0,3.0
757.0,12.0,2.0,84.0,39.0,6.0,3.0
758.0,12.0,2.0,84.0,39.0,6.0,3.0
759.0,12.0,2.0,84.0,39.0,6.0,3.0
760.0,12.0,2.0,84.0,39.0,6.0,3.0
761.0,12.0,2.0,84.0,39.0,6.0,3.0
762.0,12.0,2.0,84.0,39.0,6.0,3.0
763.0,12.0,2.0,84.0,39.0,6.0,3.0
764.0,12.0,2.0,84.0,39.0,6.0,3.0
765.0,12.0,2.0,84.0,39.0,6.0,3.0
766.0,12.0,2.0,85.0,39.0,6.0,3.0
767.0,12.0,2.0,85.0,39.0,6.0,3.0
768.0,12.0,2.0,85.0,39.0,6.0,3.0
769.0,12.0,2.0,85.0,39.0,6.0,3.0
770.0,12.0,2.0,85.0,39.0,6.0,3.0
771.0,12.0,2.0,85.0,39.0,6.0,3.0
772.0,12.0,2.0,85.0,39.0,6.0,3.0
773.0,12.0,2.0,85.0,39.0,6.0,3.0
774.0,12.0,2.0,85.0,39.0,6.0,3.0
775.0,12.0,2.0,85.0,39.0,6.0,3.0
776.0,12.0,2.0,85.0,39.0,6.0,3.0
777.0,12.0,2.0,85.0,39.0,6.0,3.0
778.0,12.0,2.0,87.0,39.0,6.0,3.0
779.0,12.0,2.0,87.0,39.0,6.0,3.0
780.0,12.0,2.0,87.0,39.0,6.0,3.0
781.0,12.0,2.0,87.0,39.0,6.0,3.0
782.0,12.0,2.0,87.0,39.0,6.0,3.0
783.0,12.0,2.0,87.0,39.0,6.0,3.0
784.0,12.0,2.0,87.0,39.0,6.0,3.0
785.0,12.0,2.0,87.0,39.0,6.0,3.0
786.0,12.0,2.0,87.0,39.0,6.0,3.0
787.0,12.0,2.0,87.0,39.0,6.0,3.0
788.0,12.0,2.0,87.0,39.0,6.0,3.0
789.0,12.0,2.0,87.0,40.0,6.0,3.0
790.0,12.0,2.0,87.0,40.0,6.0,3.0
791.0,12.0,2.0,87.0,40.0,6.0,3.0
792.0,12.0,2.0,87.0,40.0,6.0,3.0
793.0,12.0,2.0,87.0,41.0,6.0,3.0
794.0,12.0,2.0,87.0,41.0,6.0,3.0
795.0,12.0,2.0,87.0,41.0,6.0,3.0
796.0,12.0,2.0,87.0,41.0,6.0,3.0
797.0,12.0,2.0,87.0,41.0,6.0,3.0
798.0,12.0,2.0,87.0,41.0,6.0,3.0
799.0,12.0,2.0,87.0,41.0,6.0,3.0
800.0,12.0,2.0,87.0,41.0,6.0,3.0
801.0,12.0,2.0,87.0,41.0,6.0,3.0
802.0,12.0,2.0,87.0,41.0,6.0,3.0
803.0,12.0,3.0,87.0,41.0,6.0,3.0
804.0,12.0,3.0,87.0,41.0,6.0,3.0
805.0,12.0,3.0,87.0,41.0,6.0,3.0
806.0,12.0,3.0,87.0,41.0,6.0,3.0
807.0,12.0,3.0,87.0,41.0,6.0,3.0
808.0,12.0,3.0,87.0,41.0,6.0,3.0
809.0,12.0,3.0,87.0,41.0,6.0,3.0
810.0,12.0,3.0,87.0,41.0,6.0,3.0
811.0,12.0,3.0,87.0,41.0,6.0,3.0
812.0,12.0,3.0,87.0,41.0,6.0,3.0
813.0,12.0,3.0,87.0,41.0,6.0,3.0
814.0,12.0,3.0,88.0,41.0,6.0,3.0
815.0,12.0,3.0,88.0,41.0,6.0,3.0
816.0,12.0,3.0,88.0,41.0,6.0,3.0
817.0,12.0,3.0,89.0,41.0,6.0,3.0
818.0,12.0,3.0,89.0,41.0,6.0,3.0
819.0,12.0,3.0,89.0,42.0,6.0,3.0
820.0,12.0,3.0,90.0,42.0,6.0,3.0
821.0,12.0,3.0,90.0,42.0,6.0,3.0
822.0,12.0,3.0,90.0,42.0,6.0,3.0
823.0,12.0,3.0,90.0,42.0,6.0,3.0
824.0,12.0,3.0,90.0,42.0,6.0,3.0
825.0,12.0,3.0,90.0,42.0,6.0,3.0
826.0,12.0,3.0,90.0,42.0,6.0,3.0
827.0,12.0,3.0,90.0,42.0,6.0,3.0
828.0,12.0,3.0,90.0,43.0,6.0,3.0
829.0,12.0,3.0,90.0,43.0,6.0,3.0
830.0,12.0,3.0,90.0,43.0,6.0,3.0
831.0,12.0,3.0,90.0,43.0,6.0,3.0
832.0,12.0,3.0,90.0,43.0,6.0,3.0
833.0,12.0,3.0,90.0,44.0,6.0,3.0
834.0,12.0,3.0,90.0,44.0,6.0,3.0
835.0,12.0,3.0,90.0,44.0,6.0,3.0
836.0,12.0,3.0,90.0,44.0,6.0,3.0
837.0,12.0,3.0,90.0,44.0,6.0,3.0
838.0,12.0,3.0,90.0,44.0,6.0,3.0
839.0,12.0,3.0,90.0,44.0,6.0,3.0
840.0,12.0,3.0,90.0,44.0,6.0,3.0
841.0,12.0,3.0,90.0,44.0,6.0,3.0
842.0,12.0,3.0,91.0,44.0,6.0,3.0
843.0,12.0,3.0,91.0,44.0,6.0,3.0
844.0,12.0,3.0,91.0,44.0,6.0,3.0
845.0,12.0,3.0,91.0,44.0,6.0,3.0
846.0,12.0,3.0,91.0,44.0,6.0,3.0
847.0,12.0,3.0,91.0,44.0,6.0,3.0
848.0,12.0,3.0,91.0,44.0,6.0,3.0
849.0,12.0,3.0,91.0,44.0,6.0,3.0
850.0,12.0,3.0,91.0,45.0,6.0,3.0
851.0,12.0,3.0,91.0,45.0,6.0,3.0
852.0,12.0,3.0,91.0,45.0,6.0,3.0
853.0,12.0,3.0,91.0,45.0,6.0,3.0
854.0,12.0,3.0,91.0,45.0,6.0,3.0
855.0,12.0,3.0,91.0,45.0,6.0,3.0
856.0,12.0,3.0,92.0,45.0,6.0,3.0
857.0,12.0,3.0,92.0,45.0,6.0,3.0
858.0,12.0,3.0,92.0,45.0,6.0,3.0
859.0,12.0,3.0,92.0,45.0,6.0,3.0
860.0,12.0,3.0,92.0,45.0,6.0,3.0
861.0,12.0,3.0,92.0,45.0,6.0,3.0
862.0,12.0,3.0,92.0,45.0,6.0,3.0
863.0,12.0,3.0,92.0,45.0,6.0,3.0
864.0,12.0,3.0,92.0,45.0,6.0,3.0
865.0,12.0,3.0,92.0,45.0,6.0,3.0
866.0,12.0,3.0,93.0,46.0,6.0,3.0
867.0,12.0,3.0,93.0,46.0,6.0,3.0
868.0,12.0,3.0,93.0,46.0,6.0,3.0
869.0,12.0,3.0,93.0,46.0,6.0,3.0
870.0,12.0,3.0,93.0,46.0,6.0,3.0
871.0,12.0,3.0,93.0,47.0,6.0,3.0
872.0,12.0,3.0,93.0,47.0,6.0,3.0
873.0,12.0,3.0,93.0,47.0,6.0,3.0
874.0,12.0,3.0,93.0,47.0,6.0,3.0
875.0,12.0,3.0,94.0,48.0,6.0,3.0
876.0,12.0,3.0,94.0,49.0,6.0,3.0
877.0,12.0,3.0,94.0,49.0,6.0,3.0
878.0,12.0,3.0,94.0,49.0,6.0,3.0
879.0,12.0,3.0,95.0,49.0,6.0,3.0
880.0,12.0,3.0,95.0,49.0,6.0,3.0
881.0,12.0,3.0,96.0,49.0,6.0,3.0
882.0,12.0,3.0,96.0,49.0,6.0,3.0
883.0,12.0,3.0,96.0,49.0,7.0,3.0
884.0,12.0,3.0,96.0,49.0,7.0,3.0
885.0,12.0,3.0,97.0,49.0,8.0,3.0
886.0,12.0,3.0,97.0,49.0,8.0,3.0
887.0,12.0,3.0,97.0,49.0,8.0,3.0
888.0,12.0,3.0,97.0,50.0,8.0,3.0
889.0,12.0,3.0,97.0,50.0,8.0,3.0
890.0,12.0,3.0,97.0,51.0,8.0,3.0
891.0,12.0,3.0,97.0,51.0,8.0,3.0
892.0,12.0,3.0,97.0,51.0,8.0,3.0
893.0,12.0,3.0,97.0,51.0,8.0,3.0
894.0,12.0,3.0,97.0,51.0,8.0,3.0
895.0,12.0,3.0,97.0,51.0,8.0,3.0
896.0,12.0,3.0,97.0,51.0,8.0,3.0
897.0,12.0,3.0,97.0,51.0,8.0,3.0
898.0,12.0,3.0,98.0,51.0,8.0,3.0
899.0,12.0,4.0,98.0,51.0,8.0,3.0
900.0,12.0,4.0,98.0,51.0,8.0,3.0
901.0,12.0,4.0,99.0,51.0,8.0,3.0
902.0,12.0,4.0,99.0,51.0,8.0,3.0
903.0,12.0,4.0,99.0,52.0,9.0,3.0
904.0,12.0,4.0,99.0,52.0,9.0,3.0
905.0,12.0,4.0,99.0,52.0,9.0,3.0
906.0,12.0,4.0,99.0,52.0,9.0,3.0
907.0,12.0,4.0,99.0,52.0,9.0,3.0
908.0,12.0,4.0,99.0,52.0,9.0,3.0
909.0,12.0,4.0,99.0,53.0,9.0,3.0
910.0,12.0,4.0,99.0,53.0,9.0,3.0
911.0,12.0,4.0,99.0,53.0,9.0,3.0
912.0,12.0,4.0,99.0,53.0,9.0,3.0
913.0,12.0,4.0,99.0,53.0,9.0,3.0
914.0,12.0,4.0,99.0,53.0,9.0,3.0
915.0,12.0,4.0,99.0,53.0,9.0,3.0
916.0,12.0,4.0,99.0,53.0,9.0,3.0
917.0,12.0,4.0,99.0,54.0,9.0,3.0
918.0,12.0,4.0,99.0,54.0,9.0,3.0
919.0,12.0,4.0,99.0,54.0,9.0,3.0
920.0,12.0,4.0,99.0,54.0,9.0,3.0
921.0,12.0,4.0,99.0,54.0,9.0,3.0
922.0,12.0,4.0,99.0,54.0,9.0,3.0
923.0,12.0,4.0,99.0,54.0,9.0,3.0
924.0,12.0,4.0,99.0,54.0,9.0,3.0
925.0,12.0,4.0,99.0,54.0,9.0,3.0
926.0,12.0,4.0,99.0,54.0,10.0,3.0
927.0,12.0,4.0,99.0,54.0,10.0,3.0
928.0,12.0,4.0,99.0,54.0,10.0,3.0
929.0,12.0,4.0,99.0,54.0,10.0,3.0
930.0,12.0,4.0,99.0,54.0,10.0,3.0
931.0,12.0,4.0,99.0,54.0,10.0,3.0
932.0,12.0,4.0,99.0,54.0,10.0,3.0
933.0,12.0,4.0,99.0,54.0,10.0,3.0
934.0,12.0,4.0,99.0,55.0,10.0,3.0
935.0,12.0,4.0,99.0,55.0,10.0,3.0
936.0,12.0,5.0,99.0,55.0,10.0,3.0
937.0,12.0,5.0,99.0,55.0,10.0,3.0
938.0,12.0,5.0,99.0,55.0,10.0,3.0
939.0,12.0,5.0,99.0,55.0,10.0,3.0
940.0,12.0,5.0,99.0,55.0,10.0,3.0
941.0,12.0,5.0,99.0,55.0,10.0,3.0
942.0,12.0,5.0,99.0,55.0,10.0,3.0
943.0,12.0,5.0,100.0,56.0,10.0,3.0
944.0,12.0,5.0,100.0,56.0,10.0,3.0
945.0,12.0,5.0,100.0,57.0,10.0,3.0
946.0,12.0,5.0,101.0,58.0,10.0,3.0
947.0,12.0,5.0,101.0,59.0,10.0,3.0
948.0,12.0,5.0,101.0,59.0,10.0,3.0
949.0,12.0,5.0,101.0,59.0,10.0,3.0
950.0,12.0,5.0,101.0,59.0,10.0,3.0
951.0,12.0,5.0,101.0,59.0,10.0,3.0
952.0,12.0,5.0,101.0,59.0,10.0,3.0
953.0,12.0,5.0,101.0,59.0,10.0,3.0
954.0,12.0,5.0,101.0,59.0,10.0,3.0
955.0,12.0,5.0,101.0,59.0,10.0,3.0
956.0,12.0,5.0,101.0,59.0,10.0,3.0
957.0,12.0,5.0,101.0,59.0,10.0,3.0
958.0,12.0,5.0,101.0,59.0,10.0,3.0
959.0,12.0,5.0,101.0,60.0,10.0,3.0
960.0,12.0,5.0,101.0,60.0,10.0,3.0
961.0,12.0,5.0,101.0,60.0,10.0,3.0
962.0,12.0,5.0,101.0,60.0,10.0,3.0
963.0,12.0,5.0,101.0,60.0,10.0,3.0
964.0,12.0,5.0,101.0,60.0,10.0,3.0
965.0,12.0,5.0,101.0,60.0,10.0,3.0
966.0,12.0,5.0,101.0,60.0,10.0,3.0
967.0,12.0,5.0,101.0,60.0,10.0,3.0
968.0,12.0,5.0,101.0,60.0,10.0,3.0
969.0,12.0,5.0,101.0,60.0,10.0,3.0
970.0,12.0,5.0,101.0,60.0,10.0,3.0
971.0,12.0,5.0,101.0,60.0,10.0,3.0
972.0,12.0,5.0,101.0,61.0,10.0,3.0
973.0,12.0,5.0,101.0,61.0,10.0,3.0
974.0,12.0,5.0,101.0,61.0,10.0,3.0
975.0,12.0,5.0,101.0,61.0,10.0,3.0
976.0,12.0,5.0,101.0,61.0,10.0,3.0
977.0,12.0,5.0,101.0,61.0,10.0,3.0
978.0,12.0,5.0,101.0,61.0,10.0,3.0
979.0,12.0,5.0,101.0,61.0,10.0,3.0
980.0,12.0,5.0,101.0,61.0,10.0,3.0
981.0,12.0,5.0,101.0,61.0,10.0,3.0
982.0,12.0,5.0,101.0,61.0,10.0,3.0
983.0,12.0,5.0,101.0,61.0,10.0,3.0
984.0,12.0,5.0,101.0,61.0,10.0,3.0
985.0,12.0,5.0,101.0,61.0,10.0,3.0
986.0,12.0,5.0,101.0,61.0,10.0,3.0
987.0,12.0,5.0,101.0,61.0,10.0,3.0
988.0,12.0,5.0,101.0,61.0,11.0,3.0
989.0,12.0,5.0,101.0,61.0,11.0,3.0
990.0,12.0,5.0,101.0,61.0,11.0,3.0
991.0,12.0,5.0,102.0,61.0,11.0,3.0
992.0,12.0,6.0,102.0,61.0,11.0,3.0
993.0,12.0,6.0,102.0,62.0,11.0,3.0
994.0,12.0,6.0,102.0,62.0,11.0,3.0
995.0,12.0,6.0,102.0,63.0,11.0,3.0
996.0,12.0,6.0,102.0,63.0,11.0,3.0
997.0,12.0,6.0,102.0,63.0,11.0,3.0
998.0,12.0,6.0,102.0,63.0,11.0,3.0
999.0,12.0,6.0,103.0,63.0,11.0,3.0
1000.0,12.0,6.0,103.0,63.0,11.0,3.0
1001.0,12.0,6.0,103.0,63.0,11.0,3.0
1002.0,12.0,6.0,103.0,63.0,11.0,3.0
1003.0,12.0,6.0,103.0,63.0,11.0,3.0
1004.0,12.0,6.0,103.0,63.0,11.0,3.0
1005.0,12.0,6.0,103.0,63.0,11.0,3.0
1006.0,12.0,6.0,103.0,63.0,11.0,3.0
1007.0,12.0,6.0,103.0,63.0,11.0,3.0
1008.0,12.0,6.0,103.0,63.0,11.0,3.0
1009.0,12.0,6.0,103.0,63.0,11.0,3.0
1010.0,12.0,6.0,103.0,63.0,11.0,3.0
1011.0,12.0,6.0,103.0,63.0,11.0,3.0
1012.0,12.0,6.0,103.0,63.0,11.0,3.0
1013.0,12.0,6.0,104.0,63.0,11.0,3.0
1014.0,12.0,6.0,104.0,63.0,11.0,3.0
1015.0,12.0,6.0,104.0,63.0,11.0,3.0
1016.0,12.0,6.0,104.0,63.0,11.0,3.0
1017.0,12.0,6.0,104.0,63.0,11.0,3.0
1018.0,12.0,6.0,104.0,64.0,11.0,3.0
1019.0,12.0,6.0,104.0,64.0,11.0,3.0
1020.0,12.0,6.0,104.0,64.0,11.0,3.0
1021.0,12.0,6.0,104.0,64.0,11.0,3.0
1022.0,12.0,6.0,104.0,64.0,11.0,3.0
1023.0,12.0,6.0,104.0,64.0,11.0,3.0
1024.0,12.0,6.0,104.0,64.0,11.0,3.0
1025.0,12.0,6.0,104.0,64.0,11.0,3.0
1026.0,12.0,6.0,104.0,64.0,11.0,3.0
1027.0,12.0,6.0,104.0,64.0,11.0,3.0
1028.0,12.0,6.0,104.0,64.0,11.0,3.0
1029.0,12.0,6.0,104.0,64.0,11.0,3.0
1030.0,12.0,6.0,104.0,64.0,11.0,3.0
1031.0,12.0,6.0,104.0,64.0,11.0,3.0
1032.0,12.0,6.0,104.0,64.0,11.0,3.0
1033.0,12.0,6.0,104.0,64.0,11.0,3.0
1034.0,12.0,6.0,104.0,64.0,11.0,3.0
1035.0,12.0,6.0,104.0,64.0,11.0,3.0
1036.0,12.0,6.0,104.0,64.0,11.0,3.0
1037.0,12.0,6.0,104.0,64.0,11.0,3.0
1038.0,12.0,6.0,104.0,64.0,11.0,3.0
1039.0,12.0,6.0,104.0,64.0,11.0,3.0
1040.0,12.0,6.0,104.0,64.0,11.0,3.0
1041.0,12.0,6.0,104.0,64.0,11.0,3.0
1042.0,12.0,6.0,104.0,64.0,11.0,3.0
1043.0,12.0,6.0,104.0,64.0,11.0,3.0
1044.0,12.0,6.0,104.0,64.0,11.0,3.0
1045.0,12.0,6.0,104.0,64.0,11.0,3.0
1046.0,12.0,6.0,104.0,64.0,11.0,3.0
1047.0,12.0,6.0,104.0,64.0,11.0,3.0
1048.0,12.0,6.0,104.0,64.0,11.0,3.0
1049.0,12.0,6.0,104.0,64.0,11.0,3.0
1050.0,12.0,6.0,104.0,64.0,11.0,3.0
1051.0,12.0,6.0,104.0,64.0,11.0,3.0
1052.0,12.0,6.0,104.0,64.0,11.0,3.0
1053.0,12.0,6.0,104.0,64.0,11.0,3.0
1054.0,12.0,6.0,104.0,64.0,11.0,3.0
1055.0,12.0,6.0,104.0,64.0,11.0,3.0
1056.0,12.0,6.0,104.0,64.0,11.0,3.0
1057.0,12.0,6.0,104.0,64.0,11.0,3.0
1058.0,12.0,6.0,104.0,64.0,11.0,3.0
1059.0,12.0,6.0,104.0,64.0,11.0,3.0
1060.0,12.0,6.0,104.0,65.0,11.0,3.0
1061.0,12.0,6.0,104.0,65.0,11.0,3.0
1062.0,12.0,6.0,104.0,65.0,11.0,3.0
1063.0,12.0,6.0,104.0,65.0,11.0,3.0
1064.0,12.0,6.0,104.0,66.0,11.0,3.0
1065.0,12.0,6.0,104.0,66.0,11.0,3.0
1066.0,12.0,6.0,104.0,66.0,11.0,3.0
1067.0,12.0,6.0,104.0,66.0,11.0,3.0
1068.0,12.0,6.0,104.0,66.0,11.0,3.0
1069.0,12.0,6.0,104.0,66.0,11.0,3.0
1070.0,12.0,6.0,104.0,66.0,11.0,3.0
1071.0,12.0,6.0,104.0,66.0,11.0,3.0
1072.0,12.0,6.0,104.0,66.0,11.0,3.0
1073.0,12.0,6.0,104.0,66.0,11.0,3.0
1074.0,12.0,6.0,104.0,66.0,11.0,3.0
1075.0,12.0,6.0,104.0,66.0,11.0,3.0
1076.0,12.0,6.0,104.0,66.0,11.0,3.0
1077.0,12.0,6.0,104.0,67.0,11.0,3.0
1078.0,12.0,6.0,104.0,67.0,11.0,3.0
1079.0,12.0,6.0,104.0,67.0,11.0,3.0
1080.0,12.0,6.0,104.0,67.0,11.0,3.0
1081.0,12.0,6.0,104.0,67.0,11.0,3.0
1082.0,12.0,6.0,104.0,67.0,11.0,3.0
1083.0,12.0,6.0,104.0,67.0,11.0,3.0
1084.0,12.0,6.0,104.0,67.0,11.0,3.0
1085.0,12.0,6.0,104.0,67.0,11.0,3.0
1086.0,12.0,6.0,104.0,67.0,11.0,3.0
1087.0,12.0,6.0,104.0,67.0,11.0,3.0
1088.0,12.0,6.0,104.0,67.0,11.0,3.0
1089.0,12.0,6.0,104.0,67.0,11.0,3.0
1090.0,12.0,6.0,104.0,67.0,11.0,3.0
1091.0,12.0,6.0,104.0,67.0,11.0,3.0
1092.0,12.0,6.0,104.0,67.0,11.0,3.0
