"tick","perc BEV new","perc BEV occ","perc BEV lease"
1.0,1.0,2.5,0.0
2.0,1.0,2.5,0.0
3.0,1.0,2.5,0.0
4.0,1.0,2.5,0.0
5.0,1.0,2.5,0.0
6.0,1.0,2.5,0.0
7.0,1.0,2.5,0.0
8.0,1.0,2.5,0.0
9.0,1.0,2.5,0.0
10.0,1.0,2.5,0.0
11.0,1.0,2.5,0.0
12.0,1.0,2.5,0.0
13.0,1.0,2.5,0.0
14.0,1.0,2.5,0.0
15.0,1.0,2.5,0.0
16.0,1.0,2.5,0.0
17.0,1.0,2.5,0.0
18.0,1.0,2.5,0.0
19.0,1.0,2.5,0.0
20.0,1.0,2.5,0.0
21.0,1.0,2.5,0.0
22.0,1.0,2.5,0.0
23.0,1.0,2.5,0.0
24.0,1.0,2.5,0.0
25.0,1.0,2.5,0.0
26.0,1.0,2.5,0.0
27.0,1.0,2.5,0.0
28.0,1.0,2.5,0.0
29.0,1.0,2.5,0.0
30.0,1.0,2.5,0.0
31.0,1.0,2.5,0.0
32.0,1.0,2.5,0.0
33.0,1.0,2.5,0.0
34.0,1.0,2.5,0.0
35.0,1.0,2.5,0.0
36.0,1.0,2.5,0.0
37.0,1.0,2.5,0.0
38.0,1.0,2.5,0.0
39.0,1.0,2.5,0.0
40.0,1.0,2.5,0.0
41.0,1.0,2.5,0.0
42.0,1.0,2.5,0.0
43.0,1.0,2.5,0.0
44.0,1.0,2.5,0.0
45.0,1.0,2.5,0.0
46.0,1.0,2.5,0.0
47.0,1.0,2.5,0.0
48.0,1.0,2.5,0.0
49.0,1.0,2.5,0.0
50.0,1.0,2.5,0.0
51.0,1.0,2.5,0.0
52.0,1.0,2.5,0.0
53.0,1.0,2.5,0.0
54.0,1.0,2.5,0.0
55.0,1.0,2.5,0.0
56.0,1.0,2.5,0.0
57.0,1.0,2.5,0.0
58.0,1.0,2.5,0.0
59.0,1.0,2.5,0.0
60.0,1.0,2.5,0.0
61.0,1.0,2.5,0.0
62.0,1.0,2.5,0.0
63.0,1.0,2.5,0.0
64.0,1.0,2.5,0.0
65.0,1.0,2.5,0.0
66.0,1.0,2.5,0.0
67.0,1.0,2.5,0.0
68.0,1.0,2.5,0.0
69.0,1.0,2.5,0.0
70.0,1.0,2.5,0.0
71.0,1.0,2.5,0.0
72.0,1.0,2.5,0.0
73.0,1.0,2.5,0.0
74.0,1.0,2.5,0.0
75.0,1.0,2.5,0.0
76.0,1.0,2.5,0.0
77.0,1.0,2.5,0.0
78.0,1.0,2.5,0.0
79.0,1.0,2.5,0.0
80.0,1.0,2.5,0.0
81.0,1.0,2.5,0.0
82.0,1.0,2.5,0.0
83.0,1.0,2.5,0.0
84.0,1.0,2.5,0.0
85.0,1.0,2.5,0.0
86.0,1.0,2.5,0.0
87.0,1.0,2.5,0.0
88.0,1.0,2.5,0.0
89.0,1.0,2.5,0.0
90.0,1.0,2.5,0.0
91.0,1.0,2.5,0.0
92.0,1.0,2.5,0.0
93.0,1.0,2.5,0.0
94.0,1.0,2.5,0.0
95.0,1.0,2.5,0.0
96.0,1.0,2.5,0.0
97.0,1.0,2.5,0.0
98.0,1.0,2.5,0.0
99.0,1.0,2.5,0.0
100.0,1.0,2.5,0.0
101.0,1.0,2.5,0.0
102.0,1.0,2.5,0.0
103.0,1.0,2.5,0.0
104.0,1.0,2.5,0.0
105.0,1.0,2.5,0.0
106.0,1.0,2.5,0.0
107.0,1.0,2.5,0.0
108.0,1.0,2.5,0.0
109.0,1.0,2.5,0.0
110.0,1.0,2.5,0.0
111.0,1.0,2.5,0.0
112.0,1.0,2.5,0.0
113.0,1.0,2.5,0.0
114.0,1.0,2.5,0.0
115.0,1.0,2.5,0.0
116.0,1.0,2.5,0.0
117.0,1.0,2.5,0.0
118.0,1.0,2.5,0.0
119.0,1.0,2.5,0.0
120.0,1.0,2.5,0.0
121.0,1.0,2.5,0.0
122.0,1.0,2.5,0.0
123.0,1.0,2.5,0.0
124.0,1.0,2.5,0.0
125.0,1.0,2.5,0.0
126.0,1.0,2.5,0.0
127.0,1.0,2.5,0.0
128.0,1.0,2.5,0.0
129.0,1.0,2.5,0.0
130.0,1.0,2.5,0.0
131.0,1.0,2.5,0.0
132.0,1.0,2.5,0.0
133.0,1.0,2.5,0.0
134.0,1.0,2.5,0.0
135.0,1.0,2.5,0.0
136.0,1.0,2.5,0.0
137.0,1.0,2.5,0.0
138.0,1.0,2.5,0.0
139.0,1.0,2.5,0.0
140.0,1.0,2.5,0.0
141.0,1.0,2.5,0.0
142.0,1.0,2.5,0.0
143.0,1.0,2.5,0.0
144.0,1.0,2.5,0.0
145.0,1.0,2.5,0.0
146.0,1.0,2.5,0.0
147.0,1.0,2.5,0.0
148.0,1.0,2.5,0.0
149.0,1.0,2.5,0.0
150.0,1.0,2.5,0.0
151.0,1.0,2.5,0.0
152.0,1.0,2.5,0.0
153.0,1.0,2.5,0.0
154.0,1.0,2.5,0.0
155.0,1.0,2.5,0.0
156.0,1.0,2.5,0.0
157.0,1.0,2.5,0.0
158.0,1.0,2.5,0.0
159.0,1.0,2.5,0.0
160.0,1.0,2.5,0.0
161.0,1.0,2.5,0.0
162.0,1.0,2.5,0.0
163.0,1.0,2.5,0.0
164.0,1.0,2.5,0.0
165.0,1.0,2.5,0.0
166.0,1.0,2.5,0.0
167.0,1.0,2.5,0.0
168.0,1.0,2.5,0.0
169.0,1.0,2.5,0.0
170.0,1.0,2.5,0.0
171.0,1.0,2.5,0.0
172.0,1.0,2.5,0.0
173.0,1.0,2.5,0.0
174.0,1.0,2.5,0.0
175.0,1.0,2.5,0.0
176.0,1.0,2.5,0.0
177.0,1.0,3.0,0.0
178.0,1.0,3.0,0.0
179.0,1.0,3.0,0.0
180.0,1.0,3.0,0.0
181.0,1.0,3.0,0.0
182.0,1.0,3.0,0.0
183.0,1.0,3.0,0.0
184.0,1.0,3.0,0.0
185.0,1.0,3.0,0.0
186.0,1.0,3.0,0.0
187.0,1.0,3.0,0.0
188.0,1.0,3.0,0.0
189.0,1.0,3.0,0.0
190.0,1.0,3.0,0.0
191.0,1.0,3.0,0.0
192.0,1.0,3.0,0.0
193.0,1.0,3.0,0.0
194.0,1.0,3.0,0.0
195.0,1.0,3.0,0.0
196.0,1.0,3.0,0.0
197.0,1.0,3.0,0.0
198.0,1.0,3.0,0.0
199.0,1.0,3.0,0.0
200.0,1.0,3.0,0.0
201.0,1.0,3.0,0.0
202.0,1.0,3.0,0.0
203.0,1.0,3.0,0.0
204.0,1.0,3.0,0.0
205.0,1.0,3.0,0.0
206.0,1.0,3.0,0.0
207.0,1.0,3.0,0.0
208.0,1.0,3.0,0.0
209.0,1.0,3.0,0.0
210.0,1.0,3.0,0.0
211.0,1.0,3.0,0.0
212.0,1.0,3.0,0.0
213.0,1.0,3.0,0.0
214.0,1.0,3.0,0.0
215.0,1.0,3.0,0.0
216.0,1.0,3.0,0.0
217.0,1.0,3.0,0.0
218.0,1.0,3.0,0.0
219.0,1.0,3.0,0.0
220.0,1.0,3.0,0.0
221.0,1.0,3.0,0.0
222.0,1.0,3.0,0.0
223.0,1.0,3.0,0.0
224.0,1.0,3.0,0.0
225.0,1.0,3.0,0.0
226.0,1.0,3.0,0.0
227.0,1.0,3.0,0.0
228.0,1.0,3.0,0.0
229.0,1.0,3.0,0.0
230.0,1.0,3.0,0.0
231.0,1.0,3.0,0.0
232.0,1.0,3.0,0.0
233.0,1.0,3.0,0.0
234.0,1.0,3.0,0.0
235.0,1.0,3.0,0.0
236.0,1.0,3.0,0.0
237.0,1.0,3.0,0.0
238.0,1.0,3.0,0.0
239.0,1.0,3.0,0.0
240.0,1.0,3.0,0.0
241.0,1.0,3.0,0.0
242.0,1.0,3.0,0.0
243.0,1.0,3.5000000000000004,0.0
244.0,1.0,3.5000000000000004,0.0
245.0,1.0,3.5000000000000004,0.0
246.0,1.0,3.5000000000000004,0.0
247.0,1.0,3.5000000000000004,0.0
248.0,1.0,3.5000000000000004,0.0
249.0,1.0,3.5000000000000004,0.0
250.0,1.0,3.5000000000000004,0.0
251.0,1.0,3.5000000000000004,0.0
252.0,1.0,3.5000000000000004,0.0
253.0,1.0,3.5000000000000004,0.0
254.0,1.0,3.5000000000000004,0.0
255.0,1.0,3.5000000000000004,0.0
256.0,1.0,3.5000000000000004,0.0
257.0,1.0,3.5000000000000004,0.0
258.0,1.0,3.5000000000000004,0.0
259.0,1.0,3.5000000000000004,0.0
260.0,1.0,3.5000000000000004,0.0
261.0,1.0,3.5000000000000004,0.0
262.0,1.0,3.5000000000000004,0.0
263.0,1.0,3.5000000000000004,0.0
264.0,1.0,3.5000000000000004,0.0
265.0,1.0,3.5000000000000004,0.0
266.0,1.0,3.5000000000000004,0.0
267.0,1.0,3.5000000000000004,0.0
268.0,1.0,3.5000000000000004,0.0
269.0,1.0,3.5000000000000004,0.0
270.0,1.0,3.5000000000000004,0.0
271.0,1.0,3.5000000000000004,0.0
272.0,1.0,3.5000000000000004,0.0
273.0,1.0,3.5000000000000004,0.0
274.0,1.0,3.5000000000000004,0.0
275.0,1.0,3.5000000000000004,0.0
276.0,1.0,3.5000000000000004,0.0
277.0,1.0,3.5000000000000004,0.0
278.0,1.0,3.5000000000000004,0.0
279.0,1.0,3.5000000000000004,0.0
280.0,1.0,3.5000000000000004,0.0
281.0,1.0,3.5000000000000004,0.0
282.0,1.0,3.5000000000000004,0.0
283.0,1.0,3.5000000000000004,0.0
284.0,1.0,3.5000000000000004,0.0
285.0,1.0,3.5000000000000004,0.0
286.0,1.0,3.5000000000000004,0.0
287.0,1.0,3.5000000000000004,0.0
288.0,1.0,3.5000000000000004,0.0
289.0,1.0,3.5000000000000004,0.0
290.0,1.0,3.5000000000000004,0.0
291.0,1.0,3.5000000000000004,0.0
292.0,1.0,3.5000000000000004,0.0
293.0,1.0,3.5000000000000004,0.0
294.0,1.0,3.5000000000000004,0.0
295.0,1.0,3.5000000000000004,0.0
296.0,1.0,3.5000000000000004,0.0
297.0,1.0,3.5000000000000004,0.0
298.0,1.0,3.5000000000000004,0.0
299.0,1.0,3.5000000000000004,0.0
300.0,1.0,3.5000000000000004,0.0
301.0,1.0,3.5000000000000004,0.0
302.0,1.0,3.5000000000000004,0.0
303.0,1.0,3.5000000000000004,0.0
304.0,1.0,3.5000000000000004,0.0
305.0,1.0,3.5000000000000004,0.0
306.0,1.0,3.5000000000000004,0.0
307.0,1.0,3.5000000000000004,0.0
308.0,1.0,3.5000000000000004,0.0
309.0,1.0,3.5000000000000004,0.0
310.0,1.0,3.5000000000000004,0.0
311.0,1.0,3.5000000000000004,0.0
312.0,1.0,3.5000000000000004,0.0
313.0,1.0,4.0,0.0
314.0,1.0,4.0,0.0
315.0,1.0,4.0,0.0
316.0,1.0,4.0,0.0
317.0,1.0,4.0,0.0
318.0,1.0,4.0,0.0
319.0,1.0,4.0,0.0
320.0,1.0,4.0,0.0
321.0,1.0,4.0,0.0
322.0,1.0,4.0,0.0
323.0,1.0,4.0,0.0
324.0,1.0,4.0,0.0
325.0,1.0,4.0,0.0
326.0,1.0,4.0,0.0
327.0,1.0,4.0,0.0
328.0,1.0,4.0,0.0
329.0,1.0,4.0,0.0
330.0,1.0,4.0,0.0
331.0,1.0,4.0,0.0
332.0,1.0,4.0,0.0
333.0,1.0,4.0,0.0
334.0,1.0,4.0,0.0
335.0,1.0,4.0,0.0
336.0,1.0,4.0,0.0
337.0,1.0,4.0,0.0
338.0,1.0,4.0,0.0
339.0,1.0,4.0,0.0
340.0,1.0,4.0,0.0
341.0,1.0,4.0,0.0
342.0,1.0,4.0,0.0
343.0,1.0,4.0,0.0
344.0,1.0,4.0,0.0
345.0,1.0,4.0,0.0
346.0,1.0,4.0,0.0
347.0,1.0,4.0,0.0
348.0,1.0,4.0,0.0
349.0,1.0,4.0,0.0
350.0,1.0,4.0,0.0
351.0,1.0,4.0,0.0
352.0,1.0,4.0,0.0
353.0,1.0,4.0,0.0
354.0,1.0,4.0,0.0
355.0,1.0,4.0,0.0
356.0,1.0,4.0,0.0
357.0,1.0,4.0,0.0
358.0,1.0,4.0,0.0
359.0,1.0,4.0,0.0
360.0,1.0,4.0,0.0
361.0,1.0,4.0,0.0
362.0,1.0,4.0,0.0
363.0,1.0,4.0,0.0
364.0,1.0,4.0,0.0
365.0,1.0,4.0,0.0
366.0,1.0,4.0,0.0
367.0,1.0,4.0,0.0
368.0,1.0,4.0,0.0
369.0,1.0,4.0,0.0
370.0,1.0,4.0,0.0
371.0,1.0,4.0,0.0
372.0,1.0,4.0,0.0
373.0,1.0,4.0,0.0
374.0,1.0,4.0,0.0
375.0,1.0,4.0,0.0
376.0,1.0,4.0,0.0
377.0,1.0,4.0,0.0
378.0,1.0,4.0,0.0
379.0,1.0,4.0,0.0
380.0,1.0,4.0,0.0
381.0,1.0,4.0,0.0
382.0,1.0,4.0,0.0
383.0,1.0,4.0,0.0
384.0,1.0,4.0,0.0
385.0,1.0,4.0,0.0
386.0,1.0,4.0,0.0
387.0,1.0,4.0,0.0
388.0,1.0,4.0,0.0
389.0,1.0,4.0,0.0
390.0,1.0,4.0,0.0
391.0,1.0,4.0,0.0
392.0,1.0,4.0,0.0
393.0,1.0,4.0,0.0
394.0,1.0,4.0,0.0
395.0,1.0,4.0,0.0
396.0,1.0,4.0,0.0
397.0,1.0,4.0,0.0
398.0,1.0,4.0,0.0
399.0,1.0,4.0,0.0
400.0,1.0,4.0,0.0
401.0,1.0,4.0,0.0
402.0,1.0,4.0,0.0
403.0,1.0,4.0,0.0
404.0,1.0,4.0,0.0
405.0,1.0,4.0,0.0
406.0,1.0,4.0,0.0
407.0,1.0,4.0,0.0
408.0,1.0,4.0,0.0
409.0,1.0,4.0,0.0
410.0,1.0,4.0,0.0
411.0,1.0,4.0,0.0
412.0,1.0,4.0,0.0
413.0,1.0,4.0,0.0
414.0,1.0,4.0,0.0
415.0,1.0,4.0,0.0
416.0,1.0,4.0,0.0
417.0,1.0,4.5,0.5
418.0,1.0,4.5,0.5
419.0,1.0,4.5,0.5
420.0,1.0,4.5,0.5
421.0,1.0,4.5,0.5
422.0,1.0,4.5,0.5
423.0,1.0,4.5,0.5
424.0,1.0,4.5,0.5
425.0,1.0,4.5,0.5
426.0,1.0,4.5,0.5
427.0,1.0,4.5,0.5
428.0,1.0,4.5,0.5
429.0,1.0,4.5,0.5
430.0,1.0,4.5,0.5
431.0,1.0,4.5,0.5
432.0,1.0,4.5,0.5
433.0,1.0,4.5,0.5
434.0,1.0,4.5,0.5
435.0,1.0,4.5,0.5
436.0,1.0,4.5,0.5
437.0,1.0,4.5,0.5
438.0,1.0,4.5,0.5
439.0,1.0,4.5,0.5
440.0,1.0,4.5,0.5
441.0,1.0,4.5,0.5
442.0,1.0,4.5,0.5
443.0,1.0,4.5,0.5
444.0,1.0,4.5,0.5
445.0,1.0,4.5,0.5
446.0,1.0,4.5,0.5
447.0,1.0,4.5,0.5
448.0,1.0,4.5,0.5
449.0,1.0,4.5,0.5
450.0,1.0,4.5,0.5
451.0,1.0,4.5,0.5
452.0,1.0,4.5,0.5
453.0,1.0,4.5,0.5
454.0,1.0,4.5,0.5
455.0,1.0,4.5,0.5
456.0,1.0,4.5,0.5
457.0,1.0,4.5,0.5
458.0,1.0,4.5,0.5
459.0,1.0,4.5,0.5
460.0,1.0,4.5,0.5
461.0,1.0,4.5,0.5
462.0,1.0,4.5,0.5
463.0,1.0,4.5,0.5
464.0,1.0,4.5,0.5
465.0,1.0,4.5,0.5
466.0,1.0,4.5,0.5
467.0,1.0,4.5,0.5
468.0,1.0,4.5,0.5
469.0,1.0,5.0,0.5
470.0,1.0,5.0,0.5
471.0,1.0,5.0,0.5
472.0,1.0,5.0,0.5
473.0,1.0,5.0,0.5
474.0,1.0,5.0,0.5
475.0,1.0,5.0,0.5
476.0,1.0,5.0,0.5
477.0,1.0,5.0,0.5
478.0,1.0,5.0,0.5
479.0,1.0,5.0,0.5
480.0,1.0,5.0,0.5
481.0,1.0,5.0,0.5
482.0,1.0,5.0,0.5
483.0,1.0,5.0,0.5
484.0,1.0,5.0,0.5
485.0,1.0,5.0,0.5
486.0,1.0,5.0,0.5
487.0,1.0,5.0,0.5
488.0,1.0,5.0,0.5
489.0,1.0,5.0,0.5
490.0,1.0,5.0,0.5
491.0,1.0,5.0,0.5
492.0,1.0,5.0,0.5
493.0,1.0,5.0,0.5
494.0,1.0,5.0,0.5
495.0,1.0,5.0,0.5
496.0,1.0,5.0,0.5
497.0,1.0,5.0,0.5
498.0,1.0,5.0,0.5
499.0,1.0,5.0,0.5
500.0,1.0,5.0,0.5
501.0,1.0,5.0,0.5
502.0,1.0,5.0,0.5
503.0,1.0,5.0,0.5
504.0,1.0,5.0,0.5
505.0,1.0,5.0,0.5
506.0,1.0,5.0,0.5
507.0,1.0,5.0,0.5
508.0,1.0,5.0,0.5
509.0,1.0,5.0,0.5
510.0,1.0,5.0,0.5
511.0,1.0,5.0,0.5
512.0,1.0,5.0,0.5
513.0,1.0,5.0,0.5
514.0,1.0,5.0,0.5
515.0,1.0,5.0,0.5
516.0,1.0,5.0,0.5
517.0,1.0,5.0,0.5
518.0,1.0,5.0,0.5
519.0,1.0,5.0,0.5
520.0,1.0,5.0,0.5
521.0,1.0,5.0,0.5
522.0,1.0,5.0,0.5
523.0,1.0,5.0,0.5
524.0,1.0,5.0,0.5
525.0,1.0,5.0,0.5
526.0,1.0,5.0,0.5
527.0,1.0,5.0,0.5
528.0,1.0,5.0,0.5
529.0,1.0,5.0,0.5
530.0,1.0,5.0,0.5
531.0,1.0,5.0,0.5
532.0,1.0,5.0,0.5
533.0,1.0,5.0,0.5
534.0,1.0,5.0,0.5
535.0,1.0,5.0,0.5
536.0,1.0,5.0,0.5
537.0,1.0,5.0,0.5
538.0,1.0,5.0,0.5
539.0,1.0,5.0,0.5
540.0,1.0,5.0,0.5
541.0,1.0,5.0,0.5
542.0,1.0,5.0,0.5
543.0,1.0,5.0,0.5
544.0,1.0,5.0,0.5
545.0,1.0,5.0,0.5
546.0,1.0,5.0,0.5
547.0,1.0,5.0,0.5
548.0,1.0,5.0,0.5
549.0,1.0,5.0,1.0
550.0,1.0,5.0,1.0
551.0,1.0,5.0,1.0
552.0,1.0,5.0,1.0
553.0,1.0,5.0,1.0
554.0,1.0,5.0,1.0
555.0,1.0,5.0,1.0
556.0,1.0,5.0,1.0
557.0,1.0,5.0,1.0
558.0,1.0,5.0,1.0
559.0,1.0,5.0,1.0
560.0,1.0,5.0,1.0
561.0,1.0,5.0,1.0
562.0,1.0,5.0,1.0
563.0,1.0,5.0,1.0
564.0,1.0,5.0,1.0
565.0,1.0,5.0,1.0
566.0,1.0,5.0,1.0
567.0,1.0,5.0,1.0
568.0,1.0,5.0,1.0
569.0,1.0,5.0,1.0
570.0,1.0,5.0,1.0
571.0,1.0,5.0,1.0
572.0,1.0,5.0,1.0
573.0,1.0,5.0,1.0
574.0,1.0,5.0,1.0
575.0,1.0,5.0,1.0
576.0,1.0,5.0,1.0
577.0,1.0,5.0,1.0
578.0,1.0,5.0,1.0
579.0,1.0,5.0,1.0
580.0,1.0,5.0,1.0
581.0,1.0,5.0,1.0
582.0,1.0,5.0,1.0
583.0,1.0,5.0,1.0
584.0,1.0,5.0,1.0
585.0,1.0,5.0,1.0
586.0,1.0,5.0,1.0
587.0,1.0,5.0,1.0
588.0,1.0,5.0,1.0
589.0,1.0,5.0,1.0
590.0,1.0,5.0,1.0
591.0,1.0,5.0,1.0
592.0,1.0,5.0,1.0
593.0,1.0,5.0,1.0
594.0,1.0,5.0,1.0
595.0,1.0,5.0,1.0
596.0,1.0,5.0,1.0
597.0,1.0,5.0,1.0
598.0,1.0,5.0,1.0
599.0,1.0,5.0,1.0
600.0,1.0,5.0,1.0
601.0,1.0,5.0,1.0
602.0,1.0,5.0,1.0
603.0,1.0,5.0,1.0
604.0,1.0,5.0,1.0
605.0,1.0,5.0,1.0
606.0,1.0,5.0,1.0
607.0,1.0,5.0,1.0
608.0,1.0,5.0,1.0
609.0,1.0,5.0,1.0
610.0,1.0,5.0,1.0
611.0,1.0,5.0,1.0
612.0,1.0,5.0,1.0
613.0,1.0,5.0,1.0
614.0,1.0,5.0,1.0
615.0,1.0,5.0,1.0
616.0,1.0,5.0,1.0
617.0,1.0,5.0,1.0
618.0,1.0,5.0,1.0
619.0,1.0,5.0,1.0
620.0,1.0,5.0,1.0
621.0,1.0,5.0,1.0
622.0,1.0,5.0,1.0
623.0,1.0,5.0,1.0
624.0,1.0,5.0,1.0
625.0,1.0,5.0,1.0
626.0,1.0,5.0,1.0
627.0,1.0,5.0,1.0
628.0,1.0,5.0,1.0
629.0,1.0,5.0,1.0
630.0,1.0,5.0,1.0
631.0,1.0,5.0,1.0
632.0,1.0,5.0,1.0
633.0,1.0,5.0,1.0
634.0,1.0,5.0,1.0
635.0,1.0,5.0,1.0
636.0,1.0,5.0,1.0
637.0,1.0,5.0,1.0
638.0,1.0,5.0,1.0
639.0,1.0,5.0,1.0
640.0,1.0,5.0,1.0
641.0,1.0,5.0,1.0
642.0,1.0,5.0,1.0
643.0,1.0,5.0,1.0
644.0,1.0,5.0,1.0
645.0,1.0,5.0,1.0
646.0,1.0,5.0,1.0
647.0,1.0,5.0,1.0
648.0,1.0,5.0,1.0
649.0,1.0,5.0,1.0
650.0,1.0,5.0,1.0
651.0,1.0,5.0,1.0
652.0,1.0,5.0,1.0
653.0,1.0,5.0,1.0
654.0,1.0,5.0,1.0
655.0,1.0,5.0,1.0
656.0,1.0,5.0,1.0
657.0,1.0,5.0,1.0
658.0,1.0,5.0,1.0
659.0,1.0,5.0,1.0
660.0,1.0,5.0,1.0
661.0,1.0,5.0,1.0
662.0,1.0,5.5,1.0
663.0,1.0,5.5,1.0
664.0,1.0,5.5,1.0
665.0,1.0,5.5,1.0
666.0,1.0,5.5,1.0
667.0,1.0,5.5,1.0
668.0,1.0,5.5,1.0
669.0,1.0,5.5,1.0
670.0,1.0,5.5,1.0
671.0,1.0,5.5,1.0
672.0,1.0,5.5,1.0
673.0,1.0,5.5,1.0
674.0,1.0,5.5,1.0
675.0,1.0,5.5,1.0
676.0,1.0,5.5,1.0
677.0,1.0,5.5,1.0
678.0,1.0,5.5,1.0
679.0,1.0,5.5,1.0
680.0,1.0,5.5,1.0
681.0,1.0,5.5,1.0
682.0,1.0,5.5,1.0
683.0,1.0,5.5,1.0
684.0,1.0,5.5,1.0
685.0,1.0,5.5,1.0
686.0,1.0,5.5,1.0
687.0,1.0,5.5,1.0
688.0,1.0,5.5,1.0
689.0,1.0,5.5,1.0
690.0,1.0,5.5,1.0
691.0,1.0,5.5,1.0
692.0,1.0,5.5,1.0
693.0,1.0,5.5,1.0
694.0,1.0,5.5,1.0
695.0,1.0,5.5,1.0
696.0,1.0,5.5,1.0
697.0,1.0,5.5,1.0
698.0,1.0,5.5,1.0
699.0,1.0,5.5,1.0
700.0,1.0,5.5,1.0
701.0,1.0,5.5,1.0
702.0,1.0,5.5,1.0
703.0,1.0,5.5,1.0
704.0,1.0,5.5,1.0
705.0,1.0,5.5,1.0
706.0,1.0,5.5,1.0
707.0,1.0,5.5,1.0
708.0,1.0,5.5,1.0
709.0,1.0,5.5,1.0
710.0,1.0,5.5,1.0
711.0,1.0,5.5,1.0
712.0,1.0,5.5,1.0
713.0,1.0,5.5,1.0
714.0,1.0,5.5,1.0
715.0,1.0,5.5,1.0
716.0,1.0,5.5,1.0
717.0,1.0,6.0,1.0
718.0,1.0,6.0,1.0
719.0,1.0,6.0,1.0
720.0,1.0,6.0,1.0
721.0,1.0,6.0,1.0
722.0,1.0,6.0,1.0
723.0,1.0,6.0,1.0
724.0,1.0,6.0,1.0
725.0,1.0,6.0,1.0
726.0,1.0,6.0,1.0
727.0,1.0,6.5,1.0
728.0,1.0,6.5,1.0
729.0,1.0,6.5,1.0
730.0,1.0,6.5,1.0
731.0,1.0,6.5,1.0
732.0,1.0,6.5,1.0
733.0,1.0,6.5,1.0
734.0,1.0,6.5,1.0
735.0,1.0,6.5,1.0
736.0,1.0,6.5,1.0
737.0,1.0,6.5,1.0
738.0,1.0,6.5,1.0
739.0,1.0,6.5,1.0
740.0,1.0,6.5,1.0
741.0,1.0,6.5,1.0
742.0,1.0,6.5,1.0
743.0,1.0,6.5,1.0
744.0,1.0,6.5,1.0
745.0,1.0,6.5,1.0
746.0,1.0,6.5,1.0
747.0,1.0,6.5,1.0
748.0,1.0,6.5,1.0
749.0,1.0,6.5,1.0
750.0,1.0,6.5,1.0
751.0,1.0,6.5,1.0
752.0,1.0,6.5,1.0
753.0,1.0,6.5,1.0
754.0,1.0,6.5,1.0
755.0,1.0,6.5,1.0
756.0,1.0,6.5,1.0
757.0,1.0,6.5,1.0
758.0,1.0,6.5,1.0
759.0,1.0,6.5,1.0
760.0,1.0,6.5,1.0
761.0,1.0,6.5,1.0
762.0,1.0,6.5,1.0
763.0,1.0,6.5,1.0
764.0,1.0,6.5,1.0
765.0,1.0,6.5,1.0
766.0,1.0,7.000000000000001,1.0
767.0,1.0,7.000000000000001,1.0
768.0,1.0,7.000000000000001,1.0
769.0,1.0,7.000000000000001,1.0
770.0,1.0,7.000000000000001,1.0
771.0,1.0,7.000000000000001,1.0
772.0,1.0,7.000000000000001,1.0
773.0,1.0,7.000000000000001,1.0
774.0,1.0,7.000000000000001,1.0
775.0,1.0,7.000000000000001,1.0
776.0,1.0,7.000000000000001,1.0
777.0,1.0,7.000000000000001,1.0
778.0,1.0,7.000000000000001,1.0
779.0,1.0,7.000000000000001,1.0
780.0,1.0,7.000000000000001,1.0
781.0,1.0,7.000000000000001,1.0
782.0,1.0,7.000000000000001,1.0
783.0,1.0,7.000000000000001,1.0
784.0,1.0,7.000000000000001,1.0
785.0,1.0,7.000000000000001,1.0
786.0,1.0,7.000000000000001,1.0
787.0,1.0,7.000000000000001,1.0
788.0,1.0,7.000000000000001,1.0
789.0,1.0,7.000000000000001,1.0
790.0,1.0,7.000000000000001,1.0
791.0,1.0,7.000000000000001,1.0
792.0,1.0,7.000000000000001,1.0
793.0,1.0,7.000000000000001,1.0
794.0,1.0,7.000000000000001,1.0
795.0,1.0,7.000000000000001,1.0
796.0,1.0,7.000000000000001,1.0
797.0,1.0,7.000000000000001,1.0
798.0,1.0,7.000000000000001,1.0
799.0,1.0,7.000000000000001,1.0
800.0,1.0,7.000000000000001,1.0
801.0,1.0,7.000000000000001,1.0
802.0,1.0,7.000000000000001,1.0
803.0,1.0,7.000000000000001,1.0
804.0,1.0,7.000000000000001,1.0
805.0,1.0,7.000000000000001,1.0
806.0,1.0,7.000000000000001,1.0
807.0,1.0,7.000000000000001,1.0
808.0,1.0,7.000000000000001,1.0
809.0,1.0,7.000000000000001,1.0
810.0,1.0,7.000000000000001,1.0
811.0,1.0,7.000000000000001,1.0
812.0,1.0,7.000000000000001,1.0
813.0,1.0,7.000000000000001,1.0
814.0,1.0,7.000000000000001,1.0
815.0,1.0,7.000000000000001,1.0
816.0,1.0,7.000000000000001,1.0
817.0,1.0,7.000000000000001,1.0
818.0,1.0,7.000000000000001,1.0
819.0,1.0,7.000000000000001,1.0
820.0,1.0,7.000000000000001,1.0
821.0,1.0,7.000000000000001,1.0
822.0,1.0,7.000000000000001,1.0
823.0,1.0,7.000000000000001,1.0
824.0,1.0,7.000000000000001,1.0
825.0,1.0,7.000000000000001,1.0
826.0,1.0,7.000000000000001,1.0
827.0,1.0,7.000000000000001,1.0
828.0,1.0,7.000000000000001,1.0
829.0,1.0,7.000000000000001,1.0
830.0,1.0,7.000000000000001,1.0
831.0,1.0,7.000000000000001,1.0
832.0,1.0,7.000000000000001,1.0
833.0,1.0,7.000000000000001,1.0
834.0,1.0,7.000000000000001,1.0
835.0,1.0,7.000000000000001,1.0
836.0,1.0,7.000000000000001,1.0
837.0,1.0,7.000000000000001,1.0
838.0,1.0,7.000000000000001,1.0
839.0,1.0,7.000000000000001,1.0
840.0,1.0,7.000000000000001,1.0
841.0,1.0,7.000000000000001,1.0
842.0,1.0,7.000000000000001,1.0
843.0,1.0,7.000000000000001,1.0
844.0,1.0,7.000000000000001,1.0
845.0,1.0,7.000000000000001,1.0
846.0,1.0,7.000000000000001,1.0
847.0,1.0,7.000000000000001,1.0
848.0,1.0,7.000000000000001,1.0
849.0,1.0,7.000000000000001,1.0
850.0,1.0,7.000000000000001,1.0
851.0,1.0,7.000000000000001,1.0
852.0,1.0,7.000000000000001,1.0
853.0,1.0,7.000000000000001,1.0
854.0,1.0,7.000000000000001,1.0
855.0,1.0,7.000000000000001,1.0
856.0,1.0,7.000000000000001,1.0
857.0,1.0,7.000000000000001,1.0
858.0,1.0,7.000000000000001,1.0
859.0,1.0,7.000000000000001,1.0
860.0,1.0,7.000000000000001,1.0
861.0,1.0,7.000000000000001,1.0
862.0,1.0,7.000000000000001,1.0
863.0,1.0,7.000000000000001,1.0
864.0,1.0,7.000000000000001,1.0
865.0,1.0,7.000000000000001,1.0
866.0,1.0,7.000000000000001,1.0
867.0,1.0,7.000000000000001,1.0
868.0,1.0,7.000000000000001,1.0
869.0,1.0,7.000000000000001,1.0
870.0,1.0,7.000000000000001,1.0
871.0,1.0,7.000000000000001,1.0
872.0,1.0,7.000000000000001,1.0
873.0,1.0,7.000000000000001,1.0
874.0,1.0,7.000000000000001,1.0
875.0,1.0,7.000000000000001,1.0
876.0,1.0,7.000000000000001,1.0
877.0,1.0,7.000000000000001,1.0
878.0,1.0,7.000000000000001,1.0
879.0,1.0,7.000000000000001,1.0
880.0,1.0,7.000000000000001,1.0
881.0,1.0,7.000000000000001,1.0
882.0,1.0,7.000000000000001,1.0
883.0,1.0,7.000000000000001,1.5
884.0,1.0,7.000000000000001,1.5
885.0,1.0,7.000000000000001,1.5
886.0,1.0,7.000000000000001,1.5
887.0,1.0,7.000000000000001,1.5
888.0,1.0,7.000000000000001,1.5
889.0,1.0,7.000000000000001,1.5
890.0,1.0,7.000000000000001,1.5
891.0,1.0,7.000000000000001,1.5
892.0,1.0,7.000000000000001,1.5
893.0,1.0,7.000000000000001,1.5
894.0,1.0,7.000000000000001,1.5
895.0,1.0,7.000000000000001,1.5
896.0,1.0,7.000000000000001,1.5
897.0,1.0,7.000000000000001,1.5
898.0,1.0,7.5,1.5
899.0,1.0,7.5,1.5
900.0,1.0,7.5,1.5
901.0,1.0,7.5,1.5
902.0,1.0,7.5,1.5
903.0,1.0,7.5,1.5
904.0,1.0,7.5,1.5
905.0,1.0,7.5,1.5
906.0,1.0,7.5,1.5
907.0,1.0,7.5,1.5
908.0,1.0,7.5,1.5
909.0,1.0,7.5,1.5
910.0,1.0,7.5,1.5
911.0,1.0,7.5,1.5
912.0,1.0,7.5,1.5
913.0,1.0,7.5,1.5
914.0,1.0,7.5,1.5
915.0,1.0,7.5,1.5
916.0,1.0,7.5,1.5
917.0,1.0,8.0,1.5
918.0,1.0,8.0,1.5
919.0,1.0,8.0,1.5
920.0,1.0,8.0,1.5
921.0,1.0,8.0,1.5
922.0,1.0,8.0,1.5
923.0,1.0,8.0,1.5
924.0,1.0,8.0,1.5
925.0,1.0,8.0,1.5
926.0,1.0,8.0,1.5
927.0,1.0,8.0,1.5
928.0,1.0,8.0,1.5
929.0,1.0,8.0,1.5
930.0,1.0,8.0,1.5
931.0,1.0,8.0,1.5
932.0,1.0,8.0,1.5
933.0,1.0,8.0,1.5
934.0,1.0,8.0,1.5
935.0,1.0,8.0,1.5
936.0,1.0,8.0,1.5
937.0,1.0,8.0,1.5
938.0,1.0,8.0,1.5
939.0,1.0,8.0,1.5
940.0,1.0,8.0,1.5
941.0,1.0,8.0,1.5
942.0,1.0,8.0,1.5
943.0,1.0,8.0,1.5
944.0,1.0,8.0,1.5
945.0,1.0,8.0,1.5
946.0,1.0,8.0,1.5
947.0,1.0,8.0,1.5
948.0,1.0,8.0,1.5
949.0,1.0,8.0,1.5
950.0,1.0,8.0,1.5
951.0,1.0,8.0,1.5
952.0,1.0,8.0,1.5
953.0,1.0,8.0,1.5
954.0,1.0,8.0,1.5
955.0,1.0,8.0,1.5
956.0,1.0,8.0,1.5
957.0,1.0,8.0,1.5
958.0,1.0,8.0,1.5
959.0,1.0,8.5,1.5
960.0,1.0,8.5,1.5
961.0,1.0,8.5,1.5
962.0,1.0,8.5,1.5
963.0,1.0,8.5,1.5
964.0,1.0,8.5,1.5
965.0,1.0,8.5,1.5
966.0,1.0,8.5,1.5
967.0,1.0,8.5,1.5
968.0,1.0,8.5,1.5
969.0,1.0,8.5,1.5
970.0,1.0,8.5,1.5
971.0,1.0,8.5,1.5
972.0,1.0,8.5,1.5
973.0,1.0,8.5,1.5
974.0,1.0,8.5,1.5
975.0,1.0,8.5,1.5
976.0,1.0,8.5,1.5
977.0,1.0,8.5,1.5
978.0,1.0,8.5,1.5
979.0,1.0,8.5,1.5
980.0,1.0,8.5,1.5
981.0,1.0,8.5,1.5
982.0,1.0,8.5,1.5
983.0,1.0,8.5,1.5
984.0,1.0,8.5,1.5
985.0,1.0,8.5,1.5
986.0,1.0,8.5,1.5
987.0,1.0,8.5,1.5
988.0,1.0,8.5,1.5
989.0,1.0,8.5,1.5
990.0,1.0,8.5,1.5
991.0,1.0,9.0,1.5
992.0,1.0,9.0,1.5
993.0,1.0,9.0,1.5
994.0,1.0,9.0,1.5
995.0,1.0,9.0,1.5
996.0,1.0,9.0,1.5
997.0,1.0,9.0,1.5
998.0,1.0,9.0,1.5
999.0,1.0,9.0,1.5
1000.0,1.0,9.0,1.5
1001.0,1.0,9.0,1.5
1002.0,1.0,9.0,1.5
1003.0,1.0,9.0,1.5
1004.0,1.0,9.0,1.5
1005.0,1.0,9.0,1.5
1006.0,1.0,9.0,1.5
1007.0,1.0,9.0,1.5
1008.0,1.0,9.0,1.5
1009.0,1.0,9.0,1.5
1010.0,1.0,9.0,1.5
1011.0,1.0,9.0,1.5
1012.0,1.0,9.0,1.5
1013.0,1.0,9.0,1.5
1014.0,1.0,9.0,1.5
1015.0,1.0,9.0,1.5
1016.0,1.0,9.0,1.5
1017.0,1.0,9.0,1.5
1018.0,1.0,9.0,1.5
1019.0,1.0,9.0,1.5
1020.0,1.0,9.0,1.5
1021.0,1.0,9.0,1.5
1022.0,1.0,9.0,1.5
1023.0,1.0,9.0,1.5
1024.0,1.0,9.0,1.5
1025.0,1.0,9.0,1.5
1026.0,1.0,9.0,1.5
1027.0,1.0,9.0,1.5
1028.0,1.0,9.0,1.5
1029.0,1.0,9.0,1.5
1030.0,1.0,9.0,1.5
1031.0,1.0,9.0,1.5
1032.0,1.0,9.0,1.5
1033.0,1.0,9.0,1.5
1034.0,1.0,9.0,1.5
1035.0,1.0,9.0,1.5
1036.0,1.0,9.0,1.5
1037.0,1.0,9.0,1.5
1038.0,1.0,9.0,1.5
1039.0,1.0,9.0,1.5
1040.0,1.0,9.0,1.5
1041.0,1.0,9.0,1.5
1042.0,1.0,9.0,1.5
1043.0,1.0,9.0,1.5
1044.0,1.0,9.0,1.5
1045.0,1.0,9.0,1.5
1046.0,1.0,9.0,1.5
1047.0,1.0,9.0,1.5
1048.0,1.0,9.0,1.5
1049.0,1.0,9.0,1.5
1050.0,1.0,9.0,1.5
1051.0,1.0,9.0,1.5
1052.0,1.0,9.0,1.5
1053.0,1.0,9.0,1.5
1054.0,1.0,9.0,1.5
1055.0,1.0,9.0,1.5
1056.0,1.0,9.0,1.5
1057.0,1.0,9.0,1.5
1058.0,1.0,9.0,1.5
1059.0,1.0,9.0,1.5
1060.0,1.0,9.0,1.5
1061.0,1.0,9.0,1.5
1062.0,1.0,9.0,1.5
1063.0,1.0,9.0,1.5
1064.0,1.0,9.0,1.5
1065.0,1.0,9.0,1.5
1066.0,1.0,9.0,1.5
1067.0,1.0,9.0,1.5
1068.0,1.0,9.0,1.5
1069.0,1.0,9.0,1.5
1070.0,1.0,9.0,1.5
1071.0,1.0,9.0,1.5
1072.0,1.0,9.0,1.5
1073.0,1.0,9.0,1.5
1074.0,1.0,9.0,1.5
1075.0,1.0,9.0,1.5
1076.0,1.0,9.0,1.5
1077.0,1.0,9.0,1.5
1078.0,1.0,9.0,1.5
1079.0,1.0,9.0,1.5
1080.0,1.0,9.0,1.5
1081.0,1.0,9.0,1.5
1082.0,1.0,9.0,1.5
1083.0,1.0,9.0,1.5
1084.0,1.0,9.0,1.5
1085.0,1.0,9.0,1.5
1086.0,1.0,9.0,1.5
1087.0,1.0,9.0,1.5
1088.0,1.0,9.0,1.5
1089.0,1.0,9.0,1.5
1090.0,1.0,9.0,1.5
1091.0,1.0,9.0,1.5
1092.0,1.0,9.0,1.5
