"Gasoline","BEV","tick"
193.0,7.0,1.0
193.0,7.0,2.0
193.0,7.0,3.0
193.0,7.0,4.0
193.0,7.0,5.0
193.0,7.0,6.0
193.0,7.0,7.0
193.0,7.0,8.0
193.0,7.0,9.0
193.0,7.0,10.0
193.0,7.0,11.0
193.0,7.0,12.0
193.0,7.0,13.0
193.0,7.0,14.0
193.0,7.0,15.0
193.0,7.0,16.0
193.0,7.0,17.0
193.0,7.0,18.0
193.0,7.0,19.0
193.0,7.0,20.0
193.0,7.0,21.0
193.0,7.0,22.0
193.0,7.0,23.0
193.0,7.0,24.0
193.0,7.0,25.0
193.0,7.0,26.0
193.0,7.0,27.0
193.0,7.0,28.0
193.0,7.0,29.0
193.0,7.0,30.0
193.0,7.0,31.0
193.0,7.0,32.0
193.0,7.0,33.0
193.0,7.0,34.0
193.0,7.0,35.0
193.0,7.0,36.0
193.0,7.0,37.0
193.0,7.0,38.0
193.0,7.0,39.0
193.0,7.0,40.0
193.0,7.0,41.0
193.0,7.0,42.0
193.0,7.0,43.0
193.0,7.0,44.0
193.0,7.0,45.0
193.0,7.0,46.0
193.0,7.0,47.0
193.0,7.0,48.0
193.0,7.0,49.0
193.0,7.0,50.0
193.0,7.0,51.0
193.0,7.0,52.0
193.0,7.0,53.0
193.0,7.0,54.0
193.0,7.0,55.0
193.0,7.0,56.0
193.0,7.0,57.0
193.0,7.0,58.0
193.0,7.0,59.0
193.0,7.0,60.0
193.0,7.0,61.0
193.0,7.0,62.0
193.0,7.0,63.0
193.0,7.0,64.0
193.0,7.0,65.0
193.0,7.0,66.0
193.0,7.0,67.0
193.0,7.0,68.0
193.0,7.0,69.0
193.0,7.0,70.0
193.0,7.0,71.0
193.0,7.0,72.0
193.0,7.0,73.0
193.0,7.0,74.0
193.0,7.0,75.0
193.0,7.0,76.0
193.0,7.0,77.0
193.0,7.0,78.0
193.0,7.0,79.0
193.0,7.0,80.0
193.0,7.0,81.0
193.0,7.0,82.0
193.0,7.0,83.0
193.0,7.0,84.0
193.0,7.0,85.0
193.0,7.0,86.0
193.0,7.0,87.0
193.0,7.0,88.0
193.0,7.0,89.0
193.0,7.0,90.0
193.0,7.0,91.0
193.0,7.0,92.0
193.0,7.0,93.0
193.0,7.0,94.0
193.0,7.0,95.0
193.0,7.0,96.0
193.0,7.0,97.0
193.0,7.0,98.0
193.0,7.0,99.0
193.0,7.0,100.0
193.0,7.0,101.0
193.0,7.0,102.0
193.0,7.0,103.0
193.0,7.0,104.0
193.0,7.0,105.0
193.0,7.0,106.0
193.0,7.0,107.0
193.0,7.0,108.0
193.0,7.0,109.0
193.0,7.0,110.0
193.0,7.0,111.0
193.0,7.0,112.0
193.0,7.0,113.0
193.0,7.0,114.0
193.0,7.0,115.0
193.0,7.0,116.0
193.0,7.0,117.0
193.0,7.0,118.0
193.0,7.0,119.0
193.0,7.0,120.0
193.0,7.0,121.0
193.0,7.0,122.0
193.0,7.0,123.0
193.0,7.0,124.0
193.0,7.0,125.0
193.0,7.0,126.0
193.0,7.0,127.0
193.0,7.0,128.0
193.0,7.0,129.0
193.0,7.0,130.0
193.0,7.0,131.0
193.0,7.0,132.0
193.0,7.0,133.0
193.0,7.0,134.0
193.0,7.0,135.0
193.0,7.0,136.0
193.0,7.0,137.0
193.0,7.0,138.0
193.0,7.0,139.0
193.0,7.0,140.0
193.0,7.0,141.0
193.0,7.0,142.0
193.0,7.0,143.0
193.0,7.0,144.0
193.0,7.0,145.0
193.0,7.0,146.0
193.0,7.0,147.0
193.0,7.0,148.0
193.0,7.0,149.0
193.0,7.0,150.0
193.0,7.0,151.0
193.0,7.0,152.0
193.0,7.0,153.0
193.0,7.0,154.0
193.0,7.0,155.0
193.0,7.0,156.0
193.0,7.0,157.0
193.0,7.0,158.0
193.0,7.0,159.0
193.0,7.0,160.0
193.0,7.0,161.0
193.0,7.0,162.0
193.0,7.0,163.0
193.0,7.0,164.0
193.0,7.0,165.0
193.0,7.0,166.0
193.0,7.0,167.0
193.0,7.0,168.0
193.0,7.0,169.0
193.0,7.0,170.0
193.0,7.0,171.0
193.0,7.0,172.0
193.0,7.0,173.0
193.0,7.0,174.0
193.0,7.0,175.0
193.0,7.0,176.0
192.0,8.0,177.0
192.0,8.0,178.0
192.0,8.0,179.0
192.0,8.0,180.0
192.0,8.0,181.0
192.0,8.0,182.0
192.0,8.0,183.0
192.0,8.0,184.0
192.0,8.0,185.0
192.0,8.0,186.0
192.0,8.0,187.0
192.0,8.0,188.0
192.0,8.0,189.0
192.0,8.0,190.0
192.0,8.0,191.0
192.0,8.0,192.0
192.0,8.0,193.0
192.0,8.0,194.0
192.0,8.0,195.0
192.0,8.0,196.0
192.0,8.0,197.0
192.0,8.0,198.0
192.0,8.0,199.0
192.0,8.0,200.0
192.0,8.0,201.0
192.0,8.0,202.0
192.0,8.0,203.0
192.0,8.0,204.0
192.0,8.0,205.0
192.0,8.0,206.0
192.0,8.0,207.0
192.0,8.0,208.0
192.0,8.0,209.0
192.0,8.0,210.0
192.0,8.0,211.0
192.0,8.0,212.0
192.0,8.0,213.0
192.0,8.0,214.0
192.0,8.0,215.0
192.0,8.0,216.0
192.0,8.0,217.0
192.0,8.0,218.0
192.0,8.0,219.0
192.0,8.0,220.0
192.0,8.0,221.0
192.0,8.0,222.0
192.0,8.0,223.0
192.0,8.0,224.0
192.0,8.0,225.0
192.0,8.0,226.0
192.0,8.0,227.0
192.0,8.0,228.0
192.0,8.0,229.0
192.0,8.0,230.0
192.0,8.0,231.0
192.0,8.0,232.0
192.0,8.0,233.0
192.0,8.0,234.0
192.0,8.0,235.0
192.0,8.0,236.0
192.0,8.0,237.0
192.0,8.0,238.0
192.0,8.0,239.0
192.0,8.0,240.0
192.0,8.0,241.0
192.0,8.0,242.0
192.0,8.0,243.0
192.0,8.0,244.0
192.0,8.0,245.0
192.0,8.0,246.0
192.0,8.0,247.0
192.0,8.0,248.0
192.0,8.0,249.0
192.0,8.0,250.0
192.0,8.0,251.0
192.0,8.0,252.0
192.0,8.0,253.0
192.0,8.0,254.0
192.0,8.0,255.0
192.0,8.0,256.0
192.0,8.0,257.0
192.0,8.0,258.0
192.0,8.0,259.0
192.0,8.0,260.0
192.0,8.0,261.0
192.0,8.0,262.0
192.0,8.0,263.0
192.0,8.0,264.0
192.0,8.0,265.0
192.0,8.0,266.0
192.0,8.0,267.0
192.0,8.0,268.0
192.0,8.0,269.0
192.0,8.0,270.0
192.0,8.0,271.0
192.0,8.0,272.0
192.0,8.0,273.0
192.0,8.0,274.0
192.0,8.0,275.0
192.0,8.0,276.0
192.0,8.0,277.0
192.0,8.0,278.0
192.0,8.0,279.0
192.0,8.0,280.0
192.0,8.0,281.0
192.0,8.0,282.0
192.0,8.0,283.0
192.0,8.0,284.0
192.0,8.0,285.0
192.0,8.0,286.0
191.0,9.0,287.0
191.0,9.0,288.0
191.0,9.0,289.0
191.0,9.0,290.0
191.0,9.0,291.0
191.0,9.0,292.0
191.0,9.0,293.0
191.0,9.0,294.0
191.0,9.0,295.0
191.0,9.0,296.0
191.0,9.0,297.0
191.0,9.0,298.0
191.0,9.0,299.0
191.0,9.0,300.0
191.0,9.0,301.0
191.0,9.0,302.0
191.0,9.0,303.0
191.0,9.0,304.0
191.0,9.0,305.0
191.0,9.0,306.0
191.0,9.0,307.0
191.0,9.0,308.0
191.0,9.0,309.0
191.0,9.0,310.0
191.0,9.0,311.0
191.0,9.0,312.0
190.0,10.0,313.0
190.0,10.0,314.0
190.0,10.0,315.0
190.0,10.0,316.0
190.0,10.0,317.0
190.0,10.0,318.0
190.0,10.0,319.0
190.0,10.0,320.0
190.0,10.0,321.0
190.0,10.0,322.0
190.0,10.0,323.0
190.0,10.0,324.0
190.0,10.0,325.0
190.0,10.0,326.0
190.0,10.0,327.0
190.0,10.0,328.0
190.0,10.0,329.0
190.0,10.0,330.0
190.0,10.0,331.0
190.0,10.0,332.0
190.0,10.0,333.0
190.0,10.0,334.0
190.0,10.0,335.0
190.0,10.0,336.0
190.0,10.0,337.0
190.0,10.0,338.0
190.0,10.0,339.0
190.0,10.0,340.0
190.0,10.0,341.0
190.0,10.0,342.0
190.0,10.0,343.0
190.0,10.0,344.0
190.0,10.0,345.0
190.0,10.0,346.0
190.0,10.0,347.0
190.0,10.0,348.0
190.0,10.0,349.0
190.0,10.0,350.0
190.0,10.0,351.0
190.0,10.0,352.0
190.0,10.0,353.0
190.0,10.0,354.0
190.0,10.0,355.0
190.0,10.0,356.0
190.0,10.0,357.0
190.0,10.0,358.0
190.0,10.0,359.0
190.0,10.0,360.0
190.0,10.0,361.0
190.0,10.0,362.0
190.0,10.0,363.0
190.0,10.0,364.0
190.0,10.0,365.0
190.0,10.0,366.0
190.0,10.0,367.0
190.0,10.0,368.0
190.0,10.0,369.0
190.0,10.0,370.0
190.0,10.0,371.0
190.0,10.0,372.0
190.0,10.0,373.0
190.0,10.0,374.0
190.0,10.0,375.0
190.0,10.0,376.0
190.0,10.0,377.0
190.0,10.0,378.0
190.0,10.0,379.0
190.0,10.0,380.0
190.0,10.0,381.0
190.0,10.0,382.0
190.0,10.0,383.0
190.0,10.0,384.0
190.0,10.0,385.0
190.0,10.0,386.0
190.0,10.0,387.0
190.0,10.0,388.0
190.0,10.0,389.0
190.0,10.0,390.0
190.0,10.0,391.0
190.0,10.0,392.0
190.0,10.0,393.0
190.0,10.0,394.0
190.0,10.0,395.0
190.0,10.0,396.0
190.0,10.0,397.0
190.0,10.0,398.0
190.0,10.0,399.0
190.0,10.0,400.0
190.0,10.0,401.0
190.0,10.0,402.0
190.0,10.0,403.0
190.0,10.0,404.0
190.0,10.0,405.0
190.0,10.0,406.0
190.0,10.0,407.0
190.0,10.0,408.0
190.0,10.0,409.0
190.0,10.0,410.0
190.0,10.0,411.0
190.0,10.0,412.0
190.0,10.0,413.0
190.0,10.0,414.0
190.0,10.0,415.0
190.0,10.0,416.0
188.0,12.0,417.0
188.0,12.0,418.0
188.0,12.0,419.0
188.0,12.0,420.0
188.0,12.0,421.0
188.0,12.0,422.0
188.0,12.0,423.0
188.0,12.0,424.0
188.0,12.0,425.0
188.0,12.0,426.0
188.0,12.0,427.0
188.0,12.0,428.0
188.0,12.0,429.0
188.0,12.0,430.0
188.0,12.0,431.0
188.0,12.0,432.0
188.0,12.0,433.0
188.0,12.0,434.0
188.0,12.0,435.0
188.0,12.0,436.0
188.0,12.0,437.0
188.0,12.0,438.0
188.0,12.0,439.0
188.0,12.0,440.0
188.0,12.0,441.0
188.0,12.0,442.0
188.0,12.0,443.0
188.0,12.0,444.0
188.0,12.0,445.0
188.0,12.0,446.0
188.0,12.0,447.0
188.0,12.0,448.0
188.0,12.0,449.0
188.0,12.0,450.0
188.0,12.0,451.0
188.0,12.0,452.0
188.0,12.0,453.0
188.0,12.0,454.0
188.0,12.0,455.0
188.0,12.0,456.0
188.0,12.0,457.0
188.0,12.0,458.0
188.0,12.0,459.0
188.0,12.0,460.0
188.0,12.0,461.0
188.0,12.0,462.0
188.0,12.0,463.0
188.0,12.0,464.0
188.0,12.0,465.0
188.0,12.0,466.0
188.0,12.0,467.0
188.0,12.0,468.0
187.0,13.0,469.0
187.0,13.0,470.0
187.0,13.0,471.0
187.0,13.0,472.0
187.0,13.0,473.0
187.0,13.0,474.0
187.0,13.0,475.0
187.0,13.0,476.0
187.0,13.0,477.0
187.0,13.0,478.0
187.0,13.0,479.0
187.0,13.0,480.0
187.0,13.0,481.0
187.0,13.0,482.0
187.0,13.0,483.0
187.0,13.0,484.0
187.0,13.0,485.0
187.0,13.0,486.0
187.0,13.0,487.0
187.0,13.0,488.0
187.0,13.0,489.0
187.0,13.0,490.0
187.0,13.0,491.0
187.0,13.0,492.0
187.0,13.0,493.0
187.0,13.0,494.0
187.0,13.0,495.0
187.0,13.0,496.0
187.0,13.0,497.0
187.0,13.0,498.0
187.0,13.0,499.0
187.0,13.0,500.0
187.0,13.0,501.0
187.0,13.0,502.0
187.0,13.0,503.0
187.0,13.0,504.0
187.0,13.0,505.0
187.0,13.0,506.0
187.0,13.0,507.0
187.0,13.0,508.0
187.0,13.0,509.0
187.0,13.0,510.0
187.0,13.0,511.0
187.0,13.0,512.0
187.0,13.0,513.0
187.0,13.0,514.0
187.0,13.0,515.0
187.0,13.0,516.0
187.0,13.0,517.0
187.0,13.0,518.0
187.0,13.0,519.0
187.0,13.0,520.0
187.0,13.0,521.0
187.0,13.0,522.0
187.0,13.0,523.0
187.0,13.0,524.0
187.0,13.0,525.0
187.0,13.0,526.0
187.0,13.0,527.0
187.0,13.0,528.0
187.0,13.0,529.0
187.0,13.0,530.0
187.0,13.0,531.0
187.0,13.0,532.0
187.0,13.0,533.0
187.0,13.0,534.0
187.0,13.0,535.0
187.0,13.0,536.0
187.0,13.0,537.0
187.0,13.0,538.0
187.0,13.0,539.0
187.0,13.0,540.0
187.0,13.0,541.0
187.0,13.0,542.0
187.0,13.0,543.0
187.0,13.0,544.0
187.0,13.0,545.0
187.0,13.0,546.0
187.0,13.0,547.0
187.0,13.0,548.0
186.0,14.0,549.0
186.0,14.0,550.0
186.0,14.0,551.0
186.0,14.0,552.0
186.0,14.0,553.0
186.0,14.0,554.0
186.0,14.0,555.0
186.0,14.0,556.0
186.0,14.0,557.0
186.0,14.0,558.0
186.0,14.0,559.0
186.0,14.0,560.0
186.0,14.0,561.0
186.0,14.0,562.0
186.0,14.0,563.0
186.0,14.0,564.0
186.0,14.0,565.0
186.0,14.0,566.0
186.0,14.0,567.0
186.0,14.0,568.0
186.0,14.0,569.0
186.0,14.0,570.0
186.0,14.0,571.0
186.0,14.0,572.0
186.0,14.0,573.0
186.0,14.0,574.0
186.0,14.0,575.0
186.0,14.0,576.0
186.0,14.0,577.0
186.0,14.0,578.0
186.0,14.0,579.0
186.0,14.0,580.0
186.0,14.0,581.0
186.0,14.0,582.0
186.0,14.0,583.0
186.0,14.0,584.0
186.0,14.0,585.0
186.0,14.0,586.0
186.0,14.0,587.0
186.0,14.0,588.0
186.0,14.0,589.0
186.0,14.0,590.0
186.0,14.0,591.0
186.0,14.0,592.0
186.0,14.0,593.0
186.0,14.0,594.0
186.0,14.0,595.0
186.0,14.0,596.0
186.0,14.0,597.0
186.0,14.0,598.0
186.0,14.0,599.0
186.0,14.0,600.0
186.0,14.0,601.0
186.0,14.0,602.0
186.0,14.0,603.0
186.0,14.0,604.0
186.0,14.0,605.0
186.0,14.0,606.0
186.0,14.0,607.0
186.0,14.0,608.0
186.0,14.0,609.0
186.0,14.0,610.0
186.0,14.0,611.0
186.0,14.0,612.0
186.0,14.0,613.0
186.0,14.0,614.0
186.0,14.0,615.0
186.0,14.0,616.0
186.0,14.0,617.0
186.0,14.0,618.0
186.0,14.0,619.0
186.0,14.0,620.0
186.0,14.0,621.0
186.0,14.0,622.0
186.0,14.0,623.0
186.0,14.0,624.0
186.0,14.0,625.0
186.0,14.0,626.0
186.0,14.0,627.0
186.0,14.0,628.0
186.0,14.0,629.0
186.0,14.0,630.0
186.0,14.0,631.0
186.0,14.0,632.0
186.0,14.0,633.0
186.0,14.0,634.0
186.0,14.0,635.0
186.0,14.0,636.0
186.0,14.0,637.0
186.0,14.0,638.0
186.0,14.0,639.0
186.0,14.0,640.0
186.0,14.0,641.0
186.0,14.0,642.0
186.0,14.0,643.0
186.0,14.0,644.0
186.0,14.0,645.0
186.0,14.0,646.0
186.0,14.0,647.0
186.0,14.0,648.0
186.0,14.0,649.0
186.0,14.0,650.0
186.0,14.0,651.0
186.0,14.0,652.0
186.0,14.0,653.0
186.0,14.0,654.0
186.0,14.0,655.0
186.0,14.0,656.0
186.0,14.0,657.0
186.0,14.0,658.0
186.0,14.0,659.0
186.0,14.0,660.0
186.0,14.0,661.0
186.0,14.0,662.0
186.0,14.0,663.0
186.0,14.0,664.0
186.0,14.0,665.0
186.0,14.0,666.0
186.0,14.0,667.0
186.0,14.0,668.0
186.0,14.0,669.0
186.0,14.0,670.0
186.0,14.0,671.0
186.0,14.0,672.0
186.0,14.0,673.0
186.0,14.0,674.0
186.0,14.0,675.0
186.0,14.0,676.0
186.0,14.0,677.0
186.0,14.0,678.0
186.0,14.0,679.0
186.0,14.0,680.0
186.0,14.0,681.0
186.0,14.0,682.0
186.0,14.0,683.0
186.0,14.0,684.0
186.0,14.0,685.0
186.0,14.0,686.0
186.0,14.0,687.0
186.0,14.0,688.0
186.0,14.0,689.0
186.0,14.0,690.0
186.0,14.0,691.0
186.0,14.0,692.0
186.0,14.0,693.0
186.0,14.0,694.0
186.0,14.0,695.0
186.0,14.0,696.0
185.0,15.0,697.0
185.0,15.0,698.0
185.0,15.0,699.0
185.0,15.0,700.0
185.0,15.0,701.0
185.0,15.0,702.0
185.0,15.0,703.0
185.0,15.0,704.0
185.0,15.0,705.0
185.0,15.0,706.0
185.0,15.0,707.0
185.0,15.0,708.0
185.0,15.0,709.0
185.0,15.0,710.0
185.0,15.0,711.0
185.0,15.0,712.0
185.0,15.0,713.0
185.0,15.0,714.0
185.0,15.0,715.0
185.0,15.0,716.0
184.0,16.0,717.0
184.0,16.0,718.0
184.0,16.0,719.0
184.0,16.0,720.0
184.0,16.0,721.0
184.0,16.0,722.0
184.0,16.0,723.0
184.0,16.0,724.0
184.0,16.0,725.0
184.0,16.0,726.0
183.0,17.0,727.0
183.0,17.0,728.0
183.0,17.0,729.0
183.0,17.0,730.0
183.0,17.0,731.0
183.0,17.0,732.0
183.0,17.0,733.0
183.0,17.0,734.0
183.0,17.0,735.0
183.0,17.0,736.0
183.0,17.0,737.0
183.0,17.0,738.0
183.0,17.0,739.0
183.0,17.0,740.0
183.0,17.0,741.0
183.0,17.0,742.0
183.0,17.0,743.0
183.0,17.0,744.0
183.0,17.0,745.0
183.0,17.0,746.0
183.0,17.0,747.0
183.0,17.0,748.0
183.0,17.0,749.0
183.0,17.0,750.0
183.0,17.0,751.0
183.0,17.0,752.0
183.0,17.0,753.0
183.0,17.0,754.0
183.0,17.0,755.0
183.0,17.0,756.0
183.0,17.0,757.0
183.0,17.0,758.0
183.0,17.0,759.0
183.0,17.0,760.0
183.0,17.0,761.0
183.0,17.0,762.0
183.0,17.0,763.0
183.0,17.0,764.0
183.0,17.0,765.0
182.0,18.0,766.0
182.0,18.0,767.0
182.0,18.0,768.0
182.0,18.0,769.0
182.0,18.0,770.0
182.0,18.0,771.0
182.0,18.0,772.0
182.0,18.0,773.0
182.0,18.0,774.0
182.0,18.0,775.0
182.0,18.0,776.0
182.0,18.0,777.0
182.0,18.0,778.0
182.0,18.0,779.0
182.0,18.0,780.0
182.0,18.0,781.0
182.0,18.0,782.0
182.0,18.0,783.0
182.0,18.0,784.0
182.0,18.0,785.0
182.0,18.0,786.0
182.0,18.0,787.0
182.0,18.0,788.0
182.0,18.0,789.0
182.0,18.0,790.0
182.0,18.0,791.0
182.0,18.0,792.0
182.0,18.0,793.0
182.0,18.0,794.0
182.0,18.0,795.0
182.0,18.0,796.0
182.0,18.0,797.0
182.0,18.0,798.0
182.0,18.0,799.0
182.0,18.0,800.0
182.0,18.0,801.0
182.0,18.0,802.0
182.0,18.0,803.0
182.0,18.0,804.0
182.0,18.0,805.0
182.0,18.0,806.0
182.0,18.0,807.0
182.0,18.0,808.0
182.0,18.0,809.0
182.0,18.0,810.0
182.0,18.0,811.0
182.0,18.0,812.0
182.0,18.0,813.0
182.0,18.0,814.0
182.0,18.0,815.0
182.0,18.0,816.0
182.0,18.0,817.0
182.0,18.0,818.0
182.0,18.0,819.0
182.0,18.0,820.0
182.0,18.0,821.0
182.0,18.0,822.0
182.0,18.0,823.0
182.0,18.0,824.0
182.0,18.0,825.0
182.0,18.0,826.0
182.0,18.0,827.0
182.0,18.0,828.0
182.0,18.0,829.0
182.0,18.0,830.0
182.0,18.0,831.0
182.0,18.0,832.0
182.0,18.0,833.0
182.0,18.0,834.0
182.0,18.0,835.0
182.0,18.0,836.0
182.0,18.0,837.0
182.0,18.0,838.0
182.0,18.0,839.0
182.0,18.0,840.0
182.0,18.0,841.0
182.0,18.0,842.0
182.0,18.0,843.0
182.0,18.0,844.0
182.0,18.0,845.0
182.0,18.0,846.0
182.0,18.0,847.0
182.0,18.0,848.0
182.0,18.0,849.0
182.0,18.0,850.0
182.0,18.0,851.0
182.0,18.0,852.0
182.0,18.0,853.0
182.0,18.0,854.0
182.0,18.0,855.0
182.0,18.0,856.0
182.0,18.0,857.0
182.0,18.0,858.0
182.0,18.0,859.0
182.0,18.0,860.0
182.0,18.0,861.0
182.0,18.0,862.0
182.0,18.0,863.0
182.0,18.0,864.0
182.0,18.0,865.0
182.0,18.0,866.0
182.0,18.0,867.0
182.0,18.0,868.0
182.0,18.0,869.0
182.0,18.0,870.0
182.0,18.0,871.0
182.0,18.0,872.0
182.0,18.0,873.0
182.0,18.0,874.0
181.0,19.0,875.0
181.0,19.0,876.0
181.0,19.0,877.0
181.0,19.0,878.0
181.0,19.0,879.0
181.0,19.0,880.0
181.0,19.0,881.0
181.0,19.0,882.0
180.0,20.0,883.0
180.0,20.0,884.0
180.0,20.0,885.0
180.0,20.0,886.0
180.0,20.0,887.0
180.0,20.0,888.0
180.0,20.0,889.0
180.0,20.0,890.0
180.0,20.0,891.0
180.0,20.0,892.0
180.0,20.0,893.0
180.0,20.0,894.0
180.0,20.0,895.0
180.0,20.0,896.0
180.0,20.0,897.0
179.0,21.0,898.0
179.0,21.0,899.0
179.0,21.0,900.0
179.0,21.0,901.0
179.0,21.0,902.0
179.0,21.0,903.0
179.0,21.0,904.0
179.0,21.0,905.0
179.0,21.0,906.0
179.0,21.0,907.0
179.0,21.0,908.0
179.0,21.0,909.0
179.0,21.0,910.0
179.0,21.0,911.0
179.0,21.0,912.0
179.0,21.0,913.0
179.0,21.0,914.0
179.0,21.0,915.0
179.0,21.0,916.0
178.0,22.0,917.0
178.0,22.0,918.0
178.0,22.0,919.0
178.0,22.0,920.0
178.0,22.0,921.0
178.0,22.0,922.0
178.0,22.0,923.0
178.0,22.0,924.0
178.0,22.0,925.0
178.0,22.0,926.0
178.0,22.0,927.0
178.0,22.0,928.0
178.0,22.0,929.0
178.0,22.0,930.0
178.0,22.0,931.0
178.0,22.0,932.0
178.0,22.0,933.0
178.0,22.0,934.0
178.0,22.0,935.0
178.0,22.0,936.0
178.0,22.0,937.0
178.0,22.0,938.0
178.0,22.0,939.0
178.0,22.0,940.0
178.0,22.0,941.0
178.0,22.0,942.0
178.0,22.0,943.0
178.0,22.0,944.0
178.0,22.0,945.0
178.0,22.0,946.0
178.0,22.0,947.0
178.0,22.0,948.0
178.0,22.0,949.0
178.0,22.0,950.0
178.0,22.0,951.0
178.0,22.0,952.0
178.0,22.0,953.0
178.0,22.0,954.0
178.0,22.0,955.0
178.0,22.0,956.0
178.0,22.0,957.0
178.0,22.0,958.0
177.0,23.0,959.0
177.0,23.0,960.0
177.0,23.0,961.0
177.0,23.0,962.0
177.0,23.0,963.0
177.0,23.0,964.0
177.0,23.0,965.0
177.0,23.0,966.0
177.0,23.0,967.0
177.0,23.0,968.0
177.0,23.0,969.0
177.0,23.0,970.0
177.0,23.0,971.0
177.0,23.0,972.0
177.0,23.0,973.0
177.0,23.0,974.0
177.0,23.0,975.0
177.0,23.0,976.0
177.0,23.0,977.0
177.0,23.0,978.0
177.0,23.0,979.0
177.0,23.0,980.0
177.0,23.0,981.0
177.0,23.0,982.0
177.0,23.0,983.0
177.0,23.0,984.0
177.0,23.0,985.0
177.0,23.0,986.0
177.0,23.0,987.0
177.0,23.0,988.0
177.0,23.0,989.0
177.0,23.0,990.0
176.0,24.0,991.0
176.0,24.0,992.0
176.0,24.0,993.0
176.0,24.0,994.0
176.0,24.0,995.0
176.0,24.0,996.0
176.0,24.0,997.0
176.0,24.0,998.0
176.0,24.0,999.0
176.0,24.0,1000.0
176.0,24.0,1001.0
176.0,24.0,1002.0
176.0,24.0,1003.0
176.0,24.0,1004.0
176.0,24.0,1005.0
176.0,24.0,1006.0
176.0,24.0,1007.0
176.0,24.0,1008.0
176.0,24.0,1009.0
176.0,24.0,1010.0
176.0,24.0,1011.0
176.0,24.0,1012.0
176.0,24.0,1013.0
176.0,24.0,1014.0
176.0,24.0,1015.0
176.0,24.0,1016.0
176.0,24.0,1017.0
176.0,24.0,1018.0
176.0,24.0,1019.0
176.0,24.0,1020.0
176.0,24.0,1021.0
176.0,24.0,1022.0
176.0,24.0,1023.0
176.0,24.0,1024.0
176.0,24.0,1025.0
176.0,24.0,1026.0
176.0,24.0,1027.0
176.0,24.0,1028.0
176.0,24.0,1029.0
176.0,24.0,1030.0
176.0,24.0,1031.0
176.0,24.0,1032.0
176.0,24.0,1033.0
176.0,24.0,1034.0
176.0,24.0,1035.0
176.0,24.0,1036.0
176.0,24.0,1037.0
176.0,24.0,1038.0
176.0,24.0,1039.0
176.0,24.0,1040.0
176.0,24.0,1041.0
176.0,24.0,1042.0
176.0,24.0,1043.0
176.0,24.0,1044.0
176.0,24.0,1045.0
176.0,24.0,1046.0
176.0,24.0,1047.0
176.0,24.0,1048.0
176.0,24.0,1049.0
176.0,24.0,1050.0
176.0,24.0,1051.0
176.0,24.0,1052.0
176.0,24.0,1053.0
176.0,24.0,1054.0
176.0,24.0,1055.0
176.0,24.0,1056.0
176.0,24.0,1057.0
176.0,24.0,1058.0
176.0,24.0,1059.0
176.0,24.0,1060.0
176.0,24.0,1061.0
176.0,24.0,1062.0
176.0,24.0,1063.0
176.0,24.0,1064.0
176.0,24.0,1065.0
176.0,24.0,1066.0
176.0,24.0,1067.0
176.0,24.0,1068.0
176.0,24.0,1069.0
176.0,24.0,1070.0
176.0,24.0,1071.0
176.0,24.0,1072.0
176.0,24.0,1073.0
176.0,24.0,1074.0
176.0,24.0,1075.0
176.0,24.0,1076.0
176.0,24.0,1077.0
176.0,24.0,1078.0
176.0,24.0,1079.0
176.0,24.0,1080.0
176.0,24.0,1081.0
176.0,24.0,1082.0
176.0,24.0,1083.0
176.0,24.0,1084.0
176.0,24.0,1085.0
176.0,24.0,1086.0
176.0,24.0,1087.0
176.0,24.0,1088.0
176.0,24.0,1089.0
176.0,24.0,1090.0
176.0,24.0,1091.0
176.0,24.0,1092.0
