"tick","Other_happiness","EV_happiness"
1.0,0.48743727518957836,0.33669512613275915
2.0,0.4846060130998666,0.45372303191996183
3.0,0.4848388135118799,0.48691920912113135
4.0,0.4842037638016992,0.4933666276355016
5.0,0.4828687425622284,0.47694959899572975
6.0,0.48540769378990917,0.4854711592606593
7.0,0.4846705488476588,0.48458324758229787
8.0,0.48540689504610773,0.46003823064254196
9.0,0.4858059863470062,0.48485188562654674
10.0,0.4871648205443505,0.48691920912113135
11.0,0.4855494412669925,0.45756358717161155
12.0,0.4842407508270342,0.494624336256088
13.0,0.4821988752385051,0.4868313033622737
14.0,0.48179082662646755,0.4352162969057835
15.0,0.4847460816516621,0.49522959528454513
16.0,0.48498464731678576,0.4834598129216571
17.0,0.4836607178545859,0.4868313033622736
18.0,0.4862584820496484,0.4934208119770148
19.0,0.4852949248368479,0.43547001220964104
20.0,0.4829695923752227,0.4353598332628507
21.0,0.48014198414447207,0.4885139142627869
22.0,0.482359396882657,0.48240498701070755
23.0,0.4831596090712706,0.4389727406739751
24.0,0.4866816303056004,0.494624336256088
25.0,0.4824096142569661,0.4510036153581697
26.0,0.48270435387802707,0.4875244681495883
27.0,0.4849595576495478,0.48523516708325815
28.0,0.48261037935243534,0.48691920912113135
29.0,0.4852172113554839,0.44750767284818843
30.0,0.48440735426149817,0.47476694472297626
31.0,0.4869845874146854,0.4528847330216941
32.0,0.4831541832198841,0.4844980554596688
33.0,0.47810879872783685,0.4825118651442916
34.0,0.4840151142397172,0.47741900876420956
35.0,0.48475290631448614,0.49522959528454513
36.0,0.48631660567741364,0.4813569429725696
37.0,0.48509169565543286,0.4370220147042013
38.0,0.4851520686953009,0.48691920912113135
39.0,0.47655814023321347,0.4902287126388684
40.0,0.48000639752493235,0.4939718866639587
41.0,0.479434556575003,0.4868936481174163
42.0,0.4848954434864751,0.477553282724155
43.0,0.4831664696560699,0.47867415423711795
44.0,0.4827716172062931,0.4777520175200471
45.0,0.4857329362580912,0.4939718866639587
46.0,0.48499296219149934,0.4868313033622737
47.0,0.4850874330821644,0.46723682291887253
48.0,0.4858840239742805,0.47364861256653235
49.0,0.4835266072419431,0.42531930707082527
50.0,0.48233081677121264,0.4308349313305384
51.0,0.4858484034617641,0.4923186472012255
52.0,0.48436729058315686,0.4816011517747682
53.0,0.47978145451888754,0.4573568502469481
54.0,0.4878993849345635,0.4480486874444102
55.0,0.48184746234108716,0.4912693211037226
56.0,0.48488459313949206,0.4768059627358322
57.0,0.48539378541766925,0.4933666276355016
58.0,0.4860084077039233,0.48318518776615543
59.0,0.4838926147421415,0.48911917329124394
60.0,0.48419265016335206,0.4885139142627869
61.0,0.4822633400475118,0.4913455890765594
62.0,0.4853231625006537,0.45949971123334304
63.0,0.480721705437308,0.4777450451909459
64.0,0.4797496790594484,0.4939762792292308
65.0,0.4810709970380431,0.4851885066107549
66.0,0.4807528090592736,0.4868187339493654
67.0,0.47986711296386647,0.47198216644426083
68.0,0.4845776362125625,0.4925952907301207
69.0,0.4842112591637039,0.4875244681495883
70.0,0.4803310786611322,0.4833255389617113
71.0,0.4871942304646488,0.48906207010752617
72.0,0.4844648864226304,0.4863358490308865
73.0,0.4810025387976254,0.48854899697953913
74.0,0.48635357351921676,0.4875244681495883
75.0,0.4836853738653932,0.4844980554596688
76.0,0.4829609249637692,0.48911917329124394
77.0,0.48598134345800476,0.47189697432163163
78.0,0.48287009544909826,0.4918395579773723
79.0,0.4857767880741018,0.43829059044928975
80.0,0.4834209365520473,0.48906207010752617
81.0,0.48016892597514504,0.48815135673800286
82.0,0.48344176285360513,0.4885139142627869
83.0,0.4821530464944026,0.4885139142627869
84.0,0.4867753760445114,0.4376710883060786
85.0,0.4873206852046808,0.49114910682628593
86.0,0.4836382524107709,0.494624336256088
87.0,0.48283021542117605,0.48815135673800286
88.0,0.4826995775047105,0.4952295952845452
89.0,0.48361893296725644,0.48503868483298507
90.0,0.4835450538025507,0.4817132771809531
91.0,0.4820687698929693,0.493506004099644
92.0,0.4819246899853802,0.4747419647609208
93.0,0.48757997586331814,0.47540704484361007
94.0,0.48243260482528955,0.4917543658547432
95.0,0.4835299731903226,0.4824118324873809
96.0,0.484731578461768,0.48311712417274866
97.0,0.48252713659922974,0.4845832475822978
98.0,0.4834101169358215,0.47863072189592965
99.0,0.48359674503505085,0.4885139142627869
100.0,0.4841068715605794,0.4808087871278301
101.0,0.48499994465769913,0.49371362288656473
102.0,0.48189599716926573,0.4851885066107549
103.0,0.48127633973951855,0.4952295952845452
104.0,0.48505785157879294,0.48906207010752617
105.0,0.48087175625781536,0.43535983326285077
106.0,0.48156953130967445,0.4759016185614536
107.0,0.4793395419218976,0.4825118651442916
108.0,0.4849080251976777,0.4817984693035823
109.0,0.48377690836804405,0.48126448332206945
110.0,0.48417723248882744,0.40690617206120466
111.0,0.4832534358630723,0.4842044484142564
112.0,0.4845776991528187,0.4770067021794475
113.0,0.4840172337506035,0.4825118651442916
114.0,0.47947080053889174,0.42510202830627264
115.0,0.4839225382093383,0.4863358490308865
116.0,0.483473371947679,0.48407589652133826
117.0,0.48447274353169256,0.49371362288656473
118.0,0.48514347148564607,0.44638557428629494
119.0,0.48413288995204323,0.48052800629797443
120.0,0.48252294355829023,0.48141404615628725
121.0,0.48521787469269495,0.47701239440728666
122.0,0.48505996536362284,0.4626544736111798
123.0,0.48039309091228,0.4816011517747682
124.0,0.48455200431043105,0.44546959641631156
125.0,0.47979516606531947,0.48393079799016836
126.0,0.4853866544070143,0.4877940916739207
127.0,0.4830095269896241,0.48476669350391793
128.0,0.48241187952597214,0.4820641915442906
129.0,0.48350429873311634,0.494624336256088
130.0,0.4793444986273133,0.48906207010752617
131.0,0.48365341581140076,0.4844980554596688
132.0,0.4853361107722225,0.4639631752560041
133.0,0.48298577224793876,0.4901509889472786
134.0,0.4844906046463106,0.4576949581511074
135.0,0.483070712173625,0.48801408967325
136.0,0.4884845816155505,0.475967407077818
137.0,0.4835314008972342,0.4896673291359832
138.0,0.4845013188541492,0.494624336256088
139.0,0.4850979098530695,0.4589515553886036
140.0,0.48439014562835647,0.4801452298408491
141.0,0.48297213303722347,0.4824266730216623
142.0,0.47767821676219624,0.48683130336227365
143.0,0.48365225449053884,0.46422493830276795
144.0,0.48741075429294567,0.43827634733453547
145.0,0.4837713875546312,0.42332585765789804
146.0,0.48287740029256954,0.4835122960771856
147.0,0.4835004810228418,0.4718969743216317
148.0,0.4845434723557558,0.45124642825364697
149.0,0.48474511613114096,0.4890620701075261
150.0,0.4806209545627408,0.4838039051922707
151.0,0.482727868680018,0.471504523570819
152.0,0.4819633098027912,0.4777520175200471
153.0,0.48225957531284175,0.47786012212101747
154.0,0.47957946857541844,0.494624336256088
155.0,0.48638345789566967,0.4630102262500808
156.0,0.4860561098346054,0.48197611083086933
157.0,0.48530863659619716,0.4797099583363538
158.0,0.4843143664294747,0.4896673291359832
159.0,0.4794522328438485,0.48485188562654685
160.0,0.48450106439288254,0.4597975277111817
161.0,0.48300280396379913,0.4869192091211313
162.0,0.4819210572950043,0.4628679309437337
163.0,0.4863779253157986,0.4918395579773724
164.0,0.48357703207265296,0.49342081197701493
165.0,0.4824031231641976,0.47687812044734107
166.0,0.4836007776000774,0.4795782271584403
167.0,0.484339474894778,0.4912693211037226
168.0,0.4859219349024503,0.4837335534701027
169.0,0.48256832935755795,0.4825799287376985
170.0,0.4850114505457236,0.44362096782292393
171.0,0.4844670663741376,0.48311712417274866
172.0,0.481400353722737,0.4851885066107548
173.0,0.48257373933187764,0.4830269798559374
174.0,0.48089856646997836,0.4917543658547432
175.0,0.48485556170526994,0.4754800606311989
176.0,0.48539427776030014,0.4031028984102326
177.0,0.4836762725714152,0.4871574329993631
178.0,0.48050575153039743,0.43876120796307705
179.0,0.4825944748477616,0.4798308991212634
180.0,0.48341142467108633,0.4909589129939855
181.0,0.4832623704377961,0.48558804895266866
182.0,0.484478137291338,0.4845584207324147
183.0,0.47988850414664885,0.48852223200010936
184.0,0.4842963122334795,0.4855318009976223
185.0,0.4833724743957172,0.45321625908420615
186.0,0.48247286089159863,0.4872750015731284
187.0,0.4811518266585794,0.47867027937174866
188.0,0.479915948575961,0.4948473552370885
189.0,0.48525824485153707,0.4928902576156572
190.0,0.48346664713454246,0.47068344695549197
191.0,0.48192697124424455,0.4958258958739768
192.0,0.48282859013903856,0.4870653272651373
193.0,0.48079114887925845,0.4870653272651373
194.0,0.4837443604683981,0.48226492946154853
195.0,0.48579732516269536,0.48643579852721
196.0,0.48490732145053456,0.4658758915849154
197.0,0.483142537695974,0.49236065596575707
198.0,0.48257021989121107,0.48903075227633763
199.0,0.4817140338367966,0.48005581153527666
200.0,0.48119967656346635,0.4899496749799383
201.0,0.4848094409698406,0.47237642245575884
202.0,0.4825361711736125,0.47792107663260397
203.0,0.4838807410803369,0.4842105676640113
204.0,0.4801913615865938,0.4896147509034587
205.0,0.4826583472791312,0.48488113248950404
206.0,0.4867645498215156,0.4372117452895988
207.0,0.4858201459296111,0.4710955588904394
208.0,0.48129912772452027,0.4952962942240771
209.0,0.4816397929142605,0.48346951588343423
210.0,0.4858725633421022,0.48475743764548646
211.0,0.48157122354228954,0.489858417950972
212.0,0.48416294653820213,0.48707564747021764
213.0,0.4804635672678655,0.48743845087876225
214.0,0.48722333971405984,0.4658758915849153
215.0,0.4861152260444264,0.4952962942240771
216.0,0.48002490333406067,0.4952962942240771
217.0,0.48406259053032,0.4855732590675372
218.0,0.4819278060132834,0.4958258958739768
219.0,0.4808595967047614,0.4767021476614088
220.0,0.48410502472518363,0.48469788200125496
221.0,0.48626162676769424,0.47415902542266425
222.0,0.48050688075542247,0.4942432104798881
223.0,0.48143519765713494,0.4922554684730004
224.0,0.4816624205600791,0.4922554684730004
225.0,0.48141905321073963,0.46442023697746837
226.0,0.4821480286195303,0.4944994200257443
227.0,0.48422906899583684,0.48553180099762216
228.0,0.48202801768854364,0.4890307522763375
229.0,0.4809406005327501,0.48563801423842184
230.0,0.4835160455696329,0.47700409375261266
231.0,0.483757751147747,0.48674539992322846
232.0,0.4832778822481739,0.4939521321335504
233.0,0.48334916864347666,0.4780154514023991
234.0,0.48320074169088245,0.4709011145211421
235.0,0.48581309091181435,0.4794840431653185
236.0,0.4829599601499348,0.4747687040517049
237.0,0.4828426868069875,0.4904792766298387
238.0,0.4810358292702847,0.4841226554382327
239.0,0.4824716999704711,0.4841226554382327
240.0,0.4839882971196026,0.4943177535871885
241.0,0.48488072994919806,0.4879180872429091
242.0,0.48037793721399874,0.4870399432844106
243.0,0.47928363263993695,0.4838789883907192
244.0,0.482766754987784,0.49529629422407717
245.0,0.48443624017871806,0.44652245125807377
246.0,0.4844503510814549,0.45761669742569333
247.0,0.4796389281276247,0.49529629422407706
248.0,0.48443218204939426,0.455979972942887
249.0,0.4837174483483186,0.4862964609362398
250.0,0.4830634328293623,0.49529629422407706
251.0,0.48726416759489594,0.4852274836511549
252.0,0.48360648925893973,0.4846412054088928
253.0,0.4803084386257228,0.48703994328441064
254.0,0.4830700385382817,0.4838404547654944
255.0,0.4839898576244753,0.41240646781641266
256.0,0.48073317227148216,0.4659307685259901
257.0,0.48133174407544316,0.48847739044198946
258.0,0.48354776317152504,0.4944994200257443
259.0,0.4869470669218139,0.46763394796882074
260.0,0.4830337120624413,0.4750145286000142
261.0,0.4818295460652645,0.4944817337834505
262.0,0.48363210456110983,0.4790107658880586
263.0,0.48361485476423627,0.49061615450197643
264.0,0.48432589294046163,0.49033419195636097
265.0,0.4812024687072501,0.49178976257264395
266.0,0.48414103243528434,0.48804386790202575
267.0,0.4862906682929718,0.48569578119388424
268.0,0.4848895503408743,0.4544364879984377
269.0,0.48397925208472486,0.4482672584098623
270.0,0.48446376799975605,0.4686271688068842
271.0,0.4846109199220317,0.46846777834900327
272.0,0.48314674052895956,0.495296294224077
273.0,0.486703776209528,0.4952217511167764
274.0,0.48497783930803107,0.49334437332198106
275.0,0.48277846561917714,0.49285961323020094
276.0,0.4787646744504229,0.49334437332198106
277.0,0.48417479241598516,0.4840736606406346
278.0,0.48619251351401854,0.49042931134408524
279.0,0.48348874595751995,0.49529629422407706
280.0,0.4841863076575755,0.4793512627571165
281.0,0.4823775247607598,0.4922554684730004
282.0,0.47995866349156574,0.49582589587397674
283.0,0.4812169162720716,0.48475743764548634
284.0,0.4848857809174523,0.48738848559300896
285.0,0.48472850944865586,0.4870399432844106
286.0,0.4799340870143693,0.48931983021468056
287.0,0.4861143365448569,0.4480599213065661
288.0,0.4846813170520693,0.4676825773435892
289.0,0.4843051338378762,0.45372790804594
290.0,0.4828681393754792,0.4253460608390611
291.0,0.4852335998790445,0.4828434407116549
292.0,0.48283817573778137,0.47056602463250413
293.0,0.47893861673026,0.48564795768216956
294.0,0.4828201902082207,0.47037649455397057
295.0,0.48039250923113636,0.47286512111587026
296.0,0.48276369072508474,0.48807734414335785
297.0,0.4804563055680526,0.49203162979622417
298.0,0.4817141310694308,0.4906910588746345
299.0,0.4843302778138068,0.4963578368006611
300.0,0.48439631117348464,0.48218447549669646
301.0,0.4847576862367143,0.45543875547643836
302.0,0.48825015752097106,0.4618086726799502
303.0,0.4820082477089862,0.49635783680066103
304.0,0.4799218532412771,0.4865341173520215
305.0,0.48749028521569276,0.46330850695467135
306.0,0.4841720951411556,0.49635783680066103
307.0,0.48394557271758787,0.4592407860168284
308.0,0.48457766144951125,0.45657858672472074
309.0,0.48455206767864734,0.4821850506726871
310.0,0.4842500653198324,0.4870991263273461
311.0,0.4836715638902627,0.4818921450877627
312.0,0.4845955617506788,0.4954880229012046
313.0,0.4850951238882245,0.4726104737255071
314.0,0.4859729599340215,0.4748096704525912
315.0,0.48742491746625416,0.4711343359121729
316.0,0.4822476372310139,0.4860407030879557
317.0,0.48623142351970927,0.48770807300734553
318.0,0.48101207519200706,0.49092011206295416
319.0,0.48242083287592935,0.49219654157119463
320.0,0.4855822500578288,0.4769760478332408
321.0,0.48441686863213584,0.48848677721951145
322.0,0.4825754610896186,0.4839700125065144
323.0,0.48438406656521565,0.48881289501453146
324.0,0.4820178584684704,0.4840246681737554
325.0,0.4836664964164773,0.4909457467329432
326.0,0.48249212181097395,0.46806650013395507
327.0,0.48672168287354545,0.4832493147261867
328.0,0.4855052812807661,0.4809374803413634
329.0,0.4834204519173585,0.49428939251973375
330.0,0.482850194403876,0.4738514405447771
331.0,0.4820902405301764,0.436926985154543
332.0,0.48306754481039893,0.49017119650221225
333.0,0.48109125267363706,0.4913284641261254
334.0,0.4810972082676649,0.49037632263472886
335.0,0.48319987091384653,0.4912834046280134
336.0,0.487393515571142,0.4861544575067148
337.0,0.48033001482355636,0.47449350401860846
338.0,0.484917457437373,0.4777643793937051
339.0,0.4804001403309132,0.47212947733213
340.0,0.48280188641516747,0.4962983718006751
341.0,0.4869197075731114,0.4842546425563602
342.0,0.4842120871858293,0.48704071444453434
343.0,0.4871775696815054,0.4732819685905732
344.0,0.48020494719342244,0.48517833628662077
345.0,0.4838945274713992,0.4814026079016586
346.0,0.481772217003399,0.4872156381853015
347.0,0.4839231291630847,0.4545246208717925
348.0,0.48218911483805044,0.4616881114007649
349.0,0.4836723096225711,0.4736240350574645
350.0,0.48017110325324297,0.4825938235548305
351.0,0.48210190983291884,0.48351461906801374
352.0,0.48293403234814386,0.47976112702815266
353.0,0.4848942683047294,0.4491409034582848
354.0,0.4823180472651037,0.4733388450985736
355.0,0.4850488291764642,0.48652702777532275
356.0,0.48659280635524166,0.48855627219954956
357.0,0.48128662264370337,0.49282846681660175
358.0,0.48202524681579473,0.4843809205293895
359.0,0.48378602197850146,0.47996553712663576
360.0,0.48429344032287214,0.48627142738343787
361.0,0.4831275962606782,0.4890985051704056
362.0,0.48716805296543997,0.48187583414569957
363.0,0.4815117722019439,0.4595937484448793
364.0,0.48678778675392304,0.4572791250217085
365.0,0.48094932893513354,0.49369555256353564
366.0,0.48210946851449743,0.4884188895815717
367.0,0.4821813782583451,0.4870039811755553
368.0,0.47904391424289167,0.45702247574918275
369.0,0.48373899580396024,0.47506142157029135
370.0,0.483435352446846,0.49282846681660175
371.0,0.4830749509506391,0.48587845893141823
372.0,0.4841842929956875,0.47976112702815266
373.0,0.48371891372633163,0.4819695433706765
374.0,0.4836627726296049,0.4697931948429742
375.0,0.47942515689191173,0.49672205312059503
376.0,0.4817106359056457,0.48978728282090384
377.0,0.4826079394381895,0.4877831420919197
378.0,0.48057534769927496,0.4839846959451528
379.0,0.4809605709910031,0.48969329104894216
380.0,0.4831060263631098,0.4962983718006752
381.0,0.4795710545924864,0.4913284641261253
382.0,0.4811479272270037,0.48436331776696034
383.0,0.4868969021777048,0.48347829054390756
384.0,0.4845866164577771,0.489269609729022
385.0,0.4815709540823713,0.4662988678857234
386.0,0.4819699568643879,0.48392605571842445
387.0,0.4862541210803101,0.4827926848793003
388.0,0.4852615934879411,0.42067430180403254
389.0,0.4840078425360806,0.48276599892042615
390.0,0.48277907045817275,0.45302634523027413
391.0,0.4811357872366274,0.4675669496257021
392.0,0.48066753704659704,0.4751040190792039
393.0,0.485009898415881,0.4784457901917808
394.0,0.48174166202771945,0.483474219589241
395.0,0.48232862723895426,0.4786671032260455
396.0,0.48302440334229924,0.4823981977274968
397.0,0.4805361911279443,0.4881979820684478
398.0,0.4841616555934443,0.489269609729022
399.0,0.48417198678692674,0.48577950745043574
400.0,0.4857510133959349,0.4712112225303791
401.0,0.48565068784309673,0.47449611272248676
402.0,0.48479092756494,0.4855265230684842
403.0,0.48150326867508625,0.49319175938166115
404.0,0.4827796946160252,0.4882398568064103
405.0,0.4832511504368107,0.46251601018056204
406.0,0.48622671231337383,0.49541797576626506
407.0,0.48119655346282275,0.4920210764053643
408.0,0.48248843784768725,0.47919629236965333
409.0,0.4829749953810131,0.48727156641792896
410.0,0.4830591679605779,0.48610336282416766
411.0,0.48507713713667283,0.45327957635609806
412.0,0.48514650534849174,0.4268237326203924
413.0,0.48049438139783396,0.4441625089106706
414.0,0.4852817673438847,0.4822148200064745
415.0,0.48316129517814166,0.48397370023380953
416.0,0.4821661688364326,0.4799655371266358
417.0,0.4839687125788445,0.4683334856861932
418.0,0.48681936742896975,0.45210865152507174
419.0,0.48465736618314337,0.47894640857731663
420.0,0.48467523072462815,0.4886220348173843
421.0,0.48177234119632617,0.46971415303477776
422.0,0.48589409312508175,0.4653770522384638
423.0,0.4845128412074688,0.48689095003239286
424.0,0.48490072100095344,0.477302666493981
425.0,0.48539854559711937,0.4768271018518506
426.0,0.4804817000827925,0.4803704288141129
427.0,0.4826605689209307,0.4815006254233522
428.0,0.4871315895298743,0.4731648220769744
429.0,0.47895782994637903,0.49022511608333874
430.0,0.48525825866681604,0.49199644890457483
431.0,0.4829725168075762,0.4599751185482069
432.0,0.48570863974307393,0.47594606457095906
433.0,0.4847165457346057,0.45068893467917676
434.0,0.481366844474565,0.4790559531920919
435.0,0.48089658207017233,0.4922205842524247
436.0,0.4821085206917578,0.4690588420490718
437.0,0.4817382041986946,0.4897206870728502
438.0,0.48261266995569213,0.4963613475661032
439.0,0.4817335484681535,0.4826093271031644
440.0,0.4869120777172329,0.48941303382994245
441.0,0.4846064250625873,0.45116772328319305
442.0,0.4834422099687759,0.44040214747677076
443.0,0.48044356751984607,0.4891810852212473
444.0,0.4833850259961967,0.48489971108466506
445.0,0.48733612978989127,0.4781451210650233
446.0,0.4837417396129614,0.4653345828458445
447.0,0.4846308277136121,0.4451467070651823
448.0,0.48775818648056624,0.4596899334436604
449.0,0.4828272001801812,0.4868133593828268
450.0,0.4830595570483537,0.4552525059311384
451.0,0.47982834473149544,0.47638346228965645
452.0,0.484679156672832,0.4473267628503542
453.0,0.4813958228297884,0.48832242092863265
454.0,0.4817960919886925,0.4735464616506005
455.0,0.4798429001667278,0.4790211965009104
456.0,0.482258339572734,0.4646371237813339
457.0,0.48745362976593104,0.48377189739484033
458.0,0.48105636253495526,0.49160006885111174
459.0,0.4798018227716397,0.4927301059931056
460.0,0.48573398575905247,0.4684810452867741
461.0,0.4850475159198784,0.4858789417960131
462.0,0.4833104873604922,0.45211265784854077
463.0,0.4852331055580018,0.4583308566670627
464.0,0.4822931515291119,0.4866831243583441
465.0,0.4818479331348875,0.48843203607514923
466.0,0.48459900859500404,0.47747401551787677
467.0,0.48409516207856046,0.48407443645849685
468.0,0.4816862687181628,0.4919841087288544
469.0,0.48408571810205403,0.4773588617037891
470.0,0.4821842948021139,0.45928749158522936
471.0,0.48123332024065896,0.4869664862236836
472.0,0.48517233412873345,0.4804031920029057
473.0,0.48369003916279235,0.48073605558938265
474.0,0.4810753551355301,0.47953809615448956
475.0,0.48512818054207046,0.4805786567814413
476.0,0.4847778587272133,0.4870183676516197
477.0,0.4878414391561642,0.46108721676371917
478.0,0.48337465117485656,0.4655621394139504
479.0,0.4854844875034655,0.46637690759897926
480.0,0.4801992498866826,0.49020297556758846
481.0,0.4825969373453216,0.4728802486362452
482.0,0.48617780262381816,0.4687517259974677
483.0,0.4852395705294309,0.4779508034645203
484.0,0.4847245737627286,0.48435168127818745
485.0,0.4852485663748995,0.47275289755288075
486.0,0.4855459804538277,0.4746469602139642
487.0,0.4867022173873965,0.4911307432052202
488.0,0.4829416063539445,0.4881203268699945
489.0,0.4849080549006299,0.49265928854377194
490.0,0.48122012116857804,0.46559491040811635
491.0,0.48488766893490926,0.4880094993277055
492.0,0.48330104009680225,0.4494386289357035
493.0,0.4811451842869664,0.4780930835381666
494.0,0.48553242017528137,0.4671156229645612
495.0,0.4847945089445356,0.4789535344461095
496.0,0.48279667182544633,0.48255345475755984
497.0,0.482099357839636,0.455168731365648
498.0,0.4846719929264355,0.4715007529404484
499.0,0.4837506685096926,0.485856092867163
500.0,0.48166214677508506,0.4712994714008916
501.0,0.48619424344970436,0.4825197376350567
502.0,0.488986587241259,0.46738023660256006
503.0,0.48403024522167837,0.48696426219022554
504.0,0.48313534490541254,0.47054302138318627
505.0,0.48284923519178413,0.4906893778683667
506.0,0.48584991202201794,0.43516790360960633
507.0,0.4855835503715508,0.45417691848196157
508.0,0.48381181849267674,0.48433798926641414
509.0,0.48481614583340316,0.44421208523222316
510.0,0.4849495911914841,0.48846304006248725
511.0,0.4841772345989853,0.4922292882273296
512.0,0.48708723943055104,0.47536805566672313
513.0,0.4849989061753096,0.4702097997936934
514.0,0.483532202487488,0.4895444447709803
515.0,0.48401181732403603,0.4771301555308265
516.0,0.48544566253561344,0.4851708962657695
517.0,0.481729803686429,0.4935602198415965
518.0,0.48625228227757505,0.4614492269463391
519.0,0.48550114685585843,0.4913453451736506
520.0,0.48349843777960383,0.49388612854922687
521.0,0.4830618659956287,0.49185001731755895
522.0,0.4844233845836786,0.46065946176940603
523.0,0.4841159859458764,0.4739516379956038
524.0,0.48335471576253536,0.48804986441417486
525.0,0.48343411077880927,0.49578157423626484
526.0,0.4817147533601654,0.4919698204452487
527.0,0.48550104438996716,0.48135874785984073
528.0,0.48754834903927263,0.4522318462494696
529.0,0.4807437827081961,0.4761893284861239
530.0,0.48668252067436113,0.4794313915637207
531.0,0.4829750749088238,0.47068827433198307
532.0,0.4821439850765622,0.4734135929962104
533.0,0.48411117999051556,0.4916075944223113
534.0,0.48368339276913075,0.4843306420938386
535.0,0.4816067148097919,0.4816742212974483
536.0,0.4850659701934883,0.47923247777913414
537.0,0.48727461322721544,0.4783493958697331
538.0,0.4833366256779936,0.46827751366959025
539.0,0.485166374600688,0.46477930163450365
540.0,0.484114510020176,0.48099282907607055
541.0,0.48637009830275757,0.4875422761270271
542.0,0.48422633585761865,0.4810035479317045
543.0,0.4807896928205689,0.4848444691885053
544.0,0.4848537592115594,0.48671454291403465
545.0,0.480000373110905,0.46732715415778703
546.0,0.4820609202791167,0.4754175799522105
547.0,0.48035689578147284,0.4668344184560163
548.0,0.4826661414227579,0.493156667421535
549.0,0.4838059377115663,0.4748699110083551
550.0,0.48611921647152395,0.432476904746626
551.0,0.4804963780548652,0.4894277516132105
552.0,0.4836454609679268,0.475281475609554
553.0,0.4851226521121615,0.4816019146790489
554.0,0.4865453412909602,0.4466987522556885
555.0,0.48603984140755774,0.4699523686775007
556.0,0.4795018990584761,0.49391356751917165
557.0,0.48589058390087797,0.475302918829563
558.0,0.48421584865959083,0.4463188579825356
559.0,0.48800843030777097,0.4705778561447554
560.0,0.48086456987511716,0.4847250295089371
561.0,0.4849828759471265,0.45755262557956555
562.0,0.48680481631001926,0.4877956903336282
563.0,0.4842566949590182,0.4847403438308092
564.0,0.481223964668955,0.46914307905979175
565.0,0.48672211202091337,0.4756398468371565
566.0,0.4878201742224492,0.4593134091919907
567.0,0.48151338925179177,0.47630952735564164
568.0,0.4869090300878416,0.485523790879587
569.0,0.4847894724083577,0.47910600869979103
570.0,0.4847428929466712,0.4844813055069985
571.0,0.4821941137984245,0.48667912536075286
572.0,0.48371430667659593,0.48213938723087
573.0,0.4825475695636077,0.47804061059983
574.0,0.48965182475379404,0.46834484877530974
575.0,0.4845030796353002,0.48899206141371326
576.0,0.48258794263460697,0.49417701895496974
577.0,0.48497383272660677,0.4845673370140298
578.0,0.4802980949881139,0.46547912114956475
579.0,0.4836430671827163,0.49307149109517645
580.0,0.4822541361459166,0.49116624541655124
581.0,0.4833096032641648,0.47825536473189834
582.0,0.48470808101704066,0.4655565696674696
583.0,0.4850004418817419,0.4791878241707855
584.0,0.4855844181151585,0.4768282017861497
585.0,0.484310166403816,0.48042118749043006
586.0,0.48409989842804385,0.4810298868096547
587.0,0.4821327311153877,0.48394684552747697
588.0,0.4862407584377274,0.4774107419900711
589.0,0.4861961212979343,0.4856176274815309
590.0,0.4829527888215497,0.47327939815210013
591.0,0.48169916502220794,0.48785733196327347
592.0,0.48484939269158644,0.4689164249560659
593.0,0.482902005057777,0.47467373269727275
594.0,0.4846788145506167,0.4627648098988155
595.0,0.48413409456134954,0.4837466265385677
596.0,0.48531182841904363,0.48026711034806735
597.0,0.484081813073124,0.4685978723640002
598.0,0.483845624382613,0.4778076462376508
599.0,0.48164511882865485,0.47836045959679335
600.0,0.48410304105259594,0.4701892865680537
601.0,0.48229829356826137,0.4825906002822719
602.0,0.48666702356419655,0.461502604097431
603.0,0.48395620838809167,0.4846735149239843
604.0,0.48006111321604866,0.48294927396774
605.0,0.4850570933374249,0.48151620640579174
606.0,0.483990873612935,0.4649754077509032
607.0,0.48411598941915884,0.4759614458585054
608.0,0.485423033182808,0.47075799025312054
609.0,0.4879111047027275,0.4651453268356969
610.0,0.48275322709412444,0.47514840069126135
611.0,0.4796481956976258,0.48189062007100847
612.0,0.48178980674147814,0.46070080713421585
613.0,0.4829141902764043,0.44139897184593846
614.0,0.48276309792358907,0.4884660089746145
615.0,0.480530032501818,0.4753629570514957
616.0,0.4843651205801422,0.48352428484788385
617.0,0.48872037940803653,0.4441148266674952
618.0,0.48108436083599926,0.47597418855824314
619.0,0.48175131607776256,0.48723544988242146
620.0,0.48175747164778326,0.47849513179435194
621.0,0.48460404487545133,0.4651541971975623
622.0,0.4826855841450033,0.4751253666447006
623.0,0.4861441792084007,0.4737429650439781
624.0,0.48935427808214266,0.4484517154838883
625.0,0.4862004700282174,0.4574980588430134
626.0,0.4818630606414709,0.4776887454426369
627.0,0.4835608090186568,0.4837142281481759
628.0,0.4836753613546111,0.47771246429210534
629.0,0.485473822702812,0.48709608491775863
630.0,0.48437821551602434,0.4344180867238585
631.0,0.48346194590527913,0.490674224774156
632.0,0.48777638189824735,0.44517522005237486
633.0,0.48403509806949385,0.4711393467437583
634.0,0.4858266561287117,0.4687236550779582
635.0,0.48272696668991744,0.4870974662363902
636.0,0.4830224031828393,0.4796258174906392
637.0,0.4839502215930075,0.48891295745860436
638.0,0.48351141214855753,0.4850603938911258
639.0,0.4848613710283559,0.49250794024205735
640.0,0.4837318472043284,0.4863281405412976
641.0,0.48091943205230947,0.4832228465503229
642.0,0.48298551795015776,0.485152256300365
643.0,0.48248443824469067,0.48526555027986074
644.0,0.48717351307260814,0.48635342038653134
645.0,0.48303186550936345,0.4929915320211821
646.0,0.4793026120864121,0.4927846298156119
647.0,0.4880180413256388,0.44667466386987
648.0,0.4811373959472052,0.4760036414265017
649.0,0.48110969673275117,0.49284473695433
650.0,0.4854872439870411,0.4428751439812956
651.0,0.48438376733364674,0.4844617673110972
652.0,0.4856585641477072,0.479686726162596
653.0,0.48380697571657333,0.4937510199154815
654.0,0.48245984232918454,0.4817859967642876
655.0,0.4854966907750268,0.4637571230958552
656.0,0.48426192856422395,0.47730957581097794
657.0,0.4835413927176949,0.4909831252572418
658.0,0.48486106711608296,0.4819451406174848
659.0,0.48640971279834866,0.46953077532374526
660.0,0.4826504556115411,0.4867214558022188
661.0,0.4851804437302222,0.47268033692568695
662.0,0.48275356661979424,0.4922988089744059
663.0,0.4839268501635231,0.4798000077083266
664.0,0.4863157509188945,0.48471134203972194
665.0,0.481931286513614,0.49159914288182416
666.0,0.4827556463810388,0.48078451069845624
667.0,0.48350523642020293,0.4839145946776013
668.0,0.4839797953128817,0.4657406323257615
669.0,0.48406369526644716,0.44468266960226094
670.0,0.4820206869811733,0.475744769340746
671.0,0.48321762636999893,0.48451719593982295
672.0,0.48501593778610885,0.46290978864782206
673.0,0.48348418058356785,0.4929915320211821
674.0,0.48703229452241914,0.4715220750514375
675.0,0.4875800760305537,0.41063379564063734
676.0,0.48451446478617416,0.48105441176941316
677.0,0.48347737517755923,0.4629399794706659
678.0,0.48651739348817846,0.4908539901873419
679.0,0.4832884014249704,0.43741024051229854
680.0,0.48457547934538087,0.452651410238243
681.0,0.4854591273558398,0.4628364101038014
682.0,0.48489324517976273,0.49292218190752746
683.0,0.4866609013281945,0.49146703353386223
684.0,0.4841008093407637,0.4792385639413448
685.0,0.4854463579363835,0.4879451767925652
686.0,0.4846229838382729,0.4759781142118954
687.0,0.47914166553214976,0.4925540907447873
688.0,0.4838872311118321,0.48715031134094716
689.0,0.4885992607301116,0.4667972351359822
690.0,0.4857006159915367,0.4631354039783177
691.0,0.48201624559127826,0.47398863904272437
692.0,0.48337429159398115,0.4797214829801028
693.0,0.48765105850149115,0.4882639175281465
694.0,0.4861666932002604,0.4503683334888459
695.0,0.48322998205135864,0.4743780449377349
696.0,0.4878278357110596,0.45996490218390546
697.0,0.48571708228330773,0.4878204740357869
698.0,0.4830168985476987,0.4571517265123796
699.0,0.48326643042763384,0.49109790908827755
700.0,0.4829948810019619,0.4860577666423576
701.0,0.4875425082680661,0.4347367728317657
702.0,0.4851773787871305,0.4727695997718101
703.0,0.48079335996947764,0.4819463761745872
704.0,0.48537804042320726,0.48591676033909265
705.0,0.482757895000721,0.45828225183944044
706.0,0.48589018556080643,0.45959379357206803
707.0,0.48733090573945664,0.490629207626795
708.0,0.4819559768538739,0.46382306293464515
709.0,0.48419629591881863,0.48517605025986127
710.0,0.48413642510572225,0.4811722571143921
711.0,0.4874869181565163,0.44909902911991517
712.0,0.4815470676198777,0.4617318740492852
713.0,0.48796503834039784,0.4653631938997109
714.0,0.48795450602131535,0.4740195862931284
715.0,0.48360002653040096,0.47586570876098044
716.0,0.48372335622060747,0.47827543081604923
717.0,0.48717886869971033,0.4781278187260798
718.0,0.48149171525774714,0.44115357268724215
719.0,0.4854551852620472,0.48116122479237255
720.0,0.48568642278943697,0.47725593952104717
721.0,0.4860792906231722,0.47775760215661106
722.0,0.4825953818648118,0.45865764514760826
723.0,0.4832006660011998,0.4824070509962357
724.0,0.48689515682153583,0.4818687428938625
725.0,0.4823942634303227,0.484921553515421
726.0,0.479666412474321,0.4730072665222726
727.0,0.4823255612530305,0.4924794135931976
728.0,0.4814697721923228,0.4853418219202033
729.0,0.4784394647994075,0.4856252519143248
730.0,0.4851489638697565,0.4346151570726966
731.0,0.4836412212699107,0.4847259675587076
732.0,0.48449623099658357,0.4900845128650455
733.0,0.48806745210779756,0.46934488979501127
734.0,0.484780223713928,0.4821003895789299
735.0,0.4855715946682141,0.4899441317940906
736.0,0.4866897440342121,0.48368568830157627
737.0,0.4833845374545367,0.48223757253495153
738.0,0.4847989748236632,0.4846971224023993
739.0,0.4852552293865885,0.4888267121204239
740.0,0.4821103747662848,0.48008356961430065
741.0,0.48485772286571216,0.4550408790284204
742.0,0.48276203477562657,0.48231198888719223
743.0,0.4831302087090055,0.47124577456587585
744.0,0.4831353176772436,0.46098750281932954
745.0,0.48096655336182137,0.48810912475856616
746.0,0.48501091359251064,0.48751724688317727
747.0,0.4775742977138263,0.4892611448310272
748.0,0.48709780094756366,0.4742468571542217
749.0,0.484832062872902,0.48517422657377
750.0,0.4852138182133214,0.48924711614041205
751.0,0.4850825401734334,0.46719236133626885
752.0,0.4855710266363018,0.4720602888788886
753.0,0.48178067489240334,0.48229421160240943
754.0,0.48601769363708125,0.48967089738465985
755.0,0.4871049894037529,0.45373064808861047
756.0,0.4829328868815191,0.46790314821739526
757.0,0.480890526176015,0.4882919291442311
758.0,0.4843680577475707,0.47892220334752655
759.0,0.48595204495040945,0.4742243008816498
760.0,0.4869147340504696,0.46185609323911836
761.0,0.4846517297356804,0.47512277273293363
762.0,0.48747041906758604,0.45634785414975493
763.0,0.48417742888758797,0.48156036932141205
764.0,0.48379148254395465,0.48582274572520356
765.0,0.4855256456748591,0.4859662232634179
766.0,0.4823211951469035,0.48846115272040247
767.0,0.4797949292415069,0.4742856623164283
768.0,0.48412402626046575,0.4874396962171368
769.0,0.48757925483635106,0.4252989491921714
770.0,0.48381112390262543,0.48996465852481114
771.0,0.4853268988383593,0.4684015410285103
772.0,0.48468734562081894,0.4734909705162935
773.0,0.4848406057594336,0.4861845617684771
774.0,0.48289135003099004,0.4503409264269655
775.0,0.48515655541976177,0.4922562822555617
776.0,0.4845267253768951,0.491137330499254
777.0,0.47802798125210133,0.49145955836124816
778.0,0.48635259127170555,0.47064434405521827
779.0,0.48606342174398454,0.4738265349681986
780.0,0.481833783136078,0.4703272444557355
781.0,0.48160111705082115,0.4909940759235991
782.0,0.4845080300688894,0.481650218120125
783.0,0.4836683589479755,0.4815688262178252
784.0,0.4851191280744171,0.49412189664836303
785.0,0.48656994593868835,0.46093905756742104
786.0,0.48148036103555897,0.492294172644147
787.0,0.48489551863559793,0.4876438359950975
788.0,0.48368954715473744,0.4855523171544604
789.0,0.48164207125906455,0.4886992360832596
790.0,0.4809507590566218,0.48656711764667365
791.0,0.4847643342892398,0.45803562212978727
792.0,0.4861055009005704,0.4859351010016646
793.0,0.48457390494286234,0.48650354936123225
794.0,0.48476732099641495,0.4681266931352107
795.0,0.484079005865473,0.4888881669089066
796.0,0.484655414451245,0.48197662271296915
797.0,0.48386190525384326,0.4628954711906581
798.0,0.48690531180274793,0.46311597075101685
799.0,0.48493863240689905,0.4800066270739922
800.0,0.48290637689205157,0.4699578667375664
801.0,0.48303591263904494,0.486166043183006
802.0,0.48629099853504254,0.47380591933180793
803.0,0.48356729289747014,0.4934284219462491
804.0,0.4872006774493507,0.47674639222701976
805.0,0.4809497473864674,0.479877563729423
806.0,0.4820377731299205,0.4895980928048804
807.0,0.4827963051472264,0.48063432288935587
808.0,0.4835467964158274,0.4772135167597688
809.0,0.4832127127365065,0.48882573496115184
810.0,0.4874341124842707,0.4873264955573776
811.0,0.4824861856434016,0.4871023659006715
812.0,0.48345963365643985,0.49368201017533864
813.0,0.4831663306316063,0.48729825914795877
814.0,0.4838503105957242,0.479544306463063
815.0,0.48306564247793427,0.4852036513596868
816.0,0.48305169406495474,0.48756982740378874
817.0,0.4836020696594946,0.4804158469328331
818.0,0.47964651643196576,0.4776313648827426
819.0,0.48591269542118626,0.4790643299647673
820.0,0.4856890808113601,0.4794865084013003
821.0,0.4816752558509564,0.479018906860656
822.0,0.4815845195103608,0.4812356113160168
823.0,0.4870121405196343,0.4860636015280158
824.0,0.48229270892006443,0.47930235910973196
825.0,0.48474293171445687,0.48529036059951225
826.0,0.4876135180523245,0.4786619556526442
827.0,0.4848296298960408,0.4824782725810982
828.0,0.4811131277828334,0.4832143709331298
829.0,0.4872595079948604,0.43614471588409787
830.0,0.48560913750411494,0.48011175534683875
831.0,0.47656223663261194,0.49521876512644686
832.0,0.48170842767518407,0.48203897480392516
833.0,0.4820533998354949,0.45512193136391127
834.0,0.4847423289978389,0.46156221493456273
835.0,0.48080745074687525,0.4908690752812737
836.0,0.48446779571705584,0.48621802573028733
837.0,0.4845554115877899,0.46564203144807187
838.0,0.48214040828937166,0.4761642085667095
839.0,0.4834771401315416,0.4639586618891981
840.0,0.48109936174161627,0.48952991940237855
841.0,0.48587484615327275,0.4595008339574833
842.0,0.4835286526415159,0.493708352861773
843.0,0.4801910882619577,0.4661506591416022
844.0,0.4795047142447566,0.4895840310008967
845.0,0.4865511739791245,0.46266584460030996
846.0,0.48543154743635036,0.47944033297848965
847.0,0.48628244018977956,0.4915546057515311
848.0,0.48817763479921095,0.4481614809961933
849.0,0.48316103140341193,0.4765177188929783
850.0,0.4839898360259225,0.48300436427257437
851.0,0.4788050716757632,0.4883083027897333
852.0,0.48222425726072987,0.49203623721049566
853.0,0.48326009761004096,0.47067488205442287
854.0,0.4822826762281402,0.47138706361787674
855.0,0.48483761543699294,0.4549080527917634
856.0,0.4858272783171659,0.4704883516455147
857.0,0.47672617388436717,0.48876331217693403
858.0,0.4823594411759833,0.48014466289603996
859.0,0.48018656406988053,0.465766595325789
860.0,0.48504942240145116,0.48331955754557787
861.0,0.4851147777319907,0.48575812648048394
862.0,0.4883175423161809,0.4854364959325163
863.0,0.486524499346294,0.48435358767775816
864.0,0.4842771950094951,0.4942990026650706
865.0,0.4843144713139533,0.4881936358352996
866.0,0.4818304790378715,0.4892628608851475
867.0,0.4856915447284354,0.4834200322961489
868.0,0.48558723683370447,0.49188670208865426
869.0,0.4840511363406389,0.48756326258946747
870.0,0.48419039303282324,0.47505033214650966
871.0,0.4852249646047114,0.47814887415026597
872.0,0.4856528857529946,0.48131434242630095
873.0,0.48280102118294127,0.4699074781214685
874.0,0.4798890205376344,0.487203005942627
875.0,0.4822602490332437,0.49011798105881754
876.0,0.48377527784401503,0.46553045693782497
877.0,0.48464241525257273,0.45345926106721646
878.0,0.4862628407576093,0.4351490589655516
879.0,0.4845830185113631,0.4876293160835282
880.0,0.48514524008318594,0.4685210562001555
881.0,0.4875215874673958,0.4812784028193761
882.0,0.4780328321042568,0.4816108958581697
883.0,0.4869443279101494,0.4643214281324462
884.0,0.47951264837066776,0.47358064518353127
885.0,0.48089109002926517,0.49012056269425197
886.0,0.48486489465395466,0.4787191309777618
887.0,0.486567302573926,0.48497936154198285
888.0,0.4842472119077638,0.4723013270723519
889.0,0.47983709205551106,0.4846858050206398
890.0,0.480754879322664,0.4797068183397931
891.0,0.48398906135781256,0.48831108245185123
892.0,0.487504210894944,0.4785778462399214
893.0,0.4809066065470864,0.4560020260873554
894.0,0.482543729173295,0.48796751866926796
895.0,0.48456548865336624,0.4849631739941047
896.0,0.48487344421376294,0.47130600498895175
897.0,0.4853484805721737,0.45080335148035844
898.0,0.4813493676161661,0.4614746902211502
899.0,0.4810050420581745,0.4952247202475327
900.0,0.48441463386746525,0.46674189968610924
901.0,0.48113047541301107,0.48318478025758127
902.0,0.4834796142259778,0.4798317772051495
903.0,0.4801423337928307,0.48285458772183454
904.0,0.48293243436353656,0.4563975670260367
905.0,0.4825032458768646,0.4771290156935747
906.0,0.4864695245409478,0.4745850360371633
907.0,0.4859662286954501,0.4713621116765208
908.0,0.48521551098225346,0.46995119995463647
909.0,0.47912044805604526,0.4841783078045272
910.0,0.48232344168945585,0.49650339158833057
911.0,0.4841076247115221,0.49353263383630486
912.0,0.48037511030319396,0.47342728425632946
913.0,0.4863713840369259,0.4822890241674683
914.0,0.48601735344423413,0.4741266775305763
915.0,0.48621954697420405,0.46622399854146757
916.0,0.486191042980361,0.4828210881061996
917.0,0.48087425715074666,0.48617127477365985
918.0,0.4814680667317533,0.47497546371905697
919.0,0.48134130536535846,0.48764856696843656
920.0,0.47813940700527,0.4800794696198233
921.0,0.480346040647926,0.48216655614451365
922.0,0.4879003954714695,0.45797413477760074
923.0,0.48711933310969935,0.4705908916707785
924.0,0.4848671670577566,0.47175432773582954
925.0,0.48727084071232635,0.48808677789510174
926.0,0.4850951114002046,0.4828304261064225
927.0,0.47923342524458135,0.48981951419862885
928.0,0.48661093634747127,0.45855480866955484
929.0,0.48444324549626305,0.47148759416839436
930.0,0.48479485083902496,0.47747069662765756
931.0,0.48269964192220893,0.48163548696833924
932.0,0.48531984390367705,0.46836323892820525
933.0,0.48628049755781017,0.49253206290082785
934.0,0.48233561203509834,0.48631701961455664
935.0,0.48319982863496785,0.47830126996764916
936.0,0.4844645157554039,0.47841222913909554
937.0,0.48151555050100986,0.47881976350045075
938.0,0.48321999465852966,0.4492642906319246
939.0,0.4865609396304188,0.4890136426760221
940.0,0.47799192620358144,0.47855882170462477
941.0,0.4835688382133435,0.48755521339863245
942.0,0.4836286310478845,0.4892931216615883
943.0,0.4793766762004555,0.48896325414014086
944.0,0.48112755482895897,0.4809807889115722
945.0,0.48557895554812036,0.488787012803856
946.0,0.4831758894570158,0.4772060065132745
947.0,0.4882068954921775,0.47277075180914735
948.0,0.4850460120347399,0.4816072038659504
949.0,0.48534106458429854,0.48772722555802556
950.0,0.48528715612109524,0.45427451529543544
951.0,0.48503135829096283,0.4824601367804604
952.0,0.47818153294220034,0.48581233330518037
953.0,0.48063922370285433,0.4837508601738762
954.0,0.48857417735024145,0.4528540903690332
955.0,0.47833527370801043,0.4880431667283744
956.0,0.48449033160262756,0.4644369067887404
957.0,0.48459477309779175,0.47597457768365276
958.0,0.48099687397116975,0.4879550487279746
959.0,0.4821301430460951,0.48847071667191366
960.0,0.48086809438872763,0.4804976974644074
961.0,0.48459361949956187,0.4821837238135823
962.0,0.4810524740735345,0.49179537138344814
963.0,0.48039860065446927,0.47589476826515154
964.0,0.4838547726047169,0.4714573367753737
965.0,0.48082517690630333,0.4712051094068655
966.0,0.4831903796901941,0.46936353310270396
967.0,0.4798201453974083,0.4877086138854463
968.0,0.4858736090565201,0.480626568403813
969.0,0.4867710686395673,0.4817410625788013
970.0,0.4845889229488076,0.49259302324564996
971.0,0.4831405377722838,0.47126689708677233
972.0,0.4829199765120016,0.48719098760449425
973.0,0.4829294461022591,0.4845176428669525
974.0,0.48145035524941165,0.4874729498458732
975.0,0.4865689605954564,0.46958766593866713
976.0,0.48345696364053536,0.4872945287251645
977.0,0.48075114513330564,0.4860938530134689
978.0,0.48247085058206013,0.4904070547639657
979.0,0.4832816590494209,0.48940201230095703
980.0,0.4822147176035471,0.48984416976325246
981.0,0.48669181099207776,0.47527658080122287
982.0,0.4815865535099837,0.48851025495155587
983.0,0.481979304321773,0.49041842910139744
984.0,0.4817397437299504,0.4757770604876339
985.0,0.4838376914651766,0.4791173035533367
986.0,0.484763866852838,0.47894016717107807
987.0,0.4851626715808842,0.4673354408111937
988.0,0.48185493454087064,0.46786033430482465
989.0,0.48277953841571314,0.4896219028980086
990.0,0.48673138789187376,0.47584583773919303
991.0,0.483493029826228,0.48026106307968325
992.0,0.48629291656256124,0.4573567005932707
993.0,0.4827351282250148,0.49193787239950804
994.0,0.48357589501724596,0.48502296945960316
995.0,0.4812460173821246,0.4754633637314684
996.0,0.48536368018764,0.4734096700420476
997.0,0.4805503093817302,0.4798778724515559
998.0,0.4841565197499032,0.4815224841153498
999.0,0.48058871414168075,0.479549763157953
1000.0,0.48255839466495803,0.4859981262221619
1001.0,0.4849462459908457,0.4879704740680937
1002.0,0.4821564575869044,0.47885665584315823
1003.0,0.4809227304388419,0.47618468892349275
1004.0,0.4859655124503397,0.4859187992321962
1005.0,0.4852343926869038,0.46987454232678677
1006.0,0.4857428883192736,0.47201586633010273
1007.0,0.4830996685346897,0.4816844317365375
1008.0,0.4849595104314293,0.4909149003497755
1009.0,0.48271232074428966,0.4842061475199579
1010.0,0.4832896087113859,0.47063815310912765
1011.0,0.48530479543236926,0.487134774999374
1012.0,0.4756608731730041,0.47418841439954146
1013.0,0.4856577336505324,0.48687677258732737
1014.0,0.4867657652473292,0.4648923176567402
1015.0,0.48296189773101805,0.49203939713098904
1016.0,0.48138086095975613,0.4862786186246037
1017.0,0.48484039236839893,0.4793085070417795
1018.0,0.48010391303373495,0.4872361088736449
1019.0,0.4845012411639668,0.4485830494134765
1020.0,0.4829745685991377,0.4897753431150196
1021.0,0.486874934296073,0.46743691280822885
1022.0,0.4827999565123724,0.49003594687381646
1023.0,0.4776814813345946,0.4729465582521009
1024.0,0.4833898303927108,0.4890888490746423
1025.0,0.4852948067238035,0.47328500584416205
1026.0,0.48028405562563864,0.4899150760394613
1027.0,0.48388177253615866,0.4728462336679199
1028.0,0.4862333153096826,0.4588891985984997
1029.0,0.48539536124636284,0.48145765845356814
1030.0,0.4825738288064155,0.49416274169381186
1031.0,0.48446057533908254,0.47500088507310745
1032.0,0.48057988887653125,0.4828638259261724
1033.0,0.4794890670812162,0.485330046734012
1034.0,0.48413754511108353,0.4850780990264684
1035.0,0.4866045491295192,0.4892962662377476
1036.0,0.48159607135764276,0.4648135837560085
1037.0,0.4823119194712907,0.48185223637736124
1038.0,0.481616977718803,0.4838710764882242
1039.0,0.4806643632591443,0.48112022018143846
1040.0,0.48334366347229873,0.4745240563667199
1041.0,0.48515294059223213,0.4935635050847286
1042.0,0.4843711002629384,0.48486573162042607
1043.0,0.4850281268298228,0.4653398061434376
1044.0,0.4844018330444228,0.4770086012632984
1045.0,0.48473600589005517,0.46477215168078745
1046.0,0.4797556908499084,0.4894547003947873
1047.0,0.48292095673154795,0.4838504708190433
1048.0,0.4856701628598531,0.48480414844550496
1049.0,0.4858101065082938,0.4812221283784092
1050.0,0.48135684692441466,0.48379720567499657
1051.0,0.47720712112285335,0.4939493751083265
1052.0,0.48516293043718783,0.47788969265727993
1053.0,0.48460368320117286,0.480359846350034
1054.0,0.4818685750471781,0.4894884066960494
1055.0,0.4807396791862922,0.46211958825061944
1056.0,0.48044505584536273,0.47870726813004155
1057.0,0.48522107670292147,0.49126156199901455
1058.0,0.48260951559683596,0.46335387170299025
1059.0,0.48338341550095143,0.47260649860476583
1060.0,0.4854943413739281,0.4893616344396442
1061.0,0.48185946264104146,0.47790080150433867
1062.0,0.48476621607759574,0.48954392472304264
1063.0,0.48209125370456013,0.49206013954268907
1064.0,0.4841422781105606,0.4628887112894459
1065.0,0.48376146361390204,0.4886929719902368
1066.0,0.48476225248948035,0.47020145320850854
1067.0,0.48438544176360454,0.4755971917016214
1068.0,0.4861754973709639,0.4546157106753878
1069.0,0.4818254679517886,0.48518308864190685
1070.0,0.4815464360909484,0.49287650578856596
1071.0,0.48360522022406005,0.48786733476579586
1072.0,0.48386949615689323,0.4716234926480457
1073.0,0.4839046277862156,0.48680799552182374
1074.0,0.48017276215801213,0.4774646707173462
1075.0,0.48718051456899236,0.47854396945855127
1076.0,0.4849623234785512,0.4740984267396882
1077.0,0.4855130155228772,0.47670221274019337
1078.0,0.48022794507161437,0.48660855906298217
1079.0,0.484277544754099,0.4872299603470804
1080.0,0.4813016054882098,0.48104556709236
1081.0,0.48423751545876176,0.48246594318189095
1082.0,0.479925020373622,0.48918802753125873
1083.0,0.48343745621101913,0.47235360672155824
1084.0,0.4851926400186614,0.4766787606100614
1085.0,0.48038984019340686,0.4864178459079343
1086.0,0.4855146030193939,0.47508128436560754
1087.0,0.4815368628085099,0.487225684632847
1088.0,0.48597857706225284,0.48499312533651523
1089.0,0.4822482939767565,0.4632752197004986
1090.0,0.4866718454213452,0.4630685121899175
1091.0,0.48327349375900164,0.48611541923826157
1092.0,0.4850154068124661,0.4713356507197829
