"tick","Other_happiness","EV_happiness"
1.0,0.4805101424006419,0.3999398081943889
2.0,0.47914107852428356,0.4311012459836683
3.0,0.4811120381274219,0.4277978083558219
4.0,0.4756561443224088,0.48421764060440986
5.0,0.47912864000543665,0.4898248288592456
6.0,0.4778534273226277,0.4919632544895169
7.0,0.4822385636492928,0.493639646858156
8.0,0.47863118208576694,0.49155120879140357
9.0,0.4819319532830473,0.4881192542803848
10.0,0.48048759488196735,0.4606388059897896
11.0,0.4759695843125954,0.4890750197834501
12.0,0.4833575067637556,0.41486302326131425
13.0,0.4834485042578765,0.46184559210150306
14.0,0.48500248996644174,0.4867418178633869
15.0,0.47931983848062343,0.48544598544225986
16.0,0.48199662025203704,0.4839977272072905
17.0,0.4801623664013403,0.4778858260534972
18.0,0.47947853531986667,0.45419786406047186
19.0,0.48162198408356577,0.4881192542803848
20.0,0.48212751594330416,0.461698163409461
21.0,0.47968976353840126,0.493639646858156
22.0,0.4847071137446255,0.4863560662346814
23.0,0.47849186683918754,0.46572700509250264
24.0,0.48162639983488376,0.494201400491961
25.0,0.48159673027557337,0.49042992084764153
26.0,0.4781494132137752,0.4878131545864449
27.0,0.4797327749517558,0.4925250081233222
28.0,0.4816560118912949,0.48621548898143846
29.0,0.4852398159203777,0.42383299032919275
30.0,0.48283097886422327,0.45850875503861777
31.0,0.4809295888832129,0.45589198877742126
32.0,0.4812494337846922,0.47117708998952923
33.0,0.4832241256116358,0.4868368737810063
34.0,0.4825483815794307,0.4831054530256133
35.0,0.4835521478555335,0.4916917860446466
36.0,0.48259721345895706,0.484897829597521
37.0,0.48196752704602785,0.48962317562818936
38.0,0.4795693972861323,0.4867418178633869
39.0,0.4823361722744097,0.4443661738597228
40.0,0.48124141192250514,0.48544598544225986
41.0,0.48239397456700867,0.48685738908337933
42.0,0.4797693732336898,0.48581117582460603
43.0,0.4771629790797379,0.4909746711621521
44.0,0.4806084407529539,0.4395697487016333
45.0,0.480418693909413,0.4890750197834501
46.0,0.47740467416353477,0.48372894061206523
47.0,0.4817619119841985,0.4427575587109317
48.0,0.4809631210822085,0.46510368855052
49.0,0.4810126300406768,0.4658422604810489
50.0,0.47978298485309406,0.48013864856533006
51.0,0.4795451126818377,0.493639646858156
52.0,0.4780403904020904,0.4890750197834501
53.0,0.48110323007589273,0.4890750197834501
54.0,0.4806551902448845,0.48836131043118386
55.0,0.48168826558871325,0.49002421030603166
56.0,0.48104382492177833,0.4863560662346814
57.0,0.4848823951619002,0.42876803774737166
58.0,0.4808313373318431,0.48907501978345014
59.0,0.479926041618186,0.48962317562818936
60.0,0.4831072649273368,0.45137537110629156
61.0,0.48075321147052524,0.4875145958587171
62.0,0.4786876564118385,0.48907501978345014
63.0,0.48135226386816005,0.4712903035789695
64.0,0.4818768676497868,0.494201400491961
65.0,0.478921304626165,0.4900242103060316
66.0,0.47859092477451437,0.4858811082779409
67.0,0.48152272872654067,0.4971723885937206
68.0,0.4813286371662448,0.48489782959752104
69.0,0.4791275847300766,0.49196325448951683
70.0,0.48157682519316963,0.49196325448951683
71.0,0.47969145928417933,0.4811014368769772
72.0,0.48512553956976867,0.48013864856533006
73.0,0.4788037268795019,0.494201400491961
74.0,0.4811772665473035,0.43423354785131113
75.0,0.48286760079372887,0.46101836948593206
76.0,0.48086222348983837,0.49196325448951683
77.0,0.48197219315675194,0.49041291752834726
78.0,0.48064690235579355,0.4905859639398363
79.0,0.47858559699219155,0.4925250081233222
80.0,0.48128747393732585,0.48907501978345014
81.0,0.4814482735970665,0.494201400491961
82.0,0.47749181658927237,0.497031811340478
83.0,0.48058097653629667,0.48907501978345014
84.0,0.48090833285443635,0.48907501978345014
85.0,0.47911615990717993,0.48635606623468153
86.0,0.48221929858117507,0.4836452022196422
87.0,0.47935657086649114,0.49196325448951683
88.0,0.4812478441363418,0.4905859639398363
89.0,0.4801660851861663,0.4916917860446466
90.0,0.48291117135690476,0.4188782628177746
91.0,0.4785125742893179,0.48405464354819505
92.0,0.47590134742672613,0.4925941637299492
93.0,0.4795893708518852,0.48220725898178707
94.0,0.4805894523051077,0.4913320782037581
95.0,0.4787257389867684,0.4920629748616892
96.0,0.4813397389185901,0.4925250081233222
97.0,0.48109225234632363,0.48544598544225986
98.0,0.4792981348968718,0.494201400491961
99.0,0.48142755105010465,0.4925250081233222
100.0,0.48257364984625944,0.4443661738597227
101.0,0.479655403036386,0.4883478179373924
102.0,0.48171629466180826,0.43930134423924866
103.0,0.4831145800879959,0.4381973309990716
104.0,0.4810762869933393,0.46705819050976066
105.0,0.4769028018928631,0.4900242103060316
106.0,0.4815443337260164,0.4015852126068777
107.0,0.48248149254597644,0.4902868621208784
108.0,0.4805291676675156,0.48655544136548545
109.0,0.4818206121938543,0.48584829045364103
110.0,0.4807818598895246,0.4948069375026398
111.0,0.47634982722337554,0.448824267976281
112.0,0.47611243965536565,0.494201400491961
113.0,0.481481873047747,0.48640877375390695
114.0,0.47622263845973684,0.494201400491961
115.0,0.47940217981225075,0.4814351314967862
116.0,0.4818819735937091,0.49293953529495554
117.0,0.4801553024360961,0.4852786270629064
118.0,0.4793213758132828,0.48907501978345014
119.0,0.47543815032791903,0.4925250081233222
120.0,0.48332200013073034,0.44595819013731053
121.0,0.47923365713372007,0.4919223976084466
122.0,0.4810710140917725,0.494201400491961
123.0,0.4786753228920288,0.4699551497556192
124.0,0.48281070257286773,0.494201400491961
125.0,0.4806516237866132,0.48141546286790926
126.0,0.48095233518679564,0.48489782959752104
127.0,0.4801518613990684,0.4862154889814384
128.0,0.47928775611131536,0.46828322021240554
129.0,0.4775751011392161,0.4857077132003983
130.0,0.4805280361956717,0.4898078618827661
131.0,0.48163526927071626,0.4450543543268425
132.0,0.4827370097569822,0.48907501978345014
133.0,0.4825284204822042,0.4423354007780738
134.0,0.48245740107583884,0.4902868621208784
135.0,0.48202767070628894,0.49169178604464664
136.0,0.47990113830332004,0.49420140049196104
137.0,0.48019516453939043,0.4919632544895169
138.0,0.482006430934406,0.4863352009177447
139.0,0.48118993725718656,0.4902868621208784
140.0,0.47887707101709687,0.48692299636411274
141.0,0.48308952916214326,0.4896231756281894
142.0,0.4817332859550655,0.4863560662346814
143.0,0.47873985344224745,0.46525540240320934
144.0,0.48017373414401526,0.4925250081233222
145.0,0.4824971864121369,0.48751459585871704
146.0,0.47995192639191625,0.48639644629838036
147.0,0.4836734298492131,0.45719503507199594
148.0,0.47971598819472855,0.4890750197834501
149.0,0.4822111101862194,0.4936396468581559
150.0,0.47967076644423656,0.4890750197834501
151.0,0.4794758455858288,0.4837132034433409
152.0,0.48082674666047187,0.4863560662346814
153.0,0.48342567748618803,0.4283828554268257
154.0,0.4820395457987769,0.4501807350353536
155.0,0.4807568332050257,0.48855926885036666
156.0,0.48167859767863147,0.4904299208476415
157.0,0.4808209084466159,0.4882318337341246
158.0,0.48108975108155433,0.44436617385972277
159.0,0.48037121823583634,0.4848978295975209
160.0,0.48044311266707573,0.4869365941531786
161.0,0.481876224574806,0.49420140049196104
162.0,0.4798536609137387,0.49169178604464664
163.0,0.48004834568482924,0.46705671430087575
164.0,0.48110921821180674,0.49002421030603166
165.0,0.4751506362454275,0.49420140049196104
166.0,0.48157950347234346,0.4102333005095701
167.0,0.4845719036643098,0.44505435432684254
168.0,0.4833488297423524,0.4925250081233222
169.0,0.47965098501282355,0.46979899543047393
170.0,0.4841339819758191,0.4885132661496454
171.0,0.4808382728455412,0.49420140049196104
172.0,0.47938311372569553,0.48271976436562
173.0,0.47746253001354194,0.49002421030603166
174.0,0.478875589052995,0.49002421030603166
175.0,0.4811960924956663,0.4848978295975209
176.0,0.4784893213280364,0.4911300324108418
177.0,0.47873746286042096,0.4893365102631393
178.0,0.48130884407211133,0.45197126525971837
179.0,0.4861926325647862,0.43768809272278864
180.0,0.4782120025670848,0.49492622543046594
181.0,0.48140174622786286,0.48980434069521867
182.0,0.4777179362797149,0.49066117254438596
183.0,0.47660112266641214,0.493459382107907
184.0,0.4835804839651016,0.4618099921792006
185.0,0.4780848690828806,0.48856951988403136
186.0,0.48007135947515456,0.39800069535421667
187.0,0.4793339633009707,0.49492622543046594
188.0,0.4805621153573622,0.48262131749466397
189.0,0.47957981865276933,0.4929678476783274
190.0,0.4798494572090774,0.49235525006052755
191.0,0.481496220880785,0.4843809765822296
192.0,0.48287258847966985,0.4815547537500968
193.0,0.4805796695956409,0.4866272642504638
194.0,0.48510905158470635,0.4763561006997855
195.0,0.48105655953334525,0.4708902891806493
196.0,0.4795223630528393,0.4949262254304659
197.0,0.48309882662291054,0.4912711840177776
198.0,0.48031052376264266,0.4904406423105189
199.0,0.4814739685134402,0.4912711840177776
200.0,0.4794074942531589,0.4909202786746656
201.0,0.4765775359038356,0.4890752713763777
202.0,0.4807574282680649,0.4899491078809397
203.0,0.47971260525898485,0.493459382107907
204.0,0.48058625916207537,0.4927303127890657
205.0,0.48273617830496374,0.48848226455838045
206.0,0.48154933174463294,0.46452751523114044
207.0,0.478407311570831,0.4929678476783274
208.0,0.48523550859009257,0.36790419032541727
209.0,0.4792111417694163,0.4896530527190677
210.0,0.4822167352897855,0.4949262254304658
211.0,0.4788423855327296,0.4893365102631393
212.0,0.4789961907550346,0.490440642310519
213.0,0.47805956718220055,0.49260730769247824
214.0,0.4798737995486312,0.4949262254304659
215.0,0.4803870550398369,0.4907719350369273
216.0,0.47994231529209636,0.45852394276117636
217.0,0.4816260039604822,0.490440642310519
218.0,0.4792539860834034,0.4582531554732987
219.0,0.48304943684617224,0.4866272642504638
220.0,0.48320185178504615,0.4949262254304659
221.0,0.47902267801818493,0.4807731028933979
222.0,0.483033534577017,0.4391549360453478
223.0,0.48164243687072333,0.4487949377977606
224.0,0.4770792568694804,0.49296784767832746
225.0,0.4787020946568791,0.4839135075105164
226.0,0.47735788638052457,0.49044064231051904
227.0,0.47865235062745476,0.4884822645583805
228.0,0.48365604586664657,0.49079727357807823
229.0,0.47748028730360526,0.48948134239874924
230.0,0.48193751772093235,0.46197135338828244
231.0,0.4804833448319887,0.493459382107907
232.0,0.4770650746598631,0.4335980932578891
233.0,0.47760839076784184,0.4912711840177776
234.0,0.4799684106817657,0.4927303127890657
235.0,0.4796273797836314,0.4766972461937287
236.0,0.4783230778769519,0.49273031278906565
237.0,0.4824896861149055,0.48955704049700666
238.0,0.4827738931999791,0.48678560089783063
239.0,0.4816578079923855,0.4884822645583805
240.0,0.47888017628884144,0.4899491078809396
241.0,0.47994515751228284,0.49492622543046594
242.0,0.4827775204583794,0.4934593821079069
243.0,0.4805293024792554,0.4949262254304659
244.0,0.4817992199056179,0.47931829296693435
245.0,0.4834034093437361,0.49077193503692723
246.0,0.4830828298265046,0.4917627184473569
247.0,0.47958689819298317,0.49492622543046594
248.0,0.4825449988776261,0.4898043406952186
249.0,0.4776984006380094,0.4824823691465809
250.0,0.48037555962355516,0.49492622543046594
251.0,0.4809075074565311,0.4912711840177776
252.0,0.48112867190346803,0.4298036566978033
253.0,0.48173631572226333,0.49492622543046594
254.0,0.47629797519909234,0.4904287442450865
255.0,0.4839476218659112,0.4839135075105165
256.0,0.480532399396697,0.4871187986800431
257.0,0.4849613825234183,0.4788147251412593
258.0,0.48343482713269254,0.4528602756366609
259.0,0.48036729085277236,0.4464051783613297
260.0,0.48167356052126153,0.49077193503692723
261.0,0.4807708300164281,0.4880615579553466
262.0,0.48409844387381723,0.4396464704749271
263.0,0.4819837927329059,0.48316008303268826
264.0,0.48204463328151353,0.4468886762093426
265.0,0.4799132319443458,0.49176271844735686
266.0,0.48185868767873424,0.48214168113051686
267.0,0.48069240445900285,0.4460253410541479
268.0,0.47957294094304415,0.4929678476783276
269.0,0.4801122899980732,0.48678560089783063
270.0,0.4811318994385965,0.48678560089783063
271.0,0.4805142341390182,0.4899491078809395
272.0,0.47931326680957814,0.4899978131046708
273.0,0.48028805812905906,0.4929678476783276
274.0,0.4836850816147273,0.4938220933830863
275.0,0.4798184155127525,0.49150100435576854
276.0,0.4824805270118843,0.4949262254304658
277.0,0.48153941919958265,0.4585430781097211
278.0,0.47908264807427886,0.4929678476783276
279.0,0.4795418199249412,0.48049074689871923
280.0,0.4787172832054985,0.4871187986800431
281.0,0.48179379370650854,0.43720968915351144
282.0,0.4824151086855617,0.43733499849847235
283.0,0.4782383096284738,0.4916261807416863
284.0,0.4823766939236012,0.4899491078809395
285.0,0.47959267132153816,0.4912711840177776
286.0,0.4796762224247607,0.49176271844735686
287.0,0.4821648924144751,0.48681839430501994
288.0,0.48376170285162073,0.4001320654386868
289.0,0.482696627155724,0.4566878438426603
290.0,0.48266974500875387,0.47567045662063895
291.0,0.4819916082552101,0.4921953513430296
292.0,0.48039870102814547,0.4917783962433901
293.0,0.4849738881293962,0.4772567717627256
294.0,0.4820090318264765,0.4672815546574943
295.0,0.47816201938499625,0.49027424462196784
296.0,0.48106486335667664,0.49146139067222605
297.0,0.4852370139386825,0.43707534869935183
298.0,0.48184236227822996,0.4438068266641522
299.0,0.4803938654167134,0.48257943854472113
300.0,0.48256771766547313,0.49338731545618997
301.0,0.4803297725182308,0.4892927939131859
302.0,0.4800514370156978,0.4811943832170335
303.0,0.4833341157525429,0.4527485319156251
304.0,0.47902819143839925,0.4914613906722261
305.0,0.48178450778628024,0.4828680223014517
306.0,0.48493200749523907,0.3940768173063493
307.0,0.481268980984254,0.4732951899905586
308.0,0.47919116232559716,0.44232225406688974
309.0,0.48000184993305034,0.4934966533198233
310.0,0.48154323140180794,0.49414471493657103
311.0,0.4798463978085442,0.4689478366031971
312.0,0.479723763566571,0.4239740290049066
313.0,0.4833170534040634,0.4503684579118095
314.0,0.47927139303845323,0.495903718100961
315.0,0.47742170393679834,0.46143988846935957
316.0,0.47776700563492197,0.49041198412086534
317.0,0.48211748422628614,0.48614698832901637
318.0,0.4785960581991739,0.48973545482497416
319.0,0.48031693120895325,0.49096066363425034
320.0,0.4835523537239748,0.49180621031276295
321.0,0.47909157465288343,0.495903718100961
322.0,0.4807135974053513,0.47042463091930786
323.0,0.48204948282503585,0.4912229548576902
324.0,0.4812211201496511,0.45809502632824356
325.0,0.4793457392383013,0.48394219772952995
326.0,0.47885867200769955,0.48546892965415456
327.0,0.4815963998633957,0.48922390374096253
328.0,0.48303676155764796,0.42338903309353
329.0,0.4822058474613564,0.46889012720991896
330.0,0.479202147247924,0.495903718100961
331.0,0.4773515207415373,0.49231525160500345
332.0,0.4785747489634947,0.4863800154147134
333.0,0.4807176561131216,0.48949009004665056
334.0,0.480506528948253,0.4923152516050035
335.0,0.47743307829176485,0.46101905945839433
336.0,0.47886954231899437,0.49122295485769024
337.0,0.477018816635676,0.4881365548745179
338.0,0.4746138100817251,0.49036351452186716
339.0,0.47936536204360153,0.49337291251447385
340.0,0.47810602392468404,0.4867732429583763
341.0,0.4752135574748109,0.4885040440748656
342.0,0.4790261059857605,0.4836651751298581
343.0,0.4765754530893342,0.4963275940084364
344.0,0.4796317558710159,0.495903718100961
345.0,0.4788834782491097,0.4947302434429139
346.0,0.48170079708485425,0.4457491496995194
347.0,0.48002139718747644,0.48850664330001314
348.0,0.4759517549052505,0.46154401403242534
349.0,0.4784078463912308,0.4888009882403249
350.0,0.4780108883559941,0.4908183536638135
351.0,0.4817559580882373,0.4777320682156141
352.0,0.4780573128444388,0.495903718100961
353.0,0.4797923675532766,0.4892039335211304
354.0,0.4807106688881832,0.4889384482484338
355.0,0.47965593285558866,0.48762751358227774
356.0,0.47813208852698524,0.4887183138606234
357.0,0.4809901360521949,0.4680660713742119
358.0,0.4786126065584206,0.4923152516050034
359.0,0.4824817833577265,0.49068201026095926
360.0,0.48284694901280945,0.47161149072427944
361.0,0.480119207367906,0.49255110028433025
362.0,0.48350469685537734,0.4217806085003634
363.0,0.47832288426497455,0.4471447215610946
364.0,0.4772866435044115,0.47974518351568884
365.0,0.4806678101203863,0.49361789542800943
366.0,0.4812380007966705,0.49070447960560915
367.0,0.47856062977549385,0.4671961614757169
368.0,0.47994454488716826,0.4787284872215937
369.0,0.4814429401110869,0.49247729215497765
370.0,0.4820269672163435,0.4782027925988629
371.0,0.4790495164044291,0.49591862777936135
372.0,0.4774285029606892,0.49485183263568205
373.0,0.47625781511310405,0.4903556531589569
374.0,0.4766938696218826,0.49105301742614976
375.0,0.4846787820107056,0.4192640002749837
376.0,0.4798679995625499,0.4865625820434203
377.0,0.4736663701666897,0.49070096254916973
378.0,0.4781635570982788,0.48921504988592535
379.0,0.47895774896370963,0.494851832635682
380.0,0.47788680715982523,0.4866236886501649
381.0,0.4798783794178606,0.4743106434546898
382.0,0.48108584792032816,0.49591862777936135
383.0,0.4792918389321028,0.49520931222083087
384.0,0.4785303441604631,0.49336269154211
385.0,0.4806568418110084,0.49361789542800943
386.0,0.47392957992348106,0.48824374857207764
387.0,0.4798011657706681,0.461339707930966
388.0,0.47875090865427933,0.4762862782904872
389.0,0.4781850620065906,0.4961866491124465
390.0,0.47643965591222764,0.4909794163603154
391.0,0.4766428682534436,0.49432160040379786
392.0,0.4814163494727779,0.47722323006166656
393.0,0.4767555258386612,0.49128362192805947
394.0,0.4788070687653982,0.48709590448780216
395.0,0.480696212902994,0.4636964881624376
396.0,0.4779203619864999,0.4664544258891925
397.0,0.479188267683942,0.48938238898475145
398.0,0.4789280781812844,0.49627610736450994
399.0,0.48139525043183773,0.477759381583593
400.0,0.48531066295039155,0.4684129382440363
401.0,0.48121584272767026,0.49520931222083087
402.0,0.4774230107087595,0.46190456938931257
403.0,0.48109640416331245,0.46981563658578673
404.0,0.4805689297954388,0.4520971048714112
405.0,0.4807057303525887,0.4930138650954576
406.0,0.47991702339528525,0.4896186000501425
407.0,0.4786490089417438,0.48059505955736626
408.0,0.47987609761688277,0.468262956619396
409.0,0.47812389897579327,0.4859829273375512
410.0,0.48218758912850257,0.4859869309238645
411.0,0.47879166298004766,0.49627610736450994
412.0,0.4820179479994479,0.47926958774254247
413.0,0.47881813017520797,0.47600734547349005
414.0,0.47658642399214046,0.4870136789454427
415.0,0.47854124798648034,0.4539643582496702
416.0,0.47945439739369705,0.49627610736450994
417.0,0.4818035204683318,0.46439810992682357
418.0,0.4816278089918422,0.3841702729130042
419.0,0.47652436363178646,0.49088412627210093
420.0,0.4771922369702351,0.4632005330787649
421.0,0.47827673616367083,0.4903180203876087
422.0,0.4802895060222945,0.4896789707323233
423.0,0.47870729680641355,0.47271586776543034
424.0,0.4802430875005722,0.4928671921593197
425.0,0.48014670148691296,0.4932094582099598
426.0,0.4817061752870181,0.49012206170905165
427.0,0.4814064140744992,0.4730882521496251
428.0,0.4816197397933257,0.4672301186440302
429.0,0.4760931004045455,0.49177507718060837
430.0,0.47991249676702774,0.4915548363229961
431.0,0.4817340784915581,0.49237214975533966
432.0,0.47672352692299663,0.4923721497553396
433.0,0.4810036521312369,0.482436922195383
434.0,0.4771305120314681,0.49679168739549084
435.0,0.4796961377872822,0.4616219166988589
436.0,0.47934252600199573,0.4778358424510521
437.0,0.479392293074471,0.48691861188927915
438.0,0.478492223010573,0.4900669621295699
439.0,0.479904431560931,0.4962619686941077
440.0,0.47906013829202254,0.45846929993843627
441.0,0.48089802989994124,0.4504148643058585
442.0,0.47733410117926844,0.4928798685976845
443.0,0.478052797126631,0.4460887250658056
444.0,0.4791459394178465,0.49556453199667533
445.0,0.4803236467828984,0.4744131785967698
446.0,0.47847263719933664,0.49208263595491475
447.0,0.479314763768248,0.49454243114152874
448.0,0.48249433451500184,0.4833287253286113
449.0,0.4789085183906179,0.49679168739549084
450.0,0.4771301580158032,0.45416603408143813
451.0,0.47983230939166005,0.4672339119219179
452.0,0.4776849561742451,0.49089546211622426
453.0,0.4819267157735752,0.4834834484756447
454.0,0.48062880528632757,0.48750530162245054
455.0,0.48142790631711474,0.47108462546034646
456.0,0.4811274156155198,0.48347637833083673
457.0,0.47791260299262056,0.486335130986985
458.0,0.47724357086433283,0.4908848713160597
459.0,0.47815319019801417,0.4637360800448702
460.0,0.483810229822942,0.4943151951660405
461.0,0.4785626583657342,0.4841070690905936
462.0,0.4813067867762822,0.46748084236406595
463.0,0.4819870532832916,0.4694386255492258
464.0,0.48283881079619023,0.4578792224815806
465.0,0.48235387242237693,0.4962907684160274
466.0,0.47922769807498383,0.4782155281865471
467.0,0.4781854470777127,0.4935166855892571
468.0,0.4778443066526542,0.4940313285524464
469.0,0.47806943856488093,0.49060126788134983
470.0,0.4788912670739395,0.4875305104711134
471.0,0.4789808700113916,0.4580685447074659
472.0,0.4793941280963321,0.46038911613781386
473.0,0.4774758014653506,0.4919976714448295
474.0,0.47846163241577283,0.4559327291979168
475.0,0.47633329955296616,0.49422004150473886
476.0,0.47828523183891697,0.49594559130988625
477.0,0.4821924632328996,0.4799855786240231
478.0,0.47820399390758644,0.4915612401438718
479.0,0.48044537973327894,0.46191163349273784
480.0,0.4847633755739946,0.48370239889384764
481.0,0.48290685848213655,0.46095951578211464
482.0,0.47633329518637146,0.4926066768398343
483.0,0.48082012357479226,0.48312118429432027
484.0,0.4787136688450561,0.4951761519005435
485.0,0.47608489159988576,0.4754008368035657
486.0,0.4781236929043332,0.452362210109265
487.0,0.47699279851425036,0.47418718155422707
488.0,0.47808877104207237,0.49706466431110796
489.0,0.4780106098902871,0.4931621872143177
490.0,0.477308270046075,0.48559754366059277
491.0,0.47588858953105395,0.4760616033719519
492.0,0.4785689014126877,0.49287808382484166
493.0,0.472500519466838,0.49302775567641804
494.0,0.4810069634556833,0.4708572202421379
495.0,0.4821316651562492,0.4914780631928453
496.0,0.4771017306811124,0.4953871567349255
497.0,0.4787897254040152,0.48385777424073784
498.0,0.4808994906108215,0.48770336166225536
499.0,0.474082280406546,0.4966000585810301
500.0,0.47903583113273346,0.4918497962282648
501.0,0.47738899195254525,0.4959455913098862
502.0,0.47264780293977926,0.4946946367660295
503.0,0.4781956622934352,0.4951352266819844
504.0,0.4795690370971506,0.49146621698195453
505.0,0.4765597228337405,0.49100944921007456
506.0,0.4780257521099497,0.45754048303411227
507.0,0.4728916450105133,0.4954575843526575
508.0,0.47804234838275167,0.46648542373840524
509.0,0.4784308198546024,0.49518651841731354
510.0,0.4800670453915518,0.4881069990390008
511.0,0.4796160401467608,0.49442259238693603
512.0,0.48184595681631603,0.4505709078029266
513.0,0.4831002409580168,0.4299285284475622
514.0,0.48040107991348463,0.48206414833502875
515.0,0.4810393431658198,0.4957329248301594
516.0,0.4804224746497753,0.47214705099498877
517.0,0.48164790821077186,0.48724820210496794
518.0,0.48028747656664994,0.49177992424574435
519.0,0.48074623675624417,0.46389690222679736
520.0,0.4814095894475289,0.42854793932828983
521.0,0.48105445615162024,0.45690359404450037
522.0,0.47793826098671816,0.4933619725150954
523.0,0.4834013713274812,0.46414601608122846
524.0,0.4805875328856268,0.4880612641808408
525.0,0.47942451361728117,0.48501915537185875
526.0,0.4814309174095284,0.46541294566006136
527.0,0.48244895797135234,0.4645046795992157
528.0,0.4793020127363827,0.4348711218087993
529.0,0.4851384478955577,0.4278384003473132
530.0,0.48074877386544496,0.46129940158521066
531.0,0.4781081901640695,0.4951756054627425
532.0,0.47941050749109815,0.43498130527884493
533.0,0.4801356102805943,0.49040009736140666
534.0,0.4804396151953552,0.4959433740293294
535.0,0.4788211222732107,0.45921080661511116
536.0,0.48062093405122863,0.49629135020771004
537.0,0.47732545038733787,0.49218168457191813
538.0,0.4787278635195199,0.4694637120012225
539.0,0.47979673303946324,0.4540020536260784
540.0,0.48148305416506887,0.4688431207909022
541.0,0.4820815858583116,0.490689288314231
542.0,0.481606847417594,0.4596032326414451
543.0,0.4800356319641139,0.4820958145140501
544.0,0.4786437353735682,0.4826510060628689
545.0,0.476967448770005,0.49224886661406986
546.0,0.4796825759848333,0.45236090010471436
547.0,0.4827287754925204,0.493716280009161
548.0,0.48040537610150363,0.474757641870663
549.0,0.4810475839275253,0.4801187804862409
550.0,0.480130125145815,0.48744830943461287
551.0,0.478030847535413,0.475320162645285
552.0,0.4832406436812294,0.4230009687723552
553.0,0.4795419610866818,0.48728259092017145
554.0,0.480514815187713,0.48817908707087293
555.0,0.4819041864844764,0.4878835654079389
556.0,0.47470917675315705,0.481759189258295
557.0,0.4770984908834869,0.4903590270902967
558.0,0.4805249229405555,0.4788612998947197
559.0,0.479091080699331,0.46284021908754874
560.0,0.47979417302590693,0.46196512568745446
561.0,0.4820486198744714,0.4686344351895488
562.0,0.47956597532080175,0.45559221405160416
563.0,0.48112010947008077,0.4800449916121194
564.0,0.4782324971141737,0.4800477051367608
565.0,0.47611636087548165,0.49460419593810695
566.0,0.48238524961826074,0.4830793134909014
567.0,0.47552217100820965,0.4843078471664702
568.0,0.4797075609678529,0.4858903343429208
569.0,0.4811067010665625,0.4766834981735812
570.0,0.4785905235738388,0.4683441888732692
571.0,0.47654856252869404,0.49229724786844486
572.0,0.47863678865862797,0.48129867800532783
573.0,0.48166250376385966,0.4696041252752273
574.0,0.47724952456949804,0.4933398159162115
575.0,0.47948561579014853,0.47373677135721054
576.0,0.4760560185630637,0.4857237813273099
577.0,0.47903081389249147,0.4923648579974167
578.0,0.4789920939514103,0.49249834956236505
579.0,0.4802243972527773,0.47875916514242545
580.0,0.4829026918249333,0.46616367813923004
581.0,0.47676806001027333,0.477978279930867
582.0,0.4792538744783268,0.49157436216579464
583.0,0.4770234156329985,0.4704716878439825
584.0,0.4766643322623309,0.49336785360913205
585.0,0.47897471905036015,0.4829463549358197
586.0,0.4775839402320817,0.48978094224325935
587.0,0.4799645472104691,0.4858843877460084
588.0,0.47759197118871927,0.48753016733301496
589.0,0.4770491595426471,0.4915689231939485
590.0,0.4767422465842646,0.4926275282860568
591.0,0.4803472896669198,0.47813525590046235
592.0,0.4790265236907361,0.46631237713144114
593.0,0.48012445968034567,0.4701337090093005
594.0,0.47842793013096035,0.4784491330029799
595.0,0.47693549239145655,0.4867984639478538
596.0,0.48102921469719284,0.4934790408830195
597.0,0.47889576981756227,0.473037647520732
598.0,0.47604072554668503,0.48376999100608664
599.0,0.4816430647716492,0.4519708768093463
600.0,0.47800944086836195,0.4883916593763461
601.0,0.47748650763112227,0.4945589040429172
602.0,0.4729885208073419,0.4897999333576167
603.0,0.4795244138773205,0.4815914296056677
604.0,0.47733260530141075,0.4814444577393934
605.0,0.4761863287049019,0.4803119262943893
606.0,0.47972510987688216,0.4882945864304935
607.0,0.477286343732295,0.4965796572025678
608.0,0.47923155719066846,0.44997816755249276
609.0,0.48326513888950373,0.4874582958768499
610.0,0.47901046540904485,0.4956708716296612
611.0,0.47851717128059834,0.4682177266388921
612.0,0.4812999454223257,0.45488643295344594
613.0,0.48053468662663146,0.4868487709318893
614.0,0.477272065011393,0.49263559888550246
615.0,0.47655560543889275,0.4900355807119097
616.0,0.4813692983506912,0.45573180765640053
617.0,0.4777982609941198,0.49206339091801493
618.0,0.47841730963407003,0.49196552394008325
619.0,0.4801359725648222,0.4853555907814476
620.0,0.47706410259252446,0.4812911805785103
621.0,0.4771497995923117,0.48849238858650285
622.0,0.48070866321384725,0.45617297604275014
623.0,0.4785267018444755,0.49412161376204583
624.0,0.479974316804483,0.475189918263904
625.0,0.4787814603298321,0.4632079992497268
626.0,0.47828543563747467,0.4703046352700472
627.0,0.4780481729205016,0.46784416313404203
628.0,0.4800053861922115,0.47325748566430614
629.0,0.48042326885242237,0.4841732986242235
630.0,0.47835159798716,0.4934812254035166
631.0,0.47675708546434586,0.4788988695812053
632.0,0.47849230616649574,0.4897826077096102
633.0,0.47980741206619776,0.484001470278511
634.0,0.4807435101434115,0.471655563451279
635.0,0.4793245206177329,0.46708670077025055
636.0,0.4801080583443342,0.4641940312182684
637.0,0.4801859190893474,0.48961365527213874
638.0,0.4799110683109211,0.4901780833087725
639.0,0.48011759347537625,0.47335285663058146
640.0,0.4816833517252864,0.45663191093168976
641.0,0.4778688949298374,0.46703210446995286
642.0,0.47838601911548856,0.47160176249378705
643.0,0.47997192202049666,0.4887146959796014
644.0,0.48012944383478506,0.48832045481979974
645.0,0.4774164195710128,0.49201494709537924
646.0,0.4798902385337759,0.48632352529831047
647.0,0.47703327883292485,0.48753630951710786
648.0,0.4784359681886865,0.4829192839438005
649.0,0.48096208021696185,0.48853764478641215
650.0,0.4764777993683471,0.4832362354165163
651.0,0.4737924266760187,0.49392467591662265
652.0,0.4772749553919145,0.4900910350032821
653.0,0.4805882879123688,0.47777534023982693
654.0,0.47832979945371323,0.4575468426884431
655.0,0.47734522588974454,0.490936297381625
656.0,0.4776520265606011,0.49135076537427425
657.0,0.4793075930080525,0.4918532848412
658.0,0.47652724818843656,0.4873719107973685
659.0,0.47873048679083896,0.48880167283146314
660.0,0.4749845211596801,0.4788553863668312
661.0,0.47833135408316857,0.4712658421326838
662.0,0.4798916718662333,0.4841413419838104
663.0,0.47652947850305644,0.4941810005703652
664.0,0.4776373511425577,0.4575579288423088
665.0,0.47721315636186906,0.48841864068929636
666.0,0.4790459127552555,0.47157905946830314
667.0,0.4797408530204961,0.48037403718057536
668.0,0.478270768993136,0.4843737136853688
669.0,0.47851704752454277,0.49540820134102154
670.0,0.4768131794872518,0.4569480633148201
671.0,0.48004418233120943,0.4843337637525832
672.0,0.4769349711817139,0.4965139247593507
673.0,0.47648487127887473,0.47518561788278174
674.0,0.47769770285605256,0.4889343702431721
675.0,0.4744444388540091,0.4662336896503402
676.0,0.47698212108266297,0.47404093891493393
677.0,0.478111824405352,0.4687159692503945
678.0,0.47952088442243357,0.4642339634971889
679.0,0.4782410602776066,0.4941221323549098
680.0,0.4785015322515665,0.493741322303832
681.0,0.4788633600565922,0.4959942786092922
682.0,0.480521453551277,0.48683297692317123
683.0,0.4807555361447402,0.46393800363869864
684.0,0.48204339106755945,0.439684052263485
685.0,0.47753048989415925,0.48637026302331665
686.0,0.47936963684042744,0.4853016874620234
687.0,0.475186672561841,0.4818111357825651
688.0,0.4785396091696251,0.46608725013691704
689.0,0.47751591798503623,0.4729758270613176
690.0,0.481789209311327,0.4940449231891921
691.0,0.47961801822558564,0.4618390119417856
692.0,0.4745874851124774,0.4902410749297491
693.0,0.4788503573005388,0.4880137119102435
694.0,0.4814268081879288,0.4805714224114096
695.0,0.47827353087338115,0.4873647421190971
696.0,0.4780946667083844,0.46841025631605765
697.0,0.4813981467137355,0.47644532106308846
698.0,0.4802527167062595,0.4514612493107794
699.0,0.4809757811263624,0.435448228196341
700.0,0.4753001400650975,0.492090412481373
701.0,0.4809332478876732,0.4757734501183515
702.0,0.48039235299538696,0.47072950004102426
703.0,0.4806730465468266,0.4689780760832943
704.0,0.476130001690951,0.48994628077312335
705.0,0.47902225691751593,0.4650343182443682
706.0,0.47733866175775963,0.4887896145962562
707.0,0.4771626201870444,0.4871011850906424
708.0,0.4798341758274678,0.47731410018375514
709.0,0.48086534285928684,0.48837563604846906
710.0,0.4811760903549779,0.47622640966578944
711.0,0.47842913692388583,0.4863171103628537
712.0,0.47796054606340316,0.46886303570257987
713.0,0.47788852340361315,0.49242512348989625
714.0,0.4801011284591316,0.49514583350518127
715.0,0.4790660202863653,0.4719640466707106
716.0,0.4786644443064739,0.4899725470001118
717.0,0.4791571686419003,0.4752898582441058
718.0,0.4746742787281826,0.483850302603156
719.0,0.4790053216186263,0.47272131277335067
720.0,0.48168574620619536,0.47869212510443954
721.0,0.47781924663688674,0.48780178291580023
722.0,0.47905292069124705,0.4898419320368177
723.0,0.48186246165027397,0.45949408633625505
724.0,0.47830598091729803,0.4918098177857294
725.0,0.478698668349104,0.4623847169561691
726.0,0.4808297501230442,0.4698995962463191
727.0,0.48033346920237047,0.47333637496617037
728.0,0.47708863941730767,0.47601022768832
729.0,0.476646766719196,0.49238925581715254
730.0,0.4762059735417719,0.4896731485618785
731.0,0.47679298883169574,0.492644366678284
732.0,0.4748807217824019,0.49636393175801835
733.0,0.4722030730143919,0.48369053364949616
734.0,0.4802440631481242,0.4803180656100367
735.0,0.4778011303354348,0.4919391832101005
736.0,0.4833206000328315,0.47104903589462943
737.0,0.4789724296840405,0.4764433540259155
738.0,0.47965455602927026,0.4694709276588522
739.0,0.4787984076122444,0.48063621418611946
740.0,0.48102019863537215,0.4781430259812907
741.0,0.4758588193446365,0.4828692821346856
742.0,0.47827042952401255,0.4796228436353129
743.0,0.4790770174648462,0.46198384194893016
744.0,0.47541014260532655,0.48795127515560793
745.0,0.47863077476603266,0.47098202017315227
746.0,0.47849435011523733,0.48767268669536157
747.0,0.4768612991814212,0.4932039797308968
748.0,0.4789311400816382,0.46284816764210807
749.0,0.47959454866434253,0.4709949113261374
750.0,0.4788618373843621,0.4805671279101532
751.0,0.47935783926476294,0.47128298559407344
752.0,0.48129876093454044,0.48169395412184635
753.0,0.47865901888171036,0.4854675830275894
754.0,0.4784414199102897,0.4908761230149237
755.0,0.4786846232801343,0.47081927876496993
756.0,0.47583306433687617,0.47272589392356706
757.0,0.4779852457971783,0.48801197622627157
758.0,0.47871122054719467,0.48375963445648223
759.0,0.476072451183339,0.4636946082488453
760.0,0.4774325123817768,0.4786404126602541
761.0,0.4766205829051312,0.4913113037282183
762.0,0.48035332060105485,0.4576730016953105
763.0,0.47903584081275197,0.47186362523913156
764.0,0.47819652695305537,0.490396508565864
765.0,0.478944139318184,0.4787975157658314
766.0,0.47913348137566875,0.46762074996983843
767.0,0.48043151926642386,0.4764302889111588
768.0,0.47770523128781384,0.4937912274140823
769.0,0.47922379172529767,0.4910032546712365
770.0,0.4783486389228563,0.4924119594425738
771.0,0.47695527060532694,0.49557164819443766
772.0,0.48202329866229515,0.46905948110627643
773.0,0.474555568227897,0.47248039231569855
774.0,0.4818465099038531,0.4753856383700825
775.0,0.47765590431125,0.48586920266607986
776.0,0.48050350588072366,0.4324640780996648
777.0,0.4790433785041157,0.49164071789810565
778.0,0.48052571916088066,0.4447080737385787
779.0,0.48118501595716534,0.45270149768409834
780.0,0.4802308308115503,0.48220768489159416
781.0,0.47903549909729776,0.4919675005668876
782.0,0.47988788713238073,0.46111481205665394
783.0,0.48379300623966515,0.4466783251345563
784.0,0.476787220497855,0.47083098582402144
785.0,0.47953788834570904,0.4523519887943939
786.0,0.48096743662469676,0.47272985087191943
787.0,0.4776602785001746,0.484581666616519
788.0,0.4791235146137755,0.49305702960086617
789.0,0.48120102749052823,0.4520183160429559
790.0,0.4814890241384554,0.4766550655643633
791.0,0.48233342162423676,0.49135342155283956
792.0,0.47611045706585137,0.48633868197873703
793.0,0.47761285361851613,0.4768344846513023
794.0,0.48061759617163874,0.4758069314917736
795.0,0.4778288065226464,0.4785989141757926
796.0,0.47654467896074687,0.49447172454442645
797.0,0.4760122547792614,0.4701931591438778
798.0,0.4810553158427101,0.471825308085414
799.0,0.4754234634732156,0.4892982643421054
800.0,0.47818938512140013,0.49673005042042556
801.0,0.4783797541953721,0.48985406468914033
802.0,0.47717522538690765,0.4893060095943791
803.0,0.47887006506100654,0.4687560376515138
804.0,0.4752147521648944,0.4693373326977444
805.0,0.47630782603560057,0.4915610589249161
806.0,0.4802459731343451,0.4569234735534963
807.0,0.4755140720690401,0.49094172818355186
808.0,0.4778927595653001,0.48034203960644994
809.0,0.4776932698661313,0.49015684417475625
810.0,0.4811992257806163,0.46051340805621493
811.0,0.47801248545663455,0.46268210835451795
812.0,0.4767450726574952,0.49280122276536953
813.0,0.47982560903005045,0.4774066111927152
814.0,0.4809379484406664,0.4743811581693639
815.0,0.47506020555622913,0.4791399285455377
816.0,0.4796310346967578,0.4774867869709378
817.0,0.4825273928687569,0.47114576480933756
818.0,0.47787337514190875,0.4900901022478125
819.0,0.4807478072276985,0.4566600341925221
820.0,0.47630767672039914,0.49378421987068305
821.0,0.47963168445920545,0.4672946283076493
822.0,0.47965610688515703,0.4794711566524004
823.0,0.47797386137901904,0.4670031588970946
824.0,0.47853149217474716,0.4717858799273434
825.0,0.4757033737014013,0.4935056518788753
826.0,0.4769477573878684,0.4843157186998416
827.0,0.47741441041672766,0.476241637955884
828.0,0.47658376881047926,0.4561105826632746
829.0,0.47634646178169393,0.46170309440098395
830.0,0.4743926653682391,0.4953755543446435
831.0,0.4802073768676983,0.4482132522553531
832.0,0.47764377768130073,0.4789375262722736
833.0,0.48041626172797974,0.46367374562009134
834.0,0.47646463046223975,0.46869986851974416
835.0,0.4810577574057476,0.49200951928012904
836.0,0.4829479507389713,0.45905591844052057
837.0,0.47933567732739,0.47929479088265853
838.0,0.47963462132334,0.4779537421081703
839.0,0.4769551724761056,0.48976165899901725
840.0,0.4788812712182819,0.462789453193262
841.0,0.47795677681510496,0.4819338014132047
842.0,0.47746623499395985,0.4761249311902698
843.0,0.48208554697857536,0.4856075841051459
844.0,0.4804003139740697,0.46983010834658123
845.0,0.47834249010132346,0.4845737927360718
846.0,0.4818424784639787,0.4441384256534143
847.0,0.47675421229644277,0.48858948113528544
848.0,0.4789116706171759,0.4815068218175547
849.0,0.47940543074456043,0.47789765120381444
850.0,0.4766472040500762,0.4941195638695257
851.0,0.48014373344009703,0.4431871106574869
852.0,0.47851454334059806,0.4784135386410442
853.0,0.47597511248148705,0.4973819807860072
854.0,0.47369756174206273,0.4875859386707525
855.0,0.477864443667472,0.4739892282447692
856.0,0.4794217793591076,0.4434934240692547
857.0,0.48040400965185653,0.4465519121797054
858.0,0.4780234536213795,0.4879993588383329
859.0,0.47938687105455124,0.4738612182172901
860.0,0.47650875479650023,0.4898957817249883
861.0,0.47879902540068,0.47798214381967324
862.0,0.47878740101893125,0.48413253940667367
863.0,0.4774831321794409,0.48089348602278664
864.0,0.4795305073665926,0.4536590686478997
865.0,0.4796519090777694,0.47738840714939357
866.0,0.47420868663224847,0.4886552079257091
867.0,0.47807696758059426,0.4820759865723116
868.0,0.48414999519658064,0.46339273958497573
869.0,0.47657787827496206,0.45754550169650043
870.0,0.4747507680554105,0.4868836114084512
871.0,0.48035059555327936,0.4518334697848195
872.0,0.48077758024865114,0.48944633577841096
873.0,0.4792249370340218,0.4885671618429453
874.0,0.47838667134051616,0.48372064994270864
875.0,0.4746378162345973,0.49126438855337423
876.0,0.4737829024850721,0.4755184847323096
877.0,0.47632341036289677,0.4892335490902185
878.0,0.4772920632198943,0.4752077179990924
879.0,0.48126106594680235,0.4532658803531226
880.0,0.47586103704892957,0.48399937507880497
881.0,0.47764351109309844,0.49006583115838337
882.0,0.47731556900290445,0.4804984346028227
883.0,0.48128678897559857,0.4769833490673477
884.0,0.47781616559957507,0.4686966008893631
885.0,0.47852712476127907,0.4698806045008301
886.0,0.4763056262918512,0.49256072430934295
887.0,0.4766148239698761,0.4845711037898528
888.0,0.47594386274944495,0.4844359619681473
889.0,0.47842391092540665,0.4898881605455823
890.0,0.4770819869396432,0.47946084887515
891.0,0.48076745554194267,0.47712103514286114
892.0,0.4818519977464991,0.46337082753539766
893.0,0.47842319097634567,0.49311551472123494
894.0,0.4738397857337422,0.4929545666161202
895.0,0.47669261004558616,0.4900500524107492
896.0,0.4790434778445638,0.4689403058956443
897.0,0.4813655991253813,0.44020569320798797
898.0,0.47740843591243903,0.4946760692856034
899.0,0.4839341537720975,0.4396189319356504
900.0,0.4784702934280959,0.4729043194827314
901.0,0.4811371483336926,0.461055275076654
902.0,0.47658995791852404,0.491909219099803
903.0,0.4756105279354388,0.494007318241475
904.0,0.4788345569706032,0.4888910833208901
905.0,0.47397856738265015,0.487527564543243
906.0,0.4794372599903353,0.4804518263937631
907.0,0.4804011905701335,0.4686096085731534
908.0,0.4783919408063455,0.48132564066357386
909.0,0.47785628749772485,0.46892725510675276
910.0,0.47962476483141037,0.4695824375923197
911.0,0.4708412107017763,0.49140647090881284
912.0,0.4759048218260011,0.47669587974237076
913.0,0.47604385737843014,0.48024019425858777
914.0,0.4770546519143042,0.4835795171552804
915.0,0.4798974746083269,0.4691337274271653
916.0,0.47827846021814646,0.46248846101085295
917.0,0.4812612033725832,0.4540372033558724
918.0,0.4786626481762381,0.4824566526287854
919.0,0.4797177258373767,0.4778435844305528
920.0,0.4765090860231732,0.49408230588131546
921.0,0.48074424621098777,0.4827024100980523
922.0,0.47913866061958266,0.46489827456116656
923.0,0.4761245963613746,0.47239011084579724
924.0,0.47539054647735296,0.48134487632409195
925.0,0.47350529306349187,0.48357404628617223
926.0,0.47422439612818634,0.49404808049399435
927.0,0.47787335948670984,0.4790192669871868
928.0,0.4753045891695948,0.4600238194637406
929.0,0.47736653704520193,0.4779649883737298
930.0,0.477203107436514,0.4844688689217713
931.0,0.47554626146298995,0.47961968718878845
932.0,0.47354664096156474,0.4842204519012371
933.0,0.4782654841878035,0.4527945591474605
934.0,0.47607715645743764,0.49717944214921633
935.0,0.47555371443455785,0.47975909332232347
936.0,0.47587417299311896,0.48313437150332766
937.0,0.4772458508005811,0.4877365185514012
938.0,0.47905374047831256,0.48942209308250484
939.0,0.4792738806226772,0.478968960633447
940.0,0.4755281609732052,0.49033288510529166
941.0,0.47567722819898667,0.49107012533996736
942.0,0.4748478173505872,0.4900015405870878
943.0,0.47741074720763893,0.49277116347256766
944.0,0.4761894278103907,0.4783701368077907
945.0,0.4784248278577662,0.46093894534816165
946.0,0.47666348842318446,0.4828085082980556
947.0,0.48032115807944264,0.4776380141938474
948.0,0.47537879028242896,0.48645660294657
949.0,0.48554849281908685,0.44896063363743327
950.0,0.4736492458040421,0.4916619618437826
951.0,0.4812395069983487,0.48486851812451065
952.0,0.47727991307944645,0.47553991522365824
953.0,0.47816164039724374,0.47469501301449324
954.0,0.476240779249705,0.48846161572822483
955.0,0.47723496869121634,0.49116394357802245
956.0,0.4797813384653428,0.45545716002621955
957.0,0.48251972115230596,0.4704987938375672
958.0,0.4788827245692397,0.4671511905441098
959.0,0.4759835125620387,0.46563572530832403
960.0,0.47592044046084386,0.4724770117148418
961.0,0.47888924264691685,0.4760016433043137
962.0,0.47755025849545757,0.46096871208677
963.0,0.47703344708536605,0.4897449949576535
964.0,0.4791330919456535,0.4800187789510877
965.0,0.4768491545273532,0.4687544275734187
966.0,0.4797947930652545,0.49662092290795967
967.0,0.4800805462063383,0.4606455780268234
968.0,0.48148980642652284,0.42821719544070325
969.0,0.47469752463995013,0.49240159023352
970.0,0.4729891609358631,0.49419943896207497
971.0,0.4778602450839512,0.4792629107382358
972.0,0.48059989883293713,0.47523921353769305
973.0,0.48069957511769207,0.43082104993614695
974.0,0.47790765908089505,0.47944922748156976
975.0,0.4781232632563172,0.46416343474430355
976.0,0.47400643131806536,0.47585892448783207
977.0,0.47723570066044313,0.45410356547444525
978.0,0.4780706449360118,0.47958880482508687
979.0,0.4765592581682141,0.4767789032929721
980.0,0.4769026231353631,0.4790893128138115
981.0,0.4705601994033605,0.4764776063584775
982.0,0.47377886740238767,0.47651122489518744
983.0,0.4807595476098187,0.4584132281340334
984.0,0.476236829170041,0.49033812229769086
985.0,0.4804649942246098,0.46354193663746496
986.0,0.4761023453119403,0.4826827140024678
987.0,0.47730640135763003,0.4687537995679562
988.0,0.47542587929043373,0.48981655070068336
989.0,0.47818362332792685,0.4936051245705641
990.0,0.4749933381966886,0.48042805317163384
991.0,0.47477169459827356,0.4945533686411733
992.0,0.4773361744986382,0.479418846334312
993.0,0.47817943267500523,0.4669542809400971
994.0,0.47669886635217595,0.49114772043221344
995.0,0.47498009466845487,0.4832604643725604
996.0,0.47018478857051976,0.4780002124683415
997.0,0.4754009448685138,0.47723559096575263
998.0,0.47928050072324224,0.479187187700647
999.0,0.4778256573692343,0.4933512073922859
1000.0,0.4740079055361776,0.4913205820941293
1001.0,0.47819927268453893,0.48473336905535896
1002.0,0.4717519335255149,0.4852216192906024
1003.0,0.47784031560993634,0.48530331396893484
1004.0,0.4730868082670104,0.49244144121600536
1005.0,0.47691011851982656,0.4709883043238656
1006.0,0.4770569420377548,0.47532833715639483
1007.0,0.4813235578377297,0.4691197161237439
1008.0,0.4739886798025303,0.4915404046447689
1009.0,0.47490078704523075,0.45758413861862324
1010.0,0.4745773960726334,0.4799426526165298
1011.0,0.47283536067272347,0.4879705635387262
1012.0,0.4740054425385104,0.4883673360291275
1013.0,0.4800464386337959,0.4713511647442258
1014.0,0.47654639444440733,0.49431449911490477
1015.0,0.47689699017488896,0.4938649404075867
1016.0,0.4744083652238197,0.4868259667037818
1017.0,0.47785073611443035,0.46973458453787065
1018.0,0.4750344009223818,0.4807528304330192
1019.0,0.472681273955239,0.4940560822216154
1020.0,0.47867285386043423,0.4413582751790563
1021.0,0.4775547910255498,0.4937879015668589
1022.0,0.47501010759198575,0.49254885405152665
1023.0,0.4704468170112066,0.49176346942612903
1024.0,0.47612780062043936,0.48570052440797684
1025.0,0.47485911776658657,0.49317415496704253
1026.0,0.47719286380457926,0.45531675902487007
1027.0,0.4759972076867858,0.47760692117018716
1028.0,0.47046302615414143,0.47167174508517046
1029.0,0.4765077254420923,0.47799064608955544
1030.0,0.47385939031931584,0.4943721647017499
1031.0,0.4731216698701994,0.4848854142294834
1032.0,0.4749868371445329,0.4903227998050483
1033.0,0.47524304338388995,0.49134676045375064
1034.0,0.4729299996183352,0.4840434961599361
1035.0,0.47287667960510593,0.4919532056618598
1036.0,0.4722364585745971,0.47348042182746924
1037.0,0.47644072103806895,0.48483344603770545
1038.0,0.47658723740080694,0.4810372401846899
1039.0,0.47234628788163213,0.49646989057958474
1040.0,0.4727021690596361,0.49409873110905994
1041.0,0.4784694385336012,0.49102607718142044
1042.0,0.4758621214922458,0.4797906569097717
1043.0,0.47494631798114517,0.4926775067172488
1044.0,0.47372163584241805,0.48856888997912307
1045.0,0.4760100507748918,0.4823965412217727
1046.0,0.4761064381305554,0.49049047739301843
1047.0,0.4772150948590023,0.4718295642825225
1048.0,0.47550000406194676,0.4931373824696072
1049.0,0.4787705925563099,0.48656034338114124
1050.0,0.47966671385232373,0.468707235139663
1051.0,0.47626557241983325,0.49108431645730366
1052.0,0.47535001770074753,0.4916554237803188
1053.0,0.47487721545535233,0.49374187352195836
1054.0,0.4775139206753909,0.4720845356897786
1055.0,0.4750426387832008,0.47932766317203424
1056.0,0.4734588116818671,0.48670221628615995
1057.0,0.47474829296119847,0.4595827886232932
1058.0,0.4726397034180886,0.48265684678204956
1059.0,0.47789015168087523,0.47669103769121435
1060.0,0.4748918480434807,0.4935147844142851
1061.0,0.4781602197853477,0.47874851947811664
1062.0,0.4783115024892679,0.4446681980350906
1063.0,0.4749933340288573,0.48199847634298154
1064.0,0.47654852656594276,0.47502457279421545
1065.0,0.4726953638461561,0.48524635623705475
1066.0,0.4709624534447649,0.48763757423858645
1067.0,0.47911455734189895,0.4527132986707383
1068.0,0.47587224533866473,0.4850220281268861
1069.0,0.47784420865703964,0.4717146513998678
1070.0,0.4775637197149991,0.47110680680575046
1071.0,0.47531320264883337,0.4950016231298139
1072.0,0.4744877253385934,0.4922001458383347
1073.0,0.4740559643685347,0.4809248837926934
1074.0,0.47426321844325475,0.4842908934529428
1075.0,0.4770687069681849,0.4642592218742092
1076.0,0.4787037086361048,0.45681098535084086
1077.0,0.47745715309007153,0.48204844471274416
1078.0,0.47742765515930236,0.4691870612710381
1079.0,0.47907641577613524,0.4833308422856818
1080.0,0.47752408268199537,0.4898462221758053
1081.0,0.47436912302274065,0.49740859167717294
1082.0,0.4770309234002592,0.494400516493171
1083.0,0.47646936096968434,0.4821421275505288
1084.0,0.4792088599769605,0.46641910093042777
1085.0,0.4796206534068678,0.4772113809363313
1086.0,0.47499043001706354,0.46505715949577797
1087.0,0.47765266954578484,0.4768146257349734
1088.0,0.47580712118352847,0.47077964442641496
1089.0,0.47910470091687735,0.4881746837636204
1090.0,0.47588606397049654,0.49418626493660556
1091.0,0.47502077093519957,0.47966733578249304
1092.0,0.4782483539090166,0.48872867084463356
