"Occasion Count","Lease Count","New Count"
168.0,8.0,24.0
168.0,8.0,24.0
168.0,8.0,24.0
168.0,8.0,24.0
168.0,8.0,24.0
168.0,8.0,24.0
168.0,8.0,24.0
168.0,8.0,24.0
168.0,8.0,24.0
168.0,8.0,24.0
168.0,8.0,24.0
168.0,8.0,24.0
168.0,8.0,24.0
168.0,8.0,24.0
168.0,8.0,24.0
168.0,8.0,24.0
168.0,8.0,24.0
168.0,8.0,24.0
168.0,8.0,24.0
168.0,8.0,24.0
168.0,8.0,24.0
168.0,8.0,24.0
168.0,8.0,24.0
168.0,8.0,24.0
168.0,8.0,24.0
168.0,8.0,24.0
168.0,8.0,24.0
168.0,8.0,24.0
168.0,8.0,24.0
168.0,8.0,24.0
168.0,8.0,24.0
168.0,8.0,24.0
168.0,8.0,24.0
168.0,8.0,24.0
168.0,8.0,24.0
168.0,8.0,24.0
168.0,8.0,24.0
168.0,8.0,24.0
168.0,8.0,24.0
168.0,8.0,24.0
168.0,8.0,24.0
168.0,8.0,24.0
168.0,8.0,24.0
168.0,8.0,24.0
168.0,8.0,24.0
168.0,8.0,24.0
168.0,8.0,24.0
168.0,8.0,24.0
168.0,8.0,24.0
168.0,8.0,24.0
168.0,8.0,24.0
168.0,8.0,24.0
168.0,8.0,24.0
168.0,8.0,24.0
168.0,8.0,24.0
168.0,8.0,24.0
168.0,8.0,24.0
168.0,8.0,24.0
168.0,8.0,24.0
168.0,8.0,24.0
168.0,8.0,24.0
168.0,8.0,24.0
168.0,8.0,24.0
168.0,8.0,24.0
168.0,8.0,24.0
168.0,8.0,24.0
168.0,8.0,24.0
168.0,8.0,24.0
168.0,8.0,24.0
168.0,8.0,24.0
168.0,8.0,24.0
168.0,8.0,24.0
168.0,8.0,24.0
168.0,8.0,24.0
168.0,8.0,24.0
168.0,8.0,24.0
168.0,8.0,24.0
168.0,8.0,24.0
168.0,8.0,24.0
168.0,8.0,24.0
168.0,8.0,24.0
168.0,8.0,24.0
168.0,8.0,24.0
168.0,8.0,24.0
168.0,8.0,24.0
168.0,8.0,24.0
168.0,8.0,24.0
168.0,8.0,24.0
168.0,8.0,24.0
168.0,8.0,24.0
168.0,8.0,24.0
168.0,8.0,24.0
168.0,8.0,24.0
168.0,8.0,24.0
168.0,8.0,24.0
168.0,8.0,24.0
168.0,8.0,24.0
168.0,8.0,24.0
168.0,8.0,24.0
168.0,8.0,24.0
168.0,8.0,24.0
168.0,8.0,24.0
168.0,8.0,24.0
168.0,8.0,24.0
168.0,8.0,24.0
168.0,8.0,24.0
168.0,8.0,24.0
168.0,8.0,24.0
168.0,8.0,24.0
168.0,8.0,24.0
168.0,8.0,24.0
168.0,8.0,24.0
168.0,8.0,24.0
168.0,8.0,24.0
168.0,8.0,24.0
168.0,8.0,24.0
168.0,8.0,24.0
168.0,8.0,24.0
168.0,8.0,24.0
168.0,8.0,24.0
168.0,8.0,24.0
168.0,8.0,24.0
168.0,8.0,24.0
168.0,8.0,24.0
168.0,8.0,24.0
168.0,8.0,24.0
168.0,8.0,24.0
168.0,8.0,24.0
168.0,8.0,24.0
168.0,8.0,24.0
168.0,8.0,24.0
168.0,8.0,24.0
168.0,8.0,24.0
168.0,8.0,24.0
168.0,8.0,24.0
168.0,8.0,24.0
168.0,8.0,24.0
168.0,8.0,24.0
168.0,8.0,24.0
168.0,8.0,24.0
168.0,8.0,24.0
168.0,8.0,24.0
168.0,8.0,24.0
168.0,8.0,24.0
168.0,8.0,24.0
168.0,8.0,24.0
168.0,8.0,24.0
168.0,8.0,24.0
168.0,8.0,24.0
168.0,8.0,24.0
168.0,8.0,24.0
168.0,8.0,24.0
168.0,8.0,24.0
168.0,8.0,24.0
168.0,8.0,24.0
168.0,8.0,24.0
168.0,8.0,24.0
168.0,8.0,24.0
168.0,8.0,24.0
168.0,8.0,24.0
168.0,8.0,24.0
168.0,8.0,24.0
168.0,8.0,24.0
168.0,8.0,24.0
168.0,8.0,24.0
168.0,8.0,24.0
168.0,8.0,24.0
168.0,8.0,24.0
168.0,8.0,24.0
168.0,8.0,24.0
168.0,8.0,24.0
168.0,8.0,24.0
168.0,8.0,24.0
168.0,8.0,24.0
168.0,8.0,24.0
168.0,8.0,24.0
168.0,8.0,24.0
168.0,8.0,24.0
168.0,8.0,24.0
168.0,8.0,24.0
168.0,8.0,24.0
168.0,8.0,24.0
168.0,8.0,24.0
168.0,8.0,24.0
168.0,8.0,24.0
168.0,8.0,24.0
168.0,8.0,24.0
168.0,8.0,24.0
168.0,8.0,24.0
168.0,8.0,24.0
168.0,8.0,24.0
168.0,8.0,24.0
168.0,8.0,24.0
168.0,8.0,24.0
168.0,8.0,24.0
168.0,8.0,24.0
168.0,8.0,24.0
168.0,8.0,24.0
168.0,8.0,24.0
168.0,8.0,24.0
168.0,8.0,24.0
168.0,8.0,24.0
168.0,8.0,24.0
168.0,8.0,24.0
168.0,8.0,24.0
168.0,8.0,24.0
168.0,8.0,24.0
168.0,8.0,24.0
168.0,8.0,24.0
168.0,8.0,24.0
168.0,8.0,24.0
168.0,8.0,24.0
168.0,8.0,24.0
168.0,8.0,24.0
168.0,8.0,24.0
168.0,8.0,24.0
168.0,8.0,24.0
168.0,8.0,24.0
168.0,8.0,24.0
168.0,8.0,24.0
168.0,8.0,24.0
168.0,9.0,23.0
168.0,9.0,23.0
168.0,9.0,23.0
168.0,9.0,23.0
168.0,9.0,23.0
168.0,9.0,23.0
168.0,9.0,23.0
168.0,9.0,23.0
168.0,9.0,23.0
168.0,9.0,23.0
168.0,9.0,23.0
168.0,9.0,23.0
168.0,9.0,23.0
168.0,9.0,23.0
168.0,9.0,23.0
168.0,9.0,23.0
168.0,9.0,23.0
168.0,9.0,23.0
168.0,9.0,23.0
168.0,9.0,23.0
168.0,9.0,23.0
168.0,9.0,23.0
168.0,9.0,23.0
168.0,9.0,23.0
168.0,9.0,23.0
168.0,9.0,23.0
168.0,9.0,23.0
168.0,9.0,23.0
168.0,9.0,23.0
168.0,9.0,23.0
168.0,9.0,23.0
168.0,9.0,23.0
168.0,9.0,23.0
168.0,9.0,23.0
168.0,9.0,23.0
168.0,9.0,23.0
168.0,9.0,23.0
168.0,9.0,23.0
168.0,9.0,23.0
168.0,9.0,23.0
168.0,9.0,23.0
168.0,9.0,23.0
168.0,9.0,23.0
168.0,9.0,23.0
168.0,9.0,23.0
168.0,9.0,23.0
168.0,9.0,23.0
168.0,9.0,23.0
168.0,9.0,23.0
168.0,9.0,23.0
168.0,9.0,23.0
168.0,9.0,23.0
168.0,9.0,23.0
168.0,9.0,23.0
168.0,9.0,23.0
168.0,9.0,23.0
168.0,9.0,23.0
168.0,9.0,23.0
168.0,9.0,23.0
168.0,9.0,23.0
168.0,9.0,23.0
168.0,9.0,23.0
168.0,9.0,23.0
168.0,9.0,23.0
168.0,9.0,23.0
168.0,9.0,23.0
168.0,9.0,23.0
168.0,9.0,23.0
168.0,9.0,23.0
168.0,9.0,23.0
168.0,9.0,23.0
168.0,9.0,23.0
168.0,9.0,23.0
168.0,9.0,23.0
168.0,9.0,23.0
168.0,9.0,23.0
168.0,9.0,23.0
168.0,9.0,23.0
168.0,9.0,23.0
168.0,9.0,23.0
168.0,9.0,23.0
168.0,9.0,23.0
168.0,10.0,22.0
168.0,10.0,22.0
168.0,10.0,22.0
168.0,10.0,22.0
168.0,10.0,22.0
168.0,10.0,22.0
168.0,10.0,22.0
168.0,10.0,22.0
168.0,10.0,22.0
168.0,10.0,22.0
168.0,10.0,22.0
168.0,10.0,22.0
168.0,10.0,22.0
168.0,10.0,22.0
168.0,10.0,22.0
168.0,10.0,22.0
168.0,10.0,22.0
168.0,10.0,22.0
168.0,10.0,22.0
168.0,10.0,22.0
168.0,10.0,22.0
168.0,10.0,22.0
168.0,10.0,22.0
168.0,10.0,22.0
168.0,10.0,22.0
168.0,10.0,22.0
168.0,10.0,22.0
168.0,10.0,22.0
168.0,10.0,22.0
168.0,10.0,22.0
168.0,10.0,22.0
168.0,10.0,22.0
168.0,10.0,22.0
168.0,10.0,22.0
168.0,10.0,22.0
168.0,10.0,22.0
168.0,10.0,22.0
168.0,10.0,22.0
168.0,10.0,22.0
168.0,10.0,22.0
168.0,10.0,22.0
168.0,10.0,22.0
168.0,10.0,22.0
168.0,10.0,22.0
168.0,10.0,22.0
168.0,10.0,22.0
168.0,10.0,22.0
168.0,10.0,22.0
168.0,10.0,22.0
168.0,10.0,22.0
168.0,10.0,22.0
168.0,10.0,22.0
168.0,10.0,22.0
168.0,10.0,22.0
168.0,10.0,22.0
168.0,10.0,22.0
168.0,10.0,22.0
168.0,10.0,22.0
168.0,10.0,22.0
168.0,10.0,22.0
168.0,10.0,22.0
168.0,10.0,22.0
168.0,10.0,22.0
168.0,10.0,22.0
168.0,10.0,22.0
168.0,10.0,22.0
168.0,10.0,22.0
168.0,10.0,22.0
168.0,10.0,22.0
168.0,10.0,22.0
168.0,10.0,22.0
168.0,10.0,22.0
168.0,10.0,22.0
168.0,10.0,22.0
168.0,10.0,22.0
168.0,10.0,22.0
168.0,10.0,22.0
168.0,10.0,22.0
168.0,10.0,22.0
168.0,10.0,22.0
168.0,10.0,22.0
168.0,10.0,22.0
168.0,10.0,22.0
168.0,10.0,22.0
168.0,10.0,22.0
168.0,10.0,22.0
168.0,10.0,22.0
168.0,10.0,22.0
168.0,10.0,22.0
168.0,10.0,22.0
168.0,10.0,22.0
168.0,10.0,22.0
168.0,10.0,22.0
168.0,10.0,22.0
168.0,10.0,22.0
168.0,10.0,22.0
168.0,10.0,22.0
168.0,10.0,22.0
168.0,10.0,22.0
168.0,10.0,22.0
168.0,10.0,22.0
168.0,10.0,22.0
168.0,10.0,22.0
168.0,10.0,22.0
168.0,10.0,22.0
168.0,10.0,22.0
168.0,10.0,22.0
168.0,10.0,22.0
168.0,10.0,22.0
168.0,10.0,22.0
168.0,10.0,22.0
168.0,10.0,22.0
168.0,10.0,22.0
168.0,10.0,22.0
168.0,10.0,22.0
168.0,10.0,22.0
168.0,10.0,22.0
168.0,10.0,22.0
168.0,10.0,22.0
168.0,10.0,22.0
168.0,10.0,22.0
168.0,10.0,22.0
168.0,10.0,22.0
168.0,10.0,22.0
168.0,10.0,22.0
168.0,10.0,22.0
168.0,10.0,22.0
168.0,10.0,22.0
168.0,10.0,22.0
168.0,10.0,22.0
168.0,10.0,22.0
168.0,10.0,22.0
168.0,10.0,22.0
168.0,10.0,22.0
168.0,10.0,22.0
168.0,10.0,22.0
168.0,10.0,22.0
168.0,10.0,22.0
168.0,10.0,22.0
168.0,10.0,22.0
168.0,10.0,22.0
168.0,10.0,22.0
168.0,10.0,22.0
168.0,10.0,22.0
168.0,10.0,22.0
168.0,10.0,22.0
168.0,10.0,22.0
168.0,10.0,22.0
168.0,10.0,22.0
168.0,10.0,22.0
168.0,10.0,22.0
168.0,10.0,22.0
168.0,10.0,22.0
168.0,10.0,22.0
168.0,10.0,22.0
168.0,10.0,22.0
168.0,10.0,22.0
168.0,10.0,22.0
168.0,10.0,22.0
168.0,10.0,22.0
168.0,10.0,22.0
168.0,10.0,22.0
168.0,10.0,22.0
168.0,10.0,22.0
168.0,10.0,22.0
168.0,10.0,22.0
168.0,10.0,22.0
168.0,10.0,22.0
168.0,10.0,22.0
168.0,10.0,22.0
168.0,10.0,22.0
168.0,10.0,22.0
168.0,10.0,22.0
168.0,10.0,22.0
168.0,10.0,22.0
168.0,10.0,22.0
168.0,10.0,22.0
168.0,10.0,22.0
168.0,10.0,22.0
168.0,10.0,22.0
168.0,10.0,22.0
168.0,10.0,22.0
168.0,10.0,22.0
168.0,10.0,22.0
168.0,10.0,22.0
168.0,10.0,22.0
168.0,10.0,22.0
168.0,10.0,22.0
168.0,10.0,22.0
168.0,10.0,22.0
168.0,10.0,22.0
168.0,10.0,22.0
168.0,10.0,22.0
168.0,10.0,22.0
168.0,10.0,22.0
168.0,10.0,22.0
168.0,10.0,22.0
168.0,10.0,22.0
168.0,10.0,22.0
168.0,10.0,22.0
168.0,10.0,22.0
168.0,10.0,22.0
168.0,10.0,22.0
168.0,10.0,22.0
168.0,10.0,22.0
168.0,10.0,22.0
168.0,10.0,22.0
168.0,10.0,22.0
168.0,10.0,22.0
168.0,10.0,22.0
168.0,10.0,22.0
168.0,10.0,22.0
168.0,10.0,22.0
168.0,10.0,22.0
168.0,10.0,22.0
168.0,10.0,22.0
168.0,10.0,22.0
168.0,10.0,22.0
168.0,10.0,22.0
168.0,10.0,22.0
168.0,10.0,22.0
168.0,10.0,22.0
168.0,10.0,22.0
168.0,10.0,22.0
168.0,10.0,22.0
168.0,10.0,22.0
168.0,10.0,22.0
168.0,10.0,22.0
168.0,10.0,22.0
168.0,10.0,22.0
168.0,10.0,22.0
168.0,10.0,22.0
168.0,10.0,22.0
168.0,10.0,22.0
168.0,10.0,22.0
168.0,10.0,22.0
168.0,10.0,22.0
168.0,10.0,22.0
168.0,10.0,22.0
168.0,10.0,22.0
168.0,10.0,22.0
168.0,10.0,22.0
168.0,10.0,22.0
168.0,10.0,22.0
168.0,10.0,22.0
168.0,10.0,22.0
168.0,10.0,22.0
168.0,10.0,22.0
168.0,10.0,22.0
168.0,10.0,22.0
168.0,10.0,22.0
168.0,10.0,22.0
168.0,10.0,22.0
168.0,10.0,22.0
168.0,10.0,22.0
168.0,10.0,22.0
168.0,10.0,22.0
168.0,10.0,22.0
168.0,10.0,22.0
168.0,10.0,22.0
168.0,10.0,22.0
168.0,10.0,22.0
168.0,10.0,22.0
168.0,10.0,22.0
168.0,10.0,22.0
168.0,10.0,22.0
168.0,10.0,22.0
168.0,10.0,22.0
168.0,10.0,22.0
168.0,10.0,22.0
168.0,10.0,22.0
168.0,10.0,22.0
168.0,10.0,22.0
168.0,10.0,22.0
168.0,10.0,22.0
168.0,10.0,22.0
168.0,10.0,22.0
168.0,10.0,22.0
168.0,10.0,22.0
168.0,10.0,22.0
168.0,10.0,22.0
168.0,10.0,22.0
168.0,10.0,22.0
168.0,10.0,22.0
168.0,10.0,22.0
168.0,10.0,22.0
168.0,10.0,22.0
168.0,10.0,22.0
168.0,10.0,22.0
168.0,10.0,22.0
168.0,10.0,22.0
168.0,10.0,22.0
168.0,10.0,22.0
168.0,10.0,22.0
168.0,10.0,22.0
168.0,10.0,22.0
168.0,10.0,22.0
168.0,10.0,22.0
168.0,10.0,22.0
168.0,10.0,22.0
168.0,10.0,22.0
168.0,10.0,22.0
168.0,10.0,22.0
168.0,10.0,22.0
168.0,10.0,22.0
168.0,10.0,22.0
168.0,10.0,22.0
168.0,10.0,22.0
168.0,10.0,22.0
168.0,10.0,22.0
168.0,10.0,22.0
168.0,10.0,22.0
168.0,10.0,22.0
168.0,10.0,22.0
168.0,10.0,22.0
168.0,10.0,22.0
168.0,10.0,22.0
168.0,10.0,22.0
168.0,10.0,22.0
168.0,10.0,22.0
168.0,10.0,22.0
168.0,10.0,22.0
168.0,10.0,22.0
168.0,10.0,22.0
168.0,10.0,22.0
168.0,10.0,22.0
168.0,10.0,22.0
168.0,10.0,22.0
168.0,10.0,22.0
168.0,10.0,22.0
168.0,10.0,22.0
168.0,10.0,22.0
168.0,10.0,22.0
168.0,10.0,22.0
168.0,10.0,22.0
168.0,10.0,22.0
168.0,10.0,22.0
168.0,10.0,22.0
168.0,10.0,22.0
168.0,10.0,22.0
168.0,10.0,22.0
168.0,10.0,22.0
168.0,10.0,22.0
168.0,10.0,22.0
168.0,10.0,22.0
168.0,10.0,22.0
168.0,10.0,22.0
168.0,10.0,22.0
168.0,10.0,22.0
168.0,10.0,22.0
168.0,10.0,22.0
168.0,10.0,22.0
168.0,10.0,22.0
168.0,10.0,22.0
168.0,10.0,22.0
168.0,10.0,22.0
168.0,10.0,22.0
168.0,10.0,22.0
168.0,10.0,22.0
168.0,10.0,22.0
168.0,10.0,22.0
168.0,10.0,22.0
168.0,10.0,22.0
168.0,10.0,22.0
168.0,10.0,22.0
168.0,10.0,22.0
168.0,10.0,22.0
168.0,10.0,22.0
168.0,10.0,22.0
168.0,10.0,22.0
168.0,10.0,22.0
168.0,10.0,22.0
168.0,10.0,22.0
168.0,11.0,21.0
168.0,11.0,21.0
168.0,11.0,21.0
168.0,11.0,21.0
168.0,11.0,21.0
168.0,11.0,21.0
168.0,11.0,21.0
168.0,11.0,21.0
168.0,11.0,21.0
168.0,11.0,21.0
168.0,11.0,21.0
168.0,11.0,21.0
168.0,11.0,21.0
168.0,11.0,21.0
168.0,11.0,21.0
168.0,11.0,21.0
168.0,11.0,21.0
168.0,11.0,21.0
168.0,11.0,21.0
168.0,11.0,21.0
168.0,11.0,21.0
168.0,11.0,21.0
168.0,11.0,21.0
168.0,11.0,21.0
168.0,11.0,21.0
168.0,11.0,21.0
168.0,11.0,21.0
168.0,11.0,21.0
168.0,11.0,21.0
168.0,11.0,21.0
168.0,11.0,21.0
168.0,11.0,21.0
168.0,11.0,21.0
168.0,11.0,21.0
168.0,11.0,21.0
168.0,11.0,21.0
168.0,11.0,21.0
168.0,11.0,21.0
168.0,11.0,21.0
168.0,11.0,21.0
168.0,11.0,21.0
168.0,11.0,21.0
168.0,11.0,21.0
168.0,11.0,21.0
168.0,11.0,21.0
168.0,11.0,21.0
168.0,11.0,21.0
168.0,11.0,21.0
168.0,11.0,21.0
168.0,11.0,21.0
168.0,11.0,21.0
168.0,11.0,21.0
168.0,11.0,21.0
168.0,11.0,21.0
168.0,11.0,21.0
168.0,11.0,21.0
168.0,11.0,21.0
168.0,11.0,21.0
168.0,11.0,21.0
168.0,11.0,21.0
168.0,11.0,21.0
168.0,11.0,21.0
168.0,11.0,21.0
168.0,11.0,21.0
168.0,11.0,21.0
168.0,11.0,21.0
168.0,11.0,21.0
168.0,11.0,21.0
168.0,11.0,21.0
168.0,11.0,21.0
168.0,11.0,21.0
168.0,11.0,21.0
168.0,11.0,21.0
168.0,11.0,21.0
168.0,11.0,21.0
168.0,11.0,21.0
168.0,11.0,21.0
168.0,11.0,21.0
168.0,11.0,21.0
168.0,11.0,21.0
168.0,11.0,21.0
168.0,11.0,21.0
168.0,11.0,21.0
168.0,11.0,21.0
168.0,11.0,21.0
168.0,11.0,21.0
168.0,11.0,21.0
168.0,11.0,21.0
168.0,11.0,21.0
168.0,11.0,21.0
168.0,11.0,21.0
168.0,11.0,21.0
168.0,11.0,21.0
168.0,11.0,21.0
168.0,11.0,21.0
168.0,11.0,21.0
168.0,11.0,21.0
168.0,11.0,21.0
168.0,11.0,21.0
168.0,11.0,21.0
168.0,11.0,21.0
168.0,11.0,21.0
168.0,11.0,21.0
168.0,11.0,21.0
168.0,11.0,21.0
168.0,11.0,21.0
168.0,11.0,21.0
168.0,11.0,21.0
168.0,11.0,21.0
168.0,11.0,21.0
168.0,11.0,21.0
168.0,11.0,21.0
168.0,11.0,21.0
168.0,11.0,21.0
168.0,11.0,21.0
168.0,11.0,21.0
168.0,11.0,21.0
168.0,11.0,21.0
168.0,11.0,21.0
168.0,11.0,21.0
168.0,11.0,21.0
168.0,11.0,21.0
168.0,11.0,21.0
168.0,11.0,21.0
168.0,11.0,21.0
168.0,11.0,21.0
168.0,11.0,21.0
168.0,11.0,21.0
168.0,11.0,21.0
168.0,11.0,21.0
168.0,11.0,21.0
168.0,11.0,21.0
168.0,11.0,21.0
168.0,11.0,21.0
168.0,11.0,21.0
168.0,11.0,21.0
168.0,11.0,21.0
168.0,11.0,21.0
168.0,11.0,21.0
168.0,11.0,21.0
168.0,11.0,21.0
168.0,11.0,21.0
168.0,11.0,21.0
168.0,11.0,21.0
168.0,11.0,21.0
168.0,11.0,21.0
168.0,11.0,21.0
168.0,11.0,21.0
168.0,11.0,21.0
168.0,11.0,21.0
168.0,11.0,21.0
168.0,11.0,21.0
168.0,11.0,21.0
168.0,11.0,21.0
168.0,11.0,21.0
168.0,11.0,21.0
168.0,11.0,21.0
168.0,11.0,21.0
168.0,11.0,21.0
168.0,11.0,21.0
168.0,11.0,21.0
168.0,11.0,21.0
168.0,11.0,21.0
168.0,11.0,21.0
168.0,11.0,21.0
168.0,11.0,21.0
168.0,11.0,21.0
168.0,11.0,21.0
168.0,11.0,21.0
168.0,11.0,21.0
168.0,11.0,21.0
168.0,11.0,21.0
168.0,11.0,21.0
168.0,11.0,21.0
168.0,11.0,21.0
168.0,11.0,21.0
168.0,11.0,21.0
168.0,11.0,21.0
168.0,11.0,21.0
168.0,11.0,21.0
168.0,11.0,21.0
168.0,11.0,21.0
168.0,11.0,21.0
168.0,11.0,21.0
168.0,11.0,21.0
168.0,11.0,21.0
168.0,11.0,21.0
168.0,11.0,21.0
168.0,11.0,21.0
168.0,11.0,21.0
168.0,11.0,21.0
168.0,11.0,21.0
168.0,11.0,21.0
168.0,11.0,21.0
168.0,11.0,21.0
168.0,11.0,21.0
168.0,11.0,21.0
168.0,11.0,21.0
168.0,11.0,21.0
168.0,11.0,21.0
168.0,11.0,21.0
168.0,11.0,21.0
168.0,11.0,21.0
168.0,11.0,21.0
168.0,11.0,21.0
168.0,11.0,21.0
168.0,11.0,21.0
168.0,11.0,21.0
168.0,12.0,20.0
168.0,12.0,20.0
168.0,12.0,20.0
168.0,12.0,20.0
168.0,12.0,20.0
168.0,12.0,20.0
168.0,12.0,20.0
168.0,12.0,20.0
168.0,12.0,20.0
168.0,12.0,20.0
168.0,12.0,20.0
168.0,12.0,20.0
168.0,12.0,20.0
168.0,12.0,20.0
168.0,12.0,20.0
168.0,12.0,20.0
168.0,12.0,20.0
168.0,12.0,20.0
168.0,12.0,20.0
168.0,12.0,20.0
168.0,12.0,20.0
168.0,12.0,20.0
168.0,12.0,20.0
168.0,12.0,20.0
168.0,12.0,20.0
168.0,12.0,20.0
168.0,12.0,20.0
168.0,12.0,20.0
168.0,12.0,20.0
168.0,12.0,20.0
168.0,12.0,20.0
168.0,12.0,20.0
168.0,12.0,20.0
168.0,12.0,20.0
168.0,12.0,20.0
168.0,12.0,20.0
168.0,12.0,20.0
168.0,12.0,20.0
168.0,12.0,20.0
168.0,12.0,20.0
168.0,12.0,20.0
168.0,13.0,19.0
168.0,13.0,19.0
168.0,13.0,19.0
168.0,13.0,19.0
168.0,13.0,19.0
168.0,13.0,19.0
168.0,13.0,19.0
168.0,13.0,19.0
168.0,13.0,19.0
168.0,13.0,19.0
168.0,13.0,19.0
168.0,13.0,19.0
168.0,13.0,19.0
168.0,13.0,19.0
168.0,13.0,19.0
168.0,13.0,19.0
168.0,13.0,19.0
168.0,13.0,19.0
168.0,13.0,19.0
168.0,13.0,19.0
168.0,13.0,19.0
168.0,13.0,19.0
168.0,13.0,19.0
168.0,13.0,19.0
168.0,13.0,19.0
168.0,13.0,19.0
168.0,13.0,19.0
168.0,13.0,19.0
168.0,13.0,19.0
168.0,13.0,19.0
168.0,13.0,19.0
168.0,13.0,19.0
168.0,13.0,19.0
168.0,13.0,19.0
168.0,13.0,19.0
168.0,13.0,19.0
168.0,13.0,19.0
168.0,13.0,19.0
168.0,13.0,19.0
168.0,13.0,19.0
168.0,13.0,19.0
168.0,13.0,19.0
168.0,13.0,19.0
168.0,13.0,19.0
168.0,13.0,19.0
168.0,13.0,19.0
168.0,13.0,19.0
168.0,13.0,19.0
168.0,13.0,19.0
168.0,13.0,19.0
168.0,13.0,19.0
168.0,13.0,19.0
168.0,13.0,19.0
168.0,13.0,19.0
168.0,13.0,19.0
168.0,13.0,19.0
168.0,13.0,19.0
168.0,13.0,19.0
168.0,13.0,19.0
168.0,13.0,19.0
168.0,13.0,19.0
168.0,13.0,19.0
168.0,14.0,18.0
168.0,14.0,18.0
168.0,14.0,18.0
168.0,14.0,18.0
168.0,14.0,18.0
168.0,14.0,18.0
168.0,14.0,18.0
168.0,14.0,18.0
168.0,14.0,18.0
168.0,14.0,18.0
168.0,14.0,18.0
168.0,14.0,18.0
168.0,14.0,18.0
168.0,14.0,18.0
168.0,14.0,18.0
168.0,14.0,18.0
168.0,14.0,18.0
168.0,14.0,18.0
168.0,14.0,18.0
168.0,14.0,18.0
168.0,14.0,18.0
168.0,14.0,18.0
168.0,14.0,18.0
168.0,14.0,18.0
168.0,14.0,18.0
168.0,14.0,18.0
168.0,14.0,18.0
168.0,14.0,18.0
168.0,14.0,18.0
168.0,14.0,18.0
168.0,14.0,18.0
168.0,14.0,18.0
168.0,14.0,18.0
168.0,14.0,18.0
168.0,14.0,18.0
168.0,14.0,18.0
168.0,14.0,18.0
168.0,14.0,18.0
168.0,14.0,18.0
168.0,14.0,18.0
168.0,14.0,18.0
168.0,14.0,18.0
168.0,14.0,18.0
168.0,14.0,18.0
168.0,14.0,18.0
168.0,14.0,18.0
168.0,14.0,18.0
168.0,14.0,18.0
168.0,14.0,18.0
168.0,14.0,18.0
168.0,14.0,18.0
168.0,14.0,18.0
168.0,14.0,18.0
168.0,14.0,18.0
168.0,14.0,18.0
168.0,14.0,18.0
168.0,14.0,18.0
168.0,14.0,18.0
168.0,14.0,18.0
168.0,14.0,18.0
168.0,14.0,18.0
168.0,14.0,18.0
168.0,14.0,18.0
168.0,14.0,18.0
168.0,14.0,18.0
168.0,14.0,18.0
168.0,14.0,18.0
168.0,14.0,18.0
168.0,14.0,18.0
168.0,14.0,18.0
168.0,14.0,18.0
168.0,14.0,18.0
168.0,14.0,18.0
168.0,14.0,18.0
168.0,14.0,18.0
168.0,14.0,18.0
168.0,14.0,18.0
168.0,14.0,18.0
168.0,14.0,18.0
168.0,14.0,18.0
168.0,14.0,18.0
168.0,14.0,18.0
168.0,14.0,18.0
168.0,14.0,18.0
168.0,14.0,18.0
168.0,14.0,18.0
168.0,14.0,18.0
168.0,14.0,18.0
168.0,14.0,18.0
168.0,14.0,18.0
168.0,14.0,18.0
168.0,14.0,18.0
168.0,14.0,18.0
168.0,14.0,18.0
168.0,14.0,18.0
168.0,14.0,18.0
168.0,14.0,18.0
168.0,14.0,18.0
168.0,14.0,18.0
168.0,14.0,18.0
168.0,14.0,18.0
168.0,14.0,18.0
168.0,14.0,18.0
168.0,14.0,18.0
168.0,14.0,18.0
