"Gasoline","BEV","tick"
193.0,7.0,1.0
193.0,7.0,2.0
193.0,7.0,3.0
193.0,7.0,4.0
193.0,7.0,5.0
193.0,7.0,6.0
193.0,7.0,7.0
193.0,7.0,8.0
193.0,7.0,9.0
193.0,7.0,10.0
193.0,7.0,11.0
193.0,7.0,12.0
193.0,7.0,13.0
193.0,7.0,14.0
193.0,7.0,15.0
193.0,7.0,16.0
193.0,7.0,17.0
193.0,7.0,18.0
193.0,7.0,19.0
193.0,7.0,20.0
193.0,7.0,21.0
193.0,7.0,22.0
193.0,7.0,23.0
193.0,7.0,24.0
193.0,7.0,25.0
193.0,7.0,26.0
193.0,7.0,27.0
193.0,7.0,28.0
193.0,7.0,29.0
193.0,7.0,30.0
193.0,7.0,31.0
193.0,7.0,32.0
193.0,7.0,33.0
193.0,7.0,34.0
193.0,7.0,35.0
193.0,7.0,36.0
193.0,7.0,37.0
193.0,7.0,38.0
193.0,7.0,39.0
193.0,7.0,40.0
193.0,7.0,41.0
193.0,7.0,42.0
193.0,7.0,43.0
193.0,7.0,44.0
193.0,7.0,45.0
193.0,7.0,46.0
193.0,7.0,47.0
193.0,7.0,48.0
193.0,7.0,49.0
193.0,7.0,50.0
193.0,7.0,51.0
193.0,7.0,52.0
193.0,7.0,53.0
193.0,7.0,54.0
193.0,7.0,55.0
193.0,7.0,56.0
193.0,7.0,57.0
193.0,7.0,58.0
193.0,7.0,59.0
193.0,7.0,60.0
193.0,7.0,61.0
193.0,7.0,62.0
193.0,7.0,63.0
193.0,7.0,64.0
193.0,7.0,65.0
193.0,7.0,66.0
193.0,7.0,67.0
193.0,7.0,68.0
193.0,7.0,69.0
193.0,7.0,70.0
193.0,7.0,71.0
193.0,7.0,72.0
193.0,7.0,73.0
193.0,7.0,74.0
193.0,7.0,75.0
193.0,7.0,76.0
193.0,7.0,77.0
193.0,7.0,78.0
193.0,7.0,79.0
193.0,7.0,80.0
193.0,7.0,81.0
193.0,7.0,82.0
193.0,7.0,83.0
193.0,7.0,84.0
193.0,7.0,85.0
193.0,7.0,86.0
193.0,7.0,87.0
193.0,7.0,88.0
193.0,7.0,89.0
193.0,7.0,90.0
193.0,7.0,91.0
193.0,7.0,92.0
193.0,7.0,93.0
193.0,7.0,94.0
193.0,7.0,95.0
193.0,7.0,96.0
193.0,7.0,97.0
193.0,7.0,98.0
193.0,7.0,99.0
193.0,7.0,100.0
193.0,7.0,101.0
193.0,7.0,102.0
193.0,7.0,103.0
193.0,7.0,104.0
193.0,7.0,105.0
193.0,7.0,106.0
193.0,7.0,107.0
193.0,7.0,108.0
193.0,7.0,109.0
193.0,7.0,110.0
193.0,7.0,111.0
193.0,7.0,112.0
193.0,7.0,113.0
193.0,7.0,114.0
193.0,7.0,115.0
193.0,7.0,116.0
193.0,7.0,117.0
193.0,7.0,118.0
193.0,7.0,119.0
193.0,7.0,120.0
193.0,7.0,121.0
193.0,7.0,122.0
193.0,7.0,123.0
193.0,7.0,124.0
193.0,7.0,125.0
193.0,7.0,126.0
193.0,7.0,127.0
193.0,7.0,128.0
193.0,7.0,129.0
193.0,7.0,130.0
193.0,7.0,131.0
193.0,7.0,132.0
193.0,7.0,133.0
193.0,7.0,134.0
193.0,7.0,135.0
193.0,7.0,136.0
193.0,7.0,137.0
193.0,7.0,138.0
193.0,7.0,139.0
193.0,7.0,140.0
193.0,7.0,141.0
193.0,7.0,142.0
193.0,7.0,143.0
193.0,7.0,144.0
193.0,7.0,145.0
193.0,7.0,146.0
193.0,7.0,147.0
193.0,7.0,148.0
193.0,7.0,149.0
193.0,7.0,150.0
193.0,7.0,151.0
193.0,7.0,152.0
193.0,7.0,153.0
193.0,7.0,154.0
193.0,7.0,155.0
193.0,7.0,156.0
193.0,7.0,157.0
193.0,7.0,158.0
193.0,7.0,159.0
193.0,7.0,160.0
193.0,7.0,161.0
193.0,7.0,162.0
193.0,7.0,163.0
193.0,7.0,164.0
193.0,7.0,165.0
193.0,7.0,166.0
193.0,7.0,167.0
193.0,7.0,168.0
193.0,7.0,169.0
193.0,7.0,170.0
193.0,7.0,171.0
193.0,7.0,172.0
193.0,7.0,173.0
193.0,7.0,174.0
193.0,7.0,175.0
193.0,7.0,176.0
192.0,8.0,177.0
191.0,9.0,178.0
191.0,9.0,179.0
191.0,9.0,180.0
191.0,9.0,181.0
191.0,9.0,182.0
191.0,9.0,183.0
191.0,9.0,184.0
191.0,9.0,185.0
191.0,9.0,186.0
191.0,9.0,187.0
191.0,9.0,188.0
191.0,9.0,189.0
190.0,10.0,190.0
190.0,10.0,191.0
190.0,10.0,192.0
190.0,10.0,193.0
190.0,10.0,194.0
190.0,10.0,195.0
190.0,10.0,196.0
190.0,10.0,197.0
190.0,10.0,198.0
190.0,10.0,199.0
190.0,10.0,200.0
190.0,10.0,201.0
190.0,10.0,202.0
190.0,10.0,203.0
189.0,11.0,204.0
189.0,11.0,205.0
189.0,11.0,206.0
188.0,12.0,207.0
188.0,12.0,208.0
188.0,12.0,209.0
188.0,12.0,210.0
188.0,12.0,211.0
187.0,13.0,212.0
187.0,13.0,213.0
187.0,13.0,214.0
187.0,13.0,215.0
187.0,13.0,216.0
187.0,13.0,217.0
187.0,13.0,218.0
187.0,13.0,219.0
187.0,13.0,220.0
187.0,13.0,221.0
187.0,13.0,222.0
187.0,13.0,223.0
187.0,13.0,224.0
186.0,14.0,225.0
186.0,14.0,226.0
186.0,14.0,227.0
186.0,14.0,228.0
186.0,14.0,229.0
186.0,14.0,230.0
186.0,14.0,231.0
186.0,14.0,232.0
186.0,14.0,233.0
186.0,14.0,234.0
185.0,15.0,235.0
185.0,15.0,236.0
185.0,15.0,237.0
185.0,15.0,238.0
185.0,15.0,239.0
185.0,15.0,240.0
185.0,15.0,241.0
185.0,15.0,242.0
185.0,15.0,243.0
185.0,15.0,244.0
185.0,15.0,245.0
185.0,15.0,246.0
185.0,15.0,247.0
185.0,15.0,248.0
185.0,15.0,249.0
185.0,15.0,250.0
185.0,15.0,251.0
185.0,15.0,252.0
185.0,15.0,253.0
184.0,16.0,254.0
184.0,16.0,255.0
184.0,16.0,256.0
184.0,16.0,257.0
184.0,16.0,258.0
184.0,16.0,259.0
184.0,16.0,260.0
179.0,21.0,261.0
179.0,21.0,262.0
179.0,21.0,263.0
179.0,21.0,264.0
179.0,21.0,265.0
179.0,21.0,266.0
179.0,21.0,267.0
179.0,21.0,268.0
178.0,22.0,269.0
178.0,22.0,270.0
178.0,22.0,271.0
178.0,22.0,272.0
178.0,22.0,273.0
178.0,22.0,274.0
178.0,22.0,275.0
178.0,22.0,276.0
178.0,22.0,277.0
178.0,22.0,278.0
178.0,22.0,279.0
178.0,22.0,280.0
178.0,22.0,281.0
177.0,23.0,282.0
177.0,23.0,283.0
177.0,23.0,284.0
177.0,23.0,285.0
177.0,23.0,286.0
177.0,23.0,287.0
177.0,23.0,288.0
177.0,23.0,289.0
177.0,23.0,290.0
177.0,23.0,291.0
177.0,23.0,292.0
177.0,23.0,293.0
177.0,23.0,294.0
177.0,23.0,295.0
177.0,23.0,296.0
177.0,23.0,297.0
177.0,23.0,298.0
177.0,23.0,299.0
177.0,23.0,300.0
177.0,23.0,301.0
176.0,24.0,302.0
176.0,24.0,303.0
175.0,25.0,304.0
175.0,25.0,305.0
175.0,25.0,306.0
175.0,25.0,307.0
174.0,26.0,308.0
174.0,26.0,309.0
174.0,26.0,310.0
174.0,26.0,311.0
174.0,26.0,312.0
171.0,29.0,313.0
171.0,29.0,314.0
171.0,29.0,315.0
171.0,29.0,316.0
171.0,29.0,317.0
171.0,29.0,318.0
171.0,29.0,319.0
170.0,30.0,320.0
169.0,31.0,321.0
169.0,31.0,322.0
169.0,31.0,323.0
169.0,31.0,324.0
169.0,31.0,325.0
169.0,31.0,326.0
168.0,32.0,327.0
168.0,32.0,328.0
168.0,32.0,329.0
168.0,32.0,330.0
168.0,32.0,331.0
168.0,32.0,332.0
168.0,32.0,333.0
167.0,33.0,334.0
167.0,33.0,335.0
166.0,34.0,336.0
166.0,34.0,337.0
166.0,34.0,338.0
166.0,34.0,339.0
166.0,34.0,340.0
165.0,35.0,341.0
165.0,35.0,342.0
165.0,35.0,343.0
165.0,35.0,344.0
165.0,35.0,345.0
164.0,36.0,346.0
164.0,36.0,347.0
164.0,36.0,348.0
164.0,36.0,349.0
164.0,36.0,350.0
164.0,36.0,351.0
164.0,36.0,352.0
164.0,36.0,353.0
164.0,36.0,354.0
164.0,36.0,355.0
164.0,36.0,356.0
164.0,36.0,357.0
164.0,36.0,358.0
164.0,36.0,359.0
163.0,37.0,360.0
163.0,37.0,361.0
163.0,37.0,362.0
163.0,37.0,363.0
163.0,37.0,364.0
162.0,38.0,365.0
162.0,38.0,366.0
162.0,38.0,367.0
162.0,38.0,368.0
162.0,38.0,369.0
162.0,38.0,370.0
162.0,38.0,371.0
162.0,38.0,372.0
162.0,38.0,373.0
162.0,38.0,374.0
162.0,38.0,375.0
161.0,39.0,376.0
161.0,39.0,377.0
161.0,39.0,378.0
161.0,39.0,379.0
161.0,39.0,380.0
160.0,40.0,381.0
160.0,40.0,382.0
160.0,40.0,383.0
160.0,40.0,384.0
160.0,40.0,385.0
160.0,40.0,386.0
160.0,40.0,387.0
160.0,40.0,388.0
160.0,40.0,389.0
160.0,40.0,390.0
160.0,40.0,391.0
160.0,40.0,392.0
160.0,40.0,393.0
160.0,40.0,394.0
159.0,41.0,395.0
158.0,42.0,396.0
158.0,42.0,397.0
158.0,42.0,398.0
158.0,42.0,399.0
158.0,42.0,400.0
158.0,42.0,401.0
158.0,42.0,402.0
158.0,42.0,403.0
158.0,42.0,404.0
157.0,43.0,405.0
157.0,43.0,406.0
156.0,44.0,407.0
156.0,44.0,408.0
156.0,44.0,409.0
156.0,44.0,410.0
156.0,44.0,411.0
156.0,44.0,412.0
156.0,44.0,413.0
156.0,44.0,414.0
156.0,44.0,415.0
156.0,44.0,416.0
155.0,45.0,417.0
154.0,46.0,418.0
154.0,46.0,419.0
154.0,46.0,420.0
153.0,47.0,421.0
153.0,47.0,422.0
153.0,47.0,423.0
153.0,47.0,424.0
153.0,47.0,425.0
153.0,47.0,426.0
152.0,48.0,427.0
152.0,48.0,428.0
152.0,48.0,429.0
152.0,48.0,430.0
151.0,49.0,431.0
151.0,49.0,432.0
151.0,49.0,433.0
151.0,49.0,434.0
151.0,49.0,435.0
150.0,50.0,436.0
150.0,50.0,437.0
150.0,50.0,438.0
150.0,50.0,439.0
150.0,50.0,440.0
150.0,50.0,441.0
150.0,50.0,442.0
150.0,50.0,443.0
150.0,50.0,444.0
150.0,50.0,445.0
150.0,50.0,446.0
150.0,50.0,447.0
150.0,50.0,448.0
150.0,50.0,449.0
150.0,50.0,450.0
150.0,50.0,451.0
150.0,50.0,452.0
150.0,50.0,453.0
150.0,50.0,454.0
150.0,50.0,455.0
150.0,50.0,456.0
150.0,50.0,457.0
150.0,50.0,458.0
149.0,51.0,459.0
149.0,51.0,460.0
148.0,52.0,461.0
148.0,52.0,462.0
148.0,52.0,463.0
148.0,52.0,464.0
148.0,52.0,465.0
148.0,52.0,466.0
148.0,52.0,467.0
148.0,52.0,468.0
146.0,54.0,469.0
146.0,54.0,470.0
146.0,54.0,471.0
146.0,54.0,472.0
146.0,54.0,473.0
146.0,54.0,474.0
145.0,55.0,475.0
145.0,55.0,476.0
145.0,55.0,477.0
145.0,55.0,478.0
145.0,55.0,479.0
145.0,55.0,480.0
145.0,55.0,481.0
145.0,55.0,482.0
145.0,55.0,483.0
145.0,55.0,484.0
145.0,55.0,485.0
145.0,55.0,486.0
145.0,55.0,487.0
145.0,55.0,488.0
145.0,55.0,489.0
145.0,55.0,490.0
145.0,55.0,491.0
144.0,56.0,492.0
144.0,56.0,493.0
144.0,56.0,494.0
144.0,56.0,495.0
144.0,56.0,496.0
144.0,56.0,497.0
144.0,56.0,498.0
144.0,56.0,499.0
144.0,56.0,500.0
144.0,56.0,501.0
144.0,56.0,502.0
143.0,57.0,503.0
143.0,57.0,504.0
143.0,57.0,505.0
143.0,57.0,506.0
143.0,57.0,507.0
143.0,57.0,508.0
143.0,57.0,509.0
143.0,57.0,510.0
143.0,57.0,511.0
143.0,57.0,512.0
143.0,57.0,513.0
143.0,57.0,514.0
143.0,57.0,515.0
143.0,57.0,516.0
143.0,57.0,517.0
143.0,57.0,518.0
143.0,57.0,519.0
143.0,57.0,520.0
141.0,59.0,521.0
141.0,59.0,522.0
141.0,59.0,523.0
141.0,59.0,524.0
141.0,59.0,525.0
141.0,59.0,526.0
140.0,60.0,527.0
140.0,60.0,528.0
140.0,60.0,529.0
140.0,60.0,530.0
140.0,60.0,531.0
140.0,60.0,532.0
140.0,60.0,533.0
140.0,60.0,534.0
140.0,60.0,535.0
139.0,61.0,536.0
139.0,61.0,537.0
139.0,61.0,538.0
139.0,61.0,539.0
139.0,61.0,540.0
139.0,61.0,541.0
139.0,61.0,542.0
139.0,61.0,543.0
139.0,61.0,544.0
139.0,61.0,545.0
139.0,61.0,546.0
139.0,61.0,547.0
139.0,61.0,548.0
138.0,62.0,549.0
138.0,62.0,550.0
138.0,62.0,551.0
138.0,62.0,552.0
138.0,62.0,553.0
138.0,62.0,554.0
138.0,62.0,555.0
138.0,62.0,556.0
138.0,62.0,557.0
138.0,62.0,558.0
138.0,62.0,559.0
138.0,62.0,560.0
138.0,62.0,561.0
138.0,62.0,562.0
138.0,62.0,563.0
138.0,62.0,564.0
138.0,62.0,565.0
137.0,63.0,566.0
137.0,63.0,567.0
137.0,63.0,568.0
137.0,63.0,569.0
137.0,63.0,570.0
137.0,63.0,571.0
137.0,63.0,572.0
136.0,64.0,573.0
136.0,64.0,574.0
136.0,64.0,575.0
135.0,65.0,576.0
135.0,65.0,577.0
135.0,65.0,578.0
135.0,65.0,579.0
135.0,65.0,580.0
135.0,65.0,581.0
134.0,66.0,582.0
133.0,67.0,583.0
133.0,67.0,584.0
133.0,67.0,585.0
133.0,67.0,586.0
133.0,67.0,587.0
133.0,67.0,588.0
133.0,67.0,589.0
133.0,67.0,590.0
132.0,68.0,591.0
132.0,68.0,592.0
132.0,68.0,593.0
132.0,68.0,594.0
131.0,69.0,595.0
131.0,69.0,596.0
131.0,69.0,597.0
131.0,69.0,598.0
131.0,69.0,599.0
131.0,69.0,600.0
131.0,69.0,601.0
131.0,69.0,602.0
131.0,69.0,603.0
131.0,69.0,604.0
131.0,69.0,605.0
131.0,69.0,606.0
131.0,69.0,607.0
131.0,69.0,608.0
131.0,69.0,609.0
131.0,69.0,610.0
131.0,69.0,611.0
131.0,69.0,612.0
131.0,69.0,613.0
131.0,69.0,614.0
131.0,69.0,615.0
131.0,69.0,616.0
131.0,69.0,617.0
131.0,69.0,618.0
130.0,70.0,619.0
128.0,72.0,620.0
128.0,72.0,621.0
128.0,72.0,622.0
128.0,72.0,623.0
128.0,72.0,624.0
128.0,72.0,625.0
128.0,72.0,626.0
128.0,72.0,627.0
128.0,72.0,628.0
128.0,72.0,629.0
127.0,73.0,630.0
127.0,73.0,631.0
127.0,73.0,632.0
125.0,75.0,633.0
125.0,75.0,634.0
125.0,75.0,635.0
125.0,75.0,636.0
125.0,75.0,637.0
125.0,75.0,638.0
125.0,75.0,639.0
124.0,76.0,640.0
124.0,76.0,641.0
124.0,76.0,642.0
124.0,76.0,643.0
123.0,77.0,644.0
123.0,77.0,645.0
122.0,78.0,646.0
121.0,79.0,647.0
121.0,79.0,648.0
121.0,79.0,649.0
121.0,79.0,650.0
121.0,79.0,651.0
121.0,79.0,652.0
121.0,79.0,653.0
121.0,79.0,654.0
121.0,79.0,655.0
121.0,79.0,656.0
121.0,79.0,657.0
121.0,79.0,658.0
120.0,80.0,659.0
120.0,80.0,660.0
120.0,80.0,661.0
119.0,81.0,662.0
119.0,81.0,663.0
119.0,81.0,664.0
119.0,81.0,665.0
119.0,81.0,666.0
118.0,82.0,667.0
118.0,82.0,668.0
118.0,82.0,669.0
118.0,82.0,670.0
118.0,82.0,671.0
118.0,82.0,672.0
118.0,82.0,673.0
118.0,82.0,674.0
118.0,82.0,675.0
118.0,82.0,676.0
117.0,83.0,677.0
117.0,83.0,678.0
117.0,83.0,679.0
117.0,83.0,680.0
117.0,83.0,681.0
117.0,83.0,682.0
117.0,83.0,683.0
117.0,83.0,684.0
117.0,83.0,685.0
117.0,83.0,686.0
117.0,83.0,687.0
117.0,83.0,688.0
117.0,83.0,689.0
117.0,83.0,690.0
116.0,84.0,691.0
115.0,85.0,692.0
115.0,85.0,693.0
115.0,85.0,694.0
115.0,85.0,695.0
115.0,85.0,696.0
113.0,87.0,697.0
113.0,87.0,698.0
113.0,87.0,699.0
113.0,87.0,700.0
113.0,87.0,701.0
113.0,87.0,702.0
111.0,89.0,703.0
111.0,89.0,704.0
111.0,89.0,705.0
111.0,89.0,706.0
111.0,89.0,707.0
111.0,89.0,708.0
111.0,89.0,709.0
111.0,89.0,710.0
111.0,89.0,711.0
111.0,89.0,712.0
111.0,89.0,713.0
111.0,89.0,714.0
111.0,89.0,715.0
111.0,89.0,716.0
111.0,89.0,717.0
111.0,89.0,718.0
111.0,89.0,719.0
110.0,90.0,720.0
110.0,90.0,721.0
110.0,90.0,722.0
110.0,90.0,723.0
110.0,90.0,724.0
110.0,90.0,725.0
110.0,90.0,726.0
109.0,91.0,727.0
109.0,91.0,728.0
109.0,91.0,729.0
109.0,91.0,730.0
109.0,91.0,731.0
109.0,91.0,732.0
109.0,91.0,733.0
109.0,91.0,734.0
109.0,91.0,735.0
108.0,92.0,736.0
108.0,92.0,737.0
108.0,92.0,738.0
108.0,92.0,739.0
108.0,92.0,740.0
108.0,92.0,741.0
108.0,92.0,742.0
108.0,92.0,743.0
108.0,92.0,744.0
108.0,92.0,745.0
108.0,92.0,746.0
108.0,92.0,747.0
108.0,92.0,748.0
108.0,92.0,749.0
107.0,93.0,750.0
107.0,93.0,751.0
106.0,94.0,752.0
106.0,94.0,753.0
106.0,94.0,754.0
106.0,94.0,755.0
106.0,94.0,756.0
106.0,94.0,757.0
106.0,94.0,758.0
106.0,94.0,759.0
106.0,94.0,760.0
106.0,94.0,761.0
106.0,94.0,762.0
106.0,94.0,763.0
106.0,94.0,764.0
106.0,94.0,765.0
105.0,95.0,766.0
105.0,95.0,767.0
105.0,95.0,768.0
105.0,95.0,769.0
105.0,95.0,770.0
105.0,95.0,771.0
105.0,95.0,772.0
105.0,95.0,773.0
105.0,95.0,774.0
105.0,95.0,775.0
105.0,95.0,776.0
105.0,95.0,777.0
103.0,97.0,778.0
103.0,97.0,779.0
103.0,97.0,780.0
103.0,97.0,781.0
103.0,97.0,782.0
103.0,97.0,783.0
103.0,97.0,784.0
103.0,97.0,785.0
103.0,97.0,786.0
103.0,97.0,787.0
103.0,97.0,788.0
103.0,97.0,789.0
103.0,97.0,790.0
103.0,97.0,791.0
103.0,97.0,792.0
103.0,97.0,793.0
103.0,97.0,794.0
103.0,97.0,795.0
103.0,97.0,796.0
103.0,97.0,797.0
103.0,97.0,798.0
103.0,97.0,799.0
103.0,97.0,800.0
103.0,97.0,801.0
103.0,97.0,802.0
102.0,98.0,803.0
102.0,98.0,804.0
102.0,98.0,805.0
102.0,98.0,806.0
102.0,98.0,807.0
102.0,98.0,808.0
102.0,98.0,809.0
102.0,98.0,810.0
102.0,98.0,811.0
102.0,98.0,812.0
102.0,98.0,813.0
101.0,99.0,814.0
101.0,99.0,815.0
101.0,99.0,816.0
101.0,99.0,817.0
101.0,99.0,818.0
101.0,99.0,819.0
100.0,100.0,820.0
100.0,100.0,821.0
100.0,100.0,822.0
100.0,100.0,823.0
100.0,100.0,824.0
100.0,100.0,825.0
100.0,100.0,826.0
100.0,100.0,827.0
100.0,100.0,828.0
100.0,100.0,829.0
100.0,100.0,830.0
100.0,100.0,831.0
100.0,100.0,832.0
100.0,100.0,833.0
100.0,100.0,834.0
100.0,100.0,835.0
100.0,100.0,836.0
100.0,100.0,837.0
100.0,100.0,838.0
100.0,100.0,839.0
100.0,100.0,840.0
100.0,100.0,841.0
99.0,101.0,842.0
99.0,101.0,843.0
99.0,101.0,844.0
99.0,101.0,845.0
99.0,101.0,846.0
99.0,101.0,847.0
99.0,101.0,848.0
99.0,101.0,849.0
99.0,101.0,850.0
99.0,101.0,851.0
99.0,101.0,852.0
99.0,101.0,853.0
99.0,101.0,854.0
99.0,101.0,855.0
98.0,102.0,856.0
98.0,102.0,857.0
98.0,102.0,858.0
98.0,102.0,859.0
98.0,102.0,860.0
98.0,102.0,861.0
98.0,102.0,862.0
98.0,102.0,863.0
98.0,102.0,864.0
98.0,102.0,865.0
97.0,103.0,866.0
97.0,103.0,867.0
97.0,103.0,868.0
97.0,103.0,869.0
97.0,103.0,870.0
97.0,103.0,871.0
97.0,103.0,872.0
97.0,103.0,873.0
97.0,103.0,874.0
96.0,104.0,875.0
96.0,104.0,876.0
96.0,104.0,877.0
96.0,104.0,878.0
95.0,105.0,879.0
95.0,105.0,880.0
94.0,106.0,881.0
94.0,106.0,882.0
93.0,107.0,883.0
93.0,107.0,884.0
91.0,109.0,885.0
91.0,109.0,886.0
91.0,109.0,887.0
91.0,109.0,888.0
91.0,109.0,889.0
91.0,109.0,890.0
91.0,109.0,891.0
91.0,109.0,892.0
91.0,109.0,893.0
91.0,109.0,894.0
91.0,109.0,895.0
91.0,109.0,896.0
91.0,109.0,897.0
90.0,110.0,898.0
89.0,111.0,899.0
89.0,111.0,900.0
88.0,112.0,901.0
88.0,112.0,902.0
87.0,113.0,903.0
87.0,113.0,904.0
87.0,113.0,905.0
87.0,113.0,906.0
87.0,113.0,907.0
87.0,113.0,908.0
87.0,113.0,909.0
87.0,113.0,910.0
87.0,113.0,911.0
87.0,113.0,912.0
87.0,113.0,913.0
87.0,113.0,914.0
87.0,113.0,915.0
87.0,113.0,916.0
87.0,113.0,917.0
87.0,113.0,918.0
87.0,113.0,919.0
87.0,113.0,920.0
87.0,113.0,921.0
87.0,113.0,922.0
87.0,113.0,923.0
87.0,113.0,924.0
87.0,113.0,925.0
86.0,114.0,926.0
86.0,114.0,927.0
86.0,114.0,928.0
86.0,114.0,929.0
86.0,114.0,930.0
86.0,114.0,931.0
86.0,114.0,932.0
86.0,114.0,933.0
86.0,114.0,934.0
86.0,114.0,935.0
85.0,115.0,936.0
85.0,115.0,937.0
85.0,115.0,938.0
85.0,115.0,939.0
85.0,115.0,940.0
85.0,115.0,941.0
85.0,115.0,942.0
85.0,115.0,943.0
85.0,115.0,944.0
85.0,115.0,945.0
84.0,116.0,946.0
84.0,116.0,947.0
84.0,116.0,948.0
84.0,116.0,949.0
84.0,116.0,950.0
84.0,116.0,951.0
84.0,116.0,952.0
84.0,116.0,953.0
84.0,116.0,954.0
84.0,116.0,955.0
84.0,116.0,956.0
84.0,116.0,957.0
84.0,116.0,958.0
84.0,116.0,959.0
84.0,116.0,960.0
84.0,116.0,961.0
84.0,116.0,962.0
84.0,116.0,963.0
84.0,116.0,964.0
84.0,116.0,965.0
84.0,116.0,966.0
84.0,116.0,967.0
84.0,116.0,968.0
84.0,116.0,969.0
84.0,116.0,970.0
84.0,116.0,971.0
83.0,117.0,972.0
83.0,117.0,973.0
83.0,117.0,974.0
83.0,117.0,975.0
83.0,117.0,976.0
83.0,117.0,977.0
83.0,117.0,978.0
83.0,117.0,979.0
83.0,117.0,980.0
83.0,117.0,981.0
83.0,117.0,982.0
83.0,117.0,983.0
83.0,117.0,984.0
83.0,117.0,985.0
83.0,117.0,986.0
83.0,117.0,987.0
82.0,118.0,988.0
82.0,118.0,989.0
82.0,118.0,990.0
81.0,119.0,991.0
80.0,120.0,992.0
80.0,120.0,993.0
80.0,120.0,994.0
80.0,120.0,995.0
80.0,120.0,996.0
80.0,120.0,997.0
80.0,120.0,998.0
80.0,120.0,999.0
80.0,120.0,1000.0
80.0,120.0,1001.0
80.0,120.0,1002.0
80.0,120.0,1003.0
80.0,120.0,1004.0
80.0,120.0,1005.0
80.0,120.0,1006.0
80.0,120.0,1007.0
80.0,120.0,1008.0
80.0,120.0,1009.0
80.0,120.0,1010.0
80.0,120.0,1011.0
80.0,120.0,1012.0
80.0,120.0,1013.0
80.0,120.0,1014.0
80.0,120.0,1015.0
80.0,120.0,1016.0
80.0,120.0,1017.0
80.0,120.0,1018.0
80.0,120.0,1019.0
80.0,120.0,1020.0
80.0,120.0,1021.0
80.0,120.0,1022.0
80.0,120.0,1023.0
80.0,120.0,1024.0
80.0,120.0,1025.0
80.0,120.0,1026.0
80.0,120.0,1027.0
80.0,120.0,1028.0
80.0,120.0,1029.0
80.0,120.0,1030.0
80.0,120.0,1031.0
80.0,120.0,1032.0
80.0,120.0,1033.0
80.0,120.0,1034.0
80.0,120.0,1035.0
80.0,120.0,1036.0
80.0,120.0,1037.0
80.0,120.0,1038.0
80.0,120.0,1039.0
80.0,120.0,1040.0
80.0,120.0,1041.0
80.0,120.0,1042.0
80.0,120.0,1043.0
80.0,120.0,1044.0
80.0,120.0,1045.0
80.0,120.0,1046.0
80.0,120.0,1047.0
80.0,120.0,1048.0
80.0,120.0,1049.0
80.0,120.0,1050.0
80.0,120.0,1051.0
80.0,120.0,1052.0
80.0,120.0,1053.0
80.0,120.0,1054.0
80.0,120.0,1055.0
80.0,120.0,1056.0
80.0,120.0,1057.0
80.0,120.0,1058.0
80.0,120.0,1059.0
80.0,120.0,1060.0
80.0,120.0,1061.0
80.0,120.0,1062.0
80.0,120.0,1063.0
80.0,120.0,1064.0
80.0,120.0,1065.0
80.0,120.0,1066.0
80.0,120.0,1067.0
80.0,120.0,1068.0
80.0,120.0,1069.0
80.0,120.0,1070.0
80.0,120.0,1071.0
80.0,120.0,1072.0
80.0,120.0,1073.0
80.0,120.0,1074.0
80.0,120.0,1075.0
80.0,120.0,1076.0
80.0,120.0,1077.0
80.0,120.0,1078.0
80.0,120.0,1079.0
80.0,120.0,1080.0
80.0,120.0,1081.0
80.0,120.0,1082.0
80.0,120.0,1083.0
80.0,120.0,1084.0
80.0,120.0,1085.0
80.0,120.0,1086.0
80.0,120.0,1087.0
80.0,120.0,1088.0
80.0,120.0,1089.0
80.0,120.0,1090.0
80.0,120.0,1091.0
80.0,120.0,1092.0
