"tick","Agents","Occasion","Private new","Lease"
1.0,9.700000000000006,10.57142857142857,5.666666666666666,3.4999999999999996
2.0,9.700000000000006,10.57142857142857,5.666666666666666,3.4999999999999996
3.0,9.700000000000006,10.57142857142857,5.666666666666666,3.4999999999999996
4.0,9.700000000000006,10.57142857142857,5.666666666666666,3.4999999999999996
5.0,9.700000000000006,10.57142857142857,5.666666666666666,3.4999999999999996
6.0,9.700000000000006,10.57142857142857,5.666666666666666,3.4999999999999996
7.0,9.700000000000006,10.57142857142857,5.666666666666666,3.4999999999999996
8.0,9.700000000000006,10.57142857142857,5.666666666666666,3.4999999999999996
9.0,9.700000000000006,10.57142857142857,5.666666666666666,3.4999999999999996
10.0,9.700000000000006,10.57142857142857,5.666666666666666,3.4999999999999996
11.0,9.700000000000006,10.57142857142857,5.666666666666666,3.4999999999999996
12.0,9.700000000000006,10.57142857142857,5.666666666666666,3.4999999999999996
13.0,9.700000000000006,10.57142857142857,5.666666666666666,3.4999999999999996
14.0,9.700000000000006,10.57142857142857,5.666666666666666,3.4999999999999996
15.0,9.700000000000006,10.57142857142857,5.666666666666666,3.4999999999999996
16.0,9.700000000000006,10.57142857142857,5.666666666666666,3.4999999999999996
17.0,9.700000000000006,10.57142857142857,5.666666666666666,3.4999999999999996
18.0,9.700000000000006,10.57142857142857,5.666666666666666,3.4999999999999996
19.0,9.700000000000006,10.57142857142857,5.666666666666666,3.4999999999999996
20.0,9.700000000000006,10.57142857142857,5.666666666666666,3.4999999999999996
21.0,9.700000000000006,10.57142857142857,5.666666666666666,3.4999999999999996
22.0,9.700000000000006,10.57142857142857,5.666666666666666,3.4999999999999996
23.0,9.700000000000006,10.57142857142857,5.666666666666666,3.4999999999999996
24.0,9.700000000000006,10.57142857142857,5.666666666666666,3.4999999999999996
25.0,9.700000000000006,10.57142857142857,5.666666666666666,3.4999999999999996
26.0,9.700000000000006,10.57142857142857,5.666666666666666,3.4999999999999996
27.0,9.700000000000006,10.57142857142857,5.666666666666666,3.4999999999999996
28.0,9.700000000000006,10.57142857142857,5.666666666666666,3.4999999999999996
29.0,9.700000000000006,10.57142857142857,5.666666666666666,3.4999999999999996
30.0,9.700000000000006,10.57142857142857,5.666666666666666,3.4999999999999996
31.0,9.700000000000006,10.57142857142857,5.666666666666666,3.4999999999999996
32.0,9.700000000000006,10.57142857142857,5.666666666666666,3.4999999999999996
33.0,9.700000000000006,10.57142857142857,5.666666666666666,3.4999999999999996
34.0,9.700000000000006,10.57142857142857,5.666666666666666,3.4999999999999996
35.0,9.700000000000006,10.57142857142857,5.666666666666666,3.4999999999999996
36.0,9.700000000000006,10.57142857142857,5.666666666666666,3.4999999999999996
37.0,9.700000000000006,10.57142857142857,5.666666666666666,3.4999999999999996
38.0,9.700000000000006,10.57142857142857,5.666666666666666,3.4999999999999996
39.0,9.700000000000006,10.57142857142857,5.666666666666666,3.4999999999999996
40.0,9.700000000000006,10.57142857142857,5.666666666666666,3.4999999999999996
41.0,9.700000000000006,10.57142857142857,5.666666666666666,3.4999999999999996
42.0,9.700000000000006,10.57142857142857,5.666666666666666,3.4999999999999996
43.0,9.700000000000006,10.57142857142857,5.666666666666666,3.4999999999999996
44.0,9.700000000000006,10.57142857142857,5.666666666666666,3.4999999999999996
45.0,9.700000000000006,10.57142857142857,5.666666666666666,3.4999999999999996
46.0,9.700000000000006,10.57142857142857,5.666666666666666,3.4999999999999996
47.0,9.700000000000006,10.57142857142857,5.666666666666666,3.4999999999999996
48.0,9.700000000000006,10.57142857142857,5.666666666666666,3.4999999999999996
49.0,9.700000000000006,10.57142857142857,5.666666666666666,3.4999999999999996
50.0,9.700000000000006,10.57142857142857,5.666666666666666,3.4999999999999996
51.0,9.700000000000006,10.57142857142857,5.666666666666666,3.4999999999999996
52.0,9.700000000000006,10.57142857142857,5.666666666666666,3.4999999999999996
53.0,10.700000000000006,11.57142857142857,6.666666666666666,4.499999999999999
54.0,10.700000000000006,11.57142857142857,6.666666666666666,4.499999999999999
55.0,10.700000000000006,11.57142857142857,6.666666666666666,4.499999999999999
56.0,10.700000000000006,11.57142857142857,6.666666666666666,4.499999999999999
57.0,10.700000000000006,11.57142857142857,6.666666666666666,4.499999999999999
58.0,10.62,11.47619047619048,6.666666666666666,4.499999999999999
59.0,10.62,11.47619047619048,6.666666666666666,4.499999999999999
60.0,10.62,11.47619047619048,6.666666666666666,4.499999999999999
61.0,10.62,11.47619047619048,6.666666666666666,4.499999999999999
62.0,10.56,11.40476190476191,6.666666666666666,4.499999999999999
63.0,10.56,11.40476190476191,6.666666666666666,4.499999999999999
64.0,10.56,11.40476190476191,6.666666666666666,4.499999999999999
65.0,10.56,11.40476190476191,6.666666666666666,4.499999999999999
66.0,10.56,11.40476190476191,6.666666666666666,4.499999999999999
67.0,10.56,11.40476190476191,6.666666666666666,4.499999999999999
68.0,10.56,11.40476190476191,6.666666666666666,4.499999999999999
69.0,10.56,11.40476190476191,6.666666666666666,4.499999999999999
70.0,10.56,11.40476190476191,6.666666666666666,4.499999999999999
71.0,10.56,11.40476190476191,6.666666666666666,4.499999999999999
72.0,10.56,11.40476190476191,6.666666666666666,4.499999999999999
73.0,10.56,11.40476190476191,6.666666666666666,4.499999999999999
74.0,10.56,11.40476190476191,6.666666666666666,4.499999999999999
75.0,10.510000000000003,11.345238095238098,6.666666666666666,4.499999999999999
76.0,10.510000000000003,11.345238095238098,6.666666666666666,4.499999999999999
77.0,10.510000000000003,11.345238095238098,6.666666666666666,4.499999999999999
78.0,10.510000000000003,11.345238095238098,6.666666666666666,4.499999999999999
79.0,10.510000000000003,11.345238095238098,6.666666666666666,4.499999999999999
80.0,10.510000000000003,11.345238095238098,6.666666666666666,4.499999999999999
81.0,10.510000000000003,11.345238095238098,6.666666666666666,4.499999999999999
82.0,10.510000000000003,11.345238095238098,6.666666666666666,4.499999999999999
83.0,10.510000000000003,11.345238095238098,6.666666666666666,4.499999999999999
84.0,10.510000000000003,11.345238095238098,6.666666666666666,4.499999999999999
85.0,10.510000000000003,11.345238095238098,6.666666666666666,4.499999999999999
86.0,10.510000000000003,11.345238095238098,6.666666666666666,4.499999999999999
87.0,10.510000000000003,11.345238095238098,6.666666666666666,4.499999999999999
88.0,10.510000000000003,11.345238095238098,6.666666666666666,4.499999999999999
89.0,10.510000000000003,11.345238095238098,6.666666666666666,4.499999999999999
90.0,10.510000000000003,11.345238095238098,6.666666666666666,4.499999999999999
91.0,10.510000000000003,11.345238095238098,6.666666666666666,4.499999999999999
92.0,10.510000000000003,11.345238095238098,6.666666666666666,4.499999999999999
93.0,10.510000000000003,11.345238095238098,6.666666666666666,4.499999999999999
94.0,10.510000000000003,11.345238095238098,6.666666666666666,4.499999999999999
95.0,10.510000000000003,11.345238095238098,6.666666666666666,4.499999999999999
96.0,10.510000000000003,11.345238095238098,6.666666666666666,4.499999999999999
97.0,10.510000000000003,11.345238095238098,6.666666666666666,4.499999999999999
98.0,10.510000000000003,11.345238095238098,6.666666666666666,4.499999999999999
99.0,10.510000000000003,11.345238095238098,6.666666666666666,4.499999999999999
100.0,10.510000000000003,11.345238095238098,6.666666666666666,4.499999999999999
101.0,10.510000000000003,11.345238095238098,6.666666666666666,4.499999999999999
102.0,10.510000000000003,11.345238095238098,6.666666666666666,4.499999999999999
103.0,10.510000000000003,11.345238095238098,6.666666666666666,4.499999999999999
104.0,10.510000000000003,11.345238095238098,6.666666666666666,4.499999999999999
105.0,11.510000000000003,12.345238095238098,7.666666666666666,5.499999999999999
106.0,11.510000000000003,12.345238095238098,7.666666666666666,5.499999999999999
107.0,11.510000000000003,12.345238095238098,7.666666666666666,5.499999999999999
108.0,11.510000000000003,12.345238095238098,7.666666666666666,5.499999999999999
109.0,11.510000000000003,12.345238095238098,7.666666666666666,5.499999999999999
110.0,11.510000000000003,12.345238095238098,7.666666666666666,5.499999999999999
111.0,11.510000000000003,12.345238095238098,7.666666666666666,5.499999999999999
112.0,11.510000000000003,12.345238095238098,7.666666666666666,5.499999999999999
113.0,11.510000000000003,12.345238095238098,7.666666666666666,5.499999999999999
114.0,11.510000000000003,12.345238095238098,7.666666666666666,5.499999999999999
115.0,11.510000000000003,12.345238095238098,7.666666666666666,5.499999999999999
116.0,11.510000000000003,12.345238095238098,7.666666666666666,5.499999999999999
117.0,11.510000000000003,12.345238095238098,7.666666666666666,5.499999999999999
118.0,11.510000000000003,12.345238095238098,7.666666666666666,5.499999999999999
119.0,11.510000000000003,12.345238095238098,7.666666666666666,5.499999999999999
120.0,11.510000000000003,12.345238095238098,7.666666666666666,5.499999999999999
121.0,11.510000000000003,12.345238095238098,7.666666666666666,5.499999999999999
122.0,11.510000000000003,12.345238095238098,7.666666666666666,5.499999999999999
123.0,11.510000000000003,12.345238095238098,7.666666666666666,5.499999999999999
124.0,11.510000000000003,12.345238095238098,7.666666666666666,5.499999999999999
125.0,11.510000000000003,12.345238095238098,7.666666666666666,5.499999999999999
126.0,11.510000000000003,12.345238095238098,7.666666666666666,5.499999999999999
127.0,11.510000000000003,12.345238095238098,7.666666666666666,5.499999999999999
128.0,11.510000000000003,12.345238095238098,7.666666666666666,5.499999999999999
129.0,11.510000000000003,12.345238095238098,7.666666666666666,5.499999999999999
130.0,11.510000000000003,12.345238095238098,7.666666666666666,5.499999999999999
131.0,11.510000000000003,12.345238095238098,7.666666666666666,5.499999999999999
132.0,11.510000000000003,12.345238095238098,7.666666666666666,5.499999999999999
133.0,11.415000000000006,12.232142857142861,7.666666666666666,5.499999999999999
134.0,11.415000000000006,12.232142857142861,7.666666666666666,5.499999999999999
135.0,11.415000000000006,12.232142857142861,7.666666666666666,5.499999999999999
136.0,11.415000000000006,12.232142857142861,7.666666666666666,5.499999999999999
137.0,11.415000000000006,12.232142857142861,7.666666666666666,5.499999999999999
138.0,11.415000000000006,12.232142857142861,7.666666666666666,5.499999999999999
139.0,11.415000000000006,12.232142857142861,7.666666666666666,5.499999999999999
140.0,11.415000000000006,12.232142857142861,7.666666666666666,5.499999999999999
141.0,11.415000000000006,12.232142857142861,7.666666666666666,5.499999999999999
142.0,11.415000000000006,12.232142857142861,7.666666666666666,5.499999999999999
143.0,11.415000000000006,12.232142857142861,7.666666666666666,5.499999999999999
144.0,11.415000000000006,12.232142857142861,7.666666666666666,5.499999999999999
145.0,11.415000000000006,12.232142857142861,7.666666666666666,5.499999999999999
146.0,11.415000000000006,12.232142857142861,7.666666666666666,5.499999999999999
147.0,11.415000000000006,12.232142857142861,7.666666666666666,5.499999999999999
148.0,11.415000000000006,12.232142857142861,7.666666666666666,5.499999999999999
149.0,11.415000000000006,12.232142857142861,7.666666666666666,5.499999999999999
150.0,11.415000000000006,12.232142857142861,7.666666666666666,5.499999999999999
151.0,11.415000000000006,12.232142857142861,7.666666666666666,5.499999999999999
152.0,11.415000000000006,12.232142857142861,7.666666666666666,5.499999999999999
153.0,11.415000000000006,12.232142857142861,7.666666666666666,5.499999999999999
154.0,11.415000000000006,12.232142857142861,7.666666666666666,5.499999999999999
155.0,11.415000000000006,12.232142857142861,7.666666666666666,5.499999999999999
156.0,11.415000000000006,12.232142857142861,7.666666666666666,5.499999999999999
157.0,12.415000000000006,13.232142857142861,8.666666666666666,6.499999999999999
158.0,12.415000000000006,13.232142857142861,8.666666666666666,6.499999999999999
159.0,12.415000000000006,13.232142857142861,8.666666666666666,6.499999999999999
160.0,12.415000000000006,13.232142857142861,8.666666666666666,6.499999999999999
161.0,12.415000000000006,13.232142857142861,8.666666666666666,6.499999999999999
162.0,12.415000000000006,13.232142857142861,8.666666666666666,6.499999999999999
163.0,12.415000000000006,13.232142857142861,8.666666666666666,6.499999999999999
164.0,12.415000000000006,13.232142857142861,8.666666666666666,6.499999999999999
165.0,12.415000000000006,13.232142857142861,8.666666666666666,6.499999999999999
166.0,12.415000000000006,13.232142857142861,8.666666666666666,6.499999999999999
167.0,12.415000000000006,13.232142857142861,8.666666666666666,6.499999999999999
168.0,12.415000000000006,13.232142857142861,8.666666666666666,6.499999999999999
169.0,12.415000000000006,13.232142857142861,8.666666666666666,6.499999999999999
170.0,12.415000000000006,13.232142857142861,8.666666666666666,6.499999999999999
171.0,12.415000000000006,13.232142857142861,8.666666666666666,6.499999999999999
172.0,12.415000000000006,13.232142857142861,8.666666666666666,6.499999999999999
173.0,12.374999999999996,13.18452380952381,8.666666666666666,6.499999999999999
174.0,12.374999999999996,13.18452380952381,8.666666666666666,6.499999999999999
175.0,12.374999999999996,13.18452380952381,8.666666666666666,6.499999999999999
176.0,12.374999999999996,13.18452380952381,8.666666666666666,6.499999999999999
177.0,12.325000000000001,13.125000000000004,8.666666666666666,6.499999999999999
178.0,12.309999999999999,13.107142857142858,8.666666666666666,6.499999999999999
179.0,12.309999999999999,13.107142857142858,8.666666666666666,6.499999999999999
180.0,12.309999999999999,13.107142857142858,8.666666666666666,6.499999999999999
181.0,12.309999999999999,13.107142857142858,8.666666666666666,6.499999999999999
182.0,12.309999999999999,13.107142857142858,8.666666666666666,6.499999999999999
183.0,12.309999999999999,13.107142857142858,8.666666666666666,6.499999999999999
184.0,12.309999999999999,13.107142857142858,8.666666666666666,6.499999999999999
185.0,12.309999999999999,13.107142857142858,8.666666666666666,6.499999999999999
186.0,12.309999999999999,13.107142857142858,8.666666666666666,6.499999999999999
187.0,12.309999999999999,13.107142857142858,8.666666666666666,6.499999999999999
188.0,12.309999999999999,13.107142857142858,8.666666666666666,6.499999999999999
189.0,12.309999999999999,13.107142857142858,8.666666666666666,6.499999999999999
190.0,12.26,13.04761904761905,8.666666666666666,6.499999999999999
191.0,12.26,13.04761904761905,8.666666666666666,6.499999999999999
192.0,12.26,13.04761904761905,8.666666666666666,6.499999999999999
193.0,12.26,13.04761904761905,8.666666666666666,6.499999999999999
194.0,12.26,13.04761904761905,8.666666666666666,6.499999999999999
195.0,12.26,13.04761904761905,8.666666666666666,6.499999999999999
196.0,12.26,13.04761904761905,8.666666666666666,6.499999999999999
197.0,12.26,13.04761904761905,8.666666666666666,6.499999999999999
198.0,12.26,13.04761904761905,8.666666666666666,6.499999999999999
199.0,12.26,13.04761904761905,8.666666666666666,6.499999999999999
200.0,12.26,13.04761904761905,8.666666666666666,6.499999999999999
201.0,12.26,13.04761904761905,8.666666666666666,6.499999999999999
202.0,12.26,13.04761904761905,8.666666666666666,6.499999999999999
203.0,12.26,13.04761904761905,8.666666666666666,6.499999999999999
204.0,12.240000000000004,13.023809523809524,8.666666666666666,6.499999999999999
205.0,12.240000000000004,13.023809523809524,8.666666666666666,6.499999999999999
206.0,12.240000000000004,13.023809523809524,8.666666666666666,6.499999999999999
207.0,12.179999999999998,12.952380952380956,8.666666666666666,6.499999999999999
208.0,12.179999999999998,12.952380952380956,8.666666666666666,6.499999999999999
209.0,13.179999999999998,13.952380952380956,9.666666666666666,7.499999999999999
210.0,13.179999999999998,13.952380952380956,9.666666666666666,7.499999999999999
211.0,13.179999999999998,13.952380952380956,9.666666666666666,7.499999999999999
212.0,13.079999999999998,13.833333333333334,9.666666666666666,7.499999999999999
213.0,13.079999999999998,13.833333333333334,9.666666666666666,7.499999999999999
214.0,12.994999999999997,13.732142857142861,9.666666666666666,7.499999999999999
215.0,12.994999999999997,13.732142857142861,9.666666666666666,7.499999999999999
216.0,12.994999999999997,13.732142857142861,9.666666666666666,7.499999999999999
217.0,12.994999999999997,13.732142857142861,9.666666666666666,7.499999999999999
218.0,12.994999999999997,13.732142857142861,9.666666666666666,7.499999999999999
219.0,12.994999999999997,13.732142857142861,9.666666666666666,7.499999999999999
220.0,12.994999999999997,13.732142857142861,9.666666666666666,7.499999999999999
221.0,12.994999999999997,13.732142857142861,9.666666666666666,7.499999999999999
222.0,12.91,13.732142857142861,9.347826086956522,6.666666666666666
223.0,12.91,13.732142857142861,9.347826086956522,6.666666666666666
224.0,12.91,13.732142857142861,9.347826086956522,6.666666666666666
225.0,12.9,13.720238095238084,9.347826086956522,6.666666666666666
226.0,12.9,13.720238095238084,9.347826086956522,6.666666666666666
227.0,12.9,13.720238095238084,9.347826086956522,6.666666666666666
228.0,12.9,13.720238095238084,9.347826086956522,6.666666666666666
229.0,12.9,13.720238095238084,9.347826086956522,6.666666666666666
230.0,12.9,13.720238095238084,9.347826086956522,6.666666666666666
231.0,12.9,13.720238095238084,9.347826086956522,6.666666666666666
232.0,12.9,13.720238095238084,9.347826086956522,6.666666666666666
233.0,12.9,13.720238095238084,9.347826086956522,6.666666666666666
234.0,12.9,13.720238095238084,9.347826086956522,6.666666666666666
235.0,12.854999999999999,13.666666666666664,9.347826086956522,6.666666666666666
236.0,12.854999999999999,13.666666666666664,9.347826086956522,6.666666666666666
237.0,12.854999999999999,13.666666666666664,9.347826086956522,6.666666666666666
238.0,12.854999999999999,13.666666666666664,9.347826086956522,6.666666666666666
239.0,12.854999999999999,13.666666666666664,9.347826086956522,6.666666666666666
240.0,12.854999999999999,13.666666666666664,9.347826086956522,6.666666666666666
241.0,12.854999999999999,13.666666666666664,9.347826086956522,6.666666666666666
242.0,12.854999999999999,13.666666666666664,9.347826086956522,6.666666666666666
243.0,12.78,13.57738095238095,9.347826086956522,6.666666666666666
244.0,12.78,13.57738095238095,9.347826086956522,6.666666666666666
245.0,12.78,13.57738095238095,9.347826086956522,6.666666666666666
246.0,12.78,13.57738095238095,9.347826086956522,6.666666666666666
247.0,12.735000000000008,13.523809523809522,9.347826086956522,6.666666666666666
248.0,12.735000000000008,13.523809523809522,9.347826086956522,6.666666666666666
249.0,12.735000000000008,13.523809523809522,9.347826086956522,6.666666666666666
250.0,12.735000000000008,13.523809523809522,9.347826086956522,6.666666666666666
251.0,12.735000000000008,13.523809523809522,9.347826086956522,6.666666666666666
252.0,12.735000000000008,13.523809523809522,9.347826086956522,6.666666666666666
253.0,12.735000000000008,13.523809523809522,9.347826086956522,6.666666666666666
254.0,12.66,13.434523809523805,9.347826086956522,6.666666666666666
255.0,12.66,13.434523809523805,9.347826086956522,6.666666666666666
256.0,12.66,13.434523809523805,9.347826086956522,6.666666666666666
257.0,12.66,13.434523809523805,9.347826086956522,6.666666666666666
258.0,12.66,13.434523809523805,9.347826086956522,6.666666666666666
259.0,12.66,13.434523809523805,9.347826086956522,6.666666666666666
260.0,12.66,13.434523809523805,9.347826086956522,6.666666666666666
261.0,13.47,14.208333333333336,10.347826086956522,7.666666666666667
262.0,13.47,14.208333333333336,10.347826086956522,7.666666666666667
263.0,13.47,14.208333333333336,10.347826086956522,7.666666666666667
264.0,13.47,14.208333333333336,10.347826086956522,7.666666666666667
265.0,13.47,14.208333333333336,10.347826086956522,7.666666666666667
266.0,13.47,14.208333333333336,10.347826086956522,7.666666666666667
267.0,13.445000000000002,14.178571428571425,10.347826086956522,7.666666666666667
268.0,13.445000000000002,14.178571428571425,10.347826086956522,7.666666666666667
269.0,13.339999999999993,14.053571428571434,10.347826086956522,7.666666666666667
270.0,13.339999999999993,14.053571428571434,10.347826086956522,7.666666666666667
271.0,13.339999999999993,14.053571428571434,10.347826086956522,7.666666666666667
272.0,13.339999999999993,14.053571428571434,10.347826086956522,7.666666666666667
273.0,13.304999999999994,14.011904761904761,10.347826086956522,7.666666666666667
274.0,13.304999999999994,14.011904761904761,10.347826086956522,7.666666666666667
275.0,13.304999999999994,14.011904761904761,10.347826086956522,7.666666666666667
276.0,13.304999999999994,14.011904761904761,10.347826086956522,7.666666666666667
277.0,13.304999999999994,14.011904761904761,10.347826086956522,7.666666666666667
278.0,13.235000000000001,13.92857142857143,10.347826086956522,7.666666666666667
279.0,13.235000000000001,13.92857142857143,10.347826086956522,7.666666666666667
280.0,13.235000000000001,13.92857142857143,10.347826086956522,7.666666666666667
281.0,13.235000000000001,13.92857142857143,10.347826086956522,7.666666666666667
282.0,13.145000000000003,13.875000000000007,9.956521739130439,7.666666666666667
283.0,13.145000000000003,13.875000000000007,9.956521739130439,7.666666666666667
284.0,13.145000000000003,13.875000000000007,9.956521739130439,7.666666666666667
285.0,13.145000000000003,13.875000000000007,9.956521739130439,7.666666666666667
286.0,13.145000000000003,13.875000000000007,9.956521739130439,7.666666666666667
287.0,13.125,13.851190476190482,9.956521739130439,7.666666666666667
288.0,13.125,13.851190476190482,9.956521739130439,7.666666666666667
289.0,13.125,13.851190476190482,9.956521739130439,7.666666666666667
290.0,13.045,13.755952380952372,9.956521739130439,7.666666666666667
291.0,13.045,13.755952380952372,9.956521739130439,7.666666666666667
292.0,13.045,13.755952380952372,9.956521739130439,7.666666666666667
293.0,13.045,13.755952380952372,9.956521739130439,7.666666666666667
294.0,13.045,13.755952380952372,9.956521739130439,7.666666666666667
295.0,13.045,13.755952380952372,9.956521739130439,7.666666666666667
296.0,13.045,13.755952380952372,9.956521739130439,7.666666666666667
297.0,13.045,13.755952380952372,9.956521739130439,7.666666666666667
298.0,13.045,13.755952380952372,9.956521739130439,7.666666666666667
299.0,13.045,13.755952380952372,9.956521739130439,7.666666666666667
300.0,13.045,13.755952380952372,9.956521739130439,7.666666666666667
301.0,13.045,13.755952380952372,9.956521739130439,7.666666666666667
302.0,12.995000000000003,13.696428571428568,9.956521739130439,7.666666666666667
303.0,12.995000000000003,13.696428571428568,9.956521739130439,7.666666666666667
304.0,12.869999999999994,13.601190476190478,10.0,6.8999999999999995
305.0,12.869999999999994,13.601190476190478,10.0,6.8999999999999995
306.0,12.869999999999994,13.601190476190478,10.0,6.8999999999999995
307.0,12.869999999999994,13.601190476190478,10.0,6.8999999999999995
308.0,12.850000000000001,13.577380952380956,10.0,6.8999999999999995
309.0,12.850000000000001,13.577380952380956,10.0,6.8999999999999995
310.0,12.850000000000001,13.577380952380956,10.0,6.8999999999999995
311.0,12.850000000000001,13.577380952380956,10.0,6.8999999999999995
312.0,12.850000000000001,13.577380952380956,10.0,6.8999999999999995
313.0,13.675000000000008,14.369047619047622,11.0,7.8999999999999995
314.0,13.675000000000008,14.369047619047622,11.0,7.8999999999999995
315.0,13.675000000000008,14.369047619047622,11.0,7.8999999999999995
316.0,13.675000000000008,14.369047619047622,11.0,7.8999999999999995
317.0,13.675000000000008,14.369047619047622,11.0,7.8999999999999995
318.0,13.675000000000008,14.369047619047622,11.0,7.8999999999999995
319.0,13.675000000000008,14.369047619047622,11.0,7.8999999999999995
320.0,13.625,14.30952380952381,11.0,7.8999999999999995
321.0,13.58500000000001,14.261904761904763,11.0,7.8999999999999995
322.0,13.58500000000001,14.261904761904763,11.0,7.8999999999999995
323.0,13.535,14.202380952380956,11.0,7.8999999999999995
324.0,13.535,14.202380952380956,11.0,7.8999999999999995
325.0,13.535,14.202380952380956,11.0,7.8999999999999995
326.0,13.535,14.202380952380956,11.0,7.8999999999999995
327.0,13.500000000000007,14.160714285714294,11.0,7.8999999999999995
328.0,13.500000000000007,14.160714285714294,11.0,7.8999999999999995
329.0,13.500000000000007,14.160714285714294,11.0,7.8999999999999995
330.0,13.500000000000007,14.160714285714294,11.0,7.8999999999999995
331.0,13.500000000000007,14.160714285714294,11.0,7.8999999999999995
332.0,13.500000000000007,14.160714285714294,11.0,7.8999999999999995
333.0,13.500000000000007,14.160714285714294,11.0,7.8999999999999995
334.0,13.50499999999999,14.166666666666671,11.0,7.8999999999999995
335.0,13.50499999999999,14.166666666666671,11.0,7.8999999999999995
336.0,13.449999999999998,14.101190476190478,11.0,7.8999999999999995
337.0,13.449999999999998,14.101190476190478,11.0,7.8999999999999995
338.0,13.449999999999998,14.101190476190478,11.0,7.8999999999999995
339.0,13.449999999999998,14.101190476190478,11.0,7.8999999999999995
340.0,13.449999999999998,14.101190476190478,11.0,7.8999999999999995
341.0,13.399999999999999,14.041666666666666,11.0,7.8999999999999995
342.0,13.379999999999992,14.01785714285714,11.0,7.8999999999999995
343.0,13.379999999999992,14.01785714285714,11.0,7.8999999999999995
344.0,13.379999999999992,14.01785714285714,11.0,7.8999999999999995
345.0,13.379999999999992,14.01785714285714,11.0,7.8999999999999995
346.0,13.324999999999996,13.952380952380954,11.0,7.8999999999999995
347.0,13.319999999999997,13.946428571428573,11.0,7.8999999999999995
348.0,13.319999999999997,13.946428571428573,11.0,7.8999999999999995
349.0,13.319999999999997,13.946428571428573,11.0,7.8999999999999995
350.0,13.295000000000003,13.916666666666659,11.0,7.8999999999999995
351.0,13.295000000000003,13.916666666666659,11.0,7.8999999999999995
352.0,13.295000000000003,13.916666666666659,11.0,7.8999999999999995
353.0,13.295000000000003,13.916666666666659,11.0,7.8999999999999995
354.0,13.295000000000003,13.916666666666659,11.0,7.8999999999999995
355.0,13.295000000000003,13.916666666666659,11.0,7.8999999999999995
356.0,13.295000000000003,13.916666666666659,11.0,7.8999999999999995
357.0,13.295000000000003,13.916666666666659,11.0,7.8999999999999995
358.0,13.255000000000004,13.869047619047615,11.0,7.8999999999999995
359.0,13.255000000000004,13.869047619047615,11.0,7.8999999999999995
360.0,13.205000000000004,13.809523809523814,11.0,7.8999999999999995
361.0,13.205000000000004,13.809523809523814,11.0,7.8999999999999995
362.0,13.205000000000004,13.809523809523814,11.0,7.8999999999999995
363.0,13.205000000000004,13.809523809523814,11.0,7.8999999999999995
364.0,13.205000000000004,13.809523809523814,11.0,7.8999999999999995
365.0,14.090000000000005,14.672619047619044,12.0,8.9
366.0,14.090000000000005,14.672619047619044,12.0,8.9
367.0,14.090000000000005,14.672619047619044,12.0,8.9
368.0,14.090000000000005,14.672619047619044,12.0,8.9
369.0,14.090000000000005,14.672619047619044,12.0,8.9
370.0,14.090000000000005,14.672619047619044,12.0,8.9
371.0,14.090000000000005,14.672619047619044,12.0,8.9
372.0,14.090000000000005,14.672619047619044,12.0,8.9
373.0,14.090000000000005,14.672619047619044,12.0,8.9
374.0,14.090000000000005,14.672619047619044,12.0,8.9
375.0,14.090000000000005,14.672619047619044,12.0,8.9
376.0,14.015000000000004,14.583333333333327,12.0,8.9
377.0,14.015000000000004,14.583333333333327,12.0,8.9
378.0,14.015000000000004,14.583333333333327,12.0,8.9
379.0,14.015000000000004,14.583333333333327,12.0,8.9
380.0,14.015000000000004,14.583333333333327,12.0,8.9
381.0,13.910000000000005,14.45833333333333,12.0,8.9
382.0,13.910000000000005,14.45833333333333,12.0,8.9
383.0,13.930000000000003,14.482142857142856,12.0,8.9
384.0,13.930000000000003,14.482142857142856,12.0,8.9
385.0,13.930000000000003,14.482142857142856,12.0,8.9
386.0,13.930000000000003,14.482142857142856,12.0,8.9
387.0,13.930000000000003,14.482142857142856,12.0,8.9
388.0,13.930000000000003,14.482142857142856,12.0,8.9
389.0,13.930000000000003,14.482142857142856,12.0,8.9
390.0,13.930000000000003,14.482142857142856,12.0,8.9
391.0,13.930000000000003,14.482142857142856,12.0,8.9
392.0,13.930000000000003,14.482142857142856,12.0,8.9
393.0,13.930000000000003,14.482142857142856,12.0,8.9
394.0,13.930000000000003,14.482142857142856,12.0,8.9
395.0,13.905000000000001,14.452380952380949,12.0,8.9
396.0,13.829999999999995,14.36309523809524,12.0,8.9
397.0,13.754999999999994,14.273809523809529,12.0,8.9
398.0,13.704999999999998,14.214285714285719,12.0,8.9
399.0,13.650000000000002,14.214285714285719,12.0,7.800000000000001
400.0,13.650000000000002,14.214285714285719,12.0,7.800000000000001
401.0,13.650000000000002,14.214285714285719,12.0,7.800000000000001
402.0,13.650000000000002,14.214285714285719,12.0,7.800000000000001
403.0,13.625000000000002,14.184523809523808,12.0,7.800000000000001
404.0,13.625000000000002,14.184523809523808,12.0,7.800000000000001
405.0,13.550000000000002,14.095238095238088,12.0,7.800000000000001
406.0,13.550000000000002,14.095238095238088,12.0,7.800000000000001
407.0,13.410000000000007,13.928571428571427,12.0,7.800000000000001
408.0,13.410000000000007,13.928571428571427,12.0,7.800000000000001
409.0,13.410000000000007,13.928571428571427,12.0,7.800000000000001
410.0,13.410000000000007,13.928571428571427,12.0,7.800000000000001
411.0,13.410000000000007,13.928571428571427,12.0,7.800000000000001
412.0,13.410000000000007,13.928571428571427,12.0,7.800000000000001
413.0,13.410000000000007,13.928571428571427,12.0,7.800000000000001
414.0,13.410000000000007,13.928571428571427,12.0,7.800000000000001
415.0,13.410000000000007,13.928571428571427,12.0,7.800000000000001
416.0,13.410000000000007,13.928571428571427,12.0,7.800000000000001
417.0,14.26,14.904761904761905,12.363636363636362,7.6
418.0,14.209999999999999,14.845238095238093,12.363636363636362,7.6
419.0,14.209999999999999,14.845238095238093,12.363636363636362,7.6
420.0,14.209999999999999,14.845238095238093,12.363636363636362,7.6
421.0,14.175,14.80357142857143,12.363636363636362,7.6
422.0,14.175,14.80357142857143,12.363636363636362,7.6
423.0,14.175,14.80357142857143,12.363636363636362,7.6
424.0,14.155000000000008,14.779761904761903,12.363636363636362,7.6
425.0,14.155000000000008,14.779761904761903,12.363636363636362,7.6
426.0,14.155000000000008,14.779761904761903,12.363636363636362,7.6
427.0,14.105000000000004,14.720238095238088,12.363636363636362,7.6
428.0,14.105000000000004,14.720238095238088,12.363636363636362,7.6
429.0,14.105000000000004,14.720238095238088,12.363636363636362,7.6
430.0,14.105000000000004,14.720238095238088,12.363636363636362,7.6
431.0,14.105,14.72023809523809,12.363636363636362,7.6
432.0,14.105,14.72023809523809,12.363636363636362,7.6
433.0,14.105,14.72023809523809,12.363636363636362,7.6
434.0,14.105,14.72023809523809,12.363636363636362,7.6
435.0,14.105,14.72023809523809,12.363636363636362,7.6
436.0,14.064999999999998,14.672619047619044,12.363636363636362,7.6
437.0,14.064999999999998,14.672619047619044,12.363636363636362,7.6
438.0,14.064999999999998,14.672619047619044,12.363636363636362,7.6
439.0,14.064999999999998,14.672619047619044,12.363636363636362,7.6
440.0,14.064999999999998,14.672619047619044,12.363636363636362,7.6
441.0,14.064999999999998,14.672619047619044,12.363636363636362,7.6
442.0,14.064999999999998,14.672619047619044,12.363636363636362,7.6
443.0,14.064999999999998,14.672619047619044,12.363636363636362,7.6
444.0,14.055,14.660714285714283,12.363636363636362,7.6
445.0,14.055,14.660714285714283,12.363636363636362,7.6
446.0,14.055,14.660714285714283,12.363636363636362,7.6
447.0,14.055,14.660714285714283,12.363636363636362,7.6
448.0,14.055,14.660714285714283,12.363636363636362,7.6
449.0,14.055,14.660714285714283,12.363636363636362,7.6
450.0,14.055,14.660714285714283,12.363636363636362,7.6
451.0,14.055,14.660714285714283,12.363636363636362,7.6
452.0,14.0,14.660714285714283,11.863636363636363,7.6
453.0,14.0,14.660714285714283,11.863636363636363,7.6
454.0,14.0,14.660714285714283,11.863636363636363,7.6
455.0,14.0,14.660714285714283,11.863636363636363,7.6
456.0,14.0,14.660714285714283,11.863636363636363,7.6
457.0,14.0,14.660714285714283,11.863636363636363,7.6
458.0,14.0,14.660714285714283,11.863636363636363,7.6
459.0,13.935000000000002,14.583333333333329,11.863636363636363,7.6
460.0,13.935000000000002,14.583333333333329,11.863636363636363,7.6
461.0,13.925000000000002,14.571428571428575,11.863636363636363,7.6
462.0,13.925000000000002,14.571428571428575,11.863636363636363,7.6
463.0,13.925000000000002,14.571428571428575,11.863636363636363,7.6
464.0,13.925000000000002,14.571428571428575,11.863636363636363,7.6
465.0,13.925000000000002,14.571428571428575,11.863636363636363,7.6
466.0,13.925000000000002,14.571428571428575,11.863636363636363,7.6
467.0,13.925000000000002,14.571428571428575,11.863636363636363,7.6
468.0,13.850000000000007,14.571428571428575,11.863636363636363,6.1
469.0,14.714999999999996,15.416666666666671,12.863636363636363,7.0
470.0,14.714999999999996,15.416666666666671,12.863636363636363,7.0
471.0,14.714999999999996,15.416666666666671,12.863636363636363,7.0
472.0,14.714999999999996,15.416666666666671,12.863636363636363,7.0
473.0,14.714999999999996,15.416666666666671,12.863636363636363,7.0
474.0,14.714999999999996,15.416666666666671,12.863636363636363,7.0
475.0,14.674999999999999,15.36904761904763,12.863636363636363,7.0
476.0,14.674999999999999,15.36904761904763,12.863636363636363,7.0
477.0,14.674999999999999,15.36904761904763,12.863636363636363,7.0
478.0,14.674999999999999,15.36904761904763,12.863636363636363,7.0
479.0,14.674999999999999,15.36904761904763,12.863636363636363,7.0
480.0,14.674999999999999,15.36904761904763,12.863636363636363,7.0
481.0,14.674999999999999,15.36904761904763,12.863636363636363,7.0
482.0,14.674999999999999,15.36904761904763,12.863636363636363,7.0
483.0,14.674999999999999,15.36904761904763,12.863636363636363,7.0
484.0,14.674999999999999,15.36904761904763,12.863636363636363,7.0
485.0,14.674999999999999,15.36904761904763,12.863636363636363,7.0
486.0,14.674999999999999,15.36904761904763,12.863636363636363,7.0
487.0,14.674999999999999,15.36904761904763,12.863636363636363,7.0
488.0,14.674999999999999,15.36904761904763,12.863636363636363,7.0
489.0,14.674999999999999,15.36904761904763,12.863636363636363,7.0
490.0,14.674999999999999,15.36904761904763,12.863636363636363,7.0
491.0,14.674999999999999,15.36904761904763,12.863636363636363,7.0
492.0,14.605,15.285714285714292,12.863636363636363,7.0
493.0,14.605,15.285714285714292,12.863636363636363,7.0
494.0,14.605,15.285714285714292,12.863636363636363,7.0
495.0,14.540000000000001,15.285714285714292,12.272727272727273,7.0
496.0,14.540000000000001,15.285714285714292,12.272727272727273,7.0
497.0,14.515,15.255952380952383,12.272727272727273,7.0
498.0,14.515,15.255952380952383,12.272727272727273,7.0
499.0,14.515,15.255952380952383,12.272727272727273,7.0
500.0,14.515,15.255952380952383,12.272727272727273,7.0
501.0,14.344999999999994,15.136904761904765,11.636363636363637,7.0
502.0,14.344999999999994,15.136904761904765,11.636363636363637,7.0
503.0,14.290000000000003,15.071428571428577,11.636363636363637,7.0
504.0,14.290000000000003,15.071428571428577,11.636363636363637,7.0
505.0,14.229999999999999,14.999999999999995,11.636363636363637,7.0
506.0,14.229999999999999,14.999999999999995,11.636363636363637,7.0
507.0,14.229999999999999,14.999999999999995,11.636363636363637,7.0
508.0,14.229999999999999,14.999999999999995,11.636363636363637,7.0
509.0,14.229999999999999,14.999999999999995,11.636363636363637,7.0
510.0,14.229999999999999,14.999999999999995,11.636363636363637,7.0
511.0,14.229999999999999,14.999999999999995,11.636363636363637,7.0
512.0,14.229999999999999,14.999999999999995,11.636363636363637,7.0
513.0,14.229999999999999,14.999999999999995,11.636363636363637,7.0
514.0,14.229999999999999,14.999999999999995,11.636363636363637,7.0
515.0,14.229999999999999,14.999999999999995,11.636363636363637,7.0
516.0,14.229999999999999,14.999999999999995,11.636363636363637,7.0
517.0,14.229999999999999,14.999999999999995,11.636363636363637,7.0
518.0,14.229999999999999,14.999999999999995,11.636363636363637,7.0
519.0,14.229999999999999,14.999999999999995,11.636363636363637,7.0
520.0,14.229999999999999,14.999999999999995,11.636363636363637,7.0
521.0,15.025000000000004,15.898809523809534,12.090909090909088,6.800000000000001
522.0,15.025000000000004,15.898809523809534,12.090909090909088,6.800000000000001
523.0,15.025000000000004,15.898809523809534,12.090909090909088,6.800000000000001
524.0,15.025000000000004,15.898809523809534,12.090909090909088,6.800000000000001
525.0,15.025000000000004,15.898809523809534,12.090909090909088,6.800000000000001
526.0,15.025000000000004,15.898809523809534,12.090909090909088,6.800000000000001
527.0,14.949999999999994,15.809523809523807,12.090909090909088,6.800000000000001
528.0,14.949999999999994,15.809523809523807,12.090909090909088,6.800000000000001
529.0,14.949999999999994,15.809523809523807,12.090909090909088,6.800000000000001
530.0,14.949999999999994,15.809523809523807,12.090909090909088,6.800000000000001
531.0,14.949999999999994,15.809523809523807,12.090909090909088,6.800000000000001
532.0,14.889999999999997,15.809523809523807,11.545454545454545,6.800000000000001
533.0,14.889999999999997,15.809523809523807,11.545454545454545,6.800000000000001
534.0,14.830000000000007,15.73809523809524,11.545454545454545,6.800000000000001
535.0,14.830000000000007,15.73809523809524,11.545454545454545,6.800000000000001
536.0,14.800000000000008,15.70238095238095,11.545454545454545,6.800000000000001
537.0,14.800000000000008,15.70238095238095,11.545454545454545,6.800000000000001
538.0,14.800000000000008,15.70238095238095,11.545454545454545,6.800000000000001
539.0,14.800000000000008,15.70238095238095,11.545454545454545,6.800000000000001
540.0,14.800000000000008,15.70238095238095,11.545454545454545,6.800000000000001
541.0,14.800000000000008,15.70238095238095,11.545454545454545,6.800000000000001
542.0,14.840000000000002,15.75,11.545454545454545,6.800000000000001
543.0,14.840000000000002,15.75,11.545454545454545,6.800000000000001
544.0,14.840000000000002,15.75,11.545454545454545,6.800000000000001
545.0,14.840000000000002,15.75,11.545454545454545,6.800000000000001
546.0,14.770000000000007,15.75,10.90909090909091,6.800000000000001
547.0,14.770000000000007,15.75,10.90909090909091,6.800000000000001
548.0,14.770000000000007,15.75,10.90909090909091,6.800000000000001
549.0,14.715000000000002,15.75,10.90909090909091,5.7
550.0,14.715000000000002,15.75,10.90909090909091,5.7
551.0,14.715000000000002,15.75,10.90909090909091,5.7
552.0,14.715000000000002,15.75,10.90909090909091,5.7
553.0,14.715000000000002,15.75,10.90909090909091,5.7
554.0,14.715000000000002,15.75,10.90909090909091,5.7
555.0,14.715000000000002,15.75,10.90909090909091,5.7
556.0,14.715000000000002,15.75,10.90909090909091,5.7
557.0,14.715000000000002,15.75,10.90909090909091,5.7
558.0,14.715000000000002,15.75,10.90909090909091,5.7
559.0,14.715000000000002,15.75,10.90909090909091,5.7
560.0,14.715000000000002,15.75,10.90909090909091,5.7
561.0,14.715000000000002,15.75,10.90909090909091,5.7
562.0,14.715000000000002,15.75,10.90909090909091,5.7
563.0,14.715000000000002,15.75,10.90909090909091,5.7
564.0,14.715000000000002,15.75,10.90909090909091,5.7
565.0,14.715000000000002,15.75,10.90909090909091,5.7
566.0,14.669999999999998,15.696428571428568,10.90909090909091,5.7
567.0,14.669999999999998,15.696428571428568,10.90909090909091,5.7
568.0,14.669999999999998,15.696428571428568,10.90909090909091,5.7
569.0,14.669999999999998,15.696428571428568,10.90909090909091,5.7
570.0,14.669999999999998,15.696428571428568,10.90909090909091,5.7
571.0,14.669999999999998,15.696428571428568,10.90909090909091,5.7
572.0,14.669999999999998,15.696428571428568,10.90909090909091,5.7
573.0,15.545000000000002,16.630952380952387,11.272727272727272,6.7
574.0,15.545000000000002,16.630952380952387,11.272727272727272,6.7
575.0,15.545000000000002,16.630952380952387,11.272727272727272,6.7
576.0,15.514999999999997,16.59523809523811,11.272727272727272,6.7
577.0,15.514999999999997,16.59523809523811,11.272727272727272,6.7
578.0,15.514999999999997,16.59523809523811,11.272727272727272,6.7
579.0,15.514999999999997,16.59523809523811,11.272727272727272,6.7
580.0,15.514999999999997,16.59523809523811,11.272727272727272,6.7
581.0,15.514999999999997,16.59523809523811,11.272727272727272,6.7
582.0,15.469999999999992,16.54166666666668,11.272727272727272,6.7
583.0,15.379999999999995,16.43452380952381,11.272727272727272,6.7
584.0,15.379999999999995,16.43452380952381,11.272727272727272,6.7
585.0,15.379999999999995,16.43452380952381,11.272727272727272,6.7
586.0,15.379999999999995,16.43452380952381,11.272727272727272,6.7
587.0,15.379999999999995,16.43452380952381,11.272727272727272,6.7
588.0,15.379999999999995,16.43452380952381,11.272727272727272,6.7
589.0,15.379999999999995,16.43452380952381,11.272727272727272,6.7
590.0,15.379999999999995,16.43452380952381,11.272727272727272,6.7
591.0,15.329999999999993,16.374999999999996,11.272727272727272,6.7
592.0,15.329999999999993,16.374999999999996,11.272727272727272,6.7
593.0,15.329999999999993,16.374999999999996,11.272727272727272,6.7
594.0,15.329999999999993,16.374999999999996,11.272727272727272,6.7
595.0,15.269999999999996,16.303571428571434,11.272727272727272,6.7
596.0,15.269999999999996,16.303571428571434,11.272727272727272,6.7
597.0,15.269999999999996,16.303571428571434,11.272727272727272,6.7
598.0,15.269999999999996,16.303571428571434,11.272727272727272,6.7
599.0,15.269999999999996,16.303571428571434,11.272727272727272,6.7
600.0,15.269999999999996,16.303571428571434,11.272727272727272,6.7
601.0,15.269999999999996,16.303571428571434,11.272727272727272,6.7
602.0,15.269999999999996,16.303571428571434,11.272727272727272,6.7
603.0,15.269999999999996,16.303571428571434,11.272727272727272,6.7
604.0,15.269999999999996,16.303571428571434,11.272727272727272,6.7
605.0,15.269999999999996,16.303571428571434,11.272727272727272,6.7
606.0,15.269999999999996,16.303571428571434,11.272727272727272,6.7
607.0,15.269999999999996,16.303571428571434,11.272727272727272,6.7
608.0,15.269999999999996,16.303571428571434,11.272727272727272,6.7
609.0,15.269999999999996,16.303571428571434,11.272727272727272,6.7
610.0,15.269999999999996,16.303571428571434,11.272727272727272,6.7
611.0,15.269999999999996,16.303571428571434,11.272727272727272,6.7
612.0,15.269999999999996,16.303571428571434,11.272727272727272,6.7
613.0,15.269999999999996,16.303571428571434,11.272727272727272,6.7
614.0,15.269999999999996,16.303571428571434,11.272727272727272,6.7
615.0,15.269999999999996,16.303571428571434,11.272727272727272,6.7
616.0,15.269999999999996,16.303571428571434,11.272727272727272,6.7
617.0,15.269999999999996,16.303571428571434,11.272727272727272,6.7
618.0,15.269999999999996,16.303571428571434,11.272727272727272,6.7
619.0,15.160000000000009,16.172619047619044,11.272727272727272,6.7
620.0,14.989999999999991,15.970238095238095,11.272727272727272,6.7
621.0,14.989999999999991,15.970238095238095,11.272727272727272,6.7
622.0,14.989999999999991,15.970238095238095,11.272727272727272,6.7
623.0,14.989999999999991,15.970238095238095,11.272727272727272,6.7
624.0,14.989999999999991,15.970238095238095,11.272727272727272,6.7
625.0,15.990000000000016,16.9702380952381,12.27272727272727,7.7
626.0,15.990000000000016,16.9702380952381,12.27272727272727,7.7
627.0,15.990000000000016,16.9702380952381,12.27272727272727,7.7
628.0,15.990000000000016,16.9702380952381,12.27272727272727,7.7
629.0,15.990000000000016,16.9702380952381,12.27272727272727,7.7
630.0,15.91,16.87500000000001,12.27272727272727,7.7
631.0,15.91,16.87500000000001,12.27272727272727,7.7
632.0,15.91,16.87500000000001,12.27272727272727,7.7
633.0,15.759999999999994,16.69642857142857,12.27272727272727,7.7
634.0,15.759999999999994,16.69642857142857,12.27272727272727,7.7
635.0,15.759999999999994,16.69642857142857,12.27272727272727,7.7
636.0,15.759999999999994,16.69642857142857,12.27272727272727,7.7
637.0,15.759999999999994,16.69642857142857,12.27272727272727,7.7
638.0,15.759999999999994,16.69642857142857,12.27272727272727,7.7
639.0,15.759999999999994,16.69642857142857,12.27272727272727,7.7
640.0,15.604999999999999,16.69642857142857,11.590909090909088,6.1000000000000005
641.0,15.604999999999999,16.69642857142857,11.590909090909088,6.1000000000000005
642.0,15.604999999999999,16.69642857142857,11.590909090909088,6.1000000000000005
643.0,15.604999999999999,16.69642857142857,11.590909090909088,6.1000000000000005
644.0,15.495000000000006,16.565476190476197,11.590909090909088,6.1000000000000005
645.0,15.495000000000006,16.565476190476197,11.590909090909088,6.1000000000000005
646.0,15.405000000000005,16.45833333333333,11.590909090909088,6.1000000000000005
647.0,15.345,16.38690476190476,11.590909090909088,6.1000000000000005
648.0,15.345,16.38690476190476,11.590909090909088,6.1000000000000005
649.0,15.345,16.38690476190476,11.590909090909088,6.1000000000000005
650.0,15.345,16.38690476190476,11.590909090909088,6.1000000000000005
651.0,15.265,16.38690476190476,10.863636363636363,6.1000000000000005
652.0,15.265,16.38690476190476,10.863636363636363,6.1000000000000005
653.0,15.265,16.38690476190476,10.863636363636363,6.1000000000000005
654.0,15.265,16.38690476190476,10.863636363636363,6.1000000000000005
655.0,15.265,16.38690476190476,10.863636363636363,6.1000000000000005
656.0,15.265,16.38690476190476,10.863636363636363,6.1000000000000005
657.0,15.265,16.38690476190476,10.863636363636363,6.1000000000000005
658.0,15.265,16.38690476190476,10.863636363636363,6.1000000000000005
659.0,15.215000000000002,16.32738095238095,10.863636363636363,6.1000000000000005
660.0,15.215000000000002,16.32738095238095,10.863636363636363,6.1000000000000005
661.0,15.215000000000002,16.32738095238095,10.863636363636363,6.1000000000000005
662.0,15.135000000000002,16.23214285714285,10.863636363636363,6.1000000000000005
663.0,15.135000000000002,16.23214285714285,10.863636363636363,6.1000000000000005
664.0,15.135000000000002,16.23214285714285,10.863636363636363,6.1000000000000005
665.0,15.135000000000002,16.23214285714285,10.863636363636363,6.1000000000000005
666.0,15.135000000000002,16.23214285714285,10.863636363636363,6.1000000000000005
667.0,15.105000000000002,16.196428571428573,10.863636363636363,6.1000000000000005
668.0,15.105000000000002,16.196428571428573,10.863636363636363,6.1000000000000005
669.0,15.105000000000002,16.196428571428573,10.863636363636363,6.1000000000000005
670.0,15.105000000000002,16.196428571428573,10.863636363636363,6.1000000000000005
671.0,15.105000000000002,16.196428571428573,10.863636363636363,6.1000000000000005
672.0,15.105000000000002,16.196428571428573,10.863636363636363,6.1000000000000005
673.0,15.105000000000002,16.196428571428573,10.863636363636363,6.1000000000000005
674.0,15.105000000000002,16.196428571428573,10.863636363636363,6.1000000000000005
675.0,15.105000000000002,16.196428571428573,10.863636363636363,6.1000000000000005
676.0,15.105000000000002,16.196428571428573,10.863636363636363,6.1000000000000005
677.0,15.929999999999993,17.101190476190478,11.523809523809522,6.454545454545456
678.0,15.929999999999993,17.101190476190478,11.523809523809522,6.454545454545456
679.0,15.929999999999993,17.101190476190478,11.523809523809522,6.454545454545456
680.0,15.929999999999993,17.101190476190478,11.523809523809522,6.454545454545456
681.0,15.929999999999993,17.101190476190478,11.523809523809522,6.454545454545456
682.0,15.929999999999993,17.101190476190478,11.523809523809522,6.454545454545456
683.0,15.929999999999993,17.101190476190478,11.523809523809522,6.454545454545456
684.0,15.929999999999993,17.101190476190478,11.523809523809522,6.454545454545456
685.0,15.929999999999993,17.101190476190478,11.523809523809522,6.454545454545456
686.0,15.929999999999993,17.101190476190478,11.523809523809522,6.454545454545456
687.0,15.929999999999993,17.101190476190478,11.523809523809522,6.454545454545456
688.0,15.929999999999993,17.101190476190478,11.523809523809522,6.454545454545456
689.0,15.929999999999993,17.101190476190478,11.523809523809522,6.454545454545456
690.0,15.855000000000004,17.01190476190477,11.523809523809522,6.454545454545456
691.0,15.759999999999993,16.898809523809522,11.523809523809522,6.454545454545456
692.0,15.524999999999993,16.738095238095227,10.571428571428571,6.454545454545456
693.0,15.524999999999993,16.738095238095227,10.571428571428571,6.454545454545456
694.0,15.524999999999993,16.738095238095227,10.571428571428571,6.454545454545456
695.0,15.524999999999993,16.738095238095227,10.571428571428571,6.454545454545456
696.0,15.524999999999993,16.738095238095227,10.571428571428571,6.454545454545456
697.0,15.339999999999996,16.51785714285714,10.571428571428571,6.454545454545456
698.0,15.339999999999996,16.51785714285714,10.571428571428571,6.454545454545456
699.0,15.339999999999996,16.51785714285714,10.571428571428571,6.454545454545456
700.0,15.339999999999996,16.51785714285714,10.571428571428571,6.454545454545456
701.0,15.339999999999996,16.51785714285714,10.571428571428571,6.454545454545456
702.0,15.339999999999996,16.51785714285714,10.571428571428571,6.454545454545456
703.0,15.195000000000002,16.34523809523809,10.571428571428571,6.454545454545456
704.0,15.195000000000002,16.34523809523809,10.571428571428571,6.454545454545456
705.0,15.195000000000002,16.34523809523809,10.571428571428571,6.454545454545456
706.0,15.195000000000002,16.34523809523809,10.571428571428571,6.454545454545456
707.0,15.195000000000002,16.34523809523809,10.571428571428571,6.454545454545456
708.0,15.195000000000002,16.34523809523809,10.571428571428571,6.454545454545456
709.0,15.195000000000002,16.34523809523809,10.571428571428571,6.454545454545456
710.0,15.195000000000002,16.34523809523809,10.571428571428571,6.454545454545456
711.0,15.195000000000002,16.34523809523809,10.571428571428571,6.454545454545456
712.0,15.140000000000008,16.279761904761894,10.571428571428571,6.454545454545456
713.0,15.140000000000008,16.279761904761894,10.571428571428571,6.454545454545456
714.0,15.140000000000008,16.279761904761894,10.571428571428571,6.454545454545456
715.0,15.060000000000004,16.279761904761894,9.80952380952381,6.454545454545456
716.0,15.060000000000004,16.279761904761894,9.80952380952381,6.454545454545456
717.0,15.009999999999998,16.220238095238084,9.80952380952381,6.454545454545456
718.0,15.009999999999998,16.220238095238084,9.80952380952381,6.454545454545456
719.0,15.009999999999998,16.220238095238084,9.80952380952381,6.454545454545456
720.0,14.955000000000005,16.154761904761894,9.80952380952381,6.454545454545456
721.0,14.955000000000005,16.154761904761894,9.80952380952381,6.454545454545456
722.0,14.955000000000005,16.154761904761894,9.80952380952381,6.454545454545456
723.0,14.955000000000005,16.154761904761894,9.80952380952381,6.454545454545456
724.0,14.955000000000005,16.154761904761894,9.80952380952381,6.454545454545456
725.0,14.955000000000005,16.154761904761894,9.80952380952381,6.454545454545456
726.0,14.955000000000005,16.154761904761894,9.80952380952381,6.454545454545456
727.0,14.834999999999999,16.011904761904763,9.80952380952381,6.454545454545456
728.0,14.834999999999999,16.011904761904763,9.80952380952381,6.454545454545456
729.0,15.835000000000008,17.011904761904763,10.80952380952381,7.454545454545455
730.0,15.835000000000008,17.011904761904763,10.80952380952381,7.454545454545455
731.0,15.835000000000008,17.011904761904763,10.80952380952381,7.454545454545455
732.0,15.835000000000008,17.011904761904763,10.80952380952381,7.454545454545455
733.0,15.835000000000008,17.011904761904763,10.80952380952381,7.454545454545455
734.0,15.835000000000008,17.011904761904763,10.80952380952381,7.454545454545455
735.0,15.835000000000008,17.011904761904763,10.80952380952381,7.454545454545455
736.0,15.710000000000004,16.863095238095237,10.80952380952381,7.454545454545455
737.0,15.710000000000004,16.863095238095237,10.80952380952381,7.454545454545455
738.0,15.710000000000004,16.863095238095237,10.80952380952381,7.454545454545455
739.0,15.610000000000005,16.74404761904761,10.80952380952381,7.454545454545455
740.0,15.610000000000005,16.74404761904761,10.80952380952381,7.454545454545455
741.0,15.610000000000005,16.74404761904761,10.80952380952381,7.454545454545455
742.0,15.610000000000005,16.74404761904761,10.80952380952381,7.454545454545455
743.0,15.610000000000005,16.74404761904761,10.80952380952381,7.454545454545455
744.0,15.560000000000013,16.684523809523814,10.80952380952381,7.454545454545455
745.0,15.560000000000013,16.684523809523814,10.80952380952381,7.454545454545455
746.0,15.560000000000013,16.684523809523814,10.80952380952381,7.454545454545455
747.0,15.560000000000013,16.684523809523814,10.80952380952381,7.454545454545455
748.0,15.560000000000013,16.684523809523814,10.80952380952381,7.454545454545455
749.0,15.560000000000013,16.684523809523814,10.80952380952381,7.454545454545455
750.0,15.395000000000005,16.648809523809536,9.523809523809522,7.454545454545455
751.0,15.395000000000005,16.648809523809536,9.523809523809522,7.454545454545455
752.0,15.309999999999993,16.547619047619047,9.523809523809522,7.454545454545455
753.0,15.309999999999993,16.547619047619047,9.523809523809522,7.454545454545455
754.0,15.309999999999993,16.547619047619047,9.523809523809522,7.454545454545455
755.0,15.240000000000002,16.464285714285715,9.523809523809522,7.454545454545455
756.0,15.240000000000002,16.464285714285715,9.523809523809522,7.454545454545455
757.0,15.240000000000002,16.464285714285715,9.523809523809522,7.454545454545455
758.0,15.240000000000002,16.464285714285715,9.523809523809522,7.454545454545455
759.0,15.240000000000002,16.464285714285715,9.523809523809522,7.454545454545455
760.0,15.240000000000002,16.464285714285715,9.523809523809522,7.454545454545455
761.0,15.240000000000002,16.464285714285715,9.523809523809522,7.454545454545455
762.0,15.240000000000002,16.464285714285715,9.523809523809522,7.454545454545455
763.0,15.240000000000002,16.464285714285715,9.523809523809522,7.454545454545455
764.0,15.240000000000002,16.464285714285715,9.523809523809522,7.454545454545455
765.0,15.240000000000002,16.464285714285715,9.523809523809522,7.454545454545455
766.0,15.139999999999999,16.34523809523809,9.523809523809522,7.454545454545455
767.0,15.139999999999999,16.34523809523809,9.523809523809522,7.454545454545455
768.0,15.139999999999999,16.34523809523809,9.523809523809522,7.454545454545455
769.0,15.139999999999999,16.34523809523809,9.523809523809522,7.454545454545455
770.0,15.139999999999999,16.34523809523809,9.523809523809522,7.454545454545455
771.0,15.139999999999999,16.34523809523809,9.523809523809522,7.454545454545455
772.0,15.139999999999999,16.34523809523809,9.523809523809522,7.454545454545455
773.0,15.139999999999999,16.34523809523809,9.523809523809522,7.454545454545455
774.0,15.139999999999999,16.34523809523809,9.523809523809522,7.454545454545455
775.0,15.139999999999999,16.34523809523809,9.523809523809522,7.454545454545455
776.0,15.139999999999999,16.34523809523809,9.523809523809522,7.454545454545455
777.0,15.139999999999999,16.34523809523809,9.523809523809522,7.454545454545455
778.0,15.005000000000008,16.18452380952382,9.523809523809522,7.454545454545455
779.0,15.005000000000008,16.18452380952382,9.523809523809522,7.454545454545455
780.0,15.005000000000008,16.18452380952382,9.523809523809522,7.454545454545455
781.0,16.00499999999999,17.18452380952382,10.523809523809522,8.454545454545453
782.0,16.00499999999999,17.18452380952382,10.523809523809522,8.454545454545453
783.0,16.00499999999999,17.18452380952382,10.523809523809522,8.454545454545453
784.0,16.00499999999999,17.18452380952382,10.523809523809522,8.454545454545453
785.0,16.00499999999999,17.18452380952382,10.523809523809522,8.454545454545453
786.0,16.00499999999999,17.18452380952382,10.523809523809522,8.454545454545453
787.0,16.00499999999999,17.18452380952382,10.523809523809522,8.454545454545453
788.0,16.00499999999999,17.18452380952382,10.523809523809522,8.454545454545453
789.0,15.969999999999994,17.142857142857146,10.523809523809522,8.454545454545453
790.0,15.969999999999994,17.142857142857146,10.523809523809522,8.454545454545453
791.0,15.969999999999994,17.142857142857146,10.523809523809522,8.454545454545453
792.0,15.969999999999994,17.142857142857146,10.523809523809522,8.454545454545453
793.0,15.905000000000006,17.06547619047618,10.523809523809522,8.454545454545453
794.0,15.905000000000006,17.06547619047618,10.523809523809522,8.454545454545453
795.0,15.905000000000006,17.06547619047618,10.523809523809522,8.454545454545453
796.0,15.905000000000006,17.06547619047618,10.523809523809522,8.454545454545453
797.0,15.905000000000006,17.06547619047618,10.523809523809522,8.454545454545453
798.0,15.905000000000006,17.06547619047618,10.523809523809522,8.454545454545453
799.0,15.905000000000006,17.06547619047618,10.523809523809522,8.454545454545453
800.0,15.905000000000006,17.06547619047618,10.523809523809522,8.454545454545453
801.0,15.905000000000006,17.06547619047618,10.523809523809522,8.454545454545453
802.0,15.905000000000006,17.06547619047618,10.523809523809522,8.454545454545453
803.0,15.819999999999995,17.06547619047618,9.714285714285712,8.454545454545453
804.0,15.819999999999995,17.06547619047618,9.714285714285712,8.454545454545453
805.0,15.819999999999995,17.06547619047618,9.714285714285712,8.454545454545453
806.0,15.819999999999995,17.06547619047618,9.714285714285712,8.454545454545453
807.0,15.819999999999995,17.06547619047618,9.714285714285712,8.454545454545453
808.0,15.819999999999995,17.06547619047618,9.714285714285712,8.454545454545453
809.0,15.819999999999995,17.06547619047618,9.714285714285712,8.454545454545453
810.0,15.819999999999995,17.06547619047618,9.714285714285712,8.454545454545453
811.0,15.819999999999995,17.06547619047618,9.714285714285712,8.454545454545453
812.0,15.819999999999995,17.06547619047618,9.714285714285712,8.454545454545453
813.0,15.819999999999995,17.06547619047618,9.714285714285712,8.454545454545453
814.0,15.71999999999999,16.946428571428573,9.714285714285712,8.454545454545453
815.0,15.71999999999999,16.946428571428573,9.714285714285712,8.454545454545453
816.0,15.71999999999999,16.946428571428573,9.714285714285712,8.454545454545453
817.0,15.64,16.85119047619048,9.714285714285712,8.454545454545453
818.0,15.64,16.85119047619048,9.714285714285712,8.454545454545453
819.0,15.569999999999988,16.767857142857146,9.714285714285712,8.454545454545453
820.0,15.484999999999996,16.666666666666675,9.714285714285712,8.454545454545453
821.0,15.484999999999996,16.666666666666675,9.714285714285712,8.454545454545453
822.0,15.484999999999996,16.666666666666675,9.714285714285712,8.454545454545453
823.0,15.484999999999996,16.666666666666675,9.714285714285712,8.454545454545453
824.0,15.484999999999996,16.666666666666675,9.714285714285712,8.454545454545453
825.0,15.484999999999996,16.666666666666675,9.714285714285712,8.454545454545453
826.0,15.484999999999996,16.666666666666675,9.714285714285712,8.454545454545453
827.0,15.484999999999996,16.666666666666675,9.714285714285712,8.454545454545453
828.0,15.419999999999995,16.58928571428571,9.714285714285712,8.454545454545453
829.0,15.419999999999995,16.58928571428571,9.714285714285712,8.454545454545453
830.0,15.419999999999995,16.58928571428571,9.714285714285712,8.454545454545453
831.0,15.419999999999995,16.58928571428571,9.714285714285712,8.454545454545453
832.0,15.419999999999995,16.58928571428571,9.714285714285712,8.454545454545453
833.0,16.36499999999999,17.52380952380953,10.714285714285712,9.454545454545453
834.0,16.36499999999999,17.52380952380953,10.714285714285712,9.454545454545453
835.0,16.36499999999999,17.52380952380953,10.714285714285712,9.454545454545453
836.0,16.36499999999999,17.52380952380953,10.714285714285712,9.454545454545453
837.0,16.36499999999999,17.52380952380953,10.714285714285712,9.454545454545453
838.0,16.36499999999999,17.52380952380953,10.714285714285712,9.454545454545453
839.0,16.36499999999999,17.52380952380953,10.714285714285712,9.454545454545453
840.0,16.36499999999999,17.52380952380953,10.714285714285712,9.454545454545453
841.0,16.36499999999999,17.52380952380953,10.714285714285712,9.454545454545453
842.0,16.324999999999992,17.476190476190492,10.714285714285712,9.454545454545453
843.0,16.324999999999992,17.476190476190492,10.714285714285712,9.454545454545453
844.0,16.324999999999992,17.476190476190492,10.714285714285712,9.454545454545453
845.0,16.324999999999992,17.476190476190492,10.714285714285712,9.454545454545453
846.0,16.324999999999992,17.476190476190492,10.714285714285712,9.454545454545453
847.0,16.324999999999992,17.476190476190492,10.714285714285712,9.454545454545453
848.0,16.324999999999992,17.476190476190492,10.714285714285712,9.454545454545453
849.0,16.324999999999992,17.476190476190492,10.714285714285712,9.454545454545453
850.0,16.275000000000002,17.41666666666666,10.714285714285712,9.454545454545453
851.0,16.275000000000002,17.41666666666666,10.714285714285712,9.454545454545453
852.0,16.275000000000002,17.41666666666666,10.714285714285712,9.454545454545453
853.0,16.275000000000002,17.41666666666666,10.714285714285712,9.454545454545453
854.0,16.275000000000002,17.41666666666666,10.714285714285712,9.454545454545453
855.0,16.275000000000002,17.41666666666666,10.714285714285712,9.454545454545453
856.0,16.209999999999994,17.33928571428573,10.714285714285712,9.454545454545453
857.0,16.209999999999994,17.33928571428573,10.714285714285712,9.454545454545453
858.0,16.209999999999994,17.33928571428573,10.714285714285712,9.454545454545453
859.0,16.209999999999994,17.33928571428573,10.714285714285712,9.454545454545453
860.0,16.209999999999994,17.33928571428573,10.714285714285712,9.454545454545453
861.0,16.209999999999994,17.33928571428573,10.714285714285712,9.454545454545453
862.0,16.209999999999994,17.33928571428573,10.714285714285712,9.454545454545453
863.0,16.209999999999994,17.33928571428573,10.714285714285712,9.454545454545453
864.0,16.209999999999994,17.33928571428573,10.714285714285712,9.454545454545453
865.0,16.209999999999994,17.33928571428573,10.714285714285712,9.454545454545453
866.0,16.049999999999994,17.148809523809533,10.714285714285712,9.454545454545453
867.0,16.049999999999994,17.148809523809533,10.714285714285712,9.454545454545453
868.0,16.049999999999994,17.148809523809533,10.714285714285712,9.454545454545453
869.0,16.049999999999994,17.148809523809533,10.714285714285712,9.454545454545453
870.0,16.049999999999994,17.148809523809533,10.714285714285712,9.454545454545453
871.0,15.915000000000004,16.98809523809524,10.714285714285712,9.454545454545453
872.0,15.915000000000004,16.98809523809524,10.714285714285712,9.454545454545453
873.0,15.915000000000004,16.98809523809524,10.714285714285712,9.454545454545453
874.0,15.915000000000004,16.98809523809524,10.714285714285712,9.454545454545453
875.0,15.760000000000009,16.803571428571434,10.714285714285712,9.454545454545453
876.0,15.684999999999995,16.714285714285715,10.714285714285712,9.454545454545453
877.0,15.684999999999995,16.714285714285715,10.714285714285712,9.454545454545453
878.0,15.684999999999995,16.714285714285715,10.714285714285712,9.454545454545453
879.0,15.595000000000008,16.607142857142875,10.714285714285712,9.454545454545453
880.0,15.595000000000008,16.607142857142875,10.714285714285712,9.454545454545453
881.0,15.505000000000004,16.500000000000018,10.714285714285712,9.454545454545453
882.0,15.505000000000004,16.500000000000018,10.714285714285712,9.454545454545453
883.0,15.409999999999995,16.500000000000018,10.714285714285712,7.7272727272727275
884.0,15.409999999999995,16.500000000000018,10.714285714285712,7.7272727272727275
885.0,16.174999999999997,17.38095238095238,10.95,7.999999999999998
886.0,16.174999999999997,17.38095238095238,10.95,7.999999999999998
887.0,16.174999999999997,17.38095238095238,10.95,7.999999999999998
888.0,16.100000000000012,17.29166666666666,10.95,7.999999999999998
889.0,16.100000000000012,17.29166666666666,10.95,7.999999999999998
890.0,16.025000000000006,17.202380952380953,10.95,7.999999999999998
891.0,16.025000000000006,17.202380952380953,10.95,7.999999999999998
892.0,16.025000000000006,17.202380952380953,10.95,7.999999999999998
893.0,16.025000000000006,17.202380952380953,10.95,7.999999999999998
894.0,16.025000000000006,17.202380952380953,10.95,7.999999999999998
895.0,16.025000000000006,17.202380952380953,10.95,7.999999999999998
896.0,16.025000000000006,17.202380952380953,10.95,7.999999999999998
897.0,16.025000000000006,17.202380952380953,10.95,7.999999999999998
898.0,15.890000000000006,17.04166666666668,10.95,7.999999999999998
899.0,15.780000000000008,17.04166666666668,9.85,7.999999999999998
900.0,15.780000000000008,17.04166666666668,9.85,7.999999999999998
901.0,15.625000000000002,16.85714285714286,9.85,7.999999999999998
902.0,15.625000000000002,16.85714285714286,9.85,7.999999999999998
903.0,15.445,16.75595238095238,9.85,6.416666666666667
904.0,15.445,16.75595238095238,9.85,6.416666666666667
905.0,15.445,16.75595238095238,9.85,6.416666666666667
906.0,15.445,16.75595238095238,9.85,6.416666666666667
907.0,15.445,16.75595238095238,9.85,6.416666666666667
908.0,15.445,16.75595238095238,9.85,6.416666666666667
909.0,15.340000000000002,16.63095238095238,9.85,6.416666666666667
910.0,15.340000000000002,16.63095238095238,9.85,6.416666666666667
911.0,15.340000000000002,16.63095238095238,9.85,6.416666666666667
912.0,15.340000000000002,16.63095238095238,9.85,6.416666666666667
913.0,15.340000000000002,16.63095238095238,9.85,6.416666666666667
914.0,15.340000000000002,16.63095238095238,9.85,6.416666666666667
915.0,15.340000000000002,16.63095238095238,9.85,6.416666666666667
916.0,15.340000000000002,16.63095238095238,9.85,6.416666666666667
917.0,15.195,16.458333333333325,9.85,6.416666666666667
918.0,15.195,16.458333333333325,9.85,6.416666666666667
919.0,15.195,16.458333333333325,9.85,6.416666666666667
920.0,15.195,16.458333333333325,9.85,6.416666666666667
921.0,15.195,16.458333333333325,9.85,6.416666666666667
922.0,15.195,16.458333333333325,9.85,6.416666666666667
923.0,15.195,16.458333333333325,9.85,6.416666666666667
924.0,15.195,16.458333333333325,9.85,6.416666666666667
925.0,15.195,16.458333333333325,9.85,6.416666666666667
926.0,15.090000000000005,16.458333333333325,9.26315789473684,5.923076923076923
927.0,15.090000000000005,16.458333333333325,9.26315789473684,5.923076923076923
928.0,15.090000000000005,16.458333333333325,9.26315789473684,5.923076923076923
929.0,15.090000000000005,16.458333333333325,9.26315789473684,5.923076923076923
930.0,15.090000000000005,16.458333333333325,9.26315789473684,5.923076923076923
931.0,15.090000000000005,16.458333333333325,9.26315789473684,5.923076923076923
932.0,15.090000000000005,16.458333333333325,9.26315789473684,5.923076923076923
933.0,15.090000000000005,16.458333333333325,9.26315789473684,5.923076923076923
934.0,14.969999999999997,16.3154761904762,9.26315789473684,5.923076923076923
935.0,14.969999999999997,16.3154761904762,9.26315789473684,5.923076923076923
936.0,14.874999999999995,16.3154761904762,8.263157894736844,5.923076923076923
937.0,15.869999999999997,17.3154761904762,9.210526315789474,6.923076923076923
938.0,15.869999999999997,17.3154761904762,9.210526315789474,6.923076923076923
939.0,15.869999999999997,17.3154761904762,9.210526315789474,6.923076923076923
940.0,15.869999999999997,17.3154761904762,9.210526315789474,6.923076923076923
941.0,15.869999999999997,17.3154761904762,9.210526315789474,6.923076923076923
942.0,15.869999999999997,17.3154761904762,9.210526315789474,6.923076923076923
943.0,15.554999999999994,16.94047619047619,9.210526315789474,6.923076923076923
944.0,15.554999999999994,16.94047619047619,9.210526315789474,6.923076923076923
945.0,15.454999999999997,16.821428571428573,9.210526315789474,6.923076923076923
946.0,15.375,16.72619047619048,9.210526315789474,6.923076923076923
947.0,15.275,16.60714285714286,9.210526315789474,6.923076923076923
948.0,15.275,16.60714285714286,9.210526315789474,6.923076923076923
949.0,15.275,16.60714285714286,9.210526315789474,6.923076923076923
950.0,15.275,16.60714285714286,9.210526315789474,6.923076923076923
951.0,15.275,16.60714285714286,9.210526315789474,6.923076923076923
952.0,15.275,16.60714285714286,9.210526315789474,6.923076923076923
953.0,15.275,16.60714285714286,9.210526315789474,6.923076923076923
954.0,15.275,16.60714285714286,9.210526315789474,6.923076923076923
955.0,15.275,16.60714285714286,9.210526315789474,6.923076923076923
956.0,15.275,16.60714285714286,9.210526315789474,6.923076923076923
957.0,15.275,16.60714285714286,9.210526315789474,6.923076923076923
958.0,15.275,16.60714285714286,9.210526315789474,6.923076923076923
959.0,15.124999999999996,16.42857142857143,9.210526315789474,6.923076923076923
960.0,15.124999999999996,16.42857142857143,9.210526315789474,6.923076923076923
961.0,15.124999999999996,16.42857142857143,9.210526315789474,6.923076923076923
962.0,15.124999999999996,16.42857142857143,9.210526315789474,6.923076923076923
963.0,15.124999999999996,16.42857142857143,9.210526315789474,6.923076923076923
964.0,15.124999999999996,16.42857142857143,9.210526315789474,6.923076923076923
965.0,15.124999999999996,16.42857142857143,9.210526315789474,6.923076923076923
966.0,15.124999999999996,16.42857142857143,9.210526315789474,6.923076923076923
967.0,15.124999999999996,16.42857142857143,9.210526315789474,6.923076923076923
968.0,15.124999999999996,16.42857142857143,9.210526315789474,6.923076923076923
969.0,15.124999999999996,16.42857142857143,9.210526315789474,6.923076923076923
970.0,15.124999999999996,16.42857142857143,9.210526315789474,6.923076923076923
971.0,15.124999999999996,16.42857142857143,9.210526315789474,6.923076923076923
972.0,15.004999999999997,16.285714285714278,9.210526315789474,6.923076923076923
973.0,15.004999999999997,16.285714285714278,9.210526315789474,6.923076923076923
974.0,15.004999999999997,16.285714285714278,9.210526315789474,6.923076923076923
975.0,15.004999999999997,16.285714285714278,9.210526315789474,6.923076923076923
976.0,15.004999999999997,16.285714285714278,9.210526315789474,6.923076923076923
977.0,15.004999999999997,16.285714285714278,9.210526315789474,6.923076923076923
978.0,15.004999999999997,16.285714285714278,9.210526315789474,6.923076923076923
979.0,15.004999999999997,16.285714285714278,9.210526315789474,6.923076923076923
980.0,15.004999999999997,16.285714285714278,9.210526315789474,6.923076923076923
981.0,15.004999999999997,16.285714285714278,9.210526315789474,6.923076923076923
982.0,15.004999999999997,16.285714285714278,9.210526315789474,6.923076923076923
983.0,15.004999999999997,16.285714285714278,9.210526315789474,6.923076923076923
984.0,15.004999999999997,16.285714285714278,9.210526315789474,6.923076923076923
985.0,15.004999999999997,16.285714285714278,9.210526315789474,6.923076923076923
986.0,15.004999999999997,16.285714285714278,9.210526315789474,6.923076923076923
987.0,15.004999999999997,16.285714285714278,9.210526315789474,6.923076923076923
988.0,14.81499999999999,16.285714285714278,7.555555555555555,6.5
989.0,15.809999999999997,17.285714285714278,8.555555555555557,7.428571428571429
990.0,15.809999999999997,17.285714285714278,8.555555555555557,7.428571428571429
991.0,15.719999999999997,17.178571428571434,8.555555555555557,7.428571428571429
992.0,15.600000000000009,17.178571428571434,7.222222222222223,7.428571428571429
993.0,15.519999999999998,17.083333333333332,7.222222222222223,7.428571428571429
994.0,15.519999999999998,17.083333333333332,7.222222222222223,7.428571428571429
995.0,15.400000000000004,16.94047619047618,7.222222222222223,7.428571428571429
996.0,15.400000000000004,16.94047619047618,7.222222222222223,7.428571428571429
997.0,15.400000000000004,16.94047619047618,7.222222222222223,7.428571428571429
998.0,15.400000000000004,16.94047619047618,7.222222222222223,7.428571428571429
999.0,15.290000000000008,16.809523809523796,7.222222222222223,7.428571428571429
1000.0,15.290000000000008,16.809523809523796,7.222222222222223,7.428571428571429
1001.0,15.290000000000008,16.809523809523796,7.222222222222223,7.428571428571429
1002.0,15.290000000000008,16.809523809523796,7.222222222222223,7.428571428571429
1003.0,15.290000000000008,16.809523809523796,7.222222222222223,7.428571428571429
1004.0,15.290000000000008,16.809523809523796,7.222222222222223,7.428571428571429
1005.0,15.290000000000008,16.809523809523796,7.222222222222223,7.428571428571429
1006.0,15.290000000000008,16.809523809523796,7.222222222222223,7.428571428571429
1007.0,15.290000000000008,16.809523809523796,7.222222222222223,7.428571428571429
1008.0,15.290000000000008,16.809523809523796,7.222222222222223,7.428571428571429
1009.0,15.290000000000008,16.809523809523796,7.222222222222223,7.428571428571429
1010.0,15.290000000000008,16.809523809523796,7.222222222222223,7.428571428571429
1011.0,15.290000000000008,16.809523809523796,7.222222222222223,7.428571428571429
1012.0,15.290000000000008,16.809523809523796,7.222222222222223,7.428571428571429
1013.0,15.185000000000004,16.684523809523828,7.222222222222223,7.428571428571429
1014.0,15.185000000000004,16.684523809523828,7.222222222222223,7.428571428571429
1015.0,15.185000000000004,16.684523809523828,7.222222222222223,7.428571428571429
1016.0,15.185000000000004,16.684523809523828,7.222222222222223,7.428571428571429
1017.0,15.185000000000004,16.684523809523828,7.222222222222223,7.428571428571429
1018.0,15.125000000000004,16.613095238095237,7.222222222222223,7.428571428571429
1019.0,15.125000000000004,16.613095238095237,7.222222222222223,7.428571428571429
1020.0,15.125000000000004,16.613095238095237,7.222222222222223,7.428571428571429
1021.0,15.125000000000004,16.613095238095237,7.222222222222223,7.428571428571429
1022.0,15.125000000000004,16.613095238095237,7.222222222222223,7.428571428571429
1023.0,15.125000000000004,16.613095238095237,7.222222222222223,7.428571428571429
1024.0,15.125000000000004,16.613095238095237,7.222222222222223,7.428571428571429
1025.0,15.125000000000004,16.613095238095237,7.222222222222223,7.428571428571429
1026.0,15.125000000000004,16.613095238095237,7.222222222222223,7.428571428571429
1027.0,15.125000000000004,16.613095238095237,7.222222222222223,7.428571428571429
1028.0,15.125000000000004,16.613095238095237,7.222222222222223,7.428571428571429
1029.0,15.125000000000004,16.613095238095237,7.222222222222223,7.428571428571429
1030.0,15.125000000000004,16.613095238095237,7.222222222222223,7.428571428571429
1031.0,15.125000000000004,16.613095238095237,7.222222222222223,7.428571428571429
1032.0,15.125000000000004,16.613095238095237,7.222222222222223,7.428571428571429
1033.0,15.125000000000004,16.613095238095237,7.222222222222223,7.428571428571429
1034.0,15.125000000000004,16.613095238095237,7.222222222222223,7.428571428571429
1035.0,15.125000000000004,16.613095238095237,7.222222222222223,7.428571428571429
1036.0,15.125000000000004,16.613095238095237,7.222222222222223,7.428571428571429
1037.0,15.125000000000004,16.613095238095237,7.222222222222223,7.428571428571429
1038.0,15.125000000000004,16.613095238095237,7.222222222222223,7.428571428571429
1039.0,15.125000000000004,16.613095238095237,7.222222222222223,7.428571428571429
1040.0,15.125000000000004,16.613095238095237,7.222222222222223,7.428571428571429
1041.0,16.12499999999999,17.613095238095237,8.222222222222223,8.428571428571429
1042.0,16.12499999999999,17.613095238095237,8.222222222222223,8.428571428571429
1043.0,16.12499999999999,17.613095238095237,8.222222222222223,8.428571428571429
1044.0,16.12499999999999,17.613095238095237,8.222222222222223,8.428571428571429
1045.0,16.12499999999999,17.613095238095237,8.222222222222223,8.428571428571429
1046.0,16.12499999999999,17.613095238095237,8.222222222222223,8.428571428571429
1047.0,16.12499999999999,17.613095238095237,8.222222222222223,8.428571428571429
1048.0,16.12499999999999,17.613095238095237,8.222222222222223,8.428571428571429
1049.0,16.12499999999999,17.613095238095237,8.222222222222223,8.428571428571429
1050.0,16.12499999999999,17.613095238095237,8.222222222222223,8.428571428571429
1051.0,16.12499999999999,17.613095238095237,8.222222222222223,8.428571428571429
1052.0,16.12499999999999,17.613095238095237,8.222222222222223,8.428571428571429
1053.0,16.12499999999999,17.613095238095237,8.222222222222223,8.428571428571429
1054.0,16.12499999999999,17.613095238095237,8.222222222222223,8.428571428571429
1055.0,16.12499999999999,17.613095238095237,8.222222222222223,8.428571428571429
1056.0,16.12499999999999,17.613095238095237,8.222222222222223,8.428571428571429
1057.0,16.12499999999999,17.613095238095237,8.222222222222223,8.428571428571429
1058.0,16.12499999999999,17.613095238095237,8.222222222222223,8.428571428571429
1059.0,16.12499999999999,17.613095238095237,8.222222222222223,8.428571428571429
1060.0,16.12499999999999,17.613095238095237,8.222222222222223,8.428571428571429
1061.0,16.12499999999999,17.613095238095237,8.222222222222223,8.428571428571429
1062.0,16.12499999999999,17.613095238095237,8.222222222222223,8.428571428571429
1063.0,16.12499999999999,17.613095238095237,8.222222222222223,8.428571428571429
1064.0,16.03,17.49999999999999,8.222222222222223,8.428571428571429
1065.0,16.03,17.49999999999999,8.222222222222223,8.428571428571429
1066.0,16.03,17.49999999999999,8.222222222222223,8.428571428571429
1067.0,16.03,17.49999999999999,8.222222222222223,8.428571428571429
1068.0,16.03,17.49999999999999,8.222222222222223,8.428571428571429
1069.0,16.03,17.49999999999999,8.222222222222223,8.428571428571429
1070.0,16.03,17.49999999999999,8.222222222222223,8.428571428571429
1071.0,16.03,17.49999999999999,8.222222222222223,8.428571428571429
1072.0,16.03,17.49999999999999,8.222222222222223,8.428571428571429
1073.0,16.03,17.49999999999999,8.222222222222223,8.428571428571429
1074.0,15.965,17.422619047619055,8.222222222222223,8.428571428571429
1075.0,15.859999999999985,17.29761904761904,8.222222222222223,8.428571428571429
1076.0,15.859999999999985,17.29761904761904,8.222222222222223,8.428571428571429
1077.0,15.859999999999985,17.29761904761904,8.222222222222223,8.428571428571429
1078.0,15.859999999999985,17.29761904761904,8.222222222222223,8.428571428571429
1079.0,15.859999999999985,17.29761904761904,8.222222222222223,8.428571428571429
1080.0,15.859999999999985,17.29761904761904,8.222222222222223,8.428571428571429
1081.0,15.859999999999985,17.29761904761904,8.222222222222223,8.428571428571429
1082.0,15.859999999999985,17.29761904761904,8.222222222222223,8.428571428571429
1083.0,15.859999999999985,17.29761904761904,8.222222222222223,8.428571428571429
1084.0,15.859999999999985,17.29761904761904,8.222222222222223,8.428571428571429
1085.0,15.859999999999985,17.29761904761904,8.222222222222223,8.428571428571429
1086.0,15.859999999999985,17.29761904761904,8.222222222222223,8.428571428571429
1087.0,15.859999999999985,17.29761904761904,8.222222222222223,8.428571428571429
1088.0,15.859999999999985,17.29761904761904,8.222222222222223,8.428571428571429
1089.0,15.859999999999985,17.29761904761904,8.222222222222223,8.428571428571429
1090.0,15.859999999999985,17.29761904761904,8.222222222222223,8.428571428571429
1091.0,15.859999999999985,17.29761904761904,8.222222222222223,8.428571428571429
1092.0,15.859999999999985,17.29761904761904,8.222222222222223,8.428571428571429
