"tick","Agents","Occasion","Private new","Lease"
1.0,9.700000000000001,10.571428571428575,5.666666666666667,3.5
2.0,9.700000000000001,10.571428571428575,5.666666666666667,3.5
3.0,9.700000000000001,10.571428571428575,5.666666666666667,3.5
4.0,9.700000000000001,10.571428571428575,5.666666666666667,3.5
5.0,9.700000000000001,10.571428571428575,5.666666666666667,3.5
6.0,9.700000000000001,10.571428571428575,5.666666666666667,3.5
7.0,9.700000000000001,10.571428571428575,5.666666666666667,3.5
8.0,9.700000000000001,10.571428571428575,5.666666666666667,3.5
9.0,9.700000000000001,10.571428571428575,5.666666666666667,3.5
10.0,9.700000000000001,10.571428571428575,5.666666666666667,3.5
11.0,9.700000000000001,10.571428571428575,5.666666666666667,3.5
12.0,9.700000000000001,10.571428571428575,5.666666666666667,3.5
13.0,9.700000000000001,10.571428571428575,5.666666666666667,3.5
14.0,9.700000000000001,10.571428571428575,5.666666666666667,3.5
15.0,9.700000000000001,10.571428571428575,5.666666666666667,3.5
16.0,9.700000000000001,10.571428571428575,5.666666666666667,3.5
17.0,9.700000000000001,10.571428571428575,5.666666666666667,3.5
18.0,9.700000000000001,10.571428571428575,5.666666666666667,3.5
19.0,9.700000000000001,10.571428571428575,5.666666666666667,3.5
20.0,9.700000000000001,10.571428571428575,5.666666666666667,3.5
21.0,9.700000000000001,10.571428571428575,5.666666666666667,3.5
22.0,9.700000000000001,10.571428571428575,5.666666666666667,3.5
23.0,9.700000000000001,10.571428571428575,5.666666666666667,3.5
24.0,9.700000000000001,10.571428571428575,5.666666666666667,3.5
25.0,9.700000000000001,10.571428571428575,5.666666666666667,3.5
26.0,9.700000000000001,10.571428571428575,5.666666666666667,3.5
27.0,9.700000000000001,10.571428571428575,5.666666666666667,3.5
28.0,9.700000000000001,10.571428571428575,5.666666666666667,3.5
29.0,9.700000000000001,10.571428571428575,5.666666666666667,3.5
30.0,9.700000000000001,10.571428571428575,5.666666666666667,3.5
31.0,9.700000000000001,10.571428571428575,5.666666666666667,3.5
32.0,9.700000000000001,10.571428571428575,5.666666666666667,3.5
33.0,9.700000000000001,10.571428571428575,5.666666666666667,3.5
34.0,9.700000000000001,10.571428571428575,5.666666666666667,3.5
35.0,9.700000000000001,10.571428571428575,5.666666666666667,3.5
36.0,9.700000000000001,10.571428571428575,5.666666666666667,3.5
37.0,9.700000000000001,10.571428571428575,5.666666666666667,3.5
38.0,9.700000000000001,10.571428571428575,5.666666666666667,3.5
39.0,9.700000000000001,10.571428571428575,5.666666666666667,3.5
40.0,9.700000000000001,10.571428571428575,5.666666666666667,3.5
41.0,9.700000000000001,10.571428571428575,5.666666666666667,3.5
42.0,9.700000000000001,10.571428571428575,5.666666666666667,3.5
43.0,9.700000000000001,10.571428571428575,5.666666666666667,3.5
44.0,9.700000000000001,10.571428571428575,5.666666666666667,3.5
45.0,9.700000000000001,10.571428571428575,5.666666666666667,3.5
46.0,9.700000000000001,10.571428571428575,5.666666666666667,3.5
47.0,9.700000000000001,10.571428571428575,5.666666666666667,3.5
48.0,9.700000000000001,10.571428571428575,5.666666666666667,3.5
49.0,9.700000000000001,10.571428571428575,5.666666666666667,3.5
50.0,9.700000000000001,10.571428571428575,5.666666666666667,3.5
51.0,9.700000000000001,10.571428571428575,5.666666666666667,3.5
52.0,9.700000000000001,10.571428571428575,5.666666666666667,3.5
53.0,10.700000000000001,11.571428571428575,6.666666666666667,4.5
54.0,10.700000000000001,11.571428571428575,6.666666666666667,4.5
55.0,10.700000000000001,11.571428571428575,6.666666666666667,4.5
56.0,10.700000000000001,11.571428571428575,6.666666666666667,4.5
57.0,10.700000000000001,11.571428571428575,6.666666666666667,4.5
58.0,10.605000000000002,11.458333333333329,6.666666666666667,4.5
59.0,10.605000000000002,11.458333333333329,6.666666666666667,4.5
60.0,10.605000000000002,11.458333333333329,6.666666666666667,4.5
61.0,10.605000000000002,11.458333333333329,6.666666666666667,4.5
62.0,10.520000000000005,11.357142857142856,6.666666666666667,4.5
63.0,10.520000000000005,11.357142857142856,6.666666666666667,4.5
64.0,10.520000000000005,11.357142857142856,6.666666666666667,4.5
65.0,10.520000000000005,11.357142857142856,6.666666666666667,4.5
66.0,10.520000000000005,11.357142857142856,6.666666666666667,4.5
67.0,10.520000000000005,11.357142857142856,6.666666666666667,4.5
68.0,10.520000000000005,11.357142857142856,6.666666666666667,4.5
69.0,10.520000000000005,11.357142857142856,6.666666666666667,4.5
70.0,10.520000000000005,11.357142857142856,6.666666666666667,4.5
71.0,10.520000000000005,11.357142857142856,6.666666666666667,4.5
72.0,10.520000000000005,11.357142857142856,6.666666666666667,4.5
73.0,10.520000000000005,11.357142857142856,6.666666666666667,4.5
74.0,10.520000000000005,11.357142857142856,6.666666666666667,4.5
75.0,10.434999999999993,11.255952380952374,6.666666666666667,4.5
76.0,10.434999999999993,11.255952380952374,6.666666666666667,4.5
77.0,10.434999999999993,11.255952380952374,6.666666666666667,4.5
78.0,10.434999999999993,11.255952380952374,6.666666666666667,4.5
79.0,10.434999999999993,11.255952380952374,6.666666666666667,4.5
80.0,10.434999999999993,11.255952380952374,6.666666666666667,4.5
81.0,10.434999999999993,11.255952380952374,6.666666666666667,4.5
82.0,10.434999999999993,11.255952380952374,6.666666666666667,4.5
83.0,10.434999999999993,11.255952380952374,6.666666666666667,4.5
84.0,10.434999999999993,11.255952380952374,6.666666666666667,4.5
85.0,10.434999999999993,11.255952380952374,6.666666666666667,4.5
86.0,10.434999999999993,11.255952380952374,6.666666666666667,4.5
87.0,10.434999999999993,11.255952380952374,6.666666666666667,4.5
88.0,10.434999999999993,11.255952380952374,6.666666666666667,4.5
89.0,10.434999999999993,11.255952380952374,6.666666666666667,4.5
90.0,10.434999999999993,11.255952380952374,6.666666666666667,4.5
91.0,10.434999999999993,11.255952380952374,6.666666666666667,4.5
92.0,10.434999999999993,11.255952380952374,6.666666666666667,4.5
93.0,10.434999999999993,11.255952380952374,6.666666666666667,4.5
94.0,10.434999999999993,11.255952380952374,6.666666666666667,4.5
95.0,10.434999999999993,11.255952380952374,6.666666666666667,4.5
96.0,10.434999999999993,11.255952380952374,6.666666666666667,4.5
97.0,10.434999999999993,11.255952380952374,6.666666666666667,4.5
98.0,10.434999999999993,11.255952380952374,6.666666666666667,4.5
99.0,10.434999999999993,11.255952380952374,6.666666666666667,4.5
100.0,10.434999999999993,11.255952380952374,6.666666666666667,4.5
101.0,10.434999999999993,11.255952380952374,6.666666666666667,4.5
102.0,10.434999999999993,11.255952380952374,6.666666666666667,4.5
103.0,10.434999999999993,11.255952380952374,6.666666666666667,4.5
104.0,10.434999999999993,11.255952380952374,6.666666666666667,4.5
105.0,11.434999999999993,12.255952380952374,7.666666666666667,5.5
106.0,11.434999999999993,12.255952380952374,7.666666666666667,5.5
107.0,11.434999999999993,12.255952380952374,7.666666666666667,5.5
108.0,11.434999999999993,12.255952380952374,7.666666666666667,5.5
109.0,11.434999999999993,12.255952380952374,7.666666666666667,5.5
110.0,11.434999999999993,12.255952380952374,7.666666666666667,5.5
111.0,11.434999999999993,12.255952380952374,7.666666666666667,5.5
112.0,11.434999999999993,12.255952380952374,7.666666666666667,5.5
113.0,11.434999999999993,12.255952380952374,7.666666666666667,5.5
114.0,11.434999999999993,12.255952380952374,7.666666666666667,5.5
115.0,11.434999999999993,12.255952380952374,7.666666666666667,5.5
116.0,11.434999999999993,12.255952380952374,7.666666666666667,5.5
117.0,11.434999999999993,12.255952380952374,7.666666666666667,5.5
118.0,11.434999999999993,12.255952380952374,7.666666666666667,5.5
119.0,11.434999999999993,12.255952380952374,7.666666666666667,5.5
120.0,11.434999999999993,12.255952380952374,7.666666666666667,5.5
121.0,11.434999999999993,12.255952380952374,7.666666666666667,5.5
122.0,11.434999999999993,12.255952380952374,7.666666666666667,5.5
123.0,11.434999999999993,12.255952380952374,7.666666666666667,5.5
124.0,11.434999999999993,12.255952380952374,7.666666666666667,5.5
125.0,11.434999999999993,12.255952380952374,7.666666666666667,5.5
126.0,11.434999999999993,12.255952380952374,7.666666666666667,5.5
127.0,11.434999999999993,12.255952380952374,7.666666666666667,5.5
128.0,11.434999999999993,12.255952380952374,7.666666666666667,5.5
129.0,11.434999999999993,12.255952380952374,7.666666666666667,5.5
130.0,11.434999999999993,12.255952380952374,7.666666666666667,5.5
131.0,11.434999999999993,12.255952380952374,7.666666666666667,5.5
132.0,11.434999999999993,12.255952380952374,7.666666666666667,5.5
133.0,11.335000000000004,12.136904761904763,7.666666666666667,5.5
134.0,11.335000000000004,12.136904761904763,7.666666666666667,5.5
135.0,11.335000000000004,12.136904761904763,7.666666666666667,5.5
136.0,11.335000000000004,12.136904761904763,7.666666666666667,5.5
137.0,11.335000000000004,12.136904761904763,7.666666666666667,5.5
138.0,11.335000000000004,12.136904761904763,7.666666666666667,5.5
139.0,11.335000000000004,12.136904761904763,7.666666666666667,5.5
140.0,11.335000000000004,12.136904761904763,7.666666666666667,5.5
141.0,11.335000000000004,12.136904761904763,7.666666666666667,5.5
142.0,11.335000000000004,12.136904761904763,7.666666666666667,5.5
143.0,11.335000000000004,12.136904761904763,7.666666666666667,5.5
144.0,11.335000000000004,12.136904761904763,7.666666666666667,5.5
145.0,11.335000000000004,12.136904761904763,7.666666666666667,5.5
146.0,11.335000000000004,12.136904761904763,7.666666666666667,5.5
147.0,11.335000000000004,12.136904761904763,7.666666666666667,5.5
148.0,11.335000000000004,12.136904761904763,7.666666666666667,5.5
149.0,11.335000000000004,12.136904761904763,7.666666666666667,5.5
150.0,11.335000000000004,12.136904761904763,7.666666666666667,5.5
151.0,11.335000000000004,12.136904761904763,7.666666666666667,5.5
152.0,11.335000000000004,12.136904761904763,7.666666666666667,5.5
153.0,11.335000000000004,12.136904761904763,7.666666666666667,5.5
154.0,11.335000000000004,12.136904761904763,7.666666666666667,5.5
155.0,11.335000000000004,12.136904761904763,7.666666666666667,5.5
156.0,11.335000000000004,12.136904761904763,7.666666666666667,5.5
157.0,12.335000000000004,13.136904761904763,8.666666666666668,6.5
158.0,12.335000000000004,13.136904761904763,8.666666666666668,6.5
159.0,12.335000000000004,13.136904761904763,8.666666666666668,6.5
160.0,12.335000000000004,13.136904761904763,8.666666666666668,6.5
161.0,12.335000000000004,13.136904761904763,8.666666666666668,6.5
162.0,12.335000000000004,13.136904761904763,8.666666666666668,6.5
163.0,12.335000000000004,13.136904761904763,8.666666666666668,6.5
164.0,12.335000000000004,13.136904761904763,8.666666666666668,6.5
165.0,12.335000000000004,13.136904761904763,8.666666666666668,6.5
166.0,12.335000000000004,13.136904761904763,8.666666666666668,6.5
167.0,12.335000000000004,13.136904761904763,8.666666666666668,6.5
168.0,12.335000000000004,13.136904761904763,8.666666666666668,6.5
169.0,12.335000000000004,13.136904761904763,8.666666666666668,6.5
170.0,12.335000000000004,13.136904761904763,8.666666666666668,6.5
171.0,12.335000000000004,13.136904761904763,8.666666666666668,6.5
172.0,12.335000000000004,13.136904761904763,8.666666666666668,6.5
173.0,12.249999999999998,13.035714285714283,8.666666666666668,6.5
174.0,12.249999999999998,13.035714285714283,8.666666666666668,6.5
175.0,12.249999999999998,13.035714285714283,8.666666666666668,6.5
176.0,12.249999999999998,13.035714285714283,8.666666666666668,6.5
177.0,12.200000000000005,12.976190476190466,8.666666666666668,6.5
178.0,12.159999999999998,12.92857142857143,8.666666666666668,6.5
179.0,12.159999999999998,12.92857142857143,8.666666666666668,6.5
180.0,12.159999999999998,12.92857142857143,8.666666666666668,6.5
181.0,12.159999999999998,12.92857142857143,8.666666666666668,6.5
182.0,12.159999999999998,12.92857142857143,8.666666666666668,6.5
183.0,12.159999999999998,12.92857142857143,8.666666666666668,6.5
184.0,12.159999999999998,12.92857142857143,8.666666666666668,6.5
185.0,12.159999999999998,12.92857142857143,8.666666666666668,6.5
186.0,12.159999999999998,12.92857142857143,8.666666666666668,6.5
187.0,12.159999999999998,12.92857142857143,8.666666666666668,6.5
188.0,12.159999999999998,12.92857142857143,8.666666666666668,6.5
189.0,12.159999999999998,12.92857142857143,8.666666666666668,6.5
190.0,12.085000000000004,12.839285714285712,8.666666666666668,6.5
191.0,12.085000000000004,12.839285714285712,8.666666666666668,6.5
192.0,12.085000000000004,12.839285714285712,8.666666666666668,6.5
193.0,12.085000000000004,12.839285714285712,8.666666666666668,6.5
194.0,12.085000000000004,12.839285714285712,8.666666666666668,6.5
195.0,12.085000000000004,12.839285714285712,8.666666666666668,6.5
196.0,12.085000000000004,12.839285714285712,8.666666666666668,6.5
197.0,12.085000000000004,12.839285714285712,8.666666666666668,6.5
198.0,12.085000000000004,12.839285714285712,8.666666666666668,6.5
199.0,12.085000000000004,12.839285714285712,8.666666666666668,6.5
200.0,12.085000000000004,12.839285714285712,8.666666666666668,6.5
201.0,12.085000000000004,12.839285714285712,8.666666666666668,6.5
202.0,12.085000000000004,12.839285714285712,8.666666666666668,6.5
203.0,12.085000000000004,12.839285714285712,8.666666666666668,6.5
204.0,12.039999999999997,12.785714285714285,8.666666666666668,6.5
205.0,12.039999999999997,12.785714285714285,8.666666666666668,6.5
206.0,12.039999999999997,12.785714285714285,8.666666666666668,6.5
207.0,11.944999999999999,12.672619047619051,8.666666666666668,6.5
208.0,11.944999999999999,12.672619047619051,8.666666666666668,6.5
209.0,12.944999999999999,13.672619047619051,9.666666666666668,7.5
210.0,12.944999999999999,13.672619047619051,9.666666666666668,7.5
211.0,12.944999999999999,13.672619047619051,9.666666666666668,7.5
212.0,12.825,13.5297619047619,9.666666666666668,7.5
213.0,12.825,13.5297619047619,9.666666666666668,7.5
214.0,12.720000000000004,13.404761904761914,9.666666666666668,7.5
215.0,12.720000000000004,13.404761904761914,9.666666666666668,7.5
216.0,12.720000000000004,13.404761904761914,9.666666666666668,7.5
217.0,12.720000000000004,13.404761904761914,9.666666666666668,7.5
218.0,12.720000000000004,13.404761904761914,9.666666666666668,7.5
219.0,12.720000000000004,13.404761904761914,9.666666666666668,7.5
220.0,12.720000000000004,13.404761904761914,9.666666666666668,7.5
221.0,12.720000000000004,13.404761904761914,9.666666666666668,7.5
222.0,12.634999999999996,13.404761904761914,9.347826086956523,6.666666666666667
223.0,12.634999999999996,13.404761904761914,9.347826086956523,6.666666666666667
224.0,12.634999999999996,13.404761904761914,9.347826086956523,6.666666666666667
225.0,12.600000000000001,13.363095238095244,9.347826086956523,6.666666666666667
226.0,12.600000000000001,13.363095238095244,9.347826086956523,6.666666666666667
227.0,12.600000000000001,13.363095238095244,9.347826086956523,6.666666666666667
228.0,12.600000000000001,13.363095238095244,9.347826086956523,6.666666666666667
229.0,12.600000000000001,13.363095238095244,9.347826086956523,6.666666666666667
230.0,12.600000000000001,13.363095238095244,9.347826086956523,6.666666666666667
231.0,12.600000000000001,13.363095238095244,9.347826086956523,6.666666666666667
232.0,12.600000000000001,13.363095238095244,9.347826086956523,6.666666666666667
233.0,12.600000000000001,13.363095238095244,9.347826086956523,6.666666666666667
234.0,12.600000000000001,13.363095238095244,9.347826086956523,6.666666666666667
235.0,12.520000000000003,13.267857142857139,9.347826086956523,6.666666666666667
236.0,12.520000000000003,13.267857142857139,9.347826086956523,6.666666666666667
237.0,12.520000000000003,13.267857142857139,9.347826086956523,6.666666666666667
238.0,12.520000000000003,13.267857142857139,9.347826086956523,6.666666666666667
239.0,12.520000000000003,13.267857142857139,9.347826086956523,6.666666666666667
240.0,12.520000000000003,13.267857142857139,9.347826086956523,6.666666666666667
241.0,12.520000000000003,13.267857142857139,9.347826086956523,6.666666666666667
242.0,12.520000000000003,13.267857142857139,9.347826086956523,6.666666666666667
243.0,12.445000000000004,13.178571428571429,9.347826086956523,6.666666666666667
244.0,12.445000000000004,13.178571428571429,9.347826086956523,6.666666666666667
245.0,12.445000000000004,13.178571428571429,9.347826086956523,6.666666666666667
246.0,12.445000000000004,13.178571428571429,9.347826086956523,6.666666666666667
247.0,12.384999999999998,13.10714285714286,9.347826086956523,6.666666666666667
248.0,12.384999999999998,13.10714285714286,9.347826086956523,6.666666666666667
249.0,12.384999999999998,13.10714285714286,9.347826086956523,6.666666666666667
250.0,12.384999999999998,13.10714285714286,9.347826086956523,6.666666666666667
251.0,12.384999999999998,13.10714285714286,9.347826086956523,6.666666666666667
252.0,12.384999999999998,13.10714285714286,9.347826086956523,6.666666666666667
253.0,12.384999999999998,13.10714285714286,9.347826086956523,6.666666666666667
254.0,12.289999999999992,12.994047619047619,9.347826086956523,6.666666666666667
255.0,12.289999999999992,12.994047619047619,9.347826086956523,6.666666666666667
256.0,12.289999999999992,12.994047619047619,9.347826086956523,6.666666666666667
257.0,12.289999999999992,12.994047619047619,9.347826086956523,6.666666666666667
258.0,12.289999999999992,12.994047619047619,9.347826086956523,6.666666666666667
259.0,12.289999999999992,12.994047619047619,9.347826086956523,6.666666666666667
260.0,12.289999999999992,12.994047619047619,9.347826086956523,6.666666666666667
261.0,12.985000000000005,13.630952380952381,10.347826086956523,7.666666666666667
262.0,12.985000000000005,13.630952380952381,10.347826086956523,7.666666666666667
263.0,12.985000000000005,13.630952380952381,10.347826086956523,7.666666666666667
264.0,12.985000000000005,13.630952380952381,10.347826086956523,7.666666666666667
265.0,12.985000000000005,13.630952380952381,10.347826086956523,7.666666666666667
266.0,12.985000000000005,13.630952380952381,10.347826086956523,7.666666666666667
267.0,12.935000000000008,13.571428571428575,10.347826086956523,7.666666666666667
268.0,12.935000000000008,13.571428571428575,10.347826086956523,7.666666666666667
269.0,12.785000000000014,13.392857142857142,10.347826086956523,7.666666666666667
270.0,12.785000000000014,13.392857142857142,10.347826086956523,7.666666666666667
271.0,12.785000000000014,13.392857142857142,10.347826086956523,7.666666666666667
272.0,12.785000000000014,13.392857142857142,10.347826086956523,7.666666666666667
273.0,12.725000000000005,13.321428571428573,10.347826086956523,7.666666666666667
274.0,12.725000000000005,13.321428571428573,10.347826086956523,7.666666666666667
275.0,12.725000000000005,13.321428571428573,10.347826086956523,7.666666666666667
276.0,12.725000000000005,13.321428571428573,10.347826086956523,7.666666666666667
277.0,12.725000000000005,13.321428571428573,10.347826086956523,7.666666666666667
278.0,12.630000000000004,13.208333333333337,10.347826086956523,7.666666666666667
279.0,12.630000000000004,13.208333333333337,10.347826086956523,7.666666666666667
280.0,12.630000000000004,13.208333333333337,10.347826086956523,7.666666666666667
281.0,12.630000000000004,13.208333333333337,10.347826086956523,7.666666666666667
282.0,12.519999999999998,13.130952380952392,9.956521739130435,7.666666666666667
283.0,12.519999999999998,13.130952380952392,9.956521739130435,7.666666666666667
284.0,12.519999999999998,13.130952380952392,9.956521739130435,7.666666666666667
285.0,12.519999999999998,13.130952380952392,9.956521739130435,7.666666666666667
286.0,12.519999999999998,13.130952380952392,9.956521739130435,7.666666666666667
287.0,12.474999999999996,13.07738095238096,9.956521739130435,7.666666666666667
288.0,12.474999999999996,13.07738095238096,9.956521739130435,7.666666666666667
289.0,12.474999999999996,13.07738095238096,9.956521739130435,7.666666666666667
290.0,12.369999999999992,12.95238095238095,9.956521739130435,7.666666666666667
291.0,12.369999999999992,12.95238095238095,9.956521739130435,7.666666666666667
292.0,12.369999999999992,12.95238095238095,9.956521739130435,7.666666666666667
293.0,12.369999999999992,12.95238095238095,9.956521739130435,7.666666666666667
294.0,12.369999999999992,12.95238095238095,9.956521739130435,7.666666666666667
295.0,12.369999999999992,12.95238095238095,9.956521739130435,7.666666666666667
296.0,12.369999999999992,12.95238095238095,9.956521739130435,7.666666666666667
297.0,12.369999999999992,12.95238095238095,9.956521739130435,7.666666666666667
298.0,12.369999999999992,12.95238095238095,9.956521739130435,7.666666666666667
299.0,12.369999999999992,12.95238095238095,9.956521739130435,7.666666666666667
300.0,12.369999999999992,12.95238095238095,9.956521739130435,7.666666666666667
301.0,12.369999999999992,12.95238095238095,9.956521739130435,7.666666666666667
302.0,12.299999999999997,12.869047619047622,9.956521739130435,7.666666666666667
303.0,12.299999999999997,12.869047619047622,9.956521739130435,7.666666666666667
304.0,12.16,12.755952380952388,10.0,6.9
305.0,12.16,12.755952380952388,10.0,6.9
306.0,12.16,12.755952380952388,10.0,6.9
307.0,12.16,12.755952380952388,10.0,6.9
308.0,12.12,12.708333333333332,10.0,6.9
309.0,12.12,12.708333333333332,10.0,6.9
310.0,12.12,12.708333333333332,10.0,6.9
311.0,12.12,12.708333333333332,10.0,6.9
312.0,12.12,12.708333333333332,10.0,6.9
313.0,12.904999999999992,13.452380952380956,11.0,7.9
314.0,12.904999999999992,13.452380952380956,11.0,7.9
315.0,12.904999999999992,13.452380952380956,11.0,7.9
316.0,12.904999999999992,13.452380952380956,11.0,7.9
317.0,12.904999999999992,13.452380952380956,11.0,7.9
318.0,12.904999999999992,13.452380952380956,11.0,7.9
319.0,12.904999999999992,13.452380952380956,11.0,7.9
320.0,12.809999999999999,13.339285714285717,11.0,7.9
321.0,12.725000000000003,13.238095238095239,11.0,7.9
322.0,12.725000000000003,13.238095238095239,11.0,7.9
323.0,12.64,13.136904761904766,11.0,7.9
324.0,12.64,13.136904761904766,11.0,7.9
325.0,12.64,13.136904761904766,11.0,7.9
326.0,12.64,13.136904761904766,11.0,7.9
327.0,12.560000000000002,13.041666666666663,11.0,7.9
328.0,12.560000000000002,13.041666666666663,11.0,7.9
329.0,12.560000000000002,13.041666666666663,11.0,7.9
330.0,12.560000000000002,13.041666666666663,11.0,7.9
331.0,12.560000000000002,13.041666666666663,11.0,7.9
332.0,12.560000000000002,13.041666666666663,11.0,7.9
333.0,12.560000000000002,13.041666666666663,11.0,7.9
334.0,12.519999999999996,12.994047619047612,11.0,7.9
335.0,12.519999999999996,12.994047619047612,11.0,7.9
336.0,12.444999999999995,12.904761904761903,11.0,7.9
337.0,12.444999999999995,12.904761904761903,11.0,7.9
338.0,12.444999999999995,12.904761904761903,11.0,7.9
339.0,12.444999999999995,12.904761904761903,11.0,7.9
340.0,12.444999999999995,12.904761904761903,11.0,7.9
341.0,12.374999999999995,12.821428571428568,11.0,7.9
342.0,12.329999999999995,12.767857142857146,11.0,7.9
343.0,12.329999999999995,12.767857142857146,11.0,7.9
344.0,12.329999999999995,12.767857142857146,11.0,7.9
345.0,12.329999999999995,12.767857142857146,11.0,7.9
346.0,12.255,12.678571428571436,11.0,7.9
347.0,12.285000000000007,12.714285714285717,11.0,7.9
348.0,12.285000000000007,12.714285714285717,11.0,7.9
349.0,12.285000000000007,12.714285714285717,11.0,7.9
350.0,12.235,12.654761904761902,11.0,7.9
351.0,12.235,12.654761904761902,11.0,7.9
352.0,12.235,12.654761904761902,11.0,7.9
353.0,12.235,12.654761904761902,11.0,7.9
354.0,12.235,12.654761904761902,11.0,7.9
355.0,12.235,12.654761904761902,11.0,7.9
356.0,12.235,12.654761904761902,11.0,7.9
357.0,12.235,12.654761904761902,11.0,7.9
358.0,12.160000000000004,12.565476190476183,11.0,7.9
359.0,12.160000000000004,12.565476190476183,11.0,7.9
360.0,12.090000000000003,12.482142857142863,11.0,7.9
361.0,12.090000000000003,12.482142857142863,11.0,7.9
362.0,12.090000000000003,12.482142857142863,11.0,7.9
363.0,12.090000000000003,12.482142857142863,11.0,7.9
364.0,12.090000000000003,12.482142857142863,11.0,7.9
365.0,12.904999999999996,13.261904761904766,12.0,8.9
366.0,12.904999999999996,13.261904761904766,12.0,8.9
367.0,12.904999999999996,13.261904761904766,12.0,8.9
368.0,12.904999999999996,13.261904761904766,12.0,8.9
369.0,12.904999999999996,13.261904761904766,12.0,8.9
370.0,12.904999999999996,13.261904761904766,12.0,8.9
371.0,12.904999999999996,13.261904761904766,12.0,8.9
372.0,12.904999999999996,13.261904761904766,12.0,8.9
373.0,12.904999999999996,13.261904761904766,12.0,8.9
374.0,12.904999999999996,13.261904761904766,12.0,8.9
375.0,12.904999999999996,13.261904761904766,12.0,8.9
376.0,12.809999999999997,13.148809523809527,12.0,8.9
377.0,12.809999999999997,13.148809523809527,12.0,8.9
378.0,12.809999999999997,13.148809523809527,12.0,8.9
379.0,12.809999999999997,13.148809523809527,12.0,8.9
380.0,12.809999999999997,13.148809523809527,12.0,8.9
381.0,12.685000000000002,13.0,12.0,8.9
382.0,12.685000000000002,13.0,12.0,8.9
383.0,12.689999999999998,13.005952380952385,12.0,8.9
384.0,12.689999999999998,13.005952380952385,12.0,8.9
385.0,12.689999999999998,13.005952380952385,12.0,8.9
386.0,12.689999999999998,13.005952380952385,12.0,8.9
387.0,12.689999999999998,13.005952380952385,12.0,8.9
388.0,12.689999999999998,13.005952380952385,12.0,8.9
389.0,12.689999999999998,13.005952380952385,12.0,8.9
390.0,12.689999999999998,13.005952380952385,12.0,8.9
391.0,12.689999999999998,13.005952380952385,12.0,8.9
392.0,12.689999999999998,13.005952380952385,12.0,8.9
393.0,12.689999999999998,13.005952380952385,12.0,8.9
394.0,12.689999999999998,13.005952380952385,12.0,8.9
395.0,12.619999999999992,12.922619047619051,12.0,8.9
396.0,12.525000000000004,12.809523809523814,12.0,8.9
397.0,12.424999999999992,12.690476190476192,12.0,8.9
398.0,12.389999999999993,12.648809523809522,12.0,8.9
399.0,12.335,12.648809523809522,12.0,7.8
400.0,12.335,12.648809523809522,12.0,7.8
401.0,12.335,12.648809523809522,12.0,7.8
402.0,12.335,12.648809523809522,12.0,7.8
403.0,12.285000000000004,12.58928571428571,12.0,7.8
404.0,12.285000000000004,12.58928571428571,12.0,7.8
405.0,12.19,12.476190476190476,12.0,7.8
406.0,12.19,12.476190476190476,12.0,7.8
407.0,12.004999999999995,12.255952380952383,12.0,7.8
408.0,12.004999999999995,12.255952380952383,12.0,7.8
409.0,12.004999999999995,12.255952380952383,12.0,7.8
410.0,12.004999999999995,12.255952380952383,12.0,7.8
411.0,12.004999999999995,12.255952380952383,12.0,7.8
412.0,12.004999999999995,12.255952380952383,12.0,7.8
413.0,12.004999999999995,12.255952380952383,12.0,7.8
414.0,12.004999999999995,12.255952380952383,12.0,7.8
415.0,12.004999999999995,12.255952380952383,12.0,7.8
416.0,12.004999999999995,12.255952380952383,12.0,7.8
417.0,12.855,13.232142857142854,12.363636363636365,7.6000000000000005
418.0,12.760000000000003,13.119047619047626,12.363636363636365,7.6000000000000005
419.0,12.760000000000003,13.119047619047626,12.363636363636365,7.6000000000000005
420.0,12.760000000000003,13.119047619047626,12.363636363636365,7.6000000000000005
421.0,12.709999999999999,13.059523809523814,12.363636363636365,7.6000000000000005
422.0,12.709999999999999,13.059523809523814,12.363636363636365,7.6000000000000005
423.0,12.709999999999999,13.059523809523814,12.363636363636365,7.6000000000000005
424.0,12.665,13.005952380952385,12.363636363636365,7.6000000000000005
425.0,12.665,13.005952380952385,12.363636363636365,7.6000000000000005
426.0,12.665,13.005952380952385,12.363636363636365,7.6000000000000005
427.0,12.569999999999999,12.892857142857142,12.363636363636365,7.6000000000000005
428.0,12.569999999999999,12.892857142857142,12.363636363636365,7.6000000000000005
429.0,12.569999999999999,12.892857142857142,12.363636363636365,7.6000000000000005
430.0,12.569999999999999,12.892857142857142,12.363636363636365,7.6000000000000005
431.0,12.525,12.839285714285714,12.363636363636365,7.6000000000000005
432.0,12.525,12.839285714285714,12.363636363636365,7.6000000000000005
433.0,12.525,12.839285714285714,12.363636363636365,7.6000000000000005
434.0,12.525,12.839285714285714,12.363636363636365,7.6000000000000005
435.0,12.525,12.839285714285714,12.363636363636365,7.6000000000000005
436.0,12.439999999999998,12.738095238095237,12.363636363636365,7.6000000000000005
437.0,12.439999999999998,12.738095238095237,12.363636363636365,7.6000000000000005
438.0,12.439999999999998,12.738095238095237,12.363636363636365,7.6000000000000005
439.0,12.439999999999998,12.738095238095237,12.363636363636365,7.6000000000000005
440.0,12.439999999999998,12.738095238095237,12.363636363636365,7.6000000000000005
441.0,12.439999999999998,12.738095238095237,12.363636363636365,7.6000000000000005
442.0,12.439999999999998,12.738095238095237,12.363636363636365,7.6000000000000005
443.0,12.439999999999998,12.738095238095237,12.363636363636365,7.6000000000000005
444.0,12.405000000000006,12.69642857142857,12.363636363636365,7.6000000000000005
445.0,12.405000000000006,12.69642857142857,12.363636363636365,7.6000000000000005
446.0,12.405000000000006,12.69642857142857,12.363636363636365,7.6000000000000005
447.0,12.405000000000006,12.69642857142857,12.363636363636365,7.6000000000000005
448.0,12.405000000000006,12.69642857142857,12.363636363636365,7.6000000000000005
449.0,12.405000000000006,12.69642857142857,12.363636363636365,7.6000000000000005
450.0,12.405000000000006,12.69642857142857,12.363636363636365,7.6000000000000005
451.0,12.405000000000006,12.69642857142857,12.363636363636365,7.6000000000000005
452.0,12.350000000000003,12.69642857142857,11.863636363636365,7.6000000000000005
453.0,12.350000000000003,12.69642857142857,11.863636363636365,7.6000000000000005
454.0,12.350000000000003,12.69642857142857,11.863636363636365,7.6000000000000005
455.0,12.350000000000003,12.69642857142857,11.863636363636365,7.6000000000000005
456.0,12.350000000000003,12.69642857142857,11.863636363636365,7.6000000000000005
457.0,12.350000000000003,12.69642857142857,11.863636363636365,7.6000000000000005
458.0,12.350000000000003,12.69642857142857,11.863636363636365,7.6000000000000005
459.0,12.28,12.613095238095237,11.863636363636365,7.6000000000000005
460.0,12.28,12.613095238095237,11.863636363636365,7.6000000000000005
461.0,12.225,12.547619047619055,11.863636363636365,7.6000000000000005
462.0,12.225,12.547619047619055,11.863636363636365,7.6000000000000005
463.0,12.225,12.547619047619055,11.863636363636365,7.6000000000000005
464.0,12.225,12.547619047619055,11.863636363636365,7.6000000000000005
465.0,12.225,12.547619047619055,11.863636363636365,7.6000000000000005
466.0,12.225,12.547619047619055,11.863636363636365,7.6000000000000005
467.0,12.225,12.547619047619055,11.863636363636365,7.6000000000000005
468.0,12.144999999999994,12.547619047619055,11.863636363636365,6.0
469.0,12.969999999999995,13.33928571428571,12.863636363636365,7.0
470.0,12.969999999999995,13.33928571428571,12.863636363636365,7.0
471.0,12.969999999999995,13.33928571428571,12.863636363636365,7.0
472.0,12.969999999999995,13.33928571428571,12.863636363636365,7.0
473.0,12.969999999999995,13.33928571428571,12.863636363636365,7.0
474.0,12.969999999999995,13.33928571428571,12.863636363636365,7.0
475.0,12.910000000000005,13.267857142857142,12.863636363636365,7.0
476.0,12.910000000000005,13.267857142857142,12.863636363636365,7.0
477.0,12.910000000000005,13.267857142857142,12.863636363636365,7.0
478.0,12.910000000000005,13.267857142857142,12.863636363636365,7.0
479.0,12.910000000000005,13.267857142857142,12.863636363636365,7.0
480.0,12.910000000000005,13.267857142857142,12.863636363636365,7.0
481.0,12.910000000000005,13.267857142857142,12.863636363636365,7.0
482.0,12.910000000000005,13.267857142857142,12.863636363636365,7.0
483.0,12.910000000000005,13.267857142857142,12.863636363636365,7.0
484.0,12.910000000000005,13.267857142857142,12.863636363636365,7.0
485.0,12.910000000000005,13.267857142857142,12.863636363636365,7.0
486.0,12.910000000000005,13.267857142857142,12.863636363636365,7.0
487.0,12.910000000000005,13.267857142857142,12.863636363636365,7.0
488.0,12.910000000000005,13.267857142857142,12.863636363636365,7.0
489.0,12.910000000000005,13.267857142857142,12.863636363636365,7.0
490.0,12.910000000000005,13.267857142857142,12.863636363636365,7.0
491.0,12.910000000000005,13.267857142857142,12.863636363636365,7.0
492.0,12.820000000000004,13.16071428571429,12.863636363636365,7.0
493.0,12.820000000000004,13.16071428571429,12.863636363636365,7.0
494.0,12.820000000000004,13.16071428571429,12.863636363636365,7.0
495.0,12.754999999999999,13.16071428571429,12.27272727272727,7.0
496.0,12.754999999999999,13.16071428571429,12.27272727272727,7.0
497.0,12.704999999999997,13.101190476190483,12.27272727272727,7.0
498.0,12.704999999999997,13.101190476190483,12.27272727272727,7.0
499.0,12.704999999999997,13.101190476190483,12.27272727272727,7.0
500.0,12.704999999999997,13.101190476190483,12.27272727272727,7.0
501.0,12.510000000000007,12.952380952380953,11.636363636363635,7.0
502.0,12.510000000000007,12.952380952380953,11.636363636363635,7.0
503.0,12.45,12.880952380952378,11.636363636363635,7.0
504.0,12.45,12.880952380952378,11.636363636363635,7.0
505.0,12.365,12.779761904761905,11.636363636363635,7.0
506.0,12.365,12.779761904761905,11.636363636363635,7.0
507.0,12.365,12.779761904761905,11.636363636363635,7.0
508.0,12.365,12.779761904761905,11.636363636363635,7.0
509.0,12.365,12.779761904761905,11.636363636363635,7.0
510.0,12.365,12.779761904761905,11.636363636363635,7.0
511.0,12.365,12.779761904761905,11.636363636363635,7.0
512.0,12.365,12.779761904761905,11.636363636363635,7.0
513.0,12.365,12.779761904761905,11.636363636363635,7.0
514.0,12.365,12.779761904761905,11.636363636363635,7.0
515.0,12.365,12.779761904761905,11.636363636363635,7.0
516.0,12.365,12.779761904761905,11.636363636363635,7.0
517.0,12.365,12.779761904761905,11.636363636363635,7.0
518.0,12.365,12.779761904761905,11.636363636363635,7.0
519.0,12.365,12.779761904761905,11.636363636363635,7.0
520.0,12.365,12.779761904761905,11.636363636363635,7.0
521.0,13.114999999999997,13.624999999999998,12.09090909090909,6.8
522.0,13.114999999999997,13.624999999999998,12.09090909090909,6.8
523.0,13.114999999999997,13.624999999999998,12.09090909090909,6.8
524.0,13.114999999999997,13.624999999999998,12.09090909090909,6.8
525.0,13.114999999999997,13.624999999999998,12.09090909090909,6.8
526.0,13.114999999999997,13.624999999999998,12.09090909090909,6.8
527.0,13.014999999999999,13.50595238095238,12.09090909090909,6.8
528.0,13.014999999999999,13.50595238095238,12.09090909090909,6.8
529.0,13.014999999999999,13.50595238095238,12.09090909090909,6.8
530.0,13.014999999999999,13.50595238095238,12.09090909090909,6.8
531.0,13.014999999999999,13.50595238095238,12.09090909090909,6.8
532.0,12.955000000000007,13.50595238095238,11.545454545454547,6.8
533.0,12.955000000000007,13.50595238095238,11.545454545454547,6.8
534.0,12.909999999999995,13.452380952380949,11.545454545454547,6.8
535.0,12.909999999999995,13.452380952380949,11.545454545454547,6.8
536.0,12.834999999999996,13.363095238095235,11.545454545454547,6.8
537.0,12.834999999999996,13.363095238095235,11.545454545454547,6.8
538.0,12.834999999999996,13.363095238095235,11.545454545454547,6.8
539.0,12.834999999999996,13.363095238095235,11.545454545454547,6.8
540.0,12.834999999999996,13.363095238095235,11.545454545454547,6.8
541.0,12.834999999999996,13.363095238095235,11.545454545454547,6.8
542.0,12.855000000000006,13.38690476190476,11.545454545454547,6.8
543.0,12.855000000000006,13.38690476190476,11.545454545454547,6.8
544.0,12.855000000000006,13.38690476190476,11.545454545454547,6.8
545.0,12.855000000000006,13.38690476190476,11.545454545454547,6.8
546.0,12.784999999999998,13.38690476190476,10.90909090909091,6.8
547.0,12.784999999999998,13.38690476190476,10.90909090909091,6.8
548.0,12.784999999999998,13.38690476190476,10.90909090909091,6.8
549.0,12.729999999999999,13.38690476190476,10.90909090909091,5.699999999999999
550.0,12.729999999999999,13.38690476190476,10.90909090909091,5.699999999999999
551.0,12.729999999999999,13.38690476190476,10.90909090909091,5.699999999999999
552.0,12.729999999999999,13.38690476190476,10.90909090909091,5.699999999999999
553.0,12.729999999999999,13.38690476190476,10.90909090909091,5.699999999999999
554.0,12.729999999999999,13.38690476190476,10.90909090909091,5.699999999999999
555.0,12.729999999999999,13.38690476190476,10.90909090909091,5.699999999999999
556.0,12.729999999999999,13.38690476190476,10.90909090909091,5.699999999999999
557.0,12.729999999999999,13.38690476190476,10.90909090909091,5.699999999999999
558.0,12.729999999999999,13.38690476190476,10.90909090909091,5.699999999999999
559.0,12.729999999999999,13.38690476190476,10.90909090909091,5.699999999999999
560.0,12.729999999999999,13.38690476190476,10.90909090909091,5.699999999999999
561.0,12.729999999999999,13.38690476190476,10.90909090909091,5.699999999999999
562.0,12.729999999999999,13.38690476190476,10.90909090909091,5.699999999999999
563.0,12.729999999999999,13.38690476190476,10.90909090909091,5.699999999999999
564.0,12.729999999999999,13.38690476190476,10.90909090909091,5.699999999999999
565.0,12.729999999999999,13.38690476190476,10.90909090909091,5.699999999999999
566.0,12.640000000000002,13.279761904761903,10.90909090909091,5.699999999999999
567.0,12.640000000000002,13.279761904761903,10.90909090909091,5.699999999999999
568.0,12.640000000000002,13.279761904761903,10.90909090909091,5.699999999999999
569.0,12.640000000000002,13.279761904761903,10.90909090909091,5.699999999999999
570.0,12.640000000000002,13.279761904761903,10.90909090909091,5.699999999999999
571.0,12.640000000000002,13.279761904761903,10.90909090909091,5.699999999999999
572.0,12.640000000000002,13.279761904761903,10.90909090909091,5.699999999999999
573.0,13.510000000000003,14.208333333333334,11.272727272727273,6.699999999999999
574.0,13.510000000000003,14.208333333333334,11.272727272727273,6.699999999999999
575.0,13.510000000000003,14.208333333333334,11.272727272727273,6.699999999999999
576.0,13.445,14.130952380952378,11.272727272727273,6.699999999999999
577.0,13.445,14.130952380952378,11.272727272727273,6.699999999999999
578.0,13.445,14.130952380952378,11.272727272727273,6.699999999999999
579.0,13.445,14.130952380952378,11.272727272727273,6.699999999999999
580.0,13.445,14.130952380952378,11.272727272727273,6.699999999999999
581.0,13.445,14.130952380952378,11.272727272727273,6.699999999999999
582.0,13.375000000000004,14.047619047619046,11.272727272727273,6.699999999999999
583.0,13.264999999999993,13.916666666666663,11.272727272727273,6.699999999999999
584.0,13.264999999999993,13.916666666666663,11.272727272727273,6.699999999999999
585.0,13.264999999999993,13.916666666666663,11.272727272727273,6.699999999999999
586.0,13.264999999999993,13.916666666666663,11.272727272727273,6.699999999999999
587.0,13.264999999999993,13.916666666666663,11.272727272727273,6.699999999999999
588.0,13.264999999999993,13.916666666666663,11.272727272727273,6.699999999999999
589.0,13.264999999999993,13.916666666666663,11.272727272727273,6.699999999999999
590.0,13.264999999999993,13.916666666666663,11.272727272727273,6.699999999999999
591.0,13.194999999999997,13.833333333333334,11.272727272727273,6.699999999999999
592.0,13.194999999999997,13.833333333333334,11.272727272727273,6.699999999999999
593.0,13.194999999999997,13.833333333333334,11.272727272727273,6.699999999999999
594.0,13.194999999999997,13.833333333333334,11.272727272727273,6.699999999999999
595.0,13.110000000000003,13.732142857142856,11.272727272727273,6.699999999999999
596.0,13.110000000000003,13.732142857142856,11.272727272727273,6.699999999999999
597.0,13.110000000000003,13.732142857142856,11.272727272727273,6.699999999999999
598.0,13.110000000000003,13.732142857142856,11.272727272727273,6.699999999999999
599.0,13.110000000000003,13.732142857142856,11.272727272727273,6.699999999999999
600.0,13.110000000000003,13.732142857142856,11.272727272727273,6.699999999999999
601.0,13.110000000000003,13.732142857142856,11.272727272727273,6.699999999999999
602.0,13.110000000000003,13.732142857142856,11.272727272727273,6.699999999999999
603.0,13.110000000000003,13.732142857142856,11.272727272727273,6.699999999999999
604.0,13.110000000000003,13.732142857142856,11.272727272727273,6.699999999999999
605.0,13.110000000000003,13.732142857142856,11.272727272727273,6.699999999999999
606.0,13.110000000000003,13.732142857142856,11.272727272727273,6.699999999999999
607.0,13.110000000000003,13.732142857142856,11.272727272727273,6.699999999999999
608.0,13.110000000000003,13.732142857142856,11.272727272727273,6.699999999999999
609.0,13.110000000000003,13.732142857142856,11.272727272727273,6.699999999999999
610.0,13.110000000000003,13.732142857142856,11.272727272727273,6.699999999999999
611.0,13.110000000000003,13.732142857142856,11.272727272727273,6.699999999999999
612.0,13.110000000000003,13.732142857142856,11.272727272727273,6.699999999999999
613.0,13.110000000000003,13.732142857142856,11.272727272727273,6.699999999999999
614.0,13.110000000000003,13.732142857142856,11.272727272727273,6.699999999999999
615.0,13.110000000000003,13.732142857142856,11.272727272727273,6.699999999999999
616.0,13.110000000000003,13.732142857142856,11.272727272727273,6.699999999999999
617.0,13.110000000000003,13.732142857142856,11.272727272727273,6.699999999999999
618.0,13.110000000000003,13.732142857142856,11.272727272727273,6.699999999999999
619.0,12.975,13.57142857142857,11.272727272727273,6.699999999999999
620.0,12.739999999999998,13.291666666666659,11.272727272727273,6.699999999999999
621.0,12.739999999999998,13.291666666666659,11.272727272727273,6.699999999999999
622.0,12.739999999999998,13.291666666666659,11.272727272727273,6.699999999999999
623.0,12.739999999999998,13.291666666666659,11.272727272727273,6.699999999999999
624.0,12.739999999999998,13.291666666666659,11.272727272727273,6.699999999999999
625.0,13.739999999999998,14.291666666666659,12.272727272727273,7.699999999999999
626.0,13.739999999999998,14.291666666666659,12.272727272727273,7.699999999999999
627.0,13.739999999999998,14.291666666666659,12.272727272727273,7.699999999999999
628.0,13.739999999999998,14.291666666666659,12.272727272727273,7.699999999999999
629.0,13.739999999999998,14.291666666666659,12.272727272727273,7.699999999999999
630.0,13.640000000000008,14.172619047619046,12.272727272727273,7.699999999999999
631.0,13.640000000000008,14.172619047619046,12.272727272727273,7.699999999999999
632.0,13.640000000000008,14.172619047619046,12.272727272727273,7.699999999999999
633.0,13.469999999999997,13.970238095238093,12.272727272727273,7.699999999999999
634.0,13.469999999999997,13.970238095238093,12.272727272727273,7.699999999999999
635.0,13.469999999999997,13.970238095238093,12.272727272727273,7.699999999999999
636.0,13.469999999999997,13.970238095238093,12.272727272727273,7.699999999999999
637.0,13.469999999999997,13.970238095238093,12.272727272727273,7.699999999999999
638.0,13.469999999999997,13.970238095238093,12.272727272727273,7.699999999999999
639.0,13.469999999999997,13.970238095238093,12.272727272727273,7.699999999999999
640.0,13.315000000000007,13.970238095238093,11.590909090909092,6.1
641.0,13.315000000000007,13.970238095238093,11.590909090909092,6.1
642.0,13.315000000000007,13.970238095238093,11.590909090909092,6.1
643.0,13.315000000000007,13.970238095238093,11.590909090909092,6.1
644.0,13.159999999999998,13.785714285714286,11.590909090909092,6.1
645.0,13.159999999999998,13.785714285714286,11.590909090909092,6.1
646.0,13.025000000000002,13.625000000000002,11.590909090909092,6.1
647.0,12.920000000000007,13.500000000000002,11.590909090909092,6.1
648.0,12.920000000000007,13.500000000000002,11.590909090909092,6.1
649.0,12.920000000000007,13.500000000000002,11.590909090909092,6.1
650.0,12.920000000000007,13.500000000000002,11.590909090909092,6.1
651.0,12.84,13.500000000000002,10.863636363636363,6.1
652.0,12.84,13.500000000000002,10.863636363636363,6.1
653.0,12.84,13.500000000000002,10.863636363636363,6.1
654.0,12.84,13.500000000000002,10.863636363636363,6.1
655.0,12.84,13.500000000000002,10.863636363636363,6.1
656.0,12.84,13.500000000000002,10.863636363636363,6.1
657.0,12.84,13.500000000000002,10.863636363636363,6.1
658.0,12.84,13.500000000000002,10.863636363636363,6.1
659.0,12.764999999999992,13.410714285714285,10.863636363636363,6.1
660.0,12.764999999999992,13.410714285714285,10.863636363636363,6.1
661.0,12.764999999999992,13.410714285714285,10.863636363636363,6.1
662.0,12.685000000000002,13.31547619047619,10.863636363636363,6.1
663.0,12.685000000000002,13.31547619047619,10.863636363636363,6.1
664.0,12.685000000000002,13.31547619047619,10.863636363636363,6.1
665.0,12.685000000000002,13.31547619047619,10.863636363636363,6.1
666.0,12.685000000000002,13.31547619047619,10.863636363636363,6.1
667.0,12.610000000000008,13.226190476190474,10.863636363636363,6.1
668.0,12.610000000000008,13.226190476190474,10.863636363636363,6.1
669.0,12.610000000000008,13.226190476190474,10.863636363636363,6.1
670.0,12.610000000000008,13.226190476190474,10.863636363636363,6.1
671.0,12.610000000000008,13.226190476190474,10.863636363636363,6.1
672.0,12.610000000000008,13.226190476190474,10.863636363636363,6.1
673.0,12.610000000000008,13.226190476190474,10.863636363636363,6.1
674.0,12.610000000000008,13.226190476190474,10.863636363636363,6.1
675.0,12.610000000000008,13.226190476190474,10.863636363636363,6.1
676.0,12.610000000000008,13.226190476190474,10.863636363636363,6.1
677.0,13.435,14.130952380952385,11.523809523809526,6.454545454545455
678.0,13.435,14.130952380952385,11.523809523809526,6.454545454545455
679.0,13.435,14.130952380952385,11.523809523809526,6.454545454545455
680.0,13.435,14.130952380952385,11.523809523809526,6.454545454545455
681.0,13.435,14.130952380952385,11.523809523809526,6.454545454545455
682.0,13.435,14.130952380952385,11.523809523809526,6.454545454545455
683.0,13.435,14.130952380952385,11.523809523809526,6.454545454545455
684.0,13.435,14.130952380952385,11.523809523809526,6.454545454545455
685.0,13.435,14.130952380952385,11.523809523809526,6.454545454545455
686.0,13.435,14.130952380952385,11.523809523809526,6.454545454545455
687.0,13.435,14.130952380952385,11.523809523809526,6.454545454545455
688.0,13.435,14.130952380952385,11.523809523809526,6.454545454545455
689.0,13.435,14.130952380952385,11.523809523809526,6.454545454545455
690.0,13.360000000000003,14.041666666666666,11.523809523809526,6.454545454545455
691.0,13.250000000000002,13.91071428571429,11.523809523809526,6.454545454545455
692.0,12.995000000000008,13.72619047619048,10.571428571428573,6.454545454545455
693.0,12.995000000000008,13.72619047619048,10.571428571428573,6.454545454545455
694.0,12.995000000000008,13.72619047619048,10.571428571428573,6.454545454545455
695.0,12.995000000000008,13.72619047619048,10.571428571428573,6.454545454545455
696.0,12.995000000000008,13.72619047619048,10.571428571428573,6.454545454545455
697.0,12.719999999999999,13.398809523809524,10.571428571428573,6.454545454545455
698.0,12.719999999999999,13.398809523809524,10.571428571428573,6.454545454545455
699.0,12.719999999999999,13.398809523809524,10.571428571428573,6.454545454545455
700.0,12.719999999999999,13.398809523809524,10.571428571428573,6.454545454545455
701.0,12.719999999999999,13.398809523809524,10.571428571428573,6.454545454545455
702.0,12.719999999999999,13.398809523809524,10.571428571428573,6.454545454545455
703.0,12.510000000000002,13.14880952380952,10.571428571428573,6.454545454545455
704.0,12.510000000000002,13.14880952380952,10.571428571428573,6.454545454545455
705.0,12.510000000000002,13.14880952380952,10.571428571428573,6.454545454545455
706.0,12.510000000000002,13.14880952380952,10.571428571428573,6.454545454545455
707.0,12.510000000000002,13.14880952380952,10.571428571428573,6.454545454545455
708.0,12.510000000000002,13.14880952380952,10.571428571428573,6.454545454545455
709.0,12.510000000000002,13.14880952380952,10.571428571428573,6.454545454545455
710.0,12.510000000000002,13.14880952380952,10.571428571428573,6.454545454545455
711.0,12.510000000000002,13.14880952380952,10.571428571428573,6.454545454545455
712.0,12.420000000000002,13.041666666666668,10.571428571428573,6.454545454545455
713.0,12.420000000000002,13.041666666666668,10.571428571428573,6.454545454545455
714.0,12.420000000000002,13.041666666666668,10.571428571428573,6.454545454545455
715.0,12.339999999999998,13.041666666666668,9.809523809523812,6.454545454545455
716.0,12.339999999999998,13.041666666666668,9.809523809523812,6.454545454545455
717.0,12.289999999999997,12.982142857142858,9.809523809523812,6.454545454545455
718.0,12.289999999999997,12.982142857142858,9.809523809523812,6.454545454545455
719.0,12.289999999999997,12.982142857142858,9.809523809523812,6.454545454545455
720.0,12.215000000000002,12.892857142857146,9.809523809523812,6.454545454545455
721.0,12.215000000000002,12.892857142857146,9.809523809523812,6.454545454545455
722.0,12.215000000000002,12.892857142857146,9.809523809523812,6.454545454545455
723.0,12.215000000000002,12.892857142857146,9.809523809523812,6.454545454545455
724.0,12.215000000000002,12.892857142857146,9.809523809523812,6.454545454545455
