"_ages_vehicles_in_simulation"
5
4
13
20
8
5
9
12
14
12
21
4
2
16
11
3
10
6
9
4
11
9
10
5
13
10
10
19
9
1
9
18
14
4
21
19
21
6
19
9
2
4
4
13
2
21
13
10
4
10
12
21
13
6
6
2
16
19
11
6
2
5
10
17
6
8
3
13
8
4
2
19
7
19
9
5
3
12
7
10
12
12
8
4
20
9
15
7
7
21
5
14
19
2
18
1
12
10
7
8
9
4
3
6
4
4
3
17
2
7
20
4
3
10
10
11
4
6
4
9
13
5
3
12
16
18
3
12
4
4
3
17
4
7
16
10
17
12
19
12
8
18
8
14
21
9
15
14
14
5
18
10
5
3
2
3
11
16
8
9
17
4
21
15
11
10
2
7
4
8
13
7
15
1
7
15
5
4
17
9
10
2
21
3
2
4
10
10
8
12
21
18
21
2
4
8
10
2
15
7
5
4
13
20
8
5
9
12
14
12
21
4
2
16
11
3
10
6
9
4
11
9
10
5
13
10
10
19
9
1
9
18
14
4
21
19
21
6
19
9
2
4
4
13
2
21
13
10
4
10
12
21
13
6
6
2
16
19
11
6
2
5
10
17
6
8
3
13
8
4
2
19
7
19
9
5
3
12
7
10
12
12
8
4
20
9
15
7
7
21
5
14
19
2
18
1
12
10
7
8
9
4
3
6
4
4
3
17
2
7
20
4
3
10
10
11
4
6
4
9
13
5
3
12
16
18
3
12
4
4
3
17
4
7
16
10
17
12
19
12
8
18
8
14
21
9
15
14
14
5
18
10
5
3
2
3
11
16
8
9
17
4
21
15
11
10
2
7
4
8
13
7
15
1
7
15
5
4
17
9
10
2
21
3
2
4
10
10
8
12
21
18
21
2
4
8
10
2
15
7
5
4
13
20
8
5
9
12
14
12
21
4
2
16
11
3
10
6
9
4
11
9
10
5
13
10
10
19
9
1
9
18
14
4
21
19
21
6
19
9
2
4
4
13
2
21
13
10
4
10
12
21
13
6
6
2
16
19
11
6
2
5
10
17
6
8
3
13
8
4
2
19
7
19
9
5
3
12
7
10
12
12
8
4
20
9
15
7
7
21
5
14
19
2
18
1
12
10
7
8
9
4
3
6
4
4
3
17
2
7
20
4
3
10
10
11
4
6
4
9
13
5
3
12
16
18
3
12
4
4
3
17
4
7
16
10
17
12
19
12
8
18
8
14
21
9
15
14
14
5
18
10
5
3
2
3
11
16
8
9
17
4
21
15
11
10
2
7
4
8
13
7
15
1
7
15
5
4
17
9
10
2
21
3
2
4
10
10
8
12
21
18
21
2
4
8
10
2
15
7
5
4
13
20
8
5
9
12
14
12
21
4
2
16
11
3
10
6
9
4
11
9
10
5
13
10
10
19
9
1
9
18
14
4
21
19
21
6
19
9
2
4
4
13
2
21
13
10
4
10
12
21
13
6
6
2
16
19
11
6
2
5
10
17
6
8
3
13
8
4
2
19
7
19
9
5
3
12
7
10
12
12
8
4
20
9
15
7
7
21
5
14
19
2
18
1
12
10
7
8
9
4
3
6
4
4
3
17
2
7
20
4
3
10
10
11
4
6
4
9
13
5
3
12
16
18
3
12
4
4
3
17
4
7
16
10
17
12
19
12
8
18
8
14
21
9
15
14
14
5
18
10
5
3
2
3
11
16
8
9
17
4
21
15
11
10
2
7
4
8
13
7
15
1
7
15
5
4
17
9
10
2
21
3
2
4
10
10
8
12
21
18
21
2
4
8
10
2
15
7
5
4
13
20
8
5
9
12
14
12
21
4
2
16
11
3
10
6
9
4
11
9
10
5
13
10
10
19
9
1
9
18
14
4
21
19
21
6
19
9
2
4
4
13
2
21
13
10
4
10
12
21
13
6
6
2
16
19
11
6
2
5
10
17
6
8
3
13
8
4
2
19
7
19
9
5
3
12
7
10
12
12
8
4
20
9
15
7
7
21
5
14
19
2
18
1
12
10
7
8
9
4
3
6
4
4
3
17
2
7
20
4
3
10
10
11
4
6
4
9
13
5
3
12
16
18
3
12
4
4
3
17
4
7
16
10
17
12
19
12
8
18
8
14
21
9
15
14
14
5
18
10
5
3
2
3
11
16
8
9
17
4
21
15
11
10
2
7
4
8
13
7
15
1
7
15
5
4
17
9
10
2
21
3
2
4
10
10
8
12
21
18
21
2
4
8
10
2
15
7
5
4
13
20
8
5
9
12
14
12
21
4
2
16
11
3
10
6
9
4
11
9
10
5
13
10
10
19
9
1
9
18
14
4
21
19
21
6
19
9
2
4
4
13
2
21
13
10
4
10
12
21
13
6
6
2
16
19
11
6
2
5
10
17
6
8
3
13
8
4
2
19
7
19
9
5
3
12
7
10
12
12
8
4
20
9
15
7
7
21
5
14
19
2
18
1
12
10
7
8
9
4
3
6
4
4
3
17
2
7
20
4
3
10
10
11
4
6
4
9
13
5
3
12
16
18
3
12
4
4
3
17
4
7
16
10
17
12
19
12
8
18
8
14
21
9
15
14
14
5
18
10
5
3
2
3
11
16
8
9
17
4
21
15
11
10
2
7
4
8
13
7
15
1
7
15
5
4
17
9
10
2
21
3
2
4
10
10
8
12
21
18
21
2
4
8
10
2
15
7
5
4
13
20
8
5
9
12
14
12
21
4
2
16
11
3
10
6
9
4
11
9
10
5
13
10
10
19
9
1
9
18
14
4
21
19
21
6
19
9
2
4
4
13
2
21
13
10
4
10
12
21
13
6
6
2
16
19
11
6
2
5
10
17
6
8
3
13
8
4
2
19
7
19
9
5
3
12
7
10
12
12
8
4
20
9
15
7
7
21
5
14
19
2
18
1
12
10
7
8
9
4
3
6
4
4
3
17
2
7
20
4
3
10
10
11
4
6
4
9
13
5
3
12
16
18
3
12
4
4
3
17
4
7
16
10
17
12
19
12
8
18
8
14
21
9
15
14
14
5
18
10
5
3
2
3
11
16
8
9
17
4
21
15
11
10
2
7
4
8
13
7
15
1
7
15
5
4
17
9
10
2
21
3
2
4
10
10
8
12
21
18
21
2
4
8
10
2
15
7
5
4
13
20
8
5
9
12
14
12
21
4
2
16
11
3
10
6
9
4
11
9
10
5
13
10
10
19
9
1
9
18
14
4
21
19
21
6
19
9
2
4
4
13
2
21
13
10
4
10
12
21
13
6
6
2
16
19
11
6
2
5
10
17
6
8
3
13
8
4
2
19
7
19
9
5
3
12
7
10
12
12
8
4
20
9
15
7
7
21
5
14
19
2
18
1
12
10
7
8
9
4
3
6
4
4
3
17
2
7
20
4
3
10
10
11
4
6
4
9
13
5
3
12
16
18
3
12
4
4
3
17
4
7
16
10
17
12
19
12
8
18
8
14
21
9
15
14
14
5
18
10
5
3
2
3
11
16
8
9
17
4
21
15
11
10
2
7
4
8
13
7
15
1
7
15
5
4
17
9
10
2
21
3
2
4
10
10
8
12
21
18
21
2
4
8
10
2
15
7
5
4
13
20
8
5
9
12
14
12
21
4
2
16
11
3
10
6
9
4
11
9
10
5
13
10
10
19
9
1
9
18
14
4
21
19
21
6
19
9
2
4
4
13
2
21
13
10
4
10
12
21
13
6
6
2
16
19
11
6
2
5
10
17
6
8
3
13
8
4
2
19
7
19
9
5
3
12
7
10
12
12
8
4
20
9
15
7
7
21
5
14
19
2
18
1
12
10
7
8
9
4
3
6
4
4
3
17
2
7
20
4
3
10
10
11
4
6
4
9
13
5
3
12
16
18
3
12
4
4
3
17
4
7
16
10
17
12
19
12
8
18
8
14
21
9
15
14
14
5
18
10
5
3
2
3
11
16
8
9
17
4
21
15
11
10
2
7
4
8
13
7
15
1
7
15
5
4
17
9
10
2
21
3
2
4
10
10
8
12
21
18
21
2
4
8
10
2
15
7
5
4
13
20
8
5
9
12
14
12
21
4
2
16
11
3
10
6
9
4
11
9
10
5
13
10
10
19
9
1
9
18
14
4
21
19
21
6
19
9
2
4
4
13
2
21
13
10
4
10
12
21
13
6
6
2
16
19
11
6
2
5
10
17
6
8
3
13
8
4
2
19
7
19
9
5
3
12
7
10
12
12
8
4
20
9
15
7
7
21
5
14
19
2
18
1
12
10
7
8
9
4
3
6
4
4
3
17
2
7
20
4
3
10
10
11
4
6
4
9
13
5
3
12
16
18
3
12
4
4
3
17
4
7
16
10
17
12
19
12
8
18
8
14
21
9
15
14
14
5
18
10
5
3
2
3
11
16
8
9
17
4
21
15
11
10
2
7
4
8
13
7
15
1
7
15
5
4
17
9
10
2
21
3
2
4
10
10
8
12
21
18
21
2
4
8
10
2
15
7
5
4
13
20
8
5
9
12
14
12
21
4
2
16
11
3
10
6
9
4
11
9
10
5
13
10
10
19
9
1
9
18
14
4
21
19
21
6
19
9
2
4
4
13
2
21
13
10
4
10
12
21
13
6
6
2
16
19
11
6
2
5
10
17
6
8
3
13
8
4
2
19
7
19
9
5
3
12
7
10
12
12
8
4
20
9
15
7
7
21
5
14
19
2
18
1
12
10
7
8
9
4
3
6
4
4
3
17
2
7
20
4
3
10
10
11
4
6
4
9
13
5
3
12
16
18
3
12
4
4
3
17
4
7
16
10
17
12
19
12
8
18
8
14
21
9
15
14
14
5
18
10
5
3
2
3
11
16
8
9
17
4
21
15
11
10
2
7
4
8
13
7
15
1
7
15
5
4
17
9
10
2
21
3
2
4
10
10
8
12
21
18
21
2
4
8
10
2
15
7
5
4
13
20
8
5
9
12
14
12
21
4
2
16
11
3
10
6
9
4
11
9
10
5
13
10
10
19
9
1
9
18
14
4
21
19
21
6
19
9
2
4
4
13
2
21
13
10
4
10
12
21
13
6
6
2
16
19
11
6
2
5
10
17
6
8
3
13
8
4
2
19
7
19
9
5
3
12
7
10
12
12
8
4
20
9
15
7
7
21
5
14
19
2
18
1
12
10
7
8
9
4
3
6
4
4
3
17
2
7
20
4
3
10
10
11
4
6
4
9
13
5
3
12
16
18
3
12
4
4
3
17
4
7
16
10
17
12
19
12
8
18
8
14
21
9
15
14
14
5
18
10
5
3
2
3
11
16
8
9
17
4
21
15
11
10
2
7
4
8
13
7
15
1
7
15
5
4
17
9
10
2
21
3
2
4
10
10
8
12
21
18
21
2
4
8
10
2
15
7
5
4
13
20
8
5
9
12
14
12
21
4
2
16
11
3
10
6
9
4
11
9
10
5
13
10
10
19
9
1
9
18
14
4
21
19
21
6
19
9
2
4
4
13
2
21
13
10
4
10
12
21
13
6
6
2
16
19
11
6
2
5
10
17
6
8
3
13
8
4
2
19
7
19
9
5
3
12
7
10
12
12
8
4
20
9
15
7
7
21
5
14
19
2
18
1
12
10
7
8
9
4
3
6
4
4
3
17
2
7
20
4
3
10
10
11
4
6
4
9
13
5
3
12
16
18
3
12
4
4
3
17
4
7
16
10
17
12
19
12
8
18
8
14
21
9
15
14
14
5
18
10
5
3
2
3
11
16
8
9
17
4
21
15
11
10
2
7
4
8
13
7
15
1
7
15
5
4
17
9
10
2
21
3
2
4
10
10
8
12
21
18
21
2
4
8
10
2
15
7
5
4
13
20
8
5
9
12
14
12
21
4
2
16
11
3
10
6
9
4
11
9
10
5
13
10
10
19
9
1
9
18
14
4
21
19
21
6
19
9
2
4
4
13
2
21
13
10
4
10
12
21
13
6
6
2
16
19
11
6
2
5
10
17
6
8
3
13
8
4
2
19
7
19
9
5
3
12
7
10
12
12
8
4
20
9
15
7
7
21
5
14
19
2
18
1
12
10
7
8
9
4
3
6
4
4
3
17
2
7
20
4
3
10
10
11
4
6
4
9
13
5
3
12
16
18
3
12
4
4
3
17
4
7
16
10
17
12
19
12
8
18
8
14
21
9
15
14
14
5
18
10
5
3
2
3
11
16
8
9
17
4
21
15
11
10
2
7
4
8
13
7
15
1
7
15
5
4
17
9
10
2
21
3
2
4
10
10
8
12
21
18
21
2
4
8
10
2
15
7
5
4
13
20
8
5
9
12
14
12
21
4
2
16
11
3
10
6
9
4
11
9
10
5
13
10
10
19
9
1
9
18
14
4
21
19
21
6
19
9
2
4
4
13
2
21
13
10
4
10
12
21
13
6
6
2
16
19
11
6
2
5
10
17
6
8
3
13
8
4
2
19
7
19
9
5
3
12
7
10
12
12
8
4
20
9
15
7
7
21
5
14
19
2
18
1
12
10
7
8
9
4
3
6
4
4
3
17
2
7
20
4
3
10
10
11
4
6
4
9
13
5
3
12
16
18
3
12
4
4
3
17
4
7
16
10
17
12
19
12
8
18
8
14
21
9
15
14
14
5
18
10
5
3
2
3
11
16
8
9
17
4
21
15
11
10
2
7
4
8
13
7
15
1
7
15
5
4
17
9
10
2
21
3
2
4
10
10
8
12
21
18
21
2
4
8
10
2
15
7
5
4
13
20
8
5
9
12
14
12
21
4
2
16
11
3
10
6
9
4
11
9
10
5
13
10
10
19
9
1
9
18
14
4
21
19
21
6
19
9
2
4
4
13
2
21
13
10
4
10
12
21
13
6
6
2
16
19
11
6
2
5
10
17
6
8
3
13
8
4
2
19
7
19
9
5
3
12
7
10
12
12
8
4
20
9
15
7
7
21
5
14
19
2
18
1
12
10
7
8
9
4
3
6
4
4
3
17
2
7
20
4
3
10
10
11
4
6
4
9
13
5
3
12
16
18
3
12
4
4
3
17
4
7
16
10
17
12
19
12
8
18
8
14
21
9
15
14
14
5
18
10
5
3
2
3
11
16
8
9
17
4
21
15
11
10
2
7
4
8
13
7
15
1
7
15
5
4
17
9
10
2
21
3
2
4
10
10
8
12
21
18
21
2
4
8
10
2
15
7
5
4
13
20
8
5
9
12
14
12
21
4
2
16
11
3
10
6
9
4
11
9
10
5
13
10
10
19
9
1
9
18
14
4
21
19
21
6
19
9
2
4
4
13
2
21
13
10
4
10
12
21
13
6
6
2
16
19
11
6
2
5
10
17
6
8
3
13
8
4
2
19
7
19
9
5
3
12
7
10
12
12
8
4
20
9
15
7
7
21
5
14
19
2
18
1
12
10
7
8
9
4
3
6
4
4
3
17
2
7
20
4
3
10
10
11
4
6
4
9
13
5
3
12
16
18
3
12
4
4
3
17
4
7
16
10
17
12
19
12
8
18
8
14
21
9
15
14
14
5
18
10
5
3
2
3
11
16
8
9
17
4
21
15
11
10
2
7
4
8
13
7
15
1
7
15
5
4
17
9
10
2
21
3
2
4
10
10
8
12
21
18
21
2
4
8
10
2
15
7
5
4
13
20
8
5
9
12
14
12
21
4
2
16
11
3
10
6
9
4
11
9
10
5
13
10
10
19
9
1
9
18
14
4
21
19
21
6
19
9
2
4
4
13
2
21
13
10
4
10
12
21
13
6
6
2
16
19
11
6
2
5
10
17
6
8
3
13
8
4
2
19
7
19
9
5
3
12
7
10
12
12
8
4
20
9
15
7
7
21
5
14
19
2
18
1
12
10
7
8
9
4
3
6
4
4
3
17
2
7
20
4
3
10
10
11
4
6
4
9
13
5
3
12
16
18
3
12
4
4
3
17
4
7
16
10
17
12
19
12
8
18
8
14
21
9
15
14
14
5
18
10
5
3
2
3
11
16
8
9
17
4
21
15
11
10
2
7
4
8
13
7
15
1
7
15
5
4
17
9
10
2
21
3
2
4
10
10
8
12
21
18
21
2
4
8
10
2
15
7
5
4
13
20
8
5
9
12
14
12
21
4
2
16
11
3
10
6
9
4
11
9
10
5
13
10
10
19
9
1
9
18
14
4
21
19
21
6
19
9
2
4
4
13
2
21
13
10
4
10
12
21
13
6
6
2
16
19
11
6
2
5
10
17
6
8
3
13
8
4
2
19
7
19
9
5
3
12
7
10
12
12
8
4
20
9
15
7
7
21
5
14
19
2
18
1
12
10
7
8
9
4
3
6
4
4
3
17
2
7
20
4
3
10
10
11
4
6
4
9
13
5
3
12
16
18
3
12
4
4
3
17
4
7
16
10
17
12
19
12
8
18
8
14
21
9
15
14
14
5
18
10
5
3
2
3
11
16
8
9
17
4
21
15
11
10
2
7
4
8
13
7
15
1
7
15
5
4
17
9
10
2
21
3
2
4
10
10
8
12
21
18
21
2
4
8
10
2
15
7
5
4
13
20
8
5
9
12
14
12
21
4
2
16
11
3
10
6
9
4
11
9
10
5
13
10
10
19
9
1
9
18
14
4
21
19
21
6
19
9
2
4
4
13
2
21
13
10
4
10
12
21
13
6
6
2
16
19
11
6
2
5
10
17
6
8
3
13
8
4
2
19
7
19
9
5
3
12
7
10
12
12
8
4
20
9
15
7
7
21
5
14
19
2
18
1
12
10
7
8
9
4
3
6
4
4
3
17
2
7
20
4
3
10
10
11
4
6
4
9
13
5
3
12
16
18
3
12
4
4
3
17
4
7
16
10
17
12
19
12
8
18
8
14
21
9
15
14
14
5
18
10
5
3
2
3
11
16
8
9
17
4
21
15
11
10
2
7
4
8
13
7
15
1
7
15
5
4
17
9
10
2
21
3
2
4
10
10
8
12
21
18
21
2
4
8
10
2
15
7
5
4
13
20
8
5
9
12
14
12
21
4
2
16
11
3
10
6
9
4
11
9
10
5
13
10
10
19
9
1
9
18
14
4
21
19
21
6
19
9
2
4
4
13
2
21
13
10
4
10
12
21
13
6
6
2
16
19
11
6
2
5
10
17
6
8
3
13
8
4
2
19
7
19
9
5
3
12
7
10
12
12
8
4
20
9
15
7
7
21
5
14
19
2
18
1
12
10
7
8
9
4
3
6
4
4
3
17
2
7
20
4
3
10
10
11
4
6
4
9
13
5
3
12
16
18
3
12
4
4
3
17
4
7
16
10
17
12
19
12
8
18
8
14
21
9
15
14
14
5
18
10
5
3
2
3
11
16
8
9
17
4
21
15
11
10
2
7
4
8
13
7
15
1
7
15
5
4
17
9
10
2
21
3
2
4
10
10
8
12
21
18
21
2
4
8
10
2
15
7
5
4
13
20
8
5
9
12
14
12
21
4
2
16
11
3
10
6
9
4
11
9
10
5
13
10
10
19
9
1
9
18
14
4
21
19
21
6
19
9
2
4
4
13
2
21
13
10
4
10
12
21
13
6
6
2
16
19
11
6
2
5
10
17
6
8
3
13
8
4
2
19
7
19
9
5
3
12
7
10
12
12
8
4
20
9
15
7
7
21
5
14
19
2
18
1
12
10
7
8
9
4
3
6
4
4
3
17
2
7
20
4
3
10
10
11
4
6
4
9
13
5
3
12
16
18
3
12
4
4
3
17
4
7
16
10
17
12
19
12
8
18
8
14
21
9
15
14
14
5
18
10
5
3
2
3
11
16
8
9
17
4
21
15
11
10
2
7
4
8
13
7
15
1
7
15
5
4
17
9
10
2
21
3
2
4
10
10
8
12
21
18
21
2
4
8
10
2
15
7
5
4
13
20
8
5
9
12
14
12
21
4
2
16
11
3
10
6
9
4
11
9
10
5
13
10
10
19
9
1
9
18
14
4
21
19
21
6
19
9
2
4
4
13
2
21
13
10
4
10
12
21
13
6
6
2
16
19
11
6
2
5
10
17
6
8
3
13
8
4
2
19
7
19
9
5
3
12
7
10
12
12
8
4
20
9
15
7
7
21
5
14
19
2
18
1
12
10
7
8
9
4
3
6
4
4
3
17
2
7
20
4
3
10
10
11
4
6
4
9
13
5
3
12
16
18
3
12
4
4
3
17
4
7
16
10
17
12
19
12
8
18
8
14
21
9
15
14
14
5
18
10
5
3
2
3
11
16
8
9
17
4
21
15
11
10
2
7
4
8
13
7
15
1
7
15
5
4
17
9
10
2
21
3
2
4
10
10
8
12
21
18
21
2
4
8
10
2
15
7
5
4
13
20
8
5
9
12
14
12
21
4
2
16
11
3
10
6
9
4
11
9
10
5
13
10
10
19
9
1
9
18
14
4
21
19
21
6
19
9
2
4
4
13
2
21
13
10
4
10
12
21
13
6
6
2
16
19
11
6
2
5
10
17
6
8
3
13
8
4
2
19
7
19
9
5
3
12
7
10
12
12
8
4
20
9
15
7
7
21
5
14
19
2
18
1
12
10
7
8
9
4
3
6
4
4
3
17
2
7
20
4
3
10
10
11
4
6
4
9
13
5
3
12
16
18
3
12
4
4
3
17
4
7
16
10
17
12
19
12
8
18
8
14
21
9
15
14
14
5
18
10
5
3
2
3
11
16
8
9
17
4
21
15
11
10
2
7
4
8
13
7
15
1
7
15
5
4
17
9
10
2
21
3
2
4
10
10
8
12
21
18
21
2
4
8
10
2
15
7
5
4
13
20
8
5
9
12
14
12
21
4
2
16
11
3
10
6
9
4
11
9
10
5
13
10
10
19
9
1
9
18
14
4
21
19
21
6
19
9
2
4
4
13
2
21
13
10
4
10
12
21
13
6
6
2
16
19
11
6
2
5
10
17
6
8
3
13
8
4
2
19
7
19
9
5
3
12
7
10
12
12
8
4
20
9
15
7
7
21
5
14
19
2
18
1
12
10
7
8
9
4
3
6
4
4
3
17
2
7
20
4
3
10
10
11
4
6
4
9
13
5
3
12
16
18
3
12
4
4
3
17
4
7
16
10
17
12
19
12
8
18
8
14
21
9
15
14
14
5
18
10
5
3
2
3
11
16
8
9
17
4
21
15
11
10
2
7
4
8
13
7
15
1
7
15
5
4
17
9
10
2
21
3
2
4
10
10
8
12
21
18
21
2
4
8
10
2
15
7
5
4
13
20
8
5
9
12
14
12
21
4
2
16
11
3
10
6
9
4
11
9
10
5
13
10
10
19
9
1
9
18
14
4
21
19
21
6
19
9
2
4
4
13
2
21
13
10
4
10
12
21
13
6
6
2
16
19
11
6
2
5
10
17
6
8
3
13
8
4
2
19
7
19
9
5
3
12
7
10
12
12
8
4
20
9
15
7
7
21
5
14
19
2
18
1
12
10
7
8
9
4
3
6
4
4
3
17
2
7
20
4
3
10
10
11
4
6
4
9
13
5
3
12
16
18
3
12
4
4
3
17
4
7
16
10
17
12
19
12
8
18
8
14
21
9
15
14
14
5
18
10
5
3
2
3
11
16
8
9
17
4
21
15
11
10
2
7
4
8
13
7
15
1
7
15
5
4
17
9
10
2
21
3
2
4
10
10
8
12
21
18
21
2
4
8
10
2
15
7
5
4
13
20
8
5
9
12
14
12
21
4
2
16
11
3
10
6
9
4
11
9
10
5
13
10
10
19
9
1
9
18
14
4
21
19
21
6
19
9
2
4
4
13
2
21
13
10
4
10
12
21
13
6
6
2
16
19
11
6
2
5
10
17
6
8
3
13
8
4
2
19
7
19
9
5
3
12
7
10
12
12
8
4
20
9
15
7
7
21
5
14
19
2
18
1
12
10
7
8
9
4
3
6
4
4
3
17
2
7
20
4
3
10
10
11
4
6
4
9
13
5
3
12
16
18
3
12
4
4
3
17
4
7
16
10
17
12
19
12
8
18
8
14
21
9
15
14
14
5
18
10
5
3
2
3
11
16
8
9
17
4
21
15
11
10
2
7
4
8
13
7
15
1
7
15
5
4
17
9
10
2
21
3
2
4
10
10
8
12
21
18
21
2
4
8
10
2
15
7
5
4
13
20
8
5
9
12
14
12
21
4
2
16
11
3
10
6
9
4
11
9
10
5
13
10
10
19
9
1
9
18
14
4
21
19
21
6
19
9
2
4
4
13
2
21
13
10
4
10
12
21
13
6
6
2
16
19
11
6
2
5
10
17
6
8
3
13
8
4
2
19
7
19
9
5
3
12
7
10
12
12
8
4
20
9
15
7
7
21
5
14
19
2
18
1
12
10
7
8
9
4
3
6
4
4
3
17
2
7
20
4
3
10
10
11
4
6
4
9
13
5
3
12
16
18
3
12
4
4
3
17
4
7
16
10
17
12
19
12
8
18
8
14
21
9
15
14
14
5
18
10
5
3
2
3
11
16
8
9
17
4
21
15
11
10
2
7
4
8
13
7
15
1
7
15
5
4
17
9
10
2
21
3
2
4
10
10
8
12
21
18
21
2
4
8
10
2
15
7
5
4
13
20
8
5
9
12
14
12
21
4
2
16
11
3
10
6
9
4
11
9
10
5
13
10
10
19
9
1
9
18
14
4
21
19
21
6
19
9
2
4
4
13
2
21
13
10
4
10
12
21
13
6
6
2
16
19
11
6
2
5
10
17
6
8
3
13
8
4
2
19
7
19
9
5
3
12
7
10
12
12
8
4
20
9
15
7
7
21
5
14
19
2
18
1
12
10
7
8
9
4
3
6
4
4
3
17
2
7
20
4
3
10
10
11
4
6
4
9
13
5
3
12
16
18
3
12
4
4
3
17
4
7
16
10
17
12
19
12
8
18
8
14
21
9
15
14
14
5
18
10
5
3
2
3
11
16
8
9
17
4
21
15
11
10
2
7
4
8
13
7
15
1
7
15
5
4
17
9
10
2
21
3
2
4
10
10
8
12
21
18
21
2
4
8
10
2
15
7
5
4
13
20
8
5
9
12
14
12
21
4
2
16
11
3
10
6
9
4
11
9
10
5
13
10
10
19
9
1
9
18
14
4
21
19
21
6
19
9
2
4
4
13
2
21
13
10
4
10
12
21
13
6
6
2
16
19
11
6
2
5
10
17
6
8
3
13
8
4
2
19
7
19
9
5
3
12
7
10
12
12
8
4
20
9
15
7
7
21
5
14
19
2
18
1
12
10
7
8
9
4
3
6
4
4
3
17
2
7
20
4
3
10
10
11
4
6
4
9
13
5
3
12
16
18
3
12
4
4
3
17
4
7
16
10
17
12
19
12
8
18
8
14
21
9
15
14
14
5
18
10
5
3
2
3
11
16
8
9
17
4
21
15
11
10
2
7
4
8
13
7
15
1
7
15
5
4
17
9
10
2
21
3
2
4
10
10
8
12
21
18
21
2
4
8
10
2
15
7
5
4
13
20
8
5
9
12
14
12
21
4
2
16
11
3
10
6
9
4
11
9
10
5
13
10
10
19
9
1
9
18
14
4
21
19
21
6
19
9
2
4
4
13
2
21
13
10
4
10
12
21
13
6
6
2
16
19
11
6
2
5
10
17
6
8
3
13
8
4
2
19
7
19
9
5
3
12
7
10
12
12
8
4
20
9
15
7
7
21
5
14
19
2
18
1
12
10
7
8
9
4
3
6
4
4
3
17
2
7
20
4
3
10
10
11
4
6
4
9
13
5
3
12
16
18
3
12
4
4
3
17
4
7
16
10
17
12
19
12
8
18
8
14
21
9
15
14
14
5
18
10
5
3
2
3
11
16
8
9
17
4
21
15
11
10
2
7
4
8
13
7
15
1
7
15
5
4
17
9
10
2
21
3
2
4
10
10
8
12
21
18
21
2
4
8
10
2
15
7
5
4
13
20
8
5
9
12
14
12
21
4
2
16
11
3
10
6
9
4
11
9
10
5
13
10
10
19
9
1
9
18
14
4
21
19
21
6
19
9
2
4
4
13
2
21
13
10
4
10
12
21
13
6
6
2
16
19
11
6
2
5
10
17
6
8
3
13
8
4
2
19
7
19
9
5
3
12
7
10
12
12
8
4
20
9
15
7
7
21
5
14
19
2
18
1
12
10
7
8
9
4
3
6
4
4
3
17
2
7
20
4
3
10
10
11
4
6
4
9
13
5
3
12
16
18
3
12
4
4
3
17
4
7
16
10
17
12
19
12
8
18
8
14
21
9
15
14
14
5
18
10
5
3
2
3
11
16
8
9
17
4
21
15
11
10
2
7
4
8
13
7
15
1
7
15
5
4
17
9
10
2
21
3
2
4
10
10
8
12
21
18
21
2
4
8
10
2
15
7
5
4
13
20
8
5
9
12
14
12
21
4
2
16
11
3
10
6
9
4
11
9
10
5
13
10
10
19
9
1
9
18
14
4
21
19
21
6
19
9
2
4
4
13
2
21
13
10
4
10
12
21
13
6
6
2
16
19
11
6
2
5
10
17
6
8
3
13
8
4
2
19
7
19
9
5
3
12
7
10
12
12
8
4
20
9
15
7
7
21
5
14
19
2
18
1
12
10
7
8
9
4
3
6
4
4
3
17
2
7
20
4
3
10
10
11
4
6
4
9
13
5
3
12
16
18
3
12
4
4
3
17
4
7
16
10
17
12
19
12
8
18
8
14
21
9
15
14
14
5
18
10
5
3
2
3
11
16
8
9
17
4
21
15
11
10
2
7
4
8
13
7
15
1
7
15
5
4
17
9
10
2
21
3
2
4
10
10
8
12
21
18
21
2
4
8
10
2
15
7
5
4
13
20
8
5
9
12
14
12
21
4
2
16
11
3
10
6
9
4
11
9
10
5
13
10
10
19
9
1
9
18
14
4
21
19
21
6
19
9
2
4
4
13
2
21
13
10
4
10
12
21
13
6
6
2
16
19
11
6
2
5
10
17
6
8
3
13
8
4
2
19
7
19
9
5
3
12
7
10
12
12
8
4
20
9
15
7
7
21
5
14
19
2
18
1
12
10
7
8
9
4
3
6
4
4
3
17
2
7
20
4
3
10
10
11
4
6
4
9
13
5
3
12
16
18
3
12
4
4
3
17
4
7
16
10
17
12
19
12
8
18
8
14
21
9
15
14
14
5
18
10
5
3
2
3
11
16
8
9
17
4
21
15
11
10
2
7
4
8
13
7
15
1
7
15
5
4
17
9
10
2
21
3
2
4
10
10
8
12
21
18
21
2
4
8
10
2
15
7
5
4
13
20
8
5
9
12
14
12
21
4
2
16
11
3
10
6
9
4
11
9
10
5
13
10
10
19
9
1
9
18
14
4
21
19
21
6
19
9
2
4
4
13
2
21
13
10
4
10
12
21
13
6
6
2
16
19
11
6
2
5
10
17
6
8
3
13
8
4
2
19
7
19
9
5
3
12
7
10
12
12
8
4
20
9
15
7
7
21
5
14
19
2
18
1
12
10
7
8
9
4
3
6
4
4
3
17
2
7
20
4
3
10
10
11
4
6
4
9
13
5
3
12
16
18
3
12
4
4
3
17
4
7
16
10
17
12
19
12
8
18
8
14
21
9
15
14
14
5
18
10
5
3
2
3
11
16
8
9
17
4
21
15
11
10
2
7
4
8
13
7
15
1
7
15
5
4
17
9
10
2
21
3
2
4
10
10
8
12
21
18
21
2
4
8
10
2
15
7
5
4
13
20
8
5
9
12
14
12
21
4
2
16
11
3
10
6
9
4
11
9
10
5
13
10
10
19
9
1
9
18
14
4
21
19
21
6
19
9
2
4
4
13
2
21
13
10
4
10
12
21
13
6
6
2
16
19
11
6
2
5
10
17
6
8
3
13
8
4
2
19
7
19
9
5
3
12
7
10
12
12
8
4
20
9
15
7
7
21
5
14
19
2
18
1
12
10
7
8
9
4
3
6
4
4
3
17
2
7
20
4
3
10
10
11
4
6
4
9
13
5
3
12
16
18
3
12
4
4
3
17
4
7
16
10
17
12
19
12
8
18
8
14
21
9
15
14
14
5
18
10
5
3
2
3
11
16
8
9
17
4
21
15
11
10
2
7
4
8
13
7
15
1
7
15
5
4
17
9
10
2
21
3
2
4
10
10
8
12
21
18
21
2
4
8
10
2
15
7
5
4
13
20
8
5
9
12
14
12
21
4
2
16
11
3
10
6
9
4
11
9
10
5
13
10
10
19
9
1
9
18
14
4
21
19
21
6
19
9
2
4
4
13
2
21
13
10
4
10
12
21
13
6
6
2
16
19
11
6
2
5
10
17
6
8
3
13
8
4
2
19
7
19
9
5
3
12
7
10
12
12
8
4
20
9
15
7
7
21
5
14
19
2
18
1
12
10
7
8
9
4
3
6
4
4
3
17
2
7
20
4
3
10
10
11
4
6
4
9
13
5
3
12
16
18
3
12
4
4
3
17
4
7
16
10
17
12
19
12
8
18
8
14
21
9
15
14
14
5
18
10
5
3
2
3
11
16
8
9
17
4
21
15
11
10
2
7
4
8
13
7
15
1
7
15
5
4
17
9
10
2
21
3
2
4
10
10
8
12
21
18
21
2
4
8
10
2
15
7
5
4
13
20
8
5
9
12
14
12
21
4
2
16
11
3
10
6
9
4
11
9
10
5
13
10
10
19
9
1
9
18
14
4
21
19
21
6
19
9
2
4
4
13
2
21
13
10
4
10
12
21
13
6
6
2
16
19
11
6
2
5
10
17
6
8
3
13
8
4
2
19
7
19
9
5
3
12
7
10
12
12
8
4
20
9
15
7
7
21
5
14
19
2
18
1
12
10
7
8
9
4
3
6
4
4
3
17
2
7
20
4
3
10
10
11
4
6
4
9
13
5
3
12
16
18
3
12
4
4
3
17
4
7
16
10
17
12
19
12
8
18
8
14
21
9
15
14
14
5
18
10
5
3
2
3
11
16
8
9
17
4
21
15
11
10
2
7
4
8
13
7
15
1
7
15
5
4
17
9
10
2
21
3
2
4
10
10
8
12
21
18
21
2
4
8
10
2
15
7
5
4
13
20
8
5
9
12
14
12
21
4
2
16
11
3
10
6
9
4
11
9
10
5
13
10
10
19
9
1
9
18
14
4
21
19
21
6
19
9
2
4
4
13
2
21
13
10
4
10
12
21
13
6
6
2
16
19
11
6
2
5
10
17
6
8
3
13
8
4
2
19
7
19
9
5
3
12
7
10
12
12
8
4
20
9
15
7
7
21
5
14
19
2
18
1
12
10
7
8
9
4
3
6
4
4
3
17
2
7
20
4
3
10
10
11
4
6
4
9
13
5
3
12
16
18
3
12
4
4
3
17
4
7
16
10
17
12
19
12
8
18
8
14
21
9
15
14
14
5
18
10
5
3
2
3
11
16
8
9
17
4
21
15
11
10
2
7
4
8
13
7
15
1
7
15
5
4
17
9
10
2
21
3
2
4
10
10
8
12
21
18
21
2
4
8
10
2
15
7
5
4
13
20
8
5
9
12
14
12
21
4
2
16
11
3
10
6
9
4
11
9
10
5
13
10
10
19
9
1
9
18
14
4
21
19
21
6
19
9
2
4
4
13
2
21
13
10
4
10
12
21
13
6
6
2
16
19
11
6
2
5
10
17
6
8
3
13
8
4
2
19
7
19
9
5
3
12
7
10
12
12
8
4
20
9
15
7
7
21
5
14
19
2
18
1
12
10
7
8
9
4
3
6
4
4
3
17
2
7
20
4
3
10
10
11
4
6
4
9
13
5
3
12
16
18
3
12
4
4
3
17
4
7
16
10
17
12
19
12
8
18
8
14
21
9
15
14
14
5
18
10
5
3
2
3
11
16
8
9
17
4
21
15
11
10
2
7
4
8
13
7
15
1
7
15
5
4
17
9
10
2
21
3
2
4
10
10
8
12
21
18
21
2
4
8
10
2
15
7
5
4
13
20
8
5
9
12
14
12
21
4
2
16
11
3
10
6
9
4
11
9
10
5
13
10
10
19
9
1
9
18
14
4
21
19
21
6
19
9
2
4
4
13
2
21
13
10
4
10
12
21
13
6
6
2
16
19
11
6
2
5
10
17
6
8
3
13
8
4
2
19
7
19
9
5
3
12
7
10
12
12
8
4
20
9
15
7
7
21
5
14
19
2
18
1
12
10
7
8
9
4
3
6
4
4
3
17
2
7
20
4
3
10
10
11
4
6
4
9
13
5
3
12
16
18
3
12
4
4
3
17
4
7
16
10
17
12
19
12
8
18
8
14
21
9
15
14
14
5
18
10
5
3
2
3
11
16
8
9
17
4
21
15
11
10
2
7
4
8
13
7
15
1
7
15
5
4
17
9
10
2
21
3
2
4
10
10
8
12
21
18
21
2
4
8
10
2
15
7
5
4
13
20
8
5
9
12
14
12
21
4
2
16
11
3
10
6
9
4
11
9
10
5
13
10
10
19
9
1
9
18
14
4
21
19
21
6
19
9
2
4
4
13
2
21
13
10
4
10
12
21
13
6
6
2
16
19
11
6
2
5
10
17
6
8
3
13
8
4
2
19
7
19
9
5
3
12
7
10
12
12
8
4
20
9
15
7
7
21
5
14
19
2
18
1
12
10
7
8
9
4
3
6
4
4
3
17
2
7
20
4
3
10
10
11
4
6
4
9
13
5
3
12
16
18
3
12
4
4
3
17
4
7
16
10
17
12
19
12
8
18
8
14
21
9
15
14
14
5
18
10
5
3
2
3
11
16
8
9
17
4
21
15
11
10
2
7
4
8
13
7
15
1
7
15
5
4
17
9
10
2
21
3
2
4
10
10
8
12
21
18
21
2
4
8
10
2
15
7
5
4
13
20
8
5
9
12
14
12
21
4
2
16
11
3
10
6
9
4
11
9
10
5
13
10
10
19
9
1
9
18
14
4
21
19
21
6
19
9
2
4
4
13
2
21
13
10
4
10
12
21
13
6
6
2
16
19
11
6
2
5
10
17
6
8
3
13
8
4
2
19
7
19
9
5
3
12
7
10
12
12
8
4
20
9
15
7
7
21
5
14
19
2
18
1
12
10
7
8
9
4
3
6
4
4
3
17
2
7
20
4
3
10
10
11
4
6
4
9
13
5
3
12
16
18
3
12
4
4
3
17
4
7
16
10
17
12
19
12
8
18
8
14
21
9
15
14
14
5
18
10
5
3
2
3
11
16
8
9
17
4
21
15
11
10
2
7
4
8
13
7
15
1
7
15
5
4
17
9
10
2
21
3
2
4
10
10
8
12
21
18
21
2
4
8
10
2
15
7
5
4
13
20
8
5
9
12
14
12
21
4
2
16
11
3
10
6
9
4
11
9
10
5
13
10
10
19
9
1
9
18
14
4
21
19
21
6
19
9
2
4
4
13
2
21
13
10
4
10
12
21
13
6
6
2
16
19
11
6
2
5
10
17
6
8
3
13
8
4
2
19
7
19
9
5
3
12
7
10
12
12
8
4
20
9
15
7
7
21
5
14
19
2
18
1
12
10
7
8
9
4
3
6
4
4
3
17
2
7
20
4
3
10
10
11
4
6
4
9
13
5
3
12
16
18
3
12
4
4
3
17
4
7
16
10
17
12
19
12
8
18
8
14
21
9
15
14
14
5
18
10
5
3
2
3
11
16
8
9
17
4
21
15
11
10
2
7
4
8
13
7
15
1
7
15
5
4
17
9
10
2
21
3
2
4
10
10
8
12
21
18
21
2
4
8
10
2
15
7
5
4
13
20
8
5
9
12
14
12
21
4
2
16
11
3
10
6
9
4
11
9
10
5
13
10
10
19
9
1
9
18
14
4
21
19
21
6
19
9
2
4
4
13
2
21
13
10
4
10
12
21
13
6
6
2
16
19
11
6
2
5
10
17
6
8
3
13
8
4
2
19
7
19
9
5
3
12
7
10
12
12
8
4
20
9
15
7
7
21
5
14
19
2
18
1
12
10
7
8
9
4
3
6
4
4
3
17
2
7
20
4
3
10
10
11
4
6
4
9
13
5
3
12
16
18
3
12
4
4
3
17
4
7
16
10
17
12
19
12
8
18
8
14
21
9
15
14
14
5
18
10
5
3
2
3
11
16
8
9
17
4
21
15
11
10
2
7
4
8
13
7
15
1
7
15
5
4
17
9
10
2
21
3
2
4
10
10
8
12
21
18
21
2
4
8
10
2
15
7
5
4
13
20
8
5
9
12
14
12
21
4
2
16
11
3
10
6
9
4
11
9
10
5
13
10
10
19
9
1
9
18
14
4
21
19
21
6
19
9
2
4
4
13
2
21
13
10
4
10
12
21
13
6
6
2
16
19
11
6
2
5
10
17
6
8
3
13
8
4
2
19
7
19
9
5
3
12
7
10
12
12
8
4
20
9
15
7
7
21
5
14
19
2
18
1
12
10
7
8
9
4
3
6
4
4
3
17
2
7
20
4
3
10
10
11
4
6
4
9
13
5
3
12
16
18
3
12
4
4
3
17
4
7
16
10
17
12
19
12
8
18
8
14
21
9
15
14
14
5
18
10
5
3
2
3
11
16
8
9
17
4
21
15
11
10
2
7
4
8
13
7
15
1
7
15
5
4
17
9
10
2
21
3
2
4
10
10
8
12
21
18
21
2
4
8
10
2
15
7
5
4
13
20
8
5
9
12
14
12
21
4
2
16
11
3
10
6
9
4
11
9
10
5
13
10
10
19
9
1
9
18
14
4
21
19
21
6
19
9
2
4
4
13
2
21
13
10
4
10
12
21
13
6
6
2
16
19
11
6
2
5
10
17
6
8
3
13
8
4
2
19
7
19
9
5
3
12
7
10
12
12
8
4
20
9
15
7
7
21
5
14
19
2
18
1
12
10
7
8
9
4
3
6
4
4
3
17
2
7
20
4
3
10
10
11
4
6
4
9
13
5
3
12
16
18
3
12
4
4
3
17
4
7
16
10
17
12
19
12
8
18
8
14
21
9
15
14
14
5
18
10
5
3
2
3
11
16
8
9
17
4
21
15
11
10
2
7
4
8
13
7
15
1
7
15
5
4
17
9
10
2
21
3
2
4
10
10
8
12
21
18
21
2
4
8
10
2
15
7
5
4
13
20
8
5
9
12
14
12
21
4
2
16
11
3
10
6
9
4
11
9
10
5
13
10
10
19
9
1
9
18
14
4
21
19
21
6
19
9
2
4
4
13
2
21
13
10
4
10
12
21
13
6
6
2
16
19
11
6
2
5
10
17
6
8
3
13
8
4
2
19
7
19
9
5
3
12
7
10
12
12
8
4
20
9
15
7
7
21
5
14
19
2
18
1
12
10
7
8
9
4
3
6
4
4
3
17
2
7
20
4
3
10
10
11
4
6
4
9
13
5
3
12
16
18
3
12
4
4
3
17
4
7
16
10
17
12
19
12
8
18
8
14
21
9
15
14
14
5
18
10
5
3
2
3
11
16
8
9
17
4
21
15
11
10
2
7
4
8
13
7
15
1
7
15
5
4
17
9
10
2
21
3
2
4
10
10
8
12
21
18
21
2
4
8
10
2
15
7
5
4
13
20
8
5
9
12
14
12
21
4
2
16
11
3
10
6
9
4
11
9
10
5
13
10
10
19
9
1
9
18
14
4
21
19
21
6
19
9
2
4
4
13
2
21
13
10
4
10
12
21
13
6
6
2
16
19
11
6
2
5
10
17
6
8
3
13
8
4
2
19
7
19
9
5
3
12
7
10
12
12
8
4
20
9
15
7
7
21
5
14
19
2
18
1
12
10
7
8
9
4
3
6
4
4
3
17
2
7
20
4
3
10
10
11
4
6
4
9
13
5
3
12
16
18
3
12
4
4
3
17
4
7
16
10
17
12
19
12
8
18
8
14
21
9
15
14
14
5
18
10
5
3
2
3
11
16
8
9
17
4
21
15
11
10
2
7
4
8
13
7
15
1
7
15
5
4
17
9
10
2
21
3
2
4
10
10
8
12
21
18
21
2
4
8
10
2
15
7
5
4
13
20
8
5
9
12
14
12
21
4
2
16
11
3
10
6
9
4
11
9
10
5
13
10
10
19
9
1
9
18
14
4
21
19
21
6
19
9
2
4
4
13
2
21
13
10
4
10
12
21
13
6
6
2
16
19
11
6
2
5
10
17
6
8
3
13
8
4
2
19
7
19
9
5
3
12
7
10
12
12
8
4
20
9
15
7
7
21
5
14
19
2
18
1
12
10
7
8
9
4
3
6
4
4
3
17
2
7
20
4
3
10
10
11
4
6
4
9
13
5
3
12
16
18
3
12
4
4
3
17
4
7
16
10
17
12
19
12
8
18
8
14
21
9
15
14
14
5
18
10
5
3
2
3
11
16
8
9
17
4
21
15
11
10
2
7
4
8
13
7
15
1
7
15
5
4
17
9
10
2
21
3
2
4
10
10
8
12
21
18
21
2
4
8
10
2
15
7
5
4
13
20
8
5
9
12
14
12
21
4
2
16
11
3
10
6
9
4
11
9
10
5
13
10
10
19
9
1
9
18
14
4
21
19
21
6
19
9
2
4
4
13
2
21
13
10
4
10
12
21
13
6
6
2
16
19
11
6
2
5
10
17
6
8
3
13
8
4
2
19
7
19
9
5
3
12
7
10
12
12
8
4
20
9
15
7
7
21
5
14
19
2
18
1
12
10
7
8
9
4
3
6
4
4
3
17
2
7
20
4
3
10
10
11
4
6
4
9
13
5
3
12
16
18
3
12
4
4
3
17
4
7
16
10
17
12
19
12
8
18
8
14
21
9
15
14
14
5
18
10
5
3
2
3
11
16
8
9
17
4
21
15
11
10
2
7
4
8
13
7
15
1
7
15
5
4
17
9
10
2
21
3
2
4
10
10
8
12
21
18
21
2
4
8
10
2
15
7
5
4
13
20
8
5
9
12
14
12
21
4
2
16
11
3
10
6
9
4
11
9
10
5
13
10
10
19
9
1
9
18
14
4
21
19
21
6
19
9
2
4
4
13
2
21
13
10
4
10
12
21
13
6
6
2
16
19
11
6
2
5
10
17
6
8
3
13
8
4
2
19
7
19
9
5
3
12
7
10
12
12
8
4
20
9
15
7
7
21
5
14
19
2
18
1
12
10
7
8
9
4
3
6
4
4
3
17
2
7
20
4
3
10
10
11
4
6
4
9
13
5
3
12
16
18
3
12
4
4
3
17
4
7
16
10
17
12
19
12
8
18
8
14
21
9
15
14
14
5
18
10
5
3
2
3
11
16
8
9
17
4
21
15
11
10
2
7
4
8
13
7
15
1
7
15
5
4
17
9
10
2
21
3
2
4
10
10
8
12
21
18
21
2
4
8
10
2
15
7
6
5
14
21
9
6
10
13
15
13
22
5
3
17
12
4
11
7
10
5
12
10
11
6
14
11
11
20
10
2
10
19
15
5
22
20
22
7
20
10
3
5
5
14
3
22
14
11
5
11
13
22
14
7
7
3
17
20
12
7
3
6
11
18
7
9
4
14
9
5
3
20
8
20
10
6
4
13
8
11
13
13
9
5
21
10
16
8
8
22
6
15
20
3
19
2
13
11
8
9
10
5
4
7
5
5
4
18
3
8
21
5
4
11
11
12
5
7
5
10
14
6
4
13
17
19
4
13
5
5
4
18
5
8
17
11
18
13
20
13
9
19
9
15
22
10
16
15
15
6
19
11
6
4
3
4
12
17
9
10
18
5
22
16
12
11
3
8
5
9
14
8
16
2
8
16
6
5
18
10
11
3
22
4
3
5
11
11
9
13
22
19
22
3
5
9
11
3
16
8
6
5
14
21
9
6
10
13
15
13
22
5
3
17
12
4
11
7
10
5
12
10
11
6
14
11
11
20
10
2
10
19
15
5
22
20
22
7
20
10
3
5
5
14
3
22
14
11
5
11
13
22
14
7
7
3
17
20
12
7
3
6
11
18
7
9
4
14
9
5
3
20
8
20
10
6
4
13
8
11
13
13
9
5
21
10
16
8
8
22
6
15
20
3
19
2
13
11
8
9
10
5
4
7
5
5
4
18
3
8
21
5
4
11
11
12
5
7
5
10
14
6
4
13
17
19
4
13
5
5
4
18
5
8
17
11
18
13
20
13
9
19
9
15
22
10
16
15
15
6
19
11
6
4
3
4
12
17
9
10
18
5
22
16
12
11
3
8
5
9
14
8
16
2
8
16
6
5
18
10
11
3
22
4
3
5
11
11
9
13
22
19
22
3
5
9
11
3
16
8
6
5
14
21
9
6
10
13
15
13
22
5
3
17
12
4
11
7
10
5
12
10
11
6
14
11
11
20
10
2
10
19
15
5
22
20
22
7
20
10
3
5
5
14
3
22
14
11
5
11
13
22
14
7
7
3
17
20
12
7
3
6
11
18
7
9
4
14
9
5
3
20
8
20
10
6
4
13
8
11
13
13
9
5
21
10
16
8
8
22
6
15
20
3
19
2
13
11
8
9
10
5
4
7
5
5
4
18
3
8
21
5
4
11
11
12
5
7
5
10
14
6
4
13
17
19
4
13
5
5
4
18
5
8
17
11
18
13
20
13
9
19
9
15
22
10
16
15
15
6
19
11
6
4
3
4
12
17
9
10
18
5
22
16
12
11
3
8
5
9
14
8
16
2
8
16
6
5
18
10
11
3
22
4
3
5
11
11
9
13
22
19
22
3
5
9
11
3
16
8
6
5
14
21
9
6
10
13
15
13
22
5
3
17
12
4
11
7
10
5
12
10
11
6
14
11
11
20
10
2
10
19
15
5
22
20
22
7
20
10
3
5
5
14
3
22
14
11
5
11
13
22
14
7
7
3
17
20
12
7
3
6
11
18
7
9
4
14
9
5
3
20
8
20
10
6
4
13
8
11
13
13
9
5
21
10
16
8
8
22
6
15
20
3
19
2
13
11
8
9
10
5
4
7
5
5
4
18
3
8
21
5
4
11
11
12
5
7
5
10
14
6
4
13
17
19
4
13
5
5
4
18
5
8
17
11
18
13
20
13
9
19
9
15
22
10
16
15
15
6
19
11
6
4
3
4
12
17
9
10
18
5
22
16
12
11
3
8
5
9
14
8
16
2
8
16
6
5
18
10
11
3
22
4
3
5
11
11
9
13
22
19
22
3
5
9
11
3
16
8
6
5
14
21
9
6
10
13
15
13
22
5
3
17
12
4
11
7
10
5
12
10
11
6
14
11
11
20
10
2
10
19
15
5
22
20
22
7
20
10
3
5
5
14
3
22
14
11
5
11
13
22
14
7
7
3
17
20
12
7
3
6
11
18
7
9
4
14
9
5
3
20
8
20
10
6
4
13
8
11
13
13
9
5
21
10
16
8
8
22
6
15
20
3
19
2
13
11
8
9
10
5
4
7
5
5
4
18
3
8
21
5
4
11
11
12
5
7
5
10
14
6
4
13
17
19
4
13
5
5
4
18
5
8
17
11
18
13
20
13
9
19
9
15
22
10
16
15
15
6
19
11
6
4
3
4
12
17
9
10
18
5
22
16
12
11
3
8
5
9
14
8
16
2
8
16
6
5
18
10
11
3
22
4
3
5
11
11
9
13
22
19
22
3
5
9
11
3
16
8
6
5
14
21
9
6
10
13
15
13
22
5
3
17
12
4
11
7
10
5
12
10
11
6
14
11
11
20
10
2
10
19
15
5
22
20
22
7
20
10
3
5
5
14
3
22
14
11
5
11
13
22
14
7
7
3
17
20
12
7
3
6
11
18
7
9
4
14
9
5
3
8
20
10
6
4
13
8
11
13
13
9
5
21
10
16
8
8
22
6
15
20
3
19
2
13
11
8
9
10
5
4
7
5
5
4
18
3
8
5
21
5
4
11
11
12
5
7
5
10
14
6
4
13
17
19
4
13
5
5
4
18
5
8
17
11
18
13
20
13
9
19
9
15
22
10
16
15
15
6
19
11
6
4
3
4
12
17
9
10
18
5
22
16
12
11
3
8
5
9
14
8
16
2
8
16
6
5
18
10
11
3
22
4
3
5
11
11
9
13
22
19
22
3
5
9
11
3
16
8
6
5
14
21
9
6
10
13
15
13
22
5
3
17
12
4
11
7
10
5
12
10
11
6
14
11
11
20
10
2
10
19
15
5
22
20
22
7
20
10
3
5
5
14
3
22
14
11
5
11
13
22
14
7
7
3
17
20
12
7
3
6
11
18
7
9
4
14
9
5
3
8
20
10
6
4
13
8
11
13
13
9
5
21
10
16
8
8
22
6
15
20
3
19
2
13
11
8
9
10
5
4
7
5
5
4
18
3
8
5
21
5
4
11
11
12
5
7
5
10
14
6
4
13
17
19
4
13
5
5
4
18
5
8
17
11
18
13
20
13
9
19
9
15
22
10
16
15
15
6
19
11
6
4
3
4
12
17
9
10
18
5
22
16
12
11
3
8
5
9
14
8
16
2
8
16
6
5
18
10
11
3
22
4
3
5
11
11
9
13
22
19
22
3
5
9
11
3
16
8
6
5
14
21
9
6
10
13
15
13
22
5
3
17
12
4
11
7
10
5
12
10
11
6
14
11
11
20
10
2
10
19
15
5
22
20
22
7
20
10
3
5
5
14
3
22
14
11
5
11
13
22
14
7
7
3
17
20
12
7
3
6
11
18
7
9
4
14
9
5
3
8
20
10
6
4
13
8
11
13
13
9
5
21
10
16
8
8
22
6
15
20
3
19
2
13
11
8
9
10
5
4
7
5
5
4
18
3
8
5
21
5
4
11
11
12
5
7
5
10
14
6
4
13
17
19
4
13
5
5
4
18
5
8
17
11
18
13
20
13
9
19
9
15
22
10
16
15
15
6
19
11
6
4
3
4
12
17
9
10
18
5
22
16
12
11
3
8
5
9
14
8
16
2
8
16
6
5
18
10
11
3
22
4
3
5
11
11
9
13
22
19
22
3
5
9
11
3
16
8
6
5
14
21
9
6
10
13
15
13
22
5
3
17
12
4
11
7
10
5
12
10
11
6
14
11
11
20
10
2
10
19
15
5
22
20
22
7
20
10
3
5
5
14
3
22
14
11
5
11
13
22
14
7
7
3
17
20
12
7
3
6
11
18
7
9
4
14
9
5
3
8
20
10
6
4
13
8
11
13
13
9
5
21
10
16
8
8
22
6
15
20
3
19
2
13
11
8
9
10
5
4
7
5
5
4
18
3
8
5
21
5
4
11
11
12
5
7
5
10
14
6
4
13
17
19
4
13
5
5
4
18
5
8
17
11
18
13
20
13
9
19
9
15
22
10
16
15
15
6
19
11
6
4
3
4
12
17
9
10
18
5
22
16
12
11
3
8
5
9
14
8
16
2
8
16
6
5
18
10
11
3
22
4
3
5
11
11
9
13
22
19
22
3
5
9
11
3
16
8
6
5
14
21
9
6
10
13
15
13
5
3
17
12
4
11
7
10
5
12
10
11
6
14
11
11
20
10
2
10
19
15
5
22
20
22
7
20
10
3
5
5
14
3
22
14
11
5
11
13
22
14
7
7
3
17
20
12
7
3
6
11
18
7
9
4
14
9
5
3
8
20
10
6
4
13
8
11
13
13
9
5
21
10
16
8
8
22
6
15
20
3
19
2
13
11
8
9
10
5
4
7
5
5
4
18
3
8
5
21
5
4
11
11
12
5
7
5
10
14
6
4
13
17
19
4
13
5
5
4
18
5
8
17
11
18
13
20
13
9
19
9
15
22
10
16
15
15
6
19
11
6
4
3
4
12
17
9
10
18
5
22
16
12
11
3
8
5
9
14
8
16
2
8
16
6
5
18
10
11
3
22
4
3
5
10
11
11
9
13
22
19
22
3
5
9
11
3
16
8
6
5
14
21
9
6
10
13
15
13
5
3
17
12
4
11
7
10
5
12
10
11
6
14
11
11
20
10
2
10
19
15
5
22
20
22
7
20
10
3
5
5
14
3
22
14
11
5
11
13
22
14
7
7
3
17
20
12
7
3
6
11
18
7
9
4
14
9
5
3
8
20
10
6
4
13
8
11
13
13
9
5
21
10
16
8
8
22
6
15
20
3
19
2
13
11
8
9
10
5
4
7
5
5
4
18
3
8
5
21
5
4
11
11
12
5
7
5
10
14
6
4
13
17
19
4
13
5
5
4
18
5
8
17
11
18
13
20
13
9
19
9
15
22
10
16
15
15
6
19
11
6
4
3
4
12
17
9
10
18
5
22
16
12
11
3
8
5
9
14
8
16
2
8
16
6
5
18
10
11
3
22
4
3
5
10
11
11
9
13
22
19
22
3
5
9
11
3
16
8
6
5
14
21
9
6
10
13
15
13
5
3
17
12
4
11
7
10
5
12
10
11
6
14
11
11
20
10
2
10
19
15
5
22
20
22
7
20
10
3
5
5
14
3
22
14
11
5
11
13
22
14
7
7
3
17
20
12
7
3
6
11
18
7
9
4
14
9
5
3
8
20
10
6
4
13
8
11
13
13
9
5
21
10
16
8
8
22
6
15
20
3
19
2
13
11
8
9
10
5
4
7
5
5
4
18
3
8
5
21
5
4
11
11
12
5
7
5
10
14
6
4
13
17
19
4
13
5
5
4
18
5
8
17
11
18
13
20
13
9
19
9
15
22
10
16
15
15
6
19
11
6
4
3
4
12
17
9
10
18
5
22
16
12
11
3
8
5
9
14
8
16
2
8
16
6
5
18
10
11
3
22
4
3
5
10
11
11
9
13
22
19
22
3
5
9
11
3
16
8
6
5
14
21
9
6
10
13
15
13
5
3
17
12
4
11
7
10
5
12
10
11
6
14
11
11
20
10
2
10
19
15
5
22
20
22
7
20
10
3
5
5
14
3
22
14
11
5
11
13
22
14
7
7
3
17
20
12
7
3
6
11
18
7
9
4
14
9
5
3
8
20
10
6
4
13
8
11
13
13
9
5
21
10
16
8
8
22
6
15
20
3
19
2
13
11
8
9
10
5
4
7
5
5
4
18
3
8
5
21
5
4
11
11
12
5
7
5
10
14
6
4
13
17
19
4
13
5
5
4
18
5
8
17
11
18
13
20
13
9
19
9
15
22
10
16
15
15
6
19
11
6
4
3
4
12
17
9
10
18
5
22
16
12
11
3
8
5
9
14
8
16
2
8
16
6
5
18
10
11
3
22
4
3
5
10
11
11
9
13
22
19
22
3
5
9
11
3
16
8
6
5
14
21
9
6
10
13
15
13
5
3
17
12
4
11
7
10
5
12
10
11
6
14
11
11
20
10
2
10
19
15
5
22
20
22
7
20
10
3
5
5
14
3
22
14
11
5
11
13
22
14
7
7
3
17
20
12
7
3
6
11
18
7
9
4
14
9
5
3
8
20
10
6
4
13
8
11
13
13
9
5
21
10
16
8
8
22
6
15
20
3
19
2
13
11
8
9
10
5
4
7
5
5
4
18
3
8
5
21
5
4
11
11
12
5
7
5
10
14
6
4
13
17
19
4
13
5
5
4
18
5
8
17
11
18
13
20
13
9
19
9
15
22
10
16
15
15
6
19
11
6
4
3
4
12
17
9
10
18
5
22
16
12
11
3
8
5
9
14
8
16
2
8
16
6
5
18
10
11
3
22
4
3
5
10
11
11
9
13
22
19
22
3
5
9
11
3
16
8
6
5
14
21
9
6
10
13
15
13
5
3
17
12
4
11
7
10
5
12
10
11
6
14
11
11
20
10
2
10
19
15
5
22
20
22
7
20
10
3
5
5
14
3
22
14
11
5
11
13
22
14
7
7
3
17
20
12
7
3
6
11
18
7
9
4
14
9
5
3
8
20
10
6
4
13
8
11
13
13
9
5
21
10
16
8
8
22
6
15
20
3
19
2
13
11
8
9
10
5
4
7
5
5
4
18
3
8
5
21
5
4
11
11
12
5
7
5
10
14
6
4
13
17
19
4
13
5
5
4
18
5
8
17
11
18
13
20
13
9
19
9
15
22
10
16
15
15
6
19
11
6
4
3
4
12
17
9
10
18
5
22
16
12
11
3
8
5
9
14
8
16
2
8
16
6
5
18
10
11
3
22
4
3
5
10
11
11
9
13
22
19
22
3
5
9
11
3
16
8
6
5
14
21
9
6
10
13
15
13
5
3
17
12
4
11
7
10
5
12
10
11
6
14
11
11
20
10
2
10
19
15
5
22
20
22
7
20
10
3
5
5
14
3
22
14
11
5
11
13
22
14
7
7
3
17
20
12
7
3
6
11
18
7
9
4
14
9
5
3
8
20
10
6
4
13
8
11
13
13
9
5
21
10
16
8
8
22
6
15
20
3
19
2
13
11
8
9
10
5
4
7
5
5
4
18
3
8
5
21
5
4
11
11
12
5
7
5
10
14
6
4
13
17
19
4
13
5
5
4
18
5
8
17
11
18
13
20
13
9
19
9
15
22
10
16
15
15
6
19
11
6
4
3
4
12
17
9
10
18
5
22
16
12
11
3
8
5
9
14
8
16
2
8
16
6
5
18
10
11
3
22
4
3
5
10
11
11
9
13
22
19
22
3
5
9
11
3
16
8
6
5
14
21
9
6
10
13
15
13
5
3
17
12
4
11
7
10
5
12
10
11
6
14
11
11
20
10
2
10
19
15
5
22
20
22
7
20
10
3
5
5
14
3
22
14
11
5
11
13
22
14
7
7
3
17
20
12
7
3
6
11
18
7
9
4
14
9
5
3
8
20
10
6
4
13
8
11
13
13
9
5
21
10
16
8
8
22
6
15
20
3
19
2
13
11
8
9
10
5
4
7
5
5
4
18
3
8
5
21
5
4
11
11
12
5
7
5
10
14
6
4
13
17
19
4
13
5
5
4
18
5
8
17
11
18
13
20
13
9
19
9
15
22
10
16
15
15
6
19
11
6
4
3
4
12
17
9
10
18
5
22
16
12
11
3
8
5
9
14
8
16
2
8
16
6
5
18
10
11
3
22
4
3
5
10
11
11
9
13
22
19
22
3
5
9
11
3
16
8
6
5
14
21
9
6
10
13
15
13
5
3
17
12
4
11
7
10
5
12
10
11
6
14
11
11
20
10
2
10
19
15
5
22
20
22
7
20
10
3
5
5
14
3
22
14
11
5
11
13
22
14
7
7
3
17
20
12
7
3
6
11
18
7
9
4
14
9
5
3
8
20
10
6
4
13
8
11
13
13
9
5
21
10
16
8
8
22
6
15
20
3
19
2
13
11
8
9
10
5
4
7
5
5
4
18
3
8
5
21
5
4
11
11
12
5
7
5
10
14
6
4
13
17
19
4
13
5
5
4
18
5
8
17
11
18
13
20
13
9
19
9
15
22
10
16
15
15
6
19
11
6
4
3
4
12
17
9
10
18
5
22
16
12
11
3
8
5
9
14
8
16
2
8
16
6
5
18
10
11
3
22
4
3
5
10
11
11
9
13
22
19
22
3
5
9
11
3
16
8
6
5
14
21
9
6
10
13
15
13
5
3
17
12
4
11
7
10
5
12
10
11
6
14
11
11
20
10
2
10
19
15
5
22
20
22
7
20
10
3
5
5
14
3
22
14
11
5
11
13
22
14
7
7
3
17
20
12
7
3
6
11
18
7
9
4
14
9
5
3
8
20
10
6
4
13
8
11
13
13
9
5
21
10
16
8
8
22
6
15
20
3
19
2
13
11
8
9
10
5
4
7
5
5
4
18
3
8
5
21
5
4
11
11
12
5
7
5
10
14
6
4
13
17
19
4
13
5
5
4
18
5
8
17
11
18
13
20
13
9
19
9
15
22
10
16
15
15
6
19
11
6
4
3
4
12
17
9
10
18
5
22
16
12
11
3
8
5
9
14
8
16
2
8
16
6
5
18
10
11
3
22
4
3
5
10
11
11
9
13
22
19
22
3
5
9
11
3
16
8
6
5
14
21
9
6
10
13
15
13
5
3
17
12
4
11
7
10
5
12
10
11
6
14
11
11
20
10
2
10
19
15
5
22
20
22
7
20
10
3
5
5
14
3
22
14
11
5
11
13
22
14
7
7
3
17
20
12
7
3
6
11
18
7
9
4
14
9
5
3
8
20
10
6
4
13
8
11
13
13
9
5
21
10
16
8
8
22
6
15
20
3
19
2
13
11
8
9
10
5
4
7
5
5
4
18
3
8
5
21
5
4
11
11
12
5
7
5
10
14
6
4
13
17
19
4
13
5
5
4
18
5
8
17
11
18
13
20
13
9
19
9
15
22
10
16
15
15
6
19
11
6
4
3
4
12
17
9
10
18
5
22
16
12
11
3
8
5
9
14
8
16
2
8
16
6
5
18
10
11
3
22
4
3
5
10
11
11
9
13
22
19
22
3
5
9
11
3
16
8
6
5
14
21
9
6
10
13
15
13
5
3
17
12
4
11
7
10
5
12
10
11
6
14
11
11
20
10
2
10
19
15
5
22
20
22
7
20
10
3
5
5
14
3
22
14
11
5
11
13
22
14
7
7
3
17
20
12
7
3
6
11
18
7
9
4
14
9
5
3
8
20
10
6
4
13
8
11
13
13
9
5
21
10
16
8
8
22
6
15
20
3
19
2
13
11
8
9
10
5
4
7
5
5
4
18
3
8
5
21
5
4
11
11
12
5
7
5
10
14
6
4
13
17
19
4
13
5
5
4
18
5
8
17
11
18
13
20
13
9
19
9
15
22
10
16
15
15
6
19
11
6
4
3
4
12
17
9
10
18
5
22
16
12
11
3
8
5
9
14
8
16
2
8
16
6
5
18
10
11
3
22
4
3
5
10
11
11
9
13
22
19
22
3
5
9
11
3
16
8
6
5
14
21
9
6
10
13
15
13
5
3
17
12
4
11
7
10
5
12
10
11
6
14
11
11
20
10
2
10
19
15
5
22
20
22
7
20
10
3
5
5
14
3
22
14
11
5
11
13
22
14
7
7
3
17
20
12
7
3
6
11
18
7
9
4
14
9
5
3
8
20
10
6
4
13
8
11
13
13
9
5
21
10
16
8
8
22
6
15
20
3
19
2
13
11
8
9
10
5
4
7
5
5
4
18
3
8
5
21
5
4
11
11
12
5
7
5
10
14
6
4
13
17
19
4
13
5
5
4
18
5
8
17
11
18
13
20
13
9
19
9
15
22
10
16
15
15
6
19
11
6
4
3
4
12
17
9
10
18
5
22
16
12
11
3
8
5
9
14
8
16
2
8
16
6
5
18
10
11
3
22
4
3
5
10
11
11
9
13
22
19
22
3
5
9
11
3
16
8
6
5
14
21
9
6
10
13
15
13
5
3
17
12
4
11
7
10
5
12
10
11
6
14
11
11
20
10
2
10
19
15
5
22
20
22
7
20
10
3
5
5
14
3
14
11
5
11
13
22
14
7
7
3
17
20
12
7
3
6
11
18
7
9
4
14
9
5
3
8
20
10
6
4
13
8
11
13
13
9
5
21
10
16
8
8
22
6
15
20
3
19
2
13
11
8
9
10
5
4
7
5
5
4
18
3
8
5
21
5
4
11
11
12
12
5
7
5
10
14
6
4
13
17
19
4
13
5
5
4
18
5
8
17
11
18
13
20
13
9
19
9
15
22
10
16
15
15
6
19
11
6
4
3
4
12
17
9
10
18
5
22
16
12
11
3
8
5
9
14
8
16
2
8
16
6
5
18
10
11
3
22
4
3
5
10
11
11
9
13
22
19
22
3
5
9
11
3
16
8
6
5
14
21
9
6
10
13
15
13
5
3
17
12
4
11
7
10
5
12
10
11
6
14
11
11
20
10
2
10
19
15
5
22
20
22
7
20
10
3
5
5
14
3
14
11
5
11
13
22
14
7
7
3
17
20
12
7
3
6
11
18
7
9
4
14
9
5
3
8
20
10
6
4
13
8
11
13
13
9
5
21
10
16
8
8
22
6
15
20
3
19
2
13
11
8
9
10
5
4
7
5
5
4
18
3
8
5
21
5
4
11
11
12
12
5
7
5
10
14
6
4
13
17
19
4
13
5
5
4
18
5
8
17
11
18
13
20
13
9
19
9
15
22
10
16
15
15
6
19
11
6
4
3
4
12
17
9
10
18
5
22
16
12
11
3
8
5
9
14
8
16
2
8
16
6
5
18
10
11
3
22
4
3
5
10
11
11
9
13
22
19
22
3
5
9
11
3
16
8
6
5
14
21
9
6
10
13
15
13
5
3
17
12
4
11
7
10
5
12
10
11
6
14
11
11
20
10
2
10
19
15
5
22
20
22
7
20
10
3
5
5
14
3
14
11
5
11
13
22
14
7
7
3
17
20
12
7
3
6
11
18
7
9
4
14
9
5
3
8
20
10
6
4
13
8
11
13
13
9
5
21
10
16
8
8
22
6
15
20
3
19
2
13
11
8
9
10
5
4
7
5
5
4
18
3
8
5
21
5
4
11
11
12
12
5
7
5
10
14
6
4
13
17
19
4
13
5
5
4
18
5
8
17
11
18
13
20
13
9
19
9
15
22
10
16
15
15
6
19
11
6
4
3
4
12
17
9
10
18
5
22
16
12
11
3
8
5
9
14
8
16
2
8
16
6
5
18
10
11
3
22
4
3
5
10
11
11
9
13
22
19
22
3
5
9
11
3
16
8
6
5
14
21
9
6
10
13
15
13
5
3
17
12
4
11
7
10
5
12
10
11
6
14
11
11
20
10
2
10
19
15
5
22
20
22
7
20
10
3
5
5
14
3
14
11
5
11
13
22
14
7
7
3
17
20
12
7
3
6
11
18
7
9
4
14
9
5
3
8
20
10
6
4
13
8
11
13
13
9
5
21
10
16
8
8
22
6
15
20
3
19
2
13
11
8
9
10
5
4
7
5
5
4
18
3
8
5
21
5
4
11
11
12
12
5
7
5
10
14
6
4
13
17
19
4
13
5
5
4
18
5
8
17
11
18
13
20
13
9
19
9
15
22
10
16
15
15
6
19
11
6
4
3
4
12
17
9
10
18
5
22
16
12
11
3
8
5
9
14
8
16
2
8
16
6
5
18
10
11
3
22
4
3
5
10
11
11
9
13
22
19
22
3
5
9
11
3
16
8
6
5
14
21
9
6
10
13
15
13
5
3
17
12
4
11
7
10
5
12
10
11
6
14
11
11
20
10
2
10
19
15
5
22
20
22
7
20
10
3
5
5
14
3
14
11
5
11
13
22
14
7
7
3
17
20
12
7
3
6
11
18
7
9
4
14
9
5
3
8
20
10
6
4
13
8
11
13
13
9
5
21
10
16
8
8
22
6
15
20
3
19
2
13
11
8
9
10
5
4
7
5
5
4
18
3
8
5
21
5
4
11
11
12
12
5
7
5
10
14
6
4
13
17
19
4
13
5
5
4
18
5
8
17
11
18
13
20
13
9
19
9
15
22
10
16
15
15
6
19
11
6
4
3
4
12
17
9
10
18
5
22
16
12
11
3
8
5
9
14
8
16
2
8
16
6
5
18
10
11
3
22
4
3
5
10
11
11
9
13
22
19
22
3
5
9
11
3
16
8
6
5
14
21
9
6
10
13
15
13
5
3
17
12
4
11
7
10
5
12
10
11
6
14
11
11
20
10
2
10
19
15
5
22
20
22
7
20
10
3
5
5
14
3
14
11
5
11
13
22
14
7
7
3
17
20
12
7
3
6
11
18
7
9
4
14
9
5
3
8
20
10
6
4
13
8
11
13
13
9
5
21
10
16
8
8
22
6
15
20
3
19
2
13
11
8
9
10
5
4
7
5
5
4
18
3
8
5
21
5
4
11
11
12
12
5
7
5
10
14
6
4
13
17
19
4
13
5
5
4
18
5
8
17
11
18
13
20
13
9
19
9
15
22
10
16
15
15
6
19
11
6
4
3
4
12
17
9
10
18
5
22
16
12
11
3
8
5
9
14
8
16
2
8
16
6
5
18
10
11
3
22
4
3
5
10
11
11
9
13
22
19
22
3
5
9
11
3
16
8
6
5
14
21
9
6
10
13
15
13
5
3
17
12
4
11
7
10
5
12
10
11
6
14
11
11
20
10
2
10
19
15
5
22
20
22
7
20
10
3
5
5
14
3
14
11
5
11
13
22
14
7
7
3
17
20
12
7
3
6
11
18
7
9
4
14
9
5
3
8
20
10
6
4
13
8
11
13
13
9
5
21
10
16
8
8
22
6
15
20
3
19
2
13
11
8
9
10
5
4
7
5
5
4
18
3
8
5
21
5
4
11
11
12
12
5
7
5
10
14
6
4
13
17
19
4
13
5
5
4
18
5
8
17
11
18
13
20
13
9
19
9
15
22
10
16
15
15
6
19
11
6
4
3
4
12
17
9
10
18
5
22
16
12
11
3
8
5
9
14
8
16
2
8
16
6
5
18
10
11
3
22
4
3
5
10
11
11
9
13
22
19
22
3
5
9
11
3
16
8
6
5
14
21
9
6
10
13
15
13
5
3
17
12
4
11
7
10
5
12
10
11
6
14
11
11
20
10
2
10
19
15
5
22
20
22
7
20
10
3
5
5
14
3
14
11
5
11
13
22
14
7
7
3
17
20
12
7
3
6
11
18
7
9
4
14
9
5
3
8
20
10
6
4
13
8
11
13
13
9
5
21
10
16
8
8
22
6
15
20
3
19
2
13
11
8
9
10
5
4
7
5
5
4
18
3
8
5
21
5
4
11
11
12
12
5
7
5
10
14
6
4
13
17
19
4
13
5
5
4
18
5
8
17
11
18
13
20
13
9
19
9
15
22
10
16
15
15
6
19
11
6
4
3
4
12
17
9
10
18
5
22
16
12
11
3
8
5
9
14
8
16
2
8
16
6
5
18
10
11
3
22
4
3
5
10
11
11
9
13
22
19
22
3
5
9
11
3
16
8
6
5
14
21
9
6
10
13
15
13
5
3
17
12
4
11
7
10
5
12
10
11
6
14
11
11
20
10
2
10
19
15
5
22
20
22
7
20
10
3
5
5
14
3
14
11
5
11
13
22
14
7
7
3
17
20
12
7
3
6
11
18
7
9
4
14
9
5
3
8
20
10
6
4
13
8
11
13
13
9
5
21
10
16
8
8
22
6
15
20
3
19
2
13
11
8
9
10
5
4
7
5
5
4
18
3
8
5
21
5
4
11
11
12
12
5
7
5
10
14
6
4
13
17
19
4
13
5
5
4
18
5
8
17
11
18
13
20
13
9
19
9
15
22
10
16
15
15
6
19
11
6
4
3
4
12
17
9
10
18
5
22
16
12
11
3
8
5
9
14
8
16
2
8
16
6
5
18
10
11
3
22
4
3
5
10
11
11
9
13
22
19
22
3
5
9
11
3
16
8
6
5
14
21
9
6
10
13
15
13
5
3
17
12
4
11
7
10
5
12
10
11
6
14
11
11
20
10
2
10
19
15
5
22
20
22
7
20
10
3
5
5
14
3
14
11
5
11
13
22
14
7
7
3
17
20
12
7
3
6
11
18
7
9
4
14
9
5
3
8
20
10
6
4
13
8
11
13
13
9
5
21
10
16
8
8
22
6
15
20
3
19
2
13
11
8
9
10
5
4
7
5
5
4
18
3
8
5
21
5
4
11
11
12
12
5
7
5
10
14
6
4
13
17
19
4
13
5
5
4
18
5
8
17
11
18
13
20
13
9
19
9
15
22
10
16
15
15
6
19
11
6
4
3
4
12
17
9
10
18
5
22
16
12
11
3
8
5
9
14
8
16
2
8
16
6
5
18
10
11
3
22
4
3
5
10
11
11
9
13
22
19
22
3
5
9
11
3
16
8
6
5
14
21
9
6
10
13
15
13
5
3
17
12
4
11
7
10
5
12
10
11
6
14
11
11
20
10
2
10
19
15
5
22
20
22
7
20
10
3
5
5
14
3
14
11
5
11
13
22
14
7
7
3
17
20
12
7
3
6
11
18
7
9
4
14
9
5
3
8
20
10
6
4
13
8
11
13
13
9
5
21
10
16
8
8
22
6
15
20
3
19
2
13
11
8
9
10
5
4
7
5
5
4
18
3
8
5
21
5
4
11
11
12
12
5
7
5
10
14
6
4
13
17
19
4
13
5
5
4
18
5
8
17
11
18
13
20
13
9
19
9
15
22
10
16
15
15
6
19
11
6
4
3
4
12
17
9
10
18
5
22
16
12
11
3
8
5
9
14
8
16
2
8
16
6
5
18
10
11
3
22
4
3
5
10
11
11
9
13
22
19
22
3
5
9
11
3
16
8
6
5
14
21
9
6
10
13
15
13
5
3
17
12
4
11
7
10
5
12
10
11
6
14
11
11
20
10
2
10
19
15
5
22
20
22
7
20
10
3
5
5
14
3
14
11
5
11
13
22
14
7
7
3
17
20
12
7
3
6
11
18
7
9
4
14
9
5
3
8
20
10
6
4
13
8
11
13
13
9
5
21
10
16
8
8
22
6
15
20
3
19
2
13
11
8
9
10
5
4
7
5
5
4
18
3
8
5
21
5
4
11
11
12
12
5
7
5
10
14
6
4
13
17
19
4
13
5
5
4
18
5
8
17
11
18
13
20
13
9
19
9
15
22
10
16
15
15
6
19
11
6
4
3
4
12
17
9
10
18
5
22
16
12
11
3
8
5
9
14
8
16
2
8
16
6
5
18
10
11
3
22
4
3
5
10
11
11
9
13
22
19
22
3
5
9
11
3
16
8
6
5
14
21
9
6
10
13
15
13
5
3
17
12
4
11
7
10
5
12
10
11
6
14
11
11
20
10
2
10
19
15
5
22
20
22
7
20
10
3
5
5
14
3
14
11
5
11
13
22
14
7
7
3
17
20
12
7
3
6
11
18
7
9
4
14
9
5
3
8
20
10
6
4
13
8
11
13
13
9
5
21
10
16
8
8
22
6
15
20
3
19
2
13
11
8
9
10
5
4
7
5
5
4
18
3
8
5
21
5
4
11
11
12
12
5
7
5
10
14
6
4
13
17
19
4
13
5
5
4
18
5
8
17
11
18
13
20
13
9
19
9
15
22
10
16
15
15
6
19
11
6
4
3
4
12
17
9
10
18
5
22
16
12
11
3
8
5
9
14
8
16
2
8
16
6
5
18
10
11
3
22
4
3
5
10
11
11
9
13
22
19
22
3
5
9
11
3
16
8
6
5
14
21
9
6
10
13
15
13
5
3
17
12
4
11
7
10
5
12
10
11
6
14
11
11
20
10
2
10
19
15
5
22
20
22
7
20
10
3
5
5
14
3
14
11
5
11
13
22
14
7
7
3
17
20
12
7
3
6
11
18
7
9
4
14
9
5
3
8
20
10
6
4
13
8
11
13
13
9
5
21
10
16
8
8
22
6
15
20
3
19
2
13
11
8
9
10
5
4
7
5
5
4
18
3
8
5
21
5
4
11
11
12
12
5
7
5
10
14
6
4
13
17
19
4
13
5
5
4
18
5
8
17
11
18
13
20
13
9
19
9
15
22
10
16
15
15
6
19
11
6
4
3
4
12
17
9
10
18
5
22
16
12
11
3
8
5
9
14
8
16
2
8
16
6
5
18
10
11
3
22
4
3
5
10
11
11
9
13
22
19
22
3
5
9
11
3
16
8
6
5
14
21
9
6
10
13
15
13
5
3
17
12
4
11
7
10
5
12
10
11
6
14
11
11
20
10
2
10
19
15
5
22
20
22
7
20
10
3
5
5
14
3
14
11
5
11
13
22
14
7
7
3
17
20
12
7
3
6
11
18
7
9
4
14
9
5
3
8
20
10
6
4
13
8
11
13
13
9
5
21
10
16
8
8
22
6
15
20
3
19
2
13
11
8
9
10
5
4
7
5
5
4
18
3
8
5
21
5
4
11
11
12
12
5
7
5
10
14
6
4
13
17
19
4
13
5
5
4
18
5
8
17
11
18
13
20
13
9
19
9
15
22
10
16
15
15
6
19
11
6
4
3
4
12
17
9
10
18
5
22
16
12
11
3
8
5
9
14
8
16
2
8
16
6
5
18
10
11
3
22
4
3
5
10
11
11
9
13
22
19
22
3
5
9
11
3
16
8
6
5
14
21
9
6
10
13
15
13
5
3
17
12
4
11
7
10
5
12
10
11
6
14
11
11
20
10
2
10
19
15
5
22
20
22
7
20
10
3
5
5
14
3
14
11
5
11
13
22
14
7
7
3
17
20
12
7
3
6
11
18
7
9
4
14
9
5
3
8
20
10
6
4
13
8
11
13
13
9
5
21
10
16
8
8
22
6
15
20
3
19
2
13
11
8
9
10
5
4
7
5
5
4
18
3
8
5
21
5
4
11
11
12
12
5
7
5
10
14
6
4
13
17
19
4
13
5
5
4
18
5
8
17
11
18
13
20
13
9
19
9
15
22
10
16
15
15
6
19
11
6
4
3
4
12
17
9
10
18
5
22
16
12
11
3
8
5
9
14
8
16
2
8
16
6
5
18
10
11
3
22
4
3
5
10
11
11
9
13
22
19
22
3
5
9
11
3
16
8
6
5
14
21
9
6
10
13
15
13
5
3
17
12
4
11
7
10
5
12
10
11
6
14
11
11
20
10
2
10
19
15
5
22
20
22
7
20
10
3
5
5
14
3
14
11
5
11
13
22
14
7
7
3
17
20
12
7
3
6
11
18
7
9
4
14
9
5
3
8
20
10
6
4
13
8
11
13
13
9
5
21
10
16
8
8
22
6
15
20
3
19
2
13
11
8
9
10
5
4
7
5
5
4
18
3
8
5
21
5
4
11
11
12
12
5
7
5
10
14
6
4
13
17
19
4
13
5
5
4
18
5
8
17
11
18
13
20
13
9
19
9
15
22
10
16
15
15
6
19
11
6
4
3
4
12
17
9
10
18
5
22
16
12
11
3
8
5
9
14
8
16
2
8
16
6
5
18
10
11
3
22
4
3
5
10
11
11
9
13
22
19
22
3
5
9
11
3
16
8
6
5
14
21
9
6
10
13
15
13
5
3
17
12
4
11
7
10
5
12
10
11
6
14
11
11
20
10
2
10
19
15
5
22
20
22
7
20
10
3
5
5
14
3
14
11
5
11
13
22
14
7
7
3
17
20
12
7
3
6
11
18
7
9
4
14
9
5
3
8
20
10
6
4
13
8
11
13
13
9
5
21
10
16
8
8
22
6
15
20
3
19
2
13
11
8
9
10
5
4
7
5
5
4
18
3
8
5
21
5
4
11
11
12
12
5
7
5
10
14
6
4
13
17
19
4
13
5
5
4
18
5
8
17
11
18
13
20
13
9
19
9
15
22
10
16
15
15
6
19
11
6
4
3
4
12
17
9
10
18
5
22
16
12
11
3
8
5
9
14
8
16
2
8
16
6
5
18
10
11
3
22
4
3
5
10
11
11
9
13
22
19
22
3
5
9
11
3
16
8
6
5
14
21
9
6
10
13
15
13
5
3
17
12
4
11
7
10
5
12
10
11
6
14
11
11
20
10
2
10
19
15
5
22
20
22
7
20
10
3
5
5
14
3
14
11
5
11
13
22
14
7
7
3
17
20
12
7
3
6
11
18
7
9
4
14
9
5
3
8
20
10
6
4
13
8
11
13
13
9
5
21
10
16
8
8
22
6
15
20
3
19
2
13
11
8
9
10
5
4
7
5
5
4
18
3
8
5
21
5
4
11
11
12
12
5
7
5
10
14
6
4
13
17
19
4
13
5
5
4
18
5
8
17
11
18
13
20
13
9
19
9
15
22
10
16
15
15
6
19
11
6
4
3
4
12
17
9
10
18
5
22
16
12
11
3
8
5
9
14
8
16
2
8
16
6
5
18
10
11
3
22
4
3
5
10
11
11
9
13
22
19
22
3
5
9
11
3
16
8
6
5
14
21
9
6
10
13
15
13
5
3
17
12
4
11
7
10
5
12
10
11
6
14
11
11
20
10
2
10
19
15
5
22
20
22
7
20
10
3
5
5
14
3
14
11
5
11
13
22
14
7
7
3
17
20
12
7
3
6
11
18
7
9
4
14
9
5
3
8
20
10
6
4
13
8
11
13
13
9
5
21
10
16
8
8
22
6
15
20
3
19
2
13
11
8
9
10
5
4
7
5
5
4
18
3
8
5
21
5
4
11
11
12
12
5
7
5
10
14
6
4
13
17
19
4
13
5
5
4
18
5
8
17
11
18
13
20
13
9
19
9
15
22
10
16
15
15
6
19
11
6
4
3
4
12
17
9
10
18
5
22
16
12
11
3
8
5
9
14
8
16
2
8
16
6
5
18
10
11
3
22
4
3
5
10
11
11
9
13
22
19
22
3
5
9
11
3
16
8
6
5
14
21
9
6
10
13
15
13
5
3
17
12
4
11
7
10
5
12
10
11
6
14
11
11
20
10
2
10
19
15
5
22
20
22
7
20
10
3
5
5
14
3
14
11
5
11
13
22
14
7
7
3
17
20
12
7
3
6
11
18
7
9
4
14
9
5
3
8
20
10
6
4
13
8
11
13
13
9
5
21
10
16
8
8
22
6
15
20
3
19
2
13
11
8
9
10
5
4
7
5
5
4
18
3
8
5
21
5
4
11
11
12
12
5
7
5
10
14
6
4
13
17
19
4
13
5
5
4
18
5
8
17
11
18
13
20
13
9
19
9
15
22
10
16
15
15
6
19
11
6
4
3
4
12
17
9
10
18
5
22
16
12
11
3
8
5
9
14
8
16
2
8
16
6
5
18
10
11
3
22
4
3
5
10
11
11
9
13
22
19
22
3
5
9
11
3
16
8
6
5
14
21
9
6
10
13
15
13
5
3
17
12
4
11
7
10
5
12
10
11
6
14
11
11
20
10
2
10
19
15
5
22
20
22
7
20
10
3
5
5
14
3
14
11
5
11
13
22
14
7
7
3
17
20
12
7
3
6
11
18
7
9
4
14
9
5
3
8
20
10
6
4
13
8
11
13
13
9
5
21
10
16
8
8
22
6
15
20
3
19
2
13
11
8
9
10
5
4
7
5
5
4
18
3
8
5
21
5
4
11
11
12
12
5
7
5
10
14
6
4
13
17
19
4
13
5
5
4
18
5
8
17
11
18
13
20
13
9
19
9
15
22
10
16
15
15
6
19
11
6
4
3
4
12
17
9
10
18
5
22
16
12
11
3
8
5
9
14
8
16
2
8
16
6
5
18
10
11
3
22
4
3
5
10
11
11
9
13
22
19
22
3
5
9
11
3
16
8
6
5
14
21
9
6
10
13
15
13
5
3
17
12
4
11
7
10
5
12
10
11
6
14
11
11
20
10
2
10
19
15
5
22
20
22
7
20
10
3
5
5
14
3
14
11
5
11
13
22
14
7
7
3
17
20
12
7
3
6
11
18
7
9
4
14
9
5
3
8
20
10
6
4
13
8
11
13
13
9
5
21
10
16
8
8
22
6
15
20
3
19
2
13
11
8
9
10
5
4
7
5
5
4
18
3
8
5
21
5
4
11
11
12
12
5
7
5
10
14
6
4
13
17
19
4
13
5
5
4
18
5
8
17
11
18
13
20
13
9
19
9
15
22
10
16
15
15
6
19
11
6
4
3
4
12
17
9
10
18
5
22
16
12
11
3
8
5
9
14
8
16
2
8
16
6
5
18
10
11
3
22
4
3
5
10
11
11
9
13
22
19
22
3
5
9
11
3
16
8
6
5
14
21
9
6
10
13
15
13
5
3
17
12
4
11
7
10
5
12
10
11
6
14
11
11
20
10
2
10
19
15
5
22
20
22
7
20
10
3
5
5
14
3
14
11
5
11
13
22
14
7
7
3
17
20
12
7
3
6
11
18
7
9
4
14
9
5
3
8
20
10
6
4
13
8
11
13
13
9
5
21
10
16
8
8
22
6
15
20
3
19
2
13
11
8
9
10
5
4
7
5
5
4
18
3
8
5
21
5
4
11
11
12
12
5
7
5
10
14
6
4
13
17
19
4
13
5
5
4
18
5
8
17
11
18
13
20
13
9
19
9
15
22
10
16
15
15
6
19
11
6
4
3
4
12
17
9
10
18
5
22
16
12
11
3
8
5
9
14
8
16
2
8
16
6
5
18
10
11
3
22
4
3
5
10
11
11
9
13
22
19
22
3
5
9
11
3
16
8
6
5
14
21
9
6
10
13
15
13
5
3
17
12
4
11
7
10
5
12
10
11
6
14
11
11
20
10
2
10
19
15
5
22
20
22
7
20
10
3
5
5
14
3
14
11
5
11
13
22
14
7
7
3
17
20
12
7
3
6
11
18
7
9
4
14
9
5
3
8
20
10
6
4
13
8
11
13
13
9
5
21
10
16
8
8
22
6
15
20
3
19
2
13
11
8
9
10
5
4
7
5
5
4
18
3
8
5
21
5
4
11
11
12
12
5
7
5
10
14
6
4
13
17
19
4
13
5
5
4
18
5
8
17
11
18
13
20
13
9
19
9
15
22
10
16
15
15
6
19
11
6
4
3
4
12
17
9
10
18
5
22
16
12
11
3
8
5
9
14
8
16
2
8
16
6
5
18
10
11
3
22
4
3
5
10
11
11
9
13
22
19
22
3
5
9
11
3
16
8
6
5
14
21
9
6
10
13
15
13
5
3
17
12
4
11
7
10
5
12
10
11
6
14
11
11
20
10
2
10
19
15
5
22
20
22
7
20
10
3
5
5
14
3
14
11
5
11
13
22
14
7
7
3
17
20
12
7
3
6
11
18
7
9
4
14
9
5
3
8
20
10
6
4
13
8
11
13
13
9
5
21
10
16
8
8
22
6
15
20
3
19
2
13
11
8
9
10
5
4
7
5
5
4
18
3
8
5
21
5
4
11
11
12
12
5
7
5
10
14
6
4
13
17
19
4
13
5
5
4
18
5
8
17
11
18
13
20
13
9
19
9
15
22
10
16
15
15
6
19
11
6
4
3
4
12
17
9
10
18
5
22
16
12
11
3
8
5
9
14
8
16
2
8
16
6
5
18
10
11
3
22
4
3
5
10
11
11
9
13
22
19
22
3
5
9
11
3
16
8
6
5
14
21
9
6
10
13
15
13
5
3
17
12
4
11
7
10
5
12
10
11
6
14
11
11
20
10
2
10
19
15
5
22
20
22
7
20
10
3
5
5
14
3
14
11
5
11
13
22
14
7
7
3
17
20
12
7
3
6
11
18
7
9
4
14
9
5
3
8
20
10
6
4
13
8
11
13
13
9
5
21
10
16
8
8
22
6
15
20
3
19
2
13
11
8
9
10
5
4
7
5
5
4
18
3
8
5
21
5
4
11
11
12
12
5
7
5
10
14
6
4
13
17
19
4
13
5
5
4
18
5
8
17
11
18
13
20
13
9
19
9
15
22
10
16
15
15
6
19
11
6
4
3
4
12
17
9
10
18
5
22
16
12
11
3
8
5
9
14
8
16
2
8
16
6
5
18
10
11
3
22
4
3
5
10
11
11
9
13
22
19
22
3
5
9
11
3
16
8
6
5
14
21
9
6
10
13
15
13
5
3
17
12
4
11
7
10
5
12
10
11
6
14
11
11
20
10
2
10
19
15
5
22
20
22
7
20
10
3
5
5
14
3
14
11
5
11
13
22
14
7
7
3
17
20
12
7
3
6
11
18
7
9
4
14
9
5
3
8
20
10
6
4
13
8
11
13
13
9
5
21
10
16
8
8
22
6
15
20
3
19
2
13
11
8
9
10
5
4
7
5
5
4
18
3
8
5
21
5
4
11
11
12
12
5
7
5
10
14
6
4
13
17
19
4
13
5
5
4
18
5
8
17
11
18
13
20
13
9
19
9
15
22
10
16
15
15
6
19
11
6
4
3
4
12
17
9
10
18
5
22
16
12
11
3
8
5
9
14
8
16
2
8
16
6
5
18
10
11
3
22
4
3
5
10
11
11
9
13
22
19
22
3
5
9
11
3
16
8
6
5
14
21
9
6
10
13
15
13
5
3
17
12
4
11
7
10
5
12
10
11
6
14
11
11
20
10
2
10
19
15
5
22
20
22
7
20
10
3
5
5
14
3
14
11
5
11
13
22
14
7
7
3
17
20
12
7
3
6
11
18
7
9
4
14
9
5
3
8
20
10
6
4
13
8
11
13
13
9
5
21
10
16
8
8
22
6
15
20
3
19
2
13
11
8
9
10
5
4
7
5
5
4
18
3
8
5
21
5
4
11
11
12
12
5
7
5
10
14
6
4
13
17
19
4
13
5
5
4
18
5
8
17
11
18
13
20
13
9
19
9
15
22
10
16
15
15
6
19
11
6
4
3
4
12
17
9
10
18
5
22
16
12
11
3
8
5
9
14
8
16
2
8
16
6
5
18
10
11
3
22
4
3
5
10
11
11
9
13
22
19
22
3
5
9
11
3
16
8
6
5
14
21
9
6
10
13
15
13
5
3
17
12
4
11
7
10
5
12
10
11
6
14
11
11
20
10
2
10
19
15
5
22
20
22
7
20
10
3
5
5
14
3
14
11
5
11
13
22
14
7
7
3
17
20
12
7
3
6
11
18
7
9
4
14
9
5
3
8
20
10
6
4
13
8
11
13
13
9
5
21
10
16
8
8
22
6
15
20
3
19
2
13
11
8
9
10
5
4
7
5
5
4
18
3
8
5
21
5
4
11
11
12
12
5
7
5
10
14
6
4
13
17
19
4
13
5
5
4
18
5
8
17
11
18
13
20
13
9
19
9
15
22
10
16
15
15
6
19
11
6
4
3
4
12
17
9
10
18
5
22
16
12
11
3
8
5
9
14
8
16
2
8
16
6
5
18
10
11
3
22
4
3
5
10
11
11
9
13
22
19
22
3
5
9
11
3
16
8
7
6
15
22
10
7
11
14
16
14
6
4
18
13
5
12
8
11
6
13
11
12
7
15
12
12
21
11
3
11
20
16
6
23
21
23
8
21
11
4
6
6
15
4
15
12
6
12
14
23
15
8
8
4
18
21
13
8
4
7
12
19
8
10
5
15
10
6
4
9
21
11
7
5
14
9
12
14
14
10
6
22
11
17
9
9
23
7
16
21
4
20
3
14
12
9
10
11
6
5
8
6
6
5
19
4
9
6
22
6
5
12
12
13
13
6
8
6
11
15
7
5
14
18
20
5
14
6
6
5
19
6
9
18
12
19
14
21
14
10
20
10
16
23
11
17
16
16
7
20
12
7
5
4
5
13
18
10
11
19
6
23
17
13
12
4
9
6
10
15
9
17
3
9
17
7
6
19
11
12
4
23
5
4
6
11
12
12
10
14
23
20
23
4
6
10
12
4
17
9
7
6
15
22
10
7
11
14
16
14
6
4
18
13
5
12
8
11
6
13
11
12
7
15
12
12
21
11
3
11
20
16
6
23
21
23
8
21
11
4
6
6
15
4
15
12
6
12
14
23
15
8
8
4
18
21
13
8
4
7
12
19
8
10
5
15
10
6
4
9
21
11
7
5
14
9
12
14
14
10
6
22
11
17
9
9
23
7
16
21
4
20
3
14
12
9
10
11
6
5
8
6
6
5
19
4
9
6
22
6
5
12
12
13
13
6
8
6
11
15
7
5
14
18
20
5
14
6
6
5
19
6
9
18
12
19
14
21
14
10
20
10
16
23
11
17
16
16
7
20
12
7
5
4
5
13
18
10
11
19
6
23
17
13
12
4
9
6
10
15
9
17
3
9
17
7
6
19
11
12
4
23
5
4
6
11
12
12
10
14
23
20
23
4
6
10
12
4
17
9
7
6
15
22
10
7
11
14
16
14
6
4
18
13
5
12
8
11
6
13
11
12
7
15
12
12
21
11
3
11
20
16
6
23
21
23
8
21
11
4
6
6
15
4
15
12
6
12
14
23
15
8
8
4
18
21
13
8
4
7
12
19
8
10
5
15
10
6
4
9
21
11
7
5
14
9
12
14
14
10
6
22
11
17
9
9
23
7
16
21
4
20
3
14
12
9
10
11
6
5
8
6
6
5
19
4
9
6
22
6
5
12
12
13
13
6
8
6
11
15
7
5
14
18
20
5
14
6
6
5
19
6
9
18
12
19
14
21
14
10
20
10
16
23
11
17
16
16
7
20
12
7
5
4
5
13
18
10
11
19
6
23
17
13
12
4
9
6
10
15
9
17
3
9
17
7
6
19
11
12
4
23
5
4
6
11
12
12
10
14
23
20
23
4
6
10
12
4
17
9
7
6
15
22
10
7
11
14
16
14
6
4
18
13
5
12
8
11
6
13
11
12
7
15
12
12
21
11
3
11
20
16
6
23
21
23
8
21
11
4
6
6
15
4
15
12
6
12
14
23
15
8
8
4
18
21
13
8
4
7
12
19
8
10
5
15
10
6
4
9
21
11
7
5
14
9
12
14
14
10
6
22
11
17
9
9
23
7
16
21
4
20
3
14
12
9
10
11
6
5
8
6
6
5
19
4
9
6
22
6
5
12
12
13
13
6
8
6
11
15
7
5
14
18
20
5
14
6
6
5
19
6
9
18
12
19
14
21
14
10
20
10
16
23
11
17
16
16
7
20
12
7
5
4
5
13
18
10
11
19
6
23
17
13
12
4
9
6
10
15
9
17
3
9
17
7
6
19
11
12
4
23
5
4
6
11
12
12
10
14
23
20
23
4
6
10
12
4
17
9
7
6
15
22
10
7
11
14
16
14
6
4
18
13
5
12
8
11
6
13
11
12
7
15
12
12
21
11
3
11
20
16
6
23
21
23
8
21
11
4
6
6
15
4
15
12
6
12
14
23
15
8
8
4
18
21
13
8
4
7
12
19
8
10
5
15
10
6
4
9
21
11
7
5
14
9
12
14
14
10
6
22
11
17
9
9
23
7
16
21
4
20
3
14
12
9
10
11
6
5
8
6
6
5
19
4
9
6
22
6
5
12
12
13
13
6
8
6
11
15
7
5
14
18
20
5
14
6
6
5
19
6
9
18
12
19
14
21
14
10
20
10
16
23
11
17
16
16
7
20
12
7
5
4
5
13
18
10
11
19
6
23
17
13
12
4
9
6
10
15
9
17
3
9
17
7
6
19
11
12
4
23
5
4
6
11
12
12
10
14
23
20
23
4
6
10
12
4
17
9
7
6
15
22
10
7
11
14
16
14
6
4
18
13
5
12
8
11
6
13
11
12
7
15
12
12
21
11
3
11
20
16
6
23
21
23
8
21
11
4
6
6
15
4
15
12
6
12
14
23
15
8
8
4
18
21
13
8
4
7
12
19
8
10
5
15
10
6
4
9
21
11
7
5
14
9
12
14
14
10
6
22
11
17
9
9
23
7
16
21
4
20
3
14
12
9
10
11
6
5
8
6
6
5
19
4
9
6
22
6
5
12
12
13
13
6
8
6
11
15
7
5
14
18
20
5
14
6
6
5
19
6
9
18
12
19
14
21
14
10
20
10
16
23
11
17
16
16
7
20
12
7
5
4
5
13
18
10
11
19
6
23
17
13
12
4
9
6
10
15
9
17
3
9
17
7
6
19
11
12
4
23
5
4
6
11
12
12
10
14
23
20
23
4
6
10
12
4
17
9
7
6
15
22
10
7
11
14
16
14
6
4
18
13
5
12
8
11
6
13
11
12
7
15
12
12
21
11
3
11
20
16
6
23
21
23
8
21
11
4
6
6
15
4
15
12
6
12
14
23
15
8
8
4
18
21
13
8
4
7
12
19
8
10
5
15
10
6
4
9
21
11
7
5
14
9
12
14
14
10
6
22
11
17
9
9
23
7
16
21
4
20
3
14
12
9
10
11
6
5
8
6
6
5
19
4
9
6
22
6
5
12
12
13
13
6
8
6
11
15
7
5
14
18
20
5
14
6
6
5
19
6
9
18
12
19
14
21
14
10
20
10
16
23
11
17
16
16
7
20
12
7
5
4
5
13
18
10
11
19
6
23
17
13
12
4
9
6
10
15
9
17
3
9
17
7
6
19
11
12
4
23
5
4
6
11
12
12
10
14
23
20
23
4
6
10
12
4
17
9
7
6
15
22
10
7
11
14
16
14
6
4
18
13
5
12
8
11
6
13
11
12
7
15
12
12
21
11
3
11
20
16
6
23
21
23
8
21
11
4
6
6
15
4
15
12
6
12
14
23
15
8
8
4
18
21
13
8
4
7
12
19
8
10
5
15
10
6
4
9
21
11
7
5
14
9
12
14
14
10
6
22
11
17
9
9
23
7
16
21
4
20
3
14
12
9
10
11
6
5
8
6
6
5
19
4
9
6
22
6
5
12
12
13
13
6
8
6
11
15
7
5
14
18
20
5
14
6
6
5
19
6
9
18
12
19
14
21
14
10
20
10
16
23
11
17
16
16
7
20
12
7
5
4
5
13
18
10
11
19
6
23
17
13
12
4
9
6
10
15
9
17
3
9
17
7
6
19
11
12
4
23
5
4
6
11
12
12
10
14
23
20
23
4
6
10
12
4
17
9
7
6
15
22
10
7
11
14
16
14
6
4
18
13
5
12
8
11
6
13
11
12
7
15
12
12
21
11
3
11
20
16
6
23
21
23
8
21
11
4
6
6
15
4
15
12
6
12
14
23
15
8
8
4
18
21
13
8
4
7
12
19
8
10
5
15
10
6
4
9
21
11
7
5
14
9
12
14
14
10
6
22
11
17
9
9
23
7
16
21
4
20
3
14
12
9
10
11
6
5
8
6
6
5
19
4
9
6
22
6
5
12
12
13
13
6
8
6
11
15
7
5
14
18
20
5
14
6
6
5
19
6
9
18
12
19
14
21
14
10
20
10
16
23
11
17
16
16
7
20
12
7
5
4
5
13
18
10
11
19
6
23
17
13
12
4
9
6
10
15
9
17
3
9
17
7
6
19
11
12
4
23
5
4
6
11
12
12
10
14
23
20
23
4
6
10
12
4
17
9
7
6
15
22
10
7
11
14
16
14
6
4
18
13
5
12
8
11
6
13
11
12
7
15
12
12
21
11
3
11
20
16
6
23
21
23
8
21
11
4
6
6
15
4
15
12
6
12
14
23
15
8
8
4
18
21
13
8
4
7
12
19
8
10
5
15
10
6
4
9
21
11
7
5
14
9
12
14
14
10
6
22
11
17
9
9
23
7
16
21
4
20
3
14
12
9
10
11
6
5
8
6
6
5
19
4
9
6
22
6
5
12
12
13
13
6
8
6
11
15
7
5
14
18
20
5
14
6
6
5
19
6
9
18
12
19
14
21
14
10
20
10
16
23
11
17
16
16
7
20
12
7
5
4
5
13
18
10
11
19
6
23
17
13
12
4
9
6
10
15
9
17
3
9
17
7
6
19
11
12
4
23
5
4
6
11
12
12
10
14
23
20
23
4
6
10
12
4
17
9
7
6
15
22
10
7
11
14
16
14
6
4
18
13
5
12
8
11
6
13
11
12
7
15
12
12
21
11
3
11
20
16
6
23
21
23
8
21
11
4
6
6
15
4
15
12
6
12
14
23
15
8
8
4
18
21
13
8
4
7
12
19
8
10
5
15
10
6
4
9
21
11
7
5
14
9
12
14
14
10
6
22
11
17
9
9
23
7
16
21
4
20
3
14
12
9
10
11
6
5
8
6
6
5
19
4
9
6
22
6
5
12
12
13
13
6
8
6
11
15
7
5
14
18
20
5
14
6
6
5
19
6
9
18
12
19
14
21
14
10
20
10
16
23
11
17
16
16
7
20
12
7
5
4
5
13
18
10
11
19
6
23
17
13
12
4
9
6
10
15
9
17
3
9
17
7
6
19
11
12
4
23
5
4
6
11
12
12
10
14
23
20
23
4
6
10
12
4
17
9
7
6
15
22
10
7
11
14
16
14
6
4
18
13
5
12
8
11
6
13
11
12
7
15
12
12
21
11
3
11
20
16
6
23
21
23
8
21
11
4
6
6
15
4
15
12
6
12
14
23
15
8
8
4
18
21
13
8
4
7
12
19
8
10
5
15
10
6
4
9
21
11
7
5
14
9
12
14
14
10
6
22
11
17
9
9
23
7
16
21
4
20
3
14
12
9
10
11
6
5
8
6
6
5
19
4
9
6
22
6
5
12
12
13
13
6
8
6
11
15
7
5
14
18
20
5
14
6
6
5
19
6
9
18
12
19
14
21
14
10
20
10
16
23
11
17
16
16
7
20
12
7
5
4
5
13
18
10
11
19
6
23
17
13
12
4
9
6
10
15
9
17
3
9
17
7
6
19
11
12
4
23
5
4
6
11
12
12
10
14
23
20
23
4
6
10
12
4
17
9
7
6
15
22
10
7
11
14
16
14
6
4
18
13
5
12
8
11
6
13
11
12
7
15
12
12
21
11
3
11
20
16
6
23
21
23
8
21
11
4
6
6
15
4
15
12
6
12
14
23
15
8
8
4
18
21
13
8
4
7
12
19
8
10
5
15
10
6
4
9
21
11
7
5
14
9
12
14
14
10
6
22
11
17
9
9
23
7
16
21
4
20
3
14
12
9
10
11
6
5
8
6
6
5
19
4
9
6
22
6
5
12
12
13
13
6
8
6
11
15
7
5
14
18
20
5
14
6
6
5
19
6
9
18
12
19
14
21
14
10
20
10
16
23
11
17
16
16
7
20
12
7
5
4
5
13
18
10
11
19
6
23
17
13
12
4
9
6
10
15
9
17
3
9
17
7
6
19
11
12
4
23
5
4
6
11
12
12
10
14
23
20
23
4
6
10
12
4
17
9
7
6
15
22
10
7
11
14
16
14
6
4
18
13
5
12
8
11
6
13
11
12
7
15
12
12
21
11
3
11
20
16
6
23
21
23
8
21
11
4
6
6
15
4
15
12
6
12
14
23
15
8
8
4
18
21
13
8
4
7
12
19
8
10
5
15
10
6
4
9
21
11
7
5
14
9
12
14
14
10
6
22
11
17
9
9
23
7
16
21
4
20
3
14
12
9
10
11
6
5
8
6
6
5
19
4
9
6
22
6
5
12
12
13
13
6
8
6
11
15
7
5
14
18
20
5
14
6
6
5
19
6
9
18
12
19
14
21
14
10
20
10
16
23
11
17
16
16
7
20
12
7
5
4
5
13
18
10
11
19
6
23
17
13
12
4
9
6
10
15
9
17
3
9
17
7
6
19
11
12
4
23
5
4
6
11
12
12
10
14
23
20
23
4
6
10
12
4
17
9
7
6
15
22
10
7
11
14
16
14
6
4
18
13
5
12
8
11
6
13
11
12
7
15
12
12
21
11
3
11
20
16
6
23
21
23
8
21
11
4
6
6
15
4
15
12
6
12
14
23
15
8
8
4
18
21
13
8
4
7
12
19
8
10
5
15
10
6
4
9
21
11
7
5
14
9
12
14
14
10
6
22
11
17
9
9
23
7
16
21
4
20
3
14
12
9
10
11
6
5
8
6
6
5
19
4
9
6
22
6
5
12
12
13
13
6
8
6
11
15
7
5
14
18
20
5
14
6
6
5
19
6
9
18
12
19
14
21
14
10
20
10
16
23
11
17
16
16
7
20
12
7
5
4
5
13
18
10
11
19
6
23
17
13
12
4
9
6
10
15
9
17
3
9
17
7
6
19
11
12
4
23
5
4
6
11
12
12
10
14
23
20
23
4
6
10
12
4
17
9
7
6
15
22
10
7
11
14
16
14
6
4
18
13
5
12
8
11
6
13
11
12
7
15
12
12
21
11
3
11
20
16
6
23
21
23
8
21
11
4
6
6
15
4
15
12
6
12
14
23
15
8
8
4
18
21
13
8
4
7
12
19
8
10
5
15
10
6
4
9
21
11
7
5
14
9
12
14
14
10
6
22
11
17
9
9
23
7
16
21
4
20
3
14
12
9
10
11
6
5
8
6
6
5
19
4
9
6
22
6
5
12
12
13
13
6
8
6
11
15
7
5
14
18
20
5
14
6
6
5
19
6
9
18
12
19
14
21
14
10
20
10
16
23
11
17
16
16
7
20
12
7
5
4
5
13
18
10
11
19
6
23
17
13
12
4
9
6
10
15
9
17
3
9
17
7
6
19
11
12
4
23
5
4
6
11
12
12
10
14
23
20
23
4
6
10
12
4
17
9
7
6
15
22
10
7
11
14
16
14
6
4
18
13
5
12
8
11
6
13
11
12
7
15
12
12
21
11
3
11
20
16
6
23
21
23
8
21
11
4
6
6
15
4
15
12
6
12
14
23
15
8
8
4
18
21
13
8
4
7
12
19
8
10
5
15
10
6
4
9
21
11
7
5
14
9
12
14
14
10
6
22
11
17
9
9
23
7
16
21
4
20
3
14
12
9
10
11
6
5
8
6
6
5
19
4
9
6
22
6
5
12
12
13
13
6
8
6
11
15
7
5
14
18
20
5
14
6
6
5
19
6
9
18
12
19
14
21
14
10
20
10
16
23
11
17
16
16
7
20
12
7
5
4
5
13
18
10
11
19
6
23
17
13
12
4
9
6
10
15
9
17
3
9
17
7
6
19
11
12
4
23
5
4
6
11
12
12
10
14
23
20
23
4
6
10
12
4
17
9
7
6
15
22
10
7
11
14
16
14
6
4
18
13
5
12
8
11
6
13
11
12
7
15
12
12
21
11
3
11
20
16
6
23
21
23
8
21
11
4
6
6
15
4
15
12
6
12
14
23
15
8
8
4
18
21
13
8
4
7
12
19
8
10
5
15
10
6
4
9
21
11
7
5
14
9
12
14
14
10
6
22
11
17
9
9
23
7
16
21
4
20
3
14
12
9
10
11
6
5
8
6
6
5
19
4
9
6
22
6
5
12
12
13
13
6
8
6
11
15
7
5
14
18
20
5
14
6
6
5
19
6
9
18
12
19
14
21
14
10
20
10
16
23
11
17
16
16
7
20
12
7
5
4
5
13
18
10
11
19
6
23
17
13
12
4
9
6
10
15
9
17
3
9
17
7
6
19
11
12
4
23
5
4
6
11
12
12
10
14
23
20
23
4
6
10
12
4
17
9
7
6
15
22
10
7
11
14
16
14
6
4
18
13
5
12
8
11
6
13
11
12
7
15
12
12
21
11
3
11
20
16
6
23
21
23
8
21
11
4
6
6
15
4
15
12
6
12
14
23
15
8
8
4
18
21
13
8
4
7
12
19
8
10
5
15
10
6
4
9
21
11
7
5
14
9
12
14
14
10
6
22
11
17
9
9
23
7
16
21
4
20
3
14
12
9
10
11
6
5
8
6
6
5
19
4
9
6
22
6
5
12
12
13
13
6
8
6
11
15
7
5
14
18
20
5
14
6
6
5
19
6
9
18
12
19
14
21
14
10
20
10
16
23
11
17
16
16
7
20
12
7
5
4
5
13
18
10
11
19
6
23
17
13
12
4
9
6
10
15
9
17
3
9
17
7
6
19
11
12
4
23
5
4
6
11
12
12
10
14
23
20
23
4
6
10
12
4
17
9
7
6
15
22
10
7
11
14
16
14
6
4
18
13
5
12
8
11
6
13
11
12
7
15
12
12
21
11
3
11
20
16
6
23
21
23
8
21
11
4
6
6
15
4
15
12
6
12
14
23
15
8
8
4
18
21
13
8
4
7
12
19
8
10
5
15
10
6
4
9
21
11
7
5
14
9
12
14
14
10
6
22
11
17
9
9
23
7
16
21
4
20
3
14
12
9
10
11
6
5
8
6
6
5
19
4
9
6
22
6
5
12
12
13
13
6
8
6
11
15
7
5
14
18
20
5
14
6
6
5
19
6
9
18
12
19
14
21
14
10
20
10
16
23
11
17
16
16
7
20
12
7
5
4
5
13
18
10
11
19
6
23
17
13
12
4
9
6
10
15
9
17
3
9
17
7
6
19
11
12
4
23
5
4
6
11
12
12
10
14
23
20
23
4
6
10
12
4
17
9
7
6
15
22
10
7
11
14
16
14
6
4
18
13
5
12
8
11
6
13
11
12
7
15
12
12
21
11
3
11
20
16
6
23
21
23
8
21
11
4
6
6
15
4
15
12
6
12
14
23
15
8
8
4
18
21
13
8
4
7
12
19
8
10
5
15
10
6
4
9
21
11
7
5
14
9
12
14
14
10
6
22
11
17
9
9
23
7
16
21
4
20
3
14
12
9
10
11
6
5
8
6
6
5
19
4
9
6
22
6
5
12
12
13
13
6
8
6
11
15
7
5
14
18
20
5
14
6
6
5
19
6
9
18
12
19
14
21
14
10
20
10
16
23
11
17
16
16
7
20
12
7
5
4
5
13
18
10
11
19
6
23
17
13
12
4
9
6
10
15
9
17
3
9
17
7
6
19
11
12
4
23
5
4
6
11
12
12
10
14
23
20
23
4
6
10
12
4
17
9
7
6
15
22
10
7
11
14
16
14
6
4
18
13
5
12
8
11
6
13
11
12
7
15
12
12
21
11
3
11
20
16
6
23
21
23
8
21
11
4
6
6
15
4
15
12
6
12
14
23
15
8
8
4
18
21
13
8
4
7
12
19
8
10
5
15
10
6
4
9
21
11
7
5
14
9
12
14
14
10
6
22
11
17
9
9
23
7
16
21
4
20
3
14
12
9
10
11
6
5
8
6
6
5
19
4
9
6
22
6
5
12
12
13
13
6
8
6
11
15
7
5
14
18
20
5
14
6
6
5
19
6
9
18
12
19
14
21
14
10
20
10
16
23
11
17
16
16
7
20
12
7
5
4
5
13
18
10
11
19
6
23
17
13
12
4
9
6
10
15
9
17
3
9
17
7
6
19
11
12
4
23
5
4
6
11
12
12
10
14
23
20
23
4
6
10
12
4
17
9
7
6
15
22
10
7
11
14
16
14
6
4
18
13
5
12
8
11
6
13
11
12
7
15
12
12
21
11
3
11
20
16
6
23
21
23
8
21
11
4
6
6
15
4
15
12
6
12
14
23
15
8
8
4
18
21
13
8
4
7
12
19
8
10
5
15
10
6
4
9
21
11
7
5
14
9
12
14
14
10
6
22
11
17
9
9
23
7
16
21
4
20
3
14
12
9
10
11
6
5
8
6
6
5
19
4
9
6
22
6
5
12
12
13
13
6
8
6
11
15
7
5
14
18
20
5
14
6
6
5
19
6
9
18
12
19
14
21
14
10
20
10
16
23
11
17
16
16
7
20
12
7
5
4
5
13
18
10
11
19
6
23
17
13
12
4
9
6
10
15
9
17
3
9
17
7
6
19
11
12
4
23
5
4
6
11
12
12
10
14
23
20
23
4
6
10
12
4
17
9
7
6
15
22
10
7
11
14
16
14
6
4
18
13
5
12
8
11
6
13
11
12
7
15
12
12
21
11
3
11
20
16
6
23
21
23
8
21
11
4
6
6
15
4
15
12
6
12
14
23
15
8
8
4
18
21
13
8
4
7
12
19
8
10
5
15
10
6
4
9
21
11
7
5
14
9
12
14
14
10
6
22
11
17
9
9
23
7
16
21
4
20
3
14
12
9
10
11
6
5
8
6
6
5
19
4
9
6
22
6
5
12
12
13
13
6
8
6
11
15
7
5
14
18
20
5
14
6
6
5
19
6
9
18
12
19
14
21
14
10
20
10
16
23
11
17
16
16
7
20
12
7
5
4
5
13
18
10
11
19
6
23
17
13
12
4
9
6
10
15
9
17
3
9
17
7
6
19
11
12
4
23
5
4
6
11
12
12
10
14
23
20
23
4
6
10
12
4
17
9
7
6
15
22
10
7
11
14
16
14
6
4
18
13
5
12
8
11
6
13
11
12
7
15
12
12
21
11
3
11
20
16
6
23
21
23
8
21
11
4
6
6
15
4
15
12
6
12
14
23
15
8
8
4
18
21
13
8
4
7
12
19
8
10
5
15
10
6
4
9
21
11
7
5
14
9
12
14
14
10
6
22
11
17
9
9
23
7
16
21
4
20
3
14
12
9
10
11
6
5
8
6
6
5
19
4
9
6
22
6
5
12
12
13
13
6
8
6
11
15
7
5
14
18
20
5
14
6
6
5
19
6
9
18
12
19
14
21
14
10
20
10
16
23
11
17
16
16
7
20
12
7
5
4
5
13
18
10
11
19
6
23
17
13
12
4
9
6
10
15
9
17
3
9
17
7
6
19
11
12
4
23
5
4
6
11
12
12
10
14
23
20
23
4
6
10
12
4
17
9
7
6
15
22
10
7
11
14
16
14
6
4
18
13
5
12
8
11
6
13
11
12
7
15
12
12
21
11
3
11
20
16
6
23
21
23
8
21
11
4
6
6
15
4
15
12
6
12
14
23
15
8
8
4
18
21
13
8
4
7
12
19
8
10
5
15
10
6
4
9
21
11
7
5
14
9
12
14
14
10
6
22
11
17
9
9
23
7
16
21
4
20
3
14
12
9
10
11
6
5
8
6
6
5
19
4
9
6
22
6
5
12
12
13
13
6
8
6
11
15
7
5
14
18
20
5
14
6
6
5
19
6
9
18
12
19
14
21
14
10
20
10
16
23
11
17
16
16
7
20
12
7
5
4
5
13
18
10
11
19
6
23
17
13
12
4
9
6
10
15
9
17
3
9
17
7
6
19
11
12
4
23
5
4
6
11
12
12
10
14
23
20
23
4
6
10
12
4
17
9
7
6
15
22
10
7
11
14
16
14
6
4
18
13
5
12
8
11
6
13
11
12
7
15
12
12
21
11
3
11
20
16
6
23
21
23
8
21
11
4
6
6
15
4
15
12
6
12
14
23
15
8
8
4
18
21
13
8
4
7
12
19
8
10
5
15
10
6
4
9
21
11
7
5
14
9
12
14
14
10
6
22
11
17
9
9
23
7
16
21
4
20
3
14
12
9
10
11
6
5
8
6
6
5
19
4
9
6
22
6
5
12
12
13
13
6
8
6
11
15
7
5
14
18
20
5
14
6
6
5
19
6
9
18
12
19
14
21
14
10
20
10
16
23
11
17
16
16
7
20
12
7
5
4
5
13
18
10
11
19
6
23
17
13
12
4
9
6
10
15
9
17
3
9
17
7
6
19
11
12
4
23
5
4
6
11
12
12
10
14
23
20
23
4
6
10
12
4
17
9
7
6
15
22
10
7
11
14
16
14
6
4
18
13
5
12
8
11
6
13
11
12
7
15
12
12
21
11
3
11
20
16
6
23
21
23
8
21
11
4
6
6
15
4
15
12
6
12
14
23
15
8
8
4
18
21
13
8
4
7
12
19
8
10
5
15
10
6
4
9
21
11
7
5
14
9
12
14
14
10
6
22
11
17
9
9
23
7
16
21
4
20
3
14
12
9
10
11
6
5
8
6
6
5
19
4
9
6
22
6
5
12
12
13
13
6
8
6
11
15
7
5
14
18
20
5
14
6
6
5
19
6
9
18
12
19
14
21
14
10
20
10
16
23
11
17
16
16
7
20
12
7
5
4
5
13
18
10
11
19
6
23
17
13
12
4
9
6
10
15
9
17
3
9
17
7
6
19
11
12
4
23
5
4
6
11
12
12
10
14
23
20
23
4
6
10
12
4
17
9
7
6
15
22
10
7
11
14
16
14
6
4
18
13
5
12
8
11
6
13
11
12
7
15
12
12
11
3
11
20
16
6
23
21
23
8
21
11
4
6
6
15
4
15
12
6
12
14
23
15
8
8
4
18
21
13
8
4
7
12
19
8
10
5
15
10
6
4
9
21
11
7
5
5
14
9
12
14
14
10
6
22
11
17
9
9
23
7
16
21
4
20
3
14
12
9
10
11
6
5
8
6
6
5
19
4
9
6
22
6
5
12
12
13
13
6
8
6
11
15
7
5
14
18
20
5
14
6
6
5
19
6
9
18
12
19
14
21
14
10
20
10
16
23
11
17
16
16
7
20
12
7
5
4
5
13
18
10
11
19
6
23
17
13
12
4
9
6
10
15
9
17
3
9
17
7
6
19
11
12
4
23
5
4
6
11
12
12
10
14
23
20
23
4
6
10
12
4
17
9
7
6
15
22
10
7
11
14
16
14
6
4
18
13
5
12
8
11
6
13
11
12
7
15
12
12
11
3
11
20
16
6
23
21
23
8
21
11
4
6
6
15
4
15
12
6
12
14
23
15
8
8
4
18
21
13
8
4
7
12
19
8
10
5
15
10
6
4
9
21
11
7
5
5
14
9
12
14
14
10
6
22
11
17
9
9
23
7
16
21
4
20
3
14
12
9
10
11
6
5
8
6
6
5
19
4
9
6
22
6
5
12
12
13
13
6
8
6
11
15
7
5
14
18
20
5
14
6
6
5
19
6
9
18
12
19
14
21
14
10
20
10
16
23
11
17
16
16
7
20
12
7
5
4
5
13
18
10
11
19
6
23
17
13
12
4
9
6
10
15
9
17
3
9
17
7
6
19
11
12
4
23
5
4
6
11
12
12
10
14
23
20
23
4
6
10
12
4
17
9
7
6
15
22
10
7
11
14
16
14
6
4
18
13
5
12
8
11
6
13
11
12
7
15
12
12
11
3
11
20
16
6
23
21
23
8
21
11
4
6
6
15
4
15
12
6
12
14
23
15
8
8
4
18
21
13
8
4
7
12
19
8
10
5
15
10
6
4
9
21
11
7
5
5
14
9
12
14
14
10
6
22
11
17
9
9
23
7
16
21
4
20
3
14
12
9
10
11
6
5
8
6
6
5
19
4
9
6
22
6
5
12
12
13
13
6
8
6
11
15
7
5
14
18
20
5
14
6
6
5
19
6
9
18
12
19
14
21
14
10
20
10
16
23
11
17
16
16
7
20
12
7
5
4
5
13
18
10
11
19
6
23
17
13
12
4
9
6
10
15
9
17
3
9
17
7
6
19
11
12
4
23
5
4
6
11
12
12
10
14
23
20
23
4
6
10
12
4
17
9
7
6
15
22
10
7
11
14
16
14
6
4
18
13
5
12
8
11
6
13
11
12
7
15
12
12
11
3
11
20
16
6
23
21
23
8
21
11
4
6
6
15
4
15
12
6
12
14
23
15
8
8
4
18
21
13
8
4
7
12
19
8
10
5
15
10
6
4
9
21
11
7
5
5
14
9
12
14
14
10
6
22
11
17
9
9
23
7
16
21
4
20
3
14
12
9
10
11
6
5
8
6
6
5
19
4
9
6
22
6
5
12
12
13
13
6
8
6
11
15
7
5
14
18
20
5
14
6
6
5
19
6
9
18
12
19
14
21
14
10
20
10
16
23
11
17
16
16
7
20
12
7
5
4
5
13
18
10
11
19
6
23
17
13
12
4
9
6
10
15
9
17
3
9
17
7
6
19
11
12
4
23
5
4
6
11
12
12
10
14
23
20
23
4
6
10
12
4
17
9
7
6
15
22
10
7
11
14
16
14
6
4
18
13
5
12
8
11
6
13
11
12
7
15
12
12
11
3
11
20
16
6
23
21
23
8
21
11
4
6
6
15
4
15
12
6
12
14
23
15
8
8
4
18
21
13
8
4
7
12
19
8
10
5
15
10
6
4
9
21
11
7
5
5
14
9
12
14
14
10
6
22
11
17
9
9
23
7
16
21
4
20
3
14
12
9
10
11
6
5
8
6
6
5
19
4
9
6
22
6
5
12
12
13
13
6
8
6
11
15
7
5
14
18
20
5
14
6
6
5
19
6
9
18
12
19
14
21
14
10
20
10
16
23
11
17
16
16
7
20
12
7
5
4
5
13
18
10
11
19
6
23
17
13
12
4
9
6
10
15
9
17
3
9
17
7
6
19
11
12
4
23
5
4
6
11
12
12
10
14
23
20
23
4
6
10
12
4
17
9
7
6
15
22
10
7
11
14
16
14
6
4
18
13
5
12
8
11
6
13
11
12
7
15
12
12
11
3
11
20
16
6
23
21
23
8
21
11
4
6
6
15
4
15
12
6
12
14
23
15
8
8
4
18
21
13
8
4
7
12
19
8
10
5
15
10
6
4
9
21
11
7
5
5
14
9
12
14
14
10
6
22
11
17
9
9
23
7
16
21
4
20
3
14
12
9
10
11
6
5
8
6
6
5
19
4
9
6
22
6
5
12
12
13
13
6
8
6
11
15
7
5
14
18
20
5
14
6
6
5
19
6
9
18
12
19
14
21
14
10
20
10
16
23
11
17
16
16
7
20
12
7
5
4
5
13
18
10
11
19
6
23
17
13
12
4
9
6
10
15
9
17
3
9
17
7
6
19
11
12
4
23
5
4
6
11
12
12
10
14
23
20
23
4
6
10
12
4
17
9
7
6
15
22
10
7
11
14
16
14
6
4
18
13
5
12
8
11
6
13
11
12
7
15
12
12
11
3
11
20
16
6
23
21
23
8
21
11
4
6
6
15
4
15
12
6
12
14
23
15
8
8
4
18
21
13
8
4
7
12
19
8
10
5
15
10
6
4
9
21
11
7
5
5
14
9
12
14
14
10
6
22
11
17
9
9
23
7
16
21
4
20
3
14
12
9
10
11
6
5
8
6
6
5
19
4
9
6
22
6
5
12
12
13
13
6
8
6
11
15
7
5
14
18
20
5
14
6
6
5
19
6
9
18
12
19
14
21
14
10
20
10
16
23
11
17
16
16
7
20
12
7
5
4
5
13
18
10
11
19
6
23
17
13
12
4
9
6
10
15
9
17
3
9
17
7
6
19
11
12
4
23
5
4
6
11
12
12
10
14
23
20
23
4
6
10
12
4
17
9
7
6
15
22
10
7
11
14
16
14
6
4
18
13
5
12
8
11
6
13
11
12
7
15
12
12
11
3
11
20
16
6
23
21
23
8
21
11
4
6
6
15
4
15
12
6
12
14
23
15
8
8
4
18
21
13
8
4
7
12
19
8
10
5
15
10
6
4
9
21
11
7
5
5
14
9
12
14
14
10
6
22
11
17
9
9
23
7
16
21
4
20
3
14
12
9
10
11
6
5
8
6
6
5
19
4
9
6
22
6
5
12
12
13
13
6
8
6
11
15
7
5
14
18
20
5
14
6
6
5
19
6
9
18
12
19
14
21
14
10
20
10
16
23
11
17
16
16
7
20
12
7
5
4
5
13
18
10
11
19
6
23
17
13
12
4
9
6
10
15
9
17
3
9
17
7
6
19
11
12
4
23
5
4
6
11
12
12
10
14
23
20
23
4
6
10
12
4
17
9
7
6
15
22
10
7
11
14
16
14
6
4
18
13
5
12
8
11
6
13
11
12
7
15
12
12
11
3
11
20
16
6
23
21
23
8
21
11
4
6
6
15
4
15
12
6
12
14
23
15
8
8
4
18
21
13
8
4
7
12
19
8
10
5
15
10
6
4
9
21
11
7
5
5
14
9
12
14
14
10
6
22
11
17
9
9
23
7
16
21
4
20
3
14
12
9
10
11
6
5
8
6
6
5
19
4
9
6
22
6
5
12
12
13
13
6
8
6
11
15
7
5
14
18
20
5
14
6
6
5
19
6
9
18
12
19
14
21
14
10
20
10
16
23
11
17
16
16
7
20
12
7
5
4
5
13
18
10
11
19
6
23
17
13
12
4
9
6
10
15
9
17
3
9
17
7
6
19
11
12
4
23
5
4
6
11
12
12
10
14
23
20
23
4
6
10
12
4
17
9
7
6
15
22
10
7
11
14
16
14
6
4
18
13
5
12
8
11
6
13
11
12
7
15
12
12
11
3
11
20
16
6
23
21
23
8
21
11
4
6
6
15
4
15
12
6
12
14
23
15
8
8
4
18
21
13
8
4
7
12
19
8
10
5
15
10
6
4
9
21
11
7
5
5
14
9
12
14
14
10
6
22
11
17
9
9
23
7
16
21
4
20
3
14
12
9
10
11
6
5
8
6
6
5
19
4
9
6
22
6
5
12
12
13
13
6
8
6
11
15
7
5
14
18
20
5
14
6
6
5
19
6
9
18
12
19
14
21
14
10
20
10
16
23
11
17
16
16
7
20
12
7
5
4
5
13
18
10
11
19
6
23
17
13
12
4
9
6
10
15
9
17
3
9
17
7
6
19
11
12
4
23
5
4
6
11
12
12
10
14
23
20
23
4
6
10
12
4
17
9
7
6
15
22
10
7
11
14
16
14
6
4
18
13
5
12
8
11
6
13
11
12
7
15
12
12
11
3
11
20
16
6
23
21
23
8
21
11
4
6
6
15
4
15
12
6
12
14
23
15
8
8
4
18
21
13
8
4
7
12
19
8
10
5
15
10
6
4
9
21
11
7
5
5
14
9
12
14
14
10
6
22
11
17
9
9
23
7
16
21
4
20
3
14
12
9
10
11
6
5
8
6
6
5
19
4
9
6
22
6
5
12
12
13
13
6
8
6
11
15
7
5
14
18
20
5
14
6
6
5
19
6
9
18
12
19
14
21
14
10
20
10
16
23
11
17
16
16
7
20
12
7
5
4
5
13
18
10
11
19
6
23
17
13
12
4
9
6
10
15
9
17
3
9
17
7
6
19
11
12
4
23
5
4
6
11
12
12
10
14
23
20
23
4
6
10
12
4
17
9
7
6
15
22
10
7
11
14
16
14
6
4
18
13
5
12
8
11
6
13
11
12
7
15
12
12
11
3
11
20
16
6
23
21
23
8
21
11
4
6
6
15
4
15
12
6
12
14
23
15
8
8
4
18
21
13
8
4
7
12
19
8
10
5
15
10
6
4
9
21
11
7
5
5
14
9
12
14
14
10
6
22
11
17
9
9
23
7
16
21
4
20
3
14
12
9
10
11
6
5
8
6
6
5
19
4
9
6
22
6
5
12
12
13
13
6
8
6
11
15
7
5
14
18
20
5
14
6
6
5
19
6
9
18
12
19
14
21
14
10
20
10
16
23
11
17
16
16
7
20
12
7
5
4
5
13
18
10
11
19
6
23
17
13
12
4
9
6
10
15
9
17
3
9
17
7
6
19
11
12
4
23
5
4
6
11
12
12
10
14
23
20
23
4
6
10
12
4
17
9
7
6
15
22
10
7
11
14
16
14
6
4
18
13
5
12
8
11
6
13
11
12
7
15
12
12
11
3
11
20
16
6
23
21
23
8
21
11
4
6
6
15
4
15
12
6
12
14
23
15
8
8
4
18
21
13
8
4
7
12
19
8
10
5
15
10
6
4
9
21
11
7
5
5
14
9
12
14
14
10
6
22
11
17
9
9
23
7
16
21
4
20
3
14
12
9
10
11
6
5
8
6
6
5
19
4
9
6
22
6
5
12
12
13
13
6
8
6
11
15
7
5
14
18
20
5
14
6
6
5
19
6
9
18
12
19
14
21
14
10
20
10
16
23
11
17
16
16
7
20
12
7
5
4
5
13
18
10
11
19
6
23
17
13
12
4
9
6
10
15
9
17
3
9
17
7
6
19
11
12
4
23
5
4
6
11
12
12
10
14
23
20
23
4
6
10
12
4
17
9
7
6
15
22
10
7
11
14
16
14
6
4
18
13
5
12
8
11
6
13
11
12
7
15
12
12
11
3
11
20
16
6
23
21
23
8
21
11
4
6
6
15
4
15
12
6
12
14
23
15
8
8
4
18
21
13
8
4
7
12
19
8
10
5
15
10
6
4
9
21
11
7
5
5
14
9
12
14
14
10
6
22
11
17
9
9
23
7
16
21
4
20
3
14
12
9
10
11
6
5
8
6
6
5
19
4
9
6
22
6
5
12
12
13
13
6
8
6
11
15
7
5
14
18
20
5
14
6
6
5
19
6
9
18
12
19
14
21
14
10
20
10
16
23
11
17
16
16
7
20
12
7
5
4
5
13
18
10
11
19
6
23
17
13
12
4
9
6
10
15
9
17
3
9
17
7
6
19
11
12
4
23
5
4
6
11
12
12
10
14
23
20
23
4
6
10
12
4
17
9
7
6
15
22
10
7
11
14
16
14
6
4
18
13
5
12
8
11
6
13
11
12
7
15
12
12
11
3
11
20
16
6
23
21
23
8
21
11
4
6
6
15
4
15
12
6
12
14
23
15
8
8
4
18
21
13
8
4
7
12
19
8
10
5
15
10
6
4
9
21
11
7
5
5
14
9
12
14
14
10
6
22
11
17
9
9
23
7
16
21
4
20
3
14
12
9
10
11
6
5
8
6
6
5
19
4
9
6
22
6
5
12
12
13
13
6
8
6
11
15
7
5
14
18
20
5
14
6
6
5
19
6
9
18
12
19
14
21
14
10
20
10
16
23
11
17
16
16
7
20
12
7
5
4
5
13
18
10
11
19
6
23
17
13
12
4
9
6
10
15
9
17
3
9
17
7
6
19
11
12
4
23
5
4
6
11
12
12
10
14
23
20
23
4
6
10
12
4
17
9
7
6
15
22
10
7
11
14
16
14
6
4
18
13
5
12
8
11
6
13
11
12
7
15
12
12
11
3
11
20
16
6
23
21
23
8
21
11
4
6
6
15
4
15
12
6
12
14
23
15
8
8
4
18
21
13
8
4
7
12
19
8
10
5
15
10
6
4
9
21
11
7
5
5
14
9
12
14
14
10
6
22
11
17
9
9
23
7
16
21
4
20
3
14
12
9
10
11
6
5
8
6
6
5
19
4
9
6
22
6
5
12
12
13
13
6
8
6
11
15
7
5
14
18
20
5
14
6
6
5
19
6
9
18
12
19
14
21
14
10
20
10
16
23
11
17
16
16
7
20
12
7
5
4
5
13
18
10
11
19
6
23
17
13
12
4
9
6
10
15
9
17
3
9
17
7
6
19
11
12
4
23
5
4
6
11
12
12
10
14
23
20
23
4
6
10
12
4
17
9
7
6
15
22
10
7
11
14
16
14
6
4
18
13
5
12
8
11
6
13
11
12
7
15
12
12
11
3
11
20
16
6
23
21
23
8
21
11
4
6
6
15
4
15
12
6
12
14
23
15
8
8
4
18
21
13
8
4
7
12
19
8
10
5
15
10
6
4
9
21
11
7
5
5
14
9
12
14
14
10
6
22
11
17
9
9
23
7
16
21
4
20
3
14
12
9
10
11
6
5
8
6
6
5
19
4
9
6
22
6
5
12
12
13
13
6
8
6
11
15
7
5
14
18
20
5
14
6
6
5
19
6
9
18
12
19
14
21
14
10
20
10
16
23
11
17
16
16
7
20
12
7
5
4
5
13
18
10
11
19
6
23
17
13
12
4
9
6
10
15
9
17
3
9
17
7
6
19
11
12
4
23
5
4
6
11
12
12
10
14
23
20
23
4
6
10
12
4
17
9
7
6
15
22
10
7
11
14
16
14
6
4
18
13
5
12
8
11
6
13
11
12
7
15
12
12
11
3
11
20
16
6
23
21
23
8
21
11
4
6
6
15
4
15
12
6
12
14
23
15
8
8
4
18
21
13
8
4
7
12
19
8
10
5
15
10
6
4
9
21
11
7
5
5
14
9
12
14
14
10
6
22
11
17
9
9
23
7
16
21
4
20
3
14
12
9
10
11
6
5
8
6
6
5
19
4
9
6
22
6
5
12
12
13
13
6
8
6
11
15
7
5
14
18
20
5
14
6
6
5
19
6
9
18
12
19
14
21
14
10
20
10
16
23
11
17
16
16
7
20
12
7
5
4
5
13
18
10
11
19
6
23
17
13
12
4
9
6
10
15
9
17
3
9
17
7
6
19
11
12
4
23
5
4
6
11
12
12
10
14
23
20
23
4
6
10
12
4
17
9
7
6
15
22
10
7
11
14
16
14
6
4
18
13
5
12
8
11
6
13
11
12
7
15
12
12
11
3
11
20
16
6
23
21
23
8
21
11
4
6
6
15
4
15
12
6
12
14
23
15
8
8
4
18
21
13
8
4
7
12
19
8
10
5
15
10
6
4
9
21
11
7
5
5
14
9
12
14
14
10
6
22
11
17
9
9
23
7
16
21
4
20
3
14
12
9
10
11
6
5
8
6
6
5
19
4
9
6
22
6
5
12
12
13
13
6
8
6
11
15
7
5
14
18
20
5
14
6
6
5
19
6
9
18
12
19
14
21
14
10
20
10
16
23
11
17
16
16
7
20
12
7
5
4
5
13
18
10
11
19
6
23
17
13
12
4
9
6
10
15
9
17
3
9
17
7
6
19
11
12
4
23
5
4
6
11
12
12
10
14
23
20
23
4
6
10
12
4
17
9
7
6
15
22
10
7
11
14
16
14
6
4
18
13
5
12
8
11
6
13
11
12
7
15
12
12
11
3
11
20
16
6
23
21
23
8
21
11
4
6
6
15
4
15
12
6
12
14
23
15
8
8
4
18
21
13
8
4
7
12
19
8
10
5
15
10
6
4
9
21
11
7
5
5
14
9
12
14
14
10
6
22
11
17
9
9
23
7
16
21
4
20
3
14
12
9
10
11
6
5
8
6
6
5
19
4
9
6
22
6
5
12
12
13
13
6
8
6
11
15
7
5
14
18
20
5
14
6
6
5
19
6
9
18
12
19
14
21
14
10
20
10
16
23
11
17
16
16
7
20
12
7
5
4
5
13
18
10
11
19
6
23
17
13
12
4
9
6
10
15
9
17
3
9
17
7
6
19
11
12
4
23
5
4
6
11
12
12
10
14
23
20
23
4
6
10
12
4
17
9
7
6
15
22
10
7
11
14
16
14
6
4
18
13
5
12
8
11
6
13
11
12
7
15
12
12
11
3
11
20
16
6
23
21
23
8
21
11
4
6
6
15
4
15
12
6
12
14
23
15
8
8
4
18
21
13
8
4
7
12
19
8
10
5
15
10
6
4
9
21
11
7
5
5
14
9
12
14
14
10
6
22
11
17
9
9
23
7
16
21
4
20
3
14
12
9
10
11
6
5
8
6
6
5
19
4
9
6
22
6
5
12
12
13
13
6
8
6
11
15
7
5
14
18
20
5
14
6
6
5
19
6
9
18
12
19
14
21
14
10
20
10
16
23
11
17
16
16
7
20
12
7
5
4
5
13
18
10
11
19
6
23
17
13
12
4
9
6
10
15
9
17
3
9
17
7
6
19
11
12
4
23
5
4
6
11
12
12
10
14
23
20
23
4
6
10
12
4
17
9
7
6
15
22
10
7
11
14
16
14
6
4
18
13
5
12
8
11
6
13
11
12
7
15
12
12
11
3
11
20
16
6
23
21
23
8
21
11
4
6
6
15
4
15
12
6
12
14
23
15
8
8
4
18
21
13
8
4
7
12
19
8
10
5
15
10
6
4
9
21
11
7
5
5
14
9
12
14
14
10
6
22
11
17
9
9
23
7
16
21
4
20
3
14
12
9
10
11
6
5
8
6
6
5
19
4
9
6
22
6
5
12
12
13
13
6
8
6
11
15
7
5
14
18
20
5
14
6
6
5
19
6
9
18
12
19
14
21
14
10
20
10
16
23
11
17
16
16
7
20
12
7
5
4
5
13
18
10
11
19
6
23
17
13
12
4
9
6
10
15
9
17
3
9
17
7
6
19
11
12
4
23
5
4
6
11
12
12
10
14
23
20
23
4
6
10
12
4
17
9
7
6
15
22
10
7
11
14
16
14
6
4
18
13
5
12
8
11
6
13
11
12
7
15
12
12
11
3
11
20
16
6
23
21
23
8
21
11
4
6
6
15
4
15
12
6
12
14
23
15
8
8
4
18
21
13
8
4
7
12
19
8
10
5
15
10
6
4
9
21
11
7
5
5
14
9
12
14
14
10
6
22
11
17
9
9
23
7
16
21
4
20
3
14
12
9
10
11
6
5
8
6
6
5
19
4
9
6
22
6
5
12
12
13
13
6
8
6
11
15
7
5
14
18
20
5
14
6
6
5
19
6
9
18
12
19
14
21
14
10
20
10
16
23
11
17
16
16
7
20
12
7
5
4
5
13
18
10
11
19
6
23
17
13
12
4
9
6
10
15
9
17
3
9
17
7
6
19
11
12
4
23
5
4
6
11
12
12
10
14
23
20
23
4
6
10
12
4
17
9
7
6
15
22
10
7
11
14
16
14
6
4
18
13
5
12
8
11
6
13
11
12
7
15
12
12
11
3
11
20
16
6
23
21
23
8
21
11
4
6
6
15
4
15
12
6
12
14
23
15
8
8
4
18
21
13
8
4
7
12
19
8
10
5
15
10
6
4
9
21
11
7
5
5
14
9
12
14
14
10
6
22
11
17
9
9
23
7
16
21
4
20
3
14
12
9
10
11
6
5
8
6
6
5
19
4
9
6
22
6
5
12
12
13
13
6
8
6
11
15
7
5
14
18
20
5
14
6
6
5
19
6
9
18
12
19
14
21
14
10
20
10
16
23
11
17
16
16
7
20
12
7
5
4
5
13
18
10
11
19
6
23
17
13
12
4
9
6
10
15
9
17
3
9
17
7
6
19
11
12
4
23
5
4
6
11
12
12
10
14
23
20
23
4
6
10
12
4
17
9
8
7
16
23
11
8
12
15
17
15
7
5
19
14
6
13
9
12
7
14
12
13
8
16
13
13
12
4
12
21
17
7
24
22
24
9
22
12
5
7
7
16
5
16
13
7
13
15
24
16
9
9
5
19
22
14
9
5
8
13
20
9
11
6
16
11
7
5
10
22
12
8
6
6
15
10
13
15
15
11
7
23
12
18
10
10
24
8
17
22
5
21
4
15
13
10
11
12
7
6
9
7
7
6
20
5
10
7
23
7
6
13
13
14
14
7
9
7
12
16
8
6
15
19
21
6
15
7
7
6
20
7
10
19
13
20
15
22
15
11
21
11
17
24
12
18
17
17
8
21
13
8
6
5
6
14
19
11
12
20
7
24
18
14
13
5
10
7
11
16
10
18
4
10
18
8
7
20
12
13
5
24
6
5
7
12
13
13
11
15
24
21
24
5
7
11
13
5
18
10
8
7
16
23
11
8
12
15
17
15
7
5
19
14
6
13
9
12
7
14
12
13
8
16
13
13
12
4
12
21
17
7
24
22
24
9
22
12
5
7
7
16
5
16
13
7
13
15
24
16
9
9
5
19
22
14
9
5
8
13
20
9
11
6
16
11
7
5
10
22
12
8
6
6
15
10
13
15
15
11
7
23
12
18
10
10
24
8
17
22
5
21
4
15
13
10
11
12
7
6
9
7
7
6
20
5
10
7
23
7
6
13
13
14
14
7
9
7
12
16
8
6
15
19
21
6
15
7
7
6
20
7
10
19
13
20
15
22
15
11
21
11
17
24
12
18
17
17
8
21
13
8
6
5
6
14
19
11
12
20
7
24
18
14
13
5
10
7
11
16
10
18
4
10
18
8
7
20
12
13
5
24
6
5
7
12
13
13
11
15
24
21
24
5
7
11
13
5
18
10
8
7
16
23
11
8
12
15
17
15
7
5
19
14
6
13
9
12
7
14
12
13
8
16
13
13
12
4
12
21
17
7
24
22
24
9
22
12
5
7
7
16
5
16
13
7
13
15
24
16
9
9
5
19
22
14
9
5
8
13
20
9
11
6
16
11
7
5
10
22
12
8
6
6
15
10
13
15
15
11
7
23
12
18
10
10
24
8
17
22
5
21
4
15
13
10
11
12
7
6
9
7
7
6
20
5
10
7
23
7
6
13
13
14
14
7
9
7
12
16
8
6
15
19
21
6
15
7
7
6
20
7
10
19
13
20
15
22
15
11
21
11
17
24
12
18
17
17
8
21
13
8
6
5
6
14
19
11
12
20
7
24
18
14
13
5
10
7
11
16
10
18
4
10
18
8
7
20
12
13
5
24
6
5
7
12
13
13
11
15
24
21
24
5
7
11
13
5
18
10
8
7
16
23
11
8
12
15
17
15
7
5
19
14
6
13
9
12
7
14
12
13
8
16
13
13
12
4
12
21
17
7
24
22
24
9
22
12
5
7
7
16
5
16
13
7
13
15
24
16
9
9
5
19
22
14
9
5
8
13
20
9
11
6
16
11
7
5
10
22
12
8
6
6
15
10
13
15
15
11
7
23
12
18
10
10
24
8
17
22
5
21
4
15
13
10
11
12
7
6
9
7
7
6
20
5
10
7
23
7
6
13
13
14
14
7
9
7
12
16
8
6
15
19
21
6
15
7
7
6
20
7
10
19
13
20
15
22
15
11
21
11
17
24
12
18
17
17
8
21
13
8
6
5
6
14
19
11
12
20
7
24
18
14
13
5
10
7
11
16
10
18
4
10
18
8
7
20
12
13
5
24
6
5
7
12
13
13
11
15
24
21
24
5
7
11
13
5
18
10
8
7
16
23
11
8
12
15
17
15
7
5
19
14
6
13
9
12
7
14
12
13
8
16
13
13
12
4
12
21
17
7
24
22
24
9
22
12
5
7
7
16
5
16
13
7
13
15
24
16
9
9
5
19
22
14
9
5
8
13
20
9
11
6
16
11
7
5
10
22
12
8
6
6
15
10
13
15
15
11
7
23
12
18
10
10
24
8
17
22
5
21
4
15
13
10
11
12
7
6
9
7
7
6
20
5
10
7
23
7
6
13
13
14
14
7
9
7
12
16
8
6
15
19
21
6
15
7
7
6
20
7
10
19
13
20
15
22
15
11
21
11
17
24
12
18
17
17
8
21
13
8
6
5
6
14
19
11
12
20
7
24
18
14
13
5
10
7
11
16
10
18
4
10
18
8
7
20
12
13
5
24
6
5
7
12
13
13
11
15
24
21
24
5
7
11
13
5
18
10
8
7
16
23
11
8
12
15
17
15
7
5
19
14
6
13
9
12
7
14
12
13
8
16
13
13
12
4
12
21
17
7
24
22
24
9
22
12
5
7
7
16
5
16
13
7
13
15
24
16
9
9
5
19
22
14
9
5
8
13
20
9
11
6
16
11
7
5
10
22
12
8
6
6
15
10
13
15
15
11
7
23
12
18
10
10
24
8
17
22
5
21
4
15
13
10
11
12
7
6
9
7
7
6
20
5
10
7
23
7
6
13
13
14
14
7
9
7
12
16
8
6
15
19
21
6
15
7
7
6
20
7
10
19
13
20
15
22
15
11
21
11
17
24
12
18
17
17
8
21
13
8
6
5
6
14
19
11
12
20
7
24
18
14
13
5
10
7
11
16
10
18
4
10
18
8
7
20
12
13
5
24
6
5
7
12
13
13
11
15
24
21
24
5
7
11
13
5
18
10
8
7
16
23
11
8
12
15
17
15
7
5
19
14
6
13
9
12
7
14
12
13
8
16
13
13
12
4
12
21
17
7
24
22
24
9
22
12
5
7
7
16
5
16
13
7
13
15
24
16
9
9
5
19
22
14
9
5
8
13
20
9
11
6
16
11
7
5
10
22
12
8
6
6
15
10
13
15
15
11
7
23
12
18
10
10
24
8
17
22
5
21
4
15
13
10
11
12
7
6
9
7
7
6
20
5
10
7
23
7
6
13
13
14
14
7
9
7
12
16
8
6
15
19
21
6
15
7
7
6
20
7
10
19
13
20
15
22
15
11
21
11
17
24
12
18
17
17
8
21
13
8
6
5
6
14
19
11
12
20
7
24
18
14
13
5
10
7
11
16
10
18
4
10
18
8
7
20
12
13
5
24
6
5
7
12
13
13
11
15
24
21
24
5
7
11
13
5
18
10
8
7
16
23
11
8
12
15
17
15
7
5
19
14
6
13
9
12
7
14
12
13
8
16
13
13
12
4
12
21
17
7
24
22
24
9
22
12
5
7
7
16
5
16
13
7
13
15
24
16
9
9
5
19
22
14
9
5
8
13
20
9
11
6
16
11
7
5
10
22
12
8
6
6
15
10
13
15
15
11
7
23
12
18
10
10
24
8
17
22
5
21
4
15
13
10
11
12
7
6
9
7
7
6
20
5
10
7
23
7
6
13
13
14
14
7
9
7
12
16
8
6
15
19
21
6
15
7
7
6
20
7
10
19
13
20
15
22
15
11
21
11
17
24
12
18
17
17
8
21
13
8
6
5
6
14
19
11
12
20
7
24
18
14
13
5
10
7
11
16
10
18
4
10
18
8
7
20
12
13
5
24
6
5
7
12
13
13
11
15
24
21
24
5
7
11
13
5
18
10
8
7
16
23
11
8
12
15
17
15
7
5
19
14
6
13
9
12
7
14
12
13
8
16
13
13
12
4
12
21
17
7
24
22
24
9
22
12
5
7
7
16
5
16
13
7
13
15
24
16
9
9
5
19
22
14
9
5
8
13
20
9
11
6
16
11
7
5
10
22
12
8
6
6
15
10
13
15
15
11
7
23
12
18
10
10
24
8
17
22
5
21
4
15
13
10
11
12
7
6
9
7
7
6
20
5
10
7
23
7
6
13
13
14
14
7
9
7
12
16
8
6
15
19
21
6
15
7
7
6
20
7
10
19
13
20
15
22
15
11
21
11
17
24
12
18
17
17
8
21
13
8
6
5
6
14
19
11
12
20
7
24
18
14
13
5
10
7
11
16
10
18
4
10
18
8
7
20
12
13
5
24
6
5
7
12
13
13
11
15
24
21
24
5
7
11
13
5
18
10
8
7
16
23
11
8
12
15
17
15
7
5
19
14
6
13
9
12
7
14
12
13
8
16
13
13
12
4
12
21
17
7
24
22
24
9
22
12
5
7
7
16
5
16
13
7
13
15
24
16
9
9
5
19
22
14
9
5
8
13
20
9
11
6
16
11
7
5
10
22
12
8
6
6
15
10
13
15
15
11
7
23
12
18
10
10
24
8
17
22
5
21
4
15
13
10
11
12
7
6
9
7
7
6
20
5
10
7
23
7
6
13
13
14
14
7
9
7
12
16
8
6
15
19
21
6
15
7
7
6
20
7
10
19
13
20
15
22
15
11
21
11
17
24
12
18
17
17
8
21
13
8
6
5
6
14
19
11
12
20
7
24
18
14
13
5
10
7
11
16
10
18
4
10
18
8
7
20
12
13
5
24
6
5
7
12
13
13
11
15
24
21
24
5
7
11
13
5
18
10
8
7
16
23
11
8
12
15
17
15
7
5
19
14
6
13
9
12
7
14
12
13
8
16
13
13
12
4
12
21
17
7
24
22
24
9
22
12
5
7
7
16
5
16
13
7
13
15
24
16
9
9
5
19
22
14
9
5
8
13
20
9
11
6
16
11
7
5
10
22
12
8
6
6
15
10
13
15
15
11
7
23
12
18
10
10
24
8
17
22
5
21
4
15
13
10
11
12
7
6
9
7
7
6
20
5
10
7
23
7
6
13
13
14
14
7
9
7
12
16
8
6
15
19
21
6
15
7
7
6
20
7
10
19
13
20
15
22
15
11
21
11
17
24
12
18
17
17
8
21
13
8
6
5
6
14
19
11
12
20
7
24
18
14
13
5
10
7
11
16
10
18
4
10
18
8
7
20
12
13
5
24
6
5
7
12
13
13
11
15
24
21
24
5
7
11
13
5
18
10
