"Gasoline","BEV","tick"
193.0,7.0,1.0
193.0,7.0,2.0
193.0,7.0,3.0
193.0,7.0,4.0
193.0,7.0,5.0
193.0,7.0,6.0
193.0,7.0,7.0
193.0,7.0,8.0
193.0,7.0,9.0
193.0,7.0,10.0
193.0,7.0,11.0
193.0,7.0,12.0
193.0,7.0,13.0
193.0,7.0,14.0
193.0,7.0,15.0
193.0,7.0,16.0
193.0,7.0,17.0
193.0,7.0,18.0
193.0,7.0,19.0
193.0,7.0,20.0
193.0,7.0,21.0
193.0,7.0,22.0
193.0,7.0,23.0
193.0,7.0,24.0
193.0,7.0,25.0
193.0,7.0,26.0
193.0,7.0,27.0
193.0,7.0,28.0
193.0,7.0,29.0
193.0,7.0,30.0
193.0,7.0,31.0
193.0,7.0,32.0
193.0,7.0,33.0
193.0,7.0,34.0
193.0,7.0,35.0
193.0,7.0,36.0
193.0,7.0,37.0
193.0,7.0,38.0
193.0,7.0,39.0
193.0,7.0,40.0
193.0,7.0,41.0
193.0,7.0,42.0
193.0,7.0,43.0
193.0,7.0,44.0
193.0,7.0,45.0
193.0,7.0,46.0
193.0,7.0,47.0
193.0,7.0,48.0
193.0,7.0,49.0
193.0,7.0,50.0
193.0,7.0,51.0
193.0,7.0,52.0
193.0,7.0,53.0
193.0,7.0,54.0
193.0,7.0,55.0
193.0,7.0,56.0
193.0,7.0,57.0
193.0,7.0,58.0
193.0,7.0,59.0
193.0,7.0,60.0
193.0,7.0,61.0
193.0,7.0,62.0
193.0,7.0,63.0
193.0,7.0,64.0
193.0,7.0,65.0
193.0,7.0,66.0
193.0,7.0,67.0
193.0,7.0,68.0
193.0,7.0,69.0
193.0,7.0,70.0
193.0,7.0,71.0
193.0,7.0,72.0
193.0,7.0,73.0
193.0,7.0,74.0
193.0,7.0,75.0
193.0,7.0,76.0
193.0,7.0,77.0
193.0,7.0,78.0
193.0,7.0,79.0
193.0,7.0,80.0
193.0,7.0,81.0
193.0,7.0,82.0
193.0,7.0,83.0
193.0,7.0,84.0
193.0,7.0,85.0
193.0,7.0,86.0
193.0,7.0,87.0
193.0,7.0,88.0
193.0,7.0,89.0
193.0,7.0,90.0
193.0,7.0,91.0
193.0,7.0,92.0
193.0,7.0,93.0
193.0,7.0,94.0
193.0,7.0,95.0
193.0,7.0,96.0
193.0,7.0,97.0
193.0,7.0,98.0
193.0,7.0,99.0
193.0,7.0,100.0
193.0,7.0,101.0
193.0,7.0,102.0
193.0,7.0,103.0
193.0,7.0,104.0
193.0,7.0,105.0
193.0,7.0,106.0
193.0,7.0,107.0
193.0,7.0,108.0
193.0,7.0,109.0
193.0,7.0,110.0
193.0,7.0,111.0
193.0,7.0,112.0
193.0,7.0,113.0
193.0,7.0,114.0
193.0,7.0,115.0
193.0,7.0,116.0
193.0,7.0,117.0
193.0,7.0,118.0
193.0,7.0,119.0
193.0,7.0,120.0
193.0,7.0,121.0
193.0,7.0,122.0
193.0,7.0,123.0
193.0,7.0,124.0
193.0,7.0,125.0
193.0,7.0,126.0
193.0,7.0,127.0
193.0,7.0,128.0
193.0,7.0,129.0
193.0,7.0,130.0
193.0,7.0,131.0
193.0,7.0,132.0
193.0,7.0,133.0
193.0,7.0,134.0
193.0,7.0,135.0
193.0,7.0,136.0
193.0,7.0,137.0
193.0,7.0,138.0
193.0,7.0,139.0
193.0,7.0,140.0
193.0,7.0,141.0
193.0,7.0,142.0
193.0,7.0,143.0
193.0,7.0,144.0
193.0,7.0,145.0
193.0,7.0,146.0
193.0,7.0,147.0
193.0,7.0,148.0
193.0,7.0,149.0
193.0,7.0,150.0
193.0,7.0,151.0
193.0,7.0,152.0
193.0,7.0,153.0
193.0,7.0,154.0
193.0,7.0,155.0
193.0,7.0,156.0
193.0,7.0,157.0
193.0,7.0,158.0
193.0,7.0,159.0
193.0,7.0,160.0
193.0,7.0,161.0
193.0,7.0,162.0
193.0,7.0,163.0
193.0,7.0,164.0
193.0,7.0,165.0
193.0,7.0,166.0
193.0,7.0,167.0
193.0,7.0,168.0
193.0,7.0,169.0
193.0,7.0,170.0
193.0,7.0,171.0
193.0,7.0,172.0
193.0,7.0,173.0
193.0,7.0,174.0
193.0,7.0,175.0
193.0,7.0,176.0
192.0,8.0,177.0
192.0,8.0,178.0
192.0,8.0,179.0
192.0,8.0,180.0
192.0,8.0,181.0
192.0,8.0,182.0
192.0,8.0,183.0
192.0,8.0,184.0
192.0,8.0,185.0
192.0,8.0,186.0
192.0,8.0,187.0
192.0,8.0,188.0
192.0,8.0,189.0
192.0,8.0,190.0
192.0,8.0,191.0
192.0,8.0,192.0
192.0,8.0,193.0
192.0,8.0,194.0
192.0,8.0,195.0
192.0,8.0,196.0
192.0,8.0,197.0
192.0,8.0,198.0
192.0,8.0,199.0
192.0,8.0,200.0
192.0,8.0,201.0
192.0,8.0,202.0
192.0,8.0,203.0
192.0,8.0,204.0
192.0,8.0,205.0
192.0,8.0,206.0
192.0,8.0,207.0
192.0,8.0,208.0
192.0,8.0,209.0
192.0,8.0,210.0
192.0,8.0,211.0
192.0,8.0,212.0
192.0,8.0,213.0
192.0,8.0,214.0
192.0,8.0,215.0
192.0,8.0,216.0
192.0,8.0,217.0
192.0,8.0,218.0
192.0,8.0,219.0
192.0,8.0,220.0
192.0,8.0,221.0
192.0,8.0,222.0
192.0,8.0,223.0
192.0,8.0,224.0
192.0,8.0,225.0
192.0,8.0,226.0
192.0,8.0,227.0
192.0,8.0,228.0
192.0,8.0,229.0
192.0,8.0,230.0
192.0,8.0,231.0
192.0,8.0,232.0
192.0,8.0,233.0
192.0,8.0,234.0
192.0,8.0,235.0
192.0,8.0,236.0
192.0,8.0,237.0
192.0,8.0,238.0
192.0,8.0,239.0
192.0,8.0,240.0
192.0,8.0,241.0
192.0,8.0,242.0
192.0,8.0,243.0
192.0,8.0,244.0
192.0,8.0,245.0
192.0,8.0,246.0
192.0,8.0,247.0
192.0,8.0,248.0
192.0,8.0,249.0
192.0,8.0,250.0
192.0,8.0,251.0
192.0,8.0,252.0
192.0,8.0,253.0
192.0,8.0,254.0
192.0,8.0,255.0
192.0,8.0,256.0
192.0,8.0,257.0
192.0,8.0,258.0
192.0,8.0,259.0
192.0,8.0,260.0
192.0,8.0,261.0
192.0,8.0,262.0
192.0,8.0,263.0
192.0,8.0,264.0
192.0,8.0,265.0
192.0,8.0,266.0
192.0,8.0,267.0
192.0,8.0,268.0
192.0,8.0,269.0
192.0,8.0,270.0
192.0,8.0,271.0
192.0,8.0,272.0
192.0,8.0,273.0
192.0,8.0,274.0
192.0,8.0,275.0
192.0,8.0,276.0
192.0,8.0,277.0
192.0,8.0,278.0
192.0,8.0,279.0
192.0,8.0,280.0
192.0,8.0,281.0
192.0,8.0,282.0
192.0,8.0,283.0
192.0,8.0,284.0
192.0,8.0,285.0
192.0,8.0,286.0
192.0,8.0,287.0
192.0,8.0,288.0
192.0,8.0,289.0
192.0,8.0,290.0
192.0,8.0,291.0
192.0,8.0,292.0
192.0,8.0,293.0
192.0,8.0,294.0
192.0,8.0,295.0
192.0,8.0,296.0
192.0,8.0,297.0
192.0,8.0,298.0
192.0,8.0,299.0
192.0,8.0,300.0
192.0,8.0,301.0
192.0,8.0,302.0
192.0,8.0,303.0
192.0,8.0,304.0
192.0,8.0,305.0
192.0,8.0,306.0
192.0,8.0,307.0
192.0,8.0,308.0
192.0,8.0,309.0
192.0,8.0,310.0
192.0,8.0,311.0
192.0,8.0,312.0
191.0,9.0,313.0
191.0,9.0,314.0
191.0,9.0,315.0
191.0,9.0,316.0
191.0,9.0,317.0
191.0,9.0,318.0
191.0,9.0,319.0
191.0,9.0,320.0
191.0,9.0,321.0
191.0,9.0,322.0
191.0,9.0,323.0
191.0,9.0,324.0
191.0,9.0,325.0
191.0,9.0,326.0
191.0,9.0,327.0
191.0,9.0,328.0
191.0,9.0,329.0
191.0,9.0,330.0
191.0,9.0,331.0
191.0,9.0,332.0
191.0,9.0,333.0
191.0,9.0,334.0
191.0,9.0,335.0
191.0,9.0,336.0
191.0,9.0,337.0
191.0,9.0,338.0
191.0,9.0,339.0
191.0,9.0,340.0
191.0,9.0,341.0
191.0,9.0,342.0
191.0,9.0,343.0
191.0,9.0,344.0
191.0,9.0,345.0
191.0,9.0,346.0
191.0,9.0,347.0
191.0,9.0,348.0
191.0,9.0,349.0
191.0,9.0,350.0
191.0,9.0,351.0
191.0,9.0,352.0
191.0,9.0,353.0
191.0,9.0,354.0
191.0,9.0,355.0
191.0,9.0,356.0
191.0,9.0,357.0
191.0,9.0,358.0
191.0,9.0,359.0
191.0,9.0,360.0
191.0,9.0,361.0
191.0,9.0,362.0
191.0,9.0,363.0
191.0,9.0,364.0
191.0,9.0,365.0
191.0,9.0,366.0
191.0,9.0,367.0
191.0,9.0,368.0
191.0,9.0,369.0
191.0,9.0,370.0
191.0,9.0,371.0
191.0,9.0,372.0
191.0,9.0,373.0
191.0,9.0,374.0
191.0,9.0,375.0
191.0,9.0,376.0
191.0,9.0,377.0
191.0,9.0,378.0
191.0,9.0,379.0
191.0,9.0,380.0
191.0,9.0,381.0
191.0,9.0,382.0
191.0,9.0,383.0
191.0,9.0,384.0
191.0,9.0,385.0
191.0,9.0,386.0
191.0,9.0,387.0
191.0,9.0,388.0
191.0,9.0,389.0
191.0,9.0,390.0
191.0,9.0,391.0
191.0,9.0,392.0
191.0,9.0,393.0
191.0,9.0,394.0
191.0,9.0,395.0
191.0,9.0,396.0
191.0,9.0,397.0
191.0,9.0,398.0
191.0,9.0,399.0
191.0,9.0,400.0
191.0,9.0,401.0
191.0,9.0,402.0
191.0,9.0,403.0
191.0,9.0,404.0
191.0,9.0,405.0
191.0,9.0,406.0
191.0,9.0,407.0
191.0,9.0,408.0
191.0,9.0,409.0
191.0,9.0,410.0
191.0,9.0,411.0
191.0,9.0,412.0
191.0,9.0,413.0
191.0,9.0,414.0
191.0,9.0,415.0
191.0,9.0,416.0
189.0,11.0,417.0
189.0,11.0,418.0
189.0,11.0,419.0
189.0,11.0,420.0
189.0,11.0,421.0
189.0,11.0,422.0
189.0,11.0,423.0
189.0,11.0,424.0
189.0,11.0,425.0
189.0,11.0,426.0
189.0,11.0,427.0
189.0,11.0,428.0
189.0,11.0,429.0
189.0,11.0,430.0
189.0,11.0,431.0
189.0,11.0,432.0
189.0,11.0,433.0
189.0,11.0,434.0
189.0,11.0,435.0
189.0,11.0,436.0
189.0,11.0,437.0
189.0,11.0,438.0
189.0,11.0,439.0
189.0,11.0,440.0
189.0,11.0,441.0
189.0,11.0,442.0
189.0,11.0,443.0
189.0,11.0,444.0
189.0,11.0,445.0
189.0,11.0,446.0
189.0,11.0,447.0
189.0,11.0,448.0
189.0,11.0,449.0
189.0,11.0,450.0
189.0,11.0,451.0
189.0,11.0,452.0
189.0,11.0,453.0
189.0,11.0,454.0
189.0,11.0,455.0
189.0,11.0,456.0
189.0,11.0,457.0
189.0,11.0,458.0
189.0,11.0,459.0
189.0,11.0,460.0
189.0,11.0,461.0
189.0,11.0,462.0
189.0,11.0,463.0
189.0,11.0,464.0
189.0,11.0,465.0
189.0,11.0,466.0
189.0,11.0,467.0
189.0,11.0,468.0
188.0,12.0,469.0
188.0,12.0,470.0
188.0,12.0,471.0
188.0,12.0,472.0
188.0,12.0,473.0
188.0,12.0,474.0
188.0,12.0,475.0
188.0,12.0,476.0
188.0,12.0,477.0
188.0,12.0,478.0
188.0,12.0,479.0
188.0,12.0,480.0
188.0,12.0,481.0
188.0,12.0,482.0
188.0,12.0,483.0
188.0,12.0,484.0
188.0,12.0,485.0
188.0,12.0,486.0
188.0,12.0,487.0
188.0,12.0,488.0
188.0,12.0,489.0
188.0,12.0,490.0
188.0,12.0,491.0
188.0,12.0,492.0
188.0,12.0,493.0
188.0,12.0,494.0
188.0,12.0,495.0
188.0,12.0,496.0
188.0,12.0,497.0
188.0,12.0,498.0
188.0,12.0,499.0
188.0,12.0,500.0
188.0,12.0,501.0
188.0,12.0,502.0
188.0,12.0,503.0
188.0,12.0,504.0
188.0,12.0,505.0
188.0,12.0,506.0
188.0,12.0,507.0
188.0,12.0,508.0
188.0,12.0,509.0
188.0,12.0,510.0
188.0,12.0,511.0
188.0,12.0,512.0
188.0,12.0,513.0
188.0,12.0,514.0
188.0,12.0,515.0
188.0,12.0,516.0
188.0,12.0,517.0
188.0,12.0,518.0
188.0,12.0,519.0
188.0,12.0,520.0
188.0,12.0,521.0
188.0,12.0,522.0
188.0,12.0,523.0
188.0,12.0,524.0
188.0,12.0,525.0
188.0,12.0,526.0
188.0,12.0,527.0
188.0,12.0,528.0
188.0,12.0,529.0
188.0,12.0,530.0
188.0,12.0,531.0
188.0,12.0,532.0
188.0,12.0,533.0
188.0,12.0,534.0
188.0,12.0,535.0
188.0,12.0,536.0
188.0,12.0,537.0
188.0,12.0,538.0
188.0,12.0,539.0
188.0,12.0,540.0
188.0,12.0,541.0
188.0,12.0,542.0
188.0,12.0,543.0
188.0,12.0,544.0
188.0,12.0,545.0
188.0,12.0,546.0
188.0,12.0,547.0
188.0,12.0,548.0
187.0,13.0,549.0
187.0,13.0,550.0
187.0,13.0,551.0
187.0,13.0,552.0
187.0,13.0,553.0
187.0,13.0,554.0
187.0,13.0,555.0
187.0,13.0,556.0
187.0,13.0,557.0
187.0,13.0,558.0
187.0,13.0,559.0
187.0,13.0,560.0
187.0,13.0,561.0
187.0,13.0,562.0
187.0,13.0,563.0
187.0,13.0,564.0
187.0,13.0,565.0
187.0,13.0,566.0
187.0,13.0,567.0
187.0,13.0,568.0
187.0,13.0,569.0
187.0,13.0,570.0
187.0,13.0,571.0
187.0,13.0,572.0
187.0,13.0,573.0
187.0,13.0,574.0
187.0,13.0,575.0
187.0,13.0,576.0
187.0,13.0,577.0
187.0,13.0,578.0
187.0,13.0,579.0
187.0,13.0,580.0
187.0,13.0,581.0
187.0,13.0,582.0
187.0,13.0,583.0
187.0,13.0,584.0
187.0,13.0,585.0
187.0,13.0,586.0
187.0,13.0,587.0
187.0,13.0,588.0
187.0,13.0,589.0
187.0,13.0,590.0
187.0,13.0,591.0
187.0,13.0,592.0
187.0,13.0,593.0
187.0,13.0,594.0
187.0,13.0,595.0
187.0,13.0,596.0
187.0,13.0,597.0
187.0,13.0,598.0
187.0,13.0,599.0
187.0,13.0,600.0
187.0,13.0,601.0
187.0,13.0,602.0
187.0,13.0,603.0
187.0,13.0,604.0
187.0,13.0,605.0
187.0,13.0,606.0
187.0,13.0,607.0
187.0,13.0,608.0
187.0,13.0,609.0
187.0,13.0,610.0
187.0,13.0,611.0
187.0,13.0,612.0
187.0,13.0,613.0
187.0,13.0,614.0
187.0,13.0,615.0
187.0,13.0,616.0
187.0,13.0,617.0
187.0,13.0,618.0
187.0,13.0,619.0
187.0,13.0,620.0
187.0,13.0,621.0
187.0,13.0,622.0
187.0,13.0,623.0
187.0,13.0,624.0
187.0,13.0,625.0
187.0,13.0,626.0
187.0,13.0,627.0
187.0,13.0,628.0
187.0,13.0,629.0
187.0,13.0,630.0
187.0,13.0,631.0
187.0,13.0,632.0
187.0,13.0,633.0
187.0,13.0,634.0
187.0,13.0,635.0
187.0,13.0,636.0
187.0,13.0,637.0
187.0,13.0,638.0
187.0,13.0,639.0
187.0,13.0,640.0
187.0,13.0,641.0
187.0,13.0,642.0
187.0,13.0,643.0
187.0,13.0,644.0
187.0,13.0,645.0
187.0,13.0,646.0
187.0,13.0,647.0
187.0,13.0,648.0
187.0,13.0,649.0
187.0,13.0,650.0
187.0,13.0,651.0
187.0,13.0,652.0
187.0,13.0,653.0
187.0,13.0,654.0
187.0,13.0,655.0
187.0,13.0,656.0
187.0,13.0,657.0
187.0,13.0,658.0
187.0,13.0,659.0
187.0,13.0,660.0
187.0,13.0,661.0
186.0,14.0,662.0
186.0,14.0,663.0
186.0,14.0,664.0
186.0,14.0,665.0
186.0,14.0,666.0
186.0,14.0,667.0
186.0,14.0,668.0
186.0,14.0,669.0
186.0,14.0,670.0
186.0,14.0,671.0
186.0,14.0,672.0
186.0,14.0,673.0
186.0,14.0,674.0
186.0,14.0,675.0
186.0,14.0,676.0
186.0,14.0,677.0
186.0,14.0,678.0
186.0,14.0,679.0
186.0,14.0,680.0
186.0,14.0,681.0
186.0,14.0,682.0
186.0,14.0,683.0
186.0,14.0,684.0
186.0,14.0,685.0
186.0,14.0,686.0
186.0,14.0,687.0
186.0,14.0,688.0
186.0,14.0,689.0
186.0,14.0,690.0
186.0,14.0,691.0
186.0,14.0,692.0
186.0,14.0,693.0
186.0,14.0,694.0
186.0,14.0,695.0
186.0,14.0,696.0
186.0,14.0,697.0
186.0,14.0,698.0
186.0,14.0,699.0
186.0,14.0,700.0
186.0,14.0,701.0
186.0,14.0,702.0
186.0,14.0,703.0
186.0,14.0,704.0
186.0,14.0,705.0
186.0,14.0,706.0
186.0,14.0,707.0
186.0,14.0,708.0
186.0,14.0,709.0
186.0,14.0,710.0
186.0,14.0,711.0
186.0,14.0,712.0
186.0,14.0,713.0
186.0,14.0,714.0
186.0,14.0,715.0
186.0,14.0,716.0
185.0,15.0,717.0
185.0,15.0,718.0
185.0,15.0,719.0
185.0,15.0,720.0
185.0,15.0,721.0
185.0,15.0,722.0
185.0,15.0,723.0
185.0,15.0,724.0
185.0,15.0,725.0
185.0,15.0,726.0
184.0,16.0,727.0
184.0,16.0,728.0
184.0,16.0,729.0
184.0,16.0,730.0
184.0,16.0,731.0
184.0,16.0,732.0
184.0,16.0,733.0
184.0,16.0,734.0
184.0,16.0,735.0
184.0,16.0,736.0
184.0,16.0,737.0
184.0,16.0,738.0
184.0,16.0,739.0
184.0,16.0,740.0
184.0,16.0,741.0
184.0,16.0,742.0
184.0,16.0,743.0
184.0,16.0,744.0
184.0,16.0,745.0
184.0,16.0,746.0
184.0,16.0,747.0
184.0,16.0,748.0
184.0,16.0,749.0
184.0,16.0,750.0
184.0,16.0,751.0
184.0,16.0,752.0
184.0,16.0,753.0
184.0,16.0,754.0
184.0,16.0,755.0
184.0,16.0,756.0
184.0,16.0,757.0
184.0,16.0,758.0
184.0,16.0,759.0
184.0,16.0,760.0
184.0,16.0,761.0
184.0,16.0,762.0
184.0,16.0,763.0
184.0,16.0,764.0
184.0,16.0,765.0
183.0,17.0,766.0
183.0,17.0,767.0
183.0,17.0,768.0
183.0,17.0,769.0
183.0,17.0,770.0
183.0,17.0,771.0
183.0,17.0,772.0
183.0,17.0,773.0
183.0,17.0,774.0
183.0,17.0,775.0
183.0,17.0,776.0
183.0,17.0,777.0
183.0,17.0,778.0
183.0,17.0,779.0
183.0,17.0,780.0
183.0,17.0,781.0
183.0,17.0,782.0
183.0,17.0,783.0
183.0,17.0,784.0
183.0,17.0,785.0
183.0,17.0,786.0
183.0,17.0,787.0
183.0,17.0,788.0
183.0,17.0,789.0
183.0,17.0,790.0
183.0,17.0,791.0
183.0,17.0,792.0
183.0,17.0,793.0
183.0,17.0,794.0
183.0,17.0,795.0
183.0,17.0,796.0
183.0,17.0,797.0
183.0,17.0,798.0
183.0,17.0,799.0
183.0,17.0,800.0
183.0,17.0,801.0
183.0,17.0,802.0
183.0,17.0,803.0
183.0,17.0,804.0
183.0,17.0,805.0
183.0,17.0,806.0
183.0,17.0,807.0
183.0,17.0,808.0
183.0,17.0,809.0
183.0,17.0,810.0
183.0,17.0,811.0
183.0,17.0,812.0
183.0,17.0,813.0
183.0,17.0,814.0
183.0,17.0,815.0
183.0,17.0,816.0
183.0,17.0,817.0
183.0,17.0,818.0
183.0,17.0,819.0
183.0,17.0,820.0
183.0,17.0,821.0
183.0,17.0,822.0
183.0,17.0,823.0
183.0,17.0,824.0
183.0,17.0,825.0
183.0,17.0,826.0
183.0,17.0,827.0
183.0,17.0,828.0
183.0,17.0,829.0
183.0,17.0,830.0
183.0,17.0,831.0
183.0,17.0,832.0
183.0,17.0,833.0
183.0,17.0,834.0
183.0,17.0,835.0
183.0,17.0,836.0
183.0,17.0,837.0
183.0,17.0,838.0
183.0,17.0,839.0
183.0,17.0,840.0
183.0,17.0,841.0
183.0,17.0,842.0
183.0,17.0,843.0
183.0,17.0,844.0
183.0,17.0,845.0
183.0,17.0,846.0
183.0,17.0,847.0
183.0,17.0,848.0
183.0,17.0,849.0
183.0,17.0,850.0
183.0,17.0,851.0
183.0,17.0,852.0
183.0,17.0,853.0
183.0,17.0,854.0
183.0,17.0,855.0
183.0,17.0,856.0
183.0,17.0,857.0
183.0,17.0,858.0
183.0,17.0,859.0
183.0,17.0,860.0
183.0,17.0,861.0
183.0,17.0,862.0
183.0,17.0,863.0
183.0,17.0,864.0
183.0,17.0,865.0
183.0,17.0,866.0
183.0,17.0,867.0
183.0,17.0,868.0
183.0,17.0,869.0
183.0,17.0,870.0
183.0,17.0,871.0
183.0,17.0,872.0
183.0,17.0,873.0
183.0,17.0,874.0
183.0,17.0,875.0
183.0,17.0,876.0
183.0,17.0,877.0
183.0,17.0,878.0
183.0,17.0,879.0
183.0,17.0,880.0
183.0,17.0,881.0
183.0,17.0,882.0
182.0,18.0,883.0
182.0,18.0,884.0
182.0,18.0,885.0
182.0,18.0,886.0
182.0,18.0,887.0
182.0,18.0,888.0
182.0,18.0,889.0
182.0,18.0,890.0
182.0,18.0,891.0
182.0,18.0,892.0
182.0,18.0,893.0
182.0,18.0,894.0
182.0,18.0,895.0
182.0,18.0,896.0
182.0,18.0,897.0
181.0,19.0,898.0
181.0,19.0,899.0
181.0,19.0,900.0
181.0,19.0,901.0
181.0,19.0,902.0
181.0,19.0,903.0
181.0,19.0,904.0
181.0,19.0,905.0
181.0,19.0,906.0
181.0,19.0,907.0
181.0,19.0,908.0
181.0,19.0,909.0
181.0,19.0,910.0
181.0,19.0,911.0
181.0,19.0,912.0
181.0,19.0,913.0
181.0,19.0,914.0
181.0,19.0,915.0
181.0,19.0,916.0
180.0,20.0,917.0
180.0,20.0,918.0
180.0,20.0,919.0
180.0,20.0,920.0
180.0,20.0,921.0
180.0,20.0,922.0
180.0,20.0,923.0
180.0,20.0,924.0
180.0,20.0,925.0
180.0,20.0,926.0
180.0,20.0,927.0
180.0,20.0,928.0
180.0,20.0,929.0
180.0,20.0,930.0
180.0,20.0,931.0
180.0,20.0,932.0
180.0,20.0,933.0
180.0,20.0,934.0
180.0,20.0,935.0
180.0,20.0,936.0
180.0,20.0,937.0
180.0,20.0,938.0
180.0,20.0,939.0
180.0,20.0,940.0
180.0,20.0,941.0
180.0,20.0,942.0
180.0,20.0,943.0
180.0,20.0,944.0
180.0,20.0,945.0
180.0,20.0,946.0
180.0,20.0,947.0
180.0,20.0,948.0
180.0,20.0,949.0
180.0,20.0,950.0
180.0,20.0,951.0
180.0,20.0,952.0
180.0,20.0,953.0
180.0,20.0,954.0
180.0,20.0,955.0
180.0,20.0,956.0
180.0,20.0,957.0
180.0,20.0,958.0
179.0,21.0,959.0
179.0,21.0,960.0
179.0,21.0,961.0
179.0,21.0,962.0
179.0,21.0,963.0
179.0,21.0,964.0
179.0,21.0,965.0
179.0,21.0,966.0
179.0,21.0,967.0
179.0,21.0,968.0
179.0,21.0,969.0
179.0,21.0,970.0
179.0,21.0,971.0
179.0,21.0,972.0
179.0,21.0,973.0
179.0,21.0,974.0
179.0,21.0,975.0
179.0,21.0,976.0
179.0,21.0,977.0
179.0,21.0,978.0
179.0,21.0,979.0
179.0,21.0,980.0
179.0,21.0,981.0
179.0,21.0,982.0
179.0,21.0,983.0
179.0,21.0,984.0
179.0,21.0,985.0
179.0,21.0,986.0
179.0,21.0,987.0
179.0,21.0,988.0
179.0,21.0,989.0
179.0,21.0,990.0
178.0,22.0,991.0
178.0,22.0,992.0
178.0,22.0,993.0
178.0,22.0,994.0
178.0,22.0,995.0
178.0,22.0,996.0
178.0,22.0,997.0
178.0,22.0,998.0
178.0,22.0,999.0
178.0,22.0,1000.0
178.0,22.0,1001.0
178.0,22.0,1002.0
178.0,22.0,1003.0
178.0,22.0,1004.0
178.0,22.0,1005.0
178.0,22.0,1006.0
178.0,22.0,1007.0
178.0,22.0,1008.0
178.0,22.0,1009.0
178.0,22.0,1010.0
178.0,22.0,1011.0
178.0,22.0,1012.0
178.0,22.0,1013.0
178.0,22.0,1014.0
178.0,22.0,1015.0
178.0,22.0,1016.0
178.0,22.0,1017.0
178.0,22.0,1018.0
178.0,22.0,1019.0
178.0,22.0,1020.0
178.0,22.0,1021.0
178.0,22.0,1022.0
178.0,22.0,1023.0
178.0,22.0,1024.0
178.0,22.0,1025.0
178.0,22.0,1026.0
178.0,22.0,1027.0
178.0,22.0,1028.0
178.0,22.0,1029.0
178.0,22.0,1030.0
178.0,22.0,1031.0
178.0,22.0,1032.0
178.0,22.0,1033.0
178.0,22.0,1034.0
178.0,22.0,1035.0
178.0,22.0,1036.0
178.0,22.0,1037.0
178.0,22.0,1038.0
178.0,22.0,1039.0
178.0,22.0,1040.0
178.0,22.0,1041.0
178.0,22.0,1042.0
178.0,22.0,1043.0
178.0,22.0,1044.0
178.0,22.0,1045.0
178.0,22.0,1046.0
178.0,22.0,1047.0
178.0,22.0,1048.0
178.0,22.0,1049.0
178.0,22.0,1050.0
178.0,22.0,1051.0
178.0,22.0,1052.0
178.0,22.0,1053.0
178.0,22.0,1054.0
178.0,22.0,1055.0
178.0,22.0,1056.0
178.0,22.0,1057.0
178.0,22.0,1058.0
178.0,22.0,1059.0
178.0,22.0,1060.0
178.0,22.0,1061.0
178.0,22.0,1062.0
178.0,22.0,1063.0
178.0,22.0,1064.0
178.0,22.0,1065.0
178.0,22.0,1066.0
178.0,22.0,1067.0
178.0,22.0,1068.0
178.0,22.0,1069.0
178.0,22.0,1070.0
178.0,22.0,1071.0
178.0,22.0,1072.0
178.0,22.0,1073.0
178.0,22.0,1074.0
178.0,22.0,1075.0
178.0,22.0,1076.0
178.0,22.0,1077.0
178.0,22.0,1078.0
178.0,22.0,1079.0
178.0,22.0,1080.0
178.0,22.0,1081.0
178.0,22.0,1082.0
178.0,22.0,1083.0
178.0,22.0,1084.0
178.0,22.0,1085.0
178.0,22.0,1086.0
178.0,22.0,1087.0
178.0,22.0,1088.0
178.0,22.0,1089.0
178.0,22.0,1090.0
178.0,22.0,1091.0
178.0,22.0,1092.0
