"tick","Agents","Occasion","Private new","Lease"
1.0,9.700000000000005,10.57142857142858,5.666666666666667,3.5
2.0,9.700000000000005,10.57142857142858,5.666666666666667,3.5
3.0,9.700000000000005,10.57142857142858,5.666666666666667,3.5
4.0,9.700000000000005,10.57142857142858,5.666666666666667,3.5
5.0,9.700000000000005,10.57142857142858,5.666666666666667,3.5
6.0,9.700000000000005,10.57142857142858,5.666666666666667,3.5
7.0,9.700000000000005,10.57142857142858,5.666666666666667,3.5
8.0,9.700000000000005,10.57142857142858,5.666666666666667,3.5
9.0,9.700000000000005,10.57142857142858,5.666666666666667,3.5
10.0,9.700000000000005,10.57142857142858,5.666666666666667,3.5
11.0,9.700000000000005,10.57142857142858,5.666666666666667,3.5
12.0,9.700000000000005,10.57142857142858,5.666666666666667,3.5
13.0,9.700000000000005,10.57142857142858,5.666666666666667,3.5
14.0,9.700000000000005,10.57142857142858,5.666666666666667,3.5
15.0,9.700000000000005,10.57142857142858,5.666666666666667,3.5
16.0,9.700000000000005,10.57142857142858,5.666666666666667,3.5
17.0,9.700000000000005,10.57142857142858,5.666666666666667,3.5
18.0,9.700000000000005,10.57142857142858,5.666666666666667,3.5
19.0,9.700000000000005,10.57142857142858,5.666666666666667,3.5
20.0,9.700000000000005,10.57142857142858,5.666666666666667,3.5
21.0,9.700000000000005,10.57142857142858,5.666666666666667,3.5
22.0,9.700000000000005,10.57142857142858,5.666666666666667,3.5
23.0,9.700000000000005,10.57142857142858,5.666666666666667,3.5
24.0,9.700000000000005,10.57142857142858,5.666666666666667,3.5
25.0,9.700000000000005,10.57142857142858,5.666666666666667,3.5
26.0,9.700000000000005,10.57142857142858,5.666666666666667,3.5
27.0,9.700000000000005,10.57142857142858,5.666666666666667,3.5
28.0,9.700000000000005,10.57142857142858,5.666666666666667,3.5
29.0,9.700000000000005,10.57142857142858,5.666666666666667,3.5
30.0,9.700000000000005,10.57142857142858,5.666666666666667,3.5
31.0,9.700000000000005,10.57142857142858,5.666666666666667,3.5
32.0,9.700000000000005,10.57142857142858,5.666666666666667,3.5
33.0,9.700000000000005,10.57142857142858,5.666666666666667,3.5
34.0,9.700000000000005,10.57142857142858,5.666666666666667,3.5
35.0,9.700000000000005,10.57142857142858,5.666666666666667,3.5
36.0,9.700000000000005,10.57142857142858,5.666666666666667,3.5
37.0,9.700000000000005,10.57142857142858,5.666666666666667,3.5
38.0,9.700000000000005,10.57142857142858,5.666666666666667,3.5
39.0,9.700000000000005,10.57142857142858,5.666666666666667,3.5
40.0,9.700000000000005,10.57142857142858,5.666666666666667,3.5
41.0,9.700000000000005,10.57142857142858,5.666666666666667,3.5
42.0,9.700000000000005,10.57142857142858,5.666666666666667,3.5
43.0,9.700000000000005,10.57142857142858,5.666666666666667,3.5
44.0,9.700000000000005,10.57142857142858,5.666666666666667,3.5
45.0,9.700000000000005,10.57142857142858,5.666666666666667,3.5
46.0,9.700000000000005,10.57142857142858,5.666666666666667,3.5
47.0,9.700000000000005,10.57142857142858,5.666666666666667,3.5
48.0,9.700000000000005,10.57142857142858,5.666666666666667,3.5
49.0,9.700000000000005,10.57142857142858,5.666666666666667,3.5
50.0,9.700000000000005,10.57142857142858,5.666666666666667,3.5
51.0,9.700000000000005,10.57142857142858,5.666666666666667,3.5
52.0,9.700000000000005,10.57142857142858,5.666666666666667,3.5
53.0,10.700000000000005,11.57142857142858,6.666666666666667,4.499999999999999
54.0,10.700000000000005,11.57142857142858,6.666666666666667,4.499999999999999
55.0,10.700000000000005,11.57142857142858,6.666666666666667,4.499999999999999
56.0,10.700000000000005,11.57142857142858,6.666666666666667,4.499999999999999
57.0,10.700000000000005,11.57142857142858,6.666666666666667,4.499999999999999
58.0,10.61,11.464285714285712,6.666666666666667,4.499999999999999
59.0,10.61,11.464285714285712,6.666666666666667,4.499999999999999
60.0,10.61,11.464285714285712,6.666666666666667,4.499999999999999
61.0,10.61,11.464285714285712,6.666666666666667,4.499999999999999
62.0,10.55,11.392857142857139,6.666666666666667,4.499999999999999
63.0,10.55,11.392857142857139,6.666666666666667,4.499999999999999
64.0,10.55,11.392857142857139,6.666666666666667,4.499999999999999
65.0,10.55,11.392857142857139,6.666666666666667,4.499999999999999
66.0,10.55,11.392857142857139,6.666666666666667,4.499999999999999
67.0,10.55,11.392857142857139,6.666666666666667,4.499999999999999
68.0,10.55,11.392857142857139,6.666666666666667,4.499999999999999
69.0,10.55,11.392857142857139,6.666666666666667,4.499999999999999
70.0,10.55,11.392857142857139,6.666666666666667,4.499999999999999
71.0,10.55,11.392857142857139,6.666666666666667,4.499999999999999
72.0,10.55,11.392857142857139,6.666666666666667,4.499999999999999
73.0,10.55,11.392857142857139,6.666666666666667,4.499999999999999
74.0,10.55,11.392857142857139,6.666666666666667,4.499999999999999
75.0,10.490000000000002,11.321428571428571,6.666666666666667,4.499999999999999
76.0,10.490000000000002,11.321428571428571,6.666666666666667,4.499999999999999
77.0,10.490000000000002,11.321428571428571,6.666666666666667,4.499999999999999
78.0,10.490000000000002,11.321428571428571,6.666666666666667,4.499999999999999
79.0,10.490000000000002,11.321428571428571,6.666666666666667,4.499999999999999
80.0,10.490000000000002,11.321428571428571,6.666666666666667,4.499999999999999
81.0,10.490000000000002,11.321428571428571,6.666666666666667,4.499999999999999
82.0,10.490000000000002,11.321428571428571,6.666666666666667,4.499999999999999
83.0,10.490000000000002,11.321428571428571,6.666666666666667,4.499999999999999
84.0,10.490000000000002,11.321428571428571,6.666666666666667,4.499999999999999
85.0,10.490000000000002,11.321428571428571,6.666666666666667,4.499999999999999
86.0,10.490000000000002,11.321428571428571,6.666666666666667,4.499999999999999
87.0,10.490000000000002,11.321428571428571,6.666666666666667,4.499999999999999
88.0,10.490000000000002,11.321428571428571,6.666666666666667,4.499999999999999
89.0,10.490000000000002,11.321428571428571,6.666666666666667,4.499999999999999
90.0,10.490000000000002,11.321428571428571,6.666666666666667,4.499999999999999
91.0,10.490000000000002,11.321428571428571,6.666666666666667,4.499999999999999
92.0,10.490000000000002,11.321428571428571,6.666666666666667,4.499999999999999
93.0,10.490000000000002,11.321428571428571,6.666666666666667,4.499999999999999
94.0,10.490000000000002,11.321428571428571,6.666666666666667,4.499999999999999
95.0,10.490000000000002,11.321428571428571,6.666666666666667,4.499999999999999
96.0,10.490000000000002,11.321428571428571,6.666666666666667,4.499999999999999
97.0,10.490000000000002,11.321428571428571,6.666666666666667,4.499999999999999
98.0,10.490000000000002,11.321428571428571,6.666666666666667,4.499999999999999
99.0,10.490000000000002,11.321428571428571,6.666666666666667,4.499999999999999
100.0,10.490000000000002,11.321428571428571,6.666666666666667,4.499999999999999
101.0,10.490000000000002,11.321428571428571,6.666666666666667,4.499999999999999
102.0,10.490000000000002,11.321428571428571,6.666666666666667,4.499999999999999
103.0,10.490000000000002,11.321428571428571,6.666666666666667,4.499999999999999
104.0,10.490000000000002,11.321428571428571,6.666666666666667,4.499999999999999
105.0,11.490000000000002,12.321428571428571,7.666666666666667,5.499999999999999
106.0,11.490000000000002,12.321428571428571,7.666666666666667,5.499999999999999
107.0,11.490000000000002,12.321428571428571,7.666666666666667,5.499999999999999
108.0,11.490000000000002,12.321428571428571,7.666666666666667,5.499999999999999
109.0,11.490000000000002,12.321428571428571,7.666666666666667,5.499999999999999
110.0,11.490000000000002,12.321428571428571,7.666666666666667,5.499999999999999
111.0,11.490000000000002,12.321428571428571,7.666666666666667,5.499999999999999
112.0,11.490000000000002,12.321428571428571,7.666666666666667,5.499999999999999
113.0,11.490000000000002,12.321428571428571,7.666666666666667,5.499999999999999
114.0,11.490000000000002,12.321428571428571,7.666666666666667,5.499999999999999
115.0,11.490000000000002,12.321428571428571,7.666666666666667,5.499999999999999
116.0,11.490000000000002,12.321428571428571,7.666666666666667,5.499999999999999
117.0,11.490000000000002,12.321428571428571,7.666666666666667,5.499999999999999
118.0,11.490000000000002,12.321428571428571,7.666666666666667,5.499999999999999
119.0,11.490000000000002,12.321428571428571,7.666666666666667,5.499999999999999
120.0,11.490000000000002,12.321428571428571,7.666666666666667,5.499999999999999
121.0,11.490000000000002,12.321428571428571,7.666666666666667,5.499999999999999
122.0,11.490000000000002,12.321428571428571,7.666666666666667,5.499999999999999
123.0,11.490000000000002,12.321428571428571,7.666666666666667,5.499999999999999
124.0,11.490000000000002,12.321428571428571,7.666666666666667,5.499999999999999
125.0,11.490000000000002,12.321428571428571,7.666666666666667,5.499999999999999
126.0,11.490000000000002,12.321428571428571,7.666666666666667,5.499999999999999
127.0,11.490000000000002,12.321428571428571,7.666666666666667,5.499999999999999
128.0,11.490000000000002,12.321428571428571,7.666666666666667,5.499999999999999
129.0,11.490000000000002,12.321428571428571,7.666666666666667,5.499999999999999
130.0,11.490000000000002,12.321428571428571,7.666666666666667,5.499999999999999
131.0,11.490000000000002,12.321428571428571,7.666666666666667,5.499999999999999
132.0,11.490000000000002,12.321428571428571,7.666666666666667,5.499999999999999
133.0,11.434999999999993,12.25595238095238,7.666666666666667,5.499999999999999
134.0,11.434999999999993,12.25595238095238,7.666666666666667,5.499999999999999
135.0,11.434999999999993,12.25595238095238,7.666666666666667,5.499999999999999
136.0,11.434999999999993,12.25595238095238,7.666666666666667,5.499999999999999
137.0,11.434999999999993,12.25595238095238,7.666666666666667,5.499999999999999
138.0,11.434999999999993,12.25595238095238,7.666666666666667,5.499999999999999
139.0,11.434999999999993,12.25595238095238,7.666666666666667,5.499999999999999
140.0,11.434999999999993,12.25595238095238,7.666666666666667,5.499999999999999
141.0,11.434999999999993,12.25595238095238,7.666666666666667,5.499999999999999
142.0,11.434999999999993,12.25595238095238,7.666666666666667,5.499999999999999
143.0,11.434999999999993,12.25595238095238,7.666666666666667,5.499999999999999
144.0,11.434999999999993,12.25595238095238,7.666666666666667,5.499999999999999
145.0,11.434999999999993,12.25595238095238,7.666666666666667,5.499999999999999
146.0,11.434999999999993,12.25595238095238,7.666666666666667,5.499999999999999
147.0,11.434999999999993,12.25595238095238,7.666666666666667,5.499999999999999
148.0,11.434999999999993,12.25595238095238,7.666666666666667,5.499999999999999
149.0,11.434999999999993,12.25595238095238,7.666666666666667,5.499999999999999
150.0,11.434999999999993,12.25595238095238,7.666666666666667,5.499999999999999
151.0,11.434999999999993,12.25595238095238,7.666666666666667,5.499999999999999
152.0,11.434999999999993,12.25595238095238,7.666666666666667,5.499999999999999
153.0,11.434999999999993,12.25595238095238,7.666666666666667,5.499999999999999
154.0,11.434999999999993,12.25595238095238,7.666666666666667,5.499999999999999
155.0,11.434999999999993,12.25595238095238,7.666666666666667,5.499999999999999
156.0,11.434999999999993,12.25595238095238,7.666666666666667,5.499999999999999
157.0,12.434999999999993,13.25595238095238,8.666666666666666,6.499999999999999
158.0,12.434999999999993,13.25595238095238,8.666666666666666,6.499999999999999
159.0,12.434999999999993,13.25595238095238,8.666666666666666,6.499999999999999
160.0,12.434999999999993,13.25595238095238,8.666666666666666,6.499999999999999
161.0,12.434999999999993,13.25595238095238,8.666666666666666,6.499999999999999
162.0,12.434999999999993,13.25595238095238,8.666666666666666,6.499999999999999
163.0,12.434999999999993,13.25595238095238,8.666666666666666,6.499999999999999
164.0,12.434999999999993,13.25595238095238,8.666666666666666,6.499999999999999
165.0,12.434999999999993,13.25595238095238,8.666666666666666,6.499999999999999
166.0,12.434999999999993,13.25595238095238,8.666666666666666,6.499999999999999
167.0,12.434999999999993,13.25595238095238,8.666666666666666,6.499999999999999
168.0,12.434999999999993,13.25595238095238,8.666666666666666,6.499999999999999
169.0,12.434999999999993,13.25595238095238,8.666666666666666,6.499999999999999
170.0,12.434999999999993,13.25595238095238,8.666666666666666,6.499999999999999
171.0,12.434999999999993,13.25595238095238,8.666666666666666,6.499999999999999
172.0,12.434999999999993,13.25595238095238,8.666666666666666,6.499999999999999
173.0,12.370000000000012,13.178571428571427,8.666666666666666,6.499999999999999
174.0,12.370000000000012,13.178571428571427,8.666666666666666,6.499999999999999
175.0,12.370000000000012,13.178571428571427,8.666666666666666,6.499999999999999
176.0,12.370000000000012,13.178571428571427,8.666666666666666,6.499999999999999
177.0,12.32,13.119047619047615,8.666666666666666,6.499999999999999
178.0,12.304999999999994,13.101190476190471,8.666666666666666,6.499999999999999
179.0,12.304999999999994,13.101190476190471,8.666666666666666,6.499999999999999
180.0,12.304999999999994,13.101190476190471,8.666666666666666,6.499999999999999
181.0,12.304999999999994,13.101190476190471,8.666666666666666,6.499999999999999
182.0,12.304999999999994,13.101190476190471,8.666666666666666,6.499999999999999
183.0,12.304999999999994,13.101190476190471,8.666666666666666,6.499999999999999
184.0,12.304999999999994,13.101190476190471,8.666666666666666,6.499999999999999
185.0,12.304999999999994,13.101190476190471,8.666666666666666,6.499999999999999
186.0,12.304999999999994,13.101190476190471,8.666666666666666,6.499999999999999
187.0,12.304999999999994,13.101190476190471,8.666666666666666,6.499999999999999
188.0,12.304999999999994,13.101190476190471,8.666666666666666,6.499999999999999
189.0,12.304999999999994,13.101190476190471,8.666666666666666,6.499999999999999
190.0,12.255000000000006,13.041666666666673,8.666666666666666,6.499999999999999
191.0,12.255000000000006,13.041666666666673,8.666666666666666,6.499999999999999
192.0,12.255000000000006,13.041666666666673,8.666666666666666,6.499999999999999
193.0,12.255000000000006,13.041666666666673,8.666666666666666,6.499999999999999
194.0,12.255000000000006,13.041666666666673,8.666666666666666,6.499999999999999
195.0,12.255000000000006,13.041666666666673,8.666666666666666,6.499999999999999
196.0,12.255000000000006,13.041666666666673,8.666666666666666,6.499999999999999
197.0,12.255000000000006,13.041666666666673,8.666666666666666,6.499999999999999
198.0,12.255000000000006,13.041666666666673,8.666666666666666,6.499999999999999
199.0,12.255000000000006,13.041666666666673,8.666666666666666,6.499999999999999
200.0,12.255000000000006,13.041666666666673,8.666666666666666,6.499999999999999
201.0,12.255000000000006,13.041666666666673,8.666666666666666,6.499999999999999
202.0,12.255000000000006,13.041666666666673,8.666666666666666,6.499999999999999
203.0,12.255000000000006,13.041666666666673,8.666666666666666,6.499999999999999
204.0,12.235000000000001,13.017857142857142,8.666666666666666,6.499999999999999
205.0,12.235000000000001,13.017857142857142,8.666666666666666,6.499999999999999
206.0,12.235000000000001,13.017857142857142,8.666666666666666,6.499999999999999
207.0,12.174999999999997,12.946428571428566,8.666666666666666,6.499999999999999
208.0,12.174999999999997,12.946428571428566,8.666666666666666,6.499999999999999
209.0,13.174999999999997,13.946428571428566,9.666666666666666,7.499999999999999
210.0,13.174999999999997,13.946428571428566,9.666666666666666,7.499999999999999
211.0,13.174999999999997,13.946428571428566,9.666666666666666,7.499999999999999
212.0,13.099999999999996,13.857142857142861,9.666666666666666,7.499999999999999
213.0,13.099999999999996,13.857142857142861,9.666666666666666,7.499999999999999
214.0,13.010000000000002,13.750000000000007,9.666666666666666,7.499999999999999
215.0,13.010000000000002,13.750000000000007,9.666666666666666,7.499999999999999
216.0,13.010000000000002,13.750000000000007,9.666666666666666,7.499999999999999
217.0,13.010000000000002,13.750000000000007,9.666666666666666,7.499999999999999
218.0,13.010000000000002,13.750000000000007,9.666666666666666,7.499999999999999
219.0,13.010000000000002,13.750000000000007,9.666666666666666,7.499999999999999
220.0,13.010000000000002,13.750000000000007,9.666666666666666,7.499999999999999
221.0,13.010000000000002,13.750000000000007,9.666666666666666,7.499999999999999
222.0,12.925000000000006,13.750000000000007,9.347826086956523,6.666666666666667
223.0,12.925000000000006,13.750000000000007,9.347826086956523,6.666666666666667
224.0,12.925000000000006,13.750000000000007,9.347826086956523,6.666666666666667
225.0,12.914999999999996,13.738095238095237,9.347826086956523,6.666666666666667
226.0,12.914999999999996,13.738095238095237,9.347826086956523,6.666666666666667
227.0,12.914999999999996,13.738095238095237,9.347826086956523,6.666666666666667
228.0,12.914999999999996,13.738095238095237,9.347826086956523,6.666666666666667
229.0,12.914999999999996,13.738095238095237,9.347826086956523,6.666666666666667
230.0,12.914999999999996,13.738095238095237,9.347826086956523,6.666666666666667
231.0,12.914999999999996,13.738095238095237,9.347826086956523,6.666666666666667
232.0,12.914999999999996,13.738095238095237,9.347826086956523,6.666666666666667
233.0,12.914999999999996,13.738095238095237,9.347826086956523,6.666666666666667
234.0,12.914999999999996,13.738095238095237,9.347826086956523,6.666666666666667
235.0,12.860000000000008,13.672619047619046,9.347826086956523,6.666666666666667
236.0,12.860000000000008,13.672619047619046,9.347826086956523,6.666666666666667
237.0,12.860000000000008,13.672619047619046,9.347826086956523,6.666666666666667
238.0,12.860000000000008,13.672619047619046,9.347826086956523,6.666666666666667
239.0,12.860000000000008,13.672619047619046,9.347826086956523,6.666666666666667
240.0,12.860000000000008,13.672619047619046,9.347826086956523,6.666666666666667
241.0,12.860000000000008,13.672619047619046,9.347826086956523,6.666666666666667
242.0,12.860000000000008,13.672619047619046,9.347826086956523,6.666666666666667
243.0,12.804999999999998,13.607142857142858,9.347826086956523,6.666666666666667
244.0,12.804999999999998,13.607142857142858,9.347826086956523,6.666666666666667
245.0,12.804999999999998,13.607142857142858,9.347826086956523,6.666666666666667
246.0,12.804999999999998,13.607142857142858,9.347826086956523,6.666666666666667
247.0,12.790000000000004,13.589285714285714,9.347826086956523,6.666666666666667
248.0,12.790000000000004,13.589285714285714,9.347826086956523,6.666666666666667
249.0,12.790000000000004,13.589285714285714,9.347826086956523,6.666666666666667
250.0,12.790000000000004,13.589285714285714,9.347826086956523,6.666666666666667
251.0,12.790000000000004,13.589285714285714,9.347826086956523,6.666666666666667
252.0,12.790000000000004,13.589285714285714,9.347826086956523,6.666666666666667
253.0,12.790000000000004,13.589285714285714,9.347826086956523,6.666666666666667
254.0,12.739999999999998,13.529761904761903,9.347826086956523,6.666666666666667
255.0,12.739999999999998,13.529761904761903,9.347826086956523,6.666666666666667
256.0,12.739999999999998,13.529761904761903,9.347826086956523,6.666666666666667
257.0,12.739999999999998,13.529761904761903,9.347826086956523,6.666666666666667
258.0,12.739999999999998,13.529761904761903,9.347826086956523,6.666666666666667
259.0,12.739999999999998,13.529761904761903,9.347826086956523,6.666666666666667
260.0,12.739999999999998,13.529761904761903,9.347826086956523,6.666666666666667
261.0,13.584999999999999,14.345238095238097,10.347826086956523,7.666666666666667
262.0,13.584999999999999,14.345238095238097,10.347826086956523,7.666666666666667
263.0,13.584999999999999,14.345238095238097,10.347826086956523,7.666666666666667
264.0,13.584999999999999,14.345238095238097,10.347826086956523,7.666666666666667
265.0,13.584999999999999,14.345238095238097,10.347826086956523,7.666666666666667
266.0,13.584999999999999,14.345238095238097,10.347826086956523,7.666666666666667
267.0,13.559999999999992,14.315476190476184,10.347826086956523,7.666666666666667
268.0,13.559999999999992,14.315476190476184,10.347826086956523,7.666666666666667
269.0,13.440000000000003,14.172619047619047,10.347826086956523,7.666666666666667
270.0,13.440000000000003,14.172619047619047,10.347826086956523,7.666666666666667
271.0,13.440000000000003,14.172619047619047,10.347826086956523,7.666666666666667
272.0,13.440000000000003,14.172619047619047,10.347826086956523,7.666666666666667
273.0,13.405,14.130952380952374,10.347826086956523,7.666666666666667
274.0,13.405,14.130952380952374,10.347826086956523,7.666666666666667
275.0,13.405,14.130952380952374,10.347826086956523,7.666666666666667
276.0,13.405,14.130952380952374,10.347826086956523,7.666666666666667
277.0,13.405,14.130952380952374,10.347826086956523,7.666666666666667
278.0,13.335000000000006,14.047619047619044,10.347826086956523,7.666666666666667
279.0,13.335000000000006,14.047619047619044,10.347826086956523,7.666666666666667
280.0,13.335000000000006,14.047619047619044,10.347826086956523,7.666666666666667
281.0,13.335000000000006,14.047619047619044,10.347826086956523,7.666666666666667
282.0,13.269999999999996,14.02380952380952,9.956521739130435,7.666666666666667
283.0,13.269999999999996,14.02380952380952,9.956521739130435,7.666666666666667
284.0,13.269999999999996,14.02380952380952,9.956521739130435,7.666666666666667
285.0,13.269999999999996,14.02380952380952,9.956521739130435,7.666666666666667
286.0,13.269999999999996,14.02380952380952,9.956521739130435,7.666666666666667
287.0,13.224999999999998,13.970238095238097,9.956521739130435,7.666666666666667
288.0,13.224999999999998,13.970238095238097,9.956521739130435,7.666666666666667
289.0,13.224999999999998,13.970238095238097,9.956521739130435,7.666666666666667
290.0,13.145000000000001,13.875,9.956521739130435,7.666666666666667
291.0,13.145000000000001,13.875,9.956521739130435,7.666666666666667
292.0,13.145000000000001,13.875,9.956521739130435,7.666666666666667
293.0,13.145000000000001,13.875,9.956521739130435,7.666666666666667
294.0,13.145000000000001,13.875,9.956521739130435,7.666666666666667
295.0,13.145000000000001,13.875,9.956521739130435,7.666666666666667
296.0,13.145000000000001,13.875,9.956521739130435,7.666666666666667
297.0,13.145000000000001,13.875,9.956521739130435,7.666666666666667
298.0,13.145000000000001,13.875,9.956521739130435,7.666666666666667
299.0,13.145000000000001,13.875,9.956521739130435,7.666666666666667
300.0,13.145000000000001,13.875,9.956521739130435,7.666666666666667
301.0,13.145000000000001,13.875,9.956521739130435,7.666666666666667
302.0,13.120000000000001,13.845238095238097,9.956521739130435,7.666666666666667
303.0,13.120000000000001,13.845238095238097,9.956521739130435,7.666666666666667
304.0,13.025000000000004,13.785714285714288,10.0,6.9
305.0,13.025000000000004,13.785714285714288,10.0,6.9
306.0,13.025000000000004,13.785714285714288,10.0,6.9
307.0,13.025000000000004,13.785714285714288,10.0,6.9
308.0,13.030000000000003,13.791666666666663,10.0,6.9
309.0,13.030000000000003,13.791666666666663,10.0,6.9
310.0,13.030000000000003,13.791666666666663,10.0,6.9
311.0,13.030000000000003,13.791666666666663,10.0,6.9
312.0,13.030000000000003,13.791666666666663,10.0,6.9
313.0,13.839999999999995,14.565476190476199,11.0,7.9
314.0,13.839999999999995,14.565476190476199,11.0,7.9
315.0,13.839999999999995,14.565476190476199,11.0,7.9
316.0,13.839999999999995,14.565476190476199,11.0,7.9
317.0,13.839999999999995,14.565476190476199,11.0,7.9
318.0,13.839999999999995,14.565476190476199,11.0,7.9
319.0,13.839999999999995,14.565476190476199,11.0,7.9
320.0,13.764999999999995,14.47619047619048,11.0,7.9
321.0,13.724999999999998,14.428571428571432,11.0,7.9
322.0,13.724999999999998,14.428571428571432,11.0,7.9
323.0,13.674999999999995,14.369047619047619,11.0,7.9
324.0,13.674999999999995,14.369047619047619,11.0,7.9
325.0,13.674999999999995,14.369047619047619,11.0,7.9
326.0,13.674999999999995,14.369047619047619,11.0,7.9
327.0,13.610000000000003,14.291666666666659,11.0,7.9
328.0,13.610000000000003,14.291666666666659,11.0,7.9
329.0,13.610000000000003,14.291666666666659,11.0,7.9
330.0,13.610000000000003,14.291666666666659,11.0,7.9
331.0,13.610000000000003,14.291666666666659,11.0,7.9
332.0,13.610000000000003,14.291666666666659,11.0,7.9
333.0,13.610000000000003,14.291666666666659,11.0,7.9
334.0,13.59,14.267857142857139,11.0,7.9
335.0,13.59,14.267857142857139,11.0,7.9
336.0,13.529999999999994,14.196428571428571,11.0,7.9
337.0,13.529999999999994,14.196428571428571,11.0,7.9
338.0,13.529999999999994,14.196428571428571,11.0,7.9
339.0,13.529999999999994,14.196428571428571,11.0,7.9
340.0,13.529999999999994,14.196428571428571,11.0,7.9
341.0,13.504999999999994,14.166666666666677,11.0,7.9
342.0,13.484999999999996,14.142857142857144,11.0,7.9
343.0,13.484999999999996,14.142857142857144,11.0,7.9
344.0,13.484999999999996,14.142857142857144,11.0,7.9
345.0,13.484999999999996,14.142857142857144,11.0,7.9
346.0,13.425,14.07142857142857,11.0,7.9
347.0,13.455000000000004,14.107142857142856,11.0,7.9
348.0,13.455000000000004,14.107142857142856,11.0,7.9
349.0,13.455000000000004,14.107142857142856,11.0,7.9
350.0,13.44,14.089285714285719,11.0,7.9
351.0,13.44,14.089285714285719,11.0,7.9
352.0,13.44,14.089285714285719,11.0,7.9
353.0,13.44,14.089285714285719,11.0,7.9
354.0,13.44,14.089285714285719,11.0,7.9
355.0,13.44,14.089285714285719,11.0,7.9
356.0,13.44,14.089285714285719,11.0,7.9
357.0,13.44,14.089285714285719,11.0,7.9
358.0,13.380000000000003,14.01785714285714,11.0,7.9
359.0,13.380000000000003,14.01785714285714,11.0,7.9
360.0,13.330000000000004,13.958333333333334,11.0,7.9
361.0,13.330000000000004,13.958333333333334,11.0,7.9
362.0,13.330000000000004,13.958333333333334,11.0,7.9
363.0,13.330000000000004,13.958333333333334,11.0,7.9
364.0,13.330000000000004,13.958333333333334,11.0,7.9
365.0,14.214999999999996,14.821428571428568,12.0,8.899999999999999
366.0,14.214999999999996,14.821428571428568,12.0,8.899999999999999
367.0,14.214999999999996,14.821428571428568,12.0,8.899999999999999
368.0,14.214999999999996,14.821428571428568,12.0,8.899999999999999
369.0,14.214999999999996,14.821428571428568,12.0,8.899999999999999
370.0,14.214999999999996,14.821428571428568,12.0,8.899999999999999
371.0,14.214999999999996,14.821428571428568,12.0,8.899999999999999
372.0,14.214999999999996,14.821428571428568,12.0,8.899999999999999
373.0,14.214999999999996,14.821428571428568,12.0,8.899999999999999
374.0,14.214999999999996,14.821428571428568,12.0,8.899999999999999
375.0,14.214999999999996,14.821428571428568,12.0,8.899999999999999
376.0,14.140000000000002,14.73214285714286,12.0,8.899999999999999
377.0,14.140000000000002,14.73214285714286,12.0,8.899999999999999
378.0,14.140000000000002,14.73214285714286,12.0,8.899999999999999
379.0,14.140000000000002,14.73214285714286,12.0,8.899999999999999
380.0,14.140000000000002,14.73214285714286,12.0,8.899999999999999
381.0,14.060000000000002,14.63690476190477,12.0,8.899999999999999
382.0,14.060000000000002,14.63690476190477,12.0,8.899999999999999
383.0,14.064999999999998,14.642857142857142,12.0,8.899999999999999
384.0,14.064999999999998,14.642857142857142,12.0,8.899999999999999
385.0,14.064999999999998,14.642857142857142,12.0,8.899999999999999
386.0,14.064999999999998,14.642857142857142,12.0,8.899999999999999
387.0,14.064999999999998,14.642857142857142,12.0,8.899999999999999
388.0,14.064999999999998,14.642857142857142,12.0,8.899999999999999
389.0,14.064999999999998,14.642857142857142,12.0,8.899999999999999
390.0,14.064999999999998,14.642857142857142,12.0,8.899999999999999
391.0,14.064999999999998,14.642857142857142,12.0,8.899999999999999
392.0,14.064999999999998,14.642857142857142,12.0,8.899999999999999
393.0,14.064999999999998,14.642857142857142,12.0,8.899999999999999
394.0,14.064999999999998,14.642857142857142,12.0,8.899999999999999
395.0,14.014999999999993,14.58333333333333,12.0,8.899999999999999
396.0,13.939999999999996,14.494047619047619,12.0,8.899999999999999
397.0,13.875000000000007,14.416666666666675,12.0,8.899999999999999
398.0,13.839999999999998,14.374999999999996,12.0,8.899999999999999
399.0,13.785,14.374999999999996,12.0,7.799999999999999
400.0,13.785,14.374999999999996,12.0,7.799999999999999
401.0,13.785,14.374999999999996,12.0,7.799999999999999
402.0,13.785,14.374999999999996,12.0,7.799999999999999
403.0,13.760000000000002,14.345238095238093,12.0,7.799999999999999
404.0,13.760000000000002,14.345238095238093,12.0,7.799999999999999
405.0,13.710000000000008,14.285714285714286,12.0,7.799999999999999
406.0,13.710000000000008,14.285714285714286,12.0,7.799999999999999
407.0,13.595000000000002,14.148809523809522,12.0,7.799999999999999
408.0,13.595000000000002,14.148809523809522,12.0,7.799999999999999
409.0,13.595000000000002,14.148809523809522,12.0,7.799999999999999
410.0,13.595000000000002,14.148809523809522,12.0,7.799999999999999
411.0,13.595000000000002,14.148809523809522,12.0,7.799999999999999
412.0,13.595000000000002,14.148809523809522,12.0,7.799999999999999
413.0,13.595000000000002,14.148809523809522,12.0,7.799999999999999
414.0,13.595000000000002,14.148809523809522,12.0,7.799999999999999
415.0,13.595000000000002,14.148809523809522,12.0,7.799999999999999
416.0,13.595000000000002,14.148809523809522,12.0,7.799999999999999
417.0,14.445,15.125,12.363636363636365,7.6
418.0,14.394999999999996,15.065476190476195,12.363636363636365,7.6
419.0,14.394999999999996,15.065476190476195,12.363636363636365,7.6
420.0,14.394999999999996,15.065476190476195,12.363636363636365,7.6
421.0,14.365000000000002,15.029761904761903,12.363636363636365,7.6
422.0,14.365000000000002,15.029761904761903,12.363636363636365,7.6
423.0,14.365000000000002,15.029761904761903,12.363636363636365,7.6
424.0,14.344999999999999,15.005952380952378,12.363636363636365,7.6
425.0,14.344999999999999,15.005952380952378,12.363636363636365,7.6
426.0,14.344999999999999,15.005952380952378,12.363636363636365,7.6
427.0,14.294999999999995,14.946428571428571,12.363636363636365,7.6
428.0,14.294999999999995,14.946428571428571,12.363636363636365,7.6
429.0,14.294999999999995,14.946428571428571,12.363636363636365,7.6
430.0,14.294999999999995,14.946428571428571,12.363636363636365,7.6
431.0,14.294999999999993,14.94642857142857,12.363636363636365,7.6
432.0,14.294999999999993,14.94642857142857,12.363636363636365,7.6
433.0,14.294999999999993,14.94642857142857,12.363636363636365,7.6
434.0,14.294999999999993,14.94642857142857,12.363636363636365,7.6
435.0,14.294999999999993,14.94642857142857,12.363636363636365,7.6
436.0,14.255,14.89880952380953,12.363636363636365,7.6
437.0,14.255,14.89880952380953,12.363636363636365,7.6
438.0,14.255,14.89880952380953,12.363636363636365,7.6
439.0,14.255,14.89880952380953,12.363636363636365,7.6
440.0,14.255,14.89880952380953,12.363636363636365,7.6
441.0,14.255,14.89880952380953,12.363636363636365,7.6
442.0,14.255,14.89880952380953,12.363636363636365,7.6
443.0,14.255,14.89880952380953,12.363636363636365,7.6
444.0,14.244999999999996,14.886904761904768,12.363636363636365,7.6
445.0,14.244999999999996,14.886904761904768,12.363636363636365,7.6
446.0,14.244999999999996,14.886904761904768,12.363636363636365,7.6
447.0,14.244999999999996,14.886904761904768,12.363636363636365,7.6
448.0,14.244999999999996,14.886904761904768,12.363636363636365,7.6
449.0,14.244999999999996,14.886904761904768,12.363636363636365,7.6
450.0,14.244999999999996,14.886904761904768,12.363636363636365,7.6
451.0,14.244999999999996,14.886904761904768,12.363636363636365,7.6
452.0,14.190000000000001,14.886904761904768,11.86363636363636,7.6
453.0,14.190000000000001,14.886904761904768,11.86363636363636,7.6
454.0,14.190000000000001,14.886904761904768,11.86363636363636,7.6
455.0,14.190000000000001,14.886904761904768,11.86363636363636,7.6
456.0,14.190000000000001,14.886904761904768,11.86363636363636,7.6
457.0,14.190000000000001,14.886904761904768,11.86363636363636,7.6
458.0,14.190000000000001,14.886904761904768,11.86363636363636,7.6
459.0,14.125,14.809523809523817,11.86363636363636,7.6
460.0,14.125,14.809523809523817,11.86363636363636,7.6
461.0,14.115000000000006,14.797619047619046,11.86363636363636,7.6
462.0,14.115000000000006,14.797619047619046,11.86363636363636,7.6
463.0,14.115000000000006,14.797619047619046,11.86363636363636,7.6
464.0,14.115000000000006,14.797619047619046,11.86363636363636,7.6
465.0,14.115000000000006,14.797619047619046,11.86363636363636,7.6
466.0,14.115000000000006,14.797619047619046,11.86363636363636,7.6
467.0,14.115000000000006,14.797619047619046,11.86363636363636,7.6
468.0,14.034999999999998,14.797619047619046,11.86363636363636,6.0
469.0,14.905,15.642857142857139,12.86363636363636,6.999999999999999
470.0,14.905,15.642857142857139,12.86363636363636,6.999999999999999
471.0,14.905,15.642857142857139,12.86363636363636,6.999999999999999
472.0,14.905,15.642857142857139,12.86363636363636,6.999999999999999
473.0,14.905,15.642857142857139,12.86363636363636,6.999999999999999
474.0,14.905,15.642857142857139,12.86363636363636,6.999999999999999
475.0,14.860000000000005,15.589285714285717,12.86363636363636,6.999999999999999
476.0,14.860000000000005,15.589285714285717,12.86363636363636,6.999999999999999
477.0,14.860000000000005,15.589285714285717,12.86363636363636,6.999999999999999
478.0,14.860000000000005,15.589285714285717,12.86363636363636,6.999999999999999
479.0,14.860000000000005,15.589285714285717,12.86363636363636,6.999999999999999
480.0,14.860000000000005,15.589285714285717,12.86363636363636,6.999999999999999
481.0,14.860000000000005,15.589285714285717,12.86363636363636,6.999999999999999
482.0,14.860000000000005,15.589285714285717,12.86363636363636,6.999999999999999
483.0,14.860000000000005,15.589285714285717,12.86363636363636,6.999999999999999
484.0,14.860000000000005,15.589285714285717,12.86363636363636,6.999999999999999
485.0,14.860000000000005,15.589285714285717,12.86363636363636,6.999999999999999
486.0,14.860000000000005,15.589285714285717,12.86363636363636,6.999999999999999
487.0,14.860000000000005,15.589285714285717,12.86363636363636,6.999999999999999
488.0,14.860000000000005,15.589285714285717,12.86363636363636,6.999999999999999
489.0,14.860000000000005,15.589285714285717,12.86363636363636,6.999999999999999
490.0,14.860000000000005,15.589285714285717,12.86363636363636,6.999999999999999
491.0,14.860000000000005,15.589285714285717,12.86363636363636,6.999999999999999
492.0,14.790000000000006,15.50595238095238,12.86363636363636,6.999999999999999
493.0,14.790000000000006,15.50595238095238,12.86363636363636,6.999999999999999
494.0,14.790000000000006,15.50595238095238,12.86363636363636,6.999999999999999
495.0,14.725000000000001,15.50595238095238,12.272727272727273,6.999999999999999
496.0,14.725000000000001,15.50595238095238,12.272727272727273,6.999999999999999
497.0,14.709999999999997,15.488095238095239,12.272727272727273,6.999999999999999
498.0,14.709999999999997,15.488095238095239,12.272727272727273,6.999999999999999
499.0,14.709999999999997,15.488095238095239,12.272727272727273,6.999999999999999
500.0,14.709999999999997,15.488095238095239,12.272727272727273,6.999999999999999
501.0,14.539999999999997,15.369047619047613,11.636363636363637,6.999999999999999
502.0,14.539999999999997,15.369047619047613,11.636363636363637,6.999999999999999
503.0,14.525000000000004,15.351190476190471,11.636363636363637,6.999999999999999
504.0,14.525000000000004,15.351190476190471,11.636363636363637,6.999999999999999
505.0,14.464999999999995,15.279761904761902,11.636363636363637,6.999999999999999
506.0,14.464999999999995,15.279761904761902,11.636363636363637,6.999999999999999
507.0,14.464999999999995,15.279761904761902,11.636363636363637,6.999999999999999
508.0,14.464999999999995,15.279761904761902,11.636363636363637,6.999999999999999
509.0,14.464999999999995,15.279761904761902,11.636363636363637,6.999999999999999
510.0,14.464999999999995,15.279761904761902,11.636363636363637,6.999999999999999
511.0,14.464999999999995,15.279761904761902,11.636363636363637,6.999999999999999
512.0,14.464999999999995,15.279761904761902,11.636363636363637,6.999999999999999
513.0,14.464999999999995,15.279761904761902,11.636363636363637,6.999999999999999
514.0,14.464999999999995,15.279761904761902,11.636363636363637,6.999999999999999
515.0,14.464999999999995,15.279761904761902,11.636363636363637,6.999999999999999
516.0,14.464999999999995,15.279761904761902,11.636363636363637,6.999999999999999
517.0,14.464999999999995,15.279761904761902,11.636363636363637,6.999999999999999
518.0,14.464999999999995,15.279761904761902,11.636363636363637,6.999999999999999
519.0,14.464999999999995,15.279761904761902,11.636363636363637,6.999999999999999
520.0,14.464999999999995,15.279761904761902,11.636363636363637,6.999999999999999
521.0,15.26,16.17857142857143,12.090909090909092,6.8
522.0,15.26,16.17857142857143,12.090909090909092,6.8
523.0,15.26,16.17857142857143,12.090909090909092,6.8
524.0,15.26,16.17857142857143,12.090909090909092,6.8
525.0,15.26,16.17857142857143,12.090909090909092,6.8
526.0,15.26,16.17857142857143,12.090909090909092,6.8
527.0,15.185000000000008,16.089285714285715,12.090909090909092,6.8
528.0,15.185000000000008,16.089285714285715,12.090909090909092,6.8
529.0,15.185000000000008,16.089285714285715,12.090909090909092,6.8
530.0,15.185000000000008,16.089285714285715,12.090909090909092,6.8
531.0,15.185000000000008,16.089285714285715,12.090909090909092,6.8
532.0,15.124999999999996,16.089285714285715,11.545454545454543,6.8
533.0,15.124999999999996,16.089285714285715,11.545454545454543,6.8
534.0,15.065000000000007,16.01785714285715,11.545454545454543,6.8
535.0,15.065000000000007,16.01785714285715,11.545454545454543,6.8
536.0,15.010000000000002,15.952380952380944,11.545454545454543,6.8
537.0,15.010000000000002,15.952380952380944,11.545454545454543,6.8
538.0,15.010000000000002,15.952380952380944,11.545454545454543,6.8
539.0,15.010000000000002,15.952380952380944,11.545454545454543,6.8
540.0,15.010000000000002,15.952380952380944,11.545454545454543,6.8
541.0,15.010000000000002,15.952380952380944,11.545454545454543,6.8
542.0,15.01499999999999,15.958333333333341,11.545454545454543,6.8
543.0,15.01499999999999,15.958333333333341,11.545454545454543,6.8
544.0,15.01499999999999,15.958333333333341,11.545454545454543,6.8
545.0,15.01499999999999,15.958333333333341,11.545454545454543,6.8
546.0,14.944999999999995,15.958333333333341,10.909090909090908,6.8
547.0,14.944999999999995,15.958333333333341,10.909090909090908,6.8
548.0,14.944999999999995,15.958333333333341,10.909090909090908,6.8
549.0,14.889999999999997,15.958333333333341,10.909090909090908,5.7
550.0,14.889999999999997,15.958333333333341,10.909090909090908,5.7
551.0,14.889999999999997,15.958333333333341,10.909090909090908,5.7
552.0,14.889999999999997,15.958333333333341,10.909090909090908,5.7
553.0,14.889999999999997,15.958333333333341,10.909090909090908,5.7
554.0,14.889999999999997,15.958333333333341,10.909090909090908,5.7
555.0,14.889999999999997,15.958333333333341,10.909090909090908,5.7
556.0,14.889999999999997,15.958333333333341,10.909090909090908,5.7
557.0,14.889999999999997,15.958333333333341,10.909090909090908,5.7
558.0,14.889999999999997,15.958333333333341,10.909090909090908,5.7
559.0,14.889999999999997,15.958333333333341,10.909090909090908,5.7
560.0,14.889999999999997,15.958333333333341,10.909090909090908,5.7
561.0,14.889999999999997,15.958333333333341,10.909090909090908,5.7
562.0,14.889999999999997,15.958333333333341,10.909090909090908,5.7
563.0,14.889999999999997,15.958333333333341,10.909090909090908,5.7
564.0,14.889999999999997,15.958333333333341,10.909090909090908,5.7
565.0,14.889999999999997,15.958333333333341,10.909090909090908,5.7
566.0,14.819999999999995,15.874999999999995,10.909090909090908,5.7
567.0,14.819999999999995,15.874999999999995,10.909090909090908,5.7
568.0,14.819999999999995,15.874999999999995,10.909090909090908,5.7
569.0,14.819999999999995,15.874999999999995,10.909090909090908,5.7
570.0,14.819999999999995,15.874999999999995,10.909090909090908,5.7
571.0,14.819999999999995,15.874999999999995,10.909090909090908,5.7
572.0,14.819999999999995,15.874999999999995,10.909090909090908,5.7
573.0,15.709999999999997,16.827380952380935,11.272727272727272,6.7
574.0,15.709999999999997,16.827380952380935,11.272727272727272,6.7
575.0,15.709999999999997,16.827380952380935,11.272727272727272,6.7
576.0,15.670000000000007,16.77976190476191,11.272727272727272,6.7
577.0,15.670000000000007,16.77976190476191,11.272727272727272,6.7
578.0,15.670000000000007,16.77976190476191,11.272727272727272,6.7
579.0,15.670000000000007,16.77976190476191,11.272727272727272,6.7
580.0,15.670000000000007,16.77976190476191,11.272727272727272,6.7
581.0,15.670000000000007,16.77976190476191,11.272727272727272,6.7
582.0,15.625,16.726190476190474,11.272727272727272,6.7
583.0,15.535000000000004,16.61904761904762,11.272727272727272,6.7
584.0,15.535000000000004,16.61904761904762,11.272727272727272,6.7
585.0,15.535000000000004,16.61904761904762,11.272727272727272,6.7
586.0,15.535000000000004,16.61904761904762,11.272727272727272,6.7
587.0,15.535000000000004,16.61904761904762,11.272727272727272,6.7
588.0,15.535000000000004,16.61904761904762,11.272727272727272,6.7
589.0,15.535000000000004,16.61904761904762,11.272727272727272,6.7
590.0,15.535000000000004,16.61904761904762,11.272727272727272,6.7
591.0,15.479999999999999,16.553571428571427,11.272727272727272,6.7
592.0,15.479999999999999,16.553571428571427,11.272727272727272,6.7
593.0,15.479999999999999,16.553571428571427,11.272727272727272,6.7
594.0,15.479999999999999,16.553571428571427,11.272727272727272,6.7
595.0,15.429999999999998,16.494047619047617,11.272727272727272,6.7
596.0,15.429999999999998,16.494047619047617,11.272727272727272,6.7
597.0,15.429999999999998,16.494047619047617,11.272727272727272,6.7
598.0,15.429999999999998,16.494047619047617,11.272727272727272,6.7
599.0,15.429999999999998,16.494047619047617,11.272727272727272,6.7
600.0,15.429999999999998,16.494047619047617,11.272727272727272,6.7
601.0,15.429999999999998,16.494047619047617,11.272727272727272,6.7
602.0,15.429999999999998,16.494047619047617,11.272727272727272,6.7
603.0,15.429999999999998,16.494047619047617,11.272727272727272,6.7
604.0,15.429999999999998,16.494047619047617,11.272727272727272,6.7
605.0,15.429999999999998,16.494047619047617,11.272727272727272,6.7
606.0,15.429999999999998,16.494047619047617,11.272727272727272,6.7
607.0,15.429999999999998,16.494047619047617,11.272727272727272,6.7
608.0,15.429999999999998,16.494047619047617,11.272727272727272,6.7
609.0,15.429999999999998,16.494047619047617,11.272727272727272,6.7
610.0,15.429999999999998,16.494047619047617,11.272727272727272,6.7
611.0,15.429999999999998,16.494047619047617,11.272727272727272,6.7
612.0,15.429999999999998,16.494047619047617,11.272727272727272,6.7
613.0,15.429999999999998,16.494047619047617,11.272727272727272,6.7
614.0,15.429999999999998,16.494047619047617,11.272727272727272,6.7
615.0,15.429999999999998,16.494047619047617,11.272727272727272,6.7
616.0,15.429999999999998,16.494047619047617,11.272727272727272,6.7
617.0,15.429999999999998,16.494047619047617,11.272727272727272,6.7
618.0,15.429999999999998,16.494047619047617,11.272727272727272,6.7
619.0,15.329999999999998,16.375000000000014,11.272727272727272,6.7
620.0,15.185000000000011,16.202380952380977,11.272727272727272,6.7
621.0,15.185000000000011,16.202380952380977,11.272727272727272,6.7
622.0,15.185000000000011,16.202380952380977,11.272727272727272,6.7
623.0,15.185000000000011,16.202380952380977,11.272727272727272,6.7
624.0,15.185000000000011,16.202380952380977,11.272727272727272,6.7
625.0,16.18500000000001,17.20238095238097,12.272727272727272,7.7
626.0,16.18500000000001,17.20238095238097,12.272727272727272,7.7
627.0,16.18500000000001,17.20238095238097,12.272727272727272,7.7
628.0,16.18500000000001,17.20238095238097,12.272727272727272,7.7
629.0,16.18500000000001,17.20238095238097,12.272727272727272,7.7
630.0,16.089999999999996,17.08928571428571,12.272727272727272,7.7
631.0,16.089999999999996,17.08928571428571,12.272727272727272,7.7
632.0,16.089999999999996,17.08928571428571,12.272727272727272,7.7
633.0,15.94,16.91071428571429,12.272727272727272,7.7
634.0,15.94,16.91071428571429,12.272727272727272,7.7
635.0,15.94,16.91071428571429,12.272727272727272,7.7
636.0,15.94,16.91071428571429,12.272727272727272,7.7
637.0,15.94,16.91071428571429,12.272727272727272,7.7
638.0,15.94,16.91071428571429,12.272727272727272,7.7
639.0,15.94,16.91071428571429,12.272727272727272,7.7
640.0,15.784999999999993,16.91071428571429,11.590909090909092,6.1000000000000005
641.0,15.784999999999993,16.91071428571429,11.590909090909092,6.1000000000000005
642.0,15.784999999999993,16.91071428571429,11.590909090909092,6.1000000000000005
643.0,15.784999999999993,16.91071428571429,11.590909090909092,6.1000000000000005
644.0,15.675,16.77976190476191,11.590909090909092,6.1000000000000005
645.0,15.675,16.77976190476191,11.590909090909092,6.1000000000000005
646.0,15.56,16.642857142857142,11.590909090909092,6.1000000000000005
647.0,15.500000000000004,16.571428571428573,11.590909090909092,6.1000000000000005
648.0,15.500000000000004,16.571428571428573,11.590909090909092,6.1000000000000005
649.0,15.500000000000004,16.571428571428573,11.590909090909092,6.1000000000000005
650.0,15.500000000000004,16.571428571428573,11.590909090909092,6.1000000000000005
651.0,15.419999999999998,16.571428571428573,10.863636363636365,6.1000000000000005
652.0,15.419999999999998,16.571428571428573,10.863636363636365,6.1000000000000005
653.0,15.419999999999998,16.571428571428573,10.863636363636365,6.1000000000000005
654.0,15.419999999999998,16.571428571428573,10.863636363636365,6.1000000000000005
655.0,15.419999999999998,16.571428571428573,10.863636363636365,6.1000000000000005
656.0,15.419999999999998,16.571428571428573,10.863636363636365,6.1000000000000005
657.0,15.419999999999998,16.571428571428573,10.863636363636365,6.1000000000000005
658.0,15.419999999999998,16.571428571428573,10.863636363636365,6.1000000000000005
659.0,15.369999999999997,16.511904761904766,10.863636363636365,6.1000000000000005
660.0,15.369999999999997,16.511904761904766,10.863636363636365,6.1000000000000005
661.0,15.369999999999997,16.511904761904766,10.863636363636365,6.1000000000000005
662.0,15.295,16.42261904761905,10.863636363636365,6.1000000000000005
663.0,15.295,16.42261904761905,10.863636363636365,6.1000000000000005
664.0,15.295,16.42261904761905,10.863636363636365,6.1000000000000005
665.0,15.295,16.42261904761905,10.863636363636365,6.1000000000000005
666.0,15.295,16.42261904761905,10.863636363636365,6.1000000000000005
667.0,15.264999999999999,16.386904761904752,10.863636363636365,6.1000000000000005
668.0,15.264999999999999,16.386904761904752,10.863636363636365,6.1000000000000005
669.0,15.264999999999999,16.386904761904752,10.863636363636365,6.1000000000000005
670.0,15.264999999999999,16.386904761904752,10.863636363636365,6.1000000000000005
671.0,15.264999999999999,16.386904761904752,10.863636363636365,6.1000000000000005
672.0,15.264999999999999,16.386904761904752,10.863636363636365,6.1000000000000005
673.0,15.264999999999999,16.386904761904752,10.863636363636365,6.1000000000000005
674.0,15.264999999999999,16.386904761904752,10.863636363636365,6.1000000000000005
675.0,15.264999999999999,16.386904761904752,10.863636363636365,6.1000000000000005
676.0,15.264999999999999,16.386904761904752,10.863636363636365,6.1000000000000005
677.0,16.089999999999996,17.291666666666668,11.523809523809524,6.454545454545455
678.0,16.089999999999996,17.291666666666668,11.523809523809524,6.454545454545455
679.0,16.089999999999996,17.291666666666668,11.523809523809524,6.454545454545455
680.0,16.089999999999996,17.291666666666668,11.523809523809524,6.454545454545455
681.0,16.089999999999996,17.291666666666668,11.523809523809524,6.454545454545455
682.0,16.089999999999996,17.291666666666668,11.523809523809524,6.454545454545455
683.0,16.089999999999996,17.291666666666668,11.523809523809524,6.454545454545455
684.0,16.089999999999996,17.291666666666668,11.523809523809524,6.454545454545455
685.0,16.089999999999996,17.291666666666668,11.523809523809524,6.454545454545455
686.0,16.089999999999996,17.291666666666668,11.523809523809524,6.454545454545455
687.0,16.089999999999996,17.291666666666668,11.523809523809524,6.454545454545455
688.0,16.089999999999996,17.291666666666668,11.523809523809524,6.454545454545455
689.0,16.089999999999996,17.291666666666668,11.523809523809524,6.454545454545455
690.0,16.015000000000004,17.202380952380942,11.523809523809524,6.454545454545455
691.0,15.925000000000002,17.0952380952381,11.523809523809524,6.454545454545455
692.0,15.689999999999996,16.93452380952381,10.571428571428571,6.454545454545455
693.0,15.689999999999996,16.93452380952381,10.571428571428571,6.454545454545455
694.0,15.689999999999996,16.93452380952381,10.571428571428571,6.454545454545455
695.0,15.689999999999996,16.93452380952381,10.571428571428571,6.454545454545455
696.0,15.689999999999996,16.93452380952381,10.571428571428571,6.454545454545455
697.0,15.45499999999999,16.654761904761905,10.571428571428571,6.454545454545455
698.0,15.45499999999999,16.654761904761905,10.571428571428571,6.454545454545455
699.0,15.45499999999999,16.654761904761905,10.571428571428571,6.454545454545455
700.0,15.45499999999999,16.654761904761905,10.571428571428571,6.454545454545455
701.0,15.45499999999999,16.654761904761905,10.571428571428571,6.454545454545455
702.0,15.45499999999999,16.654761904761905,10.571428571428571,6.454545454545455
703.0,15.269999999999994,16.434523809523814,10.571428571428571,6.454545454545455
704.0,15.269999999999994,16.434523809523814,10.571428571428571,6.454545454545455
705.0,15.269999999999994,16.434523809523814,10.571428571428571,6.454545454545455
706.0,15.269999999999994,16.434523809523814,10.571428571428571,6.454545454545455
707.0,15.269999999999994,16.434523809523814,10.571428571428571,6.454545454545455
708.0,15.269999999999994,16.434523809523814,10.571428571428571,6.454545454545455
709.0,15.269999999999994,16.434523809523814,10.571428571428571,6.454545454545455
710.0,15.269999999999994,16.434523809523814,10.571428571428571,6.454545454545455
711.0,15.269999999999994,16.434523809523814,10.571428571428571,6.454545454545455
712.0,15.204999999999997,16.35714285714287,10.571428571428571,6.454545454545455
713.0,15.204999999999997,16.35714285714287,10.571428571428571,6.454545454545455
714.0,15.204999999999997,16.35714285714287,10.571428571428571,6.454545454545455
715.0,15.124999999999991,16.35714285714287,9.80952380952381,6.454545454545455
716.0,15.124999999999991,16.35714285714287,9.80952380952381,6.454545454545455
717.0,15.075000000000005,16.297619047619044,9.80952380952381,6.454545454545455
718.0,15.075000000000005,16.297619047619044,9.80952380952381,6.454545454545455
719.0,15.075000000000005,16.297619047619044,9.80952380952381,6.454545454545455
720.0,15.019999999999996,16.23214285714287,9.80952380952381,6.454545454545455
721.0,15.019999999999996,16.23214285714287,9.80952380952381,6.454545454545455
722.0,15.019999999999996,16.23214285714287,9.80952380952381,6.454545454545455
723.0,15.019999999999996,16.23214285714287,9.80952380952381,6.454545454545455
724.0,15.019999999999996,16.23214285714287,9.80952380952381,6.454545454545455
725.0,15.019999999999996,16.23214285714287,9.80952380952381,6.454545454545455
726.0,15.019999999999996,16.23214285714287,9.80952380952381,6.454545454545455
727.0,14.945000000000002,16.14285714285715,9.80952380952381,6.454545454545455
728.0,14.945000000000002,16.14285714285715,9.80952380952381,6.454545454545455
729.0,15.944999999999995,17.14285714285716,10.80952380952381,7.454545454545454
730.0,15.944999999999995,17.14285714285716,10.80952380952381,7.454545454545454
731.0,15.944999999999995,17.14285714285716,10.80952380952381,7.454545454545454
732.0,15.944999999999995,17.14285714285716,10.80952380952381,7.454545454545454
733.0,15.944999999999995,17.14285714285716,10.80952380952381,7.454545454545454
734.0,15.944999999999995,17.14285714285716,10.80952380952381,7.454545454545454
735.0,15.944999999999995,17.14285714285716,10.80952380952381,7.454545454545454
736.0,15.819999999999993,16.994047619047617,10.80952380952381,7.454545454545454
737.0,15.819999999999993,16.994047619047617,10.80952380952381,7.454545454545454
738.0,15.819999999999993,16.994047619047617,10.80952380952381,7.454545454545454
739.0,15.720000000000002,16.874999999999996,10.80952380952381,7.454545454545454
740.0,15.720000000000002,16.874999999999996,10.80952380952381,7.454545454545454
741.0,15.720000000000002,16.874999999999996,10.80952380952381,7.454545454545454
742.0,15.720000000000002,16.874999999999996,10.80952380952381,7.454545454545454
743.0,15.720000000000002,16.874999999999996,10.80952380952381,7.454545454545454
744.0,15.670000000000003,16.815476190476193,10.80952380952381,7.454545454545454
745.0,15.670000000000003,16.815476190476193,10.80952380952381,7.454545454545454
746.0,15.670000000000003,16.815476190476193,10.80952380952381,7.454545454545454
747.0,15.670000000000003,16.815476190476193,10.80952380952381,7.454545454545454
748.0,15.670000000000003,16.815476190476193,10.80952380952381,7.454545454545454
749.0,15.670000000000003,16.815476190476193,10.80952380952381,7.454545454545454
750.0,15.465000000000003,16.732142857142872,9.523809523809524,7.454545454545454
751.0,15.465000000000003,16.732142857142872,9.523809523809524,7.454545454545454
752.0,15.39,16.642857142857142,9.523809523809524,7.454545454545454
753.0,15.39,16.642857142857142,9.523809523809524,7.454545454545454
754.0,15.39,16.642857142857142,9.523809523809524,7.454545454545454
755.0,15.319999999999993,16.559523809523814,9.523809523809524,7.454545454545454
756.0,15.319999999999993,16.559523809523814,9.523809523809524,7.454545454545454
757.0,15.319999999999993,16.559523809523814,9.523809523809524,7.454545454545454
758.0,15.319999999999993,16.559523809523814,9.523809523809524,7.454545454545454
759.0,15.319999999999993,16.559523809523814,9.523809523809524,7.454545454545454
760.0,15.319999999999993,16.559523809523814,9.523809523809524,7.454545454545454
761.0,15.319999999999993,16.559523809523814,9.523809523809524,7.454545454545454
762.0,15.319999999999993,16.559523809523814,9.523809523809524,7.454545454545454
763.0,15.319999999999993,16.559523809523814,9.523809523809524,7.454545454545454
764.0,15.319999999999993,16.559523809523814,9.523809523809524,7.454545454545454
765.0,15.319999999999993,16.559523809523814,9.523809523809524,7.454545454545454
766.0,15.22,16.44047619047619,9.523809523809524,7.454545454545454
767.0,15.22,16.44047619047619,9.523809523809524,7.454545454545454
768.0,15.22,16.44047619047619,9.523809523809524,7.454545454545454
769.0,15.22,16.44047619047619,9.523809523809524,7.454545454545454
770.0,15.22,16.44047619047619,9.523809523809524,7.454545454545454
771.0,15.22,16.44047619047619,9.523809523809524,7.454545454545454
772.0,15.22,16.44047619047619,9.523809523809524,7.454545454545454
773.0,15.22,16.44047619047619,9.523809523809524,7.454545454545454
774.0,15.22,16.44047619047619,9.523809523809524,7.454545454545454
775.0,15.22,16.44047619047619,9.523809523809524,7.454545454545454
776.0,15.22,16.44047619047619,9.523809523809524,7.454545454545454
777.0,15.22,16.44047619047619,9.523809523809524,7.454545454545454
778.0,15.08499999999999,16.279761904761894,9.523809523809524,7.454545454545454
779.0,15.08499999999999,16.279761904761894,9.523809523809524,7.454545454545454
780.0,15.08499999999999,16.279761904761894,9.523809523809524,7.454545454545454
781.0,16.084999999999987,17.279761904761894,10.523809523809524,8.454545454545455
782.0,16.084999999999987,17.279761904761894,10.523809523809524,8.454545454545455
783.0,16.084999999999987,17.279761904761894,10.523809523809524,8.454545454545455
784.0,16.084999999999987,17.279761904761894,10.523809523809524,8.454545454545455
785.0,16.084999999999987,17.279761904761894,10.523809523809524,8.454545454545455
786.0,16.084999999999987,17.279761904761894,10.523809523809524,8.454545454545455
787.0,16.084999999999987,17.279761904761894,10.523809523809524,8.454545454545455
788.0,16.084999999999987,17.279761904761894,10.523809523809524,8.454545454545455
789.0,16.05,17.238095238095237,10.523809523809524,8.454545454545455
790.0,16.05,17.238095238095237,10.523809523809524,8.454545454545455
791.0,16.05,17.238095238095237,10.523809523809524,8.454545454545455
792.0,16.05,17.238095238095237,10.523809523809524,8.454545454545455
793.0,15.984999999999998,17.160714285714278,10.523809523809524,8.454545454545455
794.0,15.984999999999998,17.160714285714278,10.523809523809524,8.454545454545455
795.0,15.984999999999998,17.160714285714278,10.523809523809524,8.454545454545455
796.0,15.984999999999998,17.160714285714278,10.523809523809524,8.454545454545455
797.0,15.984999999999998,17.160714285714278,10.523809523809524,8.454545454545455
798.0,15.984999999999998,17.160714285714278,10.523809523809524,8.454545454545455
799.0,15.984999999999998,17.160714285714278,10.523809523809524,8.454545454545455
800.0,15.984999999999998,17.160714285714278,10.523809523809524,8.454545454545455
801.0,15.984999999999998,17.160714285714278,10.523809523809524,8.454545454545455
802.0,15.984999999999998,17.160714285714278,10.523809523809524,8.454545454545455
803.0,15.899999999999997,17.160714285714278,9.714285714285714,8.454545454545455
804.0,15.899999999999997,17.160714285714278,9.714285714285714,8.454545454545455
805.0,15.899999999999997,17.160714285714278,9.714285714285714,8.454545454545455
806.0,15.899999999999997,17.160714285714278,9.714285714285714,8.454545454545455
807.0,15.899999999999997,17.160714285714278,9.714285714285714,8.454545454545455
808.0,15.899999999999997,17.160714285714278,9.714285714285714,8.454545454545455
809.0,15.899999999999997,17.160714285714278,9.714285714285714,8.454545454545455
810.0,15.899999999999997,17.160714285714278,9.714285714285714,8.454545454545455
811.0,15.899999999999997,17.160714285714278,9.714285714285714,8.454545454545455
812.0,15.899999999999997,17.160714285714278,9.714285714285714,8.454545454545455
813.0,15.899999999999997,17.160714285714278,9.714285714285714,8.454545454545455
814.0,15.82499999999999,17.07142857142857,9.714285714285714,8.454545454545455
815.0,15.82499999999999,17.07142857142857,9.714285714285714,8.454545454545455
816.0,15.82499999999999,17.07142857142857,9.714285714285714,8.454545454545455
817.0,15.74499999999999,16.976190476190474,9.714285714285714,8.454545454545455
818.0,15.74499999999999,16.976190476190474,9.714285714285714,8.454545454545455
819.0,15.68499999999999,16.90476190476191,9.714285714285714,8.454545454545455
820.0,15.600000000000001,16.803571428571445,9.714285714285714,8.454545454545455
821.0,15.600000000000001,16.803571428571445,9.714285714285714,8.454545454545455
822.0,15.600000000000001,16.803571428571445,9.714285714285714,8.454545454545455
823.0,15.600000000000001,16.803571428571445,9.714285714285714,8.454545454545455
824.0,15.600000000000001,16.803571428571445,9.714285714285714,8.454545454545455
825.0,15.600000000000001,16.803571428571445,9.714285714285714,8.454545454545455
826.0,15.600000000000001,16.803571428571445,9.714285714285714,8.454545454545455
827.0,15.600000000000001,16.803571428571445,9.714285714285714,8.454545454545455
828.0,15.534999999999991,16.72619047619047,9.714285714285714,8.454545454545455
829.0,15.534999999999991,16.72619047619047,9.714285714285714,8.454545454545455
830.0,15.534999999999991,16.72619047619047,9.714285714285714,8.454545454545455
831.0,15.534999999999991,16.72619047619047,9.714285714285714,8.454545454545455
832.0,15.534999999999991,16.72619047619047,9.714285714285714,8.454545454545455
833.0,16.48000000000001,17.660714285714278,10.714285714285714,9.454545454545455
834.0,16.48000000000001,17.660714285714278,10.714285714285714,9.454545454545455
835.0,16.48000000000001,17.660714285714278,10.714285714285714,9.454545454545455
836.0,16.48000000000001,17.660714285714278,10.714285714285714,9.454545454545455
837.0,16.48000000000001,17.660714285714278,10.714285714285714,9.454545454545455
838.0,16.48000000000001,17.660714285714278,10.714285714285714,9.454545454545455
839.0,16.48000000000001,17.660714285714278,10.714285714285714,9.454545454545455
840.0,16.48000000000001,17.660714285714278,10.714285714285714,9.454545454545455
841.0,16.48000000000001,17.660714285714278,10.714285714285714,9.454545454545455
842.0,16.415000000000013,17.583333333333325,10.714285714285714,9.454545454545455
843.0,16.415000000000013,17.583333333333325,10.714285714285714,9.454545454545455
844.0,16.415000000000013,17.583333333333325,10.714285714285714,9.454545454545455
845.0,16.415000000000013,17.583333333333325,10.714285714285714,9.454545454545455
846.0,16.415000000000013,17.583333333333325,10.714285714285714,9.454545454545455
847.0,16.415000000000013,17.583333333333325,10.714285714285714,9.454545454545455
848.0,16.415000000000013,17.583333333333325,10.714285714285714,9.454545454545455
849.0,16.415000000000013,17.583333333333325,10.714285714285714,9.454545454545455
850.0,16.364999999999995,17.523809523809522,10.714285714285714,9.454545454545455
851.0,16.364999999999995,17.523809523809522,10.714285714285714,9.454545454545455
852.0,16.364999999999995,17.523809523809522,10.714285714285714,9.454545454545455
853.0,16.364999999999995,17.523809523809522,10.714285714285714,9.454545454545455
854.0,16.364999999999995,17.523809523809522,10.714285714285714,9.454545454545455
855.0,16.364999999999995,17.523809523809522,10.714285714285714,9.454545454545455
856.0,16.299999999999994,17.446428571428573,10.714285714285714,9.454545454545455
857.0,16.299999999999994,17.446428571428573,10.714285714285714,9.454545454545455
858.0,16.299999999999994,17.446428571428573,10.714285714285714,9.454545454545455
859.0,16.299999999999994,17.446428571428573,10.714285714285714,9.454545454545455
860.0,16.299999999999994,17.446428571428573,10.714285714285714,9.454545454545455
861.0,16.299999999999994,17.446428571428573,10.714285714285714,9.454545454545455
862.0,16.299999999999994,17.446428571428573,10.714285714285714,9.454545454545455
863.0,16.299999999999994,17.446428571428573,10.714285714285714,9.454545454545455
864.0,16.299999999999994,17.446428571428573,10.714285714285714,9.454545454545455
865.0,16.299999999999994,17.446428571428573,10.714285714285714,9.454545454545455
866.0,16.11499999999999,17.22619047619048,10.714285714285714,9.454545454545455
867.0,16.11499999999999,17.22619047619048,10.714285714285714,9.454545454545455
868.0,16.11499999999999,17.22619047619048,10.714285714285714,9.454545454545455
869.0,16.11499999999999,17.22619047619048,10.714285714285714,9.454545454545455
870.0,16.11499999999999,17.22619047619048,10.714285714285714,9.454545454545455
871.0,15.989999999999997,17.077380952380942,10.714285714285714,9.454545454545455
872.0,15.989999999999997,17.077380952380942,10.714285714285714,9.454545454545455
873.0,15.989999999999997,17.077380952380942,10.714285714285714,9.454545454545455
874.0,15.989999999999997,17.077380952380942,10.714285714285714,9.454545454545455
875.0,15.810000000000011,16.86309523809524,10.714285714285714,9.454545454545455
876.0,15.744999999999994,16.785714285714292,10.714285714285714,9.454545454545455
877.0,15.744999999999994,16.785714285714292,10.714285714285714,9.454545454545455
878.0,15.744999999999994,16.785714285714292,10.714285714285714,9.454545454545455
879.0,15.680000000000005,16.708333333333343,10.714285714285714,9.454545454545455
880.0,15.680000000000005,16.708333333333343,10.714285714285714,9.454545454545455
881.0,15.630000000000003,16.648809523809522,10.714285714285714,9.454545454545455
882.0,15.630000000000003,16.648809523809522,10.714285714285714,9.454545454545455
883.0,15.535000000000004,16.648809523809522,10.714285714285714,7.727272727272727
884.0,15.535000000000004,16.648809523809522,10.714285714285714,7.727272727272727
885.0,16.305000000000007,17.535714285714278,10.950000000000001,8.0
886.0,16.305000000000007,17.535714285714278,10.950000000000001,8.0
887.0,16.305000000000007,17.535714285714278,10.950000000000001,8.0
888.0,16.214999999999993,17.428571428571423,10.950000000000001,8.0
889.0,16.214999999999993,17.428571428571423,10.950000000000001,8.0
890.0,16.139999999999993,17.339285714285708,10.950000000000001,8.0
891.0,16.139999999999993,17.339285714285708,10.950000000000001,8.0
892.0,16.139999999999993,17.339285714285708,10.950000000000001,8.0
893.0,16.139999999999993,17.339285714285708,10.950000000000001,8.0
894.0,16.139999999999993,17.339285714285708,10.950000000000001,8.0
895.0,16.139999999999993,17.339285714285708,10.950000000000001,8.0
896.0,16.139999999999993,17.339285714285708,10.950000000000001,8.0
897.0,16.139999999999993,17.339285714285708,10.950000000000001,8.0
898.0,16.005,17.17857142857143,10.950000000000001,8.0
899.0,15.895000000000001,17.17857142857143,9.85,8.0
900.0,15.895000000000001,17.17857142857143,9.85,8.0
901.0,15.725000000000001,16.97619047619048,9.85,8.0
902.0,15.725000000000001,16.97619047619048,9.85,8.0
903.0,15.534999999999995,16.863095238095244,9.85,6.416666666666667
904.0,15.534999999999995,16.863095238095244,9.85,6.416666666666667
905.0,15.534999999999995,16.863095238095244,9.85,6.416666666666667
906.0,15.534999999999995,16.863095238095244,9.85,6.416666666666667
907.0,15.534999999999995,16.863095238095244,9.85,6.416666666666667
908.0,15.534999999999995,16.863095238095244,9.85,6.416666666666667
909.0,15.430000000000005,16.738095238095237,9.85,6.416666666666667
910.0,15.430000000000005,16.738095238095237,9.85,6.416666666666667
911.0,15.430000000000005,16.738095238095237,9.85,6.416666666666667
912.0,15.430000000000005,16.738095238095237,9.85,6.416666666666667
913.0,15.430000000000005,16.738095238095237,9.85,6.416666666666667
914.0,15.430000000000005,16.738095238095237,9.85,6.416666666666667
915.0,15.430000000000005,16.738095238095237,9.85,6.416666666666667
916.0,15.430000000000005,16.738095238095237,9.85,6.416666666666667
917.0,15.284999999999997,16.565476190476193,9.85,6.416666666666667
918.0,15.284999999999997,16.565476190476193,9.85,6.416666666666667
919.0,15.284999999999997,16.565476190476193,9.85,6.416666666666667
920.0,15.284999999999997,16.565476190476193,9.85,6.416666666666667
921.0,15.284999999999997,16.565476190476193,9.85,6.416666666666667
922.0,15.284999999999997,16.565476190476193,9.85,6.416666666666667
923.0,15.284999999999997,16.565476190476193,9.85,6.416666666666667
924.0,15.284999999999997,16.565476190476193,9.85,6.416666666666667
925.0,15.284999999999997,16.565476190476193,9.85,6.416666666666667
926.0,15.180000000000001,16.565476190476193,9.26315789473684,5.923076923076923
927.0,15.180000000000001,16.565476190476193,9.26315789473684,5.923076923076923
928.0,15.180000000000001,16.565476190476193,9.26315789473684,5.923076923076923
929.0,15.180000000000001,16.565476190476193,9.26315789473684,5.923076923076923
930.0,15.180000000000001,16.565476190476193,9.26315789473684,5.923076923076923
931.0,15.180000000000001,16.565476190476193,9.26315789473684,5.923076923076923
932.0,15.180000000000001,16.565476190476193,9.26315789473684,5.923076923076923
933.0,15.180000000000001,16.565476190476193,9.26315789473684,5.923076923076923
934.0,15.059999999999999,16.42261904761905,9.26315789473684,5.923076923076923
935.0,15.059999999999999,16.42261904761905,9.26315789473684,5.923076923076923
936.0,14.959999999999997,16.42261904761905,8.210526315789473,5.923076923076923
937.0,15.960000000000017,17.42261904761905,9.210526315789473,6.923076923076923
938.0,15.960000000000017,17.42261904761905,9.210526315789473,6.923076923076923
939.0,15.960000000000017,17.42261904761905,9.210526315789473,6.923076923076923
940.0,15.960000000000017,17.42261904761905,9.210526315789473,6.923076923076923
941.0,15.960000000000017,17.42261904761905,9.210526315789473,6.923076923076923
942.0,15.960000000000017,17.42261904761905,9.210526315789473,6.923076923076923
943.0,15.670000000000009,17.077380952380945,9.210526315789473,6.923076923076923
944.0,15.670000000000009,17.077380952380945,9.210526315789473,6.923076923076923
945.0,15.570000000000014,16.958333333333336,9.210526315789473,6.923076923076923
946.0,15.459999999999999,16.82738095238096,9.210526315789473,6.923076923076923
947.0,15.360000000000001,16.708333333333332,9.210526315789473,6.923076923076923
948.0,15.360000000000001,16.708333333333332,9.210526315789473,6.923076923076923
949.0,15.360000000000001,16.708333333333332,9.210526315789473,6.923076923076923
950.0,15.360000000000001,16.708333333333332,9.210526315789473,6.923076923076923
951.0,15.360000000000001,16.708333333333332,9.210526315789473,6.923076923076923
952.0,15.360000000000001,16.708333333333332,9.210526315789473,6.923076923076923
953.0,15.360000000000001,16.708333333333332,9.210526315789473,6.923076923076923
954.0,15.360000000000001,16.708333333333332,9.210526315789473,6.923076923076923
955.0,15.360000000000001,16.708333333333332,9.210526315789473,6.923076923076923
956.0,15.360000000000001,16.708333333333332,9.210526315789473,6.923076923076923
957.0,15.360000000000001,16.708333333333332,9.210526315789473,6.923076923076923
958.0,15.360000000000001,16.708333333333332,9.210526315789473,6.923076923076923
959.0,15.209999999999997,16.529761904761894,9.210526315789473,6.923076923076923
960.0,15.209999999999997,16.529761904761894,9.210526315789473,6.923076923076923
961.0,15.209999999999997,16.529761904761894,9.210526315789473,6.923076923076923
962.0,15.209999999999997,16.529761904761894,9.210526315789473,6.923076923076923
963.0,15.209999999999997,16.529761904761894,9.210526315789473,6.923076923076923
964.0,15.209999999999997,16.529761904761894,9.210526315789473,6.923076923076923
965.0,15.209999999999997,16.529761904761894,9.210526315789473,6.923076923076923
966.0,15.209999999999997,16.529761904761894,9.210526315789473,6.923076923076923
967.0,15.209999999999997,16.529761904761894,9.210526315789473,6.923076923076923
968.0,15.209999999999997,16.529761904761894,9.210526315789473,6.923076923076923
969.0,15.209999999999997,16.529761904761894,9.210526315789473,6.923076923076923
970.0,15.209999999999997,16.529761904761894,9.210526315789473,6.923076923076923
971.0,15.209999999999997,16.529761904761894,9.210526315789473,6.923076923076923
972.0,15.065000000000003,16.357142857142847,9.210526315789473,6.923076923076923
973.0,15.065000000000003,16.357142857142847,9.210526315789473,6.923076923076923
974.0,15.065000000000003,16.357142857142847,9.210526315789473,6.923076923076923
975.0,15.065000000000003,16.357142857142847,9.210526315789473,6.923076923076923
976.0,15.065000000000003,16.357142857142847,9.210526315789473,6.923076923076923
977.0,15.065000000000003,16.357142857142847,9.210526315789473,6.923076923076923
978.0,15.065000000000003,16.357142857142847,9.210526315789473,6.923076923076923
979.0,15.065000000000003,16.357142857142847,9.210526315789473,6.923076923076923
980.0,15.065000000000003,16.357142857142847,9.210526315789473,6.923076923076923
981.0,15.065000000000003,16.357142857142847,9.210526315789473,6.923076923076923
982.0,15.065000000000003,16.357142857142847,9.210526315789473,6.923076923076923
983.0,15.065000000000003,16.357142857142847,9.210526315789473,6.923076923076923
984.0,15.065000000000003,16.357142857142847,9.210526315789473,6.923076923076923
985.0,15.065000000000003,16.357142857142847,9.210526315789473,6.923076923076923
986.0,15.065000000000003,16.357142857142847,9.210526315789473,6.923076923076923
987.0,15.065000000000003,16.357142857142847,9.210526315789473,6.923076923076923
988.0,14.870000000000003,16.357142857142847,7.555555555555557,6.428571428571429
989.0,15.870000000000019,17.357142857142847,8.555555555555557,7.428571428571429
990.0,15.870000000000019,17.357142857142847,8.555555555555557,7.428571428571429
991.0,15.780000000000001,17.250000000000004,8.555555555555557,7.428571428571429
992.0,15.660000000000002,17.250000000000004,7.222222222222222,7.428571428571429
993.0,15.580000000000002,17.154761904761905,7.222222222222222,7.428571428571429
994.0,15.580000000000002,17.154761904761905,7.222222222222222,7.428571428571429
995.0,15.455000000000004,17.005952380952376,7.222222222222222,7.428571428571429
996.0,15.455000000000004,17.005952380952376,7.222222222222222,7.428571428571429
997.0,15.455000000000004,17.005952380952376,7.222222222222222,7.428571428571429
998.0,15.455000000000004,17.005952380952376,7.222222222222222,7.428571428571429
999.0,15.370000000000005,16.90476190476191,7.222222222222222,7.428571428571429
1000.0,15.370000000000005,16.90476190476191,7.222222222222222,7.428571428571429
1001.0,15.370000000000005,16.90476190476191,7.222222222222222,7.428571428571429
1002.0,15.370000000000005,16.90476190476191,7.222222222222222,7.428571428571429
1003.0,15.370000000000005,16.90476190476191,7.222222222222222,7.428571428571429
1004.0,15.370000000000005,16.90476190476191,7.222222222222222,7.428571428571429
1005.0,15.370000000000005,16.90476190476191,7.222222222222222,7.428571428571429
1006.0,15.370000000000005,16.90476190476191,7.222222222222222,7.428571428571429
1007.0,15.370000000000005,16.90476190476191,7.222222222222222,7.428571428571429
1008.0,15.370000000000005,16.90476190476191,7.222222222222222,7.428571428571429
1009.0,15.370000000000005,16.90476190476191,7.222222222222222,7.428571428571429
1010.0,15.370000000000005,16.90476190476191,7.222222222222222,7.428571428571429
1011.0,15.370000000000005,16.90476190476191,7.222222222222222,7.428571428571429
1012.0,15.370000000000005,16.90476190476191,7.222222222222222,7.428571428571429
1013.0,15.264999999999992,16.779761904761898,7.222222222222222,7.428571428571429
1014.0,15.264999999999992,16.779761904761898,7.222222222222222,7.428571428571429
1015.0,15.264999999999992,16.779761904761898,7.222222222222222,7.428571428571429
1016.0,15.264999999999992,16.779761904761898,7.222222222222222,7.428571428571429
1017.0,15.264999999999992,16.779761904761898,7.222222222222222,7.428571428571429
1018.0,15.180000000000001,16.678571428571427,7.222222222222222,7.428571428571429
1019.0,15.180000000000001,16.678571428571427,7.222222222222222,7.428571428571429
1020.0,15.180000000000001,16.678571428571427,7.222222222222222,7.428571428571429
1021.0,15.180000000000001,16.678571428571427,7.222222222222222,7.428571428571429
1022.0,15.180000000000001,16.678571428571427,7.222222222222222,7.428571428571429
1023.0,15.180000000000001,16.678571428571427,7.222222222222222,7.428571428571429
1024.0,15.180000000000001,16.678571428571427,7.222222222222222,7.428571428571429
1025.0,15.180000000000001,16.678571428571427,7.222222222222222,7.428571428571429
1026.0,15.180000000000001,16.678571428571427,7.222222222222222,7.428571428571429
1027.0,15.180000000000001,16.678571428571427,7.222222222222222,7.428571428571429
1028.0,15.180000000000001,16.678571428571427,7.222222222222222,7.428571428571429
1029.0,15.180000000000001,16.678571428571427,7.222222222222222,7.428571428571429
1030.0,15.180000000000001,16.678571428571427,7.222222222222222,7.428571428571429
1031.0,15.180000000000001,16.678571428571427,7.222222222222222,7.428571428571429
1032.0,15.180000000000001,16.678571428571427,7.222222222222222,7.428571428571429
1033.0,15.180000000000001,16.678571428571427,7.222222222222222,7.428571428571429
