"_ages_vehicles_in_simulation"
17
13
4
4
8
4
19
5
4
2
21
4
3
18
11
10
18
15
10
11
19
3
10
3
10
3
7
12
10
2
9
2
9
4
1
8
9
20
11
5
3
19
2
7
12
16
4
7
12
9
3
12
7
21
1
4
5
13
5
6
21
8
4
6
7
2
21
11
10
14
17
9
13
17
20
14
19
10
12
9
10
2
8
9
20
9
16
18
13
5
2
12
17
4
7
5
2
10
15
2
21
10
16
15
10
19
7
15
12
4
10
16
16
21
5
10
5
8
10
6
9
6
15
12
10
4
2
2
8
21
3
14
5
11
9
2
9
18
4
12
4
8
4
7
13
2
3
7
19
8
21
3
13
17
15
4
6
12
2
4
3
6
4
11
9
4
13
18
21
4
17
3
4
10
7
4
6
18
19
19
13
4
9
12
6
12
21
8
14
1
8
3
5
14
8
14
10
21
10
7
