"perc BEV","tick"
3.5000000000000004,1.0
3.5000000000000004,2.0
3.5000000000000004,3.0
3.5000000000000004,4.0
3.5000000000000004,5.0
3.5000000000000004,6.0
3.5000000000000004,7.0
3.5000000000000004,8.0
3.5000000000000004,9.0
3.5000000000000004,10.0
3.5000000000000004,11.0
3.5000000000000004,12.0
3.5000000000000004,13.0
3.5000000000000004,14.0
3.5000000000000004,15.0
3.5000000000000004,16.0
3.5000000000000004,17.0
3.5000000000000004,18.0
3.5000000000000004,19.0
3.5000000000000004,20.0
3.5000000000000004,21.0
3.5000000000000004,22.0
3.5000000000000004,23.0
3.5000000000000004,24.0
3.5000000000000004,25.0
3.5000000000000004,26.0
3.5000000000000004,27.0
3.5000000000000004,28.0
3.5000000000000004,29.0
3.5000000000000004,30.0
3.5000000000000004,31.0
3.5000000000000004,32.0
3.5000000000000004,33.0
3.5000000000000004,34.0
3.5000000000000004,35.0
3.5000000000000004,36.0
3.5000000000000004,37.0
3.5000000000000004,38.0
3.5000000000000004,39.0
3.5000000000000004,40.0
3.5000000000000004,41.0
3.5000000000000004,42.0
3.5000000000000004,43.0
3.5000000000000004,44.0
3.5000000000000004,45.0
3.5000000000000004,46.0
3.5000000000000004,47.0
3.5000000000000004,48.0
3.5000000000000004,49.0
3.5000000000000004,50.0
3.5000000000000004,51.0
3.5000000000000004,52.0
3.5000000000000004,53.0
3.5000000000000004,54.0
3.5000000000000004,55.0
3.5000000000000004,56.0
3.5000000000000004,57.0
3.5000000000000004,58.0
3.5000000000000004,59.0
3.5000000000000004,60.0
3.5000000000000004,61.0
3.5000000000000004,62.0
3.5000000000000004,63.0
3.5000000000000004,64.0
3.5000000000000004,65.0
3.5000000000000004,66.0
3.5000000000000004,67.0
3.5000000000000004,68.0
3.5000000000000004,69.0
3.5000000000000004,70.0
3.5000000000000004,71.0
3.5000000000000004,72.0
3.5000000000000004,73.0
3.5000000000000004,74.0
3.5000000000000004,75.0
3.5000000000000004,76.0
3.5000000000000004,77.0
3.5000000000000004,78.0
3.5000000000000004,79.0
3.5000000000000004,80.0
3.5000000000000004,81.0
3.5000000000000004,82.0
3.5000000000000004,83.0
3.5000000000000004,84.0
3.5000000000000004,85.0
3.5000000000000004,86.0
3.5000000000000004,87.0
3.5000000000000004,88.0
3.5000000000000004,89.0
3.5000000000000004,90.0
3.5000000000000004,91.0
3.5000000000000004,92.0
3.5000000000000004,93.0
3.5000000000000004,94.0
3.5000000000000004,95.0
3.5000000000000004,96.0
3.5000000000000004,97.0
3.5000000000000004,98.0
3.5000000000000004,99.0
3.5000000000000004,100.0
3.5000000000000004,101.0
3.5000000000000004,102.0
3.5000000000000004,103.0
3.5000000000000004,104.0
3.5000000000000004,105.0
3.5000000000000004,106.0
3.5000000000000004,107.0
3.5000000000000004,108.0
3.5000000000000004,109.0
3.5000000000000004,110.0
3.5000000000000004,111.0
3.5000000000000004,112.0
3.5000000000000004,113.0
3.5000000000000004,114.0
3.5000000000000004,115.0
3.5000000000000004,116.0
3.5000000000000004,117.0
3.5000000000000004,118.0
3.5000000000000004,119.0
3.5000000000000004,120.0
3.5000000000000004,121.0
3.5000000000000004,122.0
3.5000000000000004,123.0
3.5000000000000004,124.0
3.5000000000000004,125.0
3.5000000000000004,126.0
3.5000000000000004,127.0
3.5000000000000004,128.0
3.5000000000000004,129.0
3.5000000000000004,130.0
3.5000000000000004,131.0
3.5000000000000004,132.0
3.5000000000000004,133.0
3.5000000000000004,134.0
3.5000000000000004,135.0
3.5000000000000004,136.0
3.5000000000000004,137.0
3.5000000000000004,138.0
3.5000000000000004,139.0
3.5000000000000004,140.0
3.5000000000000004,141.0
3.5000000000000004,142.0
3.5000000000000004,143.0
3.5000000000000004,144.0
3.5000000000000004,145.0
3.5000000000000004,146.0
3.5000000000000004,147.0
3.5000000000000004,148.0
3.5000000000000004,149.0
3.5000000000000004,150.0
3.5000000000000004,151.0
3.5000000000000004,152.0
3.5000000000000004,153.0
3.5000000000000004,154.0
3.5000000000000004,155.0
3.5000000000000004,156.0
3.5000000000000004,157.0
3.5000000000000004,158.0
3.5000000000000004,159.0
3.5000000000000004,160.0
3.5000000000000004,161.0
3.5000000000000004,162.0
3.5000000000000004,163.0
3.5000000000000004,164.0
3.5000000000000004,165.0
3.5000000000000004,166.0
3.5000000000000004,167.0
3.5000000000000004,168.0
3.5000000000000004,169.0
3.5000000000000004,170.0
3.5000000000000004,171.0
3.5000000000000004,172.0
3.5000000000000004,173.0
3.5000000000000004,174.0
3.5000000000000004,175.0
3.5000000000000004,176.0
4.0,177.0
4.0,178.0
4.0,179.0
4.0,180.0
4.0,181.0
4.0,182.0
4.0,183.0
4.0,184.0
4.0,185.0
4.0,186.0
4.0,187.0
4.0,188.0
4.0,189.0
4.0,190.0
4.0,191.0
4.0,192.0
4.0,193.0
4.0,194.0
4.0,195.0
4.0,196.0
4.0,197.0
4.0,198.0
4.0,199.0
4.0,200.0
4.0,201.0
4.0,202.0
4.0,203.0
4.0,204.0
4.0,205.0
4.0,206.0
4.0,207.0
4.0,208.0
4.0,209.0
4.0,210.0
4.0,211.0
4.0,212.0
4.0,213.0
4.0,214.0
4.0,215.0
4.0,216.0
4.0,217.0
4.0,218.0
4.0,219.0
4.0,220.0
4.0,221.0
4.0,222.0
4.0,223.0
4.0,224.0
4.0,225.0
4.0,226.0
4.0,227.0
4.0,228.0
4.0,229.0
4.0,230.0
4.0,231.0
4.0,232.0
4.0,233.0
4.0,234.0
4.0,235.0
4.0,236.0
4.0,237.0
4.0,238.0
4.0,239.0
4.0,240.0
4.0,241.0
4.0,242.0
4.0,243.0
4.0,244.0
4.0,245.0
4.0,246.0
4.0,247.0
4.0,248.0
4.0,249.0
4.0,250.0
4.0,251.0
4.0,252.0
4.0,253.0
4.0,254.0
4.0,255.0
4.0,256.0
4.0,257.0
4.0,258.0
4.0,259.0
4.0,260.0
4.0,261.0
4.0,262.0
4.0,263.0
4.0,264.0
4.0,265.0
4.0,266.0
4.0,267.0
4.0,268.0
4.0,269.0
4.0,270.0
4.0,271.0
4.0,272.0
4.0,273.0
4.0,274.0
4.0,275.0
4.0,276.0
4.0,277.0
4.0,278.0
4.0,279.0
4.0,280.0
4.0,281.0
4.0,282.0
4.0,283.0
4.0,284.0
4.0,285.0
4.0,286.0
4.5,287.0
4.5,288.0
4.5,289.0
4.5,290.0
4.5,291.0
4.5,292.0
4.5,293.0
4.5,294.0
4.5,295.0
4.5,296.0
4.5,297.0
4.5,298.0
4.5,299.0
4.5,300.0
4.5,301.0
4.5,302.0
4.5,303.0
4.5,304.0
4.5,305.0
4.5,306.0
4.5,307.0
4.5,308.0
4.5,309.0
4.5,310.0
4.5,311.0
4.5,312.0
5.0,313.0
5.0,314.0
5.0,315.0
5.0,316.0
5.0,317.0
5.0,318.0
5.0,319.0
5.0,320.0
5.0,321.0
5.0,322.0
5.0,323.0
5.0,324.0
5.0,325.0
5.0,326.0
5.0,327.0
5.0,328.0
5.0,329.0
5.0,330.0
5.0,331.0
5.0,332.0
5.0,333.0
5.0,334.0
5.0,335.0
5.0,336.0
5.0,337.0
5.0,338.0
5.0,339.0
5.0,340.0
5.0,341.0
5.0,342.0
5.0,343.0
5.0,344.0
5.0,345.0
5.0,346.0
5.0,347.0
5.0,348.0
5.0,349.0
5.0,350.0
5.0,351.0
5.0,352.0
5.0,353.0
5.0,354.0
5.0,355.0
5.0,356.0
5.0,357.0
5.0,358.0
5.0,359.0
5.0,360.0
5.0,361.0
5.0,362.0
5.0,363.0
5.0,364.0
5.0,365.0
5.0,366.0
5.0,367.0
5.0,368.0
5.0,369.0
5.0,370.0
5.0,371.0
5.0,372.0
5.0,373.0
5.0,374.0
5.0,375.0
5.0,376.0
5.0,377.0
5.0,378.0
5.0,379.0
5.0,380.0
5.0,381.0
5.0,382.0
5.0,383.0
5.0,384.0
5.0,385.0
5.0,386.0
5.0,387.0
5.0,388.0
5.0,389.0
5.0,390.0
5.0,391.0
5.0,392.0
5.0,393.0
5.0,394.0
5.0,395.0
5.0,396.0
5.0,397.0
5.0,398.0
5.0,399.0
5.0,400.0
5.0,401.0
5.0,402.0
5.0,403.0
5.0,404.0
5.0,405.0
5.0,406.0
5.0,407.0
5.0,408.0
5.0,409.0
5.0,410.0
5.0,411.0
5.0,412.0
5.0,413.0
5.0,414.0
5.0,415.0
5.0,416.0
6.0,417.0
6.0,418.0
6.0,419.0
6.0,420.0
6.0,421.0
6.0,422.0
6.0,423.0
6.0,424.0
6.0,425.0
6.0,426.0
6.0,427.0
6.0,428.0
6.0,429.0
6.0,430.0
6.0,431.0
6.0,432.0
6.0,433.0
6.0,434.0
6.0,435.0
6.0,436.0
6.0,437.0
6.0,438.0
6.0,439.0
6.0,440.0
6.0,441.0
6.0,442.0
6.0,443.0
6.0,444.0
6.0,445.0
6.0,446.0
6.0,447.0
6.0,448.0
6.0,449.0
6.0,450.0
6.0,451.0
6.0,452.0
6.0,453.0
6.0,454.0
6.0,455.0
6.0,456.0
6.0,457.0
6.0,458.0
6.0,459.0
6.0,460.0
6.0,461.0
6.0,462.0
6.0,463.0
6.0,464.0
6.0,465.0
6.0,466.0
6.0,467.0
6.0,468.0
6.5,469.0
6.5,470.0
6.5,471.0
6.5,472.0
6.5,473.0
6.5,474.0
6.5,475.0
6.5,476.0
6.5,477.0
6.5,478.0
6.5,479.0
6.5,480.0
6.5,481.0
6.5,482.0
6.5,483.0
6.5,484.0
6.5,485.0
6.5,486.0
6.5,487.0
6.5,488.0
6.5,489.0
6.5,490.0
6.5,491.0
6.5,492.0
6.5,493.0
6.5,494.0
6.5,495.0
6.5,496.0
6.5,497.0
6.5,498.0
6.5,499.0
6.5,500.0
6.5,501.0
6.5,502.0
6.5,503.0
6.5,504.0
6.5,505.0
6.5,506.0
6.5,507.0
6.5,508.0
6.5,509.0
6.5,510.0
6.5,511.0
6.5,512.0
6.5,513.0
6.5,514.0
6.5,515.0
6.5,516.0
6.5,517.0
6.5,518.0
6.5,519.0
6.5,520.0
6.5,521.0
6.5,522.0
6.5,523.0
6.5,524.0
6.5,525.0
6.5,526.0
6.5,527.0
6.5,528.0
6.5,529.0
6.5,530.0
6.5,531.0
6.5,532.0
6.5,533.0
6.5,534.0
6.5,535.0
6.5,536.0
6.5,537.0
6.5,538.0
6.5,539.0
6.5,540.0
6.5,541.0
6.5,542.0
6.5,543.0
6.5,544.0
6.5,545.0
6.5,546.0
6.5,547.0
6.5,548.0
7.000000000000001,549.0
7.000000000000001,550.0
7.000000000000001,551.0
7.000000000000001,552.0
7.000000000000001,553.0
7.000000000000001,554.0
7.000000000000001,555.0
7.000000000000001,556.0
7.000000000000001,557.0
7.000000000000001,558.0
7.000000000000001,559.0
7.000000000000001,560.0
7.000000000000001,561.0
7.000000000000001,562.0
7.000000000000001,563.0
7.000000000000001,564.0
7.000000000000001,565.0
7.000000000000001,566.0
7.000000000000001,567.0
7.000000000000001,568.0
7.000000000000001,569.0
7.000000000000001,570.0
7.000000000000001,571.0
7.000000000000001,572.0
7.000000000000001,573.0
7.000000000000001,574.0
7.000000000000001,575.0
7.000000000000001,576.0
7.000000000000001,577.0
7.000000000000001,578.0
7.000000000000001,579.0
7.000000000000001,580.0
7.000000000000001,581.0
7.000000000000001,582.0
7.000000000000001,583.0
7.000000000000001,584.0
7.000000000000001,585.0
7.000000000000001,586.0
7.000000000000001,587.0
7.000000000000001,588.0
7.000000000000001,589.0
7.000000000000001,590.0
7.000000000000001,591.0
7.000000000000001,592.0
7.000000000000001,593.0
7.000000000000001,594.0
7.000000000000001,595.0
7.000000000000001,596.0
7.000000000000001,597.0
7.000000000000001,598.0
7.000000000000001,599.0
7.000000000000001,600.0
7.000000000000001,601.0
7.000000000000001,602.0
7.000000000000001,603.0
7.000000000000001,604.0
7.000000000000001,605.0
7.000000000000001,606.0
7.000000000000001,607.0
7.000000000000001,608.0
7.000000000000001,609.0
7.000000000000001,610.0
7.000000000000001,611.0
7.000000000000001,612.0
7.000000000000001,613.0
7.000000000000001,614.0
7.000000000000001,615.0
7.000000000000001,616.0
7.000000000000001,617.0
7.000000000000001,618.0
7.000000000000001,619.0
7.000000000000001,620.0
7.000000000000001,621.0
7.000000000000001,622.0
7.000000000000001,623.0
7.000000000000001,624.0
7.000000000000001,625.0
7.000000000000001,626.0
7.000000000000001,627.0
7.000000000000001,628.0
7.000000000000001,629.0
7.000000000000001,630.0
7.000000000000001,631.0
7.000000000000001,632.0
7.000000000000001,633.0
7.000000000000001,634.0
7.000000000000001,635.0
7.000000000000001,636.0
7.000000000000001,637.0
7.000000000000001,638.0
7.000000000000001,639.0
7.000000000000001,640.0
7.000000000000001,641.0
7.000000000000001,642.0
7.000000000000001,643.0
7.000000000000001,644.0
7.000000000000001,645.0
7.000000000000001,646.0
7.000000000000001,647.0
7.000000000000001,648.0
7.000000000000001,649.0
7.000000000000001,650.0
7.000000000000001,651.0
7.000000000000001,652.0
7.000000000000001,653.0
7.000000000000001,654.0
7.000000000000001,655.0
7.000000000000001,656.0
7.000000000000001,657.0
7.000000000000001,658.0
7.000000000000001,659.0
7.000000000000001,660.0
7.000000000000001,661.0
7.000000000000001,662.0
7.000000000000001,663.0
7.000000000000001,664.0
7.000000000000001,665.0
7.000000000000001,666.0
7.000000000000001,667.0
7.000000000000001,668.0
7.000000000000001,669.0
7.000000000000001,670.0
7.000000000000001,671.0
7.000000000000001,672.0
7.000000000000001,673.0
7.000000000000001,674.0
7.000000000000001,675.0
7.000000000000001,676.0
7.000000000000001,677.0
7.000000000000001,678.0
7.000000000000001,679.0
7.000000000000001,680.0
7.000000000000001,681.0
7.000000000000001,682.0
7.000000000000001,683.0
7.000000000000001,684.0
7.000000000000001,685.0
7.000000000000001,686.0
7.000000000000001,687.0
7.000000000000001,688.0
7.000000000000001,689.0
7.000000000000001,690.0
7.000000000000001,691.0
7.000000000000001,692.0
7.000000000000001,693.0
7.000000000000001,694.0
7.000000000000001,695.0
7.000000000000001,696.0
7.5,697.0
7.5,698.0
7.5,699.0
7.5,700.0
7.5,701.0
7.5,702.0
7.5,703.0
7.5,704.0
7.5,705.0
7.5,706.0
7.5,707.0
7.5,708.0
7.5,709.0
7.5,710.0
7.5,711.0
7.5,712.0
7.5,713.0
7.5,714.0
7.5,715.0
7.5,716.0
8.0,717.0
8.0,718.0
8.0,719.0
8.0,720.0
8.0,721.0
8.0,722.0
8.0,723.0
8.0,724.0
8.0,725.0
8.0,726.0
8.5,727.0
8.5,728.0
8.5,729.0
8.5,730.0
8.5,731.0
8.5,732.0
8.5,733.0
8.5,734.0
8.5,735.0
8.5,736.0
8.5,737.0
8.5,738.0
8.5,739.0
8.5,740.0
8.5,741.0
8.5,742.0
8.5,743.0
8.5,744.0
8.5,745.0
8.5,746.0
8.5,747.0
8.5,748.0
8.5,749.0
8.5,750.0
8.5,751.0
8.5,752.0
8.5,753.0
8.5,754.0
8.5,755.0
8.5,756.0
8.5,757.0
8.5,758.0
8.5,759.0
8.5,760.0
8.5,761.0
8.5,762.0
8.5,763.0
8.5,764.0
8.5,765.0
9.0,766.0
9.0,767.0
9.0,768.0
9.0,769.0
9.0,770.0
9.0,771.0
9.0,772.0
9.0,773.0
9.0,774.0
9.0,775.0
9.0,776.0
9.0,777.0
9.0,778.0
9.0,779.0
9.0,780.0
9.0,781.0
9.0,782.0
9.0,783.0
9.0,784.0
9.0,785.0
9.0,786.0
9.0,787.0
9.0,788.0
9.0,789.0
9.0,790.0
9.0,791.0
9.0,792.0
9.0,793.0
9.0,794.0
9.0,795.0
9.0,796.0
9.0,797.0
9.0,798.0
9.0,799.0
9.0,800.0
9.0,801.0
9.0,802.0
9.0,803.0
9.0,804.0
9.0,805.0
9.0,806.0
9.0,807.0
9.0,808.0
9.0,809.0
9.0,810.0
9.0,811.0
9.0,812.0
9.0,813.0
9.0,814.0
9.0,815.0
9.0,816.0
9.0,817.0
9.0,818.0
9.0,819.0
9.0,820.0
9.0,821.0
9.0,822.0
9.0,823.0
9.0,824.0
9.0,825.0
9.0,826.0
9.0,827.0
9.0,828.0
9.0,829.0
9.0,830.0
9.0,831.0
9.0,832.0
9.0,833.0
9.0,834.0
9.0,835.0
9.0,836.0
9.0,837.0
9.0,838.0
9.0,839.0
9.0,840.0
9.0,841.0
9.0,842.0
9.0,843.0
9.0,844.0
9.0,845.0
9.0,846.0
9.0,847.0
9.0,848.0
9.0,849.0
9.0,850.0
9.0,851.0
9.0,852.0
9.0,853.0
9.0,854.0
9.0,855.0
9.0,856.0
9.0,857.0
9.0,858.0
9.0,859.0
9.0,860.0
9.0,861.0
9.0,862.0
9.0,863.0
9.0,864.0
9.0,865.0
9.0,866.0
9.0,867.0
9.0,868.0
9.0,869.0
9.0,870.0
9.0,871.0
9.0,872.0
9.0,873.0
9.0,874.0
9.5,875.0
9.5,876.0
9.5,877.0
9.5,878.0
9.5,879.0
9.5,880.0
9.5,881.0
9.5,882.0
10.0,883.0
10.0,884.0
10.0,885.0
10.0,886.0
10.0,887.0
10.0,888.0
10.0,889.0
10.0,890.0
10.0,891.0
10.0,892.0
10.0,893.0
10.0,894.0
10.0,895.0
10.0,896.0
10.0,897.0
10.5,898.0
10.5,899.0
10.5,900.0
10.5,901.0
10.5,902.0
10.5,903.0
10.5,904.0
10.5,905.0
10.5,906.0
10.5,907.0
10.5,908.0
10.5,909.0
10.5,910.0
10.5,911.0
10.5,912.0
10.5,913.0
10.5,914.0
10.5,915.0
10.5,916.0
11.0,917.0
11.0,918.0
11.0,919.0
11.0,920.0
11.0,921.0
11.0,922.0
11.0,923.0
11.0,924.0
11.0,925.0
11.0,926.0
11.0,927.0
11.0,928.0
11.0,929.0
11.0,930.0
11.0,931.0
11.0,932.0
11.0,933.0
11.0,934.0
11.0,935.0
11.0,936.0
11.0,937.0
11.0,938.0
11.0,939.0
11.0,940.0
11.0,941.0
11.0,942.0
11.0,943.0
11.0,944.0
11.0,945.0
11.0,946.0
11.0,947.0
11.0,948.0
11.0,949.0
11.0,950.0
11.0,951.0
11.0,952.0
11.0,953.0
11.0,954.0
11.0,955.0
11.0,956.0
11.0,957.0
11.0,958.0
11.5,959.0
11.5,960.0
11.5,961.0
11.5,962.0
11.5,963.0
11.5,964.0
11.5,965.0
11.5,966.0
11.5,967.0
11.5,968.0
11.5,969.0
11.5,970.0
11.5,971.0
11.5,972.0
11.5,973.0
11.5,974.0
11.5,975.0
11.5,976.0
11.5,977.0
11.5,978.0
11.5,979.0
11.5,980.0
11.5,981.0
11.5,982.0
11.5,983.0
11.5,984.0
11.5,985.0
11.5,986.0
11.5,987.0
11.5,988.0
11.5,989.0
11.5,990.0
12.0,991.0
12.0,992.0
12.0,993.0
12.0,994.0
12.0,995.0
12.0,996.0
12.0,997.0
12.0,998.0
12.0,999.0
12.0,1000.0
12.0,1001.0
12.0,1002.0
12.0,1003.0
12.0,1004.0
12.0,1005.0
12.0,1006.0
12.0,1007.0
12.0,1008.0
12.0,1009.0
12.0,1010.0
12.0,1011.0
12.0,1012.0
12.0,1013.0
12.0,1014.0
12.0,1015.0
12.0,1016.0
12.0,1017.0
12.0,1018.0
12.0,1019.0
12.0,1020.0
12.0,1021.0
12.0,1022.0
12.0,1023.0
12.0,1024.0
12.0,1025.0
12.0,1026.0
12.0,1027.0
12.0,1028.0
12.0,1029.0
12.0,1030.0
12.0,1031.0
12.0,1032.0
12.0,1033.0
12.0,1034.0
12.0,1035.0
12.0,1036.0
12.0,1037.0
12.0,1038.0
12.0,1039.0
12.0,1040.0
12.0,1041.0
12.0,1042.0
12.0,1043.0
12.0,1044.0
12.0,1045.0
12.0,1046.0
12.0,1047.0
12.0,1048.0
12.0,1049.0
12.0,1050.0
12.0,1051.0
12.0,1052.0
12.0,1053.0
12.0,1054.0
12.0,1055.0
12.0,1056.0
12.0,1057.0
12.0,1058.0
12.0,1059.0
12.0,1060.0
12.0,1061.0
12.0,1062.0
12.0,1063.0
12.0,1064.0
12.0,1065.0
12.0,1066.0
12.0,1067.0
12.0,1068.0
12.0,1069.0
12.0,1070.0
12.0,1071.0
12.0,1072.0
12.0,1073.0
12.0,1074.0
12.0,1075.0
12.0,1076.0
12.0,1077.0
12.0,1078.0
12.0,1079.0
12.0,1080.0
12.0,1081.0
12.0,1082.0
12.0,1083.0
12.0,1084.0
12.0,1085.0
12.0,1086.0
12.0,1087.0
12.0,1088.0
12.0,1089.0
12.0,1090.0
12.0,1091.0
12.0,1092.0
