"tick","Agents","Occasion","Private new","Lease"
1.0,9.700000000000003,10.57142857142857,5.666666666666666,3.5
2.0,9.700000000000003,10.57142857142857,5.666666666666666,3.5
3.0,9.700000000000003,10.57142857142857,5.666666666666666,3.5
4.0,9.700000000000003,10.57142857142857,5.666666666666666,3.5
5.0,9.700000000000003,10.57142857142857,5.666666666666666,3.5
6.0,9.700000000000003,10.57142857142857,5.666666666666666,3.5
7.0,9.700000000000003,10.57142857142857,5.666666666666666,3.5
8.0,9.700000000000003,10.57142857142857,5.666666666666666,3.5
9.0,9.700000000000003,10.57142857142857,5.666666666666666,3.5
10.0,9.700000000000003,10.57142857142857,5.666666666666666,3.5
11.0,9.700000000000003,10.57142857142857,5.666666666666666,3.5
12.0,9.700000000000003,10.57142857142857,5.666666666666666,3.5
13.0,9.700000000000003,10.57142857142857,5.666666666666666,3.5
14.0,9.700000000000003,10.57142857142857,5.666666666666666,3.5
15.0,9.700000000000003,10.57142857142857,5.666666666666666,3.5
16.0,9.700000000000003,10.57142857142857,5.666666666666666,3.5
17.0,9.700000000000003,10.57142857142857,5.666666666666666,3.5
18.0,9.700000000000003,10.57142857142857,5.666666666666666,3.5
19.0,9.700000000000003,10.57142857142857,5.666666666666666,3.5
20.0,9.700000000000003,10.57142857142857,5.666666666666666,3.5
21.0,9.700000000000003,10.57142857142857,5.666666666666666,3.5
22.0,9.700000000000003,10.57142857142857,5.666666666666666,3.5
23.0,9.700000000000003,10.57142857142857,5.666666666666666,3.5
24.0,9.700000000000003,10.57142857142857,5.666666666666666,3.5
25.0,9.700000000000003,10.57142857142857,5.666666666666666,3.5
26.0,9.700000000000003,10.57142857142857,5.666666666666666,3.5
27.0,9.700000000000003,10.57142857142857,5.666666666666666,3.5
28.0,9.700000000000003,10.57142857142857,5.666666666666666,3.5
29.0,9.700000000000003,10.57142857142857,5.666666666666666,3.5
30.0,9.700000000000003,10.57142857142857,5.666666666666666,3.5
31.0,9.700000000000003,10.57142857142857,5.666666666666666,3.5
32.0,9.700000000000003,10.57142857142857,5.666666666666666,3.5
33.0,9.700000000000003,10.57142857142857,5.666666666666666,3.5
34.0,9.700000000000003,10.57142857142857,5.666666666666666,3.5
35.0,9.700000000000003,10.57142857142857,5.666666666666666,3.5
36.0,9.700000000000003,10.57142857142857,5.666666666666666,3.5
37.0,9.700000000000003,10.57142857142857,5.666666666666666,3.5
38.0,9.700000000000003,10.57142857142857,5.666666666666666,3.5
39.0,9.700000000000003,10.57142857142857,5.666666666666666,3.5
40.0,9.700000000000003,10.57142857142857,5.666666666666666,3.5
41.0,9.700000000000003,10.57142857142857,5.666666666666666,3.5
42.0,9.700000000000003,10.57142857142857,5.666666666666666,3.5
43.0,9.700000000000003,10.57142857142857,5.666666666666666,3.5
44.0,9.700000000000003,10.57142857142857,5.666666666666666,3.5
45.0,9.700000000000003,10.57142857142857,5.666666666666666,3.5
46.0,9.700000000000003,10.57142857142857,5.666666666666666,3.5
47.0,9.700000000000003,10.57142857142857,5.666666666666666,3.5
48.0,9.700000000000003,10.57142857142857,5.666666666666666,3.5
49.0,9.700000000000003,10.57142857142857,5.666666666666666,3.5
50.0,9.700000000000003,10.57142857142857,5.666666666666666,3.5
51.0,9.700000000000003,10.57142857142857,5.666666666666666,3.5
52.0,9.700000000000003,10.57142857142857,5.666666666666666,3.5
53.0,10.700000000000003,11.57142857142857,6.666666666666666,4.5
54.0,10.700000000000003,11.57142857142857,6.666666666666666,4.5
55.0,10.700000000000003,11.57142857142857,6.666666666666666,4.5
56.0,10.700000000000003,11.57142857142857,6.666666666666666,4.5
57.0,10.700000000000003,11.57142857142857,6.666666666666666,4.5
58.0,10.624999999999995,11.482142857142861,6.666666666666666,4.5
59.0,10.624999999999995,11.482142857142861,6.666666666666666,4.5
60.0,10.624999999999995,11.482142857142861,6.666666666666666,4.5
61.0,10.624999999999995,11.482142857142861,6.666666666666666,4.5
62.0,10.56500000000001,11.41071428571429,6.666666666666666,4.5
63.0,10.56500000000001,11.41071428571429,6.666666666666666,4.5
64.0,10.56500000000001,11.41071428571429,6.666666666666666,4.5
65.0,10.56500000000001,11.41071428571429,6.666666666666666,4.5
66.0,10.56500000000001,11.41071428571429,6.666666666666666,4.5
67.0,10.56500000000001,11.41071428571429,6.666666666666666,4.5
68.0,10.56500000000001,11.41071428571429,6.666666666666666,4.5
69.0,10.56500000000001,11.41071428571429,6.666666666666666,4.5
70.0,10.56500000000001,11.41071428571429,6.666666666666666,4.5
71.0,10.56500000000001,11.41071428571429,6.666666666666666,4.5
72.0,10.56500000000001,11.41071428571429,6.666666666666666,4.5
73.0,10.56500000000001,11.41071428571429,6.666666666666666,4.5
74.0,10.56500000000001,11.41071428571429,6.666666666666666,4.5
75.0,10.515,11.351190476190476,6.666666666666666,4.5
76.0,10.515,11.351190476190476,6.666666666666666,4.5
77.0,10.515,11.351190476190476,6.666666666666666,4.5
78.0,10.515,11.351190476190476,6.666666666666666,4.5
79.0,10.515,11.351190476190476,6.666666666666666,4.5
80.0,10.515,11.351190476190476,6.666666666666666,4.5
81.0,10.515,11.351190476190476,6.666666666666666,4.5
82.0,10.515,11.351190476190476,6.666666666666666,4.5
83.0,10.515,11.351190476190476,6.666666666666666,4.5
84.0,10.515,11.351190476190476,6.666666666666666,4.5
85.0,10.515,11.351190476190476,6.666666666666666,4.5
86.0,10.515,11.351190476190476,6.666666666666666,4.5
87.0,10.515,11.351190476190476,6.666666666666666,4.5
88.0,10.515,11.351190476190476,6.666666666666666,4.5
89.0,10.515,11.351190476190476,6.666666666666666,4.5
90.0,10.515,11.351190476190476,6.666666666666666,4.5
91.0,10.515,11.351190476190476,6.666666666666666,4.5
92.0,10.515,11.351190476190476,6.666666666666666,4.5
93.0,10.515,11.351190476190476,6.666666666666666,4.5
94.0,10.515,11.351190476190476,6.666666666666666,4.5
95.0,10.515,11.351190476190476,6.666666666666666,4.5
96.0,10.515,11.351190476190476,6.666666666666666,4.5
97.0,10.515,11.351190476190476,6.666666666666666,4.5
98.0,10.515,11.351190476190476,6.666666666666666,4.5
99.0,10.515,11.351190476190476,6.666666666666666,4.5
100.0,10.515,11.351190476190476,6.666666666666666,4.5
101.0,10.515,11.351190476190476,6.666666666666666,4.5
102.0,10.515,11.351190476190476,6.666666666666666,4.5
103.0,10.515,11.351190476190476,6.666666666666666,4.5
104.0,10.515,11.351190476190476,6.666666666666666,4.5
105.0,11.515,12.351190476190476,7.666666666666668,5.5
106.0,11.515,12.351190476190476,7.666666666666668,5.5
107.0,11.515,12.351190476190476,7.666666666666668,5.5
108.0,11.515,12.351190476190476,7.666666666666668,5.5
109.0,11.515,12.351190476190476,7.666666666666668,5.5
110.0,11.515,12.351190476190476,7.666666666666668,5.5
111.0,11.515,12.351190476190476,7.666666666666668,5.5
112.0,11.515,12.351190476190476,7.666666666666668,5.5
113.0,11.515,12.351190476190476,7.666666666666668,5.5
114.0,11.515,12.351190476190476,7.666666666666668,5.5
115.0,11.515,12.351190476190476,7.666666666666668,5.5
116.0,11.515,12.351190476190476,7.666666666666668,5.5
117.0,11.515,12.351190476190476,7.666666666666668,5.5
118.0,11.515,12.351190476190476,7.666666666666668,5.5
119.0,11.515,12.351190476190476,7.666666666666668,5.5
120.0,11.515,12.351190476190476,7.666666666666668,5.5
121.0,11.515,12.351190476190476,7.666666666666668,5.5
122.0,11.515,12.351190476190476,7.666666666666668,5.5
123.0,11.515,12.351190476190476,7.666666666666668,5.5
124.0,11.515,12.351190476190476,7.666666666666668,5.5
125.0,11.515,12.351190476190476,7.666666666666668,5.5
126.0,11.515,12.351190476190476,7.666666666666668,5.5
127.0,11.515,12.351190476190476,7.666666666666668,5.5
128.0,11.515,12.351190476190476,7.666666666666668,5.5
129.0,11.515,12.351190476190476,7.666666666666668,5.5
130.0,11.515,12.351190476190476,7.666666666666668,5.5
131.0,11.515,12.351190476190476,7.666666666666668,5.5
132.0,11.515,12.351190476190476,7.666666666666668,5.5
133.0,11.430000000000001,12.250000000000002,7.666666666666668,5.5
134.0,11.430000000000001,12.250000000000002,7.666666666666668,5.5
135.0,11.430000000000001,12.250000000000002,7.666666666666668,5.5
136.0,11.430000000000001,12.250000000000002,7.666666666666668,5.5
137.0,11.430000000000001,12.250000000000002,7.666666666666668,5.5
138.0,11.430000000000001,12.250000000000002,7.666666666666668,5.5
139.0,11.430000000000001,12.250000000000002,7.666666666666668,5.5
140.0,11.430000000000001,12.250000000000002,7.666666666666668,5.5
141.0,11.430000000000001,12.250000000000002,7.666666666666668,5.5
142.0,11.430000000000001,12.250000000000002,7.666666666666668,5.5
143.0,11.430000000000001,12.250000000000002,7.666666666666668,5.5
144.0,11.430000000000001,12.250000000000002,7.666666666666668,5.5
145.0,11.430000000000001,12.250000000000002,7.666666666666668,5.5
146.0,11.430000000000001,12.250000000000002,7.666666666666668,5.5
147.0,11.430000000000001,12.250000000000002,7.666666666666668,5.5
148.0,11.430000000000001,12.250000000000002,7.666666666666668,5.5
149.0,11.430000000000001,12.250000000000002,7.666666666666668,5.5
150.0,11.430000000000001,12.250000000000002,7.666666666666668,5.5
151.0,11.430000000000001,12.250000000000002,7.666666666666668,5.5
152.0,11.430000000000001,12.250000000000002,7.666666666666668,5.5
153.0,11.430000000000001,12.250000000000002,7.666666666666668,5.5
154.0,11.430000000000001,12.250000000000002,7.666666666666668,5.5
155.0,11.430000000000001,12.250000000000002,7.666666666666668,5.5
156.0,11.430000000000001,12.250000000000002,7.666666666666668,5.5
157.0,12.430000000000001,13.250000000000002,8.666666666666668,6.5
158.0,12.430000000000001,13.250000000000002,8.666666666666668,6.5
159.0,12.430000000000001,13.250000000000002,8.666666666666668,6.5
160.0,12.430000000000001,13.250000000000002,8.666666666666668,6.5
161.0,12.430000000000001,13.250000000000002,8.666666666666668,6.5
162.0,12.430000000000001,13.250000000000002,8.666666666666668,6.5
163.0,12.430000000000001,13.250000000000002,8.666666666666668,6.5
164.0,12.430000000000001,13.250000000000002,8.666666666666668,6.5
165.0,12.430000000000001,13.250000000000002,8.666666666666668,6.5
166.0,12.430000000000001,13.250000000000002,8.666666666666668,6.5
167.0,12.430000000000001,13.250000000000002,8.666666666666668,6.5
168.0,12.430000000000001,13.250000000000002,8.666666666666668,6.5
169.0,12.430000000000001,13.250000000000002,8.666666666666668,6.5
170.0,12.430000000000001,13.250000000000002,8.666666666666668,6.5
171.0,12.430000000000001,13.250000000000002,8.666666666666668,6.5
172.0,12.430000000000001,13.250000000000002,8.666666666666668,6.5
173.0,12.365000000000004,13.172619047619046,8.666666666666668,6.5
174.0,12.365000000000004,13.172619047619046,8.666666666666668,6.5
175.0,12.365000000000004,13.172619047619046,8.666666666666668,6.5
176.0,12.365000000000004,13.172619047619046,8.666666666666668,6.5
177.0,12.315,13.113095238095239,8.666666666666668,6.5
178.0,12.300000000000002,13.095238095238095,8.666666666666668,6.5
179.0,12.300000000000002,13.095238095238095,8.666666666666668,6.5
180.0,12.300000000000002,13.095238095238095,8.666666666666668,6.5
181.0,12.300000000000002,13.095238095238095,8.666666666666668,6.5
182.0,12.300000000000002,13.095238095238095,8.666666666666668,6.5
183.0,12.300000000000002,13.095238095238095,8.666666666666668,6.5
184.0,12.300000000000002,13.095238095238095,8.666666666666668,6.5
185.0,12.300000000000002,13.095238095238095,8.666666666666668,6.5
186.0,12.300000000000002,13.095238095238095,8.666666666666668,6.5
187.0,12.300000000000002,13.095238095238095,8.666666666666668,6.5
188.0,12.300000000000002,13.095238095238095,8.666666666666668,6.5
189.0,12.300000000000002,13.095238095238095,8.666666666666668,6.5
190.0,12.250000000000004,13.035714285714288,8.666666666666668,6.5
191.0,12.250000000000004,13.035714285714288,8.666666666666668,6.5
192.0,12.250000000000004,13.035714285714288,8.666666666666668,6.5
193.0,12.250000000000004,13.035714285714288,8.666666666666668,6.5
194.0,12.250000000000004,13.035714285714288,8.666666666666668,6.5
195.0,12.250000000000004,13.035714285714288,8.666666666666668,6.5
196.0,12.250000000000004,13.035714285714288,8.666666666666668,6.5
197.0,12.250000000000004,13.035714285714288,8.666666666666668,6.5
198.0,12.250000000000004,13.035714285714288,8.666666666666668,6.5
199.0,12.250000000000004,13.035714285714288,8.666666666666668,6.5
200.0,12.250000000000004,13.035714285714288,8.666666666666668,6.5
201.0,12.250000000000004,13.035714285714288,8.666666666666668,6.5
202.0,12.250000000000004,13.035714285714288,8.666666666666668,6.5
203.0,12.250000000000004,13.035714285714288,8.666666666666668,6.5
204.0,12.240000000000004,13.023809523809522,8.666666666666668,6.5
205.0,12.240000000000004,13.023809523809522,8.666666666666668,6.5
206.0,12.240000000000004,13.023809523809522,8.666666666666668,6.5
207.0,12.17,12.940476190476192,8.666666666666668,6.5
208.0,12.17,12.940476190476192,8.666666666666668,6.5
209.0,13.17,13.940476190476192,9.666666666666668,7.5
210.0,13.17,13.940476190476192,9.666666666666668,7.5
211.0,13.17,13.940476190476192,9.666666666666668,7.5
212.0,13.07,13.821428571428571,9.666666666666668,7.5
213.0,13.07,13.821428571428571,9.666666666666668,7.5
214.0,12.984999999999996,13.720238095238098,9.666666666666668,7.5
215.0,12.984999999999996,13.720238095238098,9.666666666666668,7.5
216.0,12.984999999999996,13.720238095238098,9.666666666666668,7.5
217.0,12.984999999999996,13.720238095238098,9.666666666666668,7.5
218.0,12.984999999999996,13.720238095238098,9.666666666666668,7.5
219.0,12.984999999999996,13.720238095238098,9.666666666666668,7.5
220.0,12.984999999999996,13.720238095238098,9.666666666666668,7.5
221.0,12.984999999999996,13.720238095238098,9.666666666666668,7.5
222.0,12.89999999999999,13.720238095238098,9.347826086956522,6.666666666666667
223.0,12.89999999999999,13.720238095238098,9.347826086956522,6.666666666666667
224.0,12.89999999999999,13.720238095238098,9.347826086956522,6.666666666666667
225.0,12.889999999999992,13.708333333333334,9.347826086956522,6.666666666666667
226.0,12.889999999999992,13.708333333333334,9.347826086956522,6.666666666666667
227.0,12.889999999999992,13.708333333333334,9.347826086956522,6.666666666666667
228.0,12.889999999999992,13.708333333333334,9.347826086956522,6.666666666666667
229.0,12.889999999999992,13.708333333333334,9.347826086956522,6.666666666666667
230.0,12.889999999999992,13.708333333333334,9.347826086956522,6.666666666666667
231.0,12.889999999999992,13.708333333333334,9.347826086956522,6.666666666666667
232.0,12.889999999999992,13.708333333333334,9.347826086956522,6.666666666666667
233.0,12.889999999999992,13.708333333333334,9.347826086956522,6.666666666666667
234.0,12.889999999999992,13.708333333333334,9.347826086956522,6.666666666666667
235.0,12.834999999999994,13.642857142857144,9.347826086956522,6.666666666666667
236.0,12.834999999999994,13.642857142857144,9.347826086956522,6.666666666666667
237.0,12.834999999999994,13.642857142857144,9.347826086956522,6.666666666666667
238.0,12.834999999999994,13.642857142857144,9.347826086956522,6.666666666666667
239.0,12.834999999999994,13.642857142857144,9.347826086956522,6.666666666666667
240.0,12.834999999999994,13.642857142857144,9.347826086956522,6.666666666666667
241.0,12.834999999999994,13.642857142857144,9.347826086956522,6.666666666666667
242.0,12.834999999999994,13.642857142857144,9.347826086956522,6.666666666666667
243.0,12.764999999999992,13.559523809523812,9.347826086956522,6.666666666666667
244.0,12.764999999999992,13.559523809523812,9.347826086956522,6.666666666666667
245.0,12.764999999999992,13.559523809523812,9.347826086956522,6.666666666666667
246.0,12.764999999999992,13.559523809523812,9.347826086956522,6.666666666666667
247.0,12.724999999999998,13.511904761904765,9.347826086956522,6.666666666666667
248.0,12.724999999999998,13.511904761904765,9.347826086956522,6.666666666666667
249.0,12.724999999999998,13.511904761904765,9.347826086956522,6.666666666666667
250.0,12.724999999999998,13.511904761904765,9.347826086956522,6.666666666666667
251.0,12.724999999999998,13.511904761904765,9.347826086956522,6.666666666666667
252.0,12.724999999999998,13.511904761904765,9.347826086956522,6.666666666666667
253.0,12.724999999999998,13.511904761904765,9.347826086956522,6.666666666666667
254.0,12.674999999999997,13.45238095238095,9.347826086956522,6.666666666666667
255.0,12.674999999999997,13.45238095238095,9.347826086956522,6.666666666666667
256.0,12.674999999999997,13.45238095238095,9.347826086956522,6.666666666666667
257.0,12.674999999999997,13.45238095238095,9.347826086956522,6.666666666666667
258.0,12.674999999999997,13.45238095238095,9.347826086956522,6.666666666666667
259.0,12.674999999999997,13.45238095238095,9.347826086956522,6.666666666666667
260.0,12.674999999999997,13.45238095238095,9.347826086956522,6.666666666666667
261.0,13.480000000000006,14.220238095238093,10.347826086956522,7.666666666666667
262.0,13.480000000000006,14.220238095238093,10.347826086956522,7.666666666666667
263.0,13.480000000000006,14.220238095238093,10.347826086956522,7.666666666666667
264.0,13.480000000000006,14.220238095238093,10.347826086956522,7.666666666666667
265.0,13.480000000000006,14.220238095238093,10.347826086956522,7.666666666666667
266.0,13.480000000000006,14.220238095238093,10.347826086956522,7.666666666666667
267.0,13.465000000000003,14.202380952380956,10.347826086956522,7.666666666666667
268.0,13.465000000000003,14.202380952380956,10.347826086956522,7.666666666666667
269.0,13.345000000000004,14.059523809523807,10.347826086956522,7.666666666666667
270.0,13.345000000000004,14.059523809523807,10.347826086956522,7.666666666666667
271.0,13.345000000000004,14.059523809523807,10.347826086956522,7.666666666666667
272.0,13.345000000000004,14.059523809523807,10.347826086956522,7.666666666666667
273.0,13.320000000000004,14.029761904761912,10.347826086956522,7.666666666666667
274.0,13.320000000000004,14.029761904761912,10.347826086956522,7.666666666666667
275.0,13.320000000000004,14.029761904761912,10.347826086956522,7.666666666666667
276.0,13.320000000000004,14.029761904761912,10.347826086956522,7.666666666666667
277.0,13.320000000000004,14.029761904761912,10.347826086956522,7.666666666666667
278.0,13.250000000000005,13.946428571428582,10.347826086956522,7.666666666666667
279.0,13.250000000000005,13.946428571428582,10.347826086956522,7.666666666666667
280.0,13.250000000000005,13.946428571428582,10.347826086956522,7.666666666666667
281.0,13.250000000000005,13.946428571428582,10.347826086956522,7.666666666666667
282.0,13.160000000000002,13.892857142857148,9.956521739130437,7.666666666666667
283.0,13.160000000000002,13.892857142857148,9.956521739130437,7.666666666666667
284.0,13.160000000000002,13.892857142857148,9.956521739130437,7.666666666666667
285.0,13.160000000000002,13.892857142857148,9.956521739130437,7.666666666666667
286.0,13.160000000000002,13.892857142857148,9.956521739130437,7.666666666666667
287.0,13.150000000000006,13.880952380952376,9.956521739130437,7.666666666666667
288.0,13.150000000000006,13.880952380952376,9.956521739130437,7.666666666666667
289.0,13.150000000000006,13.880952380952376,9.956521739130437,7.666666666666667
290.0,13.070000000000002,13.785714285714288,9.956521739130437,7.666666666666667
291.0,13.070000000000002,13.785714285714288,9.956521739130437,7.666666666666667
292.0,13.070000000000002,13.785714285714288,9.956521739130437,7.666666666666667
293.0,13.070000000000002,13.785714285714288,9.956521739130437,7.666666666666667
294.0,13.070000000000002,13.785714285714288,9.956521739130437,7.666666666666667
295.0,13.070000000000002,13.785714285714288,9.956521739130437,7.666666666666667
296.0,13.070000000000002,13.785714285714288,9.956521739130437,7.666666666666667
297.0,13.070000000000002,13.785714285714288,9.956521739130437,7.666666666666667
298.0,13.070000000000002,13.785714285714288,9.956521739130437,7.666666666666667
299.0,13.070000000000002,13.785714285714288,9.956521739130437,7.666666666666667
300.0,13.070000000000002,13.785714285714288,9.956521739130437,7.666666666666667
301.0,13.070000000000002,13.785714285714288,9.956521739130437,7.666666666666667
302.0,13.020000000000007,13.726190476190476,9.956521739130437,7.666666666666667
303.0,13.020000000000007,13.726190476190476,9.956521739130437,7.666666666666667
304.0,12.899999999999997,13.636904761904763,10.000000000000002,6.9
305.0,12.899999999999997,13.636904761904763,10.000000000000002,6.9
306.0,12.899999999999997,13.636904761904763,10.000000000000002,6.9
307.0,12.899999999999997,13.636904761904763,10.000000000000002,6.9
308.0,12.875000000000004,13.607142857142854,10.000000000000002,6.9
309.0,12.875000000000004,13.607142857142854,10.000000000000002,6.9
310.0,12.875000000000004,13.607142857142854,10.000000000000002,6.9
311.0,12.875000000000004,13.607142857142854,10.000000000000002,6.9
312.0,12.875000000000004,13.607142857142854,10.000000000000002,6.9
313.0,13.719999999999997,14.422619047619051,11.000000000000002,7.899999999999999
314.0,13.719999999999997,14.422619047619051,11.000000000000002,7.899999999999999
315.0,13.719999999999997,14.422619047619051,11.000000000000002,7.899999999999999
316.0,13.719999999999997,14.422619047619051,11.000000000000002,7.899999999999999
317.0,13.719999999999997,14.422619047619051,11.000000000000002,7.899999999999999
318.0,13.719999999999997,14.422619047619051,11.000000000000002,7.899999999999999
319.0,13.719999999999997,14.422619047619051,11.000000000000002,7.899999999999999
320.0,13.644999999999998,14.333333333333336,11.000000000000002,7.899999999999999
321.0,13.58,14.255952380952381,11.000000000000002,7.899999999999999
322.0,13.58,14.255952380952381,11.000000000000002,7.899999999999999
323.0,13.520000000000003,14.184523809523812,11.000000000000002,7.899999999999999
324.0,13.520000000000003,14.184523809523812,11.000000000000002,7.899999999999999
325.0,13.520000000000003,14.184523809523812,11.000000000000002,7.899999999999999
326.0,13.520000000000003,14.184523809523812,11.000000000000002,7.899999999999999
327.0,13.444999999999993,14.095238095238102,11.000000000000002,7.899999999999999
328.0,13.444999999999993,14.095238095238102,11.000000000000002,7.899999999999999
329.0,13.444999999999993,14.095238095238102,11.000000000000002,7.899999999999999
330.0,13.444999999999993,14.095238095238102,11.000000000000002,7.899999999999999
331.0,13.444999999999993,14.095238095238102,11.000000000000002,7.899999999999999
332.0,13.444999999999993,14.095238095238102,11.000000000000002,7.899999999999999
333.0,13.444999999999993,14.095238095238102,11.000000000000002,7.899999999999999
334.0,13.424999999999999,14.071428571428575,11.000000000000002,7.899999999999999
335.0,13.424999999999999,14.071428571428575,11.000000000000002,7.899999999999999
336.0,13.394999999999996,14.03571428571428,11.000000000000002,7.899999999999999
337.0,13.394999999999996,14.03571428571428,11.000000000000002,7.899999999999999
338.0,13.394999999999996,14.03571428571428,11.000000000000002,7.899999999999999
339.0,13.394999999999996,14.03571428571428,11.000000000000002,7.899999999999999
340.0,13.394999999999996,14.03571428571428,11.000000000000002,7.899999999999999
341.0,13.370000000000005,14.005952380952383,11.000000000000002,7.899999999999999
342.0,13.36,13.994047619047619,11.000000000000002,7.899999999999999
343.0,13.36,13.994047619047619,11.000000000000002,7.899999999999999
344.0,13.36,13.994047619047619,11.000000000000002,7.899999999999999
345.0,13.36,13.994047619047619,11.000000000000002,7.899999999999999
346.0,13.299999999999999,13.922619047619047,11.000000000000002,7.899999999999999
347.0,13.329999999999998,13.958333333333334,11.000000000000002,7.899999999999999
348.0,13.329999999999998,13.958333333333334,11.000000000000002,7.899999999999999
349.0,13.329999999999998,13.958333333333334,11.000000000000002,7.899999999999999
350.0,13.315000000000003,13.940476190476195,11.000000000000002,7.899999999999999
351.0,13.315000000000003,13.940476190476195,11.000000000000002,7.899999999999999
352.0,13.315000000000003,13.940476190476195,11.000000000000002,7.899999999999999
353.0,13.315000000000003,13.940476190476195,11.000000000000002,7.899999999999999
354.0,13.315000000000003,13.940476190476195,11.000000000000002,7.899999999999999
355.0,13.315000000000003,13.940476190476195,11.000000000000002,7.899999999999999
356.0,13.315000000000003,13.940476190476195,11.000000000000002,7.899999999999999
357.0,13.315000000000003,13.940476190476195,11.000000000000002,7.899999999999999
358.0,13.239999999999993,13.85119047619048,11.000000000000002,7.899999999999999
359.0,13.239999999999993,13.85119047619048,11.000000000000002,7.899999999999999
360.0,13.190000000000003,13.791666666666664,11.000000000000002,7.899999999999999
361.0,13.190000000000003,13.791666666666664,11.000000000000002,7.899999999999999
362.0,13.190000000000003,13.791666666666664,11.000000000000002,7.899999999999999
363.0,13.190000000000003,13.791666666666664,11.000000000000002,7.899999999999999
364.0,13.190000000000003,13.791666666666664,11.000000000000002,7.899999999999999
365.0,14.074999999999994,14.654761904761909,12.000000000000002,8.899999999999999
366.0,14.074999999999994,14.654761904761909,12.000000000000002,8.899999999999999
367.0,14.074999999999994,14.654761904761909,12.000000000000002,8.899999999999999
368.0,14.074999999999994,14.654761904761909,12.000000000000002,8.899999999999999
369.0,14.074999999999994,14.654761904761909,12.000000000000002,8.899999999999999
370.0,14.074999999999994,14.654761904761909,12.000000000000002,8.899999999999999
371.0,14.074999999999994,14.654761904761909,12.000000000000002,8.899999999999999
372.0,14.074999999999994,14.654761904761909,12.000000000000002,8.899999999999999
373.0,14.074999999999994,14.654761904761909,12.000000000000002,8.899999999999999
374.0,14.074999999999994,14.654761904761909,12.000000000000002,8.899999999999999
375.0,14.074999999999994,14.654761904761909,12.000000000000002,8.899999999999999
376.0,14.024999999999999,14.595238095238097,12.000000000000002,8.899999999999999
377.0,14.024999999999999,14.595238095238097,12.000000000000002,8.899999999999999
378.0,14.024999999999999,14.595238095238097,12.000000000000002,8.899999999999999
379.0,14.024999999999999,14.595238095238097,12.000000000000002,8.899999999999999
380.0,14.024999999999999,14.595238095238097,12.000000000000002,8.899999999999999
381.0,13.919999999999998,14.470238095238093,12.000000000000002,8.899999999999999
382.0,13.919999999999998,14.470238095238093,12.000000000000002,8.899999999999999
383.0,13.939999999999996,14.494047619047617,12.000000000000002,8.899999999999999
384.0,13.939999999999996,14.494047619047617,12.000000000000002,8.899999999999999
385.0,13.939999999999996,14.494047619047617,12.000000000000002,8.899999999999999
386.0,13.939999999999996,14.494047619047617,12.000000000000002,8.899999999999999
387.0,13.939999999999996,14.494047619047617,12.000000000000002,8.899999999999999
388.0,13.939999999999996,14.494047619047617,12.000000000000002,8.899999999999999
389.0,13.939999999999996,14.494047619047617,12.000000000000002,8.899999999999999
390.0,13.939999999999996,14.494047619047617,12.000000000000002,8.899999999999999
391.0,13.939999999999996,14.494047619047617,12.000000000000002,8.899999999999999
392.0,13.939999999999996,14.494047619047617,12.000000000000002,8.899999999999999
393.0,13.939999999999996,14.494047619047617,12.000000000000002,8.899999999999999
394.0,13.939999999999996,14.494047619047617,12.000000000000002,8.899999999999999
395.0,13.915000000000006,14.464285714285719,12.000000000000002,8.899999999999999
396.0,13.864999999999997,14.404761904761907,12.000000000000002,8.899999999999999
397.0,13.789999999999997,14.31547619047619,12.000000000000002,8.899999999999999
398.0,13.739999999999998,14.255952380952381,12.000000000000002,8.899999999999999
399.0,13.684999999999999,14.255952380952381,12.000000000000002,7.800000000000001
400.0,13.684999999999999,14.255952380952381,12.000000000000002,7.800000000000001
401.0,13.684999999999999,14.255952380952381,12.000000000000002,7.800000000000001
402.0,13.684999999999999,14.255952380952381,12.000000000000002,7.800000000000001
403.0,13.659999999999998,14.226190476190473,12.000000000000002,7.800000000000001
404.0,13.659999999999998,14.226190476190473,12.000000000000002,7.800000000000001
405.0,13.584999999999999,14.13690476190476,12.000000000000002,7.800000000000001
406.0,13.584999999999999,14.13690476190476,12.000000000000002,7.800000000000001
407.0,13.47,14.000000000000004,12.000000000000002,7.800000000000001
408.0,13.47,14.000000000000004,12.000000000000002,7.800000000000001
409.0,13.47,14.000000000000004,12.000000000000002,7.800000000000001
410.0,13.47,14.000000000000004,12.000000000000002,7.800000000000001
411.0,13.47,14.000000000000004,12.000000000000002,7.800000000000001
412.0,13.47,14.000000000000004,12.000000000000002,7.800000000000001
413.0,13.47,14.000000000000004,12.000000000000002,7.800000000000001
414.0,13.47,14.000000000000004,12.000000000000002,7.800000000000001
415.0,13.47,14.000000000000004,12.000000000000002,7.800000000000001
416.0,13.47,14.000000000000004,12.000000000000002,7.800000000000001
417.0,14.319999999999997,14.976190476190471,12.363636363636362,7.6
418.0,14.270000000000001,14.916666666666666,12.363636363636362,7.6
419.0,14.270000000000001,14.916666666666666,12.363636363636362,7.6
420.0,14.270000000000001,14.916666666666666,12.363636363636362,7.6
421.0,14.265000000000013,14.910714285714285,12.363636363636362,7.6
422.0,14.265000000000013,14.910714285714285,12.363636363636362,7.6
423.0,14.265000000000013,14.910714285714285,12.363636363636362,7.6
424.0,14.244999999999994,14.886904761904756,12.363636363636362,7.6
425.0,14.244999999999994,14.886904761904756,12.363636363636362,7.6
426.0,14.244999999999994,14.886904761904756,12.363636363636362,7.6
427.0,14.155000000000008,14.7797619047619,12.363636363636362,7.6
428.0,14.155000000000008,14.7797619047619,12.363636363636362,7.6
429.0,14.155000000000008,14.7797619047619,12.363636363636362,7.6
430.0,14.155000000000008,14.7797619047619,12.363636363636362,7.6
431.0,14.115000000000007,14.732142857142856,12.363636363636362,7.6
432.0,14.115000000000007,14.732142857142856,12.363636363636362,7.6
433.0,14.115000000000007,14.732142857142856,12.363636363636362,7.6
434.0,14.115000000000007,14.732142857142856,12.363636363636362,7.6
435.0,14.115000000000007,14.732142857142856,12.363636363636362,7.6
436.0,14.044999999999998,14.648809523809529,12.363636363636362,7.6
437.0,14.044999999999998,14.648809523809529,12.363636363636362,7.6
438.0,14.044999999999998,14.648809523809529,12.363636363636362,7.6
439.0,14.044999999999998,14.648809523809529,12.363636363636362,7.6
440.0,14.044999999999998,14.648809523809529,12.363636363636362,7.6
441.0,14.044999999999998,14.648809523809529,12.363636363636362,7.6
442.0,14.044999999999998,14.648809523809529,12.363636363636362,7.6
443.0,14.044999999999998,14.648809523809529,12.363636363636362,7.6
444.0,14.034999999999995,14.636904761904763,12.363636363636362,7.6
445.0,14.034999999999995,14.636904761904763,12.363636363636362,7.6
446.0,14.034999999999995,14.636904761904763,12.363636363636362,7.6
447.0,14.034999999999995,14.636904761904763,12.363636363636362,7.6
448.0,14.034999999999995,14.636904761904763,12.363636363636362,7.6
449.0,14.034999999999995,14.636904761904763,12.363636363636362,7.6
450.0,14.034999999999995,14.636904761904763,12.363636363636362,7.6
451.0,14.034999999999995,14.636904761904763,12.363636363636362,7.6
452.0,13.979999999999999,14.636904761904763,11.863636363636365,7.6
453.0,13.979999999999999,14.636904761904763,11.863636363636365,7.6
454.0,13.979999999999999,14.636904761904763,11.863636363636365,7.6
455.0,13.979999999999999,14.636904761904763,11.863636363636365,7.6
456.0,13.979999999999999,14.636904761904763,11.863636363636365,7.6
457.0,13.979999999999999,14.636904761904763,11.863636363636365,7.6
458.0,13.979999999999999,14.636904761904763,11.863636363636365,7.6
459.0,13.925000000000002,14.571428571428568,11.863636363636365,7.6
460.0,13.925000000000002,14.571428571428568,11.863636363636365,7.6
461.0,13.889999999999995,14.529761904761902,11.863636363636365,7.6
462.0,13.889999999999995,14.529761904761902,11.863636363636365,7.6
463.0,13.889999999999995,14.529761904761902,11.863636363636365,7.6
464.0,13.889999999999995,14.529761904761902,11.863636363636365,7.6
465.0,13.889999999999995,14.529761904761902,11.863636363636365,7.6
466.0,13.889999999999995,14.529761904761902,11.863636363636365,7.6
467.0,13.889999999999995,14.529761904761902,11.863636363636365,7.6
468.0,13.809999999999997,14.529761904761902,11.863636363636365,6.000000000000001
469.0,14.639999999999999,15.327380952380956,12.863636363636365,7.000000000000001
470.0,14.639999999999999,15.327380952380956,12.863636363636365,7.000000000000001
471.0,14.639999999999999,15.327380952380956,12.863636363636365,7.000000000000001
472.0,14.639999999999999,15.327380952380956,12.863636363636365,7.000000000000001
473.0,14.639999999999999,15.327380952380956,12.863636363636365,7.000000000000001
474.0,14.639999999999999,15.327380952380956,12.863636363636365,7.000000000000001
475.0,14.599999999999998,15.279761904761909,12.863636363636365,7.000000000000001
476.0,14.599999999999998,15.279761904761909,12.863636363636365,7.000000000000001
477.0,14.599999999999998,15.279761904761909,12.863636363636365,7.000000000000001
478.0,14.599999999999998,15.279761904761909,12.863636363636365,7.000000000000001
479.0,14.599999999999998,15.279761904761909,12.863636363636365,7.000000000000001
480.0,14.599999999999998,15.279761904761909,12.863636363636365,7.000000000000001
481.0,14.599999999999998,15.279761904761909,12.863636363636365,7.000000000000001
482.0,14.599999999999998,15.279761904761909,12.863636363636365,7.000000000000001
483.0,14.599999999999998,15.279761904761909,12.863636363636365,7.000000000000001
484.0,14.599999999999998,15.279761904761909,12.863636363636365,7.000000000000001
485.0,14.599999999999998,15.279761904761909,12.863636363636365,7.000000000000001
486.0,14.599999999999998,15.279761904761909,12.863636363636365,7.000000000000001
487.0,14.599999999999998,15.279761904761909,12.863636363636365,7.000000000000001
488.0,14.599999999999998,15.279761904761909,12.863636363636365,7.000000000000001
489.0,14.599999999999998,15.279761904761909,12.863636363636365,7.000000000000001
490.0,14.599999999999998,15.279761904761909,12.863636363636365,7.000000000000001
491.0,14.599999999999998,15.279761904761909,12.863636363636365,7.000000000000001
492.0,14.554999999999996,15.22619047619048,12.863636363636365,7.000000000000001
493.0,14.554999999999996,15.22619047619048,12.863636363636365,7.000000000000001
494.0,14.554999999999996,15.22619047619048,12.863636363636365,7.000000000000001
495.0,14.489999999999998,15.22619047619048,12.272727272727272,7.000000000000001
496.0,14.489999999999998,15.22619047619048,12.272727272727272,7.000000000000001
497.0,14.464999999999995,15.196428571428575,12.272727272727272,7.000000000000001
498.0,14.464999999999995,15.196428571428575,12.272727272727272,7.000000000000001
499.0,14.464999999999995,15.196428571428575,12.272727272727272,7.000000000000001
500.0,14.464999999999995,15.196428571428575,12.272727272727272,7.000000000000001
501.0,14.294999999999996,15.077380952380947,11.636363636363637,7.000000000000001
502.0,14.294999999999996,15.077380952380947,11.636363636363637,7.000000000000001
503.0,14.239999999999995,15.011904761904761,11.636363636363637,7.000000000000001
504.0,14.239999999999995,15.011904761904761,11.636363636363637,7.000000000000001
505.0,14.179999999999998,14.940476190476186,11.636363636363637,7.000000000000001
506.0,14.179999999999998,14.940476190476186,11.636363636363637,7.000000000000001
507.0,14.179999999999998,14.940476190476186,11.636363636363637,7.000000000000001
508.0,14.179999999999998,14.940476190476186,11.636363636363637,7.000000000000001
509.0,14.179999999999998,14.940476190476186,11.636363636363637,7.000000000000001
510.0,14.179999999999998,14.940476190476186,11.636363636363637,7.000000000000001
511.0,14.179999999999998,14.940476190476186,11.636363636363637,7.000000000000001
512.0,14.179999999999998,14.940476190476186,11.636363636363637,7.000000000000001
513.0,14.179999999999998,14.940476190476186,11.636363636363637,7.000000000000001
514.0,14.179999999999998,14.940476190476186,11.636363636363637,7.000000000000001
515.0,14.179999999999998,14.940476190476186,11.636363636363637,7.000000000000001
516.0,14.179999999999998,14.940476190476186,11.636363636363637,7.000000000000001
517.0,14.179999999999998,14.940476190476186,11.636363636363637,7.000000000000001
518.0,14.179999999999998,14.940476190476186,11.636363636363637,7.000000000000001
519.0,14.179999999999998,14.940476190476186,11.636363636363637,7.000000000000001
520.0,14.179999999999998,14.940476190476186,11.636363636363637,7.000000000000001
521.0,14.975,15.839285714285714,12.090909090909088,6.8
522.0,14.975,15.839285714285714,12.090909090909088,6.8
523.0,14.975,15.839285714285714,12.090909090909088,6.8
524.0,14.975,15.839285714285714,12.090909090909088,6.8
525.0,14.975,15.839285714285714,12.090909090909088,6.8
526.0,14.975,15.839285714285714,12.090909090909088,6.8
527.0,14.909999999999997,15.76190476190476,12.090909090909088,6.8
528.0,14.909999999999997,15.76190476190476,12.090909090909088,6.8
529.0,14.909999999999997,15.76190476190476,12.090909090909088,6.8
530.0,14.909999999999997,15.76190476190476,12.090909090909088,6.8
531.0,14.909999999999997,15.76190476190476,12.090909090909088,6.8
532.0,14.850000000000001,15.76190476190476,11.545454545454543,6.8
533.0,14.850000000000001,15.76190476190476,11.545454545454543,6.8
534.0,14.789999999999996,15.690476190476188,11.545454545454543,6.8
535.0,14.789999999999996,15.690476190476188,11.545454545454543,6.8
536.0,14.734999999999996,15.624999999999996,11.545454545454543,6.8
537.0,14.734999999999996,15.624999999999996,11.545454545454543,6.8
538.0,14.734999999999996,15.624999999999996,11.545454545454543,6.8
539.0,14.734999999999996,15.624999999999996,11.545454545454543,6.8
540.0,14.734999999999996,15.624999999999996,11.545454545454543,6.8
541.0,14.734999999999996,15.624999999999996,11.545454545454543,6.8
542.0,14.754999999999995,15.648809523809518,11.545454545454543,6.8
543.0,14.754999999999995,15.648809523809518,11.545454545454543,6.8
544.0,14.754999999999995,15.648809523809518,11.545454545454543,6.8
545.0,14.754999999999995,15.648809523809518,11.545454545454543,6.8
546.0,14.684999999999997,15.648809523809518,10.909090909090908,6.8
547.0,14.684999999999997,15.648809523809518,10.909090909090908,6.8
548.0,14.684999999999997,15.648809523809518,10.909090909090908,6.8
549.0,14.629999999999995,15.648809523809518,10.909090909090908,5.7
550.0,14.629999999999995,15.648809523809518,10.909090909090908,5.7
551.0,14.629999999999995,15.648809523809518,10.909090909090908,5.7
552.0,14.629999999999995,15.648809523809518,10.909090909090908,5.7
553.0,14.629999999999995,15.648809523809518,10.909090909090908,5.7
554.0,14.629999999999995,15.648809523809518,10.909090909090908,5.7
555.0,14.629999999999995,15.648809523809518,10.909090909090908,5.7
556.0,14.629999999999995,15.648809523809518,10.909090909090908,5.7
557.0,14.629999999999995,15.648809523809518,10.909090909090908,5.7
558.0,14.629999999999995,15.648809523809518,10.909090909090908,5.7
559.0,14.629999999999995,15.648809523809518,10.909090909090908,5.7
560.0,14.629999999999995,15.648809523809518,10.909090909090908,5.7
561.0,14.629999999999995,15.648809523809518,10.909090909090908,5.7
562.0,14.629999999999995,15.648809523809518,10.909090909090908,5.7
563.0,14.629999999999995,15.648809523809518,10.909090909090908,5.7
564.0,14.629999999999995,15.648809523809518,10.909090909090908,5.7
565.0,14.629999999999995,15.648809523809518,10.909090909090908,5.7
566.0,14.56,15.565476190476188,10.909090909090908,5.7
567.0,14.56,15.565476190476188,10.909090909090908,5.7
568.0,14.56,15.565476190476188,10.909090909090908,5.7
569.0,14.56,15.565476190476188,10.909090909090908,5.7
570.0,14.56,15.565476190476188,10.909090909090908,5.7
571.0,14.56,15.565476190476188,10.909090909090908,5.7
572.0,14.56,15.565476190476188,10.909090909090908,5.7
573.0,15.47499999999999,16.54761904761904,11.272727272727273,6.7
574.0,15.47499999999999,16.54761904761904,11.272727272727273,6.7
575.0,15.47499999999999,16.54761904761904,11.272727272727273,6.7
576.0,15.435000000000006,16.500000000000007,11.272727272727273,6.7
577.0,15.435000000000006,16.500000000000007,11.272727272727273,6.7
578.0,15.435000000000006,16.500000000000007,11.272727272727273,6.7
579.0,15.435000000000006,16.500000000000007,11.272727272727273,6.7
580.0,15.435000000000006,16.500000000000007,11.272727272727273,6.7
581.0,15.435000000000006,16.500000000000007,11.272727272727273,6.7
582.0,15.400000000000004,16.45833333333335,11.272727272727273,6.7
583.0,15.309999999999997,16.351190476190474,11.272727272727273,6.7
584.0,15.309999999999997,16.351190476190474,11.272727272727273,6.7
585.0,15.309999999999997,16.351190476190474,11.272727272727273,6.7
586.0,15.309999999999997,16.351190476190474,11.272727272727273,6.7
587.0,15.309999999999997,16.351190476190474,11.272727272727273,6.7
588.0,15.309999999999997,16.351190476190474,11.272727272727273,6.7
589.0,15.309999999999997,16.351190476190474,11.272727272727273,6.7
590.0,15.309999999999997,16.351190476190474,11.272727272727273,6.7
591.0,15.285,16.321428571428566,11.272727272727273,6.7
592.0,15.285,16.321428571428566,11.272727272727273,6.7
593.0,15.285,16.321428571428566,11.272727272727273,6.7
594.0,15.285,16.321428571428566,11.272727272727273,6.7
595.0,15.225000000000005,16.249999999999996,11.272727272727273,6.7
596.0,15.225000000000005,16.249999999999996,11.272727272727273,6.7
597.0,15.225000000000005,16.249999999999996,11.272727272727273,6.7
598.0,15.225000000000005,16.249999999999996,11.272727272727273,6.7
599.0,15.225000000000005,16.249999999999996,11.272727272727273,6.7
600.0,15.225000000000005,16.249999999999996,11.272727272727273,6.7
601.0,15.225000000000005,16.249999999999996,11.272727272727273,6.7
602.0,15.225000000000005,16.249999999999996,11.272727272727273,6.7
603.0,15.225000000000005,16.249999999999996,11.272727272727273,6.7
604.0,15.225000000000005,16.249999999999996,11.272727272727273,6.7
605.0,15.225000000000005,16.249999999999996,11.272727272727273,6.7
606.0,15.225000000000005,16.249999999999996,11.272727272727273,6.7
607.0,15.225000000000005,16.249999999999996,11.272727272727273,6.7
608.0,15.225000000000005,16.249999999999996,11.272727272727273,6.7
609.0,15.225000000000005,16.249999999999996,11.272727272727273,6.7
610.0,15.225000000000005,16.249999999999996,11.272727272727273,6.7
611.0,15.225000000000005,16.249999999999996,11.272727272727273,6.7
612.0,15.225000000000005,16.249999999999996,11.272727272727273,6.7
613.0,15.225000000000005,16.249999999999996,11.272727272727273,6.7
614.0,15.225000000000005,16.249999999999996,11.272727272727273,6.7
615.0,15.225000000000005,16.249999999999996,11.272727272727273,6.7
616.0,15.225000000000005,16.249999999999996,11.272727272727273,6.7
617.0,15.225000000000005,16.249999999999996,11.272727272727273,6.7
618.0,15.225000000000005,16.249999999999996,11.272727272727273,6.7
619.0,15.115000000000004,16.119047619047617,11.272727272727273,6.7
620.0,14.920000000000002,15.886904761904754,11.272727272727273,6.7
621.0,14.920000000000002,15.886904761904754,11.272727272727273,6.7
622.0,14.920000000000002,15.886904761904754,11.272727272727273,6.7
623.0,14.920000000000002,15.886904761904754,11.272727272727273,6.7
624.0,14.920000000000002,15.886904761904754,11.272727272727273,6.7
625.0,15.920000000000003,16.886904761904763,12.272727272727273,7.7
626.0,15.920000000000003,16.886904761904763,12.272727272727273,7.7
627.0,15.920000000000003,16.886904761904763,12.272727272727273,7.7
628.0,15.920000000000003,16.886904761904763,12.272727272727273,7.7
629.0,15.920000000000003,16.886904761904763,12.272727272727273,7.7
630.0,15.83999999999999,16.791666666666657,12.272727272727273,7.7
631.0,15.83999999999999,16.791666666666657,12.272727272727273,7.7
632.0,15.83999999999999,16.791666666666657,12.272727272727273,7.7
633.0,15.759999999999998,16.696428571428573,12.272727272727273,7.7
634.0,15.759999999999998,16.696428571428573,12.272727272727273,7.7
635.0,15.759999999999998,16.696428571428573,12.272727272727273,7.7
636.0,15.759999999999998,16.696428571428573,12.272727272727273,7.7
637.0,15.759999999999998,16.696428571428573,12.272727272727273,7.7
638.0,15.759999999999998,16.696428571428573,12.272727272727273,7.7
639.0,15.759999999999998,16.696428571428573,12.272727272727273,7.7
640.0,15.605000000000002,16.696428571428573,11.59090909090909,6.1000000000000005
641.0,15.605000000000002,16.696428571428573,11.59090909090909,6.1000000000000005
642.0,15.605000000000002,16.696428571428573,11.59090909090909,6.1000000000000005
643.0,15.605000000000002,16.696428571428573,11.59090909090909,6.1000000000000005
644.0,15.470000000000006,16.535714285714295,11.59090909090909,6.1000000000000005
645.0,15.470000000000006,16.535714285714295,11.59090909090909,6.1000000000000005
646.0,15.354999999999999,16.39880952380952,11.59090909090909,6.1000000000000005
647.0,15.269999999999998,16.297619047619055,11.59090909090909,6.1000000000000005
648.0,15.269999999999998,16.297619047619055,11.59090909090909,6.1000000000000005
649.0,15.269999999999998,16.297619047619055,11.59090909090909,6.1000000000000005
650.0,15.269999999999998,16.297619047619055,11.59090909090909,6.1000000000000005
651.0,15.190000000000003,16.297619047619055,10.863636363636362,6.1000000000000005
652.0,15.190000000000003,16.297619047619055,10.863636363636362,6.1000000000000005
653.0,15.190000000000003,16.297619047619055,10.863636363636362,6.1000000000000005
654.0,15.190000000000003,16.297619047619055,10.863636363636362,6.1000000000000005
655.0,15.190000000000003,16.297619047619055,10.863636363636362,6.1000000000000005
656.0,15.190000000000003,16.297619047619055,10.863636363636362,6.1000000000000005
657.0,15.190000000000003,16.297619047619055,10.863636363636362,6.1000000000000005
658.0,15.190000000000003,16.297619047619055,10.863636363636362,6.1000000000000005
659.0,15.140000000000002,16.238095238095234,10.863636363636362,6.1000000000000005
660.0,15.140000000000002,16.238095238095234,10.863636363636362,6.1000000000000005
661.0,15.140000000000002,16.238095238095234,10.863636363636362,6.1000000000000005
662.0,15.080000000000005,16.166666666666657,10.863636363636362,6.1000000000000005
663.0,15.080000000000005,16.166666666666657,10.863636363636362,6.1000000000000005
664.0,15.080000000000005,16.166666666666657,10.863636363636362,6.1000000000000005
665.0,15.080000000000005,16.166666666666657,10.863636363636362,6.1000000000000005
666.0,15.080000000000005,16.166666666666657,10.863636363636362,6.1000000000000005
667.0,15.049999999999995,16.130952380952383,10.863636363636362,6.1000000000000005
668.0,15.049999999999995,16.130952380952383,10.863636363636362,6.1000000000000005
669.0,15.049999999999995,16.130952380952383,10.863636363636362,6.1000000000000005
670.0,15.049999999999995,16.130952380952383,10.863636363636362,6.1000000000000005
671.0,15.049999999999995,16.130952380952383,10.863636363636362,6.1000000000000005
672.0,15.049999999999995,16.130952380952383,10.863636363636362,6.1000000000000005
673.0,15.049999999999995,16.130952380952383,10.863636363636362,6.1000000000000005
674.0,15.049999999999995,16.130952380952383,10.863636363636362,6.1000000000000005
675.0,15.049999999999995,16.130952380952383,10.863636363636362,6.1000000000000005
676.0,15.049999999999995,16.130952380952383,10.863636363636362,6.1000000000000005
677.0,15.874999999999996,17.035714285714278,11.523809523809524,6.454545454545454
678.0,15.874999999999996,17.035714285714278,11.523809523809524,6.454545454545454
679.0,15.874999999999996,17.035714285714278,11.523809523809524,6.454545454545454
680.0,15.874999999999996,17.035714285714278,11.523809523809524,6.454545454545454
681.0,15.874999999999996,17.035714285714278,11.523809523809524,6.454545454545454
682.0,15.874999999999996,17.035714285714278,11.523809523809524,6.454545454545454
683.0,15.874999999999996,17.035714285714278,11.523809523809524,6.454545454545454
684.0,15.874999999999996,17.035714285714278,11.523809523809524,6.454545454545454
685.0,15.874999999999996,17.035714285714278,11.523809523809524,6.454545454545454
686.0,15.874999999999996,17.035714285714278,11.523809523809524,6.454545454545454
687.0,15.874999999999996,17.035714285714278,11.523809523809524,6.454545454545454
688.0,15.874999999999996,17.035714285714278,11.523809523809524,6.454545454545454
689.0,15.874999999999996,17.035714285714278,11.523809523809524,6.454545454545454
690.0,15.799999999999997,16.94642857142857,11.523809523809524,6.454545454545454
691.0,15.735000000000003,16.869047619047628,11.523809523809524,6.454545454545454
692.0,15.495000000000003,16.70238095238095,10.571428571428573,6.454545454545454
693.0,15.495000000000003,16.70238095238095,10.571428571428573,6.454545454545454
694.0,15.495000000000003,16.70238095238095,10.571428571428573,6.454545454545454
695.0,15.495000000000003,16.70238095238095,10.571428571428573,6.454545454545454
696.0,15.495000000000003,16.70238095238095,10.571428571428573,6.454545454545454
697.0,15.269999999999996,16.43452380952381,10.571428571428573,6.454545454545454
698.0,15.269999999999996,16.43452380952381,10.571428571428573,6.454545454545454
699.0,15.269999999999996,16.43452380952381,10.571428571428573,6.454545454545454
700.0,15.269999999999996,16.43452380952381,10.571428571428573,6.454545454545454
701.0,15.269999999999996,16.43452380952381,10.571428571428573,6.454545454545454
702.0,15.269999999999996,16.43452380952381,10.571428571428573,6.454545454545454
703.0,15.084999999999999,16.214285714285715,10.571428571428573,6.454545454545454
704.0,15.084999999999999,16.214285714285715,10.571428571428573,6.454545454545454
705.0,15.084999999999999,16.214285714285715,10.571428571428573,6.454545454545454
706.0,15.084999999999999,16.214285714285715,10.571428571428573,6.454545454545454
707.0,15.084999999999999,16.214285714285715,10.571428571428573,6.454545454545454
708.0,15.084999999999999,16.214285714285715,10.571428571428573,6.454545454545454
709.0,15.084999999999999,16.214285714285715,10.571428571428573,6.454545454545454
710.0,15.084999999999999,16.214285714285715,10.571428571428573,6.454545454545454
711.0,15.084999999999999,16.214285714285715,10.571428571428573,6.454545454545454
712.0,15.020000000000005,16.13690476190476,10.571428571428573,6.454545454545454
713.0,15.020000000000005,16.13690476190476,10.571428571428573,6.454545454545454
714.0,15.020000000000005,16.13690476190476,10.571428571428573,6.454545454545454
715.0,14.939999999999998,16.13690476190476,9.809523809523812,6.454545454545454
716.0,14.939999999999998,16.13690476190476,9.809523809523812,6.454545454545454
717.0,14.889999999999997,16.077380952380956,9.809523809523812,6.454545454545454
718.0,14.889999999999997,16.077380952380956,9.809523809523812,6.454545454545454
719.0,14.889999999999997,16.077380952380956,9.809523809523812,6.454545454545454
720.0,14.835,16.011904761904763,9.809523809523812,6.454545454545454
721.0,14.835,16.011904761904763,9.809523809523812,6.454545454545454
722.0,14.835,16.011904761904763,9.809523809523812,6.454545454545454
723.0,14.835,16.011904761904763,9.809523809523812,6.454545454545454
724.0,14.835,16.011904761904763,9.809523809523812,6.454545454545454
725.0,14.835,16.011904761904763,9.809523809523812,6.454545454545454
726.0,14.835,16.011904761904763,9.809523809523812,6.454545454545454
727.0,14.760000000000002,15.922619047619042,9.809523809523812,6.454545454545454
728.0,14.760000000000002,15.922619047619042,9.809523809523812,6.454545454545454
729.0,15.760000000000002,16.922619047619058,10.809523809523812,7.454545454545454
730.0,15.760000000000002,16.922619047619058,10.809523809523812,7.454545454545454
731.0,15.760000000000002,16.922619047619058,10.809523809523812,7.454545454545454
732.0,15.760000000000002,16.922619047619058,10.809523809523812,7.454545454545454
733.0,15.760000000000002,16.922619047619058,10.809523809523812,7.454545454545454
734.0,15.760000000000002,16.922619047619058,10.809523809523812,7.454545454545454
735.0,15.760000000000002,16.922619047619058,10.809523809523812,7.454545454545454
736.0,15.605000000000002,16.738095238095237,10.809523809523812,7.454545454545454
737.0,15.605000000000002,16.738095238095237,10.809523809523812,7.454545454545454
738.0,15.605000000000002,16.738095238095237,10.809523809523812,7.454545454545454
739.0,15.495,16.607142857142843,10.809523809523812,7.454545454545454
740.0,15.495,16.607142857142843,10.809523809523812,7.454545454545454
741.0,15.495,16.607142857142843,10.809523809523812,7.454545454545454
742.0,15.495,16.607142857142843,10.809523809523812,7.454545454545454
743.0,15.495,16.607142857142843,10.809523809523812,7.454545454545454
744.0,15.409999999999993,16.505952380952387,10.809523809523812,7.454545454545454
745.0,15.409999999999993,16.505952380952387,10.809523809523812,7.454545454545454
746.0,15.409999999999993,16.505952380952387,10.809523809523812,7.454545454545454
747.0,15.409999999999993,16.505952380952387,10.809523809523812,7.454545454545454
748.0,15.409999999999993,16.505952380952387,10.809523809523812,7.454545454545454
749.0,15.409999999999993,16.505952380952387,10.809523809523812,7.454545454545454
750.0,15.245000000000003,16.470238095238106,9.523809523809526,7.454545454545454
751.0,15.245000000000003,16.470238095238106,9.523809523809526,7.454545454545454
752.0,15.175000000000006,16.386904761904763,9.523809523809526,7.454545454545454
753.0,15.175000000000006,16.386904761904763,9.523809523809526,7.454545454545454
754.0,15.175000000000006,16.386904761904763,9.523809523809526,7.454545454545454
755.0,15.114999999999993,16.315476190476186,9.523809523809526,7.454545454545454
756.0,15.114999999999993,16.315476190476186,9.523809523809526,7.454545454545454
757.0,15.114999999999993,16.315476190476186,9.523809523809526,7.454545454545454
758.0,15.114999999999993,16.315476190476186,9.523809523809526,7.454545454545454
759.0,15.114999999999993,16.315476190476186,9.523809523809526,7.454545454545454
760.0,15.114999999999993,16.315476190476186,9.523809523809526,7.454545454545454
761.0,15.114999999999993,16.315476190476186,9.523809523809526,7.454545454545454
762.0,15.114999999999993,16.315476190476186,9.523809523809526,7.454545454545454
763.0,15.114999999999993,16.315476190476186,9.523809523809526,7.454545454545454
764.0,15.114999999999993,16.315476190476186,9.523809523809526,7.454545454545454
765.0,15.114999999999993,16.315476190476186,9.523809523809526,7.454545454545454
766.0,15.014999999999995,16.196428571428573,9.523809523809526,7.454545454545454
767.0,15.014999999999995,16.196428571428573,9.523809523809526,7.454545454545454
768.0,15.014999999999995,16.196428571428573,9.523809523809526,7.454545454545454
769.0,15.014999999999995,16.196428571428573,9.523809523809526,7.454545454545454
770.0,15.014999999999995,16.196428571428573,9.523809523809526,7.454545454545454
771.0,15.014999999999995,16.196428571428573,9.523809523809526,7.454545454545454
772.0,15.014999999999995,16.196428571428573,9.523809523809526,7.454545454545454
773.0,15.014999999999995,16.196428571428573,9.523809523809526,7.454545454545454
774.0,15.014999999999995,16.196428571428573,9.523809523809526,7.454545454545454
775.0,15.014999999999995,16.196428571428573,9.523809523809526,7.454545454545454
776.0,15.014999999999995,16.196428571428573,9.523809523809526,7.454545454545454
777.0,15.014999999999995,16.196428571428573,9.523809523809526,7.454545454545454
778.0,14.844999999999995,15.994047619047619,9.523809523809526,7.454545454545454
779.0,14.844999999999995,15.994047619047619,9.523809523809526,7.454545454545454
780.0,14.844999999999995,15.994047619047619,9.523809523809526,7.454545454545454
781.0,15.844999999999995,16.99404761904762,10.523809523809526,8.454545454545455
782.0,15.844999999999995,16.99404761904762,10.523809523809526,8.454545454545455
783.0,15.844999999999995,16.99404761904762,10.523809523809526,8.454545454545455
784.0,15.844999999999995,16.99404761904762,10.523809523809526,8.454545454545455
785.0,15.844999999999995,16.99404761904762,10.523809523809526,8.454545454545455
786.0,15.844999999999995,16.99404761904762,10.523809523809526,8.454545454545455
787.0,15.844999999999995,16.99404761904762,10.523809523809526,8.454545454545455
788.0,15.844999999999995,16.99404761904762,10.523809523809526,8.454545454545455
789.0,15.81,16.95238095238094,10.523809523809526,8.454545454545455
790.0,15.81,16.95238095238094,10.523809523809526,8.454545454545455
791.0,15.81,16.95238095238094,10.523809523809526,8.454545454545455
792.0,15.81,16.95238095238094,10.523809523809526,8.454545454545455
793.0,15.734999999999998,16.863095238095223,10.523809523809526,8.454545454545455
794.0,15.734999999999998,16.863095238095223,10.523809523809526,8.454545454545455
795.0,15.734999999999998,16.863095238095223,10.523809523809526,8.454545454545455
796.0,15.734999999999998,16.863095238095223,10.523809523809526,8.454545454545455
797.0,15.734999999999998,16.863095238095223,10.523809523809526,8.454545454545455
798.0,15.734999999999998,16.863095238095223,10.523809523809526,8.454545454545455
799.0,15.734999999999998,16.863095238095223,10.523809523809526,8.454545454545455
800.0,15.734999999999998,16.863095238095223,10.523809523809526,8.454545454545455
801.0,15.734999999999998,16.863095238095223,10.523809523809526,8.454545454545455
802.0,15.734999999999998,16.863095238095223,10.523809523809526,8.454545454545455
803.0,15.649999999999997,16.863095238095223,9.714285714285715,8.454545454545455
804.0,15.649999999999997,16.863095238095223,9.714285714285715,8.454545454545455
805.0,15.649999999999997,16.863095238095223,9.714285714285715,8.454545454545455
806.0,15.649999999999997,16.863095238095223,9.714285714285715,8.454545454545455
807.0,15.649999999999997,16.863095238095223,9.714285714285715,8.454545454545455
808.0,15.649999999999997,16.863095238095223,9.714285714285715,8.454545454545455
809.0,15.649999999999997,16.863095238095223,9.714285714285715,8.454545454545455
810.0,15.649999999999997,16.863095238095223,9.714285714285715,8.454545454545455
811.0,15.649999999999997,16.863095238095223,9.714285714285715,8.454545454545455
812.0,15.649999999999997,16.863095238095223,9.714285714285715,8.454545454545455
813.0,15.649999999999997,16.863095238095223,9.714285714285715,8.454545454545455
814.0,15.574999999999996,16.773809523809536,9.714285714285715,8.454545454545455
815.0,15.574999999999996,16.773809523809536,9.714285714285715,8.454545454545455
816.0,15.574999999999996,16.773809523809536,9.714285714285715,8.454545454545455
817.0,15.494999999999997,16.67857142857143,9.714285714285715,8.454545454545455
818.0,15.494999999999997,16.67857142857143,9.714285714285715,8.454545454545455
819.0,15.424999999999988,16.59523809523807,9.714285714285715,8.454545454545455
820.0,15.339999999999996,16.49404761904761,9.714285714285715,8.454545454545455
821.0,15.339999999999996,16.49404761904761,9.714285714285715,8.454545454545455
822.0,15.339999999999996,16.49404761904761,9.714285714285715,8.454545454545455
823.0,15.339999999999996,16.49404761904761,9.714285714285715,8.454545454545455
824.0,15.339999999999996,16.49404761904761,9.714285714285715,8.454545454545455
825.0,15.339999999999996,16.49404761904761,9.714285714285715,8.454545454545455
826.0,15.339999999999996,16.49404761904761,9.714285714285715,8.454545454545455
827.0,15.339999999999996,16.49404761904761,9.714285714285715,8.454545454545455
828.0,15.274999999999999,16.41666666666667,9.714285714285715,8.454545454545455
829.0,15.274999999999999,16.41666666666667,9.714285714285715,8.454545454545455
830.0,15.274999999999999,16.41666666666667,9.714285714285715,8.454545454545455
831.0,15.274999999999999,16.41666666666667,9.714285714285715,8.454545454545455
832.0,15.274999999999999,16.41666666666667,9.714285714285715,8.454545454545455
833.0,16.219999999999995,17.35119047619048,10.714285714285715,9.454545454545455
834.0,16.219999999999995,17.35119047619048,10.714285714285715,9.454545454545455
835.0,16.219999999999995,17.35119047619048,10.714285714285715,9.454545454545455
836.0,16.219999999999995,17.35119047619048,10.714285714285715,9.454545454545455
837.0,16.219999999999995,17.35119047619048,10.714285714285715,9.454545454545455
838.0,16.219999999999995,17.35119047619048,10.714285714285715,9.454545454545455
839.0,16.219999999999995,17.35119047619048,10.714285714285715,9.454545454545455
840.0,16.219999999999995,17.35119047619048,10.714285714285715,9.454545454545455
841.0,16.219999999999995,17.35119047619048,10.714285714285715,9.454545454545455
842.0,16.154999999999998,17.273809523809526,10.714285714285715,9.454545454545455
843.0,16.154999999999998,17.273809523809526,10.714285714285715,9.454545454545455
844.0,16.154999999999998,17.273809523809526,10.714285714285715,9.454545454545455
845.0,16.154999999999998,17.273809523809526,10.714285714285715,9.454545454545455
846.0,16.154999999999998,17.273809523809526,10.714285714285715,9.454545454545455
847.0,16.154999999999998,17.273809523809526,10.714285714285715,9.454545454545455
848.0,16.154999999999998,17.273809523809526,10.714285714285715,9.454545454545455
849.0,16.154999999999998,17.273809523809526,10.714285714285715,9.454545454545455
850.0,16.104999999999997,17.214285714285726,10.714285714285715,9.454545454545455
851.0,16.104999999999997,17.214285714285726,10.714285714285715,9.454545454545455
852.0,16.104999999999997,17.214285714285726,10.714285714285715,9.454545454545455
853.0,16.104999999999997,17.214285714285726,10.714285714285715,9.454545454545455
854.0,16.104999999999997,17.214285714285726,10.714285714285715,9.454545454545455
855.0,16.104999999999997,17.214285714285726,10.714285714285715,9.454545454545455
856.0,16.015000000000008,17.10714285714287,10.714285714285715,9.454545454545455
857.0,16.015000000000008,17.10714285714287,10.714285714285715,9.454545454545455
858.0,16.015000000000008,17.10714285714287,10.714285714285715,9.454545454545455
859.0,16.015000000000008,17.10714285714287,10.714285714285715,9.454545454545455
860.0,16.015000000000008,17.10714285714287,10.714285714285715,9.454545454545455
861.0,16.015000000000008,17.10714285714287,10.714285714285715,9.454545454545455
862.0,16.015000000000008,17.10714285714287,10.714285714285715,9.454545454545455
863.0,16.015000000000008,17.10714285714287,10.714285714285715,9.454545454545455
864.0,16.015000000000008,17.10714285714287,10.714285714285715,9.454545454545455
865.0,16.015000000000008,17.10714285714287,10.714285714285715,9.454545454545455
866.0,15.814999999999998,16.869047619047613,10.714285714285715,9.454545454545455
867.0,15.814999999999998,16.869047619047613,10.714285714285715,9.454545454545455
868.0,15.814999999999998,16.869047619047613,10.714285714285715,9.454545454545455
869.0,15.814999999999998,16.869047619047613,10.714285714285715,9.454545454545455
870.0,15.814999999999998,16.869047619047613,10.714285714285715,9.454545454545455
871.0,15.679999999999994,16.70833333333332,10.714285714285715,9.454545454545455
872.0,15.679999999999994,16.70833333333332,10.714285714285715,9.454545454545455
873.0,15.679999999999994,16.70833333333332,10.714285714285715,9.454545454545455
874.0,15.679999999999994,16.70833333333332,10.714285714285715,9.454545454545455
875.0,15.470000000000002,16.45833333333332,10.714285714285715,9.454545454545455
876.0,15.395,16.36904761904762,10.714285714285715,9.454545454545455
877.0,15.395,16.36904761904762,10.714285714285715,9.454545454545455
878.0,15.395,16.36904761904762,10.714285714285715,9.454545454545455
879.0,15.300000000000002,16.25595238095237,10.714285714285715,9.454545454545455
880.0,15.300000000000002,16.25595238095237,10.714285714285715,9.454545454545455
881.0,15.249999999999998,16.196428571428573,10.714285714285715,9.454545454545455
882.0,15.249999999999998,16.196428571428573,10.714285714285715,9.454545454545455
883.0,15.15499999999999,16.196428571428573,10.714285714285715,7.7272727272727275
884.0,15.15499999999999,16.196428571428573,10.714285714285715,7.7272727272727275
885.0,15.909999999999991,17.0654761904762,10.950000000000001,8.0
886.0,15.909999999999991,17.0654761904762,10.950000000000001,8.0
887.0,15.909999999999991,17.0654761904762,10.950000000000001,8.0
888.0,15.82,16.95833333333334,10.950000000000001,8.0
889.0,15.82,16.95833333333334,10.950000000000001,8.0
890.0,15.744999999999997,16.86904761904762,10.950000000000001,8.0
891.0,15.744999999999997,16.86904761904762,10.950000000000001,8.0
892.0,15.744999999999997,16.86904761904762,10.950000000000001,8.0
893.0,15.744999999999997,16.86904761904762,10.950000000000001,8.0
894.0,15.744999999999997,16.86904761904762,10.950000000000001,8.0
895.0,15.744999999999997,16.86904761904762,10.950000000000001,8.0
896.0,15.744999999999997,16.86904761904762,10.950000000000001,8.0
897.0,15.744999999999997,16.86904761904762,10.950000000000001,8.0
898.0,15.609999999999994,16.70833333333332,10.950000000000001,8.0
899.0,15.500000000000005,16.70833333333332,9.85,8.0
900.0,15.500000000000005,16.70833333333332,9.85,8.0
901.0,15.345000000000004,16.52380952380952,9.85,8.0
902.0,15.345000000000004,16.52380952380952,9.85,8.0
903.0,15.154999999999998,16.410714285714274,9.85,6.416666666666666
904.0,15.154999999999998,16.410714285714274,9.85,6.416666666666666
905.0,15.154999999999998,16.410714285714274,9.85,6.416666666666666
906.0,15.154999999999998,16.410714285714274,9.85,6.416666666666666
907.0,15.154999999999998,16.410714285714274,9.85,6.416666666666666
908.0,15.154999999999998,16.410714285714274,9.85,6.416666666666666
909.0,15.049999999999999,16.285714285714274,9.85,6.416666666666666
910.0,15.049999999999999,16.285714285714274,9.85,6.416666666666666
911.0,15.049999999999999,16.285714285714274,9.85,6.416666666666666
912.0,15.049999999999999,16.285714285714274,9.85,6.416666666666666
913.0,15.049999999999999,16.285714285714274,9.85,6.416666666666666
914.0,15.049999999999999,16.285714285714274,9.85,6.416666666666666
915.0,15.049999999999999,16.285714285714274,9.85,6.416666666666666
916.0,15.049999999999999,16.285714285714274,9.85,6.416666666666666
917.0,14.904999999999998,16.113095238095237,9.85,6.416666666666666
918.0,14.904999999999998,16.113095238095237,9.85,6.416666666666666
919.0,14.904999999999998,16.113095238095237,9.85,6.416666666666666
920.0,14.904999999999998,16.113095238095237,9.85,6.416666666666666
921.0,14.904999999999998,16.113095238095237,9.85,6.416666666666666
922.0,14.904999999999998,16.113095238095237,9.85,6.416666666666666
923.0,14.904999999999998,16.113095238095237,9.85,6.416666666666666
924.0,14.904999999999998,16.113095238095237,9.85,6.416666666666666
925.0,14.904999999999998,16.113095238095237,9.85,6.416666666666666
926.0,14.799999999999997,16.113095238095237,9.263157894736842,5.9230769230769225
927.0,14.799999999999997,16.113095238095237,9.263157894736842,5.9230769230769225
928.0,14.799999999999997,16.113095238095237,9.263157894736842,5.9230769230769225
929.0,14.799999999999997,16.113095238095237,9.263157894736842,5.9230769230769225
930.0,14.799999999999997,16.113095238095237,9.263157894736842,5.9230769230769225
931.0,14.799999999999997,16.113095238095237,9.263157894736842,5.9230769230769225
932.0,14.799999999999997,16.113095238095237,9.263157894736842,5.9230769230769225
933.0,14.799999999999997,16.113095238095237,9.263157894736842,5.9230769230769225
934.0,14.679999999999994,15.970238095238093,9.263157894736842,5.9230769230769225
935.0,14.679999999999994,15.970238095238093,9.263157894736842,5.9230769230769225
936.0,14.579999999999993,15.970238095238093,8.210526315789474,5.9230769230769225
937.0,15.579999999999993,16.970238095238102,9.210526315789474,6.9230769230769225
938.0,15.579999999999993,16.970238095238102,9.210526315789474,6.9230769230769225
939.0,15.579999999999993,16.970238095238102,9.210526315789474,6.9230769230769225
940.0,15.579999999999993,16.970238095238102,9.210526315789474,6.9230769230769225
941.0,15.579999999999993,16.970238095238102,9.210526315789474,6.9230769230769225
942.0,15.579999999999993,16.970238095238102,9.210526315789474,6.9230769230769225
943.0,15.265000000000004,16.5952380952381,9.210526315789474,6.9230769230769225
944.0,15.265000000000004,16.5952380952381,9.210526315789474,6.9230769230769225
945.0,15.165000000000001,16.47619047619047,9.210526315789474,6.9230769230769225
946.0,15.020000000000001,16.303571428571427,9.210526315789474,6.9230769230769225
947.0,14.919999999999996,16.18452380952381,9.210526315789474,6.9230769230769225
948.0,14.919999999999996,16.18452380952381,9.210526315789474,6.9230769230769225
949.0,14.919999999999996,16.18452380952381,9.210526315789474,6.9230769230769225
950.0,14.919999999999996,16.18452380952381,9.210526315789474,6.9230769230769225
951.0,14.919999999999996,16.18452380952381,9.210526315789474,6.9230769230769225
952.0,14.919999999999996,16.18452380952381,9.210526315789474,6.9230769230769225
953.0,14.919999999999996,16.18452380952381,9.210526315789474,6.9230769230769225
954.0,14.919999999999996,16.18452380952381,9.210526315789474,6.9230769230769225
955.0,14.919999999999996,16.18452380952381,9.210526315789474,6.9230769230769225
956.0,14.919999999999996,16.18452380952381,9.210526315789474,6.9230769230769225
957.0,14.919999999999996,16.18452380952381,9.210526315789474,6.9230769230769225
958.0,14.919999999999996,16.18452380952381,9.210526315789474,6.9230769230769225
959.0,14.77,16.005952380952372,9.210526315789474,6.9230769230769225
960.0,14.77,16.005952380952372,9.210526315789474,6.9230769230769225
961.0,14.77,16.005952380952372,9.210526315789474,6.9230769230769225
962.0,14.77,16.005952380952372,9.210526315789474,6.9230769230769225
963.0,14.77,16.005952380952372,9.210526315789474,6.9230769230769225
964.0,14.77,16.005952380952372,9.210526315789474,6.9230769230769225
965.0,14.77,16.005952380952372,9.210526315789474,6.9230769230769225
966.0,14.77,16.005952380952372,9.210526315789474,6.9230769230769225
967.0,14.77,16.005952380952372,9.210526315789474,6.9230769230769225
968.0,14.77,16.005952380952372,9.210526315789474,6.9230769230769225
969.0,14.77,16.005952380952372,9.210526315789474,6.9230769230769225
970.0,14.77,16.005952380952372,9.210526315789474,6.9230769230769225
971.0,14.77,16.005952380952372,9.210526315789474,6.9230769230769225
972.0,14.649999999999991,15.863095238095237,9.210526315789474,6.9230769230769225
973.0,14.649999999999991,15.863095238095237,9.210526315789474,6.9230769230769225
974.0,14.649999999999991,15.863095238095237,9.210526315789474,6.9230769230769225
975.0,14.649999999999991,15.863095238095237,9.210526315789474,6.9230769230769225
976.0,14.649999999999991,15.863095238095237,9.210526315789474,6.9230769230769225
977.0,14.649999999999991,15.863095238095237,9.210526315789474,6.9230769230769225
978.0,14.649999999999991,15.863095238095237,9.210526315789474,6.9230769230769225
979.0,14.649999999999991,15.863095238095237,9.210526315789474,6.9230769230769225
980.0,14.649999999999991,15.863095238095237,9.210526315789474,6.9230769230769225
981.0,14.649999999999991,15.863095238095237,9.210526315789474,6.9230769230769225
982.0,14.649999999999991,15.863095238095237,9.210526315789474,6.9230769230769225
983.0,14.649999999999991,15.863095238095237,9.210526315789474,6.9230769230769225
984.0,14.649999999999991,15.863095238095237,9.210526315789474,6.9230769230769225
985.0,14.649999999999991,15.863095238095237,9.210526315789474,6.9230769230769225
986.0,14.649999999999991,15.863095238095237,9.210526315789474,6.9230769230769225
987.0,14.649999999999991,15.863095238095237,9.210526315789474,6.9230769230769225
988.0,14.455000000000007,15.863095238095237,7.555555555555556,6.428571428571428
989.0,15.455000000000007,16.863095238095227,8.555555555555555,7.428571428571428
990.0,15.455000000000007,16.863095238095227,8.555555555555555,7.428571428571428
991.0,15.364999999999995,16.755952380952372,8.555555555555555,7.428571428571428
992.0,15.245000000000001,16.755952380952372,7.222222222222222,7.428571428571428
993.0,15.139999999999995,16.630952380952383,7.222222222222222,7.428571428571428
994.0,15.139999999999995,16.630952380952383,7.222222222222222,7.428571428571428
995.0,15.020000000000005,16.48809523809523,7.222222222222222,7.428571428571428
996.0,15.020000000000005,16.48809523809523,7.222222222222222,7.428571428571428
997.0,15.020000000000005,16.48809523809523,7.222222222222222,7.428571428571428
998.0,15.020000000000005,16.48809523809523,7.222222222222222,7.428571428571428
999.0,14.935000000000004,16.386904761904766,7.222222222222222,7.428571428571428
1000.0,14.935000000000004,16.386904761904766,7.222222222222222,7.428571428571428
1001.0,14.935000000000004,16.386904761904766,7.222222222222222,7.428571428571428
1002.0,14.935000000000004,16.386904761904766,7.222222222222222,7.428571428571428
1003.0,14.935000000000004,16.386904761904766,7.222222222222222,7.428571428571428
1004.0,14.935000000000004,16.386904761904766,7.222222222222222,7.428571428571428
1005.0,14.935000000000004,16.386904761904766,7.222222222222222,7.428571428571428
1006.0,14.935000000000004,16.386904761904766,7.222222222222222,7.428571428571428
1007.0,14.935000000000004,16.386904761904766,7.222222222222222,7.428571428571428
1008.0,14.935000000000004,16.386904761904766,7.222222222222222,7.428571428571428
1009.0,14.935000000000004,16.386904761904766,7.222222222222222,7.428571428571428
1010.0,14.935000000000004,16.386904761904766,7.222222222222222,7.428571428571428
1011.0,14.935000000000004,16.386904761904766,7.222222222222222,7.428571428571428
1012.0,14.935000000000004,16.386904761904766,7.222222222222222,7.428571428571428
1013.0,14.830000000000002,16.261904761904766,7.222222222222222,7.428571428571428
1014.0,14.830000000000002,16.261904761904766,7.222222222222222,7.428571428571428
1015.0,14.830000000000002,16.261904761904766,7.222222222222222,7.428571428571428
1016.0,14.830000000000002,16.261904761904766,7.222222222222222,7.428571428571428
1017.0,14.830000000000002,16.261904761904766,7.222222222222222,7.428571428571428
1018.0,14.770000000000008,16.190476190476186,7.222222222222222,7.428571428571428
1019.0,14.770000000000008,16.190476190476186,7.222222222222222,7.428571428571428
1020.0,14.770000000000008,16.190476190476186,7.222222222222222,7.428571428571428
1021.0,14.770000000000008,16.190476190476186,7.222222222222222,7.428571428571428
1022.0,14.770000000000008,16.190476190476186,7.222222222222222,7.428571428571428
1023.0,14.770000000000008,16.190476190476186,7.222222222222222,7.428571428571428
1024.0,14.770000000000008,16.190476190476186,7.222222222222222,7.428571428571428
1025.0,14.770000000000008,16.190476190476186,7.222222222222222,7.428571428571428
1026.0,14.770000000000008,16.190476190476186,7.222222222222222,7.428571428571428
1027.0,14.770000000000008,16.190476190476186,7.222222222222222,7.428571428571428
1028.0,14.770000000000008,16.190476190476186,7.222222222222222,7.428571428571428
1029.0,14.770000000000008,16.190476190476186,7.222222222222222,7.428571428571428
1030.0,14.770000000000008,16.190476190476186,7.222222222222222,7.428571428571428
1031.0,14.770000000000008,16.190476190476186,7.222222222222222,7.428571428571428
1032.0,14.770000000000008,16.190476190476186,7.222222222222222,7.428571428571428
1033.0,14.770000000000008,16.190476190476186,7.222222222222222,7.428571428571428
1034.0,14.770000000000008,16.190476190476186,7.222222222222222,7.428571428571428
1035.0,14.770000000000008,16.190476190476186,7.222222222222222,7.428571428571428
1036.0,14.770000000000008,16.190476190476186,7.222222222222222,7.428571428571428
1037.0,14.770000000000008,16.190476190476186,7.222222222222222,7.428571428571428
1038.0,14.770000000000008,16.190476190476186,7.222222222222222,7.428571428571428
1039.0,14.770000000000008,16.190476190476186,7.222222222222222,7.428571428571428
1040.0,14.770000000000008,16.190476190476186,7.222222222222222,7.428571428571428
1041.0,15.770000000000008,17.190476190476193,8.222222222222221,8.428571428571429
1042.0,15.770000000000008,17.190476190476193,8.222222222222221,8.428571428571429
1043.0,15.770000000000008,17.190476190476193,8.222222222222221,8.428571428571429
1044.0,15.770000000000008,17.190476190476193,8.222222222222221,8.428571428571429
1045.0,15.770000000000008,17.190476190476193,8.222222222222221,8.428571428571429
1046.0,15.770000000000008,17.190476190476193,8.222222222222221,8.428571428571429
1047.0,15.770000000000008,17.190476190476193,8.222222222222221,8.428571428571429
1048.0,15.770000000000008,17.190476190476193,8.222222222222221,8.428571428571429
1049.0,15.770000000000008,17.190476190476193,8.222222222222221,8.428571428571429
1050.0,15.770000000000008,17.190476190476193,8.222222222222221,8.428571428571429
1051.0,15.770000000000008,17.190476190476193,8.222222222222221,8.428571428571429
1052.0,15.770000000000008,17.190476190476193,8.222222222222221,8.428571428571429
1053.0,15.770000000000008,17.190476190476193,8.222222222222221,8.428571428571429
1054.0,15.770000000000008,17.190476190476193,8.222222222222221,8.428571428571429
1055.0,15.770000000000008,17.190476190476193,8.222222222222221,8.428571428571429
1056.0,15.770000000000008,17.190476190476193,8.222222222222221,8.428571428571429
1057.0,15.770000000000008,17.190476190476193,8.222222222222221,8.428571428571429
1058.0,15.770000000000008,17.190476190476193,8.222222222222221,8.428571428571429
1059.0,15.770000000000008,17.190476190476193,8.222222222222221,8.428571428571429
1060.0,15.770000000000008,17.190476190476193,8.222222222222221,8.428571428571429
1061.0,15.770000000000008,17.190476190476193,8.222222222222221,8.428571428571429
1062.0,15.770000000000008,17.190476190476193,8.222222222222221,8.428571428571429
1063.0,15.770000000000008,17.190476190476193,8.222222222222221,8.428571428571429
1064.0,15.675000000000006,17.077380952380963,8.222222222222221,8.428571428571429
1065.0,15.675000000000006,17.077380952380963,8.222222222222221,8.428571428571429
1066.0,15.675000000000006,17.077380952380963,8.222222222222221,8.428571428571429
1067.0,15.675000000000006,17.077380952380963,8.222222222222221,8.428571428571429
1068.0,15.675000000000006,17.077380952380963,8.222222222222221,8.428571428571429
1069.0,15.675000000000006,17.077380952380963,8.222222222222221,8.428571428571429
1070.0,15.580000000000002,16.96428571428572,8.222222222222221,8.428571428571429
1071.0,15.580000000000002,16.96428571428572,8.222222222222221,8.428571428571429
1072.0,15.580000000000002,16.96428571428572,8.222222222222221,8.428571428571429
1073.0,15.580000000000002,16.96428571428572,8.222222222222221,8.428571428571429
1074.0,15.580000000000002,16.96428571428572,8.222222222222221,8.428571428571429
1075.0,15.474999999999996,16.839285714285726,8.222222222222221,8.428571428571429
1076.0,15.474999999999996,16.839285714285726,8.222222222222221,8.428571428571429
1077.0,15.474999999999996,16.839285714285726,8.222222222222221,8.428571428571429
1078.0,15.474999999999996,16.839285714285726,8.222222222222221,8.428571428571429
1079.0,15.474999999999996,16.839285714285726,8.222222222222221,8.428571428571429
1080.0,15.474999999999996,16.839285714285726,8.222222222222221,8.428571428571429
1081.0,15.474999999999996,16.839285714285726,8.222222222222221,8.428571428571429
1082.0,15.474999999999996,16.839285714285726,8.222222222222221,8.428571428571429
1083.0,15.474999999999996,16.839285714285726,8.222222222222221,8.428571428571429
1084.0,15.474999999999996,16.839285714285726,8.222222222222221,8.428571428571429
1085.0,15.474999999999996,16.839285714285726,8.222222222222221,8.428571428571429
1086.0,15.474999999999996,16.839285714285726,8.222222222222221,8.428571428571429
1087.0,15.474999999999996,16.839285714285726,8.222222222222221,8.428571428571429
1088.0,15.474999999999996,16.839285714285726,8.222222222222221,8.428571428571429
1089.0,15.474999999999996,16.839285714285726,8.222222222222221,8.428571428571429
1090.0,15.474999999999996,16.839285714285726,8.222222222222221,8.428571428571429
1091.0,15.474999999999996,16.839285714285726,8.222222222222221,8.428571428571429
1092.0,15.474999999999996,16.839285714285726,8.222222222222221,8.428571428571429
