"tick","Other_happiness","EV_happiness"
1.0,0.48206974610547393,0.38710372501798196
2.0,0.48289462858920446,0.47169657185033903
3.0,0.4801075733455027,0.4899046080437101
4.0,0.48222695985473346,0.4921118590399065
5.0,0.483437197978892,0.49378272134428147
6.0,0.48128492135264517,0.4946970160582132
7.0,0.48257759200107353,0.4687423433577511
8.0,0.48429711063403963,0.4921118590399065
9.0,0.48097945606894266,0.4341727303661692
10.0,0.48543607681785966,0.4953260189568074
11.0,0.48485676985733006,0.39857651737117206
12.0,0.4844701806944426,0.4232481498474199
13.0,0.48097091336791636,0.47626132742751376
14.0,0.48232852284442895,0.4788373363417568
15.0,0.482162749543771,0.4953260189568074
16.0,0.48531457767480896,0.3897209022351387
17.0,0.4819954415170668,0.4781588257306008
18.0,0.4786614326930039,0.4745771745795233
19.0,0.4826794523956682,0.49327334425755204
20.0,0.4808916781874432,0.4899046080437101
21.0,0.4847026196813668,0.493923576579746
22.0,0.48271907855856,0.4954668741922719
23.0,0.48452387586746865,0.4927787982900778
24.0,0.4837517773128009,0.4761873159223832
25.0,0.48180955611189497,0.493923576579746
26.0,0.482783742546113,0.4855955945637813
27.0,0.4826905995996556,0.49378272134428147
28.0,0.4823370071838936,0.49336514886417937
29.0,0.4807111533645444,0.46860148812228647
30.0,0.4818357533984175,0.49322429362871467
31.0,0.48551801400316164,0.4916809960161887
32.0,0.4812558140258668,0.4855955945637813
33.0,0.48453330465281236,0.48127422835206685
34.0,0.4831327293286673,0.4918919826653696
35.0,0.4849701707517928,0.48462924350443237
36.0,0.4804764737215356,0.482945090656442
37.0,0.4838290578812081,0.43515031963527206
38.0,0.4854236187520728,0.4375948436705251
39.0,0.48257643908058234,0.482945090656442
40.0,0.48473313950238034,0.4506147168746222
41.0,0.4850254688821728,0.493923576579746
42.0,0.48462038553849396,0.4855955945637813
43.0,0.48391602528614536,0.484488388268968
44.0,0.48442805172264053,0.4451887509964941
45.0,0.4844861296393612,0.493923576579746
46.0,0.48195683945724355,0.4954668741922719
47.0,0.4847725664356979,0.43876581583496677
48.0,0.4815664264811568,0.44269461999199416
49.0,0.48107102618595116,0.49648750417445303
50.0,0.4832394242083628,0.4899046080437101
51.0,0.480534321550043,0.4870418038906256
52.0,0.4817885956255741,0.48462924350443237
53.0,0.4827999335442142,0.49378272134428147
54.0,0.48187698277814384,0.49315371844568734
55.0,0.48451986182363826,0.4740677974927939
56.0,0.48346259171963823,0.47590059581751215
57.0,0.4809770962184833,0.49378272134428147
58.0,0.48651903415268116,0.49535988905093664
59.0,0.4836415013824648,0.4850769543243866
60.0,0.48373947326474426,0.49242425079261665
61.0,0.48173474596186877,0.49603351491823783
62.0,0.4838096812927215,0.48153658799917737
63.0,0.4822758020784772,0.4923094071707274
64.0,0.48430560228364095,0.47314325078512887
65.0,0.48434789463367417,0.49483956022769504
66.0,0.48122204434336446,0.4914060297792253
67.0,0.4830314403585761,0.4918312391156718
68.0,0.4807356499252939,0.4983506713388061
69.0,0.479612858889683,0.49483956022769504
70.0,0.4815851154303895,0.4951643388233299
71.0,0.48313158456108274,0.49630322052490494
72.0,0.4816201347639926,0.486735070510566
73.0,0.4813402971019842,0.4767858799627436
74.0,0.48308255282113455,0.48147902349518695
75.0,0.4846585879164453,0.4940900323398013
76.0,0.48397333918900987,0.4790457241412397
77.0,0.4796139793533428,0.4915695088109099
78.0,0.4844448759457472,0.48956574311658657
79.0,0.47728442779304814,0.4936005342740798
80.0,0.4819699650748194,0.4851623397954964
81.0,0.4847171314875852,0.47682011778122685
82.0,0.4862363926170571,0.4911478562291231
83.0,0.4821053270588067,0.49570924136241057
84.0,0.48477226874720397,0.48812289988092283
85.0,0.48415636029678544,0.47954816759718166
86.0,0.48233823792479735,0.47669174627672245
87.0,0.4854067002111551,0.4915305446319249
88.0,0.48308418896885885,0.4775437258982068
89.0,0.48062373664345975,0.49453033436881716
90.0,0.4828247712779644,0.45876866342221606
91.0,0.48175852581624956,0.4946289330336427
92.0,0.4837563253723762,0.4583777640213197
93.0,0.48344726790368747,0.47889181067906367
94.0,0.48220609491872435,0.4803489986753971
95.0,0.4816286704320405,0.48135137383715176
96.0,0.48426728743878966,0.416790258596216
97.0,0.4829271266026456,0.4869532962678604
98.0,0.4835158563080771,0.4934500260400493
99.0,0.4821815013129908,0.4822653586270798
100.0,0.4849977638678425,0.45675086941909987
101.0,0.47955972311848283,0.4771208356884731
102.0,0.47935199566992764,0.4946289330336427
103.0,0.48329816885105054,0.48280036258916226
104.0,0.483520692055798,0.4536407367009231
105.0,0.4854750103533148,0.4934500260400493
106.0,0.4839408902184306,0.48869461923740204
107.0,0.48464805816099843,0.40727674945468134
108.0,0.48153925840491363,0.45447853125388316
109.0,0.4871581541501127,0.43000044240598684
110.0,0.4841236048914225,0.4816812629909773
111.0,0.4797254204645179,0.49228042242698666
112.0,0.4848939100619426,0.486553093486433
113.0,0.48061664432133944,0.49336073075575465
114.0,0.4828567300236444,0.4786563066427771
115.0,0.481976077845891,0.48244766048509635
116.0,0.48165045792789457,0.49413943496792073
117.0,0.48052087494273854,0.48398343280190326
118.0,0.4805598078588768,0.49570924136241057
119.0,0.48124983162131013,0.49179247462027254
120.0,0.4851065753536713,0.4846047856612043
121.0,0.4821220306340572,0.49570924136241057
122.0,0.4814541411125715,0.4786563066427771
123.0,0.4855228373675204,0.4557678236698317
124.0,0.4823768819960006,0.49570924136241057
125.0,0.48033322231724623,0.4882990910977065
126.0,0.48125528250429833,0.4558861784133238
127.0,0.4836261156347968,0.4538402101762402
128.0,0.4810552723671213,0.49345932942057996
129.0,0.47913329792985343,0.4828850891509765
130.0,0.4814421074506222,0.4204821764550214
131.0,0.48366182568771743,0.48812289988092283
132.0,0.48252755992220364,0.48996894923552964
133.0,0.48222295584505304,0.48551272376779037
134.0,0.4790325996306753,0.4960993103294641
135.0,0.48562840652580114,0.478082056480027
136.0,0.48327982321316104,0.4874933164766041
137.0,0.48214891713442937,0.4891130011055432
138.0,0.4814314708857742,0.4872868788156369
139.0,0.4844803582276324,0.48539500101941807
140.0,0.48278616958789716,0.47861604969371063
141.0,0.48413902737288805,0.4770187804681516
142.0,0.4833366229253065,0.49489611298833835
143.0,0.48138890174185156,0.48551272376779037
144.0,0.484030172167045,0.49230049511993185
145.0,0.4840514240841956,0.46461760404615055
146.0,0.4825633257966613,0.48643233669898017
147.0,0.48122109707930033,0.48654663997680103
148.0,0.4845589663769869,0.48551272376779037
149.0,0.48253833978423,0.48673246259184066
150.0,0.48526765415597667,0.4805966424025248
151.0,0.4851256191134734,0.46886480449285006
152.0,0.480907587239613,0.4946722136072005
153.0,0.48199391714101336,0.49298220220635147
154.0,0.48427628751727575,0.4597889306089378
155.0,0.4809764812641839,0.4550942934963519
156.0,0.4826796693352308,0.4926580531511601
157.0,0.4782770510888674,0.4877755395331209
158.0,0.4852219482963813,0.45116031061178413
159.0,0.48383175129689,0.47974073927546856
160.0,0.48295469942557284,0.43274887547031704
161.0,0.4781685663448621,0.49600967517962324
162.0,0.48113208226258786,0.4876356182038702
163.0,0.48053198932522073,0.48920263625538457
164.0,0.4813440686083909,0.4960993103294641
165.0,0.48072209231943314,0.49502757669892467
166.0,0.47914487751418905,0.4945376669772512
167.0,0.48190042183450094,0.46666297853872385
168.0,0.4812894797053739,0.49585633880544966
169.0,0.48223485003821503,0.49264932156658414
170.0,0.4826169532580391,0.4864215828460648
171.0,0.4824294384390735,0.4794719814471424
172.0,0.4830728111535636,0.45916438342269317
173.0,0.48408269475129273,0.4820035953539254
174.0,0.4811091146072649,0.45548929427911333
175.0,0.48360877548780706,0.44450648150279176
176.0,0.4823574850882159,0.44111992367120834
177.0,0.481834190511037,0.4821584151037352
178.0,0.48294173687995245,0.49197269347836353
179.0,0.4803050890225248,0.4602351213368756
180.0,0.48091040607689656,0.48275467167370406
181.0,0.4807253050438605,0.4824019733739577
182.0,0.4794772919024377,0.4929779933379452
183.0,0.48130493038953487,0.46383162796685357
184.0,0.47920619881872517,0.4820660433520975
185.0,0.4855054262332674,0.4956886987944936
186.0,0.4846580502546102,0.49695236824315187
187.0,0.4807857380143571,0.465147285197683
188.0,0.48661283324742527,0.49153355289923195
189.0,0.4832142296215734,0.4954094849367106
190.0,0.48292743648424213,0.4868455679908337
191.0,0.4793375695268242,0.4971555436936082
192.0,0.4852945388795603,0.48639787560584213
193.0,0.480007468669952,0.4961747385404985
194.0,0.4768789307982223,0.4948696644033258
195.0,0.4842631969185179,0.48851977887051234
196.0,0.48239517377174596,0.4780184597145855
197.0,0.4872399726250876,0.41896326386509136
198.0,0.4804613247221094,0.4900386208075063
199.0,0.4829819183256984,0.4875688193583328
200.0,0.4820324298230327,0.4852728858941973
201.0,0.4837455506345604,0.47367942701258875
202.0,0.48432334304471386,0.49643533814109636
203.0,0.4829372804080556,0.49643533814109636
204.0,0.48045110808482866,0.4966581295072775
205.0,0.4823341239756399,0.4966581295072775
206.0,0.48162636284079835,0.49075514576108814
207.0,0.4876858553891329,0.4620672758956642
208.0,0.4836012943825659,0.49048079573739034
209.0,0.48224806662229047,0.4819418002560078
210.0,0.479678502681195,0.49717907160429287
211.0,0.48464760592289835,0.4940269643095024
212.0,0.48106385859921613,0.4856030060093061
213.0,0.4798895251502209,0.4920133088594173
214.0,0.4816706838310233,0.4894158144471467
215.0,0.4813873666695414,0.48994938009011596
216.0,0.4809239168104029,0.4964547916049116
217.0,0.482935902300578,0.45418174478437223
218.0,0.47831902086038586,0.49736022035676464
219.0,0.47711656438524835,0.49357364506353035
220.0,0.4831884053796066,0.4891214332885684
221.0,0.4816016425167332,0.47085291510641786
222.0,0.4819140147484686,0.48697165685826094
223.0,0.4821137032353206,0.45889437519684384
224.0,0.4822817525074462,0.4920425921957986
225.0,0.48395048613355546,0.481058796978377
226.0,0.48448275157071424,0.4868025900786899
227.0,0.48303777287122746,0.4918112101257416
228.0,0.4819190067603125,0.4917505870836802
229.0,0.48116247329351053,0.4839841236006923
230.0,0.4831199152803377,0.47103052502593834
231.0,0.48108174221822164,0.4906647979973047
232.0,0.48061958787255105,0.46081452949648644
233.0,0.4797128810545158,0.4928570193564923
234.0,0.478023401255933,0.4614458527168633
235.0,0.4803580358948046,0.49412237526868
236.0,0.4755712231614547,0.47475064386741234
237.0,0.4830185249331743,0.4773860982293105
238.0,0.4834102369556982,0.4862710436530531
239.0,0.48282723007530676,0.4973652786766322
240.0,0.47982245704582266,0.49465955396533656
241.0,0.483027812615583,0.47934860715862554
242.0,0.48110080431901614,0.4778676125346501
243.0,0.4774541721741068,0.49145956455713863
244.0,0.48489452752914075,0.4758189427292724
245.0,0.4833079557882281,0.4929422351398365
246.0,0.4837655229625421,0.47333260030034097
247.0,0.4853809127570186,0.4624401866600958
248.0,0.48242952344345225,0.4782439660493572
249.0,0.4789822485377971,0.4959603057852264
250.0,0.48478608003023127,0.44841067081875335
251.0,0.4840106222356941,0.4962582755350063
252.0,0.48174844955377627,0.4972034793386358
253.0,0.48249283565095136,0.48852775210530136
254.0,0.4836407776977515,0.4853056285105932
255.0,0.475308331308672,0.4908597553312285
256.0,0.4782285145991152,0.49747424641992194
257.0,0.48325395156174183,0.4795955989585109
258.0,0.4791417399007258,0.4688612373578901
259.0,0.47817855084257505,0.49191511023496187
260.0,0.4810638222448816,0.4676361917046993
261.0,0.48069462746475594,0.49380515122867824
262.0,0.47902333720525236,0.48966143649820143
263.0,0.4787482394447728,0.49400881658638934
264.0,0.4815945014749352,0.4906560451869681
265.0,0.480635790423426,0.4955443094533541
266.0,0.4852230972545957,0.46432315850931977
267.0,0.47690121480069353,0.4936919813197476
268.0,0.48014078682623007,0.4832361274126503
269.0,0.48382913622147206,0.4878786360149545
270.0,0.480305396024912,0.47075321326665803
271.0,0.4834024255585033,0.48469130062959603
272.0,0.4808000120563151,0.49312302901277816
273.0,0.48097123270443304,0.4902666613662058
274.0,0.47387086909560316,0.4819688134638655
275.0,0.47868510220988814,0.4937125466622052
276.0,0.4776704551173609,0.47994125012442135
277.0,0.48436299132345784,0.4819331268508747
278.0,0.4792382417177598,0.49349041569038227
279.0,0.48254853563284683,0.48324966048153856
280.0,0.48244233462377434,0.47173846834171507
281.0,0.48553630298389466,0.4780136595877422
282.0,0.4842915507339148,0.48451444663654186
283.0,0.4767037178127098,0.49256638680694936
284.0,0.4804910219312072,0.47342970324642863
285.0,0.4788331750364983,0.4846573585096776
286.0,0.4817436442511708,0.4917688841073648
287.0,0.4797415787210065,0.47577957094551815
288.0,0.48155969921524394,0.49026209250831887
289.0,0.4836470970545571,0.4857705476785511
290.0,0.47911302716703474,0.48739045458661834
291.0,0.4796740451296358,0.49319190470551955
292.0,0.48574955363314676,0.47142987969108635
293.0,0.4811473679142289,0.4928295895319891
294.0,0.4834926354055897,0.4865213445242776
295.0,0.48328734188334704,0.47450047960130226
296.0,0.48124820006515023,0.48302280263700326
297.0,0.48097213762149776,0.48396998928324164
298.0,0.4804642655814627,0.4917920684340756
299.0,0.47852471501712357,0.48961469392929885
300.0,0.47900023712348955,0.49693285436008927
301.0,0.4869186176037297,0.47370159752606056
302.0,0.4835213912466989,0.4891025359270425
303.0,0.47829456097268036,0.4661723962141517
304.0,0.48645981044522807,0.48943176674393196
305.0,0.4749134482182708,0.4912497996778786
306.0,0.4796635760578008,0.4920508170169134
307.0,0.4814869024680328,0.4834345421896907
308.0,0.47771737806344483,0.48876039550759437
309.0,0.4816377304563596,0.4895894561690924
310.0,0.4811994765512505,0.4950418450917679
311.0,0.484883235337188,0.4765835921526939
312.0,0.4800606199484286,0.48501802151734436
313.0,0.482114315103691,0.48460762980958205
314.0,0.4812781384090614,0.48971321778919125
315.0,0.48180928820203933,0.4818821856135427
316.0,0.48029437115801504,0.49135533737970216
317.0,0.48336486744702456,0.48546982411594886
318.0,0.4779481477086255,0.4879259724263797
319.0,0.4751078837439798,0.4886969782550919
320.0,0.4763166142915528,0.4909072201714789
321.0,0.48342962233546577,0.4861815606146254
322.0,0.48137383208810025,0.4826308059946488
323.0,0.4782079520213207,0.4840182382417168
324.0,0.4824731568551571,0.4638580654321614
325.0,0.47282255668834816,0.49245607030403
326.0,0.48212362356643573,0.488511169741832
327.0,0.4743646258567702,0.49447883712723456
328.0,0.47651864919991865,0.4874922267663571
329.0,0.4822240022539101,0.4879383150867753
330.0,0.47976401737447205,0.4904321436914025
331.0,0.47859222778913535,0.4907992262007618
332.0,0.4812878524166161,0.49058500374219344
333.0,0.47918515574073106,0.49371470025960207
334.0,0.4800933113496128,0.4959721809870617
335.0,0.48439722358640364,0.48396422624615715
336.0,0.4820203490384594,0.475400082663165
337.0,0.48304193472378043,0.4753935771042448
338.0,0.47337712179907365,0.49293956864497634
339.0,0.4716478945255117,0.49393198600936394
340.0,0.4778041700258203,0.4922430822192185
341.0,0.477022647119062,0.49555237681420167
342.0,0.4776392756435656,0.48693713609262357
343.0,0.4729110708016868,0.49084909097558926
344.0,0.47777062255054226,0.49477175332294054
345.0,0.47611133638498054,0.4918726316202993
346.0,0.48245671029308307,0.4768367456983589
347.0,0.47988797120802495,0.4787607643852733
348.0,0.47732295156772986,0.4821337704996841
349.0,0.4785325904476642,0.4909341394527376
350.0,0.4834095163628479,0.4719884967004012
351.0,0.4804654962995662,0.4815711082357848
352.0,0.4791121479241262,0.48465587815043293
353.0,0.4781602091810794,0.4833925982309162
354.0,0.48067145332753347,0.48698366330244125
355.0,0.48283078686843883,0.48297548532939943
356.0,0.47746273686788987,0.4866565793378274
357.0,0.48068394723237,0.48420246444059173
358.0,0.47847870654754365,0.48522149028973316
359.0,0.4836357262656254,0.4817800042106775
360.0,0.478192353323042,0.4896797555199098
361.0,0.47974527396818367,0.47760801800493263
362.0,0.4764935081902878,0.49222622133259986
363.0,0.48298889670265993,0.4795183263176006
364.0,0.4820500268255248,0.48277816483595754
365.0,0.48040672819798363,0.4767896665521207
366.0,0.4808118729561674,0.47330051089643493
367.0,0.48289578433432195,0.4783791616153938
368.0,0.4792212584155625,0.4937205566655581
369.0,0.4796023896418989,0.474980774673528
370.0,0.4759101349830371,0.48942453306707034
371.0,0.4809182546889717,0.4897169040314175
372.0,0.47505615753864616,0.49154644055068314
373.0,0.47782249218104517,0.49194201409381194
374.0,0.4775923463690269,0.48426736380974683
375.0,0.4810330092488412,0.4829583247402301
376.0,0.4800481944697387,0.49164853577668033
377.0,0.4790106021534752,0.4760767443154904
378.0,0.4833244519164123,0.4734541764966286
379.0,0.4780412932664328,0.48566716538281895
380.0,0.4785267722012335,0.4937212830369472
381.0,0.47989083996356097,0.48548731407801415
382.0,0.4786520117978793,0.4786396922439519
383.0,0.4819540911431724,0.4847516649979788
384.0,0.4797490732277949,0.47022257717887433
385.0,0.47891820762414794,0.48235640576999395
386.0,0.4739086607460334,0.48632180461794006
387.0,0.47969197709603667,0.4904732804501611
388.0,0.48262170134650967,0.481258929165446
389.0,0.4795332774892615,0.48500533373065974
390.0,0.4782611952139512,0.4888211984745286
391.0,0.4782742428167698,0.486389043030447
392.0,0.4783294069091915,0.48916803996267605
393.0,0.4776769754890276,0.4808812807812475
394.0,0.4755651889384471,0.48559984522886185
395.0,0.47661565102340336,0.47764375636071676
396.0,0.4818638798641224,0.4781663798393013
397.0,0.479760562450261,0.4784340921791068
398.0,0.476325433236839,0.4866738707484578
399.0,0.4785363442336503,0.4883702090823449
400.0,0.4817587483519799,0.4752303619907115
401.0,0.4801750228354314,0.4839051923757605
402.0,0.4816426269556192,0.48196231250629884
403.0,0.47508581567514474,0.4785034058290255
404.0,0.47772786574322035,0.48315723397218907
405.0,0.47946631598176837,0.4847841440909856
406.0,0.47982330532578527,0.47779723825477743
407.0,0.4734919280394737,0.48984411823608454
408.0,0.4808186047081435,0.47717304221713985
409.0,0.4827354506411498,0.47405064794638696
410.0,0.4788551621721994,0.47892968605371417
411.0,0.48113524874135805,0.4849945876700594
412.0,0.4785786936706087,0.47578469814152585
413.0,0.4822167836397696,0.47557178209426054
414.0,0.4785654379294039,0.47909662351213883
415.0,0.4836026205681706,0.48479976724774637
416.0,0.48219628216804755,0.4791421843484518
417.0,0.48005042272989246,0.4840423534474262
418.0,0.4791746346263423,0.4717817832661724
419.0,0.47765632776363953,0.48218624452756315
420.0,0.4784580853156474,0.4855545762705362
421.0,0.47373447744868863,0.4886757915079564
422.0,0.4846152640576366,0.4768397466576
423.0,0.4757585445679648,0.48912686401810973
424.0,0.4799424520758507,0.47502842989748173
425.0,0.4722595694678519,0.493652610058849
426.0,0.4805591274174695,0.4850448749367489
427.0,0.47895336155968227,0.4870166730922573
428.0,0.48617660665335766,0.4714693205583312
429.0,0.47706723410290014,0.48087386393853093
430.0,0.4814943034869312,0.48874501313940666
431.0,0.47108886230044245,0.48715959657397284
432.0,0.47665139746121377,0.49189086010396404
433.0,0.4706496805753691,0.49063733065131465
434.0,0.47422723647504333,0.48862807277331544
435.0,0.4812624506532704,0.4881168237892003
436.0,0.4751974640292197,0.48393507224409926
437.0,0.4747773192471093,0.4906265920209726
438.0,0.4730069847151015,0.48361286296660183
439.0,0.4795017012210403,0.47780638199323805
440.0,0.4740082627761801,0.4888966624110073
441.0,0.4784362494618705,0.4806977367152913
442.0,0.48529259587268847,0.4758825669974497
443.0,0.4747949737939986,0.48735253056876743
444.0,0.4823236016732422,0.47420334910125556
445.0,0.4786046899897105,0.48916044291373534
446.0,0.4770865113828896,0.4835560625742344
447.0,0.47852056464562526,0.4897528126601757
448.0,0.4729780828869929,0.4936487568926317
449.0,0.47696948964134145,0.4916329116292548
450.0,0.4770348365418895,0.48792044403558193
451.0,0.47133146599978537,0.49195022760014745
452.0,0.4797040704124928,0.481653421020459
453.0,0.4743154642207283,0.49109338832982435
454.0,0.4790587701152262,0.4736483480456456
455.0,0.48184343860449247,0.4809348427812878
456.0,0.47696086862366727,0.4819526537025988
457.0,0.4792243712541383,0.48372674863965137
458.0,0.4786710487319997,0.4869096142317927
459.0,0.47102033762316065,0.48726621424864003
460.0,0.48250093570316743,0.4848546640550423
461.0,0.4796996335830622,0.4877968476397823
462.0,0.47891818336812875,0.48278609032088887
463.0,0.47747737791876915,0.4840888179455287
464.0,0.47579245335155546,0.4835894453328884
465.0,0.4790860068963108,0.48864652229828137
466.0,0.47893613253794215,0.48254336858440455
467.0,0.4821218401587922,0.4809492355615948
468.0,0.4757333131555981,0.48303571527145583
469.0,0.47675590327579753,0.487933173736746
470.0,0.4846823861827058,0.4772536283491456
471.0,0.48266921328062573,0.4771531144752599
472.0,0.47842741379565745,0.48578682678336105
473.0,0.4781460713232149,0.4846538780727635
474.0,0.48058056857899484,0.4870449186411704
475.0,0.47805459832968467,0.48804449670888234
476.0,0.48167581189063463,0.4752477285523941
477.0,0.4793509769181267,0.4799920069051238
478.0,0.4784422161697239,0.4788923646740688
479.0,0.47780485504201975,0.48761363696618226
480.0,0.47662232202200233,0.47450089966272574
481.0,0.475577291316181,0.4835009936106771
482.0,0.4715507575391603,0.48978136983355247
483.0,0.479505835545427,0.4793653901313887
484.0,0.47795945410823576,0.4895598377308233
485.0,0.4806537086013363,0.4694389935765311
486.0,0.47985673610350144,0.47939169542960347
487.0,0.48262542686235055,0.4826188328555171
488.0,0.47596605655014174,0.48477237082343366
489.0,0.4770503037115036,0.4819240829605806
490.0,0.48027848992086997,0.4794854223354513
491.0,0.48159001991632816,0.47445085282456173
492.0,0.4786353610126951,0.4765965084560524
493.0,0.48309264732659013,0.47819074872110084
494.0,0.48079058565855254,0.47944852013106565
495.0,0.4721813487873073,0.483994216508043
496.0,0.4722198703293192,0.49115745116277215
497.0,0.4755626419246373,0.4890943445370288
498.0,0.4840425722779673,0.4759066760373549
499.0,0.4878707295475691,0.47760104242197327
500.0,0.48381117317325006,0.4808297434771334
501.0,0.4786928048801226,0.48096871017610376
502.0,0.4821305719961931,0.48020516217979214
503.0,0.4828173183719731,0.47734736017797647
504.0,0.48075249107467927,0.48632703078543993
505.0,0.47535878990613795,0.4822754905192251
506.0,0.48044659746120644,0.47763638117549606
507.0,0.48098289939990013,0.47921227581621406
508.0,0.48153222913153304,0.48185938507435544
509.0,0.48340863256200733,0.4798026709039346
510.0,0.47494755408246564,0.4858177878219385
511.0,0.4869778644515704,0.46857689773839983
512.0,0.48087297979492216,0.4744047237264009
513.0,0.48551501425122856,0.4776675221454729
514.0,0.47883152168353826,0.48402148655431887
515.0,0.48155925304057084,0.4799801568496845
516.0,0.4778127873153688,0.48320432508769806
517.0,0.47423139848423423,0.4862332889528659
518.0,0.47802417803741803,0.4863998067144217
519.0,0.47629546267957557,0.47849056139624985
520.0,0.47544759673098264,0.4831293790445707
521.0,0.4809448439584468,0.48965531051729927
522.0,0.48086736008943815,0.4728882877246435
523.0,0.4764823368929684,0.47981088140996925
524.0,0.48202484355795155,0.4830307280618148
525.0,0.4743420480271562,0.4883691656663754
526.0,0.4809972985092359,0.48201269816823017
527.0,0.48392533071905924,0.4788945527356062
528.0,0.4767266422777448,0.4855820007855986
529.0,0.48059737787133056,0.4818328929600199
530.0,0.4786586908959125,0.4837151287237943
531.0,0.4745112082781568,0.4871659722284503
532.0,0.47625490556933303,0.4889803443062268
533.0,0.4762944491270515,0.47310590574385414
534.0,0.47959715890214305,0.4833460239840033
535.0,0.48465232852037404,0.4733103242361649
536.0,0.47936997336115506,0.48369886880333707
537.0,0.47837494207586284,0.4734352633203058
538.0,0.4809863609010878,0.4791612245705449
539.0,0.48652132828381867,0.4773949174457009
540.0,0.4810147880899271,0.482739244610241
541.0,0.47358655203106725,0.484534486037787
542.0,0.4845340824590812,0.4757163340839567
543.0,0.4884266195327414,0.47408739158323565
544.0,0.481040339316933,0.47188212663070017
545.0,0.472270537386163,0.48531146187324326
546.0,0.4821650981686549,0.4783168558276805
547.0,0.4832591813686229,0.4828117149732483
548.0,0.4799626128079149,0.477192469870285
549.0,0.4738551654898373,0.481967877302667
550.0,0.47396378601311623,0.4860576555572549
551.0,0.48394366051202276,0.4787917654425329
552.0,0.47264984406624333,0.48739431014946244
553.0,0.4824698692746728,0.4775206428764053
554.0,0.4729718424391578,0.48759287645877036
555.0,0.4829833529494113,0.4744678870358841
556.0,0.4778829436352867,0.4859379860264398
557.0,0.48413805935217735,0.47798521972690455
558.0,0.4866281128612302,0.4711801130017878
559.0,0.48261689833586,0.48227552758328307
560.0,0.4814167135743405,0.47702804479381616
561.0,0.48200388206772105,0.47310287805002643
562.0,0.4810518022039565,0.48217464513822406
563.0,0.47992664191087325,0.48866081916455506
564.0,0.4774089938005247,0.47522157137510346
565.0,0.48081274928384055,0.4809913466560814
566.0,0.4758041321355279,0.48284461081960417
567.0,0.47655027784521126,0.4774897899821112
568.0,0.48292668364263697,0.4798556145219687
569.0,0.4788342691679029,0.4854816917280024
570.0,0.47760694969913386,0.4854834622182085
571.0,0.47751009912152337,0.4753218951952415
572.0,0.4828137458959702,0.48335569060025135
573.0,0.482489102456637,0.47656150150055526
574.0,0.47775738922560307,0.48971184950143176
575.0,0.48010384960572283,0.47472390068815934
576.0,0.4826861278269011,0.48580717874327123
577.0,0.4798127564301753,0.47459689540246547
578.0,0.4811010372380827,0.48126582365577775
579.0,0.4815246262500236,0.4721181221570905
580.0,0.477189119467544,0.4815117483913854
581.0,0.48091218209428904,0.480977438543378
582.0,0.476490573461885,0.4803562420942659
583.0,0.48377620168371166,0.4753862849683955
584.0,0.47484203465911545,0.474048161033732
585.0,0.4747777470242817,0.48752639581784124
586.0,0.4744682191743563,0.4870121231992811
587.0,0.4816726321662023,0.47470348662619827
588.0,0.47379944707167587,0.48252814690135387
589.0,0.48105821942930854,0.48088002878962033
590.0,0.4762053384058818,0.4830243637295323
591.0,0.4804325527525154,0.47687998889592476
592.0,0.48133641497812346,0.483952728694984
593.0,0.47737868805333583,0.4864021580775604
594.0,0.48653179297906607,0.4741408737243909
595.0,0.4767483738142129,0.48447357355276416
596.0,0.4835913411841064,0.48182365438998387
597.0,0.4783222923074672,0.47756995895043414
598.0,0.47848246701857006,0.48267360600894904
599.0,0.4784377087075097,0.4754512400210719
600.0,0.4755378028273209,0.4823431079491236
601.0,0.4815533263471009,0.4794817347160588
602.0,0.4755203830528577,0.47897932076351146
603.0,0.48131375115120756,0.47484846665042174
604.0,0.483885652057184,0.4762928768001075
605.0,0.47812714082796115,0.476380479450118
606.0,0.47293113329743547,0.48413605059386133
607.0,0.479039424341154,0.48043300907322684
608.0,0.4787566280636067,0.47892648943586774
609.0,0.47884001745327376,0.48670042419837495
610.0,0.4841618526042159,0.48059880409111694
611.0,0.48372877773561956,0.47409690672136323
612.0,0.4832544275502009,0.479344658606934
613.0,0.4768393950955689,0.48722442088531254
614.0,0.4700646176158238,0.4892800988212731
615.0,0.4843343025297041,0.4847734602934952
616.0,0.4820776622508138,0.47908026697777545
617.0,0.47934111112074484,0.47896080116233475
618.0,0.47585390172098546,0.48968770575102777
619.0,0.47243722982581576,0.48106453131329185
620.0,0.4768202871693365,0.4786705793940842
621.0,0.47779390008445327,0.4793409083532026
622.0,0.4741491824443316,0.4801008969095516
623.0,0.4780100576352173,0.4789646416302158
624.0,0.4790685238478807,0.478769758206153
625.0,0.47295279948808194,0.4851468438925497
626.0,0.468873659341176,0.4865174747894545
627.0,0.4682073869958487,0.48416645982790957
628.0,0.475127801035657,0.4835646547223385
629.0,0.4775620239579431,0.4862124110396253
630.0,0.47591280036176536,0.48021782036610694
631.0,0.4777226726901905,0.4783228620880804
632.0,0.47913294606920853,0.48287723821870876
633.0,0.47133152199595063,0.4876338033890378
634.0,0.4848253380999226,0.48177291099928504
635.0,0.48020555688388233,0.4737351395739423
636.0,0.4684751932470743,0.48602124291390914
637.0,0.4795462517884309,0.48640314624276093
638.0,0.47606297638799183,0.4824044568524801
639.0,0.48113585684187427,0.4800459632216134
640.0,0.4751274472317311,0.482090380711185
641.0,0.46747301292910526,0.4849921027266041
642.0,0.4866538752394989,0.4793877730364095
643.0,0.47996670395405217,0.4828527063100009
644.0,0.475455708697945,0.48832099592315126
645.0,0.4765376920819808,0.4823501045719268
646.0,0.46687491495494443,0.48537004126322203
647.0,0.4721377985479987,0.4899102254933078
648.0,0.47668031291187063,0.48068146349237256
649.0,0.47717348207849397,0.48125748661493045
650.0,0.4753174915871662,0.48201133624663456
651.0,0.47937526090170396,0.47814596058651454
652.0,0.4814208663660384,0.48067226622559667
653.0,0.4759197168287682,0.47838596139651735
654.0,0.47917111615053465,0.4753391108686162
655.0,0.48441269357296574,0.47543877648884225
656.0,0.4811391587999999,0.480718238609631
657.0,0.47819116682070595,0.47331519493275825
658.0,0.48532717521557506,0.4758003515260535
659.0,0.46718800666955307,0.4874284637397028
660.0,0.46213328177865465,0.48775304208823433
661.0,0.47477246685176866,0.48489491286733244
662.0,0.4822684053570355,0.4754537953063807
663.0,0.48504271531891485,0.4805250761203181
664.0,0.4696133862307893,0.4839025039021524
665.0,0.4795773882743009,0.48134991020807516
666.0,0.4755062144381694,0.48533775731215545
667.0,0.48044532525756795,0.48236822836988796
668.0,0.48566596787064237,0.4725406172169618
669.0,0.47760134900336154,0.4852151556186202
670.0,0.48335914617536996,0.47732654594215607
671.0,0.4724852548599972,0.48243851121441383
672.0,0.4801914987521526,0.4764710262807073
673.0,0.475657242616621,0.4748211849567645
674.0,0.48531166503734613,0.47848946462325587
675.0,0.47853488450722564,0.4875597989778264
676.0,0.4786457481804094,0.4751217238453615
677.0,0.4769212687455371,0.4771255575859274
678.0,0.4748559917506678,0.4833733582780709
679.0,0.46941635656130326,0.484590480602858
680.0,0.4887312483022953,0.4804146398659138
681.0,0.47767751639604045,0.4836199154562133
682.0,0.47727636562501674,0.48257508454751025
683.0,0.4742461525276153,0.48016665087603627
684.0,0.47932506060244606,0.48436345835235317
685.0,0.48635431648922084,0.4757782995672754
686.0,0.4794268280378857,0.47810597998765364
687.0,0.48115129464851414,0.47453153887893584
688.0,0.48142426964994317,0.48078258759878834
689.0,0.48206011675835003,0.4756520809099377
690.0,0.48291178624993797,0.4778003000005005
691.0,0.4812532094701804,0.4779533862864452
692.0,0.4775788843193107,0.4861111533670895
693.0,0.48127369478328597,0.48385900027464473
694.0,0.4723670209799715,0.4842262910105508
695.0,0.47825239961737614,0.47986834815811585
696.0,0.4822195993271653,0.48092718961219555
697.0,0.47463354148107184,0.4840212359475587
698.0,0.48073266200178666,0.48330138674814
699.0,0.48198630701954476,0.4790255399734443
700.0,0.48028054083649163,0.4820936641073907
701.0,0.4703455745619752,0.4876581125335938
702.0,0.47428148190303177,0.4813821955399678
703.0,0.47855872278927897,0.4848884157849828
704.0,0.48413044055828475,0.48321595321114064
705.0,0.4757784926403774,0.4820529929527165
706.0,0.4794292705219285,0.48566304670056304
707.0,0.47831448117279063,0.4834469164024476
708.0,0.4785007615330722,0.4824350666868052
709.0,0.4757308821753022,0.48402316252606437
710.0,0.4827332432310971,0.48285430361693144
711.0,0.48106968362818414,0.47519636734711845
712.0,0.48285642313040217,0.47634610714658154
713.0,0.47745739015024047,0.4819474591205627
714.0,0.4831095320459853,0.4797206105064566
715.0,0.48026470485118217,0.481113844874738
716.0,0.4783181622154906,0.4816524311156224
717.0,0.48294591441829265,0.4758041401776725
718.0,0.47971367396006365,0.48219782343777545
719.0,0.4681770289418898,0.48986472784255447
720.0,0.47821893446368147,0.481769644308488
721.0,0.4846531758681282,0.47218429577471804
722.0,0.4706739463667844,0.48524903238187955
723.0,0.48268200307060755,0.4809669539865953
724.0,0.4807062983318493,0.47417398710474284
725.0,0.4844662740926656,0.47934573012086956
726.0,0.4757451616176086,0.4840625400187517
727.0,0.4645677010854363,0.48596665139349265
728.0,0.48014595688677203,0.48330474554680375
729.0,0.4743738144974073,0.487403695982065
730.0,0.47994306463617015,0.47690646532177733
731.0,0.4859855926250773,0.48318216402901165
732.0,0.47143447346425027,0.48112273168831377
733.0,0.4717185889774069,0.48374917643022214
734.0,0.47871360743011,0.4786620644667723
735.0,0.4731630644626096,0.4839246982553931
736.0,0.4787101295571087,0.4848216808682944
737.0,0.47981203396183825,0.48150872585442067
738.0,0.4786603931681023,0.48672229381764237
739.0,0.477932264522527,0.47777417112810516
740.0,0.4679437653643676,0.486394919904274
741.0,0.48580296381757077,0.4789599972732216
742.0,0.4706861942699641,0.48387476530326023
743.0,0.47664552007810357,0.47927281088608387
744.0,0.47377242120061097,0.48809223145374203
745.0,0.4789541738290506,0.48214983620586155
746.0,0.47881698244861415,0.4783726230538037
747.0,0.47903163012179645,0.4808796006464441
748.0,0.47789195502529624,0.48096004122077535
749.0,0.4706428562235317,0.4821567805840447
750.0,0.4666637434489836,0.4894785972417613
751.0,0.4825588132286613,0.4809903163193429
752.0,0.4760576920636968,0.48236978597199887
753.0,0.4738136810229222,0.4824834130254394
754.0,0.4721660260661847,0.4860344760462737
755.0,0.47735431632146746,0.4870016208022849
756.0,0.46457101616827046,0.48764073193784546
757.0,0.4724962490877112,0.4838993836838764
758.0,0.4757069189722053,0.47918213416800814
759.0,0.47269263423186264,0.48813082844866995
760.0,0.4823080587588878,0.48164992074279467
761.0,0.47574896092182,0.4790357204855
762.0,0.48005138004152753,0.48282159026051447
763.0,0.46961040610938165,0.48055434470207214
764.0,0.48025952983116715,0.48110050627601253
765.0,0.48130122102561923,0.4843027402696105
766.0,0.48177012649314305,0.48060886653714563
767.0,0.46870175324748536,0.4780644133156845
768.0,0.47645615514464207,0.48224324840444993
769.0,0.4846747804830403,0.4825049416327016
770.0,0.4800219963171485,0.47682831405124293
771.0,0.4733626012191679,0.48460350346775527
772.0,0.47208355601799606,0.4860753649229083
773.0,0.4724627752624145,0.4829171170926824
774.0,0.4728668192083849,0.48137360549641306
775.0,0.47883660352448915,0.4773796434209783
776.0,0.4759867685634755,0.4796047938652448
777.0,0.47655574112807253,0.4832907156967537
778.0,0.480614818665252,0.48159687146919106
779.0,0.4753142688442587,0.4837546540466618
780.0,0.4837821735554318,0.4827197809319247
781.0,0.48508707748308416,0.4782023642024767
782.0,0.47558588321352613,0.48100390518261565
783.0,0.48040168748657963,0.479155307187437
784.0,0.4836879332117853,0.47559528365544873
785.0,0.4780853987968378,0.47811289839249954
786.0,0.4773291616929143,0.48060130280569363
787.0,0.4747130041955154,0.485200643741056
788.0,0.4816928471372468,0.48109679493954144
789.0,0.48317891821972736,0.4836452931802255
790.0,0.47842347831531984,0.48057234956656175
791.0,0.48349666320161644,0.48069794561737494
792.0,0.48113216792416286,0.48123182015633365
793.0,0.4760707225303677,0.48066274701415446
794.0,0.477356443027258,0.4783837176629696
795.0,0.4802748998041797,0.4831188988453354
796.0,0.4719014642574559,0.47710657896172226
797.0,0.47688563503460185,0.4816174944986612
798.0,0.48127410105160123,0.47856532139191943
799.0,0.4778675837710079,0.4830917774065313
800.0,0.4836145298755715,0.4735774925269587
801.0,0.4772869616635753,0.47673401965571605
802.0,0.47823935830315384,0.47793880711428394
803.0,0.4701577923873309,0.4852615399610267
804.0,0.4750045060097123,0.4827040852328986
805.0,0.48009460018266836,0.4785328337593356
806.0,0.47969745286853377,0.4759430470043717
807.0,0.4729439738365646,0.4838969430370764
808.0,0.47607409838810877,0.47883713815990325
809.0,0.4854174931772217,0.4749071698296588
810.0,0.47065438027665407,0.4808506112997385
811.0,0.4825308426276371,0.4766349729565309
812.0,0.48306160743543053,0.47325675845548104
813.0,0.47876459716841396,0.4829089553184158
814.0,0.4815735490001258,0.48549895531132614
815.0,0.47103251829480897,0.48479289248754315
816.0,0.48228433429117495,0.4803441772405036
817.0,0.4719640829211371,0.48571642231795814
818.0,0.4824918416296809,0.4743489482384056
819.0,0.4736820766212198,0.4838773863832785
820.0,0.47655992595970686,0.47829567250927196
821.0,0.4756808544845968,0.4843826484780145
822.0,0.474252408539339,0.48151147994834925
823.0,0.48327971214178256,0.47942488457105076
824.0,0.46429496104123347,0.4852746496355781
825.0,0.48615858356625913,0.4748867304666927
826.0,0.48300394022223986,0.47389311509369597
827.0,0.47547511070214715,0.48271975261555655
828.0,0.4779563674177337,0.4840778775483535
829.0,0.47920353823375905,0.47144117596244595
830.0,0.46936518990523374,0.4786201817958446
831.0,0.4828882557777418,0.477034269835007
832.0,0.47177176741648175,0.4825038037352983
833.0,0.4770710093265388,0.4849623602991536
834.0,0.47265749590487954,0.47903934448877517
835.0,0.4837861922033831,0.48025701393339165
836.0,0.46800769636735134,0.485536747028814
837.0,0.4776006941934198,0.4804031586941676
838.0,0.4735989090081156,0.47859391794885975
839.0,0.47922971885169646,0.48447721263211097
840.0,0.4757802280698471,0.4818802142081298
841.0,0.4720659414631316,0.4844922298303235
842.0,0.47423368351041617,0.48578020951182393
843.0,0.485200207665893,0.4800998459349635
844.0,0.47965789313259866,0.4801411773584117
845.0,0.47670313087114347,0.4804512767751007
846.0,0.4816781023371441,0.47848806343655176
847.0,0.4836891377201024,0.48097043824058705
848.0,0.47824192829133305,0.4827898367403009
849.0,0.4798058959962606,0.4785543559371446
850.0,0.4809071625150098,0.48033440387630155
851.0,0.4725588023960073,0.481097149748905
852.0,0.48362102406339097,0.47847576348478327
853.0,0.4722220489630045,0.4842594165648837
854.0,0.4793009417650855,0.4830735584305586
855.0,0.4744310397927133,0.47917320454250845
856.0,0.46719564449485845,0.4793937198652879
857.0,0.4806823484493968,0.4845113978590614
858.0,0.47246969463683863,0.4862144401090673
859.0,0.48933645859292396,0.47571698807105345
860.0,0.48371513813854905,0.4836874949840618
861.0,0.47853760144967183,0.47603697277946333
862.0,0.47001947318236176,0.4828766917826017
863.0,0.4863102887143893,0.4812509337702144
864.0,0.4756541651710356,0.4843101475575017
865.0,0.47106846379465567,0.48331811552006293
866.0,0.4667101813496768,0.4831643083087715
867.0,0.47493176054683267,0.4846908333529605
868.0,0.47914128288565705,0.48025497766250436
869.0,0.48006518164942347,0.4791460372398462
870.0,0.4781955928287741,0.48375323249971275
871.0,0.4802989395438584,0.4767008533433027
872.0,0.481695259133719,0.48332592202020347
873.0,0.4839354156830364,0.4781322336936387
874.0,0.46942912524643615,0.4875472090436294
875.0,0.4768966699629508,0.4774484234573209
876.0,0.4808070176857622,0.48320585806345123
877.0,0.48427291827252106,0.4802808011816061
878.0,0.47334205528903434,0.4808258114451265
879.0,0.4683372192682438,0.485301700611489
880.0,0.4767589276359696,0.4821155556094723
881.0,0.47816596991031907,0.48075344929867864
882.0,0.4762518817771266,0.4820598272207645
883.0,0.47278330577985117,0.4827253583359611
884.0,0.4879325248746602,0.48034909545108895
885.0,0.4889578963097461,0.47420823802177936
886.0,0.48183932523653017,0.48539610705094666
887.0,0.4885454903524007,0.4788410259366935
888.0,0.4751529180043128,0.479134025332097
889.0,0.4731283794162229,0.48259481984505403
890.0,0.47485760962024687,0.4802570293454193
891.0,0.48881901672658273,0.47584279919714983
892.0,0.48207689899597994,0.4801500865628757
893.0,0.4698784834431824,0.4874961649215671
894.0,0.492022171372689,0.474839276951814
895.0,0.4858220964771452,0.4838515118370375
896.0,0.4765303536862572,0.4827221848626376
897.0,0.47885595542932197,0.48477581333338854
898.0,0.4760712812412746,0.4802855167163097
899.0,0.4774273310874135,0.4820073434734688
900.0,0.4922074539347083,0.47506112706580084
901.0,0.4824822115881296,0.48265999809789445
902.0,0.48481893850477786,0.48174750928252125
903.0,0.47090540467610564,0.48193856092349835
904.0,0.4739928849755489,0.4752144789934511
905.0,0.4863665239210226,0.4761207828644565
906.0,0.47475944178385665,0.47942460494702543
907.0,0.4810569192221691,0.4809586633631737
908.0,0.4819818012249757,0.4772729609690195
909.0,0.48566341919515066,0.4810853684206897
910.0,0.47100820135461385,0.48241835598051047
911.0,0.46411830125734954,0.48219283141257013
912.0,0.4750157603722742,0.4855889320579397
913.0,0.469047702661369,0.48644253542642785
914.0,0.47760904088428086,0.48100061985568965
915.0,0.4887597471969954,0.48123797453766526
916.0,0.4818706242704121,0.4792703705820187
917.0,0.4798294006258642,0.4805504221882155
918.0,0.48409208370059215,0.4788305775398147
919.0,0.48538718352670357,0.47666379848523716
920.0,0.4833958769883529,0.47883495094175593
921.0,0.46559718431954955,0.48080376572129835
922.0,0.48653357498904737,0.47731157004744645
923.0,0.4766406242530053,0.48050510104789884
924.0,0.4694077214308964,0.48517150232154155
925.0,0.4626685357530776,0.48519974596173093
926.0,0.47506378734793386,0.4864866801633077
927.0,0.4762048285769013,0.48120783475041434
928.0,0.49106929134986643,0.4807300680145906
929.0,0.4736153426289318,0.47825771532628464
930.0,0.48375686246756194,0.47949327820327686
931.0,0.4762480613713368,0.4817383253410246
932.0,0.48329327206125705,0.4813259930348203
933.0,0.4770362964422695,0.4827064574389557
934.0,0.4811749464373533,0.4794820260249691
935.0,0.47323391623251315,0.4809804196878794
936.0,0.4762368885540365,0.4847168489504938
937.0,0.4841611586084195,0.48252663872988705
938.0,0.47997825274779443,0.48221260277902595
939.0,0.4861938850218337,0.4799534584367794
940.0,0.4746896797666709,0.48198667539631945
941.0,0.47315475759330583,0.4776601263140423
942.0,0.45991502620892055,0.48447488571376185
943.0,0.46784353332496487,0.483999789839811
944.0,0.4851675938890238,0.4752550944215055
945.0,0.48400634179962654,0.4800224703222755
946.0,0.467219893882315,0.4872741659589499
947.0,0.4748176010085026,0.4814304053887236
948.0,0.4737110126154636,0.4798295689944053
949.0,0.47385969575248704,0.4791780468001272
950.0,0.4840479842872329,0.4831044251028791
951.0,0.45932101953549687,0.4832223431982575
952.0,0.48344993450861,0.4800450902428661
953.0,0.47737806935374466,0.4794545201244021
954.0,0.47004228281534094,0.4840467795497436
955.0,0.4860826478243917,0.4753433766036598
956.0,0.4693575864654277,0.4844284052117863
957.0,0.47921958095592837,0.48148638921668463
958.0,0.48717076307674795,0.48109310449434745
959.0,0.4788618363013455,0.4822486709212978
960.0,0.4855850354528668,0.47725207367707784
961.0,0.47241371541531807,0.482294089104459
962.0,0.488655667664289,0.47620567348169823
963.0,0.48971143621380697,0.47719578081639763
964.0,0.48460180972154654,0.4815464751217625
965.0,0.4697675437587252,0.4852590912022011
966.0,0.48330276081342927,0.47960042803610103
967.0,0.47861409430780577,0.4802282971534251
968.0,0.4832355907086932,0.47966184319319316
969.0,0.4812569170362479,0.48371236176457966
970.0,0.47328246952409825,0.48262831427735076
971.0,0.4679067389091917,0.4817719586656003
972.0,0.47673694464172856,0.47995283865480975
973.0,0.4844535271146703,0.4806956245729942
974.0,0.4801581809061406,0.48114455112695337
975.0,0.4685340928220029,0.48458887404246426
976.0,0.4762953799060071,0.4804775109023554
977.0,0.4893595752383769,0.48371380102729417
978.0,0.4810751575124559,0.4777320017639479
979.0,0.4671780602580509,0.48213072626229037
980.0,0.4733135085756598,0.482121161600651
981.0,0.4898794306082544,0.47794596148733365
982.0,0.4785735686535791,0.47972610129933246
983.0,0.4832905331983399,0.480653303483981
984.0,0.4926601079972704,0.48043936036854296
985.0,0.48066876885445803,0.47901082323524236
986.0,0.47304073238611405,0.48462550425284406
987.0,0.4849414126539528,0.4785821906884883
988.0,0.4743425631379749,0.4864333967078465
989.0,0.4762304400777423,0.47912384218202847
990.0,0.4811206673189501,0.47767706146155575
991.0,0.458360725523376,0.48389204890298193
992.0,0.4794372230633727,0.47843806124517696
993.0,0.46888067892809515,0.477515845758452
994.0,0.49227854049595937,0.4801899635858699
995.0,0.46591987157036235,0.4772622080052745
996.0,0.4715178806980389,0.48078134958948104
997.0,0.4721758203067783,0.4770337260096331
998.0,0.4761939279863416,0.4757487803905927
999.0,0.4833110552646886,0.4748266379303996
1000.0,0.4799603294688411,0.4805128322453547
1001.0,0.47265344955973077,0.48616295081444716
1002.0,0.4821255162888268,0.4793914767183377
1003.0,0.4854317351724406,0.47739971010731963
1004.0,0.48858902235848123,0.4771760384002659
1005.0,0.46520562682296973,0.48639236296865646
1006.0,0.4705659661872276,0.47574946694850156
1007.0,0.48150983039368583,0.47844641897288553
1008.0,0.46280153653970774,0.48413899989635484
1009.0,0.4723640224743193,0.48352508234184083
1010.0,0.4771857734849347,0.4823567942477615
1011.0,0.46194471804985665,0.48528071606390666
1012.0,0.4603422681189953,0.482218769080623
1013.0,0.4839603749974975,0.4810341516362947
1014.0,0.47251104853800524,0.4836051485322332
1015.0,0.46883015663800354,0.4826043832009896
1016.0,0.4784427771335098,0.4790693672176407
1017.0,0.4673626754419456,0.47980117980118014
1018.0,0.4730092394423079,0.47739619366563346
1019.0,0.4749835959339108,0.4794955668002376
1020.0,0.47235811858973714,0.4837206845476686
1021.0,0.4755053027387236,0.4801871478218532
1022.0,0.4763775941680621,0.4802502336563275
1023.0,0.48628070548427715,0.4799175723671691
1024.0,0.48251050512374977,0.48074547118218414
1025.0,0.48238515901991225,0.4747984717731416
1026.0,0.47697398810987907,0.4809596306955851
1027.0,0.4765401787739997,0.4780661154268174
1028.0,0.48285306050960874,0.4754087055456208
1029.0,0.4773581928998218,0.48062827372045325
1030.0,0.4760819565690024,0.48187850183624137
1031.0,0.48145160650300545,0.47656329565517985
1032.0,0.4752820917448324,0.4817708650843659
1033.0,0.49068224364991114,0.47783328997625213
1034.0,0.47481789667281593,0.48126427739528277
1035.0,0.47725209461823076,0.4776857267794102
1036.0,0.4722264152430487,0.4795404384764107
1037.0,0.48006106154797,0.48084861623106007
1038.0,0.46155583325753774,0.48232946669807464
1039.0,0.48472367163039526,0.4789548866366812
1040.0,0.4867526526665431,0.4792212429433164
1041.0,0.488781536270473,0.48111646906057226
1042.0,0.48610559024992794,0.4761320948523381
1043.0,0.48933655000976156,0.4770788362472823
1044.0,0.4762190198699106,0.48280572100428076
1045.0,0.4779046278135474,0.47992773000882305
1046.0,0.47318211389280573,0.4825982154622806
1047.0,0.4747087409984463,0.4837888208586085
1048.0,0.46339814551073466,0.48637159786836537
1049.0,0.4707245312691024,0.47812517730217796
1050.0,0.4867054017865714,0.48218793410076305
1051.0,0.47422718040436307,0.4779129259780415
1052.0,0.4785684847452104,0.4776977416285133
1053.0,0.47322895324253056,0.482786902479325
1054.0,0.48709949753214726,0.4785085958066034
1055.0,0.4791725820092479,0.48420338036677685
1056.0,0.4676321672724865,0.4811538621109265
1057.0,0.47974374657378055,0.4802908850293051
1058.0,0.47657349001831445,0.48290106596226295
1059.0,0.47482075789189443,0.47983451248420006
1060.0,0.4789881708802923,0.4799226395132621
1061.0,0.47408798262881424,0.47889010325506015
1062.0,0.4881300649902402,0.4779917277450761
1063.0,0.4681259119406534,0.4806707572651138
1064.0,0.4607984355245878,0.48254577827068035
1065.0,0.48242820228782657,0.48104174729130483
1066.0,0.4697815951159496,0.48398196931699256
1067.0,0.472859890776204,0.4781504671859107
1068.0,0.47534534227032704,0.47871868131305584
1069.0,0.4848587410854728,0.4795385824478159
1070.0,0.4769451357257132,0.48163613509588593
1071.0,0.48020118975835085,0.48123069349405884
1072.0,0.48564809365504363,0.4812641445402488
1073.0,0.4762064410627446,0.4779956315960599
1074.0,0.4702225362797651,0.4845750329129415
1075.0,0.47741989464658435,0.4840568156492418
1076.0,0.48645678071157555,0.47726262467544217
1077.0,0.47727160367490434,0.4815806891411112
1078.0,0.4726057358023233,0.4836483636066286
1079.0,0.48756271109919336,0.47853810718179357
1080.0,0.487696968695252,0.4776155017539066
1081.0,0.47496877422241807,0.4817536388002147
1082.0,0.4679054249984896,0.48114610867362945
1083.0,0.46147453152885837,0.4809595820364142
1084.0,0.47780864857210953,0.4787471693677659
1085.0,0.4882405180284419,0.4808894676335927
1086.0,0.48252974632523216,0.4759334296756385
1087.0,0.48445579384257487,0.48066899904942384
1088.0,0.4868018289831071,0.47762292626965386
1089.0,0.4757883081257992,0.4846491876762802
1090.0,0.47780852689151204,0.48116401707113704
1091.0,0.4617116228437591,0.4813249009127083
1092.0,0.47113053212638345,0.4847702069731163
