﻿Province,Gasoline,Diesel,LPG
Drenthe,130,276,294
Flevoland,123,269,287
Friesland,118,257,264
Gelderland,122,260,278
Groningen,126,259,274
Limburg,112,254,286
Noord-Brabant,119,258,271
Noord-Holland,117,251,269
Overijssel,122,258,276
Utrecht,115,255,271
Zeeland,119,257,277
Zuid-Holland,132,268,284
