"tick","Other_happiness","EV_happiness"
1.0,0.48363070241392625,0.43624956477925975
2.0,0.48010614619355924,0.4762684115011844
3.0,0.4839697531013243,0.495228113883202
4.0,0.4893915149879033,0.4953260189568072
5.0,0.48370525759913346,0.4934487282444928
6.0,0.4846356645601233,0.4973165696742371
7.0,0.48858098215077717,0.48478054089771316
8.0,0.48599175409802725,0.4977385793430004
9.0,0.4814572716413257,0.49387073791325664
10.0,0.48355397643816006,0.49620413508542877
11.0,0.4853673746967735,0.49549747755076545
12.0,0.4825042856807972,0.4787257531278728
13.0,0.48664354770862545,0.49549747755076545
14.0,0.48714013050778127,0.4896523355239494
15.0,0.4856825177968841,0.45367617770381485
16.0,0.48765235289932213,0.490074345192713
17.0,0.48539660985028604,0.4973165696742371
18.0,0.4842140309055788,0.4953260189568072
19.0,0.4860360723804371,0.47830374345910937
20.0,0.48395977759468234,0.490074345192713
21.0,0.4840238641634161,0.490074345192713
22.0,0.4818761349857582,0.4977385793430004
23.0,0.48220866692214226,0.49308491716457253
24.0,0.487586254167037,0.4764846513356378
25.0,0.4847712542706095,0.49521900092503607
26.0,0.48249170648692846,0.4956501235519654
27.0,0.48591313723365537,0.49308491716457253
28.0,0.4868233346944775,0.4949040092880437
29.0,0.4854254468056403,0.49549747755076545
30.0,0.4864048013507584,0.49387073791325664
31.0,0.4848630424867994,0.49162963612102173
32.0,0.4824084273449006,0.4953260189568072
33.0,0.4847737562264449,0.49662614475419203
34.0,0.48452281918221474,0.4896523355239495
35.0,0.48559985405180384,0.4977385793430004
36.0,0.4827640863841466,0.4886453422474984
37.0,0.4818063505224958,0.49286678471676393
38.0,0.48523149394600523,0.49308491716457253
39.0,0.4823978208428221,0.4973165696742371
40.0,0.48334271932146833,0.497316569674237
41.0,0.48734519735234005,0.49266290749580893
42.0,0.4814671554323795,0.49314058027740754
43.0,0.48502677313723963,0.48846899562903645
44.0,0.4860644570824642,0.41286873288387904
45.0,0.4850192892826204,0.49230396177036484
46.0,0.4830165465778685,0.4949040092880437
47.0,0.48505436958590104,0.49387073791325664
48.0,0.48494254454457103,0.4934487282444928
49.0,0.4856938749342441,0.4949596724008793
50.0,0.4786204785304084,0.4973165696742371
51.0,0.486624875773275,0.492806440538843
52.0,0.4868032814838339,0.4953260189568072
53.0,0.4839599151757668,0.4858841640735856
54.0,0.4857443568209488,0.4943850429619571
55.0,0.4866088190973735,0.497316569674237
56.0,0.48364025506532277,0.49238443087007927
57.0,0.4845857321989477,0.46229682966886604
58.0,0.48476971617513126,0.4953260189568072
59.0,0.48699085481010446,0.4780379560679671
60.0,0.4862173792843849,0.4949040092880437
61.0,0.4857166804326951,0.4953260189568072
62.0,0.4864403811413148,0.4949040092880436
63.0,0.48699145819411677,0.48864534224749834
64.0,0.4846164053937253,0.49532601895680717
65.0,0.48510922103000226,0.49387073791325664
66.0,0.48199288941312163,0.4896523355239494
67.0,0.4853768279109718,0.4973165696742371
68.0,0.48658180489222697,0.4862327818613052
69.0,0.48464607495787415,0.472550412486283
70.0,0.48220190463712,0.4954974775507655
71.0,0.48133299153013076,0.48783324340047785
72.0,0.48510368507980123,0.4973165696742371
73.0,0.48195290939124813,0.4949040092880436
74.0,0.48363524053373413,0.4905653387466081
75.0,0.4845193268401639,0.49532601895680717
76.0,0.48343657808840435,0.4973165696742371
77.0,0.4877922206918885,0.4977385793430005
78.0,0.48369210338610413,0.49122231486687584
79.0,0.48300412400338416,0.49162963612102173
80.0,0.4852150905773659,0.4912868707362426
81.0,0.47890898686015215,0.4954974775507655
82.0,0.48307767992543543,0.4977385793430005
83.0,0.4885190508406565,0.49302671857572955
84.0,0.48267460908363274,0.4973165696742371
85.0,0.4834204961957196,0.4832896298320616
86.0,0.48379830390011297,0.44907326465633224
87.0,0.4807283403819779,0.4977385793430005
88.0,0.48452558353417574,0.4844520599708027
89.0,0.4848256520071871,0.4843963968579673
90.0,0.4872719671714752,0.49532601895680717
91.0,0.4849132342875321,0.47914136404368696
92.0,0.4811311150014288,0.4931405802774076
93.0,0.4846459392258955,0.48477330243264427
94.0,0.48519330214244155,0.49532601895680717
95.0,0.48419873125184315,0.49266290749580893
96.0,0.4858772466927377,0.4943850429619572
97.0,0.48527570959127597,0.492806440538843
98.0,0.48385832792275657,0.49689456000547355
99.0,0.4848867674144944,0.47954850868954324
100.0,0.4816309962889718,0.4977385793430005
101.0,0.4844404896411628,0.4896523355239495
102.0,0.4850756384096914,0.4802127482375714
103.0,0.48804833996673946,0.4843554911489908
104.0,0.4856336840807025,0.4931405802774076
105.0,0.4850267485551429,0.4977385793430005
106.0,0.48399202371096434,0.4825634654050711
107.0,0.48260200200228753,0.4934487282444929
108.0,0.48590688921112435,0.48477750081775445
109.0,0.48361540780731765,0.49532601895680717
110.0,0.4812168119527108,0.4977385793430005
111.0,0.48610812675923026,0.4789978310006532
112.0,0.48605755024344405,0.49092914982652847
113.0,0.48569720148918794,0.49689456000547355
114.0,0.48494164327039085,0.4973165696742371
115.0,0.48555335386835585,0.4930849171645726
116.0,0.48820106328567286,0.49565012355196536
117.0,0.4856439768408577,0.49565012355196536
118.0,0.4859788953006036,0.4804492400484031
119.0,0.48467890330245333,0.49532601895680717
120.0,0.48344018502998004,0.4846776954750735
121.0,0.48390571271024024,0.4930849171645726
122.0,0.4846152765566456,0.48783324340047785
123.0,0.483548590234924,0.4930849171645726
124.0,0.4856676980624651,0.49607213322072896
125.0,0.48414675995674106,0.4954974775507655
126.0,0.48659683677091714,0.46150404662330696
127.0,0.48342892473885263,0.497316569674237
128.0,0.4845593800668504,0.4973165696742371
129.0,0.4855862836449355,0.4896523355239494
130.0,0.485653177373187,0.4954974775507655
131.0,0.48501535891044584,0.4812389327928878
132.0,0.4836743519154432,0.49532601895680717
133.0,0.4852202978898063,0.4952190009250359
134.0,0.4862259904367518,0.49308491716457253
135.0,0.4846726602524979,0.48755476677474846
136.0,0.4853010678584818,0.49532601895680717
137.0,0.48117647737473845,0.4973165696742371
138.0,0.47933010185422603,0.49532601895680717
139.0,0.48601862212543817,0.45913619117992194
140.0,0.4854816685602708,0.49308491716457253
141.0,0.4845240602405236,0.48923032585518605
142.0,0.4845929615414432,0.47225043088195834
143.0,0.4890343609870914,0.4949040092880436
144.0,0.4854593693981258,0.49532601895680717
145.0,0.4831682104485717,0.4953816820696426
146.0,0.4872163803799014,0.49266290749580893
147.0,0.4834479361289981,0.4954974775507655
148.0,0.4828912224893628,0.4973165696742371
149.0,0.48325175801329084,0.4949596724008793
150.0,0.48202829709044365,0.4949596724008793
151.0,0.4857660823880628,0.49532601895680717
152.0,0.4827967675569478,0.4778027851948721
153.0,0.48731949679974546,0.49507546788200185
154.0,0.4855082795618491,0.4439333648194577
155.0,0.4837884031378354,0.4977385793430004
156.0,0.48558100686579164,0.48911005770305716
157.0,0.4829566433606528,0.4949040092880436
158.0,0.485485678291401,0.4944819996192803
159.0,0.48387034410746765,0.49162963612102173
160.0,0.48462876115579945,0.4780379560679671
161.0,0.48233172909210315,0.4949040092880436
162.0,0.48483590795239895,0.4973165696742371
163.0,0.48445351542226267,0.48166094246165136
164.0,0.4860008761841002,0.4862327818613052
165.0,0.4840944885162761,0.49162963612102173
166.0,0.4855850918439268,0.4938707379132567
167.0,0.47904709199450207,0.48178961048177815
168.0,0.48273071381381366,0.49532601895680717
169.0,0.48561590325082726,0.49308491716457253
170.0,0.48326219796136444,0.49532601895680717
171.0,0.48371160996475,0.4977385793430004
172.0,0.4842638403691752,0.49532601895680717
173.0,0.4897511155073832,0.4949040092880436
174.0,0.4832922671669716,0.49297789913280116
175.0,0.4806698417932318,0.49266290749580893
176.0,0.4854104642276595,0.49308491716457253
177.0,0.4830725659635675,0.4959589718109374
178.0,0.4854515129053983,0.4215029659569007
179.0,0.4785201085819294,0.4976519984649573
180.0,0.48274448353557015,0.4980212569251254
181.0,0.48146967546277913,0.49267593160589396
182.0,0.48460832551796057,0.4937543406952187
183.0,0.4866385372309931,0.4980212569251254
184.0,0.48028644357493416,0.49656311656813773
185.0,0.48479210934726985,0.49554100812703833
186.0,0.4837216862651292,0.4980212569251254
187.0,0.48568867109308744,0.4909457935834557
188.0,0.48371926198912985,0.49667861819974995
189.0,0.4879476068642381,0.45123444193566237
190.0,0.4844798845362959,0.4960602928569199
191.0,0.48219255039940023,0.49569103439675205
192.0,0.4858030863096878,0.4976519984649573
193.0,0.481197456319068,0.49236183013601836
194.0,0.48363199914685967,0.49554100812703833
195.0,0.4861985944421414,0.4976519984649573
196.0,0.48064958873945857,0.4942676372139316
197.0,0.4835355065123051,0.49554100812703833
198.0,0.47996070476093844,0.48358406619377703
199.0,0.4846342699334547,0.49006467446656116
200.0,0.48470947953082144,0.49554100812703833
201.0,0.4844051862125689,0.4813850339868887
202.0,0.4801996464223053,0.49581662580940644
203.0,0.47986626318645725,0.4959102665872064
204.0,0.4836928042037214,0.4959102665872064
205.0,0.48744790232871,0.4818612780558367
206.0,0.48580268494944046,0.4976519984649573
207.0,0.47975877451107857,0.4849693562569783
208.0,0.4830779222787767,0.4923066731457258
209.0,0.48456315834442504,0.4959102665872064
210.0,0.48489128375572543,0.4959102665872064
211.0,0.4847816851617807,0.48064651706655265
212.0,0.48279680593021224,0.4980212569251254
213.0,0.48596852076269187,0.4976519984649573
214.0,0.4845525796611799,0.4976519984649573
215.0,0.4882068611306113,0.49394930251900077
216.0,0.4803332777712843,0.48969541600639327
217.0,0.4806833363343524,0.4959102665872064
218.0,0.4869614007371345,0.4924322645583806
219.0,0.48468411156525765,0.4913150520436238
220.0,0.48345845902750106,0.4946368956740995
221.0,0.48323686985561,0.49606029285691977
222.0,0.48326607774633273,0.4980212569251254
223.0,0.48891268723695164,0.49399800774273184
224.0,0.48827989587902143,0.49619385810797006
225.0,0.4836472543868572,0.49765199846495745
226.0,0.48490820169167154,0.4959102665872064
227.0,0.488283008612534,0.4852709074038513
228.0,0.48039313597113037,0.48358406619377703
229.0,0.4863334964881358,0.49094579358345564
230.0,0.48569685581117955,0.45839184105730146
231.0,0.48413544032466027,0.4960602928569198
232.0,0.4837635068998852,0.49704787665991784
233.0,0.48330210867209905,0.4917446714032819
234.0,0.48307468609455495,0.4951717496668703
235.0,0.48554625851672834,0.4980212569251254
236.0,0.48462469455184554,0.49394930251900077
237.0,0.4850600672252144,0.4894446583396472
238.0,0.4808058054277925,0.49394930251900077
239.0,0.48301205623643995,0.4960602928569198
240.0,0.48176472924455305,0.48148807588108256
241.0,0.4853817117396389,0.4955410081270383
242.0,0.48481454688791226,0.46424416728243195
243.0,0.48826527586516527,0.4937056354714874
244.0,0.48593477435028093,0.49581662580940644
245.0,0.48576209360653533,0.4959102665872064
246.0,0.4840354697333893,0.49508691259171256
247.0,0.4831381570266002,0.49094579358345564
248.0,0.4855682823056011,0.4536132058047055
249.0,0.4838261517228956,0.4960602928569198
250.0,0.48621068583738425,0.48668031321553495
251.0,0.48433303405527517,0.4951717496668703
252.0,0.4831286392228404,0.4893540879754183
253.0,0.4830058905804284,0.49094579358345564
254.0,0.48436004786863945,0.48358406619377703
255.0,0.4833058758582863,0.4810157755267208
256.0,0.48477379874562354,0.4896954160063931
257.0,0.4844860845958376,0.49554100812703816
258.0,0.4845888602043499,0.4893540879754183
259.0,0.4846425372425051,0.4959102665872063
260.0,0.48552228799721286,0.4951717496668703
261.0,0.4843315434489537,0.49606029285691977
262.0,0.4844960552115673,0.4959102665872064
263.0,0.48428045950799087,0.4955410081270382
264.0,0.4852094906170212,0.4879536841286421
265.0,0.485361169141937,0.4909457935834557
266.0,0.48288487850903644,0.49006467446656116
267.0,0.4862811453617305,0.49001326980679816
268.0,0.4845318413495156,0.48210494510335034
269.0,0.48423519361747064,0.49606029285691977
270.0,0.4787325892260703,0.49802125692512533
271.0,0.48366771780591644,0.4835840661937771
272.0,0.48210421310507884,0.4951717496668703
273.0,0.4861568881021995,0.49619385810796995
274.0,0.4834845404105764,0.4946368956740995
275.0,0.48290774188019625,0.4959102665872064
276.0,0.48315734467417815,0.49554100812703833
277.0,0.4851013048694012,0.4980212569251253
278.0,0.482864560310357,0.4976519984649572
279.0,0.4815707371683536,0.49802125692512533
280.0,0.48281711908940544,0.49394930251900077
281.0,0.4853017196421944,0.4904188016568457
282.0,0.48555378027966883,0.4976519984649573
283.0,0.48141230076202907,0.49667861819974995
284.0,0.48759079376990383,0.49375843662716884
285.0,0.4860664135074539,0.49037407537614264
286.0,0.4853145527438308,0.4980212569251253
287.0,0.4872276456745735,0.4937063603055142
288.0,0.4856727911639383,0.4362083285101847
289.0,0.4829860289281674,0.48804869199393497
290.0,0.4862805398302957,0.4943175542211577
291.0,0.48385339068567806,0.49103657458502975
292.0,0.4877994346039057,0.48936060313156515
293.0,0.48734088560027233,0.4919724660268233
294.0,0.4846352322462249,0.4815189881186596
295.0,0.4857833915686992,0.4981997147740987
296.0,0.4813837439104745,0.4937063603055142
297.0,0.486578821967859,0.48503842660386165
298.0,0.48571705118732933,0.46216682953841665
299.0,0.48148660896032613,0.49645663560236036
300.0,0.48400866549625976,0.492855461339265
301.0,0.4844548455678504,0.48868093522243317
302.0,0.48054980321585966,0.4954494394772526
303.0,0.48292029966465744,0.4942866713996755
304.0,0.4851523415890651,0.48416458716294386
305.0,0.48892403227637776,0.4611750728568713
306.0,0.4834570406522143,0.46976007003107617
307.0,0.48224675889645713,0.454220574595176
308.0,0.4815436566238326,0.49787148503172707
309.0,0.48286760398945977,0.493989324478786
310.0,0.4846417558436332,0.497871485031727
311.0,0.4875653069931766,0.4702462928915113
312.0,0.48642793259305067,0.4851104495265387
313.0,0.4808586832359866,0.48317015554145704
314.0,0.4848061856806674,0.4959434597085121
315.0,0.4852712433090953,0.4983797432966886
316.0,0.48240750682885447,0.4855566262251799
317.0,0.4822906744229151,0.49080917243195354
318.0,0.4814441361478502,0.4961001374900847
319.0,0.48055362344798724,0.49380807627316914
320.0,0.4842748759238081,0.49215407410093437
321.0,0.4827110497347698,0.4948267730036546
322.0,0.48283691975882925,0.4917386463170289
323.0,0.4846572334086561,0.49681097204212427
324.0,0.48686254344598123,0.4864436600331935
325.0,0.48274074284486834,0.4983797432966886
326.0,0.4831629736103768,0.49006150954742084
327.0,0.48256768069117273,0.49537684752773337
328.0,0.48363998868409985,0.49350756800459883
329.0,0.48601268818649646,0.49410348304130336
330.0,0.48152618897231986,0.4735705185247945
331.0,0.48356343619246045,0.4961001374900847
332.0,0.48591238272726045,0.48571695802304143
333.0,0.48706380795678117,0.4870117715973259
334.0,0.48579918009780443,0.4920011439507739
335.0,0.48558234649772264,0.4897204403948997
336.0,0.48385648331253445,0.49350756800459883
337.0,0.4852910210692085,0.48806247468216296
338.0,0.48548699009963825,0.48522658200715435
339.0,0.4814744343183578,0.49331702754447737
340.0,0.48041854190373723,0.48653458394347554
341.0,0.4825489663932709,0.49488579879904165
342.0,0.4859902127014502,0.49639554425821886
343.0,0.48042375353658323,0.48633894198291805
344.0,0.48169234404267375,0.4966909510263536
345.0,0.4849233913883224,0.49301477939148736
346.0,0.48268674556285035,0.49808433652855444
347.0,0.4807502065648508,0.49301477939148736
348.0,0.48653123565523415,0.4959044955295273
349.0,0.483415674009667,0.48263213941646266
350.0,0.4804516516405555,0.4972978810317283
351.0,0.4843598389195353,0.49301477939148736
352.0,0.4821278702537966,0.4735705185247944
353.0,0.48460871803548283,0.49203405308516324
354.0,0.48285802225890095,0.4786999250924222
355.0,0.4849772315029502,0.49837974329668866
356.0,0.4834145359613453,0.49560908876139304
357.0,0.4865540947736904,0.48038095787051976
358.0,0.4847212083150797,0.489734871523233
359.0,0.48690419720318523,0.47927548988802215
360.0,0.4853446894580718,0.49386354727195825
361.0,0.4872711568625725,0.4701602622864292
362.0,0.48207440475295316,0.49144600813692313
363.0,0.4836514402412322,0.4966909510263536
364.0,0.48563506815285656,0.4614723100864029
365.0,0.48398251648937024,0.4963955442582188
366.0,0.4863777484259032,0.48065960030597255
367.0,0.484794025587568,0.49632063163597917
368.0,0.48490008997851985,0.4956722542958678
369.0,0.48435634794161875,0.49032568505950214
370.0,0.4838008039026192,0.49144600813692313
371.0,0.48232429003171606,0.4975932877998625
372.0,0.48712749022833585,0.48493586056135796
373.0,0.48146628040394335,0.4824684995385542
374.0,0.48589081595205014,0.4938635472719582
375.0,0.48581889198290595,0.4899542709093666
376.0,0.4805837244326285,0.4640717255847262
377.0,0.48441882857338586,0.4907199495865434
378.0,0.4842766927869167,0.4907199495865432
379.0,0.48716588246471687,0.4956090887613931
380.0,0.4837415674032017,0.49151132358523897
381.0,0.4848567892051188,0.48929488331310994
382.0,0.4863464115008562,0.4960252248678448
383.0,0.48597518258224215,0.46560055986793036
384.0,0.4855713102858826,0.4963955442582188
385.0,0.4828429990053607,0.49730563231638836
386.0,0.4807731214631351,0.4972132310110984
387.0,0.48623730801704024,0.4950658298345128
388.0,0.4847358264273449,0.4851563534331236
389.0,0.48463655449717136,0.49730563231638836
390.0,0.4864544852172969,0.4610158399290939
391.0,0.4840749805603504,0.4927193726233531
392.0,0.48160461856315095,0.4868299907116097
393.0,0.4833900117176052,0.4953768475277336
394.0,0.4820238249498927,0.4410875262398559
395.0,0.48454345453607817,0.48565668210240526
396.0,0.48458527442436833,0.4980843365285544
397.0,0.48429684841483744,0.46861821381546986
398.0,0.4826283695452326,0.4914460081369232
399.0,0.4851149663377198,0.49173864631702885
400.0,0.48378087547177273,0.4983797432966886
401.0,0.48149155304109087,0.48712539747974426
402.0,0.49043888766460175,0.4521367496409112
403.0,0.4822429599086382,0.4791952713799359
404.0,0.48384611349395873,0.49691782424296416
405.0,0.4815564957946321,0.495122179771789
406.0,0.485432707234161,0.455332813824122
407.0,0.48361090894468944,0.49681097204212415
408.0,0.48501714448038213,0.4964345084372039
409.0,0.4871021378847915,0.49203405308516324
410.0,0.4831324291974407,0.49496330070753913
411.0,0.48335356497085785,0.4865345839434754
412.0,0.4846509565269594,0.48604353521478383
413.0,0.4857598185275167,0.48904021555716554
414.0,0.48528576565023096,0.4963955442582188
415.0,0.4846707246796915,0.49808433652855433
416.0,0.48442044343516855,0.49173864631702885
417.0,0.48451868035954526,0.48817460640241817
418.0,0.4886478159756946,0.47023722382218497
419.0,0.485525082367365,0.4824466844521302
420.0,0.4863435420218295,0.4564620610464926
421.0,0.4856400208108393,0.47974677265391147
422.0,0.4843885774983586,0.4953054288314165
423.0,0.48241336778232613,0.46086105810483546
424.0,0.4886670933089885,0.4893255794006704
425.0,0.4870489527754984,0.4838251403757656
426.0,0.4843423706271258,0.4980140363247597
427.0,0.47909515415494014,0.49491873850054274
428.0,0.48437688469140405,0.4927511337675227
429.0,0.4825170494236538,0.48618325865772183
430.0,0.48705497518197965,0.4879069708276268
431.0,0.48485011033611713,0.49719421800118596
432.0,0.4836044260653489,0.49394149424446016
433.0,0.4821881104059755,0.4822002585793394
434.0,0.48066241255815595,0.47952490482283394
435.0,0.48754697586248036,0.46138886141261876
436.0,0.48546951432000834,0.49363761038227844
437.0,0.4857543135805655,0.4883015036457703
438.0,0.4889652774896253,0.49752169171120253
439.0,0.4844604255161584,0.49522455515990205
440.0,0.48439769637533386,0.49247978884170984
441.0,0.4852082548532844,0.4894749882472064
442.0,0.4849583568377951,0.4640221947459521
443.0,0.485618412541795,0.49282597866163086
444.0,0.4862787391189729,0.493887115733656
445.0,0.4865223051136109,0.4980140363247597
446.0,0.48558293195494734,0.49182440926102133
447.0,0.4857224827307935,0.4937887042129035
448.0,0.4852319620276803,0.459874618356998
449.0,0.48457706310891807,0.4966067094328133
450.0,0.48430560977895615,0.49497838285312307
451.0,0.4849935891838959,0.49215231513169366
452.0,0.48708748970643206,0.462736206636712
453.0,0.4836421836941553,0.4759819072088134
454.0,0.4820589556359297,0.4925384646095947
455.0,0.48546352004622245,0.49529940005401
456.0,0.48515495631214617,0.49529940005401
457.0,0.48648851085060424,0.492659714833906
458.0,0.4859267354268064,0.4942880414135963
459.0,0.48589671389992806,0.4905912476286384
460.0,0.4854408237789259,0.49247978884170984
461.0,0.4828025876042084,0.4830055768471463
462.0,0.4848600595091532,0.488945390547257
463.0,0.4827129329560491,0.48682455227617094
464.0,0.48296829565365645,0.46062492909121766
465.0,0.4810832463913194,0.4911144598080592
466.0,0.484524568695118,0.49207478931205995
467.0,0.48470076694376735,0.4606963425493829
468.0,0.4841314496013413,0.48855307471439735
469.0,0.48410141240496285,0.4922055797621448
470.0,0.48577022714149076,0.49089454476884725
471.0,0.4839947163518838,0.4873989186708375
472.0,0.4861103164326697,0.47071924888674677
473.0,0.48451091563164644,0.4685414553850246
474.0,0.485800934543977,0.4862412156978741
475.0,0.484586239609916,0.4969313923782579
476.0,0.4848947369161918,0.4659926782114189
477.0,0.484678237424478,0.4883492521536084
478.0,0.48464224566271674,0.4895766812243293
479.0,0.4854752936492778,0.4873321553572742
480.0,0.4837136741967851,0.4968623047836969
481.0,0.4827465955616078,0.44300184161755773
482.0,0.48596622657477023,0.47527782908765953
483.0,0.48533649047510574,0.49274269624688866
484.0,0.48135442637274556,0.482596051039825
485.0,0.48682697571443906,0.47178961918184137
486.0,0.48362191400191923,0.4930429569165341
487.0,0.4837157419462929,0.4905557684136712
488.0,0.48189142240707394,0.49661183254448465
489.0,0.4838139288845095,0.49420151266411994
490.0,0.48298678820927854,0.48002458518014346
491.0,0.4864209123486703,0.4892120079775353
492.0,0.48263010516564603,0.4924930816657839
493.0,0.4830759243247347,0.49304335441789765
494.0,0.48234278425706123,0.49171547410844507
495.0,0.4857344307680781,0.4471060505809379
496.0,0.4864938438802069,0.4639750726725178
497.0,0.4833656406839631,0.4945523849614235
498.0,0.4860836476655379,0.4602498447517158
499.0,0.4863471544218816,0.4726831285032663
500.0,0.4835316697600433,0.4898108456586936
501.0,0.4827382279001161,0.4789760894552019
502.0,0.4890075021776634,0.4466174918205345
503.0,0.48548784072472206,0.4755220343565561
504.0,0.48677873391554877,0.4964082815263677
505.0,0.4863187379169418,0.4915265326700088
506.0,0.4857047478596872,0.4940228655613052
507.0,0.4826901448474826,0.4937123450462852
508.0,0.4852302062992721,0.42851822529100025
509.0,0.48413598868372426,0.4944369065795655
510.0,0.48216310389686534,0.494001485146433
511.0,0.48430280909737183,0.48738502777863485
512.0,0.4829003606615857,0.487559391332762
513.0,0.4817918510476745,0.49482971469463327
514.0,0.4821118050988867,0.47683482642967345
515.0,0.48808411579642647,0.46556823843798906
516.0,0.4841354878432177,0.49247322646483754
517.0,0.48504212554055803,0.456617274402812
518.0,0.4794460660702852,0.46840809498542024
519.0,0.48362957823535774,0.49638459656899697
520.0,0.4854298323673346,0.49518341447539926
521.0,0.48045896898394086,0.4927354094720035
522.0,0.48274932791433245,0.4786224927094111
523.0,0.4863021851025079,0.48948095040719664
524.0,0.4859280305215147,0.462777770295641
525.0,0.48531105052217055,0.4834725964385332
526.0,0.484097794383994,0.48948095040719664
527.0,0.4844508546799362,0.48899503190554594
528.0,0.48605991112328883,0.49556323380651585
529.0,0.480340873657796,0.49356061616282537
530.0,0.4864414738547665,0.49683906851997267
531.0,0.48335361113145575,0.476378237534471
532.0,0.4855326439384356,0.49683906851997267
533.0,0.48100688806062314,0.49235559014088703
534.0,0.4849813739930844,0.49038718986814134
535.0,0.4849679728960913,0.4981381394971537
536.0,0.48255001048844826,0.4945523849614235
537.0,0.48583684164027524,0.47224773596647096
538.0,0.4836876975377799,0.49600686677769545
539.0,0.4844262381276572,0.49647736912092905
540.0,0.48786321731226656,0.4642253966416776
541.0,0.48340972282115363,0.4968623047836967
542.0,0.4889391552081194,0.4675125364027954
543.0,0.48518238449915857,0.48979872849960415
544.0,0.4820963945656353,0.49477962093691163
545.0,0.4833918248366453,0.48524714612922726
546.0,0.482163052400236,0.49266745668242823
547.0,0.4858273887031253,0.49401124418546033
548.0,0.48626533148828077,0.47355835404658786
549.0,0.48433439890383745,0.4829596122263578
550.0,0.4809780875125553,0.48134475715123715
551.0,0.487462303900312,0.4411260088819955
552.0,0.4866443707785921,0.47938234347334907
553.0,0.4876386417358975,0.45453115539012723
554.0,0.4866206696184411,0.47199171530188017
555.0,0.48687730190841033,0.4864006560732045
556.0,0.4849009805823174,0.4936242184886027
557.0,0.4833399832059936,0.49258069333305
558.0,0.47968355491027026,0.4948304986816993
559.0,0.4868286025355216,0.4726470560412019
560.0,0.4861086728069114,0.48038797937362604
561.0,0.48631433769531385,0.4937525231720215
562.0,0.4838016994617336,0.4690040037106451
563.0,0.48724792412202517,0.47046696781481867
564.0,0.4850758219784087,0.46515309528071513
565.0,0.4860847393853877,0.4958041975098133
566.0,0.4831306104683586,0.4692544076037953
567.0,0.48364168442133965,0.4913212902105697
568.0,0.48923000665799715,0.4472706563844568
569.0,0.4811415746969921,0.4942471682247942
570.0,0.4838100162874644,0.4750865230353802
571.0,0.4878615165188306,0.489071289388208
572.0,0.48190213948308674,0.49580002077344226
573.0,0.4855879356689891,0.48727177532226684
574.0,0.4829780112961965,0.4850334507623012
575.0,0.4840356924336232,0.4911023650910653
576.0,0.48308074281277946,0.4914255366079238
577.0,0.479478192621825,0.49635710856221843
578.0,0.4838809160447131,0.48898317943911
579.0,0.4827973462882635,0.480846787316254
580.0,0.48432908450762036,0.49268557313244576
581.0,0.48601138107248953,0.4898706406297436
582.0,0.482537448191371,0.47359403600078037
583.0,0.48385626490219247,0.4774771389487711
584.0,0.4842563284467163,0.49306246456229824
585.0,0.48819115493955545,0.4917676469549382
586.0,0.4838380146109104,0.47782898749233255
587.0,0.4843715296328927,0.487977818928381
588.0,0.4848781038714292,0.48794744216417335
589.0,0.4865690512528337,0.4894096406491779
590.0,0.4883141986792061,0.4890047559697109
591.0,0.48018422574313846,0.47010434540292456
592.0,0.48552527217170477,0.48362984925441604
593.0,0.4840800246721721,0.4545185698168142
594.0,0.48135842062907597,0.4955847664456332
595.0,0.4835120869771342,0.473360193456945
596.0,0.48752345165708155,0.4697273156654154
597.0,0.4851547276997156,0.49156373672973547
598.0,0.48506700188972174,0.48604312020206397
599.0,0.4846606065917586,0.46015914554325704
600.0,0.48787968680765276,0.47601741933717245
601.0,0.48421205031506276,0.4794761278057498
602.0,0.48176300874368955,0.4894480859799143
603.0,0.4847665921022522,0.46620452994696254
604.0,0.4842900460181334,0.4894699329917748
605.0,0.4821228010888962,0.49105909332721165
606.0,0.4874120399489889,0.48120531773049535
607.0,0.4836157525992869,0.4930857288577557
608.0,0.4817502935534627,0.49343031206667753
609.0,0.48677262529097604,0.492035477531225
610.0,0.4833278039964648,0.4945405385501153
611.0,0.48720234812477675,0.49103814789788186
612.0,0.48223441978713727,0.4905499188342271
613.0,0.48447535236634776,0.4912709457740852
614.0,0.4808663688499454,0.48981837849618964
615.0,0.4885705949751065,0.48047443761454706
616.0,0.48404343982379183,0.4971202192000513
617.0,0.4830967395048239,0.4682702037729625
618.0,0.4838691817606628,0.49067523915040495
619.0,0.48781238546524563,0.4896528120332338
620.0,0.4850253603294335,0.49591393900695474
621.0,0.48211961492511773,0.4947680336801776
622.0,0.4880316581512664,0.494094061130974
623.0,0.4886198286217369,0.4698124435491698
624.0,0.4813833354239312,0.48769274368512994
625.0,0.484820304144709,0.48641322444853735
626.0,0.4854674072963899,0.48461583245423273
627.0,0.4872644844532095,0.4932022088198392
628.0,0.4826352310252741,0.49260840929651356
629.0,0.4824905291677344,0.45850257907259234
630.0,0.48285005220237187,0.4941661967608994
631.0,0.48389338189264397,0.48531738556535514
632.0,0.48587592912252386,0.46883500335294576
633.0,0.48174084172410436,0.49216490230046783
634.0,0.48200059595744094,0.4788601562596575
635.0,0.4856128031576554,0.48724721787415043
636.0,0.48517427879502995,0.49096716512553507
637.0,0.48351514279129326,0.4681736699795165
638.0,0.48711283647668474,0.478340541333746
639.0,0.4837714770597547,0.488434922363615
640.0,0.48643782305927213,0.47825040076233444
641.0,0.4873692139405324,0.46624069901499093
642.0,0.48789018832271686,0.48290476970298873
643.0,0.4861358523936449,0.4672131699350031
644.0,0.4840289133785822,0.49514915598359605
645.0,0.48646116557588776,0.48354161440867155
646.0,0.483809893933539,0.48619959727145345
647.0,0.48588569148190686,0.4837377663025327
648.0,0.4869517984416622,0.4224173513337008
649.0,0.4862096503387554,0.4544276780070527
650.0,0.48638992045032947,0.48400172688953846
651.0,0.4845046766485357,0.49379808138919246
652.0,0.4855532710530857,0.4651074512068097
653.0,0.48559478349969204,0.48902505119990436
654.0,0.48622323635307013,0.4923951723066913
655.0,0.4877522325200632,0.4646455748395968
656.0,0.4839185043204993,0.48890052180251176
657.0,0.4865535723357131,0.48818627296100886
658.0,0.4874528332840701,0.47671647343460516
659.0,0.4868564570070535,0.48737488602179674
660.0,0.4863579674992205,0.46034483096914697
661.0,0.48503562347038487,0.476299716885081
662.0,0.48533864860514087,0.4703899059395239
663.0,0.48359821923005336,0.4582622230268824
664.0,0.4839957738881363,0.49338670518852185
665.0,0.48380475269543327,0.49420455065574853
666.0,0.4867021939362374,0.4697383130969523
667.0,0.4857140769618244,0.4952837499602125
668.0,0.4850358943743388,0.4664951314844429
669.0,0.48687168277222914,0.4806743220558572
670.0,0.4825216139618272,0.4893977018718444
671.0,0.48339444867999,0.4899589641308568
672.0,0.4867474641093116,0.47521674687895515
673.0,0.483641337114492,0.49080098670927336
674.0,0.48595937666620265,0.48884698513425984
675.0,0.4856654939524089,0.48806743614589565
676.0,0.4844274832905866,0.4937764148764565
677.0,0.4850812522956225,0.4936553948985166
678.0,0.48535257393481046,0.46533854061309027
679.0,0.48006399692632784,0.49371910972844735
680.0,0.48474825296548646,0.48142403275668755
681.0,0.48333324382132503,0.47720034940021905
682.0,0.484941021254803,0.4789790052042314
683.0,0.48718068517068364,0.49037361616505515
684.0,0.48384413566029116,0.49343001535099207
685.0,0.48703449803173426,0.45473945814900074
686.0,0.4822623759505961,0.48642699274232926
687.0,0.48599561600502333,0.4937125284006588
688.0,0.48127130832134263,0.49193699756960513
689.0,0.4858772240547066,0.4768212777187431
690.0,0.48534077847345775,0.47169534736987145
691.0,0.48483094984687874,0.4831072471629249
692.0,0.48280752326132237,0.4881162656269977
693.0,0.4854438729315461,0.48842430259888403
694.0,0.48235544390093077,0.496275017497153
695.0,0.48601598465265433,0.49023707186092935
696.0,0.4881710638945426,0.4186795163185116
697.0,0.4801414310516695,0.4907227786300179
698.0,0.4862313777146627,0.4597016277486192
699.0,0.48609086305252636,0.4905623138115996
700.0,0.4883177967004751,0.4423847189789405
701.0,0.48303032855395,0.4921492935101658
702.0,0.4839549444350227,0.46672915324130965
703.0,0.48493804027338605,0.45688688816490697
704.0,0.48688148415735466,0.46529710708396643
705.0,0.4813321292057792,0.4596686724576645
706.0,0.4852151493567613,0.4954321872508227
707.0,0.48487841804879606,0.48975567856017443
708.0,0.48597269674415866,0.4856147993122067
709.0,0.4854153570947731,0.4760683962234555
710.0,0.48114355464589154,0.4748471990901199
711.0,0.4853234148518508,0.48467941590093006
712.0,0.48238031571980705,0.4951031125227157
713.0,0.48280261281845255,0.4938523327439396
714.0,0.48142399819353376,0.47381846941214967
715.0,0.48526551467970847,0.494306325737266
716.0,0.480727268343535,0.4672666579573876
717.0,0.48404605311254184,0.46017091184166264
718.0,0.4847459434783894,0.46522976726789117
719.0,0.4851605862906748,0.48186336815310354
720.0,0.48653097239146686,0.4657895202081757
721.0,0.486384126054598,0.4695536739634128
722.0,0.4859324612920935,0.4832068805617407
723.0,0.48047381513406673,0.4936410761013103
724.0,0.4837588001509764,0.48146189841155834
725.0,0.4885153919906265,0.4865195558892597
726.0,0.4825094612993072,0.48657419076912506
727.0,0.4837950685280569,0.4940941344499827
728.0,0.4836538824124886,0.4904246753157977
729.0,0.48483736540393546,0.4817397460644547
730.0,0.4834261764755307,0.48511074063423554
731.0,0.4881293461511908,0.4901590899833434
732.0,0.48494738099909906,0.48752689749941897
733.0,0.48572909460058267,0.4949601580070114
734.0,0.487677524756966,0.44915841987177746
735.0,0.4860618051259403,0.4817500721581297
736.0,0.4804639966698797,0.4926927609406051
737.0,0.4844098143076389,0.4916811209875968
738.0,0.4857942509393803,0.4877389663071938
739.0,0.4868978715583516,0.49441270605201076
740.0,0.48560485039015566,0.49190284983666993
741.0,0.48594997236579107,0.4633683043974188
742.0,0.4835871355548176,0.49191372268310457
743.0,0.483524929644064,0.493936762269594
744.0,0.48005694771583524,0.4941714511104013
745.0,0.48801013226218853,0.4769620787465534
746.0,0.48756874654338705,0.4923743748288686
747.0,0.48260320130653284,0.4942073788543859
748.0,0.4853216749217501,0.48856912879180114
749.0,0.4844916265235265,0.4948199782299944
750.0,0.4822608727044339,0.4893380696898332
751.0,0.4871419411468099,0.4539177888537943
752.0,0.48299094232684214,0.49207472415540526
753.0,0.4846341139357611,0.4851616255627277
754.0,0.48556277043853435,0.49542641618978517
755.0,0.4866818474344044,0.44456009718540124
756.0,0.4842411156621524,0.49524795695450285
757.0,0.4854805458492977,0.496463031894469
758.0,0.48402387934710916,0.49520549580276246
759.0,0.4832350978192262,0.4877946030340913
760.0,0.479726851204731,0.49233886646139197
761.0,0.484851113757784,0.49436530165184905
762.0,0.48529299046386426,0.4887801022125112
763.0,0.47939329174806333,0.49542641618978517
764.0,0.486668838242254,0.4893311378777221
765.0,0.484128546716036,0.4953839550380444
766.0,0.4821231509334272,0.48353301385728187
767.0,0.4864420614663469,0.48573443031905644
768.0,0.4843241481692033,0.4708146965150836
769.0,0.4844034064077769,0.48552380286526853
770.0,0.4808604598710606,0.4604636373308595
771.0,0.48268686403039923,0.49720982069214936
772.0,0.4804961677881582,0.46733136411795195
773.0,0.4840701197945061,0.48767649685316755
774.0,0.48573553290860877,0.47299756355800415
775.0,0.4840088003793997,0.47371908591265244
776.0,0.4850774727297378,0.49086265150472924
777.0,0.4834723437126588,0.4965675787165059
778.0,0.48275743752567274,0.4951740774176474
779.0,0.48897235472292633,0.46002249160937686
780.0,0.48571122271312306,0.489734084148067
781.0,0.48169302164515165,0.48945076592313347
782.0,0.4825402091968426,0.4945676017147549
783.0,0.48456321478937997,0.4976644960596972
784.0,0.48505719895852817,0.49135844580672977
785.0,0.48541853808442176,0.4801929149914266
786.0,0.4858700765403931,0.48350306567331947
787.0,0.48541861036153705,0.4944527000544836
788.0,0.4812358299448733,0.494892483537916
789.0,0.48529974070018406,0.48077560028180555
790.0,0.48498498015926667,0.46246011128963244
791.0,0.4859867057494557,0.4646791825216618
792.0,0.4810050067192727,0.4733010412669433
793.0,0.483143906991021,0.4884708091127986
794.0,0.4850234371603736,0.49204792649005136
795.0,0.48443914636528274,0.491236690633134
796.0,0.48400954580176164,0.48255947148903716
797.0,0.4847253211462164,0.47637352570203445
798.0,0.4835202146767514,0.46616107607156027
799.0,0.47950973297358795,0.49152132394953346
800.0,0.487258332319168,0.45708480292734965
801.0,0.4844224956077567,0.493747759512428
802.0,0.4859126208977158,0.4759009706013119
803.0,0.4851729297321242,0.482786839304912
804.0,0.48332320723716937,0.4859570069428603
805.0,0.4843689856119893,0.4904790082303173
806.0,0.48400753359494747,0.47116369652458573
807.0,0.4820250321691781,0.4832602202963102
808.0,0.48593348929957314,0.4724143346161301
809.0,0.48582276386013157,0.49621641347430506
810.0,0.4862498408180579,0.49074077871701927
811.0,0.4839375179444693,0.49004328497053556
812.0,0.48579009408451596,0.4964190497265838
813.0,0.48083305329664533,0.4923675290767525
814.0,0.484534168274604,0.47899818693331697
815.0,0.48400262745418154,0.4913130712087384
816.0,0.4852877766958893,0.48771422583636054
817.0,0.48592335990418245,0.495889066127788
818.0,0.4857269532256527,0.4938917736748091
819.0,0.47984150384095225,0.49432251083557566
820.0,0.4773395504112269,0.48944941809216647
821.0,0.4798549051033781,0.49228725433294657
822.0,0.4837474122720822,0.4921614462800428
823.0,0.48584764769583605,0.4931753026498724
824.0,0.48647881633985585,0.44275341466320656
825.0,0.480572484827815,0.47128562969988547
826.0,0.48420954779793,0.48238739361572835
827.0,0.48160729159739973,0.49393443013511723
828.0,0.48583173454874207,0.48026475357639536
829.0,0.4857757223456089,0.46669712891369575
830.0,0.4807595799131653,0.4805599047806013
831.0,0.4829779500930964,0.4889038525263051
832.0,0.48134671023784303,0.48041843233180137
833.0,0.484475912850498,0.4912693781440989
834.0,0.4841524128860601,0.4680635338330268
835.0,0.4810299596201382,0.4870484793891588
836.0,0.48220842792875507,0.48710009021085293
837.0,0.48614019950508763,0.47999052519326285
838.0,0.48552947894710813,0.49221540767718003
839.0,0.48358300962170425,0.48975632974479677
840.0,0.4859043512675752,0.49612173164065304
841.0,0.48340031151725665,0.4745781852723798
842.0,0.4856363853144438,0.48204834102780897
843.0,0.48183714421407975,0.4970948508350357
844.0,0.4804932813596222,0.47163433782385655
845.0,0.48113944121633684,0.4904624672648926
846.0,0.4839588487050008,0.47151833478308447
847.0,0.48351080063673924,0.49021401039323786
848.0,0.4853767979740668,0.4659797332577143
849.0,0.47919587034173816,0.4952566193007167
850.0,0.48015017787700864,0.49565790687093414
851.0,0.48318926718260463,0.4896616048585023
852.0,0.4810223526426721,0.48862414623158024
853.0,0.48540118863104015,0.494662079876786
854.0,0.48076176464447823,0.4920937749041302
855.0,0.4807600160341129,0.4929092193723049
856.0,0.48023319764376315,0.4853716016901945
857.0,0.48089419713281417,0.4909845890634794
858.0,0.48292328549014896,0.4695829442536088
859.0,0.4802722375647739,0.4874976753241809
860.0,0.4852892328739277,0.49478543665026903
861.0,0.4841896072019661,0.4901843605449567
862.0,0.4820321191306204,0.494969599693465
863.0,0.48347445545956463,0.49312986804852466
864.0,0.4812596004815727,0.47337519286234325
865.0,0.4827012799302249,0.4935732825798468
866.0,0.48592159697119425,0.4750906490932604
867.0,0.48903659126812454,0.46955215319796145
868.0,0.4816119282597938,0.49583223166544393
869.0,0.4825939072926541,0.4887913368419942
870.0,0.486070084124928,0.47925024570888336
871.0,0.4838830586257255,0.4899385238526773
872.0,0.48745460982366307,0.47900524417613816
873.0,0.4881881420466993,0.4745898161761498
874.0,0.4851273566447231,0.47496036244068823
875.0,0.48412812869398414,0.49292166633871864
876.0,0.4805490632125987,0.44522349016432244
877.0,0.48316230754940553,0.4962456241581172
878.0,0.48191605881598193,0.4942197827456427
879.0,0.48449136653455954,0.47973181316441366
880.0,0.4827496455894364,0.4948558291945955
881.0,0.48447590739256047,0.4769637436249752
882.0,0.4806119289085009,0.4707868960606754
883.0,0.4859133580617039,0.4674374250951316
884.0,0.4844304934545076,0.4922346925533593
885.0,0.48186547539924285,0.49497750159037673
886.0,0.48438005347828184,0.48642345085192196
887.0,0.48360233253922397,0.4958492376709211
888.0,0.47996056066637566,0.4740051680224883
889.0,0.4833888103690744,0.48169830994005763
890.0,0.48591099800385484,0.4955264923683735
891.0,0.48150581248589236,0.4973102987689053
892.0,0.48434155292016506,0.4574695845989624
893.0,0.4824381957996476,0.49458554969119045
894.0,0.4832222365446284,0.48131587926219394
895.0,0.48006067556494797,0.4527174463991265
896.0,0.4864763638335826,0.4873145431804684
897.0,0.4796522925514323,0.48616363216910097
898.0,0.4868794049038572,0.4785433730118066
899.0,0.4871639185155459,0.4788049615367528
900.0,0.4884960319780461,0.4567778764639862
901.0,0.4817474905303272,0.4507469471581388
902.0,0.4820010634846419,0.4961617095628126
903.0,0.48215079298542146,0.4885775987444426
904.0,0.4863413516992177,0.4786089031092017
905.0,0.482265430370005,0.47424421830199315
906.0,0.483912591660543,0.4659790674054413
907.0,0.4810187567640904,0.48295020852445647
908.0,0.488746165231677,0.48033010641018586
909.0,0.4823214097651566,0.49449978804585
910.0,0.4813630120166759,0.4910107826814468
911.0,0.48236513627707983,0.46838295870324753
912.0,0.4872636569579134,0.4604257005874025
913.0,0.48039687794546404,0.49231418292106577
914.0,0.4835046622853122,0.4777820430298313
915.0,0.48495326580956827,0.49522938724265136
916.0,0.4835424168288834,0.4890968432619148
917.0,0.48162206142389,0.49721542216819864
918.0,0.48402260535378455,0.4736521839091086
919.0,0.48589139143615684,0.4899809111580329
920.0,0.4833977910611113,0.4960001584177778
921.0,0.4859888352957599,0.4924846796360541
922.0,0.48609736863344105,0.48442895850304885
923.0,0.48709485446961515,0.4670309395483125
924.0,0.4850728403811896,0.48011223142409
925.0,0.4861473363647008,0.4656984603481977
926.0,0.48224031599492845,0.49637828259476974
927.0,0.48319119440358677,0.4893428243902124
928.0,0.48299411513241186,0.49136598890745
929.0,0.4822480090098366,0.48730500346456457
930.0,0.4862520273964939,0.49129168168841764
931.0,0.4842491264958985,0.46112949253867
932.0,0.48452404587180375,0.49547177500413464
933.0,0.4860467952470056,0.4849034184419577
934.0,0.4833544215069575,0.497004091009802
935.0,0.4859731730585413,0.4815905952896028
936.0,0.48227334991226944,0.48162192459842595
937.0,0.4882103694749072,0.48005251699592333
938.0,0.4867962276547955,0.4829928004275511
939.0,0.4841399760164331,0.484404651325196
940.0,0.484884997128968,0.48917998377450644
941.0,0.48596630813078656,0.4884766016258679
942.0,0.47927780354128746,0.4960828758266356
943.0,0.4878165537693003,0.4838685816950209
944.0,0.4835147930774002,0.495856833551782
945.0,0.4828444498706795,0.4697721046998275
946.0,0.48161211280506205,0.48659078477015344
947.0,0.4871752207703419,0.4769047019314657
948.0,0.4815308636634181,0.48156287164041683
949.0,0.4825005906049859,0.49044562466416347
950.0,0.48677725489655355,0.48230380670800255
951.0,0.48084132262267315,0.4879002648593412
952.0,0.48471442297208767,0.4835846222734257
953.0,0.48522430005768025,0.4952585192587296
954.0,0.4840491016636301,0.49583323132010393
955.0,0.4860628113093619,0.46287654137632694
956.0,0.48564123414233473,0.48414334740509046
957.0,0.4840972451026691,0.49073745790872053
958.0,0.48282068705763875,0.47181301922038454
959.0,0.4829736881887389,0.490630331931714
960.0,0.4840060281954733,0.49223502668238023
961.0,0.48254024536564727,0.4858949363643493
962.0,0.4838456539312945,0.48778337752999057
963.0,0.48518424000292265,0.4698234772012986
964.0,0.48363634171180064,0.4906010328434715
965.0,0.48359249683684447,0.4782847781964583
966.0,0.4837646487372523,0.49142490687797896
967.0,0.4845584070317895,0.491071618761727
968.0,0.4848297982815028,0.4853208814848672
969.0,0.4846494370720674,0.47780389373389437
970.0,0.48538671719645604,0.4791824586867891
971.0,0.4833881309947246,0.4814299082797135
972.0,0.4827240019816011,0.48907186442097966
973.0,0.4851411208209939,0.48808162118371096
974.0,0.48541396326991554,0.47541606883775406
975.0,0.48511733500787435,0.49062743225879707
976.0,0.48510084075357507,0.46521421298123605
977.0,0.482565053030032,0.47966289932330497
978.0,0.4838251695845695,0.48299323781044345
979.0,0.48195042658672743,0.4898630301193994
980.0,0.48362305541055295,0.4815824874604751
981.0,0.48597114293125865,0.47342959443292093
982.0,0.482349163846509,0.4816673598246945
983.0,0.4822287551994319,0.4927331020581548
984.0,0.48258486552234875,0.48655611635718277
985.0,0.4830309918765568,0.4902374551578572
986.0,0.4839878524729892,0.4932794079465208
987.0,0.4844030491266111,0.49143657076792063
988.0,0.48411559895926604,0.47025880925450636
989.0,0.4830407669747239,0.47072675635996764
990.0,0.4845186618504762,0.49700324993036565
991.0,0.48131626959815677,0.49530667964686365
992.0,0.4874391655207846,0.47934831598429295
993.0,0.4872226523195746,0.4902233698799877
994.0,0.4851222262974156,0.48020542369569286
995.0,0.47787053165387966,0.4974386316645499
996.0,0.48436687528594635,0.4887518854502848
997.0,0.4841731444603754,0.48891605876842226
998.0,0.4786886194522121,0.4867659997321396
999.0,0.4847336998414787,0.4879710024335917
1000.0,0.48340338866210497,0.48643527214069826
1001.0,0.48084576095671955,0.48318454215393747
1002.0,0.4829235490367302,0.488228070990517
1003.0,0.4814582419806114,0.4781780724966904
1004.0,0.4820359084999552,0.47740409609369927
1005.0,0.4884396411338383,0.472773145103318
1006.0,0.4830817427317373,0.49554688681813847
1007.0,0.48290332032956723,0.49093669164267684
1008.0,0.48402560996258814,0.4891998323992382
1009.0,0.4836089645870736,0.49357849874700654
1010.0,0.4857368573811781,0.4893647956658819
1011.0,0.4823154175934245,0.49467132321173557
1012.0,0.47973762581715307,0.4963399825639223
1013.0,0.4845907818916571,0.4837315340108626
1014.0,0.48363114659362966,0.4960694643381848
1015.0,0.48264331661852083,0.4965221078699994
1016.0,0.4780388279291308,0.47708105627258784
1017.0,0.4834663321156201,0.4920026980635857
1018.0,0.486741747713516,0.4697002004982545
1019.0,0.4842730040358827,0.46700115589475283
1020.0,0.485528691415087,0.47534026757199405
1021.0,0.48305733006505613,0.4922482979047656
1022.0,0.48338750302961714,0.48863478518827913
1023.0,0.486792846626084,0.4671382574807485
1024.0,0.48159638320167725,0.4884700626171617
1025.0,0.48030687043569653,0.49535149722178434
1026.0,0.48262434632304313,0.48560285845083306
1027.0,0.48057093713701193,0.49231899098215376
1028.0,0.4869153193583961,0.47462703928819955
1029.0,0.4830158864019647,0.49513355816120774
1030.0,0.4848728422137239,0.47684036811097896
1031.0,0.483672194980718,0.48000943024004256
1032.0,0.48514074821333836,0.47392091949513016
1033.0,0.4832673994313995,0.4947799124351748
