"perc BEV","tick"
3.5000000000000004,1.0
3.5000000000000004,2.0
3.5000000000000004,3.0
3.5000000000000004,4.0
3.5000000000000004,5.0
3.5000000000000004,6.0
3.5000000000000004,7.0
3.5000000000000004,8.0
3.5000000000000004,9.0
3.5000000000000004,10.0
3.5000000000000004,11.0
3.5000000000000004,12.0
3.5000000000000004,13.0
3.5000000000000004,14.0
3.5000000000000004,15.0
3.5000000000000004,16.0
3.5000000000000004,17.0
3.5000000000000004,18.0
3.5000000000000004,19.0
3.5000000000000004,20.0
3.5000000000000004,21.0
3.5000000000000004,22.0
3.5000000000000004,23.0
3.5000000000000004,24.0
3.5000000000000004,25.0
3.5000000000000004,26.0
3.5000000000000004,27.0
3.5000000000000004,28.0
3.5000000000000004,29.0
3.5000000000000004,30.0
3.5000000000000004,31.0
3.5000000000000004,32.0
3.5000000000000004,33.0
3.5000000000000004,34.0
3.5000000000000004,35.0
3.5000000000000004,36.0
3.5000000000000004,37.0
3.5000000000000004,38.0
3.5000000000000004,39.0
3.5000000000000004,40.0
3.5000000000000004,41.0
3.5000000000000004,42.0
3.5000000000000004,43.0
3.5000000000000004,44.0
3.5000000000000004,45.0
3.5000000000000004,46.0
3.5000000000000004,47.0
3.5000000000000004,48.0
3.5000000000000004,49.0
3.5000000000000004,50.0
3.5000000000000004,51.0
3.5000000000000004,52.0
3.5000000000000004,53.0
3.5000000000000004,54.0
3.5000000000000004,55.0
3.5000000000000004,56.0
3.5000000000000004,57.0
4.0,58.0
4.0,59.0
4.0,60.0
4.0,61.0
4.5,62.0
4.5,63.0
4.5,64.0
4.5,65.0
4.5,66.0
4.5,67.0
4.5,68.0
4.5,69.0
4.5,70.0
4.5,71.0
4.5,72.0
4.5,73.0
4.5,74.0
5.0,75.0
5.0,76.0
5.0,77.0
5.0,78.0
5.0,79.0
5.0,80.0
5.0,81.0
5.0,82.0
5.0,83.0
5.0,84.0
5.0,85.0
5.0,86.0
5.0,87.0
5.0,88.0
5.0,89.0
5.0,90.0
5.0,91.0
5.0,92.0
5.0,93.0
5.0,94.0
5.0,95.0
5.0,96.0
5.0,97.0
5.0,98.0
5.0,99.0
5.0,100.0
5.0,101.0
5.0,102.0
5.0,103.0
5.0,104.0
5.0,105.0
5.0,106.0
5.0,107.0
5.0,108.0
5.0,109.0
5.0,110.0
5.0,111.0
5.0,112.0
5.0,113.0
5.0,114.0
5.0,115.0
5.0,116.0
5.0,117.0
5.0,118.0
5.0,119.0
5.0,120.0
5.0,121.0
5.0,122.0
5.0,123.0
5.0,124.0
5.0,125.0
5.0,126.0
5.0,127.0
5.0,128.0
5.0,129.0
5.0,130.0
5.0,131.0
5.0,132.0
5.5,133.0
5.5,134.0
5.5,135.0
5.5,136.0
5.5,137.0
5.5,138.0
5.5,139.0
5.5,140.0
5.5,141.0
5.5,142.0
5.5,143.0
5.5,144.0
5.5,145.0
5.5,146.0
5.5,147.0
5.5,148.0
5.5,149.0
5.5,150.0
5.5,151.0
5.5,152.0
5.5,153.0
5.5,154.0
5.5,155.0
5.5,156.0
5.5,157.0
5.5,158.0
5.5,159.0
5.5,160.0
5.5,161.0
5.5,162.0
5.5,163.0
5.5,164.0
5.5,165.0
5.5,166.0
5.5,167.0
5.5,168.0
5.5,169.0
5.5,170.0
5.5,171.0
5.5,172.0
6.0,173.0
6.0,174.0
6.0,175.0
6.0,176.0
6.5,177.0
7.000000000000001,178.0
7.000000000000001,179.0
7.000000000000001,180.0
7.000000000000001,181.0
7.000000000000001,182.0
7.000000000000001,183.0
7.000000000000001,184.0
7.000000000000001,185.0
7.000000000000001,186.0
7.000000000000001,187.0
7.000000000000001,188.0
7.000000000000001,189.0
7.5,190.0
7.5,191.0
7.5,192.0
7.5,193.0
7.5,194.0
7.5,195.0
7.5,196.0
7.5,197.0
7.5,198.0
7.5,199.0
7.5,200.0
7.5,201.0
7.5,202.0
7.5,203.0
8.0,204.0
8.0,205.0
8.0,206.0
8.5,207.0
8.5,208.0
8.5,209.0
8.5,210.0
8.5,211.0
9.0,212.0
9.0,213.0
9.5,214.0
9.5,215.0
9.5,216.0
9.5,217.0
9.5,218.0
9.5,219.0
9.5,220.0
9.5,221.0
9.5,222.0
9.5,223.0
9.5,224.0
10.0,225.0
10.0,226.0
10.0,227.0
10.0,228.0
10.0,229.0
10.0,230.0
10.0,231.0
10.0,232.0
10.0,233.0
10.0,234.0
10.5,235.0
10.5,236.0
10.5,237.0
10.5,238.0
10.5,239.0
10.5,240.0
10.5,241.0
10.5,242.0
11.0,243.0
11.0,244.0
11.0,245.0
11.0,246.0
11.5,247.0
11.5,248.0
11.5,249.0
11.5,250.0
11.5,251.0
11.5,252.0
11.5,253.0
12.0,254.0
12.0,255.0
12.0,256.0
12.0,257.0
12.0,258.0
12.0,259.0
12.0,260.0
14.499999999999998,261.0
14.499999999999998,262.0
14.499999999999998,263.0
14.499999999999998,264.0
14.499999999999998,265.0
14.499999999999998,266.0
15.0,267.0
15.0,268.0
16.0,269.0
16.0,270.0
16.0,271.0
16.0,272.0
16.5,273.0
16.5,274.0
16.5,275.0
16.5,276.0
16.5,277.0
17.0,278.0
17.0,279.0
17.0,280.0
17.0,281.0
17.5,282.0
17.5,283.0
17.5,284.0
17.5,285.0
17.5,286.0
18.0,287.0
18.0,288.0
18.0,289.0
18.5,290.0
18.5,291.0
18.5,292.0
18.5,293.0
18.5,294.0
18.5,295.0
18.5,296.0
18.5,297.0
18.5,298.0
18.5,299.0
18.5,300.0
18.5,301.0
19.0,302.0
19.0,303.0
19.5,304.0
19.5,305.0
19.5,306.0
19.5,307.0
20.0,308.0
20.0,309.0
20.0,310.0
20.0,311.0
20.0,312.0
21.5,313.0
21.5,314.0
21.5,315.0
21.5,316.0
21.5,317.0
21.5,318.0
21.5,319.0
22.0,320.0
22.5,321.0
22.5,322.0
23.0,323.0
23.0,324.0
23.0,325.0
23.0,326.0
23.5,327.0
23.5,328.0
23.5,329.0
23.5,330.0
23.5,331.0
23.5,332.0
23.5,333.0
24.0,334.0
24.0,335.0
24.5,336.0
24.5,337.0
24.5,338.0
24.5,339.0
24.5,340.0
25.0,341.0
25.5,342.0
25.5,343.0
25.5,344.0
25.5,345.0
26.0,346.0
26.0,347.0
26.0,348.0
26.0,349.0
26.5,350.0
26.5,351.0
26.5,352.0
26.5,353.0
26.5,354.0
26.5,355.0
26.5,356.0
26.5,357.0
26.5,358.0
26.5,359.0
27.0,360.0
27.0,361.0
27.0,362.0
27.0,363.0
27.0,364.0
28.000000000000004,365.0
28.000000000000004,366.0
28.000000000000004,367.0
28.000000000000004,368.0
28.000000000000004,369.0
28.000000000000004,370.0
28.000000000000004,371.0
28.000000000000004,372.0
28.000000000000004,373.0
28.000000000000004,374.0
28.000000000000004,375.0
28.499999999999996,376.0
28.499999999999996,377.0
28.499999999999996,378.0
28.499999999999996,379.0
28.499999999999996,380.0
28.999999999999996,381.0
28.999999999999996,382.0
28.999999999999996,383.0
28.999999999999996,384.0
28.999999999999996,385.0
28.999999999999996,386.0
28.999999999999996,387.0
28.999999999999996,388.0
28.999999999999996,389.0
28.999999999999996,390.0
28.999999999999996,391.0
28.999999999999996,392.0
28.999999999999996,393.0
28.999999999999996,394.0
29.5,395.0
30.0,396.0
30.5,397.0
30.5,398.0
30.5,399.0
30.5,400.0
30.5,401.0
30.5,402.0
31.0,403.0
31.0,404.0
31.5,405.0
31.5,406.0
32.5,407.0
32.5,408.0
32.5,409.0
32.5,410.0
32.5,411.0
32.5,412.0
32.5,413.0
32.5,414.0
32.5,415.0
32.5,416.0
33.5,417.0
34.0,418.0
34.0,419.0
34.0,420.0
34.5,421.0
34.5,422.0
34.5,423.0
35.0,424.0
35.0,425.0
35.0,426.0
35.5,427.0
35.5,428.0
35.5,429.0
35.5,430.0
36.0,431.0
36.0,432.0
36.0,433.0
36.0,434.0
36.0,435.0
36.5,436.0
36.5,437.0
36.5,438.0
36.5,439.0
36.5,440.0
36.5,441.0
36.5,442.0
36.5,443.0
37.0,444.0
37.0,445.0
37.0,446.0
37.0,447.0
37.0,448.0
37.0,449.0
37.0,450.0
37.0,451.0
37.0,452.0
37.0,453.0
37.0,454.0
37.0,455.0
37.0,456.0
37.0,457.0
37.0,458.0
37.5,459.0
37.5,460.0
38.0,461.0
38.0,462.0
38.0,463.0
38.0,464.0
38.0,465.0
38.0,466.0
38.0,467.0
38.0,468.0
39.0,469.0
39.0,470.0
39.0,471.0
39.0,472.0
39.0,473.0
39.0,474.0
39.5,475.0
39.5,476.0
39.5,477.0
39.5,478.0
39.5,479.0
39.5,480.0
39.5,481.0
39.5,482.0
39.5,483.0
39.5,484.0
39.5,485.0
39.5,486.0
39.5,487.0
39.5,488.0
39.5,489.0
39.5,490.0
39.5,491.0
40.0,492.0
40.0,493.0
40.0,494.0
40.0,495.0
40.0,496.0
40.5,497.0
40.5,498.0
40.5,499.0
40.5,500.0
41.0,501.0
41.0,502.0
41.5,503.0
41.5,504.0
42.0,505.0
42.0,506.0
42.0,507.0
42.0,508.0
42.0,509.0
42.0,510.0
42.0,511.0
42.0,512.0
42.0,513.0
42.0,514.0
42.0,515.0
42.0,516.0
42.0,517.0
42.0,518.0
42.0,519.0
42.0,520.0
42.5,521.0
42.5,522.0
42.5,523.0
42.5,524.0
42.5,525.0
42.5,526.0
43.0,527.0
43.0,528.0
43.0,529.0
43.0,530.0
43.0,531.0
43.0,532.0
43.0,533.0
43.0,534.0
43.0,535.0
43.5,536.0
43.5,537.0
43.5,538.0
43.5,539.0
43.5,540.0
43.5,541.0
43.5,542.0
43.5,543.0
43.5,544.0
43.5,545.0
43.5,546.0
43.5,547.0
43.5,548.0
44.0,549.0
44.0,550.0
44.0,551.0
44.0,552.0
44.0,553.0
44.0,554.0
44.0,555.0
44.0,556.0
44.0,557.0
44.0,558.0
44.0,559.0
44.0,560.0
44.0,561.0
44.0,562.0
44.0,563.0
44.0,564.0
44.0,565.0
44.5,566.0
44.5,567.0
44.5,568.0
44.5,569.0
44.5,570.0
44.5,571.0
44.5,572.0
45.0,573.0
45.0,574.0
45.0,575.0
45.5,576.0
45.5,577.0
45.5,578.0
45.5,579.0
45.5,580.0
45.5,581.0
46.0,582.0
46.5,583.0
46.5,584.0
46.5,585.0
46.5,586.0
46.5,587.0
46.5,588.0
46.5,589.0
46.5,590.0
47.0,591.0
47.0,592.0
47.0,593.0
47.0,594.0
47.5,595.0
47.5,596.0
47.5,597.0
47.5,598.0
47.5,599.0
47.5,600.0
47.5,601.0
47.5,602.0
47.5,603.0
47.5,604.0
47.5,605.0
47.5,606.0
47.5,607.0
47.5,608.0
47.5,609.0
47.5,610.0
47.5,611.0
47.5,612.0
47.5,613.0
47.5,614.0
47.5,615.0
47.5,616.0
47.5,617.0
47.5,618.0
48.0,619.0
49.0,620.0
49.0,621.0
49.0,622.0
49.0,623.0
49.0,624.0
49.0,625.0
49.0,626.0
49.0,627.0
49.0,628.0
49.0,629.0
49.5,630.0
49.5,631.0
49.5,632.0
50.5,633.0
50.5,634.0
50.5,635.0
50.5,636.0
50.5,637.0
50.5,638.0
50.5,639.0
50.5,640.0
50.5,641.0
50.5,642.0
50.5,643.0
51.0,644.0
51.0,645.0
51.5,646.0
52.0,647.0
52.0,648.0
52.0,649.0
52.0,650.0
52.0,651.0
52.0,652.0
52.0,653.0
52.0,654.0
52.0,655.0
52.0,656.0
52.0,657.0
52.0,658.0
52.5,659.0
52.5,660.0
52.5,661.0
53.0,662.0
53.0,663.0
53.0,664.0
53.0,665.0
53.0,666.0
53.5,667.0
53.5,668.0
53.5,669.0
53.5,670.0
53.5,671.0
53.5,672.0
53.5,673.0
53.5,674.0
53.5,675.0
53.5,676.0
53.5,677.0
53.5,678.0
53.5,679.0
53.5,680.0
53.5,681.0
53.5,682.0
53.5,683.0
53.5,684.0
53.5,685.0
53.5,686.0
53.5,687.0
53.5,688.0
53.5,689.0
53.5,690.0
54.0,691.0
54.50000000000001,692.0
54.50000000000001,693.0
54.50000000000001,694.0
54.50000000000001,695.0
54.50000000000001,696.0
55.50000000000001,697.0
55.50000000000001,698.0
55.50000000000001,699.0
55.50000000000001,700.0
55.50000000000001,701.0
55.50000000000001,702.0
56.49999999999999,703.0
56.49999999999999,704.0
56.49999999999999,705.0
56.49999999999999,706.0
56.49999999999999,707.0
56.49999999999999,708.0
56.49999999999999,709.0
56.49999999999999,710.0
56.49999999999999,711.0
56.99999999999999,712.0
56.99999999999999,713.0
56.99999999999999,714.0
56.99999999999999,715.0
56.99999999999999,716.0
57.49999999999999,717.0
57.49999999999999,718.0
57.49999999999999,719.0
57.99999999999999,720.0
57.99999999999999,721.0
57.99999999999999,722.0
57.99999999999999,723.0
57.99999999999999,724.0
57.99999999999999,725.0
57.99999999999999,726.0
58.5,727.0
58.5,728.0
58.5,729.0
58.5,730.0
58.5,731.0
58.5,732.0
58.5,733.0
58.5,734.0
58.5,735.0
59.0,736.0
59.0,737.0
59.0,738.0
59.5,739.0
59.5,740.0
59.5,741.0
59.5,742.0
59.5,743.0
59.5,744.0
59.5,745.0
59.5,746.0
59.5,747.0
59.5,748.0
59.5,749.0
60.0,750.0
60.0,751.0
60.5,752.0
60.5,753.0
60.5,754.0
61.0,755.0
61.0,756.0
61.0,757.0
61.0,758.0
61.0,759.0
61.0,760.0
61.0,761.0
61.0,762.0
61.0,763.0
61.0,764.0
61.0,765.0
61.5,766.0
61.5,767.0
61.5,768.0
61.5,769.0
61.5,770.0
61.5,771.0
61.5,772.0
61.5,773.0
61.5,774.0
61.5,775.0
61.5,776.0
61.5,777.0
62.5,778.0
62.5,779.0
62.5,780.0
62.5,781.0
62.5,782.0
62.5,783.0
62.5,784.0
62.5,785.0
62.5,786.0
62.5,787.0
62.5,788.0
63.0,789.0
63.0,790.0
63.0,791.0
63.0,792.0
63.5,793.0
63.5,794.0
63.5,795.0
63.5,796.0
63.5,797.0
63.5,798.0
63.5,799.0
63.5,800.0
63.5,801.0
63.5,802.0
63.5,803.0
63.5,804.0
63.5,805.0
63.5,806.0
63.5,807.0
63.5,808.0
63.5,809.0
63.5,810.0
63.5,811.0
63.5,812.0
63.5,813.0
64.0,814.0
64.0,815.0
64.0,816.0
64.0,817.0
64.0,818.0
64.5,819.0
65.0,820.0
65.0,821.0
65.0,822.0
65.0,823.0
65.0,824.0
65.0,825.0
65.0,826.0
65.0,827.0
65.5,828.0
65.5,829.0
65.5,830.0
65.5,831.0
65.5,832.0
66.0,833.0
66.0,834.0
66.0,835.0
66.0,836.0
66.0,837.0
66.0,838.0
66.0,839.0
66.0,840.0
66.0,841.0
66.5,842.0
66.5,843.0
66.5,844.0
66.5,845.0
66.5,846.0
66.5,847.0
66.5,848.0
66.5,849.0
67.0,850.0
67.0,851.0
67.0,852.0
67.0,853.0
67.0,854.0
67.0,855.0
67.5,856.0
67.5,857.0
67.5,858.0
67.5,859.0
67.5,860.0
67.5,861.0
67.5,862.0
67.5,863.0
67.5,864.0
67.5,865.0
68.5,866.0
68.5,867.0
68.5,868.0
68.5,869.0
68.5,870.0
69.0,871.0
69.0,872.0
69.0,873.0
69.0,874.0
70.0,875.0
70.5,876.0
70.5,877.0
70.5,878.0
71.0,879.0
71.0,880.0
71.5,881.0
71.5,882.0
72.0,883.0
72.0,884.0
72.5,885.0
72.5,886.0
72.5,887.0
72.5,888.0
72.5,889.0
73.0,890.0
73.0,891.0
73.0,892.0
73.0,893.0
73.0,894.0
73.0,895.0
73.0,896.0
73.0,897.0
73.5,898.0
73.5,899.0
73.5,900.0
74.0,901.0
74.0,902.0
74.5,903.0
74.5,904.0
74.5,905.0
74.5,906.0
74.5,907.0
74.5,908.0
75.0,909.0
75.0,910.0
75.0,911.0
75.0,912.0
75.0,913.0
75.0,914.0
75.0,915.0
75.0,916.0
75.5,917.0
75.5,918.0
75.5,919.0
75.5,920.0
75.5,921.0
75.5,922.0
75.5,923.0
75.5,924.0
75.5,925.0
75.5,926.0
75.5,927.0
75.5,928.0
75.5,929.0
75.5,930.0
75.5,931.0
75.5,932.0
75.5,933.0
76.0,934.0
76.0,935.0
76.0,936.0
76.0,937.0
76.0,938.0
76.0,939.0
76.0,940.0
76.0,941.0
76.0,942.0
77.0,943.0
77.0,944.0
77.5,945.0
78.0,946.0
78.5,947.0
78.5,948.0
78.5,949.0
78.5,950.0
78.5,951.0
78.5,952.0
78.5,953.0
78.5,954.0
78.5,955.0
78.5,956.0
78.5,957.0
78.5,958.0
79.0,959.0
79.0,960.0
79.0,961.0
79.0,962.0
79.0,963.0
79.0,964.0
79.0,965.0
79.0,966.0
79.0,967.0
79.0,968.0
79.0,969.0
79.0,970.0
79.0,971.0
79.5,972.0
79.5,973.0
79.5,974.0
79.5,975.0
79.5,976.0
79.5,977.0
79.5,978.0
79.5,979.0
79.5,980.0
79.5,981.0
79.5,982.0
79.5,983.0
79.5,984.0
79.5,985.0
79.5,986.0
79.5,987.0
79.5,988.0
79.5,989.0
79.5,990.0
80.0,991.0
80.0,992.0
80.5,993.0
80.5,994.0
81.0,995.0
81.0,996.0
81.0,997.0
81.0,998.0
81.5,999.0
81.5,1000.0
81.5,1001.0
81.5,1002.0
81.5,1003.0
81.5,1004.0
81.5,1005.0
81.5,1006.0
81.5,1007.0
81.5,1008.0
81.5,1009.0
81.5,1010.0
81.5,1011.0
81.5,1012.0
81.5,1013.0
81.5,1014.0
81.5,1015.0
81.5,1016.0
81.5,1017.0
82.0,1018.0
82.0,1019.0
82.0,1020.0
82.0,1021.0
82.0,1022.0
82.0,1023.0
82.0,1024.0
82.0,1025.0
82.0,1026.0
82.0,1027.0
82.0,1028.0
82.0,1029.0
82.0,1030.0
82.0,1031.0
82.0,1032.0
82.0,1033.0
82.0,1034.0
82.0,1035.0
82.0,1036.0
82.0,1037.0
82.0,1038.0
82.0,1039.0
82.0,1040.0
82.0,1041.0
82.0,1042.0
82.0,1043.0
82.0,1044.0
82.0,1045.0
82.0,1046.0
82.0,1047.0
82.0,1048.0
82.0,1049.0
82.0,1050.0
82.0,1051.0
82.0,1052.0
82.0,1053.0
82.0,1054.0
82.0,1055.0
82.0,1056.0
82.0,1057.0
82.0,1058.0
82.0,1059.0
82.0,1060.0
82.0,1061.0
82.0,1062.0
82.0,1063.0
82.0,1064.0
82.0,1065.0
82.0,1066.0
82.0,1067.0
82.0,1068.0
82.0,1069.0
82.0,1070.0
82.0,1071.0
82.0,1072.0
82.0,1073.0
82.0,1074.0
82.0,1075.0
82.0,1076.0
82.0,1077.0
82.0,1078.0
82.0,1079.0
82.0,1080.0
82.0,1081.0
82.0,1082.0
82.0,1083.0
82.0,1084.0
82.0,1085.0
82.0,1086.0
82.0,1087.0
82.0,1088.0
82.0,1089.0
82.0,1090.0
82.0,1091.0
82.0,1092.0
