"tick","Other_happiness","EV_happiness"
1.0,0.4837802984213378,0.37040065988728915
2.0,0.48158502053135344,0.4548781772626333
3.0,0.480347304693994,0.4937827213442814
4.0,0.4824586556875467,0.46921621374097233
5.0,0.47998088247298876,0.49420251110419855
6.0,0.4824470814380197,0.4937827213442814
7.0,0.4854294016103588,0.44828663930699986
8.0,0.48351753190825686,0.49322429362871484
9.0,0.47991832871680357,0.49420251110419855
10.0,0.4859899062025952,0.48758500391271253
11.0,0.48058693020590953,0.49420251110419855
12.0,0.4838233256002617,0.49420251110419855
13.0,0.48020668640955205,0.4780491796907856
14.0,0.4840299199576352,0.4516741260224581
15.0,0.48225988774240525,0.4393896020375306
16.0,0.485660989993125,0.48563508935454447
17.0,0.48316008376424957,0.46921621374097233
18.0,0.48016428320674076,0.49420251110419855
19.0,0.4794986292674475,0.49619528173047467
20.0,0.4800624648189733,0.49343265297013994
21.0,0.4820019108080384,0.49191909992683897
22.0,0.4804314288064428,0.49420251110419855
23.0,0.4760667217131792,0.49420251110419855
24.0,0.4832627426150169,0.4917807425824422
25.0,0.4814897743266568,0.4666487049130541
26.0,0.48308663809074426,0.49420251110419855
27.0,0.4832727288367416,0.49123550067755206
28.0,0.48145538810126026,0.49420251110419855
29.0,0.4794526512872828,0.49322429362871484
30.0,0.4795419292166627,0.49420251110419855
31.0,0.4836818379353733,0.49392107868867813
32.0,0.4826180608048234,0.49420251110419855
33.0,0.4825555812525526,0.4937827213442814
34.0,0.4861721627659522,0.46921621374097233
35.0,0.4824997881237368,0.4937827213442814
36.0,0.480537605142663,0.4937827213442814
37.0,0.4818160749465872,0.48078269721547023
38.0,0.48575909156289815,0.4888654175935177
39.0,0.48069867695652974,0.49420251110419855
40.0,0.4808744702649723,0.4700804278459946
41.0,0.47958510750185057,0.49392107868867813
42.0,0.4846957430728732,0.4032530063781261
43.0,0.486445525275858,0.4194355955765015
44.0,0.48422028711162457,0.4388070248255871
45.0,0.4811911990009963,0.49420251110419855
46.0,0.4821233132745231,0.49420251110419855
47.0,0.4812537016940349,0.4937827213442814
48.0,0.4788195583106601,0.4905918568679849
49.0,0.4795599253219543,0.49322429362871484
50.0,0.4813552315948594,0.49420251110419855
51.0,0.4861625495643771,0.46921621374097233
52.0,0.479907660741052,0.49420251110419855
53.0,0.4815228896265225,0.49420251110419855
54.0,0.4821882252828112,0.49392107868867813
55.0,0.4846987429358128,0.49220053234235966
56.0,0.4782140662243521,0.49619528173047467
57.0,0.47983475262459335,0.49420251110419855
58.0,0.4852346570187259,0.4689347813254516
59.0,0.48102544964321264,0.49420251110419855
60.0,0.48232859136351136,0.4741299858709131
61.0,0.47857876166746116,0.49420251110419855
62.0,0.4794574484727195,0.49420251110419855
63.0,0.48138704587815573,0.49220053234235966
64.0,0.48538556749583034,0.44657237336516464
65.0,0.4793010507323818,0.4966150714903917
66.0,0.48319613091648644,0.46921621374097233
67.0,0.4799683548400627,0.44582569106010755
68.0,0.481113699855634,0.4935012889287609
69.0,0.4852489312852064,0.4883918751967291
70.0,0.4843831262457489,0.49420251110419855
71.0,0.4855880323744763,0.46979899543047393
72.0,0.4827777671005969,0.49392107868867813
73.0,0.4833357267562913,0.49378272134428136
74.0,0.48187529612166863,0.49420251110419855
75.0,0.484010667479116,0.4917807425824422
76.0,0.47912429883198177,0.4919190999268389
77.0,0.4794115392959752,0.49420251110419855
78.0,0.4853874684606937,0.4452797863517276
79.0,0.4822443521649081,0.49420251110419855
80.0,0.48002570756616464,0.49420251110419855
81.0,0.47911517951525184,0.4807826972154703
82.0,0.4840033016039993,0.49220053234235966
83.0,0.4811940628926223,0.49420251110419855
84.0,0.4803495216664314,0.49420251110419855
85.0,0.4767044925990242,0.49420251110419855
86.0,0.47960711198119643,0.49343265297013994
87.0,0.4841447117887353,0.4875850039127126
88.0,0.4801961368645232,0.49322429362871484
89.0,0.48264275517368105,0.4761204721920491
90.0,0.48559511851463705,0.49378272134428136
91.0,0.48513651444340833,0.4518972935432135
92.0,0.4868384788982524,0.4609202384053103
93.0,0.4801255858935937,0.49420251110419855
94.0,0.48452644094229375,0.49420251110419855
95.0,0.48140806137517905,0.4851092740086965
96.0,0.48283234963410065,0.49220053234235966
97.0,0.482689653127558,0.4655251970604453
98.0,0.4810993038684417,0.49420251110419855
99.0,0.48109633992395007,0.49322429362871484
100.0,0.4833448286725836,0.4790002605208371
101.0,0.4845301404536765,0.49322429362871484
102.0,0.4805251450260461,0.46921621374097233
103.0,0.47954267432829595,0.49378272134428136
104.0,0.4782553699896682,0.49619528173047467
105.0,0.4843930555269577,0.49343265297013994
106.0,0.48500709706043993,0.49420251110419855
107.0,0.48097008686077786,0.49420251110419855
108.0,0.48133151836146654,0.4919190999268389
109.0,0.48523578137719364,0.46858917045981974
110.0,0.47975859033417784,0.49420251110419855
111.0,0.4837184177314516,0.49420251110419855
112.0,0.48052494482103736,0.4919190999268389
113.0,0.48225716864065604,0.4790002605208371
114.0,0.48071212365863625,0.49378272134428136
115.0,0.4793772851497118,0.47776774727526505
116.0,0.48301397081357883,0.493921078688678
117.0,0.48062699691519517,0.49378272134428136
118.0,0.48423499712277573,0.49322429362871484
119.0,0.4846404094153969,0.4905918568679849
120.0,0.4798912506746664,0.49420251110419855
121.0,0.48123866683932187,0.45167412602245804
122.0,0.4793129534368046,0.49420251110419855
123.0,0.4811940995420307,0.49420251110419855
124.0,0.4822624007902483,0.4917807425824422
125.0,0.48369312541432197,0.49420251110419855
126.0,0.4848262069526138,0.4806661026291695
127.0,0.48147987915341095,0.49322429362871484
128.0,0.48163443654089255,0.49307900325158976
129.0,0.48454395873808526,0.46921621374097233
130.0,0.4836104273061479,0.43313162455913157
131.0,0.48103593093238134,0.4875850039127126
132.0,0.4792640269154482,0.493921078688678
133.0,0.4803663956674285,0.49420251110419855
134.0,0.4809934243419,0.49392107868867796
135.0,0.4849665199087064,0.4937827213442814
136.0,0.47768985259761376,0.49420251110419855
137.0,0.4830063690373064,0.49420251110419855
138.0,0.4820006516343982,0.49322429362871484
139.0,0.48453434930608436,0.49149931016692155
140.0,0.4811625644160742,0.49220053234235966
141.0,0.48415762528220524,0.4214310493353209
142.0,0.47657673781320364,0.49420251110419855
143.0,0.4790150581115143,0.49420251110419855
144.0,0.48314695690446485,0.4806661026291694
145.0,0.48146510450845675,0.49086739635535726
146.0,0.4801535694202492,0.49392107868867796
147.0,0.47962902769301413,0.41837313252313274
148.0,0.4829549930316758,0.49420251110419855
149.0,0.48176531210648355,0.49420251110419855
150.0,0.48415773052514915,0.4912223148668759
151.0,0.4816461762446894,0.49420251110419855
152.0,0.4844244262548755,0.48078269721547023
153.0,0.47850199193378484,0.4787436799399471
154.0,0.47960023331697194,0.4937827213442814
155.0,0.48133726058114196,0.49220053234235966
156.0,0.4808255229718695,0.49178074258244214
157.0,0.4801541833134835,0.49420251110419855
158.0,0.4831391110129574,0.4937827213442814
159.0,0.48262460503753885,0.49420251110419855
160.0,0.4845972232783714,0.49420251110419855
161.0,0.4827472057255086,0.48867330761225
162.0,0.48193003237234694,0.4937827213442814
163.0,0.4831142418217549,0.4689347813254516
164.0,0.48177249729088395,0.48758500391271253
165.0,0.4810307404333841,0.49322429362871484
166.0,0.4820788549026711,0.49420251110419855
167.0,0.4827521004415426,0.4937827213442814
168.0,0.4850767354626053,0.4669328025636126
169.0,0.48214722358381445,0.49420251110419855
170.0,0.4785828854065061,0.49420251110419855
171.0,0.48308815737028704,0.49420251110419855
172.0,0.47871616102100045,0.4937827213442814
173.0,0.48142036411368583,0.48078269721547023
174.0,0.48114453817283825,0.4905918568679849
175.0,0.4819970562915202,0.49322429362871484
176.0,0.4829283265994127,0.49420251110419855
177.0,0.4779482675361908,0.4942535713488723
178.0,0.4828791359847143,0.4949271972161735
179.0,0.48404074931223257,0.48162522795573265
180.0,0.48191804028568785,0.4891368784236238
181.0,0.4817489237471346,0.4782447867450683
182.0,0.48529438634378436,0.480164614395287
183.0,0.4764892466186396,0.4949271972161735
184.0,0.4848462150171621,0.49182508038860445
185.0,0.47919633332336714,0.4949271972161735
186.0,0.48124770063609307,0.4852958504014556
187.0,0.4776030958682512,0.4807930322294375
188.0,0.4834843503640858,0.4913353459436362
189.0,0.4776051292121753,0.4949271972161735
190.0,0.48090340606342175,0.4949271972161735
191.0,0.4821275942985298,0.49455988117624616
192.0,0.48239328579525576,0.47593136470316444
193.0,0.48378323363971937,0.48318486006353634
194.0,0.48054098041412896,0.4891368784236238
195.0,0.4813896089623163,0.4720686429486361
196.0,0.48426015826811025,0.4570541915592638
197.0,0.482195428652636,0.4893942703643144
198.0,0.4824948897810541,0.4949271972161735
199.0,0.48421925932119114,0.4949271972161735
200.0,0.48292087185953236,0.49455988117624616
201.0,0.48324706009102336,0.4938250035615451
202.0,0.47716215963361824,0.44756584731298443
203.0,0.4766017735539782,0.4823837893184861
204.0,0.48094017877757367,0.49200897181093756
205.0,0.4789503920800667,0.47382037436524554
206.0,0.48291410546761315,0.4917678747594867
207.0,0.4800018432772551,0.4949271972161735
208.0,0.4830797369100709,0.49407125692512555
209.0,0.48503378690768806,0.49407125692512555
210.0,0.48299064518411416,0.4949271972161735
211.0,0.4812171066816914,0.49455988117624616
212.0,0.48515849420876284,0.4949271972161735
213.0,0.48656971051388115,0.4939441278451408
214.0,0.4843475539576524,0.4503592509208392
215.0,0.48028486011795124,0.49703818755409285
216.0,0.4809520398126494,0.4807930322294375
217.0,0.4821580404242069,0.4949271972161735
218.0,0.4778466170866434,0.4891480170007338
219.0,0.4834015368891807,0.4931754657995644
220.0,0.48037021912647365,0.4949271972161735
221.0,0.48219965277274673,0.49468094385259326
222.0,0.4818190301913736,0.4917678747594867
223.0,0.484381708030631,0.4935768118052135
224.0,0.4815970168194845,0.49455988117624616
225.0,0.4818167139714558,0.49468094385259326
226.0,0.4822815556616655,0.4722692707887617
227.0,0.4786040487211245,0.4949271972161735
228.0,0.48454952105595006,0.44820787813899765
229.0,0.48348263743262626,0.4949271972161735
230.0,0.48217640048071714,0.4949271972161735
231.0,0.48315199239424605,0.4949271972161735
232.0,0.4837353166691146,0.4949271972161735
233.0,0.4792378647555257,0.49455988117624616
234.0,0.48316108037590394,0.4949271972161735
235.0,0.48153335619671367,0.48878108859618663
236.0,0.4841664628952615,0.4687084971012681
237.0,0.48189372583897105,0.47910541316804295
238.0,0.48260352523374833,0.49455988117624616
239.0,0.48096215594598946,0.47306418702335057
240.0,0.48072312298182845,0.4891368784236238
241.0,0.4834994376711121,0.4260575290122027
242.0,0.4820637888223543,0.49455988117624616
243.0,0.48574442809260143,0.4954908419699322
244.0,0.48565374148023227,0.48142703392714975
245.0,0.48177530372288613,0.4954908419699322
246.0,0.48142611535240276,0.49473000615566676
247.0,0.47461675316158497,0.49736727782586015
248.0,0.4790365121401302,0.49736727782586015
249.0,0.484349790832351,0.4954908419699322
250.0,0.4797224924879249,0.47583816325312894
251.0,0.47877903372567354,0.4954908419699322
252.0,0.48147651656904283,0.49034389193210987
253.0,0.4774185303336213,0.4954908419699322
254.0,0.48339118355708977,0.49516433882333005
255.0,0.4848344296741539,0.4952719500911941
256.0,0.479607219000866,0.4952719500911941
257.0,0.48038128294781335,0.4761304431092837
258.0,0.4808966823450158,0.49549084196993226
259.0,0.48076858975241415,0.49549084196993226
260.0,0.48367844939665183,0.49516433882333005
261.0,0.4846062610357475,0.49473000615566676
262.0,0.4826386070276873,0.4954908419699322
263.0,0.48072623205893655,0.4937148554986523
264.0,0.48005468343066077,0.49516433882333005
265.0,0.48373317043522535,0.4954908419699322
266.0,0.48133549757603084,0.49516433882333005
267.0,0.48156500923000833,0.49516433882333005
268.0,0.4813005269889203,0.48941436389380333
269.0,0.4834119631944323,0.4930599079364727
270.0,0.479366059888419,0.4936072442307885
271.0,0.48120120121175897,0.47605705513186747
272.0,0.48303618622216,0.49119035036508335
273.0,0.4805620173273936,0.4954908419699322
274.0,0.47863321193422725,0.49461700252901436
275.0,0.4789458381481109,0.47583816325312894
276.0,0.4837529726146955,0.45828629226209494
277.0,0.47726421650169476,0.4954908419699322
278.0,0.4831415751404224,0.4765103297792577
279.0,0.48069468247895725,0.4954908419699322
280.0,0.481339079231428,0.49119035036508346
281.0,0.4809719809744957,0.49289686383194425
282.0,0.483100643758901,0.49268255534176575
283.0,0.48467377598634476,0.47605705513186747
284.0,0.48058153832903205,0.49473000615566676
285.0,0.48429188040582477,0.4954908419699322
286.0,0.4836218975119914,0.49268255534176575
287.0,0.48304426518864674,0.49473000615566676
288.0,0.48282413254778134,0.49549084196993215
289.0,0.4834406132791716,0.49268255534176575
290.0,0.48142655866856937,0.4949454469445917
291.0,0.4830863942828751,0.49549084196993215
292.0,0.4828561973425002,0.49549084196993215
293.0,0.4794626900546121,0.47605705513186747
294.0,0.4828910694568786,0.49527195009119407
295.0,0.4848422184007418,0.49527195009119407
296.0,0.4805984399332131,0.4939337473773907
297.0,0.4826216589513514,0.4935096703402538
298.0,0.4804895639310169,0.4905909338858998
299.0,0.48074225986964214,0.4945655602746177
300.0,0.48271149909291844,0.49289686383194425
301.0,0.48481018703596657,0.49549084196993215
302.0,0.48374923512033097,0.45396255834577565
303.0,0.48357187321455997,0.49268255534176575
304.0,0.4811869216494194,0.4948920634212199
305.0,0.48159572492820435,0.49516433882333
306.0,0.4850402359670788,0.4701061471398715
307.0,0.481595022789547,0.4931729115631254
308.0,0.48152293114500183,0.4814270339271497
309.0,0.484625458456077,0.46226028072034153
310.0,0.48075663639078636,0.49516433882333
311.0,0.4800012428153973,0.49736727782586015
312.0,0.47814858843591723,0.48292713975949947
313.0,0.47817875304795027,0.49492306104245326
314.0,0.4808887511239456,0.4959417577729389
315.0,0.4808386454251207,0.49404951711684514
316.0,0.4810487496882317,0.47138862105181584
317.0,0.48143814295462367,0.48519788024901933
318.0,0.48082431451128477,0.4959417577729389
319.0,0.4823049769677284,0.4959417577729389
320.0,0.48149587844246255,0.48074509176253133
321.0,0.4845800248086971,0.495647904940997
322.0,0.4766547970454523,0.4697044114543552
323.0,0.47995468315334855,0.4959417577729389
324.0,0.4823093136651171,0.4899081176056115
325.0,0.48137172323192573,0.4934142998075893
326.0,0.48066594262086,0.49454037263965156
327.0,0.48273684437030756,0.49454037263965156
328.0,0.48411862680627105,0.4959417577729389
329.0,0.4816504352092605,0.47586763794231207
330.0,0.48088798762363605,0.48115283080961097
331.0,0.4827891615380832,0.4959417577729389
332.0,0.4803947058971305,0.49360717744875
333.0,0.48230138909113957,0.4959417577729389
334.0,0.4821152921909084,0.475867637942312
335.0,0.4856604731672767,0.4952570055401003
336.0,0.4805699503655253,0.49594175777293886
337.0,0.47978760235203805,0.4952570055401003
338.0,0.4797556113953191,0.49594175777293886
339.0,0.4823006900060654,0.49594175777293886
340.0,0.48124055845493685,0.49130950273889884
341.0,0.4790056542208788,0.495647904940997
342.0,0.4817861612380486,0.4959417577729389
343.0,0.4855267300188061,0.495647904940997
344.0,0.47804931291218855,0.4952570055401003
345.0,0.4820449980252427,0.495647904940997
346.0,0.4816228314767271,0.47936977634290023
347.0,0.48142900361653157,0.49594175777293886
348.0,0.48284777691567493,0.49564790494099703
349.0,0.48396500514775687,0.4945403726396516
350.0,0.4820711212451744,0.49564790494099703
351.0,0.4781271296621653,0.49594175777293886
352.0,0.4810860708340766,0.49594175777293886
353.0,0.4806669269237242,0.4950600028492359
354.0,0.4856428668035716,0.4945403726396516
355.0,0.4810010667413557,0.49594175777293886
356.0,0.47981148426253883,0.4957447550820746
357.0,0.4839572937890155,0.47845134961868063
358.0,0.4797388468526927,0.4927136631472845
359.0,0.4851457960630323,0.4920713153285751
360.0,0.48129453764907587,0.4952570055401003
361.0,0.47992112591854824,0.4959417577729389
362.0,0.4840422708225735,0.47845134961868063
363.0,0.4835111206177488,0.4959417577729389
364.0,0.48180680322561675,0.479056299492196
365.0,0.4799814700113251,0.495647904940997
366.0,0.4785478511241832,0.4959417577729389
367.0,0.48436483536909947,0.45622443276729974
368.0,0.47734402491717887,0.49321729711672496
369.0,0.4851957604481431,0.47421522128088267
370.0,0.48034168643831127,0.4959417577729389
371.0,0.48532521206028956,0.47845134961868063
372.0,0.4798204117600072,0.47845134961868063
373.0,0.482129340360738,0.48654788805082905
374.0,0.4830114930702063,0.495647904940997
375.0,0.47979906441767467,0.49574475508207455
376.0,0.48080376363827726,0.4959417577729389
377.0,0.4812939179652251,0.49763055004327433
378.0,0.4785942155429057,0.4959417577729389
379.0,0.48101630785391347,0.49574475508207455
380.0,0.48219032657271804,0.4959417577729389
381.0,0.4843837944930432,0.4832843305344346
382.0,0.4815068905752467,0.4942465198077094
383.0,0.4803648075865757,0.4959417577729388
384.0,0.48161945551191865,0.4959417577729388
385.0,0.4784388393610065,0.4959417577729388
386.0,0.4835847728012621,0.4959417577729388
387.0,0.48059873246931795,0.495647904940997
388.0,0.48367753648210177,0.47845134961868063
389.0,0.4828650200718914,0.49360717744875
390.0,0.47903892304581497,0.4959417577729388
391.0,0.48119482111058354,0.4945403726396516
392.0,0.4780294116505041,0.49525700554010027
393.0,0.4823964595022694,0.4957447550820745
394.0,0.47918171903887397,0.4957447550820745
395.0,0.4804802033087253,0.49594175777293886
396.0,0.47892805778205355,0.4957447550820745
397.0,0.47823835054630315,0.45824667324442425
398.0,0.47984571216160316,0.46341369545565075
399.0,0.48247629143291515,0.49594175777293886
400.0,0.48392695787626344,0.48328433053443454
401.0,0.4817753690138509,0.49594175777293886
402.0,0.48260792774574585,0.46632810548024956
403.0,0.48155949433602047,0.47845134961868063
404.0,0.4811822178233092,0.4904859701831083
405.0,0.48244282869878347,0.4936586177159486
406.0,0.4848156090420216,0.4913095027388988
407.0,0.48256054867207016,0.49594175777293886
408.0,0.48190322538599023,0.495647904940997
409.0,0.4843091362399311,0.49594175777293886
410.0,0.48163786935304276,0.46563298752187937
411.0,0.48282394162802666,0.49594175777293886
412.0,0.48119790953963043,0.4973366972113326
413.0,0.47953436043065406,0.4853001823645859
414.0,0.4777841508618783,0.4934142998075892
415.0,0.4795171618163417,0.4770499644853933
416.0,0.480832551335979,0.49594175777293886
417.0,0.4800017233846978,0.49484139630133206
418.0,0.48259891337430355,0.4656537081758458
419.0,0.48155241472236143,0.48608153033998414
420.0,0.4838744518105999,0.4935092483929972
421.0,0.4851439413216807,0.45419513356477875
422.0,0.47957230299602505,0.4944879498533834
423.0,0.48309928316564715,0.49639202098567203
424.0,0.4770546552924414,0.4959823817216349
425.0,0.4809440332119758,0.48754445620595743
426.0,0.48363285115739596,0.48191116648768245
427.0,0.4832890574212111,0.4959823817216349
428.0,0.4796039149644928,0.48308654033822485
429.0,0.48113186031477895,0.4796635877934828
430.0,0.480830406359625,0.49444653738218125
431.0,0.47982176999559367,0.49424307249343186
432.0,0.47684644097758166,0.49561096735247256
433.0,0.4827414543176113,0.4818166808571235
434.0,0.4823679943527232,0.48815415695321007
435.0,0.48056735248783367,0.4960645472756559
436.0,0.4828786638250489,0.4925827307962949
437.0,0.48478303657876315,0.48437900373261145
438.0,0.4773033577151851,0.4963098554316511
439.0,0.477216079160117,0.4937944331866164
440.0,0.47843285598674645,0.4959823817216349
441.0,0.4794583956977222,0.4881891059222042
442.0,0.48402059120143937,0.4939548947631111
443.0,0.4800152237693876,0.47089210858778147
444.0,0.4847862526958453,0.49606454727565585
445.0,0.4783166134217398,0.49444653738218125
446.0,0.47662743619949827,0.4957392285709521
447.0,0.48003601744744334,0.4959828137117622
448.0,0.481763721491622,0.495168439215305
449.0,0.48199197759316065,0.4937207419580001
450.0,0.4802262533571661,0.4963098554316511
451.0,0.47888974451265803,0.49263338802486323
452.0,0.47839431733020543,0.49573750436168296
453.0,0.478835139507432,0.4959823817216349
454.0,0.48213401201469924,0.49444653738218125
455.0,0.4784939387742324,0.492294615239014
456.0,0.4787451241751453,0.48543452568954776
457.0,0.4816100627422012,0.45234222689916115
458.0,0.4780418532929405,0.49614714362572054
459.0,0.48174631888350633,0.49690124730690294
460.0,0.48258939804472645,0.48191116648768245
461.0,0.4843534496184167,0.4513632362496115
462.0,0.48142029115943985,0.49436437182816034
463.0,0.4810101942247934,0.48754445620595743
464.0,0.4831096061310783,0.46475443543962414
465.0,0.4768485240303101,0.495168439215305
466.0,0.48201778270475737,0.4443568917060696
467.0,0.4789561188705072,0.49657576610725096
468.0,0.4821703861829547,0.4527779869278489
469.0,0.48150921137889785,0.4952841984975539
470.0,0.4817710086665103,0.49266203908645706
471.0,0.48160676548608417,0.46965376762248423
472.0,0.48022424219956217,0.4713506322738598
473.0,0.48126435777969656,0.48132370318957907
474.0,0.47779625935051867,0.48815198622929395
475.0,0.4825248910665051,0.4964148539288101
476.0,0.4817976686871201,0.4914416723707915
477.0,0.48226672794163733,0.49588772378412466
478.0,0.48437990037206835,0.4932859013587223
479.0,0.48329077265558223,0.4806493413868917
480.0,0.48300659000731416,0.4943834605882504
481.0,0.4798193284737518,0.4936381554490016
482.0,0.4833820749862247,0.4895229796664455
483.0,0.4791348980715637,0.4967167396955539
484.0,0.481223922599184,0.4953612389598748
485.0,0.4824121974229597,0.4964148539288101
486.0,0.473272239274605,0.4964144562709234
487.0,0.4801874622796949,0.49408514668561665
488.0,0.480377034763376,0.49523926081283837
489.0,0.4806282486138989,0.4954872106000525
490.0,0.480752931550127,0.489251776806277
491.0,0.4817888834339834,0.4964906990555986
492.0,0.4788560380280902,0.49622635557350314
493.0,0.4831417881138594,0.4926038127093433
494.0,0.4817638742022548,0.485465172889802
495.0,0.47885428549242726,0.4610188142712088
496.0,0.4793936660947736,0.4923610288733758
497.0,0.4832737113119214,0.4963378134664887
498.0,0.48229405162375066,0.4822716110449218
499.0,0.4821139048690113,0.4641681306268891
500.0,0.48121851821309025,0.4946071119727724
501.0,0.48060147025471717,0.4961129692642972
502.0,0.4800206246489798,0.4939043252689738
503.0,0.48182099008598966,0.47837260243297836
504.0,0.481474904504463,0.4967167396955541
505.0,0.4793862802952946,0.494684152435094
506.0,0.47949831640510693,0.488229594954909
507.0,0.47944098746692443,0.49218240153714726
508.0,0.4823543002164112,0.4961873196506755
509.0,0.47956780358878603,0.45320434133958776
510.0,0.4808252066497772,0.49430999340567133
511.0,0.47731819280885934,0.4961129692642972
512.0,0.48024805794762254,0.4778768391800672
513.0,0.48476554940272076,0.4626697355702835
514.0,0.48520766987457714,0.49588438827054176
515.0,0.47811654369593953,0.496716739695554
516.0,0.48023795548546927,0.46804267342027334
517.0,0.4802044270680387,0.4962631647774639
518.0,0.48068716679094187,0.48540161033063023
519.0,0.47952493113904865,0.4955629060046979
520.0,0.4823692378015965,0.4755609427598613
521.0,0.4810568562161465,0.4723891413225604
522.0,0.482940535271354,0.49393701668109236
523.0,0.4797733085188284,0.4960360774218878
524.0,0.47892403242452286,0.4963391585241642
525.0,0.48133862908071817,0.4695433655013377
526.0,0.481754489066079,0.48295949847461694
527.0,0.4798388042050412,0.4954355893462531
528.0,0.4790969972820604,0.4834256422088135
529.0,0.483849624452775,0.4534652271767695
530.0,0.4805964773972536,0.49664089456876526
531.0,0.4823149648641572,0.49363815544900164
532.0,0.48080788006820663,0.49311063768764546
533.0,0.4805175855723101,0.4947338900932686
534.0,0.47841567652866784,0.4697214125436893
535.0,0.4785246069417017,0.47393700716271603
536.0,0.48124135351741437,0.4963390099042527
537.0,0.4838300242160873,0.4803352868238008
538.0,0.4796833875890824,0.4965650494419766
539.0,0.4803494344801332,0.4966408945687652
540.0,0.48442630768520917,0.49258564258595633
541.0,0.4782659276565802,0.4940917303670917
542.0,0.4818910967743141,0.4696181432183241
543.0,0.480087513907444,0.4963390088020211
544.0,0.48284965944500435,0.4905178820076581
545.0,0.4829899817771226,0.49409173036709164
546.0,0.483535901398009,0.49260540428712996
547.0,0.4787800163130885,0.493530318744238
548.0,0.4825251998114829,0.4868785904784375
549.0,0.4813170702163568,0.48799697749543935
550.0,0.4814772911594626,0.4603480341173947
551.0,0.4806215675841395,0.49590864174393456
552.0,0.48066341443341537,0.48738207545483286
553.0,0.4794423870803198,0.46646248893408443
554.0,0.4767744867849892,0.4924982953814275
555.0,0.4848578912434981,0.4949755135829319
556.0,0.4780351709099424,0.4836100245940751
557.0,0.4762345605826429,0.4941418542686448
558.0,0.4831590988378232,0.49636288745077234
559.0,0.4838973547075701,0.47244347376429036
560.0,0.4839002697485577,0.45693292241041134
561.0,0.4779749323464948,0.4967147475206188
562.0,0.4810944757428996,0.49431675045151197
563.0,0.4839904986230219,0.4629365863796334
564.0,0.4792870117731054,0.46508103078304713
565.0,0.48055707480856436,0.4887046401870505
566.0,0.48138875370426726,0.4803593724775998
567.0,0.48332770368833267,0.479985074485406
568.0,0.4775916097441749,0.4948932043853322
569.0,0.48067362550772236,0.4723913247411661
570.0,0.48433159353526345,0.4820718128759494
571.0,0.4792852142200678,0.4900037306218316
572.0,0.48128299729190616,0.49417580295761027
573.0,0.4812137886611045,0.4945970719257024
574.0,0.4760981524729639,0.49650360369512614
575.0,0.4824353840601626,0.4730000093718742
576.0,0.4807377739279997,0.49615248432595144
577.0,0.48032254374604355,0.46781896566962095
578.0,0.4755888910329159,0.49615262331706234
579.0,0.4769756784260025,0.49052325593083385
580.0,0.484051811869526,0.49615262331706234
581.0,0.48024815190859,0.49636510604510325
582.0,0.4803878802536658,0.48185308975991636
583.0,0.4787238682046479,0.4951757444538533
584.0,0.4806999321821473,0.4936166368793882
585.0,0.4794392134332818,0.49312540166040997
586.0,0.48262462840350745,0.4814062560680205
587.0,0.47486415339548155,0.4778967280279367
588.0,0.47977981313564505,0.4901443078384811
589.0,0.4816426735813677,0.4795710224555365
590.0,0.4825615851364061,0.4911606390750444
591.0,0.4790005009630759,0.4918788715121163
592.0,0.4827593253038924,0.4962245288284536
593.0,0.4804009101263182,0.49466749954343475
594.0,0.48153686242528276,0.4873128967826347
595.0,0.47725910742000793,0.47059170219816704
596.0,0.4806913909421997,0.47122302500979496
597.0,0.4775580416894688,0.46110110129482546
598.0,0.4819890742154754,0.4926085715296314
599.0,0.4804918292677775,0.4931947120951797
600.0,0.48078243924538233,0.48978451980424464
601.0,0.4796804523302558,0.48805243045470265
602.0,0.48320449465454446,0.48186283032347477
603.0,0.47888355353178463,0.4921595632635584
604.0,0.4773507349869746,0.46537164732827097
605.0,0.477887554140058,0.4880761888964971
606.0,0.4811473589577226,0.4624506852341947
607.0,0.47932662115411434,0.4816317263409639
608.0,0.4787546419918943,0.4810206011143285
609.0,0.480992701033481,0.44484474975759236
610.0,0.4820588165769352,0.4902673655117767
611.0,0.48202736315233646,0.4828167173809602
612.0,0.48093232832572225,0.47202005941006137
613.0,0.4818813758236456,0.49490522495631034
614.0,0.4780050322691685,0.4944564947090529
615.0,0.48241912214828575,0.4663814339748275
616.0,0.48026317593213796,0.4940662340240936
617.0,0.4794122119581092,0.48932007321520143
618.0,0.4790847828679884,0.48129981497211183
619.0,0.47957257354361627,0.4694183534308524
620.0,0.48079379626935176,0.4758056508166047
621.0,0.48579524125452134,0.4943163801742599
622.0,0.4816280892277155,0.45595487930230666
623.0,0.4818184843871692,0.4799777231523832
624.0,0.4810773531483225,0.4651791449987861
625.0,0.47976972295963416,0.47734201953431
626.0,0.4797768698494443,0.4946260134365433
627.0,0.4798665029304979,0.4897956323632153
628.0,0.4812971981889761,0.4816022874919484
629.0,0.4767688173463858,0.49333728271672
630.0,0.47754779841227596,0.49615248432595144
631.0,0.47996461504128984,0.4731124256673794
632.0,0.4838172798495904,0.48744495490009415
633.0,0.47596772762648043,0.4945970719257023
634.0,0.47855112779129005,0.49222999088129105
635.0,0.48198651960713096,0.46966576443863506
636.0,0.4796727194592986,0.4946674995434347
637.0,0.4755705150101158,0.48285721453438335
638.0,0.4769803251044982,0.4620054573542742
639.0,0.47938792508473016,0.48772717812099864
640.0,0.4825428977914689,0.45988889039877023
641.0,0.4833672248972814,0.44693182959938554
642.0,0.47587029577453427,0.49438680779199223
643.0,0.4811138861794148,0.48041789117111705
644.0,0.4821766890429413,0.48573116216633166
645.0,0.4795676042598881,0.4616856533785432
646.0,0.48396972565183133,0.4806009010211523
647.0,0.48004550054532164,0.4871968241483548
648.0,0.47883941414719183,0.4923560995958524
649.0,0.47810992040546674,0.48422991136788607
650.0,0.47949441260945996,0.4818641991919164
651.0,0.47776829754815414,0.493613678754054
652.0,0.48282422411021925,0.4943860670913207
653.0,0.47940251040921744,0.49222999088129105
654.0,0.4841784426273918,0.4910421131186408
655.0,0.4782499564056714,0.4820749727401573
656.0,0.4800659237401455,0.4939646591321177
657.0,0.48020198979645395,0.47008717243443077
658.0,0.48093666032696825,0.48430147656791883
659.0,0.47860132055472593,0.47860269698318264
660.0,0.48250099383939427,0.49552191966668463
661.0,0.48336973438721564,0.4415510761051656
662.0,0.48079618587164175,0.4944983503172193
663.0,0.48070038527011083,0.4892882394278184
664.0,0.48086084071818186,0.4646874586062117
665.0,0.47916166226860657,0.4956731755532381
666.0,0.48207990611583257,0.48681970736514363
667.0,0.48269713338366527,0.49502299957387236
668.0,0.47892502442790413,0.4845578993277853
669.0,0.48203621025165017,0.47468167999533867
670.0,0.48180360299193387,0.49495726713065585
671.0,0.4794483233629382,0.49593377515383585
672.0,0.48182023926617235,0.49601739623514945
673.0,0.4821603733320477,0.4807014616384826
674.0,0.4813635404846592,0.4946945968761694
675.0,0.4831363162289731,0.49660743230876286
676.0,0.48039910834160054,0.49680242922533435
677.0,0.4806190842306988,0.49235467739394884
678.0,0.47261159222343396,0.49575783136582396
679.0,0.4826378869344753,0.4949782167719479
680.0,0.47742807420388833,0.48494474488104705
681.0,0.4799980436439572,0.4948259320034124
682.0,0.4849811642661989,0.4957557619039712
683.0,0.4810604453342797,0.49232299191676077
684.0,0.47928091463690664,0.48279054547501626
685.0,0.47952873871755697,0.48912409173712823
686.0,0.4812098522547211,0.4304053483336534
687.0,0.48361386000750745,0.49312548163188363
688.0,0.48271676678231523,0.4830043748299455
689.0,0.4823436916221015,0.48397824716089616
690.0,0.481160468203356,0.49319465554746206
691.0,0.473412165786966,0.49523365742631026
692.0,0.47976907032555444,0.4968024292253346
693.0,0.4802378030207002,0.45010642347850244
694.0,0.47748255069632095,0.495213569601324
695.0,0.4805630646441869,0.49430141247179676
696.0,0.47886962982423764,0.4921153387918352
697.0,0.4781186642774096,0.49196136326453915
698.0,0.48165893777857866,0.48172232913558083
699.0,0.4824976448781816,0.4785938468826145
700.0,0.4800292617829205,0.49472379848219006
701.0,0.48386988330758646,0.4960822214906741
702.0,0.47780631232786563,0.49420121882188955
703.0,0.4782534975059803,0.48134956692980635
704.0,0.483510498662646,0.468821018161135
705.0,0.4830887660211887,0.4678358292236413
706.0,0.4828374183405529,0.47429661834091924
707.0,0.4796424941550346,0.49634338265270794
708.0,0.47843956433738094,0.4966074323087629
709.0,0.4832740250199309,0.4959548989362839
710.0,0.4836003527203856,0.47169722711301293
711.0,0.47987148882369174,0.49155928851139785
712.0,0.4800625746866083,0.47266043173762917
713.0,0.4797760064827263,0.4944667945992219
714.0,0.48105476886195725,0.4946296854786166
715.0,0.47846972689731443,0.49286682176810187
716.0,0.4786018769447446,0.47982958334550296
717.0,0.4772791603281683,0.49531077319837286
718.0,0.4755603219837748,0.4931084576405134
719.0,0.4784444849711856,0.49302812278831426
720.0,0.4809278321173294,0.4713092642206587
721.0,0.4810488821211569,0.4751123162294178
722.0,0.4822946844370068,0.49289376811371
723.0,0.48070004004871464,0.4784980339751367
724.0,0.48236170414244683,0.468594571845883
725.0,0.48087137754588444,0.48335575564774846
726.0,0.4790169510599198,0.4860852358709068
727.0,0.4766308452482516,0.4852840899030221
728.0,0.4822703756069328,0.4712602858627005
729.0,0.478007845872258,0.49575037628901647
730.0,0.4775111533697638,0.49638432963305057
731.0,0.48208550780371673,0.48079531214964044
732.0,0.4806057522712191,0.48191657613402245
733.0,0.47906211739182597,0.4638950991537021
734.0,0.482678305019217,0.4708684636945325
735.0,0.48304933813722495,0.46502248191081474
736.0,0.48090629478111185,0.4950461261987278
737.0,0.47949628936267297,0.4881771448825326
738.0,0.47932378357356475,0.49327446071104586
739.0,0.4764403112054287,0.49487121640023063
740.0,0.47757185429324917,0.49125803940768037
741.0,0.4809911973910218,0.4839249970359132
742.0,0.48187185351183187,0.4850692933069515
743.0,0.47763636308605123,0.4940093311244939
744.0,0.47807039245809335,0.49138298457214186
745.0,0.47690345930139705,0.4951027938611672
746.0,0.4799791123865934,0.4934732710690869
747.0,0.4809975170903903,0.45119546234342384
748.0,0.47732295464667296,0.49617639591670804
749.0,0.4789786466663053,0.4842463751909517
750.0,0.4807429499157649,0.4915312598766405
751.0,0.479460292372619,0.4854012156055154
752.0,0.48031376270571846,0.48368083205667545
753.0,0.48244390591151914,0.4929395225914841
754.0,0.4802603827770846,0.4717286732312998
755.0,0.47754130933761313,0.4902300466553279
756.0,0.4832296324945444,0.47082092338576875
757.0,0.4796032432417704,0.48455706150890726
758.0,0.48030201826399616,0.49111056110320706
759.0,0.47930909195903704,0.4951865273090329
760.0,0.4807667978541161,0.49315362344186797
761.0,0.48128388970727565,0.4942403061709802
762.0,0.4818854389246611,0.4725810163004839
763.0,0.48066904349834294,0.48261111166332044
764.0,0.481804361305826,0.4933592451216525
765.0,0.4788769053143856,0.49481272265349835
766.0,0.4841527648264534,0.46052162615109743
767.0,0.4768827748137713,0.4852931048630795
768.0,0.4816500468368894,0.48788371237049094
769.0,0.47973296093391854,0.49369647330711686
770.0,0.4834019131384485,0.4933119473541791
771.0,0.4769297678103432,0.4921316010844038
772.0,0.4765782060655368,0.49620392082243187
773.0,0.48080788946456593,0.48280570022495334
774.0,0.4773845619343755,0.48162792555639017
775.0,0.4780068941738633,0.4952665661923526
776.0,0.4811112074233176,0.4416039824294792
777.0,0.4816409190481151,0.49340167280162506
778.0,0.47457883319051725,0.48568107633038304
779.0,0.47617274678243504,0.4935861750434132
780.0,0.4788468640554655,0.4760222475935068
781.0,0.47815412509902655,0.4942874771302052
782.0,0.4810324888423988,0.49416509566868644
783.0,0.4817199875434817,0.48531704386203095
784.0,0.4793915680148616,0.48291314133721586
785.0,0.48325588547764897,0.4941328286966598
786.0,0.4815382851714433,0.49570175931704213
787.0,0.48403667156100516,0.46507758810106403
788.0,0.47836232901265585,0.49355706101836433
789.0,0.47849671043846104,0.4936219268834821
790.0,0.4782869837738397,0.49548351526692663
791.0,0.4833606647232699,0.49553850774374136
792.0,0.4753203425084512,0.48640126564903197
793.0,0.48379163985116236,0.49034804943839083
794.0,0.4771530869547569,0.4888560650048332
795.0,0.4791732097684495,0.48900987552582603
796.0,0.48136171367378905,0.4888151413448816
797.0,0.4767918291304303,0.49394620376148657
798.0,0.4727612649187351,0.49234973700186013
799.0,0.4811594311812169,0.49389142672547265
800.0,0.47628919387905716,0.4972392862632827
801.0,0.4810471836705118,0.4948869014346818
802.0,0.4805765725176476,0.48560637667651835
803.0,0.4737690833728476,0.4950201192540437
804.0,0.48370533526690673,0.4815666159274475
805.0,0.48420617621530343,0.4765703471953188
806.0,0.4833074511703861,0.4849430984483973
807.0,0.4799999577474702,0.48765465969919786
808.0,0.47885891564764715,0.47109928892602776
809.0,0.48051238459360446,0.49199073059262305
810.0,0.4811204418284905,0.4936261148475801
811.0,0.48008166727321583,0.4928824121861774
812.0,0.4758985299382629,0.48183570410107757
813.0,0.4775396942421592,0.49545300026475464
814.0,0.48019633073744944,0.4892870025712992
815.0,0.4784506664925591,0.4915362759766792
816.0,0.4785214332123978,0.4936844303891118
817.0,0.48344371592776797,0.46525224212212973
818.0,0.4814706067867298,0.49291012390066796
819.0,0.4823321830502881,0.439571765066705
820.0,0.47817977246000615,0.4855075796001319
821.0,0.4748014178526232,0.49553811244218104
822.0,0.47891733133472897,0.49599599469556194
823.0,0.4796400585544075,0.4930415349284924
824.0,0.48045348736847876,0.48593066496251797
825.0,0.4786948578738144,0.4930871819411127
826.0,0.4764370787912427,0.48954605514232574
827.0,0.478544920405333,0.49400098079750054
828.0,0.4769903715146166,0.49378198078610347
829.0,0.48192646650765913,0.4721100454126447
830.0,0.47918260140111213,0.49334662041954386
831.0,0.4761539469635736,0.4953734214704733
832.0,0.4741512375617315,0.49468936195689295
833.0,0.48095092440948917,0.46513830677686085
834.0,0.48178512462483586,0.4691737887540793
835.0,0.47804677677232277,0.49405564972931726
836.0,0.4749777552725825,0.4943395643443103
837.0,0.48163091939778896,0.4886118944802614
838.0,0.4799942743942761,0.49353397769509777
839.0,0.4761714468833646,0.49219829498063317
840.0,0.47118427995081713,0.4939462037614864
841.0,0.47792775351713024,0.49352519879680445
842.0,0.47745291899225256,0.49300762859338365
843.0,0.4784872190239801,0.4927763162708715
844.0,0.4777222864551362,0.4582933369550307
845.0,0.47630337746883983,0.4935639529728442
846.0,0.48451746109113947,0.4940555415966582
847.0,0.48040988806648216,0.4895118188024535
848.0,0.4784153882480561,0.49444911762028265
849.0,0.473520116733627,0.4920641054246103
850.0,0.4806733189608917,0.4905920284074322
851.0,0.4775700852962968,0.4745198218837111
852.0,0.4816122090686034,0.4702217104742987
853.0,0.47883674509000873,0.48678312011332897
854.0,0.4787254428901618,0.48015156413759
855.0,0.4800527090947093,0.4840574857723581
856.0,0.4800123473337218,0.4705520916435187
857.0,0.47986826965141227,0.4839899112850125
858.0,0.4791410361511742,0.4659764441577262
859.0,0.4760750596612826,0.46680060371108095
860.0,0.4787770571095175,0.4927771795687567
861.0,0.4785138186558123,0.4933493744884416
862.0,0.4775981772494754,0.4894437385680112
863.0,0.4791114783981666,0.4731702869780771
864.0,0.4808417685568783,0.4902641328738766
865.0,0.4806017593532535,0.4955390838442634
866.0,0.47939802967668077,0.49588322408997954
867.0,0.48039342859301415,0.4571639839275605
868.0,0.4826925172006696,0.4756652677170257
869.0,0.4802126224029669,0.49320266712000593
870.0,0.4832509585446695,0.49280041441942535
871.0,0.47690881286130676,0.489745523871757
872.0,0.4830136260989893,0.4743029361801494
873.0,0.4817442494009566,0.4826615163195065
874.0,0.47879203154481154,0.4851102271058094
875.0,0.4772077967356863,0.4853166381202466
876.0,0.4779732276692827,0.4954837307077272
877.0,0.48312759301265384,0.49196968449632855
878.0,0.47860626787394434,0.48861507825963685
879.0,0.48330514170480016,0.472261853119803
880.0,0.4807738025486308,0.48385535955401876
881.0,0.48284915354865954,0.46440657276429903
882.0,0.4792129142574252,0.4751879723165526
883.0,0.4801048888593595,0.49085577400050023
884.0,0.480139927056393,0.48771586711905907
885.0,0.48150653455543735,0.4949477203293266
886.0,0.4803712282451089,0.4953099577607041
887.0,0.48070565396761683,0.4811495297782948
888.0,0.4792703835902772,0.46333440044428886
889.0,0.4765760827824497,0.4968149129583131
890.0,0.48002027213742954,0.4943684078284131
891.0,0.4780455612116507,0.48658773147457324
892.0,0.4799350384370009,0.49418381753078966
893.0,0.482708386453687,0.4917627387093835
894.0,0.4783568899397246,0.494032984291634
895.0,0.48025314409275605,0.4940061050809637
896.0,0.4816521119760166,0.48008405049269476
897.0,0.4773696195962218,0.47699158242966333
898.0,0.47940754323612356,0.49062528965232294
899.0,0.47663427895262284,0.48428559783589936
900.0,0.47880537613948865,0.48767924106341204
901.0,0.4745858268089716,0.4961314860915602
902.0,0.4784486693013709,0.48039205336390334
903.0,0.47471821932781044,0.4913358235666596
904.0,0.48192333497680123,0.4622353776329869
905.0,0.48012486480601135,0.49375492182021435
906.0,0.4776625220162161,0.4953466802137081
907.0,0.48441920944674205,0.47741610106201465
908.0,0.48009033956544805,0.4873863793082088
909.0,0.480683640754309,0.4862335713254473
910.0,0.47864912220631073,0.49388602113185187
911.0,0.4785865783231457,0.4953959795205054
912.0,0.4797883861661828,0.49490638487797556
913.0,0.4768282285230618,0.4865871853961327
914.0,0.4784156619124449,0.4961479759814608
915.0,0.48229284414848234,0.4544910547177397
916.0,0.4796678450454433,0.4824842024388291
917.0,0.4793554730426768,0.4930695645817737
918.0,0.4778880518615242,0.47760283925934316
919.0,0.4805386592172783,0.4934025236482276
920.0,0.4775478595875724,0.4949592262509606
921.0,0.4796434648202678,0.4933633879774059
922.0,0.482238112647035,0.48059027937775867
923.0,0.4791763578357328,0.47354042279282477
924.0,0.4838394105839193,0.4947463361249714
925.0,0.4737702840429875,0.4930427299487612
926.0,0.47963491278455683,0.48383015743404095
927.0,0.4720769973014187,0.4774446336031757
928.0,0.47723443619568784,0.49154089199570233
929.0,0.47942802526564676,0.47918862728593514
930.0,0.47740502480188857,0.4801927216673308
931.0,0.47916599245663377,0.46197437368753524
932.0,0.48045653905556635,0.4828761064534727
933.0,0.4795853083938868,0.496784824907802
934.0,0.47981283774537514,0.485577304006243
935.0,0.4741006233740414,0.49152911607995875
936.0,0.4785121101677066,0.49051889943119953
937.0,0.48181519225495933,0.4836353584900376
938.0,0.4769446866358266,0.4833984412776787
939.0,0.4798892034409965,0.4672510296000493
940.0,0.4795296811059846,0.494995780849227
941.0,0.4780816001316744,0.47666292000686367
942.0,0.47855388012516065,0.4883065428861306
943.0,0.4759168249295523,0.4949809095048685
944.0,0.47716520129820544,0.4848633125844798
945.0,0.4766772699452933,0.4946530191202452
946.0,0.477702209547361,0.49733499137505377
947.0,0.47950515019051226,0.4946055735746426
948.0,0.48264202553965746,0.4810364049296332
949.0,0.4798309343259366,0.48011094509114893
950.0,0.4745194916265285,0.4947932878701256
951.0,0.47682048962066426,0.4759955458535535
952.0,0.4750023995227277,0.4915013796646554
953.0,0.48050949489880396,0.4653894895734753
954.0,0.47746107273357985,0.495660683281334
955.0,0.4787177847942853,0.4779676442965259
956.0,0.47958998051614704,0.4951762615560787
957.0,0.4792020389034739,0.4947593720180773
958.0,0.48153254837946097,0.46985582369799156
959.0,0.479470859919845,0.4866440352126465
960.0,0.4766769018997684,0.4762904863941652
961.0,0.4821918938432593,0.4622864084768948
962.0,0.4767072557841023,0.49468027723456887
963.0,0.47910208054724907,0.49128220373408565
964.0,0.4769083271750225,0.49510256592088536
965.0,0.47871727825979266,0.46473744613575824
966.0,0.47613794022535966,0.4915516861082547
967.0,0.4789520899974675,0.4899356745054236
968.0,0.4788213940702062,0.4954246136373393
969.0,0.47401858842057226,0.48918155353059284
970.0,0.47604919195945733,0.4932385849275474
971.0,0.48206561880726845,0.4795499977842821
972.0,0.4745313830052961,0.47742679864132453
973.0,0.475582774264025,0.4933726621751215
974.0,0.48076816142288264,0.4698106565438466
975.0,0.477060325299683,0.4844918714229431
976.0,0.47385948099775355,0.49345955536142366
977.0,0.47984377368713743,0.4809585766796072
978.0,0.4755440980222716,0.49567802536130695
979.0,0.4776577663752319,0.49401216266155373
980.0,0.47932702020990314,0.4917387009356336
981.0,0.473419873918032,0.48703172171399195
982.0,0.480585320422331,0.4844405307946985
983.0,0.4766901678663167,0.4733737482267067
984.0,0.48001369713090075,0.48030523810556347
985.0,0.4765893000592945,0.4949238554250647
986.0,0.47770450924620295,0.4912849949344969
987.0,0.4816345602756249,0.4957358344951649
988.0,0.47772143855512456,0.492116467011016
989.0,0.4801985997556037,0.48827590491515804
990.0,0.47861645843028067,0.4950072852454909
991.0,0.47920167198731367,0.46653741707604557
992.0,0.48142757704200717,0.4792873545835167
993.0,0.4790586694654556,0.4891676598848397
994.0,0.47971896744379394,0.48314916514459255
995.0,0.4817876970814172,0.47824054715900766
996.0,0.47996474294725877,0.48789088171011524
997.0,0.4785339876508613,0.47557239062234546
998.0,0.478683312756335,0.47842167524748336
999.0,0.4737762974849513,0.48836075713808613
1000.0,0.4783830906684989,0.490054786378619
1001.0,0.47648148630380077,0.487240802074801
1002.0,0.47923894174872883,0.4898874421229475
1003.0,0.48020058495998635,0.4922388226011837
1004.0,0.4778626151664677,0.4893978191678043
1005.0,0.47764269492072015,0.4941715130360098
1006.0,0.47690611717117426,0.4902149973619615
1007.0,0.475194896863383,0.4903999545289275
1008.0,0.48093912205852185,0.4787828626453273
1009.0,0.4794089745747219,0.4753423154757625
1010.0,0.47955016626767205,0.49528598227348825
1011.0,0.4815326662191974,0.48249431153495403
1012.0,0.4820723457385834,0.48857882980760753
1013.0,0.48011599734125404,0.47052207780010497
1014.0,0.47673575637312293,0.4772093167198564
1015.0,0.480852017068853,0.486816926875993
1016.0,0.47365645083088687,0.4911514619564616
1017.0,0.47228725202527727,0.4917154567699381
1018.0,0.4761643860060836,0.49306248099273614
1019.0,0.4792174003540491,0.4812110960700968
1020.0,0.4786626279441475,0.4941855193699529
1021.0,0.4775429517646864,0.4659164368353771
1022.0,0.4776260368188075,0.48539179477872196
1023.0,0.4765587696775085,0.47691683060346507
1024.0,0.4813596291549211,0.47752152313316715
1025.0,0.48000169331428083,0.46708073124115296
1026.0,0.4814406566719968,0.47552545849432304
1027.0,0.47498868232062863,0.4802295839121147
1028.0,0.47406202788067825,0.48924979237096755
1029.0,0.4822591746579302,0.49037275883901954
1030.0,0.4786386540252027,0.486904169546342
1031.0,0.48182707310857975,0.49363255526857464
1032.0,0.47470268290901696,0.4900571039789474
1033.0,0.4833706586241297,0.4567190342446204
1034.0,0.4770380966393773,0.4964089919139913
1035.0,0.4832784797626202,0.483778031579245
1036.0,0.48171106013206344,0.46519591363511387
1037.0,0.48109103660694724,0.47395041686978606
1038.0,0.47605754269868567,0.48994113110442244
1039.0,0.48001745656036254,0.49695725461451706
1040.0,0.4790224275231562,0.48917719219241407
1041.0,0.47648676326859446,0.4951668465317265
1042.0,0.4751827323614906,0.4924528261212583
1043.0,0.4781908366490583,0.47539950954076804
1044.0,0.47831855836923987,0.47928577354851953
1045.0,0.48354234348601705,0.47861364257667555
1046.0,0.482847627855309,0.4767936748997301
1047.0,0.4789436128816847,0.4829024340004309
1048.0,0.4794901876273379,0.47495006664382056
1049.0,0.4765971833368275,0.49447464401120883
1050.0,0.477008210715892,0.48762531918678
1051.0,0.47939973061866015,0.4951445573631055
1052.0,0.48262288582363816,0.4905578397474554
1053.0,0.47801519753176214,0.4894234443702365
1054.0,0.47693608270769183,0.49518765173396534
1055.0,0.476565626577361,0.4928527381518529
1056.0,0.47630274872133216,0.4939071302873677
1057.0,0.48089854187226516,0.4823931796120684
1058.0,0.48165006745009975,0.4714554253655153
1059.0,0.4796639130312053,0.4847605804224498
1060.0,0.4776266090845959,0.4866779711533449
1061.0,0.47958564598066483,0.4937179390610746
1062.0,0.47613665393555754,0.48458635285075863
1063.0,0.47796471270838964,0.49235889246831654
1064.0,0.47491915299477955,0.4950167952622609
1065.0,0.48187628867021004,0.449587193867795
1066.0,0.4820465131731549,0.4758244584094471
1067.0,0.4774381360904015,0.4951207322143671
1068.0,0.47750674298856627,0.49412138476222045
1069.0,0.4780342635540084,0.4807914413469977
1070.0,0.47535826691861005,0.4715593929304814
1071.0,0.47667741630054933,0.4930023210961394
1072.0,0.47725415081737754,0.49435782495728864
1073.0,0.4756634455611872,0.4864833216361093
1074.0,0.4775940750709401,0.49514455736310525
1075.0,0.4820371180983744,0.4852704715690339
1076.0,0.4804808649869497,0.48735723321088176
1077.0,0.4765783017055273,0.49067399685878377
1078.0,0.47706056123619434,0.4954626700099003
1079.0,0.47735880229331656,0.49526451341984123
1080.0,0.47447138659636184,0.493350784854985
1081.0,0.4750599024896268,0.48776961598462476
1082.0,0.48014764705203383,0.480745159914265
1083.0,0.4828171940581954,0.4952602796223197
1084.0,0.47574036948534965,0.4952297598679553
1085.0,0.4810232749974396,0.4889750977150819
1086.0,0.4814107141306798,0.4883058077172096
1087.0,0.4804290326543898,0.47403152577246677
1088.0,0.47212709788834906,0.48690054961164625
1089.0,0.4746338190684467,0.49510185760724307
1090.0,0.47805435926425555,0.49656080392672713
1091.0,0.47496400885679574,0.49582382854512974
1092.0,0.4775408112735071,0.49305463673008665
