5ba01fcb22000bf923550acf004d43d,2018-09-17 23:00:00,38.22440000,69.42070000,0.00000000,103.00000000,CONSUMER24
5ba01fcb22000bf923550acf004d43d,2018-09-17 23:00:05,38.31450000,69.42180000,0.00000000,103.00000000,CONSUMER24
5ba01fcb22000bf923550acf004d43d,2018-09-17 23:00:10,38.31450000,69.42300000,0.00000000,103.00000000,CONSUMER24
5ba01fcb22000bf923550acf004d43d,2018-09-17 23:00:15,38.22440000,69.42410000,0.00000000,103.00000000,CONSUMER24
5ba01fcb22000bf923550acf004d43d,2018-09-17 23:00:20,38.22440000,69.42520000,0.00000000,103.00000000,CONSUMER24
5ba01fcb22000bf923550acf004d43d,2018-09-17 23:00:25,38.13430000,69.42640000,0.00000000,103.00000000,CONSUMER24
5ba01fcb22000bf923550acf004d43d,2018-09-17 23:00:30,38.13430000,69.42750000,0.00000000,103.00000000,CONSUMER24
5ba01fcb22000bf923550acf004d43d,2018-09-17 23:00:35,38.22440000,69.42870000,0.00000000,103.00000000,CONSUMER24
5ba01fcb22000bf923550acf004d43d,2018-09-17 23:00:40,38.22440000,69.42980000,0.00000000,103.00000000,CONSUMER24
5ba01fcb22000bf923550acf004d43d,2018-09-17 23:00:45,38.22440000,69.43090000,0.00000000,103.00000000,CONSUMER24
5ba01fcb22000bf923550acf004d43d,2018-09-17 23:00:50,38.22440000,69.43210000,0.00000000,103.00000000,CONSUMER24
