^C:\DEV\TRAJOUTLIERS\TRAJOUTLIERS\TRAJOUTLIERS\PCH.CPP
/c /I"C:\DEV\VCPKG\INSTALLED\X64-WINDOWS\INCLUDE" /IC:\DEV\TULIB\SRC\INCLUDE /IC:\QT\5.12.3\MSVC2017_64\\INCLUDE\QTGUI /IC:\QT\5.12.3\MSVC2017_64\\INCLUDE\QTANGLE /IC:\QT\5.12.3\MSVC2017_64\\INCLUDE\QTCORE /IC:\QT\5.12.3\MSVC2017_64\\INCLUDE\QTWIDGETS /I"C:\DEV\VCPKG\INSTALLED\X64-WINDOWS\INCLUDE" /ZI /JMC /nologo /W3 /WX- /diagnostics:classic /sdl /Od /D _DEBUG /D _CONSOLE /D _CRT_SECURE_NO_WARNINGS /D QT_GUI_LIB /D QT_CORE_LIB /D QT_WIDGETS_LIB /D _UNICODE /D UNICODE /Gm- /EHsc /RTC1 /MDd /GS /fp:precise /permissive- /Zc:wchar_t /Zc:forScope /Zc:inline /Yc"pch.h" /Fp"X64\DEBUG\TRAJOUTLIERS.PCH" /Fo"X64\DEBUG\\" /Fd"X64\DEBUG\VC141.PDB" /Gd /TP /FC /std:c++latest  C:\DEV\TRAJOUTLIERS\TRAJOUTLIERS\TRAJOUTLIERS\PCH.CPP
^C:\DEV\TRAJOUTLIERS\TRAJOUTLIERS\TRAJOUTLIERS\TRAJOUTLIERS.CPP
/c /I"C:\DEV\VCPKG\INSTALLED\X64-WINDOWS\INCLUDE" /IC:\DEV\TULIB\SRC\INCLUDE /IC:\QT\5.12.3\MSVC2017_64\\INCLUDE\QTGUI /IC:\QT\5.12.3\MSVC2017_64\\INCLUDE\QTANGLE /IC:\QT\5.12.3\MSVC2017_64\\INCLUDE\QTCORE /IC:\QT\5.12.3\MSVC2017_64\\INCLUDE\QTWIDGETS /I"C:\DEV\VCPKG\INSTALLED\X64-WINDOWS\INCLUDE" /ZI /JMC /nologo /W3 /WX- /diagnostics:classic /sdl /Od /D _DEBUG /D _CONSOLE /D _CRT_SECURE_NO_WARNINGS /D QT_GUI_LIB /D QT_CORE_LIB /D QT_WIDGETS_LIB /D _UNICODE /D UNICODE /Gm- /EHsc /RTC1 /MDd /GS /fp:precise /permissive- /Zc:wchar_t /Zc:forScope /Zc:inline /Yu"pch.h" /Fp"X64\DEBUG\TRAJOUTLIERS.PCH" /Fo"X64\DEBUG\\" /Fd"X64\DEBUG\VC141.PDB" /Gd /TP /FC /std:c++latest  C:\DEV\TRAJOUTLIERS\TRAJOUTLIERS\TRAJOUTLIERS\TRAJOUTLIERS.CPP
