^C:\DEV\TRAJOUTLIERS\TRAJOUTLIERS\TRAJOUTLIERS\X64\RELEASE\PCH.OBJ|C:\DEV\TRAJOUTLIERS\TRAJOUTLIERS\TRAJOUTLIERS\X64\RELEASE\TRAJOUTLIERS.OBJ
C:\DEV\TRAJOUTLIERS\TRAJOUTLIERS\X64\RELEASE\TRAJOUTLIERS.EXE
C:\DEV\TRAJOUTLIERS\TRAJOUTLIERS\X64\RELEASE\TRAJOUTLIERS.PDB
