^C:\DEV\TRAJOUTLIERS\TRAJOUTLIERS\TRAJOUTLIERS\PCH.CPP
C:\DEV\TRAJOUTLIERS\TRAJOUTLIERS\TRAJOUTLIERS\X64\DEBUG\TRAJOUTLIERS.PCH
C:\DEV\TRAJOUTLIERS\TRAJOUTLIERS\TRAJOUTLIERS\X64\DEBUG\VC141.PDB
C:\DEV\TRAJOUTLIERS\TRAJOUTLIERS\TRAJOUTLIERS\X64\DEBUG\VC141.IDB
C:\DEV\TRAJOUTLIERS\TRAJOUTLIERS\TRAJOUTLIERS\X64\DEBUG\PCH.OBJ
^C:\DEV\TRAJOUTLIERS\TRAJOUTLIERS\TRAJOUTLIERS\TRAJOUTLIERS.CPP
C:\DEV\TRAJOUTLIERS\TRAJOUTLIERS\TRAJOUTLIERS\X64\DEBUG\VC141.PDB
C:\DEV\TRAJOUTLIERS\TRAJOUTLIERS\TRAJOUTLIERS\X64\DEBUG\VC141.IDB
C:\DEV\TRAJOUTLIERS\TRAJOUTLIERS\TRAJOUTLIERS\X64\DEBUG\TRAJOUTLIERS.OBJ
