00074BB0-A3E0-4104-A103-0430737828CC,2019-01-10 19:52:50,52.05292082,4.39771245,181.00000000,50.00000000,CONSUMER12
00074BB0-A3E0-4104-A103-0430737828CC,2019-01-10 19:52:56,52.05224577,4.39825800,123.00000000,59.00000000,CONSUMER12
00074BB0-A3E0-4104-A103-0430737828CC,2019-01-10 19:53:02,52.05250272,4.39977091,33.00000000,69.00000000,CONSUMER12
00074BB0-A3E0-4104-A103-0430737828CC,2019-01-10 19:53:08,52.05352512,4.40045266,21.00000000,76.00000000,CONSUMER12
00074BB0-A3E0-4104-A103-0430737828CC,2019-01-10 19:53:14,52.05432997,4.40093383,21.00000000,46.00000000,CONSUMER12
00074BB0-A3E0-4104-A103-0430737828CC,2019-01-10 19:53:20,52.05461284,4.40141374,71.00000000,32.00000000,CONSUMER12
00074BB0-A3E0-4104-A103-0430737828CC,2019-01-10 19:53:26,52.05501416,4.40167572,340.00000000,32.00000000,CONSUMER12
00074BB0-A3E0-4104-A103-0430737828CC,2019-01-10 19:53:32,52.05518040,4.40104569,257.00000000,30.00000000,CONSUMER12
00074BB0-A3E0-4104-A103-0430737828CC,2019-01-10 19:53:38,52.05492464,4.40072798,190.00000000,31.00000000,CONSUMER12
00074BB0-A3E0-4104-A103-0430737828CC,2019-01-10 19:53:44,52.05461566,4.39978322,265.00000000,46.00000000,CONSUMER12
00074BB0-A3E0-4104-A103-0430737828CC,2019-01-10 19:53:50,52.05477581,4.39848998,286.00000000,56.00000000,CONSUMER12
00074BB0-A3E0-4104-A103-0430737828CC,2019-01-10 19:53:56,52.05500519,4.39702561,290.00000000,75.00000000,CONSUMER12
00074BB0-A3E0-4104-A103-0430737828CC,2019-01-10 19:54:02,52.05549586,4.39490547,290.00000000,101.00000000,CONSUMER12
00074BB0-A3E0-4104-A103-0430737828CC,2019-01-10 19:54:08,52.05615789,4.39236188,295.00000000,115.00000000,CONSUMER12
00074BB0-A3E0-4104-A103-0430737828CC,2019-01-10 19:54:14,52.05696770,4.38979321,297.00000000,118.00000000,CONSUMER12
00074BB0-A3E0-4104-A103-0430737828CC,2019-01-10 19:54:20,52.05787955,4.38729143,300.00000000,119.00000000,CONSUMER12
00074BB0-A3E0-4104-A103-0430737828CC,2019-01-10 19:54:26,52.05890341,4.38473037,305.00000000,127.00000000,CONSUMER12
00074BB0-A3E0-4104-A103-0430737828CC,2019-01-10 19:54:32,52.06002254,4.38235778,309.00000000,123.00000000,CONSUMER12
00074BB0-A3E0-4104-A103-0430737828CC,2019-01-10 19:54:38,52.06106300,4.38001535,307.00000000,120.00000000,CONSUMER12
00074BB0-A3E0-4104-A103-0430737828CC,2019-01-10 19:54:44,52.06199132,4.37768718,286.00000000,113.00000000,CONSUMER12
00074BB0-A3E0-4104-A103-0430737828CC,2019-01-10 19:54:50,52.06199488,4.37520770,256.00000000,105.00000000,CONSUMER12
00074BB0-A3E0-4104-A103-0430737828CC,2019-01-10 19:54:56,52.06102940,4.37294565,223.00000000,114.00000000,CONSUMER12
00074BB0-A3E0-4104-A103-0430737828CC,2019-01-10 19:55:02,52.05943420,4.37140906,213.00000000,130.00000000,CONSUMER12
00074BB0-A3E0-4104-A103-0430737828CC,2019-01-10 19:55:08,52.05785634,4.36943345,223.00000000,130.00000000,CONSUMER12
00074BB0-A3E0-4104-A103-0430737828CC,2019-01-10 19:55:14,52.05653460,4.36707969,221.00000000,131.00000000,CONSUMER12
00074BB0-A3E0-4104-A103-0430737828CC,2019-01-10 19:55:20,52.05505289,4.36510931,215.00000000,130.00000000,CONSUMER12
00074BB0-A3E0-4104-A103-0430737828CC,2019-01-10 19:55:26,52.05346468,4.36336050,211.00000000,130.00000000,CONSUMER12
00074BB0-A3E0-4104-A103-0430737828CC,2019-01-10 19:55:32,52.05177254,4.36183617,210.00000000,125.00000000,CONSUMER12
00074BB0-A3E0-4104-A103-0430737828CC,2019-01-10 19:55:38,52.05020530,4.36021328,216.00000000,126.00000000,CONSUMER12
00074BB0-A3E0-4104-A103-0430737828CC,2019-01-10 19:55:44,52.04875771,4.35817628,225.00000000,127.00000000,CONSUMER12
00074BB0-A3E0-4104-A103-0430737828CC,2019-01-10 19:55:50,52.04755232,4.35583086,243.00000000,127.00000000,CONSUMER12
00074BB0-A3E0-4104-A103-0430737828CC,2019-01-10 19:55:56,52.04700091,4.35292115,260.00000000,128.00000000,CONSUMER12
00074BB0-A3E0-4104-A103-0430737828CC,2019-01-10 19:56:02,52.04657928,4.34988467,242.00000000,126.00000000,CONSUMER12
00074BB0-A3E0-4104-A103-0430737828CC,2019-01-10 19:56:08,52.04531219,4.34796071,208.00000000,117.00000000,CONSUMER12
00074BB0-A3E0-4104-A103-0430737828CC,2019-01-10 19:56:14,52.04347280,4.34739031,175.00000000,127.00000000,CONSUMER12
00074BB0-A3E0-4104-A103-0430737828CC,2019-01-10 19:56:20,52.04172928,4.34850729,143.00000000,126.00000000,CONSUMER12
00074BB0-A3E0-4104-A103-0430737828CC,2019-01-10 19:56:26,52.04017364,4.35063750,147.00000000,134.00000000,CONSUMER12
00074BB0-A3E0-4104-A103-0430737828CC,2019-01-10 19:56:32,52.03838687,4.35197099,165.00000000,132.00000000,CONSUMER12
00074BB0-A3E0-4104-A103-0430737828CC,2019-01-10 19:56:38,52.03645231,4.35248089,171.00000000,130.00000000,CONSUMER12
00074BB0-A3E0-4104-A103-0430737828CC,2019-01-10 19:56:44,52.03460924,4.35292627,170.00000000,124.00000000,CONSUMER12
00074BB0-A3E0-4104-A103-0430737828CC,2019-01-10 19:56:50,52.03278951,4.35352141,162.00000000,121.00000000,CONSUMER12
00074BB0-A3E0-4104-A103-0430737828CC,2019-01-10 19:56:56,52.03115377,4.35489844,149.00000000,124.00000000,CONSUMER12
00074BB0-A3E0-4104-A103-0430737828CC,2019-01-10 19:57:02,52.02983112,4.35628698,144.00000000,124.00000000,CONSUMER12
00074BB0-A3E0-4104-A103-0430737828CC,2019-01-10 19:57:07,52.02859608,4.35778332,145.00000000,123.00000000,CONSUMER12
00074BB0-A3E0-4104-A103-0430737828CC,2019-01-10 19:57:13,52.02719422,4.35937538,144.00000000,113.00000000,CONSUMER12
00074BB0-A3E0-4104-A103-0430737828CC,2019-01-10 19:57:19,52.02582963,4.36100267,144.00000000,115.00000000,CONSUMER12
00074BB0-A3E0-4104-A103-0430737828CC,2019-01-10 19:57:25,52.02441194,4.36264358,144.00000000,115.00000000,CONSUMER12
00074BB0-A3E0-4104-A103-0430737828CC,2019-01-10 19:57:31,52.02298573,4.36430541,144.00000000,116.00000000,CONSUMER12
00074BB0-A3E0-4104-A103-0430737828CC,2019-01-10 19:57:37,52.02154046,4.36599550,144.00000000,120.00000000,CONSUMER12
00074BB0-A3E0-4104-A103-0430737828CC,2019-01-10 19:57:43,52.02002517,4.36769538,144.00000000,123.00000000,CONSUMER12
00074BB0-A3E0-4104-A103-0430737828CC,2019-01-10 19:57:49,52.01868505,4.36931683,144.00000000,106.00000000,CONSUMER12
00074BB0-A3E0-4104-A103-0430737828CC,2019-01-10 19:57:55,52.01741294,4.37075891,144.00000000,105.00000000,CONSUMER12
00074BB0-A3E0-4104-A103-0430737828CC,2019-01-10 19:58:01,52.01617628,4.37224671,144.00000000,104.00000000,CONSUMER12
00074BB0-A3E0-4104-A103-0430737828CC,2019-01-10 19:58:07,52.01482129,4.37373747,144.00000000,110.00000000,CONSUMER12
00074BB0-A3E0-4104-A103-0430737828CC,2019-01-10 19:58:13,52.01360000,4.37517982,144.00000000,97.00000000,CONSUMER12
00074BB0-A3E0-4104-A103-0430737828CC,2019-01-10 19:58:19,52.01238083,4.37665718,144.00000000,102.00000000,CONSUMER12
00074BB0-A3E0-4104-A103-0430737828CC,2019-01-10 19:58:25,52.01111355,4.37803409,145.00000000,103.00000000,CONSUMER12
00074BB0-A3E0-4104-A103-0430737828CC,2019-01-10 19:58:31,52.00986468,4.37951119,144.00000000,106.00000000,CONSUMER12
00074BB0-A3E0-4104-A103-0430737828CC,2019-01-10 19:58:47,52.00636760,4.38376023,144.00000000,109.00000000,CONSUMER12
00074BB0-A3E0-4104-A103-0430737828CC,2019-01-10 19:59:01,52.00299456,4.38609948,165.00000000,112.00000000,CONSUMER12
00074BB0-A3E0-4104-A103-0430737828CC,2019-01-10 19:59:07,52.00110829,4.38689928,165.00000000,101.00000000,CONSUMER12
00074BB0-A3E0-4104-A103-0430737828CC,2019-01-10 19:59:13,51.99998967,4.38745862,165.00000000,77.00000000,CONSUMER12
00074BB0-A3E0-4104-A103-0430737828CC,2019-01-10 19:59:19,51.99883131,4.38788035,165.00000000,77.00000000,CONSUMER12
00074BB0-A3E0-4104-A103-0430737828CC,2019-01-10 19:59:25,51.99769231,4.38839770,165.00000000,81.00000000,CONSUMER12
00074BB0-A3E0-4104-A103-0430737828CC,2019-01-10 19:59:31,51.99632635,4.38900803,166.00000000,101.00000000,CONSUMER12
00074BB0-A3E0-4104-A103-0430737828CC,2019-01-10 19:59:37,51.99464624,4.38969015,165.00000000,120.00000000,CONSUMER12
00074BB0-A3E0-4104-A103-0430737828CC,2019-01-10 19:59:43,51.99281827,4.39049073,165.00000000,129.00000000,CONSUMER12
00074BB0-A3E0-4104-A103-0430737828CC,2019-01-10 19:59:49,51.99096594,4.39123537,167.00000000,126.00000000,CONSUMER12
00074BB0-A3E0-4104-A103-0430737828CC,2019-01-10 19:59:55,51.98914716,4.39204309,165.00000000,127.00000000,CONSUMER12
00074BB0-A3E0-4104-A103-0430737828CC,2019-01-10 20:00:01,51.98727031,4.39283442,166.00000000,131.00000000,CONSUMER12
00074BB0-A3E0-4104-A103-0430737828CC,2019-01-10 20:00:07,51.98535756,4.39363878,165.00000000,132.00000000,CONSUMER12
00074BB0-A3E0-4104-A103-0430737828CC,2019-01-10 20:00:13,51.98346165,4.39446993,165.00000000,129.00000000,CONSUMER12
00074BB0-A3E0-4104-A103-0430737828CC,2019-01-10 20:00:19,51.98155901,4.39526854,165.00000000,133.00000000,CONSUMER12
00074BB0-A3E0-4104-A103-0430737828CC,2019-01-10 20:00:25,51.97964134,4.39611617,165.00000000,132.00000000,CONSUMER12
00074BB0-A3E0-4104-A103-0430737828CC,2019-01-10 20:00:31,51.97772611,4.39688566,165.00000000,128.00000000,CONSUMER12
00074BB0-A3E0-4104-A103-0430737828CC,2019-01-10 20:00:37,51.97587041,4.39767207,165.00000000,130.00000000,CONSUMER12
00074BB0-A3E0-4104-A103-0430737828CC,2019-01-10 20:00:42,51.97394261,4.39850657,165.00000000,134.00000000,CONSUMER12
00074BB0-A3E0-4104-A103-0430737828CC,2019-01-10 20:00:48,51.97208014,4.39929067,165.00000000,121.00000000,CONSUMER12
00074BB0-A3E0-4104-A103-0430737828CC,2019-01-10 20:00:54,51.97067790,4.40004467,158.00000000,100.00000000,CONSUMER12
00074BB0-A3E0-4104-A103-0430737828CC,2019-01-10 20:01:00,51.96931023,4.40108237,154.00000000,97.00000000,CONSUMER12
00074BB0-A3E0-4104-A103-0430737828CC,2019-01-10 20:01:06,51.96801652,4.40209672,154.00000000,95.00000000,CONSUMER12
00074BB0-A3E0-4104-A103-0430737828CC,2019-01-10 20:01:12,51.96672787,4.40310783,154.00000000,96.00000000,CONSUMER12
00074BB0-A3E0-4104-A103-0430737828CC,2019-01-10 20:01:18,51.96543722,4.40410420,154.00000000,95.00000000,CONSUMER12
00074BB0-A3E0-4104-A103-0430737828CC,2019-01-10 20:01:24,51.96413508,4.40513420,154.00000000,97.00000000,CONSUMER12
00074BB0-A3E0-4104-A103-0430737828CC,2019-01-10 20:01:30,51.96285290,4.40616707,154.00000000,96.00000000,CONSUMER12
00074BB0-A3E0-4104-A103-0430737828CC,2019-01-10 20:01:36,51.96153940,4.40718836,154.00000000,98.00000000,CONSUMER12
00074BB0-A3E0-4104-A103-0430737828CC,2019-01-10 20:01:42,51.96023133,4.40818289,154.00000000,98.00000000,CONSUMER12
00074BB0-A3E0-4104-A103-0430737828CC,2019-01-10 20:01:48,51.95892349,4.40921873,154.00000000,96.00000000,CONSUMER12
00074BB0-A3E0-4104-A103-0430737828CC,2019-01-10 20:01:54,51.95766532,4.41028484,154.00000000,94.00000000,CONSUMER12
00074BB0-A3E0-4104-A103-0430737828CC,2019-01-10 20:02:00,51.95641065,4.41121965,154.00000000,96.00000000,CONSUMER12
00074BB0-A3E0-4104-A103-0430737828CC,2019-01-10 20:02:35,51.95001648,4.41486261,144.00000000,19.00000000,CONSUMER12
00074BB0-A3E0-4104-A103-0430737828CC,2019-01-10 20:02:37,51.94994730,4.41499831,145.00000000,16.00000000,CONSUMER12
00074BB0-A3E0-4104-A103-0430737828CC,2019-01-10 20:02:38,51.94992790,4.41495134,146.00000000,10.00000000,CONSUMER12
00074BB0-A3E0-4104-A103-0430737828CC,2019-01-10 20:02:39,51.94993151,4.41494744,146.00000000,4.00000000,CONSUMER12
00074BB0-A3E0-4104-A103-0430737828CC,2019-01-10 20:02:40,51.94990447,4.41497669,146.00000000,8.00000000,CONSUMER12
00074BB0-A3E0-4104-A103-0430737828CC,2019-01-10 20:02:41,51.94987111,4.41501277,146.00000000,11.00000000,CONSUMER12
00074BB0-A3E0-4104-A103-0430737828CC,2019-01-10 20:02:42,51.94983878,4.41504774,146.00000000,11.00000000,CONSUMER12
00074BB0-A3E0-4104-A103-0430737828CC,2019-01-10 20:02:43,51.94979741,4.41509249,146.00000000,19.00000000,CONSUMER12
00074BB0-A3E0-4104-A103-0430737828CC,2019-01-10 20:02:44,51.94977781,4.41511368,146.00000000,21.00000000,CONSUMER12
00074BB0-A3E0-4104-A103-0430737828CC,2019-01-10 20:02:45,51.94977632,4.41511530,146.00000000,27.00000000,CONSUMER12
00074BB0-A3E0-4104-A103-0430737828CC,2019-01-10 20:02:46,51.94966160,4.41528294,137.00000000,28.00000000,CONSUMER12
00074BB0-A3E0-4104-A103-0430737828CC,2019-01-10 20:02:47,51.94966099,4.41528387,137.00000000,28.00000000,CONSUMER12
00074BB0-A3E0-4104-A103-0430737828CC,2019-01-10 20:02:48,51.94966099,4.41528387,137.00000000,28.00000000,CONSUMER12
00074BB0-A3E0-4104-A103-0430737828CC,2019-01-10 20:02:49,51.94970775,4.41572096,56.00000000,29.00000000,CONSUMER12
00074BB0-A3E0-4104-A103-0430737828CC,2019-01-10 20:02:50,51.94978270,4.41590850,58.00000000,44.00000000,CONSUMER12
00074BB0-A3E0-4104-A103-0430737828CC,2019-01-10 20:02:51,51.94985238,4.41608847,58.00000000,44.00000000,CONSUMER12
00074BB0-A3E0-4104-A103-0430737828CC,2019-01-10 20:02:52,51.94992387,4.41627313,58.00000000,44.00000000,CONSUMER12
00074BB0-A3E0-4104-A103-0430737828CC,2019-01-10 20:02:53,51.94998366,4.41642756,58.00000000,42.00000000,CONSUMER12
00074BB0-A3E0-4104-A103-0430737828CC,2019-01-10 20:02:54,51.95003412,4.41655918,59.00000000,41.00000000,CONSUMER12
00074BB0-A3E0-4104-A103-0430737828CC,2019-01-10 20:02:55,51.95012744,4.41678709,55.00000000,41.00000000,CONSUMER12
00074BB0-A3E0-4104-A103-0430737828CC,2019-01-10 20:02:56,51.95017471,4.41689825,55.00000000,41.00000000,CONSUMER12
00074BB0-A3E0-4104-A103-0430737828CC,2019-01-10 20:02:57,51.95021109,4.41697744,53.00000000,36.00000000,CONSUMER12
00074BB0-A3E0-4104-A103-0430737828CC,2019-01-10 20:02:58,51.95025946,4.41708032,53.00000000,28.00000000,CONSUMER12
00074BB0-A3E0-4104-A103-0430737828CC,2019-01-10 20:02:59,51.95029273,4.41715110,53.00000000,25.00000000,CONSUMER12
00074BB0-A3E0-4104-A103-0430737828CC,2019-01-10 20:03:00,51.95032076,4.41721073,53.00000000,17.00000000,CONSUMER12
00074BB0-A3E0-4104-A103-0430737828CC,2019-01-10 20:03:01,51.95034420,4.41726059,53.00000000,17.00000000,CONSUMER12
00074BB0-A3E0-4104-A103-0430737828CC,2019-01-10 20:03:02,51.95036421,4.41730316,53.00000000,16.00000000,CONSUMER12
00074BB0-A3E0-4104-A103-0430737828CC,2019-01-10 20:03:03,51.95037737,4.41733115,53.00000000,16.00000000,CONSUMER12
00074BB0-A3E0-4104-A103-0430737828CC,2019-01-10 20:03:04,51.95039069,4.41735949,53.00000000,12.00000000,CONSUMER12
00074BB0-A3E0-4104-A103-0430737828CC,2019-01-10 20:03:05,51.95039791,4.41737484,53.00000000,5.00000000,CONSUMER12
00074BB0-A3E0-4104-A103-0430737828CC,2019-01-10 20:03:06,51.95040127,4.41738200,53.00000000,5.00000000,CONSUMER12
00074BB0-A3E0-4104-A103-0430737828CC,2019-01-10 20:03:07,51.95040620,4.41739249,53.00000000,5.00000000,CONSUMER12
00074BB0-A3E0-4104-A103-0430737828CC,2019-01-10 20:03:08,51.95042764,4.41743808,53.00000000,9.00000000,CONSUMER12
00074BB0-A3E0-4104-A103-0430737828CC,2019-01-10 20:03:09,51.95046437,4.41751623,53.00000000,17.00000000,CONSUMER12
00074BB0-A3E0-4104-A103-0430737828CC,2019-01-10 20:03:10,51.95050347,4.41763699,53.00000000,30.00000000,CONSUMER12
00074BB0-A3E0-4104-A103-0430737828CC,2019-01-10 20:03:11,51.95049608,4.41765531,53.00000000,33.00000000,CONSUMER12
00074BB0-A3E0-4104-A103-0430737828CC,2019-01-10 20:03:12,51.95059391,4.41786341,53.00000000,33.00000000,CONSUMER12
00074BB0-A3E0-4104-A103-0430737828CC,2019-01-10 20:03:13,51.95066636,4.41801278,51.00000000,35.00000000,CONSUMER12
00074BB0-A3E0-4104-A103-0430737828CC,2019-01-10 20:03:14,51.95077105,4.41822455,52.00000000,46.00000000,CONSUMER12
00074BB0-A3E0-4104-A103-0430737828CC,2019-01-10 20:03:15,51.95086161,4.41840923,57.00000000,58.00000000,CONSUMER12
00074BB0-A3E0-4104-A103-0430737828CC,2019-01-10 20:03:16,51.95097046,4.41865814,55.00000000,66.00000000,CONSUMER12
00074BB0-A3E0-4104-A103-0430737828CC,2019-01-10 20:03:17,51.95107790,4.41889650,55.00000000,66.00000000,CONSUMER12
00074BB0-A3E0-4104-A103-0430737828CC,2019-01-10 20:03:18,51.95119985,4.41919271,57.00000000,75.00000000,CONSUMER12
00074BB0-A3E0-4104-A103-0430737828CC,2019-01-10 20:03:19,51.95132370,4.41950193,57.00000000,81.00000000,CONSUMER12
00074BB0-A3E0-4104-A103-0430737828CC,2019-01-10 20:03:20,51.95145190,4.41982202,57.00000000,94.00000000,CONSUMER12
00074BB0-A3E0-4104-A103-0430737828CC,2019-01-10 20:03:21,51.95158650,4.42018815,61.00000000,99.00000000,CONSUMER12
00074BB0-A3E0-4104-A103-0430737828CC,2019-01-10 20:03:22,51.95174275,4.42050619,57.00000000,98.00000000,CONSUMER12
00074BB0-A3E0-4104-A103-0430737828CC,2019-01-10 20:03:28,51.95224727,4.42190374,65.00000000,63.00000000,CONSUMER12
00074BB0-A3E0-4104-A103-0430737828CC,2019-01-10 20:03:34,51.95164921,4.42236537,147.00000000,57.00000000,CONSUMER12
00074BB0-A3E0-4104-A103-0430737828CC,2019-01-10 20:03:40,51.95062130,4.42349624,147.00000000,86.00000000,CONSUMER12
00074BB0-A3E0-4104-A103-0430737828CC,2019-01-10 20:03:46,51.94954125,4.42463398,147.00000000,81.00000000,CONSUMER12
00074BB0-A3E0-4104-A103-0430737828CC,2019-01-10 20:03:52,51.94862960,4.42559397,147.00000000,75.00000000,CONSUMER12
00074BB0-A3E0-4104-A103-0430737828CC,2019-01-10 20:03:58,51.94774576,4.42652350,147.00000000,70.00000000,CONSUMER12
00074BB0-A3E0-4104-A103-0430737828CC,2019-01-10 20:04:04,51.94707527,4.42723072,147.00000000,39.00000000,CONSUMER12
00074BB0-A3E0-4104-A103-0430737828CC,2019-01-10 20:04:11,51.94715156,4.42801906,63.00000000,50.00000000,CONSUMER12
00074BB0-A3E0-4104-A103-0430737828CC,2019-01-10 20:04:17,51.94772646,4.42929213,57.00000000,56.00000000,CONSUMER12
00074BB0-A3E0-4104-A103-0430737828CC,2019-01-10 20:04:22,51.94823763,4.43056385,57.00000000,63.00000000,CONSUMER12
00074BB0-A3E0-4104-A103-0430737828CC,2019-01-10 20:04:28,51.94870493,4.43173146,57.00000000,56.00000000,CONSUMER12
00074BB0-A3E0-4104-A103-0430737828CC,2019-01-10 20:04:34,51.94894707,4.43247379,66.00000000,41.00000000,CONSUMER12
00074BB0-A3E0-4104-A103-0430737828CC,2019-01-10 20:04:40,51.94894733,4.43247473,66.00000000,2.00000000,CONSUMER12
00074BB0-A3E0-4104-A103-0430737828CC,2019-01-10 20:04:46,51.94878743,4.43263412,149.00000000,18.00000000,CONSUMER12
00074BB0-A3E0-4104-A103-0430737828CC,2019-01-10 20:04:52,51.94852222,4.43289822,147.00000000,22.00000000,CONSUMER12
00074BB0-A3E0-4104-A103-0430737828CC,2019-01-10 20:04:58,51.94846293,4.43296039,147.00000000,1.00000000,CONSUMER12
00074BB0-A3E0-4104-A103-0430737828CC,2019-01-10 20:05:04,51.94843857,4.43298577,147.00000000,2.00000000,CONSUMER12
00074BB0-A3E0-4104-A103-0430737828CC,2019-01-10 20:05:10,51.94845167,4.43297213,147.00000000,1.00000000,CONSUMER12
00074BB0-A3E0-4104-A103-0430737828CC,2019-01-10 20:05:16,51.94845877,4.43296472,147.00000000,0.00000000,CONSUMER12
00074BB0-A3E0-4104-A103-0430737828CC,2019-01-10 20:05:22,51.94846874,4.43295434,147.00000000,0.00000000,CONSUMER12
00074BB0-A3E0-4104-A103-0430737828CC,2019-01-10 20:05:28,51.94849979,4.43292199,147.00000000,1.00000000,CONSUMER12
00074BB0-A3E0-4104-A103-0430737828CC,2019-01-10 20:05:34,51.94854514,4.43287388,147.00000000,1.00000000,CONSUMER12
00074BB0-A3E0-4104-A103-0430737828CC,2019-01-10 20:05:40,51.94854201,4.43287720,147.00000000,0.00000000,CONSUMER12
00074BB0-A3E0-4104-A103-0430737828CC,2019-01-10 20:05:46,51.94856648,4.43285260,149.00000000,0.00000000,CONSUMER12
00074BB0-A3E0-4104-A103-0430737828CC,2019-01-10 20:05:52,51.94857539,4.43284379,149.00000000,1.00000000,CONSUMER12
00074BB0-A3E0-4104-A103-0430737828CC,2019-01-10 20:05:58,51.94849896,4.43292285,147.00000000,2.00000000,CONSUMER12
00074BB0-A3E0-4104-A103-0430737828CC,2019-01-10 20:06:04,51.94843559,4.43298888,147.00000000,4.00000000,CONSUMER12
00074BB0-A3E0-4104-A103-0430737828CC,2019-01-10 20:06:10,51.94843567,4.43298879,147.00000000,0.00000000,CONSUMER12
00074BB0-A3E0-4104-A103-0430737828CC,2019-01-10 20:06:16,51.94842390,4.43300105,147.00000000,0.00000000,CONSUMER12
00074BB0-A3E0-4104-A103-0430737828CC,2019-01-10 20:06:22,51.94841852,4.43300673,147.00000000,1.00000000,CONSUMER12
00074BB0-A3E0-4104-A103-0430737828CC,2019-01-10 20:06:28,51.94841662,4.43300874,147.00000000,1.00000000,CONSUMER12
00074BB0-A3E0-4104-A103-0430737828CC,2019-01-10 20:06:34,51.94838759,4.43303940,147.00000000,2.00000000,CONSUMER12
00074BB0-A3E0-4104-A103-0430737828CC,2019-01-10 20:06:40,51.94838402,4.43304317,147.00000000,0.00000000,CONSUMER12
00074BB0-A3E0-4104-A103-0430737828CC,2019-01-10 20:06:46,51.94838504,4.43304210,147.00000000,0.00000000,CONSUMER12
00074BB0-A3E0-4104-A103-0430737828CC,2019-01-10 20:06:52,51.94838422,4.43304296,147.00000000,0.00000000,CONSUMER12
00074BB0-A3E0-4104-A103-0430737828CC,2019-01-10 20:06:58,51.94838682,4.43304022,147.00000000,0.00000000,CONSUMER12
00074BB0-A3E0-4104-A103-0430737828CC,2019-01-10 20:07:04,51.94838494,4.43304221,147.00000000,0.00000000,CONSUMER12
00074BB0-A3E0-4104-A103-0430737828CC,2019-01-10 20:07:10,51.94838380,4.43304341,147.00000000,0.00000000,CONSUMER12
00074BB0-A3E0-4104-A103-0430737828CC,2019-01-10 20:07:16,51.94838444,4.43304273,147.00000000,0.00000000,CONSUMER12
00074BB0-A3E0-4104-A103-0430737828CC,2019-01-10 20:07:22,51.94837100,4.43305693,147.00000000,1.00000000,CONSUMER12
00074BB0-A3E0-4104-A103-0430737828CC,2019-01-10 20:07:28,51.94836763,4.43306049,147.00000000,0.00000000,CONSUMER12
00074BB0-A3E0-4104-A103-0430737828CC,2019-01-10 20:07:34,51.94838131,4.43304603,147.00000000,0.00000000,CONSUMER12
00074BB0-A3E0-4104-A103-0430737828CC,2019-01-10 20:07:40,51.94838051,4.43304689,147.00000000,0.00000000,CONSUMER12
00074BB0-A3E0-4104-A103-0430737828CC,2019-01-10 20:07:46,51.94837866,4.43304883,147.00000000,0.00000000,CONSUMER12
00074BB0-A3E0-4104-A103-0430737828CC,2019-01-10 20:07:52,51.94837160,4.43305630,147.00000000,1.00000000,CONSUMER12
00074BB0-A3E0-4104-A103-0430737828CC,2019-01-10 20:07:58,51.94837455,4.43305319,147.00000000,0.00000000,CONSUMER12
00074BB0-A3E0-4104-A103-0430737828CC,2019-01-10 20:08:04,51.94837276,4.43305507,147.00000000,0.00000000,CONSUMER12
00074BB0-A3E0-4104-A103-0430737828CC,2019-01-10 20:08:10,51.94837253,4.43305532,147.00000000,0.00000000,CONSUMER12
00074BB0-A3E0-4104-A103-0430737828CC,2019-01-10 20:08:16,51.94836647,4.43306172,147.00000000,0.00000000,CONSUMER12
00074BB0-A3E0-4104-A103-0430737828CC,2019-01-10 20:08:22,51.94837218,4.43305568,147.00000000,1.00000000,CONSUMER12
00074BB0-A3E0-4104-A103-0430737828CC,2019-01-10 20:08:28,51.94837064,4.43305731,147.00000000,1.00000000,CONSUMER12
00074BB0-A3E0-4104-A103-0430737828CC,2019-01-10 20:08:34,51.94836315,4.43306523,147.00000000,0.00000000,CONSUMER12
00074BB0-A3E0-4104-A103-0430737828CC,2019-01-10 20:08:40,51.94835826,4.43307039,147.00000000,0.00000000,CONSUMER12
00074BB0-A3E0-4104-A103-0430737828CC,2019-01-10 20:08:46,51.94835871,4.43306991,147.00000000,0.00000000,CONSUMER12
00074BB0-A3E0-4104-A103-0430737828CC,2019-01-10 20:08:52,51.94835868,4.43306994,147.00000000,0.00000000,CONSUMER12
00074BB0-A3E0-4104-A103-0430737828CC,2019-01-10 20:08:58,51.94835839,4.43307025,147.00000000,0.00000000,CONSUMER12
00074BB0-A3E0-4104-A103-0430737828CC,2019-01-10 20:09:04,51.94835864,4.43306999,147.00000000,0.00000000,CONSUMER12
00074BB0-A3E0-4104-A103-0430737828CC,2019-01-10 20:09:10,51.94835781,4.43307087,147.00000000,0.00000000,CONSUMER12
00074BB0-A3E0-4104-A103-0430737828CC,2019-01-10 20:09:16,51.94833609,4.43309381,147.00000000,2.00000000,CONSUMER12
00074BB0-A3E0-4104-A103-0430737828CC,2019-01-10 20:09:22,51.94833701,4.43309284,147.00000000,1.00000000,CONSUMER12
00074BB0-A3E0-4104-A103-0430737828CC,2019-01-10 20:09:28,51.94834386,4.43308560,147.00000000,0.00000000,CONSUMER12
00074BB0-A3E0-4104-A103-0430737828CC,2019-01-10 20:09:34,51.94834463,4.43308479,147.00000000,0.00000000,CONSUMER12
