^C:\DEV\TRAJOUTLIERS\TRAJOUTLIERS\TRAJOUTLIERS\PCH.CPP
C:\DEV\TRAJOUTLIERS\TRAJOUTLIERS\TRAJOUTLIERS\X64\RELEASE\TRAJOUTLIERS.PCH
C:\DEV\TRAJOUTLIERS\TRAJOUTLIERS\TRAJOUTLIERS\X64\RELEASE\VC141.PDB
C:\DEV\TRAJOUTLIERS\TRAJOUTLIERS\TRAJOUTLIERS\X64\RELEASE\PCH.OBJ
^C:\DEV\TRAJOUTLIERS\TRAJOUTLIERS\TRAJOUTLIERS\TRAJOUTLIERS.CPP
C:\DEV\TRAJOUTLIERS\TRAJOUTLIERS\TRAJOUTLIERS\X64\RELEASE\VC141.PDB
C:\DEV\TRAJOUTLIERS\TRAJOUTLIERS\TRAJOUTLIERS\X64\RELEASE\TRAJOUTLIERS.OBJ
