(613594,)
Detected intervals:
[(4036, 4089, 0.6480383101895912), (152569, 152625, 0.6391781944966456), (99603, 99655, 0.6356081317520244), (591621, 591674, 0.6338468308563749), (380803, 380858, 0.633211065048353), (555820, 555890, 0.6317683193504336), (65070, 65121, 0.6308588880330476), (240628, 240683, 0.6303691677236987), (38908, 38961, 0.6293342511170805), (222843, 222896, 0.6275186450850108), (582574, 582626, 0.626168431867682), (590637, 590690, 0.6248432369668003), (608060, 608114, 0.6246610312642462), (47668, 47719, 0.6245039903369325), (416061, 416114, 0.6242253047612599), (608781, 608834, 0.6240087358154871), (257564, 257618, 0.6233906325815589), (48460, 48512, 0.6232184733206739), (459238, 459290, 0.622859321906418), (267165, 267234, 0.6221868855590212), (56217, 56265, 0.6217629731165318), (21195, 21249, 0.6212682772099731), (57267, 57321, 0.6210634030018573), (57196, 57250, 0.6209654708856573), (57388, 57441, 0.6197743258423256), (381501, 381554, 0.619481070590478), (109012, 109082, 0.6191377144922271), (433748, 433802, 0.618195530972674), (468093, 468162, 0.617935380715712), (459981, 460034, 0.6176557915762051), (486069, 486122, 0.6170294483614664), (432864, 432914, 0.6169488005693471), (153413, 153465, 0.6152778535072551), (503516, 503570, 0.6152654576869961), (144220, 144273, 0.6151996252996363), (38790, 38841, 0.6151764702586324), (178732, 178786, 0.6150844793604973), (581469, 581520, 0.6147201402233392), (108515, 108585, 0.614317656013175), (556221, 556275, 0.6140736711686395), (56476, 56530, 0.614039354518196), (485402, 485473, 0.6139308556484199), (468861, 468914, 0.6139105489422758), (345980, 346034, 0.6137439011498762), (529180, 529250, 0.6122893176173724), (433821, 433874, 0.6122107123867164), (65548, 65601, 0.6121677837882735), (416403, 416474, 0.6116948995048974), (354189, 354242, 0.6110993088199618), (47764, 47819, 0.611032893927334)]
#####################################
time spent on mdi:  4904.23
Used param settings:
method = parzen, mode = CROSSENT, num_intervals = 50, proposals = hotellings_t, extint_min_len = 48,extint_max_len = 71, preproc = ['normalize'], td_lag=8, td_dim = 4,kx = 1, ky = 1, kz = 1, dx = 1, dy = 1, dz = 1, min_temporal_length = 250km, max_temporal_length=750km
data used:
/media/DataGate3/ERA5-EU_EV-Zuijlen/TotalHourlySum/*.nc, timeslice = slice('1950', '2019', None), region = longitude=slice(-14.75, 40, None),latitude=slice(35, 74.75, None), windowsize = 1, timeresolution = 1, univar =True, variable= SPV
