(3, 613594)
Detected intervals:
[(196340, 196412, 524.062675053651), (169194, 169263, 474.4670198357692), (329399, 329471, 458.7591443250757), (64838, 64909, 453.1891895611717), (129465, 129530, 437.63328378888707), (311987, 312034, 435.1221844794104), (127243, 127315, 432.95814989185203), (235954, 236026, 427.24466887409875), (206824, 206896, 418.9590117589696), (152448, 152519, 417.8526643359816), (40019, 40091, 412.0330667114597), (57623, 57695, 404.9661814198927), (135487, 135558, 400.604631199703), (373964, 374036, 393.4525554829209), (442829, 442901, 392.74543402772815), (171020, 171083, 391.0037219535926), (2342, 2414, 389.1925690218759), (331214, 331286, 384.95525891308637), (406807, 406878, 378.711251353585), (144516, 144583, 373.3449561271738)]
#####################################
time spent on mdi:  6309.47
Used param settings:
method = parzen, mode = TS, num_intervals = 20, proposals = hotellings_t, extint_min_len = 24,extint_max_len = 72, preproc = None, td_lag=8, td_dim = 4,kx = 2, ky = 2, kz = 1, dx = 3, dy = 3, dz = 1, min_temporal_length = 250km, max_temporal_length=750km
data used:
/media/DataGate3/ERA5-EU_EV-Zuijlen/TotalHourlySum/*.nc, timeslice = slice('1950', '2019', None), region = longitude=slice(-14.75, 40, None),latitude=slice(35, 74.75, None), windowsize = 1, timeresolution = 1
