/home/duijm/Documents/Thesis/code/thesis/pkgs/libmaxdiv/maxdiv
run started on:  13:30:29
#########################################################################################
Starting MDI calculation for windowsize 1 and time resolution 1.
run started on:  13:30:29
/home/duijm/anaconda3/envs/thesisenv/lib/python3.8/site-packages/xarray/core/common.py:1123: FutureWarning: 'base' in .resample() and in Grouper() is deprecated.
The new arguments that you should use are 'offset' or 'origin'.

>>> df.resample(freq="3s", base=2)

becomes:

>>> df.resample(freq="3s", offset="2s")

  grouper = pd.Grouper(
<xarray.Dataset>
Dimensions:    (height: 1, latitude: 160, longitude: 220, time: 744, variables: 1)
Coordinates:
  * time       (time) datetime64[ns] 2019-07-01 ... 2019-07-31T23:00:00
  * longitude  (longitude) float32 -14.75 -14.5 -14.25 -14.0 ... 39.5 39.75 40.0
  * latitude   (latitude) float32 74.75 74.5 74.25 74.0 ... 35.5 35.25 35.0
Dimensions without coordinates: height, variables
Data variables:
    t2m        (time, latitude, longitude, height, variables) float32 272.900...
(744, 160, 220, 1, 1)
[3, 8, 8, 1]
[72, 40, 40, 1]
using params: kt:2dt: 1
starting get embedding params 
Found parameters for td: 
K: 2 T: 1
