(613594,)
Detected intervals:
[(579274, 579345, 2256.630374618624), (527345, 527416, 2256.449119357447), (20209, 20280, 2256.449119357386), (20103, 20174, 2256.449119357386), (19868, 19939, 2256.449119357386), (19532, 19603, 2256.449119357386), (19417, 19488, 2256.449119357386), (19174, 19245, 2256.449119357386), (18928, 18999, 2256.449119357386), (18638, 18709, 2256.449119357386), (18186, 18257, 2256.449119357386), (17760, 17831, 2256.449119357386), (17495, 17566, 2256.449119357386), (17292, 17363, 2256.449119357386), (16783, 16854, 2256.449119357386), (15698, 15769, 2256.449119357386), (15512, 15583, 2256.449119357386), (14825, 14896, 2256.449119357386), (14550, 14621, 2256.449119357386), (14437, 14508, 2256.449119357386), (14246, 14317, 2256.449119357386), (14123, 14194, 2256.449119357386), (14013, 14084, 2256.449119357386), (13317, 13388, 2256.449119357386), (13166, 13237, 2256.449119357386), (12977, 13048, 2256.449119357386), (12769, 12840, 2256.449119357386), (12647, 12718, 2256.449119357386), (11370, 11441, 2256.449119357386), (11096, 11167, 2256.449119357386), (10686, 10757, 2256.449119357386), (8934, 9005, 2256.449119357386), (8420, 8491, 2256.449119357386), (8092, 8163, 2256.449119357386), (8004, 8075, 2256.449119357386), (7929, 8000, 2256.449119357386), (7666, 7737, 2256.449119357386), (7063, 7134, 2256.449119357386), (6301, 6372, 2256.449119357386), (6148, 6219, 2256.449119357386), (5646, 5717, 2256.449119357386), (5502, 5573, 2256.449119357386), (4652, 4723, 2256.449119357386), (4251, 4322, 2256.449119357386), (3815, 3886, 2256.449119357386), (3126, 3197, 2256.449119357386), (2918, 2989, 2256.449119357386), (2845, 2916, 2256.449119357386), (1989, 2060, 2256.449119357386), (1911, 1982, 2256.449119357386)]
#####################################
time spent on mdi:  7601.74
Used param settings:
method = parzen, mode = TS, num_intervals = 50, proposals = hotellings_t, extint_min_len = 48,extint_max_len = 71, preproc = None, td_lag=8, td_dim = 4,kx = 1, ky = 1, kz = 1, dx = 1, dy = 1, dz = 1, min_temporal_length = 250km, max_temporal_length=750km
data used:
/media/DataGate3/ERA5-EU_EV-Zuijlen/TotalHourlySum/*.nc, timeslice = slice('1950', '2019', None), region = longitude=slice(-14.75, 40, None),latitude=slice(35, 74.75, None), windowsize = 1, timeresolution = 1, univar =True, variable= WOF
