/home/duijm/Documents/Thesis/code/thesis/pkgs/libmaxdiv/maxdiv
run started on:  13:28:05
#########################################################################################
Starting MDI calculation for windowsize 6 and time resolution 4.
run started on:  13:28:05
<xarray.Dataset>
Dimensions:  (height: 1, lat: 26, lon: 36, time: 21912, variables: 1)
Coordinates:
  * time     (time) datetime64[ns] 2010-01-01 ... 2019-12-31T20:00:00
  * lat      (lat) float64 35.62 37.12 38.62 40.12 ... 68.62 70.12 71.62 73.12
  * lon      (lon) float64 -14.12 -12.62 -11.12 -9.625 ... 35.38 36.88 38.38
Dimensions without coordinates: height, variables
Data variables:
    SPV      (time, lat, lon, height, variables) float32 dask.array<chunksize=(1, 26, 36, 1, 1), meta=np.ndarray>
    WON      (time, lat, lon, height, variables) float32 dask.array<chunksize=(1, 26, 36, 1, 1), meta=np.ndarray>
    WOF      (time, lat, lon, height, variables) float32 dask.array<chunksize=(1, 26, 36, 1, 1), meta=np.ndarray>
(21912, 26, 36, 1, 1)
[1, 2, 2, 1]
[18, 5, 5, 1]
using params: kt:4dt: 8
Pipeline created, starting exec 
starting get embedding params 
Found parameters for td: 
K: 4 T: 8
Done time delay embedding 
Starting online non max surpression detections, max threads = 30
