(32, 160, 220, 1, 1)
Detected intervals:
[([28, 142, 142, 0], [29, 152, 150, 1], 154.7035626895171), ([15, 127, 146, 0], [16, 135, 154, 1], 145.15575343148097), ([7, 126, 144, 0], [8, 134, 152, 1], 144.59351525520444), ([8, 127, 144, 0], [9, 135, 152, 1], 127.22707487637126), ([12, 142, 142, 0], [13, 150, 150, 1], 125.89979537109461), ([20, 132, 148, 0], [21, 140, 156, 1], 118.82430570016119), ([20, 140, 162, 0], [21, 148, 170, 1], 116.50650910236675), ([16, 127, 144, 0], [17, 135, 152, 1], 115.73916570075825), ([20, 128, 136, 0], [21, 136, 144, 1], 113.57973554482822), ([20, 127, 111, 0], [21, 135, 119, 1], 112.56244273470499)]
#####################################
time spent on mdi:  4598.79
Used param settings:
libmaxdiv_wrapper.maxdiv(npar,method='gaussian_cov',num_intervals=10,proposals='dense',extint_min_len=[1,8,8,1], extint_max_len=[24,40,40,1],preproc=['s-embedding'],kx=2,ky=2,kz=1,dx=1,dy=1,dz=1,td_lag=0,td_dim=0)
data used:
ERA5-EU_t2m_201907.nc, timeslice = 2019-07-01, region = longitude=slice(-14.75,40),latitude=slice(74.75,35), windowsize = 1, timeresolution = 3
