(48, 40, 55, 1, 1)
Detected intervals:
[([7, 14, 33, 0], [44, 22, 41, 1], 3342.972141742528), ([30, 8, 42, 0], [43, 16, 50, 1], 2564.4358618986253), ([33, 14, 17, 0], [45, 22, 25, 1], 1732.815852831651), ([19, 5, 12, 0], [35, 13, 20, 1], 1702.930975726304), ([20, 20, 41, 0], [32, 28, 49, 1], 1615.6764253174429), ([32, 16, 45, 0], [42, 24, 53, 1], 1500.3964295533801), ([33, 2, 40, 0], [44, 8, 48, 1], 1185.4479635504715), ([9, 13, 26, 0], [18, 21, 33, 1], 1175.6239557911792), ([9, 21, 23, 0], [18, 29, 31, 1], 1159.8989051316098), ([15, 16, 6, 0], [43, 22, 14, 1], 1087.9739754924713), ([9, 22, 34, 0], [40, 28, 41, 1], 1087.8447443035766), ([35, 6, 3, 0], [45, 14, 11, 1], 909.3902854685784), ([15, 24, 0, 0], [40, 32, 7, 1], 829.4967190364063), ([12, 8, 33, 0], [20, 14, 41, 1], 792.8534439329236), ([33, 22, 15, 0], [42, 27, 23, 1], 752.5134054899934), ([31, 9, 50, 0], [44, 16, 55, 1], 677.1004828345624), ([18, 15, 29, 0], [31, 23, 33, 1], 577.3824437977144), ([32, 17, 25, 0], [43, 25, 32, 1], 547.4451088655178), ([15, 17, 0, 0], [44, 22, 6, 1], 539.7802903322465), ([13, 25, 8, 0], [40, 28, 15, 1], 448.78079191446574)]
#####################################
time spent on mdi:  5.57
Used param settings:
method = gaussian_cov, mode = TS, num_intervals = 20, proposals = hotellings_t, extint_min_len = [3, 2, 2, 1],extint_max_len = [72, 8, 8, 1], preproc = None, td_lag=2, td_dim = 3,kx = 2, ky = 2, kz = 1, dx = 3, dy = 3, dz = 1, min_temporal_length = 250km, max_temporal_length=750km
data used:
/media/DataGate3/ERA5-EU_EV-Zuijlen/TotalHourlySum/*.nc, timeslice = slice('15-08-1987', '16-08-1987', None), region = longitude=slice(-14.75, 40, None),latitude=slice(35, 74.75, None), windowsize = 4, timeresolution = 1
