(87672,)
Detected intervals:
[(54569, 54713, 0.5633637176408292), (19715, 19863, 0.5600889217273718), (18564, 18708, 0.559217479366832), (62475, 62628, 0.545558187996817), (51751, 51897, 0.49161375753024816), (63003, 63160, 0.48267343160761517), (60558, 60715, 0.4638214503140732), (44203, 44348, 0.4454324819158681), (51975, 52126, 0.4383996917706222), (63187, 63331, 0.43603670312001436), (71944, 72098, 0.4350275433764138), (25811, 25965, 0.4288265487954455), (27858, 28002, 0.4267354055533483), (81327, 81471, 0.42630984170783137), (53890, 54034, 0.41024461839001447), (63343, 63488, 0.40843340513190535), (62695, 62848, 0.40726206705791124), (7302, 7450, 0.3893494218556483), (46358, 46503, 0.38673265463959994), (39603, 39747, 0.37633439102831684), (60808, 60953, 0.3730082051262562), (67254, 67400, 0.36971074250308367), (68662, 68807, 0.36717633611955924), (41746, 41891, 0.36254494230172774), (42648, 42792, 0.3618048651832348), (47762, 47923, 0.3611072178509672), (33803, 33947, 0.3596457661482202), (30666, 30811, 0.3526980165961214), (86299, 86443, 0.34190024157246857), (81487, 81631, 0.33669392119911684), (15727, 15887, 0.33586751770279977), (23146, 23294, 0.3354546412454403), (13359, 13504, 0.3340729312269473), (11767, 11911, 0.3321715886678678), (72105, 72259, 0.3294310034212047), (20795, 20944, 0.32758426252317846), (34002, 34153, 0.32519961653490337), (9645, 9792, 0.32366744898231664), (5210, 5355, 0.32336878230926236), (64690, 64840, 0.32266583831691104), (1371, 1515, 0.3089146709457525), (80618, 80763, 0.3051826045820571), (40471, 40626, 0.30186010173428923), (64267, 64411, 0.3005949406716426), (59033, 59197, 0.3005840600058989), (14570, 14736, 0.30024886537756595), (36743, 36887, 0.29913096261900074), (80042, 80200, 0.2983717228660753), (438, 602, 0.2973413756910057), (38027, 38187, 0.29655546854675935)]
#####################################
time spent on mdi:  807.83
Used param settings:
method = parzen, mode = CROSSENT, num_intervals = 50, proposals = hotellings_t, extint_min_len = 144,extint_max_len = 167, preproc = ['normalize'], td_lag=8, td_dim = 4,kx = 1, ky = 1, kz = 1, dx = 1, dy = 1, dz = 1, min_temporal_length = 250km, max_temporal_length=750km
data used:
/media/DataGate3/ERA5-EU_EV-Zuijlen/TotalHourlySum/*.nc, timeslice = slice('1950', '2019', None), region = longitude=slice(-14.75, 40, None),latitude=slice(35, 74.75, None), windowsize = 1, timeresolution = 1, univar =True, variable= TOTAL
