Bas,question p,Floris
Floris,claim p,Bas
Bas,why p,Floris
Floris,since p q r,Bas
Bas,concede q,Floris
Floris,skip,Bas
Bas,claim not (q & r => p),Floris
Floris,concede not (q & r => p),Bas
Bas,skip,Floris
Floris,retract (q & r => p),Bas
